Zimmer;Bewohner;Gang
10;Betreuende;10
11;Betreuende;10
12;Teilnehmende;10
13;Teilnehmende;10
14;Teilnehmende;10
15;Teilnehmende;10
21;Betreuende;20
22;Teilnehmende;20
23;Teilnehmende;20
24;Teilnehmende;20
25;Teilnehmende;20
26;Teilnehmende;20
27;Betreuende;20
30;Betreuende;30
31;Betreuende;30
32;Teilnehmende;30
33;Teilnehmende;30
34;Teilnehmende;30
35;Teilnehmende;30
40;Betreuende;40
41;Betreuende;40
42;Teilnehmende;40
43;Teilnehmende;40
44;Teilnehmende;40
45;Teilnehmende;40
46;Teilnehmende;40
47;Teilnehmende;40
51;Betreuende;50
52;Teilnehmende;50
53;Teilnehmende;50
54;Teilnehmende;50
55;Teilnehmende;50
56;Teilnehmende;50
61;Betreuende;60
62;Teilnehmende;60
63;Teilnehmende;60
64;Teilnehmende;60
65;Teilnehmende;60
66;Teilnehmende;60
67;Teilnehmende;60
68;Teilnehmende;60
WG;Teilnehmende;60
