{
    "$schema": "http://json-schema.org/draft-04/schema#",
    "type": "object",
    "properties": {
        "data": {
            "type": "object",
            "properties": {
                "event": {
                    "type": "object",
                    "properties": {
                        "purposeOfBusinessTrip": {
                            "type": "string"
                        },
                        "overnightCosts": {
                            "type": "number"
                        },
                        "additionalCosts": {
                            "type": "number"
                        },
                        "reasonOfAdditionalCosts": {
                            "type": "string"
                        },
                        "budgetSection": {
                            "type": "string"
                        },
                        "budgetItem": {
                            "type": "string"
                        },
                        "costCenterBudget": {
                            "type": "string"
                        },
                        "costType": {
                            "type": "string"
                        },
                        "costCenterCostAndActivityAccounting": {
                            "type": "string"
                        },
                        "costObject": {
                            "type": "string"
                        },
                        "instructorExtensions": {
                            "type": "array",
                            "items": [
                                {
                                    "type": "object",
                                    "properties": {
                                        "instructor": {
                                            "type": "object",
                                            "properties": {
                                                "givenName": {
                                                    "type": "string"
                                                },
                                                "familyName": {
                                                    "type": "string"
                                                },
                                                "street": {
                                                    "type": "string"
                                                },
                                                "streetNumber": {
                                                    "type": "string"
                                                },
                                                "postalCode": {
                                                    "type": "string"
                                                },
                                                "city": {
                                                    "type": "string"
                                                }
                                            }
                                        },
                                        "hasContract": {
                                            "type": "boolean"
                                        },
                                        "contractWith": {
                                            "type": "string"
                                        },
                                        "faculty": {
                                            "type": "string"
                                        },
                                        "chair": {
                                            "type": "string"
                                        },
                                        "personnelNumber": {
                                            "type": "string"
                                        },
                                        "jobTitle": {
                                            "type": "string"
                                        },
                                        "emailWork": {
                                            "type": "string"
                                        },
                                        "telephoneWork": {
                                            "type": "string"
                                        },
                                        "startOfTravel": {
                                            "type": "string"
                                        },
                                        "arrivalAtBusinessLocation": {
                                            "type": "string"
                                        },
                                        "startOfBusinessActivities": {
                                            "type": "string"
                                        },
                                        "endOfBusinessActivities": {
                                            "type": "string"
                                        },
                                        "startOfReturnJourney": {
                                            "type": "string"
                                        },
                                        "endOfTravel": {
                                            "type": "string"
                                        }
                                    }
                                }
                            ]
                        }
                    }
                }
            },
            "required": ["event"]
        }
    },
    "required": ["data"]
}
