{
  "name": "Category",
  "plural": "Categories",
  "base": "PersistedModel",
  "idInjection": true,
  "options": {
    "validateUpsert": true
  },
  "properties": {
    "label": {
      "type": "string",
      "required": true
    },
    "sublabel": {
      "type": "string"
    },
    "color": {
      "type": "string",
      "default": "#9e9e9e"
    },
    "icon": {
      "type": "string"
    },
    "type": {
      "type": "string",
      "required": true,
      "enum": [
        "video",
        "rating"
      ],
      "default": "video"
    },
    "isEnable": {
      "type": "boolean",
      "default": true
    }
  },
  "validations": [],
  "relations": {},
  "acls": [
    {
      "accessType": "*",
      "principalType": "ROLE",
      "principalId": "$everyone",
      "permission": "DENY"
    },
    {
      "accessType": "*",
      "principalType": "ROLE",
      "principalId": "root",
      "permission": "ALLOW"
    },
    {
      "accessType": "*",
      "principalType": "ROLE",
      "principalId": "admin",
      "permission": "ALLOW"
    },
    {
      "accessType": "*",
      "principalType": "ROLE",
      "principalId": "$authenticated",
      "permission": "ALLOW",
      "property": [
        "find",
        "findOne",
        "findById"
      ]
    }
  ],
  "methods": {}
}
