{
  "collectionName": "components_header_menus",
  "info": {
    "name": "menu",
    "icon": "atlas"
  },
  "options": {},
  "attributes": {
    "label": {
      "type": "string"
    },
    "color": {
      "type": "string"
    },
    "textColor": {
      "type": "string"
    },
    "to": {
      "type": "string"
    },
    "flat": {
      "type": "boolean"
    }
  }
}
