{
  "project_info": {
    "project_number": "980068796447",
    "project_id": "pais-notificacoes",
    "storage_bucket": "pais-notificacoes.appspot.com"
  },
  "client": [
    {
      "client_info": {
        "mobilesdk_app_id": "1:980068796447:android:a0d4e45bacf48c61316d2a",
        "android_client_info": {
          "package_name": "br.com.mobile.mobiledevelopers"
        }
      },
      "oauth_client": [
        {
          "client_id": "980068796447-ve15g1pir5qeiiq8untfhu8m83lhgiv9.apps.googleusercontent.com",
          "client_type": 3
        }
      ],
      "api_key": [
        {
          "current_key": "AIzaSyBJ3Xe8cLxvkyYel_tVNyfFU6axPo6nygM"
        }
      ],
      "services": {
        "appinvite_service": {
          "other_platform_oauth_client": [
            {
              "client_id": "980068796447-ve15g1pir5qeiiq8untfhu8m83lhgiv9.apps.googleusercontent.com",
              "client_type": 3
            }
          ]
        }
      }
    }
  ],
  "configuration_version": "1"
}