1a9d62dc157b5f554900562116c13228009c6fd95c217c1275
79d7e1a336f0f92af2213b61ce97849c6e9bc411d43425650a
394d1e263818fd5a08eead129f1db3a44421b5e60ea0742f50
34dec7c28d32e3905379074c18f3ca3861a72d69105d0ff36f
6af6b469431d1ce62765487926a7f39db0b43b6e8a858b6237
2d5266d3393c05b2aec76f991e54d0ed0873b724e3e3c2687e
00406a32dccd4a21fad1f5ce03f16cc9dc95173aa0e17b6682
757878dac0e333c98c62d6273a0b056ac882d479d04b93ec06
5fa949a4e1e8dd32898f25aa3b8682db0f3d230afe57fe9187
9bd1766b5afa5bcec262269741a5ce5d17b277400303d60517
7ed3b42e8a1a896c6bd66bead5e3d52d40f4964fd6ab5ad885
bd779608972c55202ed3a9d874e71f342162acd2cc28623327
66b9fb9390c1d4c17e0ad2ca190d165fd70c17835b9052030d
209c3235c41fb71793589aa00090f53b864ba8cedf6d732203
b28eb2bd2df0f1e50731203c72962a0d4312ec588bc8c83152
15c57d84392ed51f8ba148729de2714dd91465ebcc7534a225
b7db8124dec3f11ac77e0f94f6c325b549a5966570e8f53027
a8015f4965172af425bf5ee711941d2b80d45b478d95ea324e
5e9d47cfaceb1204f2e81443e367419957ab853006dd8791b9
ddedef81d1551e47baf2d7e38f2134dd141a9e1fc98657e54e
c70b406d38304d4d1ae7ec285f340078b68e1cc718f30f555b
eca246e6eb938319e2f919bf232627a3a5d3d4f919a0ef893b
23d4d1829eae2ec7c308c13f4337002428b716cd33148cf253
951197392c91f52eb3c0e1649a8129111b70021bbc2b6a075b
c1b9e8e8ad2e2fa42608f9dc47df2abaa87ff18096e60694b3
59914aa40b92c881ed07a5ea70b4e68e095e4fb7c2b77767f9
ce9cddc8a59a1cb3787420c84ae447e7dabf0266389119d0c3
a75a16a1863ee4577745df0b8c99a64160e33f25a3cfe8bc07
a3283273932d9450bccac33a62581a8f9d9a40b0331d3bee6c
fac47ab0731fb85c64a667e0c3022bfa9ca4b1df64d4da31a1
afc587adba420c66b119bf43b780ded26d8220f8852f882b27
b899a8bc456368300e04193d5b88ed6384326b3c91d231b6eb
54531e62be825ec93474ea61603223e898733afa561052eddc
bb68b67ed143f713d813b7a8cc14617becf9ccc0b1831e20e4
ab3c05d9fb7824fd7edcc24ecab2ffa2a2dcf74c978d00ca44
c6fb1d4474873831fc875c54de2012e29033b66818545068bb
3dd8ca614294e6045e7b8453348f9811eaa4e8606833fc566c
bd81118eed9c1ef1a2c811dc7ff2c56ff5a4e6ff7222be6738
5a34eeb375b3c44e692353f12c1345eaff9bf38c61e50e444e
67d9df5bfb4764a106fdbd4800630f53340c098f7858073724
