f4b720f3b31159a180fc479ffaaa46c88ad7d815e3b6d44563
2fde0c2c5174de7323ce8074530a470cde894dbe2131dd04c5
9f55420b3d3dcfc11d63ef3c72aef9ae418cee5f3b86e0db95
663518d48bc9089a1991d78b086784a1478eaee69bb763c8b9
7d2fddfe6b08e63163011a2e48d1e4c4bc5286738610edd17f
5c73031ccde8ffff156917177bee900b6dd24aa8799c189138
6809dfc397b031fdb8a12137801dc0fda4496dfe6f27fd683c
9ec3a8cbe93be1595c2934b25d3a681772935b2f3f6ec02c12
9d75e8e9a97ba4b41483f6d83a90701762734834b72575d24d
61a7cf3fdcafae9779a82a07ae590c651857dfc83979b82eef
43a26358a278360301446e0c522a976743b3fafd20d41a77c4
85713fb872d1fe6e9416e05bb9a7373c91a1073c7e70936945
8d2aa88ebfc833b7fe2f02292359c1d7046c22a06a3f497f47
94e2c0bae7ec8ef02765560164cb0a417c2b1fd7abdf45028f
83f56ab90ffa6aab023dc669b7b8093ae862df78f7a4660b09
ec31ea1f63f4aeb4cdb8c5b4a4c82ba85153f2d7eb32cc470a
38948de222318ed62c6ccabd3368fd9d0b647f8ecbcba8819c
84aa82eedcb8f994b35b0429301bdfb38cc5f98a51256615a6
79c038a737adb1d7566547446f60ec9aa2ff911e25cd86833c
ec9b7bb0e75cbe30718b6489dedceacd370796a1dfcc24c5e4
0a830da218b62c32b210744ad7dfcf881e7b361db94c17a2c4
d6a04e9acd71ef62e0033dc77c3862b768f0a1688297d7ccff
fc0082a156d7ee1bbe4a491e9db0279045765b4bed11351f6c
3a53a47b89bf84d0532589e4a3242bb89cc247774881805c43
a604a40f436aeeca632dea5b418933655bbcd4622ed7a55e96
5fa9066cb1ff17df6f91ec64455b9355507222065585f942af
f9cf44adccd6d689873419d1741c87273a975d8f9bd06f055c
1f88cc913923bb398023b47a5df8205d2866c7f62a76c8a173
61cf129b5bfa1262fc73ca5e66ad80a5ba1c9c0e90761767a0
1f678a7d7586310b87ab30236d21731eedfde943b7091000b9
5df52986710113757a401483a7b239ee4acedd28af830f48cc
ec34d836aa2032ddbf3df5eb8c9a4fde55c895b6048a9ba580
8f644bd0024b7da82f067835fb12fecc374b0c3ac12366afbd
655bb65e8f92161ad895422b4c91fcded5bbc358daddc31d96
edc06c8bee362167b5ee257465e3bd834440f7f344f468a2b9
c031fbc7c82be48eff108696052d1ec5b450a6a3353b0f5f86
06291448e75c3ebd88f19358eaaeed824a3a1603e771b3e76c
12c7bdf6b09b1007b4f8714f70a6e362cf81b65d5b29e48da2
53262a1c5ae39bb4089cea770ffb279d94a675287eab753e33
867f0644bc108dfef7c2c3b724235453ee35574ec9802cc7c2
