eae431f69c794a26bf9abc02c0235377fbc3635ab78c1bbf7b
bd4ac7b0d3f67958169da5828b74f97af03296858e6a95222a
a35c98b9735aede1ede42b06fcb4eea30d67b07ca468ea2000
28344b19d90c015044176c183937da77b70cee9132217979f4
fb4c018b79743d81ac9338138622020b10b1a3d26e9795169a
2cd3ed9fb83429f4fe8e510cd15bed3ea9fe62075e04c4ec76
5db5ef32936b310fdd43ec305e792938a5b10329aab3f8a7f9
48f4c0ff2d3f23df16b3a6ddfa7667f08015d2fb5e91a4ecca
220abbb23a2559fa8dfc8c94f8dc276acfb51901344273f9b2
37c4ca33b7e1a4dee4bfbea2e283e09c4345f13164ae33a42f
0878b4be9fb0ed1fde39d63df280e70f795754b3177cf09527
febd48d2426f7a5423910b8e61b8681231f87a3377576fc158
094f7df198139ef0cbfa27f43fb9a92addc2706be82f66fbb3
5048f705bc738fe217454a7e2b2434813cd649a18898a2bb63
7fb509d8c2e0ab9a478e0b3762c0eaac07ef5800dfd6992fd3
3e07fa39fd0911e3bdde9d7eedf7ede25f045f1a40510b6a7e
20fd26f59ced35910ea1c1eae5eaf1bc68b827a476c4492502
c9bf1d2bbb509cc57ca752d0845ffb8611b2fc49be7a2b1f59
4b022855ce8c55d6b9efcec74592c943dfacc4adb66a5ec8a5
03a18306f29a30e4d403479f37078718fd968cbd9ccb2e8713
d603fd89dce136d60bd0c1be0979233caa93e8bf57abcf87e8
310d99ea43f44c5be719b7e45f80560d77368a2a6dcffdccf7
1a0eacc481d6701cb54d8875061dae531d0f53d6b9e3d3c480
74d7eb2d0f7995298e5f9d0df0351359281fd8dd3f27058f40
a89a29d83cd1f67f694922421f973c32abeab079ce93e1b4a8
8e70cdf808f3694ca72aa6bbcf456399c10965181c8b3745e8
7b2a479883ec1c4dc4a0464c9d5f6ec8d8d4962d00e484bfa6
b5e7ccfebaebd97ee617181aae3083b5076da23568ff366551
41dec2b9cad4e8ac46c1e744512c63c981fb0d5812bdd1759b
33e71c74caaf806e4ccf6f3ebe12d5f82ef7a1a95d7881c058
54ccb6a013a8ba66c5865b90652def14b27372612bd630796c
7f8c53ec9ca93042040ec5e5693db3851fa085e0ac1a6e0181
513681befc66f315cd17f8625b9128f8f1c51c2893e434d79e
cd6060beef241f7fd4a33f7af4babfbc575937b125e1ac9753
4c8735b0aa0d44450d4c8fbf56a757a075cdaec9ff61a35e22
7033c9912ddea9a337f967a40e53c573647bc4603aacf9e07a
345b2451b2f8172fcc7ab281659647207d46e94591ffb39646
194e8173cebbcefdc918305b4efd1165b9da6466ca96a53294
747b974a853f089eea30d02545e50b945edece2d6c583df054
408be08603dcaabcf8a595659d984510f9cd2ad10d2cc161eb
