aa26f34ecb01cb3495898abe76a7539e305cc8e7e02f807104
798894e5694eca9625cfc62e91eb1e90ca2688dd60d22836b9
03aaea92c6056056320b0c16a085adccc8ad5b8535d0a134a2
a3b61b082ff9b4c422e83b0e176c9954d3800211daf08cf450
6ecfbffe8b4ef1d8a429df7da63df80b2996958d8810c3570b
96f5ad93f48bc9d677d24eca17b4c9afccb4a3e916df16e846
2959dea4808b85a3b44c9111083d941b2f11a138b7060875bb
f8d8261285cfecb53b90da4c9fd2aba56c06a9fca326cd61cf
afb89f9b30a3397494b486f132bf393788220bf01684cf033f
51095644ac6f6a38dc44e9542f27077d6263a97b02e11b28c0
f0fba43ba3b41fe732ca725116e5c1a9da0fde79d107927e9e
feef3c9ac00408e6e7603728426f5c2c584d4b5b22ce2c700e
187006b3d59b76278d7938ffbe9c1e4879481fa7a8695d5910
e54c5d28fb48c198d3dc5d911b69c90def2ddc4ed09ac6f8aa
6893a35b30136474a1bd7d0e7c76dd62f1393d245f24c94ff7
eea12eddac46628cba417632a2865e56cd41f9f5ae7b2ba953
a08881312ad9d368e890c629c2f99313c1c2f7193c8c14bd30
b812cdb30c993e807551651523fa1de855f2ea054f6b715be3
c43e1a6cd98cd43c0cc2d8ba506609fc5e7cc576e7a91f4c6a
4e97ed62611bfe763d30d98b2b10cf4451f8aaf64570d4d649
eeaf278edf81c5c94c7cdcde9ef34e801d8269c9203012cae7
822376bf59add1f603f4998d081a80ea3b76d21d42c5c56e86
45f9b87d6ab91a9d7d45444a780ea53de1ae780a586ee349a2
a8c2da52f2934a88a3340e29376c2491ecfca03f519a98b99c
5a7e09532f00c7ebc9fb63f0a310adf6e3837eae20e0bd939c
3deebba108785fc05923715e831bac4c52af659b374731ea15
6cc2d0f8040355d15aa67a077ec1efaac2a679ff23c391e223
627e1bd0e0da634da56b732926a1bed4761ec082f6a3f0e6cf
d4b4cac687fe35312417729a4aedef7479bf3bba12c4dd992c
dabbe3326dfb3d7aa91356c3ae4a0fe223e4b530ae27211efd
fb9c21cc3dc204b87ce0fe90ccaf6e250b361b582feac45477
4f685faf36f4d89ce7759bf1bb96df37d30ee06725555cea28
610b222ae6db697cde66c1bf67a0cbbcd9bb8b8eb8e7b304a2
9ba7653413db9f474b3840b4f8fb08dade796542fd87656cec
1e528008fb2ee9efa43e9eeee67bfbb27e6d6d00aac7b12557
95a55ab8155b02f3ca4c6767f39d996d5ad3d30deca39afc31
8d0eea91fb415b855249fc2764203722ade2db16a91592a0d2
057d8841396e2126b9688263e734d05338c3553ac1ca399d14
e9890ea7b35d883b108b2d9e55b3973c75a350efadf58bc3c9
2e70c36cae2c88762541abf71f9784e4c4600744a26aa2f7d0
