33495bf7ce4d6d300a7548ad437309ab67961e23fdbe19e4a2
118fe5dbf34fc01c9fb9e6ea41c14417b16f929d0587a37bf5
acb4300d04e6d63f676b52028cf4432e80cf27b065e7324a57
40e9c43753e6cfe56256172fd4d5ff4314ebb933eff319ef47
efadbbbefa1a7df4a4b0cb7abe7be755a03bc6b4b226b5f6e3
3aae8807ffdcd970321eac60dfef244192592fca4dd93e90bb
b34499d378e5bbeb66d31cf8fc0d16bbcddbb84de11f544dba
c8d578b214a4d8268f20806f018615bd7c88265d0783ed5f8c
a2f9f739e857298421c8406909d9fb1bf89810dcd64fad0232
e6e423638f9f327cb88eebe309b6452c84d9ee69731eead915
151bdc9ee751dd8f7f90b6a3e36714ee8c13fbcadae9c91b92
7d306484914ea8a10a396af2ad86c5e5ae283f69f33e9835cc
7ae4f108996225b1387a69e0dacdb2a6a3e9970d3d604251c6
609f60255be2ffba24421629d68a992570acbdcd86a3aa9aa7
5432a6ca0283c4136376a2eb273fd5a738f07cefb2ce64093a
a674fae013a6deab8e400719c855c9c77d8558379644de2b62
6edbf6554bf7bb7c30920474c455badf6f6dc18ef0d328fe9c
ff4c8194e18aa3185144891e7a8db5f35c9b7c606f8cab65f5
28e2747874d1361be84013599e1492bef48b8ac292a2130233
efc5e3d9cb072a4a6b846374a9a708c11eccb0de5aaa625f89
3fa183734bbc6dd894a58f3452bfd47adb17f0d90012489ce8
fc72992febb80effdee5db8fb69b896e076948ded897470fa6
2cc281d88385f6317b761d126988171c8c6d4a7d64ea3794af
cb33961d9e6d05564f26cb1e8a8ea36726a9aa4ec5e1f4805c
da198bd3fcc3118b99dd529b35c69ece7bd60aecb49a9bbaca
7a83a2564322e10f9494e0109325557ededa4bab4d6e396128
919a5b510a49f6105ef39150113cdc4353aecd15e0a40825d3
ccfb07b184386dfb1c4bd3c6753cbc90c8e57ac5faf07591b3
f15b2eed23212c93dfa7d174d4c71ebe83a4478f0626b7e7e8
1ea2e80ba02499eef4faf3676dd145a5b79d9e2b2cbd047e76
8c526b8ba3089270498329200d3fed29745baf1c71712f5763
30d45f4b13c9f6042c19bc5d35edaf1e0837382d4f8605ad14
5879d704a384a7ff84a2c760e01d3827e4a82024cb3551e3fe
0b1a6f9f11fef6040090fa175bd2cf64bd8af9a1d7ed26a9c1
b5b8fde27329cbac2e501ae33c507d92b9511cef21a1b62199
911bac00cea734ae966e7248bf1571bc9182866fb798a60dbe
8f46605c4d7f38e61b6f6121db3c7d5f6e90e6c0fcab3c838d
9b0bb3c7e67e559e6bd3dc5e41a485bc0e7b612dba3f123314
94a567bab66220534308c225c731f58b7d70c22f4e695c32d8
f3bcd674e3b390d9b4b41f4999562eab3e89643b1e64f54e11
