7190edd26dcd016e21d391a871d78811964e6b0e58fbcf24cf
1f91ad246647fc10e52134a3c438801b7082cc289ed3598abd
4f7ae224bd91151b6b035a0b83ce21627b0f103559dd937d68
251701c8d077153b09bd831d2f3bce94da43b4cf2f9b71232c
0858fcb1a8a1be58a1eecae2c20998b6056266c0e0975e5b7a
65d085a36acd3e12b38ff43fa6f7b1812658608bdc7efa7ced
67f8365e45e505869ab630b0bbfcf3c6b3d5a3aa965c8f28ca
5efed86d2ff5ed97b4b4e3c657c26d7e380a3c79efbad542f6
358b1ebad670f26f2c124f2a38f2a5eb3fb76bc15fcf634937
55a52b25ba7c3f2b76dd51e72bb4fa6d4c5cea1d1e1cf9ea80
5687cfb8387105ff750468aee110b08642bb17425fbfc26289
c01449ae9b74b37dd444d6aeb52f89478e0666b86f92b67b95
2945109209997ba41cab603e2553402c86219565e493132bfa
54d7820287e05b98d833211c16abedb1f3c88b8fb87ebd69a4
63debff6a16ac847ee4b042f629ef8434a14c68e62899f962f
88573c1601f728fdeaa86318b9fd76f5cd4278919057216463
6c01adee784fefdbd0ffd8d0532249ee3a04daa9bdbd0b447d
5f81c3b277fb767b38c85ce60aa1e385572c68011877dee765
c6f14f8c4be39e62116cc248deac4c18b8a86e2620919f90fa
93c5ee7525407dc00a986ed3f8e7f3dd83e4b0cf064d3ee0c4
5466b71f71c46fc2d3af63769e9bf826cf83a84b3fed64185e
ea37cd010d668035f0802b304b5517461b3d7e969518ac9be3
7dfc3f917e337c133641b6efdd515f53f4b11e2f6bc0f9e4f3
95d74ef5aedf21f645d02683b564c9ad098506fa8254c815a7
64c6f72c4795112f67f4a26fd5781fbf6ab0ede5057a2153a3
f240de2f9a041c01c397a3e8449aa1e9d2ce36c6da16210c35
721aafd750f2cecd5084687337a73b37a56fbe45c2c9129c78
78f82c608d3c9a311ebc3b43f52ad978f9340fec97891637e9
9f642f5b50d0ed41d4fa6457ffb97e0fa5f0f60921876c71bb
bc4fb76012aec40cba2e5f1b47f140421a06217ed63c525182
eb34961177690418cc5bcc98de245a7a338c1da16675eeab26
48761d5bc7f75104d723c94bcd6f1197f74376f7649c51ebf9
b971adcd832a440bf6a541494361011aab8f42b5d455b4be33
3726402e6fe34d71812d6ed8ba8ce46c7ac0ba218d4e896401
0d08d742437d6c8b2c6f29e998e2fd1db6a0c074fcc6f11c95
be6421460515335de4b10972925aed88a96b8077f7476658d1
02a376c1b30a51ae09a5cc0657ac58ee67a5e49a78715a8243
b3d7790dfc7b9dc6281627faa98fbb72bfcebbd61c710ca7eb
459ff5985f3b392bba1be550ed37850f4337bf5b7dbb7d4d8e
d537ee6f0eca006aeb798768277dff13b85f5b69fe7c05c686
