{"_id":{"$oid":"609c005b31e13b1734af0ff5"},"subjectID":"OS301","classNumber": 9,"classTitle":"Упоређивање бројева прве хиљаде","materialsUrl":"http://localhost:8000/Assets/Classes/OS301_09_Exercise.pdf", "exercisesUrl":"http://localhost:8000/Assets/Classes/OS301_09_TrueExercise.pdf", "taskTemplate":"#/f#$1>$2=$3<","classSummaryImgUrl":"http://localhost:8000/Assets/Classes/OS301_09_Summary.png", "grade": 3}
{"_id":{"$oid":"609c00eb31e23b1734af0ff9"},"subjectID":"OS301","classNumber": 10,"classTitle":"Троцифрени бројеви","materialsUrl":"","taskTemplate":"Koji je broj veci: #/f#","classSummaryImgUrl":"http://localhost:8000/Assets/Classes/OS301_10_Summary.png", "grade": 3}
{"_id":{"$oid":"609c006b31e17b1734af0ff5"},"subjectID":"OS401","classNumber": 1,"classTitle":"Сабирање природних бројева","materialsUrl":"http://localhost:8000/Assets/Classes/OS401_01_Theory.pdf", "exercisesUrl":"http://localhost:8000/Assets/Classes/OS401_01_Exercise.pdf", "taskTemplate":"","classSummaryImgUrl":"", "grade": 4}
