[{
  "_id": {
    "$oid": "6079ecbc6b438d19ac8f2105"
  },
  "villaName": "Vila Dedinje",
  "type": "room",
  "numberOfRooms": 6,
  "numOfGuests": 2,
  "location": {
    "$oid": "60707dee70cd0d322b8a2274"
  },
  "destination": "serbia",
  "rentingDate": {
    "$date": "2021-03-03T00:00:00Z"
  },
  "dateAvailable": {
    "$date": "2021-03-03T00:00:00Z"
  },
  "user": {
    "$oid": "607051793dbb8a1739024adb"
  },
  "comments": [],
  "images": "/../../assets/img/gallery/vilaDedinje.jpeg",
  "pricePerNight": "117",
  "checkIn": "13:00",
  "checkOut": "11:00",
  "status": "active",
  "amenities": [],
  "reservations": []
},{
  "_id": {
    "$oid": "6079ecbc6b438d19ac8f2106"
  },
  "villaName": "Villa Terazije",
  "type": "apartment",
  "numberOfRooms": 2,
  "numOfGuests": 2,
  "location": {
    "$oid": "60707dee70cd0d322b8a2274"
  },
  "destination": "serbia",
  "rentingDate": {
    "$date": "2019-01-07T00:00:00Z"
  },
  "dateAvailable": {
    "$date": "2019-01-07T00:00:00Z"
  },
  "user": {
    "$oid": "607051793dbb8a1739024adb"
  },
  "comments": {
    "$oid": "60886b31de368e0d89b13e35"
  },
  "images": "/../../assets/img/gallery/vilaTerazije.jpg",
  "pricePerNight": "40",
  "checkIn": "15:00",
  "checkOut": "14:00",
  "status": "active",
  "amenities": [],
  "reservations": []
},{
  "_id": {
    "$oid": "6079ecbc6b438d19ac8f2107"
  },
  "villaName": "Bramer",
  "type": "room",
  "numberOfRooms": 4,
  "numOfGuests": 2,
  "location": {
    "$oid": "60707dee70cd0d322b8a2273"
  },
  "destination": "serbia",
  "rentingDate": {
    "$date": "2018-12-10T00:00:00Z"
  },
  "dateAvailable": {
    "$date": "2020-05-23T00:00:00Z"
  },
  "user": {
    "$oid": "607051793dbb8a1739024adb"
  },
  "comments": [],
  "images": "/../../assets/img/gallery/bramer.jpg",
  "pricePerNight": "100",
  "checkIn": "12:00",
  "checkOut": "09:00",
  "status": "active",
  "amenities": [],
  "reservations": []
},{
  "_id": {
    "$oid": "609280bda342272a99d9adfc"
  },
  "villaName": "Lux Villa",
  "type": "room",
  "numberOfRooms": 6,
  "numOfGuests": 4,
  "location": {
    "$oid": "60707dee70cd0d322b8a2273"
  },
  "destination": "serbia",
  "rentingDate": {
    "$date": "2020-09-15T00:00:00Z"
  },
  "dateAvailable": {
    "$date": "2020-09-23T00:00:00Z"
  },
  "user": {
    "$oid": "607051793dbb8a1739024adb"
  },
  "comments": [],
  "images": "/../../assets/img/gallery/lux.jpg",
  "pricePerNight": "30",
  "checkIn": "13:00",
  "checkOut": "10:00",
  "status": "active",
  "amenities": [],
  "reservations": []
},{
  "_id": {
    "$oid": "609280bda342272a99d9adfd"
  },
  "villaName": "Kraljevi Konaci",
  "type": "room",
  "numberOfRooms": 4,
  "numOfGuests": 2,
  "location": {
    "$oid": "60707dee70cd0d322b8a2273"
  },
  "destination": "serbia",
  "rentingDate": {
    "$date": "2021-04-27T00:00:00Z"
  },
  "dateAvailable": {
    "$date": "2021-04-30T00:00:00Z"
  },
  "user": {
    "$oid": "607051793dbb8a1739024adb"
  },
  "comments": [],
  "images": "/../../assets/img/gallery/kraljevikonaci.jpg",
  "pricePerNight": "25",
  "checkIn": "13:00",
  "checkOut": "10:00",
  "status": "active",
  "amenities": [],
  "reservations": []
},{
  "_id": {
    "$oid": "6079ecbc6b438d19ac8f2108"
  },
  "villaName": "Miris Dunja",
  "type": "room",
  "numberOfRooms": 3,
  "numOfGuests": 3,
  "location": {
    "$oid": "60707dee70cd0d322b8a2273"
  },
  "destination": "serbia",
  "rentingDate": {
    "$date": "2013-05-03T00:00:00Z"
  },
  "dateAvailable": {
    "$date": "2021-01-01T00:00:00Z"
  },
  "user": {
    "$oid": "607051793dbb8a1739024adb"
  },
  "comments": [],
  "images": "/../../assets/img/gallery/mirisdunja.jpg",
  "pricePerNight": "30",
  "checkIn": "14:00",
  "checkOut": "10:30",
  "status": "active",
  "amenities": [],
  "reservations": []
},{
  "_id": {
    "$oid": "6079ecbc6b438d19ac8f2109"
  },
  "villaName": "Wadi Musa",
  "type": "apartment",
  "numberOfRooms": 2,
  "numOfGuests": 4,
  "location": {
    "$oid": "60707dee70cd0d322b8a2275"
  },
  "destination": "world",
  "rentingDate": {
    "$date": "2010-06-21T00:00:00Z"
  },
  "dateAvailable": {
    "$date": "2013-01-01T00:00:00Z"
  },
  "user": {
    "$oid": "607051793dbb8a1739024adb"
  },
  "comments": [],
  "images": "petra1.png",
  "pricePerNight": "190",
  "checkIn": "13:00",
  "checkOut": "11:00",
  "status": "active",
  "amenities": [],
  "reservations": []
},{
  "_id": {
    "$oid": "6079ecbc6b438d19ac8f210a"
  },
  "villaName": "Petra Fig Tree Villa",
  "type": "room",
  "numberOfRoooms": 3,
  "numOfGuests": 6,
  "location": {
    "$oid": "60707dee70cd0d322b8a2275"
  },
  "destination": "world",
  "rentingDate": {
    "$date": "2015-02-02T00:00:00Z"
  },
  "dateAvailable": {
    "$date": "2021-02-06T00:00:00Z"
  },
  "user": {
    "$oid": "607051793dbb8a1739024adb"
  },
  "comments": [],
  "images": "petra2.png",
  "pricePerNight": "180",
  "checkIn": "14:00",
  "checkOut": "13:00",
  "status": "active",
  "amenities": [],
  "reservations": []
},{
  "_id": {
    "$oid": "607bef3bd80044d58b3238d6"
  },
  "villaName": "Villa Happy House",
  "type": "room",
  "numberOfRooms": 2,
  "numOfGuests": 4,
  "location": {
    "$oid": "60707dee70cd0d322b8a2274"
  },
  "destination": "serbia",
  "rentingDate": {
    "$date": "2020-04-08T00:00:00Z"
  },
  "dateAvailable": {
    "$date": "2020-04-08T00:00:00Z"
  },
  "user": {
    "$oid": "607051793dbb8a1739024adb"
  },
  "comments": [],
  "images": "/../../assets/img/gallery/happyhouse.jpeg",
  "pricePerNight": "100",
  "checkIn": "14:00",
  "checkOut": "12:00",
  "status": "active",
  "amenities": [],
  "reservations": []
},{
  "_id": {
    "$oid": "607bef3bd80044d58b3238d7"
  },
  "villaName": "Villa Suburbia",
  "type": "room",
  "numberOfRooms": 2,
  "numOfGuests": 5,
  "location": {
    "$oid": "60707dee70cd0d322b8a2274"
  },
  "destination": "serbia",
  "rentingDate": {
    "$date": "2019-04-08T00:00:00Z"
  },
  "dateAvailable": {
    "$date": "2019-04-12T00:00:00Z"
  },
  "user": {
    "$oid": "607051793dbb8a1739024adb"
  },
  "comments": [],
  "images":"vilaSuburbia.jpeg",
  "pricePerNight": "70",
  "checkIn": "13:00",
  "checkOut": "11:00",
  "status": "active",
  "amenities": [],
  "reservations": []
},{
  "_id": {
    "$oid": "607051793dbb8a1739024adb"
  },
  "villaName": "Villa Avala",
  "type": "room",
  "numberOfRooms": 4,
  "numOfGuests": 8,
  "location": {
    "$oid": "60707dee70cd0d322b8a2274"
  },
  "destination": "serbia",
  "rentingDate": {
    "$date": "2018-09-07T00:00:00Z"
  },
  "dateAvailable": {
    "$date": "2018-09-08T00:00:00Z"
  },
  "user": {
    "$oid": "607051793dbb8a1739024adb"
  },
  "comments": [],
  "images": "/../../assets/img/gallery/vilaAvala.jpeg",
  "pricePerNight": "80",
  "checkIn": "13:00",
  "checkOut": "11:00",
  "status": "active",
  "amenities": [],
  "reservations": []
},{
  "_id": {
    "$oid": "6092d7be198798148986551c"
  },
  "villaName": "Vila Opera",
  "type": "room",
  "numberOfRooms": 5,
  "numOfGuests": 4,
  "location": {
    "$oid": "6092ccb01987981489865517"
  },
  "destination": "serbia",
  "rentingDate": {
    "$date": "2021-02-21T00:00:00Z"
  },
  "dateAvailable": {
    "$date": "2021-02-26T00:00:00Z"
  },
  "user": {
    "$oid": "607051793dbb8a1739024adb"
  },
  "comments": [],
  "images": "/../../assets/img/gallery/opera.jpg",
  "pricePerNight": "25",
  "checkIn": "12:00",
  "checkOut": "10:00",
  "status": "active",
  "amenities": [],
  "reservations": []
},{
  "_id": {
    "$oid": "6092d7be198798148986551d"
  },
  "villaName": "Vila Hilli",
  "type": "room",
  "numberOfRooms": 6,
  "numOfGuests": 4,
  "location": {
    "$oid": "6092ccb01987981489865517"
  },
  "destination": "serbia",
  "rentingDate": {
    "$date": "2020-06-21T00:00:00Z"
  },
  "dateAvailable": {
    "$date": "2020-08-25T00:00:00Z"
  },
  "user": {
    "$oid": "607051793dbb8a1739024adb"
  },
  "comments": [],
  "images": "/../../assets/img/gallery/hilli.jpg",
  "pricePerNight": "20",
  "checkIn": "12:30",
  "checkOut": "10:00",
  "status": "active",
  "amenities": [],
  "reservations": []
},{
  "_id": {
    "$oid": "6092d7be198798148986551e"
  },
  "villaName": "Vila Emilia",
  "type": "room",
  "numberOfRooms": 2,
  "numOfGuests": 2,
  "location": {
    "$oid": "6092ccb01987981489865517"
  },
  "destination": "serbia",
  "rentingDate": {
    "$date": "2021-03-25T00:00:00Z"
  },
  "dateAvailable": {
    "$date": "2021-03-29T00:00:00Z"
  },
  "user": {
    "$oid": "607051793dbb8a1739024adb"
  },
  "comments": [],
  "images": "/../../assets/img/gallery/emilia.jpg",
  "pricePerNight": "35",
  "checkIn": "13:00",
  "checkOut": "10:30",
  "status": "active",
  "amenities": [],
  "reservations": []
},{
  "_id": {
    "$oid": "607bef3bd80044d58b3238d9"
  },
  "villaName": "Villa Aleksa",
  "type": "room",
  "numberOfRooms": 3,
  "numOfGuests": 7,
  "location": {
    "$oid": "60707dee70cd0d322b8a2274"
  },
  "destination": "serbia",
  "rentingDate": {
    "$date": "2018-09-07T00:00:00Z"
  },
  "dateAvailable": {
    "$date": "2018-09-08T00:00:00Z"
  },
  "user": {
    "$oid": "607051793dbb8a1739024ad8"
  },
  "comments": [],
  "images": "/../../assets/img/gallery/vila.jpeg",
  "pricePerNight": "80",
  "checkIn": "13:00",
  "checkOut": "11:00",
  "status": "active",
  "amenities": [],
  "reservations": []
},{
  "_id": {
    "$oid": "60932ecf5b6b5a43cea0d982"
  },
  "villaName": "Catallina",
  "type": "room",
  "numberOfRooms": 5,
  "numOfGuests": 2,
  "location": {
    "$oid": "60707dee70cd0d322b8a2276"
  },
  "destination": "world",
  "rentingDate": {
    "$date": "2019-07-07T00:00:00Z"
  },
  "dateAvailable": {
    "$date": "2018-09-08T00:00:00Z"
  },
  "user": {
    "$oid": "607051793dbb8a1739024ad8"
  },
  "comments": [],
  "images": "/../../assets/img/gallery/catalina.jpg",
  "pricePerNight": "75",
  "checkIn": "10:00",
  "checkOut": "13:00",
  "status": "active",
  "amenities": [],
  "reservations": []
},{
  "_id": {
    "$oid": "6093307b5b6b5a43cea0d983"
  },
  "villaName": "Vila Rock",
  "type": "room",
  "numberOfRooms": 5,
  "numOfGuests": 2,
  "location": {
    "$oid": "60707dee70cd0d322b8a2276"
  },
  "destination": "world",
  "rentingDate": {
    "$date": "2019-07-07T00:00:00Z"
  },
  "dateAvailable": {
    "$date": "2018-09-08T00:00:00Z"
  },
  "user": {
    "$oid": "607051793dbb8a1739024ad8"
  },
  "comments": [],
  "images": "/../../assets/img/gallery/rock.jpg",
  "pricePerNight": "95",
  "checkIn": "10:00",
  "checkOut": "13:00",
  "status": "active",
  "amenities": [],
  "reservations": []
},{
  "_id": {
    "$oid": "6093307b5b6b5a43cea0d984"
  },
  "villaName": "Terrama",
  "type": "room",
  "numberOfRooms": 10,
  "numOfGuests": 3,
  "location": {
    "$oid": "60707dee70cd0d322b8a2276"
  },
  "destination": "world",
  "rentingDate": {
    "$date": "2019-07-07T00:00:00Z"
  },
  "dateAvailable": {
    "$date": "2018-09-08T00:00:00Z"
  },
  "user": {
    "$oid": "607051793dbb8a1739024ad8"
  },
  "comments": [],
  "images": "/../../assets/img/gallery/terrama.jpg",
  "pricePerNight": "95",
  "checkIn": "11:00",
  "checkOut": "16:00",
  "status": "active",
  "amenities": [],
  "reservations": []
},{
  "_id": {
    "$oid": "60933c905b6b5a43cea0d98a"
  },
  "villaName": "Camp Villa",
  "type": "room",
  "numberOfRooms": 20,
  "numOfGuests": 40,
  "location": {
    "$oid": "60707dee70cd0d322b8a2275"
  },
  "destination": "world",
  "rentingDate": {
    "$date": "2021-07-07T00:00:00Z"
  },
  "dateAvailable": {
    "$date": "2021-09-08T00:00:00Z"
  },
  "user": {
    "$oid": "607051793dbb8a1739024ad8"
  },
  "comments": [],
  "images": "/../../assets/img/gallery/campvilla.jpg",
  "pricePerNight": "190",
  "checkIn": "11:00",
  "checkOut": "16:00",
  "status": "active",
  "amenities": [],
  "reservations": []
},{
  "_id": {
    "$oid": "60933c905b6b5a43cea0d98b"
  },
  "villaName": "FigTree",
  "type": "room",
  "numberOfRooms": 23,
  "numOfGuests": 30,
  "location": {
    "$oid": "60707dee70cd0d322b8a2275"
  },
  "destination": "world",
  "rentingDate": {
    "$date": "2021-07-07T00:00:00Z"
  },
  "dateAvailable": {
    "$date": "2021-09-08T00:00:00Z"
  },
  "user": {
    "$oid": "607051793dbb8a1739024ad8"
  },
  "comments": [],
  "images": "/../../assets/img/gallery/figtreevilla.jpg",
  "pricePerNight": "210",
  "checkIn": "11:00",
  "checkOut": "16:00",
  "status": "active",
  "amenities": [],
  "reservations": []
},{
  "_id": {
    "$oid": "60933c905b6b5a43cea0d98c"
  },
  "villaName": "Sierra",
  "type": "room",
  "numberOfRooms": 15,
  "numOfGuests": 39,
  "location": {
    "$oid": "60707dee70cd0d322b8a2275"
  },
  "destination": "world",
  "rentingDate": {
    "$date": "2021-07-07T00:00:00Z"
  },
  "dateAvailable": {
    "$date": "2021-09-08T00:00:00Z"
  },
  "user": {
    "$oid": "607051793dbb8a1739024ad8"
  },
  "comments": [],
  "images": "/../../assets/img/gallery/sierra.jpg",
  "pricePerNight": "190",
  "checkIn": "11:00",
  "checkOut": "16:00",
  "status": "active",
  "amenities": [],
  "reservations": []
},{
  "_id": {
    "$oid": "6093b38332321e34cbf44da4"
  },
  "villaName": "Jaram",
  "type": "room",
  "numberOfRooms": 8,
  "numOfGuests": 4,
  "location": {
    "$oid": "6093a79f32321e34cbf44d97"
  },
  "destination": "serbia",
  "rentingDate": {
    "$date": "2021-02-23T00:00:00Z"
  },
  "dateAvailable": {
    "$date": "2021-03-01T00:00:00Z"
  },
  "user": {
    "$oid": "607051793dbb8a1739024ad8"
  },
  "comments": [],
  "images": "/../../assets/img/gallery/jaram.jpg",
  "pricePerNight": "95",
  "checkIn": "13:00",
  "checkOut": "11:00",
  "status": "active",
  "amenities": [],
  "reservations": []
},{
  "_id": {
    "$oid": "6093b38332321e34cbf44da5"
  },
  "villaName": "Jezero",
  "type": "room",
  "numberOfRooms": 10,
  "numOfGuests": 6,
  "location": {
    "$oid": "6093a79f32321e34cbf44d97"
  },
  "destination": "serbia",
  "rentingDate": {
    "$date": "2021-04-18T00:00:00Z"
  },
  "dateAvailable": {
    "$date": "2021-04-25T00:00:00Z"
  },
  "user": {
    "$oid": "607051793dbb8a1739024ad8"
  },
  "comments": [],
  "images": "/../../assets/img/gallery/jezero.jpg",
  "pricePerNight": "55",
  "checkIn": "13:30",
  "checkOut": "11:30",
  "status": "active",
  "amenities": [],
  "reservations": []
},{
  "_id": {
    "$oid": "6093bee132321e34cbf44da6"
  },
  "villaName": "Holiday Home Floris",
  "type": "room",
  "numberOfRooms": 6,
  "numOfGuests": 8,
  "location": {
    "$oid": "6093a79f32321e34cbf44d97"
  },
  "destination": "serbia",
  "rentingDate": {
    "$date": "2021-05-05T00:00:00Z"
  },
  "dateAvailable": {
    "$date": "2021-05-15T00:00:00Z"
  },
  "user": {
    "$oid": "607051793dbb8a1739024ad8"
  },
  "comments": [],
  "images": "/../../assets/img/gallery/holiday.jpg",
  "pricePerNight": "75",
  "checkIn": "12:30",
  "checkOut": "10:30",
  "status": "active",
  "amenities": [],
  "reservations": []
},{
  "_id": {
    "$oid": "6093ee7d9cdcefad8530d668"
  },
  "villaName": "StainIn",
  "type": "room",
  "numberOfRooms": 11,
  "numOfGuests": 30,
  "location": {
    "$oid": "6093d3119cdcefad8530d65a"
  },
  "destination": "world",
  "rentingDate": {
    "$date": "2021-06-21T00:00:00Z"
  },
  "dateAvailable": {
    "$date": "2021-06-15T00:00:00Z"
  },
  "user": {
    "$oid": "607051793dbb8a1739024ad8"
  },
  "comments": [],
  "images": "/../../assets/img/gallery/stayin.jpg",
  "pricePerNight": "79",
  "checkIn": "12:30",
  "checkOut": "10:30",
  "status": "active",
  "amenities": [],
  "reservations": []
},{
  "_id": {
    "$oid": "6093ee7d9cdcefad8530d669"
  },
  "villaName": "Sollo",
  "type": "room",
  "numberOfRooms": 19,
  "numOfGuests": 31,
  "location": {
    "$oid": "6093d3119cdcefad8530d65a"
  },
  "destination": "world",
  "rentingDate": {
    "$date": "2021-06-21T00:00:00Z"
  },
  "dateAvailable": {
    "$date": "2021-06-15T00:00:00Z"
  },
  "user": {
    "$oid": "607051793dbb8a1739024ad8"
  },
  "comments": [],
  "images": "/../../assets/img/gallery/sollo.jpg",
  "pricePerNight": "79",
  "checkIn": "12:30",
  "checkOut": "10:30",
  "status": "active",
  "amenities": [],
  "reservations": []
},{
  "_id": {
    "$oid": "6093ee7d9cdcefad8530d66a"
  },
  "villaName": "Gratce Yootsugi",
  "type": "room",
  "numberOfRooms": 19,
  "numOfGuests": 29,
  "location": {
    "$oid": "6093d3119cdcefad8530d65a"
  },
  "destination": "world",
  "rentingDate": {
    "$date": "2021-06-21T00:00:00Z"
  },
  "dateAvailable": {
    "$date": "2021-06-15T00:00:00Z"
  },
  "user": {
    "$oid": "607051793dbb8a1739024ad8"
  },
  "comments": [],
  "images": "/../../assets/img/gallery/gratceyotsugi.jpg",
  "pricePerNight": "79",
  "checkIn": "12:30",
  "checkOut": "10:30",
  "status": "active",
  "amenities": [],
  "reservations": []
},{
  "_id": {
    "$oid": "6093ee7d9cdcefad8530d66b"
  },
  "villaName": "Santa Flavia",
  "type": "room",
  "numberOfRooms": 22,
  "numOfGuests": 33,
  "location": {
    "$oid": "6093d3119cdcefad8530d659"
  },
  "destination": "world",
  "rentingDate": {
    "$date": "2021-08-21T00:00:00Z"
  },
  "dateAvailable": {
    "$date": "2021-09-15T00:00:00Z"
  },
  "user": {
    "$oid": "607051793dbb8a1739024ad8"
  },
  "comments": [],
  "images": "/../../assets/img/gallery/santaflavia.jpg",
  "pricePerNight": "120",
  "checkIn": "10:00",
  "checkOut": "10:30",
  "status": "active",
  "amenities": [],
  "reservations": []
},{
  "_id": {
    "$oid": "6093ee7d9cdcefad8530d66c"
  },
  "villaName": "Santa Cristina",
  "type": "room",
  "numberOfRooms": 19,
  "numOfGuests": 29,
  "location": {
    "$oid": "6093d3119cdcefad8530d659"
  },
  "destination": "world",
  "rentingDate": {
    "$date": "2021-06-21T00:00:00Z"
  },
  "dateAvailable": {
    "$date": "2021-06-15T00:00:00Z"
  },
  "user": {
    "$oid": "607051793dbb8a1739024ad8"
  },
  "comments": [],
  "images": "/../../assets/img/gallery/santacristina.jpg",
  "pricePerNight": "210",
  "checkIn": "09:30",
  "checkOut": "10:30",
  "status": "active",
  "amenities": [],
  "reservations": []
},{
  "_id": {
    "$oid": "6093ee7d9cdcefad8530d66d"
  },
  "villaName": "La Quadra",
  "type": "room",
  "numberOfRooms": 25,
  "numOfGuests": 42,
  "location": {
    "$oid": "6093d3119cdcefad8530d659"
  },
  "destination": "world",
  "rentingDate": {
    "$date": "2021-06-21T00:00:00Z"
  },
  "dateAvailable": {
    "$date": "2021-06-15T00:00:00Z"
  },
  "user": {
    "$oid": "607051793dbb8a1739024ad8"
  },
  "comments": [],
  "images": "/../../assets/img/gallery/laquadra.jpg",
  "pricePerNight": "190",
  "checkIn": "12:30",
  "checkOut": "10:30",
  "status": "active",
  "amenities": [],
  "reservations": []
},{
  "_id": {
    "$oid": "6094651b32321e34cbf44db4"
  },
  "villaName": "Moderna",
  "type": "room",
  "numberOfRooms": 8,
  "numOfGuests": 4,
  "location": {
    "$oid": "609451f932321e34cbf44da7"
  },
  "destination": "serbia",
  "rentingDate": {
    "$date": "2021-03-13T00:00:00Z"
  },
  "dateAvailable": {
    "$date": "2021-03-18T00:00:00Z"
  },
  "user": {
    "$oid": "6099ca33a7922d118d155464"
  },
  "comments": [],
  "images": "/../../assets/img/gallery/moderna.jpg",
  "pricePerNight": "120",
  "checkIn": "13:30",
  "checkOut": "10:00",
  "status": "active",
  "amenities": [],
  "reservations": []
},{
  "_id": {
    "$oid": "6094651b32321e34cbf44db5"
  },
  "villaName": "Mir",
  "type": "room",
  "numberOfRooms": 10,
  "numOfGuests": 6,
  "location": {
    "$oid": "609451f932321e34cbf44da7"
  },
  "destination": "serbia",
  "rentingDate": {
    "$date": "2021-03-13T00:00:00Z"
  },
  "dateAvailable": {
    "$date": "2021-03-18T00:00:00Z"
  },
  "user": {
    "$oid": "6099ca33a7922d118d155464"
  },
  "comments": [],
  "images": "/../../assets/img/gallery/mir.jpg",
  "pricePerNight": "120",
  "checkIn": "13:30",
  "checkOut": "10:00",
  "status": "active",
  "amenities": [],
  "reservations": []
},{
  "_id": {
    "$oid": "6094651b32321e34cbf44db6"
  },
  "villaName": "Kraljica",
  "type": "room",
  "numberOfRooms": 9,
  "numOfGuests": 8,
  "location": {
    "$oid": "609451f932321e34cbf44da7"
  },
  "destination": "serbia",
  "rentingDate": {
    "$date": "2021-04-03T00:00:00Z"
  },
  "dateAvailable": {
    "$date": "2021-04-09T00:00:00Z"
  },
  "user": {
    "$oid": "6099ca33a7922d118d155464"
  },
  "comments": [],
  "images": "/../../assets/img/gallery/kraljica.jpg",
  "pricePerNight": "90",
  "checkIn": "12:30",
  "checkOut": "10:00",
  "status": "active",
  "amenities": [],
  "reservations": []
},{
  "_id": {
    "$oid": "60952a75746ed6315f4d2ed8"
  },
  "villaName": "Penthouse",
  "type": "room",
  "numberOfRooms": 20,
  "numOfGuests": 30,
  "location": {
    "$oid": "60941bfb9cdcefad8530d66f"
  },
  "destination": "world",
  "rentingDate": {
    "$date": "2021-12-03T00:00:00Z"
  },
  "dateAvailable": {
    "$date": "2021-01-09T00:00:00Z"
  },
  "user": {
    "$oid": "6099ca33a7922d118d155464"
  },
  "comments": [],
  "images": "/../../assets/img/gallery/penthouse.jpg",
  "pricePerNight": "110",
  "checkIn": "10:30",
  "checkOut": "14:00",
  "status": "active",
  "amenities": [],
  "reservations": []
},{
  "_id": {
    "$oid": "60952a75746ed6315f4d2ed9"
  },
  "villaName": "Solomon",
  "type": "room",
  "numberOfRooms": 15,
  "numOfGuests": 30,
  "location": {
    "$oid": "60941bfb9cdcefad8530d66f"
  },
  "destination": "world",
  "rentingDate": {
    "$date": "2021-08-03T00:00:00Z"
  },
  "dateAvailable": {
    "$date": "2021-07-09T00:00:00Z"
  },
  "user": {
    "$oid": "6099ca33a7922d118d155464"
  },
  "comments": [],
  "images": "/../../assets/img/gallery/Solomon.jpg",
  "pricePerNight": "180",
  "checkIn": "10:30",
  "checkOut": "14:00",
  "status": "active",
  "amenities": [],
  "reservations": []
},{
  "_id": {
    "$oid": "60952a75746ed6315f4d2eda"
  },
  "villaName": "Villa Verde",
  "type": "room",
  "numberOfRooms": 10,
  "numOfGuests": 30,
  "location": {
    "$oid": "60941bfb9cdcefad8530d66f"
  },
  "destination": "world",
  "rentingDate": {
    "$date": "2021-12-03T00:00:00Z"
  },
  "dateAvailable": {
    "$date": "2021-01-09T00:00:00Z"
  },
  "user": {
    "$oid": "6099ca33a7922d118d155464"
  },
  "comments": [],
  "images": "/../../assets/img/gallery/villaverde.jpg",
  "pricePerNight": "110",
  "checkIn": "10:00",
  "checkOut": "15:00",
  "status": "active",
  "amenities": [],
  "reservations": []
},{
  "_id": {
    "$oid": "60952a75746ed6315f4d2edb"
  },
  "villaName": "Marina Royal",
  "type": "room",
  "numberOfRooms": 40,
  "numOfGuests": 80,
  "location": {
    "$oid": "60941bfb9cdcefad8530d670"
  },
  "destination": "world",
  "rentingDate": {
    "$date": "2021-12-03T00:00:00Z"
  },
  "dateAvailable": {
    "$date": "2021-01-09T00:00:00Z"
  },
  "user": {
    "$oid": "6099ca33a7922d118d155464"
  },
  "comments": [],
  "images": "/../../assets/img/gallery/marinaroyal.jpg",
  "pricePerNight": "160",
  "checkIn": "10:00",
  "checkOut": "14:00",
  "status": "active",
  "amenities": [],
  "reservations": []
},{
  "_id": {
    "$oid": "60952a75746ed6315f4d2edc"
  },
  "villaName": "MyBayut",
  "type": "room",
  "numberOfRooms": 50,
  "numOfGuests": 60,
  "location": {
    "$oid": "60941bfb9cdcefad8530d670"
  },
  "destination": "world",
  "rentingDate": {
    "$date": "2021-12-03T00:00:00Z"
  },
  "dateAvailable": {
    "$date": "2021-01-09T00:00:00Z"
  },
  "user": {
    "$oid": "6099ca33a7922d118d155464"
  },
  "comments": [],
  "images": "/../../assets/img/gallery/mybayut.jpg",
  "pricePerNight": "160",
  "checkIn": "09:00",
  "checkOut": "15:00",
  "status": "active",
  "amenities": [],
  "reservations": []
},{
  "_id": {
    "$oid": "60952a75746ed6315f4d2edd"
  },
  "villaName": "Samiyat",
  "type": "room",
  "numberOfRooms": 20,
  "numOfGuests": 35,
  "location": {
    "$oid": "60941bfb9cdcefad8530d670"
  },
  "destination": "world",
  "rentingDate": {
    "$date": "2021-12-03T00:00:00Z"
  },
  "dateAvailable": {
    "$date": "2021-01-09T00:00:00Z"
  },
  "user": {
    "$oid": "6099ca33a7922d118d155464"
  },
  "comments": [],
  "images": "/../../assets/img/gallery/samiyat.jpg",
  "pricePerNight": "210",
  "checkIn": "09:00",
  "checkOut": "15:00",
  "status": "active",
  "amenities": [],
  "reservations": []
},{
  "_id": {
    "$oid": "60952a75746ed6315f4d2ede"
  },
  "villaName": "Bomo Club",
  "type": "room",
  "numberOfRooms": 40,
  "numOfGuests": 60,
  "location": {
    "$oid": "60941bfb9cdcefad8530d66e"
  },
  "destination": "world",
  "rentingDate": {
    "$date": "2021-12-03T00:00:00Z"
  },
  "dateAvailable": {
    "$date": "2021-01-09T00:00:00Z"
  },
  "user": {
    "$oid": "6099ca33a7922d118d155464"
  },
  "comments": [],
  "images": "/../../assets/img/gallery/bomoclub.jpg",
  "pricePerNight": "180e",
  "checkIn": "09:00",
  "checkOut": "15:00",
  "status": "active",
  "amenities": [],
  "reservations": []
},{
  "_id": {
    "$oid": "60952a75746ed6315f4d2edf"
  },
  "villaName": "Montazah",
  "type": "room",
  "numberOfRooms": 40,
  "numOfGuests": 60,
  "location": {
    "$oid": "60941bfb9cdcefad8530d66e"
  },
  "destination": "world",
  "rentingDate": {
    "$date": "2021-12-03T00:00:00Z"
  },
  "dateAvailable": {
    "$date": "2021-01-09T00:00:00Z"
  },
  "user": {
    "$oid": "6099ca33a7922d118d155464"
  },
  "comments": [],
  "images": "/../../assets/img/gallery/montazah.jpg",
  "pricePerNight": "210",
  "checkIn": "09:00",
  "checkOut": "15:00",
  "status": "active",
  "amenities": [],
  "reservations": []
},{
  "_id": {
    "$oid": "60952a75746ed6315f4d2ee0"
  },
  "villaName": "Rixos",
  "type": "room",
  "numberOfRooms": 20,
  "numOfGuests": 30,
  "location": {
    "$oid": "60941bfb9cdcefad8530d66e"
  },
  "destination": "world",
  "rentingDate": {
    "$date": "2021-12-03T00:00:00Z"
  },
  "dateAvailable": {
    "$date": "2021-01-09T00:00:00Z"
  },
  "user": {
    "$oid": "6099ca33a7922d118d155464"
  },
  "comments": [],
  "images": "/../../assets/img/gallery/rixos.jpg",
  "pricePerNight": "198",
  "checkIn": "10:00",
  "checkOut": "11:00",
  "status": "active",
  "amenities": [],
  "reservations": []
},{
  "_id": {
    "$oid": "60980967f3252d7c8ba188dc"
  },
  "villaName": "Calis",
  "type": "room",
  "numberOfRooms": 29,
  "numOfGuests": 30,
  "location": {
    "$oid": "60980239f3252d7c8ba188ce"
  },
  "destination": "world",
  "rentingDate": {
    "$date": "2021-12-03T00:00:00Z"
  },
  "dateAvailable": {
    "$date": "2021-01-09T00:00:00Z"
  },
  "user": {
    "$oid": "6099ca33a7922d118d155464"
  },
  "comments": [],
  "images": "/../../assets/img/gallery/calis.jpg",
  "pricePerNight": "198",
  "checkIn": "10:00",
  "checkOut": "11:00",
  "status": "active",
  "amenities": [],
  "reservations": []
},{
  "_id": {
    "$oid": "60980967f3252d7c8ba188dd"
  },
  "villaName": "Dela Santissima",
  "type": "room",
  "numberOfRooms": 32,
  "numOfGuests": 5,
  "location": {
    "$oid": "60980239f3252d7c8ba188ce"
  },
  "destination": "world",
  "rentingDate": {
    "$date": "2021-12-03T00:00:00Z"
  },
  "dateAvailable": {
    "$date": "2021-01-09T00:00:00Z"
  },
  "user": {
    "$oid": "6099ca33a7922d118d155464"
  },
  "comments": [],
  "images": "/../../assets/img/gallery/delasantissima.jpg",
  "pricePerNight": "98",
  "checkIn": "10:00",
  "checkOut": "11:00",
  "status": "active",
  "amenities": [],
  "reservations": []
},{
  "_id": {
    "$oid": "60980967f3252d7c8ba188de"
  },
  "villaName": "Havana SeaView",
  "type": "room",
  "numberOfRooms": 40,
  "numOfGuests": 50,
  "location": {
    "$oid": "60980239f3252d7c8ba188ce"
  },
  "destination": "world",
  "rentingDate": {
    "$date": "2021-12-03T00:00:00Z"
  },
  "dateAvailable": {
    "$date": "2021-01-09T00:00:00Z"
  },
  "user": {
    "$oid": "60941e6f9cdcefad8530d675"
  },
  "comments": [],
  "images": "/../../assets/img/gallery/havanaseaview.jpg",
  "pricePerNight": "100",
  "checkIn": "10:00",
  "checkOut": "11:00",
  "status": "active",
  "amenities": [],
  "reservations": []
},{
  "_id": {
    "$oid": "60980967f3252d7c8ba188df"
  },
  "villaName": "Balmond",
  "type": "room",
  "numberOfRooms": 19,
  "numOfGuests": 30,
  "location": {
    "$oid": "60980239f3252d7c8ba188cf"
  },
  "destination": "world",
  "rentingDate": {
    "$date": "2021-12-03T00:00:00Z"
  },
  "dateAvailable": {
    "$date": "2021-01-09T00:00:00Z"
  },
  "user": {
    "$oid": "60941e6f9cdcefad8530d675"
  },
  "comments": [],
  "images": "/../../assets/img/gallery/balmond.jpg",
  "pricePerNight": "82",
  "checkIn": "10:00",
  "checkOut": "11:00",
  "status": "active",
  "amenities": [],
  "reservations": []
},{
  "_id": {
    "$oid": "60980967f3252d7c8ba188e0"
  },
  "villaName": "Jungle Lodge",
  "type": "room",
  "numberOfRooms": 22,
  "numOfGuests": 31,
  "location": {
    "$oid": "60980239f3252d7c8ba188cf"
  },
  "destination": "world",
  "rentingDate": {
    "$date": "2021-12-03T00:00:00Z"
  },
  "dateAvailable": {
    "$date": "2021-01-09T00:00:00Z"
  },
  "user": {
   "$oid": "60941e6f9cdcefad8530d675"
  },
  "comments": [],
  "images": "/../../assets/img/gallery/junglelodge.jpg",
  "pricePerNight": "98",
  "checkIn": "10:00",
  "checkOut": "11:00",
  "status": "active",
  "amenities": [],
  "reservations": []
},{
  "_id": {
    "$oid": "60980967f3252d7c8ba188e1"
  },
  "villaName": "Tierra Viva",
  "type": "room",
  "numberOfRooms": 19,
  "numOfGuests": 30,
  "location": {
    "$oid": "60980239f3252d7c8ba188cf"
  },
  "destination": "world",
  "rentingDate": {
    "$date": "2021-12-03T00:00:00Z"
  },
  "dateAvailable": {
    "$date": "2021-01-09T00:00:00Z"
  },
  "user": {
    "$oid": "60941e6f9cdcefad8530d675"
  },
  "comments": [],
  "images": "/../../assets/img/gallery/tierraviva.jpg",
  "pricePerNight": "105",
  "checkIn": "10:00",
  "checkOut": "11:00",
  "status": "active",
  "amenities": [],
  "reservations": []
},{
  "_id": {
    "$oid": "60984382fda7725537840b83"
  },
  "villaName": "Zeleno Srce",
  "type": "room",
  "numberOfRooms": 3,
  "numOfGuests": 4,
  "location": {
    "$oid": "60983bfefda7725537840b7c"
  },
  "destination": "serbia",
  "rentingDate": {
    "$date": "2021-04-08T00:00:00Z"
  },
  "dateAvailable": {
    "$date": "2021-04-12T00:00:00Z"
  },
  "user": {
    "$oid": "60941e6f9cdcefad8530d675"
  },
  "comments": [],
  "images": "/../../assets/img/gallery/zelenosrce.jpg",
  "pricePerNight": "80",
  "checkIn": "13:00",
  "checkOut": "11:00",
  "status": "active",
  "amenities": [],
  "reservations": []
},{
  "_id": {
    "$oid": "60984382fda7725537840b84"
  },
  "villaName": "Almax",
  "type": "room",
  "numberOfRooms": 4,
  "numOfGuests": 4,
  "location": {
    "$oid": "60983bfefda7725537840b7c"
  },
  "destination": "serbia",
  "rentingDate": {
    "$date": "2021-05-09T00:00:00Z"
  },
  "dateAvailable": {
    "$date": "2021-05-13T00:00:00Z"
  },
  "user": {
    "$oid": "60941e6f9cdcefad8530d675"
  },
  "comments": [],
  "images": "/../../assets/img/gallery/almx.jpg",
  "pricePerNight": "60",
  "checkIn": "13:30",
  "checkOut": "11:30",
  "status": "active",
  "amenities": [],
  "reservations": []
},{
  "_id": {
    "$oid": "60984382fda7725537840b85"
  },
  "villaName": "Lux Soko",
  "type": "room",
  "numberOfRooms": 5,
  "numOfGuests": 2,
  "location": {
    "$oid": "60983bfefda7725537840b7c"
  },
  "destination": "serbia",
  "rentingDate": {
    "$date": "2021-05-18T00:00:00Z"
  },
  "dateAvailable": {
    "$date": "2021-05-22T00:00:00Z"
  },
  "user": {
    "$oid": "60941e6f9cdcefad8530d675"
  },
  "comments": [],
  "images": "/../../assets/img/gallery/sokolux.jpg",
  "pricePerNight": "50",
  "checkIn": "13:30",
  "checkOut": "12:00",
  "status": "active",
  "amenities": [],
  "reservations": []
},{
  "_id": {
    "$oid": "609861a4a8ae3a182e4d634a"
  },
  "villaName": "Mia",
  "type": "room",
  "numberOfRooms": 4,
  "numOfGuests": 4,
  "location": {
    "$oid": "60985c22a8ae3a182e4d6343"
  },
  "destination": "serbia",
  "rentingDate": {
    "$date": "2021-06-01T00:00:00Z"
  },
  "dateAvailable": {
    "$date": "2021-06-07T00:00:00Z"
  },
  "user": {
    "$oid": "60941e6f9cdcefad8530d675"
  },
  "comments": [],
  "images": "/../../assets/img/gallery/mia.jpg",
  "pricePerNight": "65",
  "checkIn": "14:30",
  "checkOut": "12:00",
  "status": "active",
  "amenities": [],
  "reservations": []
},{
  "_id": {
    "$oid": "609861a4a8ae3a182e4d634b"
  },
  "villaName": "Adi",
  "type": "room",
  "numberOfRooms": 2,
  "numOfGuests": 1,
  "location": {
    "$oid": "60985c22a8ae3a182e4d6343"
  },
  "destination": "serbia",
  "rentingDate": {
    "$date": "2021-04-02T00:00:00Z"
  },
  "dateAvailable": {
    "$date": "2021-04-07T00:00:00Z"
  },
  "user": {
    "$oid": "60941e6f9cdcefad8530d675"
  },
  "comments": [],
  "images": "/../../assets/img/gallery/adi.jpg",
  "pricePerNight": "35",
  "checkIn": "13:30",
  "checkOut": "11:00",
  "status": "active",
  "amenities": [],
  "reservations": []
},{
  "_id": {
    "$oid": "609861a4a8ae3a182e4d634c"
  },
  "villaName": "Palace",
  "type": "room",
  "numberOfRooms": 6,
  "numOfGuests": 5,
  "location": {
    "$oid": "60985c22a8ae3a182e4d6343"
  },
  "destination": "serbia",
  "rentingDate": {
    "$date": "2021-05-12T00:00:00Z"
  },
  "dateAvailable": {
    "$date": "2021-05-17T00:00:00Z"
  },
  "user": {
    "$oid": "60941e6f9cdcefad8530d675"
  },
  "comments": [],
  "images": "/../../assets/img/gallery/palace1.jpg",
  "pricePerNight": "30",
  "checkIn": "13:30",
  "checkOut": "11:30",
  "status": "active",
  "amenities": [],
  "reservations": []
},{
  "_id": {
    "$oid": "60a1542abc32ab156d232eb8"
  },
  "villaName": "Haus",
  "type": "room",
  "numberOfRooms": 5,
  "numOfGuests": 4,
  "location": {
    "$oid": "60a13bfbea98c419ce8a5a67"
  },
  "destination": "serbia",
  "rentingDate": {
    "$date": "2021-04-15T00:00:00Z"
  },
  "dateAvailable": {
    "$date": "2021-04-19T00:00:00Z"
  },
  "user": {
    "$oid": "60941e6f9cdcefad8530d675"
  },
  "comments": [],
  "images": "/../../assets/img/gallery/haus1.jpg",
  "pricePerNight": "35",
  "checkIn": "13:00",
  "checkOut": "11:30",
  "status": "active",
  "amenities": [],
  "reservations": []
},{
  "_id": {
    "$oid": "60a1542abc32ab156d232eb9"
  },
  "villaName": "Villa Mila",
  "type": "room",
  "numberOfRooms": 5,
  "numOfGuests": 6,
  "location": {
    "$oid": "60a13bfbea98c419ce8a5a67"
  },
  "destination": "serbia",
  "rentingDate": {
    "$date": "2021-05-16T00:00:00Z"
  },
  "dateAvailable": {
    "$date": "2021-05-19T00:00:00Z"
  },
  "user": {
    "$oid": "60941e6f9cdcefad8530d675"
  },
  "comments": [],
  "images": "/../../assets/img/gallery/mila.jpg",
  "pricePerNight": "40",
  "checkIn": "13:30",
  "checkOut": "10:30",
  "status": "active",
  "amenities": [],
  "reservations": []
},{
  "_id": {
    "$oid": "60a1542abc32ab156d232eba"
  },
  "villaName": "Lux A",
  "type": "room",
  "numberOfRooms": 3,
  "numOfGuests": 2,
  "location": {
    "$oid": "60a13bfbea98c419ce8a5a67"
  },
  "destination": "serbia",
  "rentingDate": {
    "$date": "2021-04-25T00:00:00Z"
  },
  "dateAvailable": {
    "$date": "2021-04-29T00:00:00Z"
  },
  "user": {
    "$oid": "60941e6f9cdcefad8530d675"
  },
  "comments": [],
  "images": "/../../assets/img/gallery/luxa1.jpg",
  "pricePerNight": "55",
  "checkIn": "13:30",
  "checkOut": "11:30",
  "status": "active",
  "amenities": [],
  "reservations": []
},{
  "_id": {
    "$oid": "60a184b9b78a6c17419187d8"
  },
  "villaName": "Vila Sofija",
  "type": "room",
  "numberOfRooms": 2,
  "numOfGuests": 2,
  "location": {
    "$oid": "60a13bfbea98c419ce8a5a67"
  },
  "destination": "serbia",
  "rentingDate": {
    "$date": "2021-05-25T00:00:00Z"
  },
  "dateAvailable": {
    "$date": "2021-05-29T00:00:00Z"
  },
  "user": {
   "$oid": "60941e6f9cdcefad8530d675"
  },
  "comments": [],
  "images": "/../../assets/img/gallery/sofija.jpg",
  "pricePerNight": "35",
  "checkIn": "13:00",
  "checkOut": "11:30",
  "status": "active",
  "amenities": [],
  "reservations": []
},{
  "_id": {
    "$oid": "60a184b9b78a6c17419187d9"
  },
  "villaName": "Zaovinska idila",
  "type": "room",
  "numberOfRooms": 4,
  "numOfGuests": 5,
  "location": {
    "$oid": "60a180c0b78a6c17419187d4"
  },
  "destination": "serbia",
  "rentingDate": {
    "$date": "2021-04-15T00:00:00Z"
  },
  "dateAvailable": {
    "$date": "2021-04-19T00:00:00Z"
  },
  "user": {
    "$oid": "60941e6f9cdcefad8530d675"
  },
  "comments": [],
  "images": "/../../assets/img/gallery/zaovinskaidila.jpg",
  "pricePerNight": "25",
  "checkIn": "13:30",
  "checkOut": "10:30",
  "status": "active",
  "amenities": [],
  "reservations": []
},{
  "_id": {
    "$oid": "60a184b9b78a6c17419187da"
  },
  "villaName": "Vila Iskra",
  "type": "room",
  "numberOfRooms": 3,
  "numOfGuests": 2,
  "location": {
    "$oid": "60a180c0b78a6c17419187d4"
  },
  "destination": "serbia",
  "rentingDate": {
    "$date": "2021-03-05T00:00:00Z"
  },
  "dateAvailable": {
    "$date": "2021-03-15T00:00:00Z"
  },
  "user": {
    "$oid": "60941e6f9cdcefad8530d675"
  },
  "comments": [],
  "images": "/../../assets/img/gallery/iskra.jpg",
  "pricePerNight": "45",
  "checkIn": "12:30",
  "checkOut": "11:30",
  "status": "active",
  "amenities": [],
  "reservations": []
}]
