[
    {
        "username": "Mica",
        "name": "Milica",
        "surname": "Sudar",
        "email": "milicasudar@gmail.com",
        "password": "$2b$10$X9zwC18bOFIjGFb/ksqJN.F.lUg.CcxCnXWabomMIylu7/7tz1Hca",
        "gender": "female",
        "location": { 
            "city": "Beograd",
            "municipality": "Vozdovac"
        },
        "dateOfBirth": "1997-07-07",
        "imgUrl": "female_avatar.png"
    
    },
    {
        "username": "Kaca",
        "name": "Katarina",
        "surname": "Simic",
        "email": "kaja@gmail.com",
        "password": "$2b$10$X9zwC18bOFIjGFb/ksqJN.F.lUg.CcxCnXWabomMIylu7/7tz1Hca",
        "gender": "female",
        "location": { 
            "city": "Beograd",
            "municipality": "Vozdovac"
        },
        "dateOfBirth": "1998-09-10",
        "imgUrl": "female_avatar.png"
    
    },
    {
        "username": "Ema",
        "name": "Emilija",
        "surname": "Stosic",
        "email": "emilija@gmail.com",
        "password": "$2b$10$X9zwC18bOFIjGFb/ksqJN.F.lUg.CcxCnXWabomMIylu7/7tz1Hca",
        "gender": "female",
        "location": { 
            "city": "Vranje",
            "municipality": "Vranje"
        },
        "dateOfBirth": "1998-05-08",
        "imgUrl": "female_avatar.png"
    
    },
    {
        "username": "Maja",
        "name": "Maja",
        "surname": "Crnomarkovic",
        "email": "maja@gmail.com",
        "password": "$2b$10$X9zwC18bOFIjGFb/ksqJN.F.lUg.CcxCnXWabomMIylu7/7tz1Hca",
        "gender": "female",
        "location": { 
            "city": "Beograd",
            "municipality": "Zemun"
        },
        "dateOfBirth": "1998-10-07",
        "imgUrl": "female_avatar.png"
    
    },
    {
        "username": "Marko",
        "name": "Marko",
        "surname": "Babic",
        "email": "marko@gmail.com",
        "password": "$2b$10$X9zwC18bOFIjGFb/ksqJN.F.lUg.CcxCnXWabomMIylu7/7tz1Hca",
        "gender": "male",
        "location": { 
            "city": "Subotica",
            "municipality": "Subotica"
        },
        "dateOfBirth": "1998-06-11",
        "imgUrl": "male_avatar.png"
    
    },
    {
        "username": "Pera",
        "name": "Petar",
        "surname": "Jovanovic",
        "email": "pera@gmail.com",
        "password": "$2b$10$X9zwC18bOFIjGFb/ksqJN.F.lUg.CcxCnXWabomMIylu7/7tz1Hca",
        "gender": "male",
        "location": { 
            "city": "Leskovac",
            "municipality": "Leskovac"
        },
        "dateOfBirth": "1990-08-12",
        "imgUrl": "male_avatar.png"
    
    },
    {
        "username": "Vesna",
        "name": "Vesna",
        "surname": "Tasic",
        "email": "veka@gmail.com",
        "password": "$2b$10$X9zwC18bOFIjGFb/ksqJN.F.lUg.CcxCnXWabomMIylu7/7tz1Hca",
        "gender": "female",
        "location": { 
            "city": "Beograd",
            "municipality": "Vracar"
        },
        "dateOfBirth": "1995-07-11",
        "imgUrl": "female_avatar.png"
    
    },
    {
        "username": "Joca",
        "name": "Jovan",
        "surname": "Nedeljkovic",
        "email": "jn@gmail.com",
        "password": "$2b$10$X9zwC18bOFIjGFb/ksqJN.F.lUg.CcxCnXWabomMIylu7/7tz1Hca",
        "gender": "male",
        "location": { 
            "city": "Beograd",
            "municipality": "Novi Beograd"
        },
        "dateOfBirth": "2000-07-07",
        "imgUrl": "male_avatar.png"
    },
    {
        "username": "Jelena",
        "name": "Jelena",
        "surname": "Pesic",
        "email": "jeca@gmail.com",
        "password": "$2b$10$X9zwC18bOFIjGFb/ksqJN.F.lUg.CcxCnXWabomMIylu7/7tz1Hca",
        "gender": "female",
        "location": { 
            "city": "Kraljevo",
            "municipality": "Kraljevo"
        },
        "dateOfBirth": "1999-10-11",
        "imgUrl": "female_avatar.png"
    
    }
]