{
	"info": {
		"_postman_id": "175533e0-c8f1-4965-920a-6ee16c5fdd2f",
		"name": "Potera",
		"schema": "https://schema.getpostman.com/json/collection/v2.1.0/collection.json"
	},
	"item": [
		{
			"name": "Users",
			"item": [
				{
					"name": "Users-GETALL",
					"request": {
						"method": "GET",
						"header": [],
						"url": {
							"raw": "http://localhost:3000/users/list",
							"protocol": "http",
							"host": [
								"localhost"
							],
							"port": "3000",
							"path": [
								"users",
								"list"
							]
						}
					},
					"response": []
				},
				{
					"name": "Users-ADDUSER",
					"request": {
						"method": "POST",
						"header": [],
						"body": {
							"mode": "raw",
							"raw": "{\"ime\": \"Test\", \n\"prezime\":\"Test1\" ,\n\"email\": \"test@gmail.com\",\n\"rodjendan\": \"1998-06-11\",\n\"sifra\": \"12345\"}",
							"options": {
								"raw": {
									"language": "json"
								}
							}
						},
						"url": {
							"raw": "http://localhost:3000/users/add",
							"protocol": "http",
							"host": [
								"localhost"
							],
							"port": "3000",
							"path": [
								"users",
								"add"
							]
						}
					},
					"response": []
				},
				{
					"name": "Users-DELETE",
					"request": {
						"method": "DELETE",
						"header": [],
						"body": {
							"mode": "raw",
							"raw": "",
							"options": {
								"raw": {
									"language": "json"
								}
							}
						},
						"url": {
							"raw": "localhost:3000/users/delete?userId=60a3da5718dcd3385bd36e41",
							"host": [
								"localhost"
							],
							"port": "3000",
							"path": [
								"users",
								"delete"
							],
							"query": [
								{
									"key": "userId",
									"value": "60a3da5718dcd3385bd36e41"
								}
							]
						}
					},
					"response": []
				},
				{
					"name": "Users-LOGIN",
					"request": {
						"method": "POST",
						"header": [],
						"body": {
							"mode": "raw",
							"raw": "{\n    \"email\": \"testi@gmail.com\",\n    \"password\": \"123456\"\n}",
							"options": {
								"raw": {
									"language": "json"
								}
							}
						},
						"url": {
							"raw": "http://localhost:3000/users/login/",
							"protocol": "http",
							"host": [
								"localhost"
							],
							"port": "3000",
							"path": [
								"users",
								"login",
								""
							]
						}
					},
					"response": []
				},
				{
					"name": "Users-Update",
					"request": {
						"method": "PUT",
						"header": [],
						"body": {
							"mode": "raw",
							"raw": "{\"ime\": \"Ivana\", \n\"prezime\":\"Boom\" ,\n\"email\": \"testi@gmail.com\",\n\"rodjendan\": \"1998-06-11\",\n\"sifra\": \"12345\"}",
							"options": {
								"raw": {
									"language": "json"
								}
							}
						},
						"url": {
							"raw": "http://localhost:3000/users/update?userId=60a8e721c5cc2e0f0c8a1f24",
							"protocol": "http",
							"host": [
								"localhost"
							],
							"port": "3000",
							"path": [
								"users",
								"update"
							],
							"query": [
								{
									"key": "userId",
									"value": "60a8e721c5cc2e0f0c8a1f24"
								}
							]
						}
					},
					"response": []
				}
			]
		},
		{
			"name": "Questions",
			"item": [
				{
					"name": "DodajPitanje",
					"request": {
						"method": "POST",
						"header": [],
						"body": {
							"mode": "raw",
							"raw": "{   \n    \"tekst\": \"Sa koje planete je Supermen?\",\n    \"odgovor1\": \"Kripton\",\n    \"odgovor2\": \"Mars\",\n    \"odgovor3\": \"Saturn\",\n    \"tacanodgovor\": \"1\"\n}",
							"options": {
								"raw": {
									"language": "json"
								}
							}
						},
						"url": {
							"raw": "http://localhost:3000/questions/add",
							"protocol": "http",
							"host": [
								"localhost"
							],
							"port": "3000",
							"path": [
								"questions",
								"add"
							]
						}
					},
					"response": []
				},
				{
					"name": "obrisi pitanje",
					"request": {
						"method": "DELETE",
						"header": [],
						"url": {
							"raw": "localhost:3000/questions/delete?questionId=60a3cd8f6679fc29c0d19579",
							"host": [
								"localhost"
							],
							"port": "3000",
							"path": [
								"questions",
								"delete"
							],
							"query": [
								{
									"key": "questionId",
									"value": "60a3cd8f6679fc29c0d19579"
								}
							]
						}
					},
					"response": []
				},
				{
					"name": "GetALL",
					"request": {
						"method": "GET",
						"header": [],
						"url": {
							"raw": "http://localhost:3000/questions/list",
							"protocol": "http",
							"host": [
								"localhost"
							],
							"port": "3000",
							"path": [
								"questions",
								"list"
							]
						}
					},
					"response": []
				},
				{
					"name": "add and update pitanje",
					"request": {
						"method": "PUT",
						"header": [],
						"body": {
							"mode": "raw",
							"raw": "{   \"_id\": \"test\",\n    \"tekst\": \"Dolci\",\n    \"odgovor1\": \"351\",\n    \"odgovor2\": \"206\",\n    \"odgovor3\": \"402\",\n    \"tacanodgovor\": \"2\"\n}",
							"options": {
								"raw": {
									"language": "json"
								}
							}
						},
						"url": {
							"raw": "http://localhost:3000/questions/update?questionId=60a80527daebca10346f503d",
							"protocol": "http",
							"host": [
								"localhost"
							],
							"port": "3000",
							"path": [
								"questions",
								"update"
							],
							"query": [
								{
									"key": "questionId",
									"value": "60a80527daebca10346f503d"
								}
							]
						}
					},
					"response": []
				},
				{
					"name": "search by tekst",
					"protocolProfileBehavior": {
						"disableBodyPruning": true
					},
					"request": {
						"method": "GET",
						"header": [],
						"body": {
							"mode": "raw",
							"raw": "{\n    \"tekst\": \"Koja je najnaseljenija zemlja na svetu?\"\n}",
							"options": {
								"raw": {
									"language": "json"
								}
							}
						},
						"url": {
							"raw": "http://localhost:3000/questions/search",
							"protocol": "http",
							"host": [
								"localhost"
							],
							"port": "3000",
							"path": [
								"questions",
								"search"
							],
							"query": [
								{
									"key": "tekst",
									"value": "Koja je najnaseljenija zemlja na svetu?",
									"disabled": true
								}
							]
						}
					},
					"response": []
				},
				{
					"name": "search by id",
					"request": {
						"method": "GET",
						"header": [],
						"url": {
							"raw": "http://localhost:3000/questions/id?questionId=608436aac3afde1aef06a1da",
							"protocol": "http",
							"host": [
								"localhost"
							],
							"port": "3000",
							"path": [
								"questions",
								"id"
							],
							"query": [
								{
									"key": "questionId",
									"value": "608436aac3afde1aef06a1da"
								}
							]
						}
					},
					"response": []
				}
			]
		},
		{
			"name": "Prvafaza",
			"item": [
				{
					"name": "DodajPitanje",
					"request": {
						"method": "POST",
						"header": [],
						"body": {
							"mode": "raw",
							"raw": "{   \n    \"tekst\": \"Sa koje planete je Supermen?\",\n    \"odgovor1\": \"Kripton\",\n    \"odgovor2\": \"Mars\",\n    \"odgovor3\": \"Saturn\",\n    \"tacanodgovor\": \"1\"\n}",
							"options": {
								"raw": {
									"language": "json"
								}
							}
						},
						"url": {
							"raw": "http://localhost:3000/prvafaza/add",
							"protocol": "http",
							"host": [
								"localhost"
							],
							"port": "3000",
							"path": [
								"prvafaza",
								"add"
							]
						}
					},
					"response": []
				},
				{
					"name": "obrisi pitanje",
					"request": {
						"method": "DELETE",
						"header": [],
						"url": {
							"raw": "localhost:3000/prvafaza/delete?questionId=60a3cd8f6679fc29c0d19579",
							"host": [
								"localhost"
							],
							"port": "3000",
							"path": [
								"prvafaza",
								"delete"
							],
							"query": [
								{
									"key": "questionId",
									"value": "60a3cd8f6679fc29c0d19579"
								}
							]
						}
					},
					"response": []
				},
				{
					"name": "GetALL",
					"request": {
						"method": "GET",
						"header": [],
						"url": {
							"raw": "http://localhost:3000/prvafaza/list",
							"protocol": "http",
							"host": [
								"localhost"
							],
							"port": "3000",
							"path": [
								"prvafaza",
								"list"
							]
						}
					},
					"response": []
				},
				{
					"name": "add and update pitanje",
					"request": {
						"method": "PUT",
						"header": [],
						"body": {
							"mode": "raw",
							"raw": "{   \"_id\": \"test\",\n    \"tekst\": \"Koliko kostiju ima ljudsko telo?\",\n    \"odgovor1\": \"351\",\n    \"odgovor2\": \"206\",\n    \"odgovor3\": \"402\",\n    \"tacanodgovor\": \"2\"\n}",
							"options": {
								"raw": {
									"language": "json"
								}
							}
						},
						"url": {
							"raw": "http://localhost:3000/prvafaza/update?questionId=60a3cdd06679fc29c0d1957b",
							"protocol": "http",
							"host": [
								"localhost"
							],
							"port": "3000",
							"path": [
								"prvafaza",
								"update"
							],
							"query": [
								{
									"key": "questionId",
									"value": "60a3cdd06679fc29c0d1957b"
								}
							]
						}
					},
					"response": []
				},
				{
					"name": "search by tekst",
					"protocolProfileBehavior": {
						"disableBodyPruning": true
					},
					"request": {
						"method": "GET",
						"header": [],
						"body": {
							"mode": "raw",
							"raw": "{\n    \"tekst\": \"Sa koje planete je Supermen?\"\n}",
							"options": {
								"raw": {
									"language": "json"
								}
							}
						},
						"url": {
							"raw": "http://localhost:3000/prvafaza/search",
							"protocol": "http",
							"host": [
								"localhost"
							],
							"port": "3000",
							"path": [
								"prvafaza",
								"search"
							],
							"query": [
								{
									"key": "tekst",
									"value": "Koja je najnaseljenija zemlja na svetu?",
									"disabled": true
								}
							]
						}
					},
					"response": []
				},
				{
					"name": "search by id",
					"request": {
						"method": "GET",
						"header": [],
						"url": null
					},
					"response": []
				}
			]
		}
	]
}