{
	"_id": {
		"$oid": "5ff5c8a060f9f62b10ab5c70"
	},
	"userId": {
		"$oid": "5f3ac3a0368a2a2d245dd317"
	},
	"name": "Увод у организацију рачунара",
	"price": 860,
	"authors": "МИТИЋ, Ненад",
	"description": "",
	"subject": "УОР",
	"image": "http://alas.matf.bg.ac.rs/~websites/knjige/wp-content/uploads/2016/11/Uvod-u-organizaciju-racunara.jpg",
	"__v": 0
}
{
	"_id": {
		"$oid": "5ff5c83d60f9f62b10ab5c6f"
	},
	"userId": {
		"$oid": "5f3ac3a0368a2a2d245dd317"
	},
	"name": "Математичко моделирање",
	"price": 500,
	"authors": "ДРАЖИЋ, Милан",
	"description": "",
	"subject": "ОММ",
	"image": "http://alas.matf.bg.ac.rs/~websites/knjige/wp-content/uploads/2017/10/Matematicko-modeliranje-page-001.jpg",
	"__v": 0
}
{
	"_id": {
		"$oid": "5ff5c81360f9f62b10ab5c6e"
	},
	"userId": {
		"$oid": "5f3ac3a0368a2a2d245dd317"
	},
	"name": "Збирка решених задатака из увода у нумеричку математику",
	"price": 400,
	"authors": "ДЕЛИЋ, Александра; ДРАЖИЋ, Зорица; ЖИВАНОВИЋ Сандра; ИВАНОВИЋ, Марија",
	"description": "",
	"subject": "УНМ",
	"image": "http://alas.matf.bg.ac.rs/~websites/knjige/wp-content/uploads/2017/10/Uvod-u-numericku-matematiku-zbirka-page-001.jpg",
	"__v": 0
}
{
	"_id": {
		"$oid": "5ffb59506872192924d9aa86"
	},
	"userId": {
		"$oid": "5f369ff624cbd721a0665a70"
	},
	"name": "Теодорине белешке из развоја софтвера",
	"price": 0,
	"authors": "Теодора Нићковић",
	"description": "Белешке 2020.",
	"subject": "РС",
	"image": null,
	"url": "http://alas.matf.bg.ac.rs/~mi16057/teodorine-rs-beleske.pdf",
	"__v": 0
}
{
	"_id": {
		"$oid": "5ff5c9e260f9f62b10ab5c73"
	},
	"userId": {
		"$oid": "5f3ac3a0368a2a2d245dd317"
	},
	"name": "Диференцијална геометрија многострукости",
	"price": 690,
	"authors": "АНТИЋ Мирослава",
	"description": "",
	"subject": "",
	"image": "http://alas.matf.bg.ac.rs/~websites/knjige/wp-content/uploads/2016/11/Diferencijana-geometrija-mnogostrukosti.jpg",
	"__v": 0
}
{
	"_id": {
		"$oid": "5ff5c8bf60f9f62b10ab5c71"
	},
	"userId": {
		"$oid": "5f3ac3a0368a2a2d245dd317"
	},
	"name": "Оперативни системи",
	"price": 750,
	"authors": "МАРИЋ, Мирослав",
	"description": "",
	"subject": "ОС",
	"image": "http://alas.matf.bg.ac.rs/~websites/knjige/wp-content/uploads/2016/11/Operativni-sistemi.jpg",
	"__v": 0
}
{
	"_id": {
		"$oid": "5ff5c9b060f9f62b10ab5c72"
	},
	"userId": {
		"$oid": "5f3ac3a0368a2a2d245dd317"
	},
	"name": "Геометрија за информатичаре",
	"price": 690,
	"authors": "ШУКИЛОВИЋ, Тијана; ВУКМИРОВИЋ, Срђан",
	"description": "Књига је намењена за предмет Геометрија на И смеру Математичког факултета. Поред чисто математичких концепата, садржи и мноштво практичних примера нарочито погодних за студенте овог смера.",
	"subject": "Г",
	"image": "http://alas.matf.bg.ac.rs/~websites/knjige/wp-content/uploads/2016/11/Geometrija-za-informaticare.jpg",
	"__v": 0
}
