{"_id":{"$oid":"5f6c8459f5817234d723ed98"},"history":[{"$numberInt":"41373501"},{"$numberInt":"40962081"},{"$numberInt":"122664252"}],"liked":["40962081"],"username":"sanja","email":"sanja@gmail.com","password":"$2a$10$1A8bfSsBwVawGiVgv6K/CONN/sVSoTZobxJdA5A0/hWRzbHKjVDsa","lists":[{"songs":[{"$numberInt":"356813591"},{"$numberInt":"830336912"},{"$numberInt":"830336922"},{"$numberInt":"830336942"},{"$numberInt":"830336972"}],"private":false,"_id":{"$oid":"5f6c8474f5817234d723ed99"},"name":"Love songs"}],"hearted":[],"__v":{"$numberInt":"10"}}
{"_id":{"$oid":"5f6c84aff5817234d723ed9a"},"history":[{"$numberInt":"11196730"},{"$numberInt":"108706862"}],"liked":["11196730","108706862"],"username":"tina","email":"tina@gmail.com","password":"$2a$10$10MKx1Zw.CRjkvvCN6O7p.oWRsmTMm4l472N3PXD94uuKSYL4LjJG","lists":[{"songs":[{"$numberInt":"107394230"},{"$numberInt":"107394232"},{"$numberInt":"107394234"},{"$numberInt":"107394242"},{"$numberInt":"107394248"}],"private":false,"_id":{"$oid":"5f6c84bbf5817234d723ed9b"},"name":"Summer"}],"hearted":[{"songs":[{"$numberInt":"356813591"},{"$numberInt":"830336912"},{"$numberInt":"830336922"},{"$numberInt":"830336942"},{"$numberInt":"830336972"}],"_id":{"$oid":"5f6c84e4f5817234d723ed9c"},"name":"Love songs"}],"__v":{"$numberInt":"11"}}
{"_id":{"$oid":"5f6c84fff5817234d723ed9d"},"history":[{"$numberInt":"164591122"},{"$numberInt":"70199552"},{"$numberInt":"75335942"}],"liked":["164591122","70199552","75335942"],"username":"darko","email":"darko@gmail.com","password":"$2a$10$7yqW/S1avJI8B4PjN/dXUeLgqqW.eD.yuUf6/L2c6TrN625stYUru","lists":[{"songs":[{"$numberInt":"538655162"},{"$numberInt":"538655152"},{"$numberInt":"538655142"},{"$numberInt":"566690232"}],"private":false,"_id":{"$oid":"5f6c850af5817234d723ed9e"},"name":"Pop"},{"songs":[{"$numberInt":"538655212"},{"$numberInt":"538655222"},{"$numberInt":"538655202"},{"$numberInt":"566690242"}],"private":false,"_id":{"$oid":"5f6c850df5817234d723ed9f"},"name":"Chill"}],"hearted":[],"__v":{"$numberInt":"16"}}
{"_id":{"$oid":"5f6c8567f5817234d723eda0"},"history":[{"$numberInt":"1238968"},{"$numberInt":"8760585"}],"liked":["1238968","8760585"],"username":"marija","email":"marija@gmail.com","password":"$2a$10$xpwQGKRsR.DVyTgXjJjXbOJpxUtgvgHeehfmYoZx1OJMb4qQJHYNW","lists":[{"songs":[{"$numberInt":"13529570"},{"$numberInt":"13529572"},{"$numberInt":"13529574"},{"$numberInt":"86835367"},{"$numberInt":"86835369"}],"private":false,"_id":{"$oid":"5f6c8571f5817234d723eda1"},"name":"Workout"},{"songs":[{"$numberInt":"13529573"},{"$numberInt":"13529575"},{"$numberInt":"86835365"},{"$numberInt":"86835375"}],"private":false,"_id":{"$oid":"5f6c8575f5817234d723eda2"},"name":"Feel good"}],"hearted":[{"songs":[{"$numberInt":"538655212"},{"$numberInt":"538655222"},{"$numberInt":"538655202"},{"$numberInt":"566690242"}],"_id":{"$oid":"5f6c85b4f5817234d723eda3"},"name":"Chill"},{"songs":[{"$numberInt":"107394230"},{"$numberInt":"107394232"},{"$numberInt":"107394234"},{"$numberInt":"107394242"},{"$numberInt":"107394248"}],"_id":{"$oid":"5f6c85b6f5817234d723eda4"},"name":"Summer"},{"songs":[{"$numberInt":"356813591"},{"$numberInt":"830336912"},{"$numberInt":"830336922"},{"$numberInt":"830336942"},{"$numberInt":"830336972"}],"_id":{"$oid":"5f6c85b9f5817234d723eda5"},"name":"Love songs"}],"__v":{"$numberInt":"18"}}
{"_id":{"$oid":"5f6c85d1f5817234d723eda6"},"history":[{"$numberInt":"8014994"},{"$numberInt":"120608152"}],"liked":["8014994","120608152"],"username":"sasa","email":"sasa@gmail.com","password":"$2a$10$gQL8mW3FRlMvGC4k6I3UP.TmBy5IoDLEHz8gjKRqNNuKuzlhIHWIm","lists":[{"songs":[{"$numberInt":"80267256"},{"$numberInt":"80267264"},{"$numberInt":"80267266"},{"$numberInt":"819557592"},{"$numberInt":"819557602"},{"$numberInt":"819557582"},{"$numberInt":"819557672"}],"private":false,"_id":{"$oid":"5f6c85daf5817234d723eda7"},"name":"Oldies"}],"hearted":[{"songs":[{"$numberInt":"13529573"},{"$numberInt":"13529575"},{"$numberInt":"86835365"},{"$numberInt":"86835375"}],"_id":{"$oid":"5f6c8612f5817234d723eda8"},"name":"Feel good"},{"songs":[{"$numberInt":"538655162"},{"$numberInt":"538655152"},{"$numberInt":"538655142"},{"$numberInt":"566690232"}],"_id":{"$oid":"5f6c8615f5817234d723eda9"},"name":"Pop"}],"__v":{"$numberInt":"14"}}
{"_id":{"$oid":"5f6c862bf5817234d723edaa"},"history":[{"$numberInt":"366357"},{"$numberInt":"126315"}],"liked":["366357","126315"],"username":"ana","email":"ana123@gmail.com","password":"$2a$10$gHmureHTOHIVjYb8lAFqQ.sHq4py.RwY/U8M40qM/Pf7Yd74VhDKu","lists":[{"songs":[{"$numberInt":"3923856"},{"$numberInt":"1182251"},{"$numberInt":"1182249"},{"$numberInt":"1182247"},{"$numberInt":"1182248"}],"private":false,"_id":{"$oid":"5f6c8632f5817234d723edab"},"name":"Winter list"}],"hearted":[{"songs":[{"$numberInt":"107394230"},{"$numberInt":"107394232"},{"$numberInt":"107394234"},{"$numberInt":"107394242"},{"$numberInt":"107394248"}],"_id":{"$oid":"5f6c8638f5817234d723edac"},"name":"Summer"},{"songs":[{"$numberInt":"356813591"},{"$numberInt":"830336912"},{"$numberInt":"830336922"},{"$numberInt":"830336942"},{"$numberInt":"830336972"}],"_id":{"$oid":"5f6c863bf5817234d723edad"},"name":"Love songs"}],"__v":{"$numberInt":"12"}}
{"_id":{"$oid":"5f6c86b1f5817234d723edae"},"history":[{"$numberInt":"13429609"},{"$numberInt":"13112696"},{"$numberInt":"11483764"}],"liked":["13429609","11483764"],"username":"natasa123","email":"natasa123@gmail.com","password":"$2a$10$CIds35.JKOoObwVWiMmHHOtcE6fahidH7mR2xSIPNjH41eWTMN5Bu","lists":[{"songs":[{"$numberInt":"127322359"},{"$numberInt":"127322361"},{"$numberInt":"127322363"},{"$numberInt":"127322367"},{"$numberInt":"127322371"},{"$numberInt":"127322373"},{"$numberInt":"127322377"},{"$numberInt":"127322379"},{"$numberInt":"110265034"}],"private":false,"_id":{"$oid":"5f6c86bdf5817234d723edaf"},"name":"Sad songs"}],"hearted":[{"songs":[{"$numberInt":"538655162"},{"$numberInt":"538655152"},{"$numberInt":"538655142"},{"$numberInt":"566690232"}],"_id":{"$oid":"5f6c86f7f5817234d723edb0"},"name":"Pop"},{"songs":[{"$numberInt":"13529573"},{"$numberInt":"13529575"},{"$numberInt":"86835365"},{"$numberInt":"86835375"}],"_id":{"$oid":"5f6c86f9f5817234d723edb1"},"name":"Feel good"},{"songs":[{"$numberInt":"3923856"},{"$numberInt":"1182251"},{"$numberInt":"1182249"},{"$numberInt":"1182247"},{"$numberInt":"1182248"}],"_id":{"$oid":"5f6c86fef5817234d723edb2"},"name":"Winter list"}],"__v":{"$numberInt":"18"}}
{"_id":{"$oid":"5f6c8710f5817234d723edb3"},"history":[{"$numberInt":"10670804"},{"$numberInt":"7687128"}],"liked":["10670804","7687128"],"username":"dusan","email":"dusan@gmail.com","password":"$2a$10$IReKLKy0JRgQvN79u2x8NuzolcBYocWDXEBMMIdr5UPLbypYQyHIC","lists":[{"songs":[{"$numberInt":"102704288"},{"$numberInt":"77361289"},{"$numberInt":"77361291"},{"$numberInt":"77361292"},{"$numberInt":"77361288"},{"$numberInt":"77361286"},{"$numberInt":"77361284"},{"$numberInt":"77361283"},{"$numberInt":"77361282"},{"$numberInt":"77361281"}],"private":false,"_id":{"$oid":"5f6c871ff5817234d723edb4"},"name":"Happy list"}],"hearted":[{"songs":[{"$numberInt":"13529573"},{"$numberInt":"13529575"},{"$numberInt":"86835365"},{"$numberInt":"86835375"}],"_id":{"$oid":"5f6c874ff5817234d723edb5"},"name":"Feel good"},{"songs":[{"$numberInt":"538655212"},{"$numberInt":"538655222"},{"$numberInt":"538655202"},{"$numberInt":"566690242"}],"_id":{"$oid":"5f6c8752f5817234d723edb6"},"name":"Chill"}],"__v":{"$numberInt":"17"}}
{"_id":{"$oid":"5f6c89ccf5817234d723edb7"},"history":[{"$numberInt":"173472102"},{"$numberInt":"7687124"}],"liked":["7687124"],"username":"aca","email":"aca@gmail.com","password":"$2a$10$VWDIF79EJAfeY6nuYUzmF.mqLJX0QRceeifDB8TZ3xSR3eNlus8JG","lists":[],"hearted":[{"songs":[{"$numberInt":"80267256"},{"$numberInt":"80267264"},{"$numberInt":"80267266"},{"$numberInt":"819557592"},{"$numberInt":"819557602"},{"$numberInt":"819557582"},{"$numberInt":"819557672"}],"_id":{"$oid":"5f6c89d7f5817234d723edb8"},"name":"Oldies"},{"songs":[{"$numberInt":"13529573"},{"$numberInt":"13529575"},{"$numberInt":"86835365"},{"$numberInt":"86835375"}],"_id":{"$oid":"5f6c89daf5817234d723edb9"},"name":"Feel good"}],"__v":{"$numberInt":"5"}}
