[{
  "_id": {
    "$oid": "5f160f95d708bf0b9c1afd78"
  },
  "firstname": "Marko",
  "lastname": "Veljkovic",
  "email": "marko.veljko@jasam.com",
  "username": "bataVe",
  "password": "marko123",
  "teacherId": {
    "$oid": "5f160ee5d708bf0b9c1afd76"
  },
  "classId": {
    "$oid": "5f160ee5d708bf0b9c1afd77"
  },
  "__v": 0
},{
  "_id": {
    "$oid": "5f27049fe3390c2fa0d2fe57"
  },
  "firstname": "stanko",
  "lastname": "stankovic",
  "email": "marko@gmail.com",
  "username": "bataVr",
  "password": "marko123",
  "teacherId": {
    "$oid": "5f2342580c34d338c8d4bde7"
  },
  "classId": {
    "$oid": "5f2342580c34d338c8d4bde8"
  },
  "__v": 0
},{
  "_id": {
    "$oid": "5f288137fdd67d3f54b05142"
  },
  "firstname": "Mladen",
  "lastname": "Veljkovic",
  "email": "mladen@gmail.com",
  "username": "mladen",
  "password": "mladen123",
  "teacherId": {
    "$oid": "5f160ee5d708bf0b9c1afd76"
  },
  "classId": {
    "$oid": "5f160ee5d708bf0b9c1afd77"
  },
  "__v": 0
},{
  "_id": {
    "$oid": "5f46bcef84f2c42d78d4439f"
  },
  "firstname": "Stefan",
  "lastname": "Stankovic",
  "email": "stefan@gmail.com",
  "username": "stefan.stankovic",
  "password": "stefan123",
  "teacherId": {
    "$oid": "5f46bcb584f2c42d78d4439d"
  },
  "classId": {
    "$oid": "5f46bcb584f2c42d78d4439e"
  },
  "__v": 0
},{
  "_id": {
    "$oid": "5f46cc3484f2c42d78d443aa"
  },
  "firstname": "Marko",
  "lastname": "Veljkovic",
  "email": "marko.veljkovic@gmail.com",
  "username": "marko.veljkovic",
  "password": "marko123",
  "teacherId": {
    "$oid": "5f46cc0384f2c42d78d443a8"
  },
  "classId": {
    "$oid": "5f46cc0384f2c42d78d443a9"
  },
  "__v": 0
},{
  "_id": {
    "$oid": "5f46d1f384f2c42d78d443bd"
  },
  "firstname": "Igor",
  "lastname": "Jovanovic",
  "email": "igor@gmail.com",
  "username": "igor11",
  "password": "igor12345",
  "teacherId": {
    "$oid": "5f46cc0384f2c42d78d443a8"
  },
  "classId": {
    "$oid": "5f46cc0384f2c42d78d443a9"
  },
  "__v": 0
},{
  "_id": {
    "$oid": "5f46d8d884f2c42d78d443c8"
  },
  "firstname": "proba",
  "lastname": "probic",
  "email": "proba@gmail.com",
  "username": "proba1",
  "password": "proba123",
  "teacherId": {
    "$oid": "5f160ee5d708bf0b9c1afd76"
  },
  "classId": {
    "$oid": "5f160ee5d708bf0b9c1afd77"
  },
  "__v": 0
},{
  "_id": {
    "$oid": "5f46e31e84f2c42d78d443f3"
  },
  "firstname": "nalog",
  "lastname": "nalog",
  "email": "nalog@gmail.com",
  "username": "nalog123",
  "password": "nalog123",
  "teacherId": {
    "$oid": "5f46e2fd84f2c42d78d443f1"
  },
  "classId": {
    "$oid": "5f46e2fd84f2c42d78d443f2"
  },
  "__v": 0
},{
  "_id": {
    "$oid": "5f47b25eb1512f3be0dd96b8"
  },
  "firstname": "Kristina",
  "lastname": "Mladenovic",
  "email": "kristina.mladenovic@gmail.com",
  "username": "kristina.mladenovic",
  "password": "Kristina123",
  "teacherId": {
    "$oid": "5f47b1c7b1512f3be0dd96b6"
  },
  "classId": {
    "$oid": "5f47b1c7b1512f3be0dd96b7"
  },
  "__v": 0
},{
  "_id": {
    "$oid": "5f47c2ea4a56af3ce41fabad"
  },
  "firstname": "Milan",
  "lastname": "Tomic",
  "email": "dusan.tomic@gmail.com",
  "username": "milan.tomic",
  "password": "Milan123",
  "teacherId": {
    "$oid": "5f160ee5d708bf0b9c1afd76"
  },
  "classId": {
    "$oid": "5f160ee5d708bf0b9c1afd77"
  },
  "__v": 0
},{
  "_id": {
    "$oid": "5f47c56d4a56af3ce41fabb1"
  },
  "firstname": "Ksenija",
  "lastname": "Knezevic",
  "email": "nenad.knezevic@gmail.com",
  "username": "ksenica.knezevic",
  "password": "Ksenija123",
  "teacherId": {
    "$oid": "5f47c50a4a56af3ce41fabae"
  },
  "classId": {
    "$oid": "5f47c50a4a56af3ce41fabaf"
  },
  "__v": 0
},{
  "_id": {
    "$oid": "5f47c5b84a56af3ce41fabb2"
  },
  "firstname": "Ksenija",
  "lastname": "Knezevic",
  "email": "nenad.knezevic@gmail.com",
  "username": "ksenija.knezevic",
  "password": "Ksenija123",
  "teacherId": {
    "$oid": "5f47c50a4a56af3ce41fabae"
  },
  "classId": {
    "$oid": "5f47c50a4a56af3ce41fabaf"
  },
  "__v": 0
}]