{"_id":{"$oid":"5f4a2c663097c31e8c59ff30"},"name":"Die Herren von Winterfell","author":"demo","targetLang":"de","size":1,"creationTime":{"$date":"2020-08-29T10:22:30.233Z"},"unknownWords":0,"yeziqs":0,"__v":0}
{"_id":{"$oid":"5f4a2d0f3097c31e8c59ff33"},"name":"Harry Potter 1","author":"demo","targetLang":"el","size":1,"creationTime":{"$date":"2020-08-29T10:25:19.109Z"},"unknownWords":0,"yeziqs":0,"__v":0}
{"_id":{"$oid":"5f4a2dee3097c31e8c59ff39"},"name":"SoAF 1","author":"demo","targetLang":"ru","size":1,"creationTime":{"$date":"2020-08-29T10:29:02.077Z"},"unknownWords":0,"yeziqs":0,"__v":0}
{"_id":{"$oid":"5f4a2e693097c31e8c59ff3c"},"name":"SoAF 1","author":"demo","targetLang":"es","size":1,"creationTime":{"$date":"2020-08-29T10:31:05.428Z"},"unknownWords":0,"yeziqs":0,"__v":0}
{"_id":{"$oid":"5f4a2ec73097c31e8c59ff3e"},"name":"SoAF 1","author":"demo","targetLang":"fr","size":1,"creationTime":{"$date":"2020-08-29T10:32:39.385Z"},"unknownWords":0,"yeziqs":0,"__v":0}
{"_id":{"$oid":"5f4a2f233097c31e8c59ff41"},"name":"Harry Potter 1","author":"demo","targetLang":"it","size":1,"creationTime":{"$date":"2020-08-29T10:34:11.228Z"},"unknownWords":0,"yeziqs":0,"__v":0}
{"_id":{"$oid":"5f4a2f7e3097c31e8c59ff44"},"name":"Harry Potter 1","author":"demo","targetLang":"pt","size":1,"creationTime":{"$date":"2020-08-29T10:35:42.208Z"},"unknownWords":0,"yeziqs":0,"__v":0}
