[{
  "_id": {
    "$oid": "5f3ae4cbf7a247088ef9ce83"
  },
  "name": "Boris",
  "phone": "12345",
  "__v": 0
},{
  "_id": {
    "$oid": "5f3be4ab15c891095a38ae94"
  },
  "name": "TestCustomer",
  "phone": "0631111111",
  "__v": 0
},{
  "_id": {
    "$oid": "5f3bf05cbb2d6009e8bde9f5"
  },
  "name": "TestCustomer2",
  "phone": "0631111111",
  "__v": 0
},{
  "_id": {
    "$oid": "5f3bf0b5bb2d6009e8bdea0b"
  },
  "name": "TestCustomer1",
  "phone": "0631111111",
  "__v": 0
},{
  "_id": {
    "$oid": "5f3bf113bb2d6009e8bdea21"
  },
  "name": "TestCustomer3",
  "phone": "0631111111",
  "__v": 0
},{
  "_id": {
    "$oid": "5f3bf162bb2d6009e8bdea37"
  },
  "name": "TestCustomer4",
  "phone": "0631111111",
  "__v": 0
},{
  "_id": {
    "$oid": "5f3bf19cbb2d6009e8bdea4d"
  },
  "name": "TestCustomer5",
  "phone": "0631111111",
  "__v": 0
},{
  "_id": {
    "$oid": "5f3bf1e4bb2d6009e8bdea63"
  },
  "name": "TestCustomer6",
  "phone": "0631111111",
  "__v": 0
},{
  "_id": {
    "$oid": "5f3bf6f9bb2d6009e8bdea79"
  },
  "name": "TestCustomer7",
  "phone": "0631111111",
  "__v": 0
},{
  "_id": {
    "$oid": "5f3bf918bb2d6009e8bdea8f"
  },
  "name": "Boris",
  "phone": "testest",
  "__v": 0
},{
  "_id": {
    "$oid": "5f3bf983bb2d6009e8bdeaa5"
  },
  "name": "FinalniTest",
  "phone": "FinalniTest",
  "__v": 0
},{
  "_id": {
    "$oid": "5f3bfb37bb2d6009e8bdeb05"
  },
  "name": "Boris",
  "phone": "FinalniTest",
  "__v": 0
},{
  "_id": {
    "$oid": "5f3bfb5cbb2d6009e8bdeb14"
  },
  "name": "Boris",
  "phone": "FinalniTest",
  "__v": 0
},{
  "_id": {
    "$oid": "5f3bfe23bb2d6009e8bdec50"
  },
  "name": "Boris",
  "phone": "06311111",
  "__v": 0
}]