[{
  "_id": {
    "$oid": "5f36e02ee7255c3f243026b4"
  },
  "eventsAndTickets": [
    {
      "_id": "5f2c8976e810a12a261c1368",
      "numOfTickets": 3
    },
    {
      "_id": "5f2c8976e810a12a261c1369",
      "numOfTickets": 5
    }
  ],
  "username": "Milica98",
  "__v": 0
},{
  "_id": {
    "$oid": "5f36e0a43137e03fa42402af"
  },
  "eventsAndTickets": [
    {
      "_id": "5f2c8976e810a12a261c136a",
      "numOfTickets": 3
    },
    {
      "_id": "5f2c8976e810a12a261c1369",
      "numOfTickets": 5
    }
  ],
  "username": "Nikola",
  "__v": 0
},{
  "_id": {
    "$oid": "5f36e1053137e03fa42402b0"
  },
  "eventsAndTickets": [
    {
      "_id": "5f2c8976e810a12a261c136a",
      "numOfTickets": 10
    },
    {
      "_id": "5f2c8976e810a12a261c1369",
      "numOfTickets": 3
    }
  ],
  "username": "Jovana",
  "__v": 0
},{
  "_id": {
    "$oid": "5f384dd9566eef27201b81fb"
  },
  "eventsAndTickets": [
    {
      "_id": "5f2c8976e810a12a261c136a",
      "numOfTickets": 10
    },
    {
      "_id": "5f2c8976e810a12a261c1369",
      "numOfTickets": 3
    }
  ],
  "username": "Jovana",
  "__v": 0
},{
  "_id": {
    "$oid": "5f384de7566eef27201b81fc"
  },
  "eventsAndTickets": [
    {
      "_id": "5f2c8976e810a12a261c136a",
      "numOfTickets": 10
    },
    {
      "_id": "5f2c8976e810a12a261c1369",
      "numOfTickets": 3
    },
    {
      "_id": "5f2c8976e810a12a261c1369",
      "numOfTickets": 3
    },
    {
      "_id": "5f2c8976e810a12a261c1369",
      "numOfTickets": 3
    }
  ],
  "username": "Jovana",
  "__v": 0
},{
  "_id": {
    "$oid": "5f3c2dbc8f659a2074d967e3"
  },
  "eventsAndTickets": [
    {
      "_id": "5f2c8976e810a12a261c1368",
      "numOfTickets": 4
    }
  ],
  "username": "miki123",
  "__v": 0
},{
  "_id": {
    "$oid": "5f3c2dd38f659a2074d967e4"
  },
  "eventsAndTickets": [
    {
      "_id": "5f2c8976e810a12a261c1368",
      "numOfTickets": 4
    },
    {
      "_id": "5f2c8976e810a12a261c1368",
      "numOfTickets": 4
    },
    {
      "_id": "5f2c8976e810a12a261c1369",
      "numOfTickets": 3
    }
  ],
  "username": "miki123",
  "__v": 0
},{
  "_id": {
    "$oid": "5f3c2e448f659a2074d967e5"
  },
  "eventsAndTickets": [
    {
      "_id": "5f2c8976e810a12a261c1368",
      "numOfTickets": 4
    },
    {
      "_id": "5f2c8976e810a12a261c1368",
      "numOfTickets": 4
    },
    {
      "_id": "5f2c8976e810a12a261c1369",
      "numOfTickets": 3
    },
    {
      "_id": "5f2c8976e810a12a261c1369",
      "numOfTickets": 3
    }
  ],
  "username": "miki123",
  "__v": 0
},{
  "_id": {
    "$oid": "5f3d05838dd68c155699246f"
  },
  "eventsAndTickets": [
    {
      "_id": "5f2c8976e810a12a261c1368",
      "numOfTickets": 3
    },
    {
      "_id": "5f2c8976e810a12a261c1369",
      "numOfTickets": 5
    }
  ],
  "username": "maramara",
  "__v": 0
},{
  "_id": {
    "$oid": "5f3d3bae02e56f343b6f6d18"
  },
  "eventsAndTickets": [
    {
      "_id": "5f2c8976e810a12a261c1368",
      "numOfTickets": 4
    }
  ],
  "username": "maramara",
  "__v": 0
},{
  "_id": {
    "$oid": "5f3d3bf902e56f343b6f6d1a"
  },
  "eventsAndTickets": [
    {
      "_id": "5f3d3be602e56f343b6f6d19",
      "numOfTickets": 3
    }
  ],
  "username": "maramara",
  "__v": 0
}]