[{
	"_id": {
		"$oid": "5f660b957774ae299435e2ee"
	},
	"streetName": "Studentski trg",
	"streetNumber": 16,
	"city": "Beograd",
	"country": "Srbija",
	"zip": 11000,
	"__v": 0
},
{
	"_id": {
		"$oid": "5f660be67774ae299435e2f0"
	},
	"streetName": "Vatroslava Jagica",
	"streetNumber": 5,
	"city": "Beograd",
	"country": "Srbija",
	"zip": 11000,
	"__v": 0
},
{
	"_id": {
		"$oid": "5f660c4b7774ae299435e2f2"
	},
	"streetName": "Svetog Nikole",
	"streetNumber": 39,
	"city": "Beograd",
	"country": "Srbija",
	"zip": 11000,
	"__v": 0
}
]