[{
	"_id": {
		"$oid": "5f660b957774ae299435e2ed"
	},
	"name": "Non stop gym",
	"phone": "+38115632958",
	"startTime": {
		"$date": "2020-07-28T08:00:12.752Z"
	},
	"endTime": {
		"$date": "2020-07-28T08:00:12.752Z"
	},
	"address": {
		"$oid": "5f660b957774ae299435e2ee"
	},
	"__v": 0
},
{
	"_id": {
		"$oid": "5f660be67774ae299435e2ef"
	},
	"name": "Night gym",
	"phone": "+381639854256",
	"startTime": {
		"$date": "2020-08-06T09:00:36.029Z"
	},
	"endTime": {
		"$date": "2020-08-06T09:00:36.029Z"
	},
	"address": {
		"$oid": "5f660be67774ae299435e2f0"
	},
	"__v": 0
},
{
	"_id": {
		"$oid": "5f660c4b7774ae299435e2f1"
	},
	"name": "Fitness studio 1",
	"phone": "+381114528763",
	"startTime": {
		"$date": "2020-08-06T13:00:36.029Z"
	},
	"endTime": {
		"$date": "2020-08-06T13:00:36.029Z"
	},
	"address": {
		"$oid": "5f660c4b7774ae299435e2f2"
	},
	"__v": 0
}
]