[{
    "trainings": [
        {
            "$oid": "5f6231fdfa29eb20f02c2713"
        },
        {
            "$oid": "5f58e9bc91cbd325188d4fcd"
        }
    ],
    "sports": [],
    "ratings": [],
    "credits": 1000,
    "followers": [
        {
            "$oid": "5f5802549e8d3724f818462a"
        },
        {
            "$oid": "5f5801f99e8d3724f8184629"
        },
        {
            "$oid": "5f5800ae9e8d3724f8184628"
        },
        {
            "$oid": "5f57fffb9e8d3724f8184627"
        },
        {
            "$oid": "5f57fd989e8d3724f8184626"
        },
        {
            "$oid": "5f57f60c9e8d3724f818461f"
        },
        {
            "$oid": "5f57f4419e8d3724f818461e"
        }
    ],
    "subscribedTo": [
        {
            "$oid": "5f57f60c9e8d3724f818461f"
        },
        {
            "$oid": "5f5800ae9e8d3724f8184628"
        }
    ],
    "statuses": [
        {
            "$oid": "5f5260dee2f04c1b44e4fc8a"
        }
    ],
    "kind": "Trainer",
    "_id": {
        "$oid": "5f57f8379e8d3724f8184622"
    },
    "username": "marko95",
    "password": "marko95",
    "firstName": "Marko",
    "lastName": "Tesic",
    "email": "marko@tesic.rs",
    "birthday": "2020-09-08T21:30:56.750Z",
    "gender": "male"
},
{
    "trainings": [
        {
            "$oid": "5f58ccc891cbd325188d4fca"
        },
        {
            "$oid": "5f58db7f91cbd325188d4fcb"
        }
    ],
    "sports": [],
    "ratings": [],
    "credits": 1000,
    "followers": [
        {
            "$oid": "5f5802549e8d3724f818462a"
        },
        {
            "$oid": "5f5801f99e8d3724f8184629"
        },
        {
            "$oid": "5f5800ae9e8d3724f8184628"
        },
        {
            "$oid": "5f57fffb9e8d3724f8184627"
        },
        {
            "$oid": "5f57fd989e8d3724f8184626"
        },
        {
            "$oid": "5f57f60c9e8d3724f818461f"
        },
        {
            "$oid": "5f57f4419e8d3724f818461e"
        }
    ],
    "subscribedTo": [
        {
            "$oid": "5f5802549e8d3724f818462a"
        },
        {
            "$oid": "5f5800ae9e8d3724f8184628"
        }
    ],
    "statuses": [
        {
            "$oid": "5f5021dc6a67a20f9c4f2bc2"
        }
    ],
    "kind": "Trainer",
    "_id": {
        "$oid": "5f57f8ec9e8d3724f8184624"
    },
    "username": "niki90",
    "password": "niki90",
    "firstName": "Nikola",
    "lastName": "Ristovic",
    "email": "nikola@ristovic.rs",
    "birthday": "1990-04-12T22:00:00.000Z",
    "gender": "male"
}]