[
    {
        "_id": {
			"$oid": "5f4fd89a64e919257453d478"
		},
        "date": "2020-09-02T17:38:34.885Z",
        "content": "Zdravo svima!"
    },
    {
        "_id": {
			"$oid": "5f4fe59b3c894c0268422fa2"
		},
        "date": "2020-09-02T18:34:03.256Z",
        "content": "Spremamo se za trening!"
    },
    {
        "_id": {
			"$oid": "5f4fecf48af35430bca5035e"
		},
        "date": "2020-09-02T19:05:24.448Z",
        "content": "Spremni za najjaci trening u gradu!"
    },
    {
        "_id": {
			"$oid": "5f4ffea42d63ce193c3b30b3"
		},
        "date": "2020-09-02T20:20:52.411Z",
        "content": "Otvara se nova teretana!"
    },
    {
        "_id": {
			"$oid": "5f501fec5370172f305a4abd"
		},
        "date": "2020-09-02T22:42:52.194Z",
        "content": "Jeste li spremni?"
    },
    {
        "_id": {
            "$oid": "5f5021dc6a67a20f9c4f2bc2"
        },
        "date": "2020-09-02T22:51:08.392Z",
        "content": "Pozdrav za sve!"
    },
    {
        "_id": {
			"$oid": "5f525cfa866acb19d07c8261"
		},
        "date": "2020-09-04T15:27:54.444Z",
        "content": "Novi dan!"
    },
    {
        "_id": {
			"$oid": "5f5260dee2f04c1b44e4fc8a"
		},
        "date": "2020-09-04T15:44:30.473Z",
        "content": "Ovog meseca akcija u teretani!"
    }
]