[
    {
        "index": "200/2019", 
        "name": "Petar", 
        "surname": "Miljkovic"
    }, 
    {
        "index": "20/2019", 
        "name": "Ana", 
        "surname": "Miljkovic"
    }, 
    {
        "index": "11/2018", 
        "name": "Marija", 
        "surname": "Matic"
    }
]