[
  {
    "id": 1594,
    "name": "Uvod u matematicku logiku",
    "espb": 7
  },
  {
    "id": 1595,
    "name": "Programiranje 1",
    "espb": 8
  },
  {
    "id": 2168,
    "name": "Strani jezik",
    "espb": 6
  },
  {
    "id": 1600,
    "name": "Programiranje 2",
    "espb": 8
  },
  {
    "id": 2169,
    "name": "Geometrija 1",
    "espb": 8
  },
  {
    "id": 2009,
    "name": "Geometrija",
    "espb": 8
  },
  {
    "id": 2017,
    "name": "Prevodjenje programskih jezika",
    "espb": 8
  },
  {
    "id": 2332,
    "name": "Racunarske mreze",
    "espb": 8
  },
  {
    "id": 1590,
    "name": "Diskretne strukture 2",
    "espb": 8
  },
  {
    "id": 2024,
    "name": "Programske paradigme",
    "espb": 8
  },
  {
    "id": 2173,
    "name": "Analiza 1",
    "espb": 9
  },
  {
    "id": 1580,
    "name": "Diskretne strukture 1",
    "espb": 8
  },
  {
    "id": 2171,
    "name": "Linearna algebra i analiticka geometrija",
    "espb": 9
  },
  {
    "id": 1578,
    "name": "Programiranje 1",
    "espb": 10
  },
  {
    "id": 2170,
    "name": "Uvod u organizaciju i arhitekturu racunara 1",
    "espb": 8
  },
  {
    "id": 1588,
    "name": "Programiranje 2",
    "espb": 10
  },
  {
    "id": 2179,
    "name": "Osnovi astronomije",
    "espb": 8
  },
  {
    "id": 2172,
    "name": "Uvod u organizaciju i arhitekturu racunara 2",
    "espb": 8
  }
]
