{
    "benefiti": [
        "Parking"
    ],
    "brGodIskustva": {
        "Bash": 4,
        "C": 5,
        "C#": 2,
        "C++": 5,
        "Haskell": 1,
        "Php": 1,
        "Python": 2
    },
    "id": "1703792260",
    "nacinRada": 2,
    "nazivPozicije": "Saradnik u nastavi - predavac C++",
    "plata": 800,
    "strucnaSprema": 0,
    "tehnologije": [
        "Qt",
        "Azure",
        "Git",
        "VmWare",
        "Cypress",
        "Linux"
    ],
    "usernameFirma": "matf",
    "vestine": [
        "Data Analyst"
    ]
}
