{
    "benefiti": [
        "fleksibilno radno vreme",
        "13. plata",
        "Fitpass",
        "parking mesto",
        "placen rucak"
    ],
    "brGodinaIskustva": {
        "C": 4,
        "Clojure": 4,
        "Go": 3,
        "Java": 2,
        "Perl": 4,
        "Php": 4,
        "Ruby": 1
    },
    "brTelefona": "0648742827",
    "ime": "Dimitrije",
    "nacinRada": 0,
    "nivoObrazovanja": 1,
    "opsegPlate": 2830,
    "pol": "m",
    "prezime": "Vranic",
    "sifra": "kraljevo",
    "tehnologije": [
        "Asembler",
        "Oracle",
        "Amazon S3",
        "dot.NET",
        "Angular JS",
        "Apache Solr",
        "Cypress",
        "Git",
        "Jenkins",
        "powerShell"
    ],
    "username": "dico",
    "vestine": [
        "Backend",
        "Data Analyst",
        "Data Engineer",
        "Data Scientist"
    ]
}
