{
    "benefiti": [
        "Plaćen ručak",
        "Fitpass",
        "Fleksibilno radno vreme"
    ],
    "brGodIskustva": {
        "HTML": 5,
        "Java": 5,
        "JavaScript": 5,
        "Python": 4
    },
    "id": "1703792570",
    "nacinRada": 1,
    "nazivPozicije": "Web dizajner",
    "plata": 1200,
    "strucnaSprema": 0,
    "tehnologije": [
        "PowerShell",
        "ASP.net",
        "chatGPT",
        "Git",
        "Cisco"
    ],
    "usernameFirma": "ddorSRB",
    "vestine": [
        "Web3"
    ]
}
