<mxfile host="app.diagrams.net" modified="2023-12-01T16:09:24.198Z" agent="Mozilla/5.0 (Windows NT 10.0; Win64; x64) AppleWebKit/537.36 (KHTML, like Gecko) Chrome/119.0.0.0 Safari/537.36" etag="NcBYoltsV3SC9i6eN-QL" version="22.1.5" type="device">
  <diagram name="Page-1" id="rt3GUFtTc6tjiuicK259">
    <mxGraphModel dx="995" dy="607" grid="1" gridSize="10" guides="1" tooltips="1" connect="1" arrows="1" fold="1" page="1" pageScale="1" pageWidth="850" pageHeight="1100" math="0" shadow="0">
      <root>
        <mxCell id="0" />
        <mxCell id="1" parent="0" />
        <mxCell id="Faax5mD0uhOHAtaDb_Hy-9" style="rounded=0;orthogonalLoop=1;jettySize=auto;html=1;endArrow=block;endFill=1;" parent="1" source="Faax5mD0uhOHAtaDb_Hy-1" edge="1">
          <mxGeometry relative="1" as="geometry">
            <mxPoint x="129.92857142857144" y="430" as="sourcePoint" />
            <mxPoint x="245" y="430" as="targetPoint" />
          </mxGeometry>
        </mxCell>
        <mxCell id="Faax5mD0uhOHAtaDb_Hy-10" value="2: Input name" style="edgeLabel;html=1;align=center;verticalAlign=middle;resizable=0;points=[];" parent="Faax5mD0uhOHAtaDb_Hy-9" vertex="1" connectable="0">
          <mxGeometry x="0.1831" relative="1" as="geometry">
            <mxPoint x="-10" as="offset" />
          </mxGeometry>
        </mxCell>
        <mxCell id="Faax5mD0uhOHAtaDb_Hy-11" style="rounded=0;orthogonalLoop=1;jettySize=auto;html=1;endArrow=block;endFill=1;" parent="1" edge="1">
          <mxGeometry relative="1" as="geometry">
            <mxPoint x="109.92857142857144" y="530" as="sourcePoint" />
            <mxPoint x="245" y="530" as="targetPoint" />
          </mxGeometry>
        </mxCell>
        <mxCell id="Faax5mD0uhOHAtaDb_Hy-12" value="3: Input game ID" style="edgeLabel;html=1;align=center;verticalAlign=middle;resizable=0;points=[];" parent="Faax5mD0uhOHAtaDb_Hy-11" vertex="1" connectable="0">
          <mxGeometry x="0.1732" y="1" relative="1" as="geometry">
            <mxPoint x="-9" y="1" as="offset" />
          </mxGeometry>
        </mxCell>
        <mxCell id="Faax5mD0uhOHAtaDb_Hy-13" style="rounded=0;orthogonalLoop=1;jettySize=auto;html=1;endArrow=block;endFill=1;" parent="1" edge="1">
          <mxGeometry relative="1" as="geometry">
            <mxPoint x="109.92857142857144" y="570" as="sourcePoint" />
            <mxPoint x="245" y="570" as="targetPoint" />
          </mxGeometry>
        </mxCell>
        <mxCell id="Faax5mD0uhOHAtaDb_Hy-14" value="4:&amp;nbsp;Press the&lt;br&gt;&quot;Join game&quot; button" style="edgeLabel;html=1;align=center;verticalAlign=middle;resizable=0;points=[];" parent="Faax5mD0uhOHAtaDb_Hy-13" vertex="1" connectable="0">
          <mxGeometry x="0.1433" relative="1" as="geometry">
            <mxPoint x="-12" as="offset" />
          </mxGeometry>
        </mxCell>
        <mxCell id="Faax5mD0uhOHAtaDb_Hy-1" value="Player" style="shape=umlLifeline;perimeter=lifelinePerimeter;container=1;dropTarget=0;collapsible=0;recursiveResize=0;outlineConnect=0;portConstraint=eastwest;newEdgeStyle={&quot;curved&quot;:0,&quot;rounded&quot;:0};participant=umlActor;verticalAlign=bottom;labelPosition=center;verticalLabelPosition=middle;align=center;labelBorderColor=none;fontColor=default;whiteSpace=wrap;html=1;spacingTop=0;spacingBottom=40;spacing=0;size=40;rounded=0;glass=0;perimeterSpacing=31;strokeWidth=1;fillColor=default;autosize=0;moveCells=0;" parent="1" vertex="1">
          <mxGeometry x="100" y="320" width="20" height="560" as="geometry" />
        </mxCell>
        <mxCell id="Faax5mD0uhOHAtaDb_Hy-15" style="rounded=0;orthogonalLoop=1;jettySize=auto;html=1;dashed=1;endArrow=open;endFill=0;" parent="1" source="Faax5mD0uhOHAtaDb_Hy-8" edge="1">
          <mxGeometry relative="1" as="geometry">
            <mxPoint x="249.92857142857144" y="590" as="sourcePoint" />
            <mxPoint x="385" y="590" as="targetPoint" />
          </mxGeometry>
        </mxCell>
        <mxCell id="Faax5mD0uhOHAtaDb_Hy-16" value="5: Settings" style="edgeLabel;html=1;align=center;verticalAlign=middle;resizable=0;points=[];" parent="Faax5mD0uhOHAtaDb_Hy-15" vertex="1" connectable="0">
          <mxGeometry x="-0.172" y="-1" relative="1" as="geometry">
            <mxPoint x="12" y="-1" as="offset" />
          </mxGeometry>
        </mxCell>
        <mxCell id="Faax5mD0uhOHAtaDb_Hy-2" value=":Game settings&lt;br&gt;window" style="shape=umlLifeline;perimeter=lifelinePerimeter;whiteSpace=wrap;html=1;container=1;dropTarget=0;collapsible=0;recursiveResize=0;outlineConnect=0;portConstraint=eastwest;newEdgeStyle={&quot;curved&quot;:0,&quot;rounded&quot;:0};" parent="1" vertex="1">
          <mxGeometry x="200" y="320" width="100" height="560" as="geometry" />
        </mxCell>
        <mxCell id="Faax5mD0uhOHAtaDb_Hy-8" value="" style="html=1;points=[[0,0,0,0,5],[0,1,0,0,-5],[1,0,0,0,5],[1,1,0,0,-5]];perimeter=orthogonalPerimeter;outlineConnect=0;targetShapes=umlLifeline;portConstraint=eastwest;newEdgeStyle={&quot;curved&quot;:0,&quot;rounded&quot;:0};fillColor=#CDEB8B;" parent="Faax5mD0uhOHAtaDb_Hy-2" vertex="1">
          <mxGeometry x="45" y="100" width="10" height="170" as="geometry" />
        </mxCell>
        <mxCell id="Faax5mD0uhOHAtaDb_Hy-48" value="" style="html=1;points=[[0,0,0,0,5],[0,1,0,0,-5],[1,0,0,0,5],[1,1,0,0,-5]];perimeter=orthogonalPerimeter;outlineConnect=0;targetShapes=umlLifeline;portConstraint=eastwest;newEdgeStyle={&quot;curved&quot;:0,&quot;rounded&quot;:0};fillColor=#CDEB8B;" parent="Faax5mD0uhOHAtaDb_Hy-2" vertex="1">
          <mxGeometry x="45" y="400" width="10" height="50" as="geometry" />
        </mxCell>
        <mxCell id="Faax5mD0uhOHAtaDb_Hy-6" style="rounded=0;orthogonalLoop=1;jettySize=auto;html=1;endArrow=block;endFill=1;" parent="1" source="Faax5mD0uhOHAtaDb_Hy-3" target="Faax5mD0uhOHAtaDb_Hy-8" edge="1">
          <mxGeometry relative="1" as="geometry">
            <mxPoint x="389.5" y="410" as="sourcePoint" />
            <mxPoint x="260" y="420" as="targetPoint" />
            <Array as="points">
              <mxPoint x="310" y="420" />
            </Array>
          </mxGeometry>
        </mxCell>
        <mxCell id="Faax5mD0uhOHAtaDb_Hy-7" value="1: Display the &lt;br&gt;settings window" style="edgeLabel;html=1;align=center;verticalAlign=middle;resizable=0;points=[];" parent="Faax5mD0uhOHAtaDb_Hy-6" vertex="1" connectable="0">
          <mxGeometry x="-0.1146" y="-1" relative="1" as="geometry">
            <mxPoint x="-10" y="1" as="offset" />
          </mxGeometry>
        </mxCell>
        <mxCell id="Faax5mD0uhOHAtaDb_Hy-3" value=":Application" style="shape=umlLifeline;perimeter=lifelinePerimeter;whiteSpace=wrap;html=1;container=1;dropTarget=0;collapsible=0;recursiveResize=0;outlineConnect=0;portConstraint=eastwest;newEdgeStyle={&quot;curved&quot;:0,&quot;rounded&quot;:0};" parent="1" vertex="1">
          <mxGeometry x="340" y="320" width="100" height="560" as="geometry" />
        </mxCell>
        <mxCell id="Faax5mD0uhOHAtaDb_Hy-17" value="" style="html=1;points=[[0,0,0,0,5],[0,1,0,0,-5],[1,0,0,0,5],[1,1,0,0,-5]];perimeter=orthogonalPerimeter;outlineConnect=0;targetShapes=umlLifeline;portConstraint=eastwest;newEdgeStyle={&quot;curved&quot;:0,&quot;rounded&quot;:0};fillColor=#CDEB8B;" parent="Faax5mD0uhOHAtaDb_Hy-3" vertex="1">
          <mxGeometry x="45" y="70" width="10" height="470" as="geometry" />
        </mxCell>
        <mxCell id="Faax5mD0uhOHAtaDb_Hy-32" value="loop" style="shape=umlFrame;whiteSpace=wrap;html=1;pointerEvents=0;" parent="1" vertex="1">
          <mxGeometry x="70" y="450" width="510" height="340" as="geometry" />
        </mxCell>
        <mxCell id="Faax5mD0uhOHAtaDb_Hy-34" value=":Server" style="shape=umlLifeline;perimeter=lifelinePerimeter;whiteSpace=wrap;html=1;container=1;dropTarget=0;collapsible=0;recursiveResize=0;outlineConnect=0;portConstraint=eastwest;newEdgeStyle={&quot;curved&quot;:0,&quot;rounded&quot;:0};" parent="1" vertex="1">
          <mxGeometry x="480" y="320" width="100" height="560" as="geometry" />
        </mxCell>
        <mxCell id="Faax5mD0uhOHAtaDb_Hy-41" value="" style="html=1;points=[[0,0,0,0,5],[0,1,0,0,-5],[1,0,0,0,5],[1,1,0,0,-5]];perimeter=orthogonalPerimeter;outlineConnect=0;targetShapes=umlLifeline;portConstraint=eastwest;newEdgeStyle={&quot;curved&quot;:0,&quot;rounded&quot;:0};fillColor=#CDEB8B;strokeColor=#000000;" parent="Faax5mD0uhOHAtaDb_Hy-34" vertex="1">
          <mxGeometry x="45" y="60" width="10" height="480" as="geometry" />
        </mxCell>
        <mxCell id="Faax5mD0uhOHAtaDb_Hy-38" style="rounded=0;orthogonalLoop=1;jettySize=auto;html=1;endArrow=block;endFill=1;" parent="1" target="Faax5mD0uhOHAtaDb_Hy-41" edge="1">
          <mxGeometry relative="1" as="geometry">
            <mxPoint x="395" y="610" as="sourcePoint" />
            <mxPoint x="530" y="610" as="targetPoint" />
          </mxGeometry>
        </mxCell>
        <mxCell id="Faax5mD0uhOHAtaDb_Hy-39" value="6: Check if game&lt;br&gt;exists" style="edgeLabel;html=1;align=center;verticalAlign=middle;resizable=0;points=[];" parent="Faax5mD0uhOHAtaDb_Hy-38" vertex="1" connectable="0">
          <mxGeometry x="0.1831" relative="1" as="geometry">
            <mxPoint x="-20" as="offset" />
          </mxGeometry>
        </mxCell>
        <mxCell id="Faax5mD0uhOHAtaDb_Hy-44" style="rounded=0;orthogonalLoop=1;jettySize=auto;html=1;endArrow=block;endFill=1;" parent="1" edge="1">
          <mxGeometry relative="1" as="geometry">
            <mxPoint x="385" y="720" as="sourcePoint" />
            <mxPoint x="250" y="720" as="targetPoint" />
            <Array as="points">
              <mxPoint x="305" y="720" />
            </Array>
          </mxGeometry>
        </mxCell>
        <mxCell id="Faax5mD0uhOHAtaDb_Hy-45" value="8: Display the&lt;br style=&quot;border-color: var(--border-color);&quot;&gt;settings window" style="edgeLabel;html=1;align=center;verticalAlign=middle;resizable=0;points=[];" parent="Faax5mD0uhOHAtaDb_Hy-44" vertex="1" connectable="0">
          <mxGeometry x="-0.1146" y="-1" relative="1" as="geometry">
            <mxPoint x="-5" y="1" as="offset" />
          </mxGeometry>
        </mxCell>
        <mxCell id="Faax5mD0uhOHAtaDb_Hy-46" value="alt" style="shape=umlFrame;whiteSpace=wrap;html=1;pointerEvents=0;" parent="1" vertex="1">
          <mxGeometry x="80" y="670" width="490" height="100" as="geometry" />
        </mxCell>
        <mxCell id="Faax5mD0uhOHAtaDb_Hy-49" style="rounded=0;orthogonalLoop=1;jettySize=auto;html=1;endArrow=block;endFill=1;" parent="1" edge="1">
          <mxGeometry relative="1" as="geometry">
            <mxPoint x="395" y="820" as="sourcePoint" />
            <mxPoint x="525" y="820" as="targetPoint" />
          </mxGeometry>
        </mxCell>
        <mxCell id="Faax5mD0uhOHAtaDb_Hy-50" value="9: Join player to &lt;br&gt;the game" style="edgeLabel;html=1;align=center;verticalAlign=middle;resizable=0;points=[];" parent="Faax5mD0uhOHAtaDb_Hy-49" vertex="1" connectable="0">
          <mxGeometry x="0.1831" relative="1" as="geometry">
            <mxPoint x="-12" as="offset" />
          </mxGeometry>
        </mxCell>
        <mxCell id="Faax5mD0uhOHAtaDb_Hy-54" value="" style="swimlane;startSize=0;" parent="1" vertex="1">
          <mxGeometry x="50" y="270" width="550" height="630" as="geometry">
            <mxRectangle x="50" y="270" width="50" height="40" as="alternateBounds" />
          </mxGeometry>
        </mxCell>
        <mxCell id="Faax5mD0uhOHAtaDb_Hy-33" value="&lt;font style=&quot;font-size: 11px;&quot;&gt;[ As long as the entered game ID does not exist ]&lt;/font&gt;" style="text;html=1;strokeColor=none;fillColor=none;align=center;verticalAlign=middle;whiteSpace=wrap;rounded=0;fontSize=13;" parent="Faax5mD0uhOHAtaDb_Hy-54" vertex="1">
          <mxGeometry x="30" y="210" width="240" height="24" as="geometry" />
        </mxCell>
        <mxCell id="Faax5mD0uhOHAtaDb_Hy-47" value="&lt;font style=&quot;font-size: 11px;&quot;&gt;[ Enetered game ID does not exist ]&lt;/font&gt;" style="text;html=1;strokeColor=none;fillColor=none;align=center;verticalAlign=middle;whiteSpace=wrap;rounded=0;fontSize=13;" parent="Faax5mD0uhOHAtaDb_Hy-54" vertex="1">
          <mxGeometry x="-10" y="426" width="270" height="24" as="geometry" />
        </mxCell>
        <mxCell id="Faax5mD0uhOHAtaDb_Hy-43" value="7: Information of &lt;br&gt;games existance" style="html=1;verticalAlign=middle;endArrow=open;dashed=1;endSize=8;curved=0;rounded=0;" parent="Faax5mD0uhOHAtaDb_Hy-54" edge="1">
          <mxGeometry relative="1" as="geometry">
            <mxPoint x="475" y="380" as="sourcePoint" />
            <mxPoint x="345" y="380" as="targetPoint" />
          </mxGeometry>
        </mxCell>
      </root>
    </mxGraphModel>
  </diagram>
</mxfile>
