<mxfile host="app.diagrams.net" modified="2023-12-30T15:10:57.628Z" agent="Mozilla/5.0 (X11; Ubuntu; Linux x86_64; rv:121.0) Gecko/20100101 Firefox/121.0" etag="Z430JNHS3w5lpgivKFhc" version="22.1.15" type="device">
  <diagram name="Page-1" id="qqmAbUr83icRItHG2aQc">
    <mxGraphModel dx="3039" dy="1736" grid="1" gridSize="10" guides="1" tooltips="1" connect="1" arrows="1" fold="1" page="1" pageScale="1" pageWidth="850" pageHeight="1100" math="0" shadow="0">
      <root>
        <mxCell id="0" />
        <mxCell id="1" parent="0" />
        <mxCell id="KOZu9F1s04NRnYqd-34C-6" value="&lt;div&gt;AudioPlayer&lt;/div&gt;&lt;div&gt;&lt;br&gt;&lt;/div&gt;" style="swimlane;fontStyle=1;align=center;verticalAlign=top;childLayout=stackLayout;horizontal=1;startSize=26;horizontalStack=0;resizeParent=1;resizeParentMax=0;resizeLast=0;collapsible=1;marginBottom=0;whiteSpace=wrap;html=1;" parent="1" vertex="1">
          <mxGeometry x="450" y="140" width="300" height="380" as="geometry">
            <mxRectangle x="170" y="160" width="100" height="30" as="alternateBounds" />
          </mxGeometry>
        </mxCell>
        <mxCell id="KOZu9F1s04NRnYqd-34C-7" value="&lt;div&gt;- m_currentSong: Song *&lt;br&gt;&lt;/div&gt;&lt;div&gt;- m_audioOutput: QAudioOutput&lt;/div&gt;&lt;div&gt;- m_player : QMediaPlayer&lt;/div&gt;&lt;div&gt;- m_muted : bool&lt;br&gt;&lt;/div&gt;&lt;div&gt;&lt;br&gt;&lt;/div&gt;" style="text;strokeColor=none;fillColor=none;align=left;verticalAlign=top;spacingLeft=4;spacingRight=4;overflow=hidden;rotatable=0;points=[[0,0.5],[1,0.5]];portConstraint=eastwest;whiteSpace=wrap;html=1;" parent="KOZu9F1s04NRnYqd-34C-6" vertex="1">
          <mxGeometry y="26" width="300" height="64" as="geometry" />
        </mxCell>
        <mxCell id="KOZu9F1s04NRnYqd-34C-8" value="" style="line;strokeWidth=1;fillColor=none;align=left;verticalAlign=middle;spacingTop=-1;spacingLeft=3;spacingRight=3;rotatable=0;labelPosition=right;points=[];portConstraint=eastwest;strokeColor=inherit;" parent="KOZu9F1s04NRnYqd-34C-6" vertex="1">
          <mxGeometry y="90" width="300" height="8" as="geometry" />
        </mxCell>
        <mxCell id="KOZu9F1s04NRnYqd-34C-9" value="&lt;div&gt;&lt;u&gt;+ player () : AudioPlayer&amp;amp;&lt;/u&gt;&lt;/div&gt;&lt;div&gt;+ muted () : bool&lt;/div&gt;&lt;div&gt;+ playing () : bool&lt;/div&gt;&lt;div&gt;+ position () :position&lt;/div&gt;&lt;div&gt;+ loop () : bool&lt;/div&gt;&lt;div&gt;+ volume () : float&lt;/div&gt;&lt;div&gt;+ playSong (Song*) : void&lt;/div&gt;&lt;div&gt;+ currentSong (): Song *&lt;/div&gt;&lt;div&gt;+ setVolume (float): void&lt;/div&gt;&lt;div&gt;+ stopPlaying (): void&lt;/div&gt;&lt;div&gt;+ setVolume (float) : void&lt;/div&gt;&lt;div&gt;+ invertMuted () : void&lt;/div&gt;&lt;div&gt;+ stopPlaying () : void&lt;/div&gt;&lt;div&gt;+ play () : void&lt;/div&gt;&lt;div&gt;+ pause () : void&lt;/div&gt;&lt;div&gt;+ setPosition (int64_t) : void&lt;/div&gt;&lt;div&gt;+ setLoop (bool) : void&lt;/div&gt;&lt;div&gt;- positionChanged(int64_t) : void&lt;/div&gt;&lt;div&gt;- statusChanged (QMediaPlayer::MediaStatus) : void&lt;br&gt;&lt;/div&gt;" style="text;strokeColor=none;fillColor=none;align=left;verticalAlign=top;spacingLeft=4;spacingRight=4;overflow=hidden;rotatable=0;points=[[0,0.5],[1,0.5]];portConstraint=eastwest;whiteSpace=wrap;html=1;" parent="KOZu9F1s04NRnYqd-34C-6" vertex="1">
          <mxGeometry y="98" width="300" height="282" as="geometry" />
        </mxCell>
        <mxCell id="vBtmWbRmqQhfP4ZIpWGv-1" value="&lt;div&gt;Playlist&lt;/div&gt;&lt;div&gt;&lt;br&gt;&lt;/div&gt;" style="swimlane;fontStyle=1;align=center;verticalAlign=top;childLayout=stackLayout;horizontal=1;startSize=26;horizontalStack=0;resizeParent=1;resizeParentMax=0;resizeLast=0;collapsible=1;marginBottom=0;whiteSpace=wrap;html=1;" parent="1" vertex="1">
          <mxGeometry x="170" y="-100" width="200" height="280" as="geometry">
            <mxRectangle x="390" y="-200" width="80" height="40" as="alternateBounds" />
          </mxGeometry>
        </mxCell>
        <mxCell id="vBtmWbRmqQhfP4ZIpWGv-2" value="&lt;div&gt;- m_name : QString&lt;/div&gt;&lt;div&gt;- m_currentIndex : int&lt;br&gt;&lt;/div&gt;&lt;div&gt;- m_songs : QVector&amp;lt;Song*&amp;gt;&lt;br&gt;&lt;/div&gt;&lt;div&gt;- m_cover_path : QString&lt;br&gt;&lt;/div&gt;" style="text;strokeColor=none;fillColor=none;align=left;verticalAlign=top;spacingLeft=4;spacingRight=4;overflow=hidden;rotatable=0;points=[[0,0.5],[1,0.5]];portConstraint=eastwest;whiteSpace=wrap;html=1;" parent="vBtmWbRmqQhfP4ZIpWGv-1" vertex="1">
          <mxGeometry y="26" width="200" height="64" as="geometry" />
        </mxCell>
        <mxCell id="vBtmWbRmqQhfP4ZIpWGv-3" value="" style="line;strokeWidth=1;fillColor=none;align=left;verticalAlign=middle;spacingTop=-1;spacingLeft=3;spacingRight=3;rotatable=0;labelPosition=right;points=[];portConstraint=eastwest;strokeColor=inherit;" parent="vBtmWbRmqQhfP4ZIpWGv-1" vertex="1">
          <mxGeometry y="90" width="200" height="8" as="geometry" />
        </mxCell>
        <mxCell id="vBtmWbRmqQhfP4ZIpWGv-4" value="&lt;div&gt;+ addSong (Song*) :bool&lt;/div&gt;&lt;div&gt;+ removeSong (Song*) : void&lt;/div&gt;&lt;div&gt;+ name() : QString&lt;/div&gt;&lt;div&gt;+ currentSong() : Song*&lt;/div&gt;&lt;div&gt;+ currentIndex() : int&lt;/div&gt;&lt;div&gt;+ numOfSongs() : int&lt;/div&gt;&lt;div&gt;+ songs() : QVector&amp;lt;Song*&amp;gt;&lt;/div&gt;&lt;div&gt;&lt;div&gt;+ changeCover (QString) : void&lt;/div&gt;&lt;div&gt;+ changeName (QString) : void&lt;/div&gt;&lt;div&gt;+ next() : Song*&lt;br&gt;+  previous() : Song*&lt;br&gt;+  shuffle() : Song*&lt;/div&gt;&lt;/div&gt;&lt;div&gt;&lt;br&gt;&lt;/div&gt;" style="text;strokeColor=none;fillColor=none;align=left;verticalAlign=top;spacingLeft=4;spacingRight=4;overflow=hidden;rotatable=0;points=[[0,0.5],[1,0.5]];portConstraint=eastwest;whiteSpace=wrap;html=1;" parent="vBtmWbRmqQhfP4ZIpWGv-1" vertex="1">
          <mxGeometry y="98" width="200" height="182" as="geometry" />
        </mxCell>
        <mxCell id="vBtmWbRmqQhfP4ZIpWGv-5" value="&lt;div&gt;SongLibrary&lt;/div&gt;&lt;div&gt;&lt;br&gt;&lt;/div&gt;" style="swimlane;fontStyle=1;align=center;verticalAlign=top;childLayout=stackLayout;horizontal=1;startSize=26;horizontalStack=0;resizeParent=1;resizeParentMax=0;resizeLast=0;collapsible=1;marginBottom=0;whiteSpace=wrap;html=1;" parent="1" vertex="1">
          <mxGeometry x="-400" y="460" width="240" height="260" as="geometry" />
        </mxCell>
        <mxCell id="vBtmWbRmqQhfP4ZIpWGv-6" value="- m_songs : QVector&amp;lt;Song*&amp;gt;" style="text;strokeColor=none;fillColor=none;align=left;verticalAlign=top;spacingLeft=4;spacingRight=4;overflow=hidden;rotatable=0;points=[[0,0.5],[1,0.5]];portConstraint=eastwest;whiteSpace=wrap;html=1;" parent="vBtmWbRmqQhfP4ZIpWGv-5" vertex="1">
          <mxGeometry y="26" width="240" height="26" as="geometry" />
        </mxCell>
        <mxCell id="vBtmWbRmqQhfP4ZIpWGv-7" value="" style="line;strokeWidth=1;fillColor=none;align=left;verticalAlign=middle;spacingTop=-1;spacingLeft=3;spacingRight=3;rotatable=0;labelPosition=right;points=[];portConstraint=eastwest;strokeColor=inherit;" parent="vBtmWbRmqQhfP4ZIpWGv-5" vertex="1">
          <mxGeometry y="52" width="240" height="8" as="geometry" />
        </mxCell>
        <mxCell id="vBtmWbRmqQhfP4ZIpWGv-8" value="&lt;div&gt;+ &lt;u&gt;songLibrary () : SongLibrary&amp;amp;&lt;/u&gt;&lt;br&gt;&lt;/div&gt;&lt;div&gt;+ songs () : QVector&amp;lt;Song*&amp;gt;&lt;/div&gt;&lt;div&gt;+ songs (QString) : QVector&amp;lt;Song*&amp;gt;&lt;/div&gt;&lt;div&gt;+ song (QString) : Song*&lt;/div&gt;&lt;div&gt;+ topTracks () : QVector&amp;lt;Song*&amp;gt;&lt;/div&gt;&lt;div&gt;+ addSong (Song*) : void&lt;/div&gt;&lt;div&gt;+ addSongViaPath (QString) : void&lt;/div&gt;&lt;div&gt;+ removeSong (Song*) : void&lt;/div&gt;&lt;div&gt;+ removeAllSongs () : void&lt;/div&gt;&lt;div&gt;+ loadSongs () : void&lt;/div&gt;&lt;div&gt;+ saveSongs () : void&lt;br&gt;&lt;/div&gt;&lt;div&gt;+ toVariant () : QVariant&lt;/div&gt;&lt;div&gt;+ fromVariant (QVariant) : void&lt;br&gt;&lt;/div&gt;" style="text;strokeColor=none;fillColor=none;align=left;verticalAlign=top;spacingLeft=4;spacingRight=4;overflow=hidden;rotatable=0;points=[[0,0.5],[1,0.5]];portConstraint=eastwest;whiteSpace=wrap;html=1;" parent="vBtmWbRmqQhfP4ZIpWGv-5" vertex="1">
          <mxGeometry y="60" width="240" height="200" as="geometry" />
        </mxCell>
        <mxCell id="vBtmWbRmqQhfP4ZIpWGv-9" value="Song" style="swimlane;fontStyle=1;align=center;verticalAlign=top;childLayout=stackLayout;horizontal=1;startSize=26;horizontalStack=0;resizeParent=1;resizeParentMax=0;resizeLast=0;collapsible=1;marginBottom=0;whiteSpace=wrap;html=1;" parent="1" vertex="1">
          <mxGeometry x="-105" y="365" width="240" height="388" as="geometry" />
        </mxCell>
        <mxCell id="vBtmWbRmqQhfP4ZIpWGv-10" value="&lt;div&gt;- m_path : QString&lt;/div&gt;&lt;div&gt;- m_name : QString&lt;/div&gt;&lt;div&gt;- m_artist : QString&lt;/div&gt;&lt;div&gt;- m_duration : unsigned&lt;br&gt;&lt;/div&gt;&lt;div&gt;- m_timesPlayed : unsigned&lt;br&gt;&lt;/div&gt;&lt;div&gt;- m_liked : bool&lt;/div&gt;&lt;div&gt;- m_path_to_img : QString&lt;/div&gt;&lt;div&gt;- m_lyrics : QString&lt;br&gt;&lt;/div&gt;" style="text;strokeColor=none;fillColor=none;align=left;verticalAlign=top;spacingLeft=4;spacingRight=4;overflow=hidden;rotatable=0;points=[[0,0.5],[1,0.5]];portConstraint=eastwest;whiteSpace=wrap;html=1;" parent="vBtmWbRmqQhfP4ZIpWGv-9" vertex="1">
          <mxGeometry y="26" width="240" height="124" as="geometry" />
        </mxCell>
        <mxCell id="vBtmWbRmqQhfP4ZIpWGv-11" value="" style="line;strokeWidth=1;fillColor=none;align=left;verticalAlign=middle;spacingTop=-1;spacingLeft=3;spacingRight=3;rotatable=0;labelPosition=right;points=[];portConstraint=eastwest;strokeColor=inherit;" parent="vBtmWbRmqQhfP4ZIpWGv-9" vertex="1">
          <mxGeometry y="150" width="240" height="8" as="geometry" />
        </mxCell>
        <mxCell id="vBtmWbRmqQhfP4ZIpWGv-12" value="&lt;div&gt;+ path () : QString&lt;/div&gt;&lt;div&gt;+ name () : Qstring&lt;/div&gt;&lt;div&gt;+ artist () :QString&lt;/div&gt;&lt;div&gt;+ duration () : int&lt;/div&gt;&lt;div&gt;+ timesPlayed () : int&lt;br&gt;&lt;/div&gt;&lt;div&gt;+ liked () : bool&lt;/div&gt;&lt;div&gt;+ lyrics () : QString&lt;br&gt;&lt;/div&gt;&lt;div&gt;+ pathToImg () : QString&lt;br&gt;&lt;/div&gt;&lt;div&gt;+ like () : void&lt;/div&gt;&lt;div&gt;+ setName (QString) : void&lt;/div&gt;&lt;div&gt;+ setArtist (QString) : void&lt;/div&gt;&lt;div&gt;+ setPathToImg (QString) : void&lt;br&gt;&lt;/div&gt;&lt;div&gt;+ incrementTimesPlayed () : void&lt;br&gt;&lt;/div&gt;&lt;div&gt;&lt;div&gt;+ toVariant () : QVariant&lt;/div&gt;+ fromVariant (QVariant) : void&lt;/div&gt;" style="text;strokeColor=none;fillColor=none;align=left;verticalAlign=top;spacingLeft=4;spacingRight=4;overflow=hidden;rotatable=0;points=[[0,0.5],[1,0.5]];portConstraint=eastwest;whiteSpace=wrap;html=1;" parent="vBtmWbRmqQhfP4ZIpWGv-9" vertex="1">
          <mxGeometry y="158" width="240" height="230" as="geometry" />
        </mxCell>
        <mxCell id="vBtmWbRmqQhfP4ZIpWGv-19" value="&lt;div&gt;PlaylistLibrary&lt;/div&gt;&lt;div&gt;&lt;br&gt;&lt;/div&gt;" style="swimlane;fontStyle=1;align=center;verticalAlign=top;childLayout=stackLayout;horizontal=1;startSize=26;horizontalStack=0;resizeParent=1;resizeParentMax=0;resizeLast=0;collapsible=1;marginBottom=0;whiteSpace=wrap;html=1;" parent="1" vertex="1">
          <mxGeometry x="-272" y="-430" width="210" height="210" as="geometry">
            <mxRectangle x="50" y="-200" width="120" height="40" as="alternateBounds" />
          </mxGeometry>
        </mxCell>
        <mxCell id="vBtmWbRmqQhfP4ZIpWGv-20" value="&lt;div&gt;- m_playlists : QVector&amp;lt;Playlist*&amp;gt;&lt;/div&gt;" style="text;strokeColor=none;fillColor=none;align=left;verticalAlign=top;spacingLeft=4;spacingRight=4;overflow=hidden;rotatable=0;points=[[0,0.5],[1,0.5]];portConstraint=eastwest;whiteSpace=wrap;html=1;" parent="vBtmWbRmqQhfP4ZIpWGv-19" vertex="1">
          <mxGeometry y="26" width="210" height="26" as="geometry" />
        </mxCell>
        <mxCell id="vBtmWbRmqQhfP4ZIpWGv-21" value="" style="line;strokeWidth=1;fillColor=none;align=left;verticalAlign=middle;spacingTop=-1;spacingLeft=3;spacingRight=3;rotatable=0;labelPosition=right;points=[];portConstraint=eastwest;strokeColor=inherit;" parent="vBtmWbRmqQhfP4ZIpWGv-19" vertex="1">
          <mxGeometry y="52" width="210" height="8" as="geometry" />
        </mxCell>
        <mxCell id="vBtmWbRmqQhfP4ZIpWGv-22" value="&lt;div&gt;+ &lt;u&gt;playlistLibrary () : PlaylistLibrary&amp;amp;&lt;/u&gt;&lt;br&gt;&lt;/div&gt;&lt;div&gt;+ addPlaylist (Playlist*) : void&lt;/div&gt;&lt;div&gt;+ addPlaylist (QString) :Playlist*&lt;/div&gt;&lt;div&gt;+ removePlaylist (Playlist*) : void&lt;/div&gt;&lt;div&gt;+ numberOfPlaylists () : int&lt;/div&gt;&lt;div&gt;+ playlists () :QVector&amp;lt;Playlist*&amp;gt;&lt;/div&gt;&lt;div&gt;+ allSongs () : ImplicitPlaylist*&lt;/div&gt;&lt;div&gt;+ likedSongs () : ImplicitPlaylist*&lt;/div&gt;&lt;div&gt;+ savePlaylists() : void&lt;/div&gt;&lt;div&gt;+ loadPlaylists() : void&lt;/div&gt;" style="text;strokeColor=none;fillColor=none;align=left;verticalAlign=top;spacingLeft=4;spacingRight=4;overflow=hidden;rotatable=0;points=[[0,0.5],[1,0.5]];portConstraint=eastwest;whiteSpace=wrap;html=1;" parent="vBtmWbRmqQhfP4ZIpWGv-19" vertex="1">
          <mxGeometry y="60" width="210" height="150" as="geometry" />
        </mxCell>
        <mxCell id="vBtmWbRmqQhfP4ZIpWGv-37" value="MainWindow" style="swimlane;fontStyle=1;align=center;verticalAlign=top;childLayout=stackLayout;horizontal=1;startSize=26;horizontalStack=0;resizeParent=1;resizeParentMax=0;resizeLast=0;collapsible=1;marginBottom=0;whiteSpace=wrap;html=1;" parent="1" vertex="1">
          <mxGeometry x="-1350" y="-310" width="410" height="830" as="geometry" />
        </mxCell>
        <mxCell id="vBtmWbRmqQhfP4ZIpWGv-38" value="&lt;div&gt;- ui - Ui::MainWindow*&lt;/div&gt;&lt;div&gt;- m_playeritem : PlayerItemUI*&lt;/div&gt;&lt;div&gt;- m_lastVisitedPage : int&lt;br&gt;&lt;/div&gt;&lt;div&gt;- m_thread_handler : ThreadHandler*&lt;br&gt;&lt;/div&gt;" style="text;strokeColor=none;fillColor=none;align=left;verticalAlign=top;spacingLeft=4;spacingRight=4;overflow=hidden;rotatable=0;points=[[0,0.5],[1,0.5]];portConstraint=eastwest;whiteSpace=wrap;html=1;" parent="vBtmWbRmqQhfP4ZIpWGv-37" vertex="1">
          <mxGeometry y="26" width="410" height="64" as="geometry" />
        </mxCell>
        <mxCell id="vBtmWbRmqQhfP4ZIpWGv-39" value="" style="line;strokeWidth=1;fillColor=none;align=left;verticalAlign=middle;spacingTop=-1;spacingLeft=3;spacingRight=3;rotatable=0;labelPosition=right;points=[];portConstraint=eastwest;strokeColor=inherit;" parent="vBtmWbRmqQhfP4ZIpWGv-37" vertex="1">
          <mxGeometry y="90" width="410" height="8" as="geometry" />
        </mxCell>
        <mxCell id="vBtmWbRmqQhfP4ZIpWGv-40" value="- backButton () : void&lt;br&gt;- settingsButton () : void&lt;br&gt;- songsMainPageButton () : void&lt;br&gt;- playlistsMainPageButton () : void&lt;br&gt;- addSongButton () : void&lt;br&gt;- addPlaylistButton () : void&lt;br&gt;- showCreateNewPlaylist () : void&lt;br&gt;- hideCreateNewPlaylist () : void&lt;br&gt;- saveNewPlaylist () : void&lt;br&gt;- removeSongFromPlaylist (Song*) : void&lt;br&gt;- refreshLikedShow () : void&lt;br&gt;- removePlaylist (PlaylistItemUI*) : void&lt;br&gt;- showPlaylistSongs (PlaylistItemUI*) : void&lt;br&gt;- openLibrary () : void&lt;br&gt;- playPlaylist () : void&lt;br&gt;- editPlaylist (PlaylistItemUI*) : void&lt;br&gt;- updatePlaylistDetails (PlaylistItemUI*) : void&lt;br&gt;- receiveLike (Song*) : void&lt;br&gt;- receiveSong (Song*, Playlist*) : void&lt;br&gt;- receiveSongs (QVector&amp;lt;Song *&amp;gt;, Playlist*) : void&lt;br&gt;- removeSong (SongItemUI*, QListWidget*) : void&lt;br&gt;- editSong (SongItemUI*) : void&lt;br&gt;- displaySong (Song*, QListWidget*, Playlist* p = nullptr) : void&lt;br&gt;- displayPlaylist (Playlist*) : void&lt;br&gt;- filterSongItemUI (QString) : void&lt;br&gt;- filterPlaylistItemUI (QString) : void&lt;br&gt;- searchSongsChangeUI () : void&lt;br&gt;- searchPlaylistsChangeUI () : void&lt;br&gt;- onThreadFinish (Song *) : void&lt;br&gt;- searchLyrics () : void&lt;br&gt;- closePlayer () : void&lt;br&gt;- fullScreenPlayer (bool) : void&lt;br&gt;- changePlayerVisible (bool) : void&lt;br&gt;- updatePlayerSongInfo (Song *) : void&lt;br&gt;- showSongLyrics () : void&lt;br&gt;- setupIcons () : void&lt;br&gt;- setupPlayer () : void&lt;br&gt;- setupMainPage () : void&lt;br&gt;- setupSongLibPage () : void&lt;br&gt;- setupPlaylistPage () : void&lt;br&gt;- clearListWidget (QListWidget *listWidget) : void&lt;br&gt;- setupTopTracks () : void&lt;br&gt;- reloadSongLibrary () : void&lt;br&gt;- reloadPlaylists () : void&lt;br&gt;- saveCurrPageAndSetNext (Pages page) : void&lt;br&gt;- showPlaylistCover (const QString path) : void&lt;br&gt;- addRemoveLiked (Song*) : void&lt;br&gt;- Playlist* getCurrentPlaylist () const&lt;br&gt;- reloadCurrentPlaylist () : void&lt;br&gt;- updateAllSongsPlaylist (Song*, bool) : void&lt;br&gt;&lt;br&gt;- setCurrentPlaylist (QString name) : void&lt;br&gt;" style="text;strokeColor=none;fillColor=none;align=left;verticalAlign=top;spacingLeft=4;spacingRight=4;overflow=hidden;rotatable=0;points=[[0,0.5],[1,0.5]];portConstraint=eastwest;whiteSpace=wrap;html=1;" parent="vBtmWbRmqQhfP4ZIpWGv-37" vertex="1">
          <mxGeometry y="98" width="410" height="732" as="geometry" />
        </mxCell>
        <mxCell id="vBtmWbRmqQhfP4ZIpWGv-46" value="&lt;div&gt;ImplicitPlaylist&lt;/div&gt;" style="swimlane;fontStyle=1;align=center;verticalAlign=top;childLayout=stackLayout;horizontal=1;startSize=26;horizontalStack=0;resizeParent=1;resizeParentMax=0;resizeLast=0;collapsible=1;marginBottom=0;whiteSpace=wrap;html=1;" parent="1" vertex="1">
          <mxGeometry x="170" y="-230" width="200" height="80" as="geometry" />
        </mxCell>
        <mxCell id="vBtmWbRmqQhfP4ZIpWGv-48" value="" style="line;strokeWidth=1;fillColor=none;align=left;verticalAlign=middle;spacingTop=-1;spacingLeft=3;spacingRight=3;rotatable=0;labelPosition=right;points=[];portConstraint=eastwest;strokeColor=inherit;" parent="vBtmWbRmqQhfP4ZIpWGv-46" vertex="1">
          <mxGeometry y="26" width="200" height="8" as="geometry" />
        </mxCell>
        <mxCell id="vBtmWbRmqQhfP4ZIpWGv-49" value="&lt;div&gt;+ changeCover (QString) : void&lt;/div&gt;&lt;div&gt;+ changeName (QString) : void&lt;br&gt;&lt;/div&gt;" style="text;strokeColor=none;fillColor=none;align=left;verticalAlign=top;spacingLeft=4;spacingRight=4;overflow=hidden;rotatable=0;points=[[0,0.5],[1,0.5]];portConstraint=eastwest;whiteSpace=wrap;html=1;" parent="vBtmWbRmqQhfP4ZIpWGv-46" vertex="1">
          <mxGeometry y="34" width="200" height="46" as="geometry" />
        </mxCell>
        <mxCell id="jXoESz9dr0sw3v8Q8oxm-5" value="LogSlider" style="swimlane;fontStyle=1;align=center;verticalAlign=top;childLayout=stackLayout;horizontal=1;startSize=26;horizontalStack=0;resizeParent=1;resizeParentMax=0;resizeLast=0;collapsible=1;marginBottom=0;whiteSpace=wrap;html=1;" parent="1" vertex="1">
          <mxGeometry x="-1000" y="560" width="200" height="140" as="geometry" />
        </mxCell>
        <mxCell id="jXoESz9dr0sw3v8Q8oxm-6" value="&lt;div&gt;- m_scale : double&lt;/div&gt;" style="text;strokeColor=none;fillColor=none;align=left;verticalAlign=top;spacingLeft=4;spacingRight=4;overflow=hidden;rotatable=0;points=[[0,0.5],[1,0.5]];portConstraint=eastwest;whiteSpace=wrap;html=1;" parent="jXoESz9dr0sw3v8Q8oxm-5" vertex="1">
          <mxGeometry y="26" width="200" height="24" as="geometry" />
        </mxCell>
        <mxCell id="jXoESz9dr0sw3v8Q8oxm-7" value="" style="line;strokeWidth=1;fillColor=none;align=left;verticalAlign=middle;spacingTop=-1;spacingLeft=3;spacingRight=3;rotatable=0;labelPosition=right;points=[];portConstraint=eastwest;strokeColor=inherit;" parent="jXoESz9dr0sw3v8Q8oxm-5" vertex="1">
          <mxGeometry y="50" width="200" height="8" as="geometry" />
        </mxCell>
        <mxCell id="jXoESz9dr0sw3v8Q8oxm-8" value="&lt;div&gt;+ setNaturalMin (double) : void&lt;/div&gt;&lt;div&gt;+ setNaturalMax (double) : void&lt;/div&gt;&lt;div&gt;+ setNaturalValue (double) : void&lt;/div&gt;&lt;div&gt;+ scale () : double&lt;/div&gt;&lt;div&gt;- onValueChanged (double) : void&lt;br&gt;&lt;/div&gt;" style="text;strokeColor=none;fillColor=none;align=left;verticalAlign=top;spacingLeft=4;spacingRight=4;overflow=hidden;rotatable=0;points=[[0,0.5],[1,0.5]];portConstraint=eastwest;whiteSpace=wrap;html=1;" parent="jXoESz9dr0sw3v8Q8oxm-5" vertex="1">
          <mxGeometry y="58" width="200" height="82" as="geometry" />
        </mxCell>
        <mxCell id="jXoESz9dr0sw3v8Q8oxm-14" value="&lt;div&gt;PlaylistController&lt;/div&gt;&lt;div&gt;&lt;br&gt;&lt;/div&gt;" style="swimlane;fontStyle=1;align=center;verticalAlign=top;childLayout=stackLayout;horizontal=1;startSize=26;horizontalStack=0;resizeParent=1;resizeParentMax=0;resizeLast=0;collapsible=1;marginBottom=0;whiteSpace=wrap;html=1;" parent="1" vertex="1">
          <mxGeometry x="570" y="-220" width="200" height="260" as="geometry" />
        </mxCell>
        <mxCell id="jXoESz9dr0sw3v8Q8oxm-15" value="&lt;div&gt;- m_currentPlaylist : Playlist*&lt;/div&gt;&lt;div&gt;- m_shuffle : bool&lt;br&gt;&lt;/div&gt;" style="text;strokeColor=none;fillColor=none;align=left;verticalAlign=top;spacingLeft=4;spacingRight=4;overflow=hidden;rotatable=0;points=[[0,0.5],[1,0.5]];portConstraint=eastwest;whiteSpace=wrap;html=1;" parent="jXoESz9dr0sw3v8Q8oxm-14" vertex="1">
          <mxGeometry y="26" width="200" height="44" as="geometry" />
        </mxCell>
        <mxCell id="jXoESz9dr0sw3v8Q8oxm-16" value="" style="line;strokeWidth=1;fillColor=none;align=left;verticalAlign=middle;spacingTop=-1;spacingLeft=3;spacingRight=3;rotatable=0;labelPosition=right;points=[];portConstraint=eastwest;strokeColor=inherit;" parent="jXoESz9dr0sw3v8Q8oxm-14" vertex="1">
          <mxGeometry y="70" width="200" height="8" as="geometry" />
        </mxCell>
        <mxCell id="jXoESz9dr0sw3v8Q8oxm-17" value="&lt;div&gt;+ &lt;u&gt;controller () : PlaylistController&amp;amp;&lt;/u&gt;&lt;/div&gt;&lt;div&gt;+ setPlaylist (Playlist*) : void&lt;/div&gt;&lt;div&gt;+ playlist () : Playlist*&lt;/div&gt;&lt;div&gt;+ playPlaylist () : void&lt;/div&gt;&lt;div&gt;+ playAtIndex (int) : void&lt;/div&gt;&lt;div&gt;+ shuffle () : bool&lt;/div&gt;&lt;div&gt;+ nextSong() : void&lt;br&gt;+ previousSong() : void&lt;br&gt;+ toggleShuffle() : void&lt;br&gt;+ songFinished() : void&lt;br&gt;+ unsetPlaylist() : void&lt;/div&gt;" style="text;strokeColor=none;fillColor=none;align=left;verticalAlign=top;spacingLeft=4;spacingRight=4;overflow=hidden;rotatable=0;points=[[0,0.5],[1,0.5]];portConstraint=eastwest;whiteSpace=wrap;html=1;" parent="jXoESz9dr0sw3v8Q8oxm-14" vertex="1">
          <mxGeometry y="78" width="200" height="182" as="geometry" />
        </mxCell>
        <mxCell id="jXoESz9dr0sw3v8Q8oxm-19" value="&lt;div&gt;Settings&lt;/div&gt;" style="swimlane;fontStyle=1;align=center;verticalAlign=top;childLayout=stackLayout;horizontal=1;startSize=26;horizontalStack=0;resizeParent=1;resizeParentMax=0;resizeLast=0;collapsible=1;marginBottom=0;whiteSpace=wrap;html=1;" parent="1" vertex="1">
          <mxGeometry x="-262" y="-690" width="200" height="198" as="geometry" />
        </mxCell>
        <mxCell id="jXoESz9dr0sw3v8Q8oxm-20" value="&lt;div&gt;- defaultDir : QString&lt;/div&gt;&lt;div&gt;- width : int&lt;/div&gt;&lt;div&gt;- height : int&lt;/div&gt;" style="text;strokeColor=none;fillColor=none;align=left;verticalAlign=top;spacingLeft=4;spacingRight=4;overflow=hidden;rotatable=0;points=[[0,0.5],[1,0.5]];portConstraint=eastwest;whiteSpace=wrap;html=1;" parent="jXoESz9dr0sw3v8Q8oxm-19" vertex="1">
          <mxGeometry y="26" width="200" height="54" as="geometry" />
        </mxCell>
        <mxCell id="jXoESz9dr0sw3v8Q8oxm-21" value="" style="line;strokeWidth=1;fillColor=none;align=left;verticalAlign=middle;spacingTop=-1;spacingLeft=3;spacingRight=3;rotatable=0;labelPosition=right;points=[];portConstraint=eastwest;strokeColor=inherit;" parent="jXoESz9dr0sw3v8Q8oxm-19" vertex="1">
          <mxGeometry y="80" width="200" height="8" as="geometry" />
        </mxCell>
        <mxCell id="jXoESz9dr0sw3v8Q8oxm-22" value="&lt;div&gt;+ &lt;u&gt;setttings () : Settings&amp;amp;&lt;/u&gt;&lt;/div&gt;&lt;div&gt;+ setDefaultDir (QString&amp;amp;) : void&lt;/div&gt;&lt;div&gt;+ setHeight (int) : void&lt;/div&gt;&lt;div&gt;+ setWidth (int) : void&lt;/div&gt;&lt;div&gt;+ defaultDir () : QString&lt;/div&gt;&lt;div&gt;+ height () : int&lt;/div&gt;&lt;div&gt;+ width () : int&lt;/div&gt;&lt;div&gt;&lt;br&gt;&lt;/div&gt;&lt;div&gt;&lt;br&gt;&lt;/div&gt;" style="text;strokeColor=none;fillColor=none;align=left;verticalAlign=top;spacingLeft=4;spacingRight=4;overflow=hidden;rotatable=0;points=[[0,0.5],[1,0.5]];portConstraint=eastwest;whiteSpace=wrap;html=1;" parent="jXoESz9dr0sw3v8Q8oxm-19" vertex="1">
          <mxGeometry y="88" width="200" height="110" as="geometry" />
        </mxCell>
        <mxCell id="jXoESz9dr0sw3v8Q8oxm-24" value="PlayerItemUI" style="swimlane;fontStyle=1;align=center;verticalAlign=top;childLayout=stackLayout;horizontal=1;startSize=26;horizontalStack=0;resizeParent=1;resizeParentMax=0;resizeLast=0;collapsible=1;marginBottom=0;whiteSpace=wrap;html=1;" parent="1" vertex="1">
          <mxGeometry x="-1350" y="560" width="240" height="360" as="geometry" />
        </mxCell>
        <mxCell id="jXoESz9dr0sw3v8Q8oxm-25" value="- ui : Ui::PlayerItemUI*&lt;br&gt;- m_current_song : Song*&lt;br&gt;- m_playing : bool&lt;br&gt;- m_full_screen : bool&lt;br&gt;- m_loop : bool&lt;br&gt;- m_shuffle : bool&lt;br&gt;" style="text;strokeColor=none;fillColor=none;align=left;verticalAlign=top;spacingLeft=4;spacingRight=4;overflow=hidden;rotatable=0;points=[[0,0.5],[1,0.5]];portConstraint=eastwest;whiteSpace=wrap;html=1;" parent="jXoESz9dr0sw3v8Q8oxm-24" vertex="1">
          <mxGeometry y="26" width="240" height="94" as="geometry" />
        </mxCell>
        <mxCell id="jXoESz9dr0sw3v8Q8oxm-26" value="" style="line;strokeWidth=1;fillColor=none;align=left;verticalAlign=middle;spacingTop=-1;spacingLeft=3;spacingRight=3;rotatable=0;labelPosition=right;points=[];portConstraint=eastwest;strokeColor=inherit;" parent="jXoESz9dr0sw3v8Q8oxm-24" vertex="1">
          <mxGeometry y="120" width="240" height="8" as="geometry" />
        </mxCell>
        <mxCell id="jXoESz9dr0sw3v8Q8oxm-27" value="+ closePlayer () : void&lt;br&gt;+ full_screen_player () : void&lt;br&gt;+ like_song () : void&lt;br&gt;+ play_pause () : void&lt;br&gt;+ shuffle () : void&lt;br&gt;+ next () : void&lt;br&gt;+ previous () : void&lt;br&gt;+ loops () : void&lt;br&gt;+ changeAudioIcon (bool) : void&lt;br&gt;+ songDeleted (Song*) : void&lt;br&gt;+ updateSongDetails (Song*) : void&lt;br&gt;- updatePosition(int) : void&lt;br&gt;- muteClicked() : void&lt;br&gt;- updateMovedPosition(int) : void&lt;br&gt;- updateData(Song* s) : void&lt;br&gt;" style="text;strokeColor=none;fillColor=none;align=left;verticalAlign=top;spacingLeft=4;spacingRight=4;overflow=hidden;rotatable=0;points=[[0,0.5],[1,0.5]];portConstraint=eastwest;whiteSpace=wrap;html=1;" parent="jXoESz9dr0sw3v8Q8oxm-24" vertex="1">
          <mxGeometry y="128" width="240" height="232" as="geometry" />
        </mxCell>
        <mxCell id="jXoESz9dr0sw3v8Q8oxm-29" value="SongItemUI" style="swimlane;fontStyle=1;align=center;verticalAlign=top;childLayout=stackLayout;horizontal=1;startSize=26;horizontalStack=0;resizeParent=1;resizeParentMax=0;resizeLast=0;collapsible=1;marginBottom=0;whiteSpace=wrap;html=1;" parent="1" vertex="1">
          <mxGeometry x="-180" y="40" width="240" height="236" as="geometry" />
        </mxCell>
        <mxCell id="jXoESz9dr0sw3v8Q8oxm-30" value="- ui : Ui::SongItemUI*&lt;br&gt;- m_song : Song*&lt;br&gt;- m_list_item : QListWidgetItem*&lt;br&gt;- m_list : QListWidget*&lt;br&gt;- m_playlist : Playlist*" style="text;strokeColor=none;fillColor=none;align=left;verticalAlign=top;spacingLeft=4;spacingRight=4;overflow=hidden;rotatable=0;points=[[0,0.5],[1,0.5]];portConstraint=eastwest;whiteSpace=wrap;html=1;" parent="jXoESz9dr0sw3v8Q8oxm-29" vertex="1">
          <mxGeometry y="26" width="240" height="84" as="geometry" />
        </mxCell>
        <mxCell id="jXoESz9dr0sw3v8Q8oxm-31" value="" style="line;strokeWidth=1;fillColor=none;align=left;verticalAlign=middle;spacingTop=-1;spacingLeft=3;spacingRight=3;rotatable=0;labelPosition=right;points=[];portConstraint=eastwest;strokeColor=inherit;" parent="jXoESz9dr0sw3v8Q8oxm-29" vertex="1">
          <mxGeometry y="110" width="240" height="8" as="geometry" />
        </mxCell>
        <mxCell id="jXoESz9dr0sw3v8Q8oxm-32" value="+ listItem () const : QListWidgetItem*&lt;br&gt;+ song () const : Song*&lt;br&gt;+ updateName () : void&lt;br&gt;+ hideForImplicit () : void&lt;br&gt;+ play_song () : void&lt;br&gt;+ remove_song () : void&lt;br&gt;+ edit_song () : void&lt;br&gt;" style="text;strokeColor=none;fillColor=none;align=left;verticalAlign=top;spacingLeft=4;spacingRight=4;overflow=hidden;rotatable=0;points=[[0,0.5],[1,0.5]];portConstraint=eastwest;whiteSpace=wrap;html=1;" parent="jXoESz9dr0sw3v8Q8oxm-29" vertex="1">
          <mxGeometry y="118" width="240" height="118" as="geometry" />
        </mxCell>
        <mxCell id="zP8Z1faxtnohD27JhnkV-1" value="JsonSerializer" style="swimlane;fontStyle=1;align=center;verticalAlign=top;childLayout=stackLayout;horizontal=1;startSize=26;horizontalStack=0;resizeParent=1;resizeParentMax=0;resizeLast=0;collapsible=1;marginBottom=0;whiteSpace=wrap;html=1;" parent="1" vertex="1">
          <mxGeometry x="-640" y="-680" width="230" height="100" as="geometry" />
        </mxCell>
        <mxCell id="zP8Z1faxtnohD27JhnkV-2" value="&amp;nbsp;- m_dir : QString" style="text;strokeColor=none;fillColor=none;align=left;verticalAlign=top;spacingLeft=4;spacingRight=4;overflow=hidden;rotatable=0;points=[[0,0.5],[1,0.5]];portConstraint=eastwest;whiteSpace=wrap;html=1;" parent="zP8Z1faxtnohD27JhnkV-1" vertex="1">
          <mxGeometry y="26" width="230" height="24" as="geometry" />
        </mxCell>
        <mxCell id="zP8Z1faxtnohD27JhnkV-3" value="" style="line;strokeWidth=1;fillColor=none;align=left;verticalAlign=middle;spacingTop=-1;spacingLeft=3;spacingRight=3;rotatable=0;labelPosition=right;points=[];portConstraint=eastwest;strokeColor=inherit;" parent="zP8Z1faxtnohD27JhnkV-1" vertex="1">
          <mxGeometry y="50" width="230" height="8" as="geometry" />
        </mxCell>
        <mxCell id="zP8Z1faxtnohD27JhnkV-4" value="&lt;div&gt;+ save (Serializable&amp;amp;, QString&amp;amp;) : void&lt;/div&gt;&lt;div&gt;+ load&amp;nbsp; (Serializable&amp;amp;, QString&amp;amp;) : void&lt;/div&gt;" style="text;strokeColor=none;fillColor=none;align=left;verticalAlign=top;spacingLeft=4;spacingRight=4;overflow=hidden;rotatable=0;points=[[0,0.5],[1,0.5]];portConstraint=eastwest;whiteSpace=wrap;html=1;" parent="zP8Z1faxtnohD27JhnkV-1" vertex="1">
          <mxGeometry y="58" width="230" height="42" as="geometry" />
        </mxCell>
        <mxCell id="zP8Z1faxtnohD27JhnkV-5" value="Use" style="endArrow=open;endSize=12;dashed=1;html=1;rounded=0;entryX=0.957;entryY=1.063;entryDx=0;entryDy=0;entryPerimeter=0;exitX=0.07;exitY=-0.022;exitDx=0;exitDy=0;exitPerimeter=0;" parent="1" source="vBtmWbRmqQhfP4ZIpWGv-19" target="zP8Z1faxtnohD27JhnkV-4" edge="1">
          <mxGeometry width="160" relative="1" as="geometry">
            <mxPoint x="-270" y="-450" as="sourcePoint" />
            <mxPoint x="230" y="-220" as="targetPoint" />
          </mxGeometry>
        </mxCell>
        <mxCell id="zP8Z1faxtnohD27JhnkV-6" value="Use" style="endArrow=open;endSize=12;dashed=1;html=1;rounded=0;exitX=-0.01;exitY=0.081;exitDx=0;exitDy=0;exitPerimeter=0;entryX=0.957;entryY=0.1;entryDx=0;entryDy=0;entryPerimeter=0;" parent="1" source="jXoESz9dr0sw3v8Q8oxm-19" target="zP8Z1faxtnohD27JhnkV-1" edge="1">
          <mxGeometry width="160" relative="1" as="geometry">
            <mxPoint x="-260" y="-372" as="sourcePoint" />
            <mxPoint x="-610" y="-720" as="targetPoint" />
            <Array as="points">
              <mxPoint x="-340" y="-674" />
            </Array>
          </mxGeometry>
        </mxCell>
        <mxCell id="zP8Z1faxtnohD27JhnkV-15" value="0..n" style="endArrow=open;html=1;endSize=12;startArrow=diamondThin;startSize=14;startFill=1;edgeStyle=orthogonalEdgeStyle;align=left;verticalAlign=bottom;rounded=0;exitX=0.996;exitY=0.093;exitDx=0;exitDy=0;exitPerimeter=0;entryX=-0.012;entryY=0.052;entryDx=0;entryDy=0;entryPerimeter=0;" parent="1" source="vBtmWbRmqQhfP4ZIpWGv-19" target="vBtmWbRmqQhfP4ZIpWGv-1" edge="1">
          <mxGeometry x="0.7762" y="-20" relative="1" as="geometry">
            <mxPoint x="30" y="-290" as="sourcePoint" />
            <mxPoint x="190" y="-290" as="targetPoint" />
            <Array as="points">
              <mxPoint x="-63" y="-320" />
              <mxPoint x="120" y="-320" />
              <mxPoint x="120" y="-120" />
              <mxPoint x="168" y="-120" />
            </Array>
            <mxPoint as="offset" />
          </mxGeometry>
        </mxCell>
        <mxCell id="zP8Z1faxtnohD27JhnkV-16" value="1" style="endArrow=open;html=1;endSize=12;startArrow=diamondThin;startSize=14;startFill=0;edgeStyle=orthogonalEdgeStyle;align=left;verticalAlign=bottom;rounded=0;exitX=0;exitY=0.059;exitDx=0;exitDy=0;exitPerimeter=0;entryX=1.004;entryY=0.052;entryDx=0;entryDy=0;entryPerimeter=0;" parent="1" source="jXoESz9dr0sw3v8Q8oxm-14" target="vBtmWbRmqQhfP4ZIpWGv-1" edge="1">
          <mxGeometry x="-0.931" y="25" relative="1" as="geometry">
            <mxPoint x="970" y="-375.42" as="sourcePoint" />
            <mxPoint x="850" y="-375.42" as="targetPoint" />
            <mxPoint as="offset" />
          </mxGeometry>
        </mxCell>
        <mxCell id="zP8Z1faxtnohD27JhnkV-17" value="Use" style="endArrow=open;endSize=12;dashed=1;html=1;rounded=0;entryX=-0.016;entryY=0.468;entryDx=0;entryDy=0;entryPerimeter=0;" parent="1" target="KOZu9F1s04NRnYqd-34C-9" edge="1">
          <mxGeometry width="160" relative="1" as="geometry">
            <mxPoint x="60" y="150" as="sourcePoint" />
            <mxPoint x="1325" y="930" as="targetPoint" />
            <Array as="points">
              <mxPoint x="170" y="370" />
            </Array>
          </mxGeometry>
        </mxCell>
        <mxCell id="zP8Z1faxtnohD27JhnkV-19" value="Use" style="endArrow=open;endSize=12;dashed=1;html=1;rounded=0;exitX=1;exitY=0.038;exitDx=0;exitDy=0;exitPerimeter=0;entryX=-0.021;entryY=0.104;entryDx=0;entryDy=0;entryPerimeter=0;" parent="1" source="jXoESz9dr0sw3v8Q8oxm-24" target="jXoESz9dr0sw3v8Q8oxm-5" edge="1">
          <mxGeometry width="160" relative="1" as="geometry">
            <mxPoint x="-1080" y="560" as="sourcePoint" />
            <mxPoint x="-920" y="560" as="targetPoint" />
          </mxGeometry>
        </mxCell>
        <mxCell id="zP8Z1faxtnohD27JhnkV-21" value="EditPlaylistUI" style="swimlane;fontStyle=1;align=center;verticalAlign=top;childLayout=stackLayout;horizontal=1;startSize=26;horizontalStack=0;resizeParent=1;resizeParentMax=0;resizeLast=0;collapsible=1;marginBottom=0;whiteSpace=wrap;html=1;" parent="1" vertex="1">
          <mxGeometry x="-680" y="-310" width="240" height="140" as="geometry" />
        </mxCell>
        <mxCell id="zP8Z1faxtnohD27JhnkV-22" value="- ui : Ui::EditPlaylistUI*&lt;br&gt;- m_playlist : Playlist*&lt;br&gt;- m_playlist_item : PlaylistItemUI*&lt;br&gt;-&amp;nbsp; newPathToImg : QString" style="text;strokeColor=none;fillColor=none;align=left;verticalAlign=top;spacingLeft=4;spacingRight=4;overflow=hidden;rotatable=0;points=[[0,0.5],[1,0.5]];portConstraint=eastwest;whiteSpace=wrap;html=1;" parent="zP8Z1faxtnohD27JhnkV-21" vertex="1">
          <mxGeometry y="26" width="240" height="64" as="geometry" />
        </mxCell>
        <mxCell id="zP8Z1faxtnohD27JhnkV-23" value="" style="line;strokeWidth=1;fillColor=none;align=left;verticalAlign=middle;spacingTop=-1;spacingLeft=3;spacingRight=3;rotatable=0;labelPosition=right;points=[];portConstraint=eastwest;strokeColor=inherit;" parent="zP8Z1faxtnohD27JhnkV-21" vertex="1">
          <mxGeometry y="90" width="240" height="8" as="geometry" />
        </mxCell>
        <mxCell id="zP8Z1faxtnohD27JhnkV-24" value="&lt;div&gt;- save_edited_playlist () : void&lt;/div&gt;&lt;div&gt;- change_icon () : void&lt;br&gt;&lt;/div&gt;" style="text;strokeColor=none;fillColor=none;align=left;verticalAlign=top;spacingLeft=4;spacingRight=4;overflow=hidden;rotatable=0;points=[[0,0.5],[1,0.5]];portConstraint=eastwest;whiteSpace=wrap;html=1;" parent="zP8Z1faxtnohD27JhnkV-21" vertex="1">
          <mxGeometry y="98" width="240" height="42" as="geometry" />
        </mxCell>
        <mxCell id="zP8Z1faxtnohD27JhnkV-25" value="PlaylistItemUI" style="swimlane;fontStyle=1;align=center;verticalAlign=top;childLayout=stackLayout;horizontal=1;startSize=26;horizontalStack=0;resizeParent=1;resizeParentMax=0;resizeLast=0;collapsible=1;marginBottom=0;whiteSpace=wrap;html=1;" parent="1" vertex="1">
          <mxGeometry x="-680" y="-160" width="240" height="228" as="geometry" />
        </mxCell>
        <mxCell id="zP8Z1faxtnohD27JhnkV-26" value="- ui : Ui::EditPlaylistUI*&lt;br&gt;- m_playlist : Playlist*&lt;br&gt;- m_item : QListWidgetItem*&lt;br&gt;&lt;div&gt;- m_icon : QPixmap*&lt;/div&gt;&lt;div&gt;- m_icon_path : QString&lt;br&gt;&lt;/div&gt;" style="text;strokeColor=none;fillColor=none;align=left;verticalAlign=top;spacingLeft=4;spacingRight=4;overflow=hidden;rotatable=0;points=[[0,0.5],[1,0.5]];portConstraint=eastwest;whiteSpace=wrap;html=1;" parent="zP8Z1faxtnohD27JhnkV-25" vertex="1">
          <mxGeometry y="26" width="240" height="84" as="geometry" />
        </mxCell>
        <mxCell id="zP8Z1faxtnohD27JhnkV-27" value="" style="line;strokeWidth=1;fillColor=none;align=left;verticalAlign=middle;spacingTop=-1;spacingLeft=3;spacingRight=3;rotatable=0;labelPosition=right;points=[];portConstraint=eastwest;strokeColor=inherit;" parent="zP8Z1faxtnohD27JhnkV-25" vertex="1">
          <mxGeometry y="110" width="240" height="8" as="geometry" />
        </mxCell>
        <mxCell id="zP8Z1faxtnohD27JhnkV-28" value="&lt;div&gt;+ playlist () : Playlist*&lt;/div&gt;&lt;div&gt;+ listItem () : QListWidgetItem*&lt;/div&gt;&lt;div&gt;+ removePlaylist() : void&lt;/div&gt;&lt;div&gt;+ edit_playlist () : void&lt;/div&gt;&lt;div&gt;+ edit_playlist_name () : void&lt;/div&gt;&lt;div&gt;+ set_playlist_icon (QString&amp;amp;) : void&lt;/div&gt;&lt;div&gt;+ hideForImplicit () : void&lt;br&gt;&lt;/div&gt;" style="text;strokeColor=none;fillColor=none;align=left;verticalAlign=top;spacingLeft=4;spacingRight=4;overflow=hidden;rotatable=0;points=[[0,0.5],[1,0.5]];portConstraint=eastwest;whiteSpace=wrap;html=1;" parent="zP8Z1faxtnohD27JhnkV-25" vertex="1">
          <mxGeometry y="118" width="240" height="110" as="geometry" />
        </mxCell>
        <mxCell id="zP8Z1faxtnohD27JhnkV-29" value="EditSongUI" style="swimlane;fontStyle=1;align=center;verticalAlign=top;childLayout=stackLayout;horizontal=1;startSize=26;horizontalStack=0;resizeParent=1;resizeParentMax=0;resizeLast=0;collapsible=1;marginBottom=0;whiteSpace=wrap;html=1;" parent="1" vertex="1">
          <mxGeometry x="-680" y="100" width="240" height="140" as="geometry" />
        </mxCell>
        <mxCell id="zP8Z1faxtnohD27JhnkV-30" value="- ui : Ui::EditSongUI*&lt;br&gt;- m_song : Song*&lt;br&gt;- m_songItem : SongItemUI*&lt;br&gt;-&amp;nbsp; newPathToImg : QString" style="text;strokeColor=none;fillColor=none;align=left;verticalAlign=top;spacingLeft=4;spacingRight=4;overflow=hidden;rotatable=0;points=[[0,0.5],[1,0.5]];portConstraint=eastwest;whiteSpace=wrap;html=1;" parent="zP8Z1faxtnohD27JhnkV-29" vertex="1">
          <mxGeometry y="26" width="240" height="64" as="geometry" />
        </mxCell>
        <mxCell id="zP8Z1faxtnohD27JhnkV-31" value="" style="line;strokeWidth=1;fillColor=none;align=left;verticalAlign=middle;spacingTop=-1;spacingLeft=3;spacingRight=3;rotatable=0;labelPosition=right;points=[];portConstraint=eastwest;strokeColor=inherit;" parent="zP8Z1faxtnohD27JhnkV-29" vertex="1">
          <mxGeometry y="90" width="240" height="8" as="geometry" />
        </mxCell>
        <mxCell id="zP8Z1faxtnohD27JhnkV-32" value="&lt;div&gt;- save_changes () : void&lt;/div&gt;&lt;div&gt;- change_icon () : void&lt;br&gt;&lt;/div&gt;" style="text;strokeColor=none;fillColor=none;align=left;verticalAlign=top;spacingLeft=4;spacingRight=4;overflow=hidden;rotatable=0;points=[[0,0.5],[1,0.5]];portConstraint=eastwest;whiteSpace=wrap;html=1;" parent="zP8Z1faxtnohD27JhnkV-29" vertex="1">
          <mxGeometry y="98" width="240" height="42" as="geometry" />
        </mxCell>
        <mxCell id="zP8Z1faxtnohD27JhnkV-33" value="SongLibraryWindow" style="swimlane;fontStyle=1;align=center;verticalAlign=top;childLayout=stackLayout;horizontal=1;startSize=26;horizontalStack=0;resizeParent=1;resizeParentMax=0;resizeLast=0;collapsible=1;marginBottom=0;whiteSpace=wrap;html=1;" parent="1" vertex="1">
          <mxGeometry x="-680" y="262" width="240" height="160" as="geometry" />
        </mxCell>
        <mxCell id="zP8Z1faxtnohD27JhnkV-34" value="- ui : Ui::EditPlaylistUI*&lt;br&gt;- m_playlist : Playlist*" style="text;strokeColor=none;fillColor=none;align=left;verticalAlign=top;spacingLeft=4;spacingRight=4;overflow=hidden;rotatable=0;points=[[0,0.5],[1,0.5]];portConstraint=eastwest;whiteSpace=wrap;html=1;" parent="zP8Z1faxtnohD27JhnkV-33" vertex="1">
          <mxGeometry y="26" width="240" height="44" as="geometry" />
        </mxCell>
        <mxCell id="zP8Z1faxtnohD27JhnkV-35" value="" style="line;strokeWidth=1;fillColor=none;align=left;verticalAlign=middle;spacingTop=-1;spacingLeft=3;spacingRight=3;rotatable=0;labelPosition=right;points=[];portConstraint=eastwest;strokeColor=inherit;" parent="zP8Z1faxtnohD27JhnkV-33" vertex="1">
          <mxGeometry y="70" width="240" height="8" as="geometry" />
        </mxCell>
        <mxCell id="zP8Z1faxtnohD27JhnkV-36" value="- display_song (Song*) : void&lt;br&gt;- update_song_list (): void&lt;br&gt;- choose_song () : void&lt;br&gt;- select_songs () : void&lt;br&gt;- add_multiple_songs () : void" style="text;strokeColor=none;fillColor=none;align=left;verticalAlign=top;spacingLeft=4;spacingRight=4;overflow=hidden;rotatable=0;points=[[0,0.5],[1,0.5]];portConstraint=eastwest;whiteSpace=wrap;html=1;" parent="zP8Z1faxtnohD27JhnkV-33" vertex="1">
          <mxGeometry y="78" width="240" height="82" as="geometry" />
        </mxCell>
        <mxCell id="zP8Z1faxtnohD27JhnkV-37" value="LyricsSearchThread" style="swimlane;fontStyle=1;align=center;verticalAlign=top;childLayout=stackLayout;horizontal=1;startSize=26;horizontalStack=0;resizeParent=1;resizeParentMax=0;resizeLast=0;collapsible=1;marginBottom=0;whiteSpace=wrap;html=1;" parent="1" vertex="1">
          <mxGeometry x="-250" y="840" width="240" height="120" as="geometry" />
        </mxCell>
        <mxCell id="zP8Z1faxtnohD27JhnkV-38" value="&lt;div&gt;- m_song : Song*&lt;/div&gt;&lt;div&gt;- QString m_lyrics&lt;br&gt;&lt;/div&gt;" style="text;strokeColor=none;fillColor=none;align=left;verticalAlign=top;spacingLeft=4;spacingRight=4;overflow=hidden;rotatable=0;points=[[0,0.5],[1,0.5]];portConstraint=eastwest;whiteSpace=wrap;html=1;" parent="zP8Z1faxtnohD27JhnkV-37" vertex="1">
          <mxGeometry y="26" width="240" height="44" as="geometry" />
        </mxCell>
        <mxCell id="zP8Z1faxtnohD27JhnkV-39" value="" style="line;strokeWidth=1;fillColor=none;align=left;verticalAlign=middle;spacingTop=-1;spacingLeft=3;spacingRight=3;rotatable=0;labelPosition=right;points=[];portConstraint=eastwest;strokeColor=inherit;" parent="zP8Z1faxtnohD27JhnkV-37" vertex="1">
          <mxGeometry y="70" width="240" height="8" as="geometry" />
        </mxCell>
        <mxCell id="zP8Z1faxtnohD27JhnkV-40" value="&lt;div&gt;+ run () : void&lt;/div&gt;&lt;div&gt;- zet (QString&amp;amp;) : QVector&amp;lt;int&amp;gt;&lt;/div&gt;&lt;div&gt;&lt;br&gt;&lt;/div&gt;" style="text;strokeColor=none;fillColor=none;align=left;verticalAlign=top;spacingLeft=4;spacingRight=4;overflow=hidden;rotatable=0;points=[[0,0.5],[1,0.5]];portConstraint=eastwest;whiteSpace=wrap;html=1;" parent="zP8Z1faxtnohD27JhnkV-37" vertex="1">
          <mxGeometry y="78" width="240" height="42" as="geometry" />
        </mxCell>
        <mxCell id="zP8Z1faxtnohD27JhnkV-41" value="Use" style="endArrow=open;endSize=12;dashed=1;html=1;rounded=0;exitX=1.011;exitY=0.021;exitDx=0;exitDy=0;exitPerimeter=0;entryX=0;entryY=0.106;entryDx=0;entryDy=0;entryPerimeter=0;" parent="1" source="vBtmWbRmqQhfP4ZIpWGv-37" target="zP8Z1faxtnohD27JhnkV-21" edge="1">
          <mxGeometry width="160" relative="1" as="geometry">
            <mxPoint x="-880" y="-210" as="sourcePoint" />
            <mxPoint x="-720" y="-210" as="targetPoint" />
          </mxGeometry>
        </mxCell>
        <mxCell id="zP8Z1faxtnohD27JhnkV-42" value="Use" style="endArrow=open;endSize=12;dashed=1;html=1;rounded=0;exitX=1.013;exitY=0.027;exitDx=0;exitDy=0;exitPerimeter=0;entryX=-0.02;entryY=0.071;entryDx=0;entryDy=0;entryPerimeter=0;" parent="1" source="vBtmWbRmqQhfP4ZIpWGv-37" target="zP8Z1faxtnohD27JhnkV-25" edge="1">
          <mxGeometry width="160" relative="1" as="geometry">
            <mxPoint x="-880" y="-160" as="sourcePoint" />
            <mxPoint x="-655" y="-160" as="targetPoint" />
          </mxGeometry>
        </mxCell>
        <mxCell id="zP8Z1faxtnohD27JhnkV-43" value="Use" style="endArrow=open;endSize=12;dashed=1;html=1;rounded=0;exitX=1.002;exitY=0.027;exitDx=0;exitDy=0;exitPerimeter=0;entryX=-0.02;entryY=0.092;entryDx=0;entryDy=0;entryPerimeter=0;" parent="1" source="vBtmWbRmqQhfP4ZIpWGv-37" target="zP8Z1faxtnohD27JhnkV-29" edge="1">
          <mxGeometry width="160" relative="1" as="geometry">
            <mxPoint x="-860" y="-100" as="sourcePoint" />
            <mxPoint x="-640" y="49" as="targetPoint" />
            <Array as="points">
              <mxPoint x="-840" y="-80" />
            </Array>
          </mxGeometry>
        </mxCell>
        <mxCell id="zP8Z1faxtnohD27JhnkV-44" value="Use" style="endArrow=open;endSize=12;dashed=1;html=1;rounded=0;exitX=1.005;exitY=0.028;exitDx=0;exitDy=0;exitPerimeter=0;entryX=-0.016;entryY=0.096;entryDx=0;entryDy=0;entryPerimeter=0;" parent="1" source="vBtmWbRmqQhfP4ZIpWGv-37" target="zP8Z1faxtnohD27JhnkV-33" edge="1">
          <mxGeometry width="160" relative="1" as="geometry">
            <mxPoint x="-850" y="10" as="sourcePoint" />
            <mxPoint x="-626" y="394" as="targetPoint" />
            <Array as="points">
              <mxPoint x="-860" />
            </Array>
          </mxGeometry>
        </mxCell>
        <mxCell id="zP8Z1faxtnohD27JhnkV-45" value="Use" style="endArrow=open;endSize=12;dashed=1;html=1;rounded=0;exitX=0.255;exitY=1.002;exitDx=0;exitDy=0;exitPerimeter=0;entryX=0.436;entryY=-0.001;entryDx=0;entryDy=0;entryPerimeter=0;" parent="1" source="vBtmWbRmqQhfP4ZIpWGv-40" target="jXoESz9dr0sw3v8Q8oxm-24" edge="1">
          <mxGeometry width="160" relative="1" as="geometry">
            <mxPoint x="-1230" y="518.5700000000002" as="sourcePoint" />
            <mxPoint x="-1070" y="518.5700000000002" as="targetPoint" />
          </mxGeometry>
        </mxCell>
        <mxCell id="zP8Z1faxtnohD27JhnkV-47" value="" style="endArrow=block;endSize=16;endFill=0;html=1;rounded=0;exitX=0.5;exitY=1;exitDx=0;exitDy=0;entryX=0.5;entryY=0;entryDx=0;entryDy=0;" parent="1" source="vBtmWbRmqQhfP4ZIpWGv-46" target="vBtmWbRmqQhfP4ZIpWGv-1" edge="1">
          <mxGeometry width="160" relative="1" as="geometry">
            <mxPoint x="440" y="-450" as="sourcePoint" />
            <mxPoint x="480" y="-390" as="targetPoint" />
          </mxGeometry>
        </mxCell>
        <mxCell id="zP8Z1faxtnohD27JhnkV-50" value="0..n" style="endArrow=open;html=1;endSize=12;startArrow=diamondThin;startSize=14;startFill=1;edgeStyle=orthogonalEdgeStyle;align=left;verticalAlign=bottom;rounded=0;entryX=-0.008;entryY=0.053;entryDx=0;entryDy=0;entryPerimeter=0;exitX=1.011;exitY=0.061;exitDx=0;exitDy=0;exitPerimeter=0;" parent="1" source="vBtmWbRmqQhfP4ZIpWGv-5" target="vBtmWbRmqQhfP4ZIpWGv-9" edge="1">
          <mxGeometry x="0.6145" y="20" relative="1" as="geometry">
            <mxPoint x="60" y="340" as="sourcePoint" />
            <mxPoint x="250" y="340" as="targetPoint" />
            <Array as="points">
              <mxPoint x="-127" y="455" />
              <mxPoint x="-130" y="455" />
              <mxPoint x="-130" y="340" />
            </Array>
            <mxPoint as="offset" />
          </mxGeometry>
        </mxCell>
        <mxCell id="zP8Z1faxtnohD27JhnkV-54" value="Use" style="endArrow=open;endSize=12;dashed=1;html=1;rounded=0;entryX=0.731;entryY=1.015;entryDx=0;entryDy=0;entryPerimeter=0;exitX=0.244;exitY=-0.027;exitDx=0;exitDy=0;exitPerimeter=0;" parent="1" source="zP8Z1faxtnohD27JhnkV-37" target="vBtmWbRmqQhfP4ZIpWGv-8" edge="1">
          <mxGeometry width="160" relative="1" as="geometry">
            <mxPoint x="-290" y="760" as="sourcePoint" />
            <mxPoint x="130" y="770" as="targetPoint" />
          </mxGeometry>
        </mxCell>
        <mxCell id="zP8Z1faxtnohD27JhnkV-55" value="Use" style="endArrow=open;endSize=12;dashed=1;html=1;rounded=0;entryX=0.392;entryY=1.004;entryDx=0;entryDy=0;entryPerimeter=0;exitX=0.717;exitY=0.018;exitDx=0;exitDy=0;exitPerimeter=0;" parent="1" source="zP8Z1faxtnohD27JhnkV-37" target="vBtmWbRmqQhfP4ZIpWGv-12" edge="1">
          <mxGeometry width="160" relative="1" as="geometry">
            <mxPoint x="-20" y="770" as="sourcePoint" />
            <mxPoint x="400" y="893" as="targetPoint" />
          </mxGeometry>
        </mxCell>
        <mxCell id="zP8Z1faxtnohD27JhnkV-56" value="Use" style="endArrow=open;endSize=12;dashed=1;html=1;rounded=0;exitX=0.361;exitY=1.02;exitDx=0;exitDy=0;exitPerimeter=0;entryX=0.328;entryY=0.004;entryDx=0;entryDy=0;entryPerimeter=0;" parent="1" source="jXoESz9dr0sw3v8Q8oxm-17" target="KOZu9F1s04NRnYqd-34C-6" edge="1">
          <mxGeometry width="160" relative="1" as="geometry">
            <mxPoint x="600" y="170" as="sourcePoint" />
            <mxPoint x="760" y="170" as="targetPoint" />
          </mxGeometry>
        </mxCell>
        <mxCell id="zP8Z1faxtnohD27JhnkV-57" value="Use" style="endArrow=open;endSize=12;dashed=1;html=1;rounded=0;exitX=0.902;exitY=-0.006;exitDx=0;exitDy=0;exitPerimeter=0;entryX=0.005;entryY=0.039;entryDx=0;entryDy=0;entryPerimeter=0;" parent="1" source="vBtmWbRmqQhfP4ZIpWGv-37" target="vBtmWbRmqQhfP4ZIpWGv-19" edge="1">
          <mxGeometry width="160" relative="1" as="geometry">
            <mxPoint x="-840" y="-330" as="sourcePoint" />
            <mxPoint x="-680" y="-330" as="targetPoint" />
            <Array as="points">
              <mxPoint x="-900" y="-420" />
            </Array>
          </mxGeometry>
        </mxCell>
        <mxCell id="zP8Z1faxtnohD27JhnkV-58" value="Use" style="endArrow=open;endSize=12;dashed=1;html=1;rounded=0;entryX=-0.005;entryY=0.038;entryDx=0;entryDy=0;entryPerimeter=0;exitX=1.002;exitY=0.847;exitDx=0;exitDy=0;exitPerimeter=0;" parent="1" source="vBtmWbRmqQhfP4ZIpWGv-40" target="vBtmWbRmqQhfP4ZIpWGv-5" edge="1">
          <mxGeometry width="160" relative="1" as="geometry">
            <mxPoint x="-700" y="560" as="sourcePoint" />
            <mxPoint x="-540" y="560" as="targetPoint" />
            <Array as="points">
              <mxPoint x="-680" y="470" />
            </Array>
          </mxGeometry>
        </mxCell>
        <mxCell id="zP8Z1faxtnohD27JhnkV-59" value="Use" style="endArrow=open;endSize=12;dashed=1;html=1;rounded=0;exitX=1.009;exitY=0.064;exitDx=0;exitDy=0;exitPerimeter=0;entryX=0.06;entryY=-0.022;entryDx=0;entryDy=0;entryPerimeter=0;" parent="1" source="zP8Z1faxtnohD27JhnkV-33" target="vBtmWbRmqQhfP4ZIpWGv-5" edge="1">
          <mxGeometry width="160" relative="1" as="geometry">
            <mxPoint x="-380" y="440" as="sourcePoint" />
            <mxPoint x="-220" y="440" as="targetPoint" />
          </mxGeometry>
        </mxCell>
        <mxCell id="zP8Z1faxtnohD27JhnkV-61" value="Use" style="endArrow=open;endSize=12;dashed=1;html=1;rounded=0;exitX=1.002;exitY=0.078;exitDx=0;exitDy=0;exitPerimeter=0;entryX=-0.016;entryY=0.947;entryDx=0;entryDy=0;entryPerimeter=0;" parent="1" source="zP8Z1faxtnohD27JhnkV-25" target="vBtmWbRmqQhfP4ZIpWGv-2" edge="1">
          <mxGeometry width="160" relative="1" as="geometry">
            <mxPoint x="-240" y="10" as="sourcePoint" />
            <mxPoint x="-80" y="10" as="targetPoint" />
            <Array as="points">
              <mxPoint x="-140" y="-40" />
            </Array>
          </mxGeometry>
        </mxCell>
        <mxCell id="zP8Z1faxtnohD27JhnkV-62" value="Use" style="endArrow=open;endSize=12;dashed=1;html=1;rounded=0;exitX=1.016;exitY=0.12;exitDx=0;exitDy=0;exitPerimeter=0;entryX=-0.02;entryY=0.859;entryDx=0;entryDy=0;entryPerimeter=0;" parent="1" source="zP8Z1faxtnohD27JhnkV-21" target="vBtmWbRmqQhfP4ZIpWGv-2" edge="1">
          <mxGeometry width="160" relative="1" as="geometry">
            <mxPoint x="-410" y="-130" as="sourcePoint" />
            <mxPoint x="-240" y="-70" as="targetPoint" />
            <Array as="points">
              <mxPoint x="-150" y="-110" />
            </Array>
          </mxGeometry>
        </mxCell>
        <mxCell id="zP8Z1faxtnohD27JhnkV-63" value="Use" style="endArrow=open;endSize=12;dashed=1;html=1;rounded=0;exitX=1.008;exitY=0.129;exitDx=0;exitDy=0;exitPerimeter=0;entryX=0.082;entryY=0.001;entryDx=0;entryDy=0;entryPerimeter=0;" parent="1" source="zP8Z1faxtnohD27JhnkV-29" target="vBtmWbRmqQhfP4ZIpWGv-9" edge="1">
          <mxGeometry width="160" relative="1" as="geometry">
            <mxPoint x="-320" y="260" as="sourcePoint" />
            <mxPoint x="-380" y="360" as="targetPoint" />
            <Array as="points">
              <mxPoint x="-300" y="270" />
            </Array>
          </mxGeometry>
        </mxCell>
        <mxCell id="zP8Z1faxtnohD27JhnkV-68" value="Use" style="endArrow=open;endSize=12;dashed=1;html=1;rounded=0;exitX=1;exitY=0.415;exitDx=0;exitDy=0;exitPerimeter=0;entryX=-0.017;entryY=0.179;entryDx=0;entryDy=0;entryPerimeter=0;" parent="1" source="vBtmWbRmqQhfP4ZIpWGv-40" target="jXoESz9dr0sw3v8Q8oxm-30" edge="1">
          <mxGeometry x="0.7627" y="11" width="160" relative="1" as="geometry">
            <mxPoint x="-390" y="90" as="sourcePoint" />
            <mxPoint x="-230" y="90" as="targetPoint" />
            <mxPoint as="offset" />
          </mxGeometry>
        </mxCell>
        <mxCell id="zP8Z1faxtnohD27JhnkV-70" value="0..n" style="endArrow=open;html=1;endSize=12;startArrow=diamondThin;startSize=14;startFill=0;edgeStyle=orthogonalEdgeStyle;align=left;verticalAlign=bottom;rounded=0;exitX=0.633;exitY=1;exitDx=0;exitDy=0;exitPerimeter=0;" parent="1" source="vBtmWbRmqQhfP4ZIpWGv-4" edge="1">
          <mxGeometry x="0.9446" y="20" relative="1" as="geometry">
            <mxPoint x="290" y="280" as="sourcePoint" />
            <mxPoint x="80" y="360" as="targetPoint" />
            <mxPoint as="offset" />
          </mxGeometry>
        </mxCell>
        <mxCell id="zP8Z1faxtnohD27JhnkV-71" value="Use" style="endArrow=open;endSize=12;dashed=1;html=1;rounded=0;exitX=0.156;exitY=-0.026;exitDx=0;exitDy=0;exitPerimeter=0;entryX=0.678;entryY=1.032;entryDx=0;entryDy=0;entryPerimeter=0;" parent="1" source="vBtmWbRmqQhfP4ZIpWGv-5" target="zP8Z1faxtnohD27JhnkV-4" edge="1">
          <mxGeometry x="-0.8272" y="1" width="160" relative="1" as="geometry">
            <mxPoint x="-340" y="410" as="sourcePoint" />
            <mxPoint x="-350" y="-360" as="targetPoint" />
            <Array as="points">
              <mxPoint x="-330" y="-350" />
            </Array>
            <mxPoint as="offset" />
          </mxGeometry>
        </mxCell>
        <mxCell id="zP8Z1faxtnohD27JhnkV-72" value="Use" style="endArrow=open;endSize=12;dashed=1;html=1;rounded=0;entryX=0.413;entryY=-0.066;entryDx=0;entryDy=0;entryPerimeter=0;exitX=1.005;exitY=0.967;exitDx=0;exitDy=0;exitPerimeter=0;" parent="1" target="L4zqKhDq99XzpKWCaEXX-1" edge="1" source="vBtmWbRmqQhfP4ZIpWGv-40">
          <mxGeometry width="160" relative="1" as="geometry">
            <mxPoint x="-910" y="460" as="sourcePoint" />
            <mxPoint x="-550" y="640" as="targetPoint" />
            <Array as="points">
              <mxPoint x="-700" y="530" />
            </Array>
          </mxGeometry>
        </mxCell>
        <mxCell id="L4zqKhDq99XzpKWCaEXX-1" value="ThreadHandler" style="swimlane;fontStyle=1;align=center;verticalAlign=top;childLayout=stackLayout;horizontal=1;startSize=26;horizontalStack=0;resizeParent=1;resizeParentMax=0;resizeLast=0;collapsible=1;marginBottom=0;whiteSpace=wrap;html=1;" parent="1" vertex="1">
          <mxGeometry x="-710" y="630" width="240" height="76" as="geometry" />
        </mxCell>
        <mxCell id="L4zqKhDq99XzpKWCaEXX-3" value="" style="line;strokeWidth=1;fillColor=none;align=left;verticalAlign=middle;spacingTop=-1;spacingLeft=3;spacingRight=3;rotatable=0;labelPosition=right;points=[];portConstraint=eastwest;strokeColor=inherit;" parent="L4zqKhDq99XzpKWCaEXX-1" vertex="1">
          <mxGeometry y="26" width="240" height="8" as="geometry" />
        </mxCell>
        <mxCell id="L4zqKhDq99XzpKWCaEXX-4" value="&lt;div&gt;+startThreads(QString)&lt;/div&gt;" style="text;strokeColor=none;fillColor=none;align=left;verticalAlign=top;spacingLeft=4;spacingRight=4;overflow=hidden;rotatable=0;points=[[0,0.5],[1,0.5]];portConstraint=eastwest;whiteSpace=wrap;html=1;" parent="L4zqKhDq99XzpKWCaEXX-1" vertex="1">
          <mxGeometry y="34" width="240" height="42" as="geometry" />
        </mxCell>
        <mxCell id="L4zqKhDq99XzpKWCaEXX-5" value="Use" style="endArrow=open;endSize=12;dashed=1;html=1;rounded=0;exitX=0.446;exitY=1.048;exitDx=0;exitDy=0;exitPerimeter=0;entryX=0.008;entryY=0.183;entryDx=0;entryDy=0;entryPerimeter=0;" parent="1" source="L4zqKhDq99XzpKWCaEXX-4" target="zP8Z1faxtnohD27JhnkV-37" edge="1">
          <mxGeometry width="160" relative="1" as="geometry">
            <mxPoint x="-580" y="810" as="sourcePoint" />
            <mxPoint x="-420" y="810" as="targetPoint" />
            <Array as="points">
              <mxPoint x="-603" y="860" />
            </Array>
          </mxGeometry>
        </mxCell>
        <mxCell id="L4zqKhDq99XzpKWCaEXX-6" value="1" style="endArrow=open;html=1;endSize=12;startArrow=diamondThin;startSize=14;startFill=0;edgeStyle=orthogonalEdgeStyle;align=left;verticalAlign=bottom;rounded=0;entryX=0.283;entryY=0.005;entryDx=0;entryDy=0;entryPerimeter=0;" parent="1" target="vBtmWbRmqQhfP4ZIpWGv-9" edge="1">
          <mxGeometry x="0.7728" y="17" relative="1" as="geometry">
            <mxPoint x="-99" y="280" as="sourcePoint" />
            <mxPoint x="60" y="310" as="targetPoint" />
            <mxPoint as="offset" />
          </mxGeometry>
        </mxCell>
        <mxCell id="L4zqKhDq99XzpKWCaEXX-7" value="1" style="endArrow=open;html=1;endSize=12;startArrow=diamondThin;startSize=14;startFill=0;edgeStyle=orthogonalEdgeStyle;align=left;verticalAlign=bottom;rounded=0;exitX=0.921;exitY=-0.013;exitDx=0;exitDy=0;exitPerimeter=0;entryX=-0.02;entryY=-0.094;entryDx=0;entryDy=0;entryPerimeter=0;" parent="1" source="jXoESz9dr0sw3v8Q8oxm-29" target="vBtmWbRmqQhfP4ZIpWGv-2" edge="1">
          <mxGeometry x="0.8661" y="-20" relative="1" as="geometry">
            <mxPoint x="80" y="70" as="sourcePoint" />
            <mxPoint x="130" y="-70" as="targetPoint" />
            <mxPoint as="offset" />
          </mxGeometry>
        </mxCell>
        <mxCell id="h0QDT2baDPYhLPLqeMAC-1" value="&lt;p style=&quot;margin:0px;margin-top:4px;text-align:center;&quot;&gt;&lt;i&gt;&amp;lt;&amp;lt;enumeration&amp;gt;&amp;gt;&lt;/i&gt;&lt;br&gt;&lt;b&gt;Pages&lt;/b&gt;&lt;br&gt;&lt;/p&gt;&lt;hr size=&quot;1&quot;&gt;&lt;p style=&quot;margin:0px;margin-left:4px;&quot;&gt;MainPage&lt;/p&gt;&lt;p style=&quot;margin:0px;margin-left:4px;&quot;&gt;AudioPlayerPage&lt;/p&gt;&lt;p style=&quot;margin:0px;margin-left:4px;&quot;&gt;SongLibPage&lt;/p&gt;&lt;p style=&quot;margin:0px;margin-left:4px;&quot;&gt;PlaylistsPage&lt;br&gt;&lt;/p&gt;&lt;hr size=&quot;1&quot;&gt;&lt;p style=&quot;margin:0px;margin-left:4px;&quot;&gt;&lt;br&gt;&lt;br&gt;&lt;/p&gt;" style="verticalAlign=top;align=left;overflow=fill;fontSize=12;fontFamily=Helvetica;html=1;whiteSpace=wrap;" vertex="1" parent="1">
          <mxGeometry x="-1350" y="-492" width="120" height="110" as="geometry" />
        </mxCell>
        <mxCell id="h0QDT2baDPYhLPLqeMAC-2" value="Use" style="endArrow=open;endSize=12;dashed=1;html=1;rounded=0;entryX=0.308;entryY=1.045;entryDx=0;entryDy=0;entryPerimeter=0;exitX=0.093;exitY=0;exitDx=0;exitDy=0;exitPerimeter=0;" edge="1" parent="1" source="vBtmWbRmqQhfP4ZIpWGv-37" target="h0QDT2baDPYhLPLqeMAC-1">
          <mxGeometry width="160" relative="1" as="geometry">
            <mxPoint x="-1330" y="-280" as="sourcePoint" />
            <mxPoint x="-1170" y="-280" as="targetPoint" />
          </mxGeometry>
        </mxCell>
      </root>
    </mxGraphModel>
  </diagram>
</mxfile>
