<svg xmlns="http://www.w3.org/2000/svg" xmlns:xlink="http://www.w3.org/1999/xlink" version="1.1" width="864pt" height="1384.08pt" viewBox="0 0 864 1384.08">
<defs>
<clipPath id="clip_0">
<path transform="matrix(.24,0,0,.24,0,0)" d="M0 0H3600V5764.1965H0Z" fill-rule="evenodd"/>
</clipPath>
<clipPath id="clip_1">
<path transform="matrix(.24,0,0,.24,0,0)" d="M0 0H3600V5758.2019H0Z" fill-rule="evenodd"/>
</clipPath>
</defs>
<g clip-path="url(#clip_0)">
<path transform="matrix(.71940049,0,0,.71940049,0,0)" d="M0 0H1201V1923H0Z" fill="#ffffff"/>
<path transform="matrix(.71940049,0,0,.71940049,0,0)" d="M0 0H1201V1921H0Z" fill="#ffffff"/>
</g>
<g clip-path="url(#clip_1)">
<path transform="matrix(.71940049,0,0,.71940049,.35970024,.35970024)" stroke-width="1" stroke-linecap="butt" stroke-miterlimit="10" stroke-linejoin="miter" fill="none" stroke="#000000" d="M145 100V120 110 123.63"/>
<path transform="matrix(.71940049,0,0,.71940049,.35970024,.35970024)" d="M145 128.88 141.5 121.88 145 123.63 148.5 121.88 145 128.88Z"/>
<path transform="matrix(.71940049,0,0,.71940049,.35970024,.35970024)" stroke-width="1" stroke-linecap="butt" stroke-miterlimit="10" stroke-linejoin="miter" fill="none" stroke="#000000" d="M145 128.88 141.5 121.88 145 123.63 148.5 121.88 145 128.88Z"/>
<path transform="matrix(.71940049,0,0,.71940049,.35970024,.35970024)" d="M152.5 47.5C152.5 47.992456 152.45197 48.48018 152.35588 48.963174 152.25981 49.446168 152.11754 49.91515 151.92908 50.37012 151.74063 50.82509 151.50962 51.257307 151.23601 51.66677 150.96242 52.076234 150.65152 52.455076 150.3033 52.803297 149.95508 53.151514 149.57624 53.46242 149.16677 53.736017 148.7573 54.00961 148.32509 54.24063 147.87012 54.42909 147.41515 54.617544 146.94615 54.759809 146.46317 54.855886 145.98018 54.951959 145.49245 54.999998 145 55 144.50754 54.999998 144.0198 54.951959 143.53682 54.855886 143.05382 54.759809 142.58483 54.617544 142.12985 54.42909 141.67488 54.24063 141.24266 54.00961 140.83319 53.736017 140.42375 53.46242 140.0449 53.151514 139.69669 52.803297 139.34847 52.455076 139.03755 52.076234 138.76396 51.666769 138.49036 51.257307 138.25934 50.82509 138.07089 50.37012 137.88243 49.91515 137.74018 49.446168 137.6441 48.963174 137.54804 48.48018 137.5 47.992456 137.5 47.5 137.5 47.00754 137.54804 46.519815 137.6441 46.036817 137.74018 45.553819 137.88243 45.084836 138.07089 44.629869 138.25934 44.174898 138.49036 43.74268 138.76396 43.333219 139.03755 42.923757 139.34847 42.544916 139.69669 42.196699 140.0449 41.848478 140.42375 41.53757 140.83319 41.263978 141.24266 40.990385 141.67488 40.759359 142.12985 40.5709 142.58483 40.382444 143.05382 40.24018 143.53682 40.144109 144.0198 40.048036 144.50754 40 145 40 145.49245 40 145.98018 40.048036 146.46317 40.144109 146.94615 40.24018 147.41515 40.382444 147.87012 40.5709 148.32509 40.759359 148.7573 40.990385 149.16677 41.263978 149.57624 41.53757 149.95508 41.848478 150.3033 42.196699 150.65152 42.544916 150.96242 42.923757 151.23601 43.333219 151.50962 43.74268 151.74063 44.174898 151.92908 44.629869 152.11754 45.084836 152.25981 45.553819 152.35588 46.036817 152.45197 46.519815 152.5 47.00754 152.5 47.5Z" fill="#ffffff"/>
<path transform="matrix(.71940049,0,0,.71940049,.35970024,.35970024)" stroke-width="1" stroke-linecap="butt" stroke-miterlimit="4" stroke-linejoin="miter" fill="none" stroke="#000000" d="M152.5 47.5C152.5 47.992456 152.45197 48.48018 152.35588 48.963174 152.25981 49.446168 152.11754 49.91515 151.92908 50.37012 151.74063 50.82509 151.50962 51.257307 151.23601 51.66677 150.96242 52.076234 150.65152 52.455076 150.3033 52.803297 149.95508 53.151514 149.57624 53.46242 149.16677 53.736017 148.7573 54.00961 148.32509 54.24063 147.87012 54.42909 147.41515 54.617544 146.94615 54.759809 146.46317 54.855886 145.98018 54.951959 145.49245 54.999998 145 55 144.50754 54.999998 144.0198 54.951959 143.53682 54.855886 143.05382 54.759809 142.58483 54.617544 142.12985 54.42909 141.67488 54.24063 141.24266 54.00961 140.83319 53.736017 140.42375 53.46242 140.0449 53.151514 139.69669 52.803297 139.34847 52.455076 139.03755 52.076234 138.76396 51.666769 138.49036 51.257307 138.25934 50.82509 138.07089 50.37012 137.88243 49.91515 137.74018 49.446168 137.6441 48.963174 137.54804 48.48018 137.5 47.992456 137.5 47.5 137.5 47.00754 137.54804 46.519815 137.6441 46.036817 137.74018 45.553819 137.88243 45.084836 138.07089 44.629869 138.25934 44.174898 138.49036 43.74268 138.76396 43.333219 139.03755 42.923757 139.34847 42.544916 139.69669 42.196699 140.0449 41.848478 140.42375 41.53757 140.83319 41.263978 141.24266 40.990385 141.67488 40.759359 142.12985 40.5709 142.58483 40.382444 143.05382 40.24018 143.53682 40.144109 144.0198 40.048036 144.50754 40 145 40 145.49245 40 145.98018 40.048036 146.46317 40.144109 146.94615 40.24018 147.41515 40.382444 147.87012 40.5709 148.32509 40.759359 148.7573 40.990385 149.16677 41.263978 149.57624 41.53757 149.95508 41.848478 150.3033 42.196699 150.65152 42.544916 150.96242 42.923757 151.23601 43.333219 151.50962 43.74268 151.74063 44.174898 151.92908 44.629869 152.11754 45.084836 152.25981 45.553819 152.35588 46.036817 152.45197 46.519815 152.5 47.00754 152.5 47.5Z"/>
<path transform="matrix(.71940049,0,0,.71940049,.35970024,.35970024)" stroke-width="1" stroke-linecap="butt" stroke-miterlimit="10" stroke-linejoin="miter" fill="none" stroke="#000000" d="M145 55V80M145 60H130M145 60H160M145 80 130 100M145 80 160 100"/>
<text xml:space="preserve" transform="matrix(.71940049 0 0 .71940049 0 0)" font-size="12" font-family="ArialMT"><tspan y="118" x="131.5 139.504 145.504 148.84 155.512">Actor</tspan></text>
<path transform="matrix(.71940049,0,0,.71940049,.35970024,.35970024)" d="M135 130H155V880H135Z" fill="#ffffff"/>
<path transform="matrix(.71940049,0,0,.71940049,.35970024,.35970024)" stroke-width="1" stroke-linecap="butt" stroke-miterlimit="4" stroke-linejoin="miter" fill="none" stroke="#000000" d="M135 130H155V880H135Z"/>
<path transform="matrix(.71940049,0,0,.71940049,.35970024,.35970024)" d="M300 50H420V110H300Z" fill="#ffffff"/>
<path transform="matrix(.71940049,0,0,.71940049,.35970024,.35970024)" stroke-width="1" stroke-linecap="butt" stroke-miterlimit="4" stroke-linejoin="miter" fill="none" stroke="#000000" d="M300 50H420V110H300Z"/>
<text xml:space="preserve" transform="matrix(.71940049 0 0 .71940049 0 0)" font-size="17" font-family="ArialMT"><tspan y="85" x="315.10939 328.3354 332.10939 341.56138 350.06138 359.51338 363.28736 368.01338 382.17439 391.62638 401.07838">Glavni meni</tspan></text>
<path transform="matrix(.71940049,0,0,.71940049,.35970024,.35970024)" d="M550 50H670V110H550Z" fill="#ffffff"/>
<path transform="matrix(.71940049,0,0,.71940049,.35970024,.35970024)" stroke-width="1" stroke-linecap="butt" stroke-miterlimit="4" stroke-linejoin="miter" fill="none" stroke="#000000" d="M550 50H670V110H550Z"/>
<text xml:space="preserve" transform="matrix(.71940049 0 0 .71940049 0 0)" font-size="16" font-family="ArialMT"><tspan y="86" x="576.2031 586.8751 595.7711 599.3231 602.8751 610.8751 619.7711 627.7711 631.3231 634.8751">Aplikacija</tspan></text>
<path transform="matrix(.71940049,0,0,.71940049,.35970024,.35970024)" d="M810 50H930V110H810Z" fill="#ffffff"/>
<path transform="matrix(.71940049,0,0,.71940049,.35970024,.35970024)" stroke-width="1" stroke-linecap="butt" stroke-miterlimit="4" stroke-linejoin="miter" fill="none" stroke="#000000" d="M810 50H930V110H810Z"/>
<text xml:space="preserve" transform="matrix(.71940049 0 0 .71940049 0 0)" font-size="16" font-family="ArialMT"><tspan y="86" x="823.7344 834.4064 843.30239 852.19839 861.09439 869.09439 877.99038 885.99038 894.88638 903.78237 907.33438">Pode&#x0161;avanja</tspan></text>
<path transform="matrix(.71940049,0,0,.71940049,.35970024,.35970024)" d="M590 140H610V880H590Z" fill="#ffffff"/>
<path transform="matrix(.71940049,0,0,.71940049,.35970024,.35970024)" stroke-width="1" stroke-linecap="butt" stroke-miterlimit="4" stroke-linejoin="miter" fill="none" stroke="#000000" d="M590 140H610V880H590Z"/>
<path transform="matrix(.71940049,0,0,.71940049,.35970024,.35970024)" stroke-width="1" stroke-linecap="butt" stroke-miterlimit="10" stroke-linejoin="miter" fill="none" stroke="#000000" d="M370 200 583.63 199.22"/>
<path transform="matrix(.71940049,0,0,.71940049,.35970024,.35970024)" d="M588.88 199.2 581.89 202.73 583.63 199.22 581.87 195.73 588.88 199.2Z"/>
<path transform="matrix(.71940049,0,0,.71940049,.35970024,.35970024)" stroke-width="1" stroke-linecap="butt" stroke-miterlimit="10" stroke-linejoin="miter" fill="none" stroke="#000000" d="M588.88 199.2 581.89 202.73 583.63 199.22 581.87 195.73 588.88 199.2Z"/>
<text xml:space="preserve" transform="matrix(.71940049 0 0 .71940049 0 0)" font-size="12" font-family="ArialMT"><tspan y="189" x="430.96876 437.64076 440.97676 444.31275 447.64875 454.32075 456.98475 462.98475 465.64875 468.31275 474.98475 477.64875 480.31275 486.31275 492.98475 495.64875 498.98475 508.98075 515.6528 522.32479">2. Inicijalizuj mapu</tspan></text>
<path transform="matrix(.71940049,0,0,.71940049,.35970024,.35970024)" stroke-width="1" stroke-linecap="butt" stroke-miterlimit="10" stroke-linejoin="miter" fill="none" stroke="#000000" d="M613 216.22 853.63 215.03"/>
<path transform="matrix(.71940049,0,0,.71940049,.35970024,.35970024)" d="M858.88 215.01 851.9 218.54 853.63 215.03 851.86 211.54 858.88 215.01Z"/>
<path transform="matrix(.71940049,0,0,.71940049,.35970024,.35970024)" stroke-width="1" stroke-linecap="butt" stroke-miterlimit="10" stroke-linejoin="miter" fill="none" stroke="#000000" d="M858.88 215.01 851.9 218.54 853.63 215.03 851.86 211.54 858.88 215.01Z"/>
<text xml:space="preserve" transform="matrix(.71940049 0 0 .71940049 0 0)" font-size="12" font-family="ArialMT"><tspan y="209" x="677.28128 683.95327 687.28927 690.62527 699.28927 705.96127 712.63327 718.63327 725.30526 728.64126 731.30526 734.64126 741.31326 747.9852 754.6572 761.3292 767.3292 774.0012 780.0012 786.6732 793.3452 796.0092">3. Dohvati pode&#x0161;avanja</tspan></text>
<path transform="matrix(.71940049,0,0,.71940049,.35970024,.35970024)" d="M612.99948 249.76 615.99948 249.75684 616.00057 250.75684 613.00057 250.76M618.99948 249.75368 621.99948 249.75052 622.00057 250.75052 619.00057 250.75368M624.99948 249.74736 627.99948 249.7442 628.00057 250.7442 625.00057 250.74736M630.99948 249.74105 633.99948 249.73789 634.00057 250.73789 631.00057 250.74105M636.99948 249.73473 639.99948 249.73157 640.00057 250.73157 637.00057 250.73473M642.99948 249.72841 645.99948 249.72527 646.00057 250.72527 643.00057 250.72841M648.99948 249.7221 651.99948 249.71895 652.00057 250.71895 649.00057 250.7221M654.99948 249.71579 657.99948 249.71263 658.00057 250.71263 655.00057 250.71579M660.99948 249.70948 663.99948 249.70632 664.00057 250.70632 661.00057 250.70948M666.99948 249.70316 669.99948 249.7 670.00057 250.7 667.00057 250.70316M672.99948 249.69684 675.9994 249.69368 676.0005 250.69368 673.00057 250.69684M678.9994 249.69052 681.9994 249.68737 682.0005 250.68737 679.0005 250.69052M684.9994 249.6842 687.9994 249.68105 688.0005 250.68105 685.0005 250.6842M690.9994 249.67789 693.9994 249.67473 694.0005 250.67473 691.0005 250.67789M696.9994 249.67157 699.9994 249.66841 700.0005 250.66841 697.0005 250.67157M702.9994 249.66526 705.9994 249.66211 706.0005 250.66211 703.0005 250.66526M708.9994 249.65895 711.9994 249.65579 712.0005 250.65579 709.0005 250.65895M714.9994 249.65264 717.9994 249.64948 718.0005 250.64948 715.0005 250.65264M720.9994 249.64632 723.9994 249.64316 724.0005 250.64316 721.0005 250.64632M726.9994 249.64 729.9994 249.63684 730.0005 250.63684 727.0005 250.64M732.9994 249.63368 735.9994 249.63053 736.0005 250.63053 733.0005 250.63368M738.9994 249.62737 741.9994 249.6242 742.0005 250.6242 739.0005 250.62737M744.9994 249.62105 747.9994 249.61789 748.0005 250.61789 745.0005 250.62105M750.9994 249.61473 753.9994 249.61157 754.0005 250.61157 751.0005 250.61473M756.9994 249.60842 759.9994 249.60526 760.0005 250.60526 757.0005 250.60842M762.9994 249.6021 765.9994 249.59894 766.0005 250.59894 763.0005 250.6021M768.9994 249.5958 771.9993 249.59264 772.0004 250.59264 769.0005 250.5958M774.9993 249.58948 777.9993 249.58632 778.0004 250.58632 775.0004 250.58948M780.9993 249.58316 783.9993 249.58 784.0004 250.58 781.0004 250.58316M786.9993 249.57685 789.9993 249.57369 790.0004 250.57369 787.0004 250.57685M792.9993 249.57053 795.9993 249.56737 796.0004 250.56737 793.0004 250.57053M798.9993 249.56421 801.9993 249.56105 802.0004 250.56105 799.0004 250.56421M804.9993 249.55789 807.9993 249.55474 808.0004 250.55474 805.0004 250.55789M810.9993 249.55158 813.9993 249.54842 814.0004 250.54842 811.0004 250.55158M816.9993 249.54526 819.9993 249.5421 820.0004 250.5421 817.0004 250.54526M822.9993 249.53894 825.9993 249.53578 826.0004 250.53578 823.0004 250.53894M828.9993 249.53264 831.9993 249.52948 832.0004 250.52948 829.0004 250.53264M834.9993 249.52632 837.9993 249.52317 838.0004 250.52317 835.0004 250.52632M840.9993 249.52 843.9993 249.51685 844.0004 250.51685 841.0004 250.52M846.9993 249.51369 849.9993 249.51053 850.0004 250.51053 847.0004 250.51369M852.9993 249.50737 855.9993 249.50421 856.0004 250.50421 853.0004 250.50737M858.9993 249.50106 859.99948 249.5 860.00057 250.5 859.0004 250.50106"/>
<path transform="matrix(-.71940049,0,0,-.71940049,885.2223,360.05995)" d="M610 246 620 250 610 254V246Z"/>
<path transform="matrix(-.71940049,0,0,-.71940049,885.2223,360.05995)" stroke-width="1" stroke-linecap="butt" stroke-miterlimit="10" stroke-linejoin="miter" fill="none" stroke="#000000" d="M610 246 620 250 610 254V246Z"/>
<text xml:space="preserve" transform="matrix(.71940049 0 0 .71940049 0 0)" font-size="12" font-family="ArialMT"><tspan y="269" x="677.28128 683.95327 687.28927 690.62527 699.28927 705.28927 707.95327 711.28927 717.96127 724.63327 731.30526 734.64126 741.31326 747.9852 754.6572 761.3292 767.3292 774.0012 780.0012 786.6732 793.3452 796.0092">4. U&#x010d;itana pode&#x0161;avanja</tspan></text>
<path transform="matrix(.71940049,0,0,.71940049,.35970024,.35970024)" d="M1040 320H1160V380H1040Z" fill="#ffffff"/>
<path transform="matrix(.71940049,0,0,.71940049,.35970024,.35970024)" stroke-width="1" stroke-linecap="butt" stroke-miterlimit="4" stroke-linejoin="miter" fill="none" stroke="#000000" d="M1040 320H1160V380H1040Z"/>
<text xml:space="preserve" transform="matrix(.71940049 0 0 .71940049 0 0)" font-size="16" font-family="ArialMT"><tspan y="356" x="1079.9844 1093.3124 1102.2084 1111.1044">Mapa</tspan></text>
<path transform="matrix(.71940049,0,0,.71940049,.35970024,.35970024)" d="M610 349.5H613V350.5H610M616 349.5H619V350.5H616M622 349.5H625V350.5H622M628 349.5H631V350.5H628M634 349.5H637V350.5H634M640 349.5H643V350.5H640M646 349.5H649V350.5H646M652 349.5H655V350.5H652M658 349.5H661V350.5H658M664 349.5H667V350.5H664M670 349.5H673V350.5H670M676 349.5H679V350.5H676M682 349.5H685V350.5H682M688 349.5H691V350.5H688M694 349.5H697V350.5H694M700 349.5H703V350.5H700M706 349.5H709V350.5H706M712 349.5H715V350.5H712M718 349.5H721V350.5H718M724 349.5H727V350.5H724M730 349.5H733V350.5H730M736 349.5H739V350.5H736M742 349.5H745V350.5H742M748 349.5H751V350.5H748M754 349.5H757V350.5H754M760 349.5H763V350.5H760M766 349.5H769V350.5H766M772 349.5H775V350.5H772M778 349.5H781V350.5H778M784 349.5H787V350.5H784M790 349.5H793V350.5H790M796 349.5H799V350.5H796M802 349.5H805V350.5H802M808 349.5H811V350.5H808M814 349.5H817V350.5H814M820 349.5H823V350.5H820M826 349.5H829V350.5H826M832 349.5H835V350.5H832M838 349.5H841V350.5H838M844 349.5H847V350.5H844M850 349.5H853V350.5H850M856 349.5H859V350.5H856M862 349.5H865V350.5H862M868 349.5H871V350.5H868M874 349.5H877V350.5H874M880 349.5H883V350.5H880M886 349.5H889V350.5H886M892 349.5H895V350.5H892M898 349.5H901V350.5H898M904 349.5H907V350.5H904M910 349.5H913V350.5H910M916 349.5H919V350.5H916M922 349.5H925V350.5H922M928 349.5H931V350.5H928M934 349.5H937V350.5H934M940 349.5H943V350.5H940M946 349.5H949V350.5H946M952 349.5H955V350.5H952M958 349.5H961V350.5H958M964 349.5H967V350.5H964M970 349.5H973V350.5H970M976 349.5H979V350.5H976M982 349.5H985V350.5H982M988 349.5H991V350.5H988M994 349.5H997V350.5H994M1000 349.5H1003V350.5H1000M1006 349.5H1009V350.5H1006M1012 349.5H1015V350.5H1012M1018 349.5H1021V350.5H1018M1024 349.5H1027V350.5H1024M1030 349.5H1033V350.5H1030M1036 349.5H1039V350.5H1036"/>
<text xml:space="preserve" transform="matrix(.71940049 0 0 .71940049 0 0)" font-size="12" font-family="ArialMT"><tspan y="344" x="774.625 781.297 784.633 787.969 795.973 799.969 806.641 809.305 813.30099 819.97299 822.63699 825.97299 832.64498 839.31698 845.31698 851.98898 855.32498 865.3209 871.9929 878.6649">5. Kreiraj novu mapu</tspan></text>
<path transform="matrix(.71940049,0,0,.71940049,.35970024,.35970024)" d="M1028 345 1038 350 1028 355V345Z"/>
<path transform="matrix(.71940049,0,0,.71940049,.35970024,.35970024)" stroke-width="1" stroke-linecap="butt" stroke-miterlimit="10" stroke-linejoin="miter" fill="none" stroke="#000000" d="M1028 345 1038 350 1028 355V345Z"/>
<path transform="matrix(.71940049,0,0,.71940049,.35970024,.35970024)" d="M358.06 492.9981 358.0713 489.99815 359.0713 490.00193 359.06 493.0019M358.08256 486.99815 358.09385 483.99818 359.09385 484.00196 359.08256 487.00193M358.1051 480.9982 358.1164 477.99824 359.1164 478.002 359.1051 481.00199M358.1277 474.99824 358.13896 471.99827 359.13896 472.00205 359.1277 475.002M358.15025 468.9983 358.1615 465.9983 359.1615 466.00209 359.15025 469.00209M358.1728 462.99833 358.18409 459.99836 359.18409 460.00215 359.1728 463.0021M358.19535 456.99836 358.20664 453.99839 359.20664 454.00218 359.19535 457.00215M358.2179 450.9984 358.2292 447.9984 359.2292 448.0022 359.2179 451.0022M358.24049 444.99845 358.25175 441.99848 359.25175 442.00227 359.24049 445.00224M358.26304 438.99848 358.2743 435.9985 359.2743 436.0023 359.26304 439.00227M358.28559 432.99855 358.29689 429.99858 359.29689 430.00236 359.28559 433.00233M358.30815 426.99858 358.31944 423.9986 359.31944 424.00239 359.30815 427.00236M358.3307 420.99864 358.34199 417.99867 359.34199 418.00245 359.3307 421.0024M358.35328 414.99867 358.36454 411.9987 359.36454 412.00248 359.35328 415.00245M358.37583 408.99873 358.3871 405.99873 359.3871 406.0025 359.37583 409.0025M358.39839 402.99876 358.40968 399.99879 359.40968 400.00257 359.39839 403.00254M358.42094 396.99879 358.43223 393.9988 359.43223 394.0026 359.42094 397.00257M358.44349 390.99885 358.45478 387.99885 359.45478 388.00263 359.44349 391.00263M358.46607 384.99888 358.47734 381.9989 359.47734 382.0027 359.46607 385.00267M358.48863 378.9989 358.49989 375.99894 359.49989 376.00273 359.48863 379.0027M358.51118 372.99897 358.52247 369.99897 359.52247 370.00276 359.51118 373.00276M358.53373 366.999 358.545 363.99903 359.545 364.0028 359.53373 367.00279M358.55628 360.99903 358.56758 357.99909 359.56758 358.00288 359.55628 361.0028M358.57887 354.99909 358.59013 351.9991 359.59013 352.0029 359.57887 355.00288M358.6014 348.99916 358.61268 345.99916 359.61268 346.00294 359.6014 349.00294M358.62397 342.99919 358.63526 339.9992 359.63526 340.003 359.62397 343.00297M358.6465 336.9992 358.6578 333.99925 359.6578 334.00303 359.6465 337.003M358.66908 330.99928 358.68037 327.99928 359.68037 328.00306 359.66908 331.00306M358.69166 324.9993 358.7029 321.99934 359.7029 322.0031 359.69166 325.00309M358.7142 318.99934 358.72547 315.99937 359.72547 316.00315 359.7142 319.0031M358.73677 312.9994 358.74806 309.9994 359.74806 310.00318 359.73677 313.00318M358.7593 306.99943 358.7706 303.99946 359.7706 304.00325 359.7593 307.0032M358.78187 300.99946 358.79316 297.9995 359.79316 298.0033 359.78187 301.00325M358.80445 294.9995 358.8157 291.9995 359.8157 292.0033 359.80445 295.0033M358.827 288.99958 358.83827 285.99958 359.83827 286.00337 359.827 289.00337M358.84956 282.9996 358.86085 279.99964 359.86085 280.00343 359.84956 283.0034M358.8721 276.99964 358.8834 273.99967 359.8834 274.00346 359.8721 277.00343M358.89466 270.9997 358.90596 267.9997 359.90596 268.00349 359.89466 271.00349M358.91725 264.99974 358.9285 261.99977 359.9285 262.00355 359.91725 265.0035M358.9398 258.99977 358.95106 255.9998 359.95106 256.00358 359.9398 259.00355M358.96235 252.99983 358.97364 249.99985 359.97364 250.0036 359.96235 253.00359M358.9849 246.99987 358.9962 243.9999 359.9962 244.00365 359.9849 247.00362M359.00746 240.99991 359.01875 237.99994 360.01875 238.0037 360.00746 241.00366M359.03004 234.99996 359.0413 231.99999 360.0413 232.00374 360.03004 235.00371M359.05259 228.99999 359.06385 226.00002 360.06385 226.00377 360.05259 229.00374M359.07514 223.00005 359.08644 220.00005 360.08644 220.0038 360.07514 223.0038M359.0977 217.00008 359.10899 214.0001 360.10899 214.00386 360.0977 217.00383M359.12025 211.00014 359.13154 208.00014 360.13154 208.00389 360.12025 211.00389M359.14283 205.00017 359.15409 202.0002 360.15409 202.00395 360.14283 205.00392M359.16539 199.0002 359.17665 196.00023 360.17665 196.00399 360.16539 199.00395M359.18794 193.00026 359.19923 190.00026 360.19923 190.00402 360.18794 193.00402M359.21049 187.00029 359.22178 184.00032 360.22178 184.00408 360.21049 187.00405M359.23304 181.00035 359.24433 178.00035 360.24433 178.0041 360.23304 181.0041M359.2556 175.00038 359.26689 172.00041 360.26689 172.00417 360.2556 175.00414M359.27818 169.00041 359.28944 166.00045 360.28944 166.0042 360.27818 169.00417M359.30073 163.00048 359.312 160.00048 360.312 160.00423 360.30073 163.00423M359.32328 157.0005 359.33457 154.00054 360.33457 154.00429 360.32328 157.00426M359.34584 151.00054 359.35713 148.00057 360.35713 148.00432 360.34584 151.00429M359.3684 145.0006 359.37968 142.00063 360.37968 142.00438 360.3684 145.00435M359.39097 139.00063 359.40223 136.00066 360.40223 136.00441 360.39097 139.00438M359.4135 133.00069 359.4248 130.00069 360.4248 130.00444 360.4135 133.00444M359.43608 127.00072 359.44737 124.00075 360.44737 124.0045 360.43608 127.00447M359.45863 121.00075 359.4699 118.00078 360.4699 118.00453 360.45863 121.0045M359.4812 115.00081 359.49247 112.00084 360.49247 112.00459 360.4812 115.00456"/>
<path transform="matrix(.71940049,0,0,.71940049,.35970024,.35970024)" d="M350 144H370V204H350Z" fill="#ffffff"/>
<path transform="matrix(.71940049,0,0,.71940049,.35970024,.35970024)" stroke-width="1" stroke-linecap="butt" stroke-miterlimit="4" stroke-linejoin="miter" fill="none" stroke="#000000" d="M350 144H370V204H350Z"/>
<path transform="matrix(.71940049,0,0,.71940049,.35970024,.35970024)" d="M360 359.5H363V360.5H360M366 359.5H369V360.5H366M372 359.5H375V360.5H372M378 359.5H381V360.5H378M384 359.5H387V360.5H384M390 359.5H393V360.5H390M396 359.5H399V360.5H396M402 359.5H405V360.5H402M408 359.5H411V360.5H408M414 359.5H417V360.5H414M420 359.5H423V360.5H420M426 359.5H429V360.5H426M432 359.5H435V360.5H432M438 359.5H441V360.5H438M444 359.5H447V360.5H444M450 359.5H453V360.5H450M456 359.5H459V360.5H456M462 359.5H465V360.5H462M468 359.5H471V360.5H468M474 359.5H477V360.5H474M480 359.5H483V360.5H480M486 359.5H489V360.5H486M492 359.5H495V360.5H492M498 359.5H501V360.5H498M504 359.5H507V360.5H504M510 359.5H513V360.5H510M516 359.5H519V360.5H516M522 359.5H525V360.5H522M528 359.5H531V360.5H528M534 359.5H537V360.5H534M540 359.5H543V360.5H540M546 359.5H549V360.5H546M552 359.5H555V360.5H552M558 359.5H561V360.5H558M564 359.5H567V360.5H564M570 359.5H573V360.5H570M576 359.5H579V360.5H576M582 359.5H585V360.5H582M588 359.5H590V360.5H588"/>
<path transform="matrix(-.71940049,0,0,-.71940049,526.9608,518.32809)" d="M361 356 371 360 361 364V356Z"/>
<path transform="matrix(-.71940049,0,0,-.71940049,526.9608,518.32809)" stroke-width="1" stroke-linecap="butt" stroke-miterlimit="10" stroke-linejoin="miter" fill="none" stroke="#000000" d="M361 356 371 360 361 364V356Z"/>
<text xml:space="preserve" transform="matrix(.71940049 0 0 .71940049 0 0)" font-size="12" font-family="ArialMT"><tspan y="354" x="408.29689 414.96888 418.30488 421.64088 424.97688 431.64888 434.31288 440.31288 442.97688 445.64088 452.31288 454.97688 457.64088 463.64088 470.31288 476.31288 482.98487 489.65687 496.32887 499.66487 509.66087 516.3329 523.0049">6. Inicijalizovana mapa</tspan></text>
<path transform="matrix(.71940049,0,0,.71940049,.35970024,.35970024)" d="M160 399.5H163V400.5H160M166 399.5H169V400.5H166M172 399.5H175V400.5H172M178 399.5H181V400.5H178M184 399.5H187V400.5H184M190 399.5H193V400.5H190M196 399.5H199V400.5H196M202 399.5H205V400.5H202M208 399.5H211V400.5H208M214 399.5H217V400.5H214M220 399.5H223V400.5H220M226 399.5H229V400.5H226M232 399.5H235V400.5H232M238 399.5H241V400.5H238M244 399.5H247V400.5H244M250 399.5H253V400.5H250M256 399.5H259V400.5H256M262 399.5H265V400.5H262M268 399.5H271V400.5H268M274 399.5H277V400.5H274M280 399.5H283V400.5H280M286 399.5H289V400.5H286M292 399.5H295V400.5H292M298 399.5H301V400.5H298M304 399.5H307V400.5H304M310 399.5H313V400.5H310M316 399.5H319V400.5H316M322 399.5H325V400.5H322M328 399.5H331V400.5H328M334 399.5H337V400.5H334M340 399.5H343V400.5H340M346 399.5H349V400.5H346M352 399.5H355V400.5H352M358 399.5H360V400.5H358"/>
<path transform="matrix(-.71940049,0,0,-.71940049,232.00666,575.8801)" d="M156 396 166 400 156 404V396Z"/>
<path transform="matrix(-.71940049,0,0,-.71940049,232.00666,575.8801)" stroke-width="1" stroke-linecap="butt" stroke-miterlimit="10" stroke-linejoin="miter" fill="none" stroke="#000000" d="M156 396 166 400 156 404V396Z"/>
<text xml:space="preserve" transform="matrix(.71940049 0 0 .71940049 0 0)" font-size="12" font-family="ArialMT"><tspan y="396" x="200.96875 207.64075 210.97675 214.31275 222.31674 226.31275 232.98474 238.98474 245.65674 249.65274 252.98874 258.98875 265.66075 268.99674 278.99275 285.66474 292.33674 299.00874">7. Prozor sa mapom</tspan></text>
<path transform="matrix(.71940049,0,0,.71940049,.35970024,.35970024)" stroke-width="1" stroke-linecap="butt" stroke-miterlimit="10" stroke-linejoin="miter" fill="none" stroke="#000000" d="M155 520 583.63 522.84"/>
<path transform="matrix(.71940049,0,0,.71940049,.35970024,.35970024)" d="M588.88 522.87 581.86 526.33 583.63 522.84 581.91 519.33 588.88 522.87Z"/>
<path transform="matrix(.71940049,0,0,.71940049,.35970024,.35970024)" stroke-width="1" stroke-linecap="butt" stroke-miterlimit="10" stroke-linejoin="miter" fill="none" stroke="#000000" d="M588.88 522.87 581.86 526.33 583.63 522.84 581.91 519.33 588.88 522.87Z"/>
<path transform="matrix(.71940049,0,0,.71940049,.35970024,.35970024)" d="M869.5 200V197H870.5V200M869.5 194V191H870.5V194M869.5 188V185H870.5V188M869.5 182V179H870.5V182M869.5 176V173H870.5V176M869.5 170V167H870.5V170M869.5 164V161H870.5V164M869.5 158V155H870.5V158M869.5 152V149H870.5V152M869.5 146V143H870.5V146M869.5 140V137H870.5V140M869.5 134V131H870.5V134M869.5 128V125H870.5V128M869.5 122V119H870.5V122M869.5 116V113H870.5V116"/>
<path transform="matrix(.71940049,0,0,.71940049,.35970024,.35970024)" d="M869.5 535V532H870.5V535M869.5 529V526H870.5V529M869.5 523V520H870.5V523M869.5 517V514H870.5V517M869.5 511V508H870.5V511M869.5 505V502H870.5V505M869.5 499V496H870.5V499M869.5 493V490H870.5V493M869.5 487V484H870.5V487M869.5 481V478H870.5V481M869.5 475V472H870.5V475M869.5 469V466H870.5V469M869.5 463V460H870.5V463M869.5 457V454H870.5V457M869.5 451V448H870.5V451M869.5 445V442H870.5V445M869.5 439V436H870.5V439M869.5 433V430H870.5V433M869.5 427V424H870.5V427M869.5 421V418H870.5V421M869.5 415V412H870.5V415M869.5 409V406H870.5V409M869.5 403V400H870.5V403M869.5 397V394H870.5V397M869.5 391V388H870.5V391M869.5 385V382H870.5V385M869.5 379V376H870.5V379M869.5 373V370H870.5V373M869.5 367V364H870.5V367M869.5 361V358H870.5V361M869.5 355V352H870.5V355M869.5 349V346H870.5V349M869.5 343V340H870.5V343M869.5 337V334H870.5V337M869.5 331V328H870.5V331M869.5 325V322H870.5V325M869.5 319V316H870.5V319M869.5 313V310H870.5V313M869.5 307V304H870.5V307M869.5 301V298H870.5V301M869.5 295V292H870.5V295M869.5 289V286H870.5V289M869.5 283V280H870.5V283M869.5 277V274H870.5V277M869.5 271V268H870.5V271M869.5 265V262H870.5V265"/>
<path transform="matrix(.71940049,0,0,.71940049,.35970024,.35970024)" d="M860 200H880V260H860Z" fill="#ffffff"/>
<path transform="matrix(.71940049,0,0,.71940049,.35970024,.35970024)" stroke-width="1" stroke-linecap="butt" stroke-miterlimit="4" stroke-linejoin="miter" fill="none" stroke="#000000" d="M860 200H880V260H860Z"/>
<path transform="matrix(.71940049,0,0,.71940049,.35970024,.35970024)" d="M1099.5 545V542H1100.5V545M1099.5 539V536H1100.5V539M1099.5 533V530H1100.5V533M1099.5 527V524H1100.5V527M1099.5 521V518H1100.5V521M1099.5 515V512H1100.5V515M1099.5 509V506H1100.5V509M1099.5 503V500H1100.5V503M1099.5 497V494H1100.5V497M1099.5 491V488H1100.5V491M1099.5 485V482H1100.5V485M1099.5 479V476H1100.5V479M1099.5 473V470H1100.5V473M1099.5 467V464H1100.5V467M1099.5 461V458H1100.5V461M1099.5 455V452H1100.5V455M1099.5 449V446H1100.5V449M1099.5 443V440H1100.5V443M1099.5 437V434H1100.5V437M1099.5 431V428H1100.5V431M1099.5 425V422H1100.5V425M1099.5 419V416H1100.5V419M1099.5 413V410H1100.5V413M1099.5 407V404H1100.5V407M1099.5 401V398H1100.5V401M1099.5 395V392H1100.5V395M1099.5 389V386H1100.5V389M1099.5 383V380H1100.5V383"/>
<path transform="matrix(.71940049,0,0,.71940049,.35970024,.35970024)" stroke-width="1" stroke-linecap="butt" stroke-miterlimit="10" stroke-linejoin="miter" fill="none" stroke="#000000" d="M610 560H1083.63"/>
<path transform="matrix(.71940049,0,0,.71940049,.35970024,.35970024)" d="M1088.88 560 1081.88 563.5 1083.63 560 1081.88 556.5 1088.88 560Z"/>
<path transform="matrix(.71940049,0,0,.71940049,.35970024,.35970024)" stroke-width="1" stroke-linecap="butt" stroke-miterlimit="10" stroke-linejoin="miter" fill="none" stroke="#000000" d="M1088.88 560 1081.88 563.5 1083.63 560 1081.88 556.5 1088.88 560Z"/>
<path transform="matrix(.71940049,0,0,.71940049,.35970024,.35970024)" d="M1099.5 720V717H1100.5V720M1099.5 714V711H1100.5V714M1099.5 708V705H1100.5V708M1099.5 702V699H1100.5V702M1099.5 696V693H1100.5V696M1099.5 690V687H1100.5V690M1099.5 684V681H1100.5V684M1099.5 678V675H1100.5V678M1099.5 672V669H1100.5V672M1099.5 666V663H1100.5V666M1099.5 660V657H1100.5V660M1099.5 654V651H1100.5V654M1099.5 648V645H1100.5V648M1099.5 642V639H1100.5V642M1099.5 636V633H1100.5V636M1099.5 630V627H1100.5V630M1099.5 624V621H1100.5V624M1099.5 618V615H1100.5V618M1099.5 612V609H1100.5V612M1099.5 606V605H1100.5V606"/>
<path transform="matrix(.71940049,0,0,.71940049,.35970024,.35970024)" d="M1090 545H1110V605H1090Z" fill="#ffffff"/>
<path transform="matrix(.71940049,0,0,.71940049,.35970024,.35970024)" stroke-width="1" stroke-linecap="butt" stroke-miterlimit="4" stroke-linejoin="miter" fill="none" stroke="#000000" d="M1090 545H1110V605H1090Z"/>
<path transform="matrix(.71940049,0,0,.71940049,.35970024,.35970024)" d="M868.7601 592.99148 868.81149 589.9919 869.81137 590.009 869.75997 593.00857M868.8629 586.9923 868.9143 583.9928 869.9142 584.0099 869.8628 587.0094M868.96578 580.9932 869.01718 577.99368 870.017 578.01077 869.96566 581.0103M869.0686 574.9941 869.12 571.99459 870.1199 572.01168 870.0685 575.01119M869.17147 568.995 869.22286 565.9954 870.2227 566.0125 870.1713 569.0121"/>
<text xml:space="preserve" transform="matrix(.71940049 0 0 .71940049 0 0)" font-size="12" font-family="ArialMT"><tspan y="554" x="800.2969 806.9689 810.3049 813.64089 822.97689 826.31289 832.31289 834.97689 837.64089 844.31289 850.31289 856.98489 859.64889 862.98489 868.98489 871.64889 878.32089 884.99288 891.66488 897.66488 904.33688 907.67288 914.34487 921.01687 923.68087 930.35287 936.35287">9. Otklju&#x010d;aj slede&#x0107;u oblast</tspan></text>
<path transform="matrix(.71940049,0,0,.71940049,.35970024,.35970024)" d="M621.00106 588.5 624.00106 588.5064 623.99899 589.5064 620.99899 589.5M627.00106 588.5128 630.00106 588.51919 629.99899 589.51919 626.99899 589.5128M633.00106 588.5256 636.001 588.532 635.9989 589.532 632.99899 589.5256M639.001 588.5384 642.001 588.5448 641.9989 589.5448 638.9989 589.5384M645.001 588.55117 648.001 588.55758 647.9989 589.55758 644.9989 589.55117M651.001 588.56399 654.001 588.5704 653.9989 589.5704 650.9989 589.56399M657.001 588.5768 660.001 588.5831 659.9989 589.5831 656.9989 589.5768M663.0009 588.58956 666.0009 588.59597 665.99887 589.59597 662.99887 589.58956M669.0009 588.60238 672.0009 588.60879 671.99887 589.60879 668.99887 589.60238M675.0009 588.6151 678.0009 588.6215 677.99887 589.6215 674.99887 589.6151M681.0009 588.6279 684.0009 588.63436 683.99887 589.63436 680.99887 589.6279M687.0009 588.64077 690.0009 588.6471 689.99887 589.6471 686.99887 589.64077M693.00088 588.6535 696.00088 588.6599 695.9988 589.6599 692.9988 589.6535M699.00088 588.6663 702.00088 588.6727 701.9988 589.6727 698.9988 589.6663M705.00088 588.6791 708.00088 588.6855 707.9988 589.6855 704.9988 589.6791M711.00088 588.6919 714.0008 588.6983 713.9987 589.6983 710.9988 589.6919M717.0008 588.7047 720.0008 588.71109 719.9987 589.71109 716.9987 589.7047M723.0008 588.71749 726.0008 588.7239 725.9987 589.7239 722.9987 589.71749M729.0008 588.7303 732.0008 588.7367 731.9987 589.7367 728.9987 589.7303M735.0008 588.74307 738.0008 588.74948 737.9987 589.74948 734.9987 589.74307M741.0008 588.75588 744.00076 588.76229 743.99868 589.76229 740.9987 589.75588M747.00076 588.7687 750.00076 588.775 749.99868 589.775 746.99868 589.7687M753.00076 588.78146 756.00076 588.78787 755.99868 589.78787 752.99868 589.78146M759.00076 588.79428 762.00076 588.80068 761.99868 589.80068 758.99868 589.79428M765.00076 588.807 768.0007 588.8134 767.9986 589.8134 764.99868 589.807M771.0007 588.8198 774.0007 588.82626 773.9986 589.82626 770.9986 589.8198M777.0007 588.83267 780.0007 588.839 779.9986 589.839 776.9986 589.83267M783.0007 588.8454 786.0007 588.8518 785.9986 589.8518 782.9986 589.8454M789.0007 588.8582 792.0007 588.8646 791.9986 589.8646 788.9986 589.8582M795.0007 588.871 798.0007 588.8774 797.9986 589.8774 794.9986 589.871M801.0006 588.8838 804.0006 588.8902 803.99856 589.8902 800.99856 589.8838M807.0006 588.8966 810.0006 588.90298 809.99856 589.90298 806.99856 589.8966M813.0006 588.90939 816.0006 588.9158 815.99856 589.9158 812.99856 589.90939M819.0006 588.9222 822.00057 588.9286 821.9985 589.9286 818.99856 589.9222M825.00057 588.93496 828.00057 588.94137 827.9985 589.94137 824.9985 589.93496M831.00057 588.94778 834.00057 588.95419 833.9985 589.95419 830.9985 589.94778M837.00057 588.9606 840.00057 588.967 839.9985 589.967 836.9985 589.9606M843.00057 588.9733 846.00057 588.97976 845.9985 589.97976 842.9985 589.9733M849.00057 588.98617 852.00057 588.99258 851.9985 589.99258 848.9985 589.98617M855.0005 588.99899 858.0005 589.0053 857.9984 590.0053 854.9984 589.99899M861.0005 589.0117 864.0005 589.0181 863.9984 590.0181 860.9984 590.0117M867.0005 589.02456 870.0005 589.03097 869.9984 590.03097 866.9984 590.02456M873.0005 589.0373 876.0004 589.0437 875.99838 590.0437 872.9984 590.0373M879.0004 589.0501 882.0004 589.0565 881.99838 590.0565 878.99838 590.0501M885.0004 589.0629 888.0004 589.0693 887.99838 590.0693 884.99838 590.0629M891.0004 589.0757 894.0004 589.0821 893.99838 590.0821 890.99838 590.0757M897.0004 589.0885 900.0004 589.0949 899.99838 590.0949 896.99838 590.0885M903.0004 589.10128 906.0004 589.10769 905.99838 590.10769 902.99838 590.10128M909.0004 589.1141 912.00039 589.1205 911.9983 590.1205 908.99838 590.1141M915.00039 589.1269 918.00039 589.13327 917.9983 590.13327 914.9983 590.1269M921.00039 589.13967 924.00039 589.14608 923.9983 590.14608 920.9983 590.13967M927.0003 589.15249 930.0003 589.1589 929.9982 590.1589 926.9982 590.15249M933.0003 589.1652 936.0003 589.17166 935.9982 590.17166 932.9982 590.1652M939.0003 589.17807 942.0003 589.18447 941.9982 590.18447 938.9982 590.17807M945.0003 589.19088 948.0003 589.1972 947.9982 590.1972 944.9982 590.19088M951.0003 589.2036 954.0003 589.21 953.9982 590.21 950.9982 590.2036M957.0003 589.21646 960.0003 589.22286 959.9982 590.22286 956.9982 590.21646M963.0003 589.2292 966.00027 589.2356 965.99819 590.2356 962.9982 590.2292M969.00027 589.242 972.00027 589.2484 971.99819 590.2484 968.99819 590.242M975.00027 589.2548 978.00027 589.26119 977.99819 590.26119 974.99819 590.2548M981.0002 589.2676 984.0002 589.274 983.9981 590.274 980.9981 590.2676M987.0002 589.2804 990.0002 589.2868 989.9981 590.2868 986.9981 590.2804M993.0002 589.29318 996.0002 589.29959 995.9981 590.29959 992.9981 590.29318M999.0002 589.30599 1002.0002 589.3124 1001.9981 590.3124 998.9981 590.30599M1005.0002 589.3188 1008.0002 589.32516 1007.9981 590.32516 1004.9981 590.3188M1011.0002 589.33157 1014.0002 589.33798 1013.9981 590.33798 1010.9981 590.33157M1017.0002 589.34439 1020.0001 589.35079 1019.99807 590.35079 1016.9981 590.34439M1023.0001 589.3571 1026.0001 589.3635 1025.9979 590.3635 1022.99807 590.3571M1029.0001 589.36996 1032.0001 589.37637 1031.9979 590.37637 1028.9979 590.36996M1035.0001 589.38278 1038.0001 589.3891 1037.9979 590.3891 1034.9979 590.38278M1041.0001 589.3955 1044.0001 589.4019 1043.9979 590.4019 1040.9979 590.3955M1047.0001 589.4083 1050.0001 589.41476 1049.9979 590.41476 1046.9979 590.4083M1053.0001 589.4211 1056.0001 589.4275 1055.9979 590.4275 1052.9979 590.4211M1059.0001 589.4339 1062.0001 589.4403 1061.9979 590.4403 1058.9979 590.4339M1065.0001 589.4467 1068.0001 589.45309 1067.9979 590.45309 1064.9979 590.4467M1071.0001 589.4595 1074.0001 589.4659 1073.9979 590.4659 1070.9979 590.4595M1077.0001 589.4723 1080.0001 589.4787 1079.9979 590.4787 1076.9979 590.4723M1083.0001 589.48507 1086 589.49148 1085.9978 590.49148 1082.9979 590.48507M1089 589.49789 1090.0011 589.5 1089.9989 590.5 1088.9978 590.49789"/>
<path transform="matrix(-.71940049,0,0,-.71940049,886.66116,847.8135)" d="M611 585 621 589 611 593V585Z"/>
<path transform="matrix(-.71940049,0,0,-.71940049,886.66116,847.8135)" stroke-width="1" stroke-linecap="butt" stroke-miterlimit="10" stroke-linejoin="miter" fill="none" stroke="#000000" d="M611 585 621 589 611 593V585Z"/>
<path transform="matrix(.71940049,0,0,.71940049,.35970024,.35970024)" d="M868.08 685.9973 868.0962 682.9974 869.0962 683.00277 869.08 686.0027M868.11239 679.9974 868.1286 676.99746 869.1286 677.0028 869.11239 680.00277M868.1448 673.9975 868.16098 670.99758 869.16098 671.0029 869.1448 674.00289M868.1771 667.99758 868.19338 664.9976 869.19338 665.003 869.1771 668.0029M868.20956 661.9977 868.2257 658.9977 869.2257 659.00308 869.20956 662.00308M868.2419 655.99777 868.2581 652.9978 869.2581 653.0032 869.2419 656.0031M868.2743 649.99789 868.29049 646.99789 869.29049 647.00326 869.2743 650.00326M868.30667 643.9979 868.3229 640.998 869.3229 641.00338 869.30667 644.0033M868.33908 637.998 868.3552 634.99807 869.3552 635.0034 869.33908 638.00338M868.3714 631.9981 868.3876 628.99819 869.3876 629.00357 869.3714 632.0035M868.4038 625.99819 868.42 622.9982 869.42 623.0036 869.4038 626.00357"/>
<text xml:space="preserve" transform="matrix(.71940049 0 0 .71940049 0 0)" font-size="12" font-family="ArialMT"><tspan y="612" x="816.96878 823.64077 830.31277 833.64877 836.32229 844.3263 850.3263 856.9983 860.99429 863.65829 867.65426 874.32626 880.9982 887.6702 891.0062 901.0022 907.6742 914.3462">10. A&#x017e;urirana mapa</tspan></text>
<path transform="matrix(.71940049,0,0,.71940049,.35970024,.35970024)" d="M1099 856V853H1100V856M1099 850V847H1100V850M1099 844V841H1100V844M1099 838V835H1100V838M1099 832V829H1100V832M1099 826V823H1100V826M1099 820V817H1100V820M1099 814V811H1100V814M1099 808V805H1100V808M1099 802V799H1100V802M1099 796V793H1100V796M1099 790V787H1100V790M1099 784V781H1100V784M1099 778V775H1100V778M1099 772V769H1100V772M1099 766V763H1100V766M1099 760V757H1100V760M1099 754V751H1100V754M1099 748V745H1100V748M1099 742V739H1100V742M1099 736V733H1100V736M1099 730V727H1100V730M1099 724V721H1100V724M1099 718V716H1100V718"/>
<path transform="matrix(.71940049,0,0,.71940049,.35970024,.35970024)" d="M869.18 743.995 869.21 740.9951 870.21 741.0051 870.18 744.005"/>
<path transform="matrix(.71940049,0,0,.71940049,.35970024,.35970024)" d="M599.5 140V137H600.5V140M599.5 134V131H600.5V134M599.5 128V125H600.5V128M599.5 122V119H600.5V122M599.5 116V113H600.5V116"/>
<path transform="matrix(.71940049,0,0,.71940049,.35970024,.35970024)" stroke-width="1" stroke-linecap="butt" stroke-miterlimit="10" stroke-linejoin="miter" fill="none" stroke="#000000" d="M160 163 343.63 162.03"/>
<path transform="matrix(.71940049,0,0,.71940049,.35970024,.35970024)" d="M348.88 162.01 341.9 165.54 343.63 162.03 341.86 158.54 348.88 162.01Z"/>
<path transform="matrix(.71940049,0,0,.71940049,.35970024,.35970024)" stroke-width="1" stroke-linecap="butt" stroke-miterlimit="10" stroke-linejoin="miter" fill="none" stroke="#000000" d="M348.88 162.01 341.9 165.54 343.63 162.03 341.86 158.54 348.88 162.01Z"/>
<text xml:space="preserve" transform="matrix(.71940049 0 0 .71940049 0 0)" font-size="12" font-family="ArialMT"><tspan y="158" x="210.29688 216.96887 220.30487 223.64087 230.97287 237.64487 244.31687 250.98886 256.98887 263.66087 266.32487 269.66087 272.32487 278.99687 282.99287">1. Zapo&#x010d;ni igru</tspan></text>
<path transform="matrix(.71940049,0,0,.71940049,.35970024,.35970024)" d="M609 959.5H610V960.5H609"/>
<text xml:space="preserve" transform="matrix(.71940049 0 0 .71940049 0 0)" font-size="12" font-family="ArialMT"><tspan y="487" x="98.9375 101.6015 108.2735 114.945499 121.61749 124.95349 128.28949 134.96149 141.63349 147.63349 150.96949 156.96949 163.64148 166.97748 173.64948 180.32147 183.65747 190.32947 194.32547 200.99747 207.66947 214.34146 217.67746 224.34946 227.68546 230.34946 237.02146 243.02146 249.69345 255.69345 258.35746 261.02146 267.69346">loop [dok se ne pre&#x0111;e 6 lokacija]</tspan></text>
<text xml:space="preserve" transform="matrix(.71940049 0 0 .71940049 0 0)" font-size="12" font-family="ArialMT"><tspan y="447" x="53.59375 56.25775 62.929754 69.60175 76.27376 79.60976 82.945758 89.61775 96.28975 102.28975 105.62575 111.62575 118.297748 121.63374 128.30574 134.97774 138.31374 144.98574 148.98174 155.65373 162.32573 168.99773 172.33373 178.33373 184.33373 191.00572 194.34172 201.01372 204.34972 211.02172 217.69371 220.35771 227.02971 233.02971 236.3657 239.02971">loop [dok se ne pre&#x0111;u sve 4 oblasti]</tspan></text>
<path transform="matrix(.71940049,0,0,.71940049,.35970024,.35970024)" stroke-width="1" stroke-linecap="butt" stroke-miterlimit="10" stroke-linejoin="miter" fill="none" stroke="#000000" d="M610 720H1093.63"/>
<path transform="matrix(.71940049,0,0,.71940049,.35970024,.35970024)" d="M1098.88 720 1091.88 723.5 1093.63 720 1091.88 716.5 1098.88 720Z"/>
<path transform="matrix(.71940049,0,0,.71940049,.35970024,.35970024)" stroke-width="1" stroke-linecap="butt" stroke-miterlimit="10" stroke-linejoin="miter" fill="none" stroke="#000000" d="M1098.88 720 1091.88 723.5 1093.63 720 1091.88 716.5 1098.88 720Z"/>
<path transform="matrix(.71940049,0,0,.71940049,.35970024,.35970024)" d="M870.3653 710.93167 870.7754 713.9035 869.7848 714.0402 869.3747 711.06838"/>
<text xml:space="preserve" transform="matrix(.71940049 0 0 .71940049 0 0)" font-size="12" font-family="ArialMT"><tspan y="705" x="792.8906 798.6738 805.3458 808.6818 812.0178 820.6818 827.3538 834.0258 840.0258 846.6978 850.0338 852.6978 856.0338 862.0338 868.7058 875.3778 882.0498 888.0498 894.7218 901.3938 904.7298 908.72579 915.39779 921.39779 928.06979 930.73379 934.06979 940.74179">11. Dohvati kona&#x010d;an rezultat</tspan></text>
<path transform="matrix(.71940049,0,0,.71940049,.35970024,.35970024)" d="M611.00057 739.5 614.00057 739.50338 613.99948 740.50338 610.99948 740.5M617.00057 739.5068 620.00057 739.51016 619.99948 740.51016 616.99948 740.5068M623.00057 739.5135 626.00057 739.51687 625.99948 740.51687 622.99948 740.5135M629.00057 739.52029 632.00057 739.5236 631.99948 740.5236 628.99948 740.52029M635.00057 739.527 638.00057 739.5304 637.99948 740.5304 634.99948 740.527M641.00057 739.53378 644.00057 739.5371 643.99948 740.5371 640.99948 740.53378M647.00057 739.54049 650.00057 739.5439 649.99948 740.5439 646.99948 740.54049M653.00057 739.54727 656.00057 739.5506 655.99948 740.5506 652.99948 740.54727M659.00057 739.554 662.00057 739.5574 661.99948 740.5574 658.99948 740.554M665.00057 739.5607 668.0005 739.5641 667.9994 740.5641 664.99948 740.5607M671.0005 739.5675 674.0005 739.57089 673.9994 740.57089 670.9994 740.5675M677.0005 739.5742 680.0005 739.5776 679.9994 740.5776 676.9994 740.5742M683.0005 739.581 686.0005 739.58438 685.9994 740.58438 682.9994 740.581M689.0005 739.5877 692.0005 739.5911 691.9994 740.5911 688.9994 740.5877M695.0005 739.5945 698.0005 739.59786 697.9994 740.59786 694.9994 740.5945M701.0005 739.6012 704.0005 739.6046 703.9994 740.6046 700.9994 740.6012M707.0005 739.608 710.0005 739.6113 709.9994 740.6113 706.9994 740.608M713.0005 739.61477 716.0005 739.6181 715.9994 740.6181 712.9994 740.61477M719.0005 739.62149 722.0005 739.6248 721.9994 740.6248 718.9994 740.62149M725.0005 739.62826 728.0005 739.6316 727.9994 740.6316 724.9994 740.62826M731.0005 739.63497 734.0005 739.63839 733.9994 740.63839 730.9994 740.63497M737.0005 739.6417 740.0005 739.6451 739.9994 740.6451 736.9994 740.6417M743.0005 739.64846 746.0005 739.65188 745.9994 740.65188 742.9994 740.64846M749.0005 739.6552 752.0004 739.65859 751.9993 740.65859 748.9994 740.6552M755.0004 739.662 758.0004 739.66537 757.9993 740.66537 754.9993 740.662M761.0004 739.6687 764.0004 739.67208 763.9993 740.67208 760.9993 740.6687M767.0004 739.6755 770.0004 739.67886 769.9993 740.67886 766.9993 740.6755M773.0004 739.6822 776.0004 739.6856 775.9993 740.6856 772.9993 740.6822M779.0004 739.68899 782.0004 739.6923 781.9993 740.6923 778.9993 740.68899M785.0004 739.6957 788.0004 739.6991 787.9993 740.6991 784.9993 740.6957M791.0004 739.70248 794.0004 739.7058 793.9993 740.7058 790.9993 740.70248M797.0004 739.70919 800.0004 739.7126 799.9993 740.7126 796.9993 740.70919M803.0004 739.71597 806.0004 739.7193 805.9993 740.7193 802.9993 740.71597M809.0004 739.7227 812.0004 739.7261 811.9993 740.7261 808.9993 740.7227M815.0004 739.72946 818.0004 739.7328 817.9993 740.7328 814.9993 740.72946M821.0004 739.7362 824.0004 739.73959 823.9993 740.73959 820.9993 740.7362M827.0004 739.7429 830.0004 739.74636 829.9993 740.74636 826.9993 740.7429M833.0004 739.7497 836.0004 739.75308 835.9993 740.75308 832.9993 740.7497M839.0004 739.7564 842.0004 739.7598 841.9993 740.7598 838.9993 740.7564M845.0004 739.7632 848.0004 739.76657 847.9993 740.76657 844.9993 740.7632M851.0004 739.76998 854.0004 739.7733 853.9993 740.7733 850.9993 740.76998M857.0004 739.7767 860.0004 739.78 859.9993 740.78 856.9993 740.7767M863.0004 739.78347 866.0004 739.7868 865.9993 740.7868 862.9993 740.78347M869.0004 739.79019 872.0004 739.7936 871.9993 740.7936 868.9993 740.79019M875.0004 739.79696 878.0004 739.8003 877.9993 740.8003 874.9993 740.79696M881.0004 739.80368 884.0004 739.80709 883.9993 740.80709 880.9993 740.80368M887.0004 739.8104 890.0004 739.8138 889.9993 740.8138 886.9993 740.8104M893.00039 739.8172 896.00039 739.82058 895.99929 740.82058 892.99929 740.8172M899.00039 739.8239 902.00039 739.8273 901.99929 740.8273 898.99929 740.8239M905.00039 739.8307 908.00039 739.83407 907.99929 740.83407 904.99929 740.8307M911.00039 739.8374 914.00039 739.84078 913.99929 740.84078 910.99929 740.8374M917.00039 739.8442 920.00039 739.84756 919.99929 740.84756 916.99929 740.8442M923.00039 739.8509 926.00039 739.8543 925.99929 740.8543 922.99929 740.8509M929.00039 739.85769 932.00039 739.861 931.99929 740.861 928.99929 740.85769M935.00039 739.8644 938.00039 739.8678 937.99929 740.8678 934.99929 740.8644M941.00039 739.87118 944.0003 739.8745 943.9992 740.8745 940.99929 740.87118M947.0003 739.8779 950.0003 739.8813 949.9992 740.8813 946.9992 740.8779M953.0003 739.88467 956.0003 739.888 955.9992 740.888 952.9992 740.88467M959.0003 739.8914 962.0003 739.8948 961.9992 740.8948 958.9992 740.8914M965.0003 739.89816 968.0003 739.90158 967.9992 740.90158 964.9992 740.89816M971.0003 739.9049 974.0003 739.90829 973.9992 740.90829 970.9992 740.9049M977.0003 739.9116 980.0003 739.91506 979.9992 740.91506 976.9992 740.9116M983.0003 739.9184 986.0003 739.92178 985.9992 740.92178 982.9992 740.9184M989.0003 739.9252 992.0003 739.9285 991.9992 740.9285 988.9992 740.9252M995.0003 739.9319 998.0003 739.93527 997.9992 740.93527 994.9992 740.9319M1001.0003 739.93869 1004.0003 739.942 1003.9992 740.942 1000.9992 740.93869M1007.0003 739.9454 1010.0003 739.9488 1009.9992 740.9488 1006.9992 740.9454M1013.0003 739.95217 1016.0003 739.9555 1015.9992 740.9555 1012.9992 740.95217M1019.0003 739.95889 1022.0003 739.9623 1021.9992 740.9623 1018.9992 740.95889M1025.0004 739.96566 1028.0004 739.969 1027.9992 740.969 1024.9992 740.96566M1031.0004 739.9724 1034.0004 739.97579 1033.9992 740.97579 1030.9992 740.9724M1037.0004 739.9791 1040.0004 739.9825 1039.9992 740.9825 1036.9992 740.9791M1043.0004 739.9859 1046.0004 739.98928 1045.9992 740.98928 1042.9992 740.9859M1049.0004 739.9926 1052.0004 739.996 1051.9992 740.996 1048.9992 740.9926M1055.0004 739.9994 1058.0004 740.00277 1057.9992 741.00277 1054.9992 740.9994M1061.0004 740.0061 1064.0004 740.0095 1063.9992 741.0095 1060.9992 741.0061M1067.0004 740.0129 1070.0004 740.01626 1069.9992 741.01626 1066.9992 741.0129M1073.0004 740.0196 1076.0004 740.023 1075.9992 741.023 1072.9992 741.0196M1079.0004 740.02639 1082.0004 740.0297 1081.9992 741.0297 1078.9992 741.02639M1085.0004 740.03317 1088.0004 740.0365 1087.9992 741.0365 1084.9992 741.03317M1091.0004 740.03988 1094.0004 740.0432 1093.9992 741.0432 1090.9992 741.03988M1097.0004 740.04666 1100.0004 740.05 1099.9992 741.05 1096.9992 741.04666"/>
<path transform="matrix(-.71940049,0,0,-.71940049,886.66116,1065.0724)" d="M611 736 621 740 611 744V736Z"/>
<path transform="matrix(-.71940049,0,0,-.71940049,886.66116,1065.0724)" stroke-width="1" stroke-linecap="butt" stroke-miterlimit="10" stroke-linejoin="miter" fill="none" stroke="#000000" d="M611 736 621 740 611 744V736Z"/>
<path transform="matrix(.71940049,0,0,.71940049,.35970024,.35970024)" stroke-width="1" stroke-linecap="butt" stroke-miterlimit="10" stroke-linejoin="miter" fill="none" stroke="#000000" d="M157 799 583.63 801.42"/>
<path transform="matrix(.71940049,0,0,.71940049,.35970024,.35970024)" d="M588.88 801.45 581.86 804.91 583.63 801.42 581.9 797.91 588.88 801.45Z"/>
<path transform="matrix(.71940049,0,0,.71940049,.35970024,.35970024)" stroke-width="1" stroke-linecap="butt" stroke-miterlimit="10" stroke-linejoin="miter" fill="none" stroke="#000000" d="M588.88 801.45 581.86 804.91 583.63 801.42 581.9 797.91 588.88 801.45Z"/>
<path transform="matrix(.71940049,0,0,.71940049,.35970024,.35970024)" d="M157.00116 838.5 160.00115 838.50698 159.99883 839.50698 156.99884 839.5M163.00115 838.51388 166.00113 838.5208 165.99881 839.5208 162.99883 839.51388M169.00113 838.5277 172.00112 838.53469 171.9988 839.53469 168.99881 839.5277M175.00112 838.54159 178.0011 838.5485 177.99878 839.5485 174.9988 839.54159M181.0011 838.5554 184.00109 838.5624 183.99877 839.5624 180.99878 839.5554M187.00109 838.5693 190.00107 838.57626 189.99875 839.57626 186.99877 839.5693M193.00107 838.5831 196.00106 838.5901 195.99874 839.5901 192.99875 839.5831M199.00104 838.597 202.00104 838.60397 201.99872 839.60397 198.99872 839.597M205.00104 838.61087 208.00102 838.6178 207.9987 839.6178 204.99872 839.61087M211.001 838.6247 214.001 838.63168 213.99869 839.63168 210.99869 839.6247M217.00099 838.63858 220.00099 838.6455 219.99868 839.6455 216.99868 839.63858M223.00098 838.6524 226.00098 838.65939 225.99866 839.65939 222.99866 839.6524M229.00096 838.66629 232.00095 838.6732 231.99863 839.6732 228.99864 839.66629M235.00095 838.6801 238.00095 838.6871 237.99863 839.6871 234.99863 839.6801M241.00093 838.694 244.00092 838.7009 243.9986 839.7009 240.99861 839.694M247.00092 838.7078 250.00092 838.7148 249.9986 839.7148 246.9986 839.7078M253.0009 838.7217 256.0009 838.72866 255.99857 839.72866 252.99858 839.7217M259.0009 838.73556 262.00086 838.7425 261.99855 839.7425 258.99858 839.73556M265.00086 838.74948 268.00086 838.75637 267.99855 839.75637 264.99855 839.74948M271.00086 838.7633 274.00086 838.7702 273.99855 839.7702 270.99855 839.7633M277.00083 838.77719 280.00083 838.78408 279.9985 839.78408 276.9985 839.77719M283.00083 838.791 286.0008 838.7979 285.99848 839.7979 282.9985 839.791M289.0008 838.8049 292.0008 838.81179 291.99848 839.81179 288.99848 839.8049M295.0008 838.8187 298.0008 838.8256 297.99848 839.8256 294.99848 839.8187M301.00077 838.8326 304.00077 838.8395 303.99845 839.8395 300.99845 839.8326M307.00074 838.84646 310.00074 838.85336 309.9984 839.85336 306.9984 839.84646M313.00074 838.8603 316.00074 838.8672 315.9984 839.8672 312.9984 839.8603M319.00074 838.87417 322.0007 838.88107 321.99839 839.88107 318.9984 839.87417M325.0007 838.888 328.00068 838.8949 327.99836 839.8949 324.99839 839.888M331.00068 838.90188 334.00068 838.90878 333.99836 839.90878 330.99836 839.90188M337.00068 838.9157 340.00068 838.9226 339.99836 839.9226 336.99836 839.9157M343.00068 838.92959 346.00065 838.93649 345.99833 839.93649 342.99836 839.92959M349.00065 838.9434 352.0006 838.9503 351.9983 839.9503 348.99833 839.9434M355.0006 838.9573 358.0006 838.9642 357.9983 839.9642 354.9983 839.9573M361.0006 838.9711 364.0006 838.9781 363.9983 839.9781 360.9983 839.9711M367.00059 838.985 370.00059 838.99197 369.99827 839.99197 366.99827 839.985M373.00056 838.99887 376.00056 839.0058 375.99824 840.0058 372.99824 839.99887M379.00056 839.0127 382.00056 839.01968 381.99824 840.01968 378.99824 840.0127M385.00056 839.02658 388.00053 839.0335 387.9982 840.0335 384.99824 840.02658M391.00053 839.0404 394.0005 839.04739 393.99818 840.04739 390.9982 840.0404M397.0005 839.05429 400.0005 839.0612 399.99818 840.0612 396.99818 840.05429M403.0005 839.0681 406.0005 839.0751 405.99818 840.0751 402.99818 840.0681M409.0005 839.082 412.00047 839.0889 411.99815 840.0889 408.99818 840.082M415.00047 839.0958 418.00047 839.1028 417.99815 840.1028 414.99815 840.0958M421.00044 839.1097 424.00044 839.11666 423.9981 840.11666 420.9981 840.1097M427.00044 839.12356 430.0004 839.1305 429.99809 840.1305 426.9981 840.12356M433.0004 839.1374 436.0004 839.14437 435.99809 840.14437 432.99809 840.1374M439.0004 839.15127 442.00038 839.1582 441.99806 840.1582 438.99809 840.15127M445.00038 839.1651 448.00038 839.17208 447.99806 840.17208 444.99806 840.1651M451.00038 839.17898 454.00035 839.1859 453.99803 840.1859 450.99806 840.17898M457.00035 839.1928 460.00035 839.19979 459.99803 840.19979 456.99803 840.1928M463.00035 839.20669 466.0003 839.2136 465.998 840.2136 462.99803 840.20669M469.0003 839.2206 472.0003 839.2275 471.998 840.2275 468.998 840.2206M475.00028 839.23446 478.00028 839.24136 477.99797 840.24136 474.99797 840.23446M481.00028 839.2483 484.00028 839.2552 483.99797 840.2552 480.99797 840.2483M487.00025 839.26217 490.00025 839.26907 489.99794 840.26907 486.99794 840.26217M493.00025 839.276 496.00025 839.2829 495.99794 840.2829 492.99794 840.276M499.0002 839.28988 502.0002 839.29678 501.9979 840.29678 498.9979 840.28988M505.0002 839.3037 508.00019 839.3106 507.99787 840.3106 504.9979 840.3037M511.00019 839.31759 514.0002 839.32449 513.99789 840.32449 510.99787 840.31759M517.0002 839.3314 520.0002 839.3383 519.99789 840.3383 516.99789 840.3314M523.0002 839.3453 526.0002 839.3522 525.99789 840.3522 522.99789 840.3453M529.0002 839.35916 532.0001 839.366 531.9978 840.366 528.99789 840.35916M535.0001 839.373 538.0001 839.3799 537.9978 840.3799 534.9978 840.373M541.0001 839.38687 544.00009 839.39376 543.99777 840.39376 540.9978 840.38687M547.00009 839.4007 550.00009 839.4076 549.99777 840.4076 546.99777 840.4007M553.00009 839.41458 556.00009 839.42147 555.99777 840.42147 552.99777 840.41458M559.00009 839.4284 562.00009 839.4353 561.99777 840.4353 558.99777 840.4284M565.00009 839.44229 568.00009 839.4492 567.99777 840.4492 564.99777 840.44229M571.00009 839.4561 574.00009 839.4631 573.99777 840.4631 570.99777 840.4561M577 839.47 580 839.4769 579.9977 840.4769 576.9977 840.47M583 839.4838 585.99996 839.4908 585.9976 840.4908 582.9977 840.4838M588.99996 839.4977 590.00119 839.5 589.99887 840.5 588.9976 840.4977"/>
<path transform="matrix(-.71940049,0,0,-.71940049,233.44547,1207.5137)" d="M157 835 167 839 157 843V835Z"/>
<path transform="matrix(-.71940049,0,0,-.71940049,233.44547,1207.5137)" stroke-width="1" stroke-linecap="butt" stroke-miterlimit="10" stroke-linejoin="miter" fill="none" stroke="#000000" d="M157 835 167 839 157 843V835Z"/>
<path transform="matrix(.71940049,0,0,.71940049,.35970024,.35970024)" d="M359.06 770.99819 359.0709 767.99819 360.0709 768.00186 360.06 771.00186M359.08183 764.9982 359.0927 761.9982 360.0927 762.0019 360.08183 765.0019M359.10365 758.9982 359.11454 755.9983 360.11454 756.00198 360.10365 759.0019M359.12547 752.9983 359.13636 749.9983 360.13636 750.00198 360.12547 753.00198M359.14729 746.99838 359.15818 743.99838 360.15818 744.002 360.14729 747.002M359.1691 740.99838 359.18 737.9984 360.18 738.0021 360.1691 741.002M359.19093 734.9984 359.2018 731.9984 360.2018 732.0021 360.19093 735.0021M359.21275 728.9984 359.22364 725.9985 360.22364 726.00216 360.21275 729.0021M359.23454 722.9985 359.24546 719.99856 360.24546 720.0022 360.23454 723.00216M359.25636 716.99856 359.26728 713.99856 360.26728 714.0022 360.25636 717.0022M359.27818 710.99856 359.2891 707.9986 360.2891 708.00228 360.27818 711.0022M359.3 704.9986 359.3109 701.9986 360.3109 702.00228 360.3 705.00228M359.3218 698.99868 359.33274 695.99868 360.33274 696.0023 360.3218 699.0023M359.34364 692.99868 359.35456 689.9987 360.35456 690.0024 360.34364 693.0023M359.36546 686.9987 359.37638 683.9987 360.37638 684.0024 360.36546 687.0024M359.38728 680.9988 359.3982 677.9988 360.3982 678.00247 360.38728 681.00247M359.4091 674.9988 359.41999 671.99887 360.41999 672.0025 360.4091 675.00247M359.4309 668.99887 359.4418 665.99887 360.4418 666.0025 360.4309 669.0025M359.45274 662.9989 359.46363 659.9989 360.46363 660.00259 360.45274 663.00259M359.47456 656.9989 359.48545 653.99899 360.48545 654.0026 360.47456 657.00259M359.49638 650.99899 359.5 649.99819 360.5 650.00186 360.49638 651.0026"/>
<path transform="matrix(.71940049,0,0,.71940049,.35970024,.35970024)" d="M358.6 842.9964 358.62144 839.99649 359.62144 840.00369 359.6 843.0036M358.64286 836.9966 358.66429 833.99667 359.66429 834.00387 359.64286 837.0038M358.68574 830.9967 358.70716 827.99679 359.70716 828.00399 359.68574 831.0039M358.72859 824.9969 358.75 821.99697 359.75 822.00418 359.72859 825.0041M358.77143 818.997 358.79286 815.9971 359.79286 816.0043 359.77143 819.0042M358.81428 812.9972 358.8357 809.99728 359.8357 810.00448 359.81428 813.0044M358.85713 806.9973 358.87858 803.9974 359.87858 804.0046 359.85713 807.0045M358.9 800.9975V800.9964L359.9 801.0036V801.0047"/>
<text xml:space="preserve" transform="matrix(.71940049 0 0 .71940049 0 0)" font-size="12" font-family="ArialMT"><tspan y="790" x="300.79689 307.46888 314.14088 317.47688 320.81288 328.81687 332.81288 338.81288 345.48487 351.48487 354.14888 357.48487 364.15687 366.82087 373.49287 379.49287 386.16487 388.82887 392.16487 402.16087 408.83287 415.50486">13. Prka&#x017e;i glavni meni</tspan></text>
<text xml:space="preserve" transform="matrix(.71940049 0 0 .71940049 0 0)" font-size="12" font-family="ArialMT"><tspan y="855" x="309.29689 315.96888 322.64088 325.97688 329.31288 338.64888 341.31288 347.98487 353.98487 360.65687 363.32087 366.65687 376.65287 383.32487 389.99687 392.66087 395.99687 401.99687">14. Glavni meni sa</tspan></text>
<text xml:space="preserve" transform="matrix(.71940049 0 0 .71940049 0 0)" font-size="12" font-family="ArialMT"><tspan y="870" x="330.98439 334.98039 341.65238 347.65238 354.32438 356.98838 360.32438 366.99638 370.33238 377.00437">rezultatom</tspan></text>
<path transform="matrix(.71940049,0,0,.71940049,.35970024,.35970024)" d="M359.50004 657.00509 359.46983 654.0052 360.46977 653.99508 360.49998 656.99496M359.43959 651.0054 359.40937 648.0055 360.4093 647.99539 360.4395 650.99526M359.37916 645.0057 359.3489 642.0058 360.34886 641.99569 360.3791 644.99557M359.3187 639.006 359.28849 636.0061 360.28843 635.996 360.31864 638.99588M359.25825 633.0063 359.22804 630.0064 360.22798 629.9963 360.25819 632.99618M359.1978 627.0066 359.16758 624.0067 360.1675 623.9966 360.19776 626.99649M359.13737 621.0069 359.10716 618.007 360.1071 617.9969 360.1373 620.99679M359.0769 615.0072 359.0467 612.0073 360.04664 611.9972 360.07685 614.9971M359.01649 609.0075 358.98625 606.0076 359.98619 605.9975 360.01643 608.9974M358.95603 603.0078 358.9258 600.00796 359.92576 599.9978 359.95597 602.9977M358.89558 597.0081 358.86537 594.00827 359.8653 593.9981 359.8955 596.998M358.83515 591.0084 358.8049 588.00857 359.80485 587.9984 359.83509 590.9983M358.7747 585.0087 358.74449 582.00888 359.74443 581.9987 359.77464 584.9986M358.71424 579.00906 358.68403 576.00918 359.68397 575.999 359.71418 578.9989M358.6538 573.00936 358.62358 570.00949 359.6235 569.9993 359.65376 572.9992M358.59336 567.00967 358.56315 564.00979 359.56309 563.99966 359.5933 566.9995M358.5329 561.00997 358.5027 558.0101 359.50263 557.99996 359.53285 560.9998M358.47248 555.01028 358.44224 552.0104 359.44218 552.00027 359.4724 555.0001M358.41203 549.01058 358.3818 546.0107 359.38175 546.00057 359.41197 549.0004M358.35157 543.01089 358.32136 540.011 359.3213 540.00088 359.3515 543.00076M358.29115 537.01119 358.2609 534.0113 359.26084 534.00119 359.29109 537.00106M358.23069 531.0115 358.20048 528.0116 359.2004 528.00149 359.23063 531.00137M358.17024 525.0118 358.15003 523.00509 359.14997 522.99496 359.17018 525.00167"/>
<text xml:space="preserve" transform="matrix(.71940049 0 0 .71940049 0 0)" font-size="12" font-family="ArialMT"><tspan y="512" x="297.46876 304.14076 307.47676 310.81275 318.14476 324.81675 330.81675 334.81275 340.81275 343.47676 346.81275 349.47676 356.14875 362.82075 369.49275 376.16474 379.50074 382.16474 388.83674 394.83674 401.50874 407.50874 410.17274 412.83674">8. Zavr&#x0161;i jednu lokaciju</tspan></text>
<text xml:space="preserve" transform="matrix(.71940049 0 0 .71940049 0 0)" font-size="12" font-family="ArialMT"><tspan y="764" x="814.9531 821.6251 828.2971 831.6331 834.9691 842.97317 849.64517 856.31716 862.98916 868.98916 875.66116 882.3331 885.6691 889.6651 896.3371 902.3371 909.0091 911.6731 915.0091 921.6811">12. Kona&#x010d;an rezultat</tspan></text>
<path transform="matrix(.71940049,0,0,.71940049,.35970024,.35970024)" stroke-width="1" stroke-linecap="butt" stroke-miterlimit="4" stroke-linejoin="miter" fill="none" stroke="#000000" d="M90 468H630V550H90Z"/>
<path transform="matrix(.71940049,0,0,.71940049,.35970024,.35970024)" stroke-width="1" stroke-linecap="butt" stroke-miterlimit="4" stroke-linejoin="miter" fill="none" stroke="#000000" d="M50 430H1140V623H50Z"/>
</g>
</svg>
