{
    "players": [
        {
            "ime": "noviPog",
            "izazov": 16,
            "nivo": 2,
            "vreme": 597
        },
        {
            "ime": "pp",
            "izazov": 11,
            "nivo": 2,
            "vreme": 339
        },
        {
            "ime": "j",
            "izazov": 16,
            "nivo": 2,
            "vreme": 523
        },
        {
            "ime": "-",
            "izazov": 0,
            "nivo": 1,
            "vreme": 0
        },
        {
            "ime": "t",
            "izazov": 12,
            "nivo": 2,
            "vreme": 207
        },
        {
            "ime": "ttt",
            "izazov": 0,
            "nivo": 1,
            "vreme": 0
        },
        {
            "ime": "54",
            "izazov": 12,
            "nivo": 2,
            "vreme": 503
        },
        {
            "ime": "novi",
            "izazov": 9,
            "nivo": 3,
            "vreme": 266
        },
        {
            "ime": "novinovi",
            "izazov": 8,
            "nivo": 3,
            "vreme": 209
        },
        {
            "ime": "67",
            "izazov": 0,
            "nivo": 1,
            "vreme": 0
        },
        {
            "ime": "888",
            "izazov": 0,
            "nivo": 1,
            "vreme": 0
        },
        {
            "ime": "566",
            "izazov": 0,
            "nivo": 1,
            "vreme": 0
        },
        {
            "ime": "rfg",
            "izazov": 0,
            "nivo": 1,
            "vreme": 0
        },
        {
            "ime": "8u",
            "izazov": 0,
            "nivo": 1,
            "vreme": 0
        },
        {
            "ime": "6t",
            "izazov": 0,
            "nivo": 1,
            "vreme": 0
        },
        {
            "ime": "noviNoviPog",
            "izazov": 0,
            "nivo": 1,
            "vreme": 0
        },
        {
            "ime": "anjinNoviPog",
            "izazov": 16,
            "nivo": 4,
            "vreme": 648
        }
    ]
}
