{
    "chat": [
    ],
    "choiceCounter": 0,
    "clue": "scooby dooby dooooo",
    "commonPile": {
        "29": 123,
        "40": 125,
        "56": 124
    },
    "currNarrator": 1,
    "deck": [
        2,
        3,
        44,
        33,
        15,
        19,
        27,
        55,
        60,
        58,
        45,
        84
    ],
    "gamePhase": "PLAYERS_VOTE",
    "hostId": 124,
    "id": 1671897105,
    "isGameStarted": true,
    "isOver": false,
    "maxPlayers": 3,
    "narratorCard": 56,
    "narratorId": 124,
    "players": {
        "123": {
            "hand": [
                1,
                10,
                14,
                23,
                51
            ],
            "id": 123,
            "points": 10,
            "username": "scooby"
        },
        "124": {
            "hand": [
                13,
                22,
                70,
                80,
                39
            ],
            "id": 124,
            "points": 12,
            "username": "shaggy"
        },
        "125": {
            "hand": [
                50,
                24,
                81,
                77,
                30
            ],
            "id": 125,
            "points": 0,
            "username": "freddy"
        }
    },
    "prevCard": 5,
    "voteCounter": 1,
    "votes": {
        "125": 56
    }
}
