{
    "rounds":
            [
            {
                "num"  : 1,
                "units":[
                        {"name" : "DreadHerald",
                         "posx" : 3,
                         "posy" : 0,
                         "level": 1},
                        {"name" : "DreadHerald",
                         "posx" : 4,
                         "posy" : 3,
                         "level": 2},
                        {"name" : "DreadHerald",
                         "posx" : 5,
                         "posy" : 3,
                         "level": 1}
                        ]
            },
            {
                "num"  : 2,
                "units":[
                        {"name" : "DreadHerald",
                         "posx" : 3,
                         "posy" : 0,
                         "level": 3},
                        {"name" : "Necromage",
                         "posx" : 2,
                         "posy" : 3,
                         "level": 2},
                        {"name" : "Necromage",
                         "posx" : 3,
                         "posy" : 3,
                         "level": 2},
                        {"name" : "Necromage",
                         "posx" : 4,
                         "posy" : 3,
                         "level": 3},
                        {"name" : "Necromage",
                         "posx" : 5,
                         "posy" : 3,
                         "level": 2}
                        ]
            },
            {
                "num"  : 3,
                "units":[
                        {"name" : "DreadHerald",
                         "posx" : 3,
                         "posy" : 0,
                         "level": 3},
                        {"name" : "Horseman",
                         "posx" : 3,
                         "posy" : 3,
                         "level": 2},
                        {"name" : "Horseman",
                         "posx" : 4,
                         "posy" : 3,
                         "level": 2},
                        {"name" : "Necromage",
                         "posx" : 5,
                         "posy" : 1,
                         "level": 1},
                        {"name" : "Necromage",
                         "posx" : 4,
                         "posy" : 1,
                         "level": 2},
                        {"name" : "Horseman",
                         "posx" : 5,
                         "posy" : 3,
                         "level": 1}
                        ]
            },
            {
                "num"  : 4,
                "units":[
                        {"name" : "DreadHerald",
                         "posx" : 3,
                         "posy" : 0,
                         "level": 2},
                        {"name" : "Reaper",
                         "posx" : 1,
                         "posy" : 2,
                         "level": 2},
                        {"name" : "Reaper",
                         "posx" : 2,
                         "posy" : 2,
                         "level": 2},
                        {"name" : "Reaper",
                         "posx" : 6,
                         "posy" : 2,
                         "level": 2},
                        {"name" : "Reaper",
                         "posx" : 7,
                         "posy" : 2,
                         "level": 2},
                        {"name" : "DreadHerald",
                         "posx" : 5,
                         "posy" : 0,
                         "level": 2}
                        ]
            },
            {
                "num"  : 5,
                "units":[
                        {"name" : "Reaper",
                         "posx" : 0,
                         "posy" : 0,
                         "level": 3},
                        {"name" : "Reaper",
                         "posx" : 7,
                         "posy" : 0,
                         "level": 2},
                        {"name" : "Necromage",
                         "posx" : 1,
                         "posy" : 0,
                         "level": 2},
                        {"name" : "DreadHerald",
                         "posx" : 3,
                         "posy" : 0,
                         "level": 3},
                        {"name" : "ElvenRanger",
                         "posx" : 2,
                         "posy" : 0,
                         "level": 2},
                        {"name" : "Knight",
                         "posx" : 3,
                         "posy" : 1,
                         "level": 3},
                        {"name" : "Knight",
                         "posx" : 4,
                         "posy" : 1,
                         "level": 3},
                        {"name" : "ElvenRanger",
                         "posx" : 5,
                         "posy" : 0,
                         "level": 2}
                        ]
            },
            {
                "num" : 6,
                "units":[]
            }
            ]
}
