140 40
---------------------------------------------------------------------------------------xxxxxxxxxxxxxxxxxx-----------------------------------
------e--------------------------------------------------------------------------------x----------------x-----------------------------------
----------------------------------------------------e---------------------------------ed-------------z--x-----------------------e-xxxxxxxxx-
----k----------------------------------xxxxx---------------p--------------------------------------------x-----------------------e-f-------x-
--xxxxxxxxxxxxx------------------------------------xxxxxx------------------------------------xxxxx------x----------------------------t----x-
---------------------------------------------------xx--------------------------------xxxxxxxxxxxxxxxxxxxx---------------------------------x-
--------------------x-------------x----------------xx--------------------------xx-------------------------------------------------xxx----xx-
--------------------------------------------xxxxxxxxx------------xx---------------------------------------------------------xxxxxx--xxxxxx--
------------xx-----------xx----------------------------------------------xx---------------------------------------------------xxx-----------
---------------------------------xxxx----------------------------------------------------------------------------------xx------xx-----------
-----------------------------------------------------xxxxxxxxx---------------x--------xxxxx-------------------------------------------------
-----------xxxxxxxx---------------------------------------------------------------------------------xxxxxxxxxxxxxx--------------------------
-----------------------------------------xx--------------------------xxx----------------------------------------------------------------e---
----------------------x---e---------------xxxxxxx-------------------------------xx-------------xx-----------------------------------------x-
-----xx---------------------------------------------------------------------------------------------------------------------------------k-x-
------------------------xx--------xxx-----------------xx-------------------------------------------------------------------------------xxxx-
------------------------xx----------------------------------------------xx-------------xxxxxxx----------------------------------------------
----xxxxxx-----------xxxxxxxx------------xxx-------------------xxxx--------------------------------------------------------------xx---------
-----------------------------------------------------------------xx------------xxxx------------------e--------------------------------------
-----------------------------------------------------------------xx--------------xxxx-------------------xxxx----------xxxxxx----------------
----------xxx--------------xxxxxxxxxxxxxx------------e----------------------------------------------------------------xxxx------------------
----------------------------------------------------xxxx----------------xxxxx--------------xxxxxx-----------------------------------x-------
------------------------------------xxxxxxx------------x-----------------------------------x----x----------------------------x--------------
---------------x--------------------d-----x------------x------------------------------------------------------k-----------------------------
---------------------------------------z--x------------x------------------------------------------------------------------------------------
------------------------------------------x------------xxxx------------------xxxxxxxx--------------------------------------xxxxx------------
------------------xx--------------xxxxxxxxx----------------------xxx----------------------------------------x--e-x---------xxxx--------e----
-xxxxx------------------------------------------------------------------------------------------------------xxxxxx---------xxx------xxx-----
-x---e-------------------xxxxxx--------------------------------------------------------xx--------------xx-----------------------------------
-x-------------------------xxxx-------------------xxxxxxxx----------------------------------------------------------------------------------
-x-k---------------xx-------xxx----------------------------------------------x------------------xxxxx---------------------------xxxxxxxx----
-xxxxxxxx--------------------xx-------------------------------------------------------------------------------------------------d-----xx----
-------------------------------------xxx------------------------------xx--------------------xx--------------------xxxxxxxxxx-------z--xx----
----------------xxxx-------------------------------------------e--------------------------------------------------x--------x----------xx----
---------------------------------------------xxxxx-------------xxxxxxx-----------------xxx------------------------x--------xxxxxxxxxxxxx----
------------xx-----------xxxxxx------------------------x-------d-----x------xxxx-------------------------------xxxx-------------------------
-----------------------------------------------------------s------z--x--s-------------------------------------------------------------------
---------------------------------------------------------------------x----------------------------------------------------------------------
xxxxxxxxxxxxxxxxxxxxxxxxxxxxxxxxxxxxxxxxxxxxxxxxxxxxxxxxxxxxxxxxxxxxxxxxxxxxxxxxxxxxxxxxxxxxxxxxxxxxxxxxxxxxxxxxxxxxxxxxxxxxxxxxxxxxxxxxxxxx
xxxxxxxxxxxxxxxxxxxxxxxxxxxxxxxxxxxxxxxxxxxxxxxxxxxxxxxxxxxxxxxxxxxxxxxxxxxxxxxxxxxxxxxxxxxxxxxxxxxxxxxxxxxxxxxxxxxxxxxxxxxxxxxxxxxxxxxxxxxx
