H F P P P w F F F P P P F F F w P P P F H
H F P H P B G G H P w P H G G B P H P F H
H H F M M w P G H P w P H G P w M M F H H
M H P P G w P F G G B G G F P w G P P H M
M M W W b X W M H P w P H M W X b W W M M
H H P P G w H M H P w P H M H w G P P H H
G G G H P F F F P G F G P F F F P H G G G
G G G H F M P H G G H G G H P M F H G G G
G G G H P F F F P G F G P F F F P H G G G
H H P P G w H M H P w P H M H w G P P H H
M M W W b X W M H P w P H M W X b W W M M
M H P P G w P F G G B G G F P w G P P H M
H H F M M w P G H P w P H G P w M M F H H
H F P H P B G G H P w P H G G B P H P F H
H F P P P w F F F P P P F F F w P P P F H
