20 26.9 2.6 90 110 125 3.0 3.0 3.0 140 20 2 2 12.71 14.62 15.92
25 33.7 2.6 90 110 125 3.0 3.0 3.0 140 20 2 2 12.82 14.73 16.03
32 42.4 2.6 110 125 140 3.0 3.0 3.0 140 20 2 2 15.11 16.76 18.21
40 48.3 2.6 110 125 140 3.0 3.0 3.0 140 20 2 2 15.31 16.60 18.05
50 60.3 2.9 125 140 160 3.0 3.0 3.0 140 20 2 2 17.90 19.77 21.95
65 76.1 2.9 140 160 180 3.0 3.0 3.0 140 12 3 2 20.38 23.05 25.65
80 88.9 3.2 160 180 200 3.0 3.0 4.0 140 12 3 2 24.35 27.44 30.42
100 114.3 3.6 200 225 250 4.0 4.0 4.2 140 12 3 2 33.21 37.6 42.56
125 139.7 3.6 225 250 280 4.0 4.2 4.4 140 12 3 2 38.89 43.89 50.76
150 168.3 4 250 280 315 4.2 4.4 4.9 200 8 4 2 46.79 53.82 61.87
200 219.1 4.5 315 355 400 4.9 5.6 6.3 200 8 5 2 67.02 78.59 91.95
250 273 5 400 450 500 6.3 7.0 7.8 200 8 5 2 97.29 114.47 140.88
300 323.9 5.6 450 500 560 7.0 7.8 8.8 250 8 5 3 120.95 150.92 186.15
350 355.6 5.6 500 560 630 7.8 8.8 9.8 250 6 6 3 147.29 183.78 211.72
400 409.4 6.3 560 630 670 8.8 9.8 10.5 250 6 7 3 191.03 230.34 246.72
450 457 6.3 560 630 710 8.8 9.8 11.1 290 6 8 3 191.56 225.23 257.67
500 508 6.3 630 710 800 9.8 11.1 12.5 300 6 9 3 230.88 264.81 303.47
600 610 7.1 710 800 900 11.1 12.5 12.9 300 6 10 3 293.89 332.06 356.30

//DN Carrier s Series1 Series2 Series3 s1 s2 s3 A e p1 p2 I II III
