[
  {
    "model": "contenttypes.contenttype",
    "pk": 1,
    "fields": {
      "app_label": "admin",
      "model": "logentry"
    }
  },
  {
    "model": "contenttypes.contenttype",
    "pk": 2,
    "fields": {
      "app_label": "auth",
      "model": "permission"
    }
  },
  {
    "model": "contenttypes.contenttype",
    "pk": 3,
    "fields": {
      "app_label": "auth",
      "model": "group"
    }
  },
  {
    "model": "contenttypes.contenttype",
    "pk": 4,
    "fields": {
      "app_label": "auth",
      "model": "user"
    }
  },
  {
    "model": "contenttypes.contenttype",
    "pk": 5,
    "fields": {
      "app_label": "contenttypes",
      "model": "contenttype"
    }
  },
  {
    "model": "contenttypes.contenttype",
    "pk": 6,
    "fields": {
      "app_label": "sessions",
      "model": "session"
    }
  },
  {
    "model": "contenttypes.contenttype",
    "pk": 7,
    "fields": {
      "app_label": "photos_app",
      "model": "photo"
    }
  },
  {
    "model": "contenttypes.contenttype",
    "pk": 8,
    "fields": {
      "app_label": "photos_api",
      "model": "photo"
    }
  },
  {
    "model": "sessions.session",
    "pk": "7nqzii18z8ib757vgg6uwex65abfowf9",
    "fields": {
      "session_data": "YzFiM2M5MTc0Zjc2ZTY3ZGNhOTNiODc2NjE0NzIyMWM3MDM0NTQ5ZDp7Il9hdXRoX3VzZXJfaWQiOiIxIiwiX2F1dGhfdXNlcl9iYWNrZW5kIjoiZGphbmdvLmNvbnRyaWIuYXV0aC5iYWNrZW5kcy5Nb2RlbEJhY2tlbmQiLCJfYXV0aF91c2VyX2hhc2giOiJmNDkzNzIyNTVhNjkwNzgzZTUzY2M4YTdjYjg5ODdiNDc2NmE3YjU4In0=",
      "expire_date": "2020-05-02T07:44:57.032Z"
    }
  },
  {
    "model": "sessions.session",
    "pk": "mrlb4lj4ta967b9rxzxlwkxpl6z7crix",
    "fields": {
      "session_data": "YzFiM2M5MTc0Zjc2ZTY3ZGNhOTNiODc2NjE0NzIyMWM3MDM0NTQ5ZDp7Il9hdXRoX3VzZXJfaWQiOiIxIiwiX2F1dGhfdXNlcl9iYWNrZW5kIjoiZGphbmdvLmNvbnRyaWIuYXV0aC5iYWNrZW5kcy5Nb2RlbEJhY2tlbmQiLCJfYXV0aF91c2VyX2hhc2giOiJmNDkzNzIyNTVhNjkwNzgzZTUzY2M4YTdjYjg5ODdiNDc2NmE3YjU4In0=",
      "expire_date": "2020-05-01T10:17:51.270Z"
    }
  },
  {
    "model": "auth.permission",
    "pk": 1,
    "fields": {
      "name": "Can add log entry",
      "content_type": 1,
      "codename": "add_logentry"
    }
  },
  {
    "model": "auth.permission",
    "pk": 2,
    "fields": {
      "name": "Can change log entry",
      "content_type": 1,
      "codename": "change_logentry"
    }
  },
  {
    "model": "auth.permission",
    "pk": 3,
    "fields": {
      "name": "Can delete log entry",
      "content_type": 1,
      "codename": "delete_logentry"
    }
  },
  {
    "model": "auth.permission",
    "pk": 4,
    "fields": {
      "name": "Can view log entry",
      "content_type": 1,
      "codename": "view_logentry"
    }
  },
  {
    "model": "auth.permission",
    "pk": 5,
    "fields": {
      "name": "Can add permission",
      "content_type": 2,
      "codename": "add_permission"
    }
  },
  {
    "model": "auth.permission",
    "pk": 6,
    "fields": {
      "name": "Can change permission",
      "content_type": 2,
      "codename": "change_permission"
    }
  },
  {
    "model": "auth.permission",
    "pk": 7,
    "fields": {
      "name": "Can delete permission",
      "content_type": 2,
      "codename": "delete_permission"
    }
  },
  {
    "model": "auth.permission",
    "pk": 8,
    "fields": {
      "name": "Can view permission",
      "content_type": 2,
      "codename": "view_permission"
    }
  },
  {
    "model": "auth.permission",
    "pk": 9,
    "fields": {
      "name": "Can add group",
      "content_type": 3,
      "codename": "add_group"
    }
  },
  {
    "model": "auth.permission",
    "pk": 10,
    "fields": {
      "name": "Can change group",
      "content_type": 3,
      "codename": "change_group"
    }
  },
  {
    "model": "auth.permission",
    "pk": 11,
    "fields": {
      "name": "Can delete group",
      "content_type": 3,
      "codename": "delete_group"
    }
  },
  {
    "model": "auth.permission",
    "pk": 12,
    "fields": {
      "name": "Can view group",
      "content_type": 3,
      "codename": "view_group"
    }
  },
  {
    "model": "auth.permission",
    "pk": 13,
    "fields": {
      "name": "Can add user",
      "content_type": 4,
      "codename": "add_user"
    }
  },
  {
    "model": "auth.permission",
    "pk": 14,
    "fields": {
      "name": "Can change user",
      "content_type": 4,
      "codename": "change_user"
    }
  },
  {
    "model": "auth.permission",
    "pk": 15,
    "fields": {
      "name": "Can delete user",
      "content_type": 4,
      "codename": "delete_user"
    }
  },
  {
    "model": "auth.permission",
    "pk": 16,
    "fields": {
      "name": "Can view user",
      "content_type": 4,
      "codename": "view_user"
    }
  },
  {
    "model": "auth.permission",
    "pk": 17,
    "fields": {
      "name": "Can add content type",
      "content_type": 5,
      "codename": "add_contenttype"
    }
  },
  {
    "model": "auth.permission",
    "pk": 18,
    "fields": {
      "name": "Can change content type",
      "content_type": 5,
      "codename": "change_contenttype"
    }
  },
  {
    "model": "auth.permission",
    "pk": 19,
    "fields": {
      "name": "Can delete content type",
      "content_type": 5,
      "codename": "delete_contenttype"
    }
  },
  {
    "model": "auth.permission",
    "pk": 20,
    "fields": {
      "name": "Can view content type",
      "content_type": 5,
      "codename": "view_contenttype"
    }
  },
  {
    "model": "auth.permission",
    "pk": 21,
    "fields": {
      "name": "Can add session",
      "content_type": 6,
      "codename": "add_session"
    }
  },
  {
    "model": "auth.permission",
    "pk": 22,
    "fields": {
      "name": "Can change session",
      "content_type": 6,
      "codename": "change_session"
    }
  },
  {
    "model": "auth.permission",
    "pk": 23,
    "fields": {
      "name": "Can delete session",
      "content_type": 6,
      "codename": "delete_session"
    }
  },
  {
    "model": "auth.permission",
    "pk": 24,
    "fields": {
      "name": "Can view session",
      "content_type": 6,
      "codename": "view_session"
    }
  },
  {
    "model": "auth.permission",
    "pk": 25,
    "fields": {
      "name": "Can add photo",
      "content_type": 7,
      "codename": "add_photo"
    }
  },
  {
    "model": "auth.permission",
    "pk": 26,
    "fields": {
      "name": "Can change photo",
      "content_type": 7,
      "codename": "change_photo"
    }
  },
  {
    "model": "auth.permission",
    "pk": 27,
    "fields": {
      "name": "Can delete photo",
      "content_type": 7,
      "codename": "delete_photo"
    }
  },
  {
    "model": "auth.permission",
    "pk": 28,
    "fields": {
      "name": "Can view photo",
      "content_type": 7,
      "codename": "view_photo"
    }
  },
  {
    "model": "auth.permission",
    "pk": 29,
    "fields": {
      "name": "Can add photo",
      "content_type": 8,
      "codename": "add_photo"
    }
  },
  {
    "model": "auth.permission",
    "pk": 30,
    "fields": {
      "name": "Can change photo",
      "content_type": 8,
      "codename": "change_photo"
    }
  },
  {
    "model": "auth.permission",
    "pk": 31,
    "fields": {
      "name": "Can delete photo",
      "content_type": 8,
      "codename": "delete_photo"
    }
  },
  {
    "model": "auth.permission",
    "pk": 32,
    "fields": {
      "name": "Can view photo",
      "content_type": 8,
      "codename": "view_photo"
    }
  },
  {
    "model": "auth.user",
    "pk": 1,
    "fields": {
      "password": "pbkdf2_sha256$180000$pJctIQRvWD1N$f7IgMML6k5is8QRsdOP/lNsSU+KRlGnBCDmmwExel+s=",
      "last_login": "2020-04-18T07:44:57.031Z",
      "is_superuser": true,
      "username": "kemaleq",
      "first_name": "",
      "last_name": "",
      "email": "mateusz.matlengiewicz@gmail.com",
      "is_staff": true,
      "is_active": true,
      "date_joined": "2020-04-17T10:17:38.876Z",
      "groups": [],
      "user_permissions": []
    }
  },
  {
    "model": "auth.user",
    "pk": 2,
    "fields": {
      "password": "pbkdf2_sha256$180000$99gGBnF84vz1$bHsmMKysomFKSFKxmn6oaRLh6GFPmfaigqTA7p7ivow=",
      "last_login": null,
      "is_superuser": false,
      "username": "test",
      "first_name": "",
      "last_name": "",
      "email": "",
      "is_staff": false,
      "is_active": true,
      "date_joined": "2020-04-18T09:23:47.941Z",
      "groups": [],
      "user_permissions": []
    }
  },
  {
    "model": "photos_api.photo",
    "pk": 2,
    "fields": {
      "owner": 1,
      "caption": "caption",
      "pub_date": "2020-04-17T11:23:04.058Z",
      "draft": false,
      "picture": "pictures/Screen_Shot_2020-04-13_at_15.55.49_ZI0HY94.png"
    }
  },
  {
    "model": "photos_api.photo",
    "pk": 3,
    "fields": {
      "owner": 1,
      "caption": "caption",
      "pub_date": "2020-04-17T11:26:55.861Z",
      "draft": false,
      "picture": "pictures/Screen_Shot_2020-04-13_at_15.55.49_o6XKEuS.png"
    }
  },
  {
    "model": "photos_api.photo",
    "pk": 4,
    "fields": {
      "owner": 2,
      "caption": "caption",
      "pub_date": "2020-04-18T07:27:23.317Z",
      "draft": false,
      "picture": "pictures/Screen_Shot_2020-04-13_at_15.55.49_PinpJ4I.png"
    }
  },
  {
    "model": "photos_api.photo",
    "pk": 5,
    "fields": {
      "owner": 2,
      "caption": "caption",
      "pub_date": "2020-04-18T07:27:31.231Z",
      "draft": true,
      "picture": "pictures/Screen_Shot_2020-04-13_at_15.55.49_vS2enVB.png"
    }
  },
  {
    "model": "photos_api.photo",
    "pk": 6,
    "fields": {
      "owner": 1,
      "caption": "caption",
      "pub_date": "2020-04-18T09:01:32.556Z",
      "draft": false,
      "picture": "pictures/photo_4IqVSwT.jpg"
    }
  },
  {
    "model": "photos_api.photo",
    "pk": 7,
    "fields": {
      "owner": 1,
      "caption": "caption",
      "pub_date": "2020-04-18T09:02:04.689Z",
      "draft": false,
      "picture": "pictures/photo_RztN5qO.jpg"
    }
  },
  {
    "model": "photos_api.photo",
    "pk": 8,
    "fields": {
      "owner": 1,
      "caption": "caption",
      "pub_date": "2020-04-18T09:55:40.709Z",
      "draft": false,
      "picture": "pictures/photo_v7bITPT.jpg"
    }
  },
  {
    "model": "admin.logentry",
    "pk": 1,
    "fields": {
      "action_time": "2020-04-17T10:18:13.783Z",
      "user": 1,
      "content_type": 8,
      "object_id": "1",
      "object_repr": "1 Caption 01",
      "action_flag": 1,
      "change_message": "[{\"added\": {}}]"
    }
  },
  {
    "model": "admin.logentry",
    "pk": 2,
    "fields": {
      "action_time": "2020-04-18T09:23:48.045Z",
      "user": 1,
      "content_type": 4,
      "object_id": "2",
      "object_repr": "test",
      "action_flag": 1,
      "change_message": "[{\"added\": {}}]"
    }
  }
]