"","RI","Na","Mg","Al","Si","K","Ca","Ba","Fe"
"1",1.52099,13.69,3.59,1.12,71.96,0.09,9.4,0,0
"2",1.5161,13.33,3.53,1.34,72.67,0.56,8.33,0,0
"3",1.51721,12.87,3.48,1.33,73.04,0.56,8.43,0,0
"4",1.52369,13.44,0,1.58,72.22,0.32,12.24,0,0
"5",1.51727,14.7,0,2.34,73.28,0,8.95,0.66,0
"6",1.51316,13.02,0,3.04,70.48,6.21,6.96,0,0
