V3 5
FL /home/wint3rmute/code/ucisw/tescik/thing.vhd 2019/12/09.18:12:52 P.20131013
EN work/module2 1575911577 FL /home/wint3rmute/code/ucisw/tescik/thing.vhd \
      PB ieee/std_logic_1164 1381692176 LB UNISIM PH unisim/VCOMPONENTS 1381692182
AR work/module2/Behavioral 1575911578 \
      FL /home/wint3rmute/code/ucisw/tescik/thing.vhd EN work/module2 1575911577 \
      CP FDC
