<?xml version="1.0" encoding="UTF-8"?>
<drawing version="7">
    <attr value="xc9500xl" name="DeviceFamilyName">
        <trait delete="all:0" />
        <trait editname="all:0" />
        <trait edittrait="all:0" />
    </attr>
    <netlist>
        <blockdef name="fd">
            <timestamp>2000-1-1T10:10:10</timestamp>
            <line x2="80" y1="-112" y2="-128" x1="64" />
            <line x2="64" y1="-128" y2="-144" x1="80" />
            <line x2="320" y1="-256" y2="-256" x1="384" />
            <line x2="64" y1="-256" y2="-256" x1="0" />
            <line x2="64" y1="-128" y2="-128" x1="0" />
            <rect width="256" x="64" y="-320" height="256" />
        </blockdef>
        <block symbolname="fd" name="XLXI_1">
            <blockpin name="C" />
            <blockpin name="D" />
            <blockpin name="Q" />
        </block>
    </netlist>
    <sheet sheetnum="1" width="3520" height="2720">
        <instance x="384" y="1408" name="XLXI_1" orien="R0" />
    </sheet>
</drawing>