1,1.71795
2,1.71795
4,1.71795
8,1.71795
16,0.410256
32,0.307692
64,0.307692
128,0.307692
256,0.307692
512,0.307692
1024,0.307692
2048,0.307692
4096,0.307692
8192,0.307692
16384,0.307692
32768,0.307692
65536,0.307692
131072,0.307692
262144,0.307692
524288,0.307692
1048576,0.307692
2097152,0.307692
4194304,0.307692
8388608,0.307692