0.420304,0.309725,0.213024,0.146792,0.151565,0.15441,0.0692826,0.215741,0.189084,0.232449,0.126799,0.295426,0.240557,0.203626,0.33442,0.431343,0.320759,0.236772,0.208753
0.331743,0.235412,0.1176,0.2586,0.278428,0.274522,0.339151,0.17431,0.379836,0.259259,0.371145,0.0907706,0.223044,0.397888,0.329212,0.147308,0.269374,0.37888,0.439839
0.517851,0.440776,0.32896,0.305256,0.235768,0.269841,0.242014,0.231942,0.312696,0.268254,0.453212,0.374695,0.298484,0.406799,0.217845,0.271187,0.392674,0.221652,0.159106
0.387456,0.3935,0.35727,0.265969,0.453299,0.386641,0.420168,0.396336,0.422667,0.356748,0.153379,0.161477,0.279072,0.271516,0.247961,0.215166,0.412309,0.161675,0.309656
0.589676,0.456668,0.435089,0.240676,0.318072,0.297304,0.348784,0.380438,0.251699,0.32199,0.218301,0.353587,0.348309,0.406178,0.45214,0.416419,0.277606,0.193174,0.403434
0.835274,0.907567,0.350099,0.38227,0.32123,0.234936,0.188246,0.288557,0.384585,0.27552,0.402992,0.225812,0.308693,0.348104,0.343714,0.25185,0.411841,0.297457,0.276794
1.15668,0.665771,0.637648,0.568825,0.280367,0.223175,0.371751,0.297899,0.336284,0.297119,0.40376,0.333977,0.346402,0.329708,0.266834,0.338318,0.490473,0.371846,0.46616
1.03362,0.899044,0.549512,0.486646,0.294292,0.30934,0.327456,0.292322,0.25127,0.315872,0.332792,0.347393,0.444352,0.426081,0.29302,0.344788,0.274209,0.381372,0.230256
1.40386,1.62646,0.923088,0.721522,0.553503,0.421886,0.26655,0.271977,0.372385,0.260016,0.291349,0.267064,0.245162,0.230277,0.325599,0.326501,0.3083,0.272968,0.316525
1.42341,1.35984,1.35282,0.870715,0.639477,0.561047,0.358856,0.405408,0.424064,0.280642,0.426645,0.303213,0.342511,0.327899,0.370405,0.350657,0.434813,0.344318,0.274475
2.0567,1.94671,1.68515,1.34618,0.749881,0.673623,0.390882,0.460408,0.379841,0.34203,0.348575,0.267895,0.27025,0.361917,0.21131,0.387578,0.288562,0.255657,0.357937
1.84086,1.893,1.77529,1.40033,1.13084,0.733506,0.428204,0.435849,0.427046,0.33226,0.396076,0.418047,0.334063,0.314501,0.243696,0.303295,0.312075,0.356763,0.278245
2.14689,2.17849,2.11527,1.3789,1.22646,0.89303,0.561255,0.428579,0.443394,0.34683,0.41938,0.396663,0.269604,0.378706,0.324818,0.34613,0.310886,0.377323,0.278021
