21-09-2022 08:15:03 [INF] Now listening on: https://localhost:7084
21-09-2022 08:15:03 [INF] Now listening on: http://localhost:5150
21-09-2022 08:15:03 [INF] Application started. Press Ctrl+C to shut down.
21-09-2022 08:15:03 [INF] Hosting environment: Development
21-09-2022 08:15:03 [INF] Content root path: /home/mateus/Área de Trabalho/dotnetelk/
21-09-2022 08:24:11 [INF] Application is shutting down...
21-09-2022 08:24:19 [INF] Now listening on: https://localhost:7084
21-09-2022 08:24:19 [INF] Now listening on: http://localhost:5150
21-09-2022 08:24:19 [INF] Application started. Press Ctrl+C to shut down.
21-09-2022 08:24:19 [INF] Hosting environment: Development
21-09-2022 08:24:19 [INF] Content root path: /home/mateus/Área de Trabalho/dotnetelk/
21-09-2022 08:24:22 [INF] Application is shutting down...
21-09-2022 08:24:39 [INF] Now listening on: https://localhost:7084
21-09-2022 08:24:39 [INF] Now listening on: http://localhost:5150
21-09-2022 08:24:39 [INF] Application started. Press Ctrl+C to shut down.
21-09-2022 08:24:39 [INF] Hosting environment: Development
21-09-2022 08:24:39 [INF] Content root path: /home/mateus/Área de Trabalho/dotnetelk/
21-09-2022 08:28:23 [INF] Application is shutting down...
21-09-2022 08:28:53 [INF] Now listening on: https://localhost:7084
21-09-2022 08:28:53 [INF] Now listening on: http://localhost:5150
21-09-2022 08:28:53 [INF] Application started. Press Ctrl+C to shut down.
21-09-2022 08:28:53 [INF] Hosting environment: Development
21-09-2022 08:28:53 [INF] Content root path: /home/mateus/Área de Trabalho/dotnetelk/
21-09-2022 08:29:00 [INF] Request starting HTTP/2 GET https://localhost:7084/ - -
21-09-2022 08:29:00 [INF] Request finished HTTP/2 GET https://localhost:7084/ - - - 404 0 - 54.9274ms
21-09-2022 08:29:00 [INF] Request starting HTTP/2 GET https://localhost:7084/favicon.ico - -
21-09-2022 08:29:00 [INF] Request finished HTTP/2 GET https://localhost:7084/favicon.ico - - - 404 0 - 1.1128ms
21-09-2022 08:29:06 [INF] Request starting HTTP/2 GET https://localhost:7084/weatherforecast - -
21-09-2022 08:29:06 [INF] Executing endpoint 'dotnetelk.Controllers.WeatherForecastController.Get (DotnetELK)'
21-09-2022 08:29:06 [INF] Route matched with {action = "Get", controller = "WeatherForecast"}. Executing controller action with signature System.Collections.Generic.IEnumerable`1[dotnetelk.WeatherForecast] Get() on controller dotnetelk.Controllers.WeatherForecastController (DotnetELK).
21-09-2022 08:29:06 [INF] index: dotnetelk-development-21-09-2022
21-09-2022 08:29:06 [INF] Executing ObjectResult, writing value of type 'dotnetelk.WeatherForecast[]'.
21-09-2022 08:29:06 [INF] Executed action dotnetelk.Controllers.WeatherForecastController.Get (DotnetELK) in 42.68ms
21-09-2022 08:29:06 [INF] Executed endpoint 'dotnetelk.Controllers.WeatherForecastController.Get (DotnetELK)'
21-09-2022 08:29:06 [INF] Request finished HTTP/2 GET https://localhost:7084/weatherforecast - - - 200 - application/json;+charset=utf-8 69.8123ms
21-09-2022 08:33:02 [INF] Application is shutting down...
21-09-2022 08:33:05 [INF] Now listening on: https://localhost:7084
21-09-2022 08:33:05 [INF] Now listening on: http://localhost:5150
21-09-2022 08:33:05 [INF] Application started. Press Ctrl+C to shut down.
21-09-2022 08:33:05 [INF] Hosting environment: Development
21-09-2022 08:33:05 [INF] Content root path: /home/mateus/Área de Trabalho/dotnetelk/
21-09-2022 13:46:10 [INF] Now listening on: https://localhost:7084
21-09-2022 13:46:10 [INF] Now listening on: http://localhost:5150
21-09-2022 13:46:10 [INF] Application started. Press Ctrl+C to shut down.
21-09-2022 13:46:10 [INF] Hosting environment: Development
21-09-2022 13:46:10 [INF] Content root path: /home/mateus.pereira/Área de Trabalho/dotnetelk/
21-09-2022 13:59:14 [INF] Application is shutting down...
21-09-2022 13:59:18 [INF] Now listening on: https://localhost:7084
21-09-2022 13:59:18 [INF] Now listening on: http://localhost:5150
21-09-2022 13:59:18 [INF] Application started. Press Ctrl+C to shut down.
21-09-2022 13:59:18 [INF] Hosting environment: Development
21-09-2022 13:59:18 [INF] Content root path: /home/mateus.pereira/Área de Trabalho/dotnetelk/
21-09-2022 14:09:29 [INF] Application is shutting down...
21-09-2022 14:11:03 [INF] Now listening on: https://localhost:7084
21-09-2022 14:11:04 [INF] Now listening on: http://localhost:5150
21-09-2022 14:11:04 [INF] Application started. Press Ctrl+C to shut down.
21-09-2022 14:11:04 [INF] Hosting environment: Development
21-09-2022 14:11:04 [INF] Content root path: /home/mateus.pereira/Área de Trabalho/dotnetelk/
21-09-2022 14:18:36 [INF] Application is shutting down...
21-09-2022 14:18:39 [INF] Now listening on: https://localhost:7084
21-09-2022 14:18:39 [INF] Now listening on: http://localhost:5150
21-09-2022 14:18:39 [INF] Application started. Press Ctrl+C to shut down.
21-09-2022 14:18:39 [INF] Hosting environment: Development
21-09-2022 14:18:39 [INF] Content root path: /home/mateus.pereira/Área de Trabalho/dotnetelk/
21-09-2022 14:21:24 [INF] Application is shutting down...
21-09-2022 14:21:27 [INF] Now listening on: https://localhost:7084
21-09-2022 14:21:27 [INF] Now listening on: http://localhost:5150
21-09-2022 14:21:27 [INF] Application started. Press Ctrl+C to shut down.
21-09-2022 14:21:27 [INF] Hosting environment: Development
21-09-2022 14:21:27 [INF] Content root path: /home/mateus.pereira/Área de Trabalho/dotnetelk/
21-09-2022 14:41:34 [INF] Application is shutting down...
21-09-2022 14:41:37 [INF] Now listening on: https://localhost:7084
21-09-2022 14:41:37 [INF] Now listening on: http://localhost:5150
21-09-2022 14:41:37 [INF] Application started. Press Ctrl+C to shut down.
21-09-2022 14:41:37 [INF] Hosting environment: Development
21-09-2022 14:41:37 [INF] Content root path: /home/mateus.pereira/Área de Trabalho/dotnetelk/
21-09-2022 15:52:36 [INF] Now listening on: https://localhost:7084
21-09-2022 15:52:36 [INF] Now listening on: http://localhost:5150
21-09-2022 15:52:36 [INF] Application started. Press Ctrl+C to shut down.
21-09-2022 15:52:36 [INF] Hosting environment: Development
21-09-2022 15:52:36 [INF] Content root path: /home/mateus.pereira/Área de Trabalho/dotnetelk/
21-09-2022 16:49:35 [INF] Now listening on: https://localhost:7084
21-09-2022 16:49:35 [INF] Now listening on: http://localhost:5150
21-09-2022 16:49:35 [INF] Application started. Press Ctrl+C to shut down.
21-09-2022 16:49:35 [INF] Hosting environment: Development
21-09-2022 16:49:35 [INF] Content root path: /home/mateus.pereira/Área de Trabalho/dotnetelk/
21-09-2022 17:15:12 [INF] Request starting HTTP/2 GET https://localhost:7084/WeatherForecast - -
21-09-2022 17:15:12 [INF] Executing endpoint 'dotnetelk.Controllers.WeatherForecastController.Get (DotnetELK)'
21-09-2022 17:15:12 [INF] Route matched with {action = "Get", controller = "WeatherForecast"}. Executing controller action with signature System.Collections.Generic.IEnumerable`1[dotnetelk.WeatherForecast] Get() on controller dotnetelk.Controllers.WeatherForecastController (DotnetELK).
21-09-2022 17:15:12 [INF] index: dotnetelk-development-21-09-2022
21-09-2022 17:15:12 [INF] Executing ObjectResult, writing value of type 'dotnetelk.WeatherForecast[]'.
21-09-2022 17:15:12 [INF] Executed action dotnetelk.Controllers.WeatherForecastController.Get (DotnetELK) in 35.5891ms
21-09-2022 17:15:12 [INF] Executed endpoint 'dotnetelk.Controllers.WeatherForecastController.Get (DotnetELK)'
21-09-2022 17:15:12 [INF] Request finished HTTP/2 GET https://localhost:7084/WeatherForecast - - - 200 - application/json;+charset=utf-8 106.0665ms
21-09-2022 17:15:13 [INF] Request starting HTTP/2 GET https://localhost:7084/WeatherForecast - -
21-09-2022 17:15:13 [INF] Executing endpoint 'dotnetelk.Controllers.WeatherForecastController.Get (DotnetELK)'
21-09-2022 17:15:13 [INF] Route matched with {action = "Get", controller = "WeatherForecast"}. Executing controller action with signature System.Collections.Generic.IEnumerable`1[dotnetelk.WeatherForecast] Get() on controller dotnetelk.Controllers.WeatherForecastController (DotnetELK).
21-09-2022 17:15:13 [INF] index: dotnetelk-development-21-09-2022
21-09-2022 17:15:13 [INF] Executing ObjectResult, writing value of type 'dotnetelk.WeatherForecast[]'.
21-09-2022 17:15:13 [INF] Executed action dotnetelk.Controllers.WeatherForecastController.Get (DotnetELK) in 1.3952ms
21-09-2022 17:15:13 [INF] Executed endpoint 'dotnetelk.Controllers.WeatherForecastController.Get (DotnetELK)'
21-09-2022 17:15:13 [INF] Request finished HTTP/2 GET https://localhost:7084/WeatherForecast - - - 200 - application/json;+charset=utf-8 3.8974ms
21-09-2022 17:20:54 [INF] Application is shutting down...
21-09-2022 17:21:00 [INF] Now listening on: https://localhost:7084
21-09-2022 17:21:00 [INF] Now listening on: http://localhost:5150
21-09-2022 17:21:00 [INF] Application started. Press Ctrl+C to shut down.
21-09-2022 17:21:00 [INF] Hosting environment: Development
21-09-2022 17:21:00 [INF] Content root path: /home/mateus.pereira/Área de Trabalho/dotnetelk/
21-09-2022 17:21:05 [INF] Request starting HTTP/2 GET https://localhost:7084/WeatherForecast - -
21-09-2022 17:21:05 [INF] Executing endpoint 'dotnetelk.Controllers.WeatherForecastController.Get (DotnetELK)'
21-09-2022 17:21:05 [INF] Route matched with {action = "Get", controller = "WeatherForecast"}. Executing controller action with signature System.Collections.Generic.IEnumerable`1[dotnetelk.WeatherForecast] Get() on controller dotnetelk.Controllers.WeatherForecastController (DotnetELK).
21-09-2022 17:21:05 [ERR] Teste log erro
21-09-2022 17:21:05 [INF] Executing ObjectResult, writing value of type 'dotnetelk.WeatherForecast[]'.
21-09-2022 17:21:05 [INF] Executed action dotnetelk.Controllers.WeatherForecastController.Get (DotnetELK) in 32.876ms
21-09-2022 17:21:05 [INF] Executed endpoint 'dotnetelk.Controllers.WeatherForecastController.Get (DotnetELK)'
21-09-2022 17:21:05 [INF] Request finished HTTP/2 GET https://localhost:7084/WeatherForecast - - - 200 - application/json;+charset=utf-8 101.3543ms
21-09-2022 17:21:41 [INF] Request starting HTTP/2 GET https://localhost:7084/swagger - -
21-09-2022 17:21:41 [INF] Request finished HTTP/2 GET https://localhost:7084/swagger - - - 301 0 - 2.8411ms
21-09-2022 17:21:41 [INF] Request starting HTTP/2 GET https://localhost:7084/swagger/index.html - -
21-09-2022 17:21:41 [INF] Request finished HTTP/2 GET https://localhost:7084/swagger/index.html - - - 200 - text/html;charset=utf-8 43.2631ms
21-09-2022 17:21:41 [INF] Request starting HTTP/2 GET https://localhost:7084/swagger/swagger-ui.css - -
21-09-2022 17:21:41 [INF] Request starting HTTP/2 GET https://localhost:7084/swagger/swagger-ui-standalone-preset.js - -
21-09-2022 17:21:41 [INF] Request starting HTTP/2 GET https://localhost:7084/swagger/swagger-ui-bundle.js - -
21-09-2022 17:21:41 [INF] Sending file. Request path: '/swagger-ui-standalone-preset.js'. Physical path: 'N/A'
21-09-2022 17:21:41 [INF] Sending file. Request path: '/swagger-ui-bundle.js'. Physical path: 'N/A'
21-09-2022 17:21:41 [INF] Sending file. Request path: '/swagger-ui.css'. Physical path: 'N/A'
21-09-2022 17:21:41 [INF] Request finished HTTP/2 GET https://localhost:7084/swagger/swagger-ui-bundle.js - - - 200 1092889 application/javascript 35.2658ms
21-09-2022 17:21:41 [INF] Request finished HTTP/2 GET https://localhost:7084/swagger/swagger-ui-standalone-preset.js - - - 200 337162 application/javascript 34.5725ms
21-09-2022 17:21:41 [INF] Request finished HTTP/2 GET https://localhost:7084/swagger/swagger-ui.css - - - 200 143632 text/css 35.7730ms
21-09-2022 17:21:41 [INF] Request starting HTTP/2 GET https://localhost:7084/swagger/favicon-16x16.png - -
21-09-2022 17:21:41 [INF] Sending file. Request path: '/favicon-16x16.png'. Physical path: 'N/A'
21-09-2022 17:21:41 [INF] Request finished HTTP/2 GET https://localhost:7084/swagger/favicon-16x16.png - - - 200 665 image/png 0.9619ms
21-09-2022 17:21:41 [INF] Request starting HTTP/2 GET https://localhost:7084/swagger/v1/swagger.json - -
21-09-2022 17:21:41 [INF] Request finished HTTP/2 GET https://localhost:7084/swagger/v1/swagger.json - - - 200 - application/json;charset=utf-8 83.2066ms
21-09-2022 17:21:44 [INF] Request starting HTTP/2 GET https://localhost:7084/WeatherForecast - -
21-09-2022 17:21:44 [INF] Executing endpoint 'dotnetelk.Controllers.WeatherForecastController.Get (DotnetELK)'
21-09-2022 17:21:44 [INF] Route matched with {action = "Get", controller = "WeatherForecast"}. Executing controller action with signature System.Collections.Generic.IEnumerable`1[dotnetelk.WeatherForecast] Get() on controller dotnetelk.Controllers.WeatherForecastController (DotnetELK).
21-09-2022 17:21:44 [ERR] Teste log erro
21-09-2022 17:21:44 [INF] Executing ObjectResult, writing value of type 'dotnetelk.WeatherForecast[]'.
21-09-2022 17:21:44 [INF] Executed action dotnetelk.Controllers.WeatherForecastController.Get (DotnetELK) in 1.8139ms
21-09-2022 17:21:44 [INF] Executed endpoint 'dotnetelk.Controllers.WeatherForecastController.Get (DotnetELK)'
21-09-2022 17:21:44 [INF] Request finished HTTP/2 GET https://localhost:7084/WeatherForecast - - - 200 - application/json;+charset=utf-8 5.8634ms
