 =================================== 
sáb 09 dez 18:38:18
Usuário:
IP:
Password:
 =================================== 
 =================================== 
sáb 09 dez 18:38:40
Usuário: aluno
IP: 10.0.1.4
Password: ifpb
 =================================== 
 =================================== 
sáb 09 dez 18:39:58
Usuário: aluno
IP: 10.0.1.4
Password: ifpb
Opção selecionada: Local para remota
 =================================== 
 =================================== 
sáb 09 dez 18:41:55
Usuário: aluno
IP: 10.0.1.4
Password: ifpb
Opção selecionada: Remoto para local
 =================================== 
 =================================== 
sáb 09 dez 18:44:19
Usuário: aluno
IP: 10.0.1.4
Password: ifpb
Opção selecionada: Remoto para local
 =================================== 
 =================================== 
sáb 09 dez 18:45:22
Usuário: aluno
IP: 10.0.1.4
Password: ifpb
Opção selecionada: Verificar ssh
 =================================== 
 =================================== 
sáb 09 dez 18:46:34
Usuário: aluno
IP: 10.0.1.4
Password: ifpb
Opção selecionada: Remoto para local
 =================================== 
 =================================== 
sáb 09 dez 18:49:04
Usuário: aluno
IP: 10.0.1.4
Password: ifpb
Opção selecionada: Local para remota
 =================================== 
 =================================== 
sáb 09 dez 18:49:49
Usuário: aluno
IP: 10.0.1.4
Password: ifpb
Opção selecionada: Local para remota
 =================================== 
 =================================== 
sáb 09 dez 18:50:33
Usuário: aluno
IP: 10.0.1.4
Password: ifpb
Opção selecionada: Verificar ssh
 =================================== 
Autenticação bem sucedida!
 =================================== 
sex 15 dez 14:19:45
Usuário:
IP:
Password:
Opção selecionada:
 =================================== 
 =================================== 
sex 15 dez 14:20:53
Usuário: aluno
IP: 10.0.1.4
Password: ifpb
Opção selecionada: Remoto para local
 =================================== 
 =================================== 
sex 15 dez 14:23:27
Usuário: aluno
IP: 10.0.1.4
Password: ifpb
Opção selecionada: Local para remota
 =================================== 
 =================================== 
sex 15 dez 14:24:56
Usuário: aluno
IP: 10.0.1.4
Password: ifpb
Opção selecionada: Remoto para local
 =================================== 
