<?xml version="1.0" encoding="utf-8"?>
<!-- Generator: Adobe Illustrator 23.0.1, SVG Export Plug-In . SVG Version: 6.00 Build 0)  -->
<svg version="1.1" id="Layer_1" xmlns="http://www.w3.org/2000/svg" xmlns:xlink="http://www.w3.org/1999/xlink" x="0px" y="0px"
	 viewBox="0 0 501.8 515.1" style="enable-background:new 0 0 501.8 515.1;" xml:space="preserve">
<style type="text/css">
	.st0{fill:#FFFFFF;}
	.st1{fill:#324764;}
	.st2{fill:#8AACB7;}
	.st3{fill:#020101;}
	.st4{fill:#D13735;}
</style>
<g>
	<path class="st0" d="M421.5,337.6c0,3-2.4,5.3-5.4,5.3s-5.3-2.4-5.3-5.3c0-3,2.4-5.4,5.3-5.4C419.1,332.2,421.5,334.6,421.5,337.6z
		"/>
	<path class="st0" d="M93.9,337.6c0,3-2.4,5.3-5.4,5.3s-5.3-2.4-5.3-5.3c0-3,2.4-5.4,5.3-5.4C91.5,332.2,93.9,334.6,93.9,337.6z"/>
</g>
<g>
	<g>
		<path class="st1" d="M258.6,27.3c0,3.6-2.9,6.5-6.5,6.5s-6.5-2.9-6.5-6.5s2.9-6.4,6.5-6.4C255.7,20.9,258.6,23.8,258.6,27.3z"/>
		<path class="st1" d="M258.6,491.6c0,3.6-2.9,6.5-6.5,6.5s-6.5-2.9-6.5-6.5s2.9-6.4,6.5-6.4C255.7,485.1,258.6,488,258.6,491.6z"/>
	</g>
	<g>
		<path class="st1" d="M158.1,47.2c1.5,3.2,0.2,7.1-3,8.6c-3.2,1.5-7.1,0.2-8.6-3s-0.2-7.1,3-8.6C152.7,42.6,156.5,44,158.1,47.2z"
			/>
		<path class="st1" d="M357.9,466.2c1.5,3.2,0.2,7.1-3,8.6s-7.1,0.2-8.6-3s-0.2-7.1,3-8.6C352.6,461.6,356.4,463,357.9,466.2z"/>
	</g>
	<g>
		<path class="st1" d="M75.9,108.4c2.8,2.2,3.2,6.3,1,9.1c-2.2,2.8-6.3,3.2-9.1,0.9c-2.8-2.2-3.2-6.3-1-9.1
			C69,106.6,73.1,106.1,75.9,108.4z"/>
		<path class="st1" d="M436.6,400.5c2.8,2.2,3.2,6.3,1,9.1c-2.2,2.8-6.3,3.2-9.1,1c-2.8-2.2-3.2-6.3-1-9.1
			C429.8,398.7,433.9,398.3,436.6,400.5z"/>
	</g>
	<g>
		<path class="st1" d="M28,199c3.5,0.8,5.6,4.3,4.8,7.8s-4.3,5.6-7.8,4.8s-5.6-4.3-4.8-7.8C21,200.3,24.5,198.2,28,199z"/>
		<path class="st1" d="M479.4,307.4c3.5,0.8,5.6,4.3,4.8,7.8c-0.8,3.5-4.3,5.6-7.8,4.8c-3.5-0.8-5.6-4.3-4.8-7.8
			C472.5,308.7,475.9,306.6,479.4,307.4z"/>
	</g>
	<g>
		<path class="st1" d="M23.8,301.4c3.5-0.7,6.9,1.5,7.7,5c0.7,3.5-1.5,6.9-5,7.7c-3.5,0.7-6.9-1.5-7.6-5
			C18.1,305.6,20.3,302.2,23.8,301.4z"/>
		<path class="st1" d="M477.9,204.9c3.5-0.7,6.9,1.5,7.7,5c0.7,3.5-1.5,6.9-5,7.6c-3.5,0.7-6.9-1.5-7.7-5
			C472.2,209.1,474.4,205.6,477.9,204.9z"/>
	</g>
	<g>
		<path class="st1" d="M64.1,395.7c2.8-2.2,6.9-1.6,9,1.2c2.2,2.8,1.6,6.9-1.2,9c-2.8,2.2-6.9,1.6-9-1.2
			C60.7,401.9,61.3,397.8,64.1,395.7z"/>
		<path class="st1" d="M432.4,113c2.8-2.2,6.9-1.6,9,1.2c2.2,2.8,1.6,6.9-1.2,9c-2.8,2.2-6.9,1.6-9-1.2
			C429.1,119.3,429.6,115.2,432.4,113z"/>
	</g>
	<g>
		<path class="st1" d="M141.1,463.4c1.6-3.2,5.5-4.4,8.7-2.8s4.4,5.5,2.8,8.7c-1.6,3.2-5.5,4.4-8.7,2.8
			C140.7,470.4,139.4,466.5,141.1,463.4z"/>
		<path class="st1" d="M351.8,49.7c1.6-3.2,5.5-4.4,8.7-2.8c3.2,1.6,4.4,5.5,2.8,8.7s-5.5,4.4-8.7,2.8
			C351.5,56.8,350.2,52.9,351.8,49.7z"/>
	</g>
</g>
<path class="st2" d="M254.3,96.9c-85.6,0-155.2,69.6-155.2,155.2s69.6,155.2,155.2,155.2s155.2-69.6,155.2-155.2
	S339.9,96.9,254.3,96.9z M391.6,252.1c0,3.1-0.1,6.1-0.3,9.1l-46-9.1l46-9.1C391.5,246,391.6,249,391.6,252.1z M117,252.1
	c0-3.1,0.1-6.1,0.3-9.1l46,9.1l-46,9.1C117.1,258.2,117,255.2,117,252.1z M254.3,264.4c-6.8,0-12.3-5.5-12.3-12.3
	s5.5-12.3,12.3-12.3s12.3,5.5,12.3,12.3S261.1,264.4,254.3,264.4z M256.1,274.7l-1.8,2.7l-1.8-2.7l0.7-0.4c0.4,0,0.8,0.1,1.1,0.1
	c0.4,0,0.8,0,1.1-0.1L256.1,274.7z M247.3,230.6l-0.4,0.7c-0.7,0.3-1.4,0.5-2.1,0.9L244,232l0.6-3.2L247.3,230.6z M245.4,224.8
	l1.7-8.7l4.9,7.4l-2.7,4L245.4,224.8z M242.1,222.6l-9.2-6.1l-6.1-30.8l17.4,26.1L242.1,222.6z M237.1,266.8l0.8,0.2
	c0.5,0.6,1.1,1.1,1.6,1.6l0.2,0.8l-3.2,0.6L237.1,266.8z M236.4,234.2l3.2,0.6l-0.2,0.8c-0.6,0.5-1.1,1-1.6,1.6l-0.8,0.2
	L236.4,234.2z M235.7,230.3l-1.7-8.7l7.4,4.9l-0.9,4.7L235.7,230.3z M234.2,241.8l0.2,0.8c-0.3,0.7-0.6,1.4-0.9,2.1l-0.7,0.4
	l-1.8-2.7L234.2,241.8z M232.2,253.2l-0.5,0.7l-2.7-1.8l2.7-1.8l0.5,0.7c0,0.4-0.1,0.8-0.1,1.1C232.1,252.5,232.2,252.9,232.2,253.2
	z M228.7,239.1l-4.9-7.4l8.7,1.7l0.9,4.7L228.7,239.1z M229.7,247.2l-4,2.7l-7.4-4.9l8.7-1.7L229.7,247.2z M229.7,257l-2.7,4
	l-8.7-1.7l7.4-4.9L229.7,257z M228.7,265.1l4.7,0.9l-0.9,4.7l-8.7,1.7L228.7,265.1z M231,261.8l1.8-2.7l0.7,0.4
	c0.3,0.7,0.5,1.4,0.9,2.1l-0.2,0.8L231,261.8z M235.7,273.9l4.7-0.9l0.9,4.7l-7.4,4.9L235.7,273.9z M231.7,229.5l-10.8-2.2
	l-17.5-26.1l26.1,17.5L231.7,229.5z M224.8,239.9L214,242l-26.1-17.5l30.8,6.1L224.8,239.9z M222.4,252.1l-9.2,6.1l-30.8-6.1
	l30.8-6.1L222.4,252.1z M214,262.2l10.8,2.2l-6.1,9.2l-30.8,6.1L214,262.2z M220.9,276.8l10.8-2.1l-2.2,10.8L203.4,303L220.9,276.8z
	 M232.9,287.8l9.2-6.1l2.2,10.8l-17.5,26.1L232.9,287.8z M244,272.3l0.8-0.2c0.7,0.3,1.4,0.6,2.1,0.9l0.4,0.7l-2.7,1.8L244,272.3z
	 M249.4,276.7l2.7,4l-4.9,7.4l-1.7-8.7L249.4,276.7z M252.5,229.5l1.8-2.7l1.8,2.7l-0.7,0.5c-0.4,0-0.7-0.1-1.1-0.1
	c-0.4,0-0.7,0-1.1,0.1L252.5,229.5z M277.6,242.4l-1.8,2.7l-0.7-0.4c-0.3-0.7-0.6-1.4-0.9-2.1l0.2-0.8L277.6,242.4z M275.2,238.2
	l0.9-4.7l8.7-1.7l-4.9,7.4L275.2,238.2z M276.4,251l0.5-0.7l2.7,1.8l-2.7,1.8l-0.5-0.7c0-0.4,0.1-0.8,0.1-1.1
	C276.5,251.7,276.4,251.3,276.4,251z M273,230.3l-4.7,0.9l-0.9-4.7l7.4-4.9L273,230.3z M271.5,237.4l-0.8-0.2
	c-0.5-0.6-1-1.1-1.6-1.6l-0.2-0.8l3.2-0.6L271.5,237.4z M272.2,270l-3.2-0.6l0.2-0.8c0.6-0.5,1.1-1,1.6-1.6l0.8-0.2L272.2,270z
	 M268.3,273l4.7,0.9l1.7,8.7l-7.4-4.9L268.3,273z M274.5,262.4l-0.2-0.8c0.3-0.7,0.6-1.4,0.9-2.1l0.7-0.4l1.8,2.7L274.5,262.4z
	 M279.9,265.1l4.9,7.4l-8.7-1.7l-0.9-4.7L279.9,265.1z M278.9,257l4-2.7l7.4,4.9l-8.7,1.7L278.9,257z M278.9,247.2l2.7-4l8.7,1.7
	l-7.4,4.9L278.9,247.2z M283.8,239.9l6.1-9.2l30.8-6.1L294.6,242L283.8,239.9z M287.7,227.4l-10.8,2.2l2.2-10.8l26.1-17.5
	L287.7,227.4z M275.7,216.5l-9.2,6.1l-2.1-10.8l17.5-26.1L275.7,216.5z M264.6,232l-0.8,0.2c-0.7-0.3-1.4-0.6-2.1-0.9l-0.4-0.7
	l2.7-1.8L264.6,232z M259.2,227.5l-2.7-4l4.9-7.4l1.7,8.7L259.2,227.5z M259.2,276.7l4,2.7l-1.7,8.7l-4.9-7.4L259.2,276.7z
	 M261.3,273.6l0.4-0.7c0.7-0.3,1.4-0.6,2.1-0.9l0.8,0.2l-0.6,3.2L261.3,273.6z M266.5,281.6l9.2,6.1l6.1,30.8l-17.5-26.1
	L266.5,281.6z M276.9,274.7l10.8,2.1l17.4,26.1L279,285.5L276.9,274.7z M283.8,264.3l10.8-2.2l26.1,17.4l-30.8-6.1L283.8,264.3z
	 M286.3,252.1l9.2-6.1l30.8,6.1l-30.8,6.1L286.3,252.1z M299.8,243.1l30.5-20.4l55.3-11c2.7,8.8,4.6,18,5.5,27.5l-55.2,11
	L299.8,243.1z M338.4,217.3l39-26.1c2.7,5.4,5,11.1,7,16.9L338.4,217.3z M328.9,219.2l-36,7.2l20.4-30.5l46.8-31.3
	c6,7.2,11.2,15,15.6,23.3L328.9,219.2z M310.6,193.2l-30.5,20.4l7.2-36l31.3-46.8c8.3,4.4,16.1,9.6,23.3,15.6L310.6,193.2z
	 M289.1,168l9.2-46c5.8,2,11.5,4.3,16.9,7L289.1,168z M283.7,176.1l-20.4,30.5l-7.2-36l11-55.2c9.5,0.9,18.7,2.7,27.5,5.5
	L283.7,176.1z M260.4,211l-6.1,9.2l-6.1-9.2l6.1-30.8L260.4,211z M245.3,206.6l-20.4-30.5l-11-55.3c8.8-2.7,18-4.6,27.5-5.5l11,55.2
	L245.3,206.6z M219.5,168l-26.1-39c5.4-2.7,11.1-5,16.9-7L219.5,168z M221.4,177.6l7.2,36L198,193.2l-31.3-46.8
	c7.2-6,15-11.2,23.3-15.6L221.4,177.6z M215.7,226.3l-36-7.2L133,187.9c4.4-8.3,9.7-16.1,15.6-23.3l46.8,31.3L215.7,226.3z
	 M170.2,217.3l-46-9.2c2-5.8,4.3-11.5,7-16.9L170.2,217.3z M178.3,222.7l30.5,20.4l-36,7.2l-55.2-11c0.9-9.5,2.7-18.7,5.5-27.5
	L178.3,222.7z M172.8,254l36,7.2l-30.5,20.4l-55.3,11c-2.7-8.8-4.6-18-5.5-27.5L172.8,254z M170.2,286.9l-39,26.1
	c-2.7-5.4-5-11.1-7-16.9L170.2,286.9z M179.8,285l36-7.2l-20.4,30.5l-46.8,31.3c-6-7.2-11.2-15-15.6-23.3L179.8,285z M198,311.1
	l30.5-20.4l-7.1,36l-31.3,46.8c-8.3-4.4-16.1-9.6-23.3-15.6L198,311.1z M219.5,336.2l-9.2,46c-5.8-2-11.5-4.3-16.9-7L219.5,336.2z
	 M224.9,328.1l20.4-30.5l7.1,36l-11,55.2c-9.5-0.9-18.7-2.7-27.5-5.5L224.9,328.1z M248.2,293.2l6.1-9.2l6.1,9.2l-6.1,30.8
	L248.2,293.2z M263.4,297.6l20.4,30.5l11,55.3c-8.8,2.7-18,4.6-27.5,5.5l-11-55.2L263.4,297.6z M289.1,336.2l26,39
	c-5.4,2.7-11.1,5-16.9,7L289.1,336.2z M287.2,326.6l-7.2-36l30.5,20.4l31.3,46.8c-7.2,6-15,11.2-23.3,15.6L287.2,326.6z
	 M292.9,277.9l36,7.2l46.8,31.3c-4.4,8.3-9.6,16.1-15.6,23.3l-46.8-31.3L292.9,277.9z M338.4,286.9l46,9.1c-2,5.8-4.3,11.5-7,16.9
	L338.4,286.9z M330.3,281.5l-30.5-20.4l36-7.2l55.2,11c-0.9,9.5-2.7,18.7-5.5,27.5L330.3,281.5z M357.6,161.7l-38.9,26l26-38.9
	C349.3,152.8,353.6,157.2,357.6,161.7z M263.5,115.1l-9.1,46l-9.2-46c3-0.2,6.1-0.3,9.2-0.3C257.4,114.8,260.4,114.9,263.5,115.1z
	 M163.9,148.8l26,38.9l-38.9-26C155,157.1,159.4,152.8,163.9,148.8z M151,342.5l38.9-26l-26,38.9C159.4,351.4,155,347.1,151,342.5z
	 M245.2,389.1l9.1-46l9.2,46c-3,0.2-6.1,0.3-9.1,0.3C251.2,389.4,248.2,389.3,245.2,389.1z M344.7,355.4l-26-38.9l38.9,26
	C353.6,347.1,349.3,351.4,344.7,355.4z"/>
<g>
	<g>
		<g>
			<path class="st3" d="M135.4,263.3c-0.3,1.6-0.4,3.2-0.5,4.8c0,1.6,0.1,3,0.4,4.1c0.2,0.4,0.2,0.7,0,0.9h0.8
				c1.4-0.5,2.6-1.5,3.6-2.7c1-1.3,2-2.7,2.8-4.3c0.8-1.6,1.5-3.4,2.1-5.2c0.6-1.8,1.2-3.6,1.7-5.3c0.2-0.4,0.4-0.8,0.5-1.2
				c0.1-0.3,0.2-0.7,0.3-1.1c0.1-0.3,0.5-0.3,1.2-0.2s1.3,0.4,2.1,0.8c0.7,0.4,1.3,0.8,1.9,1.4c0.5,0.5,0.7,1,0.5,1.4l-1.1,3.3v0.1
				c-1,3.2-2.2,6.4-3.5,9.6s-3,6-5.1,8.5c-0.3,0.4-0.8,0.9-1.3,1.4s-1.1,1-1.9,1.5c-0.7,0.5-1.5,0.8-2.4,1.2
				c-0.9,0.3-1.9,0.4-3.1,0.4c-2.7-0.2-5-1.2-6.7-2.8c-1.7-1.6-3-3.7-3.7-6.2c-1.4,2.3-3.1,4.3-5,6s-4,2.5-6.3,2.6
				c-2.1-0.2-4-0.8-5.6-1.8s-3-2.1-4.1-3.4s-2-2.7-2.8-4.2c-0.7-1.5-1.2-2.9-1.6-4.2c-0.3-1.4-0.4-2.4-0.4-3c-0.2-2-0.2-4.3,0-6.7
				c0.2-2.4,0.8-4.8,1.5-7.3c0.8-2.4,1.8-4.8,3-7c1.2-2.3,2.6-4.3,4.3-6c1.6-1.8,3.5-3.2,5.5-4.2s4.2-1.6,6.6-1.6
				c0.7,0,1.4,0.1,2.1,0.2c0.7,0.1,1.5,0.3,2.3,0.5c1.8,0.6,3.3,1.5,4.5,2.7l0.2-1.1l1.2-4.8c0.6-2,1-4.1,1.4-6.3s0.8-4.4,1-6.5
				c0.3-2.1,0.5-4.1,0.6-6.1c0.1-1.9,0.2-3.7,0.2-5.3c0.7-0.4,1.7-0.4,3.1,0c1.4,0.5,2.8,1.2,4.2,2.1c1.4,1,2.6,2.1,3.6,3.4
				c1,1.3,1.5,2.6,1.4,3.8c0,0.7-0.1,1.8-0.4,3.3c-0.3,1.5-0.6,3.3-1,5.2s-0.9,3.9-1.4,6.1c-0.5,2.1-1,4.1-1.4,6l-1.1,4.5l0.1-0.1
				c-0.9,3.5-1.7,7.1-2.5,10.8S135.8,259,135.4,263.3L135.4,263.3L135.4,263.3z M115.4,271.8c0.7-0.2,1.5-0.8,2.3-1.9
				c0.8-1,1.6-2.2,2.5-3.6c0.8-1.4,1.6-2.9,2.3-4.4c0.7-1.6,1.3-3,1.7-4.2v-0.1l0.2-2.7c0.2-1.8,0.5-3.6,0.8-5.5
				c0.3-1.8,0.7-3.7,1.1-5.5c-0.4-0.8-0.9-1.5-1.5-2.1s-1.4-1-2.4-1.1c-2-0.1-3.8,0.7-5.4,2.2c-1.5,1.5-2.8,3.4-3.9,5.7
				s-1.9,4.8-2.4,7.4c-0.6,2.6-0.9,5-0.9,7.2c-0.1,0.6,0,1.4,0,2.3c0.1,0.9,0.3,1.8,0.5,2.7c0.3,1.3,0.8,2.3,1.5,3.1
				C112.7,272.1,113.8,272.3,115.4,271.8z"/>
			<g>
				<path class="st0" d="M128.2,261.3c-0.6,4.1-0.4,7.7-0.4,11.8c0,4.1,3.4,7.5,7.5,7.5c11.8,0,16.6-16.2,19-25.3
					c-1.1,1.5-2.3,3-3.4,4.5c0.1-0.1,0.2-0.2,0.4-0.3c-1.3,0.3-2.5,0.7-3.8,1c-0.7,0.1-1.1-0.2-1.3-0.8c-0.3-1.3-0.7-2.5-1-3.8
					c0-2.5-0.5,0.9-0.8,1.9c-0.9,2.7-1.9,6.1-3.4,9.4c-1.6,3.8-7.1,12.2-9.8,4.2c-2.1-6.2-10-7.4-13.7-1.8c-2.5,3.8-4.4,6.4-8.4,2.8
					c-4.1-3.7-3.8-8.9-3.4-13.8c0.4-5.3,3.1-11.1,6.6-15c2.4-2.7,7.2-5.3,10.5-2.4c4,3.5,11.2,2.5,12.5-3.3c2.5-10.7,4.8-21,5-32.1
					c-1.8,2.4-3.7,4.8-5.5,7.2c-1.6,0.6,0.1,0.4,1.3,1.3c1.3,1,1.4,0.7,1.4,1.7c-0.2,2.9-1.2,5.9-1.8,8.6c-1,4.5-2.1,9.1-3.2,13.6
					c-1.7,7.2,7.1,12.8,12.5,7.3l0.1-0.1c-4.2-2.4-8.4-4.9-12.5-7.3c-2.1,8.2-3.7,16.4-4.6,24.8c2.5-2.5,5-5,7.5-7.5
					c-0.1,0-0.1,0-0.2,0c-9.7,0-9.7,15,0,15c0.1,0,0.1,0,0.2,0c4.4,0,7.1-3.4,7.5-7.5c0.7-7.1,2.3-14,4-20.8
					c1.8-7.2-7.1-12.7-12.5-7.3l-0.1,0.1c4.2,2.4,8.4,4.9,12.5,7.3c2-8.3,4.3-16.7,5.4-25.1c1.2-9.9-11.4-22.3-21.5-18.5
					c-3.2,1.2-5.5,3.7-5.5,7.2c-0.1,9.7-2.3,18.7-4.4,28.1c4.2-1.1,8.4-2.2,12.5-3.3c-8-7.1-19.6-7.2-28.1-0.7
					c-9,6.9-13.1,17.8-14.6,28.7c-1.4,10.7,2.9,20.8,11.4,27.3c10.7,8.2,22.1,0.7,28.4-8.7c-4.6-0.6-9.1-1.2-13.7-1.8
					c3.4,9.9,13.2,17.6,24,13.3c10.2-4.1,14.3-15.7,17.6-25.3c0.5-1.2,0.8-2.4,0.8-3.6c0,2.8-0.1,1.5,0.3,0.3
					c0.5-1.4,0.8-2.7,0.8-4.3c-0.1-5.4-5.3-8.7-9.9-10.1c-13.4-3.9-9.8,16.6-17.9,20.7c1.3-0.3,2.5-0.7,3.8-1c-0.3,0-0.5,0-0.8,0
					c2.5,2.5,5,5,7.5,7.5c0-2.7-0.6-5.1-0.2-7.8c0.6-4-0.9-8-5.2-9.2C133.9,255,128.8,257.2,128.2,261.3z"/>
				<path class="st0" d="M119.2,278.3c7.1-4,12-14.7,12.7-22.5c0.4-4.8,3.5-11.2,1-15.7c-2.8-4.9-8-8.2-13.8-6.6
					c-10.9,3.1-15,15.4-16.3,25.5c-1.3,10.3,2.1,22,14.7,20c4-0.6,6.2-5.6,5.2-9.2c-1.2-4.3-5.2-5.9-9.2-5.2c-0.5,0.1-1,0.2-1.4,0.2
					c1.3,0,2.7,0,4,0c2.8,0.5,1.6,3.2,1.4-0.6c-0.1-2.1,0.3-4.2,0.7-6.2c0.4-1.9,0.9-3.8,1.7-5.6c0.4-0.9,0.9-1.7,1.4-2.6
					c0.1-0.2,0.3-0.5,0.4-0.7c1.6-1.2,1.1-1.7-1.7-1.4c-0.3-1.9-0.5-3.9-0.8-5.8c-1,4.9-1.9,9.8-2.3,14.7c0,0.3-0.1,0.6-0.1,1
					c0.2-2.1-1.6,2.5-1.4,2.1c-0.8,1.7-2,4.8-3.7,5.7C103.2,270.1,110.8,283.1,119.2,278.3z"/>
			</g>
		</g>
		<g>
			<path class="st3" d="M176.5,248.1c-1.3,4.9-3.5,9.1-6.7,12.4c-3.1,3.3-6.9,5.7-11.4,7.3c0.4,1.5,1.1,2.9,2,4.2
				c0.9,1.3,2,2.1,3.4,2.4l-0.2-0.1c1.2,0.3,2.4,0.2,3.7-0.2c1.3-0.4,2.6-1.2,4-2.3c1.3-1.1,2.6-2.6,3.9-4.4c1.3-1.8,2.4-4,3.4-6.4
				c0.5-1.3,0.9-2.7,1.4-4.1c0.4-1.4,0.8-2.7,1.1-4c0.3-0.7,0.9-1.1,1.6-1.2c0.7-0.1,1.5,0.1,2.1,0.5c0.7,0.4,1.2,1,1.6,1.7
				c0.4,0.7,0.5,1.6,0.2,2.5l-0.8,3c-0.8,2.5-1.8,5.2-3.1,8.2s-3,5.9-5.1,8.7c-1.3,1.5-2.6,2.7-4,3.6s-2.8,1.5-4.1,1.9
				s-2.5,0.7-3.7,0.7c-1.1,0.1-2,0.1-2.7,0.1c-4.3,0-7.9-1.2-10.8-3.7c-2.9-2.5-4.9-5.9-6.1-10.1c-1-3.7-1.3-7.4-0.9-11
				c0.5-3.6,1.6-7.4,3.3-11.6c0.6-1.4,1.5-2.8,2.7-4.4c1.2-1.6,2.6-3,4.2-4.3c1.6-1.3,3.4-2.4,5.4-3.2s4.1-1.2,6.3-1.2
				c2.3,0.1,4.3,0.8,6,2.3c1.8,1.5,2.9,3.4,3.5,5.9C177.4,243.5,177.2,245.8,176.5,248.1L176.5,248.1z M169.5,241.3
				c-1.8,0.4-3.4,1.3-4.7,2.6c-1.3,1.4-2.5,3-3.5,4.9s-1.7,3.9-2.3,6c-0.6,2.1-0.9,4.1-1.1,6c3.2-1.6,6-3.7,8.2-6.5
				c2.3-2.7,3.8-6,4.6-9.8v0.1c0.2-0.4,0.2-0.9,0.2-1.3c0-0.4-0.1-0.8-0.1-1.2C170.6,241.4,170.1,241.1,169.5,241.3z"/>
			<g>
				<path class="st0" d="M169.2,246.1c-2,6.7-6.2,11.9-12.8,14.5c-3.6,1.4-6.7,5.1-5.2,9.2c2,5.6,4.8,9.8,10.6,11.8
					c8,2.8,13.4-9.9,5.8-13.7c-0.1,0-0.1-0.1-0.2-0.1c-1.3,4.7-2.5,9.3-3.8,14c11.5,1.5,19.3-11,22.6-20.3c0.3-0.9,0.6-1.8,0.9-2.7
					c0.1-0.5,0.3-0.9,0.4-1.4c1.5-3.6-1.3-4.5-8.2-2.7c-0.5,1.9-1.1,3.8-1.8,5.8c-1.8,5-4.2,11-9,13.7c-3.6,2-8.8,1.2-11.7-1.5
					c-4.1-3.8-4.4-10.9-3.4-16c1.2-5.9,3.6-11.2,8.8-14.5C166.5,239.3,170.7,240.5,169.2,246.1c4.9,0.7,9.8,1.4,14.7,2.1v-0.1
					c0-9.7-15-9.7-15,0v0.1c0,8.4,12.6,10.3,14.7,2c2.7-10.4-1.5-20.1-11.7-23.9c-9.2-3.5-20.2,3.3-25.7,10.2
					c-12.7,15.8-11.9,46.3,10.4,52.8c8.8,2.6,18.9-0.4,25.3-6.7c6.2-6.1,9.5-15.8,11.8-24c1.2-4.4-0.1-9-3.7-11.8
					c-3.5-2.8-10.4-4.4-13.7-0.2c-2.9,3.7-3.1,7.7-4.9,11.9c-1.3,3-4,8.8-7.8,8.3c-7.5-1-10.2,10.8-3.8,14c0.1,0,0.1,0.1,0.2,0.1
					c1.9-4.6,3.9-9.1,5.8-13.7c0.5-0.3,0.5-0.8-0.1-1.4c-1.7,3.1-3.5,6.2-5.2,9.2c11.7-4.5,19.7-12.8,23.3-24.9
					C186.4,240.8,172,236.8,169.2,246.1z"/>
				<path class="st0" d="M167.5,234.1c-11.5,3.2-16,16-17.1,26.7c-0.7,6,6.7,8.8,11.3,6.5c8.3-4.3,14.1-11.6,16.3-20.7
					c-4.9-0.7-9.8-1.3-14.7-2v0.1c0,8.2,13.4,10.5,14.7,2c1-6.4-1.1-12.4-8.5-12.8c-9.7-0.5-9.6,14.5,0,15c0.3,0,0.5,0,0.8,0
					c-2.2-1.2-4.3-2.5-6.5-3.7c0.2,0.3,0.3,0.5,0.5,0.8c-0.3-1.3-0.7-2.5-1-3.8c0.1,0.2,0.1,0.3,0.2,0.5c4.9,0.7,9.8,1.3,14.7,2
					v-0.1c0-8.4-12.7-10.3-14.7-2c-1.3,5.5-4.4,9.1-9.4,11.8c3.8,2.2,7.5,4.3,11.3,6.5c0.4-3.6,2-11.1,6.1-12.2
					C180.8,246,176.8,231.6,167.5,234.1z"/>
			</g>
		</g>
		<g>
			<path class="st3" d="M215.7,266.1c-0.8,1.9-1.7,3.8-2.8,5.7c-1.1,2-2.4,3.7-3.8,5.3c-1.5,1.6-3.1,2.9-4.9,3.9
				c-1.8,1-3.9,1.4-6.1,1.3c-1.3-0.1-2.5-0.4-3.6-0.9c-1.1-0.6-2-1.3-2.9-2.2c-0.9-0.9-1.6-1.9-2.1-3.1c-0.6-1.2-1-2.4-1.3-3.6
				c-0.3-1.8-0.5-3.5-0.4-5.1s0.3-3.1,0.7-4.5s0.8-2.8,1.4-4.2c0.5-1.4,1.2-2.8,1.8-4.2l1.1-2.3v0.1l1.2-2.8
				c0.3-0.6,0.6-1.2,1.1-1.6c0.5-0.5,1.4-1,2.8-1.4c-0.7,0.2-1.3,0.3-1.7,0.4c-0.4,0.1-0.8,0.2-1.2,0.3c-0.6,0.2-1.2,0.3-1.9,0.5
				s-1.5,0.2-2.4,0.2h-0.8c-0.8,1.9-1.5,3.7-2.1,5.5s-1.2,3.5-1.6,5.1v-0.1c-0.1,0.3-0.5,0.4-1.1,0.2c-0.6-0.2-1.2-0.5-1.9-0.9
				s-1.2-0.9-1.7-1.4s-0.7-1-0.5-1.4l0.1,0.1c0.8-2.1,1.4-3.9,1.9-5.5s0.9-3,1.3-4.2c-0.8-0.9-1.3-2-1.6-3.3c-0.4-1.7-0.4-3.2,0-4.5
				s0.9-2.9,1.5-4.6c0.2-0.7,0.4-1.5,0.6-2.4c0.2-0.9,0.3-2,0.4-3.2c0.9,0.4,1.9,0.9,2.8,1.4c1,0.5,1.9,1,2.7,1.6s1.6,1.4,2.2,2.2
				c0.6,0.8,1.1,1.8,1.3,2.8c0.1,0.5,0.2,1,0.2,1.6c0.1,0.6,0,1.3-0.1,2l-2,3.7c-0.2,0.3,0,0.4,0.5,0.1c0.5-0.2,1.1-0.7,1.9-1.3
				c0.8-0.6,1.7-1.3,2.7-2.1s1.9-1.6,2.8-2.5c0.9-0.8,1.7-1.6,2.4-2.3s1.2-1.3,1.4-1.6c0.3,0,0.8,0.2,1.4,0.5
				c0.6,0.3,1.2,0.7,1.9,1.1c0.7,0.4,1.2,0.8,1.7,1.2s0.8,0.6,0.9,0.7c0.8,0.9,1.3,2,1.4,3.3c0.1,1.3-0.1,2.7-0.5,4.2
				s-1,3.2-1.7,4.9s-1.6,3.5-2.4,5.3c-0.5,1-1,2-1.5,3s-1,2-1.4,3c-0.3,0.8-0.7,1.6-1.2,2.6c-0.4,1-0.8,2-1.2,3c-0.3,1-0.6,2-0.7,3
				c-0.2,1-0.2,1.8,0,2.5c0,0.3,0.3,0.5,1,0.5c0.6,0.1,1.3-0.1,2.1-0.6s1.6-1.1,2.4-2c0.8-0.9,1.6-1.9,2.3-3
				c0.7-1.2,1.4-2.4,1.9-3.8h-0.1c0.7-1.8,1.4-3.5,1.9-5.2c0.6-1.7,1-3.2,1.3-4.4c0.2-0.3,0.6-0.3,1.2-0.1c0.7,0.2,1.3,0.5,2,0.9
				s1.2,0.9,1.7,1.5s0.7,1.1,0.5,1.4v-0.2l-1.3,4.1c-0.3,1.1-0.6,2.1-0.8,3C216.3,264.5,216.1,265.3,215.7,266.1L215.7,266.1z"/>
			<g>
				<path class="st0" d="M209.2,262.4c-1.2,2.9-8.3,17.5-12.8,11.2c-3.6-5.2,0.3-12.6,2.6-17.5c-4.7-1.3-9.3-2.5-14-3.8v0.1
					c0,7,10.8,10.9,14,3.8c0.5-1.2,2-2.9,0.7-2.4c9.1-3.2,5.5-16.6-4-14.5c-2,0.5-3.9,1-6,1c-3.6,0-6,2.4-7.2,5.5
					c-1.4,3.5-2.6,7-3.7,10.5c4.9,0.7,9.8,1.3,14.7,2v-0.1c0-6.9-8-9.5-12.8-5.3c-0.1,0.1-0.2,0.2-0.4,0.3c1.8-0.7,3.5-1.5,5.3-2.2
					c0.8-0.2,1.3,0,1.6,0.7c0.3,1.3,0.7,2.5,1,3.8c0-0.2,0-0.4,0-0.6c-4.3,1.8-8.5,3.5-12.8,5.3l0.1,0.1c4.2,4.2,10.7,1.9,12.5-3.3
					c1.5-4.1,5.2-11.4,2.4-15.4c-1.3-1.9-0.7-2.8,0-5c1-3.1,1.5-6.1,1.8-9.3c-3.8,2.2-7.5,4.3-11.3,6.5c2.6,1.2,5.7,1.9,5.4,5.1
					c0.3-1.3,0.7-2.5,1-3.8c-1.3,2.5-2.9,4.9-3,7.8c-0.2,4.7,4.9,8.8,9.5,7.2c6.2-2.1,12.4-8.3,16.2-13.4c-2.8,1.1-5.6,2.3-8.5,3.4
					c-1.3-0.3,1.3,0.7,1.5,0.9c2.2,1.4,0.3-1.2,0.3,0c0,2.6-1.9,5.7-3,8c-2.9,6.3-7,12.7-7.7,19.8c-0.6,6.8,4.6,12,11.5,10.1
					c6.6-1.8,10.6-8.6,13-14.5c1.8-4.6-2.8-9.5-7.2-9.5h-0.1c2.4,3.2,4.8,6.3,7.2,9.5c1.2-3.1,2.4-6.3,3.2-9.6
					c-1.1,1.5-2.3,3-3.4,4.5c0.1-0.1,0.3-0.2,0.4-0.2c-1.9,0.3-3.9,0.5-5.8,0.8c1.3,0.2,0.9,0.5,0.5-0.1c-0.3-1.3-0.7-2.5-1-3.8
					c0,0.2,0,0.4,0,0.6c0,9.7,15,9.7,15,0c0-0.1,0-0.1,0-0.2c0-8.7-12.2-10-14.7-2c-0.4,1.1-0.7,2.2-1.1,3.3
					c-0.3,0.8-0.4,1.5-0.7,2.4c-0.6,2.4-2.3,3.7,0.6,0.7c-6.8,6.9,3.8,17.5,10.6,10.6c3.1-3.1,3.7-8.9,5-13c-4.9-0.7-9.8-1.3-14.7-2
					c0,0.1,0,0.1,0,0.2c5,0,10,0,15,0c0-5.5-5.2-10.5-10.5-11.3c-9.4-1.3-10.2,8.4-12.9,15c-1.8,4.6,2.8,9.5,7.2,9.5h0.1
					c-2.4-3.2-4.8-6.3-7.2-9.5c-0.8,2.1-2.2,3.9-4.3,4.8c1.3-0.3,2.5-0.7,3.8-1c0.1,0.1,0.2,0.2,0.3,0.3c1.5,1.1,3,2.3,4.5,3.4
					c-0.1-0.1-0.2-0.2-0.2-0.4c0.3,1.3,0.7,2.5,1,3.8c-0.4-3.9,2.5-8.5,4.2-11.9c2.2-4.3,4.3-8.8,5.7-13.5c2.7-9-2.7-18.3-12-20.3
					c-3.6-0.7-6.3,0.6-8.5,3.4c-1,1.3-2.8,2.6-4.1,3.7c-0.5,0.5-4.1,3.2-3.2,2.9c3.2,2.4,6.3,4.8,9.5,7.2c0-0.1,0-0.2,0-0.3
					c-0.3,1.3-0.7,2.5-1,3.8c2-3.8,3.5-7,2.8-11.5c-1.1-7.2-6.5-11.1-12.7-14.1c-5.5-2.6-10.7,0.6-11.3,6.5
					c-0.4,3.3-1.9,6.3-2.5,9.6c-0.8,4.2,0.2,8.7,2.7,12.2c-0.3-1.9-0.5-3.9-0.8-5.8c-1,3.2-2,6.5-3.1,9.6c4.2-1.1,8.4-2.2,12.5-3.3
					l-0.1-0.1c-4.6-4.6-12.8-1.2-12.8,5.3c0,8.5,11.5,14.4,18,8.7c-4.3-1.8-8.5-3.5-12.8-5.3v0.1c0,8.6,12.2,10,14.7,2
					c1.1-3.6,2.3-7.1,3.7-10.5c-2.4,1.8-4.8,3.7-7.2,5.5c3.5,0,6.6-0.8,10-1.6c-1.3-4.8-2.7-9.6-4-14.5c-5.1,1.8-7.6,4.5-9.7,9.3
					c4.7,1.3,9.3,2.5,14,3.8V252c0-7-10.7-10.8-14-3.8c-5.5,11.9-10,26.6,0.9,37c5.8,5.5,13.9,5.2,20.8,2.1
					c6.9-3.1,11.4-11,14.3-17.6c1.6-3.8,1.2-8-2.7-10.3C216.3,257.8,210.8,258.6,209.2,262.4z"/>
			</g>
		</g>
		<g>
			<path class="st3" d="M233.1,232.9c2.4,0.4,4.4,1.5,6.1,3.2c1.7,1.7,3,3.6,4,5.8c0.8,0.8,1.6,1.7,2.2,2.8c0.7,1.1,1.3,2.3,1.9,3.7
				c0.1,0.4,0.2,0.9,0.4,1.3c0.1,0.4,0.3,1,0.4,1.6c0.5,2.4,0.8,4.8,0.8,7.2s-0.3,4.8-0.8,7.1c-0.5,2.3-1.3,4.4-2.3,6.5
				s-2.2,3.8-3.5,5.4c-1.3,1.5-2.9,2.7-4.6,3.6c-1.7,0.9-3.5,1.3-5.4,1.3c-3.6-0.1-7-1.3-10.3-3.6c-3.3-2.3-5.9-5.9-7.9-10.7
				c-0.4-1.2-0.9-2.5-1.3-4.1c-0.6-2.4-0.8-4.8-0.7-7.3s0.6-4.9,1.3-7.3c0.7-2.4,1.7-4.6,3-6.7c1.3-2.1,2.7-3.9,4.4-5.4
				s3.6-2.7,5.6-3.5C228.5,233,230.7,232.7,233.1,232.9z M236.1,254.6c-0.5-0.2-0.9-0.5-1.3-1.2c-0.4-0.6-0.7-1.3-1-2
				s-0.6-1.5-0.7-2.3c-0.2-0.8-0.3-1.5-0.5-2.1c-0.1-0.7,0-1.4,0.2-2.1c0.2-0.7,0.6-1.3,0.9-1.8c0.4-0.5,0.8-1,1.2-1.4
				s0.8-0.7,1-0.8c-0.2-0.1-0.6-0.2-1.2-0.2c-1.2,0.1-2.3,0.6-3.6,1.4c-1.2,0.9-2.3,1.9-3.3,3.2c-0.9,1.4-1.7,2.9-2.3,4.6
				c-0.6,1.7-1,3.4-1.3,5.2s-0.4,3.6-0.3,5.4c0.1,1.8,0.3,3.4,0.7,5c0.4,2.1,1.2,3.8,2.3,5.2c1.1,1.4,2.6,2.2,4.4,2.3
				c2,0.1,3.7-0.7,5.3-2.3c1.5-1.6,2.8-3.7,3.7-6.2s1.5-5.1,1.7-8s0.1-5.4-0.5-7.7v-0.4c-0.4,0-0.9,0.2-1.3,0.5
				c-0.4,0.4-0.8,0.8-1.2,1.3c-0.3,0.5-0.6,1-0.8,1.6c-0.2,0.5-0.3,1-0.3,1.5L236.1,254.6z"/>
			<g>
				<path class="st0" d="M231.1,240.1c4,1,4.3,4.4,6.8,7.1c2.4,2.5,3.1,6.1,3.4,9.5c0.4,5.4-2,19.4-10.1,18.1
					c-16.3-2.5-15.1-34.7,1.9-34.4c9.7,0.2,9.7-14.8,0-15c-16.2-0.3-27,14.4-28.3,29.4c-1.3,15.1,8,32.2,24,34.7
					c17.2,2.7,26.2-14.5,27.6-29.2c0.7-7.6-1.5-15.9-6.2-22c-4.5-5.7-7.4-10.8-15-12.7C225.7,223.3,221.7,237.8,231.1,240.1z"/>
				<path class="st0" d="M239.8,248.1c1.3,0.8,0.7,0.4,0.4-1c-0.2-1.7-0.4-1.5-0.6,0.6c0.4-0.6,0.9-1.1,1.6-1.5
					c5.8-4.7,0.2-12.1-5.3-12.8c-9.4-1.3-15.7,8.6-18.2,16.2c-2.8,8.8-1.9,20.5,4.7,27.4c7.2,7.5,17.4,2.2,22.3-4.7
					c2.4-3.4,3.6-8,4.2-12.1c0.6-3.9-0.1-9.2-0.1-11.8c0-4.4-4.9-9.1-9.5-7.2c-4.7,1.9-7.8,5-8.8,10.1c1.1-1.5,2.3-3,3.4-4.5
					c-0.6,0.5-1.2,0.9-1.8,1.4c-3.2,2.5-5,6.4-2.7,10.3c1.9,3.2,7,5.2,10.3,2.7c1.4-1.1,7.7-7.2,3.6-5.5c-3.2-2.4-6.3-4.8-9.5-7.2
					c0,2.8,0.6,5.4,0.5,8.2c-0.1,2.1-0.8,4.1-1.4,6c-0.3,1-2.4,2.8-1,3c1.1,0.2,0.1-0.8-0.2-2.1c-0.6-2.2-0.4-4.4-0.3-6.6
					c0.1-2,1.7-8.9,4.4-8.6c-1.8-4.3-3.5-8.5-5.3-12.8c-7.8,6.2-7.2,20.3,1.7,25.5C240.6,266,248.2,253,239.8,248.1z"/>
			</g>
		</g>
		<g>
			<path class="st3" d="M267.5,237.1c-0.3,1-0.6,2.5-1,4.3s-0.8,3.8-1.3,6.1c-0.4,2.2-0.9,4.6-1.3,7c-0.4,2.4-0.8,4.8-1.1,7.1
				c-0.3,2.3-0.4,4.4-0.5,6.3s0.1,3.5,0.4,4.6c-0.1,0.2-0.1,0.3,0,0.4c0,0.1,0,0.2,0,0.2h0.6c1.4-0.5,2.6-1.4,3.6-2.7
				c1-1.2,1.9-2.6,2.7-4.2c0.8-1.6,1.5-3.2,2.1-5s1.2-3.5,1.7-5.2h-0.1c0.1-0.5,0.3-1,0.5-1.4c0.2-0.5,0.4-0.9,0.5-1.4
				c0.1-0.3,0.4-0.4,1-0.2s1.3,0.4,1.9,0.8c0.7,0.4,1.2,0.8,1.8,1.4c0.5,0.5,0.8,1,0.7,1.4l-1.2,3.7c-0.9,3.1-2.1,6.3-3.4,9.5
				s-3,6-4.9,8.4c-0.3,0.4-0.8,0.9-1.3,1.4c-0.6,0.5-1.2,1-1.9,1.4c-0.7,0.4-1.6,0.8-2.5,1.1c-0.9,0.3-1.9,0.5-3,0.5
				c-2.5-0.1-4.5-1.1-5.9-3c-1.5-1.9-2.6-4.3-3.3-7.1c-0.2-0.6-0.4-1.2-0.5-1.9c-0.1-0.7-0.1-1.3-0.1-1.9c-0.3-2.7-0.4-5.5-0.2-8.1
				c0.1-2.7,0.3-5.3,0.7-7.9c0.3-2.6,0.8-5.2,1.3-7.7c0.5-2.6,1.1-5.1,1.6-7.6l1.6-6.9c0.4-2.1,0.8-4.2,1.2-6.4
				c0.4-2.2,0.7-4.3,1-6.4c0.3-2.1,0.5-4.1,0.7-6.1c0.2-1.9,0.2-3.8,0.2-5.4c0.7-0.4,1.7-0.4,3.1,0c1.3,0.5,2.7,1.2,4.1,2.2
				s2.6,2.1,3.6,3.4c1,1.3,1.5,2.5,1.5,3.7c-0.1,0.8-0.2,2-0.5,3.5s-0.6,3.3-1,5.2s-0.9,3.9-1.3,6c-0.5,2.1-0.9,4-1.3,5.8
				L267.5,237.1z"/>
			<g>
				<path class="st0" d="M260.3,235.1c-3.2,12.6-6.8,28-4.8,40c0.6,3.2,4.2,5.5,7.2,5.5c11,0,15.2-14.3,17.9-22.6
					c1.5-4.7-2.5-9.5-7.2-9.5h-0.1c2.4,3.2,4.8,6.3,7.2,9.5c0.8-2,0.6-1.9-0.6,0.2c-1.8,0.7-3.5,1.5-5.3,2.2
					c-1.2-0.1-1.6,0.5-2.1-1.9c0-1.3,0-2.7,0-4c-2.2,6.7-3.9,14.7-8.9,19.8c-2.8,2.8-3.6-2.2-4.4-4.8c-1-3.5-0.3-8.5-0.1-12.2
					c1.1-17.3,7.7-33.7,8-51.2c-1.8,2.4-3.7,4.8-5.5,7.2c-1.2-0.1-1.2,0.1,0,0.6c0.8,0.4,2.5,1.5,2.9,2.4c-0.1-1.1-0.2-0.9-0.3,0.8
					c-0.3,1.7-0.7,3.5-1,5.2C262.2,226.5,261.3,230.8,260.3,235.1c-2.2,9.4,12.3,13.4,14.5,4c1.8-7.8,5.5-17.5,4.4-25.6
					c-1.2-8.3-13-17.6-21.5-14.6c-3.2,1.1-5.4,3.7-5.5,7.2c-0.2,12.5-3.4,24.6-6,36.8c-2.7,12.9-6,34.4,6.1,43.8
					c6.4,4.9,15,4,21-1.1s9-13.1,11.5-20.3c2-5.8,4.2-11.5-1.2-16.2c-2.6-2.3-5.5-3.4-8.9-3.7c-5.1-0.4-7.3,4.7-8.5,8.6
					c-1.5,4.7,2.5,9.5,7.2,9.5h0.1c-2.4-3.2-4.8-6.3-7.2-9.5c-1.4,4.2-2.4,10.5-6.7,12.7c1.3-0.3,2.5-0.7,3.8-1c-0.2,0-0.4,0-0.6,0
					c2.4,1.8,4.8,3.7,7.2,5.5c0.4,2,0.4,1.8,0-0.7c-0.3-1.3-0.1-2.7-0.1-4.1c0.1-3.3,0.7-6.6,1.2-9.9c1-5.8,2.2-11.6,3.6-17.3
					C277.2,229.7,262.7,225.7,260.3,235.1z"/>
			</g>
		</g>
		<g>
			<path class="st3" d="M289.7,237.1c-0.3,1-0.6,2.5-1,4.3s-0.8,3.8-1.3,6.1c-0.4,2.2-0.9,4.6-1.3,7c-0.4,2.4-0.8,4.8-1.1,7.1
				c-0.3,2.3-0.4,4.4-0.5,6.3s0.1,3.5,0.4,4.6c-0.1,0.2-0.1,0.3,0,0.4c0,0.1,0,0.2,0,0.2h0.6c1.4-0.5,2.6-1.4,3.6-2.7
				c1-1.2,1.9-2.6,2.7-4.2c0.8-1.6,1.5-3.2,2.1-5s1.2-3.5,1.7-5.2h-0.1c0.1-0.5,0.3-1,0.5-1.4c0.2-0.5,0.4-0.9,0.5-1.4
				c0.1-0.3,0.4-0.4,1-0.2s1.3,0.4,1.9,0.8c0.7,0.4,1.2,0.8,1.8,1.4c0.5,0.5,0.8,1,0.7,1.4l-1.2,3.7c-0.9,3.1-2.1,6.3-3.4,9.5
				s-3,6-4.9,8.4c-0.3,0.4-0.8,0.9-1.3,1.4c-0.6,0.5-1.2,1-1.9,1.4c-0.7,0.4-1.6,0.8-2.5,1.1c-0.9,0.3-1.9,0.5-3,0.5
				c-2.5-0.1-4.5-1.1-5.9-3c-1.5-1.9-2.6-4.3-3.3-7.1c-0.2-0.6-0.4-1.2-0.5-1.9c-0.1-0.7-0.1-1.3-0.1-1.9c-0.3-2.7-0.4-5.5-0.2-8.1
				c0.1-2.7,0.3-5.3,0.7-7.9c0.3-2.6,0.8-5.2,1.3-7.7c0.5-2.6,1.1-5.1,1.6-7.6l1.6-6.9c0.4-2.1,0.8-4.2,1.2-6.4
				c0.4-2.2,0.7-4.3,1-6.4c0.3-2.1,0.5-4.1,0.7-6.1c0.2-1.9,0.2-3.8,0.2-5.4c0.7-0.4,1.7-0.4,3.1,0c1.3,0.5,2.7,1.2,4.1,2.2
				s2.6,2.1,3.6,3.4c1,1.3,1.5,2.5,1.5,3.7c-0.1,0.8-0.2,2-0.5,3.5s-0.6,3.3-1,5.2s-0.9,3.9-1.3,6c-0.5,2.1-0.9,4-1.3,5.8
				L289.7,237.1z"/>
			<g>
				<path class="st0" d="M282.5,235.1c-3.2,12.6-6.9,28-4.8,40c0.6,3.2,4.1,5.5,7.2,5.5c11,0,15.2-14.3,17.9-22.6
					c1.5-4.7-2.5-9.5-7.2-9.5h-0.1c2.4,3.2,4.8,6.3,7.2,9.5c0.8-2,0.6-1.9-0.6,0.2c-1.8,0.7-3.5,1.5-5.3,2.2
					c-1.2-0.1-1.6,0.5-2.1-1.9c0-1.3,0-2.7,0-4c-2.2,6.7-3.9,14.7-8.9,19.8c-2.8,2.8-3.6-2.2-4.4-4.8c-1-3.5-0.3-8.5-0.1-12.2
					c1.2-17.3,7.7-33.7,8-51.2c-1.8,2.4-3.7,4.8-5.5,7.2c-1.2-0.1-1.2,0.1,0,0.6c0.8,0.4,2.5,1.5,2.9,2.4c-0.1-1.1-0.2-0.9-0.3,0.8
					c-0.3,1.7-0.7,3.5-1,5.2C284.4,226.5,283.5,230.8,282.5,235.1c-2.2,9.4,12.3,13.4,14.5,4c1.8-7.8,5.5-17.5,4.4-25.6
					c-1.2-8.3-13-17.6-21.5-14.6c-3.2,1.1-5.4,3.7-5.5,7.2c-0.2,12.5-3.4,24.6-6,36.8c-2.7,12.9-6,34.4,6.1,43.8
					c6.4,4.9,15,4,21-1.1c6-5,9-13.1,11.5-20.3c2-5.8,4.2-11.5-1.2-16.2c-2.6-2.3-5.5-3.4-8.9-3.7c-5.1-0.4-7.3,4.7-8.5,8.6
					c-1.5,4.7,2.5,9.5,7.2,9.5h0.1c-2.4-3.2-4.8-6.3-7.2-9.5c-1.4,4.2-2.4,10.5-6.7,12.7c1.3-0.3,2.5-0.7,3.8-1c-0.2,0-0.4,0-0.6,0
					c2.4,1.8,4.8,3.7,7.2,5.5c0.4,2,0.4,1.8,0-0.7c-0.3-1.3-0.1-2.7-0.1-4.1c0.1-3.3,0.7-6.6,1.2-9.9c1-5.8,2.2-11.6,3.6-17.3
					C299.3,229.7,284.9,225.7,282.5,235.1z"/>
			</g>
		</g>
		<g>
			<path class="st3" d="M299.9,233.4c0.7-0.4,1.7-0.3,3,0.2s2.6,1.3,3.8,2.3c1.3,1,2.3,2.2,3.2,3.5c0.9,1.3,1.2,2.7,0.9,3.9
				c0.1-0.1,0,0,0,0.3c-0.1,0.3-0.2,0.8-0.4,1.3c-0.2,0.6-0.3,1.2-0.5,1.9s-0.4,1.4-0.5,2c-0.6,2.1-1.3,4.6-2,7.4s-1.4,5.4-2,7.9
				s-1,4.6-1.2,6.3c-0.2,1.7,0,2.6,0.5,2.6h0.6c1.5-0.5,2.9-1.4,4.1-2.7c1.2-1.2,2.2-2.7,3.2-4.2c0.9-1.6,1.8-3.3,2.6-5.1
				c0.8-1.8,1.5-3.5,2.2-5.2l0.7-2c0.2-0.3,0.6-0.4,1.2-0.2c0.7,0.2,1.3,0.5,2,1s1.2,1,1.6,1.6s0.6,1.1,0.4,1.4v-0.2
				c-1.3,3.6-2.9,7.2-4.8,10.9c-2,3.7-4.1,6.9-6.4,9.7c-0.4,0.4-0.9,0.8-1.5,1.4c-0.6,0.5-1.3,1-2,1.4s-1.6,0.8-2.5,1.1
				c-0.9,0.3-1.9,0.5-2.9,0.5c-2.1-0.1-3.8-0.9-5.2-2.5c-1.4-1.6-2.4-3.6-3-6.1c-0.2-0.9-0.3-1.8-0.4-2.7c-0.1-0.9-0.1-1.9,0-2.9
				l-0.1,0.1c0-2.7,0.3-5.9,0.9-9.6c0.6-3.6,1.3-7.3,2-10.9c0.4-2.5,0.9-4.9,1.3-7.2s0.7-4.5,0.8-6.4L299.9,233.4z M302.3,208.2
				c0.4-0.1,1,0.1,1.7,0.5s1.5,0.9,2.3,1.5s1.7,1.3,2.5,2.1c0.9,0.8,1.6,1.6,2.3,2.3c0.7,0.7,1.3,1.4,1.8,2.1
				c0.5,0.6,0.7,1.1,0.8,1.4c0.1,1.6,0,3-0.2,4.2c-0.3,1.2-0.5,2.4-0.8,3.7s-0.5,2.6-0.8,3.9c-0.3,1.3-0.4,2.9-0.4,4.6
				c-0.8-0.2-1.6-0.6-2.6-1.2c-1-0.6-2-1.4-2.9-2.2s-1.7-1.7-2.4-2.6c-0.7-0.9-1.1-1.6-1.3-2.2c-0.2-1.1-0.4-2.3-0.4-3.6
				c-0.1-1.3-0.1-2.7,0-4.1c0.1-1.4,0.1-2.9,0-4.4s-0.2-2.9-0.5-4.3L302.3,208.2z"/>
			<g>
				<path class="st0" d="M301.9,240.7c-2.4,0.7-0.8,0.3,0.7,1.7c1.4,1.2,0.6,0.6,0.3,1.6c-0.8,2.9-1.6,5.8-2.4,8.7
					c-1.7,6.4-6.4,17.6-2.7,23.9c4.5,7.7,13.7,2.7,18-2.2c4.5-5.1,7.3-12.1,9.4-18.5c-1.1,1.5-2.3,3-3.4,4.5
					c0.1-0.1,0.3-0.2,0.4-0.3c-1.3,0.3-2.5,0.7-3.8,1c-1.1-0.8-1.7-0.9-1.6-0.3c-0.3-1.3-0.7-2.5-1-3.8c0,0.2,0,0.4,0,0.6
					c5,0,10,0,15,0c0-0.1,0-0.1,0-0.2c0-8.9-11.9-9.7-14.7-2c-2.2,6.1-5.2,12.2-9.3,17.3c-0.8,0.9-2.8,2.5-3.5,1.9
					c-1.5-1.4-1.3-4.5-1.2-6.4c0.4-6.6-8.4-9.8-12.8-5.3l-0.1,0.1c4.3,1.8,8.5,3.5,12.8,5.3c0.2-11.5,4.1-22.6,4.9-34
					c-0.3,1.3-0.7,2.5-1,3.8c0.2-0.3,0.4-0.7,0.6-1c4.9-8.4-8.1-15.9-13-7.6c-1.4,2.4-1.5,4.7-1.8,7.5c-0.5,3.6-1.2,7.2-1.9,10.7
					c-1.4,6.8-2.7,13.7-2.8,20.6c-0.1,6.6,8.3,9.9,12.8,5.3l0.1-0.1c-4.3-1.8-8.5-3.5-12.8-5.3c-0.7,12.3,8.8,25.7,22.4,20.4
					c11.4-4.5,17.2-18.6,21.1-29.2c-4.9-0.7-9.8-1.3-14.7-2c0,0.1,0,0.1,0,0.2c0,9.7,14.7,9.6,15,0c0.2-7.2-10-14.8-16.6-10.3
					c-6.5,4.5-4.8,15.6-12.7,19.1c1.3-0.3,2.5-0.7,3.8-1c-0.2,0-0.4,0-0.6,0c1.3,0.3,2.5,0.7,3.8,1c-0.1-0.1-0.3-0.2-0.4-0.3
					c1.1,1.5,2.3,3,3.4,4.5c-0.3-1.5,1.1-4.6,1.4-6.1c0.6-2.7,1.3-5.3,2.1-8c1.1-4.2,2.8-8.6,3.3-12.9c1.2-9.6-11.1-20.2-20.4-17.5
					C288.7,228.9,292.6,243.3,301.9,240.7z"/>
				<path class="st0" d="M302.3,215.7c-2.1-0.2,1.8,2.4,2.5,3.1c0.7,0.7,1.4,1.4,2.1,2.2c-0.5-1.6-0.7-1.8-0.6-0.7
					c-0.8,4.8-2.2,9.3-2.3,14.2c3.2-2.4,6.3-4.8,9.5-7.2c-4.4-1.5-4.2-3.7-4.2-7.3c0-4.1,0-8-0.7-12.1c-0.3,1.9-0.5,3.9-0.8,5.8
					c0.3-0.6,0.7-1.2,1-1.7c4.8-8.4-8.2-16-13-7.6c-1.7,2.9-2,5-1.6,8.3c0.4,3.7-0.1,7.5,0.2,11.2c0.6,8.5,7.2,15.1,15.1,17.7
					c4.8,1.6,9.4-2.6,9.5-7.2c0.2-6.4,4.9-14.8,1-20.8c-3.9-5.9-10.4-12.3-17.7-13C292.7,199.8,292.8,214.8,302.3,215.7z"/>
			</g>
		</g>
		<g>
			<path class="st3" d="M363.2,264.4c-0.5,1.4-1.2,3.2-2.1,5.2s-1.9,4-3.2,5.9c-1.2,1.9-2.6,3.6-4.2,4.9s-3.3,2-5.2,2
				c-1.2,0-2.3-0.2-3.5-0.6s-2.3-1.1-3.4-1.9c-1-0.9-2-2-2.8-3.4s-1.4-3.1-1.8-5c-0.3-1.6-0.4-3.3-0.5-4.9s0-3.3,0.1-5
				c0.1-1.8,0.3-3.7,0.6-5.7c0.3-2.1,0.6-4.4,1-7c0.5-2.3,0.6-4.1,0.2-5.4l-2.6,3.4c-1.5,1.9-2.9,3.7-4,5.6c-1.2,1.9-2.3,4-3.4,6.3
				c-0.5,3.5-0.9,7-0.9,10.5c-0.1,3.6,0.2,7.2,0.8,10.9c0.1,0.6-0.4,0.9-1.4,0.8s-2-0.3-3.2-0.8s-2.3-1.1-3.4-1.8
				c-1.1-0.7-1.8-1.4-2-2.1c-0.5-2.5-0.8-4.9-0.9-7.2c-0.1-2.3-0.2-4.6-0.1-6.9s0.2-4.5,0.5-6.8c0.2-2.2,0.4-4.5,0.7-6.7
				c0.3-2.6,0.5-5.2,0.7-7.7s0.4-4.9,0.5-7.2c0.5-0.3,1.3-0.3,2.3,0s2.1,0.8,3.3,1.4c1.2,0.7,2.3,1.5,3.3,2.4c1.1,1,1.9,2,2.4,3
				c1.6-2,3.3-3.7,5.2-5c1.9-1.4,4-2.1,6.3-2.3c0.7,0,1.6,0.3,2.6,1s2,1.5,3,2.5c0.9,1,1.7,2.1,2.3,3.2c0.6,1.2,0.9,2.2,0.9,3
				c-0.3,2.8-0.6,5.4-1,7.9c-0.4,2.4-0.8,4.5-1,6.3c-0.3,1.5-0.5,3-0.7,4.2c-0.2,1.3-0.3,2.6-0.4,3.8c-0.1,1.3-0.1,2.6,0,3.9
				s0.2,2.7,0.5,4.3c0-0.1,0.1-0.3,0.3-0.5h0c1.3-0.8,2.8-2.2,4.4-4.2s3.1-4.7,4.3-8.1c0.4-0.9,0.7-1.7,1-2.6
				c0.3-0.8,0.5-1.6,0.8-2.5l0.7-2.4c0.1-0.3,0.5-0.3,1.2-0.2s1.3,0.4,2,0.8c0.7,0.4,1.3,0.8,1.8,1.4c0.5,0.5,0.7,1,0.5,1.4v-0.2
				L363.2,264.4L363.2,264.4z"/>
			<g>
				<path class="st0" d="M356,262.4c-1.5,4.2-3.3,8.4-6.4,11.7c-2.8,3.1-4.7-2.6-5.2-4.6c-2.2-9.3,3.1-18.8,1.4-28
					c-0.9-5.2-9.2-7.6-12.5-3.3c-3.8,4.9-7.5,9.6-10.4,15.1c-4.3,8.3-3.1,19.9-1.7,28.9c0.3-1.9,0.5-3.9,0.8-5.8
					c-0.1,0.2-0.2,0.4-0.3,0.7c1.5-1.1,3-2.3,4.5-3.4c-0.4,0.1-0.7,0.1-1.1,0.2c1.3,0,2.7,0,4,0c-3.7-0.6-3.8-1-4.1-4.7
					c-0.3-4-0.1-8,0.2-12c0.6-7.8,1.6-15.5,2-23.3c-1.8,2.4-3.7,4.8-5.5,7.2c0.3-0.1,0.6-0.2,0.9-0.3c-1.3,0-2.7,0-4,0
					c2.4,0.4,4.7,1.6,5.9,3.6c2.4,3.8,8.6,5.3,11.8,1.5c1-1.1,2-2.2,3-3.2c0.7-0.7,2.9-1.5,2.1-1.9c3.4,1.8,2.3,5.1,1.8,8.2
					c-1.4,9-3.1,17.4-1.7,26.5c1.1,6.9,10.5,6.6,13.7,1.8c0.1-0.2,0.2-0.3,0.3-0.5c3.2-4.8-1-11.3-6.5-11.3h-0.1
					c1.3,4.7,2.5,9.3,3.8,14c8.2-5.8,12.1-14.7,14.7-24.2c-1.1,1.5-2.3,3-3.4,4.5c0.1-0.1,0.2-0.2,0.4-0.3c-1.3,0.3-2.5,0.7-3.8,1
					c-0.7,0.1-1.2-0.2-1.4-0.8c-0.3-1.3-0.7-2.5-1-3.8c0,0.2,0,0.4,0,0.6c0,9.7,15,9.7,15,0c0-0.1,0-0.1,0-0.2
					c0-8.6-12.3-10.1-14.7-2c-0.4,1.2-0.7,2.3-1.1,3.5c-0.3,0.9-0.5,1.8-0.8,2.6c-0.8,2.8-1.1,1,1.3-1.4
					c-6.9,6.8,3.7,17.4,10.6,10.6c2.7-2.6,3.3-7.8,4.4-11.3c-4.9-0.7-9.8-1.3-14.7-2c0,0.1,0,0.1,0,0.2c0,9.7,15,9.7,15,0
					c0-8.1-12-14.9-18.2-8.6c-2,2-2.5,5.5-3.4,8.2c-1.2,3.7-3,8-6.3,10.4c-5.8,4.1-4.2,14,3.8,14h0.1c-2.2-3.8-4.3-7.5-6.5-11.3
					c-0.1,0.2-0.2,0.3-0.3,0.5c4.6,0.6,9.1,1.2,13.7,1.8c-1.9-11.9,7-25.4,0.3-36.4c-3-5-9-9.9-15.1-9.2c-6.4,0.8-11.4,4.5-15.5,9.4
					c3.9,0.5,7.9,1,11.8,1.5c-3.9-6.2-12.2-12.4-19.8-10.3c-3.3,0.9-5.3,3.9-5.5,7.2c-0.5,10.1-2.1,20-2.4,30.1
					c-0.1,4.8,0.5,9.7,1.3,14.4c0.8,4.6,6.6,7.8,10.6,9.2c4,1.3,10.6,1.9,12.7-2.8c2.2-4.8,0.5-10.2,0.5-15.3
					c0-5.8,1.1-9.6,4.2-14.4c1.4-2.1,3.1-4.1,4.6-6.1c-4.2-1.1-8.4-2.2-12.5-3.3c0.5,2.9-1.1,7.5-1.5,10.4
					c-0.4,3.6-0.7,7.1-0.7,10.8c0.1,7.5,2.5,15.1,8.7,19.7c6.3,4.7,15.3,4.8,21.2-0.6c5.6-5.2,8.8-12.2,11.4-19.3
					C373.7,257.3,359.2,253.4,356,262.4z"/>
			</g>
		</g>
		<g>
			<path class="st3" d="M388.5,291.4l3.1,1.6c2.1,1.1,4.2,2.2,6.4,3.3c2.2,1.1,4.6,2.1,7.1,3H405c0.5,0.2,0.9,0.7,1,1.7s0,2-0.4,3.1
				s-1,2.1-2,3c-0.9,0.9-2.1,1.3-3.6,1.3c-1.3,0-2.5-0.4-3.8-1.1l-6-3.5c-0.9-0.6-1.7-1.2-2.6-1.6c-0.9-0.5-1.7-1-2.5-1.4
				c-1,2.4-2.1,4.6-3.3,6.6c-1.2,2-2.7,3.8-4.3,5.2c-1.6,1.5-3.6,2.6-5.8,3.5c-2.2,0.9-4.8,1.3-7.7,1.4c-1.7,0-3.5-0.2-5.3-0.5
				c-1.8-0.4-3.6-1-5.3-1.9c-1.7-0.9-3.2-2.2-4.5-3.8c-1.3-1.6-2.4-3.7-3.1-6.1c-0.8-2.9-0.9-5.6-0.3-8.2c0.6-2.5,1.8-4.7,3.5-6.6
				c1.7-1.8,3.9-3.3,6.5-4.3s5.4-1.5,8.4-1.5c1.5,0,3,0.1,4.2,0.2c1.3,0.1,2.5,0.3,3.7,0.5s2.3,0.5,3.4,0.8s2.2,0.7,3.3,1.1l1.3-7.3
				c0-0.2,0-0.4,0.1-0.5c-1,0.9-2.1,1.6-3.2,2.1s-2.3,0.8-3.5,0.8c-2.1-0.2-4-0.8-5.6-1.8s-3-2.1-4.1-3.4s-2-2.7-2.8-4.2
				c-0.7-1.5-1.2-2.9-1.6-4.2c-0.3-1.4-0.4-2.4-0.4-3c-0.2-2-0.2-4.3,0-6.7c0.2-2.4,0.8-4.8,1.5-7.3c0.8-2.4,1.8-4.8,3-7
				c1.2-2.3,2.6-4.3,4.3-6c1.6-1.8,3.5-3.2,5.5-4.2s4.2-1.6,6.6-1.6c0.7,0,1.4,0.1,2.1,0.2c0.7,0.1,1.5,0.3,2.3,0.5
				c1.5,0.4,2.8,1.1,3.9,2.1s2,2.1,2.8,3.4c0.8,1.3,1.4,2.7,1.9,4.1c0.5,1.5,0.9,2.9,1.2,4.3c0.1,0.3,0,0.5-0.3,0.7
				c-0.2,0.2-0.6,0.3-1,0.5c-0.4,0.1-0.9,0.2-1.4,0.2s-1-0.1-1.4-0.2c1,0.4,2,1,3,1.7s1.9,1.4,2.8,2.2c0.8,0.8,1.5,1.6,1.9,2.4
				c0.5,0.9,0.7,1.7,0.6,2.4L388.5,291.4z M366.2,310.2c2.3-1.2,4.2-3.1,5.8-5.6c1.6-2.5,2.9-5.3,4-8.4c-1.7-0.6-3.3-1.1-4.9-1.4
				c-1.6-0.4-3.2-0.6-4.9-0.6c-1.8-0.1-3.7,0.1-5.6,0.5s-3.6,1.1-5.2,1.9c-1.5,0.9-2.6,2-3.4,3.3s-0.9,2.9-0.4,4.7
				c0.3,1.2,0.8,2.2,1.5,3s1.5,1.5,2.3,2c0.9,0.5,1.8,0.9,2.9,1.2c1,0.2,2.1,0.4,3,0.4s1.7-0.1,2.5-0.3
				C364.7,310.7,365.5,310.5,366.2,310.2z M375.8,271.8c0.7-0.2,1.4-0.7,2.1-1.6s1.5-1.9,2.2-3.1s1.5-2.5,2.1-3.9
				c0.7-1.4,1.3-2.7,1.8-4c0.3-1.9,0.6-3.9,0.7-5.8c0.2-2,0.1-3.9-0.2-5.7c0.4-0.2,0.9-0.3,1.6-0.2s1.5,0.3,2.3,0.5
				c-0.3-0.2-0.5-0.4-0.6-0.8c-0.1-0.2-0.1-0.4-0.2-0.6c-0.1-0.2-0.2-0.4-0.2-0.7c-0.2-0.5-0.4-1.1-0.6-1.7
				c-0.2-0.6-0.6-1.2-0.9-1.7c-0.4-0.5-0.8-0.9-1.3-1.3c-0.5-0.3-1.1-0.5-1.8-0.6c-2-0.1-3.8,0.7-5.4,2.2c-1.5,1.5-2.8,3.4-3.9,5.7
				s-1.9,4.8-2.4,7.4c-0.5,2.6-0.9,5-0.9,7.2c-0.1,0.6,0,1.4,0,2.3c0.1,0.9,0.3,1.8,0.5,2.7c0.3,1.3,0.8,2.3,1.5,3.1
				C373.1,272.1,374.2,272.3,375.8,271.8z"/>
			<g>
				<path class="st0" d="M384.7,297.8c6,3.2,12.1,6.2,18.4,8.7c0.7-4.9,1.3-9.8,2-14.7H405c-6.1,0-10.5,8.5-5.3,12.8
					c-4.2-3.4,0.2-3.7,0.1-3.8c-1.1-0.6-2.2-1.3-3.3-1.9c-2.6-1.5-5.1-3.1-7.7-4.6c-3.2-1.8-8.6-1.2-10.3,2.7
					c-2.2,5.1-4.7,10.5-10.3,12.4c-5,1.7-11.6,0.6-14.5-4.1c-3-4.9-0.6-9.6,3.9-12.1c5.4-2.9,13.4-0.7,18.7,1
					c3.6,1.2,8.5-1.4,9.2-5.2c0.5-2.6,1-5.2,1.4-7.7c1.2-7.7-6.5-12-12.5-7.3c-0.9,0.7-2.2,0.8-3.4,1c1.3,0,2.7,0,4,0
					c-12.1-1.8-10.1-16.9-6.2-25.2c2-4.3,5.4-9.1,10.6-9.4c4.9-0.3,6.1,5.3,6.9,9.1c0-1.3,0-2.7,0-4c-0.1,0.2-0.2,0.5-0.3,0.7
					c1.1-1.5,2.3-3,3.4-4.5c-0.3,0.2-0.7,0.3-1,0.5c1.3-0.3,2.5-0.7,3.8-1c-0.9,0.2-1.8,0.2-2.8,0c-7.5-0.9-10.2,10.8-3.8,14
					c1.5,0.8,2.9,1.6,4.3,2.7c-0.1-0.1,0.9-3.6,0.5-1.9c-0.3,1-0.6,2.1-0.9,3.1c-1.1,3.8-2.1,7.7-3.2,11.5c-1.8,6.3-3.5,12.6-5.3,19
					c-2.6,9.3,11.9,13.3,14.5,4c2.1-7.6,4.2-15.1,6.3-22.7c1-3.6,2-7.3,3.1-10.9c2.2-8-5.2-14.5-11.6-17.7c-1.3,4.7-2.5,9.3-3.8,14
					c7.7,0.9,12.6-4.7,11-12.1c-1.4-6.5-4.9-11.8-10.1-15.7c-4.8-3.6-12.6-3.4-18-1.8c-6.1,1.8-10.7,6.8-14.2,11.8
					c-7.1,10-9.8,25.4-4.8,36.8c2.6,5.9,7.2,10.9,13.3,13.2c6.9,2.6,12.8,0.6,18.4-3.7c-4.2-2.4-8.4-4.9-12.5-7.3
					c-0.4,2.6-0.9,5.2-1.4,7.7c3.1-1.7,6.2-3.5,9.2-5.2c-10.7-3.6-23.2-4.4-33,2.1s-12.4,19.5-7.2,29.7
					c5.1,10.1,16.2,14.3,27.1,13.1c11.9-1.3,19.8-9.6,24.3-20.2c-3.4,0.9-6.8,1.8-10.3,2.7c5.5,3,11.1,8,17.4,8.6
					c10.2,1,21.1-14,11.6-21.8c-1.8,4.3-3.5,8.5-5.3,12.8h0.1c8.9,0,9.6-11.8,2-14.7c-5.1-2-10-4.6-14.9-7.2
					C383.7,280.4,376.2,293.3,384.7,297.8z"/>
				<path class="st0" d="M370,316.7c7-4.1,10.5-11.1,13.3-18.5c1.5-4-1.6-8-5.2-9.2c-10.5-3.5-27.5-4-32.9,8.2
					c-6.4,14.4,10.7,24.6,23.1,20.3c9.1-3.1,5.2-17.6-4-14.5c-1.7,0.6-3.2,1.1-4.9,0.2c-0.3-0.1-0.4-0.3-0.4-0.6
					c0.4,1.1-0.9,1.3,0.4,0.5c4.3-2.9,10.3-1.1,14.8,0.3c-1.7-3.1-3.5-6.2-5.2-9.2c-1.3,3.6-2.9,7.5-6.4,9.5
					C354.1,308.6,361.6,321.6,370,316.7z"/>
				<path class="st0" d="M379.6,278.3c9.9-5,13.6-20.6,12.5-30.6c-1.8,2.4-3.7,4.8-5.5,7.2c-1.7-0.1-1.7,0,0,0.3
					c6,1.6,12.4-5.4,8.5-11c0.5,0.8-0.9-2.1-0.9-2c-0.7-1.9-1.6-3.5-2.9-5c-2-2.3-5.3-4.3-8.4-4.1c-8.1,0.6-13.2,5.8-16.4,13
					c-4.8,11-7.6,35.8,11.3,32.9c4-0.6,6.2-5.6,5.2-9.2c-1.2-4.3-5.2-5.9-9.2-5.2c-0.5,0.1-1,0.2-1.4,0.2c1.3,0,2.7,0,4,0
					c1.8,0.3,2.3,3.3,1.4,0c-0.2-0.8,0.1-2.1,0.1-2.9c0.1-2.9,1-5.7,1.8-8.4c0.4-1.3,1.1-2.5,1.8-3.6c1.6-2.8,1.8,0-1.4-2.7
					c0.8,0.7,1.3,3.7,2,4.7c2.8-3.7,5.6-7.3,8.5-11c-2.6-0.7-5.3-1.2-7.9-0.3c-2.9,0.9-5.9,3.9-5.5,7.2c0.3,3.2,0.7,7.3-0.7,10.4
					c-0.9,2-2.3,6.2-4.4,7.3C363.4,269.7,371,282.7,379.6,278.3z"/>
			</g>
		</g>
	</g>
</g>
<path class="st4" d="M465,258.7c0.1-1.9,0.1-3.8,0.1-5.7s0-3.8-0.1-5.7c-6.4-2.3-11.3-8.1-12-15.3c-0.8-7.2,2.8-13.9,8.6-17.5
	c-0.7-3.8-1.5-7.5-2.4-11.2c-6.8-0.9-12.7-5.5-15-12.5c-2.2-6.9-0.1-14.2,4.8-18.9c-1.5-3.5-3-7-4.7-10.5
	c-6.8,0.5-13.6-2.8-17.3-9.1c-3.6-6.3-3.1-13.8,0.7-19.4c-2.2-3.2-4.4-6.3-6.8-9.3c-6.5,1.9-13.9,0.1-18.7-5.3
	c-4.9-5.4-5.9-12.9-3.3-19.2c-2.8-2.6-5.6-5.2-8.5-7.7c-6,3.2-13.5,3-19.4-1.3s-8.5-11.4-7.2-18.1c-3.3-2-6.6-3.9-9.9-5.8
	c-5.2,4.4-12.6,5.8-19.3,2.8c-6.6-3-10.6-9.4-10.8-16.2c-3.6-1.3-7.2-2.5-10.9-3.5c-4.1,5.4-11.2,8.3-18.3,6.8
	c-7.1-1.5-12.4-7-14-13.6c-3.8-0.5-7.6-0.9-11.4-1.2c-2.9,6.1-9.2,10.4-16.5,10.4c-7.3,0-13.5-4.2-16.5-10.4
	c-3.8,0.3-7.6,0.7-11.4,1.2c-1.6,6.6-6.8,12.1-14,13.6c-7.1,1.5-14.1-1.3-18.3-6.8c-3.7,1.1-7.3,2.3-10.9,3.5
	c-0.2,6.8-4.2,13.3-10.8,16.2c-6.6,3-14.1,1.6-19.3-2.8c-3.4,1.8-6.7,3.8-9.9,5.8c1.2,6.7-1.3,13.8-7.2,18.1
	c-5.9,4.3-13.4,4.5-19.4,1.3c-2.9,2.5-5.8,5-8.5,7.7c2.6,6.3,1.5,13.8-3.3,19.2c-4.9,5.4-12.2,7.2-18.7,5.3c-2.3,3-4.6,6.1-6.8,9.3
	c3.8,5.6,4.4,13.2,0.8,19.4c-3.6,6.3-10.5,9.6-17.3,9.1c-1.6,3.4-3.2,6.9-4.7,10.5c4.9,4.7,7.1,12,4.8,18.9
	c-2.2,6.9-8.2,11.6-15,12.5c-0.9,3.7-1.7,7.4-2.4,11.2c5.8,3.6,9.4,10.2,8.6,17.5c-0.8,7.2-5.6,13-12,15.3c-0.1,1.9-0.1,3.8-0.1,5.7
	s0,3.8,0.1,5.7c6.4,2.3,11.3,8.1,12,15.3c0.8,7.2-2.8,13.9-8.6,17.5c0.7,3.8,1.5,7.5,2.4,11.2c6.8,0.9,12.7,5.5,15,12.5
	c2.2,6.9,0.1,14.2-4.8,18.9c1.5,3.5,3,7,4.7,10.5c6.8-0.5,13.6,2.8,17.3,9.1c3.6,6.3,3.1,13.8-0.8,19.4c2.2,3.2,4.4,6.3,6.8,9.3
	c6.5-1.9,13.9-0.1,18.7,5.3c4.9,5.4,5.9,12.9,3.3,19.2c2.8,2.6,5.6,5.2,8.5,7.7c6-3.2,13.5-3,19.4,1.3s8.5,11.4,7.2,18.1
	c3.2,2,6.6,3.9,9.9,5.8c5.2-4.4,12.6-5.8,19.3-2.8c6.6,3,10.6,9.4,10.8,16.2c3.6,1.3,7.2,2.5,10.9,3.5c4.1-5.4,11.2-8.3,18.3-6.7
	c7.1,1.5,12.4,7,14,13.6c3.8,0.5,7.6,0.9,11.4,1.2c2.9-6.1,9.2-10.4,16.5-10.4s13.5,4.2,16.5,10.4c3.8-0.3,7.6-0.7,11.4-1.2
	c1.6-6.6,6.9-12.1,14-13.6s14.1,1.3,18.3,6.8c3.7-1.1,7.3-2.3,10.9-3.5c0.2-6.8,4.2-13.3,10.8-16.2c6.6-3,14.1-1.6,19.3,2.8
	c3.4-1.8,6.7-3.8,9.9-5.8c-1.2-6.7,1.3-13.8,7.2-18.1c5.9-4.3,13.4-4.5,19.4-1.3c2.9-2.5,5.8-5,8.5-7.7c-2.6-6.3-1.5-13.8,3.3-19.2
	c4.9-5.4,12.2-7.2,18.7-5.3c2.3-3,4.6-6.1,6.8-9.3c-3.8-5.6-4.4-13.2-0.8-19.4c3.6-6.3,10.5-9.6,17.3-9.1c1.6-3.4,3.2-6.9,4.7-10.5
	c-4.9-4.7-7.1-12-4.8-18.9c2.2-6.9,8.2-11.6,15-12.5c0.9-3.7,1.7-7.4,2.4-11.2c-5.8-3.6-9.4-10.2-8.6-17.5S458.6,261,465,258.7z
	 M252.8,424.7C158,424.7,81.1,347.8,81.1,253c0-94.9,76.9-171.8,171.8-171.8S424.7,158.1,424.7,253
	C424.6,347.8,347.7,424.7,252.8,424.7z"/>
<g>
	<path class="st1" d="M135.4,263.3c-0.3,1.6-0.4,3.2-0.5,4.8c0,1.6,0.1,3,0.4,4.1c0.2,0.4,0.2,0.7,0,0.9h0.8
		c1.4-0.5,2.6-1.5,3.6-2.7c1-1.3,2-2.7,2.8-4.3c0.8-1.6,1.5-3.4,2.1-5.2c0.6-1.8,1.2-3.6,1.7-5.3c0.2-0.4,0.4-0.8,0.5-1.2
		c0.1-0.3,0.2-0.7,0.3-1.1c0.1-0.3,0.5-0.3,1.2-0.2s1.3,0.4,2.1,0.8c0.7,0.4,1.3,0.8,1.9,1.4c0.5,0.5,0.7,1,0.5,1.4l-1.1,3.3v0.1
		c-1,3.2-2.2,6.4-3.5,9.6s-3,6-5.1,8.5c-0.3,0.4-0.8,0.9-1.3,1.4s-1.1,1-1.9,1.5c-0.7,0.5-1.5,0.9-2.4,1.2c-0.9,0.3-1.9,0.4-3.1,0.4
		c-2.7-0.2-5-1.2-6.7-2.8c-1.7-1.6-3-3.7-3.7-6.2c-1.4,2.3-3.1,4.3-5,6s-4,2.5-6.3,2.6c-2.1-0.2-4-0.8-5.6-1.8s-3-2.1-4.1-3.4
		s-2-2.7-2.8-4.2c-0.7-1.5-1.2-2.9-1.6-4.2c-0.3-1.4-0.4-2.4-0.4-3c-0.2-2-0.2-4.3,0-6.7c0.2-2.4,0.8-4.8,1.5-7.3
		c0.8-2.4,1.8-4.8,3-7c1.2-2.3,2.6-4.3,4.3-6c1.6-1.8,3.5-3.2,5.5-4.2s4.2-1.6,6.6-1.6c0.7,0,1.4,0.1,2.1,0.2
		c0.7,0.1,1.5,0.3,2.3,0.5c1.8,0.6,3.3,1.5,4.5,2.7l0.2-1.1l1.2-4.8c0.5-2,1-4.1,1.4-6.3s0.8-4.4,1-6.5c0.3-2.1,0.5-4.1,0.6-6.1
		c0.1-1.9,0.2-3.7,0.2-5.3c0.7-0.4,1.7-0.4,3.1,0c1.4,0.5,2.8,1.2,4.2,2.1c1.4,1,2.6,2.1,3.6,3.4c1,1.3,1.5,2.6,1.4,3.8
		c0,0.7-0.1,1.8-0.4,3.3c-0.3,1.5-0.6,3.3-1,5.2s-0.9,3.9-1.4,6.1c-0.5,2.1-1,4.1-1.4,6l-1.1,4.5l0.1-0.1c-0.9,3.5-1.7,7.1-2.5,10.8
		S135.8,259,135.4,263.3L135.4,263.3L135.4,263.3z M115.4,271.8c0.7-0.2,1.5-0.8,2.3-1.9c0.8-1,1.6-2.2,2.5-3.6
		c0.8-1.4,1.6-2.9,2.3-4.4c0.7-1.6,1.3-3,1.7-4.2v-0.1l0.2-2.7c0.2-1.8,0.5-3.6,0.8-5.5c0.3-1.8,0.7-3.7,1.1-5.5
		c-0.4-0.8-0.9-1.5-1.5-2.1s-1.4-1-2.4-1.1c-2-0.1-3.8,0.7-5.4,2.2c-1.5,1.5-2.8,3.4-3.9,5.7s-1.9,4.8-2.4,7.4s-0.9,5-0.9,7.2
		c-0.1,0.6,0,1.4,0,2.3c0.1,0.9,0.3,1.8,0.5,2.7c0.3,1.3,0.8,2.3,1.5,3.1C112.7,272.1,113.8,272.3,115.4,271.8z"/>
	<path class="st1" d="M176.5,248.1c-1.3,4.9-3.5,9.1-6.7,12.4c-3.1,3.3-6.9,5.7-11.4,7.3c0.4,1.5,1.1,2.9,2,4.2
		c0.9,1.3,2,2.1,3.4,2.4l-0.2-0.1c1.2,0.3,2.4,0.2,3.7-0.2c1.3-0.4,2.6-1.2,4-2.3c1.3-1.1,2.6-2.6,3.9-4.4c1.3-1.8,2.4-4,3.4-6.4
		c0.5-1.3,0.9-2.7,1.4-4.1c0.4-1.4,0.8-2.7,1.1-4c0.3-0.7,0.9-1.1,1.6-1.2c0.7-0.1,1.5,0.1,2.1,0.5c0.7,0.4,1.2,1,1.6,1.7
		c0.4,0.7,0.5,1.6,0.2,2.5l-0.8,3c-0.8,2.5-1.8,5.2-3.1,8.2s-3,5.9-5.1,8.7c-1.3,1.5-2.6,2.7-4,3.6s-2.8,1.5-4.1,1.9
		s-2.5,0.7-3.7,0.7c-1.1,0.1-2,0.1-2.7,0.1c-4.3,0-7.9-1.2-10.8-3.7c-2.9-2.5-4.9-5.9-6.1-10.1c-1-3.7-1.3-7.4-0.9-11
		c0.5-3.6,1.6-7.4,3.3-11.6c0.6-1.4,1.5-2.8,2.7-4.4c1.2-1.6,2.6-3,4.2-4.3c1.6-1.3,3.4-2.4,5.4-3.2s4.1-1.2,6.3-1.2
		c2.3,0.1,4.3,0.8,6,2.3c1.8,1.5,2.9,3.4,3.5,5.9C177.4,243.5,177.2,245.8,176.5,248.1L176.5,248.1z M169.5,241.3
		c-1.8,0.4-3.4,1.3-4.7,2.6c-1.3,1.4-2.5,3-3.5,4.9s-1.7,3.9-2.3,6c-0.6,2.1-0.9,4.1-1.1,6c3.2-1.6,6-3.7,8.2-6.5
		c2.3-2.7,3.8-6,4.6-9.8v0.1c0.2-0.4,0.2-0.9,0.2-1.3c0-0.4-0.1-0.8-0.1-1.2C170.6,241.4,170.1,241.1,169.5,241.3z"/>
	<path class="st4" d="M215.7,266.1c-0.8,1.9-1.7,3.8-2.8,5.7c-1.1,2-2.4,3.7-3.8,5.3c-1.5,1.6-3.1,2.9-4.9,3.9
		c-1.8,1-3.9,1.4-6.1,1.3c-1.3-0.1-2.5-0.4-3.6-0.9s-2-1.3-2.9-2.2c-0.9-0.9-1.6-1.9-2.1-3.1c-0.6-1.2-1-2.4-1.3-3.6
		c-0.3-1.8-0.5-3.5-0.4-5.1s0.3-3.1,0.7-4.5s0.8-2.8,1.4-4.2c0.5-1.4,1.2-2.8,1.8-4.2l1.1-2.3v0.1l1.2-2.8c0.3-0.6,0.6-1.2,1.1-1.6
		c0.5-0.5,1.4-1,2.8-1.4c-0.7,0.2-1.3,0.3-1.7,0.4c-0.4,0.1-0.8,0.2-1.2,0.3c-0.6,0.2-1.2,0.3-1.9,0.5s-1.5,0.2-2.4,0.2h-0.8
		c-0.8,1.9-1.5,3.7-2.1,5.5s-1.2,3.5-1.6,5.1v-0.1c-0.1,0.3-0.5,0.4-1.1,0.2c-0.6-0.2-1.2-0.5-1.9-0.9s-1.2-0.9-1.7-1.4
		s-0.7-1-0.5-1.4l0.1,0.1c0.8-2.1,1.4-3.9,1.9-5.5s0.9-3,1.3-4.2c-0.8-0.9-1.3-2-1.6-3.3c-0.4-1.7-0.4-3.2,0-4.5s0.9-2.9,1.5-4.6
		c0.2-0.7,0.4-1.5,0.6-2.4c0.2-0.9,0.3-1.9,0.4-3.2c0.9,0.4,1.9,0.9,2.8,1.4c1,0.5,1.9,1,2.7,1.6s1.6,1.4,2.2,2.2
		c0.6,0.8,1.1,1.8,1.3,2.8c0.1,0.5,0.2,1,0.2,1.6c0.1,0.6,0,1.2-0.1,2l-2,3.7c-0.2,0.3,0,0.4,0.5,0.1c0.5-0.2,1.1-0.7,1.9-1.3
		c0.8-0.6,1.7-1.3,2.7-2.1s1.9-1.6,2.8-2.5c0.9-0.8,1.7-1.6,2.4-2.3s1.2-1.3,1.4-1.6c0.3,0,0.8,0.2,1.4,0.5c0.6,0.3,1.2,0.7,1.9,1.1
		c0.7,0.4,1.2,0.8,1.7,1.2s0.8,0.6,0.9,0.7c0.8,0.9,1.3,2,1.4,3.3c0.1,1.3-0.1,2.7-0.5,4.2s-1,3.2-1.7,4.9s-1.6,3.5-2.4,5.3
		c-0.5,1-1,2-1.5,3s-1,2-1.4,3c-0.3,0.8-0.7,1.6-1.2,2.6c-0.4,1-0.8,2-1.2,3c-0.3,1-0.6,2-0.7,3c-0.2,1-0.2,1.8,0,2.5
		c0,0.3,0.3,0.5,1,0.5c0.6,0.1,1.3-0.2,2.1-0.6c0.8-0.5,1.6-1.1,2.4-2c0.8-0.9,1.6-1.9,2.3-3c0.7-1.2,1.4-2.4,1.9-3.8h-0.1
		c0.7-1.8,1.4-3.5,1.9-5.2c0.6-1.7,1-3.2,1.3-4.4c0.2-0.3,0.6-0.3,1.2-0.1c0.7,0.2,1.3,0.5,2,0.9s1.2,0.9,1.7,1.5s0.7,1.1,0.5,1.4
		v-0.2l-1.3,4.1c-0.3,1.1-0.5,2.1-0.8,3C216.3,264.5,216.1,265.3,215.7,266.1L215.7,266.1z"/>
	<path class="st4" d="M233.1,232.9c2.4,0.4,4.4,1.5,6.1,3.2c1.7,1.7,3,3.6,4,5.8c0.8,0.8,1.6,1.7,2.2,2.8c0.7,1.1,1.3,2.3,1.9,3.7
		c0.1,0.4,0.2,0.9,0.4,1.3c0.1,0.4,0.3,1,0.4,1.6c0.5,2.4,0.8,4.8,0.8,7.2s-0.3,4.8-0.8,7.1c-0.5,2.3-1.3,4.5-2.3,6.5
		c-1,2.1-2.2,3.8-3.5,5.4c-1.3,1.5-2.9,2.7-4.6,3.6c-1.7,0.9-3.5,1.3-5.4,1.3c-3.6-0.1-7-1.2-10.3-3.6c-3.3-2.3-5.9-5.9-7.9-10.7
		c-0.4-1.2-0.9-2.5-1.3-4.1c-0.6-2.4-0.8-4.8-0.7-7.3s0.6-4.9,1.3-7.3c0.7-2.4,1.7-4.6,3-6.7c1.3-2.1,2.7-3.9,4.4-5.4
		s3.6-2.7,5.6-3.5C228.5,233,230.7,232.7,233.1,232.9z M236.1,254.6c-0.5-0.2-0.9-0.5-1.3-1.2c-0.4-0.6-0.7-1.3-1-2
		s-0.5-1.5-0.7-2.3s-0.3-1.5-0.5-2.1c-0.1-0.7,0-1.4,0.2-2.1c0.2-0.7,0.6-1.3,0.9-1.8c0.4-0.5,0.8-1,1.2-1.4s0.8-0.7,1-0.8
		c-0.2-0.1-0.6-0.2-1.2-0.2c-1.2,0.1-2.3,0.6-3.6,1.4c-1.2,0.9-2.3,1.9-3.3,3.2c-0.9,1.4-1.7,2.9-2.3,4.6c-0.6,1.7-1,3.4-1.3,5.2
		s-0.4,3.6-0.3,5.4c0.1,1.8,0.3,3.4,0.7,5c0.4,2.1,1.2,3.8,2.3,5.2c1.1,1.4,2.6,2.2,4.4,2.3c2,0.1,3.7-0.7,5.3-2.3
		c1.5-1.6,2.8-3.7,3.7-6.2s1.5-5.1,1.7-8s0.1-5.4-0.5-7.7v-0.4c-0.4,0-0.9,0.2-1.3,0.5c-0.4,0.4-0.8,0.8-1.2,1.3
		c-0.3,0.5-0.6,1-0.8,1.6c-0.2,0.5-0.3,1-0.3,1.5L236.1,254.6z"/>
	<path class="st4" d="M267.5,237.1c-0.3,1-0.6,2.5-1,4.3s-0.8,3.8-1.3,6.1c-0.4,2.2-0.9,4.6-1.3,7c-0.4,2.4-0.8,4.8-1.1,7.1
		c-0.3,2.3-0.4,4.4-0.5,6.3s0.1,3.5,0.4,4.6c-0.1,0.2-0.1,0.3,0,0.4c0,0.1,0,0.2,0,0.2h0.6c1.4-0.5,2.6-1.4,3.6-2.7
		c1-1.2,1.9-2.6,2.7-4.2c0.8-1.6,1.5-3.2,2.1-5s1.2-3.5,1.7-5.2h-0.1c0.1-0.5,0.3-1,0.5-1.4c0.2-0.5,0.4-0.9,0.5-1.4
		c0.1-0.3,0.4-0.4,1-0.2s1.3,0.4,1.9,0.8c0.7,0.4,1.2,0.8,1.8,1.4c0.5,0.5,0.8,1,0.7,1.4l-1.2,3.7c-0.9,3.1-2.1,6.3-3.4,9.5
		s-3,6-4.9,8.4c-0.3,0.4-0.8,0.9-1.3,1.4s-1.2,1-1.9,1.4c-0.7,0.4-1.6,0.8-2.5,1.1c-0.9,0.3-1.9,0.5-3,0.5c-2.5-0.1-4.5-1.1-5.9-3
		c-1.5-1.9-2.6-4.3-3.3-7.1c-0.2-0.6-0.4-1.2-0.5-1.9c-0.1-0.7-0.1-1.3-0.1-1.9c-0.3-2.7-0.4-5.5-0.2-8.1c0.1-2.7,0.3-5.3,0.7-7.9
		c0.3-2.6,0.8-5.2,1.3-7.7c0.5-2.6,1.1-5.1,1.6-7.6l1.6-6.9c0.4-2.1,0.8-4.2,1.2-6.4c0.4-2.2,0.7-4.3,1-6.4c0.3-2.1,0.5-4.1,0.7-6.1
		c0.2-1.9,0.2-3.7,0.2-5.4c0.7-0.4,1.7-0.4,3.1,0c1.3,0.5,2.7,1.2,4.1,2.2s2.6,2.1,3.6,3.4c1,1.3,1.5,2.5,1.5,3.7
		c-0.1,0.8-0.2,2-0.5,3.5s-0.6,3.3-1,5.2s-0.9,3.9-1.3,6s-0.9,4-1.3,5.8L267.5,237.1z"/>
	<path class="st4" d="M289.7,237.1c-0.3,1-0.6,2.5-1,4.3s-0.8,3.8-1.3,6.1c-0.4,2.2-0.9,4.6-1.3,7c-0.4,2.4-0.8,4.8-1.1,7.1
		c-0.3,2.3-0.4,4.4-0.5,6.3s0.1,3.5,0.4,4.6c-0.1,0.2-0.1,0.3,0,0.4c0,0.1,0,0.2,0,0.2h0.6c1.4-0.5,2.6-1.4,3.6-2.7
		c1-1.2,1.9-2.6,2.7-4.2c0.8-1.6,1.5-3.2,2.1-5s1.2-3.5,1.7-5.2h-0.1c0.1-0.5,0.3-1,0.5-1.4c0.2-0.5,0.4-0.9,0.5-1.4
		c0.1-0.3,0.4-0.4,1-0.2s1.3,0.4,1.9,0.8c0.7,0.4,1.2,0.8,1.8,1.4c0.5,0.5,0.8,1,0.7,1.4l-1.2,3.7c-0.9,3.1-2.1,6.3-3.4,9.5
		s-3,6-4.9,8.4c-0.3,0.4-0.8,0.9-1.3,1.4s-1.2,1-1.9,1.4c-0.7,0.4-1.6,0.8-2.5,1.1c-0.9,0.3-1.9,0.5-3,0.5c-2.5-0.1-4.5-1.1-5.9-3
		c-1.5-1.9-2.6-4.3-3.3-7.1c-0.2-0.6-0.4-1.2-0.5-1.9c-0.1-0.7-0.1-1.3-0.1-1.9c-0.3-2.7-0.4-5.5-0.2-8.1c0.1-2.7,0.3-5.3,0.7-7.9
		c0.3-2.6,0.8-5.2,1.3-7.7c0.5-2.6,1.1-5.1,1.6-7.6l1.6-6.9c0.4-2.1,0.8-4.2,1.2-6.4c0.4-2.2,0.7-4.3,1-6.4c0.3-2.1,0.5-4.1,0.7-6.1
		c0.2-1.9,0.2-3.7,0.2-5.4c0.7-0.4,1.7-0.4,3.1,0c1.3,0.5,2.7,1.2,4.1,2.2s2.6,2.1,3.6,3.4c1,1.3,1.5,2.5,1.5,3.7
		c-0.1,0.8-0.2,2-0.5,3.5s-0.6,3.3-1,5.2s-0.9,3.9-1.3,6c-0.5,2.1-0.9,4-1.3,5.8L289.7,237.1z"/>
	<path class="st4" d="M299.9,233.4c0.7-0.4,1.7-0.3,3,0.2s2.6,1.3,3.8,2.3c1.3,1,2.3,2.2,3.2,3.5c0.9,1.3,1.2,2.7,0.9,3.9
		c0.1-0.1,0,0,0,0.3c-0.1,0.3-0.2,0.8-0.4,1.3c-0.2,0.5-0.3,1.2-0.5,1.9s-0.4,1.4-0.5,2c-0.6,2.1-1.3,4.6-2,7.4s-1.4,5.4-2,7.9
		s-1,4.6-1.2,6.3c-0.2,1.7,0,2.6,0.5,2.6h0.6c1.5-0.5,2.9-1.4,4.1-2.7c1.2-1.2,2.2-2.6,3.2-4.2c0.9-1.6,1.8-3.3,2.6-5.1
		c0.8-1.8,1.5-3.5,2.2-5.2l0.7-2c0.2-0.3,0.6-0.4,1.2-0.2c0.7,0.2,1.3,0.5,2,1s1.2,1,1.6,1.6s0.6,1.1,0.4,1.4v-0.2
		c-1.3,3.6-2.9,7.2-4.8,10.9c-2,3.7-4.1,6.9-6.4,9.7c-0.4,0.4-0.9,0.8-1.5,1.4c-0.6,0.5-1.3,1-2,1.4s-1.6,0.8-2.5,1.1
		c-0.9,0.3-1.9,0.5-2.9,0.5c-2.1-0.1-3.8-0.9-5.2-2.5c-1.4-1.6-2.4-3.6-3-6.1c-0.2-0.9-0.3-1.8-0.4-2.7c-0.1-0.9-0.1-1.9,0-2.9
		l-0.1,0.1c0-2.7,0.3-5.9,0.9-9.6c0.6-3.6,1.2-7.3,2-10.9c0.4-2.5,0.9-4.9,1.3-7.2s0.7-4.5,0.8-6.4L299.9,233.4z M302.3,208.2
		c0.4-0.1,1,0.1,1.7,0.5s1.5,0.9,2.3,1.5s1.7,1.3,2.5,2.1c0.9,0.8,1.6,1.6,2.3,2.3c0.7,0.7,1.3,1.4,1.8,2.1c0.5,0.6,0.7,1.1,0.8,1.4
		c0.1,1.6,0,3-0.2,4.2c-0.3,1.2-0.5,2.4-0.8,3.7s-0.5,2.6-0.8,3.9c-0.3,1.3-0.4,2.9-0.4,4.6c-0.8-0.2-1.6-0.6-2.6-1.2
		c-1-0.6-2-1.4-2.9-2.2s-1.7-1.7-2.4-2.6c-0.7-0.9-1.1-1.6-1.3-2.2c-0.2-1.1-0.4-2.3-0.4-3.6c-0.1-1.3-0.1-2.7,0-4.1
		c0.1-1.4,0.1-2.9,0-4.4s-0.2-2.9-0.5-4.3L302.3,208.2z"/>
	<path class="st4" d="M363.2,264.4c-0.5,1.4-1.2,3.2-2.1,5.2s-1.9,4-3.2,5.9c-1.2,1.9-2.6,3.6-4.2,4.9s-3.3,2-5.2,2
		c-1.2,0-2.3-0.2-3.5-0.6s-2.3-1.1-3.4-1.9c-1-0.9-2-2-2.8-3.4s-1.4-3.1-1.8-5c-0.3-1.6-0.4-3.3-0.5-4.9s0-3.3,0.1-5
		c0.1-1.8,0.3-3.7,0.6-5.7c0.3-2.1,0.6-4.4,1-7c0.5-2.3,0.6-4.1,0.2-5.4l-2.6,3.4c-1.5,1.9-2.9,3.7-4,5.6c-1.2,1.9-2.3,4-3.4,6.3
		c-0.5,3.5-0.9,7-0.9,10.5c-0.1,3.6,0.2,7.2,0.8,10.9c0.1,0.6-0.4,0.9-1.4,0.8s-2-0.3-3.2-0.8s-2.3-1.1-3.4-1.8
		c-1.1-0.7-1.8-1.4-2-2.1c-0.5-2.5-0.8-4.9-0.9-7.2c-0.1-2.3-0.2-4.6-0.1-6.9s0.2-4.5,0.5-6.8c0.2-2.2,0.4-4.5,0.7-6.7
		c0.3-2.6,0.5-5.2,0.7-7.7s0.4-4.9,0.5-7.2c0.5-0.3,1.3-0.3,2.3,0s2.1,0.8,3.3,1.4c1.2,0.7,2.3,1.5,3.3,2.4c1.1,1,1.9,2,2.4,3
		c1.6-2,3.3-3.7,5.2-5c1.9-1.4,4-2.1,6.3-2.3c0.7,0,1.6,0.3,2.6,1s2,1.5,3,2.5c0.9,1,1.7,2.1,2.3,3.2c0.6,1.2,0.9,2.2,0.9,3
		c-0.3,2.8-0.6,5.4-1,7.9c-0.4,2.4-0.8,4.5-1,6.3c-0.3,1.5-0.5,3-0.7,4.2c-0.2,1.3-0.3,2.6-0.4,3.8c-0.1,1.3-0.1,2.6,0,3.9
		s0.2,2.7,0.5,4.3c0-0.1,0.1-0.3,0.3-0.5h0c1.3-0.8,2.8-2.2,4.4-4.2s3.1-4.7,4.3-8.1c0.4-0.9,0.7-1.7,1-2.6c0.3-0.8,0.5-1.6,0.8-2.5
		l0.7-2.4c0.1-0.3,0.5-0.3,1.2-0.2s1.3,0.4,2,0.8c0.7,0.4,1.3,0.8,1.8,1.4c0.5,0.5,0.7,1,0.5,1.4v-0.2L363.2,264.4L363.2,264.4z"/>
	<path class="st4" d="M388.5,291.4l3.1,1.6c2.1,1.1,4.2,2.2,6.4,3.3c2.2,1.1,4.6,2.1,7.1,3H405c0.5,0.2,0.9,0.7,1,1.7s0,2-0.4,3.1
		s-1,2.1-2,3c-0.9,0.9-2.1,1.3-3.6,1.3c-1.3,0-2.5-0.4-3.8-1.1l-6-3.5c-0.9-0.6-1.7-1.2-2.6-1.6c-0.9-0.5-1.7-1-2.5-1.4
		c-1,2.4-2.1,4.6-3.3,6.6c-1.2,2-2.7,3.7-4.3,5.2c-1.6,1.5-3.6,2.6-5.8,3.5c-2.2,0.9-4.8,1.3-7.7,1.4c-1.7,0-3.5-0.2-5.3-0.5
		c-1.8-0.4-3.6-1-5.3-1.9c-1.7-0.9-3.2-2.2-4.5-3.8c-1.3-1.6-2.4-3.7-3.1-6.1c-0.8-2.9-0.9-5.6-0.3-8.2c0.6-2.5,1.8-4.7,3.5-6.6
		c1.7-1.8,3.9-3.3,6.5-4.3s5.4-1.5,8.4-1.5c1.5,0,3,0.1,4.2,0.2c1.3,0.1,2.5,0.3,3.7,0.5s2.3,0.5,3.4,0.8s2.2,0.7,3.3,1.1l1.3-7.3
		c0-0.2,0-0.4,0.1-0.5c-1,0.9-2.1,1.6-3.2,2.1s-2.3,0.8-3.5,0.8c-2.1-0.2-4-0.8-5.6-1.8s-3-2.1-4.1-3.4s-2-2.7-2.8-4.2
		c-0.7-1.5-1.2-2.9-1.6-4.2c-0.3-1.4-0.4-2.4-0.4-3c-0.2-2-0.2-4.3,0-6.7c0.2-2.4,0.8-4.8,1.5-7.3c0.8-2.4,1.8-4.8,3-7
		c1.2-2.3,2.6-4.3,4.3-6c1.6-1.8,3.5-3.2,5.5-4.2s4.2-1.6,6.6-1.6c0.7,0,1.4,0.1,2.1,0.2c0.7,0.1,1.5,0.3,2.3,0.5
		c1.5,0.4,2.8,1.1,3.9,2.1s2,2.1,2.8,3.4c0.8,1.3,1.4,2.7,1.9,4.1c0.5,1.5,0.9,2.9,1.2,4.3c0.1,0.3,0,0.5-0.3,0.7
		c-0.2,0.2-0.6,0.3-1,0.5c-0.4,0.1-0.9,0.2-1.4,0.2s-1-0.1-1.4-0.2c1,0.4,2,1,3,1.7s1.9,1.4,2.8,2.2c0.8,0.8,1.5,1.6,1.9,2.4
		c0.5,0.9,0.7,1.7,0.6,2.4L388.5,291.4z M366.2,310.2c2.3-1.2,4.2-3.1,5.8-5.6c1.6-2.5,2.9-5.3,4-8.4c-1.7-0.6-3.4-1.1-4.9-1.4
		c-1.6-0.4-3.2-0.6-4.9-0.6c-1.8-0.1-3.7,0.1-5.6,0.5s-3.6,1.1-5.2,1.9c-1.5,0.9-2.7,2-3.4,3.3c-0.8,1.3-0.9,2.9-0.4,4.7
		c0.3,1.2,0.8,2.2,1.5,3s1.5,1.5,2.3,2c0.9,0.5,1.8,0.9,2.9,1.2c1,0.2,2.1,0.4,3,0.4s1.7-0.1,2.5-0.3
		C364.7,310.7,365.5,310.5,366.2,310.2z M375.8,271.8c0.7-0.2,1.4-0.7,2.1-1.6s1.5-1.9,2.2-3.1s1.5-2.5,2.1-3.9
		c0.7-1.4,1.3-2.7,1.8-4c0.3-1.9,0.6-3.9,0.7-5.9c0.2-2,0.1-3.9-0.2-5.7c0.4-0.2,0.9-0.3,1.6-0.2s1.5,0.3,2.3,0.5
		c-0.3-0.2-0.5-0.4-0.6-0.8c-0.1-0.2-0.1-0.4-0.2-0.6c-0.1-0.2-0.2-0.4-0.2-0.7c-0.2-0.5-0.4-1.1-0.6-1.7c-0.2-0.6-0.6-1.2-0.9-1.7
		c-0.4-0.5-0.8-0.9-1.3-1.3c-0.5-0.3-1.1-0.5-1.8-0.6c-2-0.1-3.8,0.7-5.4,2.2c-1.5,1.5-2.8,3.4-3.9,5.7s-1.9,4.8-2.4,7.4
		s-0.9,5-0.9,7.2c-0.1,0.6,0,1.4,0,2.3c0.1,0.9,0.3,1.8,0.5,2.7c0.3,1.3,0.8,2.3,1.5,3.1C373.1,272.1,374.2,272.3,375.8,271.8z"/>
</g>
</svg>
