[
	{
		"id":0,
		"nombre":"Downhill",
		"activo":false,
		"thumbnail":"/img/categories/1.jpg"
	},
	{
		"id":6,
		"nombre":"Enduro",
		"activo":false,
		"thumbnail":"/img/categories/1.jpg"
	},
	{
		"id":1,	
		"nombre":"XC",
		"activo":false,
		"thumbnail":"/img/categories/3.jpg"
	},
	{
		"id":2,
		"nombre":"Ruta",
		"activo":false,
		"thumbnail":"/img/categories/4.jpg"
	},
	{
		"id":3,
		"nombre":"BMX",
		"activo":false,
		"thumbnail":"/img/categories/6.jpg"
	},
	{
		"id":5,
		"nombre":"Bicicross",
		"activo":false,
		"thumbnail":"/img/categories/5.jpg"
	}
]