"WordID","word","NormSTEM","suffix","lemma","PoS","Root","NormSuffix","NormWord"
1,"yudhiṣṭhira","_","_","yudhiṣṭhira","NC","","_","_"
2,"uvāca","_","_","vak","V","vac","_","_"
1,"yathā","_","_","yathā","CCM","","_","_"
2,"jyeṣṭhaḥ","_","_","jyeṣṭha","JJ","","_","_"
3,"kaniṣṭheṣu","_","_","kaniṣṭha","JJ","","_","_"
4,"vartate","_","_","vart","V","vṛt","_","_"
5,"_","_","_","bharata","NC","","_","_"
6,"_","_","_","ṛṣabha","NC","","_","_"
1,"_","_","_","kaniṣṭha","JJ","","_","_"
2,"_","_","_","ca","CCD","","_","_"
3,"yathā","_","_","yathā","CCM","","_","_"
4,"jyeṣṭhe","_","_","jyeṣṭha","JJ","","_","_"
5,"_","_","_","vart","V","vṛt","_","_"
6,"_","_","_","tad","PRD","","_","_"
7,"bravīhi","_","_","abravīta","V","brū","_","_"
8,"me","_","_","mat","PPR","","_","_"
1,"bhīṣma","_","_","bhīṣma","NC","","_","_"
2,"uvāca","_","_","vak","V","vac","_","_"
1,"_","_","_","jyeṣṭha","JJ","","_","_"
2,"_","_","_","vat","CX","","_","_"
3,"tāta","_","_","tāta","NC","","_","_"
4,"vartasva","_","_","vart","V","vṛt","_","_"
5,"jyeṣṭho","_","_","jyeṣṭha","JJ","","_","_"
6,"hi","_","_","hi","CX","","_","_"
7,"satataṃ","_","_","satata","CX","","_","_"
8,"bhavān","_","_","bhavat","JJ","","_","_"
1,"guror","_","_","guru","NC","","_","_"
2,"garīyasī","_","_","garīyas","JJ","","_","_"
3,"vṛttir","_","_","vṛtti","NC","","_","_"
4,"yā","_","_","yad","PRL","","_","_"
5,"_","_","_","ced","CX","","_","_"
6,"_","_","_","śiṣya","NC","","_","_"
7,"bhārata","_","_","bhārata","NC","","_","_"
1,"na","_","_","na","CNG","","_","_"
2,"_","_","_","guru","NC","","_","_"
3,"_","_","_","a","CNG","","_","_"
4,"_","_","_","kṛtaprajña","JJ","","_","_"
5,"śakyaṃ","_","_","śakya","JJ","","_","_"
6,"śiṣyeṇa","_","_","śiṣya","NC","","_","_"
7,"vartitum","_","_","vṛt","CGDI","","_","_"
1,"guror","_","_","guru","NC","","_","_"
2,"hi","_","_","hi","CX","","_","_"
3,"_","_","_","dīrgha","JJ","","_","_"
4,"_","_","_","darśin","JJ","","_","_"
6,"yat","_","_","yad","PRL","","_","_"
7,"_","_","_","tad","PRD","","_","_"
8,"_","_","_","śiṣya","NC","","_","_"
9,"bhārata","_","_","bhārata","NC","","_","_"
1,"andhaḥ","_","_","andha","JJ","","_","_"
2,"syād","_","_","as","V","as","_","_"
3,"_","_","_","andha","JJ","","_","_"
4,"_","_","_","velā","NC","","_","_"
5,"jaḍaḥ","_","_","jaḍa","JJ","","_","_"
6,"syād","_","_","as","V","as","_","_"
7,"api","_","_","api","CX","","_","_"
8,"vā","_","_","vā","CCD","","_","_"
9,"budhaḥ","_","_","budha","JJ","","_","_"
1,"parihāreṇa","_","_","parihāra","NC","","_","_"
2,"tad","_","_","tad","PRD","","_","_"
3,"brūyād","_","_","abravīta","V","brū","_","_"
4,"_","_","_","yad","PRL","","_","_"
5,"_","_","_","tad","PRD","","_","_"
6,"syād","_","_","as","V","as","_","_"
7,"vyatikramaḥ","_","_","vyatikrama","NC","","_","_"
1,"pratyakṣaṃ","_","_","pratyakṣa","JJ","","_","_"
2,"_","_","_","bhid","PPP","","_","_"
3,"_","_","_","hṛdaya","NC","","_","_"
4,"bhedayeyuḥ","_","_","bheday","V","bheday","_","_"
5,"kṛtaṃ","_","_","kṛ","PPP","","_","_"
6,"narāḥ","_","_","nara","NC","","_","_"
1,"_","_","_","śrī","NC","","_","_"
2,"_","_","_","abhitap","PPP","","_","_"
3,"kaunteya","_","_","kaunteya","NC","","_","_"
4,"_","_","_","bheda","NC","","_","_"
5,"_","_","_","kāma","NC","","_","_"
6,"_","_","_","tathā","CX","","_","_"
7,"_","_","_","ari","NC","","_","_"
1,"jyeṣṭhaḥ","_","_","jyeṣṭha","JJ","","_","_"
2,"kulaṃ","_","_","kula","NC","","_","_"
3,"vardhayati","_","_","vardhay","V","vardhay","_","_"
4,"vināśayati","_","_","vinaś","V","vinaś","_","_"
5,"vā","_","_","vā","CCD","","_","_"
6,"punaḥ","_","_","punar","CAD","","_","_"
1,"hanti","_","_","han","V","han","_","_"
2,"sarvam","_","_","sarva","JQ","","_","_"
3,"api","_","_","api","CX","","_","_"
4,"jyeṣṭhaḥ","_","_","jyeṣṭha","JJ","","_","_"
5,"kulaṃ","_","_","kula","NC","","_","_"
6,"_","_","_","yatra","CX","","_","_"
7,"_","_","_","avajan","V","avajan","_","_"
1,"atha","_","_","atha","CAD","","_","_"
2,"yo","_","_","yad","PRL","","_","_"
3,"vinikurvīta","_","_","vinikar","V","vinikṛ","_","_"
4,"jyeṣṭho","_","_","jyeṣṭha","JJ","","_","_"
5,"bhrātā","_","_","bhrātṛ","NC","","_","_"
6,"yavīyasaḥ","_","_","yavīyas","JJ","","_","_"
1,"_","_","_","a","CNG","","_","_"
2,"_","_","_","jyeṣṭha","JJ","","_","_"
3,"syād","_","_","as","V","as","_","_"
4,"_","_","_","a","CNG","","_","_"
5,"_","_","_","bhāga","NC","","_","_"
6,"_","_","_","ca","CCD","","_","_"
7,"niyamyo","_","_","niya","KDG","","_","_"
8,"_","_","_","rājan","NC","","_","_"
9,"_","_","_","ca","CCD","","_","_"
10,"saḥ","_","_","tad","PRD","","_","_"
1,"nikṛtī","_","_","nikṛtin","JJ","","_","_"
2,"hi","_","_","hi","CX","","_","_"
3,"naro","_","_","nara","NC","","_","_"
4,"lokān","_","_","loka","NC","","_","_"
5,"pāpān","_","_","pāpa","JJ","","_","_"
6,"_","_","_","ga","V","ga","_","_"
7,"_","_","_","asaṃśaya","CX","","_","_"
1,"_","_","_","vidula","NC","","_","_"
2,"_","_","_","iva","CCM","","_","_"
3,"tat","_","_","tad","PRD","","_","_"
4,"puṣpaṃ","_","_","puṣpa","NC","","_","_"
5,"moghaṃ","_","_","mogha","JJ","","_","_"
6,"janayituḥ","_","_","janayitṛ","NC","","_","_"
7,"smṛtam","_","_","smṛ","PPP","","_","_"
1,"_","_","_","sarva","JQ","","_","_"
2,"_","_","_","anartha","NC","","_","_"
3,"kule","_","_","kula","NC","","_","_"
4,"yatra","_","_","yatra","CX","","_","_"
5,"jāyate","_","_","jan","V","jan","_","_"
6,"_","_","_","pāpa","JJ","","_","_"
7,"_","_","_","pūruṣa","NC","","_","_"
1,"akīrtiṃ","_","_","akīrti","NC","","_","_"
2,"_","_","_","janay","V","janay","_","_"
3,"_","_","_","eva","CEM","","_","_"
4,"kīrtim","_","_","kīrti","NC","","_","_"
5,"antardadhāti","_","_","antardhā","V","antardhā","_","_"
6,"ca","_","_","ca","CCD","","_","_"
1,"sarve","_","_","sarva","JQ","","_","_"
2,"_","_","_","ca","CCD","","_","_"
3,"_","_","_","api","CX","","_","_"
4,"_","_","_","vikarman","NC","","_","_"
5,"_","_","_","stha","JJ","","_","_"
6,"bhāgaṃ","_","_","bhāga","NC","","_","_"
7,"_","_","_","na","CNG","","_","_"
8,"_","_","_","arh","V","arh","_","_"
9,"sodarāḥ","_","_","sodara","NC","","_","_"
1,"_","_","_","na","CNG","","_","_"
2,"_","_","_","a","CNG","","_","_"
3,"_","_","_","pradā","CGDA","","_","_"
4,"kaniṣṭhebhyo","_","_","kaniṣṭha","NC","","_","_"
5,"jyeṣṭhaḥ","_","_","jyeṣṭha","JJ","","_","_"
6,"kurvīta","_","_","kar","V","kṛ","_","_"
7,"yautakam","_","_","yautaka","NC","","_","_"
1,"anujaṃ","_","_","anuja","NC","","_","_"
2,"hi","_","_","hi","CX","","_","_"
3,"pitur","_","_","pitṛ","NC","","_","_"
4,"dāyo","_","_","dāya","NC","","_","_"
5,"_","_","_","jaṅghā","NC","","_","_"
6,"_","_","_","śrama","NC","","_","_"
7,"_","_","_","phala","NC","","_","_"
8,"'dhvagaḥ","_","_","adhvaga","NC","","_","_"
1,"svayam","_","_","svaya","CX","","_","_"
2,"_","_","_","īhita","NC","","_","_"
3,"_","_","_","labh","PPP","","_","_"
4,"tu","_","_","tu","CCD","","_","_"
5,"_","_","_","na","CNG","","_","_"
6,"_","_","_","akāma","JJ","","_","_"
7,"dātum","_","_","dā","CGDI","","_","_"
8,"arhati","_","_","arh","V","arh","_","_"
1,"bhrātṝṇām","_","_","bhrātṛ","NC","","_","_"
2,"avibhaktānām","_","_","avibhakta","JJ","","_","_"
3,"utthānam","_","_","utthāna","NC","","_","_"
4,"api","_","_","api","CX","","_","_"
5,"cet","_","_","ced","CX","","_","_"
6,"saha","_","_","saha","CX","","_","_"
1,"na","_","_","na","CNG","","_","_"
2,"_","_","_","putra","NC","","_","_"
3,"_","_","_","bhāga","NC","","_","_"
4,"viṣamaṃ","_","_","viṣama","JJ","","_","_"
5,"pitā","_","_","pitṛ","NC","","_","_"
6,"dadyāt","_","_","dad","V","dā","_","_"
7,"kathaṃcana","_","_","kathaṃcana","CX","","_","_"
1,"na","_","_","na","CNG","","_","_"
2,"jyeṣṭhān","_","_","jyeṣṭha","JJ","","_","_"
3,"avamanyeta","_","_","avaman","V","avaman","_","_"
4,"duṣkṛtaḥ","_","_","duṣkṛt","JJ","","_","_"
5,"_","_","_","su","CAD","","_","_"
6,"_","_","_","kṛt","JJ","","_","_"
7,"'pi","_","_","api","CX","","_","_"
8,"vā","_","_","vā","CCD","","_","_"
1,"yadi","_","_","yadi","CSB","","_","_"
2,"strī","_","_","strī","NC","","_","_"
3,"_","_","_","yadi","CSB","","_","_"
4,"_","_","_","avaraja","NC","","_","_"
5,"śreyaḥ","_","_","śreyas","JJ","","_","_"
6,"paśyet","_","_","paś","V","paś","_","_"
7,"_","_","_","tathā","CX","","_","_"
8,"_","_","_","ācar","V","ācar","_","_"
1,"dharmaṃ","_","_","dharma","NC","","_","_"
2,"hi","_","_","hi","CX","","_","_"
3,"śreya","_","_","śreyas","NC","","_","_"
4,"_","_","_","iti","CQT","","_","_"
5,"_","_","_","ah","V","ah","_","_"
6,"iti","_","_","iti","CQT","","_","_"
7,"_","_","_","dharma","NC","","_","_"
8,"_","_","_","vid","JJ","","_","_"
9,"viduḥ","_","_","vid","V","vid","_","_"
1,"_","_","_","daśan","NUM","","_","_"
2,"_","_","_","ācārya","NC","","_","_"
3,"upādhyāya","_","_","upādhyāya","NC","","_","_"
4,"upādhyāyān","_","_","upādhyāya","NC","","_","_"
5,"pitā","_","_","pitṛ","NC","","_","_"
6,"daśa","_","_","daśan","NUM","","_","_"
1,"daśa","_","_","daśan","NUM","","_","_"
2,"_","_","_","ca","CCD","","_","_"
3,"_","_","_","eva","CEM","","_","_"
4,"_","_","_","pitṛ","NC","","_","_"
5,"_","_","_","mātṛ","NC","","_","_"
6,"sarvāṃ","_","_","sarva","JQ","","_","_"
7,"vā","_","_","vā","CCD","","_","_"
8,"pṛthivīm","_","_","pṛthivī","NC","","_","_"
9,"api","_","_","api","CX","","_","_"
1,"_","_","_","gaurava","NC","","_","_"
2,"_","_","_","abhibhav","V","abhibhū","_","_"
3,"_","_","_","na","CNG","","_","_"
4,"_","_","_","as","V","as","_","_"
5,"_","_","_","mātṛ","NC","","_","_"
6,"_","_","_","sama","PPX","","_","_"
7,"guruḥ","_","_","guru","NC","","_","_"
1,"mātā","_","_","mātṛ","NC","","_","_"
2,"garīyasī","_","_","garīyas","JJ","","_","_"
3,"_","_","_","yad","PRL","","_","_"
4,"_","_","_","ca","CCD","","_","_"
5,"_","_","_","ta","CX","","_","_"
6,"_","_","_","tad","PRD","","_","_"
7,"manyate","_","_","man","V","man","_","_"
8,"janaḥ","_","_","jana","NC","","_","_"
1,"jyeṣṭho","_","_","jyeṣṭha","JJ","","_","_"
2,"bhrātā","_","_","bhrātṛ","NC","","_","_"
3,"_","_","_","pitṛ","NC","","_","_"
4,"_","_","_","sama","PPX","","_","_"
5,"mṛte","_","_","mṛ","PPP","","_","_"
6,"pitari","_","_","pitṛ","NC","","_","_"
7,"bhārata","_","_","bhārata","NC","","_","_"
1,"sa","_","_","tad","PRD","","_","_"
2,"_","_","_","hi","CX","","_","_"
3,"_","_","_","ida","PRD","","_","_"
4,"_","_","_","vṛtti","NC","","_","_"
5,"_","_","_","dātṛ","JJ","","_","_"
6,"syāt","_","_","as","V","as","_","_"
7,"sa","_","_","tad","PRD","","_","_"
8,"_","_","_","ca","CCD","","_","_"
9,"_","_","_","tad","PRD","","_","_"
10,"paripālayet","_","_","paripib","V","paripā","_","_"
1,"_","_","_","kaniṣṭha","NC","","_","_"
2,"_","_","_","tad","PRD","","_","_"
3,"namasyeran","_","_","namasy","V","namasy","_","_"
4,"sarve","_","_","sarva","JQ","","_","_"
5,"_","_","_","chanda","NC","","_","_"
6,"_","_","_","anuvartin","JJ","","_","_"
1,"tam","_","_","tad","PRD","","_","_"
2,"eva","_","_","eva","CEM","","_","_"
3,"_","_","_","ca","CCD","","_","_"
4,"_","_","_","upajīv","V","upajīv","_","_"
5,"_","_","_","yathā","CCM","","_","_"
6,"_","_","_","eva","CEM","","_","_"
7,"pitaraṃ","_","_","pitṛ","NC","","_","_"
8,"tathā","_","_","tathā","CX","","_","_"
1,"śarīram","_","_","śarīra","NC","","_","_"
2,"etau","_","_","tad","PRD","","_","_"
3,"sṛjataḥ","_","_","sṛj","V","sṛj","_","_"
4,"pitā","_","_","pitṛ","NC","","_","_"
5,"mātā","_","_","mātṛ","NC","","_","_"
6,"ca","_","_","ca","CCD","","_","_"
7,"bhārata","_","_","bhārata","NC","","_","_"
1,"_","_","_","ācārya","NC","","_","_"
2,"_","_","_","śās","PPP","","_","_"
3,"yā","_","_","yad","PRL","","_","_"
4,"jātiḥ","_","_","jāti","NC","","_","_"
5,"sā","_","_","tad","PRD","","_","_"
6,"satyā","_","_","satya","JJ","","_","_"
7,"_","_","_","tad","PRD","","_","_"
8,"_","_","_","ajara","JJ","","_","_"
9,"_","_","_","amara","JJ","","_","_"
1,"jyeṣṭhā","_","_","jyeṣṭha","JJ","","_","_"
2,"_","_","_","mātṛ","NC","","_","_"
3,"_","_","_","sama","PPX","","_","_"
4,"_","_","_","ca","CCD","","_","_"
5,"_","_","_","api","CX","","_","_"
6,"bhaginī","_","_","bhaginī","NC","","_","_"
7,"_","_","_","bharata","NC","","_","_"
8,"_","_","_","ṛṣabha","NC","","_","_"
1,"bhrātur","_","_","bhrātṛ","NC","","_","_"
2,"bhāryā","_","_","bhāryā","NC","","_","_"
3,"ca","_","_","ca","CCD","","_","_"
4,"tadvat","_","_","tadvat","CX","","_","_"
5,"syād","_","_","as","V","as","_","_"
6,"yasyā","_","_","yad","PRL","","_","_"
7,"bālye","_","_","bālya","NC","","_","_"
8,"stanaṃ","_","_","stana","NC","","_","_"
9,"pibet","_","_","pib","V","pā","_","_"
