"WordID","word","NormSTEM","suffix","lemma","PoS","Root","NormSuffix","NormWord"
"","<s number = ""1"">","","","","","","",""
"1","mahākavi","MAHĀKAV","i","mahākavi","","","i","mahākavi"
"2","śrī","ŚRĪ","","śrī","noun-adj","","","śrī"
"3","kāli","KĀL","i","kāli","noun-adj","","i","kāli"
"4","dāsa","DĀS","a","dāsa","noun-adj","","a","dāsa"
"5","kṛtam","KṚT","am","kṛta","noun-adj","","am","kṛtam"
"6","śyāmalā","ŚYĀMAL","ā","śyāmalā","","","ā","śyāmalā"
"7","daṇḍakam","DAṆḌAK","am","daṇḍaka","","","am","daṇḍakam"
"8","/","","","","punct","","","/"
"9","māṇikya","MĀṆIKY","a","māṇikya","noun-adj","","a","māṇikya"
"10","vīṇām","VĪṆ","ām","vīṇā","noun-adj","","ām","vīṇām"
"11","upalāpa","UPALĀP","a","upalāp","","","a","upalāpa"
"12","yantīm","YANT","īm","yanti","","","īm","yantīm"
"13","mada","","","mada","ind","","","mada"
"14","alasām","ALAS","ām","alasa","","","ām","alasām"
"15","mañjula","MAÑJUL","a","mañjula","","","a","mañjula"
"16","vāc","VĀC","","vāk","noun-adj","","","vāc"
"17","vilāsām","VILĀS","ām","vilāsā","","","ām","vilāsām"
"18","/","","","","punct","","","/"
"19","māhendra","MĀHENDR","a","māhendra","noun-adj","","a","māhendra"
"20","nīla","NĪL","a","nīla","noun-adj","","a","nīla"
"21","upala","UPAL","a","upala","noun-adj","","a","upala"
"22","komala","KOMAL","a","komala","noun-adj","","a","komala"
"23","aṅgīm","AṄG","īm","aṅgī","","","īm","aṅgīm"
"24","mātaṅga","MĀTAṂG","a","mātaṃga","noun-adj","","a","mātaṃga"
"25","kanyām","KANY","ām","kanyā","noun-adj","","ām","kanyām"
"26","satatam","SATAT","am","satata","noun-adj","","am","satatam"
"27","smarāmi","SMAR","āmi","smar","verb","smṛ","āmi","smarāmi"
"28","//","","","","punct","","","//"
"","</s>","","","","","","",""
"","<s number = ""2"">","","","","","","",""
"1","jaya","JAY","a","jaya","noun-adj","","a","jaya"
"2","mātaṅga","MĀTAṂG","a","mātaṃga","noun-adj","","a","mātaṃga"
"3","tanaye","TANAY","e","tanaya","noun-adj","","e","tanaye"
"4","jaya","JAY","a","jaya","noun-adj","","a","jaya"
"5","nīlotpala","NĪLOTPAL","a","nīlotpala","noun-adj","","a","nīlotpala"
"6","dyute","DYUT","e","dyuti","noun-adj","","e","dyute"
"7","/","","","","punct","","","/"
"8","jaya","JAY","a","jaya","noun-adj","","a","jaya"
"9","saṃgīta","SAṂGĪT","a","saṃgīta","noun-adj","","a","saṃgīta"
"10","rasike","RASIK","e","rasika","","","e","rasike"
"11","jaya","JAY","a","jaya","noun-adj","","a","jaya"
"12","līlā","LĪL","ā","līlā","noun-adj","","ā","līlā"
"13","śuka","ŚUK","a","śuka","noun-adj","","a","śuka"
"14","priye","PRIY","e","priya","noun-adj","","e","priye"
"15","//","","","","punct","","","//"
"","</s>","","","","","","",""
"","<s number = ""3"">","","","","","","",""
"1","jaya","JAY","a","jaya","noun-adj","","a","jaya"
"2","janani","JANAN","i","jananī","noun-adj","","i","janani"
"3","sudhā","SUDH","ā","sudhā","noun-adj","","ā","sudhā"
"4","samudra","SAMUDR","a","samudra","noun-adj","","a","samudra"
"5","antarudyat","ANTAR","udyat","antaru","","","udyat","antarudyat"
"6","maṇi","MAṆ","i","maṇi","noun-adj","","i","maṇi"
"7","dvīpa","DVĪP","a","dvīpa","noun-adj","","a","dvīpa"
"8","saṃrūḍha","SAṂRŪḌH","a","saṃrūḍha","noun-adj","","a","saṃrūḍha"
"9","bilva","BILV","a","bilva","noun-adj","","a","bilva"
"10","aṭavī","AṬAV","ī","aṭavī","noun-adj","","ī","aṭavī"
"11","madhya","MADHY","a","madhya","noun-adj","","a","madhya"
"12","kalpadruma","KALPADRUM","a","kalpadruma","noun-adj","","a","kalpadruma"
"13","ākalpa","ĀKALP","a","akalpa","noun-adj","","a","ākalpa"
"14","kādamba","KĀDAMB","a","kādamba","noun-adj","","a","kādamba"
"15","kān","KĀN","","kim","pron","","","kān"
"16","tāra","TĀR","a","tāra","noun-adj","","a","tāra"
"17","vāsa","VĀS","a","vāsa","noun-adj","","a","vāsa"
"18","priye","PRIY","e","priya","noun-adj","","e","priye"
"19","kṛttivāsaḥ","KṚTTIVĀS","aḥ","kṛttivāsa","","","aḥ","kṛttivāsaḥ"
"20","priye","PRIY","e","priya","noun-adj","","e","priye"
"21","sarva","SARV","a","sarva","noun-adj","","a","sarva"
"22","loka","LOK","a","loka","noun-adj","","a","loka"
"23","p","","","api","ind","","","api"
"24","sādara","SĀDAR","a","sādara","noun-adj","","a","sādara"
"25","ārabdha","ĀRABDH","a","ārabdha","noun-adj","","a","ārabdha"
"26","saṃgīta","SAṂGĪT","a","saṃgīta","noun-adj","","a","saṃgīta"
"27","saṃbhāvanā","SAMBHĀV","anā","sambhāvanā","noun-adj","","anā","sambhāvanā"
"28","saṃbhrama","SAMBHRAMA","","sambhrama","noun-adj","","","sambhrama"
"29","ālola","ĀLOL","a","ālola","noun-adj","","a","ālola"
"30","nīpa","NĪP","a","nīpa","noun-adj","","a","nīpa"
"31","sraj","SRAJ","","sraja","noun-adj","","","sraj"
"32","ābaddha","ĀBADDH","a","ābaddha","noun-adj","","a","ābaddha"
"33","cūlī","CŪL","ī","cūlin","","","ī","cūlī"
"34","sanātha","SANĀTH","a","sanātha","noun-adj","","a","sanātha"
"35","trike","TRIK","e","trika","noun-adj","","e","trike"
"36","sa","","","tad","pron","","","tad"
"37","anumat","ANUM","at","anumat","noun-adj","","at","anumat"
"38","putrike","PUTR","ike","putrika","noun-adj","","ike","putrike"
"39","/","","","","punct","","","/"
"40","śekharī","ŚEKHAR","ī","śekharī","","","ī","śekharī"
"41","bhūta","BHŪT","a","bhūta","","","a","bhūta"
"42","pīta","PĪT","a","pīta","noun-adj","","a","pīta"
"43","aṃśu","AṂŚ","u","aṃśu","noun-adj","","u","aṃśu"
"44","rekhā","REKH","ā","rekhā","noun-adj","","ā","rekhā"
"45","mayūkha","MAYŪKH","a","mayūkha","noun-adj","","a","mayūkha"
"46","āvalī","ĀVAL","ī","avalī","noun-adj","","ī","āvalī"
"47","baddha","BADDH","a","baddha","noun-adj","","a","baddha"
"48","su","","","su","ind","","","su"
"49","snigdha","SNIGDH","a","snigdha","noun-adj","","a","snigdha"
"50","nīlā","NĪL","ā","nīlā","noun-adj","","ā","nīlā"
"51","alaka","ALAK","a","alaka","noun-adj","","a","alaka"
"52","śreṇi","ŚREṆ","i","śreṇi","noun-adj","","i","śreṇi"
"53","śṛṅgārite","ŚṚṄGĀRIT","e","śṛṅgārita","","","e","śṛṅgārite"
"54","loka","LOK","a","loka","noun-adj","","a","loka"
"55","saṃbhāvite","SAMBHĀV","ite","sambhāvita","verb","","ite","sambhāvite"
"56","/","","","","punct","","","/"
"57","kāma","KĀM","a","kāma","noun-adj","","a","kāma"
"58","līlā","LĪL","ā","līlā","noun-adj","","ā","līlā"
"59","dhanuḥ","DHAN","uḥ","dhanu","noun-adj","","uḥ","dhanuḥ"
"60","saṃnibha","SAṂNIBH","a","saṃnibha","noun-adj","","a","saṃnibha"
"61","bhrū","BHR","ū","bhrū","noun-adj","","ū","bhrū"
"62","latā","LAT","ā","latā","noun-adj","","ā","latā"
"63","puṣpa","PUṢP","a","puṣpa","noun-adj","","a","puṣpa"
"64","saṃdoha","SAṂDOH","a","saṃdoha","noun-adj","","a","saṃdoha"
"65","saṃdeha","SAṂDEH","a","saṃdeha","noun-adj","","a","saṃdeha"
"66","kṛt","KṚT","","kṛta","noun-adj","","","kṛt"
"67","locane","LOCAN","e","locana","noun-adj","","e","locane"
"68","vāc","VĀC","","vāk","noun-adj","","","vāc"
"69","sudhā","SUDH","ā","sudhā","noun-adj","","ā","sudhā"
"70","secane","SECAN","e","secana","noun-adj","","e","secane"
"71","/","","","","punct","","","/"
"72","cāru","CĀR","u","cāru","noun-adj","","u","cāru"
"73","gorocanā","GOROCAN","ā","gorocanā","noun-adj","","ā","gorocanā"
"74","paṅka","PAṄK","a","paṅka","noun-adj","","a","paṅka"
"75","kelī","KEL","ī","kelī","noun-adj","","ī","kelī"
"76","lalāma","LALĀM","a","lalāma","noun-adj","","a","lalāma"
"77","abhirāme","ABHIRĀM","e","abhirāma","noun-adj","","e","abhirāme"
"78","surāme","SURĀM","e","surāma","","","e","surāme"
"79","rame","RAM","e","rama","noun-adj","","e","rame"
"80","/","","","","punct","","","/"
"81","prollasat","PROLLAS","at","prollasat","noun-adj","","at","prollasat"
"82","bālikā","BĀLIK","ā","bālikā","noun-adj","","ā","bālikā"
"83","mauktika","MAUKTIK","a","mauktika","noun-adj","","a","mauktika"
"84","śreṇikā","ŚREṆIK","ā","śreṇikā","","","ā","śreṇikā"
"85","candrikā","CANDR","ikā","candrika","noun-adj","","ikā","candrikā"
"86","maṇḍala","MAṆḌAL","a","maṇḍala","noun-adj","","a","maṇḍala"
"87","udbhāsi","UDBHĀS","i","udbhāsin","noun-adj","","i","udbhāsi"
"88","lāvaṇya","LĀVAṆY","a","lāvaṇya","noun-adj","","a","lāvaṇya"
"89","gaṇḍa","GAṆḌ","a","gaṇḍa","noun-adj","","a","gaṇḍa"
"90","sthala","STHAL","a","sthala","noun-adj","","a","sthala"
"91","nyasta","NYAST","a","nyasta","noun-adj","","a","nyasta"
"92","kastūrikā","KASTŪRIK","ā","kastūrikā","noun-adj","","ā","kastūrikā"
"93","pattra","PATTR","a","pattra","noun-adj","","a","pattra"
"94","rekhā","REKH","ā","rekhā","noun-adj","","ā","rekhā"
"95","samudbhūta","SAMUDBHŪT","a","samudbhūta","noun-adj","","a","samudbhūta"
"96","saurabhya","SAURABHY","a","saurabhya","noun-adj","","a","saurabhya"
"97","saṃbhrānta","SAṂBHRĀNT","a","saṃbhrānta","noun-adj","","a","saṃbhrānta"
"98","bhṛṅga","BHṚṄG","a","bhṛṅga","noun-adj","","a","bhṛṅga"
"99","aṅga","AṄG","a","aṅga","noun-adj","","a","aṅga"
"100","nāg","NĀG","","nāga","noun-adj","","","nāg"
"101","vallakī","VALL","akī","vallaka","noun-adj","","akī","vallakī"
"102","vādana","VĀDAN","a","vādana","noun-adj","","a","vādana"
"103","prakriyā","PRAKRIY","ā","prakriyā","noun-adj","","ā","prakriyā"
"104","lola","LOL","a","lola","noun-adj","","a","lola"
"105","tālī","TĀL","ī","tālī","noun-adj","","ī","tālī"
"106","dalā","DAL","ā","dala","noun-adj","","āḥ","dalāḥ"
"107","baddha","BADDH","a","baddha","noun-adj","","a","baddha"
"108","tā","","","tad","pron","","","tad"
"109","ṭaṅka","ṬAṄK","a","ṭaṅka","noun-adj","","a","ṭaṅka"
"110","bhūṣā","BHŪṢ","ā","bhūṣā","noun-adj","","ā","bhūṣā"
"111","viśeṣa","VIŚEṢ","a","viśeṣa","noun-adj","","a","viśeṣa"
"112","anvite","ANVIT","e","anvita","","","e","anvite"
"113","siddha","SIDDH","a","siddha","noun-adj","","a","siddha"
"114","saṃmānite","SAṂMĀN","ite","saṃmān","verb","","ite","saṃmānite"
"115","/","","","","punct","","","/"
"116","divya","DIVY","a","divya","noun-adj","","a","divya"
"117","hālā","HĀL","ā","hālā","noun-adj","","ā","hālā"
"118","mada","","","mada","ind","","","mada"
"119","udvela","UDVEL","a","udvela","noun-adj","","a","udvela"
"120","hel","HEL","","hela","","","","hel"
"121","āla","ĀL","a","āla","","","a","āla"
"122","sat","SAT","","sat","noun-adj","","","sat"
"123","cakṣuḥ","CAKṢ","uḥ","cakṣus","noun-adj","","uḥ","cakṣuḥ"
"124","āndolana","ĀNDOLAN","a","āndolana","","","a","āndolana"
"125","śrī","ŚRĪ","","śrī","noun-adj","","","śrī"
"126","samākṣipta","SAMĀKṢIPT","a","samākṣipta","noun-adj","","a","samākṣipta"
"127","karṇa","KARṆ","a","karṇa","noun-adj","","a","karṇa"
"128","eka","EK","a","eka","noun-adj","","a","eka"
"129","nīlotpale","NĪLOTPAL","e","nīlotpala","noun-adj","","e","nīlotpale"
"130","pūrita","PŪRIT","a","pūrita","noun-adj","","a","pūrita"
"131","aśeṣa","AŚEṢ","a","aśeṣa","noun-adj","","a","aśeṣa"
"132","loka","LOK","a","loka","noun-adj","","a","loka"
"133","abhivāñchā","ABHIVĀÑCH","ā","abhivāñchā","","","ā","abhivāñchā"
"134","phale","PHAL","e","phala","noun-adj","","e","phale"
"135","śrīphale","ŚRĪPHAL","e","śrīphala","","","e","śrīphale"
"136","/","","","","punct","","","/"
"137","sveda","SVED","a","sveda","noun-adj","","a","sveda"
"138","bindu","BIND","u","bindu","noun-adj","","u","bindu"
"139","ullasat","ULLAS","at","ullasat","","","at","ullasat"
"140","bhāla","BHĀL","a","bhāla","noun-adj","","a","bhāla"
"141","lāvaṇya","LĀVAṆY","a","lāvaṇya","noun-adj","","a","lāvaṇya"
"142","niṣyanda","NIṢYAND","a","niṣyanda","noun-adj","","a","niṣyanda"
"143","saṃdoha","SAṂDOH","a","saṃdoha","noun-adj","","a","saṃdoha"
"144","saṃdeha","SAṂDEH","a","saṃdeha","noun-adj","","a","saṃdeha"
"145","kṛt","KṚT","","kṛta","noun-adj","","","kṛt"
"146","nāsikā","NĀSIK","ā","nāsikā","noun-adj","","ā","nāsikā"
"147","mauktike","MAUKTIK","e","mauktika","","","e","mauktike"
"148","sarva","SARV","a","sarva","noun-adj","","a","sarva"
"149","viśva","VIŚV","a","viśva","noun-adj","","a","viśva"
"150","ātmike","ĀTM","ike","ātmika","","","ike","ātmike"
"151","kālike","KĀLIK","e","kālika","noun-adj","","e","kālike"
"152","/","","","","punct","","","/"
"153","mugdha","MUGDH","a","mugdha","noun-adj","","a","mugdha"
"154","manda","MAND","a","manda","noun-adj","","a","manda"
"155","smita","SMIT","a","smita","noun-adj","","a","smita"
"156","udāra","UDĀR","a","udāra","noun-adj","","a","udāra"
"157","vaktra","VAKTR","a","vaktra","noun-adj","","a","vaktra"
"158","sphurat","SPHUR","at","sphurat","noun-adj","","at","sphurat"
"159","pūga","PŪG","a","pūga","noun-adj","","a","pūga"
"160","tāmbūla","TĀMBŪLA","","tāmbūla","noun-adj","","","tāmbūla"
"161","karpūra","KARPŪR","a","karpūra","noun-adj","","a","karpūra"
"162","khaṇḍa","KHAṆḌ","a","khaṇḍa","noun-adj","","a","khaṇḍa"
"163","utkare","UTKAR","e","utkara","noun-adj","","e","utkare"
"164","jñāna","JÑĀN","a","jñāna","noun-adj","","a","jñāna"
"165","mudrā","MUDR","ā","mudrā","noun-adj","","ā","mudrā"
"166","kare","KAR","e","kara","noun-adj","","e","kare"
"167","sarva","SARV","a","sarva","noun-adj","","a","sarva"
"168","saṃpad","SAMPAD","","sampad","noun-adj","","","sampad"
"169","kare","KAR","e","kara","noun-adj","","e","kare"
"170","padma","PADM","a","padma","noun-adj","","a","padma"
"171","bhāsvat","BHĀSV","at","bhāsvat","noun-adj","","at","bhāsvat"
"172","kare","KAR","e","kara","noun-adj","","e","kare"
"173","/","","","","punct","","","/"
"174","kunda","KUND","a","kunda","noun-adj","","a","kunda"
"175","puṣpa","PUṢP","a","puṣpa","noun-adj","","a","puṣpa"
"176","dyuti","DYUT","i","dyuti","noun-adj","","i","dyuti"
"177","snigdha","SNIGDH","a","snigdha","noun-adj","","a","snigdha"
"178","danta","DANT","a","danta","noun-adj","","a","danta"
"179","āvalī","ĀVAL","ī","avalī","noun-adj","","ī","āvalī"
"180","nirmala","NIRMAL","a","nirmala","noun-adj","","a","nirmala"
"181","āloka","ĀLOK","a","āloka","noun-adj","","a","āloka"
"182","saṃm","","saṃm","","","","saṃm",""
"183","elana","EL","ana","ela","","","ana","elana"
"184","smera","SMER","a","smera","noun-adj","","a","smera"
"185","śoṇa","ŚOṆ","a","śoṇa","noun-adj","","a","śoṇa"
"186","adhare","ADHAR","e","adhara","noun-adj","","e","adhare"
"187","cāru","CĀR","u","cāru","noun-adj","","u","cāru"
"188","vīṇā","VĪṆ","ā","vīṇā","noun-adj","","ā","vīṇā"
"189","dhare","DHAR","e","dhara","noun-adj","","e","dhare"
"190","pakva","PAKV","a","pakva","noun-adj","","a","pakva"
"191","bimba","BIMBA","","bimba","noun-adj","","","bimba"
"192","adhare","ADHAR","e","adhara","noun-adj","","e","adhare"
"193","//","","","","punct","","","//"
"","</s>","","","","","","",""
"","<s number = ""4"">","","","","","","",""
"1","//","","","","punct","","","//"
"","</s>","","","","","","",""
"","<s number = ""5"">","","","","","","",""
"1","su","","","su","ind","","","su"
"2","lalita","LALIT","a","lalita","noun-adj","","a","lalita"
"3","nava","NAV","a","nau","noun-adj","","a","nava"
"4","yauvana","YAUVAN","a","yauvana","noun-adj","","a","yauvana"
"5","ārambha","ĀRAMBHA","","ārambha","noun-adj","","","ārambha"
"6","candra","CANDR","a","candra","noun-adj","","a","candra"
"7","udaya","UDAY","a","udaya","noun-adj","","a","udaya"
"8","udvela","UDVEL","a","udvela","noun-adj","","a","udvela"
"9","lāvaṇya","LĀVAṆY","a","lāvaṇya","noun-adj","","a","lāvaṇya"
"10","dugdha","DUGDH","a","dugdha","noun-adj","","a","dugdha"
"11","arṇava","ARṆAV","a","arṇava","noun-adj","","a","arṇava"
"12","āvirbhavat","ĀVIRBHAV","at","āvirbhavat","","","at","āvirbhavat"
"13","kambu","KAMBU","","kambu","noun-adj","","","kambu"
"14","bibboka","BIBBOK","a","bibboka","","","a","bibboka"
"15","bhṛt","BHṚ","t","bhṛt","noun-adj","","t","bhṛt"
"16","kaṃdhare","KAṂDHAR","e","kaṃdhara","","","e","kaṃdhare"
"17","satkalā","SATKAL","ā","satkalā","","","ā","satkalā"
"18","mandire","MANDIR","e","mandira","noun-adj","","e","mandire"
"19","manthare","MANTHAR","e","manthara","","","e","manthare"
"20","/","","","","punct","","","/"
"21","divya","DIVY","a","divya","noun-adj","","a","divya"
"22","ratna","RATN","a","ratna","noun-adj","","a","ratna"
"23","prabhā","PRABH","ā","prabhā","noun-adj","","ā","prabhā"
"24","bandhuracchanna","","","","","","",""
"25","hāra","HĀR","a","hāra","noun-adj","","a","hāra"
"26","ādi","ĀD","i","ādi","noun-adj","","i","ādi"
"27","bhūṣā","BHŪṢ","ā","bhūṣā","noun-adj","","ā","bhūṣā"
"28","samuddyotamāna","SAMUDDYOT","amāna","samuddyot","verb","","amāna","samuddyotamāna"
"29","anavadya","ANAVADY","a","anavadya","noun-adj","","a","anavadya"
"30","aṃśu","AṂŚ","u","aṃśu","noun-adj","","u","aṃśu"
"31","śobhe","ŚOBH","e","śobha","noun-adj","","e","śobhe"
"32","śubhe","ŚUBH","e","śubha","noun-adj","","e","śubhe"
"33","/","","","","punct","","","/"
"34","ratna","RATN","a","ratna","noun-adj","","a","ratna"
"35","keyūra","KEYŪR","a","keyūra","noun-adj","","a","keyūra"
"36","raśmi","RAŚM","i","raśmi","noun-adj","","i","raśmi"
"37","chaṭā","CHAṬ","ā","chaṭā","noun-adj","","ā","chaṭā"
"38","pallava","PALLAV","a","pallava","noun-adj","","a","pallava"
"39","prollasat","PROLLAS","at","prollasat","noun-adj","","at","prollasat"
"40","dos","","","","","","",""
"41","latārā","LAT","ārā","latā","","","ārā","latārā"
"42","jite","JIT","e","jita","noun-adj","","e","jite"
"43","yogibhiḥ","YOG","ibhiḥ","yogin","noun-adj","","ibhiḥ","yogibhiḥ"
"44","pūjite","PŪJIT","e","pūjita","noun-adj","","e","pūjite"
"45","/","","","","punct","","","/"
"46","viśva","VIŚV","a","viśva","noun-adj","","a","viśva"
"47","diś","DIŚ","","diśa","noun-adj","","","diś"
"48","maṇḍala","MAṆḌAL","a","maṇḍala","noun-adj","","a","maṇḍala"
"49","vyāpi","VYĀP","i","vyāpin","noun-adj","","i","vyāpi"
"50","māṇikya","MĀṆIKY","a","māṇikya","noun-adj","","a","māṇikya"
"51","tejaḥ","TEJ","aḥ","teja","noun-adj","","aḥ","tejaḥ"
"52","sphurat","SPHUR","at","sphurat","noun-adj","","at","sphurat"
"53","kaṅkaṇa","KAṄKAṆ","a","kaṅkaṇa","noun-adj","","a","kaṅkaṇa"
"54","alaṃkṛte","ALAṂKṚT","e","alaṃkṛta","noun-adj","","e","alaṃkṛte"
"55","vibhrama","VIBHRAM","a","vibhrama","noun-adj","","a","vibhrama"
"56","alaṃkṛte","ALAṂKṚT","e","alaṃkṛta","noun-adj","","e","alaṃkṛte"
"57","sādhakaiḥ","SĀDH","akaiḥ","sādhaka","noun-adj","","akaiḥ","sādhakaiḥ"
"58","satkṛte","SATKṚT","e","satkṛta","","","e","satkṛte"
"59","/","","","","punct","","","/"
"60","vāsara","VĀSAR","a","vāsara","noun-adj","","a","vāsara"
"61","ārambha","ĀRAMBHA","","ārambha","noun-adj","","","ārambha"
"62","velā","VEL","ā","velā","noun-adj","","ā","velā"
"63","samujjṛmbhamāna","","","","","","",""
"64","aravinda","ARAVIND","a","aravinda","","","a","aravinda"
"65","pratidvan","PRATIDV","an","pratidvat","","","ān","pratidvān"
"66","dvipāṇi","DVIP","āṇi","dvipa","","","āni","dvipāni"
"67","dvaye","DVAY","e","dvaya","noun-adj","","e","dvaye"
"68","saṃtata","SAṂTAT","a","saṃtata","noun-adj","","a","saṃtata"
"69","udyat","UDYAT","","udyata","noun-adj","","","udyat"
"70","daye","DAY","e","daya","noun-adj","","e","daye"
"71","advaye","ADVAY","e","advaya","noun-adj","","e","advaye"
"72","/","","","","punct","","","/"
"73","divya","DIVY","a","divya","noun-adj","","a","divya"
"74","ratna","RATN","a","ratna","noun-adj","","a","ratna"
"75","ūrmika","ŪRMIK","a","ūrmika","","","a","ūrmika"
"76","ādīdhiti","ĀDĪ","dhiti","ādī","verb","","dhiti","ādīdhiti"
"77","stoma","STOM","a","stoma","noun-adj","","a","stoma"
"78","saṃdhyāyamāna","SAṂDHYĀY","amāna","saṃdhyāy","verb","saṃdhyai","amāna","saṃdhyāyamāna"
"79","aṅgulī","AṄGUL","ī","aṅgulī","noun-adj","","ī","aṅgulī"
"80","pallava","PALLAV","a","pallava","noun-adj","","a","pallava"
"81","udyat","UDYAT","","udyata","noun-adj","","","udyat"
"82","na","","","na","ind","","","na"
"83","kha","","","kha","ind","","","kha"
"84","indu","IND","u","indu","noun-adj","","u","indu"
"85","prabhā","PRABH","ā","prabhā","noun-adj","","ā","prabhā"
"86","maṇḍale","MAṆḌAL","e","maṇḍala","noun-adj","","e","maṇḍale"
"87","saṃnatā","SAṂNAT","ā","saṃnatā","","","ā","saṃnatā"
"88","khaṇḍale","KHAṆḌAL","e","khaṇḍala","noun-adj","","e","khaṇḍale"
"89","cit","CIT","","cid","noun-adj","","","cit"
"90","prabhā","PRABH","ā","prabhā","noun-adj","","ā","prabhā"
"91","maṇḍale","MAṆḌAL","e","maṇḍala","noun-adj","","e","maṇḍale"
"92","prollasat","PROLLAS","at","prollasat","noun-adj","","at","prollasat"
"93","kuṇḍale","KUṆḌAL","e","kuṇḍala","noun-adj","","e","kuṇḍale"
"94","/","","","","punct","","","/"
"95","tārakārājinī","TĀRAKĀRĀJ","inī","tārakārājin","","","inī","tārakārājinī"
"96","kāśa","KĀŚ","a","kāśa","noun-adj","","a","kāśa"
"97","hāra","HĀR","a","hāra","noun-adj","","a","hāra"
"98","āvali","ĀVAL","i","āvali","noun-adj","","i","āvali"
"99","smera","SMER","a","smera","noun-adj","","a","smera"
"100","cāru","CĀR","u","cāru","noun-adj","","u","cāru"
"101","stana","STAN","a","stana","noun-adj","","a","stana"
"102","ābhoga","ĀBHOG","a","ābhoga","noun-adj","","a","ābhoga"
"103","bhārā","BHĀR","ā","bhāra","","","āḥ","bhārāḥ"
"104","namad","NAM","ad","namat","","","at","namat"
"105","madhya","MADHY","a","madhya","noun-adj","","a","madhya"
"106","vallī","VALL","ī","vallī","noun-adj","","ī","vallī"
"107","bali","BAL","i","bali","noun-adj","","i","bali"
"108","cheda","CHED","a","cheda","noun-adj","","a","cheda"
"109","vīcī","VĪC","ī","vīci","noun-adj","","ī","vīcī"
"110","samullāsa","SAMULLĀS","a","samullāsa","","","a","samullāsa"
"111","saṃdarśita","SAṂDARŚIT","a","saṃdarśita","noun-adj","","a","saṃdarśita"
"112","ākāra","ĀKĀR","a","ākāra","noun-adj","","a","ākāra"
"113","saundarya","SAUNDARY","a","saundarya","noun-adj","","a","saundarya"
"114","ratna","RATN","a","ratna","noun-adj","","a","ratna"
"115","ākare","ĀKAR","e","akara","noun-adj","","e","ākare"
"116","vallakībhṛt","","","","","","",""
"117","ka","","","kim","pron","","","kim"
"118","hema","HEM","a","hema","noun-adj","","a","hema"
"119","kumbha","KUMBHA","","kumbha","noun-adj","","","kumbha"
"120","upama","UPAM","a","upama","noun-adj","","a","upama"
"121","uttuṅga","UTTUṄG","a","uttuṅga","noun-adj","","a","uttuṅga"
"122","vakṣoja","VAKṢOJ","a","vakṣoja","","","a","vakṣoja"
"123","bhāra","BHĀR","a","bhāra","noun-adj","","a","bhāra"
"124","avanamre","AVANAM","e","avanamra","","","e","avaname"
"125","triloka","TRILOK","a","triloka","noun-adj","","a","triloka"
"126","avanamre","AVANAM","e","avanamra","","","e","avaname"
"127","/","","","","punct","","","/"
"128","lasat","LAS","at","las","verb","las","at","lasat"
"129","vṛtta","VṚTT","a","vṛtta","noun-adj","","a","vṛtta"
"130","gambhīra","GAMBHĪR","a","gambhīra","noun-adj","","a","gambhīra"
"131","nābhī","NĀBH","ī","nābhi","noun-adj","","ī","nābhī"
"132","saraḥ","SAR","aḥ","sara","noun-adj","","aḥ","saraḥ"
"133","tīra","TĪR","a","tīra","noun-adj","","a","tīra"
"134","śaivāla","ŚAIVĀL","a","śaivāla","noun-adj","","a","śaivāla"
"135","śaṅkā","ŚAṄK","ā","śaṅkā","noun-adj","","ā","śaṅkā"
"136","ākara","ĀKAR","a","akara","noun-adj","","a","ākara"
"137","śyāma","ŚYĀM","a","śyāma","noun-adj","","a","śyāma"
"138","roma","ROM","a","roma","noun-adj","","a","roma"
"139","āvalī","ĀVAL","ī","āvalī","","","ī","āvalī"
"140","bhūṣaṇe","BHŪṢAṆ","e","bhūṣaṇa","","","e","bhūṣaṇe"
"141","mañju","MAÑJ","u","mañju","noun-adj","","u","mañju"
"142","saṃbhāṣaṇe","SAMBHĀṢAṆA","","sambhāṣaṇa","noun-adj","","","sambhāṣaṇa"
"143","/","","","","punct","","","/"
"144","cāru","CĀR","u","cāru","noun-adj","","u","cāru"
"145","śiñjat","ŚIÑJ","at","śiñjat","","","at","śiñjat"
"146","kaṭī","KAṬ","ī","kaṭin","noun-adj","","ī","kaṭī"
"147","sūtra","SŪTR","a","sūtra","noun-adj","","a","sūtra"
"148","nirbhartsita","NIRBHARTSIT","a","nirbhartsita","","","a","nirbhartsita"
"149","anaṅga","ANAṄG","a","anaṅga","noun-adj","","a","anaṅga"
"150","līlā","LĪL","ā","līlā","noun-adj","","ā","līlā"
"151","dhanuḥ","DHAN","uḥ","dhanu","noun-adj","","uḥ","dhanuḥ"
"152","śiñjinī","ŚIÑJ","inī","śiñjin","","","inī","śiñjinī"
"153","ḍambare","ḌAMBAR","e","ḍambara","noun-adj","","e","ḍambare"
"154","divya","DIVY","a","divya","noun-adj","","a","divya"
"155","ratna","RATN","a","ratna","noun-adj","","a","ratna"
"156","ambare","AMBARA","","ambara","noun-adj","","","ambara"
"157","/","","","","punct","","","/"
"158","padmarāga","PADMARĀG","a","padmarāga","noun-adj","","a","padmarāga"
"159","ullasat","ULLAS","at","ullasat","","","at","ullasat"
"160","mekhalā","MEKHAL","ā","mekhalā","noun-adj","","ā","mekhalā"
"161","bhāsvara","BHĀSVAR","a","bhāsvara","noun-adj","","a","bhāsvara"
"162","śroṇi","ŚROṆ","i","śroṇī","noun-adj","","i","śroṇi"
"163","śobhā","ŚOBH","ā","śobha","noun-adj","","āḥ","śobhāḥ"
"164","jita","JIT","a","jita","noun-adj","","a","jita"
"165","svarṇa","SVARṆ","a","svarṇa","noun-adj","","a","svarṇa"
"166","bhūbhṛt","","","","","","",""
"167","tale","TAL","e","tala","noun-adj","","e","tale"
"168","candrikā","CANDR","ikā","candrika","noun-adj","","ikā","candrikā"
"169","śītale","ŚĪTAL","e","śītala","noun-adj","","e","śītale"
"170","//","","","","punct","","","//"
"","</s>","","","","","","",""
"","<s number = ""6"">","","","","","","",""
"1","//","","","","punct","","","//"
"","</s>","","","","","","",""
"","<s number = ""7"">","","","","","","",""
"1","vikasita","VIKASIT","a","vikasita","noun-adj","","a","vikasita"
"2","nava","NAV","a","nau","noun-adj","","a","nava"
"3","kiṃśukā","KIṂŚUK","ā","kiṃśuka","","","āḥ","kiṃśukāḥ"
"4","tāmra","TĀMRA","","tāmra","noun-adj","","","tāmra"
"5","divya","DIVY","a","divya","noun-adj","","a","divya"
"6","aṃśuka","AṂŚUK","a","aṃśuka","noun-adj","","a","aṃśuka"
"7","channa","CHANN","a","channa","noun-adj","","a","channa"
"8","cāru","CĀR","u","cāru","noun-adj","","u","cāru"
"9","ūru","","","","ind","","",""
"10","śobhā","ŚOBH","ā","śobha","noun-adj","","āḥ","śobhāḥ"
"11","parābhūta","PARĀBHŪT","a","parābhūta","noun-adj","","a","parābhūta"
"12","sindūra","SINDŪR","a","sindūra","noun-adj","","a","sindūra"
"13","śoṇāyamāna","","","","","","",""
"14","indra","INDR","a","indra","noun-adj","","a","indra"
"15","mātaṅga","MĀTAṂG","a","mātaṃga","noun-adj","","a","mātaṃga"
"16","hasta","HAST","a","hasta","noun-adj","","a","hasta"
"17","argale","ARGAL","e","argala","noun-adj","","e","argale"
"18","vaibhavān","VAIBHAV","ān","vaibhava","","","ān","vaibhavān"
"19","argale","ARGAL","e","argala","noun-adj","","e","argale"
"20","śyāmale","ŚYĀMAL","e","śyāmala","","","e","śyāmale"
"21","/","","","","punct","","","/"
"22","komala","KOMAL","a","komala","noun-adj","","a","komala"
"23","snigdha","SNIGDH","a","snigdha","noun-adj","","a","snigdha"
"24","nīla","NĪL","a","nīla","noun-adj","","a","nīla"
"25","upala","UPAL","a","upala","noun-adj","","a","upala"
"26","utpādita","UTPĀDIT","a","utpādita","noun-adj","","a","utpādita"
"27","anaṅga","ANAṄG","a","anaṅga","noun-adj","","a","anaṅga"
"28","tūṇīra","TŪṆĪR","a","tūṇīra","noun-adj","","a","tūṇīra"
"29","śaṅkā","ŚAṄK","ā","śaṅkā","noun-adj","","ā","śaṅkā"
"30","kara","KAR","a","kara","noun-adj","","a","kara"
"31","udāra","UDĀR","a","udāra","noun-adj","","a","udāra"
"32","jaṅghālate","JAṄGHĀL","ate","jaṅghāl","verb","","ate","jaṅghālate"
"33","cāru","CĀR","u","cāru","","","u","cāru"
"34","līlā","LĪL","ā","līlā","","","ā","līlā"
"35","gate","GAT","e","gata","noun-adj","","e","gate"
"36","/","","","","punct","","","/"
"37","namra","NAMRA","","namra","noun-adj","","","namra"
"38","dikpāla","DIKPĀL","a","dikpāla","noun-adj","","a","dikpāla"
"39","sīmantinī","SĪMANTIN","ī","sīmantinī","noun-adj","","ī","sīmantinī"
"40","kuntala","KUNTAL","a","kuntala","","","a","kuntala"
"41","snigdha","SNIGDH","a","snigdha","noun-adj","","a","snigdha"
"42","nīla","NĪL","a","nīla","noun-adj","","a","nīla"
"43","prabhā","PRABH","ā","prabhā","noun-adj","","ā","prabhā"
"44","puñja","PUÑJ","a","puñja","noun-adj","","a","puñja"
"45","saṃjāta","SAṂJĀT","a","saṃjāta","noun-adj","","a","saṃjāta"
"46","dūrvā","DŪRV","ā","dūrvā","noun-adj","","ā","dūrvā"
"47","aṅkura","AṄKUR","a","aṅkura","noun-adj","","a","aṅkura"
"48","āśaṅka","ĀŚAṄK","a","āśaṅka","noun-adj","","a","āśaṅka"
"49","sāraṅga","SĀRAṄG","a","sāraṅga","noun-adj","","a","sāraṅga"
"50","saṃyoga","SAṂYOG","a","saṃyoga","noun-adj","","a","saṃyoga"
"51","riṅkhat","RIṄKH","at","riṅkhat","","","at","riṅkhat"
"52","nakha","NAKH","a","nakha","noun-adj","","a","nakha"
"53","indu","IND","u","indu","noun-adj","","u","indu"
"54","ujjvale","UJJVAL","e","ujjvala","","","e","ujjvale"
"55","projjvale","PROJJVAL","e","projjvala","noun-adj","","e","projjvale"
"56","nirmale","NIRMAL","e","nirmala","noun-adj","","e","nirmale"
"57","/","","","","punct","","","/"
"58","prahva","PRAHV","a","prahva","noun-adj","","a","prahva"
"59","deveśa","DEVEŚ","a","deveśa","noun-adj","","a","deveśa"
"60","lakṣmīśa","LAKṢMĪŚ","a","lakṣmīśa","","","a","lakṣmīśa"
"61","bhūteśa","BHŪT","eśa","bhūta","noun-adj","","eśa","bhūteśa"
"62","toyeśa","TOYEŚ","a","toyeśa","","","a","toyeśa"
"63","vāṇi","VĀṆ","i","vāṇi","noun-adj","","i","vāṇi"
"64","īśakī","","","","","","",""
"65","nāśa","NĀŚ","a","nāśa","noun-adj","","a","nāśa"
"66","daitya","DAITY","a","daitya","noun-adj","","a","daitya"
"67","īśaya","ĪŚAY","a","īśaya","","","a","īśaya"
"68","kṣeśa","KṢEŚ","a","kṣeśa","","","a","kṣeśa"
"69","vāyu","VĀY","u","vāyu","noun-adj","","u","vāyu"
"70","agni","AGN","i","agni","noun-adj","","i","agni"
"71","koṭīra","KOṬĪR","a","koṭīra","noun-adj","","a","koṭīra"
"72","māṇikya","MĀṆIKY","a","māṇikya","noun-adj","","a","māṇikya"
"73","saṃghṛṣṭa","SAṄGHṚṢṬ","a","saṅghṛṣṭa","noun-adj","","a","saṅghṛṣṭa"
"74","bāla","BĀL","a","bāla","noun-adj","","a","bāla"
"75","ātapa","ĀTAP","a","ātapa","noun-adj","","a","ātapa"
"76","uddā","UDD","ā","uddā","","","ā","uddā"
"77","malā","MAL","ā","malā","","","ā","malā"
"78","kṣā","","","kṣā","ind","","","kṣā"
"79","rasā","RAS","ā","rasā","","","ā","rasā"
"80","ruṇya","RUṆ","ya","","","","ya","ruṇya"
"81","tāruṇī","TĀRUṆ","ī","tāruṇa","","","ī","tāruṇī"
"82","alakṣmī","ALAKṢM","ī","alakṣmī","noun-adj","","ī","alakṣmī"
"83","su","","","su","ind","","","su"
"84","rucira","RUCIR","a","rucira","noun-adj","","a","rucira"
"85","nava","NAV","a","nau","noun-adj","","a","nava"
"86","ratna","RATN","a","ratna","noun-adj","","a","ratna"
"87","pīṭha","PĪṬH","a","pīṭha","noun-adj","","a","pīṭha"
"88","sthite","STHIT","e","sthita","noun-adj","","e","sthite"
"89","susthite","SUSTHIT","e","susthita","noun-adj","","e","susthite"
"90","/","","","","punct","","","/"
"91","ratna","RATN","a","ratna","noun-adj","","a","ratna"
"92","padma","PADM","a","padma","noun-adj","","a","padma"
"93","āsane","ĀSAN","e","āsana","noun-adj","","e","āsane"
"94","ratna","RATN","a","ratna","noun-adj","","a","ratna"
"95","siṃhāsane","SIṂHĀSAN","e","siṃhāsana","noun-adj","","e","siṃhāsane"
"96","śaṅkha","ŚAṄKH","a","śaṅkha","noun-adj","","a","śaṅkha"
"97","padma","PADM","a","padma","noun-adj","","a","padma"
"98","dvaya","DVAY","a","dvaya","noun-adj","","a","dvaya"
"99","upāśrite","UPĀŚRIT","e","upāśrita","noun-adj","","e","upāśrite"
"100","/","","","","punct","","","/"
"101","tatra","","","tatra","ind","","","tatra"
"102","vighneśa","VIGHN","eśa","vighna","noun-adj","","eśa","vighneśa"
"103","durgā","DURG","ā","durgā","noun-adj","","ā","durgā"
"104","baṭu","VAṬ","u","vaṭu","noun-adj","","u","vaṭu"
"105","kṣetrapālaiḥ","KṢETRAPĀL","aiḥ","kṣetrapāla","","","air","kṣetrapālair"
"106","yute","YUT","e","yuta","noun-adj","","e","yute"
"107","/","","","","punct","","","/"
"108","matta","MATT","a","matta","noun-adj","","a","matta"
"109","mātaṅga","MĀTAṂG","a","mātaṃga","noun-adj","","a","mātaṃga"
"110","kanyā","KANY","ā","kanyā","noun-adj","","ā","kanyā"
"111","samūha","SAMŪH","a","samūha","noun-adj","","a","samūha"
"112","anvite","ANVIT","e","anvita","","","e","anvite"
"113","mañjulā","MAÑJUL","ā","mañjulā","","","ā","mañjulā"
"114","menaka","MENAK","a","menaka","","","a","menaka"
"115","ādi","ĀD","i","ādi","noun-adj","","i","ādi"
"116","aṅga","AṄG","a","aṅga","noun-adj","","a","aṅga"
"117","nā","","","nā","ind","","","nā"
"118","mānite","MĀNIT","e","mānita","","","e","mānite"
"119","bhairavaiḥ","BHAIRAV","aiḥ","bhairava","noun-adj","","air","bhairavair"
"120","aṣṭabhiḥ","AṢṬ","abhiḥ","aṣṭa","noun-adj","","abhiḥ","aṣṭabhiḥ"
"121","veṣṭite","VEṢṬIT","e","veṣṭita","noun-adj","","e","veṣṭite"
"122","/","","","","punct","","","/"
"123","devi","DEV","i","devī","noun-adj","","i","devi"
"124","vāma","VĀM","a","vāma","noun-adj","","a","vāma"
"125","ādibhiḥ","ĀD","ibhiḥ","ādi","noun-adj","","ibhiḥ","ādibhiḥ"
"126","śaktibhiḥ","ŚAKT","ibhiḥ","śakti","noun-adj","","ibhiḥ","śaktibhiḥ"
"127","sevite","SEVIT","e","sevita","noun-adj","","e","sevite"
"128","/","","","","punct","","","/"
"129","dhātri","DHĀTR","i","dhātri","noun-adj","","i","dhātri"
"130","lakṣmī","LAKṢM","ī","lakṣmī","noun-adj","","ī","lakṣmī"
"131","ādi","ĀD","i","ādi","noun-adj","","i","ādi"
"132","śakti","ŚAKT","i","śakti","noun-adj","","i","śakti"
"133","aṣṭakaiḥ","AṢṬAK","aiḥ","aṣṭaka","","","air","aṣṭakair"
"134","saṃyute","SAṂYUT","e","saṃyuta","noun-adj","","e","saṃyute"
"135","/","","","","punct","","","/"
"136","mātṛkā","MĀTṚK","ā","mātṛkā","noun-adj","","ā","mātṛkā"
"137","maṇḍalaiḥ","MAṆḌAL","aiḥ","maṇḍala","noun-adj","","air","maṇḍalair"
"138","maṇḍite","MAṆḌIT","e","maṇḍita","noun-adj","","e","maṇḍite"
"139","/","","","","punct","","","/"
"140","yakṣa","YAKṢ","a","yakṣa","noun-adj","","a","yakṣa"
"141","gandharva","GANDHARV","a","gandharva","noun-adj","","a","gandharva"
"142","siddha","SIDDH","a","siddha","noun-adj","","a","siddha"
"143","aṅganā","AṄGAN","ā","aṅgana","noun-adj","","āḥ","aṅganāḥ"
"144","maṇḍalaiḥ","MAṆḌAL","aiḥ","maṇḍala","noun-adj","","air","maṇḍalair"
"145","arcite","ARCIT","e","arcita","noun-adj","","e","arcite"
"146","/","","","","punct","","","/"
"147","pañca","PAÑC","a","pañca","noun-adj","","a","pañca"
"148","bāṇa","BĀṆ","a","bāṇa","noun-adj","","a","bāṇa"
"149","ātmike","ĀTM","ike","ātmika","","","ike","ātmike"
"150","/","","","","punct","","","/"
"151","pañca","PAÑC","a","pañca","noun-adj","","a","pañca"
"152","bāṇena","BĀṆ","ena","bāṇa","noun-adj","","ena","bāṇena"
"153","ratyā","RAT","yā","rati","noun-adj","","yāḥ","ratyāḥ"
"154","na","","","na","ind","","","na"
"155","saṃbhāvite","SAMBHĀV","ite","sambhāvita","verb","","ite","sambhāvite"
"156","/","","","","punct","","","/"
"157","prīti","PRĪT","i","prīti","noun-adj","","i","prīti"
"158","bhājā","BHĀJ","ā","bhājā","noun-adj","","ā","bhājā"
"159","vasantena","VASANT","ena","vasanta","noun-adj","","ena","vasantena"
"160","ca","","","ca","ind","","","ca"
"161","ānandite","ĀNANDIT","e","ānandita","","","e","ānandite"
"162","/","","","","punct","","","/"
"163","bhakti","BHAKT","i","bhakti","noun-adj","","i","bhakti"
"164","bhājam","BHĀJ","am","bhāja","noun-adj","","am","bhājam"
"165","param","PARAM","","parama","noun-adj","","","param"
"166","śreyase","ŚREYAS","e","śreyasa","noun-adj","","e","śreyase"
"167","kalpase","KALP","ase","kalp","verb","kḷp","asi","kalpasi"
"168","/","","","","punct","","","/"
"169","yoginām","YOG","inām","yogin","noun-adj","","inām","yoginām"
"170","mānase","MĀNAS","e","mānasa","noun-adj","","e","mānase"
"171","dyotase","DYOT","ase","dyot","verb","dyut","asi","dyotasi"
"172","/","","","","punct","","","/"
"173","chandasām","CHAND","asām","chandas","","","asām","chandasām"
"174","ojasā","OJ","asā","ojas","","","asā","ojasā"
"175","bhrājase","BHRĀJ","ase","bhrāj","verb","","asi","bhrājasi"
"176","/","","","","punct","","","/"
"177","gīta","GĪT","a","gīta","noun-adj","","a","gīta"
"178","vidyā","VIDY","ā","vidyā","noun-adj","","ā","vidyā"
"179","vinoda","VINOD","a","vinoda","noun-adj","","a","vinoda"
"180","ati","","","ati","ind","","","ati"
"181","tṛṣṇena","TṚṢṆ","ena","tṛṣṇa","noun-adj","","ena","tṛṣṇena"
"182","kṛṣṇena","KṚṢṆ","ena","kṛṣṇa","noun-adj","","ena","kṛṣṇena"
"183","saṃpūjyase","SAMPŪJ","ase","sampūj","verb","saṃpūj","asi","sampūjasi"
"184","/","","","","punct","","","/"
"185","bhaktimat","BHAKTIM","at","bhaktimat","","","at","bhaktimat"
"186","cetasā","CETAS","ā","cetas","noun-adj","","ā","cetasā"
"187","vedhasā","VEDHAS","ā","vedhasa","noun-adj","","āḥ","vedhasāḥ"
"188","stūyase","STŪ","yase","stū","verb","","asi","stūasi"
"189","/","","","","punct","","","/"
"190","viśva","VIŚV","a","viśva","noun-adj","","a","viśva"
"191","hṛdyena","HṚDY","ena","hṛdya","","","ena","hṛdyena"
"192","vādyena","VĀDY","ena","vādya","noun-adj","","ena","vādyena"
"193","vidyādharaiḥ","VIDYĀDHAR","aiḥ","vidyādhara","noun-adj","","air","vidyādharair"
"194","gīyase","GĪ","yase","gāy","verb","gai","asi","gīasi"
"195","//","","","","punct","","","//"
"","</s>","","","","","","",""
"","<s number = ""8"">","","","","","","",""
"1","//","","","","punct","","","//"
"","</s>","","","","","","",""
"","<s number = ""9"">","","","","","","",""
"1","śravaṇa","ŚRAVAṆ","a","śravaṇa","noun-adj","","a","śravaṇa"
"2","haraṇa","HARAṆ","a","haraṇa","noun-adj","","a","haraṇa"
"3","dakṣiṇa","DAKṢIṆ","a","dakṣiṇa","noun-adj","","a","dakṣiṇa"
"4","kvāṇayā","KVĀṆ","ayā","kvāṇa","","","ayā","kvāṇayā"
"5","vīṇayā","VĪṆ","ayā","vīṇā","noun-adj","","ayā","vīṇayā"
"6","kiṃnaraiḥ","KIṂNAR","aiḥ","kiṃnara","noun-adj","","air","kiṃnarair"
"7","gīyase","GĪ","yase","gāy","verb","gai","asi","gīasi"
"8","/","","","","punct","","","/"
"9","yakṣa","YAKṢ","a","yakṣa","noun-adj","","a","yakṣa"
"10","gandharva","GANDHARV","a","gandharva","noun-adj","","a","gandharva"
"11","siddh","SID","dh","sid","verb","","dh","siddh"
"12","aṅganā","AṄGAN","ā","aṅganā","","","ā","aṅganā"
"13","maṇḍalaiḥ","MAṆḌAL","aiḥ","maṇḍala","noun-adj","","air","maṇḍalair"
"14","arcyase","ARCY","ase","ṛc","verb","ṛc","asi","arcyasi"
"15","/","","","","punct","","","/"
"16","sarva","SARV","a","sarva","noun-adj","","a","sarva"
"17","saubhāgya","SAUBHĀGY","a","saubhāgya","noun-adj","","a","saubhāgya"
"18","vāñchāvatībhiḥ","","","","","","",""
"19","vadhūbhiḥ","VADHŪ","bhiḥ","vadhūa","noun-adj","","bhiḥ","vadhūbhiḥ"
"20","surāṇām","SURĀṆ","ām","sura","noun-adj","","ām","surāṇām"
"21","samārādhyase","SAMĀRĀDHY","ase","samārādh","verb","samārādh","asi","samārādhyasi"
"22","/","","","","punct","","","/"
"23","sarva","SARV","a","sarva","noun-adj","","a","sarva"
"24","vidyā","VIDY","ā","vidyā","noun-adj","","ā","vidyā"
"25","viśeṣa","VIŚEṢ","a","viśeṣa","noun-adj","","a","viśeṣa"
"26","ātmakam","ĀTM","akam","ātmaka","noun-adj","","akam","ātmakam"
"27","cāṭu","CĀṬ","u","cāṭu","noun-adj","","u","cāṭu"
"28","gāthā","GĀTH","ā","gāthā","noun-adj","","ā","gāthā"
"29","samuccāraṇam","SAMUCCĀRAṆ","am","samuccāraṇa","","","am","samuccāraṇam"
"30","kaṇṭha","KAṆṬH","a","kaṇṭha","noun-adj","","a","kaṇṭha"
"31","mūla","MŪL","a","mūla","noun-adj","","a","mūla"
"32","ullasat","ULLAS","at","ullasat","","","at","ullasat"
"33","varṇa","VARṆ","a","varṇa","noun-adj","","a","varṇa"
"34","rāji","RĀJ","i","rājan","noun-adj","","i","rāji"
"35","trayam","TRAY","am","tri","noun-adj","","am","trayam"
"36","komala","KOMAL","a","komala","noun-adj","","a","komala"
"37","śyāmala","ŚYĀMAL","a","śyāmala","noun-adj","","a","śyāmala"
"38","udāra","UDĀR","a","udāra","noun-adj","","a","udāra"
"39","pakṣa","PAKṢ","a","pakṣa","noun-adj","","a","pakṣa"
"40","dvayam","DVAY","am","dvaya","noun-adj","","am","dvayam"
"41","tuṇḍa","TUṆḌ","a","tuṇḍa","noun-adj","","a","tuṇḍa"
"42","śobhā","ŚOBH","ā","śobha","noun-adj","","āḥ","śobhāḥ"
"43","ati","","","ati","ind","","","ati"
"44","dūrībhavat","DŪRĪBHAV","at","dūrībhavat","","","at","dūrībhavat"
"45","kim","","","kim","pron","","","kim"
"46","pāṇi","PĀṆ","i","pāṇi","noun-adj","","i","pāṇi"
"47","padma","PADM","a","padma","noun-adj","","a","padma"
"48","dvayena","DVAY","ena","dvaya","noun-adj","","ena","dvayena"
"49","akṣamālām","AKṢAMĀL","ām","akṣamālā","","","ām","akṣamālām"
"50","api","","","api","ind","","","api"
"51","sphāṭikīm","SPHĀṬIK","īm","sphāṭika","","","īm","sphāṭikīm"
"52","jñāna","JÑĀN","a","jñāna","noun-adj","","a","jñāna"
"53","sāra","SĀR","a","sāra","noun-adj","","a","sāra"
"54","ātmakam","ĀTM","akam","ātmaka","noun-adj","","akam","ātmakam"
"55","pustakam","PUSTAK","am","pustaka","noun-adj","","am","pustakam"
"56","ca","","","ca","ind","","","ca"
"57","aṅkuśam","AṄKUŚ","am","aṅkuśa","noun-adj","","am","aṅkuśam"
"58","pāśam","PĀŚ","am","pāśa","noun-adj","","am","pāśam"
"59","ābibhratī","","","","","","",""
"60","yena","","","yad","pron","","","yad"
"61","saṃcintyase","SAṂCINTY","ase","saṃcint","verb","saṃcint","asi","saṃcintyasi"
"62","tasya","","","tad","pron","","","tad"
"63","vaktra","VAKTR","a","vaktra","noun-adj","","a","vaktra"
"64","antarāt","ANTAR","āt","antara","noun-adj","","āt","antarāt"
"65","gadyapa","GADY","apa","gadya","","","apa","gadyapa"
"66","yena","","","yad","pron","","","yad"
"67","vā","","","vā","ind","","","vā"
"68","y","","","","","","",""
"69","āvakābha","ĀVAK","ābha","āvaka","","","ābha","āvakābha"
"70","ākṛtiḥ","ĀKṚT","iḥ","ākṛti","noun-adj","","iḥ","ākṛtiḥ"
"71","bhāvyase","BHĀVY","ase","bhav","verb","bhū","asi","bhāvyasi"
"72","tasya","","","tad","pron","","","tad"
"73","vaśyāḥ","VAŚY","āḥ","vaśya","noun-adj","","āḥ","vaśyāḥ"
"74","bhavanti","BHAV","anti","bhav","verb","bhū","anti","bhavanti"
"75","striyaḥ","STR","iyaḥ","strī","noun-adj","","iyaḥ","striyaḥ"
"76","pūruṣāḥ","PŪRUṢ","āḥ","pūruṣa","noun-adj","","āḥ","pūruṣāḥ"
"77","/","","","","punct","","","/"
"78","yena","","","yad","pron","","","yad"
"79","vā","","","vā","ind","","","vā"
"80","śātakumbha","ŚĀTAKU","a","śātakumbha","noun-adj","","a","śātakua"
"81","dyutiḥ","DYUT","iḥ","dyuti","noun-adj","","iḥ","dyutiḥ"
"82","bhāvyase","BHĀVY","ase","bhav","verb","bhū","asi","bhāvyasi"
"83","saḥ","","","tad","pron","","","tad"
"84","api","","","api","ind","","","api"
"85","lakṣmī","LAKṢM","ī","lakṣmī","noun-adj","","ī","lakṣmī"
"86","sahasraiḥ","SAHASR","aiḥ","sahasra","noun-adj","","air","sahasrair"
"87","parikrīḍate","PARIKRĪḌ","ate","parikrīḍ","verb","parikrīḍ","ate","parikrīḍate"
"88","/","","","","punct","","","/"
"89","kim","","","kim","pron","","","kim"
"90","na","","","na","ind","","","na"
"91","siddhyet","SIDDHY","et","siddh","verb","","et","siddhyet"
"92","vapuḥ","VAP","uḥ","vapu","noun-adj","","uḥ","vapuḥ"
"93","śyāmalam","ŚYĀMAL","am","śyāmala","noun-adj","","am","śyāmalam"
"94","komalam","KOMAL","am","komala","noun-adj","","am","komalam"
"95","candracūḍa","CANDRACŪḌ","a","candracūḍa","","","a","candracūḍa"
"96","anvitam","ANVIT","am","anvita","noun-adj","","am","anvitam"
"97","tāvakam","TĀVAK","am","tāvaka","","","am","tāvakam"
"98","dhyāyataḥ","DHYĀY","ataḥ","dhyāya","","","ataḥ","dhyāyataḥ"
"99","/","","","","punct","","","/"
"100","tasya","","","tad","pron","","","tad"
"101","līlā","LĪL","ā","līlā","noun-adj","","ā","līlā"
"102","saraḥ","SAR","aḥ","sara","noun-adj","","aḥ","saraḥ"
"103","vāridhiḥ","VĀRIDH","iḥ","vāridhi","","","iḥ","vāridhiḥ"
"104","tasya","","","tad","pron","","","tad"
"105","kelī","KEL","ī","kelī","noun-adj","","ī","kelī"
"106","vanam","VAN","am","vana","noun-adj","","am","vanam"
"107","candanam","CANDAN","am","candana","noun-adj","","am","candanam"
"108","tasya","","","tad","pron","","","tad"
"109","bhadrāsanam","BHADRĀSAN","am","bhadrāsana","noun-adj","","am","bhadrāsanam"
"110","bhū","BH","ū","bhū","noun-adj","","ū","bhū"
"111","talam","TAL","am","tala","noun-adj","","am","talam"
"112","tasya","","","tad","pron","","","tad"
"113","gīḥ","","","","ind","","",""
"114","devatā","DEVAT","ā","devatā","noun-adj","","ā","devatā"
"115","kiṃkarī","KIṂKAR","ī","kiṃkarī","noun-adj","","ī","kiṃkarī"
"116","tasya","","","tad","pron","","","tad"
"117","ca","","","ca","ind","","","ca"
"118","ājñākarī","ĀJÑĀKAR","ī","ājñākarī","","","ī","ājñākarī"
"119","śrīḥ","ŚR","īḥ","śrī","noun-adj","","īḥ","śrīḥ"
"120","svayam","SVAY","am","svayam","noun-adj","","am","svayam"
"121","/","","","","punct","","","/"
"122","sarva","SARV","a","sarva","noun-adj","","a","sarva"
"123","tīrtha","TĪRTH","a","tīrtha","noun-adj","","a","tīrtha"
"124","ātmike","ĀTM","ike","ātmika","","","ike","ātmike"
"125","sarva","SARV","a","sarva","noun-adj","","a","sarva"
"126","mantra","MANTR","a","mantra","noun-adj","","a","mantra"
"127","ātmike","ĀTM","ike","ātmika","","","ike","ātmike"
"128","sarva","SARV","a","sarva","noun-adj","","a","sarva"
"129","tantra","TANTR","a","tantra","noun-adj","","a","tantra"
"130","ātmike","ĀTM","ike","ātmika","","","ike","ātmike"
"131","sarva","SARV","a","sarva","noun-adj","","a","sarva"
"132","yantra","YANTR","a","yantra","noun-adj","","a","yantra"
"133","ātmike","ĀTM","ike","ātmika","","","ike","ātmike"
"134","sarva","SARV","a","sarva","noun-adj","","a","sarva"
"135","śakti","ŚAKT","i","śakti","noun-adj","","i","śakti"
"136","ātmike","ĀTM","ike","ātmika","","","ike","ātmike"
"137","sarva","SARV","a","sarva","noun-adj","","a","sarva"
"138","pīṭha","PĪṬH","a","pīṭha","noun-adj","","a","pīṭha"
"139","ātmike","ĀTM","ike","ātmika","","","ike","ātmike"
"140","sarva","SARV","a","sarva","noun-adj","","a","sarva"
"141","tattva","TATTV","a","tattva","noun-adj","","a","tattva"
"142","ātmike","ĀTM","ike","ātmika","","","ike","ātmike"
"143","sarva","SARV","a","sarva","noun-adj","","a","sarva"
"144","vidyāt","VIDY","āt","vidya","noun-adj","","āt","vidyāt"
"145","mātā","MĀT","ā","mātṛ","noun-adj","","ā","mātā"
"146","marakata","MARAKAT","a","marakata","noun-adj","","a","marakata"
"147","śyāmā","ŚYĀM","ā","śyāma","noun-adj","","āḥ","śyāmāḥ"
"148","mātaṅgī","MĀTAṂG","ī","mātaṃgī","noun-adj","","ī","mātaṃgī"
"149","mada","","","mada","ind","","","mada"
"150","śālinī","ŚĀLIN","ī","śālin","noun-adj","","ī","śālinī"
"151","/","","","","punct","","","/"
"152","kaṭākṣayatu","KAṬĀKṢAY","atu","kaṭākṣ","verb","","ati","kaṭākṣayati"
"153","kalyāṇī","KALYĀṆ","ī","kalyāṇī","noun-adj","","ī","kalyāṇī"
"154","kadamba","KADAMBA","","kadamba","noun-adj","","","kadamba"
"155","vana","VAN","a","vana","noun-adj","","a","vana"
"156","vāsinī","VĀSIN","ī","vāsinī","noun-adj","","ī","vāsinī"
"157","//","","","","punct","","","//"
"","</s>","","","","","","",""
"","<s number = ""10"">","","","","","","",""
"1","iti","","","iti","ind","","","iti"
"2","mahā","MAH","ā","mahat","noun-adj","","ā","mahā"
"3","kavi","KAV","i","kavi","noun-adj","","i","kavi"
"4","śrī","ŚRĪ","","śrī","noun-adj","","","śrī"
"5","kāli","KĀL","i","kāli","noun-adj","","i","kāli"
"6","dāsa","DĀS","a","dāsa","noun-adj","","a","dāsa"
"7","kṛtam","KṚT","am","kṛta","noun-adj","","am","kṛtam"
"8","śyāmalā","ŚYĀMAL","ā","śyāmalā","","","ā","śyāmalā"
"9","daṇḍakam","DAṆḌAK","am","daṇḍaka","","","am","daṇḍakam"
"10","samāptam","SAMĀPT","am","samāpta","noun-adj","","am","samāptam"
"11","/","","","","punct","","","/"
