"WordID","word","NormSTEM","suffix","lemma","PoS","Root","NormSuffix","NormWord"
1,"sūta","_","_","sūta","NC","","_","_"
2,"uvāca","_","_","vak","V","vac","_","_"
1,"tato","_","_","tatas","CX","","_","_"
2,"rajanyāṃ","_","_","rajanī","NC","","_","_"
3,"vyuṣṭāyāṃ","_","_","vivas","PPP","","_","_"
4,"prabhāta","_","_","prabhāta","NC","","_","_"
5,"udite","_","_","udi","PPP","","_","_"
6,"ravau","_","_","ravi","NC","","_","_"
1,"_","_","_","kadru","NC","","_","_"
2,"_","_","_","ca","CCD","","_","_"
3,"vinatā","_","_","vinatā","NC","","_","_"
4,"_","_","_","ca","CCD","","_","_"
5,"_","_","_","eva","CEM","","_","_"
6,"bhaginyau","_","_","bhaginī","NC","","_","_"
7,"te","_","_","tad","PRD","","_","_"
8,"tapodhana","_","_","tapodhana","JJ","","_","_"
1,"amarṣite","_","_","amarṣita","JJ","","_","_"
2,"_","_","_","su","CAD","","_","_"
3,"_","_","_","saṃrabh","PPP","","_","_"
4,"dāsye","_","_","dāsya","NC","","_","_"
5,"_","_","_","kṛ","PPP","","_","_"
6,"_","_","_","paṇa","NC","","_","_"
7,"tadā","_","_","tadā","CAD","","_","_"
1,"sāgarasya","_","_","sāgara","NC","","_","_"
2,"paraṃ","_","_","para","PPX","","_","_"
3,"pāraṃ","_","_","pāra","NC","","_","_"
4,"_","_","_","velā","NC","","_","_"
5,"_","_","_","vana","NC","","_","_"
6,"_","_","_","vibhūṣay","PPP","","_","_"
1,"_","_","_","ga","V","ga","_","_"
2,"_","_","_","turaga","NC","","_","_"
3,"draṣṭum","_","_","dṛś","CGDI","","_","_"
4,"uccaiḥśravasam","_","_","uccaiḥśravas","NC","","_","_"
5,"antikāt","_","_","antika","NC","","_","_"
1,"dadṛśāte","_","_","darś","V","dṛś","_","_"
2,"tadā","_","_","tadā","CAD","","_","_"
3,"tatra","_","_","tatra","CAD","","_","_"
4,"samudraṃ","_","_","samudra","NC","","_","_"
5,"nidhim","_","_","nidhi","NC","","_","_"
6,"ambhasām","_","_","ambhas","NC","","_","_"
1,"mahāntam","_","_","mahat","JJ","","_","_"
2,"_","_","_","udaka","NC","","_","_"
3,"_","_","_","agādha","JJ","","_","_"
4,"kṣobhyamāṇaṃ","_","_","kṣobhay","KDP","","_","_"
5,"_","_","_","mahat","JJ","","_","_"
6,"_","_","_","svana","NC","","_","_"
1,"_","_","_","timiṅgila","NC","","_","_"
2,"_","_","_","jhaṣa","NC","","_","_"
3,"_","_","_","ākṛ","PPP","","_","_"
4,"makarair","_","_","makara","NC","","_","_"
5,"āvṛtaṃ","_","_","āvṛ","PPP","","_","_"
6,"tathā","_","_","tathā","CX","","_","_"
1,"_","_","_","sattva","NC","","_","_"
2,"_","_","_","ca","CCD","","_","_"
3,"_","_","_","bahu","JJ","","_","_"
4,"_","_","_","sāhasra","JJ","","_","_"
5,"_","_","_","nānā","CX","","_","_"
6,"_","_","_","rūpa","NC","","_","_"
7,"samāvṛtam","_","_","samāvṛ","PPP","","_","_"
1,"bhīṣaṇair","_","_","bhīṣaṇa","JJ","","_","_"
2,"vikṛtair","_","_","vikṛ","PPP","","_","_"
3,"anyair","_","_","anya","PPX","","_","_"
4,"ghorair","_","_","ghora","JJ","","_","_"
5,"_","_","_","jalacara","NC","","_","_"
6,"_","_","_","tathā","CX","","_","_"
1,"ugrair","_","_","ugra","JJ","","_","_"
2,"nityam","_","_","nitya","CX","","_","_"
3,"anādhṛṣyaṃ","_","_","anādhṛṣya","JJ","","_","_"
4,"_","_","_","kūrma","NC","","_","_"
5,"_","_","_","grāha","NC","","_","_"
6,"_","_","_","samākula","JJ","","_","_"
1,"ākaraṃ","_","_","ākara","NC","","_","_"
2,"_","_","_","sarva","JQ","","_","_"
3,"_","_","_","ratna","NC","","_","_"
4,"ālayaṃ","_","_","ālaya","NC","","_","_"
5,"varuṇasya","_","_","varuṇa","NC","","_","_"
6,"ca","_","_","ca","CCD","","_","_"
1,"nāgānām","_","_","nāga","NC","","_","_"
2,"ālayaṃ","_","_","ālaya","NC","","_","_"
3,"ramyam","_","_","ramya","JJ","","_","_"
4,"uttamaṃ","_","_","uttama","JJ","","_","_"
5,"saritāṃ","_","_","sarit","NC","","_","_"
6,"patim","_","_","pati","NC","","_","_"
1,"_","_","_","pātāla","NC","","_","_"
2,"_","_","_","jvalana","NC","","_","_"
3,"_","_","_","āvāsa","NC","","_","_"
4,"asurāṇāṃ","_","_","asura","NC","","_","_"
5,"ca","_","_","ca","CCD","","_","_"
6,"bandhanam","_","_","bandhana","NC","","_","_"
1,"bhayaṃkaraṃ","_","_","bhayaṃkara","JJ","","_","_"
2,"ca","_","_","ca","CCD","","_","_"
3,"sattvānāṃ","_","_","sattva","NC","","_","_"
4,"payasāṃ","_","_","payas","NC","","_","_"
5,"nidhim","_","_","nidhi","NC","","_","_"
6,"arṇavam","_","_","arṇava","NC","","_","_"
1,"śubhaṃ","_","_","śubha","JJ","","_","_"
2,"divyam","_","_","divya","JJ","","_","_"
3,"amartyānām","_","_","amartya","NC","","_","_"
4,"_","_","_","amṛta","NC","","_","_"
5,"_","_","_","ākara","NC","","_","_"
6,"param","_","_","para","PPX","","_","_"
1,"aprameyam","_","_","aprameya","JJ","","_","_"
2,"acintyaṃ","_","_","acintya","JJ","","_","_"
3,"ca","_","_","ca","CCD","","_","_"
4,"_","_","_","su","CAD","","_","_"
5,"_","_","_","puṇya","JJ","","_","_"
6,"_","_","_","jala","NC","","_","_"
7,"adbhutam","_","_","adbhuta","JJ","","_","_"
1,"ghoraṃ","_","_","ghora","JJ","","_","_"
2,"_","_","_","jalacara","NC","","_","_"
3,"_","_","_","ārāva","NC","","_","_"
4,"_","_","_","raudra","JJ","","_","_"
5,"_","_","_","bhairava","JJ","","_","_"
6,"_","_","_","nisvana","NC","","_","_"
1,"_","_","_","gambhīra","JJ","","_","_"
2,"_","_","_","āvarta","NC","","_","_"
3,"_","_","_","kalila","JJ","","_","_"
4,"_","_","_","sarva","JQ","","_","_"
5,"_","_","_","bhūta","NC","","_","_"
6,"_","_","_","bhayaṃkara","JJ","","_","_"
1,"_","_","_","velā","NC","","_","_"
2,"_","_","_","dolā","NC","","_","_"
3,"_","_","_","anila","NC","","_","_"
4,"_","_","_","cala","JJ","","_","_"
5,"_","_","_","kṣobha","NC","","_","_"
6,"_","_","_","udvega","NC","","_","_"
7,"_","_","_","samutthā","PPP","","_","_"
1,"_","_","_","vīci","NC","","_","_"
2,"_","_","_","hasta","NC","","_","_"
3,"pracalitair","_","_","pracal","PPP","","_","_"
4,"nṛtyantam","_","_","nṛt","KDP","","_","_"
5,"iva","_","_","iva","CCM","","_","_"
6,"sarvaśaḥ","_","_","sarvaśas","CX","","_","_"
1,"_","_","_","candra","NC","","_","_"
2,"_","_","_","vṛddhi","NC","","_","_"
3,"_","_","_","kṣaya","NC","","_","_"
4,"_","_","_","vaśa","NC","","_","_"
5,"_","_","_","udvṛt","PPP","","_","_"
6,"_","_","_","ūrmi","NC","","_","_"
7,"_","_","_","durāsada","JJ","","_","_"
1,"pāñcajanyasya","_","_","pāñcajanya","NC","","_","_"
2,"jananaṃ","_","_","janana","JJ","","_","_"
3,"_","_","_","ratna","NC","","_","_"
4,"_","_","_","ākara","NC","","_","_"
5,"anuttamam","_","_","anuttama","JJ","","_","_"
1,"gāṃ","_","_","go","NC","","_","_"
2,"vindatā","_","_","vid","KDP","","_","_"
3,"bhagavatā","_","_","bhagavat","NC","","_","_"
4,"_","_","_","govinda","NC","","_","_"
5,"_","_","_","amita","JJ","","_","_"
6,"_","_","_","ojas","NC","","_","_"
1,"_","_","_","varāha","NC","","_","_"
2,"_","_","_","rūpin","JJ","","_","_"
3,"_","_","_","ca","CCD","","_","_"
4,"_","_","_","antar","CAD","","_","_"
5,"_","_","_","vikṣobhay","PPP","","_","_"
6,"_","_","_","jala","NC","","_","_"
7,"_","_","_","āvila","JJ","","_","_"
1,"brahmarṣiṇā","_","_","brahmarṣi","NC","","_","_"
2,"ca","_","_","ca","CCD","","_","_"
3,"tapatā","_","_","tap","KDP","","_","_"
4,"varṣāṇāṃ","_","_","varṣa","NC","","_","_"
5,"śatam","_","_","śata","NUM","","_","_"
6,"atriṇā","_","_","atri","NC","","_","_"
1,"_","_","_","an","CX","","_","_"
2,"_","_","_","āsāday","PPP","","_","_"
3,"_","_","_","gādha","NC","","_","_"
4,"ca","_","_","ca","CCD","","_","_"
5,"_","_","_","pātāla","NC","","_","_"
6,"_","_","_","tala","NC","","_","_"
7,"avyayam","_","_","avyaya","JJ","","_","_"
1,"_","_","_","adhyātma","NC","","_","_"
2,"_","_","_","yoga","NC","","_","_"
3,"_","_","_","nidrā","NC","","_","_"
4,"ca","_","_","ca","CCD","","_","_"
5,"padmanābhasya","_","_","padmanābha","NC","","_","_"
6,"sevataḥ","_","_","sev","KDP","","_","_"
1,"_","_","_","yuga","NC","","_","_"
2,"_","_","_","ādi","NC","","_","_"
3,"_","_","_","kāla","NC","","_","_"
4,"_","_","_","śayana","NC","","_","_"
5,"viṣṇor","_","_","viṣṇu","NC","","_","_"
6,"_","_","_","amita","JJ","","_","_"
7,"_","_","_","tejas","NC","","_","_"
1,"_","_","_","vajra","NC","","_","_"
2,"_","_","_","pātana","NC","","_","_"
3,"_","_","_","saṃtras","PPP","","_","_"
4,"_","_","_","maināka","NC","","_","_"
5,"_","_","_","abhaya","NC","","_","_"
6,"_","_","_","prada","JJ","","_","_"
1,"_","_","_","ḍimba","NC","","_","_"
2,"_","_","_","āhava","NC","","_","_"
3,"_","_","_","arday","PPP","","_","_"
4,"ca","_","_","ca","CCD","","_","_"
5,"asurāṇāṃ","_","_","asura","NC","","_","_"
6,"parāyaṇam","_","_","parāyaṇa","NC","","_","_"
1,"_","_","_","vaḍavāmukha","NC","","_","_"
2,"_","_","_","dīp","PPP","","_","_"
3,"_","_","_","agni","NC","","_","_"
4,"_","_","_","toya","NC","","_","_"
5,"_","_","_","havya","NC","","_","_"
6,"_","_","_","prada","JJ","","_","_"
7,"śubham","_","_","śubha","JJ","","_","_"
1,"_","_","_","agādha","JJ","","_","_"
2,"_","_","_","pāra","NC","","_","_"
3,"vistīrṇam","_","_","vistṛ","PPP","","_","_"
4,"aprameyaṃ","_","_","aprameya","JJ","","_","_"
5,"saritpatim","_","_","saritpati","NC","","_","_"
1,"_","_","_","mahat","JJ","","_","_"
2,"_","_","_","nadī","NC","","_","_"
3,"bahvībhiḥ","_","_","bahu","JJ","","_","_"
4,"_","_","_","spardhā","NC","","_","_"
5,"_","_","_","iva","CCM","","_","_"
6,"sahasraśaḥ","_","_","sahasraśas","CX","","_","_"
1,"abhisāryamāṇam","_","_","abhisāray","KDP","","_","_"
2,"aniśaṃ","_","_","aniśa","CX","","_","_"
3,"dadṛśāte","_","_","darś","V","dṛś","_","_"
4,"mahārṇavam","_","_","mahārṇava","NC","","_","_"
1,"āpūryamāṇam","_","_","āp￞","KDP","","_","_"
2,"atyarthaṃ","_","_","atyartha","CX","","_","_"
3,"nṛtyamānam","_","_","nṛt","KDP","","_","_"
4,"_","_","_","iva","CCM","","_","_"
5,"_","_","_","ūrmi","NC","","_","_"
1,"gambhīraṃ","_","_","gambhīra","JJ","","_","_"
2,"_","_","_","timi","NC","","_","_"
3,"_","_","_","makara","NC","","_","_"
4,"_","_","_","ugra","JJ","","_","_"
5,"_","_","_","saṃkula","JJ","","_","_"
6,"taṃ","_","_","tad","PRD","","_","_"
7,"garjantaṃ","_","_","garj","KDP","","_","_"
8,"_","_","_","jalacara","NC","","_","_"
9,"_","_","_","rāva","NC","","_","_"
10,"_","_","_","raudra","JJ","","_","_"
11,"_","_","_","nāda","NC","","_","_"
1,"vistīrṇaṃ","_","_","vistṛ","PPP","","_","_"
2,"dadṛśatur","_","_","darś","V","dṛś","_","_"
3,"_","_","_","ambara","NC","","_","_"
4,"_","_","_","prakāśa","NC","","_","_"
5,"te","_","_","tad","PRD","","_","_"
6,"'gādhaṃ","_","_","agādha","JJ","","_","_"
7,"nidhim","_","_","nidhi","NC","","_","_"
8,"urum","_","_","uru","JJ","","_","_"
9,"ambhasām","_","_","ambhas","NC","","_","_"
10,"anantam","_","_","ananta","JJ","","_","_"
1,"_","_","_","iti","CQT","","_","_"
2,"_","_","_","eva","CX","","_","_"
3,"_","_","_","jhaṣa","NC","","_","_"
4,"_","_","_","makara","NC","","_","_"
5,"_","_","_","ūrmi","NC","","_","_"
6,"_","_","_","saṃkula","JJ","","_","_"
7,"taṃ","_","_","tad","PRD","","_","_"
8,"gambhīraṃ","_","_","gambhīra","JJ","","_","_"
9,"vikasitam","_","_","vikas","PPP","","_","_"
10,"_","_","_","ambara","NC","","_","_"
11,"_","_","_","prakāśa","NC","","_","_"
1,"_","_","_","pātāla","NC","","_","_"
2,"_","_","_","jvalana","NC","","_","_"
3,"_","_","_","śikhā","NC","","_","_"
4,"_","_","_","vidīpay","PPP","","_","_"
5,"taṃ","_","_","tad","PRD","","_","_"
6,"paśyantyau","_","_","dṛś","KDP","","_","_"
7,"drutam","_","_","druta","CX","","_","_"
8,"_","_","_","abhipat","V","abhipat","_","_"
9,"_","_","_","tadānīm","CX","","_","_"
1,"sautir","_","_","sauti","NC","","_","_"
2,"uvāca","_","_","vak","V","vac","_","_"
1,"_","_","_","tatas","CX","","_","_"
2,"_","_","_","tad","PRD","","_","_"
3,"paṇitaṃ","_","_","paṇita","NC","","_","_"
4,"kṛtvā","_","_","kṛ","CGDA","","_","_"
5,"bhaginyau","_","_","bhaginī","NC","","_","_"
6,"dvijasattama","_","_","dvijasattama","NC","","_","_"
1,"jagmatuḥ","_","_","ga","V","ga","_","_"
2,"_","_","_","parama","JJ","","_","_"
3,"_","_","_","prī","PPP","","_","_"
4,"paraṃ","_","_","para","PPX","","_","_"
5,"pāraṃ","_","_","pāra","NC","","_","_"
6,"mahodadheḥ","_","_","mahodadhi","NC","","_","_"
1,"_","_","_","kadru","NC","","_","_"
2,"_","_","_","ca","CCD","","_","_"
3,"vinatā","_","_","vinatā","NC","","_","_"
4,"_","_","_","ca","CCD","","_","_"
5,"_","_","_","eva","CEM","","_","_"
6,"dākṣāyaṇyau","_","_","dākṣāyaṇī","NC","","_","_"
7,"vihāyasā","_","_","vihāyas","NC","","_","_"
1,"_","_","_","ālokay","KDP","","_","_"
2,"_","_","_","akṣobhya","JJ","","_","_"
3,"samudraṃ","_","_","samudra","NC","","_","_"
4,"nidhim","_","_","nidhi","NC","","_","_"
5,"ambhasām","_","_","ambhas","NC","","_","_"
1,"_","_","_","vāyu","NC","","_","_"
2,"_","_","_","atīva","CX","","_","_"
3,"mahatā","_","_","mahat","JJ","","_","_"
4,"kṣobhyamāṇaṃ","_","_","kṣobhay","KDP","","_","_"
5,"_","_","_","mahat","JJ","","_","_"
6,"_","_","_","svana","NC","","_","_"
1,"_","_","_","timiṅgila","NC","","_","_"
2,"_","_","_","samākṛ","PPP","","_","_"
3,"makarair","_","_","makara","NC","","_","_"
4,"āvṛtaṃ","_","_","āvṛ","PPP","","_","_"
5,"tathā","_","_","tathā","CX","","_","_"
1,"saṃyutaṃ","_","_","saṃyuta","JJ","","_","_"
2,"_","_","_","bahu","JJ","","_","_"
3,"_","_","_","sāhasra","JJ","","_","_"
4,"sattvair","_","_","sattva","NC","","_","_"
5,"nānāvidhair","_","_","nānāvidha","JJ","","_","_"
6,"api","_","_","api","CX","","_","_"
1,"ghorair","_","_","ghora","JJ","","_","_"
2,"ghoram","_","_","ghora","JJ","","_","_"
3,"anādhṛṣyaṃ","_","_","anādhṛṣya","JJ","","_","_"
4,"gambhīram","_","_","gambhīra","JJ","","_","_"
5,"_","_","_","ati","CADP","","_","_"
6,"_","_","_","bhairava","JJ","","_","_"
1,"ākaraṃ","_","_","ākara","NC","","_","_"
2,"_","_","_","sarva","JQ","","_","_"
3,"_","_","_","ratna","NC","","_","_"
4,"ālayaṃ","_","_","ālaya","NC","","_","_"
5,"varuṇasya","_","_","varuṇa","NC","","_","_"
6,"ca","_","_","ca","CCD","","_","_"
1,"nāgānām","_","_","nāga","NC","","_","_"
2,"ālayaṃ","_","_","ālaya","NC","","_","_"
3,"_","_","_","ca","CCD","","_","_"
4,"_","_","_","api","CX","","_","_"
5,"_","_","_","su","CAD","","_","_"
6,"_","_","_","ramya","JJ","","_","_"
7,"saritāṃ","_","_","sarit","NC","","_","_"
8,"patim","_","_","pati","NC","","_","_"
1,"_","_","_","pātāla","NC","","_","_"
2,"_","_","_","jvalana","NC","","_","_"
3,"_","_","_","āvāsa","NC","","_","_"
4,"asurāṇāṃ","_","_","asura","NC","","_","_"
5,"_","_","_","tathā","CX","","_","_"
6,"_","_","_","ālaya","NC","","_","_"
1,"bhayaṃkarāṇāṃ","_","_","bhayaṃkara","JJ","","_","_"
2,"sattvānāṃ","_","_","sattva","NC","","_","_"
3,"payaso","_","_","payas","NC","","_","_"
4,"nidhim","_","_","nidhi","NC","","_","_"
5,"avyayam","_","_","avyaya","JJ","","_","_"
1,"śubhaṃ","_","_","śubha","JJ","","_","_"
2,"divyam","_","_","divya","JJ","","_","_"
3,"amartyānām","_","_","amartya","NC","","_","_"
4,"_","_","_","amṛta","NC","","_","_"
5,"_","_","_","ākara","NC","","_","_"
6,"param","_","_","para","PPX","","_","_"
1,"aprameyam","_","_","aprameya","JJ","","_","_"
2,"acintyaṃ","_","_","acintya","JJ","","_","_"
3,"ca","_","_","ca","CCD","","_","_"
4,"_","_","_","su","CAD","","_","_"
5,"_","_","_","puṇya","JJ","","_","_"
6,"_","_","_","jala","NC","","_","_"
7,"_","_","_","saṃmā","PPP","","_","_"
1,"_","_","_","mahat","JJ","","_","_"
2,"_","_","_","nadī","NC","","_","_"
3,"bahvībhis","_","_","bahu","JJ","","_","_"
4,"tatra","_","_","tatra","CAD","","_","_"
5,"tatra","_","_","tatra","CAD","","_","_"
6,"sahasraśaḥ","_","_","sahasraśas","CX","","_","_"
1,"āpūryamāṇam","_","_","āp￞","KDP","","_","_"
2,"atyarthaṃ","_","_","atyartha","CX","","_","_"
3,"nṛtyantam","_","_","nṛt","KDP","","_","_"
4,"iva","_","_","iva","CCM","","_","_"
5,"_","_","_","ca","CCD","","_","_"
6,"_","_","_","ūrmi","NC","","_","_"
