"WordID","word","NormSTEM","suffix","lemma","PoS","Root","NormSuffix","NormWord"
1,"saṃjaya","_","_","saṃjaya","NC","","_","_"
2,"uvāca","_","_","vak","V","vac","_","_"
1,"duḥśāsane","_","_","duḥśāsana","NC","","_","_"
2,"tu","_","_","tu","CCD","","_","_"
3,"nihate","_","_","nihan","PPP","","_","_"
4,"putrās","_","_","putra","NC","","_","_"
5,"tava","_","_","tvat","PPR","","_","_"
6,"_","_","_","mahat","JJ","","_","_"
7,"_","_","_","ratha","NC","","_","_"
1,"_","_","_","mahat","JJ","","_","_"
2,"_","_","_","krodha","NC","","_","_"
3,"_","_","_","viṣa","NC","","_","_"
4,"vīrāḥ","_","_","vīra","NC","","_","_"
5,"samareṣv","_","_","samara","NC","","_","_"
6,"a","_","_","alpha_privativum","JJ","","_","_"
6,"apalāyinaḥ","_","_","palāyin","JJ","","_","_"
1,"daśa","_","_","daśan","NUM","","_","_"
2,"rājan","_","_","rājan","NC","","_","_"
3,"_","_","_","mahat","JJ","","_","_"
4,"_","_","_","vīrya","NC","","_","_"
5,"bhīmaṃ","_","_","bhīma","NC","","_","_"
6,"prācchādayañ","_","_","pracchāday","V","pracchāday","_","_"
7,"śaraiḥ","_","_","śara","NC","","_","_"
1,"kavacī","_","_","kavacin","NC","","_","_"
2,"niṣaṅgī","_","_","niṣaṅgin","NC","","_","_"
3,"pāśī","_","_","pāśin","NC","","_","_"
4,"daṇḍadhāro","_","_","daṇḍadhāra","NC","","_","_"
5,"dhanurdharaḥ","_","_","dhanurdhara","NC","","_","_"
1,"alolupaḥ","_","_","alolupa","NC","","_","_"
2,"śalaḥ","_","_","śala","NC","","_","_"
3,"saṃdho","_","_","saṃdha","NC","","_","_"
4,"_","_","_","vātavega","NC","","_","_"
5,"_","_","_","suvarcas","NC","","_","_"
1,"ete","_","_","tad","PRD","","_","_"
2,"sametya","_","_","same","CGDA","","_","_"
3,"sahitā","_","_","sahita","JJ","","_","_"
4,"_","_","_","bhrātṛ","NC","","_","_"
5,"_","_","_","vyasana","NC","","_","_"
6,"_","_","_","karśay","PPP","","_","_"
1,"bhīmasenaṃ","_","_","bhīmasa","NC","","_","_"
2,"_","_","_","mahat","JJ","","_","_"
3,"_","_","_","bāhu","NC","","_","_"
4,"mārgaṇaiḥ","_","_","mārgaṇa","NC","","_","_"
5,"samavārayan","_","_","saṃvāray","V","saṃvāray","_","_"
1,"sa","_","_","tad","PRD","","_","_"
2,"vāryamāṇo","_","_","vāray","KDP","","_","_"
3,"viśikhaiḥ","_","_","viśikha","NC","","_","_"
4,"samantāt","_","_","samantāt","CX","","_","_"
5,"tair","_","_","tad","PRD","","_","_"
6,"_","_","_","mahat","JJ","","_","_"
7,"_","_","_","ratha","NC","","_","_"
1,"bhīmaḥ","_","_","bhīma","NC","","_","_"
2,"_","_","_","krodha","NC","","_","_"
3,"_","_","_","abhirañj","PPP","","_","_"
4,"_","_","_","akṣa","NC","","_","_"
5,"kruddhaḥ","_","_","krudh","PPP","","_","_"
6,"kāla","_","_","kāla","NC","","_","_"
7,"_","_","_","iva","CCM","","_","_"
8,"_","_","_","ābhā","V","ābhā","_","_"
1,"tāṃs","_","_","tad","PRD","","_","_"
2,"tu","_","_","tu","CCD","","_","_"
3,"bhallair","_","_","bhalla","NC","","_","_"
4,"_","_","_","mahat","JJ","","_","_"
5,"_","_","_","vega","NC","","_","_"
6,"daśabhir","_","_","daśan","NUM","","_","_"
7,"daśabhiḥ","_","_","daśan","NUM","","_","_"
8,"śitaiḥ","_","_","śā","PPP","","_","_"
1,"_","_","_","rukma","NC","","_","_"
2,"_","_","_","aṅgada","NC","","_","_"
3,"_","_","_","rukma","NC","","_","_"
4,"_","_","_","puṅkha","NC","","_","_"
5,"pārtho","_","_","pārtha","NC","","_","_"
6,"ninye","_","_","nay","V","nī","_","_"
7,"_","_","_","yama","NC","","_","_"
8,"_","_","_","kṣaya","NC","","_","_"
1,"hateṣu","_","_","han","PPP","","_","_"
2,"teṣu","_","_","tad","PRD","","_","_"
3,"vīreṣu","_","_","vīra","NC","","_","_"
4,"pradudrāva","_","_","pradru","V","pradru","_","_"
5,"balaṃ","_","_","bala","NC","","_","_"
6,"tava","_","_","tvat","PPR","","_","_"
1,"paśyataḥ","_","_","dṛś","KDP","","_","_"
2,"sūtaputrasya","_","_","sūtaputra","NC","","_","_"
3,"pāṇḍavasya","_","_","pāṇḍava","NC","","_","_"
4,"_","_","_","bhaya","NC","","_","_"
5,"_","_","_","arday","PPP","","_","_"
1,"tataḥ","_","_","tatas","CX","","_","_"
2,"karṇo","_","_","karṇa","NC","","_","_"
3,"_","_","_","mahat","JJ","","_","_"
4,"_","_","_","rāja","NC","","_","_"
5,"praviveśa","_","_","praviś","V","praviś","_","_"
6,"_","_","_","mahat","JJ","","_","_"
7,"_","_","_","raṇa","NC","","_","_"
1,"dṛṣṭvā","_","_","dṛś","CGDA","","_","_"
2,"bhīmasya","_","_","bhīma","NC","","_","_"
3,"vikrāntam","_","_","vikrānta","NC","","_","_"
4,"antakasya","_","_","antaka","NC","","_","_"
5,"prajāsv","_","_","prajā","NC","","_","_"
6,"iva","_","_","iva","CCM","","_","_"
1,"tasya","_","_","tad","PRD","","_","_"
2,"tv","_","_","tu","CCD","","_","_"
3,"_","_","_","ākāra","NC","","_","_"
4,"_","_","_","bhāva","NC","","_","_"
5,"_","_","_","jña","JJ","","_","_"
6,"śalyaḥ","_","_","śalya","NC","","_","_"
7,"_","_","_","samiti","NC","","_","_"
8,"_","_","_","śobhana","JJ","","_","_"
1,"uvāca","_","_","vak","V","vac","_","_"
2,"vacanaṃ","_","_","vacana","NC","","_","_"
3,"karṇaṃ","_","_","karṇa","NC","","_","_"
4,"_","_","_","prāp","PPP","","_","_"
5,"_","_","_","kāla","NC","","_","_"
6,"ariṃdama","_","_","ariṃdama","JJ","","_","_"
1,"mā","_","_","mā","CNG","","_","_"
2,"vyathāṃ","_","_","vyathā","NC","","_","_"
3,"kuru","_","_","kar","V","kṛ","_","_"
4,"rādheya","_","_","rādheya","NC","","_","_"
5,"_","_","_","na","CNG","","_","_"
6,"_","_","_","tad","PRD","","_","_"
7,"tvayy","_","_","tvat","PPR","","_","_"
8,"upapadyate","_","_","upapad","V","upapad","_","_"
1,"ete","_","_","tad","PRD","","_","_"
2,"dravanti","_","_","dru","V","dru","_","_"
3,"rājāno","_","_","rājan","NC","","_","_"
4,"_","_","_","bhīmasa","NC","","_","_"
5,"_","_","_","bhaya","NC","","_","_"
6,"_","_","_","arday","PPP","","_","_"
1,"duryodhanaś","_","_","duryodhana","NC","","_","_"
2,"ca","_","_","ca","CCD","","_","_"
3,"saṃmūḍho","_","_","sammuh","PPP","","_","_"
4,"_","_","_","bhrātṛ","NC","","_","_"
5,"_","_","_","vyasana","NC","","_","_"
6,"_","_","_","duḥkhita","JJ","","_","_"
1,"duḥśāsanasya","_","_","duḥśāsana","NC","","_","_"
2,"rudhire","_","_","rudhira","NC","","_","_"
3,"pīyamāne","_","_","pā","KDP","","_","_"
4,"mahātmanā","_","_","mahātman","JJ","","_","_"
1,"_","_","_","vyāpad","PPP","","_","_"
2,"_","_","_","cetas","NC","","_","_"
3,"_","_","_","ca","CCD","","_","_"
4,"_","_","_","eva","CEM","","_","_"
5,"_","_","_","śoka","NC","","_","_"
6,"_","_","_","upahan","PPP","","_","_"
7,"_","_","_","manyu","NC","","_","_"
1,"duryodhanam","_","_","duryodhana","NC","","_","_"
2,"upāsante","_","_","upās","V","upās","_","_"
3,"parivārya","_","_","parivāray","CGDA","","_","_"
4,"samantataḥ","_","_","samantataḥ","CX","","_","_"
1,"_","_","_","kṛpa","NC","","_","_"
2,"_","_","_","prabhṛti","NC","","_","_"
3,"karṇa","_","_","karṇa","NC","","_","_"
4,"_","_","_","han","PPP","","_","_"
5,"_","_","_","śeṣa","NC","","_","_"
6,"ca","_","_","ca","CCD","","_","_"
7,"sodarāḥ","_","_","sodara","NC","","_","_"
1,"pāṇḍavā","_","_","pāṇḍava","NC","","_","_"
2,"labdhalakṣāś","_","_","labdhalakṣa","JJ","","_","_"
3,"ca","_","_","ca","CCD","","_","_"
4,"_","_","_","dhanaṃjaya","NC","","_","_"
5,"_","_","_","purogama","JJ","","_","_"
1,"tvām","_","_","tvat","PPR","","_","_"
2,"_","_","_","eva","CEM","","_","_"
3,"_","_","_","abhimukha","JJ","","_","_"
4,"śūrā","_","_","śūra","NC","","_","_"
5,"yuddhāya","_","_","yuddha","NC","","_","_"
6,"samupāsthitāḥ","_","_","samupāsthā","PPP","","_","_"
1,"sa","_","_","tad","PRD","","_","_"
2,"tvaṃ","_","_","tvat","PPR","","_","_"
3,"_","_","_","puruṣa","NC","","_","_"
4,"_","_","_","śārdūla","NC","","_","_"
5,"pauruṣe","_","_","pauruṣa","NC","","_","_"
6,"mahati","_","_","mahat","JJ","","_","_"
7,"sthitaḥ","_","_","sthā","PPP","","_","_"
1,"_","_","_","kṣatra","NC","","_","_"
2,"_","_","_","dharma","NC","","_","_"
3,"puraskṛtya","_","_","puraskṛ","CGDA","","_","_"
4,"pratyudyāhi","_","_","pratyudyā","V","pratyudyā","_","_"
5,"dhanaṃjayam","_","_","dhanaṃjaya","NC","","_","_"
1,"bhāro","_","_","bhāra","NC","","_","_"
2,"hi","_","_","hi","CX","","_","_"
3,"dhārtarāṣṭreṇa","_","_","dhārtarāṣṭra","NC","","_","_"
4,"tvayi","_","_","tvat","PPR","","_","_"
5,"sarvaḥ","_","_","sarva","JQ","","_","_"
6,"samarpitaḥ","_","_","samarpay","PPP","","_","_"
1,"tam","_","_","tad","PRD","","_","_"
2,"udvaha","_","_","udvah","V","udvah","_","_"
3,"_","_","_","mahat","JJ","","_","_"
4,"_","_","_","bāhu","NC","","_","_"
5,"yathāśakti","_","_","yathāśakti","CX","","_","_"
6,"yathābalam","_","_","yathābala","CX","","_","_"
1,"jaye","_","_","jaya","NC","","_","_"
2,"syād","_","_","as","V","as","_","_"
3,"vipulā","_","_","vipula","JJ","","_","_"
4,"kīrtir","_","_","kīrti","NC","","_","_"
5,"dhruvaḥ","_","_","dhruva","JJ","","_","_"
6,"svargaḥ","_","_","svarga","NC","","_","_"
7,"parājaye","_","_","parājaya","NC","","_","_"
1,"vṛṣasenaś","_","_","vṛṣasa","NC","","_","_"
2,"ca","_","_","ca","CCD","","_","_"
3,"rādheya","_","_","rādheya","NC","","_","_"
4,"saṃkruddhas","_","_","saṃkrudh","PPP","","_","_"
5,"tanayas","_","_","tanaya","NC","","_","_"
6,"tava","_","_","tvat","PPR","","_","_"
1,"tvayi","_","_","tvat","PPR","","_","_"
2,"_","_","_","moha","NC","","_","_"
3,"_","_","_","samāpad","PPP","","_","_"
4,"pāṇḍavān","_","_","pāṇḍava","NC","","_","_"
5,"abhidhāvati","_","_","abhidhāv","V","abhidhāv","_","_"
1,"_","_","_","tad","PRD","","_","_"
2,"_","_","_","śru","CGDA","","_","_"
3,"tu","_","_","tu","CCD","","_","_"
4,"vacanaṃ","_","_","vacana","NC","","_","_"
5,"_","_","_","śalya","NC","","_","_"
6,"_","_","_","amita","JJ","","_","_"
7,"_","_","_","tejas","NC","","_","_"
1,"hṛdi","_","_","hṛd","NC","","_","_"
2,"mānuṣyakaṃ","_","_","mānuṣyaka","JJ","","_","_"
3,"bhāvaṃ","_","_","bhāva","NC","","_","_"
4,"cakre","_","_","kar","V","kṛ","_","_"
5,"yuddhāya","_","_","yuddha","NC","","_","_"
6,"_","_","_","su","CAD","","_","_"
7,"_","_","_","sthira","JJ","","_","_"
1,"tataḥ","_","_","tatas","CX","","_","_"
2,"kruddho","_","_","krudh","PPP","","_","_"
3,"vṛṣaseno","_","_","vṛṣasa","NC","","_","_"
4,"'bhyadhāvad","_","_","abhidhāv","V","abhidhāv","_","_"
5,"ātasthivāṃsaṃ","_","_","āsthā","KDP","","_","_"
6,"_","_","_","sva","JJ","","_","_"
7,"_","_","_","ratha","NC","","_","_"
8,"_","_","_","han","PPP","","_","_"
9,"_","_","_","ari","NC","","_","_"
1,"vṛkodaraṃ","_","_","vṛkodara","NC","","_","_"
2,"kālam","_","_","kāla","NC","","_","_"
3,"_","_","_","iva","CCM","","_","_"
4,"_","_","_","ādā","PPP","","_","_"
5,"_","_","_","daṇḍa","NC","","_","_"
6,"_","_","_","gadā","NC","","_","_"
7,"_","_","_","hasta","NC","","_","_"
8,"pothamānaṃ","_","_","tvadīya","JJ","","_","_"
1,"tam","_","_","tad","PRD","","_","_"
2,"abhyadhāvan","_","_","abhidhāv","V","abhidhāv","_","_"
3,"nakulaḥ","_","_","nakula","NC","","_","_"
4,"pravīro","_","_","pravīra","NC","","_","_"
5,"roṣād","_","_","roṣa","NC","","_","_"
6,"amitraṃ","_","_","amitra","NC","","_","_"
7,"pratudan","_","_","pratud","KDP","","_","_"
8,"pṛṣatkaiḥ","_","_","pṛṣatka","NC","","_","_"
1,"karṇasya","_","_","karṇa","NC","","_","_"
2,"putraṃ","_","_","putra","NC","","_","_"
3,"samare","_","_","samara","NC","","_","_"
4,"prahṛṣṭaṃ","_","_","prahṛṣ","PPP","","_","_"
5,"jiṣṇur","_","_","jiṣṇu","JJ","","_","_"
6,"jighāṃsur","_","_","jighāṃsu","JJ","","_","_"
7,"_","_","_","maghavan","NC","","_","_"
8,"_","_","_","iva","CCM","","_","_"
9,"jambham","_","_","jambha","NC","","_","_"
1,"tato","_","_","tatas","CX","","_","_"
2,"dhvajaṃ","_","_","dhvaja","NC","","_","_"
3,"_","_","_","sphāṭika","NC","","_","_"
4,"_","_","_","citra","JJ","","_","_"
5,"_","_","_","kambu","NC","","_","_"
6,"cicheda","_","_","chid","V","chid","_","_"
7,"vīro","_","_","vīra","NC","","_","_"
8,"nakulaḥ","_","_","nakula","NC","","_","_"
9,"kṣureṇa","_","_","kṣura","NC","","_","_"
1,"_","_","_","karṇa","NC","","_","_"
2,"_","_","_","ātmaja","NC","","_","_"
3,"_","_","_","iṣvasana","NC","","_","_"
4,"ca","_","_","ca","CCD","","_","_"
5,"citraṃ","_","_","citra","JJ","","_","_"
6,"bhallena","_","_","bhalla","NC","","_","_"
7,"_","_","_","jāmbūnada","NC","","_","_"
8,"_","_","_","paṭṭa","NC","","_","_"
9,"_","_","_","nah","PPP","","_","_"
1,"_","_","_","atha","CAD","","_","_"
2,"_","_","_","anya","PPX","","_","_"
3,"ādāya","_","_","ādā","CGDA","","_","_"
4,"dhanuḥ","_","_","dhanus","NC","","_","_"
5,"_","_","_","su","CAD","","_","_"
6,"_","_","_","śīghra","CX","","_","_"
7,"_","_","_","karṇa","NC","","_","_"
8,"_","_","_","ātmaja","NC","","_","_"
9,"pāṇḍavam","_","_","pāṇḍava","NC","","_","_"
10,"abhyavidhyat","_","_","abhivyadh","V","abhivyadh","_","_"
1,"divyair","_","_","divya","JJ","","_","_"
2,"_","_","_","mahat","JJ","","_","_"
3,"_","_","_","astra","NC","","_","_"
4,"nakulaṃ","_","_","nakula","NC","","_","_"
5,"_","_","_","mahat","JJ","","_","_"
6,"_","_","_","astra","NC","","_","_"
7,"_","_","_","duḥśāsana","NC","","_","_"
8,"_","_","_","apaciti","NC","","_","_"
9,"yiyāsuḥ","_","_","yiyāsu","JJ","","_","_"
1,"tataḥ","_","_","tatas","CX","","_","_"
2,"kruddho","_","_","krudh","PPP","","_","_"
3,"nakulas","_","_","nakula","NC","","_","_"
4,"taṃ","_","_","tad","PRD","","_","_"
5,"mahātmā","_","_","mahātman","JJ","","_","_"
6,"śarair","_","_","śara","NC","","_","_"
7,"_","_","_","mahat","JJ","","_","_"
8,"_","_","_","ulkā","NC","","_","_"
9,"_","_","_","pratimā","NC","","_","_"
10,"avidhyat","_","_","vyadh","V","vyadh","_","_"
1,"divyair","_","_","divya","JJ","","_","_"
2,"astrair","_","_","astra","NC","","_","_"
3,"abhyavidhyac","_","_","abhivyadh","V","abhivyadh","_","_"
4,"ca","_","_","ca","CCD","","_","_"
5,"so","_","_","tad","PRD","","_","_"
6,"'pi","_","_","api","CX","","_","_"
7,"karṇasya","_","_","karṇa","NC","","_","_"
8,"putro","_","_","putra","NC","","_","_"
9,"nakulaṃ","_","_","nakula","NC","","_","_"
10,"kṛtāstraḥ","_","_","kṛtāstra","JJ","","_","_"
1,"karṇasya","_","_","karṇa","NC","","_","_"
2,"putro","_","_","putra","NC","","_","_"
3,"nakulasya","_","_","nakula","NC","","_","_"
4,"rājan","_","_","rājan","NC","","_","_"
5,"sarvān","_","_","sarva","JQ","","_","_"
6,"aśvān","_","_","aśva","NC","","_","_"
7,"akṣiṇod","_","_","kṣi","V","kṣi","_","_"
8,"_","_","_","uttama","JJ","","_","_"
9,"_","_","_","astra","NC","","_","_"
1,"_","_","_","vanāyu","NC","","_","_"
2,"_","_","_","ja","JJ","","_","_"
3,"_","_","_","su","CAD","","_","_"
4,"_","_","_","kumāra","JJ","","_","_"
5,"śubhrān","_","_","śubhra","JJ","","_","_"
6,"alaṃkṛtāñ","_","_","alaṃkṛ","PPP","","_","_"
7,"jātarūpeṇa","_","_","jātarūpa","NC","","_","_"
8,"śīghrān","_","_","śīghra","JJ","","_","_"
1,"tato","_","_","tatas","CX","","_","_"
2,"_","_","_","han","PPP","","_","_"
3,"_","_","_","aśva","NC","","_","_"
4,"avaruhya","_","_","avaruh","CGDA","","_","_"
5,"yānād","_","_","yāna","NC","","_","_"
6,"ādāya","_","_","ādā","CGDA","","_","_"
7,"carma","_","_","carman","NC","","_","_"
8,"ruciraṃ","_","_","rucira","JJ","","_","_"
9,"_","_","_","ca","CCD","","_","_"
10,"_","_","_","aṣṭan","NUM","","_","_"
11,"_","_","_","candra","NC","","_","_"
1,"_","_","_","ākāśa","NC","","_","_"
2,"_","_","_","saṃkāśa","NC","","_","_"
3,"asiṃ","_","_","asi","NC","","_","_"
4,"gṛhītvā","_","_","grah","CGDA","","_","_"
5,"poplūyamānaḥ","_","_","poplūy","KDP","","_","_"
6,"_","_","_","khaga","NC","","_","_"
7,"_","_","_","vat","CX","","_","_"
8,"cacāra","_","_","car","V","car","_","_"
1,"tato","_","_","tatas","CX","","_","_"
2,"'ntarikṣe","_","_","antarikṣa","NC","","_","_"
3,"_","_","_","nṛ","NC","","_","_"
4,"_","_","_","vara","JJ","","_","_"
5,"_","_","_","aśva","NC","","_","_"
6,"_","_","_","nāga","NC","","_","_"
7,"cicheda","_","_","chid","V","chid","_","_"
8,"mārgān","_","_","mārga","NC","","_","_"
9,"vicaran","_","_","vicar","KDP","","_","_"
10,"vicitrān","_","_","vicitra","JJ","","_","_"
1,"te","_","_","tad","PRD","","_","_"
2,"prāpatann","_","_","prapat","V","prapat","_","_"
3,"asinā","_","_","asi","NC","","_","_"
4,"gāṃ","_","_","go","NC","","_","_"
5,"viśastā","_","_","viśaṃs","PPP","","_","_"
6,"_","_","_","yathā","CCM","","_","_"
7,"_","_","_","aśvamedha","NC","","_","_"
8,"paśavaḥ","_","_","paśu","NC","","_","_"
9,"śamitrā","_","_","śamitṛ","NC","","_","_"
1,"_","_","_","dvi","NUM","","_","_"
2,"_","_","_","sāhasra","JJ","","_","_"
3,"viditā","_","_","vid","PPP","","_","_"
4,"_","_","_","yuddha","NC","","_","_"
5,"_","_","_","śauṇḍa","JJ","","_","_"
6,"nānādeśyāḥ","_","_","nānādeśya","JJ","","_","_"
7,"_","_","_","su","CAD","","_","_"
8,"_","_","_","bhṛ","PPP","","_","_"
9,"_","_","_","satya","JJ","","_","_"
10,"_","_","_","saṃdhā","NC","","_","_"
1,"ekena","_","_","eka","PPX","","_","_"
2,"śīghraṃ","_","_","śīghra","CX","","_","_"
3,"nakulena","_","_","nakula","NC","","_","_"
4,"kṛttāḥ","_","_","kṛt","PPP","","_","_"
5,"_","_","_","sāra","NC","","_","_"
6,"_","_","_","īpsu","JJ","","_","_"
7,"_","_","_","iva","CCM","","_","_"
8,"_","_","_","uttama","JJ","","_","_"
9,"_","_","_","candana","NC","","_","_"
10,"te","_","_","tad","PRD","","_","_"
1,"tam","_","_","tad","PRD","","_","_"
2,"āpatantaṃ","_","_","āpat","KDP","","_","_"
3,"nakulaṃ","_","_","nakula","NC","","_","_"
4,"so","_","_","tad","PRD","","_","_"
5,"'bhipatya","_","_","abhipat","CGDA","","_","_"
6,"samantataḥ","_","_","samantataḥ","CX","","_","_"
7,"sāyakair","_","_","sāyaka","NC","","_","_"
8,"abhyavidhyat","_","_","abhivyadh","V","abhivyadh","_","_"
1,"sa","_","_","tad","PRD","","_","_"
2,"tudyamāno","_","_","tud","KDP","","_","_"
3,"nakulaḥ","_","_","nakula","NC","","_","_"
4,"pṛṣatkair","_","_","pṛṣatka","NC","","_","_"
5,"vivyādha","_","_","vyadh","V","vyadh","_","_"
6,"vīraṃ","_","_","vīra","NC","","_","_"
7,"sa","_","_","tad","PRD","","_","_"
8,"cukopa","_","_","kup","V","kup","_","_"
9,"viddhaḥ","_","_","vyadh","PPP","","_","_"
1,"taṃ","_","_","tad","PRD","","_","_"
2,"_","_","_","karṇa","NC","","_","_"
3,"_","_","_","putra","NC","","_","_"
4,"vidhamantam","_","_","vidha","KDP","","_","_"
5,"ekaṃ","_","_","eka","PPX","","_","_"
6,"_","_","_","nara","NC","","_","_"
7,"_","_","_","aśva","NC","","_","_"
8,"_","_","_","mātaṃga","NC","","_","_"
9,"_","_","_","ratha","NC","","_","_"
10,"_","_","_","praveka","JJ","","_","_"
1,"krīḍantam","_","_","krīḍ","KDP","","_","_"
2,"aṣṭādaśabhiḥ","_","_","aṣṭādaśan","JJ","","_","_"
3,"pṛṣatkair","_","_","pṛṣatka","NC","","_","_"
4,"vivyādha","_","_","vyadh","V","vyadh","_","_"
5,"vīraṃ","_","_","vīra","NC","","_","_"
6,"sa","_","_","tad","PRD","","_","_"
7,"cukopa","_","_","kup","V","kup","_","_"
8,"viddhaḥ","_","_","vyadh","PPP","","_","_"
1,"tato","_","_","tatas","CX","","_","_"
2,"'bhyadhāvat","_","_","abhidhāv","V","abhidhāv","_","_"
3,"samare","_","_","samara","NC","","_","_"
4,"jighāṃsuḥ","_","_","jighāṃsu","JJ","","_","_"
5,"_","_","_","karṇa","NC","","_","_"
6,"_","_","_","ātmaja","NC","","_","_"
7,"_","_","_","pāṇḍu","NC","","_","_"
8,"_","_","_","suta","NC","","_","_"
9,"_","_","_","nṛ","NC","","_","_"
10,"_","_","_","vīra","NC","","_","_"
1,"_","_","_","tad","PRD","","_","_"
2,"_","_","_","iṣu","NC","","_","_"
3,"vyadhamat","_","_","vidha","V","vidha","_","_"
4,"_","_","_","karṇa","NC","","_","_"
5,"_","_","_","putra","NC","","_","_"
6,"_","_","_","mahat","JJ","","_","_"
7,"_","_","_","raṇa","NC","","_","_"
8,"carma","_","_","carman","NC","","_","_"
9,"_","_","_","sahasra","NUM","","_","_"
10,"_","_","_","tārā","NC","","_","_"
1,"_","_","_","tad","PRD","","_","_"
2,"_","_","_","āyasa","JJ","","_","_"
3,"niśitaṃ","_","_","niśā","PPP","","_","_"
4,"_","_","_","tīkṣṇa","JJ","","_","_"
5,"_","_","_","dhārā","NC","","_","_"
6,"asiṃ","_","_","asi","NC","","_","_"
7,"vikośaṃ","_","_","vikośa","JJ","","_","_"
8,"_","_","_","guru","JJ","","_","_"
9,"_","_","_","bhāra","NC","","_","_"
10,"_","_","_","sāha","JJ","","_","_"
1,"_","_","_","dviṣ","KDP","","_","_"
2,"_","_","_","śarīra","NC","","_","_"
3,"_","_","_","apahara","JJ","","_","_"
4,"_","_","_","su","CAD","","_","_"
5,"_","_","_","ghora","JJ","","_","_"
6,"ādhunvataḥ","_","_","ādhū","KDP","","_","_"
7,"sarpam","_","_","sarpa","NC","","_","_"
8,"_","_","_","iva","CCM","","_","_"
9,"_","_","_","ugra","JJ","","_","_"
10,"_","_","_","rūpa","NC","","_","_"
1,"kṣipraṃ","_","_","kṣipra","CX","","_","_"
2,"śaraiḥ","_","_","śara","NC","","_","_"
3,"ṣaḍbhir","_","_","ṣaṣ","NUM","","_","_"
4,"_","_","_","amitra","NC","","_","_"
5,"_","_","_","sāha","JJ","","_","_"
6,"cakarta","_","_","kṛt","V","kṛt","_","_"
7,"khaḍgaṃ","_","_","khaḍga","NC","","_","_"
8,"niśitaiḥ","_","_","niśā","PPP","","_","_"
9,"_","_","_","su","CAD","","_","_"
10,"_","_","_","dhārā","NC","","_","_"
1,"punaś","_","_","punar","CAD","","_","_"
2,"ca","_","_","ca","CCD","","_","_"
3,"pītair","_","_","pīta","JJ","","_","_"
4,"niśitaiḥ","_","_","niśā","PPP","","_","_"
5,"pṛṣatkaiḥ","_","_","pṛṣatka","NC","","_","_"
6,"stanāntare","_","_","stanāntara","NC","","_","_"
7,"gāḍham","_","_","gāḍha","CX","","_","_"
8,"_","_","_","atha","CAD","","_","_"
9,"_","_","_","abhivyadh","V","abhivyadh","_","_"
1,"sa","_","_","tad","PRD","","_","_"
2,"bhīmasenasya","_","_","bhīmasa","NC","","_","_"
3,"rathaṃ","_","_","ratha","NC","","_","_"
4,"_","_","_","han","PPP","","_","_"
5,"_","_","_","aśva","NC","","_","_"
6,"_","_","_","mādrī","NC","","_","_"
7,"_","_","_","suta","NC","","_","_"
8,"_","_","_","karṇa","NC","","_","_"
9,"_","_","_","suta","NC","","_","_"
10,"_","_","_","abhitap","PPP","","_","_"
1,"āpupluve","_","_","āplu","V","āplu","_","_"
2,"siṃha","_","_","siṃha","NC","","_","_"
3,"_","_","_","iva","CCM","","_","_"
4,"_","_","_","acala","NC","","_","_"
5,"_","_","_","agra","NC","","_","_"
6,"samprekṣamāṇasya","_","_","samprekṣ","KDP","","_","_"
7,"dhanaṃjayasya","_","_","dhanaṃjaya","NC","","_","_"
1,"nakulam","_","_","nakula","NC","","_","_"
2,"atha","_","_","atha","CAD","","_","_"
3,"viditvā","_","_","vid","CGDA","","_","_"
4,"_","_","_","chid","PPP","","_","_"
5,"_","_","_","bāṇāsana","NC","","_","_"
6,"_","_","_","asi","NC","","_","_"
7,"viratham","_","_","viratha","JJ","","_","_"
8,"_","_","_","ari","NC","","_","_"
9,"_","_","_","śara","NC","","_","_"
10,"_","_","_","ārta","JJ","","_","_"
11,"_","_","_","karṇa","NC","","_","_"
12,"_","_","_","putra","NC","","_","_"
13,"_","_","_","astra","NC","","_","_"
14,"_","_","_","bhañj","PPP","","_","_"
1,"_","_","_","pavana","NC","","_","_"
2,"_","_","_","dhū","PPP","","_","_"
3,"_","_","_","patākā","NC","","_","_"
4,"hrādino","_","_","hrādin","JJ","","_","_"
5,"_","_","_","valg","PPP","","_","_"
6,"_","_","_","aśva","NC","","_","_"
7,"_","_","_","vara","JJ","","_","_"
8,"_","_","_","puruṣa","NC","","_","_"
9,"_","_","_","niyat","PPP","","_","_"
10,"te","_","_","tad","PRD","","_","_"
11,"rathāḥ","_","_","ratha","NC","","_","_"
12,"śīghram","_","_","śīghra","CX","","_","_"
13,"īyuḥ","_","_","e","V","i","_","_"
1,"_","_","_","drupada","NC","","_","_"
2,"_","_","_","suta","NC","","_","_"
3,"_","_","_","variṣṭha","JJ","","_","_"
4,"pañca","_","_","pañcan","NUM","","_","_"
5,"_","_","_","śaineya","NC","","_","_"
6,"_","_","_","ṣaṣṭha","JJ","","_","_"
7,"_","_","_","drupada","NC","","_","_"
8,"_","_","_","duhitṛ","NC","","_","_"
9,"_","_","_","putra","NC","","_","_"
10,"pañca","_","_","pañcan","NUM","","_","_"
11,"_","_","_","ca","CCD","","_","_"
12,"_","_","_","amitra","NC","","_","_"
13,"_","_","_","sāha","JJ","","_","_"
1,"_","_","_","dvirada","NC","","_","_"
2,"_","_","_","ratha","NC","","_","_"
3,"_","_","_","nara","NC","","_","_"
4,"_","_","_","aśva","NC","","_","_"
5,"sūdayantas","_","_","sūday","KDP","","_","_"
6,"tvadīyān","_","_","tvadīya","JJ","","_","_"
7,"_","_","_","bhujaga","NC","","_","_"
8,"_","_","_","pati","NC","","_","_"
9,"_","_","_","nikāśa","NC","","_","_"
10,"mārgaṇair","_","_","mārgaṇa","NC","","_","_"
11,"_","_","_","ādā","PPP","","_","_"
12,"_","_","_","śastra","NC","","_","_"
1,"atha","_","_","atha","CAD","","_","_"
2,"tava","_","_","tvat","PPR","","_","_"
3,"_","_","_","ratha","NC","","_","_"
4,"_","_","_","mukhya","JJ","","_","_"
5,"tān","_","_","tad","PRD","","_","_"
6,"pratīyus","_","_","pratye","V","pratī","_","_"
7,"tvaranto","_","_","tvar","KDP","","_","_"
8,"_","_","_","hṛdika","NC","","_","_"
9,"_","_","_","suta","NC","","_","_"
10,"_","_","_","kṛpa","NC","","_","_"
11,"ca","_","_","ca","CCD","","_","_"
12,"_","_","_","drauṇi","NC","","_","_"
13,"_","_","_","duryodhana","NC","","_","_"
14,"ca","_","_","ca","CCD","","_","_"
1,"_","_","_","śakuni","NC","","_","_"
2,"_","_","_","śuka","NC","","_","_"
3,"_","_","_","vṛka","NC","","_","_"
4,"ca","_","_","ca","CCD","","_","_"
5,"_","_","_","krātha","NC","","_","_"
6,"_","_","_","devāvṛdha","NC","","_","_"
7,"ca","_","_","ca","CCD","","_","_"
8,"_","_","_","dvirada","NC","","_","_"
9,"_","_","_","jalada","NC","","_","_"
10,"_","_","_","ghoṣa","NC","","_","_"
11,"syandanaiḥ","_","_","syandana","NC","","_","_"
12,"kārmukaiś","_","_","kārmuka","NC","","_","_"
13,"ca","_","_","ca","CCD","","_","_"
1,"tava","_","_","tvat","PPR","","_","_"
2,"_","_","_","nara","NC","","_","_"
3,"_","_","_","vara","JJ","","_","_"
4,"_","_","_","varya","JJ","","_","_"
5,"tān","_","_","tad","PRD","","_","_"
6,"_","_","_","daśan","NUM","","_","_"
7,"_","_","_","eka","PPX","","_","_"
8,"ca","_","_","ca","CCD","","_","_"
9,"vīrān","_","_","vīra","NC","","_","_"
10,"_","_","_","pravara","JJ","","_","_"
11,"_","_","_","śara","NC","","_","_"
12,"_","_","_","vara","JJ","","_","_"
13,"_","_","_","agrya","JJ","","_","_"
14,"tāḍayanto","_","_","tāḍay","KDP","","_","_"
15,"'bhyarundhan","_","_","abhirudh","V","abhirudh","_","_"
1,"_","_","_","navan","NUM","","_","_"
2,"_","_","_","jalada","NC","","_","_"
3,"_","_","_","savarṇa","JJ","","_","_"
4,"hastibhis","_","_","hastin","NC","","_","_"
5,"tān","_","_","tad","PRD","","_","_"
6,"udīyur","_","_","ude","V","udi","_","_"
7,"_","_","_","giri","NC","","_","_"
8,"_","_","_","śikhara","NC","","_","_"
9,"_","_","_","nikāśa","NC","","_","_"
10,"_","_","_","bhīma","JJ","","_","_"
11,"_","_","_","vega","NC","","_","_"
12,"kuṇindāḥ","_","_","kuṇinda","NC","","_","_"
1,"_","_","_","su","CAD","","_","_"
2,"_","_","_","kalpay","PPP","","_","_"
3,"haimavatā","_","_","haimavata","JJ","","_","_"
4,"_","_","_","mada","NC","","_","_"
5,"_","_","_","utkaṭa","JJ","","_","_"
6,"_","_","_","raṇa","NC","","_","_"
7,"_","_","_","abhikāma","JJ","","_","_"
8,"kṛtibhiḥ","_","_","kṛtin","JJ","","_","_"
9,"samāsthitāḥ","_","_","samāsthā","PPP","","_","_"
1,"_","_","_","suvarṇa","NC","","_","_"
2,"_","_","_","jāla","NC","","_","_"
3,"_","_","_","avatan","PPP","","_","_"
4,"babhur","_","_","bhā","V","bhā","_","_"
5,"gajās","_","_","gaja","NC","","_","_"
6,"tathā","_","_","tathā","CX","","_","_"
7,"yathā","_","_","yathā","CCM","","_","_"
8,"vai","_","_","vai","CX","","_","_"
9,"jaladāḥ","_","_","jalada","NC","","_","_"
10,"_","_","_","sa_saha","CX","","_","_"
11,"_","_","_","vidyut","NC","","_","_"
1,"_","_","_","kuṇinda","NC","","_","_"
2,"_","_","_","putra","NC","","_","_"
3,"daśabhir","_","_","daśan","NUM","","_","_"
4,"_","_","_","mahat","JJ","","_","_"
5,"_","_","_","āyasa","JJ","","_","_"
6,"kṛpaṃ","_","_","kṛpa","NC","","_","_"
7,"_","_","_","sa_saha","CX","","_","_"
8,"_","_","_","sūta","NC","","_","_"
9,"_","_","_","aśva","NC","","_","_"
10,"apīḍayad","_","_","pīḍay","V","pīḍay","_","_"
11,"bhṛśam","_","_","bhṛśa","CX","","_","_"
1,"tataḥ","_","_","tatas","CX","","_","_"
2,"_","_","_","śaradvat","NC","","_","_"
3,"_","_","_","suta","NC","","_","_"
4,"_","_","_","sāyaka","NC","","_","_"
5,"hataḥ","_","_","han","PPP","","_","_"
6,"_","_","_","saha","CX","","_","_"
7,"_","_","_","eva","CEM","","_","_"
8,"nāgena","_","_","nāga","NC","","_","_"
9,"papāta","_","_","pat","V","pat","_","_"
10,"_","_","_","bhū","NC","","_","_"
11,"_","_","_","tala","NC","","_","_"
1,"_","_","_","kuṇinda","NC","","_","_"
2,"_","_","_","putra","NC","","_","_"
3,"_","_","_","avaraja","NC","","_","_"
4,"tu","_","_","tu","CCD","","_","_"
5,"tomarair","_","_","tomara","NC","","_","_"
6,"_","_","_","divākara","NC","","_","_"
7,"_","_","_","aṃśu","NC","","_","_"
8,"_","_","_","pratima","JJ","","_","_"
9,"ayasmayaiḥ","_","_","ayasmaya","JJ","","_","_"
1,"rathaṃ","_","_","ratha","NC","","_","_"
2,"ca","_","_","ca","CCD","","_","_"
3,"vikṣobhya","_","_","vikṣobhay","CGDA","","_","_"
4,"nanāda","_","_","nad","V","nad","_","_"
5,"nardatas","_","_","nard","KDP","","_","_"
6,"tato","_","_","tatas","CX","","_","_"
7,"'sya","_","_","ida","PRD","","_","_"
8,"_","_","_","gāndhāra","NC","","_","_"
9,"_","_","_","pati","NC","","_","_"
10,"śiro","_","_","śiras","NC","","_","_"
11,"'harat","_","_","har","V","hṛ","_","_"
1,"tataḥ","_","_","tatas","CX","","_","_"
2,"kuṇindeṣu","_","_","kuṇinda","NC","","_","_"
3,"hateṣu","_","_","han","PPP","","_","_"
4,"teṣv","_","_","tad","PRD","","_","_"
5,"atha","_","_","atha","CAD","","_","_"
6,"_","_","_","prahṛṣ","PPP","","_","_"
7,"_","_","_","rūpa","NC","","_","_"
8,"tava","_","_","tvat","PPR","","_","_"
9,"te","_","_","tad","PRD","","_","_"
10,"_","_","_","mahat","JJ","","_","_"
11,"_","_","_","ratha","NC","","_","_"
1,"bhṛśaṃ","_","_","bhṛśa","CX","","_","_"
2,"pradadhmur","_","_","pradha","V","pradha","_","_"
3,"_","_","_","lavaṇa","JJ","","_","_"
4,"_","_","_","ambu","NC","","_","_"
5,"_","_","_","sambhava","NC","","_","_"
6,"parāṃś","_","_","para","PPX","","_","_"
7,"ca","_","_","ca","CCD","","_","_"
8,"_","_","_","bāṇāsana","NC","","_","_"
9,"_","_","_","pāṇi","NC","","_","_"
10,"'bhyayuḥ","_","_","abhiyā","V","abhiyā","_","_"
1,"_","_","_","atha","CAD","","_","_"
2,"_","_","_","bhav","V","bhū","_","_"
3,"yuddham","_","_","yuddha","NC","","_","_"
4,"atīva","_","_","atīva","CX","","_","_"
5,"dāruṇaṃ","_","_","dāruṇa","JJ","","_","_"
6,"punaḥ","_","_","punar","CAD","","_","_"
7,"kurūṇāṃ","_","_","kuru","NC","","_","_"
8,"saha","_","_","saha","CX","","_","_"
9,"_","_","_","pāṇḍu","NC","","_","_"
10,"_","_","_","sṛñjaya","NC","","_","_"
1,"_","_","_","śara","NC","","_","_"
2,"_","_","_","asi","NC","","_","_"
3,"_","_","_","śakti","NC","","_","_"
4,"_","_","_","ṛṣṭi","NC","","_","_"
5,"_","_","_","gadā","NC","","_","_"
6,"_","_","_","paraśvadha","NC","","_","_"
7,"_","_","_","bhṛśa","JJ","","_","_"
8,"_","_","_","ākula","JJ","","_","_"
1,"_","_","_","ratha","NC","","_","_"
2,"_","_","_","aśva","NC","","_","_"
3,"_","_","_","mātaṃga","NC","","_","_"
4,"_","_","_","padāti","NC","","_","_"
5,"tataḥ","_","_","tatas","CX","","_","_"
6,"parasparaṃ","_","_","paraspara","PRC","","_","_"
7,"_","_","_","viprahan","PPP","","_","_"
8,"_","_","_","pat","V","pat","_","_"
9,"kṣitau","_","_","kṣiti","NC","","_","_"
1,"yathā","_","_","yathā","CCM","","_","_"
2,"_","_","_","sa_saha","CX","","_","_"
3,"_","_","_","vidyut","NC","","_","_"
4,"_","_","_","stanita","NC","","_","_"
5,"balāhakāḥ","_","_","balāhaka","NC","","_","_"
6,"samāsthitā","_","_","samāsthā","PPP","","_","_"
7,"digbhya","_","_","diś","NC","","_","_"
8,"_","_","_","iva","CCM","","_","_"
9,"_","_","_","ugra","JJ","","_","_"
10,"_","_","_","māruta","NC","","_","_"
1,"tataḥ","_","_","tatas","CX","","_","_"
2,"_","_","_","śatānīka","NC","","_","_"
3,"_","_","_","han","PPP","","_","_"
4,"_","_","_","mahat","JJ","","_","_"
5,"_","_","_","gaja","NC","","_","_"
6,"tathā","_","_","tathā","CX","","_","_"
7,"rathān","_","_","ratha","NC","","_","_"
8,"_","_","_","patti","NC","","_","_"
9,"_","_","_","gaṇa","NC","","_","_"
10,"ca","_","_","ca","CCD","","_","_"
11,"tāvakān","_","_","tāvaka","JJ","","_","_"
1,"jaghāna","_","_","han","V","han","_","_"
2,"bhojaś","_","_","bhoja","NC","","_","_"
3,"ca","_","_","ca","CCD","","_","_"
4,"hayān","_","_","haya","NC","","_","_"
5,"_","_","_","atha","CAD","","_","_"
6,"_","_","_","pat","V","pat","_","_"
7,"_","_","_","viśastra","JJ","","_","_"
8,"_","_","_","kṛt","PPP","","_","_"
9,"kṛtavarmaṇā","_","_","kṛtavarman","NC","","_","_"
10,"dvipāḥ","_","_","dvipa","NC","","_","_"
1,"_","_","_","atha","CAD","","_","_"
2,"_","_","_","apara","PPX","","_","_"
3,"_","_","_","drauṇi","NC","","_","_"
4,"_","_","_","śara","NC","","_","_"
5,"_","_","_","āhan","PPP","","_","_"
6,"dvipās","_","_","dvipa","NC","","_","_"
7,"trayaḥ","_","_","tri","NUM","","_","_"
8,"_","_","_","sa_saha","CX","","_","_"
9,"_","_","_","sarva","JQ","","_","_"
10,"_","_","_","āyudha","NC","","_","_"
11,"_","_","_","yodha","NC","","_","_"
12,"_","_","_","ketu","NC","","_","_"
1,"nipetur","_","_","nipat","V","nipat","_","_"
2,"urvyāṃ","_","_","urvī","NC","","_","_"
3,"vyasavaḥ","_","_","vyasu","JJ","","_","_"
4,"prapātitās","_","_","prapātay","PPP","","_","_"
5,"tathā","_","_","tathā","CX","","_","_"
6,"yathā","_","_","yathā","CCM","","_","_"
7,"_","_","_","vajra","NC","","_","_"
8,"_","_","_","han","PPP","","_","_"
9,"_","_","_","mahat","JJ","","_","_"
10,"_","_","_","acala","NC","","_","_"
1,"_","_","_","kuṇinda","NC","","_","_"
2,"_","_","_","rājan","NC","","_","_"
3,"_","_","_","avaraja","NC","","_","_"
4,"anantaraḥ","_","_","anantara","JJ","","_","_"
5,"stanāntare","_","_","stanāntara","NC","","_","_"
6,"_","_","_","pattrin","NC","","_","_"
7,"_","_","_","vara","JJ","","_","_"
8,"atāḍayat","_","_","tāḍay","V","tāḍay","_","_"
1,"_","_","_","tvat","PPR","","_","_"
2,"_","_","_","ātmaja","NC","","_","_"
3,"tasya","_","_","tad","PRD","","_","_"
4,"_","_","_","tvat","PPR","","_","_"
5,"_","_","_","ātmaja","NC","","_","_"
6,"śaraiḥ","_","_","śara","NC","","_","_"
7,"śitaiḥ","_","_","śā","PPP","","_","_"
8,"śarīraṃ","_","_","śarīra","NC","","_","_"
9,"bibhide","_","_","bhid","V","bhid","_","_"
10,"dvipaṃ","_","_","dvipa","NC","","_","_"
11,"ca","_","_","ca","CCD","","_","_"
12,"tam","_","_","tad","PRD","","_","_"
1,"sa","_","_","tad","PRD","","_","_"
2,"_","_","_","nāga","NC","","_","_"
3,"_","_","_","rāja","NC","","_","_"
4,"saha","_","_","saha","CX","","_","_"
5,"_","_","_","rājan","NC","","_","_"
6,"_","_","_","sūnu","NC","","_","_"
7,"papāta","_","_","pat","V","pat","_","_"
8,"raktaṃ","_","_","rakta","NC","","_","_"
9,"bahu","_","_","bahu","JJ","","_","_"
10,"sarvataḥ","_","_","sarvatas","CX","","_","_"
11,"kṣaran","_","_","kṣar","KDP","","_","_"
1,"_","_","_","śacīśa","NC","","_","_"
2,"_","_","_","vajra","NC","","_","_"
3,"_","_","_","prahan","PPP","","_","_"
4,"_","_","_","ambuda","NC","","_","_"
5,"_","_","_","āgama","NC","","_","_"
6,"yathā","_","_","yathā","CCM","","_","_"
7,"jalaṃ","_","_","jala","NC","","_","_"
8,"_","_","_","gairika","NC","","_","_"
9,"_","_","_","parvata","NC","","_","_"
10,"tathā","_","_","tathā","CX","","_","_"
1,"_","_","_","kuṇinda","NC","","_","_"
2,"_","_","_","putra","NC","","_","_"
3,"_","_","_","prahi","PPP","","_","_"
4,"_","_","_","apara","PPX","","_","_"
5,"_","_","_","dvipa","NC","","_","_"
6,"śukaṃ","_","_","śuka","NC","","_","_"
7,"_","_","_","sa_saha","CX","","_","_"
8,"_","_","_","sūta","NC","","_","_"
9,"_","_","_","aśva","NC","","_","_"
10,"_","_","_","ratha","NC","","_","_"
11,"vyapothayat","_","_","vipothay","V","vipothay","_","_"
1,"tato","_","_","tatas","CX","","_","_"
2,"'patat","_","_","pat","V","pat","_","_"
3,"_","_","_","krātha","NC","","_","_"
4,"_","_","_","śara","NC","","_","_"
5,"_","_","_","abhidāray","PPP","","_","_"
6,"_","_","_","saha","CX","","_","_"
7,"_","_","_","īśvara","NC","","_","_"
8,"_","_","_","vajra","NC","","_","_"
9,"_","_","_","han","PPP","","_","_"
10,"yathā","_","_","yathā","CCM","","_","_"
11,"giriḥ","_","_","giri","NC","","_","_"
1,"rathī","_","_","rathin","NC","","_","_"
2,"_","_","_","dvipa","NC","","_","_"
3,"_","_","_","stha","JJ","","_","_"
4,"hato","_","_","han","PPP","","_","_"
5,"_","_","_","pat","V","pat","_","_"
6,"_","_","_","śara","NC","","_","_"
7,"_","_","_","krātha","NC","","_","_"
8,"_","_","_","adhipa","NC","","_","_"
9,"_","_","_","parvata","NC","","_","_"
10,"_","_","_","ja","JJ","","_","_"
11,"durjayaḥ","_","_","durjaya","JJ","","_","_"
1,"_","_","_","sa_saha","CX","","_","_"
2,"_","_","_","vājin","NC","","_","_"
3,"_","_","_","sūta","NC","","_","_"
4,"_","_","_","iṣvasana","NC","","_","_"
5,"_","_","_","tathā","CX","","_","_"
6,"_","_","_","pat","V","pat","_","_"
7,"yathā","_","_","yathā","CCM","","_","_"
8,"_","_","_","mahat","JJ","","_","_"
9,"_","_","_","vāta","NC","","_","_"
10,"_","_","_","han","PPP","","_","_"
11,"_","_","_","mahat","JJ","","_","_"
12,"_","_","_","druma","NC","","_","_"
1,"vṛko","_","_","vṛka","NC","","_","_"
2,"_","_","_","dvipa","NC","","_","_"
3,"_","_","_","stha","JJ","","_","_"
4,"_","_","_","girirāja","NC","","_","_"
5,"_","_","_","vāsin","JJ","","_","_"
6,"bhṛśaṃ","_","_","bhṛśa","CX","","_","_"
7,"śarair","_","_","śara","NC","","_","_"
8,"dvādaśabhiḥ","_","_","dvādaśan","NUM","","_","_"
9,"parābhinat","_","_","parābhid","V","parābhid","_","_"
1,"tato","_","_","tatas","CX","","_","_"
2,"vṛkaṃ","_","_","vṛka","NC","","_","_"
3,"_","_","_","sa_saha","CX","","_","_"
4,"_","_","_","aśva","NC","","_","_"
5,"_","_","_","ratha","NC","","_","_"
6,"_","_","_","mahat","JJ","","_","_"
7,"_","_","_","java","NC","","_","_"
8,"tvaraṃś","_","_","tvar","KDP","","_","_"
9,"caturbhiś","_","_","catur","NUM","","_","_"
10,"caraṇe","_","_","caraṇa","NC","","_","_"
11,"vyapothayat","_","_","vipothay","V","vipothay","_","_"
1,"sa","_","_","tad","PRD","","_","_"
2,"_","_","_","nāga","NC","","_","_"
3,"_","_","_","rāja","NC","","_","_"
4,"_","_","_","sa_saha","CX","","_","_"
5,"_","_","_","niyantṛka","NC","","_","_"
6,"'patat","_","_","pat","V","pat","_","_"
7,"parāhato","_","_","parāhan","PPP","","_","_"
8,"_","_","_","babhru","NC","","_","_"
9,"_","_","_","suta","NC","","_","_"
10,"_","_","_","iṣu","NC","","_","_"
11,"bhṛśam","_","_","bhṛśa","CX","","_","_"
1,"sa","_","_","tad","PRD","","_","_"
2,"_","_","_","ca","CCD","","_","_"
3,"_","_","_","api","CX","","_","_"
4,"_","_","_","devāvṛdha","NC","","_","_"
5,"_","_","_","sūnu","NC","","_","_"
6,"arditaḥ","_","_","arday","PPP","","_","_"
7,"papāta","_","_","pat","V","pat","_","_"
8,"nunnaḥ","_","_","nud","PPP","","_","_"
9,"_","_","_","sahadeva","NC","","_","_"
10,"_","_","_","sūnu","NC","","_","_"
1,"_","_","_","viṣāṇa","NC","","_","_"
2,"_","_","_","potra","NC","","_","_"
3,"_","_","_","apara","PPX","","_","_"
4,"_","_","_","gātra","NC","","_","_"
5,"_","_","_","ghātin","JJ","","_","_"
6,"gajena","_","_","gaja","NC","","_","_"
7,"hantuṃ","_","_","han","CGDI","","_","_"
8,"śakuneḥ","_","_","śakuni","NC","","_","_"
9,"_","_","_","kuṇinda","NC","","_","_"
10,"_","_","_","ja","JJ","","_","_"
1,"jagāma","_","_","ga","V","ga","_","_"
2,"vegena","_","_","vega","NC","","_","_"
3,"_","_","_","bhṛśa","JJ","","_","_"
4,"_","_","_","arday","KDP","","_","_"
5,"ca","_","_","ca","CCD","","_","_"
6,"taṃ","_","_","tad","PRD","","_","_"
7,"tato","_","_","tatas","CX","","_","_"
8,"'sya","_","_","ida","PRD","","_","_"
9,"_","_","_","gāndhāra","NC","","_","_"
10,"_","_","_","pati","NC","","_","_"
11,"śiro","_","_","śiras","NC","","_","_"
12,"'harat","_","_","har","V","hṛ","_","_"
1,"tataḥ","_","_","tatas","CX","","_","_"
2,"_","_","_","śatānīka","NC","","_","_"
3,"_","_","_","han","PPP","","_","_"
4,"_","_","_","mahat","JJ","","_","_"
5,"_","_","_","gaja","NC","","_","_"
6,"hayā","_","_","haya","NC","","_","_"
7,"rathāḥ","_","_","ratha","NC","","_","_"
8,"_","_","_","patti","NC","","_","_"
9,"_","_","_","gaṇa","NC","","_","_"
10,"ca","_","_","ca","CCD","","_","_"
11,"tāvakāḥ","_","_","tāvaka","JJ","","_","_"
1,"_","_","_","suparṇa","NC","","_","_"
2,"_","_","_","vāta","NC","","_","_"
3,"_","_","_","prahan","PPP","","_","_"
4,"yathā","_","_","yathā","CCM","","_","_"
5,"nagās","_","_","naga","NC","","_","_"
6,"tathā","_","_","tathā","CX","","_","_"
7,"gatā","_","_","ga","PPP","","_","_"
8,"gām","_","_","go","NC","","_","_"
9,"avaśā","_","_","avaśa","JJ","","_","_"
10,"vicūrṇitāḥ","_","_","vicūrṇay","PPP","","_","_"
1,"tato","_","_","tatas","CX","","_","_"
2,"'bhyavidhyad","_","_","abhivyadh","V","abhivyadh","_","_"
3,"bahubhiḥ","_","_","bahu","JJ","","_","_"
4,"śitaiḥ","_","_","śā","PPP","","_","_"
5,"śaraiḥ","_","_","śara","NC","","_","_"
6,"_","_","_","kuṇinda","NC","","_","_"
7,"_","_","_","putra","NC","","_","_"
8,"_","_","_","nakula","NC","","_","_"
9,"_","_","_","ātmaja","NC","","_","_"
10,"smayan","_","_","smi","KDP","","_","_"
1,"tato","_","_","tatas","CX","","_","_"
2,"'sya","_","_","ida","PRD","","_","_"
3,"kāyān","_","_","kāya","NC","","_","_"
4,"nicakarta","_","_","nikṛt","V","nikṛt","_","_"
5,"nākuliḥ","_","_","nākuli","NC","","_","_"
6,"śiraḥ","_","_","śiras","NC","","_","_"
7,"_","_","_","kṣura","NC","","_","_"
8,"_","_","_","ambuja","NC","","_","_"
9,"_","_","_","saṃnibha","JJ","","_","_"
10,"_","_","_","ānana","NC","","_","_"
1,"tataḥ","_","_","tatas","CX","","_","_"
2,"śatānīkam","_","_","śatānīka","NC","","_","_"
3,"avidhyad","_","_","vyadh","V","vyadh","_","_"
4,"āśugais","_","_","āśuga","NC","","_","_"
5,"tribhiḥ","_","_","tri","NUM","","_","_"
6,"śitaiḥ","_","_","śā","PPP","","_","_"
7,"_","_","_","karṇa","NC","","_","_"
8,"_","_","_","suta","NC","","_","_"
9,"'rjunaṃ","_","_","arjuna","NC","","_","_"
10,"tribhiḥ","_","_","tri","NUM","","_","_"
1,"tribhiś","_","_","tri","NUM","","_","_"
2,"ca","_","_","ca","CCD","","_","_"
3,"bhīmaṃ","_","_","bhīma","NC","","_","_"
4,"nakulaṃ","_","_","nakula","NC","","_","_"
5,"ca","_","_","ca","CCD","","_","_"
6,"saptabhir","_","_","saptan","NUM","","_","_"
7,"janārdanaṃ","_","_","janārdana","NC","","_","_"
8,"dvādaśabhiś","_","_","dvādaśan","NUM","","_","_"
9,"ca","_","_","ca","CCD","","_","_"
10,"sāyakaiḥ","_","_","sāyaka","NC","","_","_"
1,"tad","_","_","tad","PRD","","_","_"
2,"asya","_","_","ida","PRD","","_","_"
3,"_","_","_","karman","NC","","_","_"
4,"_","_","_","ati","CADP","","_","_"
5,"_","_","_","manuṣya","NC","","_","_"
6,"_","_","_","karman","NC","","_","_"
7,"samīkṣya","_","_","samīkṣ","CGDA","","_","_"
8,"hṛṣṭāḥ","_","_","hṛṣ","PPP","","_","_"
9,"kuravo","_","_","kuru","NC","","_","_"
10,"'bhyapūjayan","_","_","abhipūjay","V","abhipūjay","_","_"
1,"_","_","_","parākrama","NC","","_","_"
2,"_","_","_","jña","JJ","","_","_"
3,"tu","_","_","tu","CCD","","_","_"
4,"dhanaṃjayasya","_","_","dhanaṃjaya","NC","","_","_"
5,"te","_","_","tad","PRD","","_","_"
6,"huto","_","_","hu","PPP","","_","_"
7,"'yam","_","_","ida","PRD","","_","_"
8,"agnāv","_","_","agni","NC","","_","_"
9,"iti","_","_","iti","CQT","","_","_"
10,"taṃ","_","_","tad","PRD","","_","_"
11,"tu","_","_","tu","CCD","","_","_"
12,"menire","_","_","man","V","man","_","_"
1,"tataḥ","_","_","tatas","CX","","_","_"
2,"kirīṭī","_","_","kirīṭin","NC","","_","_"
3,"_","_","_","para","PPX","","_","_"
4,"_","_","_","vīra","NC","","_","_"
5,"_","_","_","ghātin","JJ","","_","_"
6,"_","_","_","han","PPP","","_","_"
7,"_","_","_","aśva","NC","","_","_"
8,"ālokya","_","_","ālokay","CGDA","","_","_"
9,"_","_","_","nara","NC","","_","_"
10,"_","_","_","pravīra","NC","","_","_"
1,"tam","_","_","tad","PRD","","_","_"
2,"abhyadhāvad","_","_","abhidhāv","V","abhidhāv","_","_"
3,"vṛṣasenam","_","_","vṛṣasa","NC","","_","_"
4,"āhave","_","_","āhava","NC","","_","_"
5,"sa","_","_","tad","PRD","","_","_"
6,"sūtajasya","_","_","sūtaja","NC","","_","_"
7,"pramukhe","_","_","pramukha","JJ","","_","_"
8,"sthitaṃ","_","_","sthā","PPP","","_","_"
9,"tadā","_","_","tadā","CAD","","_","_"
1,"tam","_","_","tad","PRD","","_","_"
2,"āpatantaṃ","_","_","āpat","KDP","","_","_"
3,"_","_","_","nara","NC","","_","_"
4,"_","_","_","vīra","NC","","_","_"
5,"ugraṃ","_","_","ugra","JJ","","_","_"
6,"_","_","_","mahat","JJ","","_","_"
7,"_","_","_","āhava","NC","","_","_"
8,"_","_","_","bāṇa","NC","","_","_"
9,"_","_","_","sahasra","NUM","","_","_"
10,"_","_","_","dhārin","JJ","","_","_"
1,"abhyāpatat","_","_","abhyāpat","V","abhyāpat","_","_"
2,"_","_","_","karṇa","NC","","_","_"
3,"_","_","_","suta","NC","","_","_"
4,"_","_","_","mahat","JJ","","_","_"
5,"_","_","_","ratha","NC","","_","_"
6,"_","_","_","yathā","CCM","","_","_"
7,"_","_","_","eva","CEM","","_","_"
8,"_","_","_","ca","CCD","","_","_"
9,"_","_","_","indra","NC","","_","_"
10,"namuciḥ","_","_","namuci","NC","","_","_"
11,"purātane","_","_","purātana","NC","","_","_"
1,"tato","_","_","tatas","CX","","_","_"
2,"_","_","_","adbhuta","JJ","","_","_"
3,"_","_","_","eka","PPX","","_","_"
4,"_","_","_","śata","NUM","","_","_"
5,"pārthaṃ","_","_","pārtha","NC","","_","_"
6,"śarair","_","_","śara","NC","","_","_"
7,"viddhvā","_","_","vyadh","CGDA","","_","_"
8,"sūtaputrasya","_","_","sūtaputra","NC","","_","_"
9,"putraḥ","_","_","putra","NC","","_","_"
1,"nanāda","_","_","nad","V","nad","_","_"
2,"nādaṃ","_","_","nāda","NC","","_","_"
3,"_","_","_","su","CAD","","_","_"
4,"_","_","_","mahat","JJ","","_","_"
5,"_","_","_","anubhāva","NC","","_","_"
6,"_","_","_","vyadh","CGDA","","_","_"
7,"_","_","_","iva","CCM","","_","_"
8,"śakraṃ","_","_","śakra","NC","","_","_"
9,"namuciḥ","_","_","namuci","NC","","_","_"
10,"purā","_","_","purā","CX","","_","_"
11,"vai","_","_","vai","CX","","_","_"
1,"punaḥ","_","_","punar","CAD","","_","_"
2,"sa","_","_","tad","PRD","","_","_"
3,"pārthaṃ","_","_","pārtha","NC","","_","_"
4,"vṛṣasena","_","_","vṛṣasa","NC","","_","_"
5,"ugrair","_","_","ugra","JJ","","_","_"
6,"bāṇair","_","_","bāṇa","NC","","_","_"
7,"avidhyad","_","_","vyadh","V","vyadh","_","_"
8,"_","_","_","bhujamūla","NC","","_","_"
9,"_","_","_","madhya","NC","","_","_"
1,"_","_","_","tathā","CX","","_","_"
2,"_","_","_","eva","CEM","","_","_"
3,"kṛṣṇaṃ","_","_","kṛṣṇa","NC","","_","_"
4,"navabhiḥ","_","_","navan","NUM","","_","_"
5,"samārdayat","_","_","samarday","V","samarday","_","_"
6,"punaś","_","_","punar","CAD","","_","_"
7,"ca","_","_","ca","CCD","","_","_"
8,"pārthaṃ","_","_","pārtha","NC","","_","_"
9,"daśabhiḥ","_","_","daśan","NUM","","_","_"
10,"_","_","_","śā","PPP","","_","_"
11,"_","_","_","agra","NC","","_","_"
1,"tataḥ","_","_","tatas","CX","","_","_"
2,"kirīṭī","_","_","kirīṭin","NC","","_","_"
3,"_","_","_","raṇa","NC","","_","_"
4,"_","_","_","mūrdhan","NC","","_","_"
5,"kopāt","_","_","kopa","NC","","_","_"
6,"kṛtvā","_","_","kṛ","CGDA","","_","_"
7,"_","_","_","tri","NUM","","_","_"
8,"_","_","_","śākhā","NC","","_","_"
9,"bhrukuṭiṃ","_","_","bhrukuṭi","NC","","_","_"
10,"lalāṭe","_","_","lalāṭa","NC","","_","_"
1,"mumoca","_","_","muñc","V","muc","_","_"
2,"bāṇān","_","_","bāṇa","NC","","_","_"
3,"viśikhān","_","_","viśikha","NC","","_","_"
4,"mahātmā","_","_","mahātman","JJ","","_","_"
5,"vadhāya","_","_","vadha","NC","","_","_"
6,"rājan","_","_","rājan","NC","","_","_"
7,"sūtaputrasya","_","_","sūtaputra","NC","","_","_"
8,"saṃkhye","_","_","saṃkhya","NC","","_","_"
1,"vivyādha","_","_","vyadh","V","vyadh","_","_"
2,"_","_","_","ca","CCD","","_","_"
3,"_","_","_","a","PRD","","_","_"
4,"daśabhiḥ","_","_","daśan","NUM","","_","_"
5,"pṛṣatkair","_","_","pṛṣatka","NC","","_","_"
6,"marmasv","_","_","marman","NC","","_","_"
7,"asaktaṃ","_","_","asakta","JJ","","_","_"
8,"prasabhaṃ","_","_","prasabha","CX","","_","_"
9,"kirīṭī","_","_","kirīṭin","NC","","_","_"
1,"cicheda","_","_","chid","V","chid","_","_"
2,"_","_","_","ca","CCD","","_","_"
3,"_","_","_","ida","PRD","","_","_"
4,"_","_","_","iṣvasana","NC","","_","_"
5,"bhujau","_","_","bhuja","NC","","_","_"
6,"ca","_","_","ca","CCD","","_","_"
7,"kṣuraiś","_","_","kṣura","NC","","_","_"
8,"caturbhiḥ","_","_","catur","NUM","","_","_"
9,"śira","_","_","śiras","NC","","_","_"
10,"eva","_","_","eva","CEM","","_","_"
11,"_","_","_","ca","CCD","","_","_"
12,"_","_","_","ugra","JJ","","_","_"
1,"sa","_","_","tad","PRD","","_","_"
2,"_","_","_","pārtha","NC","","_","_"
3,"_","_","_","bāṇa","NC","","_","_"
4,"_","_","_","abhihan","PPP","","_","_"
5,"papāta","_","_","pat","V","pat","_","_"
6,"rathād","_","_","ratha","NC","","_","_"
7,"vibāhur","_","_","vibāhu","JJ","","_","_"
8,"viśirā","_","_","viśiras","JJ","","_","_"
9,"dharāyām","_","_","dharā","NC","","_","_"
1,"_","_","_","su","CAD","","_","_"
2,"_","_","_","puṣpita","JJ","","_","_"
3,"_","_","_","parṇa","NC","","_","_"
4,"_","_","_","dhara","JJ","","_","_"
5,"_","_","_","ati","CADP","","_","_"
6,"_","_","_","kāya","NC","","_","_"
7,"_","_","_","vāta","NC","","_","_"
8,"_","_","_","īray","PPP","","_","_"
9,"śāla","_","_","śāla","NC","","_","_"
10,"_","_","_","iva","CCM","","_","_"
11,"_","_","_","adri","NC","","_","_"
12,"_","_","_","śṛṅga","NC","","_","_"
1,"taṃ","_","_","tad","PRD","","_","_"
2,"prekṣya","_","_","prekṣ","CGDA","","_","_"
3,"_","_","_","bāṇa","NC","","_","_"
4,"_","_","_","abhihan","PPP","","_","_"
5,"patantaṃ","_","_","pat","KDP","","_","_"
6,"rathāt","_","_","ratha","NC","","_","_"
7,"sutaṃ","_","_","suta","NC","","_","_"
8,"sūtajaḥ","_","_","sūtaja","NC","","_","_"
9,"kṣiprakārī","_","_","kṣiprakārin","JJ","","_","_"
1,"rathaṃ","_","_","ratha","NC","","_","_"
2,"_","_","_","ratha","NC","","_","_"
3,"_","_","_","āśu","CX","","_","_"
4,"jagāma","_","_","ga","V","ga","_","_"
5,"vegāt","_","_","vega","NC","","_","_"
6,"kirīṭinaḥ","_","_","kirīṭin","NC","","_","_"
7,"_","_","_","putra","NC","","_","_"
8,"_","_","_","vadha","NC","","_","_"
9,"_","_","_","abhitap","PPP","","_","_"
