"WordID","word","NormSTEM","suffix","lemma","PoS","Root","NormSuffix","NormWord"
1,"īṅkhayantīr","_","_","īṅkhay","KDP","","_","_"
2,"apasyuva","_","_","apasyu","JJ","","_","_"
3,"indraṃ","_","_","indra","NC","","_","_"
4,"jātam","_","_","jan","PPP","","_","_"
5,"upāsate","_","_","ās","V","ās","_","_"
1,"bhejānāsaḥ","_","_","bhaj","KDP","","_","_"
2,"_","_","_","su","CAD","","_","_"
3,"_","_","_","vīrya","NC","","_","_"
1,"tvam","_","_","tvat","PPR","","_","_"
2,"indra","_","_","indra","NC","","_","_"
3,"balād","_","_","bala","NC","","_","_"
4,"adhi","_","_","adhi","CADP","","_","_"
5,"sahaso","_","_","sahas","NC","","_","_"
6,"jāta","_","_","jan","PPP","","_","_"
7,"ojasaḥ","_","_","ojas","NC","","_","_"
1,"tvaṃ","_","_","tvat","PPR","","_","_"
2,"vṛṣan","_","_","vṛṣan","NC","","_","_"
3,"_","_","_","vṛṣan","NC","","_","_"
4,"_","_","_","id","CEM","","_","_"
5,"asi","_","_","as","V","as","_","_"
1,"tvam","_","_","tvat","PPR","","_","_"
2,"_","_","_","indra","NC","","_","_"
3,"_","_","_","as","V","as","_","_"
4,"vṛtrahā","_","_","vṛtrahan","NC","","_","_"
5,"vy","_","_","vi","CADP","","_","_"
6,"antarikṣam","_","_","antarikṣa","NC","","_","_"
7,"atiraḥ","_","_","tar","V","tṛ","_","_"
1,"ud","_","_","ud","CADP","","_","_"
2,"dyām","_","_","div","NC","","_","_"
3,"astabhnā","_","_","stambh","V","stambh","_","_"
4,"ojasā","_","_","ojas","NC","","_","_"
1,"tvam","_","_","tvat","PPR","","_","_"
2,"indra","_","_","indra","NC","","_","_"
3,"sajoṣasam","_","_","sajoṣas","JJ","","_","_"
4,"arkam","_","_","arka","NC","","_","_"
5,"bibharṣi","_","_","bhṛ","V","bhṛ","_","_"
6,"bāhvoḥ","_","_","bāhu","NC","","_","_"
1,"vajraṃ","_","_","vajra","NC","","_","_"
2,"śiśāna","_","_","śā","KDP","","_","_"
3,"ojasā","_","_","ojas","NC","","_","_"
1,"tvam","_","_","tvat","PPR","","_","_"
2,"indrābhibhūr","_","_","as","V","as","_","_"
3,"asi","_","_","viśva","JQ","","_","_"
4,"viśvā","_","_","jāta","NC","","_","_"
5,"jātāny","_","_","ojas","NC","","_","_"
1,"sa","_","_","tad","PRD","","_","_"
2,"viśvā","_","_","viśva","JQ","","_","_"
3,"bhuva","_","_","bhū","NC","","_","_"
4,"ābhavaḥ","_","_","ābhav","V","ābhū","_","_"
