"WordID","word","NormSTEM","suffix","lemma","PoS","Root","NormSuffix","NormWord"
1,"duryodhana","_","_","duryodhana","NC","","_","_"
2,"uvāca","_","_","vak","V","vac","_","_"
1,"kathaṃ","_","_","katha","CX","","_","_"
2,"śikhaṇḍī","_","_","śikhaṇḍin","NC","","_","_"
3,"gāṅgeya","_","_","gāṅgeya","NC","","_","_"
4,"kanyā","_","_","kanyā","NC","","_","_"
5,"bhūtvā","_","_","bhū","CGDA","","_","_"
6,"satī","_","_","as","KDP","","_","_"
7,"tadā","_","_","tadā","CAD","","_","_"
1,"puruṣo","_","_","puruṣa","NC","","_","_"
2,"'bhavad","_","_","bhav","V","bhū","_","_"
3,"yudhi","_","_","yudh","NC","","_","_"
4,"śreṣṭha","_","_","śreṣṭha","JJ","","_","_"
5,"_","_","_","tad","PRD","","_","_"
6,"_","_","_","mat","PPR","","_","_"
7,"brūhi","_","_","abravīta","V","brū","_","_"
8,"pitāmaha","_","_","pitāmaha","NC","","_","_"
1,"bhīṣma","_","_","bhīṣma","NC","","_","_"
2,"uvāca","_","_","vak","V","vac","_","_"
1,"bhāryā","_","_","bhāryā","NC","","_","_"
2,"tu","_","_","tu","CCD","","_","_"
3,"tasya","_","_","tad","PRD","","_","_"
4,"_","_","_","rājan","NC","","_","_"
5,"_","_","_","indra","NC","","_","_"
6,"drupadasya","_","_","drupada","NC","","_","_"
7,"mahīpateḥ","_","_","mahīpati","NC","","_","_"
1,"mahiṣī","_","_","mahiṣī","NC","","_","_"
2,"dayitā","_","_","dayita","JJ","","_","_"
3,"_","_","_","hi","CX","","_","_"
4,"_","_","_","as","V","as","_","_"
5,"aputrā","_","_","aputra","JJ","","_","_"
6,"ca","_","_","ca","CCD","","_","_"
7,"viśāṃ","_","_","viś","NC","","_","_"
8,"pate","_","_","pati","NC","","_","_"
1,"etasmin","_","_","tad","PRD","","_","_"
2,"eva","_","_","eva","CEM","","_","_"
3,"kāle","_","_","kāla","NC","","_","_"
4,"tu","_","_","tu","CCD","","_","_"
5,"drupado","_","_","drupada","NC","","_","_"
6,"vai","_","_","vai","CX","","_","_"
7,"mahīpatiḥ","_","_","mahīpati","NC","","_","_"
1,"_","_","_","apatya","NC","","_","_"
2,"_","_","_","artha","NC","","_","_"
3,"_","_","_","mahat","JJ","","_","_"
4,"_","_","_","rāja","NC","","_","_"
5,"toṣayāmāsa","_","_","toṣay","V","toṣay","_","_"
6,"śaṃkaram","_","_","śaṃkara","NC","","_","_"
1,"_","_","_","mat","PPR","","_","_"
2,"_","_","_","vadha","NC","","_","_"
3,"_","_","_","artha","NC","","_","_"
4,"niścitya","_","_","niści","CGDA","","_","_"
5,"tapo","_","_","tapas","NC","","_","_"
6,"ghoraṃ","_","_","ghora","JJ","","_","_"
7,"samāsthitaḥ","_","_","samāsthā","PPP","","_","_"
1,"lebhe","_","_","labh","V","labh","_","_"
2,"kanyāṃ","_","_","kanyā","NC","","_","_"
3,"mahādevāt","_","_","mahādeva","NC","","_","_"
4,"putro","_","_","putra","NC","","_","_"
5,"me","_","_","mat","PPR","","_","_"
6,"syād","_","_","as","V","as","_","_"
7,"iti","_","_","iti","CQT","","_","_"
8,"bruvan","_","_","brū","KDP","","_","_"
1,"bhagavan","_","_","bhagavat","NC","","_","_"
2,"putram","_","_","putra","NC","","_","_"
3,"icchāmi","_","_","iṣ","V","iṣ","_","_"
4,"bhīṣmaṃ","_","_","bhīṣma","NC","","_","_"
5,"praticikīrṣayā","_","_","praticikīrṣā","NC","","_","_"
1,"_","_","_","iti","CQT","","_","_"
2,"_","_","_","vac","PPP","","_","_"
3,"devadevena","_","_","devadeva","NC","","_","_"
4,"_","_","_","strī","NC","","_","_"
5,"_","_","_","puṃs","NC","","_","_"
6,"_","_","_","tvat","PPR","","_","_"
7,"bhaviṣyati","_","_","bhav","V","bhū","_","_"
1,"nivartasva","_","_","nivart","V","nivṛt","_","_"
2,"mahīpāla","_","_","mahīpāla","NC","","_","_"
3,"_","_","_","na","CNG","","_","_"
4,"_","_","_","tad","PRD","","_","_"
5,"_","_","_","jātu","CX","","_","_"
6,"_","_","_","anyathā","CX","","_","_"
7,"bhavet","_","_","bhav","V","bhū","_","_"
1,"sa","_","_","tad","PRD","","_","_"
2,"tu","_","_","tu","CCD","","_","_"
3,"gatvā","_","_","ga","CGDA","","_","_"
4,"ca","_","_","ca","CCD","","_","_"
5,"nagaraṃ","_","_","nagara","NC","","_","_"
6,"bhāryām","_","_","bhāryā","NC","","_","_"
7,"idam","_","_","ida","PRD","","_","_"
8,"uvāca","_","_","vak","V","vac","_","_"
9,"ha","_","_","ha","CEM","","_","_"
1,"kṛto","_","_","kṛ","PPP","","_","_"
2,"yatno","_","_","yatna","NC","","_","_"
3,"mayā","_","_","mat","PPR","","_","_"
4,"devi","_","_","devī","NC","","_","_"
5,"_","_","_","putra","NC","","_","_"
6,"_","_","_","artha","NC","","_","_"
7,"tapasā","_","_","tapas","NC","","_","_"
8,"mahān","_","_","mahat","JJ","","_","_"
1,"kanyā","_","_","kanyā","NC","","_","_"
2,"bhūtvā","_","_","bhū","CGDA","","_","_"
3,"pumān","_","_","puṃs","NC","","_","_"
4,"bhāvī","_","_","bhāvin","JJ","","_","_"
5,"iti","_","_","iti","CQT","","_","_"
6,"_","_","_","ca","CCD","","_","_"
7,"_","_","_","vac","PPP","","_","_"
8,"'smi","_","_","as","V","as","_","_"
9,"śaṃbhunā","_","_","śambhu","NC","","_","_"
1,"punaḥ","_","_","punar","CAD","","_","_"
2,"punar","_","_","punar","CAD","","_","_"
3,"yācyamāno","_","_","yāc","KDP","","_","_"
4,"diṣṭam","_","_","diṣṭa","NC","","_","_"
5,"_","_","_","iti","CQT","","_","_"
6,"_","_","_","abravīta","V","brū","_","_"
7,"_","_","_","śiva","NC","","_","_"
1,"na","_","_","na","CNG","","_","_"
2,"tad","_","_","tad","PRD","","_","_"
3,"_","_","_","anya","PPX","","_","_"
4,"_","_","_","hi","CX","","_","_"
5,"bhavitā","_","_","bhav","V","bhū","_","_"
6,"bhavitavyaṃ","_","_","bhū","KDG","","_","_"
7,"hi","_","_","hi","CX","","_","_"
8,"tat","_","_","tad","PRD","","_","_"
9,"tathā","_","_","tathā","CX","","_","_"
1,"tataḥ","_","_","tatas","CX","","_","_"
2,"sā","_","_","tad","PRD","","_","_"
3,"niyatā","_","_","niya","PPP","","_","_"
4,"bhūtvā","_","_","bhū","CGDA","","_","_"
5,"_","_","_","ṛtu","NC","","_","_"
6,"_","_","_","kāla","NC","","_","_"
7,"manasvinī","_","_","manasvin","JJ","","_","_"
1,"patnī","_","_","patnī","NC","","_","_"
2,"_","_","_","drupada","NC","","_","_"
3,"_","_","_","rāja","NC","","_","_"
4,"drupadaṃ","_","_","drupada","NC","","_","_"
5,"saṃviveśa","_","_","saṃviś","V","saṃviś","_","_"
6,"ha","_","_","ha","CEM","","_","_"
1,"lebhe","_","_","labh","V","labh","_","_"
2,"garbhaṃ","_","_","garbha","NC","","_","_"
3,"yathākālaṃ","_","_","yathākāla","CX","","_","_"
4,"_","_","_","vidhi","NC","","_","_"
5,"_","_","_","dṛś","PPP","","_","_"
6,"hetunā","_","_","hetu","NC","","_","_"
1,"pārṣatāt","_","_","pārṣata","NC","","_","_"
2,"sā","_","_","tad","PRD","","_","_"
3,"mahīpāla","_","_","mahīpāla","NC","","_","_"
4,"yathā","_","_","yathā","CCM","","_","_"
5,"māṃ","_","_","mat","PPR","","_","_"
6,"nārado","_","_","nārada","NC","","_","_"
7,"'bravīt","_","_","abravīta","V","brū","_","_"
1,"tato","_","_","tatas","CX","","_","_"
2,"dadhāra","_","_","dhar","V","dhṛ","_","_"
3,"taṃ","_","_","tad","PRD","","_","_"
4,"garbhaṃ","_","_","garbha","NC","","_","_"
5,"devī","_","_","devī","NC","","_","_"
6,"_","_","_","rājīva","NC","","_","_"
7,"_","_","_","locana","NC","","_","_"
1,"tāṃ","_","_","tad","PRD","","_","_"
2,"sa","_","_","tad","PRD","","_","_"
3,"rājā","_","_","rājan","NC","","_","_"
4,"priyāṃ","_","_","priya","JJ","","_","_"
5,"bhāryāṃ","_","_","bhāryā","NC","","_","_"
6,"drupadaḥ","_","_","drupada","NC","","_","_"
7,"_","_","_","kuru","NC","","_","_"
8,"_","_","_","nandana","NC","","_","_"
1,"_","_","_","putra","NC","","_","_"
2,"_","_","_","sneha","NC","","_","_"
3,"_","_","_","mahat","JJ","","_","_"
4,"_","_","_","bāhu","NC","","_","_"
5,"sukhaṃ","_","_","sukha","CX","","_","_"
6,"paryacarat","_","_","paricar","V","paricar","_","_"
7,"tadā","_","_","tadā","CAD","","_","_"
1,"aputrasya","_","_","aputra","JJ","","_","_"
2,"tato","_","_","tatas","CX","","_","_"
3,"rājño","_","_","rājan","NC","","_","_"
4,"drupadasya","_","_","drupada","NC","","_","_"
5,"mahīpateḥ","_","_","mahīpati","NC","","_","_"
1,"kanyāṃ","_","_","kanyā","NC","","_","_"
2,"_","_","_","pravara","JJ","","_","_"
3,"_","_","_","rūpa","NC","","_","_"
4,"tāṃ","_","_","tad","PRD","","_","_"
5,"prājāyata","_","_","prajan","V","prajan","_","_"
6,"narādhipa","_","_","narādhipa","NC","","_","_"
1,"aputrasya","_","_","aputra","JJ","","_","_"
2,"tu","_","_","tu","CCD","","_","_"
3,"rājñaḥ","_","_","rājan","NC","","_","_"
4,"sā","_","_","tad","PRD","","_","_"
5,"drupadasya","_","_","drupada","NC","","_","_"
6,"yaśasvinī","_","_","yaśasvin","JJ","","_","_"
1,"khyāpayāmāsa","_","_","khyāpay","V","khyāpay","_","_"
2,"_","_","_","rājan","NC","","_","_"
3,"_","_","_","indra","NC","","_","_"
4,"putro","_","_","putra","NC","","_","_"
5,"jāto","_","_","jan","PPP","","_","_"
6,"_","_","_","mat","PPR","","_","_"
7,"_","_","_","iti","CQT","","_","_"
8,"vai","_","_","vai","CX","","_","_"
1,"tataḥ","_","_","tatas","CX","","_","_"
2,"sa","_","_","tad","PRD","","_","_"
3,"rājā","_","_","rājan","NC","","_","_"
4,"drupadaḥ","_","_","drupada","NC","","_","_"
5,"pracchannāyā","_","_","pracchad","PPP","","_","_"
6,"narādhipa","_","_","narādhipa","NC","","_","_"
1,"_","_","_","putra","NC","","_","_"
2,"_","_","_","vat","CX","","_","_"
3,"_","_","_","putra","NC","","_","_"
4,"_","_","_","kārya","NC","","_","_"
5,"sarvāṇi","_","_","sarva","JQ","","_","_"
6,"samakārayat","_","_","saṃkāray","V","saṃkāray","_","_"
1,"rakṣaṇaṃ","_","_","rakṣaṇa","NC","","_","_"
2,"_","_","_","ca","CCD","","_","_"
3,"_","_","_","eva","CEM","","_","_"
4,"mantrasya","_","_","mantra","NC","","_","_"
5,"mahiṣī","_","_","mahiṣī","NC","","_","_"
6,"drupadasya","_","_","drupada","NC","","_","_"
7,"sā","_","_","tad","PRD","","_","_"
1,"cakāra","_","_","kar","V","kṛ","_","_"
2,"_","_","_","sarva","JQ","","_","_"
3,"_","_","_","yatna","NC","","_","_"
4,"bruvāṇā","_","_","brū","KDP","","_","_"
5,"putra","_","_","putra","NC","","_","_"
6,"_","_","_","iti","CQT","","_","_"
7,"_","_","_","uta","CCD","","_","_"
1,"na","_","_","na","CNG","","_","_"
2,"hi","_","_","hi","CX","","_","_"
3,"tāṃ","_","_","tad","PRD","","_","_"
4,"veda","_","_","vid","V","vid","_","_"
5,"nagare","_","_","nagara","NC","","_","_"
6,"kaścid","_","_","kiṃcit","PRI","","_","_"
7,"anyatra","_","_","anyatra","CX","","_","_"
8,"pārṣatāt","_","_","pārṣata","NC","","_","_"
1,"śraddadhāno","_","_","śraddhā","KDP","","_","_"
2,"hi","_","_","hi","CX","","_","_"
3,"tad","_","_","tad","PRD","","_","_"
4,"vākyaṃ","_","_","vākya","NC","","_","_"
5,"_","_","_","deva","NC","","_","_"
6,"_","_","_","adbhuta","JJ","","_","_"
7,"_","_","_","tejas","NC","","_","_"
1,"chādayāmāsa","_","_","chāday","V","chāday","_","_"
2,"tāṃ","_","_","tad","PRD","","_","_"
3,"kanyāṃ","_","_","kanyā","NC","","_","_"
4,"pumān","_","_","puṃs","NC","","_","_"
5,"iti","_","_","iti","CQT","","_","_"
6,"ca","_","_","ca","CCD","","_","_"
7,"so","_","_","tad","PRD","","_","_"
8,"'bravīt","_","_","abravīta","V","brū","_","_"
1,"jātakarmāṇi","_","_","jātakarman","NC","","_","_"
2,"sarvāṇi","_","_","sarva","JQ","","_","_"
3,"kārayāmāsa","_","_","kāray","V","kāray","_","_"
4,"pārthivaḥ","_","_","pārthiva","NC","","_","_"
1,"puṃvad","_","_","puṃvat","CX","","_","_"
2,"_","_","_","vidhāna","NC","","_","_"
3,"_","_","_","yuj","PPP","","_","_"
4,"_","_","_","śikhaṇḍin","NC","","_","_"
5,"_","_","_","iti","CQT","","_","_"
6,"ca","_","_","ca","CCD","","_","_"
7,"tāṃ","_","_","tad","PRD","","_","_"
8,"viduḥ","_","_","vid","V","vid","_","_"
1,"aham","_","_","mat","PPR","","_","_"
2,"_","_","_","eka","PPX","","_","_"
3,"_","_","_","tu","CCD","","_","_"
4,"cāreṇa","_","_","cāra","NC","","_","_"
5,"_","_","_","vacana","NC","","_","_"
6,"_","_","_","nārada","NC","","_","_"
7,"ca","_","_","ca","CCD","","_","_"
1,"jñātavān","_","_","jñā","KDP","","_","_"
2,"_","_","_","deva","NC","","_","_"
3,"_","_","_","vākya","NC","","_","_"
4,"_","_","_","ambā","NC","","_","_"
5,"_","_","_","tapas","NC","","_","_"
6,"tathā","_","_","tathā","CX","","_","_"
