"WordID","word","NormSTEM","suffix","lemma","PoS","Root","NormSuffix","NormWord"
1,"_","_","_","dhārā","NC","","_","_"
2,"_","_","_","vara","NC","","_","_"
3,"maruto","_","_","marut","NC","","_","_"
4,"_","_","_","dhṛṣṇu","JJ","","_","_"
5,"_","_","_","ojas","NC","","_","_"
6,"mṛgā","_","_","mṛga","NC","","_","_"
7,"na","_","_","na","CNG","","_","_"
8,"bhīmās","_","_","bhīma","JJ","","_","_"
9,"taviṣībhir","_","_","taviṣī","NC","","_","_"
10,"arcinaḥ","_","_","arcin","JJ","","_","_"
1,"agnayo","_","_","agni","NC","","_","_"
2,"na","_","_","na","CNG","","_","_"
3,"śuśucānā","_","_","śuc","KDP","","_","_"
4,"ṛjīṣiṇo","_","_","ṛjīṣin","JJ","","_","_"
5,"bhṛmiṃ","_","_","bhṛmi","NC","","_","_"
6,"dhamanto","_","_","dha","KDP","","_","_"
7,"apa","_","_","apa","CX","","_","_"
8,"gā","_","_","go","NC","","_","_"
9,"avṛṇvata","_","_","vṛ","V","vṛ","_","_"
1,"dyāvo","_","_","div","NC","","_","_"
2,"na","_","_","na","CNG","","_","_"
3,"stṛbhiś","_","_","star","NC","","_","_"
4,"citayanta","_","_","citay","V","citay","_","_"
5,"khādino","_","_","khādin","JJ","","_","_"
6,"vy","_","_","vi","CADP","","_","_"
7,"abhriyā","_","_","abhriya","JJ","","_","_"
8,"na","_","_","na","CNG","","_","_"
9,"dyutayanta","_","_","dyutay","V","dyutay","_","_"
10,"vṛṣṭayaḥ","_","_","vṛṣṭi","NC","","_","_"
1,"rudro","_","_","rudra","NC","","_","_"
2,"yad","_","_","yat","CSB","","_","_"
3,"vo","_","_","tvat","PPR","","_","_"
4,"maruto","_","_","marut","NC","","_","_"
5,"_","_","_","rukma","NC","","_","_"
6,"_","_","_","vakṣas","NC","","_","_"
7,"_","_","_","vṛṣan","NC","","_","_"
8,"_","_","_","jan","V","jan","_","_"
9,"pṛśnyāḥ","_","_","pṛśni","NC","","_","_"
10,"śukra","_","_","śukra","JJ","","_","_"
11,"ūdhani","_","_","ūdhas","NC","","_","_"
1,"ukṣante","_","_","ukṣ","V","ukṣ","_","_"
2,"aśvāṁ","_","_","aśva","NC","","_","_"
3,"atyāṁ","_","_","atya","NC","","_","_"
4,"_","_","_","iva","CCM","","_","_"
5,"_","_","_","āji","NC","","_","_"
6,"nadasya","_","_","nada","NC","","_","_"
7,"karṇais","_","_","karṇa","NC","","_","_"
8,"turayanta","_","_","turay","V","turay","_","_"
9,"āśubhiḥ","_","_","āśu","JJ","","_","_"
1,"_","_","_","hiraṇya","JJ","","_","_"
2,"_","_","_","śiprā","NC","","_","_"
3,"maruto","_","_","marut","NC","","_","_"
4,"davidhvataḥ","_","_","dodhu","KDP","","_","_"
5,"pṛkṣaṃ","_","_","pṛkṣa","NC","","_","_"
6,"yātha","_","_","yā","V","yā","_","_"
7,"pṛṣatībhiḥ","_","_","pṛṣatī","NC","","_","_"
8,"samanyavaḥ","_","_","samanyu","JJ","","_","_"
1,"pṛkṣe","_","_","pṛkṣ","NC","","_","_"
2,"tā","_","_","tad","PRD","","_","_"
3,"viśvā","_","_","viśva","JQ","","_","_"
4,"bhuvanā","_","_","bhuvana","NC","","_","_"
5,"vavakṣire","_","_","vakṣ","V","vakṣ","_","_"
6,"mitrāya","_","_","mitra","NC","","_","_"
7,"vā","_","_","vā","CCD","","_","_"
8,"sadam","_","_","sada","CAD","","_","_"
9,"ā","_","_","ā","CADP","","_","_"
10,"_","_","_","jīra","JJ","","_","_"
11,"_","_","_","dānu","JJ","","_","_"
1,"_","_","_","pṛṣat","JJ","","_","_"
2,"_","_","_","aśva","NC","","_","_"
3,"_","_","_","anavabhra","JJ","","_","_"
4,"_","_","_","rādhas","NC","","_","_"
5,"ṛjipyāso","_","_","ṛjipya","JJ","","_","_"
6,"na","_","_","na","CNG","","_","_"
7,"vayuneṣu","_","_","vayuna","JJ","","_","_"
8,"dhūrṣadaḥ","_","_","dhūrṣad","JJ","","_","_"
1,"indhanvabhir","_","_","indhanvan","JJ","","_","_"
2,"dhenubhī","_","_","dhenu","NC","","_","_"
3,"_","_","_","rapś","KDP","","_","_"
4,"_","_","_","ūdhas","NC","","_","_"
5,"adhvasmabhiḥ","_","_","adhvasman","JJ","","_","_"
6,"pathibhir","_","_","pathin","NC","","_","_"
7,"_","_","_","bhrāj","KDP","","_","_"
8,"_","_","_","ṛṣṭi","NC","","_","_"
1,"ā","_","_","ā","CADP","","_","_"
2,"haṃsāso","_","_","haṃsa","NC","","_","_"
3,"na","_","_","na","CNG","","_","_"
4,"svasarāṇi","_","_","svasara","NC","","_","_"
5,"gantana","_","_","ga","V","ga","_","_"
6,"madhor","_","_","madhu","NC","","_","_"
7,"madāya","_","_","mada","NC","","_","_"
8,"marutaḥ","_","_","marut","NC","","_","_"
9,"samanyavaḥ","_","_","samanyu","JJ","","_","_"
1,"ā","_","_","ā","CADP","","_","_"
2,"no","_","_","mat","PPR","","_","_"
3,"brahmāṇi","_","_","brahman","NC","","_","_"
4,"marutaḥ","_","_","marut","NC","","_","_"
5,"samanyavo","_","_","samanyu","JJ","","_","_"
6,"narāṃ","_","_","nṛ","NC","","_","_"
7,"na","_","_","na","CNG","","_","_"
8,"śaṃsaḥ","_","_","śaṃsa","NC","","_","_"
9,"savanāni","_","_","savana","NC","","_","_"
10,"gantana","_","_","ga","V","ga","_","_"
1,"aśvām","_","_","aśvā","NC","","_","_"
2,"iva","_","_","iva","CCM","","_","_"
3,"pipyata","_","_","pyā","V","pyā","_","_"
4,"dhenum","_","_","dhenu","NC","","_","_"
5,"ūdhani","_","_","ūdhas","NC","","_","_"
6,"kartā","_","_","kar","V","kṛ","_","_"
7,"dhiyaṃ","_","_","dhī","NC","","_","_"
8,"jaritre","_","_","jaritṛ","NC","","_","_"
9,"_","_","_","vāja","NC","","_","_"
10,"_","_","_","peśas","NC","","_","_"
1,"taṃ","_","_","tad","PRD","","_","_"
2,"no","_","_","mat","PPR","","_","_"
3,"dāta","_","_","dad","V","dā","_","_"
4,"maruto","_","_","marut","NC","","_","_"
5,"vājinaṃ","_","_","vājin","NC","","_","_"
6,"ratha","_","_","ratha","NC","","_","_"
7,"āpānam","_","_","āp","KDP","","_","_"
8,"brahma","_","_","brahman","NC","","_","_"
9,"citayad","_","_","citay","KDP","","_","_"
10,"dive","_","_","diva","NC","","_","_"
11,"dive","_","_","diva","NC","","_","_"
1,"iṣaṃ","_","_","iṣ","NC","","_","_"
2,"stotṛbhyo","_","_","stotṛ","JJ","","_","_"
3,"vṛjaneṣu","_","_","vṛjana","NC","","_","_"
4,"kārave","_","_","kāru","NC","","_","_"
5,"sanim","_","_","sani","NC","","_","_"
6,"medhām","_","_","medhā","NC","","_","_"
7,"a","_","_","alpha_privativum","JJ","","_","_"
7,"ariṣṭaṃ","_","_","riṣṭa","JJ","","_","_"
8,"duṣṭaraṃ","_","_","duṣṭara","JJ","","_","_"
9,"sahaḥ","_","_","sahas","NC","","_","_"
1,"yad","_","_","yat","CSB","","_","_"
2,"yuñjate","_","_","yuj","V","yuj","_","_"
3,"maruto","_","_","marut","NC","","_","_"
4,"_","_","_","rukma","NC","","_","_"
5,"_","_","_","vakṣas","NC","","_","_"
6,"'śvān","_","_","aśva","NC","","_","_"
7,"ratheṣu","_","_","ratha","NC","","_","_"
8,"bhaga","_","_","bhaga","NC","","_","_"
9,"ā","_","_","ā","CADP","","_","_"
10,"sudānavaḥ","_","_","sudānu","JJ","","_","_"
1,"dhenur","_","_","dhenu","NC","","_","_"
2,"na","_","_","na","CNG","","_","_"
3,"śiśve","_","_","śiśu","NC","","_","_"
4,"svasareṣu","_","_","svasara","NC","","_","_"
5,"pinvate","_","_","pinv","V","pinv","_","_"
6,"janāya","_","_","jana","NC","","_","_"
7,"_","_","_","rā","PPP","","_","_"
8,"_","_","_","havis","NC","","_","_"
9,"mahīm","_","_","mah","JJ","","_","_"
10,"iṣam","_","_","iṣ","NC","","_","_"
1,"yo","_","_","yad","PRL","","_","_"
2,"no","_","_","mat","PPR","","_","_"
3,"maruto","_","_","marut","NC","","_","_"
4,"vṛkatāti","_","_","vṛkatāti","NC","","_","_"
5,"martyo","_","_","martya","JJ","","_","_"
6,"ripur","_","_","ripu","NC","","_","_"
7,"dadhe","_","_","dadh","V","dhā","_","_"
8,"vasavo","_","_","vasu","JJ","","_","_"
9,"rakṣatā","_","_","rakṣ","V","rakṣ","_","_"
10,"riṣaḥ","_","_","riṣ","NC","","_","_"
1,"vartayata","_","_","vartay","V","vartay","_","_"
2,"tapuṣā","_","_","tapus","NC","","_","_"
3,"_","_","_","cakrī","NC","","_","_"
4,"_","_","_","abhi","CADP","","_","_"
5,"tam","_","_","tad","PRD","","_","_"
6,"ava","_","_","ava","CX","","_","_"
7,"rudrā","_","_","rudra","NC","","_","_"
8,"aśaso","_","_","aśas","JJ","","_","_"
9,"hantanā","_","_","han","V","han","_","_"
10,"vadhaḥ","_","_","vadhar","NC","","_","_"
1,"citraṃ","_","_","citra","JJ","","_","_"
2,"tad","_","_","tad","PRD","","_","_"
3,"vo","_","_","tvat","PPR","","_","_"
4,"maruto","_","_","marut","NC","","_","_"
5,"yāma","_","_","yāman","NC","","_","_"
6,"cekite","_","_","cekit","V","cekit","_","_"
7,"pṛśnyā","_","_","pṛśni","NC","","_","_"
8,"yad","_","_","yat","CSB","","_","_"
9,"ūdhar","_","_","ūdhas","NC","","_","_"
10,"apy","_","_","api","CX","","_","_"
11,"āpayo","_","_","āpi","NC","","_","_"
12,"duhuḥ","_","_","duh","V","duh","_","_"
1,"yad","_","_","yat","CSB","","_","_"
2,"vā","_","_","vā","CCD","","_","_"
3,"nide","_","_","nid","NC","","_","_"
4,"navamānasya","_","_","nū","KDP","","_","_"
5,"rudriyās","_","_","rudriya","NC","","_","_"
6,"tritaṃ","_","_","trita","NC","","_","_"
7,"jarāya","_","_","jara","NC","","_","_"
8,"juratām","_","_","jṛ","KDP","","_","_"
9,"adābhyāḥ","_","_","adābhya","JJ","","_","_"
1,"tān","_","_","tad","PRD","","_","_"
2,"vo","_","_","tvat","PPR","","_","_"
3,"maho","_","_","mah","JJ","","_","_"
4,"maruta","_","_","marut","NC","","_","_"
5,"_","_","_","eva","JJ","","_","_"
6,"_","_","_","yāvan","NC","","_","_"
7,"viṣṇor","_","_","viṣṇu","NC","","_","_"
8,"eṣasya","_","_","eṣa","NC","","_","_"
9,"prabhṛthe","_","_","prabhṛtha","NC","","_","_"
10,"havāmahe","_","_","hvā","V","hvā","_","_"
1,"_","_","_","hiraṇya","NC","","_","_"
2,"_","_","_","varṇa","NC","","_","_"
3,"kakuhān","_","_","kakuha","JJ","","_","_"
4,"_","_","_","ya","PPP","","_","_"
5,"_","_","_","sruc","NC","","_","_"
6,"brahmaṇyantaḥ","_","_","brahmaṇy","KDP","","_","_"
7,"śaṃsyaṃ","_","_","śaṃs","KDG","","_","_"
8,"rādha","_","_","rādhas","NC","","_","_"
9,"īmahe","_","_","e","V","ī","_","_"
1,"te","_","_","tad","PRD","","_","_"
2,"daśagvāḥ","_","_","daśagva","NC","","_","_"
3,"prathamā","_","_","prathama","JJ","","_","_"
4,"yajñam","_","_","yajña","NC","","_","_"
5,"ūhire","_","_","vah","V","vah","_","_"
6,"te","_","_","tad","PRD","","_","_"
7,"no","_","_","mat","PPR","","_","_"
8,"_","_","_","hi","V","hi","_","_"
9,"_","_","_","uṣas","NC","","_","_"
10,"vyuṣṭiṣu","_","_","vyuṣṭi","NC","","_","_"
1,"uṣā","_","_","uṣas","NC","","_","_"
2,"na","_","_","na","CNG","","_","_"
3,"rāmīr","_","_","rāmī","NC","","_","_"
4,"aruṇair","_","_","aruṇa","NC","","_","_"
5,"_","_","_","apa","CX","","_","_"
6,"_","_","_","vṛ","V","vṛ","_","_"
7,"_","_","_","mah","JJ","","_","_"
8,"_","_","_","u","CEM","","_","_"
9,"jyotiṣā","_","_","jyotis","NC","","_","_"
10,"śucatā","_","_","śuc","KDP","","_","_"
11,"_","_","_","go","NC","","_","_"
12,"_","_","_","arṇas","NC","","_","_"
1,"te","_","_","tad","PRD","","_","_"
2,"kṣoṇībhir","_","_","kṣoṇī","NC","","_","_"
3,"aruṇebhir","_","_","aruṇa","JJ","","_","_"
4,"_","_","_","na","CNG","","_","_"
5,"_","_","_","añji","NC","","_","_"
6,"rudrā","_","_","rudra","NC","","_","_"
7,"ṛtasya","_","_","ṛta","NC","","_","_"
8,"sadaneṣu","_","_","sadana","NC","","_","_"
9,"vāvṛdhuḥ","_","_","vṛdh","V","vṛdh","_","_"
1,"nimeghamānā","_","_","nimih","KDP","","_","_"
2,"atyena","_","_","atya","NC","","_","_"
3,"pājasā","_","_","pājas","NC","","_","_"
4,"_","_","_","su","CAD","","_","_"
5,"_","_","_","ścandra","JJ","","_","_"
6,"varṇaṃ","_","_","varṇa","NC","","_","_"
7,"dadhire","_","_","dadh","V","dhā","_","_"
8,"_","_","_","su","CAD","","_","_"
9,"_","_","_","peśas","NC","","_","_"
1,"tāṁ","_","_","tad","PRD","","_","_"
2,"iyāno","_","_","i","KDP","","_","_"
3,"mahi","_","_","mahi","JJ","","_","_"
4,"varūtham","_","_","varūtha","NC","","_","_"
5,"ūtaya","_","_","ūti","NC","","_","_"
6,"upa","_","_","upa","CADP","","_","_"
7,"_","_","_","gha","CX","","_","_"
8,"_","_","_","id","CEM","","_","_"
9,"enā","_","_","ida","PRD","","_","_"
10,"namasā","_","_","namas","NC","","_","_"
11,"gṛṇīmasi","_","_","gṛ","V","gṛ","_","_"
1,"trito","_","_","trita","NC","","_","_"
2,"na","_","_","na","CNG","","_","_"
3,"yān","_","_","yad","PRL","","_","_"
4,"pañca","_","_","pañcan","NUM","","_","_"
5,"hotṝn","_","_","hotṛ","NC","","_","_"
6,"abhiṣṭaya","_","_","abhiṣṭi","NC","","_","_"
7,"āvavartad","_","_","āvart","V","āvṛt","_","_"
8,"avarāñ","_","_","avara","JJ","","_","_"
9,"_","_","_","cakrī","NC","","_","_"
10,"_","_","_","av","CGDI","","_","_"
1,"yayā","_","_","yad","PRL","","_","_"
2,"radhram","_","_","radhra","JJ","","_","_"
3,"_","_","_","pāray","V","pāray","_","_"
4,"_","_","_","ati","CADP","","_","_"
5,"aṃho","_","_","aṃhas","NC","","_","_"
6,"yayā","_","_","yad","PRL","","_","_"
7,"nido","_","_","nid","NC","","_","_"
8,"muñcatha","_","_","muñc","V","muc","_","_"
9,"vanditāram","_","_","vanditṛ","JJ","","_","_"
1,"arvācī","_","_","arvāñc","JJ","","_","_"
2,"sā","_","_","tad","PRD","","_","_"
3,"maruto","_","_","marut","NC","","_","_"
4,"yā","_","_","yad","PRL","","_","_"
5,"va","_","_","tvat","PPR","","_","_"
6,"ūtir","_","_","ūti","NC","","_","_"
7,"_","_","_","ā","CADP","","_","_"
8,"_","_","_","u","CEM","","_","_"
9,"ṣu","_","_","su","CAD","","_","_"
10,"_","_","_","vāśrā","NC","","_","_"
11,"_","_","_","iva","CCM","","_","_"
12,"sumatir","_","_","sumati","NC","","_","_"
13,"jigātu","_","_","gā","V","gā","_","_"
