"WordID","word","NormSTEM","suffix","lemma","PoS","Root","NormSuffix","NormWord"
1,"ā","_","_","ā","CADP","","_","_"
2,"vāṃ","_","_","tvat","PPR","","_","_"
3,"ratho","_","_","ratha","NC","","_","_"
4,"aśvinā","_","_","aśvin","NC","","_","_"
5,"_","_","_","śya","NC","","_","_"
6,"_","_","_","patvan","NC","","_","_"
7,"_","_","_","su","CAD","","_","_"
8,"_","_","_","mṛḍīka","NC","","_","_"
9,"svavāṁ","_","_","svavat","JJ","","_","_"
10,"yātv","_","_","yā","V","yā","_","_"
11,"arvāṅ","_","_","arvāñc","JJ","","_","_"
1,"yo","_","_","yad","PRL","","_","_"
2,"martyasya","_","_","martya","NC","","_","_"
3,"manaso","_","_","manas","NC","","_","_"
4,"javīyān","_","_","javīyas","JJ","","_","_"
5,"_","_","_","tri","NUM","","_","_"
6,"_","_","_","vandhura","NC","","_","_"
7,"vṛṣaṇā","_","_","vṛṣan","NC","","_","_"
8,"_","_","_","vāta","NC","","_","_"
9,"_","_","_","raṃhas","NC","","_","_"
1,"_","_","_","tri","NUM","","_","_"
2,"_","_","_","vandhura","NC","","_","_"
3,"trivṛtā","_","_","trivṛt","JJ","","_","_"
4,"rathena","_","_","ratha","NC","","_","_"
5,"_","_","_","tri","NUM","","_","_"
6,"_","_","_","cakra","NC","","_","_"
7,"suvṛtā","_","_","suvṛt","JJ","","_","_"
8,"yātam","_","_","yā","V","yā","_","_"
9,"arvāk","_","_","arvāk","CX","","_","_"
1,"pinvataṃ","_","_","pinv","V","pinv","_","_"
2,"gā","_","_","go","NC","","_","_"
3,"jinvatam","_","_","jinv","V","jinv","_","_"
4,"arvato","_","_","arvat","NC","","_","_"
5,"no","_","_","mat","PPR","","_","_"
6,"vardhayatam","_","_","vardhay","V","vardhay","_","_"
7,"aśvinā","_","_","aśvin","NC","","_","_"
8,"vīram","_","_","vīra","NC","","_","_"
9,"asme","_","_","mat","PPR","","_","_"
1,"_","_","_","pravat","NC","","_","_"
2,"_","_","_","yāman","NC","","_","_"
3,"suvṛtā","_","_","suvṛt","JJ","","_","_"
4,"rathena","_","_","ratha","NC","","_","_"
5,"dasrāv","_","_","dasra","NC","","_","_"
6,"imaṃ","_","_","ida","PRD","","_","_"
7,"śṛṇutaṃ","_","_","śṛṇ","V","śru","_","_"
8,"ślokam","_","_","śloka","NC","","_","_"
9,"adreḥ","_","_","adri","NC","","_","_"
1,"kim","_","_","kim","CX","","_","_"
2,"aṅga","_","_","aṅga","CEM","","_","_"
3,"vām","_","_","tvat","PPR","","_","_"
4,"praty","_","_","prati","CADP","","_","_"
5,"avartiṃ","_","_","avarti","NC","","_","_"
6,"_","_","_","gamiṣṭha","JJ","","_","_"
7,"_","_","_","ah","V","ah","_","_"
8,"viprāso","_","_","vipra","NC","","_","_"
9,"aśvinā","_","_","aśvin","NC","","_","_"
10,"purājāḥ","_","_","purājā","JJ","","_","_"
1,"ā","_","_","ā","CADP","","_","_"
2,"vāṃ","_","_","tvat","PPR","","_","_"
3,"śyenāso","_","_","śya","NC","","_","_"
4,"aśvinā","_","_","aśvin","NC","","_","_"
5,"vahantu","_","_","vah","V","vah","_","_"
6,"rathe","_","_","ratha","NC","","_","_"
7,"yuktāsa","_","_","yuj","PPP","","_","_"
8,"āśavaḥ","_","_","āśu","JJ","","_","_"
9,"pataṅgāḥ","_","_","pataṃga","NC","","_","_"
1,"ye","_","_","yad","PRL","","_","_"
2,"apturo","_","_","aptur","JJ","","_","_"
3,"divyāso","_","_","divya","JJ","","_","_"
4,"na","_","_","na","CNG","","_","_"
5,"gṛdhrā","_","_","gṛdhra","NC","","_","_"
6,"abhi","_","_","abhi","CADP","","_","_"
7,"prayo","_","_","prayas","NC","","_","_"
8,"nāsatyā","_","_","nāsatya","NC","","_","_"
9,"vahanti","_","_","vahan","V","vah","_","_"
1,"ā","_","_","ā","CADP","","_","_"
2,"vāṃ","_","_","tvat","PPR","","_","_"
3,"rathaṃ","_","_","ratha","NC","","_","_"
4,"yuvatis","_","_","yuvati","NC","","_","_"
5,"tiṣṭhad","_","_","tiṣṭh","V","sthā","_","_"
6,"atra","_","_","atra","CAD","","_","_"
7,"juṣṭvī","_","_","juṣ","CGDA","","_","_"
8,"narā","_","_","nara","NC","","_","_"
9,"duhitā","_","_","duhitṛ","NC","","_","_"
10,"sūryasya","_","_","sūrya","NC","","_","_"
1,"pari","_","_","pari","CADP","","_","_"
2,"vām","_","_","tvat","PPR","","_","_"
3,"aśvā","_","_","aśva","NC","","_","_"
4,"vapuṣaḥ","_","_","vapus","JJ","","_","_"
5,"pataṅgā","_","_","pataṃga","NC","","_","_"
6,"vayo","_","_","vi","NC","","_","_"
7,"vahantv","_","_","vah","V","vah","_","_"
8,"aruṣā","_","_","aruṣa","JJ","","_","_"
9,"abhīke","_","_","abhīka","NC","","_","_"
1,"ud","_","_","ud","CADP","","_","_"
2,"vandanam","_","_","vandana","NC","","_","_"
3,"airataṃ","_","_","īr","V","īr","_","_"
4,"daṃsanābhir","_","_","daṃsanā","NC","","_","_"
5,"ud","_","_","ud","CADP","","_","_"
6,"rebhaṃ","_","_","rebha","NC","","_","_"
7,"dasrā","_","_","dasra","NC","","_","_"
8,"vṛṣaṇā","_","_","vṛṣan","NC","","_","_"
9,"śacībhiḥ","_","_","śacī","NC","","_","_"
1,"niṣ","_","_","niḥ","CADP","","_","_"
2,"ṭaugryam","_","_","taugrya","NC","","_","_"
3,"pārayathaḥ","_","_","pāray","V","pāray","_","_"
4,"samudrāt","_","_","samudra","NC","","_","_"
5,"punaś","_","_","punar","CAD","","_","_"
6,"cyavānaṃ","_","_","cyavāna","NC","","_","_"
7,"cakrathur","_","_","kar","V","kṛ","_","_"
8,"yuvānam","_","_","yuvan","NC","","_","_"
1,"yuvam","_","_","tvat","PPR","","_","_"
2,"atraye","_","_","atri","NC","","_","_"
3,"'vanītāya","_","_","avanī","PPP","","_","_"
4,"taptam","_","_","tap","PPP","","_","_"
5,"ūrjam","_","_","ūrj","NC","","_","_"
6,"omānam","_","_","oman","NC","","_","_"
7,"aśvināv","_","_","aśvin","NC","","_","_"
8,"adhattam","_","_","dadh","V","dhā","_","_"
1,"yuvaṃ","_","_","tvat","PPR","","_","_"
2,"_","_","_","kaṇva","NC","","_","_"
3,"_","_","_","apiripta","JJ","","_","_"
4,"cakṣuḥ","_","_","cakṣus","NC","","_","_"
5,"praty","_","_","prati","CADP","","_","_"
6,"adhattaṃ","_","_","dadh","V","dhā","_","_"
7,"suṣṭutiṃ","_","_","suṣṭuti","NC","","_","_"
8,"jujuṣāṇā","_","_","juṣ","KDP","","_","_"
1,"yuvaṃ","_","_","tvat","PPR","","_","_"
2,"dhenuṃ","_","_","dhenu","NC","","_","_"
3,"śayave","_","_","śayu","NC","","_","_"
4,"_","_","_","nādh","PPP","","_","_"
5,"_","_","_","pinv","V","pinv","_","_"
6,"aśvinā","_","_","aśvin","NC","","_","_"
7,"pūrvyāya","_","_","pūrvya","JJ","","_","_"
1,"amuñcataṃ","_","_","muñc","V","muc","_","_"
2,"vartikām","_","_","vartikā","NC","","_","_"
3,"aṃhaso","_","_","aṃhas","NC","","_","_"
4,"niḥ","_","_","niḥ","CADP","","_","_"
5,"prati","_","_","prati","CADP","","_","_"
6,"jaṅghāṃ","_","_","jaṅghā","NC","","_","_"
7,"viśpalāyā","_","_","viśpalā","NC","","_","_"
8,"adhattam","_","_","dadh","V","dhā","_","_"
1,"yuvaṃ","_","_","tvat","PPR","","_","_"
2,"śvetam","_","_","śveta","JJ","","_","_"
3,"pedava","_","_","pedu","NC","","_","_"
4,"_","_","_","indra","NC","","_","_"
5,"_","_","_","jū","PPP","","_","_"
6,"_","_","_","ahi","NC","","_","_"
7,"_","_","_","han","JJ","","_","_"
8,"_","_","_","aśvin","NC","","_","_"
9,"_","_","_","dad","V","dā","_","_"
10,"aśvam","_","_","aśva","NC","","_","_"
1,"johūtram","_","_","johūtra","JJ","","_","_"
2,"aryo","_","_","ari","JJ","","_","_"
3,"abhibhūtim","_","_","abhibhūti","JJ","","_","_"
4,"ugraṃ","_","_","ugra","JJ","","_","_"
5,"_","_","_","sahasra","NUM","","_","_"
6,"_","_","_","sā","JJ","","_","_"
7,"vṛṣaṇaṃ","_","_","vṛṣan","JJ","","_","_"
8,"_","_","_","vīḍu","JJ","","_","_"
9,"_","_","_","aṅga","NC","","_","_"
1,"tā","_","_","tad","PRD","","_","_"
2,"vāṃ","_","_","tvat","PPR","","_","_"
3,"narā","_","_","nara","NC","","_","_"
4,"sv","_","_","su","CAD","","_","_"
5,"avase","_","_","avas","NC","","_","_"
6,"sujātā","_","_","sujāta","JJ","","_","_"
7,"havāmahe","_","_","hvā","V","hvā","_","_"
8,"aśvinā","_","_","aśvin","NC","","_","_"
9,"nādhamānāḥ","_","_","nādh","KDP","","_","_"
1,"ā","_","_","ā","CADP","","_","_"
2,"na","_","_","mat","PPR","","_","_"
3,"upa","_","_","upa","CADP","","_","_"
4,"vasumatā","_","_","vasumat","JJ","","_","_"
5,"rathena","_","_","ratha","NC","","_","_"
6,"giro","_","_","gir","NC","","_","_"
7,"juṣāṇā","_","_","juṣ","KDP","","_","_"
8,"suvitāya","_","_","suvita","NC","","_","_"
9,"yātam","_","_","yā","V","yā","_","_"
1,"ā","_","_","ā","CADP","","_","_"
2,"śyenasya","_","_","śya","NC","","_","_"
3,"javasā","_","_","javas","NC","","_","_"
4,"_","_","_","nūtana","JJ","","_","_"
5,"_","_","_","mat","PPR","","_","_"
6,"yātaṃ","_","_","yā","V","yā","_","_"
7,"nāsatyā","_","_","nāsatya","NC","","_","_"
8,"sajoṣāḥ","_","_","sajoṣas","JJ","","_","_"
1,"have","_","_","hvā","V","hvā","_","_"
2,"hi","_","_","hi","CX","","_","_"
3,"vām","_","_","tvat","PPR","","_","_"
4,"aśvinā","_","_","aśvin","NC","","_","_"
5,"_","_","_","rā","PPP","","_","_"
6,"_","_","_","havya","NC","","_","_"
7,"śaśvattamāyā","_","_","śaśvattama","JJ","","_","_"
8,"uṣaso","_","_","uṣas","NC","","_","_"
9,"vyuṣṭau","_","_","vyuṣṭi","NC","","_","_"
