"WordID","word","NormSTEM","suffix","lemma","PoS","Root","NormSuffix","NormWord"
1,"śaunaka","_","_","śaunaka","NC","","_","_"
2,"uvāca","_","_","vak","V","vac","_","_"
1,"tasmāt","_","_","tasmāt","CX","","_","_"
2,"te","_","_","tvat","PPR","","_","_"
3,"'haṃ","_","_","mat","PPR","","_","_"
4,"pravakṣyāmi","_","_","pravak","V","pravac","_","_"
5,"dharmam","_","_","dharma","NC","","_","_"
6,"_","_","_","āvṛt","PPP","","_","_"
7,"_","_","_","cetas","NC","","_","_"
1,"_","_","_","śrīmat","JJ","","_","_"
2,"_","_","_","mahat","JJ","","_","_"
3,"_","_","_","bala","NC","","_","_"
4,"_","_","_","tuṣ","PPP","","_","_"
5,"_","_","_","yad","PRL","","_","_"
6,"_","_","_","tvat","PPR","","_","_"
7,"dharmam","_","_","dharma","NC","","_","_"
8,"avekṣase","_","_","avekṣ","V","avekṣ","_","_"
1,"purastād","_","_","purastāt","CX","","_","_"
2,"dāruṇo","_","_","dāruṇa","JJ","","_","_"
3,"bhūtvā","_","_","bhū","CGDA","","_","_"
4,"_","_","_","su","CAD","","_","_"
5,"_","_","_","citratara","JJ","","_","_"
6,"eva","_","_","eva","CEM","","_","_"
7,"tat","_","_","tad","PRD","","_","_"
1,"anugṛhṇanti","_","_","anugrah","V","anugrah","_","_"
2,"bhūtāni","_","_","bhūta","NC","","_","_"
3,"svena","_","_","sva","JJ","","_","_"
4,"vṛttena","_","_","vṛtta","NC","","_","_"
5,"pārthiva","_","_","pārthiva","NC","","_","_"
1,"kṛtsne","_","_","kṛtsna","JJ","","_","_"
2,"nūnaṃ","_","_","nūna","CX","","_","_"
3,"_","_","_","as","KDP","","_","_"
4,"_","_","_","asat","JJ","","_","_"
5,"iti","_","_","iti","CQT","","_","_"
6,"loko","_","_","loka","NC","","_","_"
7,"vyavasyati","_","_","vyavasā","V","vyavasā","_","_"
1,"yatra","_","_","yatra","CX","","_","_"
2,"tvaṃ","_","_","tvat","PPR","","_","_"
3,"tādṛśo","_","_","tādṛśa","JJ","","_","_"
4,"bhūtvā","_","_","bhū","CGDA","","_","_"
5,"dharmam","_","_","dharma","NC","","_","_"
6,"_","_","_","adya","CX","","_","_"
7,"_","_","_","anupaś","V","anupaś","_","_"
1,"hitvā","_","_","hā","CGDA","","_","_"
2,"_","_","_","su","CAD","","_","_"
3,"_","_","_","rucira","JJ","","_","_"
4,"bhakṣyaṃ","_","_","bhakṣya","NC","","_","_"
5,"_","_","_","bhoga","NC","","_","_"
6,"_","_","_","ca","CCD","","_","_"
7,"tapa","_","_","tapas","NC","","_","_"
8,"āsthitaḥ","_","_","āsthā","PPP","","_","_"
1,"_","_","_","iti","CQT","","_","_"
2,"_","_","_","tad","PRD","","_","_"
3,"api","_","_","api","CX","","_","_"
4,"bhūtānām","_","_","bhūta","NC","","_","_"
5,"adbhutaṃ","_","_","adbhuta","JJ","","_","_"
6,"janamejaya","_","_","janamejaya","NC","","_","_"
1,"yo","_","_","yad","PRL","","_","_"
2,"durbalo","_","_","durbala","JJ","","_","_"
3,"bhaved","_","_","bhav","V","bhū","_","_"
4,"dātā","_","_","dātṛ","JJ","","_","_"
5,"kṛpaṇo","_","_","kṛpaṇa","JJ","","_","_"
6,"vā","_","_","vā","CCD","","_","_"
7,"tapodhanaḥ","_","_","tapodhana","JJ","","_","_"
1,"anāścaryaṃ","_","_","anāścarya","JJ","","_","_"
2,"tad","_","_","tad","PRD","","_","_"
3,"_","_","_","iti","CQT","","_","_"
4,"_","_","_","ah","V","ah","_","_"
5,"_","_","_","na","CNG","","_","_"
6,"_","_","_","ati","CADP","","_","_"
7,"_","_","_","dūra","NC","","_","_"
8,"hi","_","_","hi","CX","","_","_"
9,"vartate","_","_","vart","V","vṛt","_","_"
1,"etad","_","_","tad","PRD","","_","_"
2,"eva","_","_","eva","CEM","","_","_"
3,"hi","_","_","hi","CX","","_","_"
4,"kārpaṇyaṃ","_","_","kārpaṇya","NC","","_","_"
5,"samagram","_","_","samagra","JJ","","_","_"
6,"asamīkṣitam","_","_","asamīkṣita","JJ","","_","_"
1,"tasmāt","_","_","tasmāt","CX","","_","_"
2,"_","_","_","samīkṣā","NC","","_","_"
3,"_","_","_","eva","CEM","","_","_"
4,"syād","_","_","as","V","as","_","_"
5,"bhavet","_","_","bhav","V","bhū","_","_"
6,"_","_","_","tad","PRD","","_","_"
7,"_","_","_","tatas","CX","","_","_"
8,"guṇaḥ","_","_","guṇa","NC","","_","_"
1,"yajño","_","_","yajña","NC","","_","_"
2,"dānaṃ","_","_","dāna","NC","","_","_"
3,"dayā","_","_","dayā","NC","","_","_"
4,"vedāḥ","_","_","veda","NC","","_","_"
5,"satyaṃ","_","_","satya","NC","","_","_"
6,"ca","_","_","ca","CCD","","_","_"
7,"pṛthivīpate","_","_","pṛthivīpati","NC","","_","_"
1,"_","_","_","pañcan","NUM","","_","_"
2,"_","_","_","tad","PRD","","_","_"
3,"pavitrāṇi","_","_","pavitra","NC","","_","_"
4,"ṣaṣṭhaṃ","_","_","ṣaṣṭha","JJ","","_","_"
5,"_","_","_","su","CAD","","_","_"
6,"_","_","_","car","PPP","","_","_"
7,"tapaḥ","_","_","tapas","NC","","_","_"
1,"tad","_","_","tad","PRD","","_","_"
2,"eva","_","_","eva","CEM","","_","_"
3,"rājñāṃ","_","_","rājan","NC","","_","_"
4,"paramaṃ","_","_","parama","JJ","","_","_"
5,"pavitraṃ","_","_","pavitra","JJ","","_","_"
6,"janamejaya","_","_","janamejaya","NC","","_","_"
1,"tena","_","_","tad","PRD","","_","_"
2,"samyag","_","_","samyak","CX","","_","_"
3,"gṛhītena","_","_","grah","PPP","","_","_"
4,"śreyāṃsaṃ","_","_","śreyas","JJ","","_","_"
5,"dharmam","_","_","dharma","NC","","_","_"
6,"āpsyasi","_","_","āpn","V","āp","_","_"
1,"_","_","_","puṇya","JJ","","_","_"
2,"_","_","_","deśa","NC","","_","_"
3,"_","_","_","abhigamana","NC","","_","_"
4,"pavitraṃ","_","_","pavitra","NC","","_","_"
5,"paramaṃ","_","_","parama","JJ","","_","_"
6,"smṛtam","_","_","smṛ","PPP","","_","_"
1,"api","_","_","api","CX","","_","_"
2,"_","_","_","hi","CX","","_","_"
3,"_","_","_","udāhṛ","V","udāhṛ","_","_"
4,"_","_","_","ida","PRD","","_","_"
5,"gāthā","_","_","gāthā","NC","","_","_"
6,"gītā","_","_","gā","PPP","","_","_"
7,"yayātinā","_","_","yayāti","NC","","_","_"
1,"yo","_","_","yad","PRL","","_","_"
2,"martyaḥ","_","_","martya","NC","","_","_"
3,"pratipadyeta","_","_","pratipad","V","pratipad","_","_"
4,"āyur","_","_","āyus","NC","","_","_"
5,"jīveta","_","_","jīv","V","jīv","_","_"
6,"vā","_","_","vā","CCD","","_","_"
7,"punaḥ","_","_","punar","CAD","","_","_"
1,"yajñam","_","_","yajña","NC","","_","_"
2,"ekāntataḥ","_","_","ekānta","NC","","_","_"
3,"kṛtvā","_","_","kṛ","CGDA","","_","_"
4,"tat","_","_","tad","PRD","","_","_"
5,"saṃnyasya","_","_","saṃnyas","CGDA","","_","_"
6,"_","_","_","tapas","NC","","_","_"
7,"_","_","_","car","V","car","_","_"
1,"puṇyam","_","_","puṇya","JJ","","_","_"
2,"āhuḥ","_","_","ah","V","ah","_","_"
3,"kurukṣetraṃ","_","_","kurukṣetra","NC","","_","_"
4,"sarasvatyāṃ","_","_","sarasvatī","NC","","_","_"
5,"pṛthūdakam","_","_","pṛthūdaka","NC","","_","_"
1,"_","_","_","yatra","CX","","_","_"
2,"_","_","_","avagāh","CGDA","","_","_"
3,"pītvā","_","_","pā","CGDA","","_","_"
4,"vā","_","_","vā","CCD","","_","_"
5,"_","_","_","na","CNG","","_","_"
6,"_","_","_","eva","CX","","_","_"
7,"śvomaraṇaṃ","_","_","śvomaraṇa","NC","","_","_"
8,"tapet","_","_","tap","V","tap","_","_"
1,"_","_","_","mahat","JJ","","_","_"
2,"_","_","_","saras","NC","","_","_"
3,"puṣkarāṇi","_","_","puṣkara","NC","","_","_"
4,"_","_","_","prabhāsa","NC","","_","_"
5,"_","_","_","uttaramānasa","NC","","_","_"
1,"kālodaṃ","_","_","kāloda","NC","","_","_"
2,"_","_","_","tu","CCD","","_","_"
3,"_","_","_","eva","CEM","","_","_"
4,"gantāsi","_","_","ganta","V","ga","_","_"
5,"_","_","_","labh","PPP","","_","_"
6,"_","_","_","āyus","NC","","_","_"
7,"jīvite","_","_","jīvita","NC","","_","_"
8,"punaḥ","_","_","punar","CAD","","_","_"
1,"_","_","_","sarasvatī","NC","","_","_"
2,"_","_","_","dṛṣadvatī","NC","","_","_"
3,"sevamāno","_","_","sev","KDP","","_","_"
4,"'nusaṃcareḥ","_","_","anusaṃcar","V","anusaṃcar","_","_"
1,"_","_","_","svādhyāya","NC","","_","_"
2,"_","_","_","śīla","NC","","_","_"
3,"sthāneṣu","_","_","sthāna","NC","","_","_"
4,"sarveṣu","_","_","sarva","JQ","","_","_"
5,"samupaspṛśeḥ","_","_","samupaspṛs","V","samupaspṛs","_","_"
1,"_","_","_","tyāga","NC","","_","_"
2,"_","_","_","dharma","NC","","_","_"
3,"pavitrāṇāṃ","_","_","pavitra","NC","","_","_"
4,"saṃnyāsaṃ","_","_","saṃnyāsa","NC","","_","_"
5,"param","_","_","para","PPX","","_","_"
6,"abravīt","_","_","abravīta","V","brū","_","_"
1,"_","_","_","atra","CAD","","_","_"
2,"_","_","_","api","CX","","_","_"
3,"_","_","_","udāhṛ","V","udāhṛ","_","_"
4,"_","_","_","ida","PRD","","_","_"
5,"gāthāḥ","_","_","gāthā","NC","","_","_"
6,"satyavatā","_","_","satyavat","NC","","_","_"
7,"kṛtāḥ","_","_","kṛ","PPP","","_","_"
1,"yathā","_","_","yathā","CCM","","_","_"
2,"kumāraḥ","_","_","kumāra","NC","","_","_"
3,"satyo","_","_","satya","JJ","","_","_"
4,"vai","_","_","vai","CX","","_","_"
5,"na","_","_","na","CNG","","_","_"
6,"puṇyo","_","_","puṇya","JJ","","_","_"
7,"na","_","_","na","CNG","","_","_"
8,"ca","_","_","ca","CCD","","_","_"
9,"_","_","_","pāpa","NC","","_","_"
10,"_","_","_","kṛt","JJ","","_","_"
1,"na","_","_","na","CNG","","_","_"
2,"_","_","_","hi","CX","","_","_"
3,"_","_","_","as","V","as","_","_"
4,"_","_","_","sarva","JQ","","_","_"
5,"_","_","_","bhūta","NC","","_","_"
6,"duḥkham","_","_","duḥkha","NC","","_","_"
7,"asmin","_","_","ida","PRD","","_","_"
8,"kutaḥ","_","_","kutas","CX","","_","_"
9,"sukham","_","_","sukha","NC","","_","_"
1,"evaṃ","_","_","eva","CX","","_","_"
2,"_","_","_","prakṛti","NC","","_","_"
3,"_","_","_","bhū","PPP","","_","_"
4,"_","_","_","sarva","JQ","","_","_"
5,"_","_","_","saṃsarga","NC","","_","_"
6,"_","_","_","yāyin","JJ","","_","_"
1,"tyajatāṃ","_","_","tyaj","KDP","","_","_"
2,"jīvitaṃ","_","_","jīvita","NC","","_","_"
3,"prāyo","_","_","prāyas","CX","","_","_"
4,"vivṛte","_","_","vivṛ","PPP","","_","_"
5,"_","_","_","puṇya","JJ","","_","_"
6,"_","_","_","pātaka","NC","","_","_"
1,"yat","_","_","yad","PRL","","_","_"
2,"_","_","_","tu","CCD","","_","_"
3,"_","_","_","eva","CEM","","_","_"
4,"rājño","_","_","rājan","NC","","_","_"
5,"jyāyo","_","_","jyāyas","JJ","","_","_"
6,"vai","_","_","vai","CX","","_","_"
7,"kāryāṇāṃ","_","_","kārya","NC","","_","_"
8,"tad","_","_","tad","PRD","","_","_"
9,"vadāmi","_","_","vad","V","vad","_","_"
10,"te","_","_","tvat","PPR","","_","_"
1,"balena","_","_","bala","NC","","_","_"
2,"_","_","_","saṃvibhāga","NC","","_","_"
3,"_","_","_","ca","CCD","","_","_"
4,"jaya","_","_","jay","V","ji","_","_"
5,"svargaṃ","_","_","svarga","NC","","_","_"
6,"punīṣva","_","_","pū","V","pū","_","_"
7,"ca","_","_","ca","CCD","","_","_"
1,"_","_","_","yad","PRL","","_","_"
2,"_","_","_","eva","CX","","_","_"
3,"balam","_","_","bala","NC","","_","_"
4,"_","_","_","ojas","NC","","_","_"
5,"_","_","_","ca","CCD","","_","_"
6,"sa","_","_","tad","PRD","","_","_"
7,"dharmasya","_","_","dharma","NC","","_","_"
8,"prabhur","_","_","prabhu","JJ","","_","_"
9,"naraḥ","_","_","nara","NC","","_","_"
1,"brāhmaṇānāṃ","_","_","brāhmaṇa","NC","","_","_"
2,"_","_","_","sukha","NC","","_","_"
3,"_","_","_","artha","NC","","_","_"
4,"tvaṃ","_","_","tvat","PPR","","_","_"
5,"paryehi","_","_","parye","V","parye","_","_"
6,"pṛthivīm","_","_","pṛthivī","NC","","_","_"
7,"imām","_","_","ida","PRD","","_","_"
1,"_","_","_","yathā","CCM","","_","_"
2,"_","_","_","eva","CEM","","_","_"
3,"_","_","_","a","PRD","","_","_"
4,"_","_","_","purā","CX","","_","_"
5,"_","_","_","kṣip","V","kṣip","_","_"
6,"_","_","_","tathā","CX","","_","_"
7,"_","_","_","eva","CEM","","_","_"
8,"_","_","_","a","PRD","","_","_"
9,"prasādaya","_","_","prasāday","V","prasāday","_","_"
1,"api","_","_","api","CX","","_","_"
2,"_","_","_","dhik","CX","","_","_"
3,"_","_","_","kṛ","KDP","","_","_"
4,"'pi","_","_","api","CX","","_","_"
5,"tyajyamāno","_","_","tyaj","KDP","","_","_"
6,"_","_","_","api","CX","","_","_"
7,"_","_","_","anekadhā","CX","","_","_"
1,"ātmano","_","_","ātman","NC","","_","_"
2,"darśanaṃ","_","_","darśana","NC","","_","_"
3,"_","_","_","vidvas","JJ","","_","_"
4,"_","_","_","āhan","V","āhan","_","_"
5,"_","_","_","iti","CQT","","_","_"
6,"mā","_","_","mā","CNG","","_","_"
7,"krudhaḥ","_","_","krudhy","V","krudh","_","_"
1,"ghaṭamānaḥ","_","_","ghaṭ","KDP","","_","_"
2,"_","_","_","sva","JJ","","_","_"
3,"_","_","_","kārya","NC","","_","_"
4,"kuru","_","_","kar","V","kṛ","_","_"
5,"naiḥśreyasaṃ","_","_","naiḥśreyasa","JJ","","_","_"
6,"param","_","_","para","PPX","","_","_"
1,"_","_","_","hima","JJ","","_","_"
2,"_","_","_","agni","NC","","_","_"
3,"_","_","_","ghora","JJ","","_","_"
4,"_","_","_","sadṛśa","JJ","","_","_"
5,"rājā","_","_","rājan","NC","","_","_"
6,"bhavati","_","_","bhav","V","bhū","_","_"
7,"kaścana","_","_","kaścana","PRI","","_","_"
1,"_","_","_","lāṅgala","NC","","_","_"
2,"_","_","_","aśani","NC","","_","_"
3,"_","_","_","kalpa","NC","","_","_"
4,"vā","_","_","vā","CCD","","_","_"
5,"_","_","_","bhav","V","bhū","_","_"
6,"_","_","_","anya","PPX","","_","_"
7,"paraṃtapa","_","_","paraṃtapa","JJ","","_","_"
1,"na","_","_","na","CNG","","_","_"
2,"niḥśeṣeṇa","_","_","niḥśeṣa","JJ","","_","_"
3,"mantavyam","_","_","man","KDG","","_","_"
4,"a","_","_","alpha_privativum","JJ","","_","_"
4,"acikitsyena","_","_","cikitsya","JJ","","_","_"
5,"vā","_","_","vā","CCD","","_","_"
6,"punaḥ","_","_","punar","CAD","","_","_"
1,"na","_","_","na","CNG","","_","_"
2,"jātu","_","_","jātu","CX","","_","_"
3,"_","_","_","na","CNG","","_","_"
4,"_","_","_","mat","PPR","","_","_"
5,"_","_","_","as","V","as","_","_"
6,"_","_","_","iti","CQT","","_","_"
7,"prasaktavyam","_","_","prasañj","KDG","","_","_"
8,"asādhuṣu","_","_","asādhu","JJ","","_","_"
1,"vikarmaṇā","_","_","vikarman","NC","","_","_"
2,"tapyamānaḥ","_","_","tap","KDP","","_","_"
3,"pādāt","_","_","pāda","NC","","_","_"
4,"pāpasya","_","_","pāpa","NC","","_","_"
5,"mucyate","_","_","muñc","V","muc","_","_"
1,"_","_","_","na","CNG","","_","_"
2,"_","_","_","tad","PRD","","_","_"
3,"kāryaṃ","_","_","kṛ","KDG","","_","_"
4,"punar","_","_","punar","CAD","","_","_"
5,"iti","_","_","iti","CQT","","_","_"
6,"dvitīyāt","_","_","dvitīya","JJ","","_","_"
7,"parimucyate","_","_","parimuñc","V","parimuc","_","_"
1,"cariṣye","_","_","car","V","car","_","_"
2,"dharmam","_","_","dharma","NC","","_","_"
3,"_","_","_","eva","CEM","","_","_"
4,"_","_","_","iti","CQT","","_","_"
5,"tṛtīyāt","_","_","tṛtīya","JJ","","_","_"
6,"parimucyate","_","_","parimuñc","V","parimuc","_","_"
1,"kalyāṇam","_","_","kalyāṇa","JJ","","_","_"
2,"anumantavyaṃ","_","_","anuman","KDG","","_","_"
3,"puruṣeṇa","_","_","puruṣa","NC","","_","_"
4,"bubhūṣatā","_","_","bubhūṣ","KDP","","_","_"
1,"ye","_","_","yad","PRL","","_","_"
2,"sugandhīni","_","_","sugandhi","JJ","","_","_"
3,"sevante","_","_","sev","V","sev","_","_"
4,"_","_","_","tathā","CX","","_","_"
5,"_","_","_","gandha","NC","","_","_"
6,"bhavanti","_","_","bhav","V","bhū","_","_"
7,"te","_","_","tad","PRD","","_","_"
1,"ye","_","_","yad","PRL","","_","_"
2,"durgandhīni","_","_","durgandhi","JJ","","_","_"
3,"sevante","_","_","sev","V","sev","_","_"
4,"_","_","_","tathā","CX","","_","_"
5,"_","_","_","gandha","NC","","_","_"
6,"bhavanti","_","_","bhav","V","bhū","_","_"
7,"te","_","_","tad","PRD","","_","_"
1,"_","_","_","tapas","NC","","_","_"
2,"_","_","_","caryā","NC","","_","_"
3,"_","_","_","para","PPX","","_","_"
4,"sadyaḥ","_","_","sadyas","CAD","","_","_"
5,"_","_","_","pāpa","NC","","_","_"
6,"_","_","_","hi","CX","","_","_"
7,"parimucyate","_","_","parimuñc","V","parimuc","_","_"
1,"saṃvatsaram","_","_","saṃvatsara","NC","","_","_"
2,"_","_","_","upās","CGDA","","_","_"
3,"_","_","_","agni","NC","","_","_"
4,"abhiśastaḥ","_","_","abhiśaṃs","PPP","","_","_"
5,"pramucyate","_","_","pramuñc","V","pramuc","_","_"
1,"trīṇi","_","_","tri","NUM","","_","_"
2,"_","_","_","varṣa","NC","","_","_"
3,"_","_","_","upās","CGDA","","_","_"
4,"_","_","_","agni","NC","","_","_"
5,"_","_","_","bhrūṇa","NC","","_","_"
6,"_","_","_","han","JJ","","_","_"
7,"vipramucyate","_","_","vipramuñc","V","vipramuc","_","_"
1,"yāvataḥ","_","_","yāvat","JJ","","_","_"
2,"prāṇino","_","_","prāṇin","NC","","_","_"
3,"hanyāt","_","_","han","V","han","_","_"
4,"_","_","_","tad","PRD","","_","_"
5,"_","_","_","jātīya","JJ","","_","_"
6,"svabhāvataḥ","_","_","svabhāva","NC","","_","_"
1,"pramīyamāṇān","_","_","pramā","KDP","","_","_"
2,"unmocya","_","_","unmocay","CGDA","","_","_"
3,"_","_","_","bhrūṇa","NC","","_","_"
4,"_","_","_","han","JJ","","_","_"
5,"vipramucyate","_","_","vipramuñc","V","vipramuc","_","_"
1,"api","_","_","api","CX","","_","_"
2,"_","_","_","vā","CCD","","_","_"
3,"_","_","_","ap","NC","","_","_"
4,"nimajjeta","_","_","nimajj","V","nimajj","_","_"
5,"trir","_","_","tris","CX","","_","_"
6,"japann","_","_","jap","KDP","","_","_"
7,"aghamarṣaṇam","_","_","aghamarṣaṇa","NC","","_","_"
1,"_","_","_","yathā","CCM","","_","_"
2,"_","_","_","aśvamedha","NC","","_","_"
3,"_","_","_","avabhṛtha","NC","","_","_"
4,"_","_","_","tathā","CX","","_","_"
5,"_","_","_","tad","PRD","","_","_"
6,"_","_","_","manu","NC","","_","_"
7,"abravīt","_","_","abravīta","V","brū","_","_"
1,"kṣipraṃ","_","_","kṣipra","CX","","_","_"
2,"praṇudate","_","_","praṇud","V","praṇud","_","_"
3,"pāpaṃ","_","_","pāpa","NC","","_","_"
4,"satkāraṃ","_","_","satkāra","NC","","_","_"
5,"labhate","_","_","labh","V","labh","_","_"
6,"tathā","_","_","tathā","CX","","_","_"
1,"api","_","_","api","CX","","_","_"
2,"_","_","_","ca","CCD","","_","_"
3,"_","_","_","a","PRD","","_","_"
4,"prasīdanti","_","_","prasīd","V","prasad","_","_"
5,"bhūtāni","_","_","bhūta","NC","","_","_"
6,"_","_","_","jaḍa","JJ","","_","_"
7,"_","_","_","mūka","JJ","","_","_"
8,"_","_","_","vat","CX","","_","_"
1,"bṛhaspatiṃ","_","_","bṛhaspati","NC","","_","_"
2,"devaguruṃ","_","_","devaguru","NC","","_","_"
3,"_","_","_","sura","NC","","_","_"
4,"_","_","_","asura","NC","","_","_"
5,"sametya","_","_","same","CGDA","","_","_"
6,"sarve","_","_","sarva","JQ","","_","_"
7,"nṛpate","_","_","nṛpati","NC","","_","_"
8,"'nvayuñjan","_","_","anuyuj","V","anuyuj","_","_"
1,"dharme","_","_","dharma","NC","","_","_"
2,"phalaṃ","_","_","phala","NC","","_","_"
3,"vettha","_","_","vid","V","vid","_","_"
4,"kṛte","_","_","kṛ","PPP","","_","_"
5,"_","_","_","mahat","JJ","","_","_"
6,"_","_","_","ṛṣi","NC","","_","_"
7,"_","_","_","tathā","CX","","_","_"
8,"_","_","_","itara","PPX","","_","_"
9,"_","_","_","naraka","NC","","_","_"
10,"_","_","_","pāpa","JJ","","_","_"
11,"_","_","_","loka","NC","","_","_"
1,"ubhe","_","_","ubh","PPX","","_","_"
2,"tu","_","_","tu","CCD","","_","_"
3,"yasya","_","_","yad","PRL","","_","_"
4,"_","_","_","su","CAD","","_","_"
5,"_","_","_","kṛ","PPP","","_","_"
6,"bhavetāṃ","_","_","bhav","V","bhū","_","_"
7,"kiṃ","_","_","kiṃ","PRQ","","_","_"
8,"svit","_","_","svid","CX","","_","_"
9,"_","_","_","tad","PRD","","_","_"
10,"_","_","_","tatra","CAD","","_","_"
11,"_","_","_","jaya","NC","","_","_"
12,"_","_","_","uttara","JJ","","_","_"
13,"syāt","_","_","as","V","as","_","_"
1,"ācakṣva","_","_","cakṣ","V","cakṣ","_","_"
2,"naḥ","_","_","mat","PPR","","_","_"
3,"_","_","_","karman","NC","","_","_"
4,"_","_","_","phala","NC","","_","_"
5,"_","_","_","mahat","JJ","","_","_"
6,"_","_","_","ṛṣi","NC","","_","_"
7,"kathaṃ","_","_","katha","CX","","_","_"
8,"pāpaṃ","_","_","pāpa","NC","","_","_"
9,"nudate","_","_","anudad","V","anudā","_","_"
10,"_","_","_","puṇya","JJ","","_","_"
11,"_","_","_","śīla","NC","","_","_"
1,"bṛhaspatir","_","_","bṛhaspati","NC","","_","_"
2,"uvāca","_","_","vak","V","vac","_","_"
1,"kṛtvā","_","_","kṛ","CGDA","","_","_"
2,"pāpaṃ","_","_","pāpa","NC","","_","_"
3,"pūrvam","_","_","pūrva","CX","","_","_"
4,"_","_","_","abuddhi","NC","","_","_"
5,"_","_","_","pūrva","CX","","_","_"
6,"puṇyāni","_","_","puṇya","JJ","","_","_"
7,"yaḥ","_","_","yad","PRL","","_","_"
8,"kurute","_","_","kar","V","kṛ","_","_"
9,"_","_","_","buddhi","NC","","_","_"
10,"_","_","_","pūrva","CX","","_","_"
1,"sa","_","_","tad","PRD","","_","_"
2,"tat","_","_","tad","PRD","","_","_"
3,"pāpaṃ","_","_","pāpa","NC","","_","_"
4,"nudate","_","_","anudad","V","anudā","_","_"
5,"_","_","_","puṇya","JJ","","_","_"
6,"_","_","_","śīla","NC","","_","_"
7,"vāso","_","_","vāsas","NC","","_","_"
8,"yathā","_","_","yathā","CCM","","_","_"
9,"malinaṃ","_","_","malina","JJ","","_","_"
10,"_","_","_","kṣāra","NC","","_","_"
11,"_","_","_","yukti","NC","","_","_"
1,"pāpaṃ","_","_","pāpa","NC","","_","_"
2,"kṛtvā","_","_","kṛ","CGDA","","_","_"
3,"na","_","_","na","CNG","","_","_"
4,"manyeta","_","_","man","V","man","_","_"
5,"_","_","_","na","CNG","","_","_"
6,"_","_","_","mat","PPR","","_","_"
7,"_","_","_","as","V","as","_","_"
8,"_","_","_","iti","CQT","","_","_"
9,"pūruṣaḥ","_","_","pūruṣa","NC","","_","_"
1,"cikīrṣed","_","_","cikīrṣ","V","cikīrṣ","_","_"
2,"eva","_","_","eva","CEM","","_","_"
3,"kalyāṇaṃ","_","_","kalyāṇa","NC","","_","_"
4,"śraddadhāno","_","_","śraddhā","KDP","","_","_"
5,"'nasūyakaḥ","_","_","anasūyaka","JJ","","_","_"
1,"chidrāṇi","_","_","chidra","NC","","_","_"
2,"_","_","_","vasana","NC","","_","_"
3,"_","_","_","iva","CCM","","_","_"
4,"sādhunā","_","_","sādhu","JJ","","_","_"
5,"vivṛṇoti","_","_","vivṛ","V","vivṛ","_","_"
6,"yaḥ","_","_","yad","PRL","","_","_"
1,"yaḥ","_","_","yad","PRL","","_","_"
2,"pāpaṃ","_","_","pāpa","NC","","_","_"
3,"puruṣaḥ","_","_","puruṣa","NC","","_","_"
4,"kṛtvā","_","_","kṛ","CGDA","","_","_"
5,"kalyāṇam","_","_","kalyāṇa","NC","","_","_"
6,"abhipadyate","_","_","abhipad","V","abhipad","_","_"
1,"_","_","_","yathā","CCM","","_","_"
2,"_","_","_","āditya","NC","","_","_"
3,"punar","_","_","punar","CAD","","_","_"
4,"_","_","_","udi","KDP","","_","_"
5,"_","_","_","tamas","NC","","_","_"
6,"sarvaṃ","_","_","sarva","JQ","","_","_"
7,"vyapohati","_","_","vyapoh","V","vyapoh","_","_"
1,"kalyāṇam","_","_","kalyāṇa","JJ","","_","_"
2,"ācarann","_","_","ācar","KDP","","_","_"
3,"evaṃ","_","_","eva","CX","","_","_"
4,"sarvaṃ","_","_","sarva","JQ","","_","_"
5,"pāpaṃ","_","_","pāpa","NC","","_","_"
6,"vyapohati","_","_","vyapoh","V","vyapoh","_","_"
1,"bhīṣma","_","_","bhīṣma","NC","","_","_"
2,"uvāca","_","_","vak","V","vac","_","_"
1,"evam","_","_","eva","CX","","_","_"
2,"uktvā","_","_","vac","CGDA","","_","_"
3,"sa","_","_","tad","PRD","","_","_"
4,"rājānam","_","_","rājan","NC","","_","_"
5,"indroto","_","_","indrota","NC","","_","_"
6,"janamejayam","_","_","janamejaya","NC","","_","_"
1,"yājayāmāsa","_","_","yājay","V","yājay","_","_"
2,"vidhivad","_","_","vidhivat","CX","","_","_"
3,"vājimedhena","_","_","vājimedha","NC","","_","_"
4,"śaunakaḥ","_","_","śaunaka","NC","","_","_"
1,"tataḥ","_","_","tatas","CX","","_","_"
2,"sa","_","_","tad","PRD","","_","_"
3,"rājā","_","_","rājan","NC","","_","_"
4,"_","_","_","vyapanī","PPP","","_","_"
5,"_","_","_","kalmaṣa","NC","","_","_"
6,"śriyā","_","_","śrī","NC","","_","_"
7,"yutaḥ","_","_","yuta","JJ","","_","_"
8,"_","_","_","prajval","PPP","","_","_"
9,"_","_","_","agni","NC","","_","_"
10,"_","_","_","rūpa","NC","","_","_"
1,"viveśa","_","_","viś","V","viś","_","_"
2,"rājyaṃ","_","_","rājya","NC","","_","_"
3,"svam","_","_","sva","JJ","","_","_"
4,"_","_","_","amitra","NC","","_","_"
5,"_","_","_","karśana","JJ","","_","_"
6,"divaṃ","_","_","div","NC","","_","_"
7,"yathā","_","_","yathā","CCM","","_","_"
8,"_","_","_","pṛ","PPP","","_","_"
9,"_","_","_","vapus","NC","","_","_"
10,"niśākaraḥ","_","_","niśākara","NC","","_","_"
