"WordID","word","NormSTEM","suffix","lemma","PoS","Root","NormSuffix","NormWord"
1,"sthāṇur","_","_","sthāṇu","NC","","_","_"
2,"uvāca","_","_","vak","V","vac","_","_"
1,"_","_","_","prajā","NC","","_","_"
2,"_","_","_","sarga","NC","","_","_"
3,"_","_","_","nimitta","NC","","_","_"
4,"me","_","_","mat","PPR","","_","_"
5,"_","_","_","kāryavat","JJ","","_","_"
7,"imāṃ","_","_","ida","PRD","","_","_"
8,"prabho","_","_","prabhu","JJ","","_","_"
1,"viddhi","_","_","vid","V","vid","_","_"
2,"_","_","_","sṛj","PPP","","_","_"
3,"_","_","_","tvat","PPR","","_","_"
4,"_","_","_","hi","CX","","_","_"
5,"_","_","_","ida","PRD","","_","_"
6,"mā","_","_","mā","CNG","","_","_"
7,"_","_","_","kup","V","kup","_","_"
8,"_","_","_","ida","PRD","","_","_"
9,"pitāmaha","_","_","pitāmaha","NC","","_","_"
1,"tava","_","_","tvat","PPR","","_","_"
2,"_","_","_","tejas","NC","","_","_"
3,"_","_","_","agni","NC","","_","_"
4,"deva","_","_","deva","NC","","_","_"
5,"prajā","_","_","prajā","NC","","_","_"
6,"dahyanti","_","_","dah","V","dah","_","_"
7,"sarvaśaḥ","_","_","sarvaśas","CX","","_","_"
1,"tā","_","_","tad","PRD","","_","_"
2,"dṛṣṭvā","_","_","dṛś","CGDA","","_","_"
3,"mama","_","_","mat","PPR","","_","_"
4,"kāruṇyaṃ","_","_","kāruṇya","NC","","_","_"
5,"mā","_","_","mā","CNG","","_","_"
6,"_","_","_","kup","V","kup","_","_"
7,"_","_","_","ida","PRD","","_","_"
8,"jagatprabho","_","_","jagatprabhu","NC","","_","_"
1,"prajāpatir","_","_","prajāpati","NC","","_","_"
2,"uvāca","_","_","vak","V","vac","_","_"
1,"na","_","_","na","CNG","","_","_"
2,"kupye","_","_","kup","V","kup","_","_"
3,"na","_","_","na","CNG","","_","_"
4,"ca","_","_","ca","CCD","","_","_"
5,"me","_","_","mat","PPR","","_","_"
6,"kāmo","_","_","kāma","NC","","_","_"
7,"na","_","_","na","CNG","","_","_"
8,"bhaveran","_","_","bhav","V","bhū","_","_"
9,"prajā","_","_","prajā","NC","","_","_"
10,"iti","_","_","iti","CQT","","_","_"
1,"_","_","_","lāghava","NC","","_","_"
2,"_","_","_","artha","NC","","_","_"
3,"_","_","_","dharaṇī","NC","","_","_"
4,"_","_","_","tu","CCD","","_","_"
5,"tataḥ","_","_","tatas","CX","","_","_"
6,"saṃhāra","_","_","saṃhāra","NC","","_","_"
7,"iṣyate","_","_","iṣ","V","iṣ","_","_"
1,"iyaṃ","_","_","ida","PRD","","_","_"
2,"hi","_","_","hi","CX","","_","_"
3,"māṃ","_","_","mat","PPR","","_","_"
4,"sadā","_","_","sadā","CAD","","_","_"
5,"devī","_","_","devī","NC","","_","_"
6,"_","_","_","bhāra","NC","","_","_"
7,"_","_","_","ārta","JJ","","_","_"
8,"samacodayat","_","_","saṃcoday","V","saṃcoday","_","_"
1,"_","_","_","saṃhāra","NC","","_","_"
2,"_","_","_","artha","NC","","_","_"
3,"mahādeva","_","_","mahādeva","NC","","_","_"
4,"_","_","_","bhāra","NC","","_","_"
5,"_","_","_","ap","NC","","_","_"
6,"nimajjati","_","_","nimajj","V","nimajj","_","_"
1,"_","_","_","yadā","CSB","","_","_"
2,"_","_","_","mat","PPR","","_","_"
3,"_","_","_","na","CNG","","_","_"
4,"_","_","_","adhiga","V","adhiga","_","_"
5,"buddhyā","_","_","buddhi","NC","","_","_"
6,"bahu","_","_","bahu","JJ","","_","_"
7,"vicārayan","_","_","vicāray","KDP","","_","_"
1,"saṃhāram","_","_","saṃhāra","NC","","_","_"
2,"āsāṃ","_","_","ida","PRD","","_","_"
3,"vṛddhānāṃ","_","_","vṛdh","PPP","","_","_"
4,"tato","_","_","tatas","CX","","_","_"
5,"māṃ","_","_","mat","PPR","","_","_"
6,"krodha","_","_","krodha","NC","","_","_"
7,"āviśat","_","_","viś","V","viś","_","_"
1,"sthāṇur","_","_","sthāṇu","NC","","_","_"
2,"uvāca","_","_","vak","V","vac","_","_"
1,"_","_","_","saṃhāra","NC","","_","_"
2,"_","_","_","anta","NC","","_","_"
3,"prasīdasva","_","_","prasīd","V","prasad","_","_"
4,"mā","_","_","mā","CNG","","_","_"
5,"_","_","_","krudhy","V","krudh","_","_"
6,"_","_","_","tridaśeśvara","NC","","_","_"
1,"mā","_","_","mā","CNG","","_","_"
2,"prajāḥ","_","_","prajā","NC","","_","_"
3,"sthāvaraṃ","_","_","sthāvara","JJ","","_","_"
4,"vai","_","_","vai","CX","","_","_"
5,"ca","_","_","ca","CCD","","_","_"
6,"jaṅgamaṃ","_","_","jaṅgama","JJ","","_","_"
7,"ca","_","_","ca","CCD","","_","_"
8,"vinīnaśaḥ","_","_","vinaś","V","vinaś","_","_"
1,"palvalāni","_","_","palvala","NC","","_","_"
2,"ca","_","_","ca","CCD","","_","_"
3,"sarvāṇi","_","_","sarva","JQ","","_","_"
4,"sarvaṃ","_","_","sarva","JQ","","_","_"
5,"_","_","_","ca","CCD","","_","_"
6,"_","_","_","eva","CEM","","_","_"
7,"_","_","_","tṛṇa","NC","","_","_"
8,"_","_","_","ulapa","NC","","_","_"
1,"sthāvaraṃ","_","_","sthāvara","JJ","","_","_"
2,"jaṅgamaṃ","_","_","jaṅgama","JJ","","_","_"
3,"_","_","_","ca","CCD","","_","_"
4,"_","_","_","eva","CEM","","_","_"
5,"_","_","_","bhūta","NC","","_","_"
6,"_","_","_","grāma","NC","","_","_"
7,"caturvidham","_","_","caturvidha","JJ","","_","_"
1,"tad","_","_","tad","PRD","","_","_"
2,"etad","_","_","tad","PRD","","_","_"
3,"bhasmasād","_","_","bhasmasāt","CX","","_","_"
4,"bhūtaṃ","_","_","bhū","PPP","","_","_"
5,"jagat","_","_","jagat","NC","","_","_"
6,"sarvam","_","_","sarva","JQ","","_","_"
7,"upaplutam","_","_","upaplu","PPP","","_","_"
1,"prasīda","_","_","prasīd","V","prasad","_","_"
2,"bhagavan","_","_","bhagavat","JJ","","_","_"
3,"sādho","_","_","sādhu","JJ","","_","_"
4,"vara","_","_","vara","NC","","_","_"
5,"eṣa","_","_","tad","PRD","","_","_"
6,"vṛto","_","_","vṛ","PPP","","_","_"
7,"mayā","_","_","mat","PPR","","_","_"
1,"naṣṭā","_","_","naś","PPP","","_","_"
2,"na","_","_","na","CNG","","_","_"
3,"punar","_","_","punar","CAD","","_","_"
4,"eṣyanti","_","_","e","V","i","_","_"
5,"prajā","_","_","prajā","NC","","_","_"
6,"_","_","_","hi","CX","","_","_"
7,"_","_","_","tad","PRD","","_","_"
8,"kathaṃcana","_","_","kathaṃcana","CX","","_","_"
1,"_","_","_","tasmāt","CX","","_","_"
2,"_","_","_","nivartay","V","nivartay","_","_"
3,"etat","_","_","tad","PRD","","_","_"
4,"tejaḥ","_","_","tejas","NC","","_","_"
5,"_","_","_","sva","JJ","","_","_"
6,"_","_","_","eva","CEM","","_","_"
7,"tejasā","_","_","tejas","NC","","_","_"
1,"upāyam","_","_","upāya","NC","","_","_"
2,"anyaṃ","_","_","anya","PPX","","_","_"
3,"saṃpaśya","_","_","sampaś","V","saṃpaś","_","_"
4,"prajānāṃ","_","_","prajā","NC","","_","_"
5,"_","_","_","hita","NC","","_","_"
6,"_","_","_","kāmyā","NC","","_","_"
1,"_","_","_","yathā","CCM","","_","_"
2,"_","_","_","ida","PRD","","_","_"
3,"jantavaḥ","_","_","jantu","NC","","_","_"
4,"sarve","_","_","sarva","JQ","","_","_"
5,"nivarteran","_","_","nivart","V","nivṛt","_","_"
6,"paraṃtapa","_","_","paraṃtapa","JJ","","_","_"
1,"abhāvam","_","_","abhāva","NC","","_","_"
2,"abhigaccheyur","_","_","abhiga","V","abhiga","_","_"
3,"_","_","_","utsad","PPP","","_","_"
4,"_","_","_","prajana","NC","","_","_"
5,"prajāḥ","_","_","prajā","NC","","_","_"
1,"_","_","_","adhidaiva","NC","","_","_"
2,"_","_","_","niyuj","PPP","","_","_"
3,"'smi","_","_","as","V","as","_","_"
4,"tvayā","_","_","tvat","PPR","","_","_"
5,"_","_","_","loka","NC","","_","_"
6,"_","_","_","iha","CAD","","_","_"
7,"_","_","_","īśvara","NC","","_","_"
1,"_","_","_","tvat","PPR","","_","_"
2,"_","_","_","bhava","NC","","_","_"
3,"hi","_","_","hi","CX","","_","_"
4,"jagannātha","_","_","jagannātha","NC","","_","_"
5,"jagat","_","_","jagat","NC","","_","_"
6,"_","_","_","sthāvara","JJ","","_","_"
7,"_","_","_","jaṅgama","JJ","","_","_"
1,"prasādya","_","_","prasāday","CGDA","","_","_"
2,"tvāṃ","_","_","tvat","PPR","","_","_"
3,"mahādeva","_","_","mahādeva","NC","","_","_"
4,"_","_","_","yāc","V","yāc","_","_"
5,"_","_","_","āvṛtti","NC","","_","_"
6,"_","_","_","ja","JJ","","_","_"
7,"prajāḥ","_","_","prajā","NC","","_","_"
1,"nārada","_","_","nārada","NC","","_","_"
2,"uvāca","_","_","vak","V","vac","_","_"
1,"śrutvā","_","_","śru","CGDA","","_","_"
2,"tu","_","_","tu","CCD","","_","_"
3,"vacanaṃ","_","_","vacana","NC","","_","_"
4,"devaḥ","_","_","deva","NC","","_","_"
5,"sthāṇor","_","_","sthāṇu","NC","","_","_"
6,"_","_","_","niya","PPP","","_","_"
7,"_","_","_","vāc","NC","","_","_"
8,"_","_","_","manas","NC","","_","_"
1,"_","_","_","tejas","NC","","_","_"
2,"_","_","_","tad","PRD","","_","_"
3,"svaṃ","_","_","sva","JJ","","_","_"
4,"nijagrāha","_","_","nigrah","V","nigrah","_","_"
5,"punar","_","_","punar","CAD","","_","_"
6,"_","_","_","eva","CEM","","_","_"
7,"_","_","_","antar","CAD","","_","_"
8,"ātmanā","_","_","ātman","NC","","_","_"
1,"tato","_","_","tatas","CX","","_","_"
2,"'gnim","_","_","agni","NC","","_","_"
3,"upasaṃgṛhya","_","_","upasaṃgrah","CGDA","","_","_"
4,"bhagavāṃl","_","_","bhagavat","JJ","","_","_"
5,"_","_","_","loka","NC","","_","_"
6,"_","_","_","pūjay","PPP","","_","_"
1,"pravṛttiṃ","_","_","pravṛtti","NC","","_","_"
2,"ca","_","_","ca","CCD","","_","_"
3,"nivṛttiṃ","_","_","nivṛtti","NC","","_","_"
4,"ca","_","_","ca","CCD","","_","_"
5,"kalpayāmāsa","_","_","kalpay","V","kalpay","_","_"
6,"vai","_","_","vai","CX","","_","_"
7,"prabhuḥ","_","_","prabhu","JJ","","_","_"
1,"_","_","_","upasaṃhṛ","KDP","","_","_"
2,"_","_","_","tad","PRD","","_","_"
3,"tam","_","_","tad","PRD","","_","_"
4,"agniṃ","_","_","agni","NC","","_","_"
5,"_","_","_","roṣa","NC","","_","_"
6,"_","_","_","ja","JJ","","_","_"
7,"tadā","_","_","tadā","CAD","","_","_"
1,"prādurbabhūva","_","_","prādurbhav","V","prādurbhū","_","_"
2,"viśvebhyaḥ","_","_","viśva","JQ","","_","_"
3,"khebhyo","_","_","kha","NC","","_","_"
4,"nārī","_","_","nārī","NC","","_","_"
5,"mahātmanaḥ","_","_","mahātman","JJ","","_","_"
1,"kṛṣṇā","_","_","kṛṣṇa","JJ","","_","_"
2,"_","_","_","rakta","JJ","","_","_"
3,"_","_","_","ambara","NC","","_","_"
4,"_","_","_","dhara","JJ","","_","_"
5,"_","_","_","rakta","JJ","","_","_"
6,"_","_","_","netra","NC","","_","_"
7,"_","_","_","tala","NC","","_","_"
8,"_","_","_","antara","NC","","_","_"
1,"_","_","_","divya","JJ","","_","_"
2,"_","_","_","kuṇḍala","NC","","_","_"
3,"_","_","_","sampad","PPP","","_","_"
4,"_","_","_","divya","JJ","","_","_"
5,"_","_","_","ābharaṇa","NC","","_","_"
6,"_","_","_","bhūṣay","PPP","","_","_"
1,"sā","_","_","tad","PRD","","_","_"
2,"viniḥsṛtya","_","_","viniḥsṛ","CGDA","","_","_"
3,"vai","_","_","vai","CX","","_","_"
4,"khebhyo","_","_","kha","NC","","_","_"
5,"dakṣiṇām","_","_","dakṣiṇa","JJ","","_","_"
6,"āśritā","_","_","āśri","PPP","","_","_"
7,"diśam","_","_","diś","NC","","_","_"
1,"dadṛśāte","_","_","darś","V","dṛś","_","_"
2,"'tha","_","_","atha","CAD","","_","_"
3,"tau","_","_","tad","PRD","","_","_"
4,"kanyāṃ","_","_","kanyā","NC","","_","_"
5,"devau","_","_","deva","NC","","_","_"
6,"_","_","_","viśva","JQ","","_","_"
7,"_","_","_","īśvara","NC","","_","_"
8,"_","_","_","ubh","PPX","","_","_"
1,"tām","_","_","tad","PRD","","_","_"
2,"āhūya","_","_","āhvā","CGDA","","_","_"
3,"tadā","_","_","tadā","CAD","","_","_"
4,"devo","_","_","deva","NC","","_","_"
5,"lokānām","_","_","loka","NC","","_","_"
6,"ādir","_","_","ādi","NC","","_","_"
7,"īśvaraḥ","_","_","īśvara","NC","","_","_"
1,"mṛtyo","_","_","mṛtyu","NC","","_","_"
2,"iti","_","_","iti","CQT","","_","_"
3,"mahīpāla","_","_","mahīpāla","NC","","_","_"
4,"jahi","_","_","jah","V","hā","_","_"
5,"_","_","_","ca","CCD","","_","_"
6,"_","_","_","ida","PRD","","_","_"
7,"prajā","_","_","prajā","NC","","_","_"
8,"iti","_","_","iti","CQT","","_","_"
1,"tvaṃ","_","_","tvat","PPR","","_","_"
2,"hi","_","_","hi","CX","","_","_"
3,"_","_","_","saṃhāra","NC","","_","_"
4,"_","_","_","buddhi","NC","","_","_"
5,"me","_","_","mat","PPR","","_","_"
6,"cintitā","_","_","cintay","PPP","","_","_"
7,"ruṣitena","_","_","ruṣ","PPP","","_","_"
8,"ca","_","_","ca","CCD","","_","_"
1,"tasmāt","_","_","tasmāt","CX","","_","_"
2,"saṃhara","_","_","saṃhar","V","saṃhṛ","_","_"
3,"_","_","_","sarva","JQ","","_","_"
4,"_","_","_","tvat","PPR","","_","_"
5,"prajāḥ","_","_","prajā","NC","","_","_"
6,"_","_","_","sa_saha","CX","","_","_"
7,"_","_","_","jaḍa","JJ","","_","_"
8,"_","_","_","paṇḍita","JJ","","_","_"
1,"aviśeṣeṇa","_","_","aviśeṣa","NC","","_","_"
2,"_","_","_","ca","CCD","","_","_"
3,"_","_","_","eva","CEM","","_","_"
4,"tvaṃ","_","_","tvat","PPR","","_","_"
5,"prajāḥ","_","_","prajā","NC","","_","_"
6,"saṃhara","_","_","saṃhar","V","saṃhṛ","_","_"
7,"bhāmini","_","_","bhāminī","NC","","_","_"
1,"mama","_","_","mat","PPR","","_","_"
2,"tvaṃ","_","_","tvat","PPR","","_","_"
3,"hi","_","_","hi","CX","","_","_"
4,"niyogena","_","_","niyoga","NC","","_","_"
5,"śreyaḥ","_","_","śreyas","NC","","_","_"
6,"param","_","_","para","PPX","","_","_"
7,"avāpsyasi","_","_","avāps","V","avāp","_","_"
1,"evam","_","_","eva","CX","","_","_"
2,"uktā","_","_","vac","PPP","","_","_"
3,"tu","_","_","tu","CCD","","_","_"
4,"sā","_","_","tad","PRD","","_","_"
5,"devī","_","_","devī","NC","","_","_"
6,"mṛtyuḥ","_","_","mṛtyu","NC","","_","_"
7,"_","_","_","kamala","NC","","_","_"
8,"_","_","_","mālin","JJ","","_","_"
1,"pradadhyau","_","_","pradadhya","V","pradhyā","_","_"
2,"duḥkhitā","_","_","duḥkhita","JJ","","_","_"
3,"bālā","_","_","bālā","NC","","_","_"
4,"_","_","_","sa_saha","CX","","_","_"
5,"_","_","_","aśrupāta","NC","","_","_"
6,"atīva","_","_","atīva","CX","","_","_"
7,"hi","_","_","hi","CX","","_","_"
1,"pāṇibhyāṃ","_","_","pāṇi","NC","","_","_"
2,"_","_","_","ca","CCD","","_","_"
3,"_","_","_","eva","CEM","","_","_"
4,"jagrāha","_","_","grah","V","grah","_","_"
5,"_","_","_","tad","PRD","","_","_"
6,"_","_","_","aśru","NC","","_","_"
7,"janeśvaraḥ","_","_","janeśvara","NC","","_","_"
1,"mānavānāṃ","_","_","mānava","NC","","_","_"
2,"_","_","_","hita","NC","","_","_"
3,"_","_","_","artha","NC","","_","_"
4,"yayāce","_","_","yayāca","V","yāc","_","_"
5,"punar","_","_","punar","CAD","","_","_"
6,"eva","_","_","eva","CEM","","_","_"
7,"ca","_","_","ca","CCD","","_","_"
