"WordID","word","NormSTEM","suffix","lemma","PoS","Root","NormSuffix","NormWord"
NA,"<doc textid = ""mahadandadharanizitavati"" genre = ""dhāraṇī"" title = ""mahādaṇḍadhāraṇīśītavatī"" author = ""n / a"" discourse = ""tantra"" tradition = ""buddh"" period = ""commentarial"" source = ""gretil accessed sept 2020 : http :// gretil.sub.uni-goettingen.d e/ greti l/ corpuste i/ sa_.xml"" date_range = ""1.-8. ce"" notes = ""skt. text normalized by editor g. hidas; dating: first half of the first millenium; scripture likely originates 1st–6th cent ce according to hidas 2017 p. 455; tibetan translation: 800 ce."" religion = ""buddh"" edition = ""based on the ed. by g. hidas 2017"" digitization = ""g. hidas"" segmentation_lemmatization = ""ligeia lugli & buddhist translators workbench team"" metadata_enrichment = ""bruno galasek-hul & buddhist translators workbench team"" proofreader = "" n/ a"" permission = ""permission for derivatives from m. mehner on behalf of gretil"" reconstructions = ""none"">","","","","","","",""
NA,"<page number=""462"">","","","","","","",""
NA,"<s number=""1"">","","","","","","",""
1,"mahā","MAH","ā","mahat","noun-adj","","ā","mahā"
2,"daṇḍa","DAṆḌ","a","daṇḍa","noun-adj","","a","daṇḍa"
3,"dhāraṇī","DHĀRAṆ","ī","dhāraṇī","noun-adj","","ī","dhāraṇī"
4,"śītavatī","ŚĪTAVAT","ī","śītavatī","noun-adj","","ī","śītavatī"
5,"namaḥ","NAM","aḥ","namas","noun-adj","","aḥ","namaḥ"
6,"sarva","SARV","a","sarva","noun-adj","","a","sarva"
7,"buddha","BUDDH","a","buddha","noun-adj","","a","buddha"
8,"bodhisattvebhyaḥ","BODHISATTV","ebhyaḥ","bodhisattva","noun-adj","","ebhyaḥ","bodhisattvebhyaḥ"
9,"/","","","","punct","","","/"
NA,"</s>","","","","","","",""
NA,"<s number=""2"">","","","","","","",""
1,"evaṃ","","","eva","ind","","","eva"
2,"mayā","","","mat","pron","","","mat"
3,"śrutam","ŚRUT","am","śruta","noun-adj","","am","śrutam"
4,"ekasmin","EK","asmin","eka","noun-adj","","asmin","ekasmin"
5,"samaye","SAMAY","e","samaya","noun-adj","","e","samaye"
6,"bhagavān","BHAGAV","ān","bhagavat","noun-adj","","ān","bhagavān"
7,"rājagṛhe","RĀJAGṚH","e","rājagṛha","noun-adj","","e","rājagṛhe"
8,"viharati","VIHAR","ati","vihar","verb","vihṛ","ati","viharati"
9,"sma","","","sma","ind","","","sma"
10,"/","","","","punct","","","/"
NA,"</s>","","","","","","",""
NA,"<s number=""3"">","","","","","","",""
1,"śītavane","ŚĪTAVAN","e","śītavana","noun-adj","","e","śītavane"
2,"mahā","MAH","ā","mahat","noun-adj","","ā","mahā"
3,"śmaśāne","ŚMAŚĀN","e","śmaśāna","noun-adj","","e","śmaśāne"
4,"iṅghik","IṄGHIK","a","iṅghika","noun-adj","","a","iṅghika"
5,"^āyatana","ĀYATAN","a","āyatana","noun-adj","","a","āyatana"
6,"pratyuddeśe","PRATYUDDEŚ","e","pratyuddeśa","noun-adj","","e","pratyuddeśe"
7,"/","","","","punct","","","/"
NA,"</s>","","","","","","",""
NA,"<s number=""4"">","","","","","","",""
1,"tatr","","","tatra","ind","","","tatra"
2,"āyuṣmān","ĀYUṢM","ān","āyuṣmat","noun-adj","","ān","āyuṣmān"
3,"rāhulo","RĀHUL","o","rāhula","noun-adj","","aḥ","rāhulaḥ"
4,"atīva","ATĪV","a","atīva","noun-adj","","a","atīva"
5,"viheṭhyate","VIHEṬH","yate","viheṭh","verb","","yate","viheṭhyate"
6,"deva","DEV","a","deva","noun-adj","","a","deva"
7,"grahair","GRAH","air","graha","noun-adj","","air","grahair"
8,"nāga","NĀG","a","nāga","noun-adj","","a","nāga"
9,"grahair","GRAH","air","graha","noun-adj","","air","grahair"
10,"yakṣa","YAKṢ","a","yakṣa","noun-adj","","a","yakṣa"
11,"grahai","GRAH","ai","graha","noun-adj","","ai","grahai"
12,"rākṣasa","RĀKṢAS","a","rākṣasa","noun-adj","","a","rākṣasa"
13,"grahaiḥ","GRAH","aiḥ","graha","noun-adj","","air","grahair"
14,"kinnara","KIṂNAR","a","kiṃnara","noun-adj","","a","kiṃnara"
15,"grahair","GRAH","air","graha","noun-adj","","air","grahair"
16,"garuḍa","GARUḌ","a","garuḍa","noun-adj","","a","garuḍa"
17,"grahair","GRAH","air","graha","noun-adj","","air","grahair"
18,"mahoraga","MAHORAG","a","mahoraga","noun-adj","","a","mahoraga"
19,"grahair","GRAH","air","graha","noun-adj","","air","grahair"
20,"manuṣya","MANUṢY","a","manuṣya","noun-adj","","a","manuṣya"
21,"grahair","GRAH","air","graha","noun-adj","","air","grahair"
22,"a","","","alpha_privativum","ind","","","alpha_privativum"
23,"manuṣya","MANUṢY","a","manuṣya","noun-adj","","a","manuṣya"
24,"grahaiḥ","GRAH","aiḥ","graha","noun-adj","","air","grahair"
25,"preta","PRET","a","preta","noun-adj","","a","preta"
26,"grahair","GRAH","air","graha","noun-adj","","air","grahair"
27,"bhūta","BHŪT","a","bhūta","noun-adj","","a","bhūta"
28,"grahaiḥ","GRAH","aiḥ","graha","noun-adj","","air","grahair"
29,"piśāca","PIŚĀC","a","piśāca","noun-adj","","a","piśāca"
30,"grahaiḥ","GRAH","aiḥ","graha","noun-adj","","air","grahair"
31,"kumbhāṇḍa","KUMBHĀṆḌ","a","kumbhāṇḍa","noun-adj","","a","kumbhāṇḍa"
32,"grahair","GRAH","air","graha","noun-adj","","air","grahair"
NA,"</page>","","","","","","",""
NA,"<page number=""463"">","","","","","","",""
35,"dvīpibhiḥ","DVĪP","ibhiḥ","dvīpin","noun-adj","","ibhiḥ","dvīpibhiḥ"
36,"kākair","KĀK","air","kāka","noun-adj","","air","kākair"
37,"ulūkaiḥ","ULŪK","aiḥ","ulūka","noun-adj","","air","ulūkair"
38,"kīṭaiḥ","KĪṬ","aiḥ","kīṭa","noun-adj","","air","kīṭair"
39,"sarī","SAR","ī","sarī","noun-adj","","ī","sarī"
40,"sṛpaiṛ","SṚP","aiṛ","sṛpa","noun-adj","","aiṛ","sṛpaiṛ"
41,"anyaiś","ANY","aiś","anya","pron","","aiś","anyaiś"
42,"ca","","","ca","ind","","","ca"
43,"manuṣy","MANUṢY","","manuṣya","noun-adj","","","manuṣy"
44,"ā","","","alpha_privativum","ind","","","alpha_privativum"
45,"manuṣyaiḥ","MANUṢY","aiḥ","manuṣya","noun-adj","","air","manuṣyair"
46,"sattvaiḥ","SATTV","aiḥ","sattva","noun-adj","","air","sattvair"
47,"/","","","","punct","","","/"
NA,"</s>","","","","","","",""
NA,"<s number=""5"">","","","","","","",""
1,"ath","","a","atha","ind","","a","atha"
2,"^āyuṣmān","ĀYUṢM","ān","āyuṣmat","noun-adj","","ān","āyuṣmān"
3,"rāhulo","RĀHUL","o","rāhula","noun-adj","","aḥ","rāhulaḥ"
4,"yena","","","yad","pron","","","yad"
5,"bhagavāṃs","BHAGAV","āṃs","bhagavat","noun-adj","","āṃs","bhagavāṃs"
6,"ten","","","tad","pron","","","tad"
7,"opasaṃkrānta","UPASAṂKRĀNT","a","upasaṃkrānta","noun-adj","","a","upasaṃkrānta"
8,"upasaṃkramya","UPASAṂKRAM","ya","upasaṃkram","verb","upasaṃkram","ya","upasaṃkramya"
9,"bhagavataḥ","BHAGAV","ataḥ","bhagavat","noun-adj","","ataḥ","bhagavataḥ"
10,"pādau","PĀD","au","pāda","noun-adj","","au","pādau"
11,"śiras","ŚIRAS","a","śiras","noun-adj","","a","śirasa"
12,"^ābhivanditvā","ABHIVAND","itvā","abhivand","verb","abhivand","tvā","abhivandtvā"
13,"bhagavantaṃ","BHAGAV","antaṃ","bhagavat","noun-adj","","antam","bhagavantam"
14,"tripradakṣiṇīkṛtya","TRIPRADAKṢIṆĪKṚTY","a","tripradakṣiṇīkṛtya","noun-adj","","a","tripradakṣiṇīkṛtya"
15,"bhagavataḥ","BHAGAV","ataḥ","bhagavat","noun-adj","","ataḥ","bhagavataḥ"
16,"purato","PURAT","o","puratas","noun-adj","","aḥ","purataḥ"
17,"rudann","RUDAN","n","rudana","noun-adj","","n","rudann"
18,"a","","","alpha_privativum","ind","","","alpha_privativum"
19,"śrūṇi","ŚRŪṆ","i","śrūṇi","noun-adj","","i","śrūṇi"
20,"pravartayati","PRAVART","ayati","pravart","verb","pravṛt","ayati","pravartayati"
21,"sma","","","sma","ind","","","sma"
22,"/","","","","punct","","","/"
NA,"</s>","","","","","","",""
NA,"<s number=""6"">","","","","","","",""
NA,"</page>","","","","","","",""
NA,"<page number=""464"">","","","","","","",""
3,"atha","","","atha","ind","","","atha"
4,"bhagavān","BHAGAV","ān","bhagavat","noun-adj","","ān","bhagavān"
5,"jānann","JĀN","ann","jānat","noun-adj","","ann","jānann"
6,"eva","","","eva","ind","","","eva"
7,"rāhulam","RĀHUL","am","rāhula","noun-adj","","am","rāhulam"
8,"āmantrayate","AMANTR","ayate","amantr","verb","","yate","amantryate"
9,"sma","","","sma","ind","","","sma"
10,"/","","","","punct","","","/"
NA,"</s>","","","","","","",""
NA,"<s number=""7"">","","","","","","",""
1,"kiṃ","","","kim","pron","","","kim"
2,"tvaṃ","","","tvat","pron","","","tvat"
3,"rāhula","RĀHUL","a","rāhula","noun-adj","","a","rāhula"
4,"mama","MAM","a","mat","pron","","a","mama"
5,"purataḥ","PURAT","aḥ","puratas","noun-adj","","aḥ","purataḥ"
6,"sthitvā","STH","itvā","tiṣṭh","verb","sthā","tvā","sthtvā"
7,"a","","","alpha_privativum","ind","","","alpha_privativum"
8,"śrūṇi","ŚRŪṆ","i","śrūṇi","noun-adj","","i","śrūṇi"
9,"pravartayasi","PRAVARTAY","asi","pravart","verb","pravṛt","asi","pravartayasi"
10,"/","","","","punct","","","/"
NA,"</s>","","","","","","",""
NA,"<s number=""8"">","","","","","","",""
1,"evam","","","eva","ind","","","eva"
2,"ukte","UKT","e","ukta","noun-adj","","e","ukte"
3,"āyuṣmān","ĀYUṢM","ān","āyuṣmat","noun-adj","","ān","āyuṣmān"
4,"rāhulo","RĀHUL","o","rāhula","noun-adj","","aḥ","rāhulaḥ"
5,"bhagavantam","BHAGAV","antam","bhagavat","noun-adj","","antam","bhagavantam"
6,"etad","ETAD","","tad","pron","","","etad"
7,"avocat","AVOCAT","","vak","verb","","","avocat"
8,"/","","","","punct","","","/"
NA,"</s>","","","","","","",""
NA,"<s number=""9"">","","","","","","",""
1,"ih","","","iha","ind","","","iha"
2,"āhaṃ","ĀHAṂ","","mat","pron","","","āhaṃ"
3,"bhagavan","BHAGAV","an","bhagavat","noun-adj","","ān","bhagavān"
4,"rājagṛhe","RĀJAGṚH","e","rājagṛha","noun-adj","","e","rājagṛhe"
5,"viharāmi","VIHAR","āmi","vihar","verb","vihṛ","āmi","viharāmi"
6,"/","","","","punct","","","/"
NA,"</s>","","","","","","",""
NA,"<s number=""10"">","","","","","","",""
1,"śītavane","ŚĪTAVAN","e","śītavana","noun-adj","","e","śītavane"
2,"mahā","MAH","ā","mahat","noun-adj","","ā","mahā"
3,"śmaśāne","ŚMAŚĀN","e","śmaśāna","noun-adj","","e","śmaśāne"
4,"iṅghik","IṄGHIK","a","iṅghika","noun-adj","","a","iṅghika"
5,"^āyatana","ĀYATAN","a","āyatana","noun-adj","","a","āyatana"
6,"pratyuddeśe","PRATYUDDEŚ","e","pratyuddeśa","noun-adj","","e","pratyuddeśe"
7,"/","","","","punct","","","/"
NA,"</s>","","","","","","",""
NA,"<s number=""11"">","","","","","","",""
1,"so","","","tad","pron","","","tad"
2,"ahaṃ","AHAṂ","","mat","pron","","","ahaṃ"
3,"bhagavaṃs","BHAGAV","aṃs","bhagavat","noun-adj","","aṃs","bhagavaṃs"
4,"tatra","","","tatra","ind","","","tatra"
5,"viheṭhye","VIHEṬH","ye","viheṭh","verb","","ye","viheṭhye"
6,"deva","DEV","a","deva","noun-adj","","a","deva"
7,"grahair","GRAH","air","graha","noun-adj","","air","grahair"
8,"nāga","NĀG","a","nāga","noun-adj","","a","nāga"
9,"grahair","GRAH","air","graha","noun-adj","","air","grahair"
10,"yakṣa","YAKṢ","a","yakṣa","noun-adj","","a","yakṣa"
11,"grahai","GRAH","ai","graha","noun-adj","","ai","grahai"
12,"rākṣasa","RĀKṢAS","a","rākṣasa","noun-adj","","a","rākṣasa"
13,"grahaiḥ","GRAH","aiḥ","graha","noun-adj","","air","grahair"
14,"kinnara","KIṂNAR","a","kiṃnara","noun-adj","","a","kiṃnara"
15,"grahair","GRAH","air","graha","noun-adj","","air","grahair"
NA,"</page>","","","","","","",""
NA,"<page number=""464"">","","","","","","",""
18,"garuḍa","GARUḌ","a","garuḍa","noun-adj","","a","garuḍa"
19,"grahair","GRAH","air","graha","noun-adj","","air","grahair"
20,"mahoraga","MAHORAG","a","mahoraga","noun-adj","","a","mahoraga"
21,"grahair","GRAH","air","graha","noun-adj","","air","grahair"
22,"manuṣya","MANUṢY","a","manuṣya","noun-adj","","a","manuṣya"
23,"grahair","GRAH","air","graha","noun-adj","","air","grahair"
24,"a","","","alpha_privativum","ind","","","alpha_privativum"
25,"manuṣya","MANUṢY","a","manuṣya","noun-adj","","a","manuṣya"
26,"grahaiḥ","GRAH","aiḥ","graha","noun-adj","","air","grahair"
27,"preta","PRET","a","preta","noun-adj","","a","preta"
28,"grahair","GRAH","air","graha","noun-adj","","air","grahair"
29,"bhūta","BHŪT","a","bhūta","noun-adj","","a","bhūta"
30,"grahaiḥ","GRAH","aiḥ","graha","noun-adj","","air","grahair"
31,"piśāca","PIŚĀC","a","piśāca","noun-adj","","a","piśāca"
32,"grahaiḥ","GRAH","aiḥ","graha","noun-adj","","air","grahair"
33,"kumbhāṇḍa","KUMBHĀṆḌ","a","kumbhāṇḍa","noun-adj","","a","kumbhāṇḍa"
34,"grahair","GRAH","air","graha","noun-adj","","air","grahair"
35,"dvīpibhiḥ","DVĪP","ibhiḥ","dvīpin","noun-adj","","ibhiḥ","dvīpibhiḥ"
36,"kākair","KĀK","air","kāka","noun-adj","","air","kākair"
37,"ulūkaiḥ","ULŪK","aiḥ","ulūka","noun-adj","","air","ulūkair"
38,"kīṭaiḥ","KĪṬ","aiḥ","kīṭa","noun-adj","","air","kīṭair"
39,"sarīsṛpair","SARĪSṚP","air","sarīsṛpa","noun-adj","","air","sarīsṛpair"
40,"anyaiś","ANY","aiś","anya","pron","","aiś","anyaiś"
41,"ca","","","ca","ind","","","ca"
42,"manuṣy","MANUṢY","","manuṣya","noun-adj","","","manuṣy"
43,"ā","","","alpha_privativum","ind","","","alpha_privativum"
44,"manuṣyaiḥ","MANUṢY","aiḥ","manuṣya","noun-adj","","air","manuṣyair"
45,"sattvair","SATTV","air","sattva","noun-adj","","air","sattvair"
46,"iti","","","iti","ind","","","iti"
47,"/","","","","punct","","","/"
NA,"</s>","","","","","","",""
NA,"<s number=""12"">","","","","","","",""
1,"atha","","","atha","ind","","","atha"
2,"khalu","KHAL","u","khalu","noun-adj","","u","khalu"
3,"bhagavān","BHAGAV","ān","bhagavat","noun-adj","","ān","bhagavān"
4,"āyuṣmantaṃ","ĀYUṢM","antaṃ","āyuṣmat","noun-adj","","antam","āyuṣmantam"
5,"rāhulam","RĀHUL","am","rāhula","noun-adj","","am","rāhulam"
6,"āmantrayate","AMANTR","ayate","amantr","verb","","yate","amantryate"
7,"sma","","","sma","ind","","","sma"
8,"/","","","","punct","","","/"
NA,"</s>","","","","","","",""
NA,"<s number=""13"">","","","","","","",""
1,"udgṛhṇa","UDGṚHṆ","a","udgṛhṇāti","noun-adj","","a","udgṛhṇa"
2,"tvaṃ","","","tvat","pron","","","tvat"
3,"rāhula","RĀHUL","a","rāhula","noun-adj","","a","rāhula"
4,"imāṃ","","","idam","pron","","","idam"
5,"mahā","MAH","ā","mahat","noun-adj","","ā","mahā"
6,"daṇḍa","DAṆḌ","a","daṇḍa","noun-adj","","a","daṇḍa"
7,"dhāraṇīṃ","DHĀRAṆ","īṃ","dhāraṇī","noun-adj","","īm","dhāraṇīm"
8,"vidyām","VIDY","ām","vidyā","noun-adj","","ām","vidyām"
9,"/","","","","punct","","","/"
NA,"</s>","","","","","","",""
NA,"<s number=""14"">","","","","","","",""
1,"catasṛṇāṃ","CATAS","ṛṇāṃ","catasṛ","noun-adj","","ṛṇām","catasṛṇām"
2,"parṣadāṃ","PARṢAD","āṃ","parṣad","noun-adj","","ām","parṣadām"
3,"rakṣāvaraṇaguptaye","RAKṢĀVARAṆAGUPT","aye","rakṣāvaraṇagupti","noun-adj","","aye","rakṣāvaraṇaguptaye"
4,"bhikṣūṇāṃ","BHIKṢ","ūṇāṃ","bhikṣu","noun-adj","","ūnām","bhikṣūnām"
5,"bhikṣuṇīnām","BHIKṢ","uṇīnām","bhikṣuṇī","noun-adj","","uṇīnām","bhikṣuṇīnām"
6,"upāsakānām","UPĀSAK","ānām","upāsaka","noun-adj","","ānām","upāsakānām"
7,"upāsikānāṃ","UPĀSIK","ānāṃ","upāsika","noun-adj","","ānām","upāsikānām"
8,"ca","","","ca","ind","","","ca"
9,"dīrgharātram","DĪRGHARĀTR","am","dīrgharātra","noun-adj","","am","dīrgharātram"
10,"arthāya","ARTH","āya","artha","noun-adj","","āya","arthāya"
11,"hitāya","HIT","āya","hita","noun-adj","","āya","hitāya"
12,"sukhāya","SUKH","āya","sukha","noun-adj","","āya","sukhāya"
13,"bhaviṣyati","BHAVIṢ","yati","bhav","verb","bhū","yati","bhaviṣyati"
14,"/","","","","punct","","","/"
NA,"</s>","","","","","","",""
NA,"<s number=""15"">","","","","","","",""
NA,"</page>","","","","","","",""
NA,"<page number=""465"">","","","","","","",""
3,"tadyathā","","","tadyathā","ind","","","tadyathā"
4,"/","","","","punct","","","/"
NA,"</s>","","","","","","",""
NA,"<s number=""16"">","","","","","","",""
1,"aṅgā","AṄG","ā","aṅga","noun-adj","","ā","aṅgā"
2,"/","","","","punct","","","/"
NA,"</s>","","","","","","",""
NA,"<s number=""17"">","","","","","","",""
1,"vaṅgā","VAṄG","ā","vaṅga","noun-adj","","ā","vaṅgā"
2,"/","","","","punct","","","/"
NA,"</s>","","","","","","",""
NA,"<s number=""18"">","","","","","","",""
1,"bhaṅgā","BHAṄG","ā","bhaṅgā","noun-adj","","ā","bhaṅgā"
2,"/","","","","punct","","","/"
NA,"</s>","","","","","","",""
NA,"<s number=""19"">","","","","","","",""
1,"v","","","vā","ind","","","vā"
2,"araṅgā","ARAṄG","ā","araṅgin","noun-adj","","ā","araṅgā"
3,"/","","","","punct","","","/"
NA,"</s>","","","","","","",""
NA,"<s number=""20"">","","","","","","",""
1,"saṃsāra","SAṂSĀR","a","saṃsāra","noun-adj","","a","saṃsāra"
2,"taraṅgā","TARAṂG","ā","taraṃga","noun-adj","","ā","taraṃgā"
3,"/","","","","punct","","","/"
NA,"</s>","","","","","","",""
NA,"<s number=""21"">","","","","","","",""
1,"sāsa","SĀS","a","sāsa","noun-adj","","a","sāsa"
2,"daṅgā","DAṄG","ā","daṅgh","noun-adj","","ā","daṅgā"
3,"/","","","","punct","","","/"
NA,"</s>","","","","","","",""
NA,"<s number=""22"">","","","","","","",""
1,"bhaṅgā","BHAṄG","ā","bhaṅgā","noun-adj","","ā","bhaṅgā"
2,"/","","","","punct","","","/"
NA,"</s>","","","","","","",""
NA,"<s number=""23"">","","","","","","",""
1,"jesurā","","","","ind","","",""
2,"/","","","","punct","","","/"
NA,"</s>","","","","","","",""
NA,"<s number=""24"">","","","","","","",""
1,"ekatarā","EK","atarā","eka","noun-adj","","atarā","ekatarā"
2,"/","","","","punct","","","/"
NA,"</s>","","","","","","",""
NA,"<s number=""25"">","","","","","","",""
1,"ara","","","ara","ind","","","ara"
2,"vīrā","VĪR","ā","vīrā","noun-adj","","ā","vīrā"
3,"/","","","","punct","","","/"
NA,"</s>","","","","","","",""
NA,"<s number=""26"">","","","","","","",""
1,"tara","","","tara","ind","","","tara"
2,"vīrā","VĪR","ā","vīrā","noun-adj","","ā","vīrā"
3,"/","","","","punct","","","/"
NA,"</s>","","","","","","",""
NA,"<s number=""27"">","","","","","","",""
1,"kara","KAR","a","kara","noun-adj","","a","kara"
2,"vīrā","VĪR","ā","vīrā","noun-adj","","ā","vīrā"
3,"/","","","","punct","","","/"
NA,"</s>","","","","","","",""
NA,"<s number=""28"">","","","","","","",""
1,"kara","KAR","a","kara","noun-adj","","a","kara"
2,"kara","KAR","a","kara","noun-adj","","a","kara"
3,"vīrā","VĪR","ā","vīrā","noun-adj","","ā","vīrā"
4,"/","","","","punct","","","/"
NA,"</s>","","","","","","",""
NA,"<s number=""29"">","","","","","","",""
1,"indrā","INDR","ā","indra","noun-adj","","ā","indrā"
2,"/","","","","punct","","","/"
NA,"</s>","","","","","","",""
NA,"<s number=""30"">","","","","","","",""
1,"indra","INDR","a","indra","noun-adj","","a","indra"
2,"kisarā","KISAR","ā","kisara","noun-adj","","ā","kisarā"
3,"/","","","","punct","","","/"
NA,"</s>","","","","","","",""
NA,"<s number=""31"">","","","","","","",""
1,"haṃsā","HAṂS","ā","haṃsa","noun-adj","","ā","haṃsā"
2,"/","","","","punct","","","/"
NA,"</s>","","","","","","",""
NA,"<s number=""32"">","","","","","","",""
1,"haṃsa","HAṂS","a","haṃsa","noun-adj","","a","haṃsa"
2,"kisarā","KISAR","ā","kisara","noun-adj","","ā","kisarā"
3,"/","","","","punct","","","/"
NA,"</s>","","","","","","",""
NA,"<s number=""33"">","","","","","","",""
1,"pici","PIC","i","pici","noun-adj","","i","pici"
2,"malā","MAL","ā","mala","noun-adj","","ā","malā"
3,"/","","","","punct","","","/"
NA,"</s>","","","","","","",""
NA,"<s number=""34"">","","","","","","",""
1,"mahāki","MAH","āki","mahāka","noun-adj","","āki","mahāki"
2,"c","","a","ca","ind","","a","ca"
3,"^ā","","","alpha_privativum","ind","","","alpha_privativum"
4,"/","","","","punct","","","/"
NA,"</s>","","","","","","",""
NA,"<s number=""35"">","","","","","","",""
1,"viheṭhikā","VIHEṬHIK","ā","viheṭhikā","noun-adj","","ā","viheṭhikā"
2,"/","","","","punct","","","/"
NA,"</s>","","","","","","",""
NA,"<s number=""36"">","","","","","","",""
1,"kālucchikā","KĀLUCCH","ikā","kālucchika","noun-adj","","ikā","kālucchikā"
2,"/","","","","punct","","","/"
NA,"</s>","","","","","","",""
NA,"<s number=""37"">","","","","","","",""
1,"aṅg","AṄG","a","aṅga","noun-adj","","a","aṅga"
2,"^odarā","UDAR","ā","udara","noun-adj","","ā","udarā"
3,"/","","","","punct","","","/"
NA,"</s>","","","","","","",""
NA,"<s number=""38"">","","","","","","",""
1,"jayā","JAY","ā","jaya","noun-adj","","ā","jayā"
2,"/","","","","punct","","","/"
NA,"</s>","","","","","","",""
NA,"<s number=""39"">","","","","","","",""
1,"jay","JAY","a","jaya","noun-adj","","a","jaya"
2,"^ālikā","ALIK","ā","alikā","noun-adj","","ā","alikā"
3,"/","","","","punct","","","/"
NA,"</s>","","","","","","",""
NA,"<s number=""40"">","","","","","","",""
1,"velā","VEL","ā","velā","noun-adj","","ā","velā"
2,"/","","","","punct","","","/"
NA,"</s>","","","","","","",""
NA,"<s number=""41"">","","","","","","",""
1,"elā","","","","ind","","",""
2,"/","","","","punct","","","/"
NA,"</s>","","","","","","",""
NA,"<s number=""42"">","","","","","","",""
1,"cintāli","CINT","āli","cinta","noun-adj","","āli","cintāli"
2,"/","","","","punct","","","/"
NA,"</s>","","","","","","",""
NA,"<s number=""43"">","","","","","","",""
1,"cili","CIL","i","cili","noun-adj","","i","cili"
2,"cili","CIL","i","cili","noun-adj","","i","cili"
3,"/","","","","punct","","","/"
NA,"</s>","","","","","","",""
NA,"<s number=""44"">","","","","","","",""
1,"hili","HIL","i","hili","noun-adj","","i","hili"
2,"hili","HIL","i","hili","noun-adj","","i","hili"
3,"/","","","","punct","","","/"
NA,"</s>","","","","","","",""
NA,"<s number=""45"">","","","","","","",""
1,"sumati","SUMAT","i","sumati","noun-adj","","i","sumati"
2,"/","","","","punct","","","/"
NA,"</s>","","","","","","",""
NA,"<s number=""46"">","","","","","","",""
1,"vasumati","VASUMAT","i","vasumati","noun-adj","","i","vasumati"
2,"/","","","","punct","","","/"
NA,"</s>","","","","","","",""
NA,"<s number=""47"">","","","","","","",""
1,"culu","CUL","u","culu","noun-adj","","u","culu"
2,"naṭṭe","NAṬṬ","e","naṭṭā","noun-adj","","e","naṭṭe"
3,"/","","","","punct","","","/"
NA,"</s>","","","","","","",""
NA,"<s number=""48"">","","","","","","",""
1,"culu","CUL","u","culu","noun-adj","","u","culu"
2,"culu","CUL","u","culu","noun-adj","","u","culu"
3,"naṭṭe","NAṬṬ","e","naṭṭā","noun-adj","","e","naṭṭe"
4,"/","","","","punct","","","/"
NA,"</s>","","","","","","",""
NA,"<s number=""49"">","","","","","","",""
1,"culu","CUL","u","culu","noun-adj","","u","culu"
2,"nāḍi","NĀḌ","i","nāḍi","noun-adj","","i","nāḍi"
3,"/","","","","punct","","","/"
NA,"</s>","","","","","","",""
NA,"<s number=""50"">","","","","","","",""
NA,"</page>","","","","","","",""
NA,"<page number=""466"">","","","","","","",""
3,"ku","","","ku","ind","","","ku"
4,"nāḍi","NĀḌ","i","nāḍi","noun-adj","","i","nāḍi"
5,"/","","","","punct","","","/"
NA,"</s>","","","","","","",""
NA,"<s number=""51"">","","","","","","",""
1,"hārīṭaki","HĀR","īṭaki","","noun-adj","","īṭaki","hārīṭaki"
2,"/","","","","punct","","","/"
NA,"</s>","","","","","","",""
NA,"<s number=""52"">","","","","","","",""
1,"kārīṭaki","KĀR","īṭaki","","noun-adj","","īṭaki","kārīṭaki"
2,"/","","","","punct","","","/"
NA,"</s>","","","","","","",""
NA,"<s number=""53"">","","","","","","",""
1,"gauri","GAUR","i","gauri","noun-adj","","i","gauri"
2,"/","","","","punct","","","/"
NA,"</s>","","","","","","",""
NA,"<s number=""54"">","","","","","","",""
1,"gandhāri","GANDHĀR","i","gandhāri","noun-adj","","i","gandhāri"
2,"/","","","","punct","","","/"
NA,"</s>","","","","","","",""
NA,"<s number=""55"">","","","","","","",""
1,"caṇḍāli","CAṆḌĀL","i","caṇḍāli","noun-adj","","i","caṇḍāli"
2,"/","","","","punct","","","/"
NA,"</s>","","","","","","",""
NA,"<s number=""56"">","","","","","","",""
1,"mātaṅgi","MĀTAṂG","i","mātaṃgi","noun-adj","","i","mātaṃgi"
2,"/","","","","punct","","","/"
NA,"</s>","","","","","","",""
NA,"<s number=""57"">","","","","","","",""
1,"dharaṇi","DHARAṆ","i","dharaṇī","noun-adj","","i","dharaṇi"
2,"dhāraṇi","DHĀRAṆ","i","dhāraṇī","noun-adj","","i","dhāraṇi"
3,"/","","","","punct","","","/"
NA,"</s>","","","","","","",""
NA,"<s number=""58"">","","","","","","",""
1,"uṣṭra","UṢṬR","a","uṣṭra","noun-adj","","a","uṣṭra"
2,"pālike","PĀLIK","e","pālika","noun-adj","","e","pālike"
3,"/","","","","punct","","","/"
NA,"</s>","","","","","","",""
NA,"<s number=""59"">","","","","","","",""
1,"kaca","KAC","a","kaca","noun-adj","","a","kaca"
2,"kārike","KĀRIK","e","kārika","noun-adj","","e","kārike"
3,"/","","","","punct","","","/"
NA,"</s>","","","","","","",""
NA,"<s number=""60"">","","","","","","",""
1,"calan","CALAN","a","calana","noun-adj","","a","calana"
2,"^āṭike","ĀṬIK","e","āṭika","noun-adj","","e","āṭike"
3,"/","","","","punct","","","/"
NA,"</s>","","","","","","",""
NA,"<s number=""61"">","","","","","","",""
1,"kākalike","KĀKAL","ike","kākalika","noun-adj","","ike","kākalike"
2,"/","","","","punct","","","/"
NA,"</s>","","","","","","",""
NA,"<s number=""62"">","","","","","","",""
1,"lala","LAL","a","lala","noun-adj","","a","lala"
2,"mati","MAT","i","mati","noun-adj","","i","mati"
3,"/","","","","punct","","","/"
NA,"</s>","","","","","","",""
NA,"<s number=""63"">","","","","","","",""
1,"rakṣam","RAKṢ","am","rakṣa","noun-adj","","am","rakṣam"
2,"ati","","","ati","ind","","","ati"
3,"/","","","","punct","","","/"
NA,"</s>","","","","","","",""
NA,"<s number=""64"">","","","","","","",""
1,"var","VAR","a","vara","noun-adj","","a","vara"
2,"^ākule","ĀKUL","e","ākula","noun-adj","","e","ākule"
3,"/","","","","punct","","","/"
NA,"</s>","","","","","","",""
NA,"<s number=""65"">","","","","","","",""
1,"manmate","MANM","ate","manm","verb","","ate","manmate"
2,"utpale","UTPAL","e","utpala","noun-adj","","e","utpale"
3,"/","","","","punct","","","/"
NA,"</s>","","","","","","",""
NA,"<s number=""66"">","","","","","","",""
1,"kara","KAR","a","kara","noun-adj","","a","kara"
2,"vīre","","","vīra","ind","","","vīra"
3,"/","","","","punct","","","/"
NA,"</s>","","","","","","",""
NA,"<s number=""67"">","","","","","","",""
1,"tara","","","tara","ind","","","tara"
2,"vīre","","","vīra","ind","","","vīra"
3,"/","","","","punct","","","/"
NA,"</s>","","","","","","",""
NA,"<s number=""68"">","","","","","","",""
1,"tara","","","tara","ind","","","tara"
NA,"</page>","","","","","","",""
NA,"<page number=""467"">","","","","","","",""
4,"tara","","","tara","ind","","","tara"
5,"vīre","","","vīra","ind","","","vīra"
6,"/","","","","punct","","","/"
NA,"</s>","","","","","","",""
NA,"<s number=""69"">","","","","","","",""
1,"kuru","KUR","u","kar","verb","kṛ","u","kuru"
2,"vīre","","","vīra","ind","","","vīra"
3,"/","","","","punct","","","/"
NA,"</s>","","","","","","",""
NA,"<s number=""70"">","","","","","","",""
1,"kuru","KUR","u","kar","verb","kṛ","u","kuru"
2,"kuru","KUR","u","kar","verb","kṛ","u","kuru"
3,"vīre","","","vīra","ind","","","vīra"
4,"/","","","","punct","","","/"
NA,"</s>","","","","","","",""
NA,"<s number=""71"">","","","","","","",""
1,"curu","CUR","u","curu","noun-adj","","u","curu"
2,"vīre","","","vīra","ind","","","vīra"
3,"/","","","","punct","","","/"
NA,"</s>","","","","","","",""
NA,"<s number=""72"">","","","","","","",""
1,"curu","CUR","u","curu","noun-adj","","u","curu"
2,"curu","CUR","u","curu","noun-adj","","u","curu"
3,"vīre","","","vīra","ind","","","vīra"
4,"/","","","","punct","","","/"
NA,"</s>","","","","","","",""
NA,"<s number=""73"">","","","","","","",""
1,"mahāvīre","MAHĀVĪR","e","mahāvīra","noun-adj","","e","mahāvīre"
2,"/","","","","punct","","","/"
NA,"</s>","","","","","","",""
NA,"<s number=""74"">","","","","","","",""
1,"i","","","","ind","","",""
2,"ramati","RAM","ati","ram","verb","ram","ati","ramati"
3,"/","","","","punct","","","/"
NA,"</s>","","","","","","",""
NA,"<s number=""75"">","","","","","","",""
1,"varam","VAR","am","vara","noun-adj","","am","varam"
2,"ati","","","ati","ind","","","ati"
3,"/","","","","punct","","","/"
NA,"</s>","","","","","","",""
NA,"<s number=""76"">","","","","","","",""
1,"rakṣam","RAKṢ","am","rakṣa","noun-adj","","am","rakṣam"
2,"ati","","","ati","ind","","","ati"
3,"/","","","","punct","","","/"
NA,"</s>","","","","","","",""
NA,"<s number=""77"">","","","","","","",""
1,"sarv","SARV","a","sarva","noun-adj","","a","sarva"
2,"^ārtha","ARTH","a","artha","noun-adj","","a","artha"
3,"sādhani","SĀDHAN","i","sādhani","noun-adj","","i","sādhani"
4,"/","","","","punct","","","/"
NA,"</s>","","","","","","",""
NA,"<s number=""78"">","","","","","","",""
1,"paramārtha","PARAMĀRTH","a","paramārtha","noun-adj","","a","paramārtha"
2,"sādhani","SĀDHAN","i","sādhani","noun-adj","","i","sādhani"
3,"/","","","","punct","","","/"
NA,"</s>","","","","","","",""
NA,"<s number=""79"">","","","","","","",""
1,"a","","","alpha_privativum","ind","","","alpha_privativum"
2,"pratihate","PRATIHAT","e","pratihata","noun-adj","","e","pratihate"
3,"/","","","","punct","","","/"
NA,"</s>","","","","","","",""
NA,"<s number=""80"">","","","","","","",""
1,"indro","INDR","o","indra","noun-adj","","aḥ","indraḥ"
2,"rājā","RĀJ","ā","rājan","noun-adj","","ā","rājā"
3,"/","","","","punct","","","/"
NA,"</s>","","","","","","",""
NA,"<s number=""81"">","","","","","","",""
1,"yamo","","","yama","ind","","","yama"
2,"rājā","RĀJ","ā","rājan","noun-adj","","ā","rājā"
3,"/","","","","punct","","","/"
NA,"</s>","","","","","","",""
NA,"<s number=""82"">","","","","","","",""
1,"varuṇo","VARUṆ","o","varuṇa","noun-adj","","aḥ","varuṇaḥ"
2,"rājā","RĀJ","ā","rājan","noun-adj","","ā","rājā"
3,"/","","","","punct","","","/"
NA,"</s>","","","","","","",""
NA,"<s number=""83"">","","","","","","",""
1,"kubero","KUBER","o","kubera","noun-adj","","aḥ","kuberaḥ"
2,"rājā","RĀJ","ā","rājan","noun-adj","","ā","rājā"
3,"/","","","","punct","","","/"
NA,"</s>","","","","","","",""
NA,"<s number=""84"">","","","","","","",""
1,"manasvī","MANASV","ī","manasvin","noun-adj","","ī","manasvī"
2,"rājā","RĀJ","ā","rājan","noun-adj","","ā","rājā"
3,"/","","","","punct","","","/"
NA,"</s>","","","","","","",""
NA,"<s number=""85"">","","","","","","",""
1,"vāsukī","VĀSUK","ī","vāsukī","noun-adj","","ī","vāsukī"
2,"rājā","RĀJ","ā","rājan","noun-adj","","ā","rājā"
3,"/","","","","punct","","","/"
NA,"</s>","","","","","","",""
NA,"<s number=""86"">","","","","","","",""
1,"daṇḍ","DAṆḌ","a","daṇḍa","noun-adj","","a","daṇḍa"
2,"^āgnī","AGN","ī","agni","noun-adj","","ī","agnī"
3,"rājā","RĀJ","ā","rājan","noun-adj","","ā","rājā"
4,"/","","","","punct","","","/"
NA,"</s>","","","","","","",""
NA,"<s number=""87"">","","","","","","",""
1,"brahmā","BRAHM","ā","brahman","noun-adj","","ā","brahmā"
2,"sahasr","SAHASR","a","sahasra","noun-adj","","a","sahasra"
3,"^ādhipatī","ADHIPAT","ī","adhipat","noun-adj","","ī","adhipatī"
4,"rājā","RĀJ","ā","rājan","noun-adj","","ā","rājā"
5,"/","","","","punct","","","/"
NA,"</s>","","","","","","",""
NA,"<s number=""88"">","","","","","","",""
1,"buddho","BUDDH","o","buddha","noun-adj","","aḥ","buddhaḥ"
2,"bhagavān","BHAGAV","ān","bhagavat","noun-adj","","ān","bhagavān"
3,"dharma","DHARM","a","dharma","noun-adj","","a","dharma"
4,"svāmī","SVĀM","ī","svāmin","noun-adj","","ī","svāmī"
5,"rājā","RĀJ","ā","rājan","noun-adj","","ā","rājā"
6,"/","","","","punct","","","/"
NA,"</s>","","","","","","",""
NA,"<s number=""89"">","","","","","","",""
1,"anuttaro","ANUTTAR","o","anuttara","noun-adj","","aḥ","anuttaraḥ"
2,"lok","LOK","a","loka","noun-adj","","a","loka"
3,"^ānukampakaḥ","ĀNUKAMP","akaḥ","ānukaṃpaka","noun-adj","","akaḥ","ānukampakaḥ"
4,"/","","","","punct","","","/"
NA,"</s>","","","","","","",""
NA,"<s number=""90"">","","","","","","",""
1,"mama","MAM","a","mat","pron","","a","mama"
2,"sarva","SARV","a","sarva","noun-adj","","a","sarva"
3,"sattvānāṃ","SATTV","ānāṃ","sattva","noun-adj","","ānām","sattvānām"
4,"ca","","","ca","ind","","","ca"
5,"rakṣāṃ","RAKṢ","āṃ","rakṣā","noun-adj","","ām","rakṣām"
6,"kurvantu","KURV","antu","kar","verb","kṛ","anti","kurvanti"
7,"/","","","","punct","","","/"
NA,"</s>","","","","","","",""
NA,"<s number=""91"">","","","","","","",""
1,"paritrāṇaṃ","PARITRĀṆ","aṃ","paritrāṇa","noun-adj","","am","paritrāṇam"
2,"parigrahaṃ","PARIGRAH","aṃ","parigraha","noun-adj","","am","parigraham"
3,"paripālanaṃ","PARIPĀLAN","aṃ","paripālana","noun-adj","","am","paripālanam"
4,"śāntiṃ","ŚĀNT","iṃ","śānti","noun-adj","","im","śāntim"
5,"svasty","SVAST","y","svasti","noun-adj","","i","svasti"
6,"ayanaṃ","AYAN","aṃ","ayana","noun-adj","","am","ayanam"
7,"daṇḍa","DAṆḌ","a","daṇḍa","noun-adj","","a","daṇḍa"
8,"parihāraṃ","PARIHĀR","aṃ","parihāra","noun-adj","","am","parihāram"
9,"śastra","ŚASTR","a","śastra","noun-adj","","a","śastra"
10,"parihāraṃ","PARIHĀR","aṃ","parihāra","noun-adj","","am","parihāram"
11,"viṣa","VIṢ","a","viṣa","noun-adj","","a","viṣa"
12,"dūṣaṇaṃ","DŪṢAṆ","aṃ","dūṣaṇa","noun-adj","","am","dūṣaṇam"
13,"viṣa","VIṢ","a","viṣa","noun-adj","","a","viṣa"
14,"nāśanaṃ","NĀŚAN","aṃ","nāśana","noun-adj","","am","nāśanam"
15,"sīmābandhaṃ","SĪMĀBANDH","aṃ","sīmābandha","noun-adj","","am","sīmābandham"
16,"dharaṇī","DHARAṆ","ī","dharaṇī","noun-adj","","ī","dharaṇī"
17,"bandhaṃ","BANDH","aṃ","bandha","noun-adj","","am","bandham"
18,"ca","","","ca","ind","","","ca"
19,"kurvantu","KURV","antu","kar","verb","kṛ","anti","kurvanti"
20,"/","","","","punct","","","/"
NA,"</s>","","","","","","",""
NA,"<s number=""92"">","","","","","","",""
1,"jīvatu","JĪV","atu","jīv","verb","jīv","ati","jīvati"
2,"varṣa","VARṢ","a","varṣa","noun-adj","","a","varṣa"
3,"śataṃ","ŚAT","aṃ","śata","noun-adj","","am","śatam"
4,"paśyatu","PAŚ","yatu","paś","noun-adj","","yatu","paśyatu"
5,"śaradāṃ","ŚARAD","āṃ","śaradā","noun-adj","","ām","śaradām"
6,"śatam","ŚAT","am","śata","noun-adj","","am","śatam"
7,"/","","","","punct","","","/"
NA,"</s>","","","","","","",""
NA,"<s number=""93"">","","","","","","",""
NA,"</page>","","","","","","",""
NA,"<page number=""469"">","","","","","","",""
3,"tadyathā","","","tadyathā","ind","","","tadyathā"
4,"/","","","","punct","","","/"
NA,"</s>","","","","","","",""
NA,"<s number=""94"">","","","","","","",""
1,"balavati","BAL","avati","bal","verb","","avati","balavati"
2,"/","","","","punct","","","/"
NA,"</s>","","","","","","",""
NA,"<s number=""95"">","","","","","","",""
1,"varam","VAR","am","vara","noun-adj","","am","varam"
2,"ati","","","ati","ind","","","ati"
3,"/","","","","punct","","","/"
NA,"</s>","","","","","","",""
NA,"<s number=""96"">","","","","","","",""
1,"tala","TAL","a","tala","noun-adj","","a","tala"
2,"mati","MAT","i","mati","noun-adj","","i","mati"
3,"/","","","","punct","","","/"
NA,"</s>","","","","","","",""
NA,"<s number=""97"">","","","","","","",""
1,"lakṣam","LAKṢ","am","lakṣa","noun-adj","","am","lakṣam"
2,"ati","","","ati","ind","","","ati"
3,"/","","","","punct","","","/"
NA,"</s>","","","","","","",""
NA,"<s number=""98"">","","","","","","",""
1,"rakṣam","RAKṢ","am","rakṣa","noun-adj","","am","rakṣam"
2,"ati","","","ati","ind","","","ati"
3,"/","","","","punct","","","/"
NA,"</s>","","","","","","",""
NA,"<s number=""99"">","","","","","","",""
1,"huru","","","huras","ind","","","huras"
2,"huru","","","huras","ind","","","huras"
3,"/","","","","punct","","","/"
NA,"</s>","","","","","","",""
NA,"<s number=""100"">","","","","","","",""
1,"phuru","","","","ind","","",""
2,"phuru","","","","ind","","",""
3,"/","","","","punct","","","/"
NA,"</s>","","","","","","",""
NA,"<s number=""101"">","","","","","","",""
1,"cara","CAR","a","cara","noun-adj","","a","cara"
2,"cara","CAR","a","cara","noun-adj","","a","cara"
3,"/","","","","punct","","","/"
NA,"</s>","","","","","","",""
NA,"<s number=""102"">","","","","","","",""
1,"khara","KHAR","a","khara","noun-adj","","a","khara"
2,"khara","KHAR","a","khara","noun-adj","","a","khara"
3,"/","","","","punct","","","/"
NA,"</s>","","","","","","",""
NA,"<s number=""103"">","","","","","","",""
1,"khuru","KHUR","u","khura","noun-adj","","u","khuru"
2,"khuru","KHUR","u","khura","noun-adj","","u","khuru"
3,"/","","","","punct","","","/"
NA,"</s>","","","","","","",""
NA,"<s number=""104"">","","","","","","",""
1,"mati","MAT","i","mati","noun-adj","","i","mati"
2,"mati","MAT","i","mati","noun-adj","","i","mati"
3,"/","","","","punct","","","/"
NA,"</s>","","","","","","",""
NA,"<s number=""105"">","","","","","","",""
1,"bhūmi","BHŪM","i","bhūmi","noun-adj","","i","bhūmi"
2,"caṇḍe","CAṆḌ","e","caṇḍa","noun-adj","","e","caṇḍe"
3,"/","","","","punct","","","/"
NA,"</s>","","","","","","",""
NA,"<s number=""106"">","","","","","","",""
1,"kālikeṭi","KĀL","ikeṭi","kālika","noun-adj","","ikeṭi","kālikeṭi"
2,"/","","","","punct","","","/"
NA,"</s>","","","","","","",""
NA,"<s number=""107"">","","","","","","",""
1,"a","","","alpha_privativum","ind","","","alpha_privativum"
2,"kisalā","KISAL","ā","kisala","noun-adj","","ā","kisalā"
3,"/","","","","punct","","","/"
NA,"</s>","","","","","","",""
NA,"<s number=""108"">","","","","","","",""
1,"pīne","PĪN","e","pīna","noun-adj","","e","pīne"
2,"/","","","","punct","","","/"
NA,"</s>","","","","","","",""
NA,"<s number=""109"">","","","","","","",""
1,"sāma","SĀM","a","sāma","noun-adj","","a","sāma"
2,"late","LAT","e","lata","noun-adj","","e","late"
3,"/","","","","punct","","","/"
NA,"</s>","","","","","","",""
NA,"<s number=""110"">","","","","","","",""
1,"hūle","","","","ind","","",""
2,"sthūle","STHŪL","e","sthūla","noun-adj","","e","sthūle"
3,"/","","","","punct","","","/"
NA,"</s>","","","","","","",""
NA,"<s number=""111"">","","","","","","",""
1,"sthūla","STHŪL","a","sthūla","noun-adj","","a","sthūla"
2,"śikhare","ŚIKHAR","e","śikhara","noun-adj","","e","śikhare"
3,"/","","","","punct","","","/"
NA,"</s>","","","","","","",""
NA,"<s number=""112"">","","","","","","",""
1,"jaya","JAY","a","jaya","noun-adj","","a","jaya"
2,"sthūle","STHŪL","e","sthūla","noun-adj","","e","sthūle"
3,"/","","","","punct","","","/"
NA,"</s>","","","","","","",""
NA,"<s number=""113"">","","","","","","",""
1,"jaya","JAY","a","jaya","noun-adj","","a","jaya"
2,"naṭṭe","NAṬṬ","e","naṭṭā","noun-adj","","e","naṭṭe"
3,"/","","","","punct","","","/"
NA,"</s>","","","","","","",""
NA,"<s number=""114"">","","","","","","",""
1,"cala","CAL","a","cala","noun-adj","","a","cala"
2,"n","","a","na","ind","","a","na"
3,"^āsi","","","as","verb","as","",""
4,"/","","","","punct","","","/"
NA,"</s>","","","","","","",""
NA,"<s number=""115"">","","","","","","",""
1,"culu","CUL","u","culu","noun-adj","","u","culu"
2,"n","","a","na","ind","","a","na"
3,"^āsi","","","as","verb","as","",""
4,"/","","","","punct","","","/"
NA,"</s>","","","","","","",""
NA,"<s number=""116"">","","","","","","",""
1,"vāg","VĀG","","vāc","noun-adj","","","vāg"
2,"bandhani","BANDHAN","i","bandhana","noun-adj","","i","bandhani"
3,"/","","","","punct","","","/"
NA,"</s>","","","","","","",""
NA,"<s number=""117"">","","","","","","",""
NA,"</page>","","","","","","",""
NA,"<page number=""470"">","","","","","","",""
3,"virohaṇi","VIROH","aṇi","viroha","noun-adj","","āni","virohāni"
4,"/","","","","punct","","","/"
NA,"</s>","","","","","","",""
NA,"<s number=""118"">","","","","","","",""
1,"solo","SOL","o","sola","noun-adj","","aḥ","solaḥ"
2,"hite","HIT","e","hita","noun-adj","","e","hite"
3,"/","","","","punct","","","/"
NA,"</s>","","","","","","",""
NA,"<s number=""119"">","","","","","","",""
1,"aṇḍare","AṆḌAR","e","aṇḍara","noun-adj","","e","aṇḍare"
2,"/","","","","punct","","","/"
NA,"</s>","","","","","","",""
NA,"<s number=""120"">","","","","","","",""
1,"paṇḍare","PAṆḌAR","e","paṇḍara","noun-adj","","e","paṇḍare"
2,"/","","","","punct","","","/"
NA,"</s>","","","","","","",""
NA,"<s number=""121"">","","","","","","",""
1,"karāle","KARĀL","e","karāla","noun-adj","","e","karāle"
2,"/","","","","punct","","","/"
NA,"</s>","","","","","","",""
NA,"<s number=""122"">","","","","","","",""
1,"kinnare","KIṂNAR","e","kiṃnara","noun-adj","","e","kiṃnare"
2,"/","","","","punct","","","/"
NA,"</s>","","","","","","",""
NA,"<s number=""123"">","","","","","","",""
1,"keyūre","KEYŪR","e","keyūra","noun-adj","","e","keyūre"
2,"/","","","","punct","","","/"
NA,"</s>","","","","","","",""
NA,"<s number=""124"">","","","","","","",""
1,"ketumati","KETUMAT","i","ketumatī","noun-adj","","i","ketumati"
2,"/","","","","punct","","","/"
NA,"</s>","","","","","","",""
NA,"<s number=""125"">","","","","","","",""
1,"bhūtaṃ","BHŪT","aṃ","bhūta","noun-adj","","am","bhūtam"
2,"game","GAM","e","gama","noun-adj","","e","game"
3,"/","","","","punct","","","/"
NA,"</s>","","","","","","",""
NA,"<s number=""126"">","","","","","","",""
1,"bhūta","BHŪT","a","bhūta","noun-adj","","a","bhūta"
2,"mati","MAT","i","mati","noun-adj","","i","mati"
3,"/","","","","punct","","","/"
NA,"</s>","","","","","","",""
NA,"<s number=""127"">","","","","","","",""
1,"dhanye","DHANY","e","dhanya","noun-adj","","e","dhanye"
2,"/","","","","punct","","","/"
NA,"</s>","","","","","","",""
NA,"<s number=""128"">","","","","","","",""
1,"maṅgalye","MAṄGALY","e","maṅgalya","noun-adj","","e","maṅgalye"
2,"/","","","","punct","","","/"
NA,"</s>","","","","","","",""
NA,"<s number=""129"">","","","","","","",""
1,"mahābala","MAHĀBAL","a","mahābala","noun-adj","","a","mahābala"
2,"lohita","LOH","ita","lohita","noun-adj","","ita","lohita"
3,"mūle","MŪL","e","mūla","noun-adj","","e","mūle"
4,"/","","","","punct","","","/"
NA,"</s>","","","","","","",""
NA,"<s number=""130"">","","","","","","",""
1,"a","","","alpha_privativum","ind","","","alpha_privativum"
2,"cala","CAL","a","cala","noun-adj","","a","cala"
3,"caṇḍe","CAṆḌ","e","caṇḍa","noun-adj","","e","caṇḍe"
4,"/","","","","punct","","","/"
NA,"</s>","","","","","","",""
NA,"<s number=""131"">","","","","","","",""
1,"dhuraṃ","DHUR","aṃ","dhura","noun-adj","","am","dhuram"
2,"dharā","DHAR","ā","dharā","noun-adj","","ā","dharā"
3,"/","","","","punct","","","/"
NA,"</s>","","","","","","",""
NA,"<s number=""132"">","","","","","","",""
1,"jay","JAY","a","jaya","noun-adj","","a","jaya"
2,"^ālike","ALIK","e","alika","noun-adj","","e","alike"
3,"/","","","","punct","","","/"
NA,"</s>","","","","","","",""
NA,"<s number=""133"">","","","","","","",""
1,"jayā","JAY","ā","jaya","noun-adj","","ā","jayā"
2,"/","","","","punct","","","/"
NA,"</s>","","","","","","",""
NA,"<s number=""134"">","","","","","","",""
1,"go","","","go","noun-adj","","","go"
2,"rohaṇi","ROH","aṇi","roha","noun-adj","","āni","rohāni"
3,"/","","","","punct","","","/"
NA,"</s>","","","","","","",""
NA,"<s number=""135"">","","","","","","",""
1,"curu","CUR","u","curu","noun-adj","","u","curu"
2,"curu","CUR","u","curu","noun-adj","","u","curu"
3,"/","","","","punct","","","/"
NA,"</s>","","","","","","",""
NA,"<s number=""136"">","","","","","","",""
1,"rundha","RUNDH","a","rundh","noun-adj","","a","rundha"
2,"rundha","RUNDH","a","rundh","noun-adj","","a","rundha"
3,"/","","","","punct","","","/"
NA,"</s>","","","","","","",""
NA,"<s number=""137"">","","","","","","",""
1,"dhuru","DHUR","u","dhura","noun-adj","","u","dhuru"
2,"dhuru","DHUR","u","dhura","noun-adj","","u","dhuru"
3,"/","","","","punct","","","/"
NA,"</s>","","","","","","",""
NA,"<s number=""138"">","","","","","","",""
1,"khuru","KHUR","u","khura","noun-adj","","u","khuru"
2,"khuru","KHUR","u","khura","noun-adj","","u","khuru"
3,"/","","","","punct","","","/"
NA,"</s>","","","","","","",""
NA,"<s number=""139"">","","","","","","",""
1,"khuru","KHUR","u","khura","noun-adj","","u","khuru"
2,"mati","MAT","i","mati","noun-adj","","i","mati"
3,"/","","","","punct","","","/"
NA,"</s>","","","","","","",""
NA,"<s number=""140"">","","","","","","",""
1,"bandhumati","BANDHUMAT","i","bandhumatī","noun-adj","","i","bandhumati"
2,"/","","","","punct","","","/"
NA,"</s>","","","","","","",""
NA,"<s number=""141"">","","","","","","",""
1,"dhuraṃ","DHUR","aṃ","dhura","noun-adj","","am","dhuram"
2,"dhare","DHAR","e","dhara","noun-adj","","e","dhare"
3,"/","","","","punct","","","/"
NA,"</s>","","","","","","",""
NA,"<s number=""142"">","","","","","","",""
1,"dhare","DHAR","e","dhara","noun-adj","","e","dhare"
2,"dhare","DHAR","e","dhara","noun-adj","","e","dhare"
3,"/","","","","punct","","","/"
NA,"</s>","","","","","","",""
NA,"<s number=""143"">","","","","","","",""
1,"vidhare","VIDHAR","e","vidhar","verb","vidhṛ","e","vidhare"
2,"vimati","VIMAT","i","vimati","noun-adj","","i","vimati"
3,"/","","","","punct","","","/"
NA,"</s>","","","","","","",""
NA,"<s number=""144"">","","","","","","",""
1,"viṣkambhaṇi","VIṢKAMBH","i","viṣkambhaṇa","noun-adj","","i","viṣkambhi"
2,"/","","","","punct","","","/"
NA,"</s>","","","","","","",""
NA,"<s number=""145"">","","","","","","",""
1,"nāśani","NĀŚAN","i","nāśana","noun-adj","","i","nāśani"
NA,"</page>","","","","","","",""
NA,"<page number=""471"">","","","","","","",""
4,"vināśani","VINĀŚAN","i","vināśana","noun-adj","","i","vināśani"
5,"/","","","","punct","","","/"
NA,"</s>","","","","","","",""
NA,"<s number=""146"">","","","","","","",""
1,"bandhani","BANDHAN","i","bandhana","noun-adj","","i","bandhani"
2,"/","","","","punct","","","/"
NA,"</s>","","","","","","",""
NA,"<s number=""147"">","","","","","","",""
1,"mokṣaṇi","MOKṢAṆ","i","mokṣaṇi","noun-adj","","i","mokṣaṇi"
2,"/","","","","punct","","","/"
NA,"</s>","","","","","","",""
NA,"<s number=""148"">","","","","","","",""
1,"mocani","MOCAN","i","mocani","noun-adj","","i","mocani"
2,"/","","","","punct","","","/"
NA,"</s>","","","","","","",""
NA,"<s number=""149"">","","","","","","",""
1,"mohani","MOH","ani","moha","noun-adj","","āni","mohāni"
2,"/","","","","punct","","","/"
3,"bhāvani","BHĀVAN","i","bhāva","noun-adj","","i","bhāvani"
4,"/","","","","punct","","","/"
NA,"</s>","","","","","","",""
NA,"<s number=""150"">","","","","","","",""
1,"śodhani","ŚODHAN","i","śodhani","noun-adj","","i","śodhani"
2,"/","","","","punct","","","/"
NA,"</s>","","","","","","",""
NA,"<s number=""151"">","","","","","","",""
1,"saṃśodhani","SAṂŚODHAN","i","saṃśodhana","noun-adj","","i","saṃśodhani"
2,"viśodhani","VIŚODHAN","i","viśodhani","noun-adj","","i","viśodhani"
3,"/","","","","punct","","","/"
NA,"</s>","","","","","","",""
NA,"<s number=""152"">","","","","","","",""
1,"saṃk","SAṂK","","saṃka","noun-adj","","","saṃk"
2,"hiraṇi","HIRAṆ","i","hiraṇin","noun-adj","","i","hiraṇi"
3,"/","","","","punct","","","/"
NA,"</s>","","","","","","",""
NA,"<s number=""153"">","","","","","","",""
1,"saṃch","SAṂCH","","saṃch","noun-adj","","","saṃch"
2,"indani","IND","ani","inda","noun-adj","","āni","indāni"
3,"/","","","","punct","","","/"
NA,"</s>","","","","","","",""
NA,"<s number=""154"">","","","","","","",""
1,"sādhu","SĀDH","u","sādhu","noun-adj","","u","sādhu"
2,"tu","","","tu","ind","","","tu"
3,"rumāṇe","RUM","āṇe","ruma","noun-adj","","ane","rumane"
4,"/","","","","punct","","","/"
NA,"</s>","","","","","","",""
NA,"<s number=""155"">","","","","","","",""
1,"hara","HAR","a","hara","noun-adj","","a","hara"
2,"hara","HAR","a","hara","noun-adj","","a","hara"
3,"bandhumati","BANDHUMAT","i","bandhumatī","noun-adj","","i","bandhumati"
4,"/","","","","punct","","","/"
NA,"</s>","","","","","","",""
NA,"<s number=""156"">","","","","","","",""
1,"hiri","","","hiri","ind","","","hiri"
2,"hiri","","","hiri","ind","","","hiri"
3,"/","","","","punct","","","/"
NA,"</s>","","","","","","",""
NA,"<s number=""157"">","","","","","","",""
1,"khiri","","","","ind","","",""
2,"khiri","","","","ind","","",""
3,"/","","","","punct","","","/"
NA,"</s>","","","","","","",""
NA,"<s number=""158"">","","","","","","",""
1,"kharali","KHAR","ali","khara","noun-adj","","ali","kharali"
2,"/","","","","punct","","","/"
NA,"</s>","","","","","","",""
NA,"<s number=""159"">","","","","","","",""
1,"huru","","","huras","ind","","","huras"
2,"huru","","","huras","ind","","","huras"
3,"/","","","","punct","","","/"
NA,"</s>","","","","","","",""
NA,"<s number=""160"">","","","","","","",""
1,"piṅgale","PIṄGAL","e","piṅgala","noun-adj","","e","piṅgale"
2,"/","","","","punct","","","/"
NA,"</s>","","","","","","",""
NA,"<s number=""161"">","","","","","","",""
1,"namo","NAM","o","namas","noun-adj","","aḥ","namaḥ"
2,"astu","","","as","verb","as","",""
3,"buddhānāṃ","BUDDH","ānāṃ","buddha","noun-adj","","ānām","buddhānām"
4,"bhagavatāṃ","BHAGAV","atāṃ","bhagavat","noun-adj","","atām","bhagavatām"
5,"svāhā","SVĀH","ā","svāhā","noun-adj","","ā","svāhā"
6,"/","","","","punct","","","/"
NA,"</s>","","","","","","",""
NA,"<s number=""162"">","","","","","","",""
NA,"</page>","","","","","","",""
NA,"<page number=""472"">","","","","","","",""
3,"asyāṃ","","","idam","pron","","","idam"
4,"khalu","KHAL","u","khalu","noun-adj","","u","khalu"
5,"rāhula","RĀHUL","a","rāhula","noun-adj","","a","rāhula"
6,"mahā","MAH","ā","mahat","noun-adj","","ā","mahā"
7,"daṇḍa","DAṆḌ","a","daṇḍa","noun-adj","","a","daṇḍa"
8,"dhāraṇyāṃ","DHĀRAṆ","yāṃ","dhāraṇi","noun-adj","","yām","dhāraṇyām"
9,"vidyāyām","VIDY","āyām","vidyā","noun-adj","","āyām","vidyāyām"
10,"antaśo","ANTAŚ","o","antaśas","noun-adj","","aḥ","antaśaḥ"
11,"aṣṭ","AṢṬ","a","aṣṭa","noun-adj","","a","aṣṭa"
12,"^ottara","UTTAR","a","uttara","noun-adj","","a","uttara"
13,"śata","ŚAT","a","śata","noun-adj","","a","śata"
14,"padānāṃ","PAD","ānāṃ","pada","noun-adj","","ānām","padānām"
15,"sūtraṃ","SŪTR","aṃ","sūtra","noun-adj","","am","sūtram"
16,"granthiṃ","GRANTH","iṃ","granthi","noun-adj","","im","granthim"
17,"baddhāyāṃ","BADDH","āyāṃ","baddha","noun-adj","","āyām","baddhāyām"
18,"hastena","HAST","ena","hasta","noun-adj","","ena","hastena"
19,"dhāryamāṇāyāṃ","DHĀR","yamāṇāyāṃ","dhār","verb","dhṛ","yamāṇāyāṃ","dhāryamāṇāyāṃ"
20,"kaṇṭhena","KAṆṬH","ena","kaṇṭha","noun-adj","","ena","kaṇṭhena"
21,"dhāryamāṇāyāṃ","DHĀR","yamāṇāyāṃ","dhār","verb","dhṛ","yamāṇāyāṃ","dhāryamāṇāyāṃ"
22,"samantād","SAMANT","ād","samanta","noun-adj","","āt","samantāt"
23,"yojana","YOJAN","a","yojana","noun-adj","","a","yojana"
24,"śatasya","ŚAT","asya","śata","noun-adj","","asya","śatasya"
25,"rakṣā","RAKṢ","ā","rakṣa","noun-adj","","āḥ","rakṣāḥ"
26,"kṛtā","KṚT","ā","kṛtā","noun-adj","","ā","kṛtā"
27,"bhaviṣyati","BHAVIṢ","yati","bhav","verb","bhū","yati","bhaviṣyati"
28,"/","","","","punct","","","/"
NA,"</s>","","","","","","",""
NA,"<s number=""163"">","","","","","","",""
1,"gandhair","GANDH","air","gandha","noun-adj","","air","gandhair"
2,"vā","","","vā","ind","","","vā"
3,"puṣpair","PUṢP","air","puṣpa","noun-adj","","air","puṣpair"
4,"vā","","","vā","ind","","","vā"
5,"mudrābhir","MUDR","ābhir","mudrā","noun-adj","","ābhiḥ","mudrābhiḥ"
6,"vā","","","vā","ind","","","vā"
7,"n","","a","na","ind","","a","na"
8,"^aiva","","","eva","ind","","","eva"
9,"manuṣyo","MANUṢY","o","manuṣya","noun-adj","","aḥ","manuṣyaḥ"
10,"vā","","","vā","ind","","","vā"
11,"manuṣyovābhibhaviṣyati","MANUṢY","ovābhibhaviṣyati","manuṣ","verb","","ovābhibhaviṣyati","manuṣyovābhibhaviṣyati"
12,"/","","","","punct","","","/"
NA,"</s>","","","","","","",""
NA,"<s number=""164"">","","","","","","",""
1,"na","","","na","ind","","","na"
2,"viṣaṃ","VIṢ","aṃ","viṣa","noun-adj","","am","viṣam"
3,"na","","","na","ind","","","na"
4,"śastraṃ","ŚASTR","aṃ","śastra","noun-adj","","am","śastram"
5,"na","","","na","ind","","","na"
6,"rogo","ROG","o","roga","noun-adj","","aḥ","rogaḥ"
7,"na","","","na","ind","","","na"
8,"jvaro","JVAR","o","jvara","noun-adj","","aḥ","jvaraḥ"
9,"na","","","na","ind","","","na"
10,"prajvaro","PRAJVAR","o","prajvara","noun-adj","","aḥ","prajvaraḥ"
11,"na","","","na","ind","","","na"
12,"vidy","VIDY","a","vidyā","noun-adj","","a","vidyā"
13,"^āmantrona","AMANTR","ona","amantra","noun-adj","","ona","amantrona"
14,"vetāḍaḥ","VETĀḌ","aḥ","vetāḍa","noun-adj","","aḥ","vetāḍaḥ"
15,"/","","","","punct","","","/"
NA,"</s>","","","","","","",""
NA,"<s number=""165"">","","","","","","",""
1,"na","","","na","ind","","","na"
2,"vyādhau","VYĀDH","au","vyādha","noun-adj","","au","vyādhau"
3,"n","","","na","ind","","","na"
4,"āgnau","AGN","au","agni","noun-adj","","au","agnau"
NA,"</page>","","","","","","",""
NA,"<page number=""473"">","","","","","","",""
7,"na","","","na","ind","","","na"
8,"viṣ","VIṢ","a","viṣa","noun-adj","","a","viṣa"
9,"^odakena","UDAK","ena","udaka","noun-adj","","ena","udakena"
10,"kālaṃ","KĀL","aṃ","kāla","noun-adj","","am","kālam"
11,"kariṣyati","KARIṢ","yati","kar","verb","kṛ","yati","kariṣyati"
12,"/","","","","punct","","","/"
NA,"</s>","","","","","","",""
NA,"<s number=""166"">","","","","","","",""
1,"vidy","VIDY","a","vidyā","noun-adj","","a","vidyā"
2,"^āmantra","AMANTR","a","amantra","noun-adj","","a","amantra"
3,"prayogānāṃ","PRAYOG","ānāṃ","prayoga","noun-adj","","ānām","prayogānām"
4,"ca","","","ca","ind","","","ca"
5,"sarveṣāṃ","SARV","eṣāṃ","sarva","noun-adj","","eṣāṃ","sarveṣāṃ"
6,"sādhu","SĀDH","u","sādhu","noun-adj","","u","sādhu"
7,"prayuktānāṃ","PRAYUKT","ānāṃ","prayukta","noun-adj","","ānām","prayuktānām"
8,"ca","","","ca","ind","","","ca"
9,"bandhanī","BANDHAN","ī","bandhana","noun-adj","","ī","bandhanī"
10,"/","","","","punct","","","/"
NA,"</s>","","","","","","",""
NA,"<s number=""167"">","","","","","","",""
1,"para","PAR","a","para","noun-adj","","a","para"
2,"bandhānāṃ","BANDH","ānāṃ","bandha","noun-adj","","ānām","bandhānām"
3,"ca","","","ca","ind","","","ca"
4,"pramocanī","PRAMOCAN","ī","pramocanī","noun-adj","","ī","pramocanī"
5,"/","","","","punct","","","/"
NA,"</s>","","","","","","",""
NA,"<s number=""168"">","","","","","","",""
1,"sarva","SARV","a","sarva","noun-adj","","a","sarva"
2,"roga","ROG","a","roga","noun-adj","","a","roga"
3,"śoka","ŚOK","a","śoka","noun-adj","","a","śoka"
4,"vighna","VIGHN","a","vighna","noun-adj","","a","vighna"
5,"vināśana","VINĀŚAN","a","vināśana","noun-adj","","a","vināśana"
6,"karī","KAR","ī","karin","noun-adj","","ī","karī"
7,"/","","","","punct","","","/"
NA,"</s>","","","","","","",""
NA,"<s number=""169"">","","","","","","",""
1,"kali","KAL","i","kali","noun-adj","","i","kali"
2,"kaluṣa","KALUṢ","a","kaluṣa","noun-adj","","a","kaluṣa"
3,"praśamana","PRAŚAMAN","a","praśamana","noun-adj","","a","praśamana"
4,"karī","KAR","ī","karin","noun-adj","","ī","karī"
5,"/","","","","punct","","","/"
NA,"</s>","","","","","","",""
NA,"<s number=""170"">","","","","","","",""
1,"sarva","SARV","a","sarva","noun-adj","","a","sarva"
2,"graha","GRAH","a","graha","noun-adj","","a","graha"
3,"vimocana","VIMOCAN","a","vimocana","noun-adj","","a","vimocana"
4,"karī","KAR","ī","karin","noun-adj","","ī","karī"
5,"/","","","","punct","","","/"
NA,"</s>","","","","","","",""
NA,"<s number=""171"">","","","","","","",""
1,"yo","","","yad","pron","","","yad"
2,"graho","GRAH","o","graha","noun-adj","","aḥ","grahaḥ"
3,"na","","","na","ind","","","na"
4,"muñcet","MUÑC","et","muñc","verb","muc","et","muñcet"
5,"saptadhāsya","SAPTADH","āsya","saptadhā","noun-adj","","āsya","saptadhāsya"
6,"sphuṭet","SPHUṬ","et","sphuṭ","verb","","et","sphuṭet"
7,"mūrdhā","MŪRDH","ā","mūrdha","noun-adj","","āḥ","mūrdhāḥ"
8,"arjakasy","ARJAK","asya","arjaka","noun-adj","","asya","arjakasya"
9,"^eva","","","eva","ind","","","eva"
10,"mañjarī","MAÑJAR","ī","mañjarī","noun-adj","","ī","mañjarī"
11,"/","","","","punct","","","/"
NA,"</s>","","","","","","",""
NA,"<s number=""172"">","","","","","","",""
1,"vajrapāṇiś","VAJRAPĀṆ","iś","vajrapāṇi","noun-adj","","iś","vajrapāṇiś"
2,"c","","a","ca","ind","","a","ca"
3,"^āsya","","","idam","pron","","","idam"
4,"mahā","MAH","ā","mahat","noun-adj","","ā","mahā"
5,"yakṣa","YAKṢ","a","yakṣa","noun-adj","","a","yakṣa"
6,"senāpatir","SENĀPAT","ir","senāpati","noun-adj","","iḥ","senāpatiḥ"
7,"vajreṇ","VAJR","eṇ","vajra","noun-adj","","ena","vajrena"
8,"ādīptena","ĀDĪPT","ena","ādīpta","noun-adj","","ena","ādīptena"
9,"sampra","SAṂPR","a","saṃpra","noun-adj","","a","saṃpra"
10,"jvālitena","JVĀL","itena","jvālita","noun-adj","","itena","jvālitena"
11,"eka","EK","a","eka","noun-adj","","a","eka"
12,"jvālī","JVĀL","ī","jvālin","noun-adj","","ī","jvālī"
13,"bhūtena","BHŪT","ena","bhūta","noun-adj","","ena","bhūtena"
NA,"</page>","","","","","","",""
NA,"<page number=""474"">","","","","","","",""
16,"dhyāyitvā","DHYĀY","itvā","dhyā","verb","","tvā","dhyāytvā"
17,"mūrdhānaṃ","MŪRDH","ānaṃ","mūrdha","noun-adj","","ānaṃ","mūrdhānaṃ"
18,"sphoṭayet","SPHOṬAY","et","sphoṭ","verb","","et","sphoṭayet"
19,"/","","","","punct","","","/"
NA,"</s>","","","","","","",""
NA,"<s number=""173"">","","","","","","",""
1,"catvāraś","CATVĀR","aś","catur","noun-adj","","aḥ","catvāraḥ"
2,"ca","","","ca","ind","","","ca"
3,"mahārājāno","MAHĀRĀJ","āno","mahārāja","noun-adj","","āno","mahārājāno"
4,"ayomayena","AYOMAY","ena","ayomaya","noun-adj","","ena","ayomayena"
5,"cakreṇa","CAKR","eṇa","cakra","noun-adj","","ena","cakrena"
6,"kṣura","KṢUR","a","kṣura","noun-adj","","a","kṣura"
7,"dhārā","DHĀR","ā","dhārā","noun-adj","","ā","dhārā"
8,"prahāreṇa","PRAHĀR","eṇa","prahāra","noun-adj","","ena","prahārena"
9,"vināśayeyuḥ","VINĀŚ","ayeyuḥ","vināśa","noun-adj","","ayeyuḥ","vināśayeyuḥ"
10,"/","","","","punct","","","/"
NA,"</s>","","","","","","",""
NA,"<s number=""174"">","","","","","","",""
1,"tasmād","TASMĀD","","tad","pron","","","tasmād"
2,"yakṣa","YAKṢ","a","yakṣa","noun-adj","","a","yakṣa"
3,"lokāc","LOK","āc","loka","noun-adj","","āt","lokāt"
4,"cyavanaṃ","CYAVAN","aṃ","cyavana","noun-adj","","am","cyavanam"
5,"bhavet","BHAV","et","bhav","verb","bhū","et","bhavet"
6,"/","","","","punct","","","/"
NA,"</s>","","","","","","",""
NA,"<s number=""175"">","","","","","","",""
1,"aḍakavatyāṃ","AḌAKAVAT","yāṃ","aḍakavatī","noun-adj","","yām","aḍakavatyām"
2,"rāja","RĀJ","a","rājan","noun-adj","","a","rāja"
3,"dhānyāṃ","DHĀNY","āṃ","dhānya","noun-adj","","ām","dhānyām"
4,"na","","","na","ind","","","na"
5,"labhat","LABH","at","labh","verb","labh","at","labhat"
6,"ev","","a","eva","ind","","a","eva"
7,"^ā","","","alpha_privativum","ind","","","alpha_privativum"
8,"sam","SAM","","sama","noun-adj","","","sam"
9,"/","","","","punct","","","/"
NA,"</s>","","","","","","",""
NA,"<s number=""176"">","","","","","","",""
1,"asyāṃ","","","idam","pron","","","idam"
2,"khalu","KHAL","u","khalu","noun-adj","","u","khalu"
3,"rāhula","RĀHUL","a","rāhula","noun-adj","","a","rāhula"
4,"mahā","MAH","ā","mahat","noun-adj","","ā","mahā"
5,"daṇḍa","DAṆḌ","a","daṇḍa","noun-adj","","a","daṇḍa"
6,"dhāraṇyāṃ","DHĀRAṆ","yāṃ","dhāraṇi","noun-adj","","yām","dhāraṇyām"
7,"vidyāyāṃ","VIDY","āyāṃ","vidyā","noun-adj","","āyām","vidyāyām"
8,"sakṛt","SAKṚ","t","sakṛt","noun-adj","","t","sakṛt"
9,"parivartitāyāṃ","PARIVARTIT","āyāṃ","parivartitā","noun-adj","","āyām","parivartitāyām"
10,"rāja","RĀJ","a","rājan","noun-adj","","a","rāja"
11,"caur","CAUR","a","caura","noun-adj","","a","caura"
12,"^odak","UDAK","a","udaka","noun-adj","","a","udaka"
13,"^āgni","AGN","i","agni","noun-adj","","i","agni"
14,"viṣa","VIṢ","a","viṣa","noun-adj","","a","viṣa"
15,"śastr","ŚASTR","a","śastra","noun-adj","","a","śastra"
16,"^āṭavī","ĀṬAV","ī","aṭavī","noun-adj","","ī","āṭavī"
17,"kāntāra","KĀNTĀR","a","kāntāra","noun-adj","","a","kāntāra"
18,"parvata","PARVAT","a","parvata","noun-adj","","a","parvata"
19,"durga","DURG","a","durga","noun-adj","","a","durga"
20,"madhya","MADHY","a","madhya","noun-adj","","a","madhya"
21,"gataḥ","GAT","aḥ","gata","noun-adj","","aḥ","gataḥ"
22,"sarva","SARV","a","sarva","noun-adj","","a","sarva"
23,"bhayebhyaḥ","BHAY","ebhyaḥ","bhaya","noun-adj","","ebhyaḥ","bhayebhyaḥ"
24,"pratimucyate","PRATIMUC","yate","pratimuñc","verb","pratimuc","yate","pratimucyate"
25,"/","","","","punct","","","/"
NA,"</s>","","","","","","",""
NA,"<s number=""177"">","","","","","","",""
1,"iyaṃ","","","idam","pron","","","idam"
2,"khalu","KHAL","u","khalu","noun-adj","","u","khalu"
NA,"</page>","","","","","","",""
NA,"<page number=""475"">","","","","","","",""
5,"mahā","MAH","ā","mahat","noun-adj","","ā","mahā"
6,"daṇḍa","DAṆḌ","a","daṇḍa","noun-adj","","a","daṇḍa"
7,"dhāraṇī","DHĀRAṆ","ī","dhāraṇī","noun-adj","","ī","dhāraṇī"
8,"vidyā","VIDY","ā","vidyā","noun-adj","","ā","vidyā"
9,"eka","EK","a","eka","noun-adj","","a","eka"
10,"navati","NAVAT","i","navati","noun-adj","","i","navati"
11,"gaṅgā","GAṄG","ā","gaṅgā","noun-adj","","ā","gaṅgā"
12,"nadī","NAD","ī","nadī","noun-adj","","ī","nadī"
13,"vālikā","VĀLIK","ā","vālikā","noun-adj","","ā","vālikā"
14,"samair","SAM","air","sama","noun-adj","","air","samair"
15,"buddhair","BUDDH","air","buddha","noun-adj","","air","buddhair"
16,"bhāṣitā","BHĀṢIT","ā","bhāṣita","noun-adj","","āḥ","bhāṣitāḥ"
17,"bhāṣyate","BHĀṢ","yate","bhāṣ","verb","bhāṣ","yate","bhāṣyate"
18,"bhāṣ","BHĀṢ","","bhāṣa","noun-adj","","","bhāṣ"
19,"iṣyate","IṢ","yate","iṣ","verb","iṣ","yate","iṣyate"
20,"ca","","","ca","ind","","","ca"
21,"siddhā","SIDDH","ā","siddhā","noun-adj","","ā","siddhā"
22,"parama","PARAM","a","parama","noun-adj","","a","parama"
23,"siddhā","SIDDH","ā","siddhā","noun-adj","","ā","siddhā"
24,"sarva","SARV","a","sarva","noun-adj","","a","sarva"
25,"deva","DEV","a","deva","noun-adj","","a","deva"
26,"nāga","NĀG","a","nāga","noun-adj","","a","nāga"
27,"yakṣa","YAKṢ","a","yakṣa","noun-adj","","a","yakṣa"
28,"gandharv","GANDHARV","a","gandharva","noun-adj","","a","gandharva"
29,"^āsura","ĀSUR","a","asura","noun-adj","","a","āsura"
30,"garuḍa","GARUḌ","a","garuḍa","noun-adj","","a","garuḍa"
31,"kinnara","KIṂNAR","a","kiṃnara","noun-adj","","a","kiṃnara"
32,"mahoragābhir","MAHORAG","ābhir","mahoraga","noun-adj","","ābhiḥ","mahoragābhiḥ"
33,"vanditā","VANDIT","ā","vandita","noun-adj","","āḥ","vanditāḥ"
34,"sarva","SARV","a","sarva","noun-adj","","a","sarva"
35,"ja","J","a","ja","noun-adj","","a","ja"
36,"nagaṇa","NAGAṆ","a","nagaṇā","noun-adj","","a","nagaṇā"
37,"parivṛtā","PARIVṚT","ā","parivṛta","noun-adj","","ā","parivṛtā"
38,"/","","","","punct","","","/"
NA,"</s>","","","","","","",""
NA,"<s number=""178"">","","","","","","",""
1,"sarva","SARV","a","sarva","noun-adj","","a","sarva"
2,"bhay","BHAY","a","bhaya","noun-adj","","a","bhaya"
3,"^opadraveṣu","UPADRAV","eṣu","upadrava","noun-adj","","eṣu","upadraveṣu"
4,"mama","MAM","a","mat","pron","","a","mama"
5,"sarva","SARV","a","sarva","noun-adj","","a","sarva"
6,"sattvānāṃ","SATTV","ānāṃ","sattva","noun-adj","","ānām","sattvānām"
7,"ca","","","ca","ind","","","ca"
8,"śivam","ŚIV","am","śiva","noun-adj","","am","śivam"
9,"ārogyaṃ","ĀROGY","aṃ","ārogya","noun-adj","","am","ārogyam"
10,"bhavatu","BHAV","atu","bhav","verb","bhū","ati","bhavati"
11,"/","","","","punct","","","/"
NA,"</s>","","","","","","",""
NA,"<s number=""179"">","","","","","","",""
NA,"</page>","","","","","","",""
NA,"<page number=""476"">","","","","","","",""
3,"idam","IDAM","","idam","pron","","","idam"
4,"avocad","AVOCAD","","vak","verb","","","avocad"
5,"bhagavān","BHAGAV","ān","bhagavat","noun-adj","","ān","bhagavān"
6,"āttamanā","ĀTTAMAN","ā","āttamanas","noun-adj","","ā","āttamanā"
7,"āyuṣmān","ĀYUṢM","ān","āyuṣmat","noun-adj","","ān","āyuṣmān"
8,"rāhulo","RĀHUL","o","rāhula","noun-adj","","aḥ","rāhulaḥ"
9,"bhagavato","BHAGAV","ato","bhagavat","noun-adj","","ataḥ","bhagavataḥ"
10,"bhāṣitam","BHĀṢIT","am","bhāṣita","noun-adj","","am","bhāṣitam"
11,"abhyanandann","ABHYANAND","ann","abhyanand","noun-adj","","ann","abhyanandann"
12,"iti","","","iti","ind","","","iti"
13,"/","","","","punct","","","/"
NA,"</s>","","","","","","",""
NA,"<s number=""180"">","","","","","","",""
1,"ārya","ĀRY","a","ārya","noun-adj","","a","ārya"
2,"mahā","MAH","ā","mahat","noun-adj","","ā","mahā"
3,"daṇḍa","DAṆḌ","a","daṇḍa","noun-adj","","a","daṇḍa"
4,"dhāraṇī","DHĀRAṆ","ī","dhāraṇī","noun-adj","","ī","dhāraṇī"
5,"śītavatī","ŚĪTAVAT","ī","śītavatī","noun-adj","","ī","śītavatī"
6,"samāptā","SAMĀPT","ā","samāpta","noun-adj","","ā","samāptā"
7,"/","","","","punct","","","/"
NA,"</s>","","","","","","",""
NA,"</page>","","","","","","",""
NA,"</doc>","","","","","","",""
