"WordID","word","NormSTEM","suffix","lemma","PoS","Root","NormSuffix","NormWord"
1,"tatra","_","_","tatra","CAD","","_","_"
2,"_","_","_","mitra","NC","","_","_"
3,"_","_","_","prakāṇḍa","NC","","_","_"
4,"gomukhena","_","_","gomukha","NC","","_","_"
5,"vinoditaḥ","_","_","vinoday","PPP","","_","_"
1,"māsam","_","_","māsa","NC","","_","_"
2,"āsiṣi","_","_","ās","V","ās","_","_"
3,"vipraiś","_","_","vipra","NC","","_","_"
4,"ca","_","_","ca","CCD","","_","_"
5,"prasannaiḥ","_","_","prasad","PPP","","_","_"
6,"_","_","_","sa_saha","CX","","_","_"
7,"_","_","_","prasannaka","NC","","_","_"
1,"ekadā","_","_","ekadā","CX","","_","_"
2,"_","_","_","gomukha","NC","","_","_"
3,"_","_","_","vac","PPP","","_","_"
4,"yojane","_","_","yojana","NC","","_","_"
5,"grāmakād","_","_","grāmaka","NC","","_","_"
6,"itaḥ","_","_","itas","CX","","_","_"
1,"_","_","_","avimukta","NC","","_","_"
2,"_","_","_","avimukta","JJ","","_","_"
4,"puṇyā","_","_","puṇya","JJ","","_","_"
5,"vārāṇasī","_","_","vārāṇasī","NC","","_","_"
6,"purī","_","_","purī","NC","","_","_"
1,"_","_","_","prāgjyotiṣa","NC","","_","_"
2,"_","_","_","kaśmīra","NC","","_","_"
3,"_","_","_","dvārakā","NC","","_","_"
4,"_","_","_","tāmraparṇī","NC","","_","_"
5,"yat","_","_","yad","PRL","","_","_"
1,"tat","_","_","tad","PRD","","_","_"
2,"sarvaṃ","_","_","sarva","JQ","","_","_"
3,"sulabhaṃ","_","_","sulabha","JJ","","_","_"
4,"tasyāṃ","_","_","tad","PRD","","_","_"
5,"_","_","_","manohārin","JJ","","_","_"
6,"_","_","_","vinodana","NC","","_","_"
1,"kadācic","_","_","kadācid","CX","","_","_"
2,"_","_","_","ca","CCD","","_","_"
3,"_","_","_","upalabh","V","upalabh","_","_"
4,"tatra","_","_","tatra","CAD","","_","_"
5,"pānthāt","_","_","pāntha","NC","","_","_"
6,"kutaścana","_","_","kutaścana","CX","","_","_"
1,"vārttā","_","_","vārttā","NC","","_","_"
2,"_","_","_","hariśikha","NC","","_","_"
3,"_","_","_","ādi","NC","","_","_"
4,"ataḥ","_","_","atas","CX","","_","_"
5,"_","_","_","tad","PRD","","_","_"
6,"_","_","_","āga","V","āga","_","_"
7,"iti","_","_","iti","CQT","","_","_"
1,"tam","_","_","tad","PRD","","_","_"
2,"uktvā","_","_","vac","CGDA","","_","_"
3,"yuktam","_","_","yukta","JJ","","_","_"
4,"_","_","_","ah","V","ah","_","_"
5,"_","_","_","iti","CQT","","_","_"
6,"taṃ","_","_","tad","PRD","","_","_"
7,"_","_","_","ca","CCD","","_","_"
8,"_","_","_","āmantray","CGDA","","_","_"
9,"prasannakam","_","_","prasannaka","NC","","_","_"
1,"_","_","_","sa_saha","CX","","_","_"
2,"_","_","_","ākranda","NC","","_","_"
3,"_","_","_","sambhava","NC","","_","_"
4,"_","_","_","grāma","NC","","_","_"
5,"prati","_","_","prati","CADP","","_","_"
6,"vārāṇasīm","_","_","vārāṇasī","NC","","_","_"
7,"agām","_","_","gā","V","gā","_","_"
1,"atha","_","_","atha","CAD","","_","_"
2,"_","_","_","stoka","NC","","_","_"
3,"_","_","_","antara","NC","","_","_"
4,"_","_","_","atī","PPP","","_","_"
5,"mām","_","_","mat","PPR","","_","_"
6,"abhāṣata","_","_","bhāṣ","V","bhāṣ","_","_"
7,"gomukhaḥ","_","_","gomukha","NC","","_","_"
1,"vahāni","_","_","vah","V","vah","_","_"
2,"kim","_","_","kim","CX","","_","_"
3,"ahaṃ","_","_","mat","PPR","","_","_"
4,"yuṣmān","_","_","tvat","PPR","","_","_"
5,"yūyaṃ","_","_","tvat","PPR","","_","_"
6,"vahata","_","_","vah","V","vah","_","_"
7,"mām","_","_","mat","PPR","","_","_"
8,"iti","_","_","iti","CQT","","_","_"
1,"cintitaṃ","_","_","cintay","PPP","","_","_"
2,"ca","_","_","ca","CCD","","_","_"
3,"mayā","_","_","mat","PPR","","_","_"
4,"hanta","_","_","hanta","CX","","_","_"
5,"vinaṣṭaḥ","_","_","vinaś","PPP","","_","_"
6,"khalu","_","_","khalu","CX","","_","_"
7,"gomukhaḥ","_","_","gomukha","NC","","_","_"
1,"yūyaṃ","_","_","tvat","PPR","","_","_"
2,"māṃ","_","_","mat","PPR","","_","_"
3,"_","_","_","vah","V","vah","_","_"
4,"_","_","_","iti","CQT","","_","_"
5,"eṣa","_","_","tad","PRD","","_","_"
6,"no","_","_","mat","PPR","","_","_"
7,"brūyāt","_","_","abravīta","V","brū","_","_"
8,"katham","_","_","katha","CX","","_","_"
9,"anyathā","_","_","anyathā","CX","","_","_"
1,"_","_","_","āsana","NC","","_","_"
2,"_","_","_","api","CX","","_","_"
3,"yaś","_","_","yad","PRL","","_","_"
4,"chāyāṃ","_","_","chāyā","NC","","_","_"
5,"madīyasya","_","_","madīya","JJ","","_","_"
6,"namasyati","_","_","namasy","V","namasy","_","_"
1,"a","_","_","alpha_privativum","NC","","_","_"
1,"_","_","_","riṣṭa","NC","","_","_"
2,"_","_","_","āviś","PPP","","_","_"
4,"muktvā","_","_","muc","CGDA","","_","_"
5,"katham","_","_","katha","CX","","_","_"
6,"itthaṃ","_","_","ittha","CX","","_","_"
7,"sa","_","_","tad","PRD","","_","_"
8,"vakṣyati","_","_","vak","V","vac","_","_"
1,"sa","_","_","tad","PRD","","_","_"
2,"_","_","_","mat","PPR","","_","_"
3,"_","_","_","vac","PPP","","_","_"
4,"_","_","_","sa_saha","CX","","_","_"
5,"_","_","_","dainya","NC","","_","_"
6,"bhavān","_","_","bhavat","JJ","","_","_"
7,"_","_","_","guru","NC","","_","_"
8,"_","_","_","pada","NC","","_","_"
9,"_","_","_","śrama","NC","","_","_"
1,"tan","_","_","tad","PRD","","_","_"
2,"madīyam","_","_","madīya","JJ","","_","_"
3,"aśaṅkena","_","_","aśaṅka","JJ","","_","_"
4,"pṛṣṭham","_","_","pṛṣṭha","NC","","_","_"
5,"āruhyatām","_","_","āroh","V","āruh","_","_"
6,"iti","_","_","iti","CQT","","_","_"
1,"tena","_","_","tad","PRD","","_","_"
2,"_","_","_","ca","CCD","","_","_"
3,"_","_","_","vac","PPP","","_","_"
4,"vilakṣeṇa","_","_","vilakṣa","JJ","","_","_"
5,"mā","_","_","mā","CNG","","_","_"
6,"grahīta","_","_","grah","V","grah","_","_"
7,"yathāśrutam","_","_","yathāśruta","CX","","_","_"
1,"_","_","_","na","CNG","","_","_"
2,"_","_","_","ida","PRD","","_","_"
3,"saṃbhāvyate","_","_","saṃbhav","V","saṃbhū","_","_"
4,"cintā","_","_","cintā","NC","","_","_"
5,"_","_","_","jan","PPP","","_","_"
6,"a","_","_","alpha_privativum","NC","","_","_"
6,"_","_","_","riṣṭa","NC","","_","_"
7,"'pi","_","_","api","CX","","_","_"
8,"mādṛśi","_","_","mādṛś","JJ","","_","_"
1,"kiṃtu","_","_","kiṃtu","CX","","_","_"
2,"yaḥ","_","_","yad","PRL","","_","_"
3,"kiṃcid","_","_","kiṃcit","PRI","","_","_"
4,"ācaṣṭe","_","_","ācakṣ","V","ācakṣ","_","_"
5,"pānthasya","_","_","pāntha","NC","","_","_"
6,"pathikaḥ","_","_","pathika","NC","","_","_"
7,"pathi","_","_","pathin","NC","","_","_"
1,"voḍhā","_","_","voḍhṛ","JJ","","_","_"
2,"bhavati","_","_","bhavat","JJ","","_","_"
3,"_","_","_","tad","PRD","","_","_"
4,"_","_","_","adas","PRD","","_","_"
5,"_","_","_","kheda","NC","","_","_"
6,"_","_","_","vismaraṇa","NC","","_","_"
7,"iti","_","_","iti","CQT","","_","_"
1,"sa","_","_","tad","PRD","","_","_"
2,"_","_","_","mat","PPR","","_","_"
3,"_","_","_","vac","PPP","","_","_"
4,"bhavān","_","_","bhavat","JJ","","_","_"
5,"eva","_","_","eva","CEM","","_","_"
6,"_","_","_","sarva","JQ","","_","_"
7,"_","_","_","vṛttānta","NC","","_","_"
8,"_","_","_","peśala","JJ","","_","_"
1,"ākhyātuṃ","_","_","ākhyā","CGDI","","_","_"
2,"ca","_","_","ca","CCD","","_","_"
3,"vijānāti","_","_","vijān","V","vijñā","_","_"
4,"yat","_","_","yad","PRL","","_","_"
5,"tataḥ","_","_","tatas","CX","","_","_"
6,"kathayatv","_","_","kathay","V","kathay","_","_"
7,"iti","_","_","iti","CQT","","_","_"
1,"_","_","_","tad","PRD","","_","_"
2,"_","_","_","vac","PPP","","_","_"
3,"pañca","_","_","pañcan","NUM","","_","_"
4,"kathyante","_","_","kath","V","kath","_","_"
5,"_","_","_","kathā","NC","","_","_"
6,"_","_","_","vastu","NC","","_","_"
7,"kovidaiḥ","_","_","kovida","JJ","","_","_"
1,"_","_","_","dharma","NC","","_","_"
2,"_","_","_","artha","NC","","_","_"
3,"_","_","_","sukha","NC","","_","_"
4,"_","_","_","nirvāṇa","NC","","_","_"
5,"_","_","_","cikitsā","NC","","_","_"
6,"_","_","_","saha","CX","","_","_"
7,"_","_","_","vistara","NC","","_","_"
1,"tatra","_","_","tatra","CAD","","_","_"
2,"_","_","_","sattva","NC","","_","_"
3,"_","_","_","upakāra","NC","","_","_"
4,"_","_","_","artha","NC","","_","_"
5,"_","_","_","kāya","NC","","_","_"
6,"_","_","_","vāc","NC","","_","_"
7,"_","_","_","mānasa","NC","","_","_"
8,"_","_","_","kriyā","NC","","_","_"
1,"prabhavaḥ","_","_","prabhava","NC","","_","_"
2,"_","_","_","sarva","JQ","","_","_"
3,"_","_","_","dharma","NC","","_","_"
4,"jagatī","_","_","jagatī","NC","","_","_"
5,"jagatām","_","_","jagat","NC","","_","_"
6,"iva","_","_","iva","CCM","","_","_"
1,"_","_","_","yad","PRL","","_","_"
2,"_","_","_","upāya","NC","","_","_"
3,"_","_","_","mitra","NC","","_","_"
5,"yānti","_","_","yā","V","yā","_","_"
6,"_","_","_","madhyastha","JJ","","_","_"
7,"_","_","_","śatru","NC","","_","_"
1,"_","_","_","sarva","JQ","","_","_"
2,"_","_","_","artha","NC","","_","_"
3,"asau","_","_","adas","PRD","","_","_"
4,"hetur","_","_","hetu","NC","","_","_"
5,"guṇānām","_","_","guṇa","NC","","_","_"
6,"iva","_","_","iva","CCM","","_","_"
7,"_","_","_","sat","JJ","","_","_"
8,"_","_","_","jana","NC","","_","_"
1,"_","_","_","para","PPX","","_","_"
2,"_","_","_","strī","NC","","_","_"
3,"_","_","_","gaṇikā","NC","","_","_"
4,"_","_","_","tyāga","NC","","_","_"
5,"saṃtoṣo","_","_","saṃtoṣa","NC","","_","_"
6,"_","_","_","manda","JJ","","_","_"
7,"_","_","_","roṣa","NC","","_","_"
1,"_","_","_","na","CNG","","_","_"
2,"_","_","_","atisakti","NC","","_","_"
3,"ca","_","_","ca","CCD","","_","_"
4,"dāreṣu","_","_","dāra","NC","","_","_"
5,"sukhaṃ","_","_","sukha","NC","","_","_"
6,"duḥkhaṃ","_","_","duḥkha","NC","","_","_"
7,"viparyayaḥ","_","_","viparyaya","NC","","_","_"
1,"_","_","_","sa_saha","CX","","_","_"
2,"_","_","_","aṅga","NC","","_","_"
3,"_","_","_","sukha","NC","","_","_"
4,"_","_","_","rāga","NC","","_","_"
5,"_","_","_","ādi","NC","","_","_"
6,"anaṅgasya","_","_","anaṅga","NC","","_","_"
7,"ca","_","_","ca","CCD","","_","_"
8,"dehinaḥ","_","_","dehin","JJ","","_","_"
1,"_","_","_","sambandha","NC","","_","_"
2,"_","_","_","abhāva","NC","","_","_"
3,"atyantaṃ","_","_","atyanta","JJ","","_","_"
4,"nirvāṇaṃ","_","_","nirvāṇa","NC","","_","_"
5,"vidur","_","_","vid","V","vid","_","_"
6,"īśvarāḥ","_","_","īśvara","NC","","_","_"
1,"ardharātre","_","_","ardharātra","NC","","_","_"
2,"'pi","_","_","api","CX","","_","_"
3,"bhuñjānaḥ","_","_","bhuj","KDP","","_","_"
4,"_","_","_","parama","JJ","","_","_"
5,"_","_","_","artha","NC","","_","_"
6,"_","_","_","bubhukṣ","PPP","","_","_"
1,"_","_","_","kūṭa","NC","","_","_"
2,"_","_","_","vaidya","NC","","_","_"
3,"_","_","_","parityāgin","JJ","","_","_"
4,"rogair","_","_","roga","NC","","_","_"
5,"dūreṇa","_","_","dūra","JJ","","_","_"
6,"varjyate","_","_","varjay","V","varjay","_","_"
1,"_","_","_","dṛś","PPP","","_","_"
2,"_","_","_","saṃsāra","NC","","_","_"
3,"_","_","_","sāra","NC","","_","_"
4,"ṛṣīṇāṃ","_","_","ṛṣi","NC","","_","_"
5,"ko","_","_","kiṃ","PRQ","","_","_"
6,"hi","_","_","hi","CX","","_","_"
7,"mādṛśaḥ","_","_","mādṛśa","JJ","","_","_"
1,"asāro","_","_","asāra","JJ","","_","_"
2,"_","_","_","guru","JJ","","_","_"
3,"_","_","_","sāra","NC","","_","_"
4,"darśanāni","_","_","darśana","NC","","_","_"
5,"viḍambayet","_","_","viḍambay","V","viḍambay","_","_"
1,"tena","_","_","tad","PRD","","_","_"
2,"yat","_","_","yad","PRL","","_","_"
3,"kiṃcid","_","_","kiṃcit","PRI","","_","_"
4,"ucchāstraṃ","_","_","ucchāstra","JJ","","_","_"
5,"_","_","_","bāla","NC","","_","_"
6,"_","_","_","bhāva","NC","","_","_"
7,"udāhṛtam","_","_","udāhṛ","PPP","","_","_"
1,"_","_","_","śuka","NC","","_","_"
2,"_","_","_","vāśita","NC","","_","_"
3,"_","_","_","niḥsāra","JJ","","_","_"
4,"idaṃ","_","_","ida","PRD","","_","_"
5,"me","_","_","mat","PPR","","_","_"
6,"mṛṣyatām","_","_","mṛṣ","V","mṛṣ","_","_"
7,"iti","_","_","iti","CQT","","_","_"
1,"_","_","_","ida","PRD","","_","_"
2,"_","_","_","ādi","NC","","_","_"
3,"kathāḥ","_","_","kathā","NC","","_","_"
4,"śṛṇvan","_","_","śru","KDP","","_","_"
5,"_","_","_","nirantara","JJ","","_","_"
6,"_","_","_","surālaya","NC","","_","_"
1,"_","_","_","gaṅgā","NC","","_","_"
2,"_","_","_","ābharaṇa","NC","","_","_"
3,"ākhyātāṃ","_","_","ākhyā","PPP","","_","_"
4,"prāpaṃ","_","_","prāpn","V","prāp","_","_"
5,"vārāṇasīṃ","_","_","vārāṇasī","NC","","_","_"
6,"tataḥ","_","_","tatas","CX","","_","_"
1,"tatra","_","_","tatra","CAD","","_","_"
2,"_","_","_","bāhya","JJ","","_","_"
3,"_","_","_","niviś","PPP","","_","_"
4,"śūnyasya","_","_","śūnya","JJ","","_","_"
5,"_","_","_","pura","NC","","_","_"
6,"_","_","_","sadman","NC","","_","_"
1,"_","_","_","jṛ","KDP","","_","_"
2,"_","_","_","dāru","NC","","_","_"
3,"_","_","_","sudhā","NC","","_","_"
4,"_","_","_","citra","JJ","","_","_"
5,"adhyatiṣṭhāma","_","_","adhiṣṭhā","V","adhiṣṭhā","_","_"
6,"maṇḍapam","_","_","maṇḍapa","NC","","_","_"
1,"gomukhas","_","_","gomukha","NC","","_","_"
2,"tu","_","_","tu","CCD","","_","_"
3,"kṣaṇaṃ","_","_","kṣaṇa","NC","","_","_"
4,"sthitvā","_","_","sthā","CGDA","","_","_"
5,"mām","_","_","mat","PPR","","_","_"
6,"avocad","_","_","vak","V","vac","_","_"
7,"_","_","_","ga","PPP","","_","_"
8,"_","_","_","śrama","NC","","_","_"
1,"muhūrtakam","_","_","muhūrtaka","NC","","_","_"
2,"anutkaṇṭhair","_","_","anutkaṇṭha","JJ","","_","_"
3,"iha","_","_","iha","CAD","","_","_"
4,"yuṣmābhir","_","_","tvat","PPR","","_","_"
5,"āsyatām","_","_","ās","V","ās","_","_"
1,"yatra","_","_","yatra","CX","","_","_"
2,"sthātavyam","_","_","sthā","KDG","","_","_"
3,"asmābhir","_","_","mat","PPR","","_","_"
4,"upalabhya","_","_","upalabh","CGDA","","_","_"
5,"tam","_","_","tad","PRD","","_","_"
6,"āśrayam","_","_","āśraya","NC","","_","_"
1,"_","_","_","āga","V","āga","_","_"
2,"_","_","_","iti","CQT","","_","_"
3,"mām","_","_","mat","PPR","","_","_"
4,"uktvā","_","_","vac","CGDA","","_","_"
5,"calair","_","_","cala","JJ","","_","_"
6,"uccalitaḥ","_","_","uccal","PPP","","_","_"
7,"padaiḥ","_","_","pada","NC","","_","_"
1,"gatvā","_","_","ga","CGDA","","_","_"
2,"_","_","_","ṣoḍaśan","JJ","","_","_"
3,"_","_","_","viṃśa","JJ","","_","_"
4,"padāni","_","_","pada","NC","","_","_"
5,"sahasā","_","_","sahasā","CX","","_","_"
6,"sthitaḥ","_","_","sthā","PPP","","_","_"
1,"tataḥ","_","_","tatas","CX","","_","_"
2,"_","_","_","kiṃ","PRQ","","_","_"
3,"_","_","_","api","CX","","_","_"
4,"niścitya","_","_","niści","CGDA","","_","_"
5,"nivṛtto","_","_","nivṛt","PPP","","_","_"
6,"mām","_","_","mat","PPR","","_","_"
7,"abhāṣata","_","_","bhāṣ","V","bhāṣ","_","_"
1,"yad","_","_","yad","PRL","","_","_"
2,"idaṃ","_","_","ida","PRD","","_","_"
3,"_","_","_","tvat","PPR","","_","_"
4,"_","_","_","aṅga","NC","","_","_"
5,"divyaṃ","_","_","divya","JJ","","_","_"
6,"bhūṣaṇam","_","_","bhūṣaṇa","NC","","_","_"
7,"āhitam","_","_","ādhā","PPP","","_","_"
1,"idam","_","_","ida","PRD","","_","_"
2,"ādāya","_","_","ādā","CGDA","","_","_"
3,"gacchāmi","_","_","gacch","V","gam","_","_"
4,"sthātuṃ","_","_","sthā","CGDI","","_","_"
5,"_","_","_","na","CNG","","_","_"
6,"_","_","_","ida","PRD","","_","_"
7,"_","_","_","iha","CAD","","_","_"
8,"yujyate","_","_","yuj","V","yuj","_","_"
1,"_","_","_","tridaṇḍin","NC","","_","_"
2,"_","_","_","pāṇḍara","JJ","","_","_"
3,"_","_","_","aṅga","NC","","_","_"
4,"_","_","_","ādi","NC","","_","_"
5,"_","_","_","pāṣaṇḍa","NC","","_","_"
6,"_","_","_","chadman","NC","","_","_"
7,"_","_","_","kaṅkaṭa","NC","","_","_"
1,"vārāṇasī","_","_","vārāṇasī","NC","","_","_"
2,"_","_","_","mahat","JJ","","_","_"
3,"_","_","_","caura","NC","","_","_"
4,"tīrthadhvāṅkṣair","_","_","tīrthadhvāṅkṣa","NC","","_","_"
5,"adhiṣṭhitā","_","_","adhiṣṭhā","PPP","","_","_"
1,"yuṣmān","_","_","tvat","PPR","","_","_"
2,"ekākino","_","_","ekākin","JJ","","_","_"
3,"dṛṣṭvā","_","_","dṛś","CGDA","","_","_"
4,"_","_","_","sa_saha","CX","","_","_"
5,"_","_","_","alaṃkāra","NC","","_","_"
6,"nirāyudhān","_","_","nirāyudha","JJ","","_","_"
1,"teṣāṃ","_","_","tad","PRD","","_","_"
2,"sāhasikaḥ","_","_","sāhasika","NC","","_","_"
3,"kaścid","_","_","kiṃcit","PRI","","_","_"
4,"anarthaṃ","_","_","anartha","NC","","_","_"
5,"cintayed","_","_","cint","V","cint","_","_"
6,"iti","_","_","iti","CQT","","_","_"
1,"evaṃ","_","_","eva","CX","","_","_"
2,"bhavatu","_","_","bhav","V","bhū","_","_"
3,"_","_","_","nāma","CX","","_","_"
4,"_","_","_","iti","CQT","","_","_"
5,"_","_","_","mat","PPR","","_","_"
6,"_","_","_","adas","PRD","","_","_"
7,"anumoditaḥ","_","_","anumoday","PPP","","_","_"
1,"_","_","_","tad","PRD","","_","_"
2,"_","_","_","ābharaṇa","NC","","_","_"
3,"ādāya","_","_","ādā","CGDA","","_","_"
4,"prāviśat","_","_","praviś","V","praviś","_","_"
5,"tvaritaḥ","_","_","tvarita","JJ","","_","_"
6,"puram","_","_","pura","NC","","_","_"
1,"_","_","_","atha","CAD","","_","_"
2,"_","_","_","acira","JJ","","_","_"
3,"_","_","_","ga","PPP","","_","_"
4,"tasmin","_","_","tad","PRD","","_","_"
5,"_","_","_","parivrāj","NC","","_","_"
6,"_","_","_","brahmacārin","NC","","_","_"
1,"_","_","_","paricaṅkramaṇa","NC","","_","_"
2,"_","_","_","śra","PPP","","_","_"
3,"tasminn","_","_","tad","PRD","","_","_"
4,"eva","_","_","eva","CEM","","_","_"
5,"nyasīdatām","_","_","niṣad","V","niṣad","_","_"
1,"āsīc","_","_","as","V","as","_","_"
2,"ca","_","_","ca","CCD","","_","_"
3,"mama","_","_","mat","PPR","","_","_"
4,"tāv","_","_","tad","PRD","","_","_"
5,"etau","_","_","tad","PRD","","_","_"
6,"nūnaṃ","_","_","nūna","CX","","_","_"
7,"_","_","_","pāṣaṇḍin","JJ","","_","_"
8,"_","_","_","taskara","NC","","_","_"
1,"_","_","_","nirāyudha","JJ","","_","_"
2,"_","_","_","asahāya","JJ","","_","_"
3,"māṃ","_","_","mat","PPR","","_","_"
4,"muṣituṃ","_","_","muṣ","CGDI","","_","_"
5,"kila","_","_","kila","CX","","_","_"
6,"vāñchataḥ","_","_","vāñch","V","vāñch","_","_"
1,"tad","_","_","tad","PRD","","_","_"
2,"eteṣāṃ","_","_","tad","PRD","","_","_"
3,"sahasreṣu","_","_","sahasra","NUM","","_","_"
4,"_","_","_","sa_saha","CX","","_","_"
5,"_","_","_","kṛpāṇa","NC","","_","_"
6,"_","_","_","kara","NC","","_","_"
7,"api","_","_","api","CX","","_","_"
1,"gavām","_","_","go","NC","","_","_"
2,"_","_","_","iva","CCM","","_","_"
3,"_","_","_","udviṣāṇa","JJ","","_","_"
4,"matir","_","_","mati","NC","","_","_"
5,"me","_","_","mat","PPR","","_","_"
6,"_","_","_","manthara","NC","","_","_"
7,"_","_","_","ādara","NC","","_","_"
1,"_","_","_","ūru","NC","","_","_"
2,"_","_","_","mūla","NC","","_","_"
3,"_","_","_","stha","JJ","","_","_"
4,"_","_","_","śastra","NC","","_","_"
5,"_","_","_","pravrajyā","NC","","_","_"
6,"_","_","_","kaṅkaṭa","NC","","_","_"
7,"yaḥ","_","_","yad","PRL","","_","_"
1,"prayuṅkte","_","_","prayuj","V","prayuj","_","_"
2,"nirghṛṇaḥ","_","_","nirghṛṇa","JJ","","_","_"
3,"śastraṃ","_","_","śastra","NC","","_","_"
4,"ko","_","_","kiṃ","PRQ","","_","_"
5,"'nyaḥ","_","_","anya","PPX","","_","_"
6,"klībatamas","_","_","klībatama","JJ","","_","_"
7,"tataḥ","_","_","tatas","CX","","_","_"
1,"_","_","_","evamādi","JJ","","_","_"
2,"_","_","_","vikalpa","NC","","_","_"
3,"mām","_","_","mat","PPR","","_","_"
4,"asāv","_","_","adas","PRD","","_","_"
5,"ālokya","_","_","ālokay","CGDA","","_","_"
6,"maskarī","_","_","maskarin","NC","","_","_"
1,"nirāśa","_","_","nirāśa","JJ","","_","_"
2,"iva","_","_","iva","CCM","","_","_"
3,"vidrāṇo","_","_","brahmacārin","NC","","_","_"
4,"brahmacāriṇam","_","_","vac","KDP","","_","_"
1,"_","_","_","jalpāka","JJ","","_","_"
2,"_","_","_","granth","PPP","","_","_"
3,"granthaiḥ","_","_","grantha","NC","","_","_"
4,"_","_","_","sāṃkhya","NC","","_","_"
5,"_","_","_","yoga","NC","","_","_"
6,"_","_","_","ādi","NC","","_","_"
7,"vayam","_","_","mat","PPR","","_","_"
1,"vipralabdhāḥ","_","_","vipralabh","PPP","","_","_"
2,"sukhaṃ","_","_","sukha","NC","","_","_"
3,"tyaktvā","_","_","tyaj","CGDA","","_","_"
4,"_","_","_","mokṣa","NC","","_","_"
5,"_","_","_","mārga","NC","","_","_"
6,"kila","_","_","kila","CX","","_","_"
7,"sthitāḥ","_","_","sthā","PPP","","_","_"
1,"yathā","_","_","yathā","CCM","","_","_"
2,"tṛṇam","_","_","tṛṇa","NC","","_","_"
3,"upādātum","_","_","upādā","CGDI","","_","_"
4,"_","_","_","ambara","NC","","_","_"
5,"_","_","_","ambhoja","NC","","_","_"
6,"eva","_","_","eva","CEM","","_","_"
7,"vā","_","_","vā","CCD","","_","_"
1,"kaścin","_","_","kiṃcit","PRI","","_","_"
2,"mahat","_","_","mahat","JJ","","_","_"
3,"tapaḥ","_","_","tapas","NC","","_","_"
4,"kuryān","_","_","kar","V","kṛ","_","_"
5,"_","_","_","mokṣa","NC","","_","_"
6,"_","_","_","artha","NC","","_","_"
7,"nas","_","_","mat","PPR","","_","_"
8,"tathā","_","_","tathā","CX","","_","_"
9,"śramaḥ","_","_","śrama","NC","","_","_"
1,"_","_","_","tṛṇa","NC","","_","_"
2,"_","_","_","vat","CX","","_","_"
3,"_","_","_","sulabha","JJ","","_","_"
4,"mokṣo","_","_","mokṣa","NC","","_","_"
5,"yadi","_","_","yadi","CSB","","_","_"
6,"khedo","_","_","kheda","NC","","_","_"
7,"'phalas","_","_","aphala","JJ","","_","_"
8,"tataḥ","_","_","tatas","CX","","_","_"
1,"atha","_","_","atha","CAD","","_","_"
2,"_","_","_","kha","NC","","_","_"
3,"_","_","_","ambhoja","NC","","_","_"
4,"_","_","_","duṣprāpa","JJ","","_","_"
5,"tato","_","_","tatas","CX","","_","_"
6,"naṣṭā","_","_","naś","PPP","","_","_"
7,"mumukṣavaḥ","_","_","mumukṣu","JJ","","_","_"
1,"_","_","_","para","PPX","","_","_"
2,"_","_","_","loka","NC","","_","_"
3,"sadbhāve","_","_","sadbhāva","NC","","_","_"
4,"hetuḥ","_","_","hetu","NC","","_","_"
5,"_","_","_","sarvajña","JJ","","_","_"
6,"_","_","_","bhāṣ","PPP","","_","_"
1,"_","_","_","sarvajña","JJ","","_","_"
2,"_","_","_","api","CX","","_","_"
3,"sadbhāvaḥ","_","_","sadbhāva","NC","","_","_"
4,"_","_","_","pañcan","NUM","","_","_"
5,"_","_","_","divya","JJ","","_","_"
6,"_","_","_","pramāṇaka","NC","","_","_"
1,"yo","_","_","yad","PRL","","_","_"
2,"'py","_","_","api","CX","","_","_"
3,"upādīyate","_","_","upādad","V","upādā","_","_"
4,"hetuḥ","_","_","hetu","NC","","_","_"
5,"_","_","_","sarvajña","JJ","","_","_"
6,"_","_","_","astitva","NC","","_","_"
7,"_","_","_","siddhi","NC","","_","_"
1,"so","_","_","tad","PRD","","_","_"
2,"'py","_","_","api","CX","","_","_"
3,"_","_","_","asiddha","JJ","","_","_"
4,"_","_","_","virudh","PPP","","_","_"
5,"_","_","_","ādi","NC","","_","_"
6,"_","_","_","doṣa","NC","","_","_"
7,"_","_","_","āśīviṣa","NC","","_","_"
8,"_","_","_","dūṣay","PPP","","_","_"
1,"tad","_","_","tad","PRD","","_","_"
2,"alaṃ","_","_","ala","CX","","_","_"
3,"_","_","_","viṭa","NC","","_","_"
4,"_","_","_","vācāṭa","JJ","","_","_"
5,"_","_","_","ghaṭay","PPP","","_","_"
6,"_","_","_","kāvya","NC","","_","_"
7,"_","_","_","karpaṭa","NC","","_","_"
1,"sevamānā","_","_","sev","KDP","","_","_"
2,"_","_","_","yathā","CCM","","_","_"
3,"_","_","_","chanda","NC","","_","_"
4,"āsmahe","_","_","ās","V","ās","_","_"
5,"viṣayān","_","_","viṣaya","NC","","_","_"
6,"iti","_","_","iti","CQT","","_","_"
1,"brahmacārī","_","_","brahmacārin","NC","","_","_"
2,"tu","_","_","tu","CCD","","_","_"
3,"_","_","_","sa_saha","CX","","_","_"
4,"_","_","_","āvega","NC","","_","_"
5,"parivrājakam","_","_","parivrājaka","NC","","_","_"
6,"uktavān","_","_","vac","KDP","","_","_"
1,"prasāritas","_","_","prasāray","PPP","","_","_"
2,"tvayā","_","_","tvat","PPR","","_","_"
3,"kasmād","_","_","kasmāt","CX","","_","_"
4,"asāro","_","_","asāra","JJ","","_","_"
5,"_","_","_","malla","NC","","_","_"
6,"_","_","_","daṇḍaka","NC","","_","_"
1,"_","_","_","pratijñā","NC","","_","_"
2,"_","_","_","hetu","NC","","_","_"
3,"_","_","_","dṛṣṭānta","NC","","_","_"
4,"sādhavas","_","_","sādhu","JJ","","_","_"
5,"tāvad","_","_","tāvat","CX","","_","_"
6,"āsatām","_","_","ās","V","ās","_","_"
1,"_","_","_","sarva","JQ","","_","_"
2,"_","_","_","tantra","NC","","_","_"
3,"_","_","_","aviruddha","JJ","","_","_"
4,"_","_","_","siddhānta","NC","","_","_"
5,"_","_","_","eva","CEM","","_","_"
6,"bādhyase","_","_","bādh","V","bādh","_","_"
1,"_","_","_","asat","JJ","","_","_"
3,"_","_","_","para","PPX","","_","_"
4,"_","_","_","loka","NC","","_","_"
5,"_","_","_","śuṣka","JJ","","_","_"
6,"_","_","_","tarka","NC","","_","_"
7,"sādhayan","_","_","sādhay","KDP","","_","_"
1,"_","_","_","vitaṇḍā","NC","","_","_"
2,"_","_","_","vāda","NC","","_","_"
3,"_","_","_","vārttā","NC","","_","_"
4,"_","_","_","ārta","JJ","","_","_"
5,"sādhu","_","_","sādhu","JJ","","_","_"
6,"śocyo","_","_","śuc","KDG","","_","_"
7,"bhaviṣyasi","_","_","bhav","V","bhū","_","_"
1,"_","_","_","athavā","CX","","_","_"
2,"_","_","_","ās","V","ās","_","_"
3,"idaṃ","_","_","ida","PRD","","_","_"
4,"tāvad","_","_","tāvat","CX","","_","_"
5,"idaṃ","_","_","ida","PRD","","_","_"
6,"tāvan","_","_","tāvat","CX","","_","_"
7,"nigadyatām","_","_","nigad","V","nigad","_","_"
1,"smṛtīnāṃ","_","_","smṛti","NC","","_","_"
2,"_","_","_","viṭa","NC","","_","_"
3,"_","_","_","kāvya","NC","","_","_"
5,"kathaṃ","_","_","katha","CX","","_","_"
6,"veda","_","_","vid","V","vid","_","_"
7,"bhavān","_","_","bhavat","JJ","","_","_"
8,"iti","_","_","iti","CQT","","_","_"
1,"_","_","_","tad","PRD","","_","_"
2,"_","_","_","vac","PPP","","_","_"
3,"mānuṣāṇāṃ","_","_","mānuṣa","NC","","_","_"
4,"ca","_","_","ca","CCD","","_","_"
5,"prāyaḥ","_","_","prāyas","CX","","_","_"
6,"_","_","_","sarva","JQ","","_","_"
7,"_","_","_","śarīrin","NC","","_","_"
1,"_","_","_","nandīśa","NC","","_","_"
2,"_","_","_","pramukha","JJ","","_","_"
3,"uktam","_","_","vac","PPP","","_","_"
4,"ahaṃ","_","_","mat","PPR","","_","_"
5,"jānāmi","_","_","jān","V","jñā","_","_"
6,"lakṣaṇam","_","_","lakṣaṇa","NC","","_","_"
1,"yaś","_","_","yad","PRL","","_","_"
2,"_","_","_","ca","CCD","","_","_"
3,"_","_","_","tad","PRD","","_","_"
4,"puruṣaḥ","_","_","puruṣa","NC","","_","_"
5,"_","_","_","kiṃ","PRQ","","_","_"
6,"_","_","_","api","CX","","_","_"
7,"pānthaḥ","_","_","pāntha","NC","","_","_"
8,"_","_","_","pāṃsula","JJ","","_","_"
9,"_","_","_","pādaka","NC","","_","_"
1,"eṣa","_","_","tad","PRD","","_","_"
2,"_","_","_","vidyādhara","NC","","_","_"
3,"_","_","_","indra","NC","","_","_"
4,"indraḥ","_","_","indra","NC","","_","_"
5,"kila","_","_","kila","CX","","_","_"
6,"bhaviṣyati","_","_","bhav","V","bhū","_","_"
1,"enaṃ","_","_","a","PRD","","_","_"
2,"_","_","_","dṛś","CGDA","","_","_"
3,"_","_","_","adhiṣṭhā","KDP","","_","_"
4,"etaṃ","_","_","tad","PRD","","_","_"
5,"_","_","_","jarjara","JJ","","_","_"
6,"_","_","_","maṇḍapa","NC","","_","_"
1,"_","_","_","malla","NC","","_","_"
2,"_","_","_","daṇḍaka","NC","","_","_"
3,"_","_","_","niḥsāra","JJ","","_","_"
4,"utprekṣe","_","_","utprekṣ","V","utprekṣ","_","_"
5,"_","_","_","sakala","JJ","","_","_"
6,"_","_","_","āgama","NC","","_","_"
1,"a","_","_","alpha_privativum","JJ","","_","_"
1,"_","_","_","dṛṣṭa","JJ","","_","_"
2,"_","_","_","artha","NC","","_","_"
3,"kila","_","_","kila","CX","","_","_"
4,"granthā","_","_","grantha","NC","","_","_"
5,"_","_","_","dṛś","PPP","","_","_"
6,"_","_","_","artha","NC","","_","_"
7,"_","_","_","gāruḍa","JJ","","_","_"
8,"_","_","_","ādi","NC","","_","_"
1,"arthavanto","_","_","arthavat","JJ","","_","_"
2,"'numīyante","_","_","anumā","V","anumā","_","_"
3,"yācakair","_","_","yācaka","NC","","_","_"
4,"iva","_","_","iva","CCM","","_","_"
5,"dāyakāḥ","_","_","dāyaka","JJ","","_","_"
1,"yathā","_","_","yathā","CCM","","_","_"
2,"ca","_","_","ca","CCD","","_","_"
3,"_","_","_","viṭa","NC","","_","_"
4,"_","_","_","kāvya","NC","","_","_"
6,"mṛṣā","_","_","mṛṣā","CX","","_","_"
7,"_","_","_","puruṣa","NC","","_","_"
8,"_","_","_","lakṣaṇa","NC","","_","_"
1,"_","_","_","śruti","NC","","_","_"
2,"_","_","_","smṛti","NC","","_","_"
3,"_","_","_","purāṇa","NC","","_","_"
4,"_","_","_","ādi","NC","","_","_"
5,"tathā","_","_","tathā","CX","","_","_"
6,"saṃbhāvyatām","_","_","sambhāvay","V","sambhāvay","_","_"
7,"iti","_","_","iti","CQT","","_","_"
1,"itaras","_","_","itara","PPX","","_","_"
2,"tam","_","_","tad","PRD","","_","_"
3,"_","_","_","atha","CAD","","_","_"
4,"_","_","_","vak","V","vac","_","_"
5,"_","_","_","atī","PPP","","_","_"
6,"_","_","_","bhava","NC","","_","_"
7,"_","_","_","saṃci","PPP","","_","_"
1,"_","_","_","iṣ","PPP","","_","_"
2,"_","_","_","aniṣṭa","JJ","","_","_"
3,"_","_","_","phala","NC","","_","_"
4,"karma","_","_","karman","NC","","_","_"
5,"daivam","_","_","daiva","NC","","_","_"
6,"āhur","_","_","ah","V","ah","_","_"
7,"vicakṣaṇāḥ","_","_","vicakṣaṇa","JJ","","_","_"
1,"yac","_","_","yad","PRL","","_","_"
2,"_","_","_","ca","CCD","","_","_"
3,"_","_","_","ida","PRD","","_","_"
4,"lakṣaṇaṃ","_","_","lakṣaṇa","NC","","_","_"
5,"nāma","_","_","nāma","CX","","_","_"
6,"śarīreṣu","_","_","śarīra","NC","","_","_"
7,"śarīriṇām","_","_","śarīrin","NC","","_","_"
1,"etad","_","_","tad","PRD","","_","_"
2,"_","_","_","daiva","NC","","_","_"
3,"_","_","_","abhidhāna","NC","","_","_"
4,"lakṣaṇaṃ","_","_","lakṣaṇa","NC","","_","_"
5,"_","_","_","pūrva","PPX","","_","_"
6,"_","_","_","karman","NC","","_","_"
1,"na","_","_","na","CNG","","_","_"
2,"_","_","_","ca","CCD","","_","_"
3,"_","_","_","apuruṣa","JJ","","_","_"
4,"_","_","_","kāra","NC","","_","_"
5,"daivaṃ","_","_","daiva","NC","","_","_"
6,"phalati","_","_","phal","V","phal","_","_"
7,"kasyacit","_","_","kiṃcit","PRI","","_","_"
1,"_","_","_","kāla","NC","","_","_"
2,"_","_","_","kāraṇa","NC","","_","_"
3,"_","_","_","sāmagrī","NC","","_","_"
4,"īśvaro","_","_","īśvara","NC","","_","_"
5,"'pi","_","_","api","CX","","_","_"
6,"hy","_","_","hi","CX","","_","_"
7,"apekṣate","_","_","apekṣ","V","apekṣ","_","_"
1,"ayaṃ","_","_","ida","PRD","","_","_"
2,"tu","_","_","tu","CCD","","_","_"
3,"taruṇaḥ","_","_","taruṇa","JJ","","_","_"
4,"kalyaḥ","_","_","kalya","JJ","","_","_"
5,"_","_","_","kānti","NC","","_","_"
6,"_","_","_","kṣip","PPP","","_","_"
7,"_","_","_","sura","NC","","_","_"
8,"_","_","_","asura","NC","","_","_"
1,"kuṇṭhayā","_","_","kuṇṭha","JJ","","_","_"
2,"_","_","_","gaṇḍa","NC","","_","_"
3,"_","_","_","maṇḍa","NC","","_","_"
4,"_","_","_","manda","JJ","","_","_"
5,"_","_","_","ceṣṭa","NC","","_","_"
7,"samaḥ","_","_","sama","PPX","","_","_"
1,"yathā","_","_","yathā","CCM","","_","_"
2,"dhanur","_","_","dhanus","NC","","_","_"
3,"a","_","_","alpha_privativum","JJ","","_","_"
3,"adhānuṣkaṃ","_","_","dhānuṣka","JJ","","_","_"
4,"yathā","_","_","yathā","CCM","","_","_"
5,"bījam","_","_","bīja","NC","","_","_"
6,"a","_","_","alpha_privativum","JJ","","_","_"
6,"avāpakam","_","_","vāpaka","JJ","","_","_"
1,"_","_","_","as","KDP","","_","_"
3,"_","_","_","mātra","NC","","_","_"
4,"_","_","_","phala","NC","","_","_"
5,"puṃsas","_","_","puṃs","NC","","_","_"
6,"tathā","_","_","tathā","CX","","_","_"
7,"daivam","_","_","daiva","NC","","_","_"
8,"apauruṣam","_","_","apauruṣa","JJ","","_","_"
1,"parivrāḍ","_","_","parivrāj","NC","","_","_"
2,"abravīd","_","_","abravīta","V","brū","_","_"
3,"daivaṃ","_","_","daiva","NC","","_","_"
4,"pauruṣād","_","_","pauruṣa","NC","","_","_"
5,"balavattaram","_","_","balavattara","JJ","","_","_"
1,"jñāpakaṃ","_","_","jñāpaka","JJ","","_","_"
2,"_","_","_","ca","CCD","","_","_"
3,"_","_","_","ida","PRD","","_","_"
4,"pakṣasya","_","_","pakṣa","NC","","_","_"
5,"śrūyatāṃ","_","_","śṛṇ","V","śru","_","_"
6,"yan","_","_","yad","PRL","","_","_"
7,"mayā","_","_","mat","PPR","","_","_"
8,"śrutam","_","_","śru","PPP","","_","_"
1,"asti","_","_","as","V","as","_","_"
2,"_","_","_","sindhu","NC","","_","_"
3,"_","_","_","taṭa","NC","","_","_"
4,"grāmo","_","_","grāma","NC","","_","_"
5,"_","_","_","brahmasthalaka","NC","","_","_"
6,"_","_","_","nāmaka","JJ","","_","_"
1,"_","_","_","tatra","CAD","","_","_"
2,"_","_","_","as","V","as","_","_"
3,"_","_","_","vedaśarman","NC","","_","_"
4,"_","_","_","iti","CQT","","_","_"
5,"_","_","_","catur","NUM","","_","_"
6,"_","_","_","veda","NC","","_","_"
7,"dvijottamaḥ","_","_","dvijottama","NC","","_","_"
1,"tasya","_","_","tad","PRD","","_","_"
2,"yo","_","_","yad","PRL","","_","_"
3,"'nyatamaḥ","_","_","anyatama","JJ","","_","_"
4,"śiṣyaḥ","_","_","śiṣya","NC","","_","_"
5,"pāṭhaṃ","_","_","pāṭha","NC","","_","_"
6,"prati","_","_","prati","CADP","","_","_"
7,"_","_","_","dṛḍha","JJ","","_","_"
8,"_","_","_","udyama","NC","","_","_"
1,"tasmād","_","_","tasmāt","CX","","_","_"
2,"eva","_","_","eva","CEM","","_","_"
3,"ca","_","_","ca","CCD","","_","_"
4,"sa","_","_","tad","PRD","","_","_"
5,"chāttrair","_","_","chāttra","NC","","_","_"
6,"āhūyata","_","_","āhvā","V","āhvā","_","_"
7,"dṛḍhodyamaḥ","_","_","dṛḍhodyama","NC","","_","_"
1,"_","_","_","tamobhedaka","NC","","_","_"
2,"_","_","_","nāman","NC","","_","_"
3,"ca","_","_","ca","CCD","","_","_"
4,"gṛhasthasya","_","_","gṛhastha","NC","","_","_"
5,"gṛhe","_","_","gṛha","NC","","_","_"
6,"sadā","_","_","sadā","CAD","","_","_"
1,"dāpitaṃ","_","_","dāpay","PPP","","_","_"
2,"bhojanaṃ","_","_","bhojana","NC","","_","_"
3,"tasya","_","_","tad","PRD","","_","_"
4,"ācchādanaṃ","_","_","ācchādana","NC","","_","_"
5,"vedaśarmaṇā","_","_","vedaśarman","NC","","_","_"
1,"tatra","_","_","tatra","CAD","","_","_"
2,"bhinnatamā","_","_","bhinnatamas","NC","","_","_"
3,"nāma","_","_","nāma","CX","","_","_"
4,"parivrāṭ","_","_","parivrāj","NC","","_","_"
5,"pāñcarātrikaḥ","_","_","pāñcarātrika","JJ","","_","_"
1,"vāsam","_","_","vāsa","NC","","_","_"
2,"āvasathe","_","_","āvasatha","NC","","_","_"
3,"tasya","_","_","tad","PRD","","_","_"
4,"karoti","_","_","kar","V","kṛ","_","_"
5,"sma","_","_","sma","CX","","_","_"
6,"dṛḍhodyamaḥ","_","_","dṛḍhodyama","NC","","_","_"
1,"anena","_","_","ida","PRD","","_","_"
2,"ca","_","_","ca","CCD","","_","_"
3,"prakāreṇa","_","_","prakāra","NC","","_","_"
1,"a","_","_","alpha_privativum","PPP","","_","_"
1,"adhītaṃ","_","_","dhī","PPP","","_","_"
2,"daśabhir","_","_","daśan","NUM","","_","_"
3,"varṣais","_","_","varṣa","NC","","_","_"
4,"tena","_","_","tad","PRD","","_","_"
5,"_","_","_","veda","NC","","_","_"
6,"_","_","_","catuṣṭaya","NC","","_","_"
1,"atha","_","_","atha","CAD","","_","_"
2,"bhinnatamāḥ","_","_","bhinnatamas","NC","","_","_"
3,"kṛtvā","_","_","kṛ","CGDA","","_","_"
4,"_","_","_","varṇa","NC","","_","_"
5,"_","_","_","āśrama","NC","","_","_"
6,"_","_","_","kathā","NC","","_","_"
7,"ciram","_","_","cira","CX","","_","_"
1,"_","_","_","praśa","PPP","","_","_"
2,"_","_","_","jana","NC","","_","_"
3,"_","_","_","sampāta","NC","","_","_"
4,"pradoṣe","_","_","pradoṣa","NC","","_","_"
5,"tam","_","_","tad","PRD","","_","_"
6,"abhāṣata","_","_","bhāṣ","V","bhāṣ","_","_"
1,"_","_","_","bahu","JJ","","_","_"
2,"_","_","_","go","CX","","_","_"
3,"_","_","_","mahiṣī","NC","","_","_"
4,"_","_","_","bhūmi","NC","","_","_"
5,"_","_","_","dāsī","NC","","_","_"
6,"_","_","_","dāsa","NC","","_","_"
7,"idaṃ","_","_","ida","PRD","","_","_"
8,"mayā","_","_","mat","PPR","","_","_"
1,"_","_","_","tantra","NC","","_","_"
2,"_","_","_","sthāna","NC","","_","_"
3,"upāntaṃ","_","_","upānta","NC","","_","_"
4,"ca","_","_","ca","CCD","","_","_"
5,"_","_","_","cāṭa","NC","","_","_"
6,"_","_","_","ādi","NC","","_","_"
7,"ca","_","_","ca","CCD","","_","_"
8,"rakṣitam","_","_","rakṣ","PPP","","_","_"
1,"_","_","_","dhyāna","NC","","_","_"
2,"_","_","_","adhyāya","NC","","_","_"
3,"_","_","_","pradhāna","NC","","_","_"
4,"ca","_","_","ca","CCD","","_","_"
5,"vihitaṃ","_","_","vidhā","PPP","","_","_"
6,"_","_","_","bhikṣu","NC","","_","_"
7,"_","_","_","karman","NC","","_","_"
8,"yat","_","_","yad","PRL","","_","_"
1,"_","_","_","vaiśya","NC","","_","_"
2,"_","_","_","karman","NC","","_","_"
3,"_","_","_","abhiyuj","PPP","","_","_"
4,"tasya","_","_","tad","PRD","","_","_"
5,"_","_","_","nāman","NC","","_","_"
6,"_","_","_","api","CX","","_","_"
7,"_","_","_","na","CNG","","_","_"
8,"_","_","_","as","V","as","_","_"
9,"me","_","_","mat","PPR","","_","_"
1,"adhunā","_","_","adhunā","CX","","_","_"
2,"tu","_","_","tu","CCD","","_","_"
3,"_","_","_","vacas","NC","","_","_"
4,"_","_","_","kāya","NC","","_","_"
5,"_","_","_","parispanda","NC","","_","_"
6,"_","_","_","apahārin","JJ","","_","_"
1,"_","_","_","para","PPX","","_","_"
2,"_","_","_","loka","NC","","_","_"
3,"_","_","_","samāsad","PPP","","_","_"
4,"_","_","_","jarā","NC","","_","_"
5,"_","_","_","tandrā","NC","","_","_"
6,"_","_","_","iva","CCM","","_","_"
7,"_","_","_","āga","PPP","","_","_"
1,"_","_","_","gṛhamedhin","NC","","_","_"
2,"_","_","_","vrata","NC","","_","_"
3,"_","_","_","stha","JJ","","_","_"
4,"alasānāṃ","_","_","alasa","JJ","","_","_"
5,"_","_","_","sva","JJ","","_","_"
6,"_","_","_","karman","NC","","_","_"
1,"_","_","_","dharma","NC","","_","_"
2,"_","_","_","sādhana","NC","","_","_"
3,"uddiṣṭam","_","_","uddiś","PPP","","_","_"
4,"ṛṣibhis","_","_","ṛṣi","NC","","_","_"
5,"_","_","_","tīrtha","NC","","_","_"
6,"_","_","_","sevana","NC","","_","_"
1,"āha","_","_","ah","V","ah","_","_"
2,"_","_","_","vedānta","NC","","_","_"
3,"_","_","_","vāda","NC","","_","_"
4,"ca","_","_","ca","CCD","","_","_"
5,"tārakaṃ","_","_","tāraka","JJ","","_","_"
6,"brahma","_","_","brahman","NC","","_","_"
7,"tantrayet","_","_","tantray","V","tantray","_","_"
1,"etasmān","_","_","tad","PRD","","_","_"
2,"na","_","_","na","CNG","","_","_"
3,"vimuñceyur","_","_","vimuñc","V","vimuc","_","_"
4,"avimuktaṃ","_","_","avimukta","NC","","_","_"
5,"mumukṣavaḥ","_","_","mumukṣu","JJ","","_","_"
1,"śvaḥ","_","_","śvas","CX","","_","_"
2,"prasthātāsmahe","_","_","pratiṣṭh","V","prasthā","_","_"
3,"tasmāt","_","_","tasmāt","CX","","_","_"
4,"prātar","_","_","prātar","CX","","_","_"
5,"vārāṇasīṃ","_","_","vārāṇasī","NC","","_","_"
6,"prati","_","_","prati","CADP","","_","_"
1,"_","_","_","buddha","NC","","_","_"
2,"_","_","_","dharma","NC","","_","_"
3,"praśastā","_","_","praśaṃs","PPP","","_","_"
4,"hi","_","_","hi","CX","","_","_"
5,"dharmasya","_","_","dharma","NC","","_","_"
6,"tvaritā","_","_","tvarita","JJ","","_","_"
7,"gatiḥ","_","_","gati","NC","","_","_"
1,"_","_","_","bhavat","JJ","","_","_"
2,"_","_","_","api","CX","","_","_"
3,"_","_","_","śruti","NC","","_","_"
4,"_","_","_","smṛti","NC","","_","_"
5,"prāmāṇyam","_","_","prāmāṇya","NC","","_","_"
6,"anujānatā","_","_","anujñā","KDP","","_","_"
1,"_","_","_","niyoga","NC","","_","_"
2,"_","_","_","eva","CEM","","_","_"
3,"kartavyaḥ","_","_","kṛ","KDG","","_","_"
4,"_","_","_","patnī","NC","","_","_"
5,"_","_","_","putra","NC","","_","_"
6,"_","_","_","parigraha","NC","","_","_"
1,"_","_","_","gṛhastha","NC","","_","_"
2,"_","_","_","āśrama","NC","","_","_"
3,"_","_","_","dharma","NC","","_","_"
4,"ca","_","_","ca","CCD","","_","_"
5,"_","_","_","go","NC","","_","_"
6,"_","_","_","ādi","NC","","_","_"
7,"_","_","_","dhana","NC","","_","_"
8,"_","_","_","sādhana","NC","","_","_"
1,"na","_","_","na","CNG","","_","_"
2,"ca","_","_","ca","CCD","","_","_"
3,"pratigrahād","_","_","pratigraha","NC","","_","_"
4,"anyad","_","_","anya","PPX","","_","_"
5,"viprasya","_","_","vipra","NC","","_","_"
6,"_","_","_","dhana","NC","","_","_"
7,"_","_","_","sādhana","NC","","_","_"
1,"tat","_","_","tad","PRD","","_","_"
2,"_","_","_","sukha","NC","","_","_"
3,"_","_","_","upana","PPP","","_","_"
4,"_","_","_","ca","CCD","","_","_"
5,"_","_","_","tad","PRD","","_","_"
6,"anindyam","_","_","anindya","JJ","","_","_"
7,"_","_","_","ati","CADP","","_","_"
8,"_","_","_","bhūri","JQ","","_","_"
9,"ca","_","_","ca","CCD","","_","_"
1,"_","_","_","sa_saha","CX","","_","_"
2,"_","_","_","dāsī","NC","","_","_"
3,"_","_","_","dāsa","NC","","_","_"
4,"asmākaṃ","_","_","mat","PPR","","_","_"
5,"dhanam","_","_","dhana","NC","","_","_"
6,"ādīyatām","_","_","ādad","V","ādā","_","_"
7,"iti","_","_","iti","CQT","","_","_"
1,"_","_","_","tad","PRD","","_","_"
2,"_","_","_","vac","PPP","","_","_"
3,"_","_","_","tvat","PPR","","_","_"
4,"_","_","_","ādiś","PPP","","_","_"
5,"akāryam","_","_","akārya","JJ","","_","_"
6,"api","_","_","api","CX","","_","_"
7,"mādṛśaḥ","_","_","mādṛś","JJ","","_","_"
1,"na","_","_","na","CNG","","_","_"
2,"vikalpayituṃ","_","_","vikalpay","CGDI","","_","_"
3,"śaktaḥ","_","_","śak","PPP","","_","_"
4,"kiṃ","_","_","kim","CX","","_","_"
5,"punar","_","_","punar","CAD","","_","_"
6,"nyāyyam","_","_","nyāyya","JJ","","_","_"
7,"īdṛśam","_","_","īdṛśa","JJ","","_","_"
1,"kiṃtv","_","_","kiṃtu","CX","","_","_"
2,"āmantrya","_","_","āmantray","CGDA","","_","_"
3,"pitṛsthānau","_","_","pitṛsthāna","NC","","_","_"
4,"_","_","_","vidyā","NC","","_","_"
5,"_","_","_","jīvita","NC","","_","_"
6,"_","_","_","dāyin","JJ","","_","_"
1,"kartāsmi","_","_","kar","V","kṛ","_","_"
2,"_","_","_","bhavat","JJ","","_","_"
3,"_","_","_","ādeśa","NC","","_","_"
4,"ativāhya","_","_","ativāhay","CGDA","","_","_"
5,"niśām","_","_","niśā","NC","","_","_"
6,"iti","_","_","iti","CQT","","_","_"
1,"yātāyāṃ","_","_","yā","PPP","","_","_"
2,"tu","_","_","tu","CCD","","_","_"
3,"triyāmāyāṃ","_","_","triyāmā","NC","","_","_"
4,"tam","_","_","tad","PRD","","_","_"
5,"āmantrayituṃ","_","_","āmantray","CGDI","","_","_"
6,"gatam","_","_","ga","PPP","","_","_"
1,"_","_","_","sampratiṣṭhā","NC","","_","_"
2,"_","_","_","samāna","JJ","","_","_"
3,"'pi","_","_","api","CX","","_","_"
4,"ciraṃ","_","_","cira","CX","","_","_"
5,"bhikṣur","_","_","bhikṣu","NC","","_","_"
6,"udaikṣata","_","_","udīkṣ","V","udīkṣ","_","_"
1,"yadā","_","_","yadā","CSB","","_","_"
2,"tu","_","_","tu","CCD","","_","_"
3,"_","_","_","divasa","NC","","_","_"
4,"_","_","_","ardha","NC","","_","_"
5,"'pi","_","_","api","CX","","_","_"
6,"gate","_","_","ga","PPP","","_","_"
7,"chāttraḥ","_","_","chāttra","NC","","_","_"
8,"sa","_","_","tad","PRD","","_","_"
9,"_","_","_","na","CNG","","_","_"
10,"_","_","_","āga","PPP","","_","_"
1,"taṃ","_","_","tad","PRD","","_","_"
2,"gaveṣayituṃ","_","_","gaveṣay","CGDI","","_","_"
3,"bhikṣuḥ","_","_","bhikṣu","NC","","_","_"
4,"svayam","_","_","svaya","CX","","_","_"
5,"eva","_","_","eva","CEM","","_","_"
6,"tadā","_","_","tadā","CAD","","_","_"
7,"gataḥ","_","_","ga","PPP","","_","_"
1,"sa","_","_","tad","PRD","","_","_"
2,"tu","_","_","tu","CCD","","_","_"
3,"_","_","_","tad","PRD","","_","_"
4,"_","_","_","aṅgaṇa","NC","","_","_"
5,"dṛṣṭas","_","_","dṛś","PPP","","_","_"
6,"_","_","_","tamobhedaka","NC","","_","_"
7,"_","_","_","veśa","NC","","_","_"
8,"_","_","_","manas","NC","","_","_"
1,"śanaiś","_","_","śanais","CX","","_","_"
2,"caṅkramaṇaṃ","_","_","caṅkramaṇa","NC","","_","_"
3,"kurvan","_","_","kṛ","KDP","","_","_"
4,"nīcaiś","_","_","nīcais","CX","","_","_"
5,"_","_","_","ca","CCD","","_","_"
6,"_","_","_","āmnāya","NC","","_","_"
7,"_","_","_","mānasa","NC","","_","_"
1,"uktaṃ","_","_","vac","PPP","","_","_"
2,"ca","_","_","ca","CCD","","_","_"
3,"bhavatā","_","_","bhavat","JJ","","_","_"
4,"kasmād","_","_","kasmāt","CX","","_","_"
5,"_","_","_","iyat","JJ","","_","_"
6,"_","_","_","cira","CX","","_","_"
7,"iha","_","_","iha","CAD","","_","_"
8,"sthitam","_","_","sthā","PPP","","_","_"
1,"_","_","_","atha","CAD","","_","_"
2,"_","_","_","artha","NC","","_","_"
3,"_","_","_","eva","CEM","","_","_"
4,"_","_","_","tad","PRD","","_","_"
5,"_","_","_","artha","NC","","_","_"
6,"tathā","_","_","tathā","CX","","_","_"
7,"naḥ","_","_","mat","PPR","","_","_"
8,"kathyatām","_","_","kath","V","kath","_","_"
9,"iti","_","_","iti","CQT","","_","_"
1,"tatas","_","_","tatas","CX","","_","_"
2,"_","_","_","tad","PRD","","_","_"
3,"_","_","_","vac","PPP","","_","_"
4,"etasmin","_","_","tad","PRD","","_","_"
5,"gṛhe","_","_","gṛha","NC","","_","_"
6,"_","_","_","kiṃ","PRQ","","_","_"
7,"_","_","_","api","CX","","_","_"
8,"hetunā","_","_","hetu","NC","","_","_"
1,"vyagraḥ","_","_","vyagra","JJ","","_","_"
2,"parijanaḥ","_","_","parijana","NC","","_","_"
3,"sarvas","_","_","sarva","JQ","","_","_"
4,"tatra","_","_","tatra","CAD","","_","_"
5,"_","_","_","tatra","CAD","","_","_"
6,"_","_","_","abhidhāv","V","abhidhāv","_","_"
1,"yāṃ","_","_","yad","PRL","","_","_"
2,"yām","_","_","yad","PRL","","_","_"
3,"eva","_","_","eva","CEM","","_","_"
4,"ca","_","_","ca","CCD","","_","_"
5,"pṛcchāmi","_","_","pṛcch","V","prach","_","_"
6,"kim","_","_","kiṃ","PRQ","","_","_"
7,"etad","_","_","tad","PRD","","_","_"
8,"iti","_","_","iti","CQT","","_","_"
9,"dārikām","_","_","dārikā","NC","","_","_"
1,"sā","_","_","tad","PRD","","_","_"
2,"sā","_","_","tad","PRD","","_","_"
3,"mām","_","_","mat","PPR","","_","_"
4,"āha","_","_","ah","V","ah","_","_"
5,"saṃrabdhā","_","_","saṃrabh","PPP","","_","_"
6,"śivaṃ","_","_","śiva","NC","","_","_"
7,"dhyātu","_","_","bhavat","JJ","","_","_"
8,"bhavān","_","_","iti","CQT","","_","_"
1,"taṃ","_","_","tad","PRD","","_","_"
2,"_","_","_","ca","CCD","","_","_"
3,"_","_","_","adya","CX","","_","_"
4,"_","_","_","api","CX","","_","_"
5,"na","_","_","na","CNG","","_","_"
6,"pṛcchāmi","_","_","pṛcch","V","prach","_","_"
7,"tamobhedakam","_","_","tamobhedaka","NC","","_","_"
8,"ākulam","_","_","ākula","JJ","","_","_"
1,"_","_","_","ta","CX","","_","_"
2,"_","_","_","mat","PPR","","_","_"
3,"_","_","_","na","CNG","","_","_"
4,"_","_","_","āga","PPP","","_","_"
5,"kṣipraṃ","_","_","kṣipra","CX","","_","_"
6,"sakāśaṃ","_","_","sakāśa","NC","","_","_"
7,"bhavatām","_","_","bhavat","JJ","","_","_"
8,"iti","_","_","iti","CQT","","_","_"
1,"atha","_","_","atha","CAD","","_","_"
2,"bhinnatamāḥ","_","_","bhinnatamas","NC","","_","_"
3,"smitvā","_","_","smi","CGDA","","_","_"
4,"dṛḍhodyamam","_","_","dṛḍhodyama","NC","","_","_"
5,"abhāṣata","_","_","bhāṣ","V","bhāṣ","_","_"
1,"_","_","_","ya","CX","","_","_"
2,"_","_","_","ida","PRD","","_","_"
3,"ākulo","_","_","ākula","JJ","","_","_"
4,"lokas","_","_","loka","NC","","_","_"
5,"tad","_","_","tad","PRD","","_","_"
6,"ahaṃ","_","_","mat","PPR","","_","_"
7,"kathayāmi","_","_","kath","V","kath","_","_"
8,"te","_","_","tvat","PPR","","_","_"
1,"_","_","_","tamobhedaka","NC","","_","_"
2,"_","_","_","bhāryā","NC","","_","_"
3,"prasūtiḥ","_","_","prasūti","NC","","_","_"
4,"pratyupasthitā","_","_","pratyupasthā","PPP","","_","_"
1,"ayaṃ","_","_","ida","PRD","","_","_"
2,"parijanas","_","_","parijana","NC","","_","_"
3,"tatra","_","_","tatra","CAD","","_","_"
4,"_","_","_","tatra","CAD","","_","_"
5,"_","_","_","tatra","CAD","","_","_"
6,"_","_","_","ākula","JJ","","_","_"
7,"_","_","_","ākula","JJ","","_","_"
1,"dārikā","_","_","dārikā","NC","","_","_"
2,"jāyate","_","_","jan","V","jan","_","_"
3,"_","_","_","ca","CCD","","_","_"
4,"_","_","_","ida","PRD","","_","_"
5,"tāṃ","_","_","tad","PRD","","_","_"
6,"ca","_","_","ca","CCD","","_","_"
7,"tvaṃ","_","_","tvat","PPR","","_","_"
8,"pariṇeṣyasi","_","_","pariṇī","V","pariṇī","_","_"
1,"sā","_","_","tad","PRD","","_","_"
2,"ca","_","_","ca","CCD","","_","_"
3,"_","_","_","rāga","NC","","_","_"
4,"_","_","_","graha","NC","","_","_"
5,"_","_","_","āviś","PPP","","_","_"
6,"_","_","_","duṣ","PPP","","_","_"
7,"_","_","_","ceṣṭā","NC","","_","_"
8,"bhaviṣyati","_","_","bhav","V","bhū","_","_"
1,"iti","_","_","iti","CQT","","_","_"
2,"tasmin","_","_","tad","PRD","","_","_"
3,"_","_","_","kṛ","PPP","","_","_"
4,"_","_","_","ādeśa","NC","","_","_"
5,"gate","_","_","ga","PPP","","_","_"
6,"_","_","_","sva","JJ","","_","_"
7,"_","_","_","vivadha","NC","","_","_"
8,"prati","_","_","prati","CADP","","_","_"
1,"itaraś","_","_","itara","PPX","","_","_"
2,"cintayāmāsa","_","_","cintay","V","cintay","_","_"
3,"_","_","_","śaṅkā","NC","","_","_"
4,"_","_","_","kampay","PPP","","_","_"
5,"_","_","_","mānasa","NC","","_","_"
1,"brāhmaṇī","_","_","brāhmaṇī","NC","","_","_"
2,"_","_","_","brāhmaṇa","NC","","_","_"
3,"_","_","_","ida","PRD","","_","_"
4,"yadi","_","_","yadi","CSB","","_","_"
5,"kanyāṃ","_","_","kanyā","NC","","_","_"
6,"vijāyate","_","_","vijan","V","vijan","_","_"
1,"tato","_","_","tatas","CX","","_","_"
2,"_","_","_","bhinnatamas","NC","","_","_"
3,"_","_","_","vākya","NC","","_","_"
4,"_","_","_","abhūta","JJ","","_","_"
5,"_","_","_","artha","NC","","_","_"
6,"na","_","_","na","CNG","","_","_"
7,"jāyate","_","_","jan","V","jan","_","_"
1,"_","_","_","stobha","NC","","_","_"
2,"_","_","_","āveśa","NC","","_","_"
3,"_","_","_","viṣa","NC","","_","_"
4,"_","_","_","āccheda","NC","","_","_"
5,"_","_","_","kriyā","NC","","_","_"
6,"_","_","_","vyakta","JJ","","_","_"
7,"_","_","_","śakti","NC","","_","_"
1,"śeṣāṇām","_","_","śeṣa","JJ","","_","_"
2,"api","_","_","api","CX","","_","_"
3,"mantrāṇāṃ","_","_","mantra","NC","","_","_"
4,"sāmarthyam","_","_","sāmarthya","NC","","_","_"
5,"anumīyate","_","_","anumā","V","anumā","_","_"
1,"iti","_","_","iti","CQT","","_","_"
2,"cintayatas","_","_","cintay","KDP","","_","_"
3,"tasya","_","_","tad","PRD","","_","_"
4,"dīno","_","_","dīna","JJ","","_","_"
5,"gṛhapatir","_","_","gṛhapati","NC","","_","_"
6,"gṛhāt","_","_","gṛha","NC","","_","_"
1,"hā","_","_","hā","CX","","_","_"
2,"daivaṃ","_","_","daiva","NC","","_","_"
3,"khalam","_","_","khala","NC","","_","_"
4,"ityādi","_","_","ityādi","JJ","","_","_"
5,"lapan","_","_","lap","KDP","","_","_"
6,"nīcair","_","_","nīcais","CX","","_","_"
7,"vinirgataḥ","_","_","vinirga","PPP","","_","_"
1,"kṣaṇāc","_","_","kṣaṇa","NC","","_","_"
2,"ca","_","_","ca","CCD","","_","_"
3,"_","_","_","śvan","NC","","_","_"
4,"_","_","_","grah","PPP","","_","_"
5,"_","_","_","mārjāra","NC","","_","_"
6,"_","_","_","iva","CCM","","_","_"
7,"kūjataḥ","_","_","kūj","KDP","","_","_"
1,"_","_","_","antar","CAD","","_","_"
2,"_","_","_","bhavana","NC","","_","_"
3,"udbhūtaḥ","_","_","udbhū","PPP","","_","_"
4,"_","_","_","śvan","NC","","_","_"
5,"_","_","_","āgāra","NC","","_","_"
6,"_","_","_","paruṣa","JJ","","_","_"
7,"_","_","_","śruti","NC","","_","_"
1,"tataḥ","_","_","tatas","CX","","_","_"
2,"prasādhitā","_","_","prasādhay","PPP","","_","_"
3,"nāryo","_","_","nārī","NC","","_","_"
4,"_","_","_","lajjā","NC","","_","_"
5,"_","_","_","prāvṛ","PPP","","_","_"
6,"_","_","_","mastaka","NC","","_","_"
1,"_","_","_","pakṣa","NC","","_","_"
2,"_","_","_","dvāra","NC","","_","_"
3,"nirjagmur","_","_","nirga","V","nirga","_","_"
4,"_","_","_","nairāśya","NC","","_","_"
5,"_","_","_","uttāna","JJ","","_","_"
6,"_","_","_","pāṇi","NC","","_","_"
1,"_","_","_","paricāraka","NC","","_","_"
2,"_","_","_","varga","NC","","_","_"
3,"ca","_","_","ca","CCD","","_","_"
4,"_","_","_","śuc","KDP","","_","_"
5,"_","_","_","bandhu","NC","","_","_"
6,"_","_","_","kadambaka","NC","","_","_"
1,"amantrayata","_","_","mantray","V","mantray","_","_"
2,"vāmasya","_","_","vāma","JJ","","_","_"
3,"vidheḥ","_","_","vidhi","NC","","_","_"
4,"kiṃ","_","_","kiṃ","PRQ","","_","_"
5,"kriyatām","_","_","kar","V","kṛ","_","_"
6,"iti","_","_","iti","CQT","","_","_"
1,"_","_","_","evamprāya","JJ","","_","_"
2,"_","_","_","prapañca","NC","","_","_"
3,"tu","_","_","tu","CCD","","_","_"
4,"gṛhe","_","_","gṛha","NC","","_","_"
5,"tasmin","_","_","tad","PRD","","_","_"
6,"dṛḍhodyamaḥ","_","_","dṛḍhodyama","NC","","_","_"
1,"_","_","_","siddha","NC","","_","_"
2,"_","_","_","pravrajita","NC","","_","_"
3,"_","_","_","ādeśa","NC","","_","_"
4,"_","_","_","jan","PPP","","_","_"
5,"_","_","_","bhīti","NC","","_","_"
6,"acintayat","_","_","cintay","V","cintay","_","_"
1,"_","_","_","parivrājaka","NC","","_","_"
2,"_","_","_","vākya","NC","","_","_"
3,"_","_","_","tathā","CX","","_","_"
4,"_","_","_","bhū","PPP","","_","_"
5,"sādhitam","_","_","sādhay","PPP","","_","_"
1,"daivaṃ","_","_","daiva","NC","","_","_"
2,"puruṣakāreṇa","_","_","puruṣakāra","NC","","_","_"
3,"janāḥ","_","_","jana","NC","","_","_"
4,"paśyantu","_","_","paś","V","paś","_","_"
5,"bādhitam","_","_","bādh","PPP","","_","_"
1,"_","_","_","sindhu","NC","","_","_"
2,"_","_","_","deśa","NC","","_","_"
3,"parityajya","_","_","parityaj","CGDA","","_","_"
4,"de","_","_","da","JJ","","_","_"
1,"ayaṃ","_","_","ida","PRD","","_","_"
2,"pariharāmy","_","_","parihar","V","parihṛ","_","_"
3,"enāṃ","_","_","a","PRD","","_","_"
4,"dūrataḥ","_","_","dūratas","CX","","_","_"
5,"kardamām","_","_","kardama","JJ","","_","_"
6,"iti","_","_","iti","CQT","","_","_"
1,"evamādi","_","_","evamādi","JJ","","_","_"
2,"_","_","_","vimṛś","CGDA","","_","_"
3,"_","_","_","adas","PRD","","_","_"
4,"_","_","_","asaṃmantrya","CX","","_","_"
5,"_","_","_","eva","CEM","","_","_"
6,"saṃskṛtān","_","_","saṃskṛ","PPP","","_","_"
1,"_","_","_","daśan","NUM","","_","_"
2,"_","_","_","yojana","NC","","_","_"
3,"adhvānam","_","_","adhvan","NC","","_","_"
4,"_","_","_","eka","PPX","","_","_"
5,"_","_","_","aha","NC","","_","_"
6,"palāyitaḥ","_","_","palāyita","JJ","","_","_"
1,"_","_","_","sa_saha","CX","","_","_"
2,"_","_","_","dvīpa","NC","","_","_"
3,"ca","_","_","ca","CCD","","_","_"
4,"parikramya","_","_","parikra","CGDA","","_","_"
5,"varṣair","_","_","varṣa","NC","","_","_"
6,"dvādaśabhir","_","_","dvādaśan","NUM","","_","_"
7,"mahīm","_","_","mahī","NC","","_","_"
1,"_","_","_","gaṅgā","NC","","_","_"
2,"_","_","_","taṭa","NC","","_","_"
3,"upāgacchat","_","_","upāga","V","upaga","_","_"
4,"_","_","_","tīrtha","NC","","_","_"
5,"_","_","_","upāsana","NC","","_","_"
6,"_","_","_","kāmyā","NC","","_","_"
1,"_","_","_","atha","CAD","","_","_"
2,"_","_","_","ātapa","NC","","_","_"
3,"_","_","_","pipāsā","NC","","_","_"
4,"_","_","_","ārta","JJ","","_","_"
5,"_","_","_","chāyā","NC","","_","_"
6,"_","_","_","salila","NC","","_","_"
7,"_","_","_","vāñchā","NC","","_","_"
1,"kasmiṃścid","_","_","kiṃcit","PRI","","_","_"
2,"_","_","_","brāhmaṇa","NC","","_","_"
3,"_","_","_","grāma","NC","","_","_"
4,"kaṃcana","_","_","kaścana","PRI","","_","_"
5,"prāviśad","_","_","praviś","V","praviś","_","_"
6,"gṛham","_","_","gṛha","NC","","_","_"
1,"tatra","_","_","tatra","CAD","","_","_"
2,"_","_","_","ca","CCD","","_","_"
3,"_","_","_","alindaka","NC","","_","_"
4,"_","_","_","ās","PPP","","_","_"
5,"_","_","_","arka","NC","","_","_"
6,"_","_","_","tūla","NC","","_","_"
7,"_","_","_","ābha","JJ","","_","_"
8,"_","_","_","mūrdhaja","NC","","_","_"
1,"yayāce","_","_","yayāca","V","yāc","_","_"
2,"brāhmaṇīm","_","_","brāhmaṇī","NC","","_","_"
3,"amba","_","_","ambā","NC","","_","_"
4,"pānīyaṃ","_","_","pānīya","NC","","_","_"
5,"dāpyatām","_","_","dāpay","V","dāpay","_","_"
6,"iti","_","_","iti","CQT","","_","_"
1,"sā","_","_","tad","PRD","","_","_"
2,"tv","_","_","tu","CCD","","_","_"
3,"abhāṣata","_","_","bhāṣ","V","bhāṣ","_","_"
4,"saṃbhrāntā","_","_","sambhra","PPP","","_","_"
5,"hale","_","_","halā","NC","","_","_"
6,"putri","_","_","putrī","NC","","_","_"
7,"tamālike","_","_","tamālikā","NC","","_","_"
1,"_","_","_","āsana","NC","","_","_"
2,"_","_","_","udaka","NC","","_","_"
3,"ādāya","_","_","ādā","CGDA","","_","_"
4,"laghu","_","_","laghu","JJ","","_","_"
5,"nirgamyatām","_","_","nirga","V","nirga","_","_"
6,"iti","_","_","iti","CQT","","_","_"
1,"tataḥ","_","_","tatas","CX","","_","_"
2,"_","_","_","pīṭha","NC","","_","_"
3,"_","_","_","ālukā","NC","","_","_"
4,"_","_","_","hasta","NC","","_","_"
5,"_","_","_","vasita","NC","","_","_"
6,"_","_","_","asita","JJ","","_","_"
7,"_","_","_","kañcuka","NC","","_","_"
1,"kanyakā","_","_","kanyakā","NC","","_","_"
2,"niragād","_","_","nirgā","V","nirgā","_","_"
3,"gṛhāt","_","_","gṛha","NC","","_","_"
1,"diśas","_","_","diś","NC","","_","_"
2,"taralayā","_","_","tarala","JJ","","_","_"
3,"dṛṣṭyā","_","_","dṛṣṭi","NC","","_","_"
4,"paśyantī","_","_","dṛś","KDP","","_","_"
5,"_","_","_","saṃtan","PPP","","_","_"
6,"_","_","_","smita","NC","","_","_"
1,"_","_","_","paṅgu","JJ","","_","_"
2,"_","_","_","bhaṅgura","JJ","","_","_"
3,"_","_","_","saṃcāra","NC","","_","_"
4,"cirāt","_","_","cirāt","CX","","_","_"
5,"prāpad","_","_","prāpn","V","prāp","_","_"
6,"dṛḍhodyamam","_","_","dṛḍhodyama","NC","","_","_"
1,"āsyatām","_","_","ās","V","ās","_","_"
2,"atra","_","_","atra","CAD","","_","_"
3,"_","_","_","mitra","NC","","_","_"
4,"_","_","_","iti","CQT","","_","_"
5,"vadantyā","_","_","vad","KDP","","_","_"
6,"śūnyayā","_","_","śūnya","JJ","","_","_"
7,"tayā","_","_","tad","PRD","","_","_"
1,"_","_","_","pīṭha","NC","","_","_"
2,"_","_","_","buddhi","NC","","_","_"
3,"puras","_","_","puras","CX","","_","_"
4,"tasya","_","_","tad","PRD","","_","_"
5,"nikṣiptaṃ","_","_","nikṣip","PPP","","_","_"
6,"_","_","_","jala","NC","","_","_"
7,"_","_","_","bhājana","NC","","_","_"
1,"atha","_","_","atha","CAD","","_","_"
2,"tām","_","_","tad","PRD","","_","_"
3,"abravīd","_","_","abravīta","V","brū","_","_"
4,"vṛddhā","_","_","vṛddha","JJ","","_","_"
5,"_","_","_","muc","CGDA","","_","_"
6,"_","_","_","tad","PRD","","_","_"
7,"_","_","_","avinīta","JJ","","_","_"
1,"_","_","_","apara","PPX","","_","_"
2,"_","_","_","uda","NC","","_","_"
3,"_","_","_","pātra","NC","","_","_"
4,"jalam","_","_","jala","NC","","_","_"
5,"āvarjyatām","_","_","āvarjay","V","āvarjay","_","_"
6,"iti","_","_","iti","CQT","","_","_"
1,"sā","_","_","tad","PRD","","_","_"
2,"tu","_","_","tu","CCD","","_","_"
3,"_","_","_","kṛtrima","JJ","","_","_"
4,"_","_","_","saṃtrāsa","NC","","_","_"
5,"_","_","_","janay","PPP","","_","_"
6,"_","_","_","utkaṭa","JJ","","_","_"
7,"_","_","_","vepathu","NC","","_","_"
1,"_","_","_","antar","CAD","","_","_"
2,"_","_","_","hasita","NC","","_","_"
3,"_","_","_","bhuj","PPP","","_","_"
4,"_","_","_","oṣṭhī","NC","","_","_"
5,"_","_","_","vṛddha","JJ","","_","_"
6,"_","_","_","ājñā","NC","","_","_"
7,"samapādayat","_","_","sampāday","V","sampāday","_","_"
1,"tato","_","_","tatas","CX","","_","_"
2,"_","_","_","ga","PPP","","_","_"
3,"_","_","_","śrama","NC","","_","_"
4,"vṛddhā","_","_","vṛddha","JJ","","_","_"
5,"pṛcchati","_","_","pṛcch","V","prach","_","_"
6,"sma","_","_","sma","CX","","_","_"
7,"dṛḍhodyamam","_","_","dṛḍhodyama","NC","","_","_"
1,"āgacchati","_","_","āgacch","V","āgam","_","_"
2,"kuto","_","_","kutas","CX","","_","_"
3,"deśāt","_","_","deśa","NC","","_","_"
4,"kaṃ","_","_","kiṃ","PRQ","","_","_"
5,"vā","_","_","vā","CCD","","_","_"
6,"yāti","_","_","yā","V","yā","_","_"
7,"bhavān","_","_","bhavat","JJ","","_","_"
8,"iti","_","_","iti","CQT","","_","_"
1,"_","_","_","tad","PRD","","_","_"
2,"_","_","_","vac","PPP","","_","_"
3,"na","_","_","na","CNG","","_","_"
4,"sa","_","_","tad","PRD","","_","_"
5,"deśo","_","_","deśa","NC","","_","_"
6,"'sti","_","_","as","V","as","_","_"
7,"_","_","_","na","CNG","","_","_"
8,"_","_","_","āga","V","āga","_","_"
9,"yataḥ","_","_","yatas","CX","","_","_"
10,"kṣitau","_","_","kṣiti","NC","","_","_"
1,"yac","_","_","yad","PRL","","_","_"
2,"ca","_","_","ca","CCD","","_","_"
3,"brūtha","_","_","abravīta","V","brū","_","_"
4,"kva","_","_","kva","CX","","_","_"
5,"_","_","_","yā","V","yā","_","_"
6,"_","_","_","iti","CQT","","_","_"
7,"tatra","_","_","tatra","CAD","","_","_"
8,"vijñāpayāmi","_","_","vijān","V","vijñā","_","_"
9,"vaḥ","_","_","tvat","PPR","","_","_"
1,"kasmiṃścid","_","_","kiṃcit","PRI","","_","_"
2,"_","_","_","brāhmaṇa","NC","","_","_"
3,"_","_","_","grāma","NC","","_","_"
4,"kurvan","_","_","kṛ","KDP","","_","_"
5,"_","_","_","baṭuka","NC","","_","_"
6,"_","_","_","pāṭhana","NC","","_","_"
1,"saṃtuṣṭo","_","_","saṃtuṣ","PPP","","_","_"
2,"_","_","_","grāma","NC","","_","_"
3,"_","_","_","vāsas","NC","","_","_"
4,"ninīṣe","_","_","nay","V","nī","_","_"
5,"divasān","_","_","divasa","NC","","_","_"
6,"iti","_","_","iti","CQT","","_","_"
1,"tatas","_","_","tatas","CX","","_","_"
2,"tam","_","_","tad","PRD","","_","_"
3,"abravīd","_","_","abravīta","V","brū","_","_"
4,"vṛddhā","_","_","vṛddha","JJ","","_","_"
5,"_","_","_","nīti","NC","","_","_"
6,"_","_","_","jña","JJ","","_","_"
7,"satyam","_","_","satya","NC","","_","_"
8,"ucyate","_","_","vak","V","vac","_","_"
1,"na","_","_","na","CNG","","_","_"
2,"hy","_","_","hi","CX","","_","_"
3,"ataptena","_","_","atapta","JJ","","_","_"
4,"lohena","_","_","loha","NC","","_","_"
5,"taptaṃ","_","_","tap","PPP","","_","_"
6,"saṃdhīyate","_","_","saṃdadh","V","saṃdhā","_","_"
7,"kvacit","_","_","kvacid","CX","","_","_"
1,"mama","_","_","mat","PPR","","_","_"
2,"dvau","_","_","dvi","NUM","","_","_"
3,"_","_","_","putra","NC","","_","_"
4,"_","_","_","naptṛ","NC","","_","_"
5,"_","_","_","adhunā","CX","","_","_"
6,"_","_","_","eva","CEM","","_","_"
7,"_","_","_","upanītaka","NC","","_","_"
1,"tau","_","_","tad","PRD","","_","_"
2,"ca","_","_","ca","CCD","","_","_"
3,"saṃyojitau","_","_","saṃyojay","PPP","","_","_"
4,"puṇyair","_","_","puṇya","JJ","","_","_"
5,"arthināv","_","_","arthin","JJ","","_","_"
6,"arthinā","_","_","arthin","JJ","","_","_"
7,"tvayā","_","_","tvat","PPR","","_","_"
1,"bhavān","_","_","bhavat","JJ","","_","_"
2,"_","_","_","adhyāpana","NC","","_","_"
3,"_","_","_","arthin","JJ","","_","_"
4,"tau","_","_","tad","PRD","","_","_"
5,"_","_","_","ca","CCD","","_","_"
6,"_","_","_","adhyayana","NC","","_","_"
7,"_","_","_","kāṅkṣin","JJ","","_","_"
1,"_","_","_","naś","PPP","","_","_"
2,"_","_","_","aśva","NC","","_","_"
3,"_","_","_","dah","PPP","","_","_"
4,"_","_","_","ratha","NC","","_","_"
5,"_","_","_","vat","CX","","_","_"
6,"yogo","_","_","yoga","NC","","_","_"
7,"'stu","_","_","as","V","as","_","_"
8,"bhavatām","_","_","bhavat","JJ","","_","_"
9,"iti","_","_","iti","CQT","","_","_"
1,"tatas","_","_","tatas","CX","","_","_"
2,"tasyai","_","_","tad","PRD","","_","_"
3,"pratijñāya","_","_","pratijñā","CGDA","","_","_"
4,"tau","_","_","tad","PRD","","_","_"
5,"baṭū","_","_","baṭu","NC","","_","_"
6,"pāṭhayann","_","_","pāṭhay","KDP","","_","_"
7,"asau","_","_","adas","PRD","","_","_"
1,"_","_","_","antevāsin","NC","","_","_"
2,"_","_","_","gaṇa","NC","","_","_"
3,"_","_","_","ca","CCD","","_","_"
4,"_","_","_","anya","PPX","","_","_"
5,"asthāt","_","_","tiṣṭh","V","sthā","_","_"
6,"_","_","_","saṃvatsara","NC","","_","_"
7,"_","_","_","dvaya","NC","","_","_"
1,"ekadā","_","_","ekadā","CX","","_","_"
2,"tām","_","_","tad","PRD","","_","_"
3,"abhāṣanta","_","_","bhāṣ","V","bhāṣ","_","_"
4,"vṛddhām","_","_","vṛddha","JJ","","_","_"
5,"āgatya","_","_","āga","CGDA","","_","_"
6,"bāndhavāḥ","_","_","bāndhava","NC","","_","_"
1,"kasmād","_","_","kasmāt","CX","","_","_"
2,"_","_","_","dṛḍhodyama","NC","","_","_"
3,"_","_","_","ida","PRD","","_","_"
4,"dīyate","_","_","dad","V","dā","_","_"
5,"na","_","_","na","CNG","","_","_"
6,"tamālikā","_","_","tamālikā","NC","","_","_"
1,"ye","_","_","yad","PRL","","_","_"
2,"_","_","_","jāmātṛ","NC","","_","_"
3,"_","_","_","guṇa","NC","","_","_"
4,"teṣāṃ","_","_","tad","PRD","","_","_"
5,"kaścid","_","_","kiṃcit","PRI","","_","_"
6,"asti","_","_","as","V","as","_","_"
7,"kvacid","_","_","kvacid","CX","","_","_"
8,"vare","_","_","vara","JJ","","_","_"
1,"dṛḍhodyame","_","_","dṛḍhodyama","NC","","_","_"
2,"punaḥ","_","_","punar","CAD","","_","_"
3,"paśya","_","_","paś","V","paś","_","_"
4,"yadi","_","_","yadi","CSB","","_","_"
5,"kaṃcin","_","_","kiṃcit","PRI","","_","_"
6,"na","_","_","na","CNG","","_","_"
7,"paśyasi","_","_","paś","V","paś","_","_"
1,"durlabhaḥ","_","_","durlabha","JJ","","_","_"
2,"sulabhībhūtas","_","_","sulabhībhū","PPP","","_","_"
3,"tasmāt","_","_","tasmāt","CX","","_","_"
4,"svīkriyatām","_","_","svīkar","V","svīkṛ","_","_"
5,"ayam","_","_","ida","PRD","","_","_"
1,"kena","_","_","kiṃ","PRQ","","_","_"
2,"vanyaḥ","_","_","vanya","JJ","","_","_"
3,"karī","_","_","karin","NC","","_","_"
4,"vārīm","_","_","āga","PPP","","_","_"
5,"āgataḥ","_","_","svaya","CX","","_","_"
6,"svayam","_","_","ujjhita","JJ","","_","_"
1,"iti","_","_","iti","CQT","","_","_"
2,"tair","_","_","tad","PRD","","_","_"
3,"bodhitā","_","_","bodhay","PPP","","_","_"
4,"vṛddhā","_","_","vṛddha","JJ","","_","_"
5,"pratītā","_","_","pratī","PPP","","_","_"
6,"tān","_","_","tad","PRD","","_","_"
7,"ayācata","_","_","yāc","V","yāc","_","_"
1,"yady","_","_","yadi","CSB","","_","_"
2,"evaṃ","_","_","eva","CX","","_","_"
3,"svayam","_","_","svaya","CX","","_","_"
4,"_","_","_","eva","CEM","","_","_"
5,"_","_","_","ida","PRD","","_","_"
6,"pūjyair","_","_","pūjay","KDG","","_","_"
7,"abhyarthyatām","_","_","abhyarthay","V","abhyarthay","_","_"
8,"iti","_","_","iti","CQT","","_","_"
1,"te","_","_","tad","PRD","","_","_"
2,"tatas","_","_","tatas","CX","","_","_"
3,"tam","_","_","tad","PRD","","_","_"
4,"abhāṣanta","_","_","bhāṣ","V","bhāṣ","_","_"
5,"bhautika","_","_","bhautika","NC","","_","_"
6,"brahmacāriṇā","_","_","brahmacārin","NC","","_","_"
1,"āmnātāś","_","_","āmnā","PPP","","_","_"
2,"_","_","_","ca","CCD","","_","_"
3,"_","_","_","avabudh","PPP","","_","_"
4,"ca","_","_","ca","CCD","","_","_"
5,"vedāḥ","_","_","veda","NC","","_","_"
6,"_","_","_","sa_saha","CX","","_","_"
7,"_","_","_","smṛti","NC","","_","_"
8,"tvayā","_","_","tvat","PPR","","_","_"
1,"avaśyaṃ","_","_","avaśya","CX","","_","_"
2,"_","_","_","ca","CCD","","_","_"
3,"_","_","_","adhunā","CX","","_","_"
4,"kāryaḥ","_","_","kṛ","KDG","","_","_"
5,"_","_","_","śuddha","JJ","","_","_"
6,"_","_","_","patnī","NC","","_","_"
7,"_","_","_","parigraha","NC","","_","_"
1,"_","_","_","uras","NC","","_","_"
2,"_","_","_","kaṇṭha","NC","","_","_"
3,"_","_","_","oṣṭha","NC","","_","_"
4,"_","_","_","śoṣa","NC","","_","_"
5,"mā","_","_","mā","CNG","","_","_"
6,"bhūd","_","_","bhav","V","bhū","_","_"
7,"vaiphalyam","_","_","vaiphalya","NC","","_","_"
8,"anyathā","_","_","anyathā","CX","","_","_"
1,"ataḥ","_","_","atas","CX","","_","_"
2,"pratīṣyatām","_","_","pratīṣ","V","pratīṣ","_","_"
3,"eṣā","_","_","tad","PRD","","_","_"
4,"_","_","_","sarva","JQ","","_","_"
5,"_","_","_","śuddha","JJ","","_","_"
6,"tamālikā","_","_","tamālikā","NC","","_","_"
1,"jyeṣṭhaṃ","_","_","jyeṣṭha","JJ","","_","_"
2,"_","_","_","jyeṣṭha","JJ","","_","_"
3,"_","_","_","āśrama","NC","","_","_"
4,"_","_","_","aṅga","NC","","_","_"
5,"trayī","_","_","trayī","NC","","_","_"
6,"_","_","_","vidyā","NC","","_","_"
7,"_","_","_","iva","CCM","","_","_"
8,"dehinī","_","_","dehin","JJ","","_","_"
1,"evamādi","_","_","evamādi","JJ","","_","_"
2,"sa","_","_","tad","PRD","","_","_"
3,"tair","_","_","tad","PRD","","_","_"
4,"uktaḥ","_","_","vac","PPP","","_","_"
5,"kṣaṇam","_","_","kṣaṇa","NC","","_","_"
6,"etad","_","_","tad","PRD","","_","_"
7,"acintayat","_","_","cintay","V","cintay","_","_"
1,"yuktaṃ","_","_","yukta","JJ","","_","_"
2,"yad","_","_","yad","PRL","","_","_"
3,"brāhmaṇair","_","_","brāhmaṇa","NC","","_","_"
4,"uktam","_","_","vac","PPP","","_","_"
5,"atra","_","_","atra","CAD","","_","_"
6,"tāvat","_","_","tāvat","CX","","_","_"
7,"kim","_","_","kiṃ","PRQ","","_","_"
8,"ucyate","_","_","vak","V","vac","_","_"
1,"yaś","_","_","yad","PRL","","_","_"
2,"_","_","_","ca","CCD","","_","_"
3,"_","_","_","adas","PRD","","_","_"
4,"_","_","_","sindhu","NC","","_","_"
5,"_","_","_","viṣaya","NC","","_","_"
6,"dūṣitaḥ","_","_","dūṣay","PPP","","_","_"
7,"kṛtyayā","_","_","kṛtyā","NC","","_","_"
8,"tayā","_","_","tad","PRD","","_","_"
1,"pāre","_","_","pāra","NC","","_","_"
2,"_","_","_","sāgara","NC","","_","_"
3,"_","_","_","vat","CX","","_","_"
4,"so","_","_","tad","PRD","","_","_"
5,"'pi","_","_","api","CX","","_","_"
6,"_","_","_","dūra","JJ","","_","_"
8,"_","_","_","su","CAD","","_","_"
9,"_","_","_","durāgama","JJ","","_","_"
1,"atha","_","_","atha","CAD","","_","_"
2,"daivena","_","_","daiva","NC","","_","_"
3,"_","_","_","tad","PRD","","_","_"
4,"_","_","_","eva","CEM","","_","_"
5,"_","_","_","ida","PRD","","_","_"
6,"ānītā","_","_","ānī","PPP","","_","_"
7,"_","_","_","sindhu","NC","","_","_"
8,"_","_","_","deśa","NC","","_","_"
1,"_","_","_","sūci","NC","","_","_"
2,"_","_","_","sūtra","NC","","_","_"
3,"_","_","_","ga","PPP","","_","_"
4,"daivāt","_","_","daiva","NC","","_","_"
5,"tataḥ","_","_","tatas","CX","","_","_"
6,"kaḥ","_","_","kiṃ","PRQ","","_","_"
7,"kutra","_","_","kutra","CX","","_","_"
8,"mokṣyate","_","_","muñc","V","muc","_","_"
1,"evamādi","_","_","evamādi","JJ","","_","_"
2,"sa","_","_","tad","PRD","","_","_"
3,"niścitya","_","_","niści","CGDA","","_","_"
4,"pratiśrutya","_","_","pratiśru","CGDA","","_","_"
5,"_","_","_","tathā","CX","","_","_"
6,"_","_","_","iti","CQT","","_","_"
7,"ca","_","_","ca","CCD","","_","_"
1,"pariṇīya","_","_","pariṇī","CGDA","","_","_"
2,"ca","_","_","ca","CCD","","_","_"
3,"tāṃ","_","_","tad","PRD","","_","_"
4,"kanyāṃ","_","_","kanyā","NC","","_","_"
5,"saṃvatsaram","_","_","saṃvatsara","NC","","_","_"
6,"ayāpayat","_","_","yāpay","V","yāpay","_","_"
1,"atha","_","_","atha","CAD","","_","_"
2,"_","_","_","yā","PPP","","_","_"
3,"_","_","_","triyāmā","NC","","_","_"
4,"triyāmāyāṃ","_","_","triyāmā","NC","","_","_"
5,"dṛḍhodyamaḥ","_","_","dṛḍhodyama","NC","","_","_"
1,"_","_","_","jṛmbhā","NC","","_","_"
2,"_","_","_","veday","PPP","","_","_"
3,"_","_","_","nidrā","NC","","_","_"
4,"_","_","_","anta","NC","","_","_"
5,"pṛcchati","_","_","pṛcch","V","prach","_","_"
6,"sma","_","_","sma","CX","","_","_"
7,"tamālikām","_","_","tamālikā","NC","","_","_"
1,"brūhi","_","_","abravīta","V","brū","_","_"
2,"sundari","_","_","sundarī","NC","","_","_"
3,"paśyāma","_","_","paś","V","paś","_","_"
4,"_","_","_","kuṭumba","NC","","_","_"
5,"_","_","_","ida","PRD","","_","_"
6,"kaḥ","_","_","kiṃ","PRQ","","_","_"
7,"prabhuḥ","_","_","prabhu","NC","","_","_"
1,"_","_","_","kiṃ","PRQ","","_","_"
2,"_","_","_","ida","PRD","","_","_"
3,"bhavati","_","_","bhav","V","bhū","_","_"
4,"te","_","_","tvat","PPR","","_","_"
5,"vṛddhā","_","_","vṛddha","JJ","","_","_"
6,"kāv","_","_","kiṃ","PRQ","","_","_"
7,"etau","_","_","tad","PRD","","_","_"
8,"baṭukāv","_","_","baṭuka","NC","","_","_"
9,"iti","_","_","iti","CQT","","_","_"
1,"tayā","_","_","tad","PRD","","_","_"
2,"tv","_","_","tu","CCD","","_","_"
3,"_","_","_","āya","PPP","","_","_"
4,"_","_","_","niśvāsa","NC","","_","_"
5,"_","_","_","kathay","PPP","","_","_"
6,"_","_","_","āya","PPP","","_","_"
7,"_","_","_","duḥkha","NC","","_","_"
1,"_","_","_","sru","PPP","","_","_"
2,"_","_","_","aśru","NC","","_","_"
3,"_","_","_","kaṇikā","NC","","_","_"
4,"_","_","_","śreṇi","NC","","_","_"
5,"kathitaṃ","_","_","kathay","PPP","","_","_"
6,"_","_","_","skhal","KDP","","_","_"
7,"_","_","_","akṣara","NC","","_","_"
1,"asyā","_","_","ida","PRD","","_","_"
2,"_","_","_","brāhmaṇa","NC","","_","_"
3,"_","_","_","vṛddha","JJ","","_","_"
4,"priyaḥ","_","_","priya","JJ","","_","_"
5,"sādhur","_","_","sādhu","NC","","_","_"
6,"abhūt","_","_","bhav","V","bhū","_","_"
7,"patiḥ","_","_","pati","NC","","_","_"
1,"yasya","_","_","yad","PRL","","_","_"
2,"_","_","_","vidyā","NC","","_","_"
3,"_","_","_","dhana","NC","","_","_"
4,"tṛptāḥ","_","_","tṛp","PPP","","_","_"
5,"_","_","_","śiṣya","NC","","_","_"
6,"_","_","_","yājaka","NC","","_","_"
7,"_","_","_","yācaka","NC","","_","_"
1,"tena","_","_","tad","PRD","","_","_"
2,"_","_","_","ca","CCD","","_","_"
3,"_","_","_","aśeṣa","JJ","","_","_"
4,"_","_","_","veda","NC","","_","_"
5,"_","_","_","kṣamā","NC","","_","_"
6,"_","_","_","ādi","NC","","_","_"
7,"_","_","_","guṇa","NC","","_","_"
8,"_","_","_","śālin","JJ","","_","_"
1,"duhitā","_","_","duhitṛ","NC","","_","_"
2,"_","_","_","gṛha","NC","","_","_"
3,"_","_","_","jāmātṛ","NC","","_","_"
4,"chāttrāya","_","_","chāttra","NC","","_","_"
5,"pratipāditā","_","_","pratipāday","PPP","","_","_"
1,"tāḍitaś","_","_","tāḍay","PPP","","_","_"
2,"_","_","_","caraṇa","NC","","_","_"
3,"_","_","_","api","CX","","_","_"
4,"yaḥ","_","_","yad","PRL","","_","_"
5,"kṣamāvān","_","_","kṣamāvat","JJ","","_","_"
6,"abhūt","_","_","bhav","V","bhū","_","_"
7,"purā","_","_","purā","CX","","_","_"
1,"sa","_","_","tad","PRD","","_","_"
2,"_","_","_","jāmātṛ","NC","","_","_"
4,"krodhād","_","_","krodha","NC","","_","_"
5,"gamitaḥ","_","_","gamay","PPP","","_","_"
6,"_","_","_","kṛṣṇa","JJ","","_","_"
7,"_","_","_","sarpa","NC","","_","_"
1,"mahāntam","_","_","mahat","JJ","","_","_"
2,"api","_","_","api","CX","","_","_"
3,"saṃmānaṃ","_","_","sammāna","NC","","_","_"
4,"manyamāno","_","_","man","KDP","","_","_"
5,"_","_","_","vimāna","JJ","","_","_"
1,"_","_","_","śvaśrū","NC","","_","_"
2,"_","_","_","śvaśura","NC","","_","_"
3,"khedam","_","_","kheda","NC","","_","_"
4,"ātmanaś","_","_","ātman","NC","","_","_"
5,"_","_","_","ca","CCD","","_","_"
6,"_","_","_","kar","V","kṛ","_","_"
7,"vṛthā","_","_","vṛthā","CX","","_","_"
1,"ekadā","_","_","ekadā","CX","","_","_"
2,"parihāsena","_","_","parihāsa","NC","","_","_"
3,"syālakas","_","_","syālaka","NC","","_","_"
4,"tam","_","_","tad","PRD","","_","_"
5,"abhāṣata","_","_","bhāṣ","V","bhāṣ","_","_"
1,"_","_","_","durvāsas","NC","","_","_"
2,"_","_","_","sadṛśa","JJ","","_","_"
3,"tāta","_","_","tāta","NC","","_","_"
4,"durārādho","_","_","durārādha","JJ","","_","_"
5,"bhavān","_","_","bhavat","JJ","","_","_"
6,"iti","_","_","iti","CQT","","_","_"
1,"yady","_","_","yadi","CSB","","_","_"
2,"evaṃ","_","_","eva","CX","","_","_"
3,"durdurūḍhena","_","_","kiṃ","PRQ","","_","_"
4,"_","_","_","mat","PPR","","_","_"
5,"_","_","_","ārādhay","PPP","","_","_"
6,"mayārādhitena","_","_","tvat","PPR","","_","_"
1,"ity","_","_","iti","CQT","","_","_"
2,"uktvā","_","_","vac","CGDA","","_","_"
3,"_","_","_","manthara","JJ","","_","_"
4,"_","_","_","ālāpa","NC","","_","_"
5,"_","_","_","sa_saha","CX","","_","_"
6,"_","_","_","dāra","NC","","_","_"
7,"gata","_","_","ga","PPP","","_","_"
8,"eva","_","_","eva","CEM","","_","_"
9,"saḥ","_","_","tad","PRD","","_","_"
1,"_","_","_","śvaśrū","NC","","_","_"
2,"_","_","_","śvaśura","NC","","_","_"
3,"_","_","_","mitra","NC","","_","_"
4,"avakarṇya","_","_","avakarṇay","CGDA","","_","_"
5,"kadarthanām","_","_","kadarthana","NC","","_","_"
1,"nirapekṣaṃ","_","_","nirapekṣa","JJ","","_","_"
2,"_","_","_","sva","JJ","","_","_"
3,"_","_","_","deśa","NC","","_","_"
4,"_","_","_","sindhu","NC","","_","_"
5,"_","_","_","deśa","NC","","_","_"
6,"yātavān","_","_","yā","KDP","","_","_"
1,"tatra","_","_","tatra","CAD","","_","_"
2,"ca","_","_","ca","CCD","","_","_"
3,"grāmam","_","_","grāma","NC","","_","_"
4,"adhyāsya","_","_","adhyās","CGDA","","_","_"
5,"_","_","_","brahmasthalaka","NC","","_","_"
6,"_","_","_","nāmaka","JJ","","_","_"
1,"acirān","_","_","acirāt","CX","","_","_"
2,"_","_","_","nitya","JJ","","_","_"
3,"_","_","_","kāmya","JJ","","_","_"
4,"karmāṇi","_","_","karman","NC","","_","_"
5,"niravartayat","_","_","nirvartay","V","nirvartay","_","_"
1,"tasya","_","_","tad","PRD","","_","_"
2,"tasyāṃ","_","_","tad","PRD","","_","_"
3,"ca","_","_","ca","CCD","","_","_"
4,"bhāryāyāṃ","_","_","bhāryā","NC","","_","_"
5,"_","_","_","kālarātri","NC","","_","_"
6,"_","_","_","sama","PPX","","_","_"
7,"sutā","_","_","sutā","NC","","_","_"
1,"yamau","_","_","yama","NC","","_","_"
2,"ca","_","_","ca","CCD","","_","_"
3,"tanayau","_","_","tanaya","NC","","_","_"
4,"jātau","_","_","jan","PPP","","_","_"
5,"_","_","_","yama","NC","","_","_"
6,"_","_","_","kāla","NC","","_","_"
7,"kulasya","_","_","kula","NC","","_","_"
8,"yau","_","_","yad","PRL","","_","_"
1,"aham","_","_","mat","PPR","","_","_"
2,"eva","_","_","eva","CEM","","_","_"
3,"ca","_","_","ca","CCD","","_","_"
4,"sā","_","_","tad","PRD","","_","_"
5,"kanyā","_","_","kanyā","NC","","_","_"
6,"tau","_","_","tad","PRD","","_","_"
7,"_","_","_","ca","CCD","","_","_"
8,"_","_","_","tad","PRD","","_","_"
9,"_","_","_","kāka","NC","","_","_"
10,"_","_","_","tālukā","NC","","_","_"
1,"yair","_","_","yad","PRL","","_","_"
2,"_","_","_","mātā","NC","","_","_"
3,"_","_","_","pitṛ","NC","","_","_"
4,"eva","_","_","eva","CEM","","_","_"
5,"bālair","_","_","bāla","NC","","_","_"
6,"eva","_","_","eva","CEM","","_","_"
7,"samāhitau","_","_","samādhā","PPP","","_","_"
1,"_","_","_","sindhu","NC","","_","_"
2,"_","_","_","deśa","NC","","_","_"
3,"_","_","_","eka","PPX","","_","_"
4,"_","_","_","deśa","NC","","_","_"
5,"ca","_","_","ca","CCD","","_","_"
6,"sindhunā","_","_","sindhu","NC","","_","_"
7,"_","_","_","caṇḍa","JJ","","_","_"
8,"_","_","_","raṃhas","NC","","_","_"
1,"_","_","_","durvāra","JJ","","_","_"
2,"_","_","_","guru","JJ","","_","_"
3,"_","_","_","pūra","NC","","_","_"
4,"_","_","_","sahasā","CX","","_","_"
5,"_","_","_","ākṛṣ","CGDA","","_","_"
6,"nīyate","_","_","nay","V","nī","_","_"
1,"atha","_","_","atha","CAD","","_","_"
2,"_","_","_","mātā","NC","","_","_"
3,"_","_","_","pitṛ","NC","","_","_"
4,"nas","_","_","mat","PPR","","_","_"
5,"_","_","_","tad","PRD","","_","_"
6,"_","_","_","bhaya","NC","","_","_"
7,"avadhāritam","_","_","avadhāray","PPP","","_","_"
1,"_","_","_","mātāmaha","NC","","_","_"
2,"_","_","_","gṛha","NC","","_","_"
3,"yāntu","_","_","yā","V","yā","_","_"
4,"bālā","_","_","bāla","JJ","","_","_"
5,"me","_","_","mat","PPR","","_","_"
6,"niviśantv","_","_","niviś","V","niviś","_","_"
7,"iti","_","_","iti","CQT","","_","_"
1,"tataḥ","_","_","tatas","CX","","_","_"
2,"_","_","_","śaṅkā","NC","","_","_"
3,"_","_","_","iṣu","NC","","_","_"
4,"_","_","_","bhid","PPP","","_","_"
5,"tām","_","_","tad","PRD","","_","_"
6,"abhāṣata","_","_","bhāṣ","V","bhāṣ","_","_"
7,"dṛḍhodyamaḥ","_","_","dṛḍhodyama","NC","","_","_"
1,"śeṣaṃ","_","_","śeṣa","NC","","_","_"
2,"_","_","_","su","CAD","","_","_"
3,"_","_","_","jñāna","NC","","_","_"
4,"_","_","_","eva","CEM","","_","_"
5,"_","_","_","ida","PRD","","_","_"
6,"kathāyāḥ","_","_","kathā","NC","","_","_"
7,"sthīyatām","_","_","tiṣṭh","V","sthā","_","_"
8,"iti","_","_","iti","CQT","","_","_"
1,"āsīc","_","_","as","V","as","_","_"
2,"_","_","_","ca","CCD","","_","_"
3,"_","_","_","ida","PRD","","_","_"
4,"sa","_","_","tad","PRD","","_","_"
5,"sarvajñaḥ","_","_","sarvajña","JJ","","_","_"
6,"_","_","_","parivrājaka","NC","","_","_"
7,"_","_","_","bhāskara","NC","","_","_"
1,"sphuṭaṃ","_","_","sphuṭa","JJ","","_","_"
2,"bhinnatamā","_","_","bhinnatamas","NC","","_","_"
3,"eva","_","_","eva","CEM","","_","_"
4,"_","_","_","bhid","PPP","","_","_"
5,"_","_","_","ajñāna","NC","","_","_"
6,"_","_","_","tamas","NC","","_","_"
7,"yataḥ","_","_","yatas","CX","","_","_"
1,"anubhūtau","_","_","anubhū","PPP","","_","_"
2,"tathābhūtau","_","_","tathābhūta","JJ","","_","_"
3,"_","_","_","tad","PRD","","_","_"
4,"_","_","_","ādeśa","NC","","_","_"
5,"_","_","_","mat","PPR","","_","_"
6,"_","_","_","adhunā","CX","","_","_"
1,"_","_","_","tṛtīya","JJ","","_","_"
2,"_","_","_","parihāra","NC","","_","_"
3,"tyajāmi","_","_","tyaj","V","tyaj","_","_"
4,"pṛthivīm","_","_","pṛthivī","NC","","_","_"
5,"iti","_","_","iti","CQT","","_","_"
1,"atha","_","_","atha","CAD","","_","_"
2,"_","_","_","dvādaśan","NUM","","_","_"
3,"_","_","_","varṣa","NC","","_","_"
4,"bhrāntvā","_","_","bhra","CGDA","","_","_"
5,"_","_","_","dvīpa","NC","","_","_"
6,"_","_","_","antara","NC","","_","_"
7,"saḥ","_","_","tad","PRD","","_","_"
1,"nirviṇṇaś","_","_","nirviṇṇa","JJ","","_","_"
2,"cintayāmāsa","_","_","cintay","V","cintay","_","_"
3,"kiṃcid","_","_","kiṃcit","PRI","","_","_"
4,"_","_","_","dhavala","JJ","","_","_"
5,"_","_","_","mūrdhaja","NC","","_","_"
1,"ādiṣṭaṃ","_","_","ādiś","PPP","","_","_"
2,"yat","_","_","yad","PRL","","_","_"
3,"parivrājā","_","_","parivrāj","NC","","_","_"
4,"tat","_","_","tad","PRD","","_","_"
5,"_","_","_","tad","PRD","","_","_"
6,"_","_","_","unmāda","NC","","_","_"
7,"_","_","_","mat","PPP","","_","_"
1,"_","_","_","kāla","NC","","_","_"
2,"_","_","_","etāvat","JJ","","_","_"
3,"nūnam","_","_","nūna","CX","","_","_"
4,"akṛtyaṃ","_","_","akṛtya","JJ","","_","_"
5,"kṛtyayā","_","_","kṛtyā","NC","","_","_"
6,"kṛtam","_","_","kṛ","PPP","","_","_"
1,"asmābhiś","_","_","mat","PPR","","_","_"
2,"ca","_","_","ca","CCD","","_","_"
3,"na","_","_","na","CNG","","_","_"
4,"_","_","_","veda","NC","","_","_"
5,"_","_","_","vac","PPP","","_","_"
6,"na","_","_","na","CNG","","_","_"
7,"_","_","_","vedānta","NC","","_","_"
8,"_","_","_","vac","PPP","","_","_"
9,"_","_","_","mohay","PPP","","_","_"
1,"vraṇair","_","_","vraṇa","NC","","_","_"
2,"iva","_","_","iva","CCM","","_","_"
3,"visarpadbhiḥ","_","_","visṛp","KDP","","_","_"
4,"_","_","_","kvāpi","CX","","_","_"
5,"_","_","_","i","PPP","","_","_"
6,"_","_","_","puruṣa","NC","","_","_"
7,"_","_","_","āyuṣa","NC","","_","_"
1,"tena","_","_","ta","CX","","_","_"
2,"vārāṇasīṃ","_","_","vārāṇasī","NC","","_","_"
3,"gatvā","_","_","ga","CGDA","","_","_"
4,"_","_","_","tīrtha","NC","","_","_"
5,"_","_","_","upāsana","NC","","_","_"
6,"_","_","_","hetuka","JJ","","_","_"
1,"puṇyaṃ","_","_","puṇya","JJ","","_","_"
2,"_","_","_","svarga","NC","","_","_"
3,"_","_","_","phala","NC","","_","_"
4,"kurvann","_","_","kṛ","KDP","","_","_"
5,"ayāmi","_","_","divasa","NC","","_","_"
6,"divasān","_","_","iti","CQT","","_","_"
1,"tataḥ","_","_","tatas","CX","","_","_"
2,"sāgaram","_","_","sāgara","NC","","_","_"
3,"uttīrya","_","_","uttṛ","CGDA","","_","_"
4,"gaṅgāsāgaram","_","_","gaṅgāsāgara","NC","","_","_"
5,"āgamat","_","_","āgacch","V","āgam","_","_"
1,"tato","_","_","tatas","CX","","_","_"
2,"vārāṇasīṃ","_","_","vārāṇasī","NC","","_","_"
3,"prāpad","_","_","prāpn","V","prāp","_","_"
4,"a","_","_","alpha_privativum","JJ","","_","_"
4,"amuñcann","_","_","muñcat","JJ","","_","_"
5,"eva","_","_","eva","CEM","","_","_"
6,"jāhnavīm","_","_","jāhnavī","NC","","_","_"
1,"eva","_","_","eva","CEM","","_","_"
2,"_","_","_","ca","CCD","","_","_"
3,"_","_","_","paś","V","paś","_","_"
4,"_","_","_","nara","NC","","_","_"
5,"_","_","_","dhātu","NC","","_","_"
6,"_","_","_","paricchada","NC","","_","_"
1,"_","_","_","skhal","KDP","","_","_"
2,"_","_","_","ālāpa","NC","","_","_"
3,"_","_","_","saṃcāra","NC","","_","_"
4,"_","_","_","mahat","JJ","","_","_"
5,"_","_","_","pāśupata","NC","","_","_"
6,"puraḥ","_","_","puras","CX","","_","_"
1,"taṃ","_","_","tad","PRD","","_","_"
2,"_","_","_","ca","CCD","","_","_"
3,"_","_","_","anu","CADP","","_","_"
4,"_","_","_","sphaṭika","NC","","_","_"
5,"_","_","_","prāya","NC","","_","_"
6,"_","_","_","karṇa","NC","","_","_"
7,"_","_","_","kaṇṭha","NC","","_","_"
8,"_","_","_","vibhūṣaṇa","NC","","_","_"
1,"_","_","_","madirā","NC","","_","_"
2,"_","_","_","tāmra","JJ","","_","_"
3,"_","_","_","jihma","JJ","","_","_"
4,"_","_","_","akṣa","NC","","_","_"
5,"_","_","_","vicitra","JJ","","_","_"
6,"_","_","_","gala","NC","","_","_"
7,"_","_","_","kaṇṭhikā","NC","","_","_"
1,"_","_","_","dvi","NUM","","_","_"
2,"_","_","_","guṇīkṛ","KDP","","_","_"
3,"mārgaṃ","_","_","mārga","NC","","_","_"
4,"vaṅkair","_","_","vaṅka","NC","","_","_"
5,"_","_","_","gati","NC","","_","_"
6,"_","_","_","nivartana","NC","","_","_"
1,"_","_","_","amukta","JJ","","_","_"
2,"_","_","_","nija","JJ","","_","_"
3,"_","_","_","nirmoka","NC","","_","_"
4,"bhujaṃgīm","_","_","bhujaṃgī","NC","","_","_"
5,"iva","_","_","iva","CCM","","_","_"
6,"yoṣitam","_","_","yoṣit","NC","","_","_"
1,"sā","_","_","tad","PRD","","_","_"
2,"tu","_","_","tu","CCD","","_","_"
3,"_","_","_","kāpālika","NC","","_","_"
4,"_","_","_","vac","PPP","","_","_"
5,"drutam","_","_","druta","CX","","_","_"
6,"ehi","_","_","e","V","e","_","_"
7,"kapālini","_","_","kapālinī","NC","","_","_"
1,"na","_","_","na","CNG","","_","_"
2,"yāvad","_","_","yāvat","CX","","_","_"
3,"avimuktasya","_","_","avimukta","NC","","_","_"
4,"_","_","_","dhūpa","NC","","_","_"
5,"_","_","_","velā","NC","","_","_"
6,"_","_","_","ativart","V","ativṛt","_","_"
1,"_","_","_","huṃhuṃkāra","NC","","_","_"
2,"_","_","_","ādi","NC","","_","_"
3,"stutvā","_","_","stu","CGDA","","_","_"
4,"_","_","_","saṃsthā","NC","","_","_"
5,"_","_","_","traya","NC","","_","_"
6,"_","_","_","para","PPX","","_","_"
7,"dhruvam","_","_","dhruva","CX","","_","_"
1,"tataḥ","_","_","tatas","CX","","_","_"
2,"_","_","_","śuṇḍika","NC","","_","_"
3,"_","_","_","śāla","NC","","_","_"
4,"mārgayāmi","_","_","mārgay","V","mārgay","_","_"
5,"surām","_","_","surā","NC","","_","_"
6,"iti","_","_","iti","CQT","","_","_"
1,"evaṃprāye","_","_","evamprāya","JJ","","_","_"
2,"ca","_","_","ca","CCD","","_","_"
3,"vṛttānte","_","_","vṛttānta","NC","","_","_"
4,"ciraṃ","_","_","cira","CX","","_","_"
5,"dṛṣṭvā","_","_","dṛś","CGDA","","_","_"
6,"dṛḍhodyamam","_","_","dṛḍhodyama","NC","","_","_"
1,"papāta","_","_","pat","V","pat","_","_"
2,"pādayos","_","_","pāda","NC","","_","_"
3,"tasya","_","_","tad","PRD","","_","_"
4,"_","_","_","tāra","JJ","","_","_"
5,"_","_","_","ākranda","NC","","_","_"
6,"kapālinī","_","_","kapālinī","NC","","_","_"
1,"punaḥ","_","_","punar","CAD","","_","_"
2,"_","_","_","kāpālika","NC","","_","_"
3,"_","_","_","vac","PPP","","_","_"
4,"muñca","_","_","muñc","V","muc","_","_"
5,"brāhmaṇam","_","_","brāhmaṇa","NC","","_","_"
6,"adhvagam","_","_","adhvaga","NC","","_","_"
1,"parihāsaś","_","_","parihāsa","NC","","_","_"
2,"ciraṃ","_","_","cira","CX","","_","_"
3,"caṇḍi","_","_","caṇḍa","JJ","","_","_"
4,"viruddhas","_","_","virudh","PPP","","_","_"
5,"tyajyatām","_","_","tyaj","V","tyaj","_","_"
6,"iti","_","_","iti","CQT","","_","_"
1,"_","_","_","tad","PRD","","_","_"
2,"_","_","_","abravīta","V","brū","_","_"
3,"eṣa","_","_","tad","PRD","","_","_"
4,"me","_","_","mat","PPR","","_","_"
5,"bhartā","_","_","bhartṛ","NC","","_","_"
6,"daivataiḥ","_","_","daivata","NC","","_","_"
7,"pratipāditaḥ","_","_","pratipāday","PPP","","_","_"
1,"tvaṃ","_","_","tvat","PPR","","_","_"
2,"tu","_","_","tu","CCD","","_","_"
3,"_","_","_","dhṛṣ","PPP","","_","_"
4,"_","_","_","viṭa","NC","","_","_"
5,"bhūtvā","_","_","bhū","CGDA","","_","_"
6,"kiṃ","_","_","kiṃ","PRQ","","_","_"
7,"vyāharasi","_","_","vyāhṛ","V","vyāhṛ","_","_"
8,"mām","_","_","mat","PPR","","_","_"
9,"iti","_","_","iti","CQT","","_","_"
1,"taṃ","_","_","tad","PRD","","_","_"
2,"ca","_","_","ca","CCD","","_","_"
3,"prapañcam","_","_","prapañca","NC","","_","_"
4,"ālokya","_","_","ālokay","CGDA","","_","_"
5,"sa","_","_","tad","PRD","","_","_"
6,"pradeśaḥ","_","_","pradeśa","NC","","_","_"
7,"_","_","_","sa_saha","CX","","_","_"
8,"_","_","_","kautuka","NC","","_","_"
1,"janair","_","_","jana","NC","","_","_"
2,"agaṇitair","_","_","agaṇita","JJ","","_","_"
3,"vyāptaḥ","_","_","vyāp","PPP","","_","_"
4,"_","_","_","śramaṇa","NC","","_","_"
5,"_","_","_","brāhmaṇa","NC","","_","_"
6,"_","_","_","ādi","NC","","_","_"
1,"sā","_","_","tad","PRD","","_","_"
2,"_","_","_","ca","CCD","","_","_"
3,"_","_","_","vak","V","vac","_","_"
4,"_","_","_","catur","NUM","","_","_"
5,"_","_","_","veda","NC","","_","_"
6,"_","_","_","ric","PPP","","_","_"
7,"_","_","_","veda","NC","","_","_"
8,"'si","_","_","as","V","as","_","_"
9,"sarvathā","_","_","sarvathā","CX","","_","_"
1,"_","_","_","sa_saha","CX","","_","_"
2,"_","_","_","veda","NC","","_","_"
3,"ko","_","_","kiṃ","PRQ","","_","_"
4,"hi","_","_","hi","CX","","_","_"
5,"nirvedaṃ","_","_","nirveda","NC","","_","_"
6,"_","_","_","veda","NC","","_","_"
7,"_","_","_","vac","PPP","","_","_"
8,"karmabhir","_","_","karman","NC","","_","_"
9,"vrajet","_","_","vraj","V","vraj","_","_"
1,"na","_","_","na","CNG","","_","_"
2,"_","_","_","tvat","PPR","","_","_"
3,"_","_","_","utpāday","PPP","","_","_"
4,"putrā","_","_","putra","NC","","_","_"
5,"_","_","_","na","CNG","","_","_"
6,"_","_","_","agnihotra","NC","","_","_"
7,"upāsitam","_","_","upās","PPP","","_","_"
1,"_","_","_","na","CNG","","_","_"
2,"_","_","_","arcay","PPP","","_","_"
3,"pitaraḥ","_","_","pitṛ","NC","","_","_"
4,"piṇḍair","_","_","piṇḍa","NC","","_","_"
5,"_","_","_","vāyu","NC","","_","_"
6,"_","_","_","bhū","PPP","","_","_"
7,"hiṇḍitam","_","_","hiṇḍ","PPP","","_","_"
1,"tvayā","_","_","tvat","PPR","","_","_"
2,"dṛḍhodyama","_","_","dṛḍhodyama","NC","","_","_"
3,"tyaktā","_","_","tyaj","PPP","","_","_"
4,"_","_","_","tad","PRD","","_","_"
5,"_","_","_","mat","PPR","","_","_"
6,"mandā","_","_","manda","JJ","","_","_"
7,"tamālikā","_","_","tamālikā","NC","","_","_"
1,"kulāt","_","_","kula","NC","","_","_"
2,"kulam","_","_","kula","NC","","_","_"
3,"_","_","_","aṭ","KDP","","_","_"
4,"_","_","_","ida","PRD","","_","_"
5,"carāmi","_","_","car","V","car","_","_"
6,"_","_","_","kulaṭā","NC","","_","_"
7,"_","_","_","vrata","NC","","_","_"
1,"a","_","_","alpha_privativum","JJ","","_","_"
1,"_","_","_","vṛddha","JJ","","_","_"
2,"_","_","_","kula","NC","","_","_"
3,"_","_","_","vāsin","JJ","","_","_"
4,"taruṇyaḥ","_","_","taruṇa","JJ","","_","_"
5,"_","_","_","pati","NC","","_","_"
6,"_","_","_","varjay","PPP","","_","_"
1,"yair","_","_","yad","PRL","","_","_"
2,"a","_","_","alpha_privativum","JJ","","_","_"
2,"aduṣṭāḥ","_","_","duṣṭa","JJ","","_","_"
3,"striyo","_","_","strī","NC","","_","_"
4,"dṛṣṭās","_","_","dṛś","PPP","","_","_"
5,"te","_","_","tad","PRD","","_","_"
6,"dṛṣṭāḥ","_","_","dṛś","PPP","","_","_"
7,"kenacit","_","_","kiṃcit","PRI","","_","_"
8,"kvacit","_","_","kvacid","CX","","_","_"
1,"tena","_","_","tad","PRD","","_","_"
2,"tyaktavatā","_","_","tyaj","KDP","","_","_"
3,"dārān","_","_","dāra","NC","","_","_"
4,"yat","_","_","yad","PRL","","_","_"
5,"tvayā","_","_","tvat","PPR","","_","_"
6,"pāpam","_","_","pāpa","NC","","_","_"
7,"arjitam","_","_","arjay","PPP","","_","_"
1,"tān","_","_","tad","PRD","","_","_"
2,"eva","_","_","eva","CEM","","_","_"
3,"bharamāṇena","_","_","bhṛ","KDP","","_","_"
4,"tat","_","_","tad","PRD","","_","_"
5,"samucchidyatām","_","_","samucchid","V","samucchid","_","_"
6,"iti","_","_","iti","CQT","","_","_"
1,"atha","_","_","atha","CAD","","_","_"
2,"_","_","_","lajjā","NC","","_","_"
3,"_","_","_","viṣāda","NC","","_","_"
4,"_","_","_","andha","JJ","","_","_"
5,"ūcur","_","_","vak","V","vac","_","_"
6,"viprā","_","_","vipra","NC","","_","_"
7,"dṛḍhodyamam","_","_","dṛḍhodyama","NC","","_","_"
1,"bhagavatyā","_","_","bhagavat","JJ","","_","_"
2,"yad","_","_","yad","PRL","","_","_"
3,"uktaṃ","_","_","vac","PPP","","_","_"
4,"tat","_","_","tad","PRD","","_","_"
5,"tattvataḥ","_","_","tattva","NC","","_","_"
6,"kathyatām","_","_","kath","V","kath","_","_"
7,"iti","_","_","iti","CQT","","_","_"
1,"_","_","_","ta","CX","","_","_"
2,"_","_","_","ātman","NC","","_","_"
3,"ca","_","_","ca","CCD","","_","_"
4,"tasyāś","_","_","tad","PRD","","_","_"
5,"ca","_","_","ca","CCD","","_","_"
6,"_","_","_","dvija","NC","","_","_"
7,"_","_","_","ādi","NC","","_","_"
8,"_","_","_","jana","NC","","_","_"
9,"_","_","_","saṃnidhi","NC","","_","_"
1,"_","_","_","brahmasthalaka","NC","","_","_"
2,"_","_","_","vāsa","NC","","_","_"
3,"_","_","_","ādi","NC","","_","_"
4,"yad","_","_","yad","PRL","","_","_"
5,"vṛttaṃ","_","_","vṛt","PPP","","_","_"
6,"tan","_","_","tad","PRD","","_","_"
7,"niveditam","_","_","niveday","PPP","","_","_"
1,"_","_","_","atha","CAD","","_","_"
2,"_","_","_","vac","PPP","","_","_"
3,"brāhmaṇair","_","_","brāhmaṇa","NC","","_","_"
4,"brahman","_","_","brahman","NC","","_","_"
5,"brāhmaṇī","_","_","brāhmaṇī","NC","","_","_"
6,"parigṛhyatām","_","_","parigrah","V","parigrah","_","_"
1,"_","_","_","rañj","PPP","","_","_"
2,"_","_","_","dāra","NC","","_","_"
3,"_","_","_","parityāga","NC","","_","_"
4,"ācaranti","_","_","ācar","V","ācar","_","_"
5,"na","_","_","na","CNG","","_","_"
6,"sādhavaḥ","_","_","sādhu","JJ","","_","_"
1,"yac","_","_","yad","PRL","","_","_"
2,"ca","_","_","ca","CCD","","_","_"
3,"kiṃcid","_","_","kiṃcit","PRI","","_","_"
4,"a","_","_","alpha_privativum","JJ","","_","_"
4,"akartavyam","_","_","kartavya","JJ","","_","_"
5,"anāthyād","_","_","anāthya","NC","","_","_"
6,"anayā","_","_","ida","PRD","","_","_"
7,"kṛtam","_","_","kṛ","PPP","","_","_"
1,"tasya","_","_","tad","PRD","","_","_"
2,"kṛcchratamaiḥ","_","_","kṛcchratama","JJ","","_","_"
3,"kṛcchrair","_","_","kṛcchra","NC","","_","_"
4,"viśuddhiḥ","_","_","viśuddhi","NC","","_","_"
5,"kriyatām","_","_","kar","V","kṛ","_","_"
6,"iti","_","_","iti","CQT","","_","_"
1,"_","_","_","tad","PRD","","_","_"
2,"_","_","_","vac","PPP","","_","_"
3,"yādṛśaṃ","_","_","yādṛśa","JJ","","_","_"
4,"pāpaṃ","_","_","pāpa","NC","","_","_"
5,"prāyaścittair","_","_","prāyaścitta","NC","","_","_"
6,"apohyate","_","_","apavah","V","apavah","_","_"
1,"pūjyānām","_","_","pūjay","KDG","","_","_"
2,"eva","_","_","eva","CEM","","_","_"
3,"tad","_","_","tad","PRD","","_","_"
4,"buddham","_","_","budh","PPP","","_","_"
5,"idaṃ","_","_","ida","PRD","","_","_"
6,"budhyata","_","_","bodh","V","budh","_","_"
7,"yādṛśam","_","_","yādṛśa","JJ","","_","_"
1,"_","_","_","hā","PPP","","_","_"
2,"_","_","_","varṇa","NC","","_","_"
3,"_","_","_","abhigāmin","JJ","","_","_"
4,"pātakinyaḥ","_","_","pātakin","JJ","","_","_"
5,"kila","_","_","kila","CX","","_","_"
6,"striyaḥ","_","_","strī","NC","","_","_"
1,"iyaṃ","_","_","ida","PRD","","_","_"
2,"tv","_","_","tu","CCD","","_","_"
3,"_","_","_","aśubha","JJ","","_","_"
4,"_","_","_","sāvarṇa","JJ","","_","_"
5,"yam","_","_","yad","PRL","","_","_"
6,"upāste","_","_","ās","V","ās","_","_"
7,"sa","_","_","tad","PRD","","_","_"
8,"dṛśyatām","_","_","darś","V","dṛś","_","_"
1,"tad","_","_","tad","PRD","","_","_"
2,"upāstām","_","_","upās","V","upās","_","_"
3,"iyaṃ","_","_","ida","PRD","","_","_"
4,"bhadrā","_","_","bhadra","JJ","","_","_"
5,"yam","_","_","yad","PRL","","_","_"
6,"upāsac","_","_","upās","V","upās","_","_"
7,"chivaṃ","_","_","śiva","NC","","_","_"
8,"dhruvam","_","_","dhruva","CX","","_","_"
1,"sukhānāṃ","_","_","sukha","NC","","_","_"
2,"_","_","_","ca","CCD","","_","_"
3,"_","_","_","upahartṛ","JJ","","_","_"
4,"_","_","_","mahat","JJ","","_","_"
5,"_","_","_","pāśupata","NC","","_","_"
6,"patim","_","_","pati","NC","","_","_"
1,"ity","_","_","iti","CQT","","_","_"
2,"uktavati","_","_","vac","KDP","","_","_"
3,"sā","_","_","tad","PRD","","_","_"
4,"tasminn","_","_","tad","PRD","","_","_"
5,"_","_","_","vak","V","vac","_","_"
6,"_","_","_","upaci","PPP","","_","_"
7,"_","_","_","trapā","NC","","_","_"
1,"mṛtyos","_","_","mṛtyu","NC","","_","_"
2,"_","_","_","tvat","PPR","","_","_"
3,"_","_","_","samīpa","NC","","_","_"
4,"_","_","_","stha","JJ","","_","_"
5,"nayāmi","_","_","nay","V","nī","_","_"
6,"divasān","_","_","divasa","NC","","_","_"
7,"iti","_","_","iti","CQT","","_","_"
1,"_","_","_","atha","CAD","","_","_"
2,"_","_","_","eka","PPX","","_","_"
3,"brāhmaṇas","_","_","brāhmaṇa","NC","","_","_"
4,"teṣu","_","_","tad","PRD","","_","_"
5,"dṛḍhodyamam","_","_","dṛḍhodyama","NC","","_","_"
6,"abhāṣata","_","_","bhāṣ","V","bhāṣ","_","_"
1,"madīyā","_","_","madīya","JJ","","_","_"
2,"duhitā","_","_","duhitṛ","NC","","_","_"
3,"brahman","_","_","brahman","NC","","_","_"
4,"rūpiṇī","_","_","rūpin","JJ","","_","_"
5,"pariṇīyatām","_","_","pariṇī","V","pariṇī","_","_"
1,"dhanaṃ","_","_","dhana","NC","","_","_"
2,"me","_","_","mat","PPR","","_","_"
3,"_","_","_","dhanada","NC","","_","_"
4,"_","_","_","iva","CCM","","_","_"
5,"_","_","_","tad","PRD","","_","_"
6,"_","_","_","eva","CEM","","_","_"
7,"_","_","_","ca","CCD","","_","_"
8,"_","_","_","eka","PPX","","_","_"
9,"sutā","_","_","sutā","NC","","_","_"
10,"yataḥ","_","_","yatas","CX","","_","_"
1,"tatas","_","_","tatas","CX","","_","_"
2,"tasya","_","_","tad","PRD","","_","_"
3,"ca","_","_","ca","CCD","","_","_"
4,"tasyāś","_","_","tad","PRD","","_","_"
5,"ca","_","_","ca","CCD","","_","_"
6,"bhaved","_","_","bhav","V","bhū","_","_"
7,"bhartā","_","_","bhartṛ","NC","","_","_"
8,"bhavān","_","_","bhavat","JJ","","_","_"
9,"iti","_","_","iti","CQT","","_","_"
1,"āsīc","_","_","as","V","as","_","_"
2,"_","_","_","ca","CCD","","_","_"
3,"_","_","_","ida","PRD","","_","_"
4,"kim","_","_","kiṃ","PRQ","","_","_"
5,"_","_","_","adya","CX","","_","_"
6,"_","_","_","api","CX","","_","_"
7,"syān","_","_","as","V","as","_","_"
8,"na","_","_","na","CNG","","_","_"
9,"syād","_","_","as","V","as","_","_"
10,"iti","_","_","iti","CQT","","_","_"
11,"cintayā","_","_","cintā","NC","","_","_"
1,"_","_","_","parivrājaka","NC","","_","_"
2,"_","_","_","vākya","NC","","_","_"
3,"hi","_","_","hi","CX","","_","_"
4,"kṛtārthīkṛtam","_","_","kṛtārthīkṛ","PPP","","_","_"
5,"etayā","_","_","tad","PRD","","_","_"
1,"pratijñāya","_","_","pratijñā","CGDA","","_","_"
2,"ca","_","_","ca","CCD","","_","_"
3,"tāṃ","_","_","tad","PRD","","_","_"
4,"kanyāṃ","_","_","kanyā","NC","","_","_"
5,"dadānād","_","_","dā","KDP","","_","_"
6,"brāhmaṇāt","_","_","brāhmaṇa","NC","","_","_"
7,"svayam","_","_","svaya","CX","","_","_"
1,"_","_","_","sa_saha","CX","","_","_"
2,"_","_","_","mahat","JJ","","_","_"
3,"_","_","_","draviṇa","NC","","_","_"
4,"_","_","_","skandha","NC","","_","_"
5,"upayeme","_","_","upaya","V","upaya","_","_"
6,"dṛḍhodyamaḥ","_","_","dṛḍhodyama","NC","","_","_"
1,"_","_","_","tamālikā","NC","","_","_"
2,"_","_","_","api","CX","","_","_"
3,"saṃhārya","_","_","saṃhāray","CGDA","","_","_"
4,"keśān","_","_","keśa","NC","","_","_"
5,"_","_","_","kāṣāya","NC","","_","_"
6,"_","_","_","cīvara","NC","","_","_"
1,"_","_","_","dṛḍhodyama","NC","","_","_"
2,"_","_","_","gṛha","NC","","_","_"
3,"_","_","_","āsad","PPP","","_","_"
4,"vasatī","_","_","vas","KDP","","_","_"
5,"kālam","_","_","kāla","NC","","_","_"
6,"akṣipat","_","_","kṣip","V","kṣip","_","_"
1,"dṛḍhodyamo","_","_","dṛḍhodyama","NC","","_","_"
2,"'pi","_","_","api","CX","","_","_"
3,"saṃtataṃ","_","_","saṃtata","CX","","_","_"
4,"_","_","_","dvijāti","NC","","_","_"
5,"_","_","_","karman","NC","","_","_"
6,"sādhayan","_","_","sādhay","KDP","","_","_"
1,"_","_","_","hara","NC","","_","_"
2,"_","_","_","uttamāṅga","NC","","_","_"
3,"_","_","_","lālay","PPP","","_","_"
4,"upāsta","_","_","upās","V","upās","_","_"
5,"_","_","_","jahnu","NC","","_","_"
6,"_","_","_","kanyakā","NC","","_","_"
1,"tat","_","_","tad","PRD","","_","_"
2,"tena","_","_","tad","PRD","","_","_"
3,"yena","_","_","yad","PRL","","_","_"
4,"_","_","_","kṛ","PPP","","_","_"
5,"_","_","_","duṣkara","JJ","","_","_"
6,"_","_","_","pauruṣa","NC","","_","_"
7,"vākyaṃ","_","_","vākya","NC","","_","_"
8,"na","_","_","na","CNG","","_","_"
9,"bhinnatamasaḥ","_","_","bhinnatamas","NC","","_","_"
10,"kṛtam","_","_","kṛ","PPP","","_","_"
11,"apramāṇam","_","_","apramāṇa","JJ","","_","_"
1,"śūreṇa","_","_","śūra","NC","","_","_"
2,"_","_","_","daiva","NC","","_","_"
3,"_","_","_","hari","JJ","","_","_"
4,"prabhuṇā","_","_","prabhu","NC","","_","_"
5,"prasahya","_","_","prasah","CGDA","","_","_"
6,"tasmāj","_","_","tasmāt","CX","","_","_"
7,"jitaḥ","_","_","ji","PPP","","_","_"
8,"_","_","_","puruṣakāra","NC","","_","_"
9,"_","_","_","gaja","NC","","_","_"
10,"_","_","_","adhirāja","NC","","_","_"
