"WordID","word","NormSTEM","suffix","lemma","PoS","Root","NormSuffix","NormWord"
1,"janamejaya","_","_","janamejaya","NC","","_","_"
2,"uvāca","_","_","vak","V","vac","_","_"
1,"vasamāneṣu","_","_","vas","KDP","","_","_"
2,"pārtheṣu","_","_","pārtha","NC","","_","_"
3,"vane","_","_","vana","NC","","_","_"
4,"tasmin","_","_","tad","PRD","","_","_"
5,"mahātmasu","_","_","mahātman","JJ","","_","_"
1,"dhārtarāṣṭrā","_","_","dhārtarāṣṭra","NC","","_","_"
2,"_","_","_","mahat","JJ","","_","_"
3,"_","_","_","iṣvāsa","NC","","_","_"
4,"kim","_","_","kiṃ","PRQ","","_","_"
5,"akurvanta","_","_","kar","V","kṛ","_","_"
6,"sattama","_","_","sattama","JJ","","_","_"
1,"karṇo","_","_","karṇa","NC","","_","_"
2,"vaikartanaś","_","_","vaikartana","NC","","_","_"
3,"_","_","_","ca","CCD","","_","_"
4,"_","_","_","api","CX","","_","_"
5,"śakuniś","_","_","śakuni","NC","","_","_"
6,"ca","_","_","ca","CCD","","_","_"
7,"_","_","_","mahat","JJ","","_","_"
8,"_","_","_","bala","NC","","_","_"
1,"_","_","_","bhīṣma","NC","","_","_"
2,"_","_","_","droṇa","NC","","_","_"
3,"_","_","_","kṛpa","NC","","_","_"
4,"_","_","_","ca","CCD","","_","_"
5,"_","_","_","eva","CEM","","_","_"
6,"_","_","_","tad","PRD","","_","_"
7,"_","_","_","mat","PPR","","_","_"
8,"śaṃsitum","_","_","śaṃs","CGDI","","_","_"
9,"arhasi","_","_","arh","V","arh","_","_"
1,"vaiśampāyana","_","_","vaiśampāyana","NC","","_","_"
2,"uvāca","_","_","vak","V","vac","_","_"
1,"evaṃ","_","_","eva","CX","","_","_"
2,"gateṣu","_","_","ga","PPP","","_","_"
3,"pārtheṣu","_","_","pārtha","NC","","_","_"
4,"visṛṣṭe","_","_","visṛj","PPP","","_","_"
5,"ca","_","_","ca","CCD","","_","_"
6,"suyodhane","_","_","suyodhana","NC","","_","_"
1,"āgate","_","_","āga","PPP","","_","_"
2,"hāstinapuraṃ","_","_","hāstinapura","NC","","_","_"
3,"mokṣite","_","_","mokṣay","PPP","","_","_"
4,"_","_","_","pāṇḍu","NC","","_","_"
5,"_","_","_","nandana","NC","","_","_"
1,"bhīṣmo","_","_","bhīṣma","NC","","_","_"
2,"_","_","_","abravīta","V","brū","_","_"
3,"_","_","_","mahat","JJ","","_","_"
4,"_","_","_","rāja","NC","","_","_"
5,"dhārtarāṣṭram","_","_","dhārtarāṣṭra","NC","","_","_"
6,"idaṃ","_","_","ida","PRD","","_","_"
7,"vacaḥ","_","_","vacas","NC","","_","_"
1,"uktaṃ","_","_","vac","PPP","","_","_"
2,"tāta","_","_","tāta","NC","","_","_"
3,"mayā","_","_","mat","PPR","","_","_"
4,"pūrvaṃ","_","_","pūrva","CX","","_","_"
5,"gacchatas","_","_","ga","KDP","","_","_"
6,"te","_","_","tvat","PPR","","_","_"
7,"_","_","_","tapas","NC","","_","_"
8,"_","_","_","vana","NC","","_","_"
1,"gamanaṃ","_","_","gamana","NC","","_","_"
2,"me","_","_","mat","PPR","","_","_"
3,"na","_","_","na","CNG","","_","_"
4,"rucitaṃ","_","_","ruc","PPP","","_","_"
5,"tava","_","_","tvat","PPR","","_","_"
6,"_","_","_","tad","PRD","","_","_"
7,"_","_","_","na","CNG","","_","_"
8,"kṛtaṃ","_","_","kṛ","PPP","","_","_"
9,"ca","_","_","ca","CCD","","_","_"
10,"te","_","_","tvat","PPR","","_","_"
1,"tataḥ","_","_","tatas","CX","","_","_"
2,"prāptaṃ","_","_","prāp","PPP","","_","_"
3,"tvayā","_","_","tvat","PPR","","_","_"
4,"vīra","_","_","vīra","NC","","_","_"
5,"grahaṇaṃ","_","_","grahaṇa","NC","","_","_"
6,"śatrubhir","_","_","śatru","NC","","_","_"
7,"balāt","_","_","bala","NC","","_","_"
1,"_","_","_","mokṣay","PPP","","_","_"
2,"_","_","_","ca","CCD","","_","_"
3,"_","_","_","as","V","as","_","_"
4,"_","_","_","dharma","NC","","_","_"
5,"_","_","_","jña","JJ","","_","_"
6,"pāṇḍavair","_","_","pāṇḍava","NC","","_","_"
7,"na","_","_","na","CNG","","_","_"
8,"ca","_","_","ca","CCD","","_","_"
9,"lajjase","_","_","lajj","V","lajj","_","_"
1,"pratyakṣaṃ","_","_","pratyakṣa","JJ","","_","_"
2,"tava","_","_","tvat","PPR","","_","_"
3,"gāndhāre","_","_","gāndhāri","NC","","_","_"
4,"_","_","_","sa_saha","CX","","_","_"
5,"_","_","_","sainya","NC","","_","_"
6,"viśāṃ","_","_","viś","NC","","_","_"
7,"pate","_","_","pati","NC","","_","_"
1,"sūtaputro","_","_","sūtaputra","NC","","_","_"
2,"'payād","_","_","apayā","V","apayā","_","_"
3,"bhīto","_","_","bhī","PPP","","_","_"
4,"gandharvāṇāṃ","_","_","gandharva","NC","","_","_"
5,"tadā","_","_","tadā","CAD","","_","_"
6,"raṇāt","_","_","raṇa","NC","","_","_"
1,"krośatas","_","_","kruś","KDP","","_","_"
2,"tava","_","_","tvat","PPR","","_","_"
3,"_","_","_","rājan","NC","","_","_"
4,"_","_","_","indra","NC","","_","_"
5,"_","_","_","sa_saha","CX","","_","_"
6,"_","_","_","sainya","NC","","_","_"
7,"_","_","_","nṛpa","NC","","_","_"
8,"_","_","_","ātmaja","NC","","_","_"
1,"dṛṣṭas","_","_","dṛś","PPP","","_","_"
2,"te","_","_","tvat","PPR","","_","_"
3,"vikramaś","_","_","vikrama","NC","","_","_"
4,"_","_","_","ca","CCD","","_","_"
5,"_","_","_","eva","CEM","","_","_"
6,"pāṇḍavānāṃ","_","_","pāṇḍava","NC","","_","_"
7,"mahātmanām","_","_","mahātman","JJ","","_","_"
1,"karṇasya","_","_","karṇa","NC","","_","_"
2,"ca","_","_","ca","CCD","","_","_"
3,"_","_","_","mahat","JJ","","_","_"
4,"_","_","_","bāhu","NC","","_","_"
5,"sūtaputrasya","_","_","sūtaputra","NC","","_","_"
6,"durmateḥ","_","_","durmati","JJ","","_","_"
1,"na","_","_","na","CNG","","_","_"
2,"_","_","_","ca","CCD","","_","_"
3,"_","_","_","api","CX","","_","_"
4,"_","_","_","pāda","NC","","_","_"
5,"_","_","_","bhāj","JJ","","_","_"
6,"karṇaḥ","_","_","karṇa","NC","","_","_"
7,"pāṇḍavānāṃ","_","_","pāṇḍava","NC","","_","_"
8,"_","_","_","nṛpa","NC","","_","_"
9,"_","_","_","uttama","JJ","","_","_"
1,"dhanurvede","_","_","dhanurveda","NC","","_","_"
2,"ca","_","_","ca","CCD","","_","_"
3,"śaurye","_","_","śaurya","NC","","_","_"
4,"ca","_","_","ca","CCD","","_","_"
5,"dharme","_","_","dharma","NC","","_","_"
6,"vā","_","_","vā","CCD","","_","_"
7,"_","_","_","dharma","NC","","_","_"
8,"_","_","_","vatsala","JJ","","_","_"
1,"tasya","_","_","tad","PRD","","_","_"
2,"te","_","_","tvat","PPR","","_","_"
3,"'haṃ","_","_","mat","PPR","","_","_"
4,"kṣamaṃ","_","_","kṣama","JJ","","_","_"
5,"manye","_","_","man","V","man","_","_"
6,"pāṇḍavais","_","_","pāṇḍava","NC","","_","_"
7,"tair","_","_","tad","PRD","","_","_"
8,"mahātmabhiḥ","_","_","mahātman","JJ","","_","_"
1,"saṃdhiṃ","_","_","saṃdhi","NC","","_","_"
2,"_","_","_","saṃdhi","NC","","_","_"
3,"_","_","_","vid","JJ","","_","_"
4,"śreṣṭha","_","_","śreṣṭha","JJ","","_","_"
5,"_","_","_","kula","NC","","_","_"
6,"_","_","_","ida","PRD","","_","_"
7,"vivṛddhaye","_","_","vivṛddhi","NC","","_","_"
1,"evam","_","_","eva","CX","","_","_"
2,"uktas","_","_","vac","PPP","","_","_"
3,"tu","_","_","tu","CCD","","_","_"
4,"bhīṣmeṇa","_","_","bhīṣma","NC","","_","_"
5,"dhārtarāṣṭro","_","_","dhārtarāṣṭra","NC","","_","_"
6,"janeśvaraḥ","_","_","janeśvara","NC","","_","_"
1,"prahasya","_","_","prahas","CGDA","","_","_"
2,"sahasā","_","_","sahas","NC","","_","_"
3,"rājan","_","_","rājan","NC","","_","_"
4,"vipratasthe","_","_","vipratiṣṭh","V","viprasthā","_","_"
5,"_","_","_","sa_saha","CX","","_","_"
6,"_","_","_","saubala","NC","","_","_"
1,"taṃ","_","_","tad","PRD","","_","_"
2,"tu","_","_","tu","CCD","","_","_"
3,"prasthitam","_","_","prasthā","PPP","","_","_"
4,"ājñāya","_","_","ājñā","CGDA","","_","_"
5,"_","_","_","karṇa","NC","","_","_"
6,"_","_","_","duḥśāsana","NC","","_","_"
7,"_","_","_","ādi","NC","","_","_"
1,"anujagmur","_","_","anuga","V","anuga","_","_"
2,"_","_","_","mahat","JJ","","_","_"
3,"_","_","_","iṣvāsa","NC","","_","_"
4,"dhārtarāṣṭraṃ","_","_","dhārtarāṣṭra","NC","","_","_"
5,"_","_","_","mahat","JJ","","_","_"
6,"_","_","_","bala","NC","","_","_"
1,"_","_","_","tad","PRD","","_","_"
2,"_","_","_","tu","CCD","","_","_"
3,"samprasthitān","_","_","samprasthā","PPP","","_","_"
4,"dṛṣṭvā","_","_","dṛś","CGDA","","_","_"
5,"bhīṣmaḥ","_","_","bhīṣma","NC","","_","_"
6,"_","_","_","kuru","NC","","_","_"
7,"_","_","_","pitāmaha","NC","","_","_"
1,"lajjayā","_","_","lajjā","NC","","_","_"
2,"vrīḍito","_","_","vrīḍ","PPP","","_","_"
3,"_","_","_","rājan","NC","","_","_"
4,"_","_","_","ga","V","ga","_","_"
5,"svaṃ","_","_","sva","JJ","","_","_"
6,"niveśanam","_","_","niveśana","NC","","_","_"
1,"gate","_","_","ga","PPP","","_","_"
2,"bhīṣme","_","_","bhīṣma","NC","","_","_"
3,"_","_","_","mahat","JJ","","_","_"
4,"_","_","_","rāja","NC","","_","_"
5,"dhārtarāṣṭro","_","_","dhārtarāṣṭra","NC","","_","_"
6,"janādhipaḥ","_","_","janādhipa","NC","","_","_"
1,"punar","_","_","punar","CAD","","_","_"
2,"āgamya","_","_","āga","CGDA","","_","_"
3,"taṃ","_","_","tad","PRD","","_","_"
4,"deśam","_","_","deśa","NC","","_","_"
5,"amantrayata","_","_","mantray","V","mantray","_","_"
6,"mantribhiḥ","_","_","mantrin","NC","","_","_"
1,"kim","_","_","kiṃ","PRQ","","_","_"
2,"asmākaṃ","_","_","mat","PPR","","_","_"
3,"_","_","_","bhav","V","bhū","_","_"
4,"_","_","_","śreyas","NC","","_","_"
5,"kiṃ","_","_","kiṃ","PRQ","","_","_"
6,"kāryam","_","_","kārya","NC","","_","_"
7,"avaśiṣyate","_","_","avaśās","V","avaśās","_","_"
1,"kathaṃ","_","_","katha","CX","","_","_"
2,"nu","_","_","nu","CX","","_","_"
3,"sukṛtaṃ","_","_","sukṛta","JJ","","_","_"
4,"ca","_","_","ca","CCD","","_","_"
5,"_","_","_","as","V","as","_","_"
6,"_","_","_","mantray","V","mantray","_","_"
7,"bhārata","_","_","bhārata","NC","","_","_"
1,"karṇa","_","_","karṇa","NC","","_","_"
2,"uvāca","_","_","vak","V","vac","_","_"
1,"duryodhana","_","_","duryodhana","NC","","_","_"
2,"_","_","_","nibodh","V","nibudh","_","_"
3,"_","_","_","ida","PRD","","_","_"
4,"yat","_","_","yad","PRL","","_","_"
5,"tvā","_","_","tvat","PPR","","_","_"
6,"vakṣyāmi","_","_","vak","V","vac","_","_"
7,"kaurava","_","_","kaurava","NC","","_","_"
1,"śrutvā","_","_","śru","CGDA","","_","_"
2,"ca","_","_","ca","CCD","","_","_"
3,"tat","_","_","tad","PRD","","_","_"
4,"tathā","_","_","tathā","CX","","_","_"
5,"sarvaṃ","_","_","sarva","JQ","","_","_"
6,"kartum","_","_","kṛ","CGDI","","_","_"
7,"_","_","_","arh","V","arh","_","_"
8,"_","_","_","ariṃdama","JJ","","_","_"
1,"_","_","_","tvat","PPR","","_","_"
2,"_","_","_","adya","CX","","_","_"
3,"pṛthivī","_","_","pṛthivī","NC","","_","_"
4,"vīra","_","_","vīra","NC","","_","_"
5,"niḥsapatnā","_","_","niḥsapatna","JJ","","_","_"
6,"_","_","_","nṛpa","NC","","_","_"
7,"_","_","_","uttama","JJ","","_","_"
1,"tāṃ","_","_","tad","PRD","","_","_"
2,"pālaya","_","_","pālay","V","pālay","_","_"
3,"yathā","_","_","yathā","CCM","","_","_"
4,"śakro","_","_","śakra","NC","","_","_"
5,"_","_","_","han","PPP","","_","_"
6,"_","_","_","śatru","NC","","_","_"
7,"mahāmanāḥ","_","_","mahāmanas","JJ","","_","_"
1,"vaiśampāyana","_","_","vaiśampāyana","NC","","_","_"
2,"uvāca","_","_","vak","V","vac","_","_"
1,"evam","_","_","eva","CX","","_","_"
2,"uktas","_","_","vac","PPP","","_","_"
3,"tu","_","_","tu","CCD","","_","_"
4,"karṇena","_","_","karṇa","NC","","_","_"
5,"karṇaṃ","_","_","karṇa","NC","","_","_"
6,"_","_","_","rājan","NC","","_","_"
7,"_","_","_","abravīta","V","brū","_","_"
8,"punaḥ","_","_","punar","CAD","","_","_"
1,"na","_","_","na","CNG","","_","_"
2,"kiṃcid","_","_","kiṃcit","PRI","","_","_"
3,"durlabhaṃ","_","_","durlabha","JJ","","_","_"
4,"tasya","_","_","tad","PRD","","_","_"
5,"yasya","_","_","yad","PRL","","_","_"
6,"tvaṃ","_","_","tvat","PPR","","_","_"
7,"_","_","_","puruṣa","NC","","_","_"
8,"_","_","_","ṛṣabha","NC","","_","_"
1,"sahāyaś","_","_","sahāya","NC","","_","_"
2,"_","_","_","ca","CCD","","_","_"
3,"_","_","_","anurañj","PPP","","_","_"
4,"ca","_","_","ca","CCD","","_","_"
5,"_","_","_","mat","PPR","","_","_"
6,"_","_","_","artha","NC","","_","_"
7,"ca","_","_","ca","CCD","","_","_"
8,"samudyataḥ","_","_","samudya","PPP","","_","_"
1,"abhiprāyas","_","_","abhiprāya","NC","","_","_"
2,"tu","_","_","tu","CCD","","_","_"
3,"me","_","_","mat","PPR","","_","_"
4,"kaścit","_","_","kiṃcit","PRI","","_","_"
5,"taṃ","_","_","tad","PRD","","_","_"
6,"vai","_","_","vai","CX","","_","_"
7,"śṛṇu","_","_","śṛṇ","V","śru","_","_"
8,"yathātatham","_","_","yathātatha","JJ","","_","_"
1,"rājasūyaṃ","_","_","rājasūya","NC","","_","_"
2,"pāṇḍavasya","_","_","pāṇḍava","NC","","_","_"
3,"dṛṣṭvā","_","_","dṛś","CGDA","","_","_"
4,"_","_","_","kratu","NC","","_","_"
5,"_","_","_","vara","JJ","","_","_"
6,"tadā","_","_","tadā","CAD","","_","_"
1,"mama","_","_","mat","PPR","","_","_"
2,"spṛhā","_","_","spṛhā","NC","","_","_"
3,"samutpannā","_","_","samutpad","PPP","","_","_"
4,"tāṃ","_","_","tad","PRD","","_","_"
5,"saṃpādaya","_","_","sampāday","V","sampāday","_","_"
6,"sūtaja","_","_","sūtaja","NC","","_","_"
1,"evam","_","_","eva","CX","","_","_"
2,"uktas","_","_","vac","PPP","","_","_"
3,"tataḥ","_","_","tatas","CX","","_","_"
4,"karṇo","_","_","karṇa","NC","","_","_"
5,"rājānam","_","_","rājan","NC","","_","_"
6,"idam","_","_","ida","PRD","","_","_"
7,"abravīt","_","_","abravīta","V","brū","_","_"
1,"_","_","_","tvat","PPR","","_","_"
2,"_","_","_","adya","CX","","_","_"
3,"_","_","_","pṛthivī","NC","","_","_"
4,"_","_","_","pāla","NC","","_","_"
5,"vaśyāḥ","_","_","vaśya","JJ","","_","_"
6,"sarve","_","_","sarva","JQ","","_","_"
7,"_","_","_","nṛpa","NC","","_","_"
8,"_","_","_","uttama","JJ","","_","_"
1,"āhūyantāṃ","_","_","āhvā","V","āhvā","_","_"
2,"dvijavarāḥ","_","_","dvijavara","NC","","_","_"
3,"_","_","_","sabhāra","JJ","","_","_"
4,"_","_","_","ca","CCD","","_","_"
5,"yathāvidhi","_","_","yathāvidhi","CX","","_","_"
1,"saṃbhriyantāṃ","_","_","sambhṛ","V","sambhṛ","_","_"
2,"_","_","_","kuru","NC","","_","_"
3,"_","_","_","śreṣṭha","JJ","","_","_"
4,"_","_","_","yajña","NC","","_","_"
5,"_","_","_","upakaraṇa","NC","","_","_"
6,"ca","_","_","ca","CCD","","_","_"
1,"ṛtvijaś","_","_","ṛtvij","NC","","_","_"
2,"ca","_","_","ca","CCD","","_","_"
3,"samāhūtā","_","_","samāhvā","PPP","","_","_"
4,"yathoktaṃ","_","_","yathokta","CX","","_","_"
5,"_","_","_","veda","NC","","_","_"
6,"_","_","_","pāraga","JJ","","_","_"
1,"kriyāṃ","_","_","kriyā","NC","","_","_"
2,"kurvantu","_","_","kar","V","kṛ","_","_"
3,"te","_","_","tad","PRD","","_","_"
4,"rājan","_","_","rājan","NC","","_","_"
5,"yathāśāstram","_","_","yathāśāstra","CX","","_","_"
6,"ariṃdama","_","_","ariṃdama","JJ","","_","_"
1,"_","_","_","bahu","JJ","","_","_"
2,"_","_","_","anna","NC","","_","_"
3,"_","_","_","pāna","NC","","_","_"
4,"_","_","_","saṃyuj","PPP","","_","_"
5,"_","_","_","su","CAD","","_","_"
6,"_","_","_","samṛdh","PPP","","_","_"
7,"_","_","_","guṇa","NC","","_","_"
8,"_","_","_","anvita","JJ","","_","_"
1,"pravartatāṃ","_","_","pravart","V","pravṛt","_","_"
2,"_","_","_","mahat","JJ","","_","_"
3,"_","_","_","yajña","NC","","_","_"
4,"_","_","_","tvat","PPR","","_","_"
5,"_","_","_","api","CX","","_","_"
6,"_","_","_","bharata","NC","","_","_"
7,"_","_","_","ṛṣabha","NC","","_","_"
1,"evam","_","_","eva","CX","","_","_"
2,"uktas","_","_","vac","PPP","","_","_"
3,"tu","_","_","tu","CCD","","_","_"
4,"karṇena","_","_","karṇa","NC","","_","_"
5,"dhārtarāṣṭro","_","_","dhārtarāṣṭra","NC","","_","_"
6,"viśāṃ","_","_","viś","NC","","_","_"
7,"pate","_","_","pati","NC","","_","_"
1,"purohitaṃ","_","_","purohita","NC","","_","_"
2,"samānāyya","_","_","samānāyay","CGDA","","_","_"
3,"idaṃ","_","_","ida","PRD","","_","_"
4,"vacanam","_","_","vacana","NC","","_","_"
5,"abravīt","_","_","abravīta","V","brū","_","_"
1,"rājasūyaṃ","_","_","rājasūya","NC","","_","_"
2,"_","_","_","kratu","NC","","_","_"
3,"_","_","_","śreṣṭha","JJ","","_","_"
4,"_","_","_","samāp","PPP","","_","_"
5,"_","_","_","vara","JJ","","_","_"
6,"_","_","_","dakṣiṇā","NC","","_","_"
1,"āhara","_","_","āhar","V","āhṛ","_","_"
2,"tvaṃ","_","_","tvat","PPR","","_","_"
3,"mama","_","_","mat","PPR","","_","_"
4,"kṛte","_","_","kṛta","NC","","_","_"
5,"yathānyāyaṃ","_","_","yathānyāya","CX","","_","_"
6,"yathākramam","_","_","yathākrama","CX","","_","_"
1,"sa","_","_","tad","PRD","","_","_"
2,"evam","_","_","eva","CX","","_","_"
3,"ukto","_","_","vac","PPP","","_","_"
4,"nṛpatim","_","_","nṛpati","NC","","_","_"
5,"uvāca","_","_","vak","V","vac","_","_"
6,"_","_","_","dvija","NC","","_","_"
7,"_","_","_","puṃgava","NC","","_","_"
1,"na","_","_","na","CNG","","_","_"
2,"sa","_","_","tad","PRD","","_","_"
3,"śakyaḥ","_","_","śakya","JJ","","_","_"
4,"_","_","_","kratu","NC","","_","_"
5,"_","_","_","śreṣṭha","JJ","","_","_"
6,"jīvamāne","_","_","jīv","KDP","","_","_"
7,"yudhiṣṭhire","_","_","yudhiṣṭhira","NC","","_","_"
1,"āhartuṃ","_","_","āhṛ","CGDI","","_","_"
2,"_","_","_","kaurava","NC","","_","_"
3,"_","_","_","śreṣṭha","JJ","","_","_"
4,"kule","_","_","kula","NC","","_","_"
5,"tava","_","_","tvat","PPR","","_","_"
6,"_","_","_","nṛpa","NC","","_","_"
7,"_","_","_","uttama","JJ","","_","_"
1,"_","_","_","dīrgha","JJ","","_","_"
2,"_","_","_","āyus","NC","","_","_"
3,"jīvati","_","_","jīv","V","jīv","_","_"
4,"ca","_","_","ca","CCD","","_","_"
5,"vai","_","_","vai","CX","","_","_"
6,"dhṛtarāṣṭraḥ","_","_","dhṛtarāṣṭra","NC","","_","_"
7,"pitā","_","_","pitṛ","NC","","_","_"
8,"tava","_","_","tvat","PPR","","_","_"
1,"ataś","_","_","atas","CX","","_","_"
2,"_","_","_","ca","CCD","","_","_"
3,"_","_","_","api","CX","","_","_"
4,"viruddhas","_","_","virudh","PPP","","_","_"
5,"te","_","_","tvat","PPR","","_","_"
6,"kratur","_","_","kratu","NC","","_","_"
7,"eṣa","_","_","tad","PRD","","_","_"
8,"_","_","_","nṛpa","NC","","_","_"
9,"_","_","_","uttama","JJ","","_","_"
1,"asti","_","_","as","V","as","_","_"
2,"_","_","_","tu","CCD","","_","_"
3,"_","_","_","anya","PPX","","_","_"
4,"_","_","_","mahat","JJ","","_","_"
5,"sattraṃ","_","_","sattra","NC","","_","_"
6,"_","_","_","rājasūya","NC","","_","_"
7,"_","_","_","sama","PPX","","_","_"
8,"prabho","_","_","prabhu","NC","","_","_"
1,"tena","_","_","tad","PRD","","_","_"
2,"tvaṃ","_","_","tvat","PPR","","_","_"
3,"yaja","_","_","yaj","V","yaj","_","_"
4,"_","_","_","rājan","NC","","_","_"
5,"_","_","_","indra","NC","","_","_"
6,"śṛṇu","_","_","śṛṇ","V","śru","_","_"
7,"_","_","_","ca","CCD","","_","_"
8,"_","_","_","ida","PRD","","_","_"
9,"vaco","_","_","vacas","NC","","_","_"
10,"mama","_","_","mat","PPR","","_","_"
1,"ya","_","_","yad","PRL","","_","_"
2,"ime","_","_","ida","PRD","","_","_"
3,"_","_","_","pṛthivī","NC","","_","_"
4,"_","_","_","pāla","NC","","_","_"
5,"_","_","_","kara","NC","","_","_"
6,"_","_","_","da","JJ","","_","_"
7,"tava","_","_","tvat","PPR","","_","_"
8,"pārthiva","_","_","pārthiva","NC","","_","_"
1,"te","_","_","tad","PRD","","_","_"
2,"karān","_","_","kara","NC","","_","_"
3,"samprayacchantu","_","_","sampraya","V","sampraya","_","_"
4,"suvarṇaṃ","_","_","suvarṇa","NC","","_","_"
5,"ca","_","_","ca","CCD","","_","_"
6,"kṛtākṛtam","_","_","kṛtākṛta","JJ","","_","_"
1,"tena","_","_","tad","PRD","","_","_"
2,"te","_","_","tvat","PPR","","_","_"
3,"kriyatām","_","_","kar","V","kṛ","_","_"
4,"adya","_","_","adya","CX","","_","_"
5,"lāṅgalaṃ","_","_","lāṅgala","NC","","_","_"
6,"_","_","_","nṛpa","NC","","_","_"
7,"_","_","_","sattama","JJ","","_","_"
1,"yajñavāṭasya","_","_","yajñavāṭa","NC","","_","_"
2,"te","_","_","tvat","PPR","","_","_"
3,"bhūmiḥ","_","_","bhūmi","NC","","_","_"
4,"kṛṣyatāṃ","_","_","kṛṣ","V","kṛṣ","_","_"
5,"tena","_","_","tad","PRD","","_","_"
6,"bhārata","_","_","bhārata","NC","","_","_"
1,"tatra","_","_","tatra","CAD","","_","_"
2,"yajño","_","_","yajña","NC","","_","_"
3,"_","_","_","nṛpa","NC","","_","_"
4,"_","_","_","śreṣṭha","JJ","","_","_"
5,"_","_","_","prabhū","PPP","","_","_"
6,"_","_","_","anna","NC","","_","_"
7,"susaṃskṛtaḥ","_","_","susaṃskṛta","JJ","","_","_"
1,"pravartatāṃ","_","_","pravart","V","pravṛt","_","_"
2,"yathānyāyaṃ","_","_","yathānyāya","CX","","_","_"
3,"sarvato","_","_","sarvatas","CX","","_","_"
4,"_","_","_","hi","CX","","_","_"
5,"_","_","_","anivārita","JJ","","_","_"
1,"eṣa","_","_","tad","PRD","","_","_"
2,"te","_","_","tvat","PPR","","_","_"
3,"vaiṣṇavo","_","_","vaiṣṇava","NC","","_","_"
4,"nāma","_","_","nāma","CX","","_","_"
5,"yajñaḥ","_","_","yajña","NC","","_","_"
6,"_","_","_","as","KDP","","_","_"
7,"_","_","_","puruṣa","NC","","_","_"
8,"_","_","_","ucita","JJ","","_","_"
1,"etena","_","_","tad","PRD","","_","_"
2,"_","_","_","na","CNG","","_","_"
3,"_","_","_","iṣ","KDP","","_","_"
4,"kaścid","_","_","kiṃcit","PRI","","_","_"
5,"ṛte","_","_","ṛte","CX","","_","_"
6,"viṣṇuṃ","_","_","viṣṇu","NC","","_","_"
7,"purātanam","_","_","purātana","JJ","","_","_"
1,"rājasūyaṃ","_","_","rājasūya","NC","","_","_"
2,"_","_","_","kratu","NC","","_","_"
3,"_","_","_","śreṣṭha","JJ","","_","_"
4,"_","_","_","spardh","V","spṛdh","_","_"
5,"_","_","_","tad","PRD","","_","_"
6,"_","_","_","mahat","JJ","","_","_"
7,"_","_","_","kratu","NC","","_","_"
1,"asmākaṃ","_","_","mat","PPR","","_","_"
2,"rocate","_","_","roc","V","ruc","_","_"
3,"_","_","_","ca","CCD","","_","_"
4,"_","_","_","eva","CEM","","_","_"
5,"śreyaś","_","_","śreyas","JJ","","_","_"
6,"ca","_","_","ca","CCD","","_","_"
7,"tava","_","_","tvat","PPR","","_","_"
8,"bhārata","_","_","bhārata","NC","","_","_"
1,"_","_","_","avighna","JJ","","_","_"
2,"_","_","_","ca","CCD","","_","_"
3,"bhaved","_","_","bhav","V","bhū","_","_"
4,"eṣa","_","_","tad","PRD","","_","_"
5,"saphalā","_","_","saphala","JJ","","_","_"
6,"syāt","_","_","as","V","as","_","_"
7,"spṛhā","_","_","spṛhā","NC","","_","_"
8,"tava","_","_","tvat","PPR","","_","_"
1,"evam","_","_","eva","CX","","_","_"
2,"uktas","_","_","vac","PPP","","_","_"
3,"tu","_","_","tu","CCD","","_","_"
4,"tair","_","_","tad","PRD","","_","_"
5,"viprair","_","_","vipra","NC","","_","_"
6,"dhārtarāṣṭro","_","_","dhārtarāṣṭra","NC","","_","_"
7,"mahīpatiḥ","_","_","mahīpati","NC","","_","_"
1,"karṇaṃ","_","_","karṇa","NC","","_","_"
2,"ca","_","_","ca","CCD","","_","_"
3,"saubalaṃ","_","_","saubala","NC","","_","_"
4,"_","_","_","ca","CCD","","_","_"
5,"_","_","_","eva","CEM","","_","_"
6,"bhrātṝṃś","_","_","bhrātṛ","NC","","_","_"
7,"_","_","_","ca","CCD","","_","_"
8,"_","_","_","eva","CEM","","_","_"
9,"_","_","_","ida","PRD","","_","_"
10,"abravīt","_","_","abravīta","V","brū","_","_"
1,"rocate","_","_","roc","V","ruc","_","_"
2,"me","_","_","mat","PPR","","_","_"
3,"vacaḥ","_","_","vacas","NC","","_","_"
4,"kṛtsnaṃ","_","_","kṛtsna","JJ","","_","_"
5,"brāhmaṇānāṃ","_","_","brāhmaṇa","NC","","_","_"
6,"na","_","_","na","CNG","","_","_"
7,"saṃśayaḥ","_","_","saṃśaya","NC","","_","_"
1,"rocate","_","_","roc","V","ruc","_","_"
2,"yadi","_","_","yadi","CSB","","_","_"
3,"yuṣmākaṃ","_","_","tvat","PPR","","_","_"
4,"tan","_","_","tad","PRD","","_","_"
5,"mā","_","_","mat","PPR","","_","_"
6,"prabrūta","_","_","prabrū","V","prabrū","_","_"
7,"māciram","_","_","mācira","CX","","_","_"
1,"evam","_","_","eva","CX","","_","_"
2,"uktās","_","_","vac","PPP","","_","_"
3,"tu","_","_","tu","CCD","","_","_"
4,"te","_","_","tad","PRD","","_","_"
5,"sarve","_","_","sarva","JQ","","_","_"
6,"_","_","_","tathā","CX","","_","_"
7,"_","_","_","iti","CQT","","_","_"
8,"_","_","_","vak","V","vac","_","_"
9,"_","_","_","nara","NC","","_","_"
10,"_","_","_","adhipa","NC","","_","_"
1,"saṃdideśa","_","_","saṃdiś","V","saṃdiś","_","_"
2,"tato","_","_","tatas","CX","","_","_"
3,"rājā","_","_","rājan","NC","","_","_"
4,"_","_","_","vyāpāra","NC","","_","_"
5,"_","_","_","stha","JJ","","_","_"
6,"yathākramam","_","_","yathākrama","CX","","_","_"
1,"halasya","_","_","hala","NC","","_","_"
2,"karaṇe","_","_","karaṇa","NC","","_","_"
3,"_","_","_","ca","CCD","","_","_"
4,"_","_","_","api","CX","","_","_"
5,"vyādiṣṭāḥ","_","_","vyādiś","PPP","","_","_"
6,"_","_","_","sarva","JQ","","_","_"
7,"_","_","_","śilpin","NC","","_","_"
1,"yathoktaṃ","_","_","yathokta","CX","","_","_"
2,"ca","_","_","ca","CCD","","_","_"
3,"_","_","_","nṛpa","NC","","_","_"
4,"_","_","_","śreṣṭha","JJ","","_","_"
5,"kṛtaṃ","_","_","kṛ","PPP","","_","_"
6,"sarvaṃ","_","_","sarva","JQ","","_","_"
7,"yathākramam","_","_","yathākrama","CX","","_","_"
