"WordID","word","NormSTEM","suffix","lemma","PoS","Root","NormSuffix","NormWord"
1,"ayaṃ","_","_","ida","PRD","","_","_"
2,"soma","_","_","soma","NC","","_","_"
3,"indra","_","_","indra","NC","","_","_"
4,"tubhyaṃ","_","_","tvat","PPR","","_","_"
5,"sunve","_","_","su","V","su","_","_"
6,"tubhyam","_","_","tvat","PPR","","_","_"
7,"pavate","_","_","pū","V","pū","_","_"
8,"tvam","_","_","tvat","PPR","","_","_"
9,"asya","_","_","ida","PRD","","_","_"
10,"pāhi","_","_","pib","V","pā","_","_"
1,"tvaṃ","_","_","tvat","PPR","","_","_"
2,"ha","_","_","ha","CEM","","_","_"
3,"yaṃ","_","_","yad","PRL","","_","_"
4,"cakṛṣe","_","_","kar","V","kṛ","_","_"
5,"tvaṃ","_","_","tvat","PPR","","_","_"
6,"vavṛṣa","_","_","vṛ","V","vṛ","_","_"
7,"indum","_","_","indu","NC","","_","_"
8,"madāya","_","_","mada","NC","","_","_"
9,"yujyāya","_","_","yujya","JJ","","_","_"
10,"somam","_","_","soma","NC","","_","_"
1,"sa","_","_","tad","PRD","","_","_"
2,"īṃ","_","_","īṃ","CX","","_","_"
3,"ratho","_","_","ratha","NC","","_","_"
4,"na","_","_","na","CNG","","_","_"
5,"bhūriṣāﾱ","_","_","bhūriṣāh","JJ","","_","_"
6,"ayoji","_","_","yuj","V","yuj","_","_"
7,"mahaḥ","_","_","maha","JJ","","_","_"
8,"purūṇi","_","_","puru","JJ","","_","_"
9,"sātaye","_","_","sāti","NC","","_","_"
10,"vasūni","_","_","vasu","NC","","_","_"
1,"ād","_","_","āt","CX","","_","_"
2,"īṃ","_","_","īṃ","CX","","_","_"
3,"viśvā","_","_","viśva","JQ","","_","_"
4,"nahuṣyāṇi","_","_","nahuṣya","JJ","","_","_"
5,"jātā","_","_","jāta","NC","","_","_"
6,"svarṣātā","_","_","svarṣāti","NC","","_","_"
7,"vana","_","_","vana","NC","","_","_"
8,"ūrdhvā","_","_","ūrdhva","JJ","","_","_"
9,"navanta","_","_","nū","V","nū","_","_"
1,"vāyur","_","_","vāyu","NC","","_","_"
2,"na","_","_","na","CNG","","_","_"
3,"yo","_","_","yad","PRL","","_","_"
4,"niyutvāṁ","_","_","niyutvat","JJ","","_","_"
5,"_","_","_","iṣ","PPP","","_","_"
6,"_","_","_","yāman","NC","","_","_"
7,"_","_","_","nāsatya","NC","","_","_"
8,"_","_","_","iva","CCM","","_","_"
9,"hava","_","_","hava","NC","","_","_"
10,"ā","_","_","ā","CADP","","_","_"
11,"śambhaviṣṭhaḥ","_","_","śambhaviṣṭha","JJ","","_","_"
1,"_","_","_","viśva","JQ","","_","_"
2,"_","_","_","vāra","NC","","_","_"
3,"_","_","_","draviṇas","NC","","_","_"
4,"_","_","_","dā","JJ","","_","_"
5,"iva","_","_","iva","CCM","","_","_"
6,"tman","_","_","tman","NC","","_","_"
7,"_","_","_","pūṣan","NC","","_","_"
8,"_","_","_","iva","CCM","","_","_"
9,"_","_","_","dhī","NC","","_","_"
10,"_","_","_","javana","JJ","","_","_"
11,"'si","_","_","as","V","as","_","_"
12,"soma","_","_","soma","NC","","_","_"
1,"indro","_","_","indra","NC","","_","_"
2,"na","_","_","na","CNG","","_","_"
3,"yo","_","_","yad","PRL","","_","_"
4,"mahā","_","_","maha","JJ","","_","_"
5,"karmāṇi","_","_","karman","NC","","_","_"
6,"cakrir","_","_","cakri","JJ","","_","_"
7,"hantā","_","_","hantṛ","JJ","","_","_"
8,"vṛtrāṇām","_","_","vṛtra","NC","","_","_"
9,"asi","_","_","as","V","as","_","_"
10,"soma","_","_","soma","NC","","_","_"
11,"_","_","_","pur","NC","","_","_"
12,"_","_","_","bhid","JJ","","_","_"
1,"paidvo","_","_","paidva","JJ","","_","_"
2,"na","_","_","na","CNG","","_","_"
3,"hi","_","_","hi","CX","","_","_"
4,"tvam","_","_","tvat","PPR","","_","_"
5,"_","_","_","ahi","NC","","_","_"
6,"_","_","_","nāman","NC","","_","_"
7,"hantā","_","_","hantṛ","JJ","","_","_"
8,"_","_","_","viśva","JQ","","_","_"
9,"_","_","_","as","V","as","_","_"
10,"soma","_","_","soma","NC","","_","_"
11,"dasyoḥ","_","_","dasyu","NC","","_","_"
1,"agnir","_","_","agni","NC","","_","_"
2,"na","_","_","na","CNG","","_","_"
3,"yo","_","_","yad","PRL","","_","_"
4,"vana","_","_","vana","NC","","_","_"
5,"ā","_","_","ā","CADP","","_","_"
6,"sṛjyamāno","_","_","sṛj","KDP","","_","_"
7,"vṛthā","_","_","vṛthā","CX","","_","_"
8,"pājāṃsi","_","_","pājas","NC","","_","_"
9,"kṛṇute","_","_","kar","V","kṛ","_","_"
10,"nadīṣu","_","_","nadī","NC","","_","_"
1,"jano","_","_","jana","NC","","_","_"
2,"na","_","_","na","CNG","","_","_"
3,"yudhvā","_","_","yudhvan","JJ","","_","_"
4,"mahata","_","_","mahat","JJ","","_","_"
5,"upabdir","_","_","upabdi","NC","","_","_"
6,"iyarti","_","_","ṛch","V","ṛch","_","_"
7,"somaḥ","_","_","soma","NC","","_","_"
8,"pavamāna","_","_","pū","KDP","","_","_"
9,"ūrmim","_","_","ūrmi","NC","","_","_"
1,"ete","_","_","tad","PRD","","_","_"
2,"somā","_","_","soma","NC","","_","_"
3,"ati","_","_","ati","CADP","","_","_"
4,"vārāṇy","_","_","vāra","NC","","_","_"
5,"avyā","_","_","avya","JJ","","_","_"
6,"divyā","_","_","divya","JJ","","_","_"
7,"na","_","_","na","CNG","","_","_"
8,"kośāso","_","_","kośa","NC","","_","_"
9,"_","_","_","abhra","NC","","_","_"
10,"_","_","_","varṣa","NC","","_","_"
1,"vṛthā","_","_","vṛthā","CX","","_","_"
2,"samudraṃ","_","_","samudra","NC","","_","_"
3,"sindhavo","_","_","sindhu","NC","","_","_"
4,"na","_","_","na","CNG","","_","_"
5,"nīcīḥ","_","_","nyāñc","JJ","","_","_"
6,"sutāso","_","_","su","PPP","","_","_"
7,"abhi","_","_","abhi","CADP","","_","_"
8,"kalaśāṁ","_","_","kalaśa","NC","","_","_"
9,"asṛgran","_","_","sṛj","V","sṛj","_","_"
1,"śuṣmī","_","_","śuṣmin","JJ","","_","_"
2,"śardho","_","_","śardhas","NC","","_","_"
3,"na","_","_","na","CNG","","_","_"
4,"mārutam","_","_","māruta","JJ","","_","_"
5,"_","_","_","pū","V","pū","_","_"
6,"_","_","_","anabhiśasta","JJ","","_","_"
7,"divyā","_","_","divya","JJ","","_","_"
8,"yathā","_","_","yathā","CCM","","_","_"
9,"viṭ","_","_","viś","NC","","_","_"
1,"āpo","_","_","ap","NC","","_","_"
2,"na","_","_","na","CNG","","_","_"
3,"makṣū","_","_","makṣū","CX","","_","_"
4,"sumatir","_","_","sumati","JJ","","_","_"
5,"bhavā","_","_","bhav","V","bhū","_","_"
6,"naḥ","_","_","mat","PPR","","_","_"
7,"_","_","_","sahasra","NUM","","_","_"
8,"_","_","_","apsas","NC","","_","_"
9,"pṛtanāṣāṇ","_","_","pṛtanāṣāh","JJ","","_","_"
10,"na","_","_","na","CNG","","_","_"
11,"yajñaḥ","_","_","yajña","NC","","_","_"
1,"rājño","_","_","rājan","NC","","_","_"
2,"nu","_","_","nu","CX","","_","_"
3,"te","_","_","tvat","PPR","","_","_"
4,"varuṇasya","_","_","varuṇa","NC","","_","_"
5,"vratāni","_","_","vrata","NC","","_","_"
6,"bṛhad","_","_","bṛhat","JJ","","_","_"
7,"gabhīraṃ","_","_","gabhīra","JJ","","_","_"
8,"tava","_","_","tvat","PPR","","_","_"
9,"soma","_","_","soma","NC","","_","_"
10,"dhāma","_","_","dhāman","NC","","_","_"
1,"śuciṣ","_","_","śuci","JJ","","_","_"
2,"ṭvam","_","_","tvat","PPR","","_","_"
3,"asi","_","_","as","V","as","_","_"
4,"priyo","_","_","priya","JJ","","_","_"
5,"na","_","_","na","CNG","","_","_"
6,"mitro","_","_","mitra","NC","","_","_"
7,"dakṣāyyo","_","_","dakṣāyya","JJ","","_","_"
8,"_","_","_","aryaman","NC","","_","_"
9,"_","_","_","iva","CCM","","_","_"
10,"_","_","_","as","V","as","_","_"
11,"soma","_","_","soma","NC","","_","_"
