"WordID","word","NormSTEM","suffix","lemma","PoS","Root","NormSuffix","NormWord"
1,"iti","_","_","iti","CQT","","_","_"
2,"vā","_","_","vai","CX","","_","_"
3,"iti","_","_","iti","CQT","","_","_"
4,"me","_","_","mat","PPR","","_","_"
5,"mano","_","_","manas","NC","","_","_"
6,"gām","_","_","go","NC","","_","_"
7,"aśvaṃ","_","_","aśva","NC","","_","_"
8,"sanuyām","_","_","san","V","san","_","_"
9,"iti","_","_","iti","CQT","","_","_"
1,"kuvit","_","_","kuvid","CX","","_","_"
2,"_","_","_","soma","NC","","_","_"
3,"_","_","_","pib","V","pā","_","_"
4,"iti","_","_","iti","CQT","","_","_"
1,"pra","_","_","pra","CADP","","_","_"
2,"vātā","_","_","vāta","NC","","_","_"
3,"iva","_","_","iva","CCM","","_","_"
4,"dodhata","_","_","dudh","KDP","","_","_"
5,"un","_","_","ud","CADP","","_","_"
6,"mā","_","_","mat","PPR","","_","_"
7,"pītā","_","_","pā","PPP","","_","_"
8,"ayaṃsata","_","_","ya","V","ya","_","_"
1,"kuvit","_","_","kuvid","CX","","_","_"
2,"_","_","_","soma","NC","","_","_"
3,"_","_","_","pib","V","pā","_","_"
4,"iti","_","_","iti","CQT","","_","_"
1,"un","_","_","ud","CADP","","_","_"
2,"mā","_","_","mat","PPR","","_","_"
3,"pītā","_","_","pā","PPP","","_","_"
4,"ayaṃsata","_","_","ya","V","ya","_","_"
5,"ratham","_","_","ratha","NC","","_","_"
6,"aśvā","_","_","aśva","NC","","_","_"
7,"_","_","_","iva","CCM","","_","_"
8,"_","_","_","āśu","JJ","","_","_"
1,"kuvit","_","_","kuvid","CX","","_","_"
2,"_","_","_","soma","NC","","_","_"
3,"_","_","_","pib","V","pā","_","_"
4,"iti","_","_","iti","CQT","","_","_"
1,"upa","_","_","upa","CADP","","_","_"
2,"mā","_","_","mat","PPR","","_","_"
3,"matir","_","_","mati","NC","","_","_"
4,"asthita","_","_","tiṣṭh","V","sthā","_","_"
5,"vāśrā","_","_","vāśrā","NC","","_","_"
6,"putram","_","_","putra","NC","","_","_"
7,"iva","_","_","iva","CCM","","_","_"
8,"priyam","_","_","priya","JJ","","_","_"
1,"kuvit","_","_","kuvid","CX","","_","_"
2,"_","_","_","soma","NC","","_","_"
3,"_","_","_","pib","V","pā","_","_"
4,"iti","_","_","iti","CQT","","_","_"
1,"ahaṃ","_","_","mat","PPR","","_","_"
2,"_","_","_","taṣṭṛ","NC","","_","_"
3,"_","_","_","iva","CCM","","_","_"
4,"vandhuram","_","_","vandhura","NC","","_","_"
5,"pary","_","_","pari","CADP","","_","_"
6,"acāmi","_","_","añc","V","añc","_","_"
7,"hṛdā","_","_","hṛd","NC","","_","_"
8,"matim","_","_","mati","NC","","_","_"
1,"kuvit","_","_","kuvid","CX","","_","_"
2,"_","_","_","soma","NC","","_","_"
3,"_","_","_","pib","V","pā","_","_"
4,"iti","_","_","iti","CQT","","_","_"
1,"nahi","_","_","nahi","CX","","_","_"
2,"me","_","_","mat","PPR","","_","_"
3,"akṣipac","_","_","akṣipat","CX","","_","_"
4,"_","_","_","cana","CX","","_","_"
5,"_","_","_","chand","V","chand","_","_"
6,"pañca","_","_","pañcan","NUM","","_","_"
7,"kṛṣṭayaḥ","_","_","kṛṣṭi","NC","","_","_"
1,"kuvit","_","_","kuvid","CX","","_","_"
2,"_","_","_","soma","NC","","_","_"
3,"_","_","_","pib","V","pā","_","_"
4,"iti","_","_","iti","CQT","","_","_"
1,"nahi","_","_","nahi","CX","","_","_"
2,"me","_","_","mat","PPR","","_","_"
3,"rodasī","_","_","rodas","NC","","_","_"
4,"ubhe","_","_","ubh","PPX","","_","_"
5,"anyam","_","_","anya","PPX","","_","_"
6,"pakṣaṃ","_","_","pakṣa","NC","","_","_"
7,"cana","_","_","cana","CX","","_","_"
8,"prati","_","_","prati","CADP","","_","_"
1,"kuvit","_","_","kuvid","CX","","_","_"
2,"_","_","_","soma","NC","","_","_"
3,"_","_","_","pib","V","pā","_","_"
4,"iti","_","_","iti","CQT","","_","_"
1,"abhi","_","_","abhi","CADP","","_","_"
2,"dyām","_","_","div","NC","","_","_"
3,"mahinā","_","_","mahina","NC","","_","_"
4,"bhuvam","_","_","bhav","V","bhū","_","_"
5,"_","_","_","abhi","CADP","","_","_"
6,"_","_","_","ida","PRD","","_","_"
7,"pṛthivīm","_","_","pṛthivī","NC","","_","_"
8,"mahīm","_","_","mah","JJ","","_","_"
1,"kuvit","_","_","kuvid","CX","","_","_"
2,"_","_","_","soma","NC","","_","_"
3,"_","_","_","pib","V","pā","_","_"
4,"iti","_","_","iti","CQT","","_","_"
1,"_","_","_","hanta","CX","","_","_"
2,"_","_","_","mat","PPR","","_","_"
3,"pṛthivīm","_","_","pṛthivī","NC","","_","_"
4,"imāṃ","_","_","ida","PRD","","_","_"
5,"ni","_","_","ni","CADP","","_","_"
6,"_","_","_","dadh","V","dhā","_","_"
7,"_","_","_","iha","CAD","","_","_"
8,"_","_","_","vā","CCD","","_","_"
9,"_","_","_","iha","CAD","","_","_"
10,"vā","_","_","vā","CCD","","_","_"
1,"kuvit","_","_","kuvid","CX","","_","_"
2,"_","_","_","soma","NC","","_","_"
3,"_","_","_","pib","V","pā","_","_"
4,"iti","_","_","iti","CQT","","_","_"
1,"oṣam","_","_","oṣa","CX","","_","_"
2,"it","_","_","id","CEM","","_","_"
3,"pṛthivīm","_","_","pṛthivī","NC","","_","_"
4,"ahaṃ","_","_","mat","PPR","","_","_"
5,"_","_","_","jaṅghan","V","jaṅghan","_","_"
6,"_","_","_","iha","CAD","","_","_"
7,"_","_","_","vā","CCD","","_","_"
8,"_","_","_","iha","CAD","","_","_"
9,"vā","_","_","vā","CCD","","_","_"
1,"kuvit","_","_","kuvid","CX","","_","_"
2,"_","_","_","soma","NC","","_","_"
3,"_","_","_","pib","V","pā","_","_"
4,"iti","_","_","iti","CQT","","_","_"
1,"divi","_","_","div","NC","","_","_"
2,"me","_","_","mat","PPR","","_","_"
3,"anyaḥ","_","_","anya","PPX","","_","_"
4,"pakṣo","_","_","pakṣa","NC","","_","_"
5,"'dho","_","_","adhas","CX","","_","_"
6,"anyam","_","_","anya","PPX","","_","_"
7,"acīkṛṣam","_","_","kṛṣ","V","kṛṣ","_","_"
1,"kuvit","_","_","kuvid","CX","","_","_"
2,"_","_","_","soma","NC","","_","_"
3,"_","_","_","pib","V","pā","_","_"
4,"iti","_","_","iti","CQT","","_","_"
1,"aham","_","_","mat","PPR","","_","_"
2,"asmi","_","_","as","V","as","_","_"
3,"_","_","_","mahat","JJ","","_","_"
4,"_","_","_","maha","JJ","","_","_"
5,"'bhinabhyam","_","_","abhinabhya","CX","","_","_"
6,"udīṣitaḥ","_","_","udīṣ","PPP","","_","_"
1,"kuvit","_","_","kuvid","CX","","_","_"
2,"_","_","_","soma","NC","","_","_"
3,"_","_","_","pib","V","pā","_","_"
4,"iti","_","_","iti","CQT","","_","_"
1,"gṛho","_","_","gṛha","NC","","_","_"
2,"yāmy","_","_","yā","V","yā","_","_"
3,"araṃkṛto","_","_","alaṃkṛ","PPP","","_","_"
4,"devebhyo","_","_","deva","NC","","_","_"
5,"_","_","_","havya","NC","","_","_"
6,"_","_","_","vāhana","JJ","","_","_"
1,"kuvit","_","_","kuvid","CX","","_","_"
2,"_","_","_","soma","NC","","_","_"
3,"_","_","_","pib","V","pā","_","_"
4,"iti","_","_","iti","CQT","","_","_"
