"WordID","word","NormSTEM","suffix","lemma","PoS","Root","NormSuffix","NormWord"
1,"yo","_","_","yad","PRL","","_","_"
2,"_","_","_","adri","NC","","_","_"
3,"_","_","_","bhid","JJ","","_","_"
4,"_","_","_","prathama","JJ","","_","_"
5,"_","_","_","jā","JJ","","_","_"
6,"ṛtāvā","_","_","ṛtāvan","JJ","","_","_"
7,"bṛhaspatir","_","_","bṛhaspati","NC","","_","_"
8,"āṅgiraso","_","_","āṅgirasa","NC","","_","_"
9,"haviṣmān","_","_","haviṣmat","JJ","","_","_"
1,"dvibarhajmā","_","_","dvibarhajman","JJ","","_","_"
2,"prāgharmasat","_","_","prāgharmasad","JJ","","_","_"
3,"pitā","_","_","pitṛ","NC","","_","_"
4,"na","_","_","mat","PPR","","_","_"
5,"ā","_","_","ā","CADP","","_","_"
6,"rodasī","_","_","rodas","NC","","_","_"
7,"vṛṣabho","_","_","vṛṣabha","NC","","_","_"
8,"roravīti","_","_","roro","V","roro","_","_"
1,"janāya","_","_","jana","NC","","_","_"
2,"cid","_","_","cit","CEM","","_","_"
3,"ya","_","_","yad","PRL","","_","_"
4,"īvata","_","_","īvat","JJ","","_","_"
5,"u","_","_","u","CEM","","_","_"
6,"lokam","_","_","loka","NC","","_","_"
7,"bṛhaspatir","_","_","bṛhaspati","NC","","_","_"
8,"_","_","_","deva","NC","","_","_"
9,"_","_","_","hūti","NC","","_","_"
10,"cakāra","_","_","kar","V","kṛ","_","_"
1,"ghnan","_","_","han","KDP","","_","_"
2,"vṛtrāṇi","_","_","vṛtra","NC","","_","_"
3,"vi","_","_","vi","CADP","","_","_"
4,"puro","_","_","pur","NC","","_","_"
5,"dardarīti","_","_","dardar","V","dardar","_","_"
6,"_","_","_","ji","KDP","","_","_"
7,"_","_","_","śatru","NC","","_","_"
8,"amitrān","_","_","amitra","NC","","_","_"
9,"pṛtsu","_","_","pṛt","NC","","_","_"
10,"sāhan","_","_","sah","KDP","","_","_"
1,"bṛhaspatiḥ","_","_","bṛhaspati","NC","","_","_"
2,"sam","_","_","sa","CADP","","_","_"
3,"ajayad","_","_","jay","V","ji","_","_"
4,"vasūni","_","_","vasu","NC","","_","_"
5,"maho","_","_","mah","JJ","","_","_"
6,"vrajān","_","_","vraja","NC","","_","_"
7,"gomato","_","_","gomat","JJ","","_","_"
8,"deva","_","_","deva","NC","","_","_"
9,"eṣaḥ","_","_","tad","PRD","","_","_"
1,"apaḥ","_","_","ap","NC","","_","_"
2,"siṣāsan","_","_","siṣās","KDP","","_","_"
3,"svar","_","_","svar","NC","","_","_"
4,"apratīto","_","_","apratīta","JJ","","_","_"
5,"bṛhaspatir","_","_","bṛhaspati","NC","","_","_"
6,"hanty","_","_","han","V","han","_","_"
7,"amitram","_","_","amitra","NC","","_","_"
8,"arkaiḥ","_","_","arka","NC","","_","_"
