"WordID","word","NormSTEM","suffix","lemma","PoS","Root","NormSuffix","NormWord"
1,"mama","_","_","mat","PPR","","_","_"
2,"dvitā","_","_","dvitā","CX","","_","_"
3,"rāṣṭraṃ","_","_","rāṣṭra","NC","","_","_"
4,"kṣatriyasya","_","_","kṣatriya","NC","","_","_"
5,"viśvāyor","_","_","viśvāyu","JJ","","_","_"
6,"viśve","_","_","viśva","JQ","","_","_"
7,"amṛtā","_","_","amṛta","JJ","","_","_"
8,"yathā","_","_","yathā","CCM","","_","_"
9,"naḥ","_","_","mat","PPR","","_","_"
1,"kratuṃ","_","_","kratu","NC","","_","_"
2,"sacante","_","_","sac","V","sac","_","_"
3,"varuṇasya","_","_","varuṇa","NC","","_","_"
4,"devā","_","_","deva","NC","","_","_"
5,"rājāmi","_","_","rāj","V","rāj","_","_"
6,"kṛṣṭer","_","_","kṛṣṭi","NC","","_","_"
7,"upamasya","_","_","upama","JJ","","_","_"
8,"vavreḥ","_","_","vavri","NC","","_","_"
1,"ahaṃ","_","_","mat","PPR","","_","_"
2,"rājā","_","_","rājan","NC","","_","_"
3,"varuṇo","_","_","varuṇa","NC","","_","_"
4,"mahyaṃ","_","_","mat","PPR","","_","_"
5,"tāny","_","_","tad","PRD","","_","_"
6,"asuryāṇi","_","_","asurya","NC","","_","_"
7,"prathamā","_","_","prathama","JJ","","_","_"
8,"dhārayanta","_","_","dhāray","V","dhāray","_","_"
1,"kratuṃ","_","_","kratu","NC","","_","_"
2,"sacante","_","_","sac","V","sac","_","_"
3,"varuṇasya","_","_","varuṇa","NC","","_","_"
4,"devā","_","_","deva","NC","","_","_"
5,"rājāmi","_","_","rāj","V","rāj","_","_"
6,"kṛṣṭer","_","_","kṛṣṭi","NC","","_","_"
7,"upamasya","_","_","upama","JJ","","_","_"
8,"vavreḥ","_","_","vavri","NC","","_","_"
1,"aham","_","_","mat","PPR","","_","_"
2,"indro","_","_","indra","NC","","_","_"
3,"varuṇas","_","_","varuṇa","NC","","_","_"
4,"te","_","_","tad","PRD","","_","_"
5,"_","_","_","mahitva","NC","","_","_"
6,"_","_","_","uru","JJ","","_","_"
7,"gabhīre","_","_","gabhīra","JJ","","_","_"
8,"rajasī","_","_","rajas","NC","","_","_"
9,"sumeke","_","_","sumeka","JJ","","_","_"
1,"_","_","_","tvaṣṭṛ","NC","","_","_"
2,"_","_","_","iva","CCM","","_","_"
3,"viśvā","_","_","viśva","JQ","","_","_"
4,"bhuvanāni","_","_","bhuvana","NC","","_","_"
5,"vidvān","_","_","vid","KDP","","_","_"
6,"sam","_","_","sa","CADP","","_","_"
7,"airayaṃ","_","_","īray","V","īray","_","_"
8,"rodasī","_","_","rodas","NC","","_","_"
9,"dhārayaṃ","_","_","dhāray","V","dhāray","_","_"
10,"ca","_","_","ca","CCD","","_","_"
1,"aham","_","_","mat","PPR","","_","_"
2,"apo","_","_","ap","NC","","_","_"
3,"apinvam","_","_","pinv","V","pinv","_","_"
4,"ukṣamāṇā","_","_","vakṣ","KDP","","_","_"
5,"dhārayaṃ","_","_","dhāray","V","dhāray","_","_"
6,"divaṃ","_","_","div","NC","","_","_"
7,"sadana","_","_","sadana","NC","","_","_"
8,"ṛtasya","_","_","ṛta","NC","","_","_"
1,"ṛtena","_","_","ṛta","NC","","_","_"
2,"putro","_","_","putra","NC","","_","_"
3,"aditer","_","_","aditi","NC","","_","_"
4,"_","_","_","ṛtāvan","JJ","","_","_"
5,"_","_","_","uta","CCD","","_","_"
6,"tridhātu","_","_","tridhātu","NC","","_","_"
7,"prathayad","_","_","prathay","V","prathay","_","_"
8,"vi","_","_","vi","CADP","","_","_"
9,"bhūma","_","_","bhūman","NC","","_","_"
1,"māṃ","_","_","mat","PPR","","_","_"
2,"naraḥ","_","_","nṛ","NC","","_","_"
3,"_","_","_","su","CAD","","_","_"
4,"_","_","_","aśva","NC","","_","_"
5,"vājayanto","_","_","vājay","KDP","","_","_"
6,"māṃ","_","_","mat","PPR","","_","_"
7,"vṛtāḥ","_","_","vṛ","PPP","","_","_"
8,"samaraṇe","_","_","samaraṇa","NC","","_","_"
9,"havante","_","_","hve","V","hve","_","_"
1,"kṛṇomy","_","_","kar","V","kṛ","_","_"
2,"ājim","_","_","āji","NC","","_","_"
3,"_","_","_","maghavan","NC","","_","_"
4,"_","_","_","mat","PPR","","_","_"
5,"indra","_","_","indra","NC","","_","_"
6,"iyarmi","_","_","ṛch","V","ṛch","_","_"
7,"reṇum","_","_","reṇu","NC","","_","_"
8,"_","_","_","abhibhūti","JJ","","_","_"
9,"_","_","_","ojas","NC","","_","_"
1,"ahaṃ","_","_","mat","PPR","","_","_"
2,"tā","_","_","tad","PRD","","_","_"
3,"viśvā","_","_","viśva","JQ","","_","_"
4,"cakaraṃ","_","_","kar","V","kṛ","_","_"
5,"nakir","_","_","nakir","CX","","_","_"
6,"mā","_","_","mat","PPR","","_","_"
7,"daivyaṃ","_","_","daivya","JJ","","_","_"
8,"saho","_","_","sahas","NC","","_","_"
9,"varate","_","_","vṛ","V","vṛ","_","_"
10,"apratītam","_","_","apratīta","JJ","","_","_"
1,"yan","_","_","yat","CSB","","_","_"
2,"mā","_","_","mat","PPR","","_","_"
3,"somāso","_","_","soma","NC","","_","_"
4,"mamadan","_","_","mat","V","mat","_","_"
5,"yad","_","_","yat","CSB","","_","_"
6,"_","_","_","uktha","NC","","_","_"
7,"_","_","_","ubh","PPX","","_","_"
8,"bhayete","_","_","bhī","V","bhī","_","_"
9,"rajasī","_","_","rajas","NC","","_","_"
10,"apāre","_","_","apāra","JJ","","_","_"
1,"viduṣ","_","_","vid","V","vid","_","_"
2,"ṭe","_","_","tvat","PPR","","_","_"
3,"viśvā","_","_","viśva","JQ","","_","_"
4,"bhuvanāni","_","_","bhuvana","NC","","_","_"
5,"tasya","_","_","tad","PRD","","_","_"
6,"tā","_","_","tad","PRD","","_","_"
7,"pra","_","_","pra","CADP","","_","_"
8,"bravīṣi","_","_","abravīta","V","brū","_","_"
9,"varuṇāya","_","_","varuṇa","NC","","_","_"
10,"vedhaḥ","_","_","vedhas","NC","","_","_"
1,"tvaṃ","_","_","tvat","PPR","","_","_"
2,"vṛtrāṇi","_","_","vṛtra","NC","","_","_"
3,"śṛṇviṣe","_","_","śṛṇ","V","śru","_","_"
4,"jaghanvān","_","_","han","KDP","","_","_"
5,"tvaṃ","_","_","tvat","PPR","","_","_"
6,"vṛtāṁ","_","_","vṛ","PPP","","_","_"
7,"ariṇā","_","_","ri","V","ri","_","_"
8,"indra","_","_","indra","NC","","_","_"
9,"sindhūn","_","_","sindhu","NC","","_","_"
1,"asmākam","_","_","mat","PPR","","_","_"
2,"atra","_","_","atra","CAD","","_","_"
3,"pitaras","_","_","pitṛ","NC","","_","_"
4,"ta","_","_","tad","PRD","","_","_"
5,"āsan","_","_","as","V","as","_","_"
6,"sapta","_","_","saptan","NUM","","_","_"
7,"ṛṣayo","_","_","ṛṣi","NC","","_","_"
8,"daurgahe","_","_","daurgaha","NC","","_","_"
9,"badhyamāne","_","_","bandh","KDP","","_","_"
1,"ta","_","_","tad","PRD","","_","_"
2,"āyajanta","_","_","āyaja","V","āyaj","_","_"
3,"trasadasyum","_","_","trasadasyu","NC","","_","_"
4,"asyā","_","_","ida","PRD","","_","_"
5,"indraṃ","_","_","indra","NC","","_","_"
6,"na","_","_","na","CNG","","_","_"
7,"_","_","_","vṛtra","NC","","_","_"
8,"_","_","_","tura","JJ","","_","_"
9,"_","_","_","ardha","JJ","","_","_"
10,"_","_","_","deva","NC","","_","_"
1,"purukutsānī","_","_","purukutsānī","NC","","_","_"
2,"hi","_","_","hi","CX","","_","_"
3,"vām","_","_","tvat","PPR","","_","_"
4,"_","_","_","dāś","V","dāś","_","_"
5,"_","_","_","havya","NC","","_","_"
6,"indrāvaruṇā","_","_","indrāvaruṇa","NC","","_","_"
7,"namobhiḥ","_","_","namas","NC","","_","_"
1,"athā","_","_","atha","CAD","","_","_"
2,"rājānaṃ","_","_","rājan","NC","","_","_"
3,"trasadasyum","_","_","trasadasyu","NC","","_","_"
4,"asyā","_","_","ida","PRD","","_","_"
5,"_","_","_","vṛtra","NC","","_","_"
6,"_","_","_","han","JJ","","_","_"
7,"dadathur","_","_","dad","V","dā","_","_"
8,"_","_","_","ardha","JJ","","_","_"
9,"_","_","_","deva","NC","","_","_"
1,"rāyā","_","_","rai","NC","","_","_"
2,"vayaṃ","_","_","mat","PPR","","_","_"
3,"sasavāṃso","_","_","san","KDP","","_","_"
4,"madema","_","_","mand","V","mand","_","_"
5,"havyena","_","_","havya","NC","","_","_"
6,"devā","_","_","deva","NC","","_","_"
7,"yavasena","_","_","yavasa","NC","","_","_"
8,"gāvaḥ","_","_","go","NC","","_","_"
1,"tāṃ","_","_","tad","PRD","","_","_"
2,"dhenum","_","_","dhenu","NC","","_","_"
3,"indrāvaruṇā","_","_","indrāvaruṇa","NC","","_","_"
4,"yuvaṃ","_","_","tvat","PPR","","_","_"
5,"no","_","_","mat","PPR","","_","_"
6,"viśvāhā","_","_","viśvāhā","CX","","_","_"
7,"dhattam","_","_","dadh","V","dhā","_","_"
8,"_","_","_","an","CX","","_","_"
9,"_","_","_","apasphur","KDP","","_","_"
