"WordID","word","NormSTEM","suffix","lemma","PoS","Root","NormSuffix","NormWord"
1,"bhīṣma","_","_","bhīṣma","NC","","_","_"
2,"uvāca","_","_","vak","V","vac","_","_"
1,"tataḥ","_","_","tatas","CX","","_","_"
2,"sa","_","_","tad","PRD","","_","_"
3,"bhagavān","_","_","bhagavat","NC","","_","_"
4,"devo","_","_","deva","NC","","_","_"
5,"lokānāṃ","_","_","loka","NC","","_","_"
6,"parameśvaraḥ","_","_","parameśvara","NC","","_","_"
1,"brahmāṇaṃ","_","_","brahman","NC","","_","_"
2,"_","_","_","prativak","V","prativac","_","_"
3,"_","_","_","ida","PRD","","_","_"
4,"_","_","_","snigdha","JJ","","_","_"
5,"_","_","_","gambhīra","JJ","","_","_"
6,"girā","_","_","gir","NC","","_","_"
1,"viditaṃ","_","_","vid","PPP","","_","_"
2,"tāta","_","_","tāta","NC","","_","_"
3,"_","_","_","yoga","NC","","_","_"
4,"_","_","_","mat","PPR","","_","_"
5,"sarvam","_","_","sarva","JQ","","_","_"
6,"etat","_","_","tad","PRD","","_","_"
7,"_","_","_","tvat","PPR","","_","_"
8,"_","_","_","īpsay","PPP","","_","_"
1,"tathā","_","_","tathā","CX","","_","_"
2,"tad","_","_","tad","PRD","","_","_"
3,"_","_","_","bhav","V","bhū","_","_"
4,"_","_","_","iti","CQT","","_","_"
5,"_","_","_","vac","CGDA","","_","_"
6,"_","_","_","tatra","CAD","","_","_"
7,"_","_","_","eva","CEM","","_","_"
8,"_","_","_","antardhā","V","antardhā","_","_"
1,"tato","_","_","tatas","CX","","_","_"
2,"_","_","_","deva","NC","","_","_"
3,"_","_","_","ṛṣi","NC","","_","_"
4,"_","_","_","gandharva","NC","","_","_"
5,"vismayaṃ","_","_","vismaya","NC","","_","_"
6,"paramaṃ","_","_","parama","JJ","","_","_"
7,"gatāḥ","_","_","ga","PPP","","_","_"
1,"_","_","_","kautūhala","NC","","_","_"
2,"_","_","_","para","PPX","","_","_"
3,"sarve","_","_","sarva","JQ","","_","_"
4,"pitāmaham","_","_","pitāmaha","NC","","_","_"
5,"_","_","_","atha","CAD","","_","_"
6,"_","_","_","abravīta","V","brū","_","_"
1,"ko","_","_","kiṃ","PRQ","","_","_"
2,"_","_","_","nu","CX","","_","_"
3,"_","_","_","ida","PRD","","_","_"
4,"yo","_","_","yad","PRL","","_","_"
5,"bhagavatā","_","_","bhagavat","JJ","","_","_"
6,"praṇamya","_","_","praṇa","CGDA","","_","_"
7,"vinayād","_","_","vinaya","NC","","_","_"
8,"vibho","_","_","vibhu","JJ","","_","_"
1,"vāgbhiḥ","_","_","vāc","NC","","_","_"
2,"stuto","_","_","stu","PPP","","_","_"
3,"variṣṭhābhiḥ","_","_","variṣṭha","JJ","","_","_"
4,"śrotum","_","_","śru","CGDI","","_","_"
5,"icchāma","_","_","iṣ","V","iṣ","_","_"
6,"taṃ","_","_","tad","PRD","","_","_"
7,"vayam","_","_","mat","PPR","","_","_"
1,"evam","_","_","eva","CX","","_","_"
2,"_","_","_","vac","PPP","","_","_"
3,"_","_","_","tu","CCD","","_","_"
4,"bhagavān","_","_","bhagavat","JJ","","_","_"
5,"pratyuvāca","_","_","prativak","V","prativac","_","_"
6,"pitāmahaḥ","_","_","pitāmaha","NC","","_","_"
1,"_","_","_","deva","NC","","_","_"
2,"_","_","_","brahman","NC","","_","_"
3,"_","_","_","ṛṣi","NC","","_","_"
4,"_","_","_","gandharva","NC","","_","_"
5,"_","_","_","sarva","JQ","","_","_"
6,"_","_","_","madhura","JJ","","_","_"
7,"girā","_","_","gir","NC","","_","_"
1,"yat","_","_","yad","PRL","","_","_"
2,"_","_","_","tad","PRD","","_","_"
3,"_","_","_","para","PPX","","_","_"
4,"bhaviṣyaṃ","_","_","bhaviṣya","JJ","","_","_"
5,"ca","_","_","ca","CCD","","_","_"
6,"bhavitavyaṃ","_","_","bhū","KDG","","_","_"
7,"ca","_","_","ca","CCD","","_","_"
8,"yat","_","_","yad","PRL","","_","_"
9,"param","_","_","para","PPX","","_","_"
1,"bhūtātmā","_","_","bhūtātman","NC","","_","_"
2,"yaḥ","_","_","yad","PRL","","_","_"
3,"_","_","_","prabhu","NC","","_","_"
4,"_","_","_","ca","CCD","","_","_"
5,"_","_","_","eva","CEM","","_","_"
6,"brahma","_","_","brahman","NC","","_","_"
7,"_","_","_","yad","PRL","","_","_"
8,"_","_","_","ca","CCD","","_","_"
9,"paraṃ","_","_","para","PPX","","_","_"
10,"padam","_","_","pada","NC","","_","_"
1,"_","_","_","tad","PRD","","_","_"
2,"_","_","_","as","V","as","_","_"
3,"_","_","_","kṛ","PPP","","_","_"
4,"_","_","_","saṃvāda","NC","","_","_"
5,"prasannena","_","_","prasad","PPP","","_","_"
6,"_","_","_","sura","NC","","_","_"
7,"_","_","_","ṛṣabha","NC","","_","_"
1,"jagato","_","_","jagat","NC","","_","_"
2,"_","_","_","anugraha","NC","","_","_"
3,"_","_","_","artha","NC","","_","_"
4,"yācito","_","_","yāc","PPP","","_","_"
5,"me","_","_","mat","PPR","","_","_"
6,"jagatpatiḥ","_","_","jagatpati","NC","","_","_"
1,"mānuṣaṃ","_","_","mānuṣa","JJ","","_","_"
2,"lokam","_","_","loka","NC","","_","_"
3,"ātiṣṭha","_","_","ātiṣṭh","V","āsthā","_","_"
4,"vāsudeva","_","_","vāsudeva","NC","","_","_"
5,"iti","_","_","iti","CQT","","_","_"
6,"śrutaḥ","_","_","śru","PPP","","_","_"
1,"asurāṇāṃ","_","_","asura","NC","","_","_"
2,"_","_","_","vadha","NC","","_","_"
3,"_","_","_","artha","NC","","_","_"
4,"saṃbhavasva","_","_","sambhav","V","sambhū","_","_"
5,"_","_","_","mahī","NC","","_","_"
6,"_","_","_","tala","NC","","_","_"
1,"saṃgrāme","_","_","saṃgrāma","NC","","_","_"
2,"nihatā","_","_","nihan","PPP","","_","_"
3,"ye","_","_","yad","PRL","","_","_"
4,"te","_","_","tad","PRD","","_","_"
5,"_","_","_","daitya","NC","","_","_"
6,"_","_","_","dānava","NC","","_","_"
7,"_","_","_","rākṣasa","NC","","_","_"
1,"ta","_","_","tad","PRD","","_","_"
2,"ime","_","_","ida","PRD","","_","_"
3,"nṛṣu","_","_","nṛ","NC","","_","_"
4,"sambhūtā","_","_","sambhū","PPP","","_","_"
5,"_","_","_","ghora","JJ","","_","_"
6,"_","_","_","rūpa","NC","","_","_"
7,"_","_","_","mahat","JJ","","_","_"
8,"_","_","_","bala","NC","","_","_"
1,"teṣāṃ","_","_","tad","PRD","","_","_"
2,"_","_","_","vadha","NC","","_","_"
3,"_","_","_","artha","NC","","_","_"
4,"_","_","_","bhagavat","NC","","_","_"
5,"_","_","_","nara","NC","","_","_"
6,"sahito","_","_","sahita","JJ","","_","_"
7,"vaśī","_","_","vaśin","JJ","","_","_"
1,"mānuṣīṃ","_","_","mānuṣa","JJ","","_","_"
2,"yonim","_","_","yoni","NC","","_","_"
3,"āsthāya","_","_","āsthā","CGDA","","_","_"
4,"cariṣyati","_","_","car","V","car","_","_"
5,"_","_","_","mahī","NC","","_","_"
6,"_","_","_","tala","NC","","_","_"
1,"_","_","_","nara","NC","","_","_"
2,"_","_","_","nārāyaṇa","NC","","_","_"
3,"yau","_","_","yad","PRL","","_","_"
4,"tau","_","_","tad","PRD","","_","_"
5,"purāṇāv","_","_","purāṇa","JJ","","_","_"
6,"_","_","_","ṛṣi","NC","","_","_"
7,"_","_","_","sattama","JJ","","_","_"
1,"sahitau","_","_","sahita","JJ","","_","_"
2,"mānuṣe","_","_","mānuṣa","JJ","","_","_"
3,"loke","_","_","loka","NC","","_","_"
4,"_","_","_","sambhū","PPP","","_","_"
5,"_","_","_","amita","JJ","","_","_"
6,"_","_","_","dyuti","NC","","_","_"
1,"ajeyau","_","_","ajeya","JJ","","_","_"
2,"samare","_","_","samara","NC","","_","_"
3,"yattau","_","_","yat","PPP","","_","_"
4,"_","_","_","sahita","JJ","","_","_"
5,"_","_","_","amara","NC","","_","_"
6,"api","_","_","api","CX","","_","_"
1,"_","_","_","muh","PPP","","_","_"
2,"_","_","_","tu","CCD","","_","_"
3,"_","_","_","tad","PRD","","_","_"
4,"na","_","_","na","CNG","","_","_"
5,"jānanti","_","_","jān","V","jñā","_","_"
6,"_","_","_","nara","NC","","_","_"
7,"_","_","_","nārāyaṇa","NC","","_","_"
8,"ṛṣī","_","_","ṛṣi","NC","","_","_"
1,"_","_","_","tad","PRD","","_","_"
2,"_","_","_","mat","PPR","","_","_"
3,"ātmajo","_","_","ātmaja","NC","","_","_"
4,"brahmā","_","_","brahman","NC","","_","_"
5,"sarvasya","_","_","sarva","JQ","","_","_"
6,"jagataḥ","_","_","jagat","NC","","_","_"
7,"patiḥ","_","_","pati","NC","","_","_"
1,"vāsudevo","_","_","vāsudeva","NC","","_","_"
2,"'rcanīyo","_","_","arc","KDG","","_","_"
3,"vaḥ","_","_","tvat","PPR","","_","_"
4,"_","_","_","sarva","JQ","","_","_"
5,"_","_","_","loka","NC","","_","_"
6,"_","_","_","maheśvara","NC","","_","_"
1,"tathā","_","_","tathā","CX","","_","_"
2,"manuṣyo","_","_","manuṣya","NC","","_","_"
3,"'yam","_","_","ida","PRD","","_","_"
4,"iti","_","_","iti","CQT","","_","_"
5,"kadācit","_","_","kadācid","CX","","_","_"
6,"_","_","_","sura","NC","","_","_"
7,"_","_","_","sattama","JJ","","_","_"
1,"_","_","_","na","CNG","","_","_"
2,"_","_","_","avajñā","KDG","","_","_"
3,"_","_","_","mahat","JJ","","_","_"
4,"_","_","_","vīrya","NC","","_","_"
5,"_","_","_","śaṅkha","NC","","_","_"
6,"_","_","_","cakra","NC","","_","_"
7,"_","_","_","gadā","NC","","_","_"
8,"_","_","_","dhara","JJ","","_","_"
1,"etat","_","_","tad","PRD","","_","_"
2,"paramakaṃ","_","_","paramaka","JJ","","_","_"
3,"guhyam","_","_","guhya","NC","","_","_"
4,"etat","_","_","tad","PRD","","_","_"
5,"paramakaṃ","_","_","paramaka","JJ","","_","_"
6,"padam","_","_","pada","NC","","_","_"
1,"etat","_","_","tad","PRD","","_","_"
2,"paramakaṃ","_","_","paramaka","JJ","","_","_"
3,"brahma","_","_","brahman","NC","","_","_"
4,"etat","_","_","tad","PRD","","_","_"
5,"paramakaṃ","_","_","paramaka","JJ","","_","_"
6,"yaśaḥ","_","_","yaśas","NC","","_","_"
1,"etad","_","_","tad","PRD","","_","_"
2,"akṣaram","_","_","akṣara","JJ","","_","_"
3,"avyaktam","_","_","avyakta","JJ","","_","_"
4,"etat","_","_","tad","PRD","","_","_"
5,"_","_","_","tad","PRD","","_","_"
6,"_","_","_","śāśvata","JJ","","_","_"
7,"mahat","_","_","mahat","JJ","","_","_"
1,"etat","_","_","tad","PRD","","_","_"
2,"_","_","_","puruṣa","NC","","_","_"
3,"_","_","_","saṃjñā","NC","","_","_"
4,"vai","_","_","vai","CX","","_","_"
5,"gīyate","_","_","gāy","V","gai","_","_"
6,"jñāyate","_","_","jān","V","jñā","_","_"
7,"na","_","_","na","CNG","","_","_"
8,"ca","_","_","ca","CCD","","_","_"
1,"etat","_","_","tad","PRD","","_","_"
2,"paramakaṃ","_","_","paramaka","JJ","","_","_"
3,"teja","_","_","tejas","NC","","_","_"
4,"etat","_","_","tad","PRD","","_","_"
5,"paramakaṃ","_","_","paramaka","JJ","","_","_"
6,"sukham","_","_","sukha","NC","","_","_"
1,"etat","_","_","tad","PRD","","_","_"
2,"paramakaṃ","_","_","paramaka","JJ","","_","_"
3,"satyaṃ","_","_","satya","NC","","_","_"
4,"kīrtitaṃ","_","_","kīrtay","PPP","","_","_"
5,"viśvakarmaṇā","_","_","viśvakarman","NC","","_","_"
1,"tasmāt","_","_","tasmāt","CX","","_","_"
2,"sarvaiḥ","_","_","sarva","JQ","","_","_"
3,"suraiḥ","_","_","sura","NC","","_","_"
4,"_","_","_","sa_saha","CX","","_","_"
5,"_","_","_","indra","NC","","_","_"
6,"_","_","_","loka","NC","","_","_"
7,"_","_","_","ca","CCD","","_","_"
8,"_","_","_","amita","JJ","","_","_"
9,"_","_","_","vikrama","NC","","_","_"
1,"_","_","_","na","CNG","","_","_"
2,"_","_","_","avajñā","KDG","","_","_"
3,"vāsudevo","_","_","vāsudeva","NC","","_","_"
4,"mānuṣo","_","_","mānuṣa","NC","","_","_"
5,"'yam","_","_","ida","PRD","","_","_"
6,"iti","_","_","iti","CQT","","_","_"
7,"prabhuḥ","_","_","prabhu","NC","","_","_"
1,"_","_","_","yad","PRL","","_","_"
2,"_","_","_","ca","CCD","","_","_"
3,"_","_","_","mānuṣa","NC","","_","_"
4,"_","_","_","mātra","NC","","_","_"
5,"'yam","_","_","ida","PRD","","_","_"
6,"iti","_","_","iti","CQT","","_","_"
7,"brūyāt","_","_","abravīta","V","brū","_","_"
8,"_","_","_","su","CAD","","_","_"
9,"_","_","_","manda","JJ","","_","_"
10,"_","_","_","dhī","NC","","_","_"
1,"hṛṣīkeśam","_","_","hṛṣīkeśa","NC","","_","_"
2,"avajñānāt","_","_","avajñāna","NC","","_","_"
3,"tam","_","_","tad","PRD","","_","_"
4,"āhuḥ","_","_","ah","V","ah","_","_"
5,"_","_","_","puruṣa","NC","","_","_"
6,"_","_","_","adhama","JJ","","_","_"
1,"yoginaṃ","_","_","yogin","NC","","_","_"
2,"taṃ","_","_","tad","PRD","","_","_"
3,"mahātmānaṃ","_","_","mahātman","JJ","","_","_"
4,"praviṣṭaṃ","_","_","praviś","PPP","","_","_"
5,"mānuṣīṃ","_","_","mānuṣa","JJ","","_","_"
6,"tanum","_","_","tanu","NC","","_","_"
1,"avamanyed","_","_","avaman","V","avaman","_","_"
2,"vāsudevaṃ","_","_","vāsudeva","NC","","_","_"
3,"tam","_","_","tad","PRD","","_","_"
4,"_","_","_","ah","V","ah","_","_"
5,"_","_","_","tāmasa","JJ","","_","_"
6,"janāḥ","_","_","jana","NC","","_","_"
1,"devaṃ","_","_","deva","NC","","_","_"
2,"_","_","_","carācara","NC","","_","_"
3,"_","_","_","ātman","NC","","_","_"
4,"_","_","_","śrīvatsa","NC","","_","_"
5,"_","_","_","aṅka","NC","","_","_"
6,"_","_","_","su","CAD","","_","_"
7,"_","_","_","varcas","NC","","_","_"
1,"padmanābhaṃ","_","_","padmanābha","NC","","_","_"
2,"na","_","_","na","CNG","","_","_"
3,"jānāti","_","_","jān","V","jñā","_","_"
4,"tam","_","_","tad","PRD","","_","_"
5,"_","_","_","ah","V","ah","_","_"
6,"_","_","_","tāmasa","JJ","","_","_"
7,"janāḥ","_","_","jana","NC","","_","_"
1,"_","_","_","kirīṭa","NC","","_","_"
2,"_","_","_","kaustubha","NC","","_","_"
3,"_","_","_","dhara","JJ","","_","_"
4,"mitrāṇām","_","_","mitra","NC","","_","_"
5,"abhayaṃkaram","_","_","abhayaṃkara","JJ","","_","_"
1,"_","_","_","avajñā","KDP","","_","_"
2,"_","_","_","mahātman","JJ","","_","_"
3,"ghore","_","_","ghora","JJ","","_","_"
4,"tamasi","_","_","tamas","NC","","_","_"
5,"majjati","_","_","majj","V","majj","_","_"
1,"evaṃ","_","_","eva","CX","","_","_"
2,"viditvā","_","_","vid","CGDA","","_","_"
3,"_","_","_","tattva","NC","","_","_"
4,"_","_","_","artha","NC","","_","_"
5,"lokānām","_","_","loka","NC","","_","_"
6,"_","_","_","īśvara","NC","","_","_"
7,"_","_","_","īśvara","NC","","_","_"
1,"vāsudevo","_","_","vāsudeva","NC","","_","_"
2,"namaskāryaḥ","_","_","namaskṛ","KDG","","_","_"
3,"_","_","_","sarva","JQ","","_","_"
4,"_","_","_","loka","NC","","_","_"
5,"_","_","_","sura","NC","","_","_"
6,"_","_","_","uttama","JJ","","_","_"
1,"evam","_","_","eva","CX","","_","_"
2,"uktvā","_","_","vac","CGDA","","_","_"
3,"sa","_","_","tad","PRD","","_","_"
4,"bhagavān","_","_","bhagavat","NC","","_","_"
5,"sarvān","_","_","sarva","JQ","","_","_"
6,"_","_","_","deva","NC","","_","_"
7,"_","_","_","gaṇa","NC","","_","_"
8,"purā","_","_","purā","CX","","_","_"
1,"visṛjya","_","_","visṛj","CGDA","","_","_"
2,"_","_","_","sarva","JQ","","_","_"
3,"_","_","_","loka","NC","","_","_"
4,"_","_","_","ātman","NC","","_","_"
5,"jagāma","_","_","ga","V","ga","_","_"
6,"bhavanaṃ","_","_","bhavana","NC","","_","_"
7,"svakam","_","_","svaka","JJ","","_","_"
1,"tato","_","_","tatas","CX","","_","_"
2,"devāḥ","_","_","deva","NC","","_","_"
3,"_","_","_","sa_saha","CX","","_","_"
4,"_","_","_","gandharva","NC","","_","_"
5,"munayo","_","_","muni","NC","","_","_"
6,"'psaraso","_","_","apsaras","NC","","_","_"
7,"'pi","_","_","api","CX","","_","_"
8,"ca","_","_","ca","CCD","","_","_"
1,"kathāṃ","_","_","kathā","NC","","_","_"
2,"tāṃ","_","_","tad","PRD","","_","_"
3,"brahmaṇā","_","_","brahman","NC","","_","_"
4,"gītāṃ","_","_","gā","PPP","","_","_"
5,"śrutvā","_","_","śru","CGDA","","_","_"
6,"prītā","_","_","prī","PPP","","_","_"
7,"divaṃ","_","_","div","NC","","_","_"
8,"yayuḥ","_","_","yā","V","yā","_","_"
1,"_","_","_","tad","PRD","","_","_"
2,"_","_","_","śru","PPP","","_","_"
3,"mayā","_","_","mat","PPR","","_","_"
4,"tāta","_","_","tāta","NC","","_","_"
5,"ṛṣīṇāṃ","_","_","ṛṣi","NC","","_","_"
6,"bhāvitātmanām","_","_","bhāvitātman","JJ","","_","_"
1,"vāsudevaṃ","_","_","vāsudeva","NC","","_","_"
2,"kathayatāṃ","_","_","kathay","KDP","","_","_"
3,"samavāye","_","_","samavāya","NC","","_","_"
4,"purātanam","_","_","purātana","JJ","","_","_"
1,"jāmadagnyasya","_","_","jāmadagnya","NC","","_","_"
2,"rāmasya","_","_","rāma","NC","","_","_"
3,"mārkaṇḍeyasya","_","_","mārkaṇḍeya","NC","","_","_"
4,"dhīmataḥ","_","_","dhīmat","JJ","","_","_"
1,"_","_","_","vyāsa","NC","","_","_"
2,"_","_","_","nārada","NC","","_","_"
3,"_","_","_","ca","CCD","","_","_"
4,"_","_","_","api","CX","","_","_"
5,"śrutaṃ","_","_","śru","PPP","","_","_"
6,"_","_","_","śru","PPP","","_","_"
7,"_","_","_","viśārada","JJ","","_","_"
1,"etam","_","_","tad","PRD","","_","_"
2,"arthaṃ","_","_","artha","NC","","_","_"
3,"ca","_","_","ca","CCD","","_","_"
4,"vijñāya","_","_","vijñā","CGDA","","_","_"
5,"śrutvā","_","_","śru","CGDA","","_","_"
6,"ca","_","_","ca","CCD","","_","_"
7,"prabhum","_","_","prabhu","NC","","_","_"
8,"avyayam","_","_","avyaya","JJ","","_","_"
1,"vāsudevaṃ","_","_","vāsudeva","NC","","_","_"
2,"mahātmānaṃ","_","_","mahātman","JJ","","_","_"
3,"lokānām","_","_","loka","NC","","_","_"
4,"_","_","_","īśvara","NC","","_","_"
5,"_","_","_","īśvara","NC","","_","_"
1,"_","_","_","yad","PRL","","_","_"
2,"_","_","_","adas","PRD","","_","_"
3,"_","_","_","ātmaja","NC","","_","_"
4,"brahmā","_","_","brahman","NC","","_","_"
5,"sarvasya","_","_","sarva","JQ","","_","_"
6,"jagataḥ","_","_","jagat","NC","","_","_"
7,"pitā","_","_","pitṛ","NC","","_","_"
1,"kathaṃ","_","_","katha","CX","","_","_"
2,"na","_","_","na","CNG","","_","_"
3,"vāsudevo","_","_","vāsudeva","NC","","_","_"
4,"'yam","_","_","ida","PRD","","_","_"
5,"_","_","_","arc","KDG","","_","_"
6,"_","_","_","ca","CCD","","_","_"
7,"_","_","_","yaj","KDG","","_","_"
8,"_","_","_","ca","CCD","","_","_"
9,"mānavaiḥ","_","_","mānava","NC","","_","_"
1,"vārito","_","_","vāray","PPP","","_","_"
2,"'si","_","_","as","V","as","_","_"
3,"purā","_","_","purā","CX","","_","_"
4,"tāta","_","_","tāta","NC","","_","_"
5,"munibhir","_","_","muni","NC","","_","_"
6,"vedapāragaiḥ","_","_","vedapāraga","NC","","_","_"
1,"mā","_","_","mā","CNG","","_","_"
2,"gaccha","_","_","ga","V","ga","_","_"
3,"saṃyugaṃ","_","_","saṃyuga","NC","","_","_"
4,"tena","_","_","tad","PRD","","_","_"
5,"vāsudevena","_","_","vāsudeva","NC","","_","_"
6,"dhīmatā","_","_","dhīmat","JJ","","_","_"
1,"mā","_","_","mā","CNG","","_","_"
2,"pāṇḍavaiḥ","_","_","pāṇḍava","NC","","_","_"
3,"sārdham","_","_","sārdha","CX","","_","_"
4,"iti","_","_","iti","CQT","","_","_"
5,"_","_","_","tad","PRD","","_","_"
6,"_","_","_","ca","CCD","","_","_"
7,"_","_","_","moha","NC","","_","_"
8,"_","_","_","na","CNG","","_","_"
9,"budhyase","_","_","bodh","V","budh","_","_"
1,"manye","_","_","man","V","man","_","_"
2,"tvāṃ","_","_","tvat","PPR","","_","_"
3,"rākṣasaṃ","_","_","rākṣasa","NC","","_","_"
4,"krūraṃ","_","_","krūra","JJ","","_","_"
5,"tathā","_","_","tathā","CX","","_","_"
6,"_","_","_","ca","CCD","","_","_"
7,"_","_","_","as","V","as","_","_"
8,"_","_","_","tamas","NC","","_","_"
9,"_","_","_","vṛ","PPP","","_","_"
1,"yasmād","_","_","yasmāt","CX","","_","_"
2,"dviṣasi","_","_","dviṣ","V","dviṣ","_","_"
3,"govindaṃ","_","_","govinda","NC","","_","_"
4,"pāṇḍavaṃ","_","_","pāṇḍava","NC","","_","_"
5,"ca","_","_","ca","CCD","","_","_"
6,"dhanaṃjayam","_","_","dhanaṃjaya","NC","","_","_"
1,"_","_","_","nara","NC","","_","_"
2,"_","_","_","nārāyaṇa","NC","","_","_"
3,"devau","_","_","deva","NC","","_","_"
4,"_","_","_","na","CNG","","_","_"
5,"_","_","_","anya","PPX","","_","_"
6,"_","_","_","dviṣ","V","dviṣ","_","_"
7,"_","_","_","hi","CX","","_","_"
8,"mānavaḥ","_","_","mānava","NC","","_","_"
1,"tasmād","_","_","tasmāt","CX","","_","_"
2,"bravīmi","_","_","abravīta","V","brū","_","_"
3,"te","_","_","tvat","PPR","","_","_"
4,"rājann","_","_","rājan","NC","","_","_"
5,"eṣa","_","_","tad","PRD","","_","_"
6,"vai","_","_","vai","CX","","_","_"
7,"śāśvato","_","_","śāśvata","JJ","","_","_"
8,"'vyayaḥ","_","_","avyaya","JJ","","_","_"
1,"_","_","_","sarva","JQ","","_","_"
2,"_","_","_","loka","NC","","_","_"
3,"_","_","_","maya","JJ","","_","_"
4,"nityaḥ","_","_","nitya","JJ","","_","_"
5,"śāstā","_","_","śāstṛ","NC","","_","_"
6,"dhātā","_","_","dhātṛ","NC","","_","_"
7,"dharo","_","_","dhara","NC","","_","_"
8,"dhruvaḥ","_","_","dhruva","NC","","_","_"
1,"lokān","_","_","loka","NC","","_","_"
2,"dhārayate","_","_","dhar","V","dhṛ","_","_"
3,"_","_","_","yad","PRL","","_","_"
4,"_","_","_","tri","NUM","","_","_"
5,"_","_","_","carācara","NC","","_","_"
6,"_","_","_","guru","NC","","_","_"
7,"prabhuḥ","_","_","prabhu","NC","","_","_"
1,"yoddhā","_","_","yoddhṛ","NC","","_","_"
2,"_","_","_","jaya","NC","","_","_"
3,"_","_","_","ca","CCD","","_","_"
4,"jetā","_","_","jetṛ","JJ","","_","_"
5,"ca","_","_","ca","CCD","","_","_"
6,"_","_","_","sarva","JQ","","_","_"
7,"_","_","_","prakṛti","NC","","_","_"
8,"īśvaraḥ","_","_","īśvara","NC","","_","_"
1,"rājan","_","_","rājan","NC","","_","_"
2,"_","_","_","sattva","NC","","_","_"
3,"_","_","_","maya","JJ","","_","_"
4,"_","_","_","hi","CX","","_","_"
5,"_","_","_","tad","PRD","","_","_"
6,"_","_","_","tamas","NC","","_","_"
7,"_","_","_","rāga","NC","","_","_"
8,"_","_","_","vivarjay","PPP","","_","_"
1,"yataḥ","_","_","yatas","CX","","_","_"
2,"_","_","_","kṛṣṇa","NC","","_","_"
3,"_","_","_","tatas","CX","","_","_"
4,"dharmo","_","_","dharma","NC","","_","_"
5,"yato","_","_","yatas","CX","","_","_"
6,"_","_","_","dharma","NC","","_","_"
7,"_","_","_","tatas","CX","","_","_"
8,"jayaḥ","_","_","jaya","NC","","_","_"
1,"tasya","_","_","tad","PRD","","_","_"
2,"_","_","_","māhātmya","NC","","_","_"
3,"_","_","_","yoga","NC","","_","_"
4,"_","_","_","yoga","NC","","_","_"
5,"_","_","_","ātman","NC","","_","_"
6,"eva","_","_","eva","CEM","","_","_"
7,"ca","_","_","ca","CCD","","_","_"
1,"dhṛtāḥ","_","_","dhṛ","PPP","","_","_"
2,"_","_","_","pāṇḍu","NC","","_","_"
3,"_","_","_","suta","NC","","_","_"
4,"rājañ","_","_","rājan","NC","","_","_"
5,"_","_","_","jaya","NC","","_","_"
6,"_","_","_","ca","CCD","","_","_"
7,"_","_","_","ida","PRD","","_","_"
8,"bhaviṣyati","_","_","bhav","V","bhū","_","_"
1,"_","_","_","śreyas","NC","","_","_"
2,"_","_","_","yuj","PPP","","_","_"
3,"sadā","_","_","sadā","CAD","","_","_"
4,"buddhiṃ","_","_","buddhi","NC","","_","_"
5,"pāṇḍavānāṃ","_","_","pāṇḍava","NC","","_","_"
6,"dadhāti","_","_","dadh","V","dhā","_","_"
7,"yaḥ","_","_","yad","PRL","","_","_"
1,"balaṃ","_","_","bala","NC","","_","_"
2,"_","_","_","ca","CCD","","_","_"
3,"_","_","_","eva","CEM","","_","_"
4,"raṇe","_","_","raṇa","NC","","_","_"
5,"nityaṃ","_","_","nitya","CX","","_","_"
6,"_","_","_","bhaya","NC","","_","_"
7,"_","_","_","ca","CCD","","_","_"
8,"_","_","_","eva","CEM","","_","_"
9,"rakṣati","_","_","rakṣ","V","rakṣ","_","_"
1,"sa","_","_","tad","PRD","","_","_"
2,"eṣa","_","_","tad","PRD","","_","_"
3,"śāśvato","_","_","śāśvata","JJ","","_","_"
4,"devaḥ","_","_","deva","NC","","_","_"
5,"_","_","_","sarva","JQ","","_","_"
6,"_","_","_","guhya","NC","","_","_"
7,"_","_","_","maya","JJ","","_","_"
8,"śivaḥ","_","_","śiva","JJ","","_","_"
1,"vāsudeva","_","_","vāsudeva","NC","","_","_"
2,"iti","_","_","iti","CQT","","_","_"
3,"jñeyo","_","_","jñā","KDG","","_","_"
4,"_","_","_","yad","PRL","","_","_"
5,"_","_","_","mat","PPR","","_","_"
6,"pṛcchasi","_","_","pṛcch","V","prach","_","_"
7,"bhārata","_","_","bhārata","NC","","_","_"
1,"brāhmaṇaiḥ","_","_","brāhmaṇa","NC","","_","_"
2,"kṣatriyair","_","_","kṣatriya","NC","","_","_"
3,"vaiśyaiḥ","_","_","vaiśya","NC","","_","_"
4,"_","_","_","śūdra","NC","","_","_"
5,"_","_","_","ca","CCD","","_","_"
6,"_","_","_","kṛ","PPP","","_","_"
7,"_","_","_","lakṣaṇa","NC","","_","_"
1,"sevyate","_","_","sev","V","sev","_","_"
2,"'bhyarcyate","_","_","abhyarcay","V","abhyarcay","_","_"
3,"_","_","_","ca","CCD","","_","_"
4,"_","_","_","eva","CEM","","_","_"
5,"_","_","_","nitya","JJ","","_","_"
6,"_","_","_","yuj","PPP","","_","_"
7,"_","_","_","sva","JJ","","_","_"
8,"_","_","_","karman","NC","","_","_"
1,"dvāparasya","_","_","dvāpara","NC","","_","_"
2,"_","_","_","yuga","NC","","_","_"
3,"_","_","_","anta","NC","","_","_"
4,"ādau","_","_","ādi","NC","","_","_"
5,"_","_","_","kali","NC","","_","_"
6,"_","_","_","yuga","NC","","_","_"
7,"ca","_","_","ca","CCD","","_","_"
1,"sātvataṃ","_","_","sātvata","JJ","","_","_"
2,"vidhim","_","_","vidhi","NC","","_","_"
3,"āsthāya","_","_","āsthā","CGDA","","_","_"
4,"gītaḥ","_","_","gā","PPP","","_","_"
5,"saṃkarṣaṇena","_","_","saṃkarṣaṇa","NC","","_","_"
6,"yaḥ","_","_","yad","PRL","","_","_"
1,"sa","_","_","tad","PRD","","_","_"
2,"eṣa","_","_","tad","PRD","","_","_"
3,"_","_","_","sarva","JQ","","_","_"
4,"_","_","_","asura","NC","","_","_"
5,"_","_","_","martya","NC","","_","_"
6,"_","_","_","loka","NC","","_","_"
7,"_","_","_","samudra","NC","","_","_"
8,"_","_","_","kakṣyā","NC","","_","_"
9,"_","_","_","antari","PPP","","_","_"
10,"_","_","_","purī","NC","","_","_"
11,"_","_","_","ca","CCD","","_","_"
1,"yuge","_","_","yuga","NC","","_","_"
2,"yuge","_","_","yuga","NC","","_","_"
3,"mānuṣaṃ","_","_","mānuṣa","JJ","","_","_"
4,"_","_","_","ca","CCD","","_","_"
5,"_","_","_","eva","CEM","","_","_"
6,"vāsaṃ","_","_","vāsa","NC","","_","_"
7,"punaḥ","_","_","punar","CAD","","_","_"
8,"punaḥ","_","_","punar","CAD","","_","_"
9,"sṛjate","_","_","sṛj","V","sṛj","_","_"
10,"vāsudevaḥ","_","_","vāsudeva","NC","","_","_"
