"WordID","word","NormSTEM","suffix","lemma","PoS","Root","NormSuffix","NormWord"
1,"garbhā","_","_","garbha","NC","","_","_"
2,"vā","_","_","vai","CX","","_","_"
3,"eta","_","_","tad","PRD","","_","_"
4,"ukthānāṃ","_","_","uktha","NC","","_","_"
5,"yan","_","_","yad","PRL","","_","_"
6,"nividas","_","_","nivid","NC","","_","_"
7,"tad","_","_","tad","PRD","","_","_"
8,"yat","_","_","yat","CSB","","_","_"
9,"purastād","_","_","purastāt","CX","","_","_"
10,"ukthānām","_","_","uktha","NC","","_","_"
11,"prātaḥsavane","_","_","prātaḥsavana","NC","","_","_"
12,"dhīyante","_","_","dadh","V","dhā","_","_"
13,"tasmāt","_","_","tasmāt","CX","","_","_"
14,"parāñco","_","_","parāñc","JJ","","_","_"
15,"garbhā","_","_","garbha","NC","","_","_"
16,"dhīyante","_","_","dadh","V","dhā","_","_"
17,"parāñcaḥ","_","_","parāñc","JJ","","_","_"
18,"sambhavanti","_","_","sambhav","V","sambhū","_","_"
1,"yan","_","_","yat","CSB","","_","_"
2,"madhyato","_","_","madhya","NC","","_","_"
3,"madhyaṃdine","_","_","madhyaṃdina","NC","","_","_"
4,"dhīyante","_","_","dadh","V","dhā","_","_"
5,"tasmān","_","_","tasmāt","CX","","_","_"
6,"madhye","_","_","madhya","NC","","_","_"
7,"garbhā","_","_","garbha","NC","","_","_"
8,"dhṛtāḥ","_","_","dhṛ","PPP","","_","_"
1,"yad","_","_","yat","CSB","","_","_"
2,"antatas","_","_","antatas","CX","","_","_"
3,"tṛtīyasavane","_","_","tṛtīyasavana","NC","","_","_"
4,"dhīyante","_","_","dadh","V","dhā","_","_"
5,"tasmād","_","_","tasmāt","CX","","_","_"
6,"amuto","_","_","amutas","CX","","_","_"
7,"'rvāñco","_","_","arvāñc","JJ","","_","_"
8,"garbhāḥ","_","_","garbha","NC","","_","_"
9,"prajāyante","_","_","prajan","V","prajan","_","_"
10,"prajātyai","_","_","prajāti","NC","","_","_"
1,"prajāyate","_","_","prajan","V","prajan","_","_"
2,"prajayā","_","_","prajā","NC","","_","_"
3,"paśubhir","_","_","paśu","NC","","_","_"
4,"ya","_","_","yad","PRL","","_","_"
5,"evaṃ","_","_","eva","CX","","_","_"
6,"veda","_","_","vid","V","vid","_","_"
1,"peśā","_","_","peśa","NC","","_","_"
2,"vā","_","_","vai","CX","","_","_"
3,"eta","_","_","tad","PRD","","_","_"
4,"ukthānāṃ","_","_","uktha","NC","","_","_"
5,"yan","_","_","yad","PRL","","_","_"
6,"nividas","_","_","nivid","NC","","_","_"
7,"tad","_","_","tad","PRD","","_","_"
8,"yat","_","_","yat","CSB","","_","_"
9,"purastād","_","_","purastāt","CX","","_","_"
10,"ukthānām","_","_","uktha","NC","","_","_"
11,"prātaḥsavane","_","_","prātaḥsavana","NC","","_","_"
12,"dhīyante","_","_","dadh","V","dhā","_","_"
13,"_","_","_","yathā","CCM","","_","_"
14,"_","_","_","eva","CEM","","_","_"
15,"pravayaṇataḥ","_","_","pravayaṇa","NC","","_","_"
16,"peśaḥ","_","_","peśas","NC","","_","_"
17,"kuryāt","_","_","kar","V","kṛ","_","_"
18,"tādṛk","_","_","tādṛś","JJ","","_","_"
19,"tad","_","_","tad","PRD","","_","_"
20,"yan","_","_","yat","CSB","","_","_"
21,"madhyato","_","_","madhya","NC","","_","_"
22,"madhyaṃdine","_","_","madhyaṃdina","NC","","_","_"
23,"dhīyante","_","_","dadh","V","dhā","_","_"
24,"_","_","_","yathā","CCM","","_","_"
25,"_","_","_","eva","CEM","","_","_"
26,"madhyataḥ","_","_","madhya","NC","","_","_"
27,"peśaḥ","_","_","peśas","NC","","_","_"
28,"kuryāt","_","_","kar","V","kṛ","_","_"
29,"tādṛk","_","_","tādṛś","JJ","","_","_"
30,"tad","_","_","tad","PRD","","_","_"
31,"yad","_","_","yat","CSB","","_","_"
32,"antatas","_","_","antatas","CX","","_","_"
33,"tṛtīyasavane","_","_","tṛtīyasavana","NC","","_","_"
34,"dhīyante","_","_","dadh","V","dhā","_","_"
35,"_","_","_","yathā","CCM","","_","_"
36,"_","_","_","eva","CEM","","_","_"
37,"_","_","_","avaprajjana","NC","","_","_"
38,"peśaḥ","_","_","peśas","NC","","_","_"
39,"kuryāt","_","_","kar","V","kṛ","_","_"
40,"tādṛk","_","_","tādṛś","JJ","","_","_"
41,"tat","_","_","tad","PRD","","_","_"
1,"sarvato","_","_","sarvatas","CX","","_","_"
2,"yajñasya","_","_","yajña","NC","","_","_"
3,"peśasā","_","_","peśas","NC","","_","_"
4,"śobhate","_","_","śubh","V","śubh","_","_"
5,"ya","_","_","yad","PRL","","_","_"
6,"evaṃ","_","_","eva","CX","","_","_"
7,"veda","_","_","vid","V","vid","_","_"
