"WordID","word","NormSTEM","suffix","lemma","PoS","Root","NormSuffix","NormWord"
1,"indra","_","_","indra","NC","","_","_"
2,"piba","_","_","pib","V","pā","_","_"
3,"tubhyaṃ","_","_","tvat","PPR","","_","_"
4,"suto","_","_","su","PPP","","_","_"
5,"_","_","_","mada","NC","","_","_"
6,"_","_","_","ava","CX","","_","_"
7,"sya","_","_","sā","V","sā","_","_"
8,"harī","_","_","hari","NC","","_","_"
9,"vi","_","_","vi","CADP","","_","_"
10,"mucā","_","_","muñc","V","muc","_","_"
11,"sakhāyā","_","_","sakhi","NC","","_","_"
1,"uta","_","_","uta","CCD","","_","_"
2,"pra","_","_","pra","CADP","","_","_"
3,"gāya","_","_","gā","V","gā","_","_"
4,"gaṇa","_","_","gaṇa","NC","","_","_"
5,"ā","_","_","ā","CADP","","_","_"
6,"_","_","_","niṣad","CGDA","","_","_"
7,"_","_","_","atha","CAD","","_","_"
8,"yajñāya","_","_","yajña","NC","","_","_"
9,"gṛṇate","_","_","gṛ","KDP","","_","_"
10,"vayo","_","_","vayas","NC","","_","_"
11,"dhāḥ","_","_","dadh","V","dhā","_","_"
1,"asya","_","_","ida","PRD","","_","_"
2,"piba","_","_","pib","V","pā","_","_"
3,"yasya","_","_","yad","PRL","","_","_"
4,"jajñāna","_","_","jan","KDP","","_","_"
5,"indra","_","_","indra","NC","","_","_"
6,"madāya","_","_","mada","NC","","_","_"
7,"kratve","_","_","kratu","NC","","_","_"
8,"apibo","_","_","pib","V","pā","_","_"
9,"virapśin","_","_","virapśin","JJ","","_","_"
1,"tam","_","_","tad","PRD","","_","_"
2,"u","_","_","u","CEM","","_","_"
3,"te","_","_","tvat","PPR","","_","_"
4,"gāvo","_","_","go","NC","","_","_"
5,"nara","_","_","nṛ","NC","","_","_"
6,"āpo","_","_","ap","NC","","_","_"
7,"adrir","_","_","adri","NC","","_","_"
8,"induṃ","_","_","indu","NC","","_","_"
9,"sam","_","_","sa","CADP","","_","_"
10,"ahyan","_","_","hi","V","hi","_","_"
11,"pītaye","_","_","pā","CGDI","","_","_"
12,"sam","_","_","sa","CADP","","_","_"
13,"asmai","_","_","ida","PRD","","_","_"
1,"samiddhe","_","_","samindh","PPP","","_","_"
2,"agnau","_","_","agni","NC","","_","_"
3,"suta","_","_","su","PPP","","_","_"
4,"indra","_","_","indra","NC","","_","_"
5,"soma","_","_","soma","NC","","_","_"
6,"ā","_","_","ā","CADP","","_","_"
7,"tvā","_","_","tvat","PPR","","_","_"
8,"vahantu","_","_","vah","V","vah","_","_"
9,"harayo","_","_","hari","NC","","_","_"
10,"vahiṣṭhāḥ","_","_","vahiṣṭha","JJ","","_","_"
1,"tvāyatā","_","_","tvāyat","JJ","","_","_"
2,"manasā","_","_","manas","NC","","_","_"
3,"_","_","_","johav","V","johav","_","_"
4,"_","_","_","indra","NC","","_","_"
5,"_","_","_","ā","CADP","","_","_"
6,"yāhi","_","_","yā","V","yā","_","_"
7,"suvitāya","_","_","suvita","NC","","_","_"
8,"mahe","_","_","mah","JJ","","_","_"
9,"naḥ","_","_","mat","PPR","","_","_"
1,"ā","_","_","ā","CADP","","_","_"
2,"yāhi","_","_","yā","V","yā","_","_"
3,"śaśvad","_","_","śaśvat","CX","","_","_"
4,"uśatā","_","_","vaś","KDP","","_","_"
5,"_","_","_","yā","V","yā","_","_"
6,"_","_","_","indra","NC","","_","_"
7,"mahā","_","_","mah","JJ","","_","_"
8,"manasā","_","_","manas","NC","","_","_"
9,"_","_","_","soma","NC","","_","_"
10,"_","_","_","peya","NC","","_","_"
1,"upa","_","_","upa","CADP","","_","_"
2,"brahmāṇi","_","_","brahman","NC","","_","_"
3,"śṛṇava","_","_","śṛṇ","V","śru","_","_"
4,"imā","_","_","ida","PRD","","_","_"
5,"no","_","_","mat","PPR","","_","_"
6,"'thā","_","_","atha","CAD","","_","_"
7,"te","_","_","tvat","PPR","","_","_"
8,"yajñas","_","_","yajña","NC","","_","_"
9,"tanve","_","_","tanū","NC","","_","_"
10,"vayo","_","_","vayas","NC","","_","_"
11,"dhāt","_","_","dadh","V","dhā","_","_"
1,"yad","_","_","yat","CSB","","_","_"
2,"indra","_","_","indra","NC","","_","_"
3,"divi","_","_","div","NC","","_","_"
4,"pārye","_","_","pārya","JJ","","_","_"
5,"yad","_","_","yat","CSB","","_","_"
6,"ṛdhag","_","_","ṛdhak","CX","","_","_"
7,"yad","_","_","yat","CSB","","_","_"
8,"vā","_","_","vā","CCD","","_","_"
9,"sve","_","_","sva","JJ","","_","_"
10,"sadane","_","_","sadana","NC","","_","_"
11,"yatra","_","_","yatra","CX","","_","_"
12,"_","_","_","vā","CCD","","_","_"
13,"_","_","_","as","V","as","_","_"
1,"ato","_","_","atas","CX","","_","_"
2,"no","_","_","mat","PPR","","_","_"
3,"yajñam","_","_","yajña","NC","","_","_"
4,"avase","_","_","av","CGDI","","_","_"
5,"niyutvān","_","_","niyutvat","JJ","","_","_"
6,"sajoṣāḥ","_","_","sajoṣas","JJ","","_","_"
7,"pāhi","_","_","pib","V","pā","_","_"
8,"girvaṇo","_","_","girvaṇas","JJ","","_","_"
9,"marudbhiḥ","_","_","marut","NC","","_","_"
