"WordID","word","NormSTEM","suffix","lemma","PoS","Root","NormSuffix","NormWord"
1,"bhīṣma","_","_","bhīṣma","NC","","_","_"
2,"uvāca","_","_","vak","V","vac","_","_"
1,"_","_","_","atra","CAD","","_","_"
2,"_","_","_","api","CX","","_","_"
3,"_","_","_","udāhṛ","V","udāhṛ","_","_"
4,"_","_","_","ida","PRD","","_","_"
5,"itihāsaṃ","_","_","itihāsa","NC","","_","_"
6,"purātanam","_","_","purātana","JJ","","_","_"
1,"pratardano","_","_","pratardana","NC","","_","_"
2,"_","_","_","maithila","NC","","_","_"
3,"_","_","_","ca","CCD","","_","_"
4,"saṃgrāmaṃ","_","_","saṃgrāma","NC","","_","_"
5,"yatra","_","_","yatra","CX","","_","_"
6,"cakratuḥ","_","_","kar","V","kṛ","_","_"
1,"_","_","_","yajña","NC","","_","_"
2,"_","_","_","upavītin","JJ","","_","_"
3,"saṃgrāme","_","_","saṃgrāma","NC","","_","_"
4,"janako","_","_","janaka","NC","","_","_"
5,"maithilo","_","_","maithila","NC","","_","_"
6,"yathā","_","_","yathā","CCM","","_","_"
1,"yodhān","_","_","yodha","NC","","_","_"
2,"uddharṣayāmāsa","_","_","uddharṣay","V","uddharṣay","_","_"
3,"_","_","_","tad","PRD","","_","_"
4,"_","_","_","nibodh","V","nibudh","_","_"
5,"yudhiṣṭhira","_","_","yudhiṣṭhira","NC","","_","_"
1,"janako","_","_","janaka","NC","","_","_"
2,"maithilo","_","_","maithila","NC","","_","_"
3,"rājā","_","_","rājan","NC","","_","_"
4,"mahātmā","_","_","mahātman","JJ","","_","_"
5,"_","_","_","sarva","JQ","","_","_"
6,"_","_","_","tattva","NC","","_","_"
7,"_","_","_","vid","JJ","","_","_"
1,"yodhān","_","_","yodha","NC","","_","_"
2,"svān","_","_","sva","JJ","","_","_"
3,"darśayāmāsa","_","_","darśay","V","darśay","_","_"
4,"svargaṃ","_","_","svarga","NC","","_","_"
5,"narakam","_","_","naraka","NC","","_","_"
6,"eva","_","_","eva","CEM","","_","_"
7,"ca","_","_","ca","CCD","","_","_"
1,"abhītānām","_","_","abhīta","JJ","","_","_"
2,"ime","_","_","ida","PRD","","_","_"
3,"lokā","_","_","loka","NC","","_","_"
4,"bhāsvanto","_","_","bhāsvat","JJ","","_","_"
5,"hanta","_","_","hanta","CX","","_","_"
6,"paśyata","_","_","paś","V","paś","_","_"
1,"pūrṇā","_","_","pṛ","PPP","","_","_"
2,"_","_","_","gandharva","NC","","_","_"
3,"_","_","_","kanyā","NC","","_","_"
4,"_","_","_","sarva","JQ","","_","_"
5,"_","_","_","kāmaduh","JJ","","_","_"
6,"'kṣayāḥ","_","_","akṣaya","JJ","","_","_"
1,"ime","_","_","ida","PRD","","_","_"
2,"palāyamānānāṃ","_","_","palāy","KDP","","_","_"
3,"narakāḥ","_","_","naraka","NC","","_","_"
4,"pratyupasthitāḥ","_","_","pratyupasthā","PPP","","_","_"
1,"akīrtiḥ","_","_","akīrti","NC","","_","_"
2,"śāśvatī","_","_","śāśvata","JJ","","_","_"
3,"_","_","_","ca","CCD","","_","_"
4,"_","_","_","eva","CEM","","_","_"
5,"patitavyam","_","_","pat","KDG","","_","_"
6,"anantaram","_","_","anantara","CX","","_","_"
1,"tān","_","_","tad","PRD","","_","_"
2,"_","_","_","dṛś","CGDA","","_","_"
3,"_","_","_","ari","NC","","_","_"
4,"vijayato","_","_","viji","KDP","","_","_"
5,"bhūtvā","_","_","bhū","CGDA","","_","_"
6,"_","_","_","saṃtyāga","NC","","_","_"
7,"_","_","_","buddhi","NC","","_","_"
1,"_","_","_","naraka","NC","","_","_"
2,"_","_","_","apratiṣṭha","JJ","","_","_"
3,"mā","_","_","mā","CNG","","_","_"
4,"bhūta","_","_","bhav","V","bhū","_","_"
5,"vaśavartinaḥ","_","_","vaśavartin","JJ","","_","_"
1,"_","_","_","tyāga","NC","","_","_"
2,"_","_","_","mūla","NC","","_","_"
3,"hi","_","_","hi","CX","","_","_"
4,"śūrāṇāṃ","_","_","śūra","NC","","_","_"
5,"_","_","_","svarga","NC","","_","_"
6,"_","_","_","dvāra","NC","","_","_"
7,"anuttamam","_","_","anuttama","JJ","","_","_"
1,"_","_","_","iti","CQT","","_","_"
2,"_","_","_","vac","PPP","","_","_"
3,"_","_","_","tad","PRD","","_","_"
4,"nṛpatinā","_","_","nṛpati","NC","","_","_"
5,"yodhāḥ","_","_","yodha","NC","","_","_"
6,"_","_","_","para","PPX","","_","_"
7,"_","_","_","puraṃjaya","NC","","_","_"
1,"vyajayanta","_","_","vijay","V","viji","_","_"
2,"raṇe","_","_","raṇa","NC","","_","_"
3,"śatrūn","_","_","śatru","NC","","_","_"
4,"harṣayanto","_","_","harṣay","KDP","","_","_"
5,"janeśvaram","_","_","janeśvara","NC","","_","_"
1,"tasmād","_","_","tasmāt","CX","","_","_"
2,"ātmavatā","_","_","ātmavat","JJ","","_","_"
3,"nityaṃ","_","_","nitya","CX","","_","_"
4,"sthātavyaṃ","_","_","sthā","KDG","","_","_"
5,"_","_","_","raṇa","NC","","_","_"
6,"_","_","_","mūrdhan","NC","","_","_"
1,"gajānāṃ","_","_","gaja","NC","","_","_"
2,"rathino","_","_","rathin","NC","","_","_"
3,"madhye","_","_","madhya","NC","","_","_"
4,"rathānām","_","_","ratha","NC","","_","_"
5,"anu","_","_","anu","CADP","","_","_"
6,"sādinaḥ","_","_","sādin","NC","","_","_"
1,"sādinām","_","_","sādin","NC","","_","_"
2,"antarā","_","_","antarā","CX","","_","_"
3,"sthāpyaṃ","_","_","sthāpay","KDG","","_","_"
4,"pādātam","_","_","pādāta","NC","","_","_"
5,"iha","_","_","iha","CAD","","_","_"
6,"daṃśitam","_","_","daṃśay","PPP","","_","_"
1,"ya","_","_","yad","PRL","","_","_"
2,"evaṃ","_","_","eva","CX","","_","_"
3,"vyūhate","_","_","vyūh","V","vyūh","_","_"
4,"rājā","_","_","rājan","NC","","_","_"
5,"sa","_","_","tad","PRD","","_","_"
6,"nityaṃ","_","_","nitya","CX","","_","_"
7,"jayate","_","_","jay","V","ji","_","_"
8,"dviṣaḥ","_","_","dviṣ","JJ","","_","_"
1,"tasmād","_","_","tasmāt","CX","","_","_"
2,"evaṃ","_","_","eva","CX","","_","_"
3,"vidhātavyaṃ","_","_","vidhā","KDG","","_","_"
4,"nityam","_","_","nitya","CX","","_","_"
5,"eva","_","_","eva","CEM","","_","_"
6,"yudhiṣṭhira","_","_","yudhiṣṭhira","NC","","_","_"
1,"sarve","_","_","sarva","JQ","","_","_"
2,"_","_","_","su","CAD","","_","_"
3,"_","_","_","kṛ","PPP","","_","_"
4,"icchantaḥ","_","_","iṣ","KDP","","_","_"
5,"_","_","_","su","CAD","","_","_"
6,"_","_","_","yuddha","NC","","_","_"
7,"_","_","_","ati","CADP","","_","_"
8,"_","_","_","manyu","NC","","_","_"
1,"kṣobhayeyur","_","_","kṣobhay","V","kṣobhay","_","_"
2,"anīkāni","_","_","anīka","NC","","_","_"
3,"sāgaraṃ","_","_","sāgara","NC","","_","_"
4,"makarā","_","_","makara","NC","","_","_"
5,"iva","_","_","iva","CCM","","_","_"
1,"harṣayeyur","_","_","harṣay","V","harṣay","_","_"
2,"_","_","_","viṣad","PPP","","_","_"
3,"_","_","_","ca","CCD","","_","_"
4,"vyavasthāpya","_","_","vyavasthāpay","CGDA","","_","_"
5,"parasparam","_","_","paraspara","PRC","","_","_"
1,"jitāṃ","_","_","ji","PPP","","_","_"
2,"ca","_","_","ca","CCD","","_","_"
3,"bhūmiṃ","_","_","bhūmi","NC","","_","_"
4,"rakṣeta","_","_","rakṣ","V","rakṣ","_","_"
5,"_","_","_","bhañj","PPP","","_","_"
6,"_","_","_","na","CNG","","_","_"
7,"_","_","_","atyanusāray","V","atyanusāray","_","_"
1,"_","_","_","punar","CAD","","_","_"
2,"_","_","_","āvṛt","KDP","","_","_"
3,"nirāśānāṃ","_","_","nirāśa","JJ","","_","_"
4,"ca","_","_","ca","CCD","","_","_"
5,"jīvite","_","_","jīvita","NC","","_","_"
1,"na","_","_","na","CNG","","_","_"
2,"vegaḥ","_","_","vega","NC","","_","_"
3,"_","_","_","su","CAD","","_","_"
4,"_","_","_","saha","JJ","","_","_"
5,"_","_","_","rājan","NC","","_","_"
6,"_","_","_","tasmāt","CX","","_","_"
7,"_","_","_","na","CNG","","_","_"
8,"_","_","_","atyanusāray","V","atyanusāray","_","_"
1,"na","_","_","na","CNG","","_","_"
2,"hi","_","_","hi","CX","","_","_"
3,"prahartum","_","_","prahṛ","CGDI","","_","_"
4,"icchanti","_","_","iṣ","V","iṣ","_","_"
5,"śūrāḥ","_","_","śūra","NC","","_","_"
6,"prādravatāṃ","_","_","prādru","KDP","","_","_"
7,"bhayāt","_","_","bhaya","NC","","_","_"
1,"tasmāt","_","_","tasmāt","CX","","_","_"
2,"palāyamānānāṃ","_","_","palāy","KDP","","_","_"
3,"_","_","_","kar","V","kṛ","_","_"
4,"_","_","_","na","CNG","","_","_"
5,"_","_","_","ati","CADP","","_","_"
6,"_","_","_","anusāraṇā","NC","","_","_"
1,"carāṇām","_","_","cara","JJ","","_","_"
2,"acarā","_","_","acara","JJ","","_","_"
3,"_","_","_","hi","CX","","_","_"
4,"_","_","_","anna","NC","","_","_"
5,"a","_","_","alpha_privativum","JJ","","_","_"
5,"adaṃṣṭrā","_","_","daṃṣṭra","JJ","","_","_"
6,"daṃṣṭriṇām","_","_","daṃṣṭrin","JJ","","_","_"
7,"api","_","_","api","CX","","_","_"
1,"apāṇayaḥ","_","_","apāṇi","JJ","","_","_"
2,"pāṇimatām","_","_","pāṇimat","JJ","","_","_"
3,"annaṃ","_","_","anna","NC","","_","_"
4,"śūrasya","_","_","śūra","NC","","_","_"
5,"kātarāḥ","_","_","kātara","JJ","","_","_"
1,"_","_","_","samāna","JJ","","_","_"
2,"_","_","_","pṛṣṭha","NC","","_","_"
3,"_","_","_","udara","NC","","_","_"
4,"_","_","_","pāṇi","NC","","_","_"
5,"_","_","_","pāda","NC","","_","_"
6,"_","_","_","paścāt","CAD","","_","_"
7,"_","_","_","śūra","NC","","_","_"
8,"bhīravo","_","_","bhīru","JJ","","_","_"
9,"'nuvrajanti","_","_","anuvraj","V","anuvraj","_","_"
1,"ato","_","_","atas","CX","","_","_"
2,"_","_","_","bhaya","NC","","_","_"
3,"_","_","_","ārta","JJ","","_","_"
4,"praṇipatya","_","_","praṇipat","CGDA","","_","_"
5,"bhūyaḥ","_","_","bhūyas","CX","","_","_"
6,"_","_","_","kṛ","CGDA","","_","_"
7,"_","_","_","añjali","NC","","_","_"
8,"upatiṣṭhanti","_","_","upatiṣṭh","V","upasthā","_","_"
9,"śūrān","_","_","śūra","NC","","_","_"
1,"_","_","_","śūra","NC","","_","_"
2,"_","_","_","bāhu","NC","","_","_"
3,"loko","_","_","loka","NC","","_","_"
4,"'yaṃ","_","_","ida","PRD","","_","_"
5,"lambate","_","_","lamb","V","lamb","_","_"
6,"_","_","_","putra","NC","","_","_"
7,"_","_","_","vat","CX","","_","_"
8,"sadā","_","_","sadā","CAD","","_","_"
1,"tasmāt","_","_","tasmāt","CX","","_","_"
2,"_","_","_","sarva","JQ","","_","_"
3,"_","_","_","avasthā","NC","","_","_"
4,"śūraḥ","_","_","śūra","NC","","_","_"
5,"saṃmānam","_","_","sammāna","NC","","_","_"
6,"arhati","_","_","arh","V","arh","_","_"
1,"na","_","_","na","CNG","","_","_"
2,"hi","_","_","hi","CX","","_","_"
3,"śauryāt","_","_","śaurya","NC","","_","_"
4,"paraṃ","_","_","para","PPX","","_","_"
5,"kiṃcit","_","_","kiṃcit","PRI","","_","_"
6,"triṣu","_","_","tri","NUM","","_","_"
7,"lokeṣu","_","_","loka","NC","","_","_"
8,"vidyate","_","_","vid","V","vid","_","_"
1,"śūraḥ","_","_","śūra","NC","","_","_"
2,"sarvaṃ","_","_","sarva","JQ","","_","_"
3,"pālayati","_","_","pālay","V","pālay","_","_"
4,"sarvaṃ","_","_","sarva","JQ","","_","_"
5,"śūre","_","_","śūra","NC","","_","_"
6,"pratiṣṭhitam","_","_","pratiṣṭhā","PPP","","_","_"
