"WordID","word","NormSTEM","suffix","lemma","PoS","Root","NormSuffix","NormWord"
1,"sūta","_","_","sūta","NC","","_","_"
2,"uvāca","_","_","vak","V","vac","_","_"
1,"janamejayaḥ","_","_","janamejaya","NC","","_","_"
2,"pārikṣitaḥ","_","_","pārikṣita","NC","","_","_"
3,"saha","_","_","saha","CX","","_","_"
4,"bhrātṛbhiḥ","_","_","bhrātṛ","NC","","_","_"
5,"kurukṣetre","_","_","kurukṣetra","NC","","_","_"
6,"_","_","_","dīrgha","JJ","","_","_"
7,"_","_","_","sattra","NC","","_","_"
8,"upāste","_","_","ās","V","ās","_","_"
1,"tasya","_","_","tad","PRD","","_","_"
2,"bhrātaras","_","_","bhrātṛ","NC","","_","_"
3,"trayaḥ","_","_","tri","NUM","","_","_"
4,"śrutasena","_","_","śrutasa","NC","","_","_"
5,"ugraseno","_","_","ugrasa","NC","","_","_"
6,"bhīmasena","_","_","bhīmasa","NC","","_","_"
7,"iti","_","_","iti","CQT","","_","_"
1,"teṣu","_","_","tad","PRD","","_","_"
2,"tat","_","_","tad","PRD","","_","_"
3,"satram","_","_","sattra","NC","","_","_"
4,"upāsīneṣu","_","_","upās","PPP","","_","_"
5,"tatra","_","_","tatra","CAD","","_","_"
6,"_","_","_","śvan","NC","","_","_"
7,"_","_","_","abhyāga","V","abhyāga","_","_"
8,"sārameyaḥ","_","_","sārameya","NC","","_","_"
1,"sa","_","_","tad","PRD","","_","_"
2,"janamejayasya","_","_","janamejaya","NC","","_","_"
3,"bhrātṛbhir","_","_","bhrātṛ","NC","","_","_"
4,"abhihato","_","_","abhihan","PPP","","_","_"
5,"rorūyamāṇo","_","_","rorūy","KDP","","_","_"
6,"mātuḥ","_","_","mātṛ","NC","","_","_"
7,"samīpam","_","_","samīpa","NC","","_","_"
8,"upāgacchat","_","_","upaga","V","upaga","_","_"
1,"taṃ","_","_","tad","PRD","","_","_"
2,"mātā","_","_","mātṛ","NC","","_","_"
3,"rorūyamāṇam","_","_","rorūy","KDP","","_","_"
4,"uvāca","_","_","vak","V","vac","_","_"
1,"kiṃ","_","_","kim","CX","","_","_"
2,"rodiṣi","_","_","rod","V","rud","_","_"
1,"_","_","_","kiṃ","PRQ","","_","_"
2,"_","_","_","as","V","as","_","_"
3,"_","_","_","abhihan","PPP","","_","_"
4,"iti","_","_","iti","CQT","","_","_"
1,"sa","_","_","tad","PRD","","_","_"
2,"evam","_","_","eva","CX","","_","_"
3,"ukto","_","_","vac","PPP","","_","_"
4,"mātaraṃ","_","_","mātṛ","NC","","_","_"
5,"pratyuvāca","_","_","prativak","V","prativac","_","_"
1,"janamejayasya","_","_","janamejaya","NC","","_","_"
2,"bhrātṛbhir","_","_","bhrātṛ","NC","","_","_"
3,"abhihato","_","_","abhihan","PPP","","_","_"
4,"_","_","_","as","V","as","_","_"
5,"_","_","_","iti","CQT","","_","_"
1,"taṃ","_","_","tad","PRD","","_","_"
2,"mātā","_","_","mātṛ","NC","","_","_"
3,"pratyuvāca","_","_","prativak","V","prativac","_","_"
1,"vyaktaṃ","_","_","vyakta","JJ","","_","_"
2,"tvayā","_","_","tvat","PPR","","_","_"
3,"_","_","_","tatra","CAD","","_","_"
4,"_","_","_","aparādh","PPP","","_","_"
5,"_","_","_","ya","CX","","_","_"
6,"_","_","_","as","V","as","_","_"
7,"abhihata","_","_","abhihan","PPP","","_","_"
8,"iti","_","_","iti","CQT","","_","_"
1,"sa","_","_","tad","PRD","","_","_"
2,"tāṃ","_","_","tad","PRD","","_","_"
3,"punar","_","_","punar","CAD","","_","_"
4,"uvāca","_","_","vak","V","vac","_","_"
1,"_","_","_","na","CNG","","_","_"
2,"_","_","_","aparādh","V","aparādh","_","_"
3,"kiṃcit","_","_","kiṃcit","PRI","","_","_"
1,"_","_","_","na","CNG","","_","_"
2,"_","_","_","avekṣ","V","avekṣ","_","_"
3,"havīṃṣi","_","_","havis","NC","","_","_"
4,"_","_","_","na","CNG","","_","_"
5,"_","_","_","avalih","V","avalih","_","_"
6,"iti","_","_","iti","CQT","","_","_"
1,"_","_","_","tad","PRD","","_","_"
2,"_","_","_","śru","CGDA","","_","_"
3,"tasya","_","_","tad","PRD","","_","_"
4,"mātā","_","_","mātṛ","NC","","_","_"
5,"saramā","_","_","saramā","NC","","_","_"
6,"_","_","_","putra","NC","","_","_"
7,"_","_","_","śoka","NC","","_","_"
8,"_","_","_","ārta","JJ","","_","_"
9,"tat","_","_","tad","PRD","","_","_"
10,"satram","_","_","sattra","NC","","_","_"
11,"upāgacchad","_","_","upaga","V","upaga","_","_"
12,"yatra","_","_","yatra","CX","","_","_"
13,"sa","_","_","tad","PRD","","_","_"
14,"janamejayaḥ","_","_","janamejaya","NC","","_","_"
15,"saha","_","_","saha","CX","","_","_"
16,"bhrātṛbhir","_","_","bhrātṛ","NC","","_","_"
17,"_","_","_","dīrgha","JJ","","_","_"
18,"_","_","_","sattra","NC","","_","_"
19,"upāste","_","_","ās","V","ās","_","_"
1,"sa","_","_","tad","PRD","","_","_"
2,"tayā","_","_","tad","PRD","","_","_"
3,"kruddhayā","_","_","krudh","PPP","","_","_"
4,"_","_","_","tatra","CAD","","_","_"
5,"_","_","_","vac","PPP","","_","_"
1,"ayaṃ","_","_","ida","PRD","","_","_"
2,"me","_","_","mat","PPR","","_","_"
3,"putro","_","_","putra","NC","","_","_"
4,"na","_","_","na","CNG","","_","_"
5,"kiṃcid","_","_","kiṃcit","PRI","","_","_"
6,"aparādhyati","_","_","aparādh","V","aparādh","_","_"
1,"kimartham","_","_","kimartha","CX","","_","_"
2,"abhihata","_","_","abhihan","PPP","","_","_"
3,"iti","_","_","iti","CQT","","_","_"
1,"_","_","_","yasmāt","CX","","_","_"
2,"_","_","_","ca","CCD","","_","_"
3,"_","_","_","ida","PRD","","_","_"
4,"abhihato","_","_","abhihan","PPP","","_","_"
5,"'napakārī","_","_","anapakārin","JJ","","_","_"
6,"tasmād","_","_","tasmāt","CX","","_","_"
7,"a","_","_","alpha_privativum","JJ","","_","_"
7,"adṛṣṭaṃ","_","_","dṛṣṭa","JJ","","_","_"
8,"tvāṃ","_","_","tvat","PPR","","_","_"
9,"bhayam","_","_","bhaya","NC","","_","_"
10,"_","_","_","āga","V","āga","_","_"
11,"_","_","_","iti","CQT","","_","_"
1,"sa","_","_","tad","PRD","","_","_"
2,"janamejaya","_","_","janamejaya","NC","","_","_"
3,"evam","_","_","eva","CX","","_","_"
4,"ukto","_","_","vac","PPP","","_","_"
5,"devaśunyā","_","_","devaśunī","NC","","_","_"
6,"saramayā","_","_","saramā","NC","","_","_"
7,"dṛḍhaṃ","_","_","dṛḍha","CX","","_","_"
8,"saṃbhrānto","_","_","sambhra","PPP","","_","_"
9,"viṣaṇṇaś","_","_","viṣad","PPP","","_","_"
10,"_","_","_","ca","CCD","","_","_"
11,"_","_","_","as","V","as","_","_"
1,"sa","_","_","tad","PRD","","_","_"
2,"tasmin","_","_","tad","PRD","","_","_"
3,"satre","_","_","sattra","NC","","_","_"
4,"samāpte","_","_","samāp","PPP","","_","_"
5,"hāstinapuraṃ","_","_","hāstinapura","NC","","_","_"
6,"pratyetya","_","_","pratye","CGDA","","_","_"
7,"purohitam","_","_","purohita","NC","","_","_"
8,"anurūpam","_","_","anurūpa","JJ","","_","_"
9,"anvicchamānaḥ","_","_","anviṣ","KDP","","_","_"
10,"paraṃ","_","_","para","PPX","","_","_"
11,"yatnam","_","_","yatna","NC","","_","_"
12,"akarod","_","_","kar","V","kṛ","_","_"
13,"yo","_","_","yad","PRL","","_","_"
14,"me","_","_","mat","PPR","","_","_"
15,"_","_","_","pāpa","JJ","","_","_"
16,"_","_","_","kṛtyā","NC","","_","_"
17,"śamayed","_","_","śam","V","śam","_","_"
18,"iti","_","_","iti","CQT","","_","_"
1,"sa","_","_","tad","PRD","","_","_"
2,"_","_","_","kadācid","CX","","_","_"
3,"_","_","_","mṛgayā","NC","","_","_"
4,"yātaḥ","_","_","yā","PPP","","_","_"
5,"pārikṣito","_","_","pārikṣita","NC","","_","_"
6,"janamejayaḥ","_","_","janamejaya","NC","","_","_"
7,"kasmiṃścit","_","_","kiṃcit","PRI","","_","_"
8,"_","_","_","sva","JJ","","_","_"
9,"_","_","_","viṣaya","NC","","_","_"
10,"_","_","_","uddeśa","NC","","_","_"
11,"āśramam","_","_","āśrama","NC","","_","_"
12,"apaśyat","_","_","paś","V","paś","_","_"
1,"tatra","_","_","tatra","CAD","","_","_"
2,"kaścid","_","_","kiṃcit","PRI","","_","_"
3,"ṛṣir","_","_","ṛṣi","NC","","_","_"
4,"āsāṃcakre","_","_","ās","V","ās","_","_"
5,"śrutaśravā","_","_","śrutaśravas","NC","","_","_"
6,"nāma","_","_","nāma","CX","","_","_"
1,"_","_","_","tad","PRD","","_","_"
2,"_","_","_","abhiman","PPP","","_","_"
3,"putra","_","_","putra","NC","","_","_"
4,"āste","_","_","ās","V","ās","_","_"
5,"somaśravā","_","_","somaśravas","NC","","_","_"
6,"nāma","_","_","nāma","CX","","_","_"
1,"tasya","_","_","tad","PRD","","_","_"
2,"taṃ","_","_","tad","PRD","","_","_"
3,"putram","_","_","putra","NC","","_","_"
4,"abhigamya","_","_","abhiga","CGDA","","_","_"
5,"janamejayaḥ","_","_","janamejaya","NC","","_","_"
6,"pārikṣitaḥ","_","_","pārikṣita","NC","","_","_"
7,"paurohityāya","_","_","paurohitya","NC","","_","_"
8,"vavre","_","_","vṛ","V","vṛ","_","_"
1,"sa","_","_","tad","PRD","","_","_"
2,"namaskṛtya","_","_","namaskṛ","CGDA","","_","_"
3,"tam","_","_","tad","PRD","","_","_"
4,"ṛṣim","_","_","ṛṣi","NC","","_","_"
5,"uvāca","_","_","vak","V","vac","_","_"
1,"bhagavann","_","_","bhagavat","JJ","","_","_"
2,"ayaṃ","_","_","ida","PRD","","_","_"
3,"tava","_","_","tvat","PPR","","_","_"
4,"putro","_","_","putra","NC","","_","_"
5,"mama","_","_","mat","PPR","","_","_"
6,"purohito","_","_","purohita","NC","","_","_"
7,"'stv","_","_","as","V","as","_","_"
8,"iti","_","_","iti","CQT","","_","_"
1,"sa","_","_","tad","PRD","","_","_"
2,"evam","_","_","eva","CX","","_","_"
3,"uktaḥ","_","_","vac","PPP","","_","_"
4,"pratyuvāca","_","_","prativak","V","prativac","_","_"
1,"bho","_","_","bho","CX","","_","_"
2,"janamejaya","_","_","janamejaya","NC","","_","_"
3,"putro","_","_","putra","NC","","_","_"
4,"'yaṃ","_","_","ida","PRD","","_","_"
5,"mama","_","_","mat","PPR","","_","_"
6,"sarpyāṃ","_","_","sarpī","NC","","_","_"
7,"jātaḥ","_","_","jan","PPP","","_","_"
1,"_","_","_","mahat","JJ","","_","_"
2,"_","_","_","tapasvin","NC","","_","_"
3,"_","_","_","svādhyāya","NC","","_","_"
4,"_","_","_","sampad","PPP","","_","_"
5,"_","_","_","mat","PPR","","_","_"
6,"_","_","_","tapas","NC","","_","_"
7,"_","_","_","vīrya","NC","","_","_"
8,"_","_","_","sambhṛ","PPP","","_","_"
9,"_","_","_","mat","PPR","","_","_"
10,"_","_","_","śukra","NC","","_","_"
11,"pītavatyās","_","_","pā","KDP","","_","_"
12,"tasyāḥ","_","_","tad","PRD","","_","_"
13,"kukṣau","_","_","kukṣi","NC","","_","_"
14,"saṃvṛddhaḥ","_","_","saṃvṛdh","PPP","","_","_"
1,"samartho","_","_","samartha","JJ","","_","_"
2,"'yaṃ","_","_","ida","PRD","","_","_"
3,"bhavataḥ","_","_","bhavat","JJ","","_","_"
4,"sarvāḥ","_","_","sarva","JQ","","_","_"
5,"_","_","_","pāpa","JJ","","_","_"
6,"_","_","_","kṛtyā","NC","","_","_"
7,"śamayitum","_","_","śamay","CGDI","","_","_"
8,"antareṇa","_","_","antareṇa","CX","","_","_"
9,"_","_","_","mahādeva","NC","","_","_"
10,"_","_","_","kṛtyā","NC","","_","_"
1,"asya","_","_","ida","PRD","","_","_"
2,"tv","_","_","tu","CCD","","_","_"
3,"ekam","_","_","eka","PPX","","_","_"
4,"_","_","_","upāṃśu","JJ","","_","_"
5,"_","_","_","vrata","NC","","_","_"
1,"yad","_","_","yat","CSB","","_","_"
2,"enaṃ","_","_","a","PRD","","_","_"
3,"kaścid","_","_","kiṃcit","PRI","","_","_"
4,"brāhmaṇaḥ","_","_","brāhmaṇa","NC","","_","_"
5,"kaṃcid","_","_","kiṃcit","PRI","","_","_"
6,"artham","_","_","artha","NC","","_","_"
7,"abhiyācet","_","_","abhiyāc","V","abhiyāc","_","_"
8,"taṃ","_","_","tad","PRD","","_","_"
9,"tasmai","_","_","tad","PRD","","_","_"
10,"dadyād","_","_","dad","V","dā","_","_"
11,"ayam","_","_","ida","PRD","","_","_"
1,"yady","_","_","yadi","CSB","","_","_"
2,"etad","_","_","tad","PRD","","_","_"
3,"utsahase","_","_","utsah","V","utsah","_","_"
4,"tato","_","_","tatas","CX","","_","_"
5,"_","_","_","nay","V","nī","_","_"
6,"_","_","_","a","PRD","","_","_"
7,"iti","_","_","iti","CQT","","_","_"
1,"_","_","_","tad","PRD","","_","_"
2,"_","_","_","eva","CX","","_","_"
3,"ukto","_","_","vac","PPP","","_","_"
4,"janamejayas","_","_","janamejaya","NC","","_","_"
5,"taṃ","_","_","tad","PRD","","_","_"
6,"pratyuvāca","_","_","prativak","V","prativac","_","_"
1,"bhagavaṃs","_","_","bhagavat","JJ","","_","_"
2,"tathā","_","_","tathā","CX","","_","_"
3,"_","_","_","bhav","V","bhū","_","_"
4,"_","_","_","iti","CQT","","_","_"
1,"sa","_","_","tad","PRD","","_","_"
2,"taṃ","_","_","tad","PRD","","_","_"
3,"purohitam","_","_","purohita","NC","","_","_"
4,"_","_","_","upādā","CGDA","","_","_"
5,"_","_","_","upāvṛt","PPP","","_","_"
6,"bhrātṝn","_","_","bhrātṛ","NC","","_","_"
7,"uvāca","_","_","vak","V","vac","_","_"
1,"_","_","_","mat","PPR","","_","_"
2,"_","_","_","ida","PRD","","_","_"
3,"vṛta","_","_","vṛ","PPP","","_","_"
4,"upādhyāyaḥ","_","_","upādhyāya","NC","","_","_"
1,"yad","_","_","yad","PRL","","_","_"
2,"ayaṃ","_","_","ida","PRD","","_","_"
3,"brūyāt","_","_","abravīta","V","brū","_","_"
4,"tat","_","_","tad","PRD","","_","_"
5,"kāryam","_","_","kṛ","KDG","","_","_"
6,"_","_","_","a","CNG","","_","_"
7,"_","_","_","vicāray","KDP","","_","_"
8,"iti","_","_","iti","CQT","","_","_"
1,"_","_","_","tad","PRD","","_","_"
2,"_","_","_","eva","CX","","_","_"
3,"uktā","_","_","vac","PPP","","_","_"
4,"bhrātaras","_","_","bhrātṛ","NC","","_","_"
5,"tasya","_","_","tad","PRD","","_","_"
6,"tathā","_","_","tathā","CX","","_","_"
7,"cakruḥ","_","_","kar","V","kṛ","_","_"
1,"sa","_","_","tad","PRD","","_","_"
2,"tathā","_","_","tathā","CX","","_","_"
3,"bhrātṝn","_","_","bhrātṛ","NC","","_","_"
4,"saṃdiśya","_","_","saṃdiś","CGDA","","_","_"
5,"takṣaśilāṃ","_","_","takṣaśilā","NC","","_","_"
6,"pratyabhipratasthe","_","_","pratyabhiprasthā","V","pratyabhiprasthā","_","_"
1,"taṃ","_","_","tad","PRD","","_","_"
2,"ca","_","_","ca","CCD","","_","_"
3,"deśaṃ","_","_","deśa","NC","","_","_"
4,"vaśe","_","_","vaśa","NC","","_","_"
5,"sthāpayāmāsa","_","_","sthāpay","V","sthāpay","_","_"
1,"etasminn","_","_","tad","PRD","","_","_"
2,"antare","_","_","antara","NC","","_","_"
3,"kaścid","_","_","kiṃcit","PRI","","_","_"
4,"ṛṣir","_","_","ṛṣi","NC","","_","_"
5,"dhaumyo","_","_","dhaumya","NC","","_","_"
6,"_","_","_","nāma","CX","","_","_"
7,"_","_","_","āyoda","NC","","_","_"
1,"tasya","_","_","tad","PRD","","_","_"
2,"śiṣyās","_","_","śās","KDG","","_","_"
3,"trayo","_","_","tri","NUM","","_","_"
4,"babhūvur","_","_","bhav","V","bhū","_","_"
5,"upamanyur","_","_","upamanyu","NC","","_","_"
6,"āruṇir","_","_","āruṇi","NC","","_","_"
7,"vedaś","_","_","veda","NC","","_","_"
8,"_","_","_","ca","CCD","","_","_"
9,"_","_","_","iti","CQT","","_","_"
1,"sa","_","_","tad","PRD","","_","_"
2,"ekaṃ","_","_","eka","PPX","","_","_"
3,"śiṣyam","_","_","śiṣya","NC","","_","_"
4,"āruṇiṃ","_","_","āruṇi","NC","","_","_"
5,"pāñcālyaṃ","_","_","pāñcālya","JJ","","_","_"
6,"preṣayāmāsa","_","_","preṣay","V","preṣay","_","_"
1,"gaccha","_","_","ga","V","ga","_","_"
2,"kedārakhaṇḍaṃ","_","_","kedārakhaṇḍa","NC","","_","_"
3,"_","_","_","bandh","V","bandh","_","_"
4,"_","_","_","iti","CQT","","_","_"
1,"sa","_","_","tad","PRD","","_","_"
2,"upādhyāyena","_","_","upādhyāya","NC","","_","_"
3,"saṃdiṣṭa","_","_","saṃdiś","PPP","","_","_"
4,"āruṇiḥ","_","_","āruṇi","NC","","_","_"
5,"pāñcālyas","_","_","pāñcālya","JJ","","_","_"
6,"tatra","_","_","tatra","CAD","","_","_"
7,"gatvā","_","_","ga","CGDA","","_","_"
8,"tat","_","_","tad","PRD","","_","_"
9,"kedārakhaṇḍaṃ","_","_","kedārakhaṇḍa","NC","","_","_"
10,"baddhuṃ","_","_","bandh","CGDI","","_","_"
11,"_","_","_","na","CNG","","_","_"
12,"_","_","_","śakn","V","śak","_","_"
1,"sa","_","_","tad","PRD","","_","_"
2,"kliśyamāno","_","_","kliś","KDP","","_","_"
3,"'paśyad","_","_","paś","V","paś","_","_"
4,"upāyam","_","_","upāya","NC","","_","_"
1,"bhavatv","_","_","bhav","V","bhū","_","_"
2,"evaṃ","_","_","eva","CX","","_","_"
3,"_","_","_","kar","V","kṛ","_","_"
4,"_","_","_","iti","CQT","","_","_"
1,"sa","_","_","tad","PRD","","_","_"
2,"tatra","_","_","tatra","CAD","","_","_"
3,"saṃviveśa","_","_","saṃviś","V","saṃviś","_","_"
4,"kedārakhaṇḍe","_","_","kedārakhaṇḍa","NC","","_","_"
1,"śayāne","_","_","śī","KDP","","_","_"
2,"tasmiṃs","_","_","tad","PRD","","_","_"
3,"tad","_","_","tad","PRD","","_","_"
4,"udakaṃ","_","_","udaka","NC","","_","_"
5,"tasthau","_","_","tiṣṭh","V","sthā","_","_"
1,"tataḥ","_","_","tatas","CX","","_","_"
2,"kadācid","_","_","kadācid","CX","","_","_"
3,"upādhyāya","_","_","upādhyāya","NC","","_","_"
4,"āyodo","_","_","āyoda","NC","","_","_"
5,"dhaumyaḥ","_","_","dhaumya","NC","","_","_"
6,"śiṣyān","_","_","śiṣya","NC","","_","_"
7,"apṛcchat","_","_","pracch","V","pracch","_","_"
1,"kva","_","_","kva","CX","","_","_"
2,"āruṇiḥ","_","_","āruṇi","NC","","_","_"
3,"pāñcālyo","_","_","pāñcālya","JJ","","_","_"
4,"gata","_","_","ga","PPP","","_","_"
5,"iti","_","_","iti","CQT","","_","_"
1,"te","_","_","tad","PRD","","_","_"
2,"pratyūcuḥ","_","_","prativak","V","prativac","_","_"
1,"_","_","_","bhagavat","JJ","","_","_"
2,"_","_","_","eva","CEM","","_","_"
3,"preṣito","_","_","preṣay","PPP","","_","_"
4,"gaccha","_","_","ga","V","ga","_","_"
5,"kedārakhaṇḍaṃ","_","_","kedārakhaṇḍa","NC","","_","_"
6,"_","_","_","bandh","V","bandh","_","_"
7,"_","_","_","iti","CQT","","_","_"
1,"sa","_","_","tad","PRD","","_","_"
2,"evam","_","_","eva","CX","","_","_"
3,"uktas","_","_","vac","PPP","","_","_"
4,"_","_","_","tad","PRD","","_","_"
5,"_","_","_","śiṣya","NC","","_","_"
6,"pratyuvāca","_","_","prativak","V","prativac","_","_"
1,"tasmāt","_","_","tasmāt","CX","","_","_"
2,"sarve","_","_","sarva","JQ","","_","_"
3,"tatra","_","_","tatra","CAD","","_","_"
4,"gacchāmo","_","_","ga","V","ga","_","_"
5,"yatra","_","_","yatra","CX","","_","_"
6,"sa","_","_","tad","PRD","","_","_"
7,"iti","_","_","iti","CQT","","_","_"
1,"sa","_","_","tad","PRD","","_","_"
2,"tatra","_","_","tatra","CAD","","_","_"
3,"gatvā","_","_","ga","CGDA","","_","_"
4,"_","_","_","tad","PRD","","_","_"
5,"_","_","_","āhvāna","NC","","_","_"
6,"śabdaṃ","_","_","śabda","NC","","_","_"
7,"cakāra","_","_","kar","V","kṛ","_","_"
1,"bho","_","_","bho","CX","","_","_"
2,"āruṇe","_","_","āruṇi","NC","","_","_"
3,"pāñcālya","_","_","pāñcālya","JJ","","_","_"
4,"_","_","_","kva","CX","","_","_"
5,"_","_","_","as","V","as","_","_"
1,"_","_","_","vatsa","NC","","_","_"
2,"_","_","_","e","V","e","_","_"
3,"_","_","_","iti","CQT","","_","_"
1,"sa","_","_","tad","PRD","","_","_"
2,"_","_","_","tad","PRD","","_","_"
3,"_","_","_","śru","CGDA","","_","_"
4,"āruṇir","_","_","āruṇi","NC","","_","_"
5,"_","_","_","upādhyāya","NC","","_","_"
6,"_","_","_","vākya","NC","","_","_"
7,"tasmāt","_","_","tad","PRD","","_","_"
8,"kedārakhaṇḍāt","_","_","kedārakhaṇḍa","NC","","_","_"
9,"_","_","_","sahasā","CX","","_","_"
10,"_","_","_","utthā","CGDA","","_","_"
11,"tam","_","_","tad","PRD","","_","_"
12,"upādhyāyam","_","_","upādhyāya","NC","","_","_"
13,"upatasthe","_","_","upatiṣṭh","V","upasthā","_","_"
1,"provāca","_","_","pravak","V","pravac","_","_"
2,"_","_","_","ca","CCD","","_","_"
3,"_","_","_","a","PRD","","_","_"
1,"ayam","_","_","ida","PRD","","_","_"
2,"asmy","_","_","as","V","as","_","_"
3,"atra","_","_","atra","CAD","","_","_"
4,"kedārakhaṇḍe","_","_","kedārakhaṇḍa","NC","","_","_"
5,"niḥsaramāṇam","_","_","niḥsṛ","KDP","","_","_"
6,"udakam","_","_","udaka","NC","","_","_"
7,"avāraṇīyaṃ","_","_","avāraṇīya","JJ","","_","_"
8,"saṃroddhuṃ","_","_","saṃrudh","CGDI","","_","_"
9,"saṃviṣṭo","_","_","saṃviś","PPP","","_","_"
10,"_","_","_","bhagavat","JJ","","_","_"
11,"_","_","_","śabda","NC","","_","_"
12,"_","_","_","śru","CGDA","","_","_"
13,"_","_","_","eva","CEM","","_","_"
14,"sahasā","_","_","sahasā","CX","","_","_"
15,"vidārya","_","_","vidāray","CGDA","","_","_"
16,"kedārakhaṇḍaṃ","_","_","kedārakhaṇḍa","NC","","_","_"
17,"bhavantam","_","_","bhavat","JJ","","_","_"
18,"upasthitaḥ","_","_","upasthā","PPP","","_","_"
1,"tad","_","_","tad","PRD","","_","_"
2,"abhivādaye","_","_","abhivādi","V","abhivāday","_","_"
3,"bhagavantam","_","_","bhagavat","JJ","","_","_"
1,"ājñāpayatu","_","_","ājān","V","ājñā","_","_"
2,"bhavān","_","_","bhavat","JJ","","_","_"
1,"kiṃ","_","_","kiṃ","PRQ","","_","_"
2,"_","_","_","kar","V","kṛ","_","_"
3,"_","_","_","iti","CQT","","_","_"
1,"tam","_","_","tad","PRD","","_","_"
2,"upādhyāyo","_","_","upādhyāya","NC","","_","_"
3,"'bravīt","_","_","abravīta","V","brū","_","_"
1,"yasmād","_","_","yad","PRL","","_","_"
2,"bhavān","_","_","bhavat","JJ","","_","_"
3,"kedārakhaṇḍam","_","_","kedārakhaṇḍa","NC","","_","_"
4,"_","_","_","avadāray","CGDA","","_","_"
5,"_","_","_","utthā","PPP","","_","_"
6,"tasmād","_","_","tasmāt","CX","","_","_"
7,"bhavān","_","_","bhavat","JJ","","_","_"
8,"uddālaka","_","_","uddālaka","NC","","_","_"
9,"eva","_","_","eva","CEM","","_","_"
10,"nāmnā","_","_","nāman","NC","","_","_"
11,"_","_","_","bhav","V","bhū","_","_"
12,"_","_","_","iti","CQT","","_","_"
1,"sa","_","_","tad","PRD","","_","_"
2,"_","_","_","upādhyāya","NC","","_","_"
3,"_","_","_","anugrah","PPP","","_","_"
1,"yasmāt","_","_","yasmāt","CX","","_","_"
2,"tvayā","_","_","tvat","PPR","","_","_"
3,"_","_","_","mat","PPR","","_","_"
4,"_","_","_","vacas","NC","","_","_"
5,"'nuṣṭhitaṃ","_","_","anuṣṭhā","PPP","","_","_"
6,"_","_","_","tasmāt","CX","","_","_"
7,"_","_","_","śreyas","NC","","_","_"
8,"_","_","_","avāp","V","avāp","_","_"
9,"_","_","_","iti","CQT","","_","_"
1,"sarve","_","_","sarva","JQ","","_","_"
2,"ca","_","_","ca","CCD","","_","_"
3,"te","_","_","tvat","PPR","","_","_"
4,"vedāḥ","_","_","veda","NC","","_","_"
5,"pratibhāsyanti","_","_","pratibhā","V","pratibhā","_","_"
6,"sarvāṇi","_","_","sarva","JQ","","_","_"
7,"ca","_","_","ca","CCD","","_","_"
8,"_","_","_","dharmaśāstra","NC","","_","_"
9,"_","_","_","iti","CQT","","_","_"
1,"sa","_","_","tad","PRD","","_","_"
2,"evam","_","_","eva","CX","","_","_"
3,"ukta","_","_","vac","PPP","","_","_"
4,"_","_","_","upādhyāya","NC","","_","_"
5,"_","_","_","iṣ","PPP","","_","_"
6,"deśaṃ","_","_","deśa","NC","","_","_"
7,"jagāma","_","_","ga","V","ga","_","_"
1,"_","_","_","atha","CAD","","_","_"
2,"_","_","_","apara","PPX","","_","_"
3,"śiṣyas","_","_","śiṣya","NC","","_","_"
4,"_","_","_","tad","PRD","","_","_"
5,"_","_","_","eva","CEM","","_","_"
6,"_","_","_","āyoda","NC","","_","_"
7,"_","_","_","dhaumya","NC","","_","_"
8,"_","_","_","upamanyu","NC","","_","_"
9,"nāma","_","_","nāma","CX","","_","_"
1,"tam","_","_","tad","PRD","","_","_"
2,"upādhyāyaḥ","_","_","upādhyāya","NC","","_","_"
3,"preṣayāmāsa","_","_","preṣay","V","preṣay","_","_"
1,"_","_","_","vatsa","NC","","_","_"
2,"_","_","_","upamanyu","NC","","_","_"
3,"gā","_","_","go","NC","","_","_"
4,"_","_","_","rakṣ","V","rakṣ","_","_"
5,"_","_","_","iti","CQT","","_","_"
1,"sa","_","_","sa_saha","CX","","_","_"
2,"_","_","_","upādhyāya","NC","","_","_"
3,"_","_","_","vacana","NC","","_","_"
4,"arakṣad","_","_","rakṣ","V","rakṣ","_","_"
5,"gāḥ","_","_","go","NC","","_","_"
1,"sa","_","_","tad","PRD","","_","_"
2,"_","_","_","ca","CCD","","_","_"
3,"_","_","_","ahar","NC","","_","_"
4,"gā","_","_","go","NC","","_","_"
5,"rakṣitvā","_","_","rakṣ","CGDA","","_","_"
6,"_","_","_","divasa","NC","","_","_"
7,"_","_","_","kṣaya","NC","","_","_"
8,"_","_","_","abhyāga","CGDA","","_","_"
9,"_","_","_","upādhyāya","NC","","_","_"
10,"_","_","_","agratas","CX","","_","_"
11,"sthitvā","_","_","sthā","CGDA","","_","_"
12,"namaścakre","_","_","namaskar","V","namaskṛ","_","_"
1,"tam","_","_","tad","PRD","","_","_"
2,"upādhyāyaḥ","_","_","upādhyāya","NC","","_","_"
3,"pīvānam","_","_","pīvas","JJ","","_","_"
4,"apaśyat","_","_","paś","V","paś","_","_"
1,"uvāca","_","_","vak","V","vac","_","_"
2,"_","_","_","ca","CCD","","_","_"
3,"_","_","_","a","PRD","","_","_"
1,"_","_","_","vatsa","NC","","_","_"
2,"_","_","_","upamanyu","NC","","_","_"
3,"kena","_","_","ka","CX","","_","_"
4,"vṛttiṃ","_","_","vṛtti","NC","","_","_"
5,"kalpayasi","_","_","kalpay","V","kalpay","_","_"
1,"pīvān","_","_","pīvas","JJ","","_","_"
2,"asi","_","_","as","V","as","_","_"
3,"dṛḍham","_","_","dṛḍha","CX","","_","_"
4,"iti","_","_","iti","CQT","","_","_"
1,"sa","_","_","tad","PRD","","_","_"
2,"upādhyāyaṃ","_","_","upādhyāya","NC","","_","_"
3,"pratyuvāca","_","_","prativak","V","prativac","_","_"
1,"bhaikṣeṇa","_","_","bhaikṣa","NC","","_","_"
2,"vṛttiṃ","_","_","vṛtti","NC","","_","_"
3,"_","_","_","kalpay","V","kalpay","_","_"
4,"_","_","_","iti","CQT","","_","_"
1,"tam","_","_","tad","PRD","","_","_"
2,"upādhyāyaḥ","_","_","upādhyāya","NC","","_","_"
3,"pratyuvāca","_","_","prativak","V","prativac","_","_"
1,"_","_","_","mat","PPR","","_","_"
2,"_","_","_","a","CNG","","_","_"
3,"_","_","_","niveday","CGDA","","_","_"
4,"bhaikṣaṃ","_","_","bhaikṣa","NC","","_","_"
5,"_","_","_","na","CNG","","_","_"
6,"_","_","_","upayuj","KDG","","_","_"
7,"iti","_","_","iti","CQT","","_","_"
1,"sa","_","_","tad","PRD","","_","_"
2,"_","_","_","tathā","CX","","_","_"
3,"_","_","_","iti","CQT","","_","_"
4,"uktvā","_","_","vac","CGDA","","_","_"
5,"punar","_","_","punar","CAD","","_","_"
6,"arakṣad","_","_","rakṣ","V","rakṣ","_","_"
7,"gāḥ","_","_","go","NC","","_","_"
1,"rakṣitvā","_","_","rakṣ","CGDA","","_","_"
2,"_","_","_","ca","CCD","","_","_"
3,"_","_","_","āga","CGDA","","_","_"
4,"_","_","_","tathā","CX","","_","_"
5,"_","_","_","eva","CEM","","_","_"
6,"_","_","_","upādhyāya","NC","","_","_"
7,"_","_","_","agratas","CX","","_","_"
8,"sthitvā","_","_","sthā","CGDA","","_","_"
9,"namaścakre","_","_","namaskar","V","namaskṛ","_","_"
1,"tam","_","_","tad","PRD","","_","_"
2,"upādhyāyas","_","_","upādhyāya","NC","","_","_"
3,"_","_","_","tathā","CX","","_","_"
4,"_","_","_","api","CX","","_","_"
5,"pīvānam","_","_","pīvas","JJ","","_","_"
6,"eva","_","_","eva","CEM","","_","_"
7,"_","_","_","dṛś","CGDA","","_","_"
8,"_","_","_","vak","V","vac","_","_"
1,"_","_","_","vatsa","NC","","_","_"
2,"_","_","_","upamanyu","NC","","_","_"
3,"sarvam","_","_","sarva","JQ","","_","_"
4,"aśeṣatas","_","_","aśeṣatas","CX","","_","_"
5,"te","_","_","tvat","PPR","","_","_"
6,"bhaikṣaṃ","_","_","bhaikṣa","NC","","_","_"
7,"gṛhṇāmi","_","_","grah","V","grah","_","_"
1,"_","_","_","ka","CX","","_","_"
2,"_","_","_","idānīm","CX","","_","_"
3,"vṛttiṃ","_","_","vṛtti","NC","","_","_"
4,"_","_","_","kalpay","V","kalpay","_","_"
5,"_","_","_","iti","CQT","","_","_"
1,"sa","_","_","tad","PRD","","_","_"
2,"evam","_","_","eva","CX","","_","_"
3,"ukta","_","_","vac","PPP","","_","_"
4,"upādhyāyena","_","_","upādhyāya","NC","","_","_"
5,"pratyuvāca","_","_","prativak","V","prativac","_","_"
1,"bhagavate","_","_","bhagavat","JJ","","_","_"
2,"nivedya","_","_","niveday","CGDA","","_","_"
3,"pūrvam","_","_","pūrva","CX","","_","_"
4,"aparaṃ","_","_","apara","PPX","","_","_"
5,"carāmi","_","_","car","V","car","_","_"
1,"tena","_","_","ta","CX","","_","_"
2,"vṛttiṃ","_","_","vṛtti","NC","","_","_"
3,"_","_","_","kalpay","V","kalpay","_","_"
4,"_","_","_","iti","CQT","","_","_"
1,"tam","_","_","tad","PRD","","_","_"
2,"upādhyāyaḥ","_","_","upādhyāya","NC","","_","_"
3,"pratyuvāca","_","_","prativak","V","prativac","_","_"
1,"_","_","_","na","CNG","","_","_"
2,"_","_","_","tad","PRD","","_","_"
3,"nyāyyā","_","_","nyāyya","JJ","","_","_"
4,"_","_","_","guru","NC","","_","_"
5,"_","_","_","vṛtti","NC","","_","_"
1,"anyeṣām","_","_","anya","PPX","","_","_"
2,"api","_","_","api","CX","","_","_"
3,"_","_","_","vṛtti","NC","","_","_"
4,"_","_","_","uparodha","NC","","_","_"
5,"karoṣy","_","_","kar","V","kṛ","_","_"
6,"evaṃ","_","_","eva","CX","","_","_"
7,"vartamānaḥ","_","_","vṛt","KDP","","_","_"
1,"lubdho","_","_","lubh","PPP","","_","_"
2,"_","_","_","as","V","as","_","_"
3,"_","_","_","iti","CQT","","_","_"
1,"sa","_","_","tad","PRD","","_","_"
2,"_","_","_","tathā","CX","","_","_"
3,"_","_","_","iti","CQT","","_","_"
4,"uktvā","_","_","vac","CGDA","","_","_"
5,"gā","_","_","go","NC","","_","_"
6,"arakṣat","_","_","rakṣ","V","rakṣ","_","_"
1,"rakṣitvā","_","_","rakṣ","CGDA","","_","_"
2,"ca","_","_","ca","CCD","","_","_"
3,"punar","_","_","punar","CAD","","_","_"
4,"_","_","_","upādhyāya","NC","","_","_"
5,"_","_","_","gṛha","NC","","_","_"
6,"_","_","_","āga","CGDA","","_","_"
7,"_","_","_","upādhyāya","NC","","_","_"
8,"_","_","_","agratas","CX","","_","_"
9,"sthitvā","_","_","sthā","CGDA","","_","_"
10,"namaścakre","_","_","namaskar","V","namaskṛ","_","_"
1,"tam","_","_","tad","PRD","","_","_"
2,"upādhyāyas","_","_","upādhyāya","NC","","_","_"
3,"_","_","_","tathā","CX","","_","_"
4,"_","_","_","api","CX","","_","_"
5,"pīvānam","_","_","pīvas","JJ","","_","_"
6,"eva","_","_","eva","CEM","","_","_"
7,"dṛṣṭvā","_","_","dṛś","CGDA","","_","_"
8,"punar","_","_","punar","CAD","","_","_"
9,"uvāca","_","_","vak","V","vac","_","_"
1,"ahaṃ","_","_","mat","PPR","","_","_"
2,"te","_","_","tvat","PPR","","_","_"
3,"sarvaṃ","_","_","sarva","JQ","","_","_"
4,"bhaikṣaṃ","_","_","bhaikṣa","NC","","_","_"
5,"gṛhṇāmi","_","_","grah","V","grah","_","_"
6,"na","_","_","na","CNG","","_","_"
7,"_","_","_","ca","CCD","","_","_"
8,"_","_","_","anya","PPX","","_","_"
9,"carasi","_","_","car","V","car","_","_"
1,"pīvān","_","_","pīvas","JJ","","_","_"
2,"asi","_","_","as","V","as","_","_"
1,"kena","_","_","ka","CX","","_","_"
2,"vṛttiṃ","_","_","vṛtti","NC","","_","_"
3,"_","_","_","kalpay","V","kalpay","_","_"
4,"_","_","_","iti","CQT","","_","_"
1,"sa","_","_","tad","PRD","","_","_"
2,"upādhyāyaṃ","_","_","upādhyāya","NC","","_","_"
3,"pratyuvāca","_","_","prativak","V","prativac","_","_"
1,"bho","_","_","bho","CX","","_","_"
2,"etāsāṃ","_","_","tad","PRD","","_","_"
3,"gavāṃ","_","_","go","NC","","_","_"
4,"payasā","_","_","payas","NC","","_","_"
5,"vṛttiṃ","_","_","vṛtti","NC","","_","_"
6,"_","_","_","kalpay","V","kalpay","_","_"
7,"_","_","_","iti","CQT","","_","_"
1,"tam","_","_","tad","PRD","","_","_"
2,"upādhyāyaḥ","_","_","upādhyāya","NC","","_","_"
3,"pratyuvāca","_","_","prativak","V","prativac","_","_"
1,"_","_","_","na","CNG","","_","_"
2,"_","_","_","tad","PRD","","_","_"
3,"nyāyyaṃ","_","_","nyāyya","JJ","","_","_"
4,"paya","_","_","payas","NC","","_","_"
5,"upayoktuṃ","_","_","upayuj","CGDI","","_","_"
6,"bhavato","_","_","bhavat","JJ","","_","_"
7,"_","_","_","mat","PPR","","_","_"
8,"_","_","_","ananujñāta","JJ","","_","_"
9,"iti","_","_","iti","CQT","","_","_"
1,"sa","_","_","tad","PRD","","_","_"
2,"_","_","_","tathā","CX","","_","_"
3,"_","_","_","iti","CQT","","_","_"
4,"pratijñāya","_","_","pratijñā","CGDA","","_","_"
5,"gā","_","_","go","NC","","_","_"
6,"rakṣitvā","_","_","rakṣ","CGDA","","_","_"
7,"punar","_","_","punar","CAD","","_","_"
8,"_","_","_","upādhyāya","NC","","_","_"
9,"_","_","_","gṛha","NC","","_","_"
10,"etya","_","_","e","CGDA","","_","_"
11,"guror","_","_","guru","NC","","_","_"
12,"agrataḥ","_","_","agratas","CX","","_","_"
13,"sthitvā","_","_","sthā","CGDA","","_","_"
14,"namaścakre","_","_","namaskar","V","namaskṛ","_","_"
1,"tam","_","_","tad","PRD","","_","_"
2,"upādhyāyaḥ","_","_","upādhyāya","NC","","_","_"
3,"pīvānam","_","_","pīvas","JJ","","_","_"
4,"_","_","_","eva","CEM","","_","_"
5,"_","_","_","paś","V","paś","_","_"
1,"uvāca","_","_","vak","V","vac","_","_"
2,"_","_","_","ca","CCD","","_","_"
3,"_","_","_","a","PRD","","_","_"
1,"bhaikṣaṃ","_","_","bhaikṣa","NC","","_","_"
2,"_","_","_","na","CNG","","_","_"
3,"_","_","_","aś","V","aś","_","_"
4,"na","_","_","na","CNG","","_","_"
5,"_","_","_","ca","CCD","","_","_"
6,"_","_","_","anya","PPX","","_","_"
7,"carasi","_","_","car","V","car","_","_"
1,"payo","_","_","payas","NC","","_","_"
2,"na","_","_","na","CNG","","_","_"
3,"pibasi","_","_","pib","V","pā","_","_"
1,"pīvān","_","_","pīvas","JJ","","_","_"
2,"asi","_","_","as","V","as","_","_"
1,"kena","_","_","ka","CX","","_","_"
2,"vṛttiṃ","_","_","vṛtti","NC","","_","_"
3,"_","_","_","kalpay","V","kalpay","_","_"
4,"_","_","_","iti","CQT","","_","_"
1,"sa","_","_","tad","PRD","","_","_"
2,"evam","_","_","eva","CX","","_","_"
3,"ukta","_","_","vac","PPP","","_","_"
4,"upādhyāyaṃ","_","_","upādhyāya","NC","","_","_"
5,"pratyuvāca","_","_","prativak","V","prativac","_","_"
1,"bhoḥ","_","_","bhoḥ","CX","","_","_"
2,"phenaṃ","_","_","pha","NC","","_","_"
3,"pibāmi","_","_","pib","V","pā","_","_"
4,"yam","_","_","yad","PRL","","_","_"
5,"ime","_","_","ida","PRD","","_","_"
6,"vatsā","_","_","vatsa","NC","","_","_"
7,"mātṝṇāṃ","_","_","mātṛ","NC","","_","_"
8,"stanaṃ","_","_","stana","NC","","_","_"
9,"pibanta","_","_","pā","KDP","","_","_"
10,"_","_","_","udgṛ","V","udgṛ","_","_"
11,"_","_","_","iti","CQT","","_","_"
1,"tam","_","_","tad","PRD","","_","_"
2,"upādhyāyaḥ","_","_","upādhyāya","NC","","_","_"
3,"pratyuvāca","_","_","prativak","V","prativac","_","_"
1,"ete","_","_","tad","PRD","","_","_"
2,"_","_","_","tvat","PPR","","_","_"
3,"_","_","_","anukampā","NC","","_","_"
4,"guṇavanto","_","_","guṇavat","JJ","","_","_"
5,"vatsāḥ","_","_","vatsa","NC","","_","_"
6,"prabhūtataraṃ","_","_","prabhūtatara","JJ","","_","_"
7,"phenam","_","_","pha","NC","","_","_"
8,"udgiranti","_","_","udgṛ","V","udgṛ","_","_"
1,"tad","_","_","tad","PRD","","_","_"
2,"evam","_","_","eva","CX","","_","_"
3,"api","_","_","api","CX","","_","_"
4,"vatsānāṃ","_","_","vatsa","NC","","_","_"
5,"_","_","_","vṛtti","NC","","_","_"
6,"_","_","_","uparodha","NC","","_","_"
7,"karoṣy","_","_","kar","V","kṛ","_","_"
8,"evaṃ","_","_","eva","CX","","_","_"
9,"vartamānaḥ","_","_","vṛt","KDP","","_","_"
1,"phenam","_","_","pha","NC","","_","_"
2,"api","_","_","api","CX","","_","_"
3,"bhavān","_","_","bhavat","JJ","","_","_"
4,"na","_","_","na","CNG","","_","_"
5,"pātum","_","_","pā","CGDI","","_","_"
6,"_","_","_","arh","V","arh","_","_"
7,"_","_","_","iti","CQT","","_","_"
1,"sa","_","_","tad","PRD","","_","_"
2,"_","_","_","tathā","CX","","_","_"
3,"_","_","_","iti","CQT","","_","_"
4,"pratijñāya","_","_","pratijñā","CGDA","","_","_"
5,"nirāhāras","_","_","nirāhāra","JJ","","_","_"
6,"tā","_","_","tad","PRD","","_","_"
7,"gā","_","_","go","NC","","_","_"
8,"arakṣat","_","_","rakṣ","V","rakṣ","_","_"
1,"tathā","_","_","tathā","CX","","_","_"
2,"pratiṣiddho","_","_","pratiṣidh","PPP","","_","_"
3,"bhaikṣaṃ","_","_","bhaikṣa","NC","","_","_"
4,"_","_","_","na","CNG","","_","_"
5,"_","_","_","aś","V","aś","_","_"
6,"na","_","_","na","CNG","","_","_"
7,"_","_","_","ca","CCD","","_","_"
8,"_","_","_","anya","PPX","","_","_"
9,"_","_","_","car","V","car","_","_"
1,"payo","_","_","payas","NC","","_","_"
2,"na","_","_","na","CNG","","_","_"
3,"pibati","_","_","pib","V","pā","_","_"
1,"phenaṃ","_","_","pha","NC","","_","_"
2,"_","_","_","na","CNG","","_","_"
3,"_","_","_","upayuj","V","upayuj","_","_"
1,"sa","_","_","tad","PRD","","_","_"
2,"kadācid","_","_","kadācid","CX","","_","_"
3,"araṇye","_","_","araṇya","NC","","_","_"
4,"_","_","_","kṣudhā","NC","","_","_"
5,"_","_","_","ārta","JJ","","_","_"
6,"_","_","_","arka","NC","","_","_"
7,"_","_","_","pattra","NC","","_","_"
8,"_","_","_","bhakṣay","V","bhakṣay","_","_"
1,"sa","_","_","tad","PRD","","_","_"
2,"tair","_","_","tad","PRD","","_","_"
3,"_","_","_","arka","NC","","_","_"
4,"_","_","_","pattra","NC","","_","_"
5,"bhakṣitaiḥ","_","_","bhakṣay","PPP","","_","_"
6,"_","_","_","kṣāra","JJ","","_","_"
7,"_","_","_","kaṭu","JJ","","_","_"
8,"_","_","_","uṣṇa","JJ","","_","_"
9,"_","_","_","vipākin","JJ","","_","_"
10,"_","_","_","cakṣus","NC","","_","_"
11,"_","_","_","upahan","PPP","","_","_"
12,"'ndho","_","_","andha","JJ","","_","_"
13,"'bhavat","_","_","bhav","V","bhū","_","_"
1,"so","_","_","tad","PRD","","_","_"
2,"'ndho","_","_","andha","JJ","","_","_"
3,"'pi","_","_","api","CX","","_","_"
4,"caṅkramyamāṇaḥ","_","_","caṅkra","KDP","","_","_"
5,"kūpe","_","_","kūpa","NC","","_","_"
6,"'patat","_","_","pat","V","pat","_","_"
1,"atha","_","_","atha","CAD","","_","_"
2,"tasminn","_","_","tad","PRD","","_","_"
3,"_","_","_","an","CX","","_","_"
4,"_","_","_","āga","KDP","","_","_"
5,"_","_","_","upādhyāya","NC","","_","_"
6,"śiṣyān","_","_","śiṣya","NC","","_","_"
7,"avocat","_","_","vak","V","vac","_","_"
1,"_","_","_","mat","PPR","","_","_"
2,"_","_","_","upamanyu","NC","","_","_"
3,"sarvataḥ","_","_","sarvatas","CX","","_","_"
4,"pratiṣiddhaḥ","_","_","pratiṣidh","PPP","","_","_"
1,"sa","_","_","tad","PRD","","_","_"
2,"niyataṃ","_","_","niyata","CX","","_","_"
3,"kupitaḥ","_","_","kup","PPP","","_","_"
1,"tato","_","_","tatas","CX","","_","_"
2,"_","_","_","na","CNG","","_","_"
3,"_","_","_","āga","V","āga","_","_"
4,"_","_","_","cira","JJ","","_","_"
5,"_","_","_","ga","PPP","","_","_"
6,"_","_","_","ca","CCD","","_","_"
7,"_","_","_","iti","CQT","","_","_"
1,"sa","_","_","tad","PRD","","_","_"
2,"evam","_","_","eva","CX","","_","_"
3,"uktvā","_","_","vac","CGDA","","_","_"
4,"_","_","_","ga","CGDA","","_","_"
5,"_","_","_","araṇya","NC","","_","_"
6,"upamanyor","_","_","upamanyu","NC","","_","_"
7,"āhvānaṃ","_","_","āhvāna","NC","","_","_"
8,"cakre","_","_","kar","V","kṛ","_","_"
1,"bho","_","_","bho","CX","","_","_"
2,"upamanyo","_","_","upamanyu","NC","","_","_"
3,"_","_","_","kva","CX","","_","_"
4,"_","_","_","as","V","as","_","_"
1,"_","_","_","vatsa","NC","","_","_"
2,"_","_","_","e","V","e","_","_"
3,"_","_","_","iti","CQT","","_","_"
1,"sa","_","_","tad","PRD","","_","_"
2,"_","_","_","tad","PRD","","_","_"
3,"_","_","_","āhvāna","NC","","_","_"
4,"_","_","_","upādhyāya","NC","","_","_"
5,"_","_","_","śru","CGDA","","_","_"
6,"_","_","_","prativak","V","prativac","_","_"
7,"_","_","_","uccais","CX","","_","_"
1,"ayam","_","_","ida","PRD","","_","_"
2,"asmi","_","_","as","V","as","_","_"
3,"bho","_","_","bho","CX","","_","_"
4,"upādhyāya","_","_","upādhyāya","NC","","_","_"
5,"kūpe","_","_","kūpa","NC","","_","_"
6,"patita","_","_","pat","PPP","","_","_"
7,"iti","_","_","iti","CQT","","_","_"
1,"tam","_","_","tad","PRD","","_","_"
2,"upādhyāyaḥ","_","_","upādhyāya","NC","","_","_"
3,"pratyuvāca","_","_","prativak","V","prativac","_","_"
1,"katham","_","_","katha","CX","","_","_"
2,"asi","_","_","as","V","as","_","_"
3,"kūpe","_","_","kūpa","NC","","_","_"
4,"patita","_","_","pat","PPP","","_","_"
5,"iti","_","_","iti","CQT","","_","_"
1,"sa","_","_","tad","PRD","","_","_"
2,"taṃ","_","_","tad","PRD","","_","_"
3,"pratyuvāca","_","_","prativak","V","prativac","_","_"
1,"_","_","_","arka","NC","","_","_"
2,"_","_","_","pattra","NC","","_","_"
3,"_","_","_","bhakṣay","CGDA","","_","_"
4,"_","_","_","andhībhū","PPP","","_","_"
5,"'smi","_","_","as","V","as","_","_"
1,"ataḥ","_","_","atas","CX","","_","_"
2,"kūpe","_","_","kūpa","NC","","_","_"
3,"patita","_","_","pat","PPP","","_","_"
4,"iti","_","_","iti","CQT","","_","_"
1,"tam","_","_","tad","PRD","","_","_"
2,"upādhyāyaḥ","_","_","upādhyāya","NC","","_","_"
3,"pratyuvāca","_","_","prativak","V","prativac","_","_"
1,"aśvinau","_","_","aśvin","NC","","_","_"
2,"stuhi","_","_","stu","V","stu","_","_"
1,"tau","_","_","tad","PRD","","_","_"
2,"tvāṃ","_","_","tvat","PPR","","_","_"
3,"cakṣuṣmantaṃ","_","_","cakṣuṣmat","JJ","","_","_"
4,"kariṣyato","_","_","kar","V","kṛ","_","_"
5,"devabhiṣajāv","_","_","devabhiṣaj","NC","","_","_"
6,"iti","_","_","iti","CQT","","_","_"
1,"sa","_","_","tad","PRD","","_","_"
2,"evam","_","_","eva","CX","","_","_"
3,"ukta","_","_","vac","PPP","","_","_"
4,"upādhyāyena","_","_","upādhyāya","NC","","_","_"
5,"stotuṃ","_","_","stu","CGDI","","_","_"
6,"pracakrame","_","_","pracakrama","V","prakra","_","_"
7,"devāv","_","_","deva","NC","","_","_"
8,"aśvinau","_","_","aśvin","NC","","_","_"
9,"vāgbhir","_","_","vāc","NC","","_","_"
10,"ṛgbhiḥ","_","_","ṛc","NC","","_","_"
1,"pra","_","_","pra","CADP","","_","_"
2,"_","_","_","pūrva","PPX","","_","_"
3,"_","_","_","ga","JJ","","_","_"
4,"_","_","_","pūrva","PPX","","_","_"
5,"_","_","_","ja","JJ","","_","_"
6,"_","_","_","citra","JJ","","_","_"
7,"_","_","_","bhānu","NC","","_","_"
8,"girā","_","_","gir","NC","","_","_"
9,"vā","_","_","vā","CCD","","_","_"
10,"śaṃsāmi","_","_","śaṃs","V","śaṃs","_","_"
11,"tapanāv","_","_","tapana","JJ","","_","_"
12,"anantau","_","_","ananta","JJ","","_","_"
1,"divyau","_","_","divya","JJ","","_","_"
2,"_","_","_","su","CAD","","_","_"
3,"_","_","_","parṇa","NC","","_","_"
4,"virajau","_","_","viraja","JJ","","_","_"
5,"vimānāv","_","_","vimāna","NC","","_","_"
6,"adhikṣiyantau","_","_","bhuvana","NC","","_","_"
7,"bhuvanāni","_","_","viśva","JQ","","_","_"
1,"hiraṇmayau","_","_","hiraṇmaya","JJ","","_","_"
2,"śakunī","_","_","śakuni","NC","","_","_"
3,"sāṃparāyau","_","_","sāmparāya","JJ","","_","_"
4,"_","_","_","nāsatya","NC","","_","_"
5,"_","_","_","dasra","NC","","_","_"
6,"_","_","_","su","CAD","","_","_"
7,"_","_","_","nasā","NC","","_","_"
8,"vaijayantau","_","_","vaijayanta","NC","","_","_"
1,"śukraṃ","_","_","śukra","JJ","","_","_"
2,"vayantau","_","_","ve","KDP","","_","_"
3,"tarasā","_","_","taras","NC","","_","_"
4,"_","_","_","su","CAD","","_","_"
5,"_","_","_","vema","NC","","_","_"
6,"abhivyayantāv","_","_","asita","JJ","","_","_"
7,"asitaṃ","_","_","vivasvat","JJ","","_","_"
1,"grastāṃ","_","_","gras","PPP","","_","_"
2,"suparṇasya","_","_","suparṇa","NC","","_","_"
3,"balena","_","_","bala","NC","","_","_"
4,"vartikām","_","_","vartikā","NC","","_","_"
5,"amuñcatām","_","_","muñc","V","muc","_","_"
6,"aśvinau","_","_","aśvin","NC","","_","_"
7,"saubhagāya","_","_","saubhaga","NC","","_","_"
1,"tāvat","_","_","tāvat","CX","","_","_"
2,"_","_","_","su","CAD","","_","_"
3,"_","_","_","vṛtta","JJ","","_","_"
4,"anamanta","_","_","na","V","na","_","_"
5,"māyayā","_","_","māyā","NC","","_","_"
6,"sattamā","_","_","sattama","JJ","","_","_"
7,"gā","_","_","go","NC","","_","_"
8,"aruṇā","_","_","aruṇa","JJ","","_","_"
9,"udāvahan","_","_","udāvah","V","udāvah","_","_"
1,"ṣaṣṭiś","_","_","ṣaṣṭi","NC","","_","_"
2,"ca","_","_","ca","CCD","","_","_"
3,"gāvas","_","_","go","NC","","_","_"
4,"_","_","_","tri","NUM","","_","_"
5,"_","_","_","śata","NUM","","_","_"
6,"ca","_","_","ca","CCD","","_","_"
7,"dhenava","_","_","dhenu","NC","","_","_"
8,"ekaṃ","_","_","eka","PPX","","_","_"
9,"vatsaṃ","_","_","vatsa","NC","","_","_"
10,"suvate","_","_","suv","V","sū","_","_"
11,"taṃ","_","_","tad","PRD","","_","_"
12,"duhanti","_","_","duh","V","duh","_","_"
1,"_","_","_","nānā","CX","","_","_"
2,"_","_","_","goṣṭha","NC","","_","_"
3,"vihitā","_","_","vidhā","PPP","","_","_"
4,"_","_","_","eka","PPX","","_","_"
5,"_","_","_","dohana","NC","","_","_"
6,"_","_","_","tad","PRD","","_","_"
7,"_","_","_","aśvin","NC","","_","_"
8,"duhato","_","_","duh","V","duh","_","_"
9,"gharmam","_","_","gharma","NC","","_","_"
10,"ukthyam","_","_","ukthya","JJ","","_","_"
1,"ekāṃ","_","_","eka","PPX","","_","_"
2,"nābhiṃ","_","_","nābhi","NC","","_","_"
3,"_","_","_","saptan","NUM","","_","_"
4,"_","_","_","śata","NUM","","_","_"
5,"arāḥ","_","_","ara","NC","","_","_"
6,"śritāḥ","_","_","śri","PPP","","_","_"
7,"_","_","_","pradhi","NC","","_","_"
8,"_","_","_","anya","PPX","","_","_"
9,"viṃśatir","_","_","viṃśati","NC","","_","_"
10,"arpitā","_","_","arpay","PPP","","_","_"
11,"arāḥ","_","_","ara","NC","","_","_"
1,"_","_","_","a","CNG","","_","_"
2,"_","_","_","nemi","NC","","_","_"
3,"cakraṃ","_","_","cakra","NC","","_","_"
4,"parivartate","_","_","parivart","V","parivṛt","_","_"
5,"'jaraṃ","_","_","ajara","JJ","","_","_"
6,"_","_","_","māyā","NC","","_","_"
7,"_","_","_","aśvin","NC","","_","_"
8,"samanakti","_","_","samañj","V","samañj","_","_"
9,"carṣaṇī","_","_","carṣaṇi","NC","","_","_"
1,"ekaṃ","_","_","eka","PPX","","_","_"
2,"cakraṃ","_","_","cakra","NC","","_","_"
3,"vartate","_","_","vart","V","vṛt","_","_"
4,"_","_","_","dvādaśan","NUM","","_","_"
5,"_","_","_","ara","NC","","_","_"
6,"_","_","_","pradhi","NC","","_","_"
7,"_","_","_","ṣaṇṇābhi","JJ","","_","_"
8,"_","_","_","eka","PPX","","_","_"
9,"_","_","_","akṣa","NC","","_","_"
10,"amṛtasya","_","_","amṛta","NC","","_","_"
11,"dhāraṇam","_","_","dhāraṇa","JJ","","_","_"
1,"yasmin","_","_","yad","PRL","","_","_"
2,"devā","_","_","deva","NC","","_","_"
3,"adhi","_","_","adhi","CADP","","_","_"
4,"viśve","_","_","viśva","JQ","","_","_"
5,"viṣaktās","_","_","viṣañj","PPP","","_","_"
6,"_","_","_","tad","PRD","","_","_"
7,"_","_","_","aśvin","NC","","_","_"
8,"muñcato","_","_","muñc","V","muc","_","_"
9,"mā","_","_","mā","CNG","","_","_"
10,"viṣīdatam","_","_","viṣīd","V","viṣad","_","_"
1,"aśvināv","_","_","aśvin","NC","","_","_"
2,"indram","_","_","indra","NC","","_","_"
3,"amṛtaṃ","_","_","amṛta","NC","","_","_"
4,"_","_","_","vṛtta","JJ","","_","_"
5,"_","_","_","bhūya","NC","","_","_"
6,"tirodhattām","_","_","tirodhā","V","tirodhā","_","_"
7,"aśvinau","_","_","aśvin","NC","","_","_"
8,"_","_","_","dāsa","NC","","_","_"
9,"_","_","_","patnī","NC","","_","_"
1,"bhittvā","_","_","bhid","CGDA","","_","_"
2,"girim","_","_","giri","NC","","_","_"
3,"aśvinau","_","_","aśvin","NC","","_","_"
4,"gām","_","_","go","NC","","_","_"
5,"udācarantau","_","_","udācar","KDP","","_","_"
6,"_","_","_","tad","PRD","","_","_"
7,"_","_","_","vṛṣ","PPP","","_","_"
8,"_","_","_","mahan","NC","","_","_"
9,"prathitā","_","_","prath","PPP","","_","_"
10,"valasya","_","_","vala","NC","","_","_"
1,"yuvāṃ","_","_","tvat","PPR","","_","_"
2,"diśo","_","_","diś","NC","","_","_"
3,"janayatho","_","_","janay","V","janay","_","_"
4,"_","_","_","daśan","NUM","","_","_"
5,"_","_","_","agra","NC","","_","_"
6,"samānaṃ","_","_","samāna","JJ","","_","_"
7,"mūrdhni","_","_","mūrdhan","NC","","_","_"
8,"rathayā","_","_","rathayā","NC","","_","_"
9,"viyanti","_","_","viyat","NC","","_","_"
1,"tāsāṃ","_","_","tad","PRD","","_","_"
2,"yātam","_","_","yāta","NC","","_","_"
3,"ṛṣayo","_","_","ṛṣi","NC","","_","_"
4,"'nuprayānti","_","_","anuprayā","V","anuprayā","_","_"
5,"devā","_","_","deva","NC","","_","_"
6,"manuṣyāḥ","_","_","manuṣya","NC","","_","_"
7,"kṣitim","_","_","kṣiti","NC","","_","_"
8,"ācaranti","_","_","ācar","V","ācar","_","_"
1,"yuvāṃ","_","_","tvat","PPR","","_","_"
2,"varṇān","_","_","varṇa","NC","","_","_"
3,"vikurutho","_","_","vikar","V","vikṛ","_","_"
4,"_","_","_","viśva","JQ","","_","_"
5,"_","_","_","rūpa","NC","","_","_"
6,"te","_","_","tad","PRD","","_","_"
7,"'dhikṣiyanti","_","_","adhikṣi","V","adhikṣi","_","_"
8,"bhuvanāni","_","_","bhuvana","NC","","_","_"
9,"viśvā","_","_","viśva","JQ","","_","_"
1,"te","_","_","tad","PRD","","_","_"
2,"bhānavo","_","_","bhānu","NC","","_","_"
3,"'py","_","_","api","CX","","_","_"
4,"anusṛtāś","_","_","anusṛ","PPP","","_","_"
5,"caranti","_","_","car","V","car","_","_"
6,"devā","_","_","deva","NC","","_","_"
7,"manuṣyāḥ","_","_","manuṣya","NC","","_","_"
8,"kṣitim","_","_","kṣiti","NC","","_","_"
9,"ācaranti","_","_","ācar","V","ācar","_","_"
1,"tau","_","_","tad","PRD","","_","_"
2,"nāsatyāv","_","_","nāsatya","NC","","_","_"
3,"aśvināv","_","_","aśvin","NC","","_","_"
4,"āmahe","_","_","tvat","PPR","","_","_"
5,"vāṃ","_","_","sraj","NC","","_","_"
6,"srajaṃ","_","_","ca","CCD","","_","_"
7,"ca","_","_","yad","PRL","","_","_"
8,"yāṃ","_","_","bhṛ","V","bhṛ","_","_"
9,"bibhṛthaḥ","_","_","puṣkara","NC","","_","_"
1,"tau","_","_","tad","PRD","","_","_"
2,"nāsatyāv","_","_","nāsatya","NC","","_","_"
3,"_","_","_","amṛta","JJ","","_","_"
4,"_","_","_","ṛtāvṛdh","JJ","","_","_"
5,"ṛte","_","_","ṛte","CX","","_","_"
6,"devās","_","_","deva","NC","","_","_"
7,"tat","_","_","tad","PRD","","_","_"
8,"prapadena","_","_","prapada","NC","","_","_"
9,"sūte","_","_","suv","V","sū","_","_"
1,"mukhena","_","_","mukha","NC","","_","_"
2,"garbhaṃ","_","_","garbha","NC","","_","_"
3,"labhatāṃ","_","_","labh","V","labh","_","_"
4,"yuvānau","_","_","yuvan","NC","","_","_"
5,"gatāsur","_","_","gatāsu","JJ","","_","_"
6,"etat","_","_","tad","PRD","","_","_"
7,"prapadena","_","_","prapada","NC","","_","_"
8,"sūte","_","_","suv","V","sū","_","_"
1,"sadyo","_","_","sadyas","CAD","","_","_"
2,"jāto","_","_","jan","PPP","","_","_"
3,"mātaram","_","_","mātṛ","NC","","_","_"
4,"atti","_","_","ad","V","ad","_","_"
5,"garbhas","_","_","garbha","NC","","_","_"
6,"_","_","_","tad","PRD","","_","_"
7,"_","_","_","aśvin","NC","","_","_"
8,"muñcatho","_","_","muñc","V","muc","_","_"
9,"jīvase","_","_","jīv","CGDI","","_","_"
10,"gāḥ","_","_","go","NC","","_","_"
1,"evaṃ","_","_","eva","CX","","_","_"
2,"_","_","_","tad","PRD","","_","_"
3,"_","_","_","abhiṣṭu","PPP","","_","_"
4,"aśvināv","_","_","aśvin","NC","","_","_"
5,"ājagmatuḥ","_","_","āga","V","āga","_","_"
1,"āhatuś","_","_","ah","V","ah","_","_"
2,"_","_","_","ca","CCD","","_","_"
3,"_","_","_","a","PRD","","_","_"
1,"prītau","_","_","prī","PPP","","_","_"
2,"svaḥ","_","_","as","V","as","_","_"
1,"eṣa","_","_","tad","PRD","","_","_"
2,"te","_","_","tvat","PPR","","_","_"
3,"'pūpaḥ","_","_","apūpa","NC","","_","_"
1,"_","_","_","aś","V","aś","_","_"
2,"_","_","_","a","PRD","","_","_"
3,"iti","_","_","iti","CQT","","_","_"
1,"sa","_","_","tad","PRD","","_","_"
2,"evam","_","_","eva","CX","","_","_"
3,"uktaḥ","_","_","vac","PPP","","_","_"
4,"pratyuvāca","_","_","prativak","V","prativac","_","_"
1,"_","_","_","na","CNG","","_","_"
2,"_","_","_","anṛta","NC","","_","_"
3,"ūcatur","_","_","vak","V","vac","_","_"
4,"bhavantau","_","_","bhavat","JJ","","_","_"
1,"na","_","_","na","CNG","","_","_"
2,"tv","_","_","tu","CCD","","_","_"
3,"aham","_","_","mat","PPR","","_","_"
4,"etam","_","_","tad","PRD","","_","_"
5,"apūpam","_","_","apūpa","NC","","_","_"
6,"upayoktum","_","_","upayuj","CGDI","","_","_"
7,"utsahe","_","_","utsaha","V","utsah","_","_"
8,"_","_","_","a","CNG","","_","_"
9,"_","_","_","niveday","CGDA","","_","_"
10,"gurava","_","_","guru","NC","","_","_"
11,"iti","_","_","iti","CQT","","_","_"
1,"tatas","_","_","tatas","CX","","_","_"
2,"tam","_","_","tad","PRD","","_","_"
3,"aśvināv","_","_","aśvin","NC","","_","_"
4,"ūcatuḥ","_","_","vak","V","vac","_","_"
1,"āvābhyāṃ","_","_","mat","PPR","","_","_"
2,"purastād","_","_","purastāt","CX","","_","_"
3,"bhavata","_","_","bhavat","JJ","","_","_"
4,"_","_","_","upādhyāya","NC","","_","_"
5,"_","_","_","eva","CX","","_","_"
6,"_","_","_","eva","CEM","","_","_"
7,"_","_","_","abhiṣṭu","PPP","","_","_"
8,"apūpaḥ","_","_","apūpa","NC","","_","_"
9,"prītābhyāṃ","_","_","prī","PPP","","_","_"
10,"dattaḥ","_","_","dā","PPP","","_","_"
1,"upayuktaś","_","_","upayuj","PPP","","_","_"
2,"ca","_","_","ca","CCD","","_","_"
3,"sa","_","_","tad","PRD","","_","_"
4,"_","_","_","tad","PRD","","_","_"
5,"_","_","_","a","CNG","","_","_"
6,"_","_","_","niveday","CGDA","","_","_"
7,"gurave","_","_","guru","NC","","_","_"
1,"tvam","_","_","tvat","PPR","","_","_"
2,"api","_","_","api","CX","","_","_"
3,"_","_","_","tathā","CX","","_","_"
4,"_","_","_","eva","CEM","","_","_"
5,"kuruṣva","_","_","kar","V","kṛ","_","_"
6,"yathā","_","_","yathā","CCM","","_","_"
7,"kṛtam","_","_","kṛ","PPP","","_","_"
8,"_","_","_","upādhyāya","NC","","_","_"
9,"_","_","_","iti","CQT","","_","_"
1,"sa","_","_","tad","PRD","","_","_"
2,"evam","_","_","eva","CX","","_","_"
3,"uktaḥ","_","_","vac","PPP","","_","_"
4,"punar","_","_","punar","CAD","","_","_"
5,"eva","_","_","eva","CEM","","_","_"
6,"_","_","_","prativak","V","prativac","_","_"
7,"_","_","_","tad","PRD","","_","_"
1,"pratyanunaye","_","_","pratyanunī","V","pratyanunī","_","_"
2,"bhavantāv","_","_","bhavat","JJ","","_","_"
3,"aśvinau","_","_","aśvin","NC","","_","_"
1,"_","_","_","na","CNG","","_","_"
2,"_","_","_","utsah","V","utsah","_","_"
3,"'ham","_","_","mat","PPR","","_","_"
4,"_","_","_","a","CNG","","_","_"
5,"_","_","_","niveday","CGDA","","_","_"
6,"_","_","_","upādhyāya","NC","","_","_"
7,"_","_","_","upayuj","CGDI","","_","_"
8,"iti","_","_","iti","CQT","","_","_"
1,"tam","_","_","tad","PRD","","_","_"
2,"aśvināv","_","_","aśvin","NC","","_","_"
3,"āhatuḥ","_","_","ah","V","ah","_","_"
1,"prītau","_","_","prī","PPP","","_","_"
2,"svas","_","_","as","V","as","_","_"
3,"_","_","_","tvat","PPR","","_","_"
4,"_","_","_","ida","PRD","","_","_"
5,"_","_","_","guru","NC","","_","_"
6,"_","_","_","vṛtti","NC","","_","_"
1,"upādhyāyasya","_","_","upādhyāya","NC","","_","_"
2,"te","_","_","tvat","PPR","","_","_"
3,"kārṣṇāyasā","_","_","kārṣṇāyasa","JJ","","_","_"
4,"dantāḥ","_","_","danta","NC","","_","_"
1,"bhavato","_","_","bhavat","JJ","","_","_"
2,"hiraṇmayā","_","_","hiraṇmaya","JJ","","_","_"
3,"bhaviṣyanti","_","_","bhav","V","bhū","_","_"
1,"cakṣuṣmāṃś","_","_","cakṣuṣmat","JJ","","_","_"
2,"ca","_","_","ca","CCD","","_","_"
3,"bhaviṣyasi","_","_","bhav","V","bhū","_","_"
1,"śreyaś","_","_","śreyas","NC","","_","_"
2,"_","_","_","ca","CCD","","_","_"
3,"_","_","_","avāp","V","avāp","_","_"
4,"_","_","_","iti","CQT","","_","_"
1,"sa","_","_","tad","PRD","","_","_"
2,"evam","_","_","eva","CX","","_","_"
3,"ukto","_","_","vac","PPP","","_","_"
4,"'śvibhyāṃ","_","_","aśvin","NC","","_","_"
5,"_","_","_","labh","PPP","","_","_"
6,"_","_","_","cakṣus","NC","","_","_"
7,"_","_","_","upādhyāya","NC","","_","_"
8,"_","_","_","sakāśa","NC","","_","_"
9,"_","_","_","āga","CGDA","","_","_"
10,"_","_","_","upādhyāya","NC","","_","_"
11,"_","_","_","abhivāday","CGDA","","_","_"
12,"_","_","_","ācakṣ","V","ācakṣ","_","_"
1,"sa","_","_","tad","PRD","","_","_"
2,"_","_","_","ca","CCD","","_","_"
3,"_","_","_","ida","PRD","","_","_"
4,"prītimān","_","_","prītimat","JJ","","_","_"
5,"abhūt","_","_","bhav","V","bhū","_","_"
1,"āha","_","_","ah","V","ah","_","_"
2,"_","_","_","ca","CCD","","_","_"
3,"_","_","_","a","PRD","","_","_"
1,"_","_","_","yathā","CCM","","_","_"
2,"_","_","_","aśvin","NC","","_","_"
3,"āhatus","_","_","ah","V","ah","_","_"
4,"tathā","_","_","tathā","CX","","_","_"
5,"tvaṃ","_","_","tvat","PPR","","_","_"
6,"śreyo","_","_","śreyas","NC","","_","_"
7,"_","_","_","avāp","V","avāp","_","_"
8,"_","_","_","iti","CQT","","_","_"
1,"sarve","_","_","sarva","JQ","","_","_"
2,"ca","_","_","ca","CCD","","_","_"
3,"te","_","_","tvat","PPR","","_","_"
4,"vedāḥ","_","_","veda","NC","","_","_"
5,"_","_","_","pratibhā","V","pratibhā","_","_"
6,"_","_","_","iti","CQT","","_","_"
1,"eṣā","_","_","tad","PRD","","_","_"
2,"_","_","_","tad","PRD","","_","_"
3,"_","_","_","api","CX","","_","_"
4,"_","_","_","parīkṣā","NC","","_","_"
5,"_","_","_","upamanyu","NC","","_","_"
1,"_","_","_","atha","CAD","","_","_"
2,"_","_","_","apara","PPX","","_","_"
3,"śiṣyas","_","_","śiṣya","NC","","_","_"
4,"_","_","_","tad","PRD","","_","_"
5,"_","_","_","eva","CEM","","_","_"
6,"_","_","_","āyoda","NC","","_","_"
7,"dhaumyasya","_","_","dhaumya","NC","","_","_"
8,"vedo","_","_","veda","NC","","_","_"
9,"nāma","_","_","nāma","CX","","_","_"
1,"tam","_","_","tad","PRD","","_","_"
2,"upādhyāyaḥ","_","_","upādhyāya","NC","","_","_"
3,"saṃdideśa","_","_","saṃdiś","V","saṃdiś","_","_"
1,"vatsa","_","_","vatsa","NC","","_","_"
2,"veda","_","_","veda","NC","","_","_"
3,"_","_","_","iha","CAD","","_","_"
4,"_","_","_","ās","V","ās","_","_"
1,"bhavatā","_","_","bhavat","JJ","","_","_"
2,"_","_","_","mat","PPR","","_","_"
3,"_","_","_","gṛha","NC","","_","_"
4,"kaṃcit","_","_","kiṃcit","PRI","","_","_"
5,"kālaṃ","_","_","kāla","NC","","_","_"
6,"śuśrūṣamāṇena","_","_","śuśrūṣ","KDP","","_","_"
7,"bhavitavyam","_","_","bhū","KDG","","_","_"
1,"śreyas","_","_","śreyas","NC","","_","_"
2,"te","_","_","tvat","PPR","","_","_"
3,"_","_","_","bhav","V","bhū","_","_"
4,"_","_","_","iti","CQT","","_","_"
1,"sa","_","_","tad","PRD","","_","_"
2,"_","_","_","tathā","CX","","_","_"
3,"_","_","_","iti","CQT","","_","_"
4,"uktvā","_","_","vac","CGDA","","_","_"
5,"_","_","_","guru","NC","","_","_"
6,"_","_","_","kula","NC","","_","_"
7,"_","_","_","dīrgha","JJ","","_","_"
8,"_","_","_","kāla","NC","","_","_"
9,"_","_","_","guru","NC","","_","_"
10,"_","_","_","śuśrūṣaṇa","NC","","_","_"
11,"_","_","_","para","PPX","","_","_"
12,"'vasat","_","_","vas","V","vas","_","_"
1,"gaur","_","_","go","NC","","_","_"
2,"iva","_","_","iva","CCM","","_","_"
3,"nityaṃ","_","_","nitya","CX","","_","_"
4,"guruṣu","_","_","guru","NC","","_","_"
5,"dhūrṣu","_","_","dhur","NC","","_","_"
6,"niyujyamānaḥ","_","_","niyuj","KDP","","_","_"
7,"_","_","_","śīta","JJ","","_","_"
8,"_","_","_","uṣṇa","JJ","","_","_"
9,"_","_","_","kṣudh","NC","","_","_"
10,"_","_","_","tṛṣṇā","NC","","_","_"
11,"_","_","_","duḥkha","NC","","_","_"
12,"_","_","_","saha","JJ","","_","_"
13,"_","_","_","sarvatra","CX","","_","_"
14,"_","_","_","apratikūla","JJ","","_","_"
1,"tasya","_","_","tad","PRD","","_","_"
2,"mahatā","_","_","mahat","JJ","","_","_"
3,"kālena","_","_","kāla","NC","","_","_"
4,"guruḥ","_","_","guru","NC","","_","_"
5,"paritoṣaṃ","_","_","paritoṣa","NC","","_","_"
6,"jagāma","_","_","ga","V","ga","_","_"
1,"_","_","_","tad","PRD","","_","_"
2,"_","_","_","paritoṣa","NC","","_","_"
3,"_","_","_","ca","CCD","","_","_"
4,"śreyaḥ","_","_","śreyas","NC","","_","_"
5,"_","_","_","sarvajña","JJ","","_","_"
7,"_","_","_","ca","CCD","","_","_"
8,"_","_","_","avāp","V","avāp","_","_"
1,"eṣā","_","_","tad","PRD","","_","_"
2,"_","_","_","tad","PRD","","_","_"
3,"_","_","_","api","CX","","_","_"
4,"parīkṣā","_","_","parīkṣā","NC","","_","_"
5,"vedasya","_","_","veda","NC","","_","_"
1,"sa","_","_","tad","PRD","","_","_"
2,"_","_","_","upādhyāya","NC","","_","_"
3,"_","_","_","anujñā","PPP","","_","_"
4,"samāvṛttas","_","_","samāvṛt","PPP","","_","_"
5,"tasmād","_","_","tad","PRD","","_","_"
6,"_","_","_","guru","NC","","_","_"
7,"_","_","_","kula","NC","","_","_"
8,"_","_","_","vāsa","NC","","_","_"
9,"_","_","_","gṛha","NC","","_","_"
10,"_","_","_","āśrama","NC","","_","_"
11,"pratyapadyata","_","_","pratipad","V","pratipad","_","_"
1,"_","_","_","tad","PRD","","_","_"
2,"_","_","_","api","CX","","_","_"
3,"_","_","_","sva","JJ","","_","_"
4,"_","_","_","gṛha","NC","","_","_"
5,"vasatas","_","_","vas","KDP","","_","_"
6,"trayaḥ","_","_","tri","NUM","","_","_"
7,"śiṣyā","_","_","śiṣya","NC","","_","_"
8,"babhūvuḥ","_","_","bhav","V","bhū","_","_"
1,"sa","_","_","sa_saha","CX","","_","_"
2,"śiṣyān","_","_","śiṣya","NC","","_","_"
3,"na","_","_","na","CNG","","_","_"
4,"kiṃcid","_","_","kiṃcit","PRI","","_","_"
5,"uvāca","_","_","vak","V","vac","_","_"
1,"karma","_","_","karman","NC","","_","_"
2,"vā","_","_","vā","CCD","","_","_"
3,"kriyatāṃ","_","_","kar","V","kṛ","_","_"
4,"_","_","_","guru","NC","","_","_"
5,"_","_","_","śuśrūṣā","NC","","_","_"
6,"_","_","_","vā","CCD","","_","_"
7,"_","_","_","iti","CQT","","_","_"
1,"_","_","_","duḥkha","NC","","_","_"
2,"_","_","_","abhijña","JJ","","_","_"
3,"hi","_","_","hi","CX","","_","_"
4,"_","_","_","guru","NC","","_","_"
5,"_","_","_","kula","NC","","_","_"
6,"_","_","_","vāsa","NC","","_","_"
7,"śiṣyān","_","_","śiṣya","NC","","_","_"
8,"parikleśena","_","_","parikleśa","NC","","_","_"
9,"yojayituṃ","_","_","yojay","CGDI","","_","_"
10,"_","_","_","na","CNG","","_","_"
11,"_","_","_","iṣ","V","iṣ","_","_"
1,"atha","_","_","atha","CAD","","_","_"
2,"kasyacit","_","_","kiṃcit","PRI","","_","_"
3,"kālasya","_","_","kāla","NC","","_","_"
4,"vedaṃ","_","_","veda","NC","","_","_"
5,"brāhmaṇaṃ","_","_","brāhmaṇa","NC","","_","_"
6,"janamejayaḥ","_","_","janamejaya","NC","","_","_"
7,"_","_","_","pauṣya","NC","","_","_"
8,"_","_","_","ca","CCD","","_","_"
9,"_","_","_","kṣatriya","NC","","_","_"
10,"_","_","_","upe","CGDA","","_","_"
11,"_","_","_","upādhyāya","NC","","_","_"
12,"varayāṃcakratuḥ","_","_","varay","V","varay","_","_"
1,"sa","_","_","tad","PRD","","_","_"
2,"kadācid","_","_","kadācid","CX","","_","_"
3,"_","_","_","yājya","NC","","_","_"
4,"_","_","_","kārya","NC","","_","_"
5,"_","_","_","abhiprasthā","PPP","","_","_"
6,"uttaṅkaṃ","_","_","uttaṅka","NC","","_","_"
7,"nāma","_","_","nāma","CX","","_","_"
8,"śiṣyaṃ","_","_","śiṣya","NC","","_","_"
9,"niyojayāmāsa","_","_","niyojay","V","niyojay","_","_"
1,"bho","_","_","bho","CX","","_","_"
2,"uttaṅka","_","_","uttaṅka","NC","","_","_"
3,"yat","_","_","yad","PRL","","_","_"
4,"kiṃcid","_","_","kiṃcit","PRI","","_","_"
5,"_","_","_","mat","PPR","","_","_"
6,"_","_","_","gṛha","NC","","_","_"
7,"parihīyate","_","_","parijah","V","parihā","_","_"
8,"tad","_","_","tad","PRD","","_","_"
9,"_","_","_","iṣ","V","iṣ","_","_"
10,"_","_","_","mat","PPR","","_","_"
11,"_","_","_","a","CNG","","_","_"
12,"_","_","_","parihā","PPP","","_","_"
13,"bhavatā","_","_","bhavat","JJ","","_","_"
14,"kriyamāṇam","_","_","kṛ","KDP","","_","_"
15,"iti","_","_","iti","CQT","","_","_"
1,"sa","_","_","tad","PRD","","_","_"
2,"evaṃ","_","_","eva","CX","","_","_"
3,"_","_","_","pratisamādiś","CGDA","","_","_"
4,"_","_","_","uttaṅka","NC","","_","_"
5,"vedaḥ","_","_","veda","NC","","_","_"
6,"pravāsaṃ","_","_","pravāsa","NC","","_","_"
7,"jagāma","_","_","ga","V","ga","_","_"
1,"_","_","_","atha","CAD","","_","_"
2,"_","_","_","uttaṅka","NC","","_","_"
3,"_","_","_","guru","NC","","_","_"
4,"_","_","_","śuśrūṣu","JJ","","_","_"
5,"_","_","_","guru","NC","","_","_"
6,"_","_","_","niyoga","NC","","_","_"
7,"anutiṣṭhamānas","_","_","anuṣṭhā","KDP","","_","_"
8,"tatra","_","_","tatra","CAD","","_","_"
9,"_","_","_","guru","NC","","_","_"
10,"_","_","_","kula","NC","","_","_"
11,"vasati","_","_","vas","V","vas","_","_"
12,"sma","_","_","sma","CX","","_","_"
1,"sa","_","_","tad","PRD","","_","_"
2,"vasaṃs","_","_","vas","KDP","","_","_"
3,"_","_","_","tatra","CAD","","_","_"
4,"_","_","_","upādhyāya","NC","","_","_"
5,"_","_","_","strī","NC","","_","_"
6,"sahitābhir","_","_","sahita","JJ","","_","_"
7,"_","_","_","āhvā","CGDA","","_","_"
8,"_","_","_","vac","PPP","","_","_"
1,"upādhyāyinī","_","_","upādhyāyinī","NC","","_","_"
2,"te","_","_","tvat","PPR","","_","_"
3,"ṛtumatī","_","_","ṛtumatī","NC","","_","_"
1,"upādhyāyaś","_","_","upādhyāya","NC","","_","_"
2,"ca","_","_","ca","CCD","","_","_"
3,"proṣitaḥ","_","_","pravas","PPP","","_","_"
1,"asyā","_","_","ida","PRD","","_","_"
2,"_","_","_","yathā","CCM","","_","_"
3,"_","_","_","ida","PRD","","_","_"
4,"ṛtur","_","_","ṛtu","NC","","_","_"
5,"vandhyo","_","_","vandhya","JJ","","_","_"
6,"na","_","_","na","CNG","","_","_"
7,"bhavati","_","_","bhav","V","bhū","_","_"
8,"tathā","_","_","tathā","CX","","_","_"
9,"kriyatām","_","_","kar","V","kṛ","_","_"
1,"etad","_","_","tad","PRD","","_","_"
2,"_","_","_","viṣīd","V","viṣad","_","_"
3,"_","_","_","iti","CQT","","_","_"
1,"sa","_","_","tad","PRD","","_","_"
2,"evam","_","_","eva","CX","","_","_"
3,"uktas","_","_","vac","PPP","","_","_"
4,"tāḥ","_","_","tad","PRD","","_","_"
5,"striyaḥ","_","_","strī","NC","","_","_"
6,"pratyuvāca","_","_","prativak","V","prativac","_","_"
1,"na","_","_","na","CNG","","_","_"
2,"mayā","_","_","mat","PPR","","_","_"
3,"strīṇāṃ","_","_","strī","NC","","_","_"
4,"vacanād","_","_","vacana","NC","","_","_"
5,"idam","_","_","ida","PRD","","_","_"
6,"akāryaṃ","_","_","akārya","NC","","_","_"
7,"kāryam","_","_","kṛ","KDG","","_","_"
1,"na","_","_","na","CNG","","_","_"
2,"hy","_","_","hi","CX","","_","_"
3,"aham","_","_","mat","PPR","","_","_"
4,"upādhyāyena","_","_","upādhyāya","NC","","_","_"
5,"saṃdiṣṭaḥ","_","_","saṃdiś","PPP","","_","_"
1,"akāryam","_","_","akārya","NC","","_","_"
2,"api","_","_","api","CX","","_","_"
3,"tvayā","_","_","tvat","PPR","","_","_"
4,"kāryam","_","_","kṛ","KDG","","_","_"
5,"iti","_","_","iti","CQT","","_","_"
1,"tasya","_","_","tad","PRD","","_","_"
2,"punar","_","_","punar","CAD","","_","_"
3,"upādhyāyaḥ","_","_","upādhyāya","NC","","_","_"
4,"_","_","_","kāla","NC","","_","_"
5,"_","_","_","antara","NC","","_","_"
6,"gṛhān","_","_","gṛha","NC","","_","_"
7,"upajagāma","_","_","upaga","V","upaga","_","_"
8,"tasmāt","_","_","tad","PRD","","_","_"
9,"pravāsāt","_","_","pravāsa","NC","","_","_"
1,"sa","_","_","tad","PRD","","_","_"
2,"_","_","_","tad","PRD","","_","_"
3,"_","_","_","vṛtta","NC","","_","_"
4,"_","_","_","tad","PRD","","_","_"
5,"_","_","_","aśeṣa","JJ","","_","_"
6,"upalabhya","_","_","upalabh","CGDA","","_","_"
7,"prītimān","_","_","prītimat","JJ","","_","_"
8,"abhūt","_","_","bhav","V","bhū","_","_"
1,"uvāca","_","_","vak","V","vac","_","_"
2,"_","_","_","ca","CCD","","_","_"
3,"_","_","_","a","PRD","","_","_"
1,"_","_","_","vatsa","NC","","_","_"
2,"_","_","_","uttaṅka","NC","","_","_"
3,"kiṃ","_","_","kiṃ","PRQ","","_","_"
4,"te","_","_","tvat","PPR","","_","_"
5,"priyaṃ","_","_","priya","JJ","","_","_"
6,"_","_","_","kar","V","kṛ","_","_"
7,"_","_","_","iti","CQT","","_","_"
1,"dharmato","_","_","dharma","NC","","_","_"
2,"hi","_","_","hi","CX","","_","_"
3,"śuśrūṣito","_","_","śuśrūṣ","PPP","","_","_"
4,"'smi","_","_","as","V","as","_","_"
5,"bhavatā","_","_","bhavat","JJ","","_","_"
1,"tena","_","_","tad","PRD","","_","_"
2,"prītiḥ","_","_","prīti","NC","","_","_"
3,"paraspareṇa","_","_","paraspara","PRC","","_","_"
4,"nau","_","_","mat","PPR","","_","_"
5,"saṃvṛddhā","_","_","saṃvṛdh","PPP","","_","_"
1,"tad","_","_","tad","PRD","","_","_"
2,"anujāne","_","_","anujān","V","anujñā","_","_"
3,"bhavantam","_","_","bhavat","JJ","","_","_"
1,"sarvām","_","_","sarva","JQ","","_","_"
2,"eva","_","_","eva","CEM","","_","_"
3,"siddhiṃ","_","_","siddhi","NC","","_","_"
4,"prāpsyasi","_","_","prāpn","V","prāp","_","_"
1,"gamyatām","_","_","ga","V","ga","_","_"
2,"iti","_","_","iti","CQT","","_","_"
1,"sa","_","_","tad","PRD","","_","_"
2,"evam","_","_","eva","CX","","_","_"
3,"uktaḥ","_","_","vac","PPP","","_","_"
4,"pratyuvāca","_","_","prativak","V","prativac","_","_"
1,"kiṃ","_","_","kiṃ","PRQ","","_","_"
2,"te","_","_","tvat","PPR","","_","_"
3,"priyaṃ","_","_","priya","JJ","","_","_"
4,"_","_","_","kar","V","kṛ","_","_"
5,"_","_","_","iti","CQT","","_","_"
1,"evaṃ","_","_","eva","CX","","_","_"
2,"hy","_","_","hi","CX","","_","_"
3,"āhuḥ","_","_","ah","V","ah","_","_"
1,"yaś","_","_","yad","PRL","","_","_"
2,"_","_","_","ca","CCD","","_","_"
3,"_","_","_","adharma","NC","","_","_"
4,"vibrūyād","_","_","vibrū","V","vibrū","_","_"
5,"yaś","_","_","yad","PRL","","_","_"
6,"_","_","_","ca","CCD","","_","_"
7,"_","_","_","adharma","NC","","_","_"
8,"pṛcchati","_","_","pṛcch","V","prach","_","_"
1,"tayor","_","_","tad","PRD","","_","_"
2,"anyataraḥ","_","_","anyatara","PPX","","_","_"
3,"praiti","_","_","pre","V","pre","_","_"
4,"vidveṣaṃ","_","_","vidveṣa","NC","","_","_"
5,"_","_","_","ca","CCD","","_","_"
6,"_","_","_","adhiga","V","adhiga","_","_"
1,"so","_","_","tad","PRD","","_","_"
2,"'ham","_","_","mat","PPR","","_","_"
3,"anujñāto","_","_","anujñā","PPP","","_","_"
4,"bhavatā","_","_","bhavat","JJ","","_","_"
5,"_","_","_","iṣ","V","iṣ","_","_"
6,"_","_","_","iṣ","PPP","","_","_"
7,"te","_","_","tvat","PPR","","_","_"
8,"_","_","_","guru","NC","","_","_"
9,"_","_","_","artha","NC","","_","_"
10,"upahartum","_","_","upahṛ","CGDI","","_","_"
11,"iti","_","_","iti","CQT","","_","_"
1,"_","_","_","tad","PRD","","_","_"
2,"_","_","_","eva","CX","","_","_"
3,"ukta","_","_","vac","PPP","","_","_"
4,"upādhyāyaḥ","_","_","upādhyāya","NC","","_","_"
5,"pratyuvāca","_","_","prativak","V","prativac","_","_"
1,"_","_","_","vatsa","NC","","_","_"
2,"_","_","_","uttaṅka","NC","","_","_"
3,"uṣyatāṃ","_","_","vas","V","vas","_","_"
4,"tāvad","_","_","tāvat","CX","","_","_"
5,"iti","_","_","iti","CQT","","_","_"
1,"sa","_","_","tad","PRD","","_","_"
2,"kadācit","_","_","kadācid","CX","","_","_"
3,"tam","_","_","tad","PRD","","_","_"
4,"upādhyāyam","_","_","upādhyāya","NC","","_","_"
5,"_","_","_","ah","V","ah","_","_"
6,"_","_","_","uttaṅka","NC","","_","_"
1,"ājñāpayatu","_","_","ājān","V","ājñā","_","_"
2,"bhavān","_","_","bhavat","JJ","","_","_"
1,"kiṃ","_","_","kiṃ","PRQ","","_","_"
2,"te","_","_","tvat","PPR","","_","_"
3,"priyam","_","_","priya","JJ","","_","_"
4,"upaharāmi","_","_","upahar","V","upahṛ","_","_"
5,"_","_","_","guru","NC","","_","_"
6,"_","_","_","artha","NC","","_","_"
7,"iti","_","_","iti","CQT","","_","_"
1,"tam","_","_","tad","PRD","","_","_"
2,"upādhyāyaḥ","_","_","upādhyāya","NC","","_","_"
3,"pratyuvāca","_","_","prativak","V","prativac","_","_"
1,"_","_","_","vatsa","NC","","_","_"
2,"_","_","_","uttaṅka","NC","","_","_"
3,"bahuśo","_","_","bahuśas","CX","","_","_"
4,"māṃ","_","_","mat","PPR","","_","_"
5,"codayasi","_","_","coday","V","coday","_","_"
6,"_","_","_","guru","NC","","_","_"
7,"_","_","_","artha","NC","","_","_"
8,"upahareyam","_","_","upahar","V","upahṛ","_","_"
9,"iti","_","_","iti","CQT","","_","_"
1,"tad","_","_","tad","PRD","","_","_"
2,"gaccha","_","_","ga","V","ga","_","_"
1,"enāṃ","_","_","a","PRD","","_","_"
2,"_","_","_","praviś","CGDA","","_","_"
3,"_","_","_","upādhyāyinī","NC","","_","_"
4,"pṛccha","_","_","pracch","V","pracch","_","_"
5,"kim","_","_","kiṃ","PRQ","","_","_"
6,"_","_","_","upahar","V","upahṛ","_","_"
7,"_","_","_","iti","CQT","","_","_"
1,"eṣā","_","_","tad","PRD","","_","_"
2,"yad","_","_","yad","PRL","","_","_"
3,"bravīti","_","_","abravīta","V","brū","_","_"
4,"tad","_","_","tad","PRD","","_","_"
5,"_","_","_","upahar","V","upahṛ","_","_"
6,"_","_","_","iti","CQT","","_","_"
1,"sa","_","_","tad","PRD","","_","_"
2,"evam","_","_","eva","CX","","_","_"
3,"ukta","_","_","vac","PPP","","_","_"
4,"_","_","_","upādhyāya","NC","","_","_"
5,"_","_","_","upādhyāyinī","NC","","_","_"
6,"apṛcchat","_","_","pracch","V","pracch","_","_"
1,"bhavaty","_","_","bhav","V","bhū","_","_"
2,"_","_","_","upādhyāya","NC","","_","_"
3,"_","_","_","as","V","as","_","_"
4,"anujñāto","_","_","anujñā","PPP","","_","_"
5,"gṛhaṃ","_","_","gṛha","NC","","_","_"
6,"gantum","_","_","ga","CGDI","","_","_"
1,"tad","_","_","tad","PRD","","_","_"
2,"_","_","_","iṣ","V","iṣ","_","_"
3,"_","_","_","iṣ","PPP","","_","_"
4,"te","_","_","tvat","PPR","","_","_"
5,"_","_","_","guru","NC","","_","_"
6,"_","_","_","artha","NC","","_","_"
7,"_","_","_","upahṛ","CGDA","","_","_"
8,"_","_","_","anṛṇa","JJ","","_","_"
9,"gantum","_","_","ga","CGDI","","_","_"
1,"tad","_","_","tad","PRD","","_","_"
2,"ājñāpayatu","_","_","ājān","V","ājñā","_","_"
3,"bhavatī","_","_","bhavat","JJ","","_","_"
1,"kim","_","_","kiṃ","PRQ","","_","_"
2,"upaharāmi","_","_","upahar","V","upahṛ","_","_"
3,"_","_","_","guru","NC","","_","_"
4,"_","_","_","artha","NC","","_","_"
5,"iti","_","_","iti","CQT","","_","_"
1,"_","_","_","tad","PRD","","_","_"
2,"_","_","_","eva","CX","","_","_"
3,"_","_","_","vac","PPP","","_","_"
4,"_","_","_","upādhyāyinī","NC","","_","_"
5,"uttaṅkaṃ","_","_","uttaṅka","NC","","_","_"
6,"pratyuvāca","_","_","prativak","V","prativac","_","_"
1,"gaccha","_","_","ga","V","ga","_","_"
2,"pauṣyaṃ","_","_","pauṣya","NC","","_","_"
3,"rājānam","_","_","rājan","NC","","_","_"
1,"bhikṣasva","_","_","bhikṣ","V","bhikṣ","_","_"
2,"tasya","_","_","tad","PRD","","_","_"
3,"kṣatriyayā","_","_","kṣatriyā","NC","","_","_"
4,"pinaddhe","_","_","pinah","PPP","","_","_"
5,"kuṇḍale","_","_","kuṇḍala","NC","","_","_"
1,"te","_","_","tad","PRD","","_","_"
2,"ānayasva","_","_","ānay","V","ānī","_","_"
1,"itaś","_","_","itas","CX","","_","_"
2,"caturthe","_","_","caturtha","JJ","","_","_"
3,"'hani","_","_","ahar","NC","","_","_"
4,"puṇyakaṃ","_","_","puṇyaka","NC","","_","_"
5,"bhavitā","_","_","bhav","V","bhū","_","_"
1,"tābhyām","_","_","tad","PRD","","_","_"
2,"ābaddhābhyāṃ","_","_","ābandh","PPP","","_","_"
3,"brāhmaṇān","_","_","brāhmaṇa","NC","","_","_"
4,"pariveṣṭum","_","_","pariviś","CGDI","","_","_"
5,"icchāmi","_","_","iṣ","V","iṣ","_","_"
1,"śobhamānā","_","_","śubh","KDP","","_","_"
2,"yathā","_","_","yathā","CCM","","_","_"
3,"tābhyāṃ","_","_","tad","PRD","","_","_"
4,"kuṇḍalābhyāṃ","_","_","kuṇḍala","NC","","_","_"
5,"tasminn","_","_","tad","PRD","","_","_"
6,"ahani","_","_","ahar","NC","","_","_"
7,"saṃpādayasva","_","_","sampāday","V","sampāday","_","_"
1,"śreyo","_","_","śreyas","JJ","","_","_"
2,"hi","_","_","hi","CX","","_","_"
3,"te","_","_","tvat","PPR","","_","_"
4,"syāt","_","_","as","V","as","_","_"
5,"kṣaṇaṃ","_","_","kṣaṇa","NC","","_","_"
6,"kurvata","_","_","kṛ","KDP","","_","_"
7,"iti","_","_","iti","CQT","","_","_"
1,"sa","_","_","tad","PRD","","_","_"
2,"evam","_","_","eva","CX","","_","_"
3,"ukta","_","_","vac","PPP","","_","_"
4,"upādhyāyinyā","_","_","upādhyāyinī","NC","","_","_"
5,"_","_","_","pratiṣṭh","V","prasthā","_","_"
6,"_","_","_","uttaṅka","NC","","_","_"
1,"sa","_","_","tad","PRD","","_","_"
2,"pathi","_","_","pathin","NC","","_","_"
3,"gacchann","_","_","ga","KDP","","_","_"
4,"apaśyad","_","_","paś","V","paś","_","_"
5,"ṛṣabham","_","_","ṛṣabha","NC","","_","_"
6,"_","_","_","ati","CADP","","_","_"
7,"_","_","_","pramāṇa","NC","","_","_"
8,"tam","_","_","tad","PRD","","_","_"
9,"adhirūḍhaṃ","_","_","adhiruh","PPP","","_","_"
10,"ca","_","_","ca","CCD","","_","_"
11,"puruṣam","_","_","puruṣa","NC","","_","_"
12,"_","_","_","ati","CADP","","_","_"
13,"_","_","_","pramāṇa","NC","","_","_"
14,"eva","_","_","eva","CEM","","_","_"
1,"sa","_","_","tad","PRD","","_","_"
2,"puruṣa","_","_","puruṣa","NC","","_","_"
3,"uttaṅkam","_","_","uttaṅka","NC","","_","_"
4,"abhyabhāṣata","_","_","abhibhāṣ","V","abhibhāṣ","_","_"
1,"_","_","_","uttaṅka","NC","","_","_"
2,"_","_","_","tad","PRD","","_","_"
3,"purīṣam","_","_","purīṣa","NC","","_","_"
4,"asya","_","_","ida","PRD","","_","_"
5,"ṛṣabhasya","_","_","ṛṣabha","NC","","_","_"
6,"_","_","_","bhakṣay","V","bhakṣay","_","_"
7,"_","_","_","iti","CQT","","_","_"
1,"sa","_","_","tad","PRD","","_","_"
2,"evam","_","_","eva","CX","","_","_"
3,"ukto","_","_","vac","PPP","","_","_"
4,"_","_","_","na","CNG","","_","_"
5,"_","_","_","iṣ","V","iṣ","_","_"
1,"tam","_","_","tad","PRD","","_","_"
2,"āha","_","_","ah","V","ah","_","_"
3,"puruṣo","_","_","puruṣa","NC","","_","_"
4,"bhūyaḥ","_","_","bhūyas","CX","","_","_"
1,"_","_","_","bhakṣay","V","bhakṣay","_","_"
2,"_","_","_","uttaṅka","NC","","_","_"
1,"mā","_","_","mā","CNG","","_","_"
2,"vicāraya","_","_","vicāray","V","vicāray","_","_"
1,"_","_","_","upādhyāya","NC","","_","_"
2,"_","_","_","api","CX","","_","_"
3,"te","_","_","tvat","PPR","","_","_"
4,"bhakṣitaṃ","_","_","bhakṣay","PPP","","_","_"
5,"pūrvam","_","_","pūrva","CX","","_","_"
6,"iti","_","_","iti","CQT","","_","_"
1,"sa","_","_","tad","PRD","","_","_"
2,"evam","_","_","eva","CX","","_","_"
3,"ukto","_","_","vac","PPP","","_","_"
4,"bāḍham","_","_","bāḍha","CX","","_","_"
5,"ity","_","_","iti","CQT","","_","_"
6,"uktvā","_","_","vac","CGDA","","_","_"
7,"tadā","_","_","tadā","CAD","","_","_"
8,"tad","_","_","tad","PRD","","_","_"
9,"ṛṣabhasya","_","_","ṛṣabha","NC","","_","_"
10,"purīṣaṃ","_","_","purīṣa","NC","","_","_"
11,"mūtraṃ","_","_","mūtra","NC","","_","_"
12,"ca","_","_","ca","CCD","","_","_"
13,"_","_","_","bhakṣay","CGDA","","_","_"
14,"_","_","_","uttaṅka","NC","","_","_"
15,"pratasthe","_","_","pratiṣṭh","V","prasthā","_","_"
16,"yatra","_","_","yatra","CX","","_","_"
17,"sa","_","_","tad","PRD","","_","_"
18,"kṣatriyaḥ","_","_","kṣatriya","NC","","_","_"
19,"pauṣyaḥ","_","_","pauṣya","NC","","_","_"
1,"tam","_","_","tad","PRD","","_","_"
2,"_","_","_","upe","CGDA","","_","_"
3,"_","_","_","paś","V","paś","_","_"
4,"uttaṅka","_","_","uttaṅka","NC","","_","_"
5,"āsīnam","_","_","ās","PPP","","_","_"
1,"sa","_","_","tad","PRD","","_","_"
2,"tam","_","_","tad","PRD","","_","_"
3,"_","_","_","upe","CGDA","","_","_"
4,"_","_","_","āśis","NC","","_","_"
5,"_","_","_","abhinand","CGDA","","_","_"
6,"_","_","_","vak","V","vac","_","_"
1,"arthī","_","_","arthin","JJ","","_","_"
2,"bhavantam","_","_","bhavat","JJ","","_","_"
3,"upagato","_","_","upaga","PPP","","_","_"
4,"_","_","_","as","V","as","_","_"
5,"_","_","_","iti","CQT","","_","_"
1,"sa","_","_","tad","PRD","","_","_"
2,"enam","_","_","a","PRD","","_","_"
3,"_","_","_","abhivāday","CGDA","","_","_"
4,"_","_","_","vak","V","vac","_","_"
1,"bhagavan","_","_","bhagavat","JJ","","_","_"
2,"pauṣyaḥ","_","_","pauṣya","NC","","_","_"
3,"khalv","_","_","khalu","CX","","_","_"
4,"aham","_","_","mat","PPR","","_","_"
1,"kiṃ","_","_","kiṃ","PRQ","","_","_"
2,"_","_","_","kar","V","kṛ","_","_"
3,"_","_","_","iti","CQT","","_","_"
1,"tam","_","_","tad","PRD","","_","_"
2,"_","_","_","vak","V","vac","_","_"
3,"_","_","_","uttaṅka","NC","","_","_"
1,"_","_","_","guru","NC","","_","_"
2,"_","_","_","artha","NC","","_","_"
3,"kuṇḍalābhyām","_","_","kuṇḍala","NC","","_","_"
4,"arthy","_","_","arthin","JJ","","_","_"
5,"āgato","_","_","āga","PPP","","_","_"
6,"_","_","_","as","V","as","_","_"
7,"_","_","_","iti","CQT","","_","_"
8,"ye","_","_","yad","PRL","","_","_"
9,"te","_","_","tvat","PPR","","_","_"
10,"kṣatriyayā","_","_","kṣatriyā","NC","","_","_"
11,"pinaddhe","_","_","pinah","PPP","","_","_"
12,"kuṇḍale","_","_","kuṇḍala","NC","","_","_"
13,"te","_","_","tad","PRD","","_","_"
14,"bhavān","_","_","bhavat","JJ","","_","_"
15,"dātum","_","_","dā","CGDI","","_","_"
16,"_","_","_","arh","V","arh","_","_"
17,"_","_","_","iti","CQT","","_","_"
1,"taṃ","_","_","tad","PRD","","_","_"
2,"pauṣyaḥ","_","_","pauṣya","NC","","_","_"
3,"pratyuvāca","_","_","prativak","V","prativac","_","_"
1,"_","_","_","praviś","CGDA","","_","_"
2,"_","_","_","antaḥpura","NC","","_","_"
3,"kṣatriyā","_","_","kṣatriyā","NC","","_","_"
4,"yācyatām","_","_","yāc","V","yāc","_","_"
5,"iti","_","_","iti","CQT","","_","_"
1,"sa","_","_","tad","PRD","","_","_"
2,"_","_","_","tad","PRD","","_","_"
3,"_","_","_","eva","CX","","_","_"
4,"uktaḥ","_","_","vac","PPP","","_","_"
5,"_","_","_","praviś","CGDA","","_","_"
6,"_","_","_","antaḥpura","NC","","_","_"
7,"kṣatriyāṃ","_","_","kṣatriyā","NC","","_","_"
8,"_","_","_","na","CNG","","_","_"
9,"_","_","_","paś","V","paś","_","_"
1,"sa","_","_","tad","PRD","","_","_"
2,"pauṣyaṃ","_","_","pauṣya","NC","","_","_"
3,"punar","_","_","punar","CAD","","_","_"
4,"uvāca","_","_","vak","V","vac","_","_"
1,"na","_","_","na","CNG","","_","_"
2,"yuktaṃ","_","_","yukta","JJ","","_","_"
3,"bhavatā","_","_","bhavat","JJ","","_","_"
4,"vayam","_","_","mat","PPR","","_","_"
5,"_","_","_","anṛta","NC","","_","_"
6,"_","_","_","upacar","CGDI","","_","_"
1,"na","_","_","na","CNG","","_","_"
2,"hi","_","_","hi","CX","","_","_"
3,"te","_","_","tvat","PPR","","_","_"
4,"_","_","_","kṣatriyā","NC","","_","_"
5,"_","_","_","antaḥpura","NC","","_","_"
6,"saṃnihitā","_","_","saṃnidhā","PPP","","_","_"
1,"_","_","_","na","CNG","","_","_"
2,"_","_","_","a","PRD","","_","_"
3,"_","_","_","darś","V","dṛś","_","_"
4,"_","_","_","iti","CQT","","_","_"
1,"sa","_","_","tad","PRD","","_","_"
2,"evam","_","_","eva","CX","","_","_"
3,"uktaḥ","_","_","vac","PPP","","_","_"
4,"pauṣyas","_","_","pauṣya","NC","","_","_"
5,"taṃ","_","_","tad","PRD","","_","_"
6,"pratyuvāca","_","_","prativak","V","prativac","_","_"
1,"saṃprati","_","_","samprati","CX","","_","_"
2,"bhavān","_","_","bhavat","JJ","","_","_"
3,"ucchiṣṭaḥ","_","_","ucchiṣṭa","JJ","","_","_"
1,"smara","_","_","smar","V","smṛ","_","_"
2,"tāvat","_","_","tāvat","CX","","_","_"
1,"na","_","_","na","CNG","","_","_"
2,"hi","_","_","hi","CX","","_","_"
3,"sā","_","_","tad","PRD","","_","_"
4,"kṣatriyā","_","_","kṣatriyā","NC","","_","_"
5,"_","_","_","ucchiṣṭa","JJ","","_","_"
6,"_","_","_","aśuci","JJ","","_","_"
7,"vā","_","_","vā","CCD","","_","_"
8,"śakyā","_","_","śakya","JJ","","_","_"
9,"draṣṭum","_","_","dṛś","CGDI","","_","_"
1,"_","_","_","pativratā","NC","","_","_"
3,"eṣā","_","_","tad","PRD","","_","_"
4,"_","_","_","na","CNG","","_","_"
5,"_","_","_","aśuci","JJ","","_","_"
6,"darśanam","_","_","darśana","NC","","_","_"
7,"_","_","_","upai","V","upe","_","_"
8,"_","_","_","iti","CQT","","_","_"
1,"_","_","_","atha","CAD","","_","_"
2,"_","_","_","eva","CX","","_","_"
3,"ukta","_","_","vac","PPP","","_","_"
4,"uttaṅkaḥ","_","_","uttaṅka","NC","","_","_"
5,"_","_","_","smṛ","CGDA","","_","_"
6,"_","_","_","vak","V","vac","_","_"
1,"asti","_","_","as","V","as","_","_"
2,"khalu","_","_","khalu","CX","","_","_"
3,"_","_","_","mat","PPR","","_","_"
4,"_","_","_","ucchiṣṭa","JJ","","_","_"
5,"_","_","_","upaspṛś","PPP","","_","_"
6,"śīghraṃ","_","_","śīghra","CX","","_","_"
7,"gacchatā","_","_","ga","KDP","","_","_"
8,"_","_","_","ca","CCD","","_","_"
9,"_","_","_","iti","CQT","","_","_"
1,"taṃ","_","_","tad","PRD","","_","_"
2,"pauṣyaḥ","_","_","pauṣya","NC","","_","_"
3,"pratyuvāca","_","_","prativak","V","prativac","_","_"
1,"etat","_","_","tad","PRD","","_","_"
2,"tad","_","_","tad","PRD","","_","_"
3,"evaṃ","_","_","eva","CX","","_","_"
4,"hi","_","_","hi","CX","","_","_"
1,"na","_","_","na","CNG","","_","_"
2,"_","_","_","ga","KDP","","_","_"
3,"_","_","_","upaspṛś","PPP","","_","_"
4,"bhavati","_","_","bhav","V","bhū","_","_"
5,"na","_","_","na","CNG","","_","_"
6,"_","_","_","sthā","PPP","","_","_"
7,"_","_","_","iti","CQT","","_","_"
1,"_","_","_","atha","CAD","","_","_"
2,"_","_","_","uttaṅka","NC","","_","_"
3,"_","_","_","tathā","CX","","_","_"
4,"_","_","_","iti","CQT","","_","_"
5,"uktvā","_","_","vac","CGDA","","_","_"
6,"prāṅmukha","_","_","prāṅmukha","JJ","","_","_"
7,"upaviśya","_","_","upaviś","CGDA","","_","_"
8,"_","_","_","su","CAD","","_","_"
9,"_","_","_","prakṣālay","PPP","","_","_"
10,"_","_","_","pāṇi","NC","","_","_"
11,"_","_","_","pāda","NC","","_","_"
12,"_","_","_","vadana","NC","","_","_"
13,"'śabdābhir","_","_","aśabda","JJ","","_","_"
14,"hṛdayaṃgamābhir","_","_","hṛdayaṃgama","JJ","","_","_"
15,"adbhir","_","_","ap","NC","","_","_"
16,"upaspṛśya","_","_","upaspṛś","CGDA","","_","_"
17,"triḥ","_","_","tris","CX","","_","_"
18,"pītvā","_","_","pā","CGDA","","_","_"
19,"dviḥ","_","_","dvis","CX","","_","_"
20,"parimṛjya","_","_","parimṛj","CGDA","","_","_"
21,"khāny","_","_","kha","NC","","_","_"
22,"adbhir","_","_","ap","NC","","_","_"
23,"_","_","_","upaspṛś","CGDA","","_","_"
24,"_","_","_","antaḥpura","NC","","_","_"
25,"praviśya","_","_","praviś","CGDA","","_","_"
26,"tāṃ","_","_","tad","PRD","","_","_"
27,"kṣatriyām","_","_","kṣatriyā","NC","","_","_"
28,"apaśyat","_","_","paś","V","paś","_","_"
1,"sā","_","_","tad","PRD","","_","_"
2,"ca","_","_","ca","CCD","","_","_"
3,"_","_","_","dṛś","CGDA","","_","_"
4,"_","_","_","eva","CEM","","_","_"
5,"_","_","_","uttaṅka","NC","","_","_"
6,"_","_","_","abhyutthā","CGDA","","_","_"
7,"_","_","_","abhivāday","CGDA","","_","_"
8,"_","_","_","vak","V","vac","_","_"
1,"svāgataṃ","_","_","svāgata","NC","","_","_"
2,"te","_","_","tvat","PPR","","_","_"
3,"bhagavan","_","_","bhagavat","JJ","","_","_"
1,"ājñāpaya","_","_","ājñāpaya","V","ājñāpay","_","_"
2,"kiṃ","_","_","kiṃ","PRQ","","_","_"
3,"_","_","_","kar","V","kṛ","_","_"
4,"_","_","_","iti","CQT","","_","_"
1,"sa","_","_","tad","PRD","","_","_"
2,"tām","_","_","tad","PRD","","_","_"
3,"uvāca","_","_","vak","V","vac","_","_"
1,"ete","_","_","tad","PRD","","_","_"
2,"kuṇḍale","_","_","kuṇḍala","NC","","_","_"
3,"_","_","_","guru","NC","","_","_"
4,"_","_","_","artha","NC","","_","_"
5,"me","_","_","mat","PPR","","_","_"
6,"bhikṣite","_","_","bhikṣ","PPP","","_","_"
7,"dātum","_","_","dā","CGDI","","_","_"
8,"_","_","_","arh","V","arh","_","_"
9,"_","_","_","iti","CQT","","_","_"
1,"sā","_","_","tad","PRD","","_","_"
2,"prītā","_","_","prī","PPP","","_","_"
3,"tena","_","_","tad","PRD","","_","_"
4,"tasya","_","_","tad","PRD","","_","_"
5,"_","_","_","sat","JJ","","_","_"
6,"_","_","_","bhāva","NC","","_","_"
7,"pātram","_","_","pātra","NC","","_","_"
8,"ayam","_","_","ida","PRD","","_","_"
9,"anatikramaṇīyaśceti","_","_","man","CGDA","","_","_"
10,"matvā","_","_","tad","PRD","","_","_"
11,"te","_","_","kuṇḍala","NC","","_","_"
12,"_","_","_","avamuc","CGDA","","_","_"
13,"_","_","_","ida","PRD","","_","_"
14,"avamucyāsmai","_","_","praya","V","praya","_","_"
1,"āha","_","_","ah","V","ah","_","_"
2,"_","_","_","ca","CCD","","_","_"
3,"_","_","_","a","PRD","","_","_"
1,"ete","_","_","tad","PRD","","_","_"
2,"kuṇḍale","_","_","kuṇḍala","NC","","_","_"
3,"takṣako","_","_","takṣaka","NC","","_","_"
4,"_","_","_","nāga","NC","","_","_"
5,"_","_","_","rāja","NC","","_","_"
6,"prārthayati","_","_","prārthay","V","prārthay","_","_"
1,"apramatto","_","_","apramatta","JJ","","_","_"
2,"netum","_","_","nī","CGDI","","_","_"
3,"_","_","_","arh","V","arh","_","_"
4,"_","_","_","iti","CQT","","_","_"
1,"sa","_","_","tad","PRD","","_","_"
2,"evam","_","_","eva","CX","","_","_"
3,"uktas","_","_","vac","PPP","","_","_"
4,"tāṃ","_","_","tad","PRD","","_","_"
5,"kṣatriyāṃ","_","_","kṣatriyā","NC","","_","_"
6,"pratyuvāca","_","_","prativak","V","prativac","_","_"
1,"bhavati","_","_","bhavat","JJ","","_","_"
2,"_","_","_","su","CAD","","_","_"
3,"_","_","_","nirvṛta","JJ","","_","_"
4,"bhava","_","_","bhav","V","bhū","_","_"
1,"na","_","_","na","CNG","","_","_"
2,"māṃ","_","_","mat","PPR","","_","_"
3,"śaktas","_","_","śak","PPP","","_","_"
4,"takṣako","_","_","takṣaka","NC","","_","_"
5,"_","_","_","nāga","NC","","_","_"
6,"_","_","_","rāja","NC","","_","_"
7,"dharṣayitum","_","_","dharṣay","CGDI","","_","_"
8,"iti","_","_","iti","CQT","","_","_"
1,"sa","_","_","tad","PRD","","_","_"
2,"evam","_","_","eva","CX","","_","_"
3,"uktvā","_","_","vac","CGDA","","_","_"
4,"tāṃ","_","_","tad","PRD","","_","_"
5,"kṣatriyām","_","_","kṣatriyā","NC","","_","_"
6,"āmantrya","_","_","āmantray","CGDA","","_","_"
7,"_","_","_","pauṣya","NC","","_","_"
8,"_","_","_","sakāśa","NC","","_","_"
9,"āgacchat","_","_","gacch","V","gam","_","_"
1,"sa","_","_","tad","PRD","","_","_"
2,"taṃ","_","_","tad","PRD","","_","_"
3,"_","_","_","dṛś","CGDA","","_","_"
4,"_","_","_","vak","V","vac","_","_"
1,"bhoḥ","_","_","bhoḥ","CX","","_","_"
2,"pauṣya","_","_","pauṣya","NC","","_","_"
3,"prīto","_","_","prī","PPP","","_","_"
4,"_","_","_","as","V","as","_","_"
5,"_","_","_","iti","CQT","","_","_"
1,"taṃ","_","_","tad","PRD","","_","_"
2,"pauṣyaḥ","_","_","pauṣya","NC","","_","_"
3,"pratyuvāca","_","_","prativak","V","prativac","_","_"
1,"bhagavaṃś","_","_","bhagavat","JJ","","_","_"
2,"cirasya","_","_","cirasya","CX","","_","_"
3,"pātram","_","_","pātra","NC","","_","_"
4,"āsādyate","_","_","āsāday","V","āsāday","_","_"
1,"bhavāṃś","_","_","bhavat","JJ","","_","_"
2,"ca","_","_","ca","CCD","","_","_"
3,"guṇavān","_","_","guṇavat","JJ","","_","_"
4,"atithiḥ","_","_","atithi","NC","","_","_"
1,"tat","_","_","tad","PRD","","_","_"
2,"kariṣye","_","_","kar","V","kṛ","_","_"
3,"śrāddham","_","_","śrāddha","NC","","_","_"
1,"kṣaṇaḥ","_","_","kṣaṇa","NC","","_","_"
2,"kriyatām","_","_","kar","V","kṛ","_","_"
3,"iti","_","_","iti","CQT","","_","_"
1,"tam","_","_","tad","PRD","","_","_"
2,"uttaṅkaḥ","_","_","uttaṅka","NC","","_","_"
3,"pratyuvāca","_","_","prativak","V","prativac","_","_"
1,"kṛtakṣaṇa","_","_","kṛtakṣaṇa","JJ","","_","_"
2,"_","_","_","eva","CEM","","_","_"
3,"_","_","_","as","V","as","_","_"
1,"śīghram","_","_","śīghra","CX","","_","_"
2,"icchāmi","_","_","iṣ","V","iṣ","_","_"
3,"_","_","_","yathā","CCM","","_","_"
4,"_","_","_","upapad","PPP","","_","_"
5,"annam","_","_","anna","NC","","_","_"
6,"upahṛtaṃ","_","_","upahṛ","PPP","","_","_"
7,"_","_","_","bhavat","JJ","","_","_"
8,"_","_","_","iti","CQT","","_","_"
1,"sa","_","_","tad","PRD","","_","_"
2,"_","_","_","tathā","CX","","_","_"
3,"_","_","_","iti","CQT","","_","_"
4,"_","_","_","vac","CGDA","","_","_"
5,"_","_","_","yathā","CCM","","_","_"
6,"_","_","_","upapad","PPP","","_","_"
7,"_","_","_","anna","NC","","_","_"
8,"_","_","_","a","PRD","","_","_"
9,"bhojayāmāsa","_","_","bhojay","V","bhojay","_","_"
1,"_","_","_","atha","CAD","","_","_"
2,"_","_","_","uttaṅka","NC","","_","_"
3,"śītam","_","_","śīta","JJ","","_","_"
4,"annaṃ","_","_","anna","NC","","_","_"
5,"_","_","_","sa_saha","CX","","_","_"
6,"_","_","_","keśa","NC","","_","_"
7,"dṛṣṭvā","_","_","dṛś","CGDA","","_","_"
8,"aśucy","_","_","aśuci","JJ","","_","_"
9,"etad","_","_","tad","PRD","","_","_"
10,"iti","_","_","iti","CQT","","_","_"
11,"matvā","_","_","man","CGDA","","_","_"
12,"pauṣyam","_","_","pauṣya","NC","","_","_"
13,"uvāca","_","_","vak","V","vac","_","_"
1,"yasmān","_","_","yasmāt","CX","","_","_"
2,"me","_","_","mat","PPR","","_","_"
3,"aśucy","_","_","aśuci","JJ","","_","_"
4,"annaṃ","_","_","anna","NC","","_","_"
5,"dadāsi","_","_","dad","V","dā","_","_"
6,"tasmād","_","_","tasmāt","CX","","_","_"
7,"andho","_","_","andha","JJ","","_","_"
8,"_","_","_","bhav","V","bhū","_","_"
9,"_","_","_","iti","CQT","","_","_"
1,"taṃ","_","_","tad","PRD","","_","_"
2,"pauṣyaḥ","_","_","pauṣya","NC","","_","_"
3,"pratyuvāca","_","_","prativak","V","prativac","_","_"
1,"yasmāt","_","_","yasmāt","CX","","_","_"
2,"tvam","_","_","tvat","PPR","","_","_"
3,"apy","_","_","api","CX","","_","_"
4,"a","_","_","alpha_privativum","JJ","","_","_"
4,"aduṣṭam","_","_","duṣṭa","JJ","","_","_"
5,"annaṃ","_","_","anna","NC","","_","_"
6,"dūṣayasi","_","_","dūṣay","V","dūṣay","_","_"
7,"tasmād","_","_","tasmāt","CX","","_","_"
8,"anapatyo","_","_","anapatya","JJ","","_","_"
9,"_","_","_","bhav","V","bhū","_","_"
10,"_","_","_","iti","CQT","","_","_"
1,"so","_","_","tad","PRD","","_","_"
2,"'tha","_","_","atha","CAD","","_","_"
3,"pauṣyas","_","_","pauṣya","NC","","_","_"
4,"_","_","_","tad","PRD","","_","_"
5,"_","_","_","aśuci","JJ","","_","_"
6,"_","_","_","bhāva","NC","","_","_"
7,"_","_","_","anna","NC","","_","_"
8,"_","_","_","āgamay","V","āgamay","_","_"
1,"atha","_","_","atha","CAD","","_","_"
2,"_","_","_","tad","PRD","","_","_"
3,"_","_","_","anna","NC","","_","_"
4,"_","_","_","muc","PPP","","_","_"
5,"_","_","_","keśa","JJ","","_","_"
6,"_","_","_","strī","NC","","_","_"
7,"_","_","_","upahṛ","PPP","","_","_"
8,"_","_","_","sa_saha","CX","","_","_"
9,"_","_","_","keśa","NC","","_","_"
10,"aśuci","_","_","aśuci","JJ","","_","_"
11,"_","_","_","man","CGDA","","_","_"
12,"_","_","_","uttaṅka","NC","","_","_"
13,"prasādayāmāsa","_","_","prasāday","V","prasāday","_","_"
1,"bhagavann","_","_","bhagavat","JJ","","_","_"
2,"ajñānād","_","_","ajñāna","NC","","_","_"
3,"etad","_","_","tad","PRD","","_","_"
4,"annaṃ","_","_","anna","NC","","_","_"
5,"_","_","_","sa_saha","CX","","_","_"
6,"_","_","_","keśa","NC","","_","_"
7,"upahṛtaṃ","_","_","upahṛ","PPP","","_","_"
8,"śītaṃ","_","_","śīta","JJ","","_","_"
9,"ca","_","_","ca","CCD","","_","_"
1,"tat","_","_","tad","PRD","","_","_"
2,"kṣāmaye","_","_","kṣāmay","V","kṣāmay","_","_"
3,"bhavantam","_","_","bhavat","JJ","","_","_"
1,"na","_","_","na","CNG","","_","_"
2,"bhaveyam","_","_","bhav","V","bhū","_","_"
3,"andha","_","_","andha","JJ","","_","_"
4,"iti","_","_","iti","CQT","","_","_"
1,"tam","_","_","tad","PRD","","_","_"
2,"uttaṅkaḥ","_","_","uttaṅka","NC","","_","_"
3,"pratyuvāca","_","_","prativak","V","prativac","_","_"
1,"na","_","_","na","CNG","","_","_"
2,"mṛṣā","_","_","mṛṣā","CX","","_","_"
3,"bravīmi","_","_","abravīta","V","brū","_","_"
1,"bhūtvā","_","_","bhū","CGDA","","_","_"
2,"tvam","_","_","tvat","PPR","","_","_"
3,"andho","_","_","andha","JJ","","_","_"
4,"nacirād","_","_","nacirāt","CX","","_","_"
5,"_","_","_","an","CX","","_","_"
6,"_","_","_","andha","JJ","","_","_"
7,"_","_","_","bhav","V","bhū","_","_"
8,"_","_","_","iti","CQT","","_","_"
1,"_","_","_","mat","PPR","","_","_"
2,"_","_","_","api","CX","","_","_"
3,"śāpo","_","_","śāpa","NC","","_","_"
4,"na","_","_","na","CNG","","_","_"
5,"bhaved","_","_","bhav","V","bhū","_","_"
6,"bhavatā","_","_","bhavat","JJ","","_","_"
7,"datta","_","_","dā","PPP","","_","_"
8,"iti","_","_","iti","CQT","","_","_"
1,"taṃ","_","_","tad","PRD","","_","_"
2,"pauṣyaḥ","_","_","pauṣya","NC","","_","_"
3,"pratyuvāca","_","_","prativak","V","prativac","_","_"
1,"_","_","_","na","CNG","","_","_"
2,"_","_","_","mat","PPR","","_","_"
3,"śaktaḥ","_","_","śak","PPP","","_","_"
4,"śāpaṃ","_","_","śāpa","NC","","_","_"
5,"pratyādātum","_","_","pratyādā","CGDI","","_","_"
1,"na","_","_","na","CNG","","_","_"
2,"hi","_","_","hi","CX","","_","_"
3,"me","_","_","mat","PPR","","_","_"
4,"manyur","_","_","manyu","NC","","_","_"
5,"_","_","_","adya","CX","","_","_"
6,"_","_","_","api","CX","","_","_"
7,"_","_","_","upaśama","NC","","_","_"
8,"gacchati","_","_","gacch","V","gam","_","_"
1,"kiṃ","_","_","kiṃ","PRQ","","_","_"
2,"_","_","_","ca","CCD","","_","_"
3,"_","_","_","tad","PRD","","_","_"
4,"bhavatā","_","_","bhavat","JJ","","_","_"
5,"na","_","_","na","CNG","","_","_"
6,"jñāyate","_","_","jān","V","jñā","_","_"
7,"yathā","_","_","yathā","CCM","","_","_"
1,"nāvanītaṃ","_","_","nāvanīta","JJ","","_","_"
2,"hṛdayaṃ","_","_","hṛdaya","NC","","_","_"
3,"brāhmaṇasya","_","_","brāhmaṇa","NC","","_","_"
4,"vāci","_","_","vāc","NC","","_","_"
5,"kṣuro","_","_","kṣura","NC","","_","_"
6,"nihitas","_","_","nidhā","PPP","","_","_"
7,"_","_","_","tīkṣṇa","JJ","","_","_"
8,"_","_","_","dhārā","NC","","_","_"
1,"viparītam","_","_","viparīta","JJ","","_","_"
2,"etad","_","_","tad","PRD","","_","_"
3,"ubhayaṃ","_","_","ubhaya","JJ","","_","_"
4,"kṣatriyasya","_","_","kṣatriya","NC","","_","_"
5,"vāṅ","_","_","vāc","NC","","_","_"
6,"nāvanītī","_","_","nāvanīta","JJ","","_","_"
7,"hṛdayaṃ","_","_","hṛdaya","NC","","_","_"
8,"_","_","_","tīkṣṇa","JJ","","_","_"
9,"_","_","_","dhārā","NC","","_","_"
1,"iti","_","_","iti","CQT","","_","_"
1,"tad","_","_","tad","PRD","","_","_"
2,"evaṃ","_","_","eva","CX","","_","_"
3,"gate","_","_","ga","PPP","","_","_"
4,"na","_","_","na","CNG","","_","_"
5,"śakto","_","_","śak","PPP","","_","_"
6,"'haṃ","_","_","mat","PPR","","_","_"
7,"_","_","_","tīkṣṇa","JJ","","_","_"
8,"_","_","_","hṛdaya","NC","","_","_"
10,"taṃ","_","_","tad","PRD","","_","_"
11,"śāpam","_","_","śāpa","NC","","_","_"
12,"anyathā","_","_","anyathā","CX","","_","_"
13,"kartum","_","_","kṛ","CGDI","","_","_"
1,"gamyatām","_","_","ga","V","ga","_","_"
2,"iti","_","_","iti","CQT","","_","_"
1,"tam","_","_","tad","PRD","","_","_"
2,"uttaṅkaḥ","_","_","uttaṅka","NC","","_","_"
3,"pratyuvāca","_","_","prativak","V","prativac","_","_"
1,"_","_","_","bhavat","JJ","","_","_"
2,"_","_","_","mat","PPR","","_","_"
3,"_","_","_","anna","NC","","_","_"
4,"_","_","_","aśuci","JJ","","_","_"
5,"_","_","_","bhāva","NC","","_","_"
6,"āgamayya","_","_","āgamay","CGDA","","_","_"
7,"pratyanunītaḥ","_","_","pratyanunī","PPP","","_","_"
1,"prāk","_","_","prāk","CX","","_","_"
2,"ca","_","_","ca","CCD","","_","_"
3,"te","_","_","tvat","PPR","","_","_"
4,"'bhihitam","_","_","abhidhā","PPP","","_","_"
1,"yasmād","_","_","yasmāt","CX","","_","_"
2,"a","_","_","alpha_privativum","JJ","","_","_"
2,"aduṣṭam","_","_","duṣṭa","JJ","","_","_"
3,"annaṃ","_","_","anna","NC","","_","_"
4,"dūṣayasi","_","_","dūṣay","V","dūṣay","_","_"
5,"tasmād","_","_","tasmāt","CX","","_","_"
6,"anapatyo","_","_","anapatya","JJ","","_","_"
7,"_","_","_","bhav","V","bhū","_","_"
8,"_","_","_","iti","CQT","","_","_"
1,"duṣṭe","_","_","duṣ","PPP","","_","_"
2,"_","_","_","ca","CCD","","_","_"
3,"_","_","_","anna","NC","","_","_"
4,"_","_","_","na","CNG","","_","_"
5,"_","_","_","tad","PRD","","_","_"
6,"mama","_","_","mat","PPR","","_","_"
7,"śāpo","_","_","śāpa","NC","","_","_"
8,"_","_","_","bhav","V","bhū","_","_"
9,"_","_","_","iti","CQT","","_","_"
1,"sādhayāmas","_","_","sādhay","V","sādhay","_","_"
2,"tāvad","_","_","tāvat","CX","","_","_"
3,"ity","_","_","iti","CQT","","_","_"
4,"uktvā","_","_","vac","CGDA","","_","_"
5,"_","_","_","pratiṣṭh","V","prasthā","_","_"
6,"_","_","_","uttaṅka","NC","","_","_"
7,"te","_","_","tad","PRD","","_","_"
8,"kuṇḍale","_","_","kuṇḍala","NC","","_","_"
9,"gṛhītvā","_","_","grah","CGDA","","_","_"
1,"so","_","_","tad","PRD","","_","_"
2,"'paśyat","_","_","paś","V","paś","_","_"
3,"pathi","_","_","pathin","NC","","_","_"
4,"nagnaṃ","_","_","nagna","JJ","","_","_"
5,"śramaṇam","_","_","śramaṇa","NC","","_","_"
6,"āgacchantaṃ","_","_","āga","KDP","","_","_"
7,"muhur","_","_","muhur","CX","","_","_"
8,"muhur","_","_","muhur","CX","","_","_"
9,"dṛśyamānam","_","_","dṛś","KDP","","_","_"
10,"_","_","_","a","CNG","","_","_"
11,"_","_","_","dṛś","KDP","","_","_"
12,"ca","_","_","ca","CCD","","_","_"
1,"_","_","_","atha","CAD","","_","_"
2,"_","_","_","uttaṅka","NC","","_","_"
3,"te","_","_","tad","PRD","","_","_"
4,"kuṇḍale","_","_","kuṇḍala","NC","","_","_"
5,"bhūmau","_","_","bhūmi","NC","","_","_"
6,"_","_","_","nikṣip","CGDA","","_","_"
7,"_","_","_","udaka","NC","","_","_"
8,"_","_","_","artha","NC","","_","_"
9,"pracakrame","_","_","pracakrama","V","prakra","_","_"
1,"etasminn","_","_","tad","PRD","","_","_"
2,"antare","_","_","antara","NC","","_","_"
3,"sa","_","_","tad","PRD","","_","_"
4,"śramaṇas","_","_","śramaṇa","NC","","_","_"
5,"tvaramāṇa","_","_","tvar","KDP","","_","_"
6,"upasṛtya","_","_","upasṛ","CGDA","","_","_"
7,"te","_","_","tad","PRD","","_","_"
8,"kuṇḍale","_","_","kuṇḍala","NC","","_","_"
9,"gṛhītvā","_","_","grah","CGDA","","_","_"
10,"prādravat","_","_","pradru","V","pradru","_","_"
1,"tam","_","_","tad","PRD","","_","_"
2,"uttaṅko","_","_","uttaṅka","NC","","_","_"
3,"'bhisṛtya","_","_","abhisṛ","CGDA","","_","_"
4,"jagrāha","_","_","grah","V","grah","_","_"
1,"sa","_","_","tad","PRD","","_","_"
2,"tad","_","_","tad","PRD","","_","_"
3,"rūpaṃ","_","_","rūpa","NC","","_","_"
4,"vihāya","_","_","vihā","CGDA","","_","_"
5,"_","_","_","takṣaka","NC","","_","_"
6,"_","_","_","rūpa","NC","","_","_"
7,"kṛtvā","_","_","kṛ","CGDA","","_","_"
8,"sahasā","_","_","sahasā","CX","","_","_"
9,"dharaṇyāṃ","_","_","dharaṇī","NC","","_","_"
10,"vivṛtaṃ","_","_","vivṛ","PPP","","_","_"
11,"_","_","_","mahat","JJ","","_","_"
12,"_","_","_","bila","NC","","_","_"
13,"viveśa","_","_","viś","V","viś","_","_"
1,"praviśya","_","_","praviś","CGDA","","_","_"
2,"ca","_","_","ca","CCD","","_","_"
3,"_","_","_","nāga","NC","","_","_"
4,"_","_","_","loka","NC","","_","_"
5,"_","_","_","sva","JJ","","_","_"
6,"_","_","_","bhavana","NC","","_","_"
7,"agacchat","_","_","ga","V","ga","_","_"
1,"tam","_","_","tad","PRD","","_","_"
2,"uttaṅko","_","_","uttaṅka","NC","","_","_"
3,"'nvāviveśa","_","_","anvāviś","V","anvāviś","_","_"
4,"_","_","_","tad","PRD","","_","_"
5,"_","_","_","eva","CEM","","_","_"
6,"bilena","_","_","bila","NC","","_","_"
1,"praviśya","_","_","praviś","CGDA","","_","_"
2,"ca","_","_","ca","CCD","","_","_"
3,"nāgān","_","_","nāga","NC","","_","_"
4,"astuvad","_","_","stu","V","stu","_","_"
5,"ebhiḥ","_","_","ida","PRD","","_","_"
6,"ślokaiḥ","_","_","śloka","NC","","_","_"
1,"ya","_","_","yad","PRL","","_","_"
2,"_","_","_","airāvata","NC","","_","_"
3,"_","_","_","rājan","NC","","_","_"
4,"sarpāḥ","_","_","sarpa","NC","","_","_"
5,"_","_","_","samiti","NC","","_","_"
6,"_","_","_","śobhana","JJ","","_","_"
1,"varṣanta","_","_","vṛṣ","KDP","","_","_"
2,"iva","_","_","iva","CCM","","_","_"
3,"jīmūtāḥ","_","_","jīmūta","NC","","_","_"
4,"_","_","_","sa_saha","CX","","_","_"
5,"_","_","_","vidyut","NC","","_","_"
6,"_","_","_","pavana","NC","","_","_"
7,"_","_","_","īray","PPP","","_","_"
1,"_","_","_","su","CAD","","_","_"
2,"_","_","_","rūpa","NC","","_","_"
3,"ca","_","_","ca","CCD","","_","_"
4,"virūpāś","_","_","virūpa","JJ","","_","_"
5,"ca","_","_","ca","CCD","","_","_"
6,"tathā","_","_","tathā","CX","","_","_"
7,"_","_","_","kalmāṣa","NC","","_","_"
8,"_","_","_","kuṇḍala","NC","","_","_"
1,"_","_","_","āditya","NC","","_","_"
2,"_","_","_","vat","CX","","_","_"
3,"_","_","_","nāka","NC","","_","_"
4,"_","_","_","pṛṣṭha","NC","","_","_"
5,"rejur","_","_","reju","V","rāj","_","_"
6,"_","_","_","airāvata","NC","","_","_"
7,"_","_","_","udbhava","JJ","","_","_"
