"WordID","word","NormSTEM","suffix","lemma","PoS","Root","NormSuffix","NormWord"
1,"sūta","_","_","sūta","NC","","_","_"
2,"uvāca","_","_","vak","V","vac","_","_"
1,"_","_","_","samprahṛṣ","PPP","","_","_"
2,"_","_","_","tatas","CX","","_","_"
3,"nāgā","_","_","nāga","NC","","_","_"
4,"_","_","_","jala","NC","","_","_"
5,"_","_","_","dhārā","NC","","_","_"
6,"_","_","_","plu","PPP","","_","_"
7,"_","_","_","tadā","CAD","","_","_"
1,"_","_","_","suparṇa","NC","","_","_"
2,"_","_","_","vah","KDP","","_","_"
3,"_","_","_","tad","PRD","","_","_"
4,"_","_","_","ga","V","ga","_","_"
5,"_","_","_","tad","PRD","","_","_"
6,"deśam","_","_","deśa","NC","","_","_"
7,"āśu","_","_","āśu","JJ","","_","_"
8,"vai","_","_","vai","CX","","_","_"
1,"taṃ","_","_","tad","PRD","","_","_"
2,"dvīpaṃ","_","_","dvīpa","NC","","_","_"
3,"_","_","_","makara","NC","","_","_"
4,"_","_","_","āvāsa","NC","","_","_"
5,"vihitaṃ","_","_","vidhā","PPP","","_","_"
6,"viśvakarmaṇā","_","_","viśvakarman","NC","","_","_"
1,"_","_","_","indra","NC","","_","_"
2,"_","_","_","tulya","JJ","","_","_"
3,"_","_","_","bala","NC","","_","_"
4,"ghoraṃ","_","_","ghora","JJ","","_","_"
5,"dadṛśuḥ","_","_","darś","V","dṛś","_","_"
6,"sarvam","_","_","sarva","JQ","","_","_"
7,"āyatam","_","_","āya","PPP","","_","_"
1,"_","_","_","suparṇa","NC","","_","_"
2,"_","_","_","sahita","JJ","","_","_"
3,"sarpāḥ","_","_","sarpa","NC","","_","_"
4,"kānanaṃ","_","_","kānana","NC","","_","_"
5,"ca","_","_","ca","CCD","","_","_"
6,"manoramam","_","_","manorama","JJ","","_","_"
1,"_","_","_","sāgara","NC","","_","_"
2,"_","_","_","ambu","NC","","_","_"
3,"_","_","_","parikṣip","PPP","","_","_"
4,"_","_","_","pakṣin","NC","","_","_"
5,"_","_","_","saṃgha","NC","","_","_"
6,"_","_","_","nināday","PPP","","_","_"
1,"_","_","_","vicitra","JJ","","_","_"
2,"_","_","_","phala","NC","","_","_"
3,"_","_","_","puṣpa","NC","","_","_"
4,"_","_","_","vana","NC","","_","_"
5,"_","_","_","rāji","NC","","_","_"
6,"āvṛtam","_","_","āvṛ","PPP","","_","_"
1,"bhavanair","_","_","bhavana","NC","","_","_"
2,"āvṛtaṃ","_","_","āvṛ","PPP","","_","_"
3,"_","_","_","ramya","JJ","","_","_"
4,"_","_","_","tathā","CX","","_","_"
5,"_","_","_","padma","NC","","_","_"
6,"_","_","_","ākara","NC","","_","_"
7,"api","_","_","api","CX","","_","_"
1,"_","_","_","prasad","PPP","","_","_"
2,"_","_","_","salila","NC","","_","_"
3,"_","_","_","ca","CCD","","_","_"
4,"_","_","_","api","CX","","_","_"
5,"_","_","_","hrada","NC","","_","_"
6,"_","_","_","citra","JJ","","_","_"
7,"vibhūṣitam","_","_","vibhūṣay","PPP","","_","_"
1,"_","_","_","divya","JJ","","_","_"
2,"_","_","_","gandha","NC","","_","_"
3,"_","_","_","vaha","JJ","","_","_"
4,"puṇyair","_","_","puṇya","JJ","","_","_"
5,"mārutair","_","_","māruta","NC","","_","_"
6,"upavījitam","_","_","upavījay","PPP","","_","_"
1,"upajighradbhir","_","_","upaghrā","KDP","","_","_"
2,"ākāśaṃ","_","_","ākāśa","NC","","_","_"
3,"vṛkṣair","_","_","vṛkṣa","NC","","_","_"
4,"malayajair","_","_","malayaja","NC","","_","_"
5,"api","_","_","api","CX","","_","_"
1,"śobhitaṃ","_","_","śobhay","PPP","","_","_"
2,"_","_","_","puṣpa","NC","","_","_"
3,"_","_","_","varṣa","NC","","_","_"
4,"muñcadbhir","_","_","muc","KDP","","_","_"
5,"_","_","_","māruta","NC","","_","_"
6,"_","_","_","uddhū","PPP","","_","_"
1,"_","_","_","vāyu","NC","","_","_"
2,"_","_","_","vikṣip","PPP","","_","_"
3,"_","_","_","kusuma","NC","","_","_"
4,"_","_","_","tathā","CX","","_","_"
5,"_","_","_","anya","PPX","","_","_"
6,"api","_","_","api","CX","","_","_"
7,"pādapaiḥ","_","_","pādapa","NC","","_","_"
1,"kiradbhir","_","_","kṛ","KDP","","_","_"
2,"iva","_","_","iva","CCM","","_","_"
3,"tatrasthān","_","_","tatrastha","JJ","","_","_"
4,"nāgān","_","_","nāga","NC","","_","_"
5,"_","_","_","puṣpa","NC","","_","_"
6,"_","_","_","ambu","NC","","_","_"
7,"_","_","_","vṛṣṭi","NC","","_","_"
1,"_","_","_","manas","NC","","_","_"
2,"_","_","_","saṃharṣaṇa","JJ","","_","_"
3,"puṇyaṃ","_","_","puṇya","JJ","","_","_"
4,"_","_","_","gandharva","NC","","_","_"
5,"_","_","_","apsaras","NC","","_","_"
6,"priyam","_","_","priya","JJ","","_","_"
1,"_","_","_","mat","PPP","","_","_"
2,"_","_","_","bhramara","NC","","_","_"
3,"_","_","_","saṃghuṣ","PPP","","_","_"
4,"_","_","_","manojña","JJ","","_","_"
5,"_","_","_","ākṛti","NC","","_","_"
6,"_","_","_","darśana","NC","","_","_"
1,"ramaṇīyaṃ","_","_","ramaṇīya","JJ","","_","_"
2,"śivaṃ","_","_","śiva","JJ","","_","_"
3,"puṇyaṃ","_","_","puṇya","JJ","","_","_"
4,"sarvair","_","_","sarva","JQ","","_","_"
5,"_","_","_","jana","NC","","_","_"
6,"_","_","_","manohara","JJ","","_","_"
1,"_","_","_","nānā","CX","","_","_"
2,"_","_","_","pakṣin","NC","","_","_"
3,"_","_","_","ruta","NC","","_","_"
4,"ramyaṃ","_","_","ramya","JJ","","_","_"
5,"_","_","_","kadru","NC","","_","_"
6,"_","_","_","putra","NC","","_","_"
7,"_","_","_","praharṣaṇa","JJ","","_","_"
1,"tat","_","_","tad","PRD","","_","_"
2,"te","_","_","tad","PRD","","_","_"
3,"vanaṃ","_","_","vana","NC","","_","_"
4,"samāsādya","_","_","samāsāday","CGDA","","_","_"
5,"vijahruḥ","_","_","vihar","V","vihṛ","_","_"
6,"pannagā","_","_","pannaga","NC","","_","_"
7,"mudā","_","_","mud","NC","","_","_"
1,"_","_","_","abravīta","V","brū","_","_"
2,"_","_","_","ca","CCD","","_","_"
3,"_","_","_","mahat","JJ","","_","_"
4,"_","_","_","vīrya","NC","","_","_"
5,"suparṇaṃ","_","_","suparṇa","NC","","_","_"
6,"_","_","_","pataga","NC","","_","_"
7,"_","_","_","uttama","JJ","","_","_"
1,"_","_","_","vah","V","vah","_","_"
2,"_","_","_","mat","PPR","","_","_"
3,"aparaṃ","_","_","apara","PPX","","_","_"
4,"dvīpaṃ","_","_","dvīpa","NC","","_","_"
5,"_","_","_","su","CAD","","_","_"
6,"_","_","_","ramya","JJ","","_","_"
7,"_","_","_","vipula","JJ","","_","_"
8,"_","_","_","udaka","NC","","_","_"
1,"tvaṃ","_","_","tvat","PPR","","_","_"
2,"hi","_","_","hi","CX","","_","_"
3,"deśān","_","_","deśa","NC","","_","_"
4,"bahūn","_","_","bahu","JJ","","_","_"
5,"ramyān","_","_","ramya","JJ","","_","_"
6,"patan","_","_","pat","KDP","","_","_"
7,"paśyasi","_","_","paś","V","paś","_","_"
8,"khecara","_","_","khecara","NC","","_","_"
1,"sa","_","_","tad","PRD","","_","_"
2,"_","_","_","vicintay","CGDA","","_","_"
3,"_","_","_","abravīta","V","brū","_","_"
4,"pakṣī","_","_","pakṣin","NC","","_","_"
5,"mātaraṃ","_","_","mātṛ","NC","","_","_"
6,"vinatāṃ","_","_","vinatā","NC","","_","_"
7,"tadā","_","_","tadā","CAD","","_","_"
1,"kiṃ","_","_","kiṃ","PRQ","","_","_"
2,"kāraṇaṃ","_","_","kāraṇa","NC","","_","_"
3,"mayā","_","_","mat","PPR","","_","_"
4,"mātaḥ","_","_","mātṛ","NC","","_","_"
5,"kartavyaṃ","_","_","kṛ","KDG","","_","_"
6,"_","_","_","sarpa","NC","","_","_"
7,"_","_","_","bhāṣ","PPP","","_","_"
1,"_","_","_","kiṃ","PRQ","","_","_"
2,"_","_","_","artha","NC","","_","_"
3,"ca","_","_","ca","CCD","","_","_"
4,"vayaṃ","_","_","mat","PPR","","_","_"
5,"sarpān","_","_","sarpa","NC","","_","_"
6,"vahāmo","_","_","vah","V","vah","_","_"
7,"_","_","_","durbala","JJ","","_","_"
8,"_","_","_","adhama","JJ","","_","_"
1,"evam","_","_","eva","CX","","_","_"
2,"_","_","_","vac","PPP","","_","_"
3,"_","_","_","tadā","CAD","","_","_"
4,"tena","_","_","tad","PRD","","_","_"
5,"vinatā","_","_","vinatā","NC","","_","_"
6,"prāha","_","_","prāh","V","prāh","_","_"
7,"khecaram","_","_","khecara","NC","","_","_"
1,"putraṃ","_","_","putra","NC","","_","_"
2,"_","_","_","sarva","JQ","","_","_"
3,"_","_","_","guṇa","NC","","_","_"
4,"_","_","_","upe","PPP","","_","_"
5,"_","_","_","mahat","JJ","","_","_"
6,"_","_","_","vīrya","NC","","_","_"
7,"_","_","_","bala","NC","","_","_"
8,"_","_","_","acala","NC","","_","_"
1,"_","_","_","vinatā","NC","","_","_"
2,"_","_","_","vak","V","vac","_","_"
1,"_","_","_","dāsī","NC","","_","_"
2,"_","_","_","bhū","PPP","","_","_"
3,"_","_","_","as","V","as","_","_"
4,"_","_","_","anārya","JJ","","_","_"
5,"bhaginyāḥ","_","_","bhaginī","NC","","_","_"
6,"_","_","_","pataga","NC","","_","_"
7,"_","_","_","uttama","JJ","","_","_"
1,"paṇaṃ","_","_","paṇa","NC","","_","_"
2,"vitatham","_","_","vitatha","JJ","","_","_"
3,"āsthāya","_","_","āsthā","CGDA","","_","_"
4,"sarpair","_","_","sarpa","NC","","_","_"
5,"upadhinā","_","_","upadhi","NC","","_","_"
6,"kṛtam","_","_","kṛ","PPP","","_","_"
1,"sūta","_","_","sūta","NC","","_","_"
2,"uvāca","_","_","vak","V","vac","_","_"
1,"_","_","_","tad","PRD","","_","_"
2,"_","_","_","tu","CCD","","_","_"
3,"kathite","_","_","kathay","PPP","","_","_"
4,"mātrā","_","_","mātṛ","NC","","_","_"
5,"kāraṇe","_","_","kāraṇa","NC","","_","_"
6,"gaganecaraḥ","_","_","gaganecara","NC","","_","_"
1,"uvāca","_","_","vak","V","vac","_","_"
2,"vacanaṃ","_","_","vacana","NC","","_","_"
3,"_","_","_","sarpa","NC","","_","_"
4,"_","_","_","tad","PRD","","_","_"
5,"duḥkhena","_","_","duḥkha","NC","","_","_"
6,"duḥkhitaḥ","_","_","duḥkhita","JJ","","_","_"
1,"kim","_","_","kiṃ","PRQ","","_","_"
2,"āhṛtya","_","_","āhṛ","CGDA","","_","_"
3,"viditvā","_","_","vid","CGDA","","_","_"
4,"vā","_","_","vā","CCD","","_","_"
5,"kiṃ","_","_","kiṃ","PRQ","","_","_"
6,"vā","_","_","vā","CCD","","_","_"
7,"_","_","_","kṛ","CGDA","","_","_"
8,"_","_","_","iha","CAD","","_","_"
9,"pauruṣam","_","_","pauruṣa","NC","","_","_"
1,"dāsyād","_","_","dāsya","NC","","_","_"
2,"vo","_","_","tvat","PPR","","_","_"
3,"vipramucyeyaṃ","_","_","vipramuñc","V","vipramuc","_","_"
4,"satyaṃ","_","_","satya","NC","","_","_"
5,"śaṃsata","_","_","śaṃs","V","śaṃs","_","_"
6,"lelihāḥ","_","_","leliha","NC","","_","_"
1,"śrutvā","_","_","śru","CGDA","","_","_"
2,"tam","_","_","tad","PRD","","_","_"
3,"abruvan","_","_","abravīta","V","brū","_","_"
4,"sarpā","_","_","sarpa","NC","","_","_"
5,"_","_","_","āhar","V","āhṛ","_","_"
6,"_","_","_","amṛta","NC","","_","_"
7,"ojasā","_","_","ojas","NC","","_","_"
1,"tato","_","_","tatas","CX","","_","_"
2,"dāsyād","_","_","dāsya","NC","","_","_"
3,"vipramokṣo","_","_","vipramokṣa","NC","","_","_"
4,"bhavitā","_","_","bhav","V","bhū","_","_"
5,"tava","_","_","tvat","PPR","","_","_"
6,"khecara","_","_","khecara","NC","","_","_"
