"WordID","word","NormSTEM","suffix","lemma","PoS","Root","NormSuffix","NormWord"
1,"na","_","_","na","CNG","","_","_"
2,"tā","_","_","tad","PRD","","_","_"
3,"minanti","_","_","mī","V","mī","_","_"
4,"māyino","_","_","māyin","JJ","","_","_"
5,"na","_","_","na","CNG","","_","_"
6,"dhīrā","_","_","dhīra","JJ","","_","_"
7,"vratā","_","_","vrata","NC","","_","_"
8,"devānām","_","_","deva","NC","","_","_"
9,"prathamā","_","_","prathama","JJ","","_","_"
10,"dhruvāṇi","_","_","dhruva","JJ","","_","_"
1,"na","_","_","na","CNG","","_","_"
2,"rodasī","_","_","rodas","NC","","_","_"
3,"a","_","_","alpha_privativum","JJ","","_","_"
3,"adruhā","_","_","druh","JJ","","_","_"
4,"vedyābhir","_","_","vedyā","NC","","_","_"
5,"na","_","_","na","CNG","","_","_"
6,"parvatā","_","_","parvata","NC","","_","_"
7,"niname","_","_","nina","CGDI","","_","_"
8,"tasthivāṃsaḥ","_","_","sthā","KDP","","_","_"
1,"ṣaḍ","_","_","ṣaṣ","NUM","","_","_"
2,"bhārāṁ","_","_","bhāra","NC","","_","_"
3,"eko","_","_","eka","PPX","","_","_"
4,"_","_","_","a","CNG","","_","_"
5,"_","_","_","car","KDP","","_","_"
6,"bibharty","_","_","bhṛ","V","bhṛ","_","_"
7,"ṛtaṃ","_","_","ṛta","NC","","_","_"
8,"varṣiṣṭham","_","_","varṣiṣṭha","JJ","","_","_"
9,"upa","_","_","upa","CADP","","_","_"
10,"gāva","_","_","go","NC","","_","_"
11,"āguḥ","_","_","āgā","V","āgā","_","_"
1,"tisro","_","_","tri","NUM","","_","_"
2,"mahīr","_","_","mahī","NC","","_","_"
3,"uparās","_","_","upara","JJ","","_","_"
4,"tasthur","_","_","tiṣṭh","V","sthā","_","_"
5,"atyā","_","_","atya","NC","","_","_"
6,"guhā","_","_","guhā","CX","","_","_"
7,"dve","_","_","dvi","NUM","","_","_"
8,"nihite","_","_","nidhā","PPP","","_","_"
9,"darśy","_","_","darś","V","dṛś","_","_"
10,"ekā","_","_","eka","PPX","","_","_"
1,"_","_","_","tri","NUM","","_","_"
2,"_","_","_","pājasya","NC","","_","_"
3,"vṛṣabho","_","_","vṛṣabha","NC","","_","_"
4,"_","_","_","viśva","JQ","","_","_"
5,"_","_","_","rūpa","NC","","_","_"
6,"uta","_","_","uta","CCD","","_","_"
7,"_","_","_","tri","NUM","","_","_"
8,"_","_","_","udhan","NC","","_","_"
9,"purudha","_","_","purudhā","CX","","_","_"
10,"prajāvān","_","_","prajāvat","JJ","","_","_"
1,"_","_","_","tri","NUM","","_","_"
2,"_","_","_","anīka","NC","","_","_"
3,"patyate","_","_","paty","V","paty","_","_"
4,"māhināvān","_","_","māhināvat","JJ","","_","_"
5,"sa","_","_","tad","PRD","","_","_"
6,"retodhā","_","_","retodhā","JJ","","_","_"
7,"vṛṣabhaḥ","_","_","vṛṣabha","NC","","_","_"
8,"śaśvatīnām","_","_","śaśvat","JJ","","_","_"
1,"abhīka","_","_","abhīka","NC","","_","_"
2,"āsām","_","_","ida","PRD","","_","_"
3,"padavīr","_","_","padavī","JJ","","_","_"
4,"abodhy","_","_","bodh","V","budh","_","_"
5,"ādityānām","_","_","āditya","NC","","_","_"
6,"ahve","_","_","hvā","V","hvā","_","_"
7,"cāru","_","_","cāru","JJ","","_","_"
8,"nāma","_","_","nāman","NC","","_","_"
1,"āpaś","_","_","ap","NC","","_","_"
2,"cid","_","_","cit","CEM","","_","_"
3,"asmā","_","_","ida","PRD","","_","_"
4,"aramanta","_","_","ra","V","ra","_","_"
5,"devīḥ","_","_","deva","JJ","","_","_"
6,"pṛthag","_","_","pṛthak","CX","","_","_"
7,"vrajantīḥ","_","_","vraj","KDP","","_","_"
8,"pari","_","_","pari","CADP","","_","_"
9,"ṣīm","_","_","sīm","CX","","_","_"
10,"avṛñjan","_","_","vṛj","V","vṛj","_","_"
1,"trī","_","_","tri","NUM","","_","_"
2,"ṣadhasthā","_","_","sadhastha","NC","","_","_"
3,"sindhavas","_","_","sindhu","NC","","_","_"
4,"triḥ","_","_","tris","CX","","_","_"
5,"kavīnām","_","_","kavi","NC","","_","_"
6,"uta","_","_","uta","CCD","","_","_"
7,"_","_","_","tri","NUM","","_","_"
8,"_","_","_","mātṛ","NC","","_","_"
9,"vidatheṣu","_","_","vidatha","NC","","_","_"
10,"samrāṭ","_","_","samrāj","NC","","_","_"
1,"ṛtāvarīr","_","_","ṛtāvan","JJ","","_","_"
2,"yoṣaṇās","_","_","yoṣaṇā","NC","","_","_"
3,"tisro","_","_","tri","NUM","","_","_"
4,"apyās","_","_","apya","JJ","","_","_"
5,"trir","_","_","tris","CX","","_","_"
6,"ā","_","_","ā","CADP","","_","_"
7,"divo","_","_","div","NC","","_","_"
8,"vidathe","_","_","vidatha","NC","","_","_"
9,"patyamānāḥ","_","_","paty","KDP","","_","_"
1,"trir","_","_","tris","CX","","_","_"
2,"ā","_","_","ā","CADP","","_","_"
3,"divaḥ","_","_","div","NC","","_","_"
4,"savitar","_","_","savitṛ","NC","","_","_"
5,"vāryāṇi","_","_","vārya","NC","","_","_"
6,"dive","_","_","diva","NC","","_","_"
7,"diva","_","_","diva","NC","","_","_"
8,"ā","_","_","ā","CADP","","_","_"
9,"suva","_","_","suv","V","sū","_","_"
10,"trir","_","_","tris","CX","","_","_"
11,"no","_","_","mat","PPR","","_","_"
12,"ahnaḥ","_","_","ahar","NC","","_","_"
1,"_","_","_","tri","NUM","","_","_"
2,"_","_","_","dhātu","NC","","_","_"
3,"rāya","_","_","rai","NC","","_","_"
4,"ā","_","_","ā","CADP","","_","_"
5,"_","_","_","suv","V","sū","_","_"
6,"_","_","_","ā","CADP","","_","_"
7,"vasūni","_","_","vasu","NC","","_","_"
8,"bhaga","_","_","bhaga","NC","","_","_"
9,"trātar","_","_","trātṛ","NC","","_","_"
10,"dhiṣaṇe","_","_","dhiṣaṇā","NC","","_","_"
11,"sātaye","_","_","sāti","NC","","_","_"
12,"dhāḥ","_","_","dadh","V","dhā","_","_"
1,"trir","_","_","tris","CX","","_","_"
2,"ā","_","_","ā","CADP","","_","_"
3,"divaḥ","_","_","div","NC","","_","_"
4,"savitā","_","_","savitṛ","NC","","_","_"
5,"soṣavīti","_","_","soṣav","V","soṣav","_","_"
6,"rājānā","_","_","rājan","NC","","_","_"
7,"mitrāvaruṇā","_","_","mitrāvaruṇa","NC","","_","_"
8,"_","_","_","su","CAD","","_","_"
9,"_","_","_","pāṇi","NC","","_","_"
1,"āpaś","_","_","ap","NC","","_","_"
2,"cid","_","_","cit","CEM","","_","_"
3,"asya","_","_","ida","PRD","","_","_"
4,"rodasī","_","_","rodas","NC","","_","_"
5,"cid","_","_","cit","CEM","","_","_"
6,"urvī","_","_","uru","JJ","","_","_"
7,"ratnam","_","_","ratna","NC","","_","_"
8,"bhikṣanta","_","_","bhikṣ","V","bhikṣ","_","_"
9,"savituḥ","_","_","savitṛ","NC","","_","_"
10,"savāya","_","_","sava","NC","","_","_"
1,"trir","_","_","tris","CX","","_","_"
2,"uttamā","_","_","uttama","JJ","","_","_"
3,"dūṇaśā","_","_","dūṇaśa","JJ","","_","_"
4,"rocanāni","_","_","rocana","NC","","_","_"
5,"trayo","_","_","tri","NUM","","_","_"
6,"rājanty","_","_","rāj","V","rāj","_","_"
7,"asurasya","_","_","asura","NC","","_","_"
8,"vīrāḥ","_","_","vīra","NC","","_","_"
1,"ṛtāvāna","_","_","ṛtāvan","JJ","","_","_"
2,"iṣirā","_","_","iṣira","JJ","","_","_"
3,"dūﾱabhāsas","_","_","dūḍabha","JJ","","_","_"
4,"trir","_","_","tris","CX","","_","_"
5,"ā","_","_","ā","CADP","","_","_"
6,"divo","_","_","div","NC","","_","_"
7,"vidathe","_","_","vidatha","NC","","_","_"
8,"santu","_","_","as","V","as","_","_"
9,"devāḥ","_","_","deva","NC","","_","_"
