"WordID","word","NormSTEM","suffix","lemma","PoS","Root","NormSuffix","NormWord"
1,"indro","_","_","indra","NC","","_","_"
2,"vai","_","_","vai","CX","","_","_"
3,"devatā","_","_","devatā","NC","","_","_"
4,"dvitīyam","_","_","dvitīya","JJ","","_","_"
5,"ahar","_","_","ahar","NC","","_","_"
6,"vahati","_","_","vah","V","vah","_","_"
7,"pañcadaśaḥ","_","_","pañcadaśa","JJ","","_","_"
8,"stomo","_","_","stoma","NC","","_","_"
9,"bṛhat","_","_","bṛhat","NC","","_","_"
10,"sāma","_","_","sāman","NC","","_","_"
11,"triṣṭup","_","_","triṣṭubh","NC","","_","_"
12,"chandaḥ","_","_","chandas","NC","","_","_"
1,"yathādevatam","_","_","yathādevata","CX","","_","_"
2,"enena","_","_","a","PRD","","_","_"
3,"yathāstomaṃ","_","_","yathāstoma","CX","","_","_"
4,"yathāsāma","_","_","yathāsāma","CX","","_","_"
5,"yathāchandasaṃ","_","_","yathāchandasa","CX","","_","_"
6,"rādhnoti","_","_","rādh","V","rādh","_","_"
7,"ya","_","_","yad","PRL","","_","_"
8,"evaṃ","_","_","eva","CX","","_","_"
9,"veda","_","_","vid","V","vid","_","_"
1,"yad","_","_","yad","PRL","","_","_"
2,"vai","_","_","vai","CX","","_","_"
3,"_","_","_","na","CNG","","_","_"
4,"_","_","_","iti","CQT","","_","_"
5,"na","_","_","na","CNG","","_","_"
6,"_","_","_","pra","CADP","","_","_"
7,"_","_","_","iti","CQT","","_","_"
8,"yat","_","_","yad","PRL","","_","_"
9,"sthitaṃ","_","_","sthā","PPP","","_","_"
10,"tad","_","_","tad","PRD","","_","_"
11,"_","_","_","dvitīya","JJ","","_","_"
12,"_","_","_","ahar","NC","","_","_"
13,"rūpaṃ","_","_","rūpa","NC","","_","_"
14,"yad","_","_","yad","PRL","","_","_"
15,"ūrdhvavad","_","_","ūrdhvavat","JJ","","_","_"
16,"yat","_","_","yad","PRL","","_","_"
17,"prativad","_","_","prativat","JJ","","_","_"
18,"yad","_","_","yad","PRL","","_","_"
19,"antarvad","_","_","antarvat","JJ","","_","_"
20,"yad","_","_","yad","PRL","","_","_"
21,"vṛṣaṇvad","_","_","vṛṣaṇvat","JJ","","_","_"
22,"yad","_","_","yad","PRL","","_","_"
23,"vṛdhanvad","_","_","vṛdhanvat","JJ","","_","_"
24,"yan","_","_","yat","CSB","","_","_"
25,"madhyame","_","_","madhyama","JJ","","_","_"
26,"pade","_","_","pada","NC","","_","_"
27,"devatā","_","_","devatā","NC","","_","_"
28,"nirucyate","_","_","nirvak","V","nirvac","_","_"
29,"yad","_","_","yad","PRL","","_","_"
30,"antarikṣam","_","_","antarikṣa","NC","","_","_"
31,"abhyuditaṃ","_","_","abhivad","PPP","","_","_"
32,"yad","_","_","yad","PRL","","_","_"
33,"bārhataṃ","_","_","bārhata","JJ","","_","_"
34,"yat","_","_","yad","PRL","","_","_"
35,"traiṣṭubhaṃ","_","_","traiṣṭubha","JJ","","_","_"
36,"yat","_","_","yad","PRL","","_","_"
37,"kurvad","_","_","kṛ","KDP","","_","_"
38,"etāni","_","_","tad","PRD","","_","_"
39,"vai","_","_","vai","CX","","_","_"
40,"_","_","_","dvitīya","JJ","","_","_"
41,"_","_","_","ahar","NC","","_","_"
42,"rūpāṇi","_","_","rūpa","NC","","_","_"
1,"agniṃ","_","_","agni","NC","","_","_"
2,"dūtaṃ","_","_","dūta","NC","","_","_"
3,"vṛṇīmaha","_","_","vṛ","V","vṛ","_","_"
4,"iti","_","_","iti","CQT","","_","_"
5,"_","_","_","dvitīya","JJ","","_","_"
6,"_","_","_","ahar","NC","","_","_"
7,"ājyam","_","_","ājya","NC","","_","_"
8,"bhavati","_","_","bhav","V","bhū","_","_"
9,"kurvad","_","_","kṛ","KDP","","_","_"
10,"dvitīye","_","_","dvitīya","JJ","","_","_"
11,"'hani","_","_","ahar","NC","","_","_"
12,"_","_","_","dvitīya","JJ","","_","_"
13,"_","_","_","ahar","NC","","_","_"
14,"rūpam","_","_","rūpa","NC","","_","_"
1,"vāyo","_","_","vāyu","NC","","_","_"
2,"ye","_","_","yad","PRL","","_","_"
3,"te","_","_","tvat","PPR","","_","_"
4,"sahasriṇa","_","_","sahasrin","JJ","","_","_"
5,"iti","_","_","iti","CQT","","_","_"
6,"praugaṃ","_","_","prauga","NC","","_","_"
7,"sutaḥ","_","_","su","PPP","","_","_"
8,"soma","_","_","soma","NC","","_","_"
9,"_","_","_","ṛtāvṛdh","JJ","","_","_"
10,"_","_","_","iti","CQT","","_","_"
11,"vṛdhanvad","_","_","vṛdhanvat","JJ","","_","_"
12,"dvitīye","_","_","dvitīya","JJ","","_","_"
13,"'hani","_","_","ahar","NC","","_","_"
14,"_","_","_","dvitīya","JJ","","_","_"
15,"_","_","_","ahar","NC","","_","_"
16,"rūpam","_","_","rūpa","NC","","_","_"
1,"viśvānarasya","_","_","viśvānara","JJ","","_","_"
2,"vas","_","_","tvat","PPR","","_","_"
3,"patim","_","_","pati","NC","","_","_"
4,"indra","_","_","indra","NC","","_","_"
5,"it","_","_","id","CEM","","_","_"
6,"_","_","_","soma","NC","","_","_"
7,"_","_","_","pā","JJ","","_","_"
8,"eka","_","_","eka","PPX","","_","_"
9,"iti","_","_","iti","CQT","","_","_"
10,"marutvatīyasya","_","_","marutvatīya","JJ","","_","_"
11,"_","_","_","pratipad","NC","","_","_"
12,"_","_","_","anucara","NC","","_","_"
13,"_","_","_","vṛdhanvat","JJ","","_","_"
14,"_","_","_","ca","CCD","","_","_"
15,"_","_","_","antarvat","JJ","","_","_"
16,"_","_","_","ca","CCD","","_","_"
17,"dvitīye","_","_","dvitīya","JJ","","_","_"
18,"'hani","_","_","ahar","NC","","_","_"
19,"_","_","_","dvitīya","JJ","","_","_"
20,"_","_","_","ahar","NC","","_","_"
21,"rūpam","_","_","rūpa","NC","","_","_"
1,"indra","_","_","indra","NC","","_","_"
2,"nedīya","_","_","nedīyas","JJ","","_","_"
3,"_","_","_","ā","CADP","","_","_"
4,"_","_","_","id","CEM","","_","_"
5,"_","_","_","e","V","i","_","_"
6,"_","_","_","iti","CQT","","_","_"
7,"_","_","_","acyuta","JJ","","_","_"
8,"pragātha","_","_","pragātha","NC","","_","_"
9,"ut","_","_","ud","CADP","","_","_"
10,"tiṣṭha","_","_","tiṣṭh","V","sthā","_","_"
11,"brahmaṇaspata","_","_","brahmaṇaspati","NC","","_","_"
12,"iti","_","_","iti","CQT","","_","_"
13,"brāhmaṇaspatya","_","_","brāhmaṇaspatya","JJ","","_","_"
14,"ūrdhvavān","_","_","ūrdhvavat","JJ","","_","_"
15,"dvitīye","_","_","dvitīya","JJ","","_","_"
16,"'hani","_","_","ahar","NC","","_","_"
17,"_","_","_","dvitīya","JJ","","_","_"
18,"_","_","_","ahar","NC","","_","_"
19,"rūpam","_","_","rūpa","NC","","_","_"
1,"agnir","_","_","agni","NC","","_","_"
2,"netā","_","_","netṛ","NC","","_","_"
3,"tvaṃ","_","_","tvat","PPR","","_","_"
4,"soma","_","_","soma","NC","","_","_"
5,"kratubhiḥ","_","_","kratu","NC","","_","_"
6,"pinvanty","_","_","pinv","V","pinv","_","_"
7,"apa","_","_","ap","NC","","_","_"
8,"iti","_","_","iti","CQT","","_","_"
9,"dhāyyā","_","_","dhāyyā","NC","","_","_"
10,"acyutā","_","_","acyuta","JJ","","_","_"
1,"bṛhad","_","_","bṛhat","JJ","","_","_"
2,"indrāya","_","_","indra","NC","","_","_"
3,"_","_","_","gā","V","gā","_","_"
4,"_","_","_","iti","CQT","","_","_"
5,"marutvatīyaḥ","_","_","marutvatīya","JJ","","_","_"
6,"pragātho","_","_","pragātha","NC","","_","_"
7,"yena","_","_","yad","PRL","","_","_"
8,"jyotir","_","_","jyotis","NC","","_","_"
9,"ajanayann","_","_","janay","V","janay","_","_"
10,"ṛtāvṛdha","_","_","ṛtāvṛdh","JJ","","_","_"
11,"iti","_","_","iti","CQT","","_","_"
12,"vṛdhanvān","_","_","vṛdhanvat","JJ","","_","_"
13,"dvitīye","_","_","dvitīya","JJ","","_","_"
14,"'hani","_","_","ahar","NC","","_","_"
15,"_","_","_","dvitīya","JJ","","_","_"
16,"_","_","_","ahar","NC","","_","_"
17,"rūpam","_","_","rūpa","NC","","_","_"
1,"indra","_","_","indra","NC","","_","_"
2,"somaṃ","_","_","soma","NC","","_","_"
3,"_","_","_","soma","NC","","_","_"
4,"_","_","_","pati","NC","","_","_"
5,"_","_","_","pib","V","pā","_","_"
6,"_","_","_","ida","PRD","","_","_"
7,"iti","_","_","iti","CQT","","_","_"
8,"sūktam","_","_","sūkta","NC","","_","_"
9,"sajoṣā","_","_","sajoṣas","JJ","","_","_"
10,"rudrais","_","_","rudra","NC","","_","_"
11,"tṛpad","_","_","tṛp","KDP","","_","_"
12,"ā","_","_","ā","CADP","","_","_"
13,"_","_","_","vṛṣ","V","vṛṣ","_","_"
14,"_","_","_","iti","CQT","","_","_"
15,"vṛṣaṇvad","_","_","vṛṣaṇvat","JJ","","_","_"
16,"dvitīye","_","_","dvitīya","JJ","","_","_"
17,"'hani","_","_","ahar","NC","","_","_"
18,"_","_","_","dvitīya","JJ","","_","_"
19,"_","_","_","ahar","NC","","_","_"
20,"rūpam","_","_","rūpa","NC","","_","_"
1,"tvām","_","_","tvat","PPR","","_","_"
2,"_","_","_","id","CEM","","_","_"
3,"_","_","_","hi","CX","","_","_"
4,"havāmahe","_","_","hvā","V","hvā","_","_"
5,"tvaṃ","_","_","tvat","PPR","","_","_"
6,"hy","_","_","hi","CX","","_","_"
7,"ehi","_","_","e","V","e","_","_"
8,"cerava","_","_","ceru","JJ","","_","_"
9,"iti","_","_","iti","CQT","","_","_"
10,"_","_","_","bṛhat","NC","","_","_"
11,"_","_","_","pṛṣṭha","NC","","_","_"
12,"bhavati","_","_","bhav","V","bhū","_","_"
13,"bārhate","_","_","bārhata","JJ","","_","_"
14,"'hani","_","_","ahar","NC","","_","_"
15,"dvitīye","_","_","dvitīya","JJ","","_","_"
16,"'hani","_","_","ahar","NC","","_","_"
17,"_","_","_","dvitīya","JJ","","_","_"
18,"_","_","_","ahar","NC","","_","_"
19,"rūpam","_","_","rūpa","NC","","_","_"
1,"yad","_","_","yat","CSB","","_","_"
2,"_","_","_","van","V","van","_","_"
3,"_","_","_","iti","CQT","","_","_"
4,"_","_","_","dhāyyā","NC","","_","_"
5,"_","_","_","acyuta","JJ","","_","_"
1,"ubhayaṃ","_","_","ubhaya","JJ","","_","_"
2,"śṛṇavac","_","_","śṛṇ","V","śru","_","_"
3,"ca","_","_","ca","CCD","","_","_"
4,"na","_","_","mat","PPR","","_","_"
5,"iti","_","_","iti","CQT","","_","_"
6,"sāmapragātho","_","_","sāmapragātha","NC","","_","_"
7,"yac","_","_","yad","PRL","","_","_"
8,"_","_","_","ca","CCD","","_","_"
9,"_","_","_","ida","PRD","","_","_"
10,"adya","_","_","adya","CX","","_","_"
11,"yad","_","_","yad","PRL","","_","_"
12,"u","_","_","u","CEM","","_","_"
13,"ca","_","_","ca","CCD","","_","_"
14,"hya","_","_","hyas","CX","","_","_"
15,"āsīd","_","_","as","V","as","_","_"
16,"iti","_","_","iti","CQT","","_","_"
17,"bārhate","_","_","bārhata","JJ","","_","_"
18,"'hani","_","_","ahar","NC","","_","_"
19,"dvitīye","_","_","dvitīya","JJ","","_","_"
20,"'hani","_","_","ahar","NC","","_","_"
21,"_","_","_","dvitīya","JJ","","_","_"
22,"_","_","_","ahar","NC","","_","_"
23,"rūpam","_","_","rūpa","NC","","_","_"
1,"tyam","_","_","tya","PRD","","_","_"
2,"ū","_","_","u","CEM","","_","_"
3,"ṣu","_","_","su","CAD","","_","_"
4,"vājinaṃ","_","_","vājin","NC","","_","_"
5,"_","_","_","deva","NC","","_","_"
6,"_","_","_","jū","PPP","","_","_"
7,"iti","_","_","iti","CQT","","_","_"
8,"tārkṣyo","_","_","tārkṣya","NC","","_","_"
9,"'cyutaḥ","_","_","acyuta","JJ","","_","_"
