"WordID","word","NormSTEM","suffix","lemma","PoS","Root","NormSuffix","NormWord"
NA,"<doc textid = ""aryosnisavijayanamadharani"" genre = ""dhāraṇī"" title = ""āryoṣṇīṣavijayānāmadhāraṇī"" author = "" n/ a"" discourse = ""tantra"" tradition = ""buddh"" period = ""unknown"" source = ""pdf"" date_range = """" notes = ""edition from cambridge add. 1680.8 manuscript 12th-13th centuries . ""the uṣṇīṣavijayādhāraṇī has been published from a nepalese manuscript that contains only the dhāraṇī section. on the basis of unpublished sanskrit witnesses this teaching is given by amitāyus to avalokiteśvara in the land of sukhāvatī.” “the classication of dhāraṇī scriptures as sūtra or tantra is much varied and sometimes controversial within tibetan and chinese textual systems; showing that the positioning of these scriptures was problematic in earlier times as well.” brill "" religion = ""buddh"" edition = ""based on the ed. by gergely hidas. powers of protection. the buddhist tradition of spells in the dhāraṇīsaṃgraha collections"" digitization = ""ocr by tilak balavijayan & buddhist translators worbench team"" segmentation_lemmatization = ""ligeia lugli & buddhist translators workbench team"" metadata_enrichment = ""buddhist translators workbench team"" proofreader = """" permission = """" reconstructions = ""none"">","","","","",NA,"",""
NA,"<page number=""28"">","","","","",NA,"",""
NA,"<s number=""1"">","","","","",NA,"",""
1,"samanta","SAMANT","a","samanta","noun-adj",NA,"a","samanta"
2,"raśmi","RAŚM","i","raśmi","noun-adj",NA,"i","raśmi"
3,"pariśuddhe","PARIŚUDDH","e","pariśuddha","noun-adj",NA,"e","pariśuddhe"
4,"/","","","","punct",NA,"","/"
NA,"</s>","","","","",NA,"",""
NA,"<s number=""2"">","","","","",NA,"",""
1,"sarva","SARV","a","sarva","noun-adj",NA,"a","sarva"
2,"tathāgata","TATHĀGAT","a","tathāgata","noun-adj",NA,"a","tathāgata"
3,"hṛday","HṚDAY","a","hṛdaya","noun-adj",NA,"a","hṛdaya"
4,"^ādhiṣṭhān","ADHIṢṬHĀN","a","adhiṣṭhāna","noun-adj",NA,"a","adhiṣṭhāna"
5,"^ādhiṣṭhite","ADHIṢṬHIT","e","adhiṣṭhita","noun-adj",NA,"e","adhiṣṭhite"
6,"/","","","","punct",NA,"","/"
NA,"</s>","","","","",NA,"",""
NA,"<s number=""3"">","","","","",NA,"",""
1,"mudre","MUDR","e","mudrā","noun-adj",NA,"e","mudre"
2,"mudre","MUDR","e","mudrā","noun-adj",NA,"e","mudre"
3,"mahāmudre","MAHĀMUDR","e","mahāmudrā","noun-adj",NA,"e","mahāmudre"
4,"mahāmudrā","MAHĀMUDR","ā","mahāmudrā","noun-adj",NA,"ā","mahāmudrā"
5,"mantra","MANTR","a","mantra","noun-adj",NA,"a","mantra"
6,"pade","PAD","e","pada","noun-adj",NA,"e","pade"
7,"svāhā","SVĀH","ā","svāhā","noun-adj",NA,"ā","svāhā"
8,"//","","","","punct",NA,"","//"
NA,"</s>","","","","",NA,"",""
NA,"</page>","","","","",NA,"",""
NA,"</doc>","","","","",NA,"",""
