"WordID","word","NormSTEM","suffix","lemma","PoS","Root","NormSuffix","NormWord"
1,"dhṛtarāṣṭra","_","_","dhṛtarāṣṭra","NC","","_","_"
2,"uvāca","_","_","vak","V","vac","_","_"
1,"tathā","_","_","tathā","CX","","_","_"
2,"pramathamānaṃ","_","_","pramath","KDP","","_","_"
3,"taṃ","_","_","tad","PRD","","_","_"
4,"_","_","_","mahat","JJ","","_","_"
5,"_","_","_","iṣvāsa","NC","","_","_"
6,"ajihmagaiḥ","_","_","ajihmaga","NC","","_","_"
1,"ārjuniṃ","_","_","ārjuni","NC","","_","_"
2,"māmakāḥ","_","_","māmaka","JJ","","_","_"
3,"sarve","_","_","sarva","JQ","","_","_"
4,"ke","_","_","kiṃ","PRQ","","_","_"
5,"_","_","_","tu","CCD","","_","_"
6,"_","_","_","a","PRD","","_","_"
7,"samavākiran","_","_","samavakṛ","V","samavakṛ","_","_"
1,"saṃjaya","_","_","saṃjaya","NC","","_","_"
2,"uvāca","_","_","vak","V","vac","_","_"
1,"śṛṇu","_","_","śṛṇ","V","śru","_","_"
2,"rājan","_","_","rājan","NC","","_","_"
3,"kumārasya","_","_","kumāra","NC","","_","_"
4,"raṇe","_","_","raṇa","NC","","_","_"
5,"vikrīḍitaṃ","_","_","vikrīḍita","NC","","_","_"
6,"mahat","_","_","mahat","JJ","","_","_"
1,"bibhitsato","_","_","bibhits","KDP","","_","_"
2,"_","_","_","ratha","NC","","_","_"
3,"_","_","_","anīka","NC","","_","_"
4,"bhāradvājena","_","_","bhāradvāja","NC","","_","_"
5,"rakṣitam","_","_","rakṣ","PPP","","_","_"
1,"_","_","_","madra","NC","","_","_"
2,"_","_","_","īśa","NC","","_","_"
3,"sāditaṃ","_","_","sāday","PPP","","_","_"
4,"dṛṣṭvā","_","_","dṛś","CGDA","","_","_"
5,"_","_","_","saubhadra","NC","","_","_"
6,"_","_","_","āśuga","NC","","_","_"
7,"raṇe","_","_","raṇa","NC","","_","_"
1,"śalyād","_","_","śalya","NC","","_","_"
2,"avarajaḥ","_","_","avaraja","NC","","_","_"
3,"kruddhaḥ","_","_","krudh","PPP","","_","_"
4,"kiran","_","_","kṛ","KDP","","_","_"
5,"bāṇān","_","_","bāṇa","NC","","_","_"
6,"samabhyayāt","_","_","samabhiyā","V","samabhiyā","_","_"
1,"sa","_","_","tad","PRD","","_","_"
2,"viddhvā","_","_","vyadh","CGDA","","_","_"
3,"daśabhir","_","_","daśan","NUM","","_","_"
4,"bāṇaiḥ","_","_","bāṇa","NC","","_","_"
5,"_","_","_","sa_saha","CX","","_","_"
6,"_","_","_","aśva","NC","","_","_"
7,"_","_","_","yantṛ","NC","","_","_"
8,"ārjunim","_","_","ārjuni","NC","","_","_"
1,"_","_","_","utkroś","V","utkruś","_","_"
2,"_","_","_","mahat","JJ","","_","_"
3,"_","_","_","śabda","NC","","_","_"
4,"tiṣṭha","_","_","tiṣṭh","V","sthā","_","_"
5,"_","_","_","tiṣṭh","V","sthā","_","_"
6,"_","_","_","iti","CQT","","_","_"
7,"_","_","_","ca","CCD","","_","_"
8,"_","_","_","abravīta","V","brū","_","_"
1,"_","_","_","tad","PRD","","_","_"
2,"_","_","_","ārjuni","NC","","_","_"
3,"_","_","_","śiras","NC","","_","_"
4,"_","_","_","grīvā","NC","","_","_"
5,"_","_","_","pāṇi","NC","","_","_"
6,"_","_","_","pāda","NC","","_","_"
7,"dhanur","_","_","dhanus","NC","","_","_"
8,"hayān","_","_","haya","NC","","_","_"
1,"chatraṃ","_","_","chattra","NC","","_","_"
2,"dhvajaṃ","_","_","dhvaja","NC","","_","_"
3,"niyantāraṃ","_","_","niyantṛ","NC","","_","_"
4,"triveṇuṃ","_","_","triveṇu","NC","","_","_"
5,"_","_","_","śamī","NC","","_","_"
6,"_","_","_","upaskara","NC","","_","_"
1,"cakre","_","_","kar","V","kṛ","_","_"
2,"_","_","_","yuga","NC","","_","_"
3,"_","_","_","īṣā","NC","","_","_"
4,"tūṇīrān","_","_","tūṇīra","NC","","_","_"
5,"anukarṣaṃ","_","_","anukarṣa","NC","","_","_"
6,"ca","_","_","ca","CCD","","_","_"
7,"sāyakaiḥ","_","_","sāyaka","NC","","_","_"
1,"patākāṃ","_","_","patākā","NC","","_","_"
2,"cakragoptārau","_","_","cakragoptṛ","NC","","_","_"
3,"_","_","_","sarva","JQ","","_","_"
4,"_","_","_","upakaraṇa","NC","","_","_"
5,"ca","_","_","ca","CCD","","_","_"
1,"vyadhamal","_","_","vidha","V","vidha","_","_"
2,"lāghavāt","_","_","lāghava","NC","","_","_"
3,"_","_","_","tad","PRD","","_","_"
4,"_","_","_","ca","CCD","","_","_"
5,"dadṛśe","_","_","darś","V","dṛś","_","_"
6,"_","_","_","na","CNG","","_","_"
7,"_","_","_","ida","PRD","","_","_"
8,"kaścana","_","_","kaścana","PRI","","_","_"
1,"sa","_","_","tad","PRD","","_","_"
2,"papāta","_","_","pat","V","pat","_","_"
3,"kṣitau","_","_","kṣiti","NC","","_","_"
4,"kṣīṇaḥ","_","_","kṣi","PPP","","_","_"
5,"_","_","_","pravyadh","PPP","","_","_"
6,"_","_","_","ābharaṇa","NC","","_","_"
7,"_","_","_","ambara","NC","","_","_"
1,"_","_","_","vāyu","NC","","_","_"
2,"_","_","_","iva","CCM","","_","_"
3,"_","_","_","mahat","JJ","","_","_"
4,"_","_","_","caitya","NC","","_","_"
5,"saṃbhagno","_","_","sambhañj","PPP","","_","_"
6,"_","_","_","amita","JJ","","_","_"
7,"_","_","_","tejas","NC","","_","_"
1,"_","_","_","anuga","JJ","","_","_"
2,"_","_","_","ca","CCD","","_","_"
3,"_","_","_","ida","PRD","","_","_"
4,"vitrastāḥ","_","_","vitras","PPP","","_","_"
5,"prādravan","_","_","pradru","V","pradru","_","_"
6,"sarvatodiśam","_","_","sarvatodiśa","CX","","_","_"
1,"ārjuneḥ","_","_","ārjuni","NC","","_","_"
2,"karma","_","_","karman","NC","","_","_"
3,"tad","_","_","tad","PRD","","_","_"
4,"dṛṣṭvā","_","_","dṛś","CGDA","","_","_"
5,"_","_","_","praṇad","V","praṇad","_","_"
6,"_","_","_","ca","CCD","","_","_"
7,"samantataḥ","_","_","samantataḥ","CX","","_","_"
1,"nādena","_","_","nāda","NC","","_","_"
2,"_","_","_","sarva","JQ","","_","_"
3,"_","_","_","bhūta","NC","","_","_"
4,"sādhu","_","_","sādhu","JJ","","_","_"
5,"_","_","_","sādhu","JJ","","_","_"
6,"_","_","_","iti","CQT","","_","_"
7,"bhārata","_","_","bhārata","NC","","_","_"
1,"_","_","_","śalya","NC","","_","_"
2,"_","_","_","bhrātṛ","NC","","_","_"
3,"_","_","_","atha","CAD","","_","_"
4,"_","_","_","āruj","PPP","","_","_"
5,"_","_","_","bahuśas","CX","","_","_"
6,"_","_","_","tad","PRD","","_","_"
7,"sainikāḥ","_","_","sainika","NC","","_","_"
1,"_","_","_","kula","NC","","_","_"
2,"_","_","_","adhivāsa","NC","","_","_"
3,"_","_","_","nāman","NC","","_","_"
4,"śrāvayanto","_","_","śrāvay","KDP","","_","_"
5,"_","_","_","arjuna","NC","","_","_"
6,"_","_","_","ātmaja","NC","","_","_"
1,"abhyavartanta","_","_","abhivart","V","abhivṛt","_","_"
2,"saṃkruddhā","_","_","saṃkrudh","PPP","","_","_"
3,"_","_","_","vividha","JJ","","_","_"
4,"_","_","_","āyudha","NC","","_","_"
5,"_","_","_","pāṇi","NC","","_","_"
1,"rathair","_","_","ratha","NC","","_","_"
2,"aśvair","_","_","aśva","NC","","_","_"
3,"_","_","_","gaja","NC","","_","_"
4,"_","_","_","ca","CCD","","_","_"
5,"_","_","_","anya","PPX","","_","_"
6,"_","_","_","pādāta","NC","","_","_"
7,"_","_","_","ca","CCD","","_","_"
8,"_","_","_","bala","NC","","_","_"
9,"_","_","_","utkaṭa","JJ","","_","_"
1,"_","_","_","bāṇa","NC","","_","_"
2,"_","_","_","śabda","NC","","_","_"
3,"mahatā","_","_","mahat","JJ","","_","_"
4,"_","_","_","khura","NC","","_","_"
5,"_","_","_","nemi","NC","","_","_"
6,"_","_","_","svana","NC","","_","_"
7,"ca","_","_","ca","CCD","","_","_"
1,"huṃkāraiḥ","_","_","huṃkāra","NC","","_","_"
2,"_","_","_","kṣveḍita","NC","","_","_"
3,"_","_","_","utkruṣṭa","NC","","_","_"
4,"siṃhanādaiḥ","_","_","siṃhanāda","NC","","_","_"
5,"_","_","_","sa_saha","CX","","_","_"
6,"_","_","_","garjita","NC","","_","_"
1,"_","_","_","jyā","NC","","_","_"
2,"_","_","_","talatra","NC","","_","_"
3,"_","_","_","svana","NC","","_","_"
4,"anye","_","_","anya","PPX","","_","_"
5,"garjanto","_","_","garj","KDP","","_","_"
6,"_","_","_","arjuna","NC","","_","_"
7,"_","_","_","nandana","NC","","_","_"
1,"_","_","_","brū","KDP","","_","_"
2,"_","_","_","ca","CCD","","_","_"
3,"na","_","_","na","CNG","","_","_"
4,"no","_","_","mat","PPR","","_","_"
5,"_","_","_","jīv","KDP","","_","_"
6,"_","_","_","muñc","V","muc","_","_"
7,"jīvatām","_","_","jīv","KDP","","_","_"
8,"iti","_","_","iti","CQT","","_","_"
1,"_","_","_","tad","PRD","","_","_"
2,"_","_","_","tathā","CX","","_","_"
3,"bruvato","_","_","brū","KDP","","_","_"
4,"dṛṣṭvā","_","_","dṛś","CGDA","","_","_"
5,"saubhadraḥ","_","_","saubhadra","NC","","_","_"
6,"prahasann","_","_","prahas","KDP","","_","_"
7,"iva","_","_","iva","CCM","","_","_"
1,"yo","_","_","yad","PRL","","_","_"
2,"yaḥ","_","_","yad","PRL","","_","_"
3,"sma","_","_","sma","CX","","_","_"
4,"prāharat","_","_","prahar","V","prahṛ","_","_"
5,"pūrvaṃ","_","_","pūrva","CX","","_","_"
6,"taṃ","_","_","tad","PRD","","_","_"
7,"taṃ","_","_","tad","PRD","","_","_"
8,"vivyādha","_","_","vyadh","V","vyadh","_","_"
9,"patribhiḥ","_","_","pattrin","NC","","_","_"
1,"saṃdarśayiṣyann","_","_","saṃdarśay","KDP","","_","_"
2,"astrāṇi","_","_","astra","NC","","_","_"
3,"citrāṇi","_","_","citra","JJ","","_","_"
4,"ca","_","_","ca","CCD","","_","_"
5,"laghūni","_","_","laghu","JJ","","_","_"
6,"ca","_","_","ca","CCD","","_","_"
1,"ārjuniḥ","_","_","ārjuni","NC","","_","_"
2,"samare","_","_","samara","NC","","_","_"
3,"śūro","_","_","śūra","NC","","_","_"
4,"_","_","_","mṛdu","JJ","","_","_"
5,"_","_","_","pūrva","CX","","_","_"
6,"ayudhyata","_","_","yudh","V","yudh","_","_"
1,"vāsudevād","_","_","vāsudeva","NC","","_","_"
2,"upāttaṃ","_","_","upadā","PPP","","_","_"
3,"yad","_","_","yad","PRL","","_","_"
4,"yad","_","_","yad","PRL","","_","_"
5,"astraṃ","_","_","astra","NC","","_","_"
6,"ca","_","_","ca","CCD","","_","_"
7,"dhanaṃjayāt","_","_","dhanaṃjaya","NC","","_","_"
1,"adarśayata","_","_","darśay","V","darśay","_","_"
2,"tat","_","_","tad","PRD","","_","_"
3,"kārṣṇiḥ","_","_","kārṣṇi","NC","","_","_"
4,"kṛṣṇābhyām","_","_","kṛṣṇa","NC","","_","_"
5,"a","_","_","alpha_privativum","KDP","","_","_"
5,"aviśeṣayan","_","_","viśeṣay","KDP","","_","_"
1,"dūram","_","_","dūra","CX","","_","_"
2,"asyan","_","_","as","KDP","","_","_"
3,"guruṃ","_","_","guru","JJ","","_","_"
4,"bhāraṃ","_","_","bhāra","NC","","_","_"
5,"_","_","_","sādhay","KDP","","_","_"
6,"_","_","_","ca","CCD","","_","_"
7,"punaḥ","_","_","punar","CAD","","_","_"
8,"punaḥ","_","_","punar","CAD","","_","_"
1,"saṃdadhad","_","_","saṃdhā","KDP","","_","_"
2,"_","_","_","visṛj","KDP","","_","_"
3,"_","_","_","ca","CCD","","_","_"
4,"_","_","_","iṣu","NC","","_","_"
5,"_","_","_","nirviśeṣa","JJ","","_","_"
6,"adṛśyata","_","_","darś","V","dṛś","_","_"
1,"_","_","_","cāpa","NC","","_","_"
2,"_","_","_","maṇḍala","NC","","_","_"
3,"_","_","_","eva","CEM","","_","_"
4,"_","_","_","ida","PRD","","_","_"
5,"visphurad","_","_","visphur","KDP","","_","_"
6,"_","_","_","diś","NC","","_","_"
7,"_","_","_","darś","V","dṛś","_","_"
1,"tamo","_","_","tamas","NC","","_","_"
2,"ghnataḥ","_","_","han","KDP","","_","_"
3,"_","_","_","su","CAD","","_","_"
4,"_","_","_","dīp","PPP","","_","_"
5,"savitur","_","_","savitṛ","NC","","_","_"
6,"maṇḍalaṃ","_","_","maṇḍala","NC","","_","_"
7,"yathā","_","_","yathā","CCM","","_","_"
1,"_","_","_","jyā","NC","","_","_"
2,"_","_","_","śabda","NC","","_","_"
3,"śuśruve","_","_","śṛṇ","V","śru","_","_"
4,"tasya","_","_","tad","PRD","","_","_"
5,"_","_","_","tala","NC","","_","_"
6,"_","_","_","śabda","NC","","_","_"
7,"_","_","_","ca","CCD","","_","_"
8,"dāruṇaḥ","_","_","dāruṇa","JJ","","_","_"
1,"_","_","_","mahat","JJ","","_","_"
2,"_","_","_","aśani","NC","","_","_"
3,"_","_","_","muc","JJ","","_","_"
4,"kāle","_","_","kāla","NC","","_","_"
5,"_","_","_","payoda","NC","","_","_"
6,"_","_","_","iva","CCM","","_","_"
7,"nisvanaḥ","_","_","nisvana","NC","","_","_"
1,"hrīmān","_","_","hrīmat","JJ","","_","_"
2,"amarṣī","_","_","amarṣin","JJ","","_","_"
3,"saubhadro","_","_","saubhadra","NC","","_","_"
4,"_","_","_","māna","NC","","_","_"
5,"_","_","_","kṛt","JJ","","_","_"
6,"_","_","_","priya","JJ","","_","_"
7,"_","_","_","darśana","NC","","_","_"
1,"saṃmimānayiṣur","_","_","saṃmimānayiṣu","JJ","","_","_"
2,"vīrān","_","_","vīra","NC","","_","_"
3,"_","_","_","iṣvāsa","NC","","_","_"
4,"_","_","_","ca","CCD","","_","_"
5,"_","_","_","api","CX","","_","_"
6,"_","_","_","yudh","V","yudh","_","_"
1,"mṛdur","_","_","mṛdu","JJ","","_","_"
2,"bhūtvā","_","_","bhū","CGDA","","_","_"
3,"_","_","_","mahat","JJ","","_","_"
4,"_","_","_","rāja","NC","","_","_"
5,"dāruṇaḥ","_","_","dāruṇa","JJ","","_","_"
6,"samapadyata","_","_","saṃpad","V","saṃpad","_","_"
1,"_","_","_","varṣa","NC","","_","_"
2,"_","_","_","abhyatī","PPP","","_","_"
3,"bhagavāñ","_","_","bhagavat","JJ","","_","_"
4,"_","_","_","śarad","NC","","_","_"
5,"_","_","_","iva","CCM","","_","_"
6,"divākaraḥ","_","_","divākara","NC","","_","_"
1,"śarān","_","_","śara","NC","","_","_"
2,"_","_","_","vicitra","JJ","","_","_"
3,"_","_","_","mahat","JJ","","_","_"
4,"_","_","_","rukma","NC","","_","_"
5,"_","_","_","puṅkha","NC","","_","_"
6,"_","_","_","śilā","NC","","_","_"
7,"_","_","_","śā","PPP","","_","_"
1,"mumoca","_","_","muñc","V","muc","_","_"
2,"śataśaḥ","_","_","śataśas","CX","","_","_"
3,"kruddho","_","_","krudh","PPP","","_","_"
4,"gabhastīn","_","_","gabhasti","NC","","_","_"
5,"iva","_","_","iva","CCM","","_","_"
6,"bhāskaraḥ","_","_","bhāskara","NC","","_","_"
1,"kṣuraprair","_","_","kṣurapra","NC","","_","_"
2,"_","_","_","vatsadanta","NC","","_","_"
3,"_","_","_","ca","CCD","","_","_"
4,"_","_","_","vipāṭha","NC","","_","_"
5,"_","_","_","ca","CCD","","_","_"
6,"_","_","_","mahat","JJ","","_","_"
7,"_","_","_","yaśas","NC","","_","_"
1,"nārācair","_","_","nārāca","NC","","_","_"
2,"ardhanārācair","_","_","ardhanārāca","NC","","_","_"
3,"bhallair","_","_","bhalla","NC","","_","_"
4,"ajñalikair","_","_","ajñalika","NC","","_","_"
5,"api","_","_","api","CX","","_","_"
1,"avākirad","_","_","avakṛ","V","avakṛ","_","_"
2,"_","_","_","ratha","NC","","_","_"
3,"_","_","_","anīka","NC","","_","_"
4,"bhāradvājasya","_","_","bhāradvāja","NC","","_","_"
5,"paśyataḥ","_","_","dṛś","KDP","","_","_"
1,"_","_","_","tatas","CX","","_","_"
2,"_","_","_","tad","PRD","","_","_"
3,"sainyam","_","_","sainya","NC","","_","_"
4,"abhavad","_","_","bhav","V","bhū","_","_"
5,"vimukhaṃ","_","_","vimukha","JJ","","_","_"
6,"_","_","_","śara","NC","","_","_"
7,"_","_","_","pīḍay","PPP","","_","_"
