"WordID","word","NormSTEM","suffix","lemma","PoS","Root","NormSuffix","NormWord"
1,"yudhiṣṭhira","_","_","yudhiṣṭhira","NC","","_","_"
2,"uvāca","_","_","vak","V","vac","_","_"
1,"_","_","_","na","CNG","","_","_"
2,"_","_","_","āpad","NC","","_","_"
3,"asti","_","_","as","V","as","_","_"
4,"maryādā","_","_","maryādā","NC","","_","_"
5,"na","_","_","na","CNG","","_","_"
6,"nimittaṃ","_","_","nimitta","NC","","_","_"
7,"na","_","_","na","CNG","","_","_"
8,"kāraṇam","_","_","kāraṇa","NC","","_","_"
1,"_","_","_","dharma","NC","","_","_"
2,"_","_","_","tu","CCD","","_","_"
3,"_","_","_","vibhaj","V","vibhaj","_","_"
4,"_","_","_","atra","CAD","","_","_"
5,"ubhayoḥ","_","_","ubhaya","JJ","","_","_"
6,"_","_","_","puṇya","JJ","","_","_"
7,"_","_","_","pāpa","JJ","","_","_"
1,"bhīma","_","_","bhīma","NC","","_","_"
2,"uvāca","_","_","vak","V","vac","_","_"
1,"_","_","_","prātikāmin","JJ","","_","_"
2,"_","_","_","nay","V","nī","_","_"
3,"kṛṣṇāṃ","_","_","kṛṣṇā","NC","","_","_"
4,"sabhāyāṃ","_","_","sabhā","NC","","_","_"
5,"_","_","_","preṣya","NC","","_","_"
6,"_","_","_","vat","CX","","_","_"
7,"tadā","_","_","tadā","CAD","","_","_"
1,"na","_","_","na","CNG","","_","_"
2,"mayā","_","_","mat","PPR","","_","_"
3,"nihatas","_","_","nihan","PPP","","_","_"
4,"tatra","_","_","tatra","CAD","","_","_"
5,"tena","_","_","tad","PRD","","_","_"
6,"prāptāḥ","_","_","prāp","PPP","","_","_"
7,"sma","_","_","sma","CX","","_","_"
8,"saṃśayam","_","_","saṃśaya","NC","","_","_"
1,"arjuna","_","_","arjuna","NC","","_","_"
2,"uvāca","_","_","vak","V","vac","_","_"
1,"vācas","_","_","vāc","NC","","_","_"
2,"_","_","_","tīkṣṇa","JJ","","_","_"
3,"_","_","_","asthi","NC","","_","_"
4,"_","_","_","bhedin","JJ","","_","_"
5,"sūtaputreṇa","_","_","sūtaputra","NC","","_","_"
6,"bhāṣitāḥ","_","_","bhāṣ","PPP","","_","_"
1,"atitīkṣṇā","_","_","atitīkṣṇa","JJ","","_","_"
2,"mayā","_","_","mat","PPR","","_","_"
3,"_","_","_","kṣa","PPP","","_","_"
4,"_","_","_","tad","PRD","","_","_"
5,"prāptāḥ","_","_","prāp","PPP","","_","_"
6,"sma","_","_","sma","CX","","_","_"
7,"saṃśayam","_","_","saṃśaya","NC","","_","_"
1,"sahadeva","_","_","sahadeva","NC","","_","_"
2,"uvāca","_","_","vak","V","vac","_","_"
1,"_","_","_","śakuni","NC","","_","_"
2,"_","_","_","tvat","PPR","","_","_"
3,"_","_","_","yadā","CSB","","_","_"
4,"_","_","_","jay","V","ji","_","_"
5,"_","_","_","akṣa","NC","","_","_"
6,"_","_","_","dyūta","NC","","_","_"
7,"bhārata","_","_","bhārata","NC","","_","_"
1,"sa","_","_","tad","PRD","","_","_"
2,"mayā","_","_","mat","PPR","","_","_"
3,"na","_","_","na","CNG","","_","_"
4,"hatas","_","_","han","PPP","","_","_"
5,"tatra","_","_","tatra","CAD","","_","_"
6,"tena","_","_","tad","PRD","","_","_"
7,"prāptāḥ","_","_","prāp","PPP","","_","_"
8,"sma","_","_","sma","CX","","_","_"
9,"saṃśayam","_","_","saṃśaya","NC","","_","_"
1,"vaiśampāyana","_","_","vaiśampāyana","NC","","_","_"
2,"uvāca","_","_","vak","V","vac","_","_"
1,"tato","_","_","tatas","CX","","_","_"
2,"yudhiṣṭhiro","_","_","yudhiṣṭhira","NC","","_","_"
3,"rājā","_","_","rājan","NC","","_","_"
4,"nakulaṃ","_","_","nakula","NC","","_","_"
5,"vākyam","_","_","vākya","NC","","_","_"
6,"abravīt","_","_","abravīta","V","brū","_","_"
1,"āruhya","_","_","āruh","CGDA","","_","_"
2,"vṛkṣaṃ","_","_","vṛkṣa","NC","","_","_"
3,"mādreya","_","_","mādreya","NC","","_","_"
4,"nirīkṣasva","_","_","nirīkṣ","V","nirīkṣ","_","_"
5,"diśo","_","_","diś","NC","","_","_"
6,"daśa","_","_","daśan","NUM","","_","_"
1,"pānīyam","_","_","pānīya","NC","","_","_"
2,"antike","_","_","antika","NC","","_","_"
3,"paśya","_","_","paś","V","paś","_","_"
4,"vṛkṣān","_","_","vṛkṣa","NC","","_","_"
5,"_","_","_","vā","CCD","","_","_"
6,"_","_","_","api","CX","","_","_"
7,"_","_","_","udaka","NC","","_","_"
8,"_","_","_","āśraya","NC","","_","_"
1,"ime","_","_","ida","PRD","","_","_"
2,"hi","_","_","hi","CX","","_","_"
3,"bhrātaraḥ","_","_","bhrātṛ","NC","","_","_"
4,"śrāntās","_","_","śra","PPP","","_","_"
5,"tava","_","_","tvat","PPR","","_","_"
6,"tāta","_","_","tāta","NC","","_","_"
7,"pipāsitāḥ","_","_","pipāsita","JJ","","_","_"
1,"_","_","_","nakula","NC","","_","_"
2,"_","_","_","tu","CCD","","_","_"
3,"_","_","_","tathā","CX","","_","_"
4,"_","_","_","iti","CQT","","_","_"
5,"_","_","_","vac","CGDA","","_","_"
6,"śīghram","_","_","śīghra","JJ","","_","_"
7,"āruhya","_","_","āruh","CGDA","","_","_"
8,"pādapam","_","_","pādapa","NC","","_","_"
1,"abravīd","_","_","abravīta","V","brū","_","_"
2,"bhrātaraṃ","_","_","bhrātṛ","NC","","_","_"
3,"jyeṣṭham","_","_","jyeṣṭha","JJ","","_","_"
4,"abhivīkṣya","_","_","abhivīkṣ","CGDA","","_","_"
5,"samantataḥ","_","_","samantataḥ","CX","","_","_"
1,"paśyāmi","_","_","paś","V","paś","_","_"
2,"bahulān","_","_","bahula","JJ","","_","_"
3,"rājan","_","_","rājan","NC","","_","_"
4,"vṛkṣān","_","_","vṛkṣa","NC","","_","_"
5,"_","_","_","udaka","NC","","_","_"
6,"_","_","_","saṃśraya","NC","","_","_"
1,"sārasānāṃ","_","_","sārasa","NC","","_","_"
2,"ca","_","_","ca","CCD","","_","_"
3,"nirhrādam","_","_","nirhrāda","NC","","_","_"
4,"_","_","_","atra","CAD","","_","_"
5,"_","_","_","udaka","NC","","_","_"
6,"asaṃśayam","_","_","asaṃśaya","NC","","_","_"
1,"tato","_","_","tatas","CX","","_","_"
2,"'bravīt","_","_","abravīta","V","brū","_","_"
3,"_","_","_","satya","NC","","_","_"
4,"_","_","_","dhṛti","NC","","_","_"
5,"_","_","_","kuntī","NC","","_","_"
6,"_","_","_","putra","NC","","_","_"
7,"yudhiṣṭhiraḥ","_","_","yudhiṣṭhira","NC","","_","_"
1,"gaccha","_","_","ga","V","ga","_","_"
2,"saumya","_","_","saumya","JJ","","_","_"
3,"tataḥ","_","_","tatas","CX","","_","_"
4,"śīghraṃ","_","_","śīghra","JJ","","_","_"
5,"tūrṇaṃ","_","_","tūrṇa","CX","","_","_"
6,"pānīyam","_","_","pānīya","NC","","_","_"
7,"ānaya","_","_","ānay","V","ānī","_","_"
1,"_","_","_","nakula","NC","","_","_"
2,"_","_","_","tu","CCD","","_","_"
3,"_","_","_","tathā","CX","","_","_"
4,"_","_","_","iti","CQT","","_","_"
5,"_","_","_","vac","CGDA","","_","_"
6,"bhrātur","_","_","bhrātṛ","NC","","_","_"
7,"jyeṣṭhasya","_","_","jyeṣṭha","JJ","","_","_"
8,"śāsanāt","_","_","śāsana","NC","","_","_"
1,"prādravad","_","_","pradru","V","pradru","_","_"
2,"yatra","_","_","yatra","CX","","_","_"
3,"pānīyaṃ","_","_","pānīya","NC","","_","_"
4,"śīghraṃ","_","_","śīghra","JJ","","_","_"
5,"_","_","_","ca","CCD","","_","_"
6,"_","_","_","eva","CEM","","_","_"
7,"_","_","_","anupad","V","anupad","_","_"
1,"sa","_","_","tad","PRD","","_","_"
2,"dṛṣṭvā","_","_","dṛś","CGDA","","_","_"
3,"vimalaṃ","_","_","vimala","JJ","","_","_"
4,"toyaṃ","_","_","toya","NC","","_","_"
5,"sārasaiḥ","_","_","sārasa","NC","","_","_"
6,"parivāritam","_","_","parivāray","PPP","","_","_"
1,"_","_","_","pātu","NC","","_","_"
2,"_","_","_","kāma","NC","","_","_"
3,"tato","_","_","tatas","CX","","_","_"
4,"vācam","_","_","vāc","NC","","_","_"
5,"antarikṣāt","_","_","antarikṣa","NC","","_","_"
6,"sa","_","_","tad","PRD","","_","_"
7,"śuśruve","_","_","śṛṇ","V","śru","_","_"
1,"mā","_","_","mā","CNG","","_","_"
2,"tāta","_","_","tāta","NC","","_","_"
3,"sāhasaṃ","_","_","sāhasa","NC","","_","_"
4,"kārṣīr","_","_","kar","V","kṛ","_","_"
5,"mama","_","_","mat","PPR","","_","_"
6,"_","_","_","pūrva","PPX","","_","_"
7,"_","_","_","parigraha","NC","","_","_"
1,"praśnān","_","_","praśna","NC","","_","_"
2,"uktvā","_","_","vac","CGDA","","_","_"
3,"tu","_","_","tu","CCD","","_","_"
4,"mādreya","_","_","mādreya","NC","","_","_"
5,"tataḥ","_","_","tatas","CX","","_","_"
6,"piba","_","_","pib","V","pā","_","_"
7,"harasva","_","_","har","V","hṛ","_","_"
8,"ca","_","_","ca","CCD","","_","_"
1,"anādṛtya","_","_","anādṛtya","CX","","_","_"
2,"tu","_","_","tu","CCD","","_","_"
3,"tad","_","_","tad","PRD","","_","_"
4,"vākyaṃ","_","_","vākya","NC","","_","_"
5,"nakulaḥ","_","_","nakula","NC","","_","_"
6,"su","_","_","su","JJ","","_","_"
6,"supipāsitaḥ","_","_","pipāsita","JJ","","_","_"
1,"_","_","_","pib","V","pā","_","_"
2,"_","_","_","śītala","JJ","","_","_"
3,"toyaṃ","_","_","toya","NC","","_","_"
4,"pītvā","_","_","pā","CGDA","","_","_"
5,"ca","_","_","ca","CCD","","_","_"
6,"nipapāta","_","_","nipat","V","nipat","_","_"
7,"ha","_","_","ha","CEM","","_","_"
1,"cirāyamāṇe","_","_","cirāy","KDP","","_","_"
2,"nakule","_","_","nakula","NC","","_","_"
3,"_","_","_","kuntī","NC","","_","_"
4,"_","_","_","putra","NC","","_","_"
5,"yudhiṣṭhiraḥ","_","_","yudhiṣṭhira","NC","","_","_"
1,"abravīd","_","_","abravīta","V","brū","_","_"
2,"bhrātaraṃ","_","_","bhrātṛ","NC","","_","_"
3,"vīraṃ","_","_","vīra","NC","","_","_"
4,"sahadevam","_","_","sahadeva","NC","","_","_"
5,"ariṃdamam","_","_","ariṃdama","JJ","","_","_"
1,"bhrātā","_","_","bhrātṛ","NC","","_","_"
2,"cirāyate","_","_","cirāy","V","cirāy","_","_"
3,"tāta","_","_","tāta","NC","","_","_"
4,"sahadeva","_","_","sahadeva","NC","","_","_"
5,"_","_","_","tvat","PPR","","_","_"
6,"_","_","_","agraja","NC","","_","_"
1,"taṃ","_","_","tad","PRD","","_","_"
2,"_","_","_","ca","CCD","","_","_"
3,"_","_","_","eva","CEM","","_","_"
4,"_","_","_","ānay","V","ānī","_","_"
5,"sodaryaṃ","_","_","sodarya","JJ","","_","_"
6,"pānīyaṃ","_","_","pānīya","NC","","_","_"
7,"ca","_","_","ca","CCD","","_","_"
8,"tvam","_","_","tvat","PPR","","_","_"
9,"ānaya","_","_","ānay","V","ānī","_","_"
1,"_","_","_","sahadeva","NC","","_","_"
2,"_","_","_","tathā","CX","","_","_"
3,"_","_","_","iti","CQT","","_","_"
4,"_","_","_","vac","CGDA","","_","_"
5,"tāṃ","_","_","tad","PRD","","_","_"
6,"diśaṃ","_","_","diś","NC","","_","_"
7,"pratyapadyata","_","_","pratipad","V","pratipad","_","_"
1,"dadarśa","_","_","darś","V","dṛś","_","_"
2,"ca","_","_","ca","CCD","","_","_"
3,"hataṃ","_","_","han","PPP","","_","_"
4,"bhūmau","_","_","bhūmi","NC","","_","_"
5,"bhrātaraṃ","_","_","bhrātṛ","NC","","_","_"
6,"nakulaṃ","_","_","nakula","NC","","_","_"
7,"tadā","_","_","tadā","CAD","","_","_"
1,"_","_","_","bhrātṛ","NC","","_","_"
2,"_","_","_","śoka","NC","","_","_"
3,"_","_","_","abhisaṃtap","PPP","","_","_"
4,"_","_","_","tṛṣā","NC","","_","_"
5,"ca","_","_","ca","CCD","","_","_"
6,"prapīḍitaḥ","_","_","prapīḍay","PPP","","_","_"
1,"abhidudrāva","_","_","abhidru","V","abhidru","_","_"
2,"pānīyaṃ","_","_","pānīya","NC","","_","_"
3,"tato","_","_","tatas","CX","","_","_"
4,"vāg","_","_","vāc","NC","","_","_"
5,"abhyabhāṣata","_","_","abhibhāṣ","V","abhibhāṣ","_","_"
1,"mā","_","_","mā","CNG","","_","_"
2,"tāta","_","_","tāta","NC","","_","_"
3,"sāhasaṃ","_","_","sāhasa","NC","","_","_"
4,"kārṣīr","_","_","kar","V","kṛ","_","_"
5,"mama","_","_","mat","PPR","","_","_"
6,"_","_","_","pūrva","PPX","","_","_"
7,"_","_","_","parigraha","NC","","_","_"
1,"praśnān","_","_","praśna","NC","","_","_"
2,"uktvā","_","_","vac","CGDA","","_","_"
3,"yathākāmaṃ","_","_","yathākāma","JJ","","_","_"
4,"tataḥ","_","_","tatas","CX","","_","_"
5,"piba","_","_","pib","V","pā","_","_"
6,"harasva","_","_","har","V","hṛ","_","_"
7,"ca","_","_","ca","CCD","","_","_"
1,"anādṛtya","_","_","anādṛtya","CX","","_","_"
2,"tu","_","_","tu","CCD","","_","_"
3,"tad","_","_","tad","PRD","","_","_"
4,"vākyaṃ","_","_","vākya","NC","","_","_"
5,"sahadevaḥ","_","_","sahadeva","NC","","_","_"
6,"pipāsitaḥ","_","_","pipāsita","JJ","","_","_"
1,"_","_","_","pib","V","pā","_","_"
2,"_","_","_","śītala","JJ","","_","_"
3,"toyaṃ","_","_","toya","NC","","_","_"
4,"pītvā","_","_","pā","CGDA","","_","_"
5,"ca","_","_","ca","CCD","","_","_"
6,"nipapāta","_","_","nipat","V","nipat","_","_"
7,"ha","_","_","ha","CEM","","_","_"
1,"_","_","_","atha","CAD","","_","_"
2,"_","_","_","abravīta","V","brū","_","_"
3,"sa","_","_","tad","PRD","","_","_"
4,"vijayaṃ","_","_","vijaya","NC","","_","_"
5,"_","_","_","kuntī","NC","","_","_"
6,"_","_","_","putra","NC","","_","_"
7,"yudhiṣṭhiraḥ","_","_","yudhiṣṭhira","NC","","_","_"
1,"bhrātarau","_","_","bhrātṛ","NC","","_","_"
2,"te","_","_","tvat","PPR","","_","_"
3,"_","_","_","cira","JJ","","_","_"
4,"_","_","_","ga","PPP","","_","_"
5,"bībhatso","_","_","bībhatsu","JJ","","_","_"
6,"_","_","_","śatru","NC","","_","_"
7,"_","_","_","karśana","JJ","","_","_"
1,"tau","_","_","tad","PRD","","_","_"
2,"_","_","_","ca","CCD","","_","_"
3,"_","_","_","eva","CEM","","_","_"
4,"_","_","_","ānay","V","ānī","_","_"
5,"bhadraṃ","_","_","bhadra","NC","","_","_"
6,"te","_","_","tvat","PPR","","_","_"
7,"pānīyaṃ","_","_","pānīya","NC","","_","_"
8,"ca","_","_","ca","CCD","","_","_"
9,"tvam","_","_","tvat","PPR","","_","_"
10,"ānaya","_","_","ānay","V","ānī","_","_"
1,"evam","_","_","eva","CX","","_","_"
2,"ukto","_","_","vac","PPP","","_","_"
3,"guḍākeśaḥ","_","_","guḍākeśa","NC","","_","_"
4,"pragṛhya","_","_","pragrah","CGDA","","_","_"
5,"_","_","_","sa_saha","CX","","_","_"
6,"_","_","_","śara","NC","","_","_"
7,"dhanuḥ","_","_","dhanus","NC","","_","_"
1,"_","_","_","āmuc","PPP","","_","_"
2,"_","_","_","khaḍga","NC","","_","_"
3,"medhāvī","_","_","medhāvin","JJ","","_","_"
4,"tat","_","_","tad","PRD","","_","_"
5,"saraḥ","_","_","saras","NC","","_","_"
6,"pratyapadyata","_","_","pratipad","V","pratipad","_","_"
1,"yataḥ","_","_","yatas","CX","","_","_"
2,"_","_","_","puruṣa","NC","","_","_"
3,"_","_","_","śārdūla","NC","","_","_"
4,"_","_","_","pānīya","NC","","_","_"
5,"_","_","_","haraṇa","NC","","_","_"
6,"gatau","_","_","ga","PPP","","_","_"
1,"tau","_","_","tad","PRD","","_","_"
2,"dadarśa","_","_","darś","V","dṛś","_","_"
3,"hatau","_","_","han","PPP","","_","_"
4,"tatra","_","_","tatra","CAD","","_","_"
5,"bhrātarau","_","_","bhrātṛ","NC","","_","_"
6,"śvetavāhanaḥ","_","_","śvetavāhana","NC","","_","_"
1,"_","_","_","prasvap","PPP","","_","_"
2,"_","_","_","iva","CCM","","_","_"
3,"tau","_","_","tad","PRD","","_","_"
4,"dṛṣṭvā","_","_","dṛś","CGDA","","_","_"
5,"_","_","_","nara","NC","","_","_"
6,"_","_","_","siṃha","NC","","_","_"
7,"_","_","_","su","CAD","","_","_"
8,"_","_","_","duḥkhita","JJ","","_","_"
1,"dhanur","_","_","dhanus","NC","","_","_"
2,"udyamya","_","_","udya","CGDA","","_","_"
3,"kaunteyo","_","_","kaunteya","NC","","_","_"
4,"vyalokayata","_","_","vilokay","V","vilokay","_","_"
5,"tad","_","_","tad","PRD","","_","_"
6,"vanam","_","_","vana","NC","","_","_"
1,"_","_","_","na","CNG","","_","_"
2,"_","_","_","paś","V","paś","_","_"
3,"tatra","_","_","tatra","CAD","","_","_"
4,"kiṃcit","_","_","kiṃcit","PRI","","_","_"
5,"sa","_","_","tad","PRD","","_","_"
6,"bhūtaṃ","_","_","bhūta","NC","","_","_"
7,"tasmin","_","_","tad","PRD","","_","_"
8,"_","_","_","mahat","JJ","","_","_"
9,"_","_","_","vana","NC","","_","_"
1,"savyasācī","_","_","savyasācin","NC","","_","_"
2,"tataḥ","_","_","tatas","CX","","_","_"
3,"śrāntaḥ","_","_","śra","PPP","","_","_"
4,"pānīyaṃ","_","_","pānīya","NC","","_","_"
5,"so","_","_","tad","PRD","","_","_"
6,"'bhyadhāvata","_","_","abhidhāv","V","abhidhāv","_","_"
1,"_","_","_","abhidhāv","KDP","","_","_"
2,"_","_","_","tatas","CX","","_","_"
3,"vācam","_","_","vāc","NC","","_","_"
4,"antarikṣāt","_","_","antarikṣa","NC","","_","_"
5,"sa","_","_","tad","PRD","","_","_"
6,"śuśruve","_","_","śṛṇ","V","śru","_","_"
1,"kim","_","_","kiṃ","PRQ","","_","_"
2,"āsīd","_","_","as","V","as","_","_"
3,"asi","_","_","as","V","as","_","_"
4,"pānīyaṃ","_","_","pānīya","NC","","_","_"
5,"_","_","_","na","CNG","","_","_"
6,"_","_","_","tad","PRD","","_","_"
7,"_","_","_","śakya","JJ","","_","_"
8,"balāt","_","_","bala","NC","","_","_"
9,"tvayā","_","_","tvat","PPR","","_","_"
1,"kaunteya","_","_","kaunteya","NC","","_","_"
2,"yadi","_","_","yadi","CSB","","_","_"
3,"vai","_","_","vai","CX","","_","_"
4,"praśnān","_","_","praśna","NC","","_","_"
5,"_","_","_","mat","PPR","","_","_"
6,"_","_","_","vac","PPP","","_","_"
7,"pratipatsyase","_","_","pratipad","V","pratipad","_","_"
1,"tataḥ","_","_","tatas","CX","","_","_"
2,"pāsyasi","_","_","pib","V","pā","_","_"
3,"pānīyaṃ","_","_","pānīya","NC","","_","_"
4,"hariṣyasi","_","_","har","V","hṛ","_","_"
5,"ca","_","_","ca","CCD","","_","_"
6,"bhārata","_","_","bhārata","NC","","_","_"
1,"_","_","_","vāray","PPP","","_","_"
2,"_","_","_","tu","CCD","","_","_"
3,"_","_","_","abravīta","V","brū","_","_"
4,"pārtho","_","_","pārtha","NC","","_","_"
5,"dṛśyamāno","_","_","dṛś","KDP","","_","_"
6,"nivāraya","_","_","nivāray","V","nivāray","_","_"
1,"yāvad","_","_","yāvat","CX","","_","_"
2,"bāṇair","_","_","bāṇa","NC","","_","_"
3,"vinirbhinnaḥ","_","_","vinirbhid","PPP","","_","_"
4,"punar","_","_","punar","CAD","","_","_"
5,"_","_","_","na","CNG","","_","_"
6,"_","_","_","eva","CX","","_","_"
7,"vadiṣyasi","_","_","vad","V","vad","_","_"
1,"evam","_","_","eva","CX","","_","_"
2,"uktvā","_","_","vac","CGDA","","_","_"
3,"tataḥ","_","_","tatas","CX","","_","_"
4,"pārthaḥ","_","_","pārtha","NC","","_","_"
5,"śarair","_","_","śara","NC","","_","_"
6,"_","_","_","astra","NC","","_","_"
7,"_","_","_","anumantray","PPP","","_","_"
1,"vavarṣa","_","_","vṛṣ","V","vṛṣ","_","_"
2,"tāṃ","_","_","tad","PRD","","_","_"
3,"diśaṃ","_","_","diś","NC","","_","_"
4,"kṛtsnāṃ","_","_","kṛtsna","JJ","","_","_"
5,"śabdavedhaṃ","_","_","śabdavedha","NC","","_","_"
6,"ca","_","_","ca","CCD","","_","_"
7,"darśayan","_","_","darśay","KDP","","_","_"
1,"_","_","_","karṇin","NC","","_","_"
2,"_","_","_","nālīka","NC","","_","_"
3,"_","_","_","nārāca","NC","","_","_"
4,"utsṛjan","_","_","utsṛj","KDP","","_","_"
5,"_","_","_","bharata","NC","","_","_"
6,"_","_","_","ṛṣabha","NC","","_","_"
1,"anekair","_","_","aneka","JJ","","_","_"
2,"_","_","_","iṣu","NC","","_","_"
3,"_","_","_","saṃghāta","NC","","_","_"
4,"antarikṣaṃ","_","_","antarikṣa","NC","","_","_"
5,"vavarṣa","_","_","vṛṣ","V","vṛṣ","_","_"
6,"ha","_","_","ha","CEM","","_","_"
1,"yakṣa","_","_","yakṣa","NC","","_","_"
2,"uvāca","_","_","vak","V","vac","_","_"
1,"kiṃ","_","_","kiṃ","PRQ","","_","_"
2,"vighātena","_","_","vighāta","NC","","_","_"
3,"te","_","_","tvat","PPR","","_","_"
4,"pārtha","_","_","pārtha","NC","","_","_"
5,"praśnān","_","_","praśna","NC","","_","_"
6,"uktvā","_","_","vac","CGDA","","_","_"
7,"tataḥ","_","_","tatas","CX","","_","_"
8,"piba","_","_","pib","V","pā","_","_"
1,"anuktvā","_","_","anuktvā","CX","","_","_"
2,"tu","_","_","tu","CCD","","_","_"
3,"tataḥ","_","_","tatas","CX","","_","_"
4,"praśnān","_","_","praśna","NC","","_","_"
5,"_","_","_","pā","CGDA","","_","_"
6,"_","_","_","eva","CEM","","_","_"
7,"na","_","_","na","CNG","","_","_"
8,"bhaviṣyasi","_","_","bhav","V","bhū","_","_"
1,"vaiśampāyana","_","_","vaiśampāyana","NC","","_","_"
2,"uvāca","_","_","vak","V","vac","_","_"
1,"sa","_","_","tad","PRD","","_","_"
2,"_","_","_","tu","CCD","","_","_"
3,"_","_","_","amogha","JJ","","_","_"
4,"iṣūn","_","_","iṣu","NC","","_","_"
5,"muktvā","_","_","muc","CGDA","","_","_"
6,"_","_","_","tṛṣṇā","NC","","_","_"
7,"_","_","_","abhiprapīḍay","PPP","","_","_"
1,"a","_","_","alpha_privativum","CX","","_","_"
1,"_","_","_","vijñāya","CX","","_","_"
2,"_","_","_","eva","CEM","","_","_"
3,"tān","_","_","tad","PRD","","_","_"
4,"praśnān","_","_","praśna","NC","","_","_"
5,"_","_","_","pā","CGDA","","_","_"
6,"_","_","_","eva","CEM","","_","_"
7,"nipapāta","_","_","nipat","V","nipat","_","_"
8,"ha","_","_","ha","CEM","","_","_"
1,"_","_","_","atha","CAD","","_","_"
2,"_","_","_","abravīta","V","brū","_","_"
3,"bhīmasenaṃ","_","_","bhīmasa","NC","","_","_"
4,"_","_","_","kuntī","NC","","_","_"
5,"_","_","_","putra","NC","","_","_"
6,"yudhiṣṭhiraḥ","_","_","yudhiṣṭhira","NC","","_","_"
1,"nakulaḥ","_","_","nakula","NC","","_","_"
2,"sahadevaś","_","_","sahadeva","NC","","_","_"
3,"ca","_","_","ca","CCD","","_","_"
4,"bībhatsuś","_","_","bībhatsu","JJ","","_","_"
5,"_","_","_","ca","CCD","","_","_"
6,"_","_","_","aparājita","JJ","","_","_"
1,"ciraṃ","_","_","cira","CX","","_","_"
2,"gatās","_","_","ga","PPP","","_","_"
3,"_","_","_","toya","NC","","_","_"
4,"_","_","_","hetu","NC","","_","_"
5,"na","_","_","na","CNG","","_","_"
6,"_","_","_","ca","CCD","","_","_"
7,"_","_","_","āga","V","āga","_","_"
8,"bhārata","_","_","bhārata","NC","","_","_"
1,"tāṃś","_","_","tad","PRD","","_","_"
2,"_","_","_","ca","CCD","","_","_"
3,"_","_","_","eva","CEM","","_","_"
4,"_","_","_","ānay","V","ānī","_","_"
5,"bhadraṃ","_","_","bhadra","NC","","_","_"
6,"te","_","_","tvat","PPR","","_","_"
7,"pānīyaṃ","_","_","pānīya","NC","","_","_"
8,"ca","_","_","ca","CCD","","_","_"
9,"tvam","_","_","tvat","PPR","","_","_"
10,"ānaya","_","_","ānay","V","ānī","_","_"
1,"_","_","_","bhīmasa","NC","","_","_"
2,"_","_","_","tathā","CX","","_","_"
3,"_","_","_","iti","CQT","","_","_"
4,"_","_","_","vac","CGDA","","_","_"
5,"tāṃ","_","_","tad","PRD","","_","_"
6,"diśaṃ","_","_","diś","NC","","_","_"
7,"pratyapadyata","_","_","pratipad","V","pratipad","_","_"
1,"yatra","_","_","yatra","CX","","_","_"
2,"te","_","_","tad","PRD","","_","_"
3,"_","_","_","puruṣa","NC","","_","_"
4,"_","_","_","vyāghra","NC","","_","_"
5,"bhrātaro","_","_","bhrātṛ","NC","","_","_"
6,"'sya","_","_","ida","PRD","","_","_"
7,"nipātitāḥ","_","_","nipātay","PPP","","_","_"
1,"tān","_","_","tad","PRD","","_","_"
2,"dṛṣṭvā","_","_","dṛś","CGDA","","_","_"
3,"duḥkhito","_","_","duḥkhita","JJ","","_","_"
4,"bhīmas","_","_","bhīma","NC","","_","_"
5,"tṛṣayā","_","_","tṛṣā","NC","","_","_"
6,"ca","_","_","ca","CCD","","_","_"
7,"prapīḍitaḥ","_","_","prapīḍay","PPP","","_","_"
1,"amanyata","_","_","man","V","man","_","_"
2,"_","_","_","mahat","JJ","","_","_"
3,"_","_","_","bāhu","NC","","_","_"
4,"karma","_","_","karman","NC","","_","_"
5,"tad","_","_","tad","PRD","","_","_"
6,"_","_","_","yakṣa","NC","","_","_"
7,"_","_","_","rakṣas","NC","","_","_"
1,"sa","_","_","tad","PRD","","_","_"
2,"cintayāmāsa","_","_","cintay","V","cintay","_","_"
3,"tadā","_","_","tadā","CAD","","_","_"
4,"yoddhavyaṃ","_","_","yudh","KDG","","_","_"
5,"dhruvam","_","_","dhruva","CX","","_","_"
6,"adya","_","_","adya","CX","","_","_"
7,"me","_","_","mat","PPR","","_","_"
1,"pāsyāmi","_","_","pib","V","pā","_","_"
2,"tāvat","_","_","tāvat","CX","","_","_"
3,"pānīyam","_","_","pānīya","NC","","_","_"
4,"iti","_","_","iti","CQT","","_","_"
5,"pārtho","_","_","pārtha","NC","","_","_"
6,"vṛkodaraḥ","_","_","vṛkodara","NC","","_","_"
1,"tato","_","_","tatas","CX","","_","_"
2,"'bhyadhāvat","_","_","abhidhāv","V","abhidhāv","_","_"
3,"pānīyaṃ","_","_","pānīya","NC","","_","_"
4,"pipāsuḥ","_","_","pipāsu","JJ","","_","_"
5,"_","_","_","puruṣa","NC","","_","_"
6,"_","_","_","ṛṣabha","NC","","_","_"
1,"yakṣa","_","_","yakṣa","NC","","_","_"
2,"uvāca","_","_","vak","V","vac","_","_"
1,"mā","_","_","mā","CNG","","_","_"
2,"tāta","_","_","tāta","NC","","_","_"
3,"sāhasaṃ","_","_","sāhasa","NC","","_","_"
4,"kārṣīr","_","_","kar","V","kṛ","_","_"
5,"mama","_","_","mat","PPR","","_","_"
6,"_","_","_","pūrva","PPX","","_","_"
7,"_","_","_","parigraha","NC","","_","_"
1,"praśnān","_","_","praśna","NC","","_","_"
2,"uktvā","_","_","vac","CGDA","","_","_"
3,"tu","_","_","tu","CCD","","_","_"
4,"kaunteya","_","_","kaunteya","NC","","_","_"
5,"tataḥ","_","_","tatas","CX","","_","_"
6,"piba","_","_","pib","V","pā","_","_"
7,"harasva","_","_","har","V","hṛ","_","_"
8,"ca","_","_","ca","CCD","","_","_"
1,"vaiśampāyana","_","_","vaiśampāyana","NC","","_","_"
2,"uvāca","_","_","vak","V","vac","_","_"
1,"evam","_","_","eva","CX","","_","_"
2,"uktas","_","_","vac","PPP","","_","_"
3,"tato","_","_","tatas","CX","","_","_"
4,"bhīmo","_","_","bhīma","NC","","_","_"
5,"_","_","_","yakṣa","NC","","_","_"
6,"_","_","_","amita","JJ","","_","_"
7,"_","_","_","tejas","NC","","_","_"
1,"a","_","_","alpha_privativum","CX","","_","_"
1,"_","_","_","vijñāya","CX","","_","_"
2,"_","_","_","eva","CEM","","_","_"
3,"tān","_","_","tad","PRD","","_","_"
4,"praśnān","_","_","praśna","NC","","_","_"
5,"_","_","_","pā","CGDA","","_","_"
6,"_","_","_","eva","CEM","","_","_"
7,"nipapāta","_","_","nipat","V","nipat","_","_"
8,"ha","_","_","ha","CEM","","_","_"
1,"tataḥ","_","_","tatas","CX","","_","_"
2,"_","_","_","kuntī","NC","","_","_"
3,"_","_","_","suta","NC","","_","_"
4,"rājā","_","_","rājan","NC","","_","_"
5,"vicintya","_","_","vicintay","CGDA","","_","_"
6,"_","_","_","puruṣa","NC","","_","_"
7,"_","_","_","ṛṣabha","NC","","_","_"
1,"samutthāya","_","_","samutthā","CGDA","","_","_"
2,"_","_","_","mahat","JJ","","_","_"
3,"_","_","_","bāhu","NC","","_","_"
4,"dahyamānena","_","_","dah","KDP","","_","_"
5,"cetasā","_","_","cetas","NC","","_","_"
1,"_","_","_","ape","PPP","","_","_"
2,"_","_","_","jana","NC","","_","_"
3,"_","_","_","nirghoṣa","NC","","_","_"
4,"praviveśa","_","_","praviś","V","praviś","_","_"
5,"_","_","_","mahat","JJ","","_","_"
6,"_","_","_","vana","NC","","_","_"
1,"_","_","_","ruru","NC","","_","_"
2,"_","_","_","ca","CCD","","_","_"
3,"_","_","_","varāha","NC","","_","_"
4,"_","_","_","ca","CCD","","_","_"
5,"pakṣibhiś","_","_","pakṣin","NC","","_","_"
6,"ca","_","_","ca","CCD","","_","_"
7,"niṣevitam","_","_","niṣev","PPP","","_","_"
1,"_","_","_","nīla","JJ","","_","_"
2,"_","_","_","bhāsvara","JJ","","_","_"
3,"_","_","_","varṇa","NC","","_","_"
4,"_","_","_","ca","CCD","","_","_"
5,"pādapair","_","_","pādapa","NC","","_","_"
6,"upaśobhitam","_","_","upaśobhay","PPP","","_","_"
1,"bhramarair","_","_","bhramara","NC","","_","_"
2,"upagītaṃ","_","_","upagā","PPP","","_","_"
3,"ca","_","_","ca","CCD","","_","_"
4,"pakṣibhiś","_","_","pakṣin","NC","","_","_"
5,"ca","_","_","ca","CCD","","_","_"
6,"_","_","_","mahat","JJ","","_","_"
7,"_","_","_","yaśas","NC","","_","_"
1,"sa","_","_","tad","PRD","","_","_"
2,"gacchan","_","_","ga","KDP","","_","_"
3,"kānane","_","_","kānana","NC","","_","_"
4,"tasmin","_","_","tad","PRD","","_","_"
5,"_","_","_","heman","NC","","_","_"
6,"_","_","_","jāla","NC","","_","_"
7,"_","_","_","pariṣkṛ","PPP","","_","_"
1,"dadarśa","_","_","darś","V","dṛś","_","_"
2,"tat","_","_","tad","PRD","","_","_"
3,"saraḥ","_","_","saras","NC","","_","_"
4,"śrīmān","_","_","śrīmat","JJ","","_","_"
5,"_","_","_","viśvakarman","NC","","_","_"
6,"_","_","_","kṛ","PPP","","_","_"
7,"yathā","_","_","yathā","CCM","","_","_"
1,"upetaṃ","_","_","upe","PPP","","_","_"
2,"_","_","_","nalinī","NC","","_","_"
3,"_","_","_","jāla","NC","","_","_"
4,"sindhuvāraiś","_","_","sindhuvāra","NC","","_","_"
5,"ca","_","_","ca","CCD","","_","_"
6,"vetasaiḥ","_","_","vetasa","NC","","_","_"
1,"ketakaiḥ","_","_","ketaka","NC","","_","_"
2,"karavīraiś","_","_","karavīra","NC","","_","_"
3,"ca","_","_","ca","CCD","","_","_"
4,"pippalaiś","_","_","pippala","NC","","_","_"
5,"_","_","_","ca","CCD","","_","_"
6,"_","_","_","eva","CEM","","_","_"
7,"saṃvṛtam","_","_","saṃvṛ","PPP","","_","_"
1,"_","_","_","śrama","NC","","_","_"
2,"_","_","_","ārta","JJ","","_","_"
3,"_","_","_","tad","PRD","","_","_"
4,"upāgamya","_","_","upāga","CGDA","","_","_"
5,"saro","_","_","saras","NC","","_","_"
6,"_","_","_","dṛś","CGDA","","_","_"
7,"_","_","_","atha","CAD","","_","_"
8,"vismitaḥ","_","_","vismi","PPP","","_","_"
