"WordID","word","NormSTEM","suffix","lemma","PoS","Root","NormSuffix","NormWord"
1,"yudhiṣṭhira","_","_","yudhiṣṭhira","NC","","_","_"
2,"uvāca","_","_","vak","V","vac","_","_"
1,"sa","_","_","tad","PRD","","_","_"
2,"kathaṃ","_","_","katha","CX","","_","_"
3,"kāñcanaṣṭhīvī","_","_","kāñcanaṣṭhīvin","NC","","_","_"
4,"sṛñjayasya","_","_","sṛñjaya","NC","","_","_"
5,"suto","_","_","suta","NC","","_","_"
6,"'bhavat","_","_","bhav","V","bhū","_","_"
1,"parvatena","_","_","parvata","NC","","_","_"
2,"kimarthaṃ","_","_","kimartha","CX","","_","_"
3,"ca","_","_","ca","CCD","","_","_"
4,"dattaḥ","_","_","dā","PPP","","_","_"
5,"kena","_","_","kiṃ","PRQ","","_","_"
6,"mamāra","_","_","mar","V","mṛ","_","_"
7,"ca","_","_","ca","CCD","","_","_"
1,"yadā","_","_","yadā","CSB","","_","_"
2,"_","_","_","varṣa","NC","","_","_"
3,"_","_","_","sahasra","NUM","","_","_"
4,"_","_","_","āyus","NC","","_","_"
5,"_","_","_","tadā","CAD","","_","_"
6,"bhavati","_","_","bhav","V","bhū","_","_"
7,"mānavaḥ","_","_","mānava","NC","","_","_"
1,"katham","_","_","katha","CX","","_","_"
2,"_","_","_","aprāpta","JJ","","_","_"
3,"_","_","_","kaumāra","JJ","","_","_"
4,"sṛñjayasya","_","_","sṛñjaya","NC","","_","_"
5,"suto","_","_","suta","NC","","_","_"
6,"mṛtaḥ","_","_","mṛ","PPP","","_","_"
1,"_","_","_","uta","CCD","","_","_"
2,"_","_","_","aho","CX","","_","_"
3,"_","_","_","nāman","NC","","_","_"
4,"_","_","_","mātra","NC","","_","_"
5,"vai","_","_","vai","CX","","_","_"
6,"suvarṇaṣṭhīvino","_","_","suvarṇaṣṭhīvin","NC","","_","_"
7,"'bhavat","_","_","bhav","V","bhū","_","_"
1,"tathyaṃ","_","_","tathya","JJ","","_","_"
2,"vā","_","_","vā","CCD","","_","_"
3,"_","_","_","kāñcanaṣṭhīvin","NC","","_","_"
4,"_","_","_","iti","CQT","","_","_"
5,"_","_","_","tad","PRD","","_","_"
6,"icchāmi","_","_","iṣ","V","iṣ","_","_"
7,"veditum","_","_","vid","CGDI","","_","_"
1,"vāsudeva","_","_","vāsudeva","NC","","_","_"
2,"uvāca","_","_","vak","V","vac","_","_"
1,"atra","_","_","atra","CAD","","_","_"
2,"te","_","_","tvat","PPR","","_","_"
3,"kathayiṣyāmi","_","_","kath","V","kath","_","_"
4,"yathā","_","_","yathā","CCM","","_","_"
5,"vṛttaṃ","_","_","vṛt","PPP","","_","_"
6,"janeśvara","_","_","janeśvara","NC","","_","_"
1,"nāradaḥ","_","_","nārada","NC","","_","_"
2,"_","_","_","parvata","NC","","_","_"
3,"_","_","_","ca","CCD","","_","_"
4,"_","_","_","eva","CEM","","_","_"
5,"prāg","_","_","prāk","CX","","_","_"
6,"ṛṣī","_","_","ṛṣi","NC","","_","_"
7,"_","_","_","loka","NC","","_","_"
8,"_","_","_","pūjay","PPP","","_","_"
1,"mātulo","_","_","mātula","NC","","_","_"
2,"_","_","_","bhāgineya","NC","","_","_"
3,"_","_","_","ca","CCD","","_","_"
4,"_","_","_","deva","NC","","_","_"
5,"_","_","_","loka","NC","","_","_"
6,"_","_","_","iha","CAD","","_","_"
7,"_","_","_","āga","PPP","","_","_"
1,"_","_","_","vihartu","NC","","_","_"
2,"_","_","_","kāma","NC","","_","_"
3,"saṃprītyā","_","_","samprīti","NC","","_","_"
4,"mānuṣyeṣu","_","_","mānuṣya","JJ","","_","_"
5,"purā","_","_","purā","CX","","_","_"
6,"prabhū","_","_","prabhu","JJ","","_","_"
1,"_","_","_","havis","NC","","_","_"
2,"_","_","_","pavitra","NC","","_","_"
3,"_","_","_","bhojya","NC","","_","_"
4,"_","_","_","deva","NC","","_","_"
5,"_","_","_","bhojya","NC","","_","_"
6,"_","_","_","ca","CCD","","_","_"
7,"_","_","_","eva","CEM","","_","_"
8,"ha","_","_","ha","CEM","","_","_"
1,"nārado","_","_","nārada","NC","","_","_"
2,"_","_","_","mātula","NC","","_","_"
3,"_","_","_","ca","CCD","","_","_"
4,"_","_","_","eva","CEM","","_","_"
5,"_","_","_","bhāgineya","NC","","_","_"
6,"_","_","_","ca","CCD","","_","_"
7,"parvataḥ","_","_","parvata","NC","","_","_"
1,"_","_","_","tad","PRD","","_","_"
2,"_","_","_","ubh","PPX","","_","_"
3,"_","_","_","tapas","NC","","_","_"
4,"_","_","_","upeta","JJ","","_","_"
5,"_","_","_","avanī","NC","","_","_"
6,"_","_","_","tala","NC","","_","_"
7,"_","_","_","cārin","JJ","","_","_"
1,"bhuñjānau","_","_","bhuj","KDP","","_","_"
2,"mānuṣān","_","_","mānuṣa","JJ","","_","_"
3,"bhogān","_","_","bhoga","NC","","_","_"
4,"yathāvat","_","_","yathāvat","CX","","_","_"
5,"paryadhāvatām","_","_","paridhāv","V","paridhāv","_","_"
1,"prītimantau","_","_","prītimat","JJ","","_","_"
2,"mudā","_","_","mud","NC","","_","_"
3,"yuktau","_","_","yuj","PPP","","_","_"
4,"samayaṃ","_","_","samaya","NC","","_","_"
5,"tatra","_","_","tatra","CAD","","_","_"
6,"cakratuḥ","_","_","kar","V","kṛ","_","_"
1,"yo","_","_","yad","PRL","","_","_"
2,"_","_","_","bhav","V","bhū","_","_"
3,"_","_","_","hṛd","NC","","_","_"
4,"saṃkalpaḥ","_","_","saṃkalpa","NC","","_","_"
5,"śubho","_","_","śubha","JJ","","_","_"
6,"vā","_","_","vā","CCD","","_","_"
7,"yadi","_","_","yadi","CSB","","_","_"
8,"_","_","_","vā","CCD","","_","_"
9,"_","_","_","aśubha","JJ","","_","_"
1,"anyonyasya","_","_","anyonya","PRC","","_","_"
2,"sa","_","_","tad","PRD","","_","_"
3,"ākhyeyo","_","_","ākhyā","KDG","","_","_"
4,"mṛṣā","_","_","mṛṣā","CX","","_","_"
5,"śāpo","_","_","śāpa","NC","","_","_"
6,"'nyathā","_","_","anyathā","CX","","_","_"
7,"bhavet","_","_","bhav","V","bhū","_","_"
1,"tau","_","_","tad","PRD","","_","_"
2,"_","_","_","tathā","CX","","_","_"
3,"_","_","_","iti","CQT","","_","_"
4,"pratijñāya","_","_","pratijñā","CGDA","","_","_"
5,"_","_","_","mahat","JJ","","_","_"
6,"_","_","_","ṛṣi","NC","","_","_"
7,"_","_","_","loka","NC","","_","_"
8,"_","_","_","pūjay","PPP","","_","_"
1,"sṛñjayaṃ","_","_","sṛñjaya","NC","","_","_"
2,"śvaityam","_","_","śvaitya","NC","","_","_"
3,"abhyetya","_","_","abhye","CGDA","","_","_"
4,"rājānam","_","_","rājan","NC","","_","_"
5,"idam","_","_","ida","PRD","","_","_"
6,"ūcatuḥ","_","_","vak","V","vac","_","_"
1,"āvāṃ","_","_","mat","PPR","","_","_"
2,"bhavati","_","_","bhav","V","bhū","_","_"
3,"vatsyāvaḥ","_","_","vas","V","vas","_","_"
4,"kaṃcit","_","_","kiṃcit","PRI","","_","_"
5,"kālaṃ","_","_","kāla","NC","","_","_"
6,"hitāya","_","_","hita","NC","","_","_"
7,"te","_","_","tvat","PPR","","_","_"
1,"yathāvat","_","_","yathāvat","CX","","_","_"
2,"pṛthivīpāla","_","_","pṛthivīpāla","NC","","_","_"
3,"āvayoḥ","_","_","mat","PPR","","_","_"
4,"praguṇībhava","_","_","praguṇībhū","V","praguṇībhū","_","_"
1,"_","_","_","tathā","CX","","_","_"
2,"_","_","_","iti","CQT","","_","_"
3,"kṛtvā","_","_","kṛ","CGDA","","_","_"
4,"tau","_","_","tad","PRD","","_","_"
5,"rājā","_","_","rājan","NC","","_","_"
6,"_","_","_","satkṛ","CGDA","","_","_"
7,"_","_","_","upacar","V","upacar","_","_"
8,"ha","_","_","ha","CEM","","_","_"
1,"tataḥ","_","_","tatas","CX","","_","_"
2,"kadācit","_","_","kadācid","CX","","_","_"
3,"tau","_","_","tad","PRD","","_","_"
4,"rājā","_","_","rājan","NC","","_","_"
5,"mahātmānau","_","_","mahātman","JJ","","_","_"
6,"tathāgatau","_","_","tathāgata","JJ","","_","_"
1,"abravīt","_","_","abravīta","V","brū","_","_"
2,"_","_","_","parama","JJ","","_","_"
3,"_","_","_","prī","PPP","","_","_"
4,"_","_","_","sutā","NC","","_","_"
5,"_","_","_","ida","PRD","","_","_"
6,"varavarṇinī","_","_","varavarṇinī","NC","","_","_"
1,"_","_","_","eka","PPX","","_","_"
2,"_","_","_","eva","CEM","","_","_"
3,"mama","_","_","mat","PPR","","_","_"
4,"_","_","_","kanyā","NC","","_","_"
5,"_","_","_","tad","PRD","","_","_"
6,"yuvāṃ","_","_","tvat","PPR","","_","_"
7,"paricariṣyati","_","_","paricar","V","paricar","_","_"
1,"_","_","_","darśanīya","JJ","","_","_"
2,"_","_","_","anavadya","JJ","","_","_"
3,"_","_","_","aṅga","JJ","","_","_"
4,"_","_","_","śīla","NC","","_","_"
5,"_","_","_","vṛtta","NC","","_","_"
6,"_","_","_","samanvita","JJ","","_","_"
1,"sukumārī","_","_","sukumāra","JJ","","_","_"
2,"kumārī","_","_","kumārī","NC","","_","_"
3,"ca","_","_","ca","CCD","","_","_"
4,"_","_","_","padma","NC","","_","_"
5,"_","_","_","kiñjalka","NC","","_","_"
6,"_","_","_","saṃnibha","JJ","","_","_"
1,"paramaṃ","_","_","parama","JJ","","_","_"
2,"saumya","_","_","saumya","JJ","","_","_"
3,"_","_","_","iti","CQT","","_","_"
4,"_","_","_","vac","PPP","","_","_"
5,"_","_","_","tad","PRD","","_","_"
6,"rājā","_","_","rājan","NC","","_","_"
7,"śaśāsa","_","_","śās","V","śās","_","_"
8,"tām","_","_","tad","PRD","","_","_"
1,"kanye","_","_","kanyā","NC","","_","_"
2,"_","_","_","vipra","NC","","_","_"
3,"_","_","_","upacar","V","upacar","_","_"
4,"_","_","_","deva","NC","","_","_"
5,"_","_","_","vat","CX","","_","_"
6,"_","_","_","pitṛ","NC","","_","_"
7,"_","_","_","vat","CX","","_","_"
8,"_","_","_","ca","CCD","","_","_"
9,"ha","_","_","ha","CEM","","_","_"
1,"sā","_","_","tad","PRD","","_","_"
2,"tu","_","_","tu","CCD","","_","_"
3,"kanyā","_","_","kanyā","NC","","_","_"
4,"_","_","_","tathā","CX","","_","_"
5,"_","_","_","iti","CQT","","_","_"
6,"_","_","_","vac","CGDA","","_","_"
7,"pitaraṃ","_","_","pitṛ","NC","","_","_"
8,"_","_","_","dharma","NC","","_","_"
9,"_","_","_","cārin","JJ","","_","_"
1,"_","_","_","yathā","CCM","","_","_"
2,"_","_","_","nideśa","NC","","_","_"
3,"_","_","_","rājan","NC","","_","_"
4,"_","_","_","tad","PRD","","_","_"
5,"_","_","_","satkṛ","CGDA","","_","_"
6,"_","_","_","upacar","V","upacar","_","_"
7,"ha","_","_","ha","CEM","","_","_"
1,"_","_","_","tad","PRD","","_","_"
2,"_","_","_","tathā","CX","","_","_"
3,"_","_","_","upacāra","NC","","_","_"
4,"_","_","_","rūpa","NC","","_","_"
5,"_","_","_","apratima","JJ","","_","_"
6,"ca","_","_","ca","CCD","","_","_"
1,"nāradaṃ","_","_","nārada","NC","","_","_"
2,"_","_","_","hṛcchaya","NC","","_","_"
3,"_","_","_","tūrṇa","CX","","_","_"
4,"_","_","_","sahas","NC","","_","_"
5,"_","_","_","eva","CEM","","_","_"
6,"_","_","_","anupad","V","anupad","_","_"
1,"vavṛdhe","_","_","vṛdh","V","vṛdh","_","_"
2,"ca","_","_","ca","CCD","","_","_"
3,"_","_","_","tatas","CX","","_","_"
4,"_","_","_","tad","PRD","","_","_"
5,"hṛdi","_","_","hṛd","NC","","_","_"
6,"kāmo","_","_","kāma","NC","","_","_"
7,"mahātmanaḥ","_","_","mahātman","JJ","","_","_"
1,"yathā","_","_","yathā","CCM","","_","_"
2,"śuklasya","_","_","śukla","JJ","","_","_"
3,"pakṣasya","_","_","pakṣa","NC","","_","_"
4,"_","_","_","pravṛtti","NC","","_","_"
5,"_","_","_","uḍurāj","NC","","_","_"
6,"śanaiḥ","_","_","śanais","CX","","_","_"
1,"na","_","_","na","CNG","","_","_"
2,"ca","_","_","ca","CCD","","_","_"
3,"taṃ","_","_","tad","PRD","","_","_"
4,"bhāgineyāya","_","_","bhāgineya","NC","","_","_"
5,"parvatāya","_","_","parvata","NC","","_","_"
6,"mahātmane","_","_","mahātman","JJ","","_","_"
1,"śaśaṃsa","_","_","śaṃs","V","śaṃs","_","_"
2,"manmathaṃ","_","_","manmatha","NC","","_","_"
3,"tīvraṃ","_","_","tīvra","JJ","","_","_"
4,"vrīḍamānaḥ","_","_","vrīḍ","KDP","","_","_"
5,"sa","_","_","tad","PRD","","_","_"
6,"_","_","_","dharma","NC","","_","_"
7,"_","_","_","vid","JJ","","_","_"
1,"tapasā","_","_","tapas","NC","","_","_"
2,"_","_","_","ca","CCD","","_","_"
3,"_","_","_","iṅgita","NC","","_","_"
4,"_","_","_","atha","CAD","","_","_"
5,"parvato","_","_","parvata","NC","","_","_"
6,"'tha","_","_","atha","CAD","","_","_"
7,"bubodha","_","_","bodh","V","budh","_","_"
8,"tat","_","_","tad","PRD","","_","_"
1,"_","_","_","kāma","NC","","_","_"
2,"_","_","_","ārta","JJ","","_","_"
3,"nāradaṃ","_","_","nārada","NC","","_","_"
4,"kruddhaḥ","_","_","krudh","PPP","","_","_"
5,"_","_","_","śap","V","śap","_","_"
6,"_","_","_","a","PRD","","_","_"
7,"tato","_","_","tatas","CX","","_","_"
8,"bhṛśam","_","_","bhṛśa","CX","","_","_"
1,"kṛtvā","_","_","kṛ","CGDA","","_","_"
2,"samayam","_","_","samaya","NC","","_","_"
3,"avyagro","_","_","avyagra","JJ","","_","_"
4,"bhavān","_","_","bhavat","JJ","","_","_"
5,"vai","_","_","vai","CX","","_","_"
6,"sahito","_","_","sahita","JJ","","_","_"
7,"mayā","_","_","mat","PPR","","_","_"
1,"yo","_","_","yad","PRL","","_","_"
2,"_","_","_","bhav","V","bhū","_","_"
3,"_","_","_","hṛd","NC","","_","_"
4,"saṃkalpaḥ","_","_","saṃkalpa","NC","","_","_"
5,"śubho","_","_","śubha","JJ","","_","_"
6,"vā","_","_","vā","CCD","","_","_"
7,"yadi","_","_","yadi","CSB","","_","_"
8,"_","_","_","vā","CCD","","_","_"
9,"_","_","_","aśubha","JJ","","_","_"
1,"anyonyasya","_","_","anyonya","PRC","","_","_"
2,"sa","_","_","tad","PRD","","_","_"
3,"ākhyeya","_","_","ākhyā","KDG","","_","_"
4,"iti","_","_","iti","CQT","","_","_"
5,"tad","_","_","tad","PRD","","_","_"
6,"vai","_","_","vai","CX","","_","_"
7,"mṛṣā","_","_","mṛṣā","CX","","_","_"
8,"kṛtam","_","_","kṛ","PPP","","_","_"
1,"bhavatā","_","_","bhavat","JJ","","_","_"
2,"vacanaṃ","_","_","vacana","NC","","_","_"
3,"_","_","_","brahman","NC","","_","_"
4,"_","_","_","tasmāt","CX","","_","_"
5,"etad","_","_","tad","PRD","","_","_"
6,"_","_","_","vad","V","vad","_","_"
7,"_","_","_","mat","PPR","","_","_"
1,"na","_","_","na","CNG","","_","_"
2,"hi","_","_","hi","CX","","_","_"
3,"kāmaṃ","_","_","kāma","NC","","_","_"
4,"pravartantaṃ","_","_","pravṛt","KDP","","_","_"
5,"bhavān","_","_","bhavat","JJ","","_","_"
6,"ācaṣṭa","_","_","ācakṣ","V","ācakṣ","_","_"
7,"me","_","_","mat","PPR","","_","_"
8,"purā","_","_","purā","CX","","_","_"
1,"sukumāryāṃ","_","_","sukumāra","JJ","","_","_"
2,"kumāryāṃ","_","_","kumārī","NC","","_","_"
3,"te","_","_","tvat","PPR","","_","_"
4,"tasmād","_","_","tasmāt","CX","","_","_"
5,"eṣa","_","_","tad","PRD","","_","_"
6,"_","_","_","śap","V","śap","_","_"
7,"_","_","_","mat","PPR","","_","_"
1,"_","_","_","brahman","NC","","_","_"
2,"_","_","_","vādin","JJ","","_","_"
3,"gurur","_","_","guru","NC","","_","_"
4,"yasmāt","_","_","yasmāt","CX","","_","_"
5,"tapasvī","_","_","tapasvin","NC","","_","_"
6,"_","_","_","brāhmaṇa","NC","","_","_"
7,"_","_","_","ca","CCD","","_","_"
8,"san","_","_","as","KDP","","_","_"
1,"akārṣīḥ","_","_","kar","V","kṛ","_","_"
2,"_","_","_","samaya","NC","","_","_"
3,"_","_","_","bhraṃśa","NC","","_","_"
4,"āvābhyāṃ","_","_","mat","PPR","","_","_"
5,"yaḥ","_","_","yad","PRL","","_","_"
6,"kṛto","_","_","kṛ","PPP","","_","_"
7,"mithaḥ","_","_","mithas","CX","","_","_"
1,"śapsye","_","_","śap","V","śap","_","_"
2,"tasmāt","_","_","tasmāt","CX","","_","_"
3,"_","_","_","su","CAD","","_","_"
4,"_","_","_","saṃkrudh","PPP","","_","_"
5,"bhavantaṃ","_","_","bhavat","JJ","","_","_"
6,"taṃ","_","_","tad","PRD","","_","_"
7,"nibodha","_","_","nibodh","V","nibudh","_","_"
8,"me","_","_","mat","PPR","","_","_"
1,"sukumārī","_","_","sukumāra","JJ","","_","_"
2,"ca","_","_","ca","CCD","","_","_"
3,"te","_","_","tvat","PPR","","_","_"
4,"bhāryā","_","_","bhāryā","NC","","_","_"
5,"bhaviṣyati","_","_","bhav","V","bhū","_","_"
6,"na","_","_","na","CNG","","_","_"
7,"saṃśayaḥ","_","_","saṃśaya","NC","","_","_"
1,"vānaraṃ","_","_","vānara","NC","","_","_"
2,"_","_","_","ca","CCD","","_","_"
3,"_","_","_","eva","CEM","","_","_"
4,"kanyā","_","_","kanyā","NC","","_","_"
5,"tvāṃ","_","_","tvat","PPR","","_","_"
6,"vivāhāt","_","_","vivāha","NC","","_","_"
7,"prabhṛti","_","_","prabhṛti","CX","","_","_"
8,"prabho","_","_","prabhu","JJ","","_","_"
1,"saṃdrakṣyanti","_","_","saṃdarś","V","saṃdṛś","_","_"
2,"_","_","_","nara","NC","","_","_"
3,"_","_","_","ca","CCD","","_","_"
4,"_","_","_","anya","PPX","","_","_"
5,"_","_","_","sva","JJ","","_","_"
6,"_","_","_","rūpa","NC","","_","_"
7,"vinākṛtam","_","_","vinākṛta","JJ","","_","_"
1,"sa","_","_","tad","PRD","","_","_"
2,"tad","_","_","tad","PRD","","_","_"
3,"vākyaṃ","_","_","vākya","NC","","_","_"
4,"tu","_","_","tu","CCD","","_","_"
5,"vijñāya","_","_","vijñā","CGDA","","_","_"
6,"nāradaḥ","_","_","nārada","NC","","_","_"
7,"parvatāt","_","_","parvata","NC","","_","_"
8,"tadā","_","_","tadā","CAD","","_","_"
1,"aśapat","_","_","śap","V","śap","_","_"
2,"tam","_","_","tad","PRD","","_","_"
3,"api","_","_","api","CX","","_","_"
4,"krodhād","_","_","krodha","NC","","_","_"
5,"bhāgineyaṃ","_","_","bhāgineya","NC","","_","_"
6,"sa","_","_","tad","PRD","","_","_"
7,"mātulaḥ","_","_","mātula","NC","","_","_"
1,"tapasā","_","_","tapas","NC","","_","_"
2,"brahmacaryeṇa","_","_","brahmacarya","NC","","_","_"
3,"satyena","_","_","satya","NC","","_","_"
4,"ca","_","_","ca","CCD","","_","_"
5,"damena","_","_","dama","NC","","_","_"
6,"ca","_","_","ca","CCD","","_","_"
1,"yukto","_","_","yuj","PPP","","_","_"
2,"'pi","_","_","api","CX","","_","_"
3,"_","_","_","dharma","NC","","_","_"
4,"_","_","_","nitya","JJ","","_","_"
5,"_","_","_","ca","CCD","","_","_"
6,"na","_","_","na","CNG","","_","_"
7,"_","_","_","svarga","NC","","_","_"
8,"_","_","_","vāsa","NC","","_","_"
9,"āpsyasi","_","_","āpn","V","āp","_","_"
1,"tau","_","_","tad","PRD","","_","_"
2,"tu","_","_","tu","CCD","","_","_"
3,"śaptvā","_","_","śap","CGDA","","_","_"
4,"bhṛśaṃ","_","_","bhṛśa","CX","","_","_"
5,"kruddhau","_","_","krudh","PPP","","_","_"
6,"parasparam","_","_","paraspara","PRC","","_","_"
7,"amarṣaṇau","_","_","amarṣaṇa","JJ","","_","_"
1,"pratijagmatur","_","_","pratiga","V","pratiga","_","_"
2,"anyonyaṃ","_","_","anyonya","PRC","","_","_"
3,"_","_","_","krudh","PPP","","_","_"
4,"_","_","_","iva","CCM","","_","_"
5,"_","_","_","gaja","NC","","_","_"
6,"_","_","_","uttama","JJ","","_","_"
1,"parvataḥ","_","_","parvata","NC","","_","_"
2,"pṛthivīṃ","_","_","pṛthivī","NC","","_","_"
3,"kṛtsnāṃ","_","_","kṛtsna","JJ","","_","_"
4,"vicacāra","_","_","vicar","V","vicar","_","_"
5,"_","_","_","mahat","JJ","","_","_"
6,"_","_","_","muni","NC","","_","_"
1,"pūjyamāno","_","_","pūjay","KDP","","_","_"
2,"yathānyāyaṃ","_","_","yathānyāya","CX","","_","_"
3,"tejasā","_","_","tejas","NC","","_","_"
4,"svena","_","_","sva","JJ","","_","_"
5,"bhārata","_","_","bhārata","NC","","_","_"
1,"atha","_","_","atha","CAD","","_","_"
2,"tām","_","_","tad","PRD","","_","_"
3,"alabhat","_","_","labh","V","labh","_","_"
4,"kanyāṃ","_","_","kanyā","NC","","_","_"
5,"nāradaḥ","_","_","nārada","NC","","_","_"
6,"_","_","_","sṛñjaya","NC","","_","_"
7,"_","_","_","ātmajā","NC","","_","_"
1,"dharmeṇa","_","_","dharma","NC","","_","_"
2,"_","_","_","dharma","NC","","_","_"
3,"_","_","_","pravara","JJ","","_","_"
4,"sukumārīm","_","_","sukumāra","JJ","","_","_"
5,"aninditām","_","_","anindita","JJ","","_","_"
1,"sā","_","_","tad","PRD","","_","_"
2,"tu","_","_","tu","CCD","","_","_"
3,"kanyā","_","_","kanyā","NC","","_","_"
4,"_","_","_","yathā","CCM","","_","_"
5,"_","_","_","śāpa","NC","","_","_"
6,"nāradaṃ","_","_","nārada","NC","","_","_"
7,"taṃ","_","_","tad","PRD","","_","_"
8,"dadarśa","_","_","darś","V","dṛś","_","_"
9,"ha","_","_","ha","CEM","","_","_"
1,"_","_","_","pāṇigrahaṇa","NC","","_","_"
2,"_","_","_","mantra","NC","","_","_"
3,"prayogād","_","_","prayoga","NC","","_","_"
4,"eva","_","_","eva","CEM","","_","_"
5,"vānaram","_","_","vānara","NC","","_","_"
1,"sukumārī","_","_","sukumāra","JJ","","_","_"
2,"ca","_","_","ca","CCD","","_","_"
3,"_","_","_","deva","NC","","_","_"
4,"_","_","_","ṛṣi","NC","","_","_"
5,"_","_","_","vānara","NC","","_","_"
6,"_","_","_","pratima","JJ","","_","_"
7,"_","_","_","ānana","NC","","_","_"
1,"_","_","_","na","CNG","","_","_"
2,"_","_","_","eva","CEM","","_","_"
3,"_","_","_","avaman","V","avaman","_","_"
4,"tadā","_","_","tadā","CAD","","_","_"
5,"_","_","_","prītimat","JJ","","_","_"
6,"_","_","_","eva","CEM","","_","_"
7,"_","_","_","ca","CCD","","_","_"
8,"_","_","_","bhav","V","bhū","_","_"
1,"upatasthe","_","_","upatiṣṭh","V","upasthā","_","_"
2,"ca","_","_","ca","CCD","","_","_"
3,"bhartāraṃ","_","_","bhartṛ","NC","","_","_"
4,"na","_","_","na","CNG","","_","_"
5,"_","_","_","ca","CCD","","_","_"
6,"_","_","_","anya","PPX","","_","_"
7,"_","_","_","manas","NC","","_","_"
8,"_","_","_","api","CX","","_","_"
9,"_","_","_","gā","V","gā","_","_"
1,"devaṃ","_","_","deva","NC","","_","_"
2,"muniṃ","_","_","muni","NC","","_","_"
3,"vā","_","_","vā","CCD","","_","_"
4,"yakṣaṃ","_","_","yakṣa","NC","","_","_"
5,"vā","_","_","vā","CCD","","_","_"
6,"_","_","_","pati","NC","","_","_"
8,"_","_","_","pati","NC","","_","_"
9,"_","_","_","vatsala","JJ","","_","_"
1,"tataḥ","_","_","tatas","CX","","_","_"
2,"kadācid","_","_","kadācid","CX","","_","_"
3,"bhagavān","_","_","bhagavat","JJ","","_","_"
4,"parvato","_","_","parvata","NC","","_","_"
5,"'nusasāra","_","_","anusṛ","V","anusṛ","_","_"
6,"ha","_","_","ha","CEM","","_","_"
1,"vanaṃ","_","_","vana","NC","","_","_"
2,"virahitaṃ","_","_","virahita","JJ","","_","_"
3,"kiṃcit","_","_","kiṃcit","PRI","","_","_"
4,"_","_","_","tatra","CAD","","_","_"
5,"_","_","_","paś","V","paś","_","_"
6,"sa","_","_","tad","PRD","","_","_"
7,"nāradam","_","_","nārada","NC","","_","_"
1,"tato","_","_","tatas","CX","","_","_"
2,"'bhivādya","_","_","abhivāday","CGDA","","_","_"
3,"provāca","_","_","pravak","V","pravac","_","_"
4,"nāradaṃ","_","_","nārada","NC","","_","_"
5,"_","_","_","parvata","NC","","_","_"
6,"_","_","_","tadā","CAD","","_","_"
1,"bhavān","_","_","bhavat","JJ","","_","_"
2,"prasādaṃ","_","_","prasāda","NC","","_","_"
3,"kurutāṃ","_","_","kar","V","kṛ","_","_"
4,"_","_","_","svarga","NC","","_","_"
5,"_","_","_","ādeśa","NC","","_","_"
6,"me","_","_","mat","PPR","","_","_"
7,"prabho","_","_","prabhu","JJ","","_","_"
1,"tam","_","_","tad","PRD","","_","_"
2,"uvāca","_","_","vak","V","vac","_","_"
3,"tato","_","_","tatas","CX","","_","_"
4,"dṛṣṭvā","_","_","dṛś","CGDA","","_","_"
5,"parvataṃ","_","_","parvata","NC","","_","_"
6,"_","_","_","nārada","NC","","_","_"
7,"_","_","_","tadā","CAD","","_","_"
1,"kṛtāñjalim","_","_","kṛtāñjali","JJ","","_","_"
2,"upāsīnaṃ","_","_","upās","PPP","","_","_"
3,"dīnaṃ","_","_","dīna","JJ","","_","_"
4,"dīnataraḥ","_","_","dīnatara","JJ","","_","_"
5,"svayam","_","_","svaya","CX","","_","_"
1,"_","_","_","tvat","PPR","","_","_"
2,"_","_","_","mat","PPR","","_","_"
3,"prathamaṃ","_","_","prathama","CX","","_","_"
4,"śapto","_","_","śap","PPP","","_","_"
5,"_","_","_","vānara","NC","","_","_"
6,"_","_","_","tvat","PPR","","_","_"
7,"bhaviṣyasi","_","_","bhav","V","bhū","_","_"
1,"_","_","_","iti","CQT","","_","_"
2,"_","_","_","vac","PPP","","_","_"
3,"mayā","_","_","mat","PPR","","_","_"
4,"_","_","_","paścāt","CAD","","_","_"
5,"_","_","_","śap","PPP","","_","_"
6,"_","_","_","tvat","PPR","","_","_"
7,"api","_","_","api","CX","","_","_"
8,"matsarāt","_","_","matsara","NC","","_","_"
1,"_","_","_","adya","CX","","_","_"
2,"_","_","_","prabhṛti","CX","","_","_"
3,"vai","_","_","vai","CX","","_","_"
4,"vāsaṃ","_","_","vāsa","NC","","_","_"
5,"svarge","_","_","svarga","NC","","_","_"
6,"_","_","_","na","CNG","","_","_"
7,"_","_","_","avāp","V","avāp","_","_"
8,"_","_","_","iti","CQT","","_","_"
9,"ha","_","_","ha","CEM","","_","_"
1,"tava","_","_","tvat","PPR","","_","_"
2,"_","_","_","na","CNG","","_","_"
3,"_","_","_","tad","PRD","","_","_"
4,"_","_","_","hi","CX","","_","_"
5,"sadṛśaṃ","_","_","sadṛśa","JJ","","_","_"
6,"_","_","_","putra","NC","","_","_"
7,"_","_","_","sthāna","NC","","_","_"
8,"hi","_","_","hi","CX","","_","_"
9,"me","_","_","mat","PPR","","_","_"
10,"bhavān","_","_","bhavat","JJ","","_","_"
1,"nivartayetāṃ","_","_","nivartay","V","nivartay","_","_"
2,"tau","_","_","tad","PRD","","_","_"
3,"śāpam","_","_","śāpa","NC","","_","_"
4,"anyonyena","_","_","anyonya","PRC","","_","_"
5,"tadā","_","_","tadā","CAD","","_","_"
6,"munī","_","_","muni","NC","","_","_"
1,"_","_","_","śrī","NC","","_","_"
2,"_","_","_","samṛdh","PPP","","_","_"
3,"tadā","_","_","tadā","CAD","","_","_"
4,"dṛṣṭvā","_","_","dṛś","CGDA","","_","_"
5,"nāradaṃ","_","_","nārada","NC","","_","_"
6,"_","_","_","deva","NC","","_","_"
7,"_","_","_","rūpin","JJ","","_","_"
1,"sukumārī","_","_","sukumāra","JJ","","_","_"
2,"pradudrāva","_","_","pradru","V","pradru","_","_"
3,"_","_","_","para","PPX","","_","_"
4,"_","_","_","pati","NC","","_","_"
5,"_","_","_","abhiśaṅkā","NC","","_","_"
1,"tāṃ","_","_","tad","PRD","","_","_"
2,"_","_","_","parvata","NC","","_","_"
3,"_","_","_","tatas","CX","","_","_"
4,"dṛṣṭvā","_","_","dṛś","CGDA","","_","_"
5,"pradravantīm","_","_","pradru","KDP","","_","_"
6,"aninditām","_","_","anindita","JJ","","_","_"
1,"abravīt","_","_","abravīta","V","brū","_","_"
2,"tava","_","_","tvat","PPR","","_","_"
3,"_","_","_","bhartṛ","NC","","_","_"
4,"_","_","_","tad","PRD","","_","_"
5,"_","_","_","na","CNG","","_","_"
6,"_","_","_","atra","CAD","","_","_"
7,"kāryā","_","_","kṛ","KDG","","_","_"
8,"vicāraṇā","_","_","vicāraṇā","NC","","_","_"
1,"ṛṣiḥ","_","_","ṛṣi","NC","","_","_"
2,"_","_","_","parama","JJ","","_","_"
3,"_","_","_","dharma","NC","","_","_"
4,"_","_","_","ātman","NC","","_","_"
5,"nārado","_","_","nārada","NC","","_","_"
6,"bhagavān","_","_","bhagavat","JJ","","_","_"
7,"prabhuḥ","_","_","prabhu","JJ","","_","_"
1,"_","_","_","tvat","PPR","","_","_"
2,"_","_","_","eva","CEM","","_","_"
3,"_","_","_","abhedya","JJ","","_","_"
4,"_","_","_","hṛdaya","NC","","_","_"
5,"mā","_","_","mā","CNG","","_","_"
6,"te","_","_","tvat","PPR","","_","_"
7,"bhūd","_","_","bhav","V","bhū","_","_"
8,"atra","_","_","atra","CAD","","_","_"
9,"saṃśayaḥ","_","_","saṃśaya","NC","","_","_"
1,"_","_","_","tad","PRD","","_","_"
2,"_","_","_","anunī","PPP","","_","_"
3,"bahuvidhaṃ","_","_","bahuvidha","JJ","","_","_"
4,"parvatena","_","_","parvata","NC","","_","_"
5,"mahātmanā","_","_","mahātman","JJ","","_","_"
1,"_","_","_","śāpa","NC","","_","_"
2,"_","_","_","doṣa","NC","","_","_"
3,"ca","_","_","ca","CCD","","_","_"
4,"taṃ","_","_","tad","PRD","","_","_"
5,"bhartuḥ","_","_","bhartṛ","NC","","_","_"
6,"śrutvā","_","_","śru","CGDA","","_","_"
7,"svāṃ","_","_","sva","JJ","","_","_"
8,"prakṛtiṃ","_","_","prakṛti","NC","","_","_"
9,"gatā","_","_","ga","PPP","","_","_"
1,"parvato","_","_","parvata","NC","","_","_"
2,"'tha","_","_","atha","CAD","","_","_"
3,"yayau","_","_","yā","V","yā","_","_"
4,"svargaṃ","_","_","svarga","NC","","_","_"
5,"nārado","_","_","nārada","NC","","_","_"
6,"'tha","_","_","atha","CAD","","_","_"
7,"yayau","_","_","yā","V","yā","_","_"
8,"gṛhān","_","_","gṛha","NC","","_","_"
1,"_","_","_","pratyakṣa","JJ","","_","_"
2,"_","_","_","karman","NC","","_","_"
3,"sarvasya","_","_","sarva","JQ","","_","_"
4,"nārado","_","_","nārada","NC","","_","_"
5,"'yaṃ","_","_","ida","PRD","","_","_"
6,"mahān","_","_","mahat","JJ","","_","_"
7,"ṛṣiḥ","_","_","ṛṣi","NC","","_","_"
1,"eṣa","_","_","tad","PRD","","_","_"
2,"vakṣyati","_","_","vak","V","vac","_","_"
3,"vai","_","_","vai","CX","","_","_"
4,"pṛṣṭo","_","_","pracch","PPP","","_","_"
5,"yathā","_","_","yathā","CCM","","_","_"
6,"vṛttaṃ","_","_","vṛt","PPP","","_","_"
7,"_","_","_","nara","NC","","_","_"
8,"_","_","_","uttama","JJ","","_","_"
