"WordID","word","NormSTEM","suffix","lemma","PoS","Root","NormSuffix","NormWord"
1,"_","_","_","satya","NC","","_","_"
2,"_","_","_","uttambh","PPP","","_","_"
3,"bhūmiḥ","_","_","bhūmi","NC","","_","_"
4,"_","_","_","sūrya","NC","","_","_"
5,"_","_","_","uttambh","PPP","","_","_"
6,"dyauḥ","_","_","div","NC","","_","_"
1,"_","_","_","ṛta","NC","","_","_"
2,"_","_","_","āditya","NC","","_","_"
3,"tiṣṭhanti","_","_","tiṣṭh","V","sthā","_","_"
4,"divi","_","_","div","NC","","_","_"
5,"somo","_","_","soma","NC","","_","_"
6,"adhiśritaḥ","_","_","adhiśri","PPP","","_","_"
1,"_","_","_","soma","NC","","_","_"
2,"_","_","_","āditya","NC","","_","_"
3,"balinaḥ","_","_","balin","JJ","","_","_"
4,"somena","_","_","soma","NC","","_","_"
5,"pṛthivī","_","_","pṛthivī","NC","","_","_"
6,"mahī","_","_","mah","JJ","","_","_"
1,"_","_","_","atha","CAD","","_","_"
2,"_","_","_","u","CEM","","_","_"
3,"nakṣatrāṇām","_","_","nakṣatra","NC","","_","_"
4,"eṣām","_","_","ida","PRD","","_","_"
5,"upasthe","_","_","upastha","NC","","_","_"
6,"soma","_","_","soma","NC","","_","_"
7,"āhitaḥ","_","_","ādhā","PPP","","_","_"
1,"somaṃ","_","_","soma","NC","","_","_"
2,"manyate","_","_","man","V","man","_","_"
3,"papivān","_","_","pā","KDP","","_","_"
4,"yat","_","_","yat","CSB","","_","_"
5,"sampiṃṣanty","_","_","sampiṣ","V","sampiṣ","_","_"
6,"oṣadhim","_","_","oṣadhi","NC","","_","_"
1,"somaṃ","_","_","soma","NC","","_","_"
2,"yaṃ","_","_","yad","PRL","","_","_"
3,"brahmāṇo","_","_","brahman","NC","","_","_"
4,"vidur","_","_","vid","V","vid","_","_"
5,"na","_","_","na","CNG","","_","_"
6,"_","_","_","tad","PRD","","_","_"
7,"_","_","_","aś","V","aś","_","_"
8,"pārthivaḥ","_","_","pārthiva","NC","","_","_"
1,"yat","_","_","yat","CSB","","_","_"
2,"tvā","_","_","tvat","PPR","","_","_"
3,"soma","_","_","soma","NC","","_","_"
4,"prapibanti","_","_","prapib","V","prapā","_","_"
5,"tata","_","_","tatas","CX","","_","_"
6,"āpyāyase","_","_","āpyā","V","āpyā","_","_"
7,"punaḥ","_","_","punar","CAD","","_","_"
1,"vāyuḥ","_","_","vāyu","NC","","_","_"
2,"somasya","_","_","soma","NC","","_","_"
3,"rakṣitā","_","_","rakṣitṛ","JJ","","_","_"
4,"samānāṃ","_","_","samā","NC","","_","_"
5,"māsa","_","_","māsa","NC","","_","_"
6,"ākṛtiḥ","_","_","ākṛti","NC","","_","_"
1,"_","_","_","ācchad","NC","","_","_"
2,"_","_","_","vidhāna","NC","","_","_"
3,"gupito","_","_","gup","PPP","","_","_"
4,"bārhataiḥ","_","_","bārhata","NC","","_","_"
5,"soma","_","_","soma","NC","","_","_"
6,"rakṣitaḥ","_","_","rakṣ","PPP","","_","_"
1,"grāvṇām","_","_","grāvan","NC","","_","_"
2,"_","_","_","id","CEM","","_","_"
3,"_","_","_","śru","KDP","","_","_"
4,"tiṣṭhasi","_","_","tiṣṭh","V","sthā","_","_"
5,"na","_","_","na","CNG","","_","_"
6,"te","_","_","tvat","PPR","","_","_"
7,"aśnāti","_","_","aśn","V","aś","_","_"
8,"pārthivaḥ","_","_","pārthiva","NC","","_","_"
1,"cittir","_","_","citti","NC","","_","_"
2,"ā","_","_","as","V","as","_","_"
3,"upabarhaṇaṃ","_","_","upabarhaṇa","NC","","_","_"
4,"cakṣur","_","_","cakṣus","NC","","_","_"
5,"ā","_","_","as","V","as","_","_"
6,"abhyañjanam","_","_","abhyañjana","NC","","_","_"
1,"dyaur","_","_","div","NC","","_","_"
2,"bhūmiḥ","_","_","bhūmi","NC","","_","_"
3,"kośa","_","_","kośa","NC","","_","_"
4,"āsīd","_","_","as","V","as","_","_"
5,"yad","_","_","yat","CSB","","_","_"
6,"ayāt","_","_","yā","V","yā","_","_"
7,"sūryā","_","_","sūryā","NC","","_","_"
8,"patim","_","_","pati","NC","","_","_"
1,"raibhy","_","_","raibhī","NC","","_","_"
2,"āsīd","_","_","as","V","as","_","_"
3,"anudeyī","_","_","anudeyī","NC","","_","_"
4,"nārāśaṃsī","_","_","nārāśaṃsī","NC","","_","_"
5,"nyocanī","_","_","nyocanī","NC","","_","_"
1,"sūryāyā","_","_","sūryā","NC","","_","_"
2,"bhadram","_","_","bhadra","JJ","","_","_"
3,"id","_","_","id","CEM","","_","_"
4,"vāso","_","_","vāsas","NC","","_","_"
5,"_","_","_","gāthā","NC","","_","_"
6,"_","_","_","e","V","i","_","_"
7,"pariṣkṛtā","_","_","pariṣkṛ","PPP","","_","_"
1,"stomā","_","_","stoma","NC","","_","_"
2,"āsan","_","_","as","V","as","_","_"
3,"pratidhayaḥ","_","_","pratidhi","NC","","_","_"
4,"kurīraṃ","_","_","kurīra","NC","","_","_"
5,"chanda","_","_","chandas","NC","","_","_"
6,"opaśaḥ","_","_","opaśa","NC","","_","_"
1,"sūryāyā","_","_","sūryā","NC","","_","_"
2,"aśvinā","_","_","aśvin","NC","","_","_"
3,"_","_","_","vara","NC","","_","_"
4,"_","_","_","agni","NC","","_","_"
5,"āsīt","_","_","as","V","as","_","_"
6,"purogavaḥ","_","_","purogava","NC","","_","_"
1,"somo","_","_","soma","NC","","_","_"
2,"vadhūyur","_","_","vadhūyu","JJ","","_","_"
3,"abhavad","_","_","bhav","V","bhū","_","_"
4,"_","_","_","aśvin","NC","","_","_"
5,"_","_","_","as","V","as","_","_"
6,"ubhā","_","_","ubh","PPX","","_","_"
7,"varā","_","_","vara","NC","","_","_"
1,"sūryāṃ","_","_","sūryā","NC","","_","_"
2,"yat","_","_","yat","CSB","","_","_"
3,"patye","_","_","pati","NC","","_","_"
4,"śaṃsantīṃ","_","_","śaṃs","KDP","","_","_"
5,"manasā","_","_","manas","NC","","_","_"
6,"_","_","_","savitṛ","NC","","_","_"
7,"_","_","_","dad","V","dā","_","_"
1,"mano","_","_","manas","NC","","_","_"
2,"asyā","_","_","ida","PRD","","_","_"
3,"ana","_","_","anas","NC","","_","_"
4,"āsīd","_","_","as","V","as","_","_"
5,"dyaur","_","_","div","NC","","_","_"
6,"āsīd","_","_","as","V","as","_","_"
7,"uta","_","_","uta","CCD","","_","_"
8,"chadiḥ","_","_","chadis","NC","","_","_"
1,"śukrāv","_","_","śukra","JJ","","_","_"
2,"anaḍvāhāv","_","_","anaḍuh","NC","","_","_"
3,"āstāṃ","_","_","as","V","as","_","_"
4,"yad","_","_","yat","CSB","","_","_"
5,"ayāt","_","_","yā","V","yā","_","_"
6,"sūryā","_","_","sūryā","NC","","_","_"
7,"patim","_","_","pati","NC","","_","_"
1,"_","_","_","ṛc","NC","","_","_"
2,"_","_","_","sāman","NC","","_","_"
3,"abhihitau","_","_","abhidhā","PPP","","_","_"
4,"gāvau","_","_","go","NC","","_","_"
5,"te","_","_","tvat","PPR","","_","_"
6,"sāmanāv","_","_","sāmana","JJ","","_","_"
7,"aitām","_","_","e","V","i","_","_"
1,"śrotre","_","_","śrotra","NC","","_","_"
2,"te","_","_","tvat","PPR","","_","_"
3,"cakre","_","_","cakra","NC","","_","_"
4,"āstāṃ","_","_","as","V","as","_","_"
5,"divi","_","_","div","NC","","_","_"
6,"panthāś","_","_","pathin","NC","","_","_"
7,"_","_","_","cara","JJ","","_","_"
8,"_","_","_","acara","JJ","","_","_"
1,"śucī","_","_","śuci","JJ","","_","_"
2,"te","_","_","tvat","PPR","","_","_"
3,"cakre","_","_","cakra","NC","","_","_"
4,"yātyā","_","_","yā","KDP","","_","_"
5,"vyāno","_","_","vyāna","NC","","_","_"
6,"akṣa","_","_","akṣa","NC","","_","_"
7,"āhataḥ","_","_","āhan","PPP","","_","_"
1,"ano","_","_","anas","NC","","_","_"
2,"manasmayaṃ","_","_","manasmaya","JJ","","_","_"
3,"_","_","_","sūryā","NC","","_","_"
4,"_","_","_","āroh","V","āruh","_","_"
5,"prayatī","_","_","pre","KDP","","_","_"
6,"patim","_","_","pati","NC","","_","_"
1,"sūryāyā","_","_","sūryā","NC","","_","_"
2,"vahatuḥ","_","_","vahatu","NC","","_","_"
3,"prāgāt","_","_","pragā","V","pragā","_","_"
4,"savitā","_","_","savitṛ","NC","","_","_"
5,"yam","_","_","yad","PRL","","_","_"
6,"avāsṛjat","_","_","avasṛj","V","avasṛj","_","_"
1,"maghāsu","_","_","maghā","NC","","_","_"
2,"hanyante","_","_","han","V","han","_","_"
3,"gāvaḥ","_","_","go","NC","","_","_"
4,"phalgunīṣu","_","_","phalgunī","NC","","_","_"
5,"vyuhyate","_","_","vivah","V","vivah","_","_"
1,"yad","_","_","yat","CSB","","_","_"
2,"aśvinā","_","_","aśvin","NC","","_","_"
3,"pṛcchamānāv","_","_","pracch","KDP","","_","_"
4,"ayātaṃ","_","_","yā","V","yā","_","_"
5,"_","_","_","tri","NUM","","_","_"
6,"_","_","_","cakra","NC","","_","_"
7,"vahatuṃ","_","_","vahatu","NC","","_","_"
8,"sūryāyāḥ","_","_","sūryā","NC","","_","_"
1,"_","_","_","kva","CX","","_","_"
2,"_","_","_","eka","PPX","","_","_"
3,"cakraṃ","_","_","cakra","NC","","_","_"
4,"vām","_","_","tvat","PPR","","_","_"
5,"āsīt","_","_","as","V","as","_","_"
6,"kva","_","_","kva","CX","","_","_"
7,"deṣṭrāya","_","_","deṣṭra","NC","","_","_"
8,"tasthathuḥ","_","_","tiṣṭh","V","sthā","_","_"
1,"yad","_","_","yat","CSB","","_","_"
2,"ayātaṃ","_","_","yā","V","yā","_","_"
3,"śubhas","_","_","śubh","NC","","_","_"
4,"patī","_","_","pati","NC","","_","_"
5,"vareyaṃ","_","_","varey","CGDI","","_","_"
6,"sūryām","_","_","sūryā","NC","","_","_"
7,"upa","_","_","upa","CADP","","_","_"
1,"viśve","_","_","viśva","JQ","","_","_"
2,"devā","_","_","deva","NC","","_","_"
3,"anu","_","_","anu","CADP","","_","_"
4,"tad","_","_","tad","PRD","","_","_"
5,"vām","_","_","tvat","PPR","","_","_"
6,"ajānan","_","_","jān","V","jñā","_","_"
7,"putraḥ","_","_","putra","NC","","_","_"
8,"pitaram","_","_","pitṛ","NC","","_","_"
9,"avṛṇīta","_","_","vṛ","V","vṛ","_","_"
10,"pūṣā","_","_","pūṣan","NC","","_","_"
1,"dve","_","_","dvi","NUM","","_","_"
2,"te","_","_","tvat","PPR","","_","_"
3,"cakre","_","_","cakra","NC","","_","_"
4,"sūrye","_","_","sūryā","NC","","_","_"
5,"brahmāṇa","_","_","brahman","NC","","_","_"
6,"ṛtuthā","_","_","ṛtuthā","CX","","_","_"
7,"viduḥ","_","_","vid","V","vid","_","_"
1,"_","_","_","atha","CAD","","_","_"
2,"_","_","_","eka","PPX","","_","_"
3,"cakraṃ","_","_","cakra","NC","","_","_"
4,"yad","_","_","yad","PRL","","_","_"
5,"guhā","_","_","guhā","CX","","_","_"
6,"tad","_","_","tad","PRD","","_","_"
7,"addhātaya","_","_","addhāti","NC","","_","_"
8,"id","_","_","id","CEM","","_","_"
9,"viduḥ","_","_","vid","V","vid","_","_"
1,"aryamaṇaṃ","_","_","aryaman","NC","","_","_"
2,"yajāmahe","_","_","yaj","V","yaj","_","_"
3,"_","_","_","su","CAD","","_","_"
4,"_","_","_","bandhu","NC","","_","_"
5,"_","_","_","pati","NC","","_","_"
6,"_","_","_","vedana","JJ","","_","_"
1,"urvārukam","_","_","urvāruka","NC","","_","_"
2,"iva","_","_","iva","CCM","","_","_"
3,"bandhanāt","_","_","bandhana","NC","","_","_"
4,"preto","_","_","pre","PPP","","_","_"
5,"muñcāmi","_","_","muñc","V","muc","_","_"
6,"_","_","_","na","CNG","","_","_"
7,"_","_","_","amutas","CX","","_","_"
1,"preto","_","_","pre","PPP","","_","_"
2,"muñcāmi","_","_","muñc","V","muc","_","_"
3,"_","_","_","na","CNG","","_","_"
4,"_","_","_","amutas","CX","","_","_"
5,"_","_","_","su","CAD","","_","_"
6,"_","_","_","bandh","PPP","","_","_"
7,"amutas","_","_","amutas","CX","","_","_"
8,"karam","_","_","kar","V","kṛ","_","_"
1,"_","_","_","yathā","CCM","","_","_"
2,"_","_","_","ida","PRD","","_","_"
3,"indra","_","_","indra","NC","","_","_"
4,"mīḍhvaḥ","_","_","mīḍhvas","JJ","","_","_"
5,"_","_","_","su","CAD","","_","_"
6,"_","_","_","putra","NC","","_","_"
7,"_","_","_","subhaga","JJ","","_","_"
8,"_","_","_","as","V","as","_","_"
1,"pra","_","_","pra","CADP","","_","_"
2,"tvā","_","_","tvat","PPR","","_","_"
3,"muñcāmi","_","_","muñc","V","muc","_","_"
4,"varuṇasya","_","_","varuṇa","NC","","_","_"
5,"pāśād","_","_","pāśa","NC","","_","_"
6,"yena","_","_","yad","PRL","","_","_"
7,"_","_","_","tvat","PPR","","_","_"
8,"_","_","_","bandh","V","bandh","_","_"
9,"savitā","_","_","savitṛ","NC","","_","_"
10,"suśevāḥ","_","_","suśevas","JJ","","_","_"
1,"ṛtasya","_","_","ṛta","NC","","_","_"
2,"yonau","_","_","yoni","NC","","_","_"
3,"sukṛtasya","_","_","sukṛta","NC","","_","_"
4,"loke","_","_","loka","NC","","_","_"
5,"syonaṃ","_","_","syona","JJ","","_","_"
6,"te","_","_","tvat","PPR","","_","_"
7,"astu","_","_","as","V","as","_","_"
8,"_","_","_","saha","CX","","_","_"
9,"_","_","_","sambhala","NC","","_","_"
1,"bhagas","_","_","bhaga","NC","","_","_"
2,"_","_","_","tvat","PPR","","_","_"
3,"_","_","_","itas","CX","","_","_"
4,"nayatu","_","_","nay","V","nī","_","_"
5,"_","_","_","hasta","NC","","_","_"
6,"_","_","_","grah","CGDA","","_","_"
7,"_","_","_","aśvin","NC","","_","_"
8,"tvā","_","_","tvat","PPR","","_","_"
9,"pravahatāṃ","_","_","pravah","V","pravah","_","_"
10,"rathena","_","_","ratha","NC","","_","_"
1,"gṛhān","_","_","gṛha","NC","","_","_"
2,"gaccha","_","_","ga","V","ga","_","_"
3,"_","_","_","gṛha","NC","","_","_"
4,"_","_","_","patnī","NC","","_","_"
5,"_","_","_","yathā","CCM","","_","_"
6,"_","_","_","as","V","as","_","_"
7,"vaśinī","_","_","vaśin","JJ","","_","_"
8,"tvaṃ","_","_","tvat","PPR","","_","_"
9,"vidatham","_","_","vidatha","NC","","_","_"
10,"āvadāsi","_","_","āvad","V","āvad","_","_"
1,"iha","_","_","iha","CAD","","_","_"
2,"priyaṃ","_","_","priya","JJ","","_","_"
3,"prajāyai","_","_","prajā","NC","","_","_"
4,"te","_","_","tvat","PPR","","_","_"
5,"samṛdhyatām","_","_","samṛdh","V","samṛdh","_","_"
6,"asmin","_","_","ida","PRD","","_","_"
7,"gṛhe","_","_","gṛha","NC","","_","_"
8,"gārhapatyāya","_","_","gārhapatya","NC","","_","_"
9,"jāgṛhi","_","_","jāgṛ","V","jāgṛ","_","_"
1,"enā","_","_","ida","PRD","","_","_"
2,"patyā","_","_","pati","NC","","_","_"
3,"tanvaṃ","_","_","tanū","NC","","_","_"
4,"_","_","_","saṃspṛś","V","saṃspṛś","_","_"
5,"_","_","_","atha","CAD","","_","_"
6,"jivrir","_","_","jivri","JJ","","_","_"
7,"vidatham","_","_","vidatha","NC","","_","_"
8,"āvadāsi","_","_","āvad","V","āvad","_","_"
1,"_","_","_","iha","CAD","","_","_"
2,"_","_","_","eva","CEM","","_","_"
3,"staṃ","_","_","as","V","as","_","_"
4,"mā","_","_","mā","CNG","","_","_"
5,"viyauṣṭaṃ","_","_","viyu","V","viyu","_","_"
6,"viśvam","_","_","viśva","JQ","","_","_"
7,"āyur","_","_","āyus","NC","","_","_"
8,"vyaśnutam","_","_","vyaś","V","vyaś","_","_"
1,"krīḍantau","_","_","krīḍ","KDP","","_","_"
2,"putrair","_","_","putra","NC","","_","_"
3,"naptṛbhir","_","_","naptṛ","NC","","_","_"
4,"modamānau","_","_","mud","KDP","","_","_"
5,"svastakau","_","_","svastaka","JJ","","_","_"
1,"_","_","_","pūrva","PPX","","_","_"
2,"_","_","_","apara","PPX","","_","_"
3,"carato","_","_","car","V","car","_","_"
4,"_","_","_","māyā","NC","","_","_"
5,"_","_","_","tad","PRD","","_","_"
6,"śiśū","_","_","śiśu","NC","","_","_"
7,"krīḍantau","_","_","krīḍ","KDP","","_","_"
8,"pariyāto","_","_","pariyā","V","pariyā","_","_"
9,"'rṇavam","_","_","arṇava","NC","","_","_"
1,"_","_","_","viśva","JQ","","_","_"
2,"_","_","_","anya","PPX","","_","_"
3,"bhuvanā","_","_","bhuvana","NC","","_","_"
4,"vicaṣṭa","_","_","vicakṣ","V","vicakṣ","_","_"
5,"ṛtūṃr","_","_","ṛtu","NC","","_","_"
6,"anyo","_","_","anya","PPX","","_","_"
7,"vidadhaj","_","_","vidhā","KDP","","_","_"
8,"jāyase","_","_","jan","V","jan","_","_"
9,"navaḥ","_","_","nava","JJ","","_","_"
1,"navo","_","_","nava","JJ","","_","_"
2,"navo","_","_","nava","JJ","","_","_"
3,"bhavasi","_","_","bhav","V","bhū","_","_"
4,"jāyamāno","_","_","jan","KDP","","_","_"
5,"'hnāṃ","_","_","ahar","NC","","_","_"
6,"ketur","_","_","ketu","NC","","_","_"
7,"uṣasām","_","_","uṣas","NC","","_","_"
8,"eṣy","_","_","e","V","i","_","_"
9,"agram","_","_","agra","NC","","_","_"
1,"bhāgaṃ","_","_","bhāga","NC","","_","_"
2,"devebhyo","_","_","deva","NC","","_","_"
3,"vidadhāsy","_","_","vidadh","V","vidhā","_","_"
4,"āyan","_","_","e","KDP","","_","_"
5,"pra","_","_","pra","CADP","","_","_"
6,"candramas","_","_","candramas","NC","","_","_"
7,"tirase","_","_","tar","V","tṛ","_","_"
8,"dīrgham","_","_","dīrgha","JJ","","_","_"
9,"āyuḥ","_","_","āyus","NC","","_","_"
1,"parā","_","_","parā","CADP","","_","_"
2,"dehi","_","_","dad","V","dā","_","_"
3,"śāmulyaṃ","_","_","śāmulya","NC","","_","_"
4,"brahmabhyo","_","_","brahman","NC","","_","_"
5,"vibhajā","_","_","vibhaj","V","vibhaj","_","_"
6,"vasu","_","_","vasu","NC","","_","_"
1,"_","_","_","kṛtyā","NC","","_","_"
2,"_","_","_","tad","PRD","","_","_"
3,"padvatī","_","_","padvat","JJ","","_","_"
4,"bhūtvā","_","_","bhū","CGDA","","_","_"
5,"jāyā","_","_","jāyā","NC","","_","_"
6,"viśate","_","_","viś","V","viś","_","_"
7,"patim","_","_","pati","NC","","_","_"
1,"_","_","_","nīla","JJ","","_","_"
2,"_","_","_","lohita","JJ","","_","_"
3,"bhavati","_","_","bhav","V","bhū","_","_"
4,"_","_","_","kṛtyā","NC","","_","_"
5,"_","_","_","āsakti","NC","","_","_"
6,"vyajyate","_","_","vyañj","V","vyañj","_","_"
1,"edhante","_","_","edh","V","edh","_","_"
2,"asyā","_","_","ida","PRD","","_","_"
3,"jñātayaḥ","_","_","jñāti","NC","","_","_"
4,"patir","_","_","pati","NC","","_","_"
5,"bandheṣu","_","_","bandha","NC","","_","_"
6,"badhyate","_","_","bandh","V","bandh","_","_"
1,"aślīlā","_","_","aślīla","JJ","","_","_"
2,"tanūr","_","_","tanū","NC","","_","_"
3,"bhavati","_","_","bhav","V","bhū","_","_"
4,"ruśatī","_","_","ruśat","JJ","","_","_"
5,"_","_","_","pāpa","JJ","","_","_"
6,"_","_","_","adas","PRD","","_","_"
1,"patir","_","_","pati","NC","","_","_"
2,"yad","_","_","yat","CSB","","_","_"
3,"vadhvo","_","_","vadhū","NC","","_","_"
4,"vāsasaḥ","_","_","vāsas","NC","","_","_"
5,"svam","_","_","sva","JJ","","_","_"
6,"aṅgam","_","_","aṅga","NC","","_","_"
7,"abhyūrṇute","_","_","abhivṛ","V","abhivṛ","_","_"
1,"āśasanaṃ","_","_","āśasana","NC","","_","_"
2,"viśasanam","_","_","viśasana","NC","","_","_"
3,"_","_","_","atha","CAD","","_","_"
4,"_","_","_","u","CEM","","_","_"
5,"adhivikartanam","_","_","adhivikartana","NC","","_","_"
1,"sūryāyāḥ","_","_","sūryā","NC","","_","_"
2,"paśya","_","_","paś","V","paś","_","_"
3,"rūpāṇi","_","_","rūpa","NC","","_","_"
4,"tāni","_","_","tad","PRD","","_","_"
5,"_","_","_","brahman","NC","","_","_"
6,"_","_","_","uta","CCD","","_","_"
7,"śumbhati","_","_","śubh","V","śubh","_","_"
1,"tṛṣṭam","_","_","tṛṣ","PPP","","_","_"
2,"etat","_","_","tad","PRD","","_","_"
3,"kaṭukam","_","_","kaṭuka","JJ","","_","_"
4,"apāṣṭhavad","_","_","apāṣṭhavat","JJ","","_","_"
5,"viṣavan","_","_","viṣavat","JJ","","_","_"
6,"_","_","_","na","CNG","","_","_"
7,"_","_","_","tad","PRD","","_","_"
8,"attave","_","_","ad","CGDI","","_","_"
1,"sūryāṃ","_","_","sūryā","NC","","_","_"
2,"yo","_","_","yad","PRL","","_","_"
3,"brahmā","_","_","brahman","NC","","_","_"
4,"veda","_","_","vid","V","vid","_","_"
5,"sa","_","_","tad","PRD","","_","_"
6,"id","_","_","id","CEM","","_","_"
7,"vādhūyam","_","_","vādhūya","NC","","_","_"
8,"arhati","_","_","arh","V","arh","_","_"
1,"sa","_","_","tad","PRD","","_","_"
2,"it","_","_","id","CEM","","_","_"
3,"tat","_","_","tad","PRD","","_","_"
4,"syonaṃ","_","_","syona","JJ","","_","_"
5,"harati","_","_","har","V","hṛ","_","_"
6,"brahmā","_","_","brahman","NC","","_","_"
7,"vāsaḥ","_","_","vāsas","NC","","_","_"
8,"_","_","_","su","CAD","","_","_"
9,"_","_","_","maṅgala","JJ","","_","_"
1,"prāyaścittiṃ","_","_","prāyaścitti","NC","","_","_"
2,"yo","_","_","yad","PRL","","_","_"
3,"adhyeti","_","_","adhye","V","adhī","_","_"
4,"yena","_","_","yad","PRL","","_","_"
5,"jāyā","_","_","jāyā","NC","","_","_"
6,"na","_","_","na","CNG","","_","_"
7,"riṣyati","_","_","riṣ","V","riṣ","_","_"
1,"yuvaṃ","_","_","tvat","PPR","","_","_"
2,"bhagaṃ","_","_","bhaga","NC","","_","_"
3,"saṃbharataṃ","_","_","sambhṛ","V","sambhṛ","_","_"
4,"samṛddham","_","_","samṛdh","PPP","","_","_"
5,"ṛtaṃ","_","_","ṛta","NC","","_","_"
6,"vadantāv","_","_","vad","KDP","","_","_"
7,"ṛtodyeṣu","_","_","ṛtodya","NC","","_","_"
1,"brahmaṇaspate","_","_","brahmaṇaspati","NC","","_","_"
2,"patim","_","_","pati","NC","","_","_"
3,"asyai","_","_","ida","PRD","","_","_"
4,"rocaya","_","_","rocay","V","rocay","_","_"
5,"cāru","_","_","cāru","JJ","","_","_"
6,"saṃbhalo","_","_","sambhala","NC","","_","_"
7,"vadatu","_","_","vad","V","vad","_","_"
8,"vācam","_","_","vāc","NC","","_","_"
9,"etām","_","_","tad","PRD","","_","_"
1,"_","_","_","iha","CAD","","_","_"
2,"_","_","_","id","CEM","","_","_"
3,"asātha","_","_","as","V","as","_","_"
4,"na","_","_","na","CNG","","_","_"
5,"paro","_","_","paras","CX","","_","_"
6,"_","_","_","ga","V","ga","_","_"
7,"_","_","_","ida","PRD","","_","_"
8,"gāvaḥ","_","_","go","NC","","_","_"
9,"prajayā","_","_","prajā","NC","","_","_"
10,"_","_","_","vardhay","V","vardhay","_","_"
11,"_","_","_","atha","CAD","","_","_"
1,"śubhaṃ","_","_","śubh","CGDI","","_","_"
2,"yatīr","_","_","i","KDP","","_","_"
3,"usriyāḥ","_","_","usriya","JJ","","_","_"
4,"_","_","_","soma","NC","","_","_"
5,"_","_","_","varcas","NC","","_","_"
6,"viśve","_","_","viśva","JQ","","_","_"
7,"devāḥ","_","_","deva","NC","","_","_"
8,"krann","_","_","kar","V","kṛ","_","_"
9,"iha","_","_","iha","CAD","","_","_"
10,"vo","_","_","tvat","PPR","","_","_"
11,"manāṃsi","_","_","manas","NC","","_","_"
1,"imaṃ","_","_","ida","PRD","","_","_"
2,"gāvaḥ","_","_","go","NC","","_","_"
3,"prajayā","_","_","prajā","NC","","_","_"
4,"_","_","_","saṃviś","V","saṃviś","_","_"
5,"_","_","_","ida","PRD","","_","_"
6,"devānāṃ","_","_","deva","NC","","_","_"
7,"na","_","_","na","CNG","","_","_"
8,"mināti","_","_","mī","V","mī","_","_"
9,"bhāgam","_","_","bhāga","NC","","_","_"
1,"asmai","_","_","ida","PRD","","_","_"
2,"vaḥ","_","_","tvat","PPR","","_","_"
3,"pūṣā","_","_","pūṣan","NC","","_","_"
4,"marutaś","_","_","marut","NC","","_","_"
5,"ca","_","_","ca","CCD","","_","_"
6,"sarve","_","_","sarva","JQ","","_","_"
7,"asmai","_","_","ida","PRD","","_","_"
8,"vo","_","_","tvat","PPR","","_","_"
9,"dhātā","_","_","dhātṛ","NC","","_","_"
10,"savitā","_","_","savitṛ","NC","","_","_"
11,"suvāti","_","_","suv","V","sū","_","_"
1,"anṛkṣarā","_","_","anṛkṣara","JJ","","_","_"
2,"ṛjavaḥ","_","_","ṛju","JJ","","_","_"
3,"santu","_","_","as","V","as","_","_"
4,"panthāno","_","_","pathin","NC","","_","_"
5,"yebhiḥ","_","_","yad","PRL","","_","_"
6,"sakhāyo","_","_","sakhi","NC","","_","_"
7,"yanti","_","_","e","V","i","_","_"
8,"no","_","_","mat","PPR","","_","_"
9,"vareyam","_","_","varey","CGDI","","_","_"
1,"saṃ","_","_","sa","CADP","","_","_"
2,"bhagena","_","_","bhaga","NC","","_","_"
3,"sam","_","_","sa","CADP","","_","_"
4,"aryamṇā","_","_","aryaman","NC","","_","_"
5,"saṃ","_","_","sa","CADP","","_","_"
6,"dhātā","_","_","dhātṛ","NC","","_","_"
7,"sṛjatu","_","_","sṛj","V","sṛj","_","_"
8,"varcasā","_","_","varcas","NC","","_","_"
1,"yac","_","_","yad","PRL","","_","_"
2,"ca","_","_","ca","CCD","","_","_"
3,"varco","_","_","varcas","NC","","_","_"
4,"akṣeṣu","_","_","akṣa","NC","","_","_"
5,"surāyāṃ","_","_","surā","NC","","_","_"
6,"ca","_","_","ca","CCD","","_","_"
7,"yad","_","_","yad","PRL","","_","_"
8,"āhitam","_","_","ādhā","PPP","","_","_"
1,"yad","_","_","yad","PRL","","_","_"
2,"goṣv","_","_","go","NC","","_","_"
3,"aśvinā","_","_","aśvin","NC","","_","_"
4,"varcas","_","_","varcas","NC","","_","_"
5,"_","_","_","tad","PRD","","_","_"
6,"_","_","_","ida","PRD","","_","_"
7,"_","_","_","varcas","NC","","_","_"
8,"_","_","_","av","V","av","_","_"
1,"yena","_","_","yad","PRL","","_","_"
2,"mahānagnyā","_","_","mahānagnā","NC","","_","_"
3,"jaghanam","_","_","jaghana","NC","","_","_"
4,"aśvinā","_","_","aśvin","NC","","_","_"
5,"yena","_","_","yad","PRL","","_","_"
6,"vā","_","_","vā","CCD","","_","_"
7,"surā","_","_","surā","NC","","_","_"
1,"_","_","_","yad","PRL","","_","_"
2,"_","_","_","akṣa","NC","","_","_"
3,"abhyaṣicyanta","_","_","abhiṣic","V","abhiṣic","_","_"
4,"_","_","_","tad","PRD","","_","_"
5,"_","_","_","ida","PRD","","_","_"
6,"_","_","_","varcas","NC","","_","_"
7,"_","_","_","av","V","av","_","_"
1,"yo","_","_","yad","PRL","","_","_"
2,"anidhmo","_","_","anidhma","JJ","","_","_"
3,"dīdayad","_","_","dīdī","V","dīdī","_","_"
4,"apsv","_","_","ap","NC","","_","_"
5,"antar","_","_","antar","CAD","","_","_"
6,"yaṃ","_","_","yad","PRL","","_","_"
7,"viprāsa","_","_","vipra","NC","","_","_"
8,"īḍate","_","_","īḍ","V","īḍ","_","_"
9,"adhvareṣu","_","_","adhvara","NC","","_","_"
1,"apāṃ","_","_","ap","NC","","_","_"
2,"napān","_","_","napāt","NC","","_","_"
3,"madhumatīr","_","_","madhumat","JJ","","_","_"
4,"apo","_","_","ap","NC","","_","_"
5,"dā","_","_","dad","V","dā","_","_"
6,"yābhir","_","_","yad","PRL","","_","_"
7,"indro","_","_","indra","NC","","_","_"
8,"vāvṛdhe","_","_","vṛdh","V","vṛdh","_","_"
9,"vīryāvān","_","_","vīryāvat","JJ","","_","_"
1,"idam","_","_","ida","PRD","","_","_"
2,"ahaṃ","_","_","mat","PPR","","_","_"
3,"ruśantaṃ","_","_","ruśat","JJ","","_","_"
4,"grābhaṃ","_","_","grābha","NC","","_","_"
5,"_","_","_","tanū","NC","","_","_"
6,"_","_","_","dūṣi","JJ","","_","_"
7,"apohāmi","_","_","apoh","V","apoh","_","_"
1,"yo","_","_","yad","PRL","","_","_"
2,"bhadro","_","_","bhadra","JJ","","_","_"
3,"rocanas","_","_","rocana","JJ","","_","_"
4,"tam","_","_","tad","PRD","","_","_"
5,"udacāmi","_","_","udañc","V","udañc","_","_"
1,"_","_","_","ā","CADP","","_","_"
2,"_","_","_","ida","PRD","","_","_"
3,"brāhmaṇāḥ","_","_","brāhmaṇa","NC","","_","_"
4,"snapanīr","_","_","snapana","JJ","","_","_"
5,"harantv","_","_","har","V","hṛ","_","_"
6,"_","_","_","a","CNG","","_","_"
7,"_","_","_","vīra","NC","","_","_"
8,"_","_","_","ghna","JJ","","_","_"
9,"udajantv","_","_","udaj","V","udaj","_","_"
10,"āpaḥ","_","_","ap","NC","","_","_"
1,"aryamṇo","_","_","aryaman","NC","","_","_"
2,"agniṃ","_","_","agni","NC","","_","_"
3,"paryetu","_","_","parye","V","parī","_","_"
4,"pūṣan","_","_","pūṣan","NC","","_","_"
5,"pratīkṣante","_","_","pratīkṣ","V","pratīkṣ","_","_"
6,"śvaśuro","_","_","śvaśura","NC","","_","_"
7,"devaraś","_","_","devara","NC","","_","_"
8,"ca","_","_","ca","CCD","","_","_"
1,"śaṃ","_","_","śa","NC","","_","_"
2,"te","_","_","tvat","PPR","","_","_"
3,"hiraṇyaṃ","_","_","hiraṇya","NC","","_","_"
4,"śam","_","_","śa","NC","","_","_"
5,"u","_","_","u","CEM","","_","_"
6,"santv","_","_","as","V","as","_","_"
7,"āpaḥ","_","_","ap","NC","","_","_"
8,"śaṃ","_","_","śa","NC","","_","_"
9,"methir","_","_","methi","NC","","_","_"
10,"bhavatu","_","_","bhav","V","bhū","_","_"
11,"śaṃ","_","_","śa","NC","","_","_"
12,"yugasya","_","_","yuga","NC","","_","_"
13,"tardma","_","_","tardman","NC","","_","_"
1,"śaṃ","_","_","śa","NC","","_","_"
2,"ta","_","_","tvat","PPR","","_","_"
3,"āpaḥ","_","_","ap","NC","","_","_"
4,"_","_","_","śata","NUM","","_","_"
5,"_","_","_","pavitra","NC","","_","_"
6,"bhavantu","_","_","bhav","V","bhū","_","_"
7,"śam","_","_","śa","NC","","_","_"
8,"u","_","_","u","CEM","","_","_"
9,"patyā","_","_","pati","NC","","_","_"
10,"tanvaṃ","_","_","tanū","NC","","_","_"
11,"saṃspṛśasva","_","_","saṃspṛś","V","saṃspṛś","_","_"
1,"khe","_","_","kha","NC","","_","_"
2,"rathasya","_","_","ratha","NC","","_","_"
3,"khe","_","_","kha","NC","","_","_"
4,"'nasaḥ","_","_","anas","NC","","_","_"
5,"khe","_","_","kha","NC","","_","_"
6,"yugasya","_","_","yuga","NC","","_","_"
7,"śatakrato","_","_","śatakratu","NC","","_","_"
1,"apālām","_","_","apālā","NC","","_","_"
2,"indra","_","_","indra","NC","","_","_"
3,"triṣ","_","_","tris","CX","","_","_"
4,"_","_","_","pū","CGDA","","_","_"
5,"_","_","_","kar","V","kṛ","_","_"
6,"_","_","_","sūrya","NC","","_","_"
7,"_","_","_","tvac","NC","","_","_"
1,"āśāsānā","_","_","āśās","KDP","","_","_"
2,"saumanasaṃ","_","_","saumanasa","NC","","_","_"
3,"prajāṃ","_","_","prajā","NC","","_","_"
4,"saubhāgyaṃ","_","_","saubhāgya","NC","","_","_"
5,"rayim","_","_","rayi","NC","","_","_"
1,"patyur","_","_","pati","NC","","_","_"
2,"anuvratā","_","_","anuvrata","JJ","","_","_"
3,"bhūtvā","_","_","bhū","CGDA","","_","_"
4,"_","_","_","saṃnah","V","saṃnah","_","_"
5,"_","_","_","amṛta","NC","","_","_"
6,"kam","_","_","kaṃ","CX","","_","_"
1,"yathā","_","_","yathā","CCM","","_","_"
2,"sindhur","_","_","sindhu","NC","","_","_"
3,"nadīnāṃ","_","_","nadī","NC","","_","_"
4,"sāmrājyaṃ","_","_","sāmrājya","NC","","_","_"
5,"suṣuve","_","_","suv","V","sū","_","_"
6,"vṛṣā","_","_","vṛṣan","JJ","","_","_"
1,"evā","_","_","eva","CEM","","_","_"
2,"tvaṃ","_","_","tvat","PPR","","_","_"
3,"samrājñy","_","_","samrājñī","NC","","_","_"
4,"edhi","_","_","as","V","as","_","_"
5,"patyur","_","_","pati","NC","","_","_"
6,"astaṃ","_","_","asta","NC","","_","_"
7,"paretya","_","_","pare","CGDA","","_","_"
1,"samrājñy","_","_","samrājñī","NC","","_","_"
2,"edhi","_","_","as","V","as","_","_"
3,"śvaśureṣu","_","_","śvaśura","NC","","_","_"
4,"samrājñy","_","_","samrājñī","NC","","_","_"
5,"uta","_","_","uta","CCD","","_","_"
6,"devṛṣu","_","_","devṛ","NC","","_","_"
1,"nanānduḥ","_","_","nanāndṛ","NC","","_","_"
2,"samrājñy","_","_","samrājñī","NC","","_","_"
3,"edhi","_","_","as","V","as","_","_"
4,"samrājñy","_","_","samrājñī","NC","","_","_"
5,"uta","_","_","uta","CCD","","_","_"
6,"śvaśrvāḥ","_","_","śvaśrū","NC","","_","_"
1,"yā","_","_","yad","PRL","","_","_"
2,"akṛntann","_","_","kṛt","V","kṛt","_","_"
3,"avayan","_","_","ve","V","ve","_","_"
4,"yāś","_","_","yad","PRL","","_","_"
5,"ca","_","_","ca","CCD","","_","_"
6,"tatnire","_","_","tan","V","tan","_","_"
7,"yā","_","_","yad","PRL","","_","_"
8,"devīr","_","_","devī","NC","","_","_"
9,"antāṁ","_","_","anta","NC","","_","_"
10,"abhito","_","_","abhitas","CX","","_","_"
11,"'dadanta","_","_","dad","V","dā","_","_"
1,"tās","_","_","tad","PRD","","_","_"
2,"tvā","_","_","tvat","PPR","","_","_"
3,"jarase","_","_","jaras","NC","","_","_"
4,"saṃvyayantv","_","_","saṃvye","V","saṃvye","_","_"
5,"_","_","_","āyuṣmat","JJ","","_","_"
6,"_","_","_","ida","PRD","","_","_"
7,"paridhatsva","_","_","paridadh","V","paridhā","_","_"
8,"vāsaḥ","_","_","vāsas","NC","","_","_"
1,"jīvaṃ","_","_","jīva","JJ","","_","_"
2,"rudanti","_","_","rod","V","rud","_","_"
3,"vinayanty","_","_","vinay","V","vinī","_","_"
4,"adhvaraṃ","_","_","adhvara","NC","","_","_"
5,"dīrghām","_","_","dīrgha","JJ","","_","_"
6,"anu","_","_","anu","CADP","","_","_"
7,"prasitiṃ","_","_","prasiti","NC","","_","_"
8,"dīdhyur","_","_","dhī","V","dhī","_","_"
9,"naraḥ","_","_","nṛ","NC","","_","_"
1,"vāmaṃ","_","_","vāma","JJ","","_","_"
2,"pitṛbhyo","_","_","pitṛ","NC","","_","_"
3,"ya","_","_","yad","PRL","","_","_"
4,"idaṃ","_","_","ida","PRD","","_","_"
5,"samīrire","_","_","samīr","V","samīr","_","_"
6,"mayaḥ","_","_","mayas","NC","","_","_"
7,"patibhyo","_","_","pati","NC","","_","_"
8,"janaye","_","_","jani","NC","","_","_"
9,"pariṣvaje","_","_","pariṣvaj","CGDI","","_","_"
1,"syonaṃ","_","_","syona","JJ","","_","_"
2,"dhruvaṃ","_","_","dhruva","JJ","","_","_"
3,"prajāyai","_","_","prajā","NC","","_","_"
4,"dhārayāmi","_","_","dhar","V","dhṛ","_","_"
5,"te","_","_","tvat","PPR","","_","_"
6,"'śmānaṃ","_","_","aśman","NC","","_","_"
7,"devyāḥ","_","_","devī","NC","","_","_"
8,"pṛthivyā","_","_","pṛthivī","NC","","_","_"
9,"upasthe","_","_","upastha","NC","","_","_"
1,"tam","_","_","tad","PRD","","_","_"
2,"_","_","_","ātiṣṭh","V","āsthā","_","_"
3,"_","_","_","anumad","KDG","","_","_"
4,"_","_","_","su","CAD","","_","_"
5,"_","_","_","varcas","NC","","_","_"
6,"dīrghaṃ","_","_","dīrgha","JJ","","_","_"
7,"ta","_","_","tvat","PPR","","_","_"
8,"āyuḥ","_","_","āyus","NC","","_","_"
9,"savitā","_","_","savitṛ","NC","","_","_"
10,"kṛṇotu","_","_","kar","V","kṛ","_","_"
1,"_","_","_","yad","PRL","","_","_"
2,"_","_","_","agni","NC","","_","_"
3,"asyā","_","_","ida","PRD","","_","_"
4,"bhūmyā","_","_","bhūmi","NC","","_","_"
5,"hastaṃ","_","_","hasta","NC","","_","_"
6,"jagrāha","_","_","grah","V","grah","_","_"
7,"dakṣiṇam","_","_","dakṣiṇa","JJ","","_","_"
1,"tena","_","_","tad","PRD","","_","_"
2,"gṛhṇāmi","_","_","grah","V","grah","_","_"
3,"te","_","_","tvat","PPR","","_","_"
4,"hastaṃ","_","_","hasta","NC","","_","_"
5,"mā","_","_","mā","CNG","","_","_"
6,"vyathiṣṭhā","_","_","vyath","V","vyath","_","_"
7,"mayā","_","_","mat","PPR","","_","_"
8,"saha","_","_","saha","CX","","_","_"
9,"prajayā","_","_","prajā","NC","","_","_"
10,"ca","_","_","ca","CCD","","_","_"
11,"dhanena","_","_","dhana","NC","","_","_"
12,"ca","_","_","ca","CCD","","_","_"
1,"devas","_","_","deva","NC","","_","_"
2,"te","_","_","tvat","PPR","","_","_"
3,"savitā","_","_","savitṛ","NC","","_","_"
4,"hastaṃ","_","_","hasta","NC","","_","_"
5,"gṛhṇātu","_","_","grah","V","grah","_","_"
6,"somo","_","_","soma","NC","","_","_"
7,"rājā","_","_","rājan","NC","","_","_"
8,"suprajasaṃ","_","_","suprajas","JJ","","_","_"
9,"kṛṇotu","_","_","kar","V","kṛ","_","_"
1,"agniḥ","_","_","agni","NC","","_","_"
2,"subhagāṃ","_","_","subhaga","JJ","","_","_"
3,"jātavedāḥ","_","_","jātavedas","NC","","_","_"
4,"patye","_","_","pati","NC","","_","_"
5,"patnīṃ","_","_","patnī","NC","","_","_"
6,"jaradaṣṭim","_","_","jaradaṣṭi","JJ","","_","_"
7,"kṛṇotu","_","_","kar","V","kṛ","_","_"
1,"gṛhṇāmi","_","_","grah","V","grah","_","_"
2,"te","_","_","tvat","PPR","","_","_"
3,"_","_","_","saubhaga","NC","","_","_"
5,"hastaṃ","_","_","hasta","NC","","_","_"
6,"mayā","_","_","mat","PPR","","_","_"
7,"patyā","_","_","pati","NC","","_","_"
8,"jaradaṣṭir","_","_","jaradaṣṭi","JJ","","_","_"
9,"_","_","_","yathā","CCM","","_","_"
10,"_","_","_","as","V","as","_","_"
1,"bhago","_","_","bhaga","NC","","_","_"
2,"aryamā","_","_","aryaman","NC","","_","_"
3,"savitā","_","_","savitṛ","NC","","_","_"
4,"puraṃdhir","_","_","puraṃdhi","NC","","_","_"
5,"mahyaṃ","_","_","mat","PPR","","_","_"
6,"_","_","_","tvat","PPR","","_","_"
7,"_","_","_","dad","V","dā","_","_"
8,"gārhapatyāya","_","_","gārhapatya","NC","","_","_"
9,"devāḥ","_","_","deva","NC","","_","_"
1,"bhagas","_","_","bhaga","NC","","_","_"
2,"te","_","_","tvat","PPR","","_","_"
3,"hastam","_","_","hasta","NC","","_","_"
4,"agrahīt","_","_","grah","V","grah","_","_"
5,"savitā","_","_","savitṛ","NC","","_","_"
6,"hastam","_","_","hasta","NC","","_","_"
7,"agrahīt","_","_","grah","V","grah","_","_"
1,"patnī","_","_","patnī","NC","","_","_"
2,"tvam","_","_","tvat","PPR","","_","_"
3,"asi","_","_","as","V","as","_","_"
4,"_","_","_","dharman","NC","","_","_"
5,"_","_","_","mat","PPR","","_","_"
6,"gṛhapatis","_","_","gṛhapati","NC","","_","_"
7,"tava","_","_","tvat","PPR","","_","_"
1,"_","_","_","mat","PPR","","_","_"
2,"_","_","_","ida","PRD","","_","_"
3,"astu","_","_","as","V","as","_","_"
4,"poṣyā","_","_","puṣ","KDG","","_","_"
5,"mahyaṃ","_","_","mat","PPR","","_","_"
6,"_","_","_","tvat","PPR","","_","_"
7,"_","_","_","dad","V","dā","_","_"
8,"bṛhaspatiḥ","_","_","bṛhaspati","NC","","_","_"
1,"mayā","_","_","mat","PPR","","_","_"
2,"patyā","_","_","pati","NC","","_","_"
3,"prajāvati","_","_","prajāvat","JJ","","_","_"
4,"saṃjīva","_","_","saṃjīv","V","saṃjīv","_","_"
5,"śaradaḥ","_","_","śarad","NC","","_","_"
6,"śatam","_","_","śata","NUM","","_","_"
1,"tvaṣṭā","_","_","tvaṣṭṛ","NC","","_","_"
2,"vāso","_","_","vāsas","NC","","_","_"
3,"vyadadhāc","_","_","vidadh","V","vidhā","_","_"
4,"chubhe","_","_","śubh","CGDI","","_","_"
5,"kaṃ","_","_","kaṃ","CX","","_","_"
6,"bṛhaspateḥ","_","_","bṛhaspati","NC","","_","_"
7,"praśiṣā","_","_","praśis","NC","","_","_"
8,"kavīnām","_","_","kavi","NC","","_","_"
1,"_","_","_","tad","PRD","","_","_"
2,"_","_","_","ida","PRD","","_","_"
3,"nārīṃ","_","_","nārī","NC","","_","_"
4,"savitā","_","_","savitṛ","NC","","_","_"
5,"bhagaś","_","_","bhaga","NC","","_","_"
6,"ca","_","_","ca","CCD","","_","_"
7,"sūryām","_","_","sūryā","NC","","_","_"
8,"iva","_","_","iva","CCM","","_","_"
9,"paridhattāṃ","_","_","paridadh","V","paridhā","_","_"
10,"prajayā","_","_","prajā","NC","","_","_"
1,"_","_","_","indra","NC","","_","_"
2,"_","_","_","agni","NC","","_","_"
3,"dyāvāpṛthivī","_","_","dyāvāpṛthivī","NC","","_","_"
4,"mātariśvā","_","_","mātariśvan","NC","","_","_"
5,"mitrāvaruṇā","_","_","mitrāvaruṇa","NC","","_","_"
6,"bhago","_","_","bhaga","NC","","_","_"
7,"_","_","_","aśvin","NC","","_","_"
8,"_","_","_","ubh","PPX","","_","_"
1,"bṛhaspatir","_","_","bṛhaspati","NC","","_","_"
2,"maruto","_","_","marut","NC","","_","_"
3,"brahma","_","_","brahman","NC","","_","_"
4,"soma","_","_","soma","NC","","_","_"
5,"imāṃ","_","_","ida","PRD","","_","_"
6,"nāriṃ","_","_","nārī","NC","","_","_"
7,"prajayā","_","_","prajā","NC","","_","_"
8,"vardhayantu","_","_","vardhay","V","vardhay","_","_"
1,"bṛhaspatiḥ","_","_","bṛhaspati","NC","","_","_"
2,"prathamaḥ","_","_","prathama","JJ","","_","_"
3,"sūryāyāḥ","_","_","sūryā","NC","","_","_"
4,"śīrṣe","_","_","śīrṣa","NC","","_","_"
5,"keśāṁ","_","_","keśa","NC","","_","_"
6,"akalpayat","_","_","kalpay","V","kalpay","_","_"
1,"_","_","_","tad","PRD","","_","_"
2,"_","_","_","ida","PRD","","_","_"
3,"aśvinā","_","_","aśvin","NC","","_","_"
4,"nārīṃ","_","_","nārī","NC","","_","_"
5,"patye","_","_","pati","NC","","_","_"
6,"saṃśobhayāmasi","_","_","saṃśobhay","V","saṃśobhay","_","_"
1,"idaṃ","_","_","ida","PRD","","_","_"
2,"tad","_","_","tad","PRD","","_","_"
3,"rūpaṃ","_","_","rūpa","NC","","_","_"
4,"yad","_","_","yad","PRL","","_","_"
5,"avasta","_","_","vas","V","vas","_","_"
6,"yoṣā","_","_","yoṣā","NC","","_","_"
7,"jāyāṃ","_","_","jāyā","NC","","_","_"
8,"jijñāse","_","_","jijñās","V","jijñās","_","_"
9,"manasā","_","_","manas","NC","","_","_"
10,"carantīm","_","_","car","KDP","","_","_"
1,"tām","_","_","tad","PRD","","_","_"
2,"anvartiṣye","_","_","sakhi","NC","","_","_"
3,"sakhibhir","_","_","navagva","JJ","","_","_"
4,"navagvaiḥ","_","_","kiṃ","PRQ","","_","_"
5,"ka","_","_","ida","PRD","","_","_"
6,"imān","_","_","vid","KDP","","_","_"
7,"vidvān","_","_","vicṛt","V","vicṛt","_","_"
8,"vicacarta","_","_","pāśa","NC","","_","_"
1,"ahaṃ","_","_","mat","PPR","","_","_"
2,"viṣyāmi","_","_","viṣā","V","viṣā","_","_"
3,"mayi","_","_","mat","PPR","","_","_"
4,"rūpam","_","_","rūpa","NC","","_","_"
5,"asyā","_","_","ida","PRD","","_","_"
6,"vedad","_","_","vid","V","vid","_","_"
7,"it","_","_","id","CEM","","_","_"
8,"paśyan","_","_","paś","KDP","","_","_"
9,"manasaḥ","_","_","manas","NC","","_","_"
10,"kulāyam","_","_","kulāya","NC","","_","_"
1,"na","_","_","na","CNG","","_","_"
2,"steyam","_","_","steya","NC","","_","_"
3,"admi","_","_","ad","V","ad","_","_"
4,"_","_","_","manas","NC","","_","_"
5,"_","_","_","unmuc","V","unmuc","_","_"
6,"svayaṃ","_","_","svaya","CX","","_","_"
7,"śrathnāno","_","_","śrath","KDP","","_","_"
8,"varuṇasya","_","_","varuṇa","NC","","_","_"
9,"pāśān","_","_","pāśa","NC","","_","_"
1,"pra","_","_","pra","CADP","","_","_"
2,"tvā","_","_","tvat","PPR","","_","_"
3,"muñcāmi","_","_","muñc","V","muc","_","_"
4,"varuṇasya","_","_","varuṇa","NC","","_","_"
5,"pāśād","_","_","pāśa","NC","","_","_"
6,"yena","_","_","yad","PRL","","_","_"
7,"_","_","_","tvat","PPR","","_","_"
8,"_","_","_","bandh","V","bandh","_","_"
9,"savitā","_","_","savitṛ","NC","","_","_"
10,"suśevāḥ","_","_","suśevas","JJ","","_","_"
1,"uruṃ","_","_","uru","JJ","","_","_"
2,"lokaṃ","_","_","loka","NC","","_","_"
3,"sugam","_","_","suga","JJ","","_","_"
4,"atra","_","_","atra","CAD","","_","_"
5,"panthāṃ","_","_","pathin","NC","","_","_"
6,"kṛṇomi","_","_","kar","V","kṛ","_","_"
7,"tubhyaṃ","_","_","tvat","PPR","","_","_"
8,"_","_","_","saha","CX","","_","_"
9,"_","_","_","patnī","NC","","_","_"
10,"vadhu","_","_","vadhū","NC","","_","_"
1,"udyacchadhvam","_","_","udya","V","udya","_","_"
2,"apa","_","_","apa","CX","","_","_"
3,"rakṣo","_","_","rakṣas","NC","","_","_"
4,"_","_","_","han","V","han","_","_"
5,"_","_","_","ida","PRD","","_","_"
6,"nārīṃ","_","_","nārī","NC","","_","_"
7,"_","_","_","su","CAD","","_","_"
8,"_","_","_","kṛt","JJ","","_","_"
9,"dadhāta","_","_","dadh","V","dhā","_","_"
1,"dhātā","_","_","dhātṛ","NC","","_","_"
2,"vipaścit","_","_","vipaścit","JJ","","_","_"
3,"patim","_","_","pati","NC","","_","_"
4,"asyai","_","_","ida","PRD","","_","_"
5,"viveda","_","_","vid","V","vid","_","_"
6,"bhago","_","_","bhaga","NC","","_","_"
7,"rājā","_","_","rājan","NC","","_","_"
8,"pura","_","_","puras","CX","","_","_"
9,"etu","_","_","e","V","i","_","_"
10,"prajānan","_","_","prajñā","KDP","","_","_"
1,"bhagas","_","_","bhaga","NC","","_","_"
2,"tatakṣa","_","_","takṣ","V","takṣ","_","_"
3,"caturaḥ","_","_","catur","NUM","","_","_"
4,"pādān","_","_","pāda","NC","","_","_"
5,"bhagas","_","_","bhaga","NC","","_","_"
6,"tatakṣa","_","_","takṣ","V","takṣ","_","_"
7,"catvāry","_","_","catur","NUM","","_","_"
8,"uṣyalāni","_","_","uṣyala","NC","","_","_"
1,"tvaṣṭā","_","_","tvaṣṭṛ","NC","","_","_"
2,"pipeśa","_","_","piś","V","piś","_","_"
3,"madhyato","_","_","madhyatas","CX","","_","_"
4,"'nu","_","_","anu","CADP","","_","_"
5,"vardhrānt","_","_","vardhra","NC","","_","_"
6,"sā","_","_","tad","PRD","","_","_"
7,"no","_","_","mat","PPR","","_","_"
8,"astu","_","_","as","V","as","_","_"
9,"_","_","_","su","CAD","","_","_"
10,"_","_","_","maṅgala","JJ","","_","_"
1,"_","_","_","su","CAD","","_","_"
2,"_","_","_","kiṃśuka","NC","","_","_"
3,"vahatuṃ","_","_","vahatu","NC","","_","_"
4,"_","_","_","viśva","JQ","","_","_"
5,"_","_","_","rūpa","NC","","_","_"
6,"_","_","_","hiraṇya","NC","","_","_"
7,"_","_","_","varṇa","NC","","_","_"
8,"suvṛtaṃ","_","_","suvṛt","JJ","","_","_"
9,"_","_","_","su","CAD","","_","_"
10,"_","_","_","cakra","NC","","_","_"
1,"āroha","_","_","āroh","V","āruh","_","_"
2,"sūrye","_","_","sūryā","NC","","_","_"
3,"amṛtasya","_","_","amṛta","NC","","_","_"
4,"lokaṃ","_","_","loka","NC","","_","_"
5,"syonaṃ","_","_","syona","JJ","","_","_"
6,"patibhyo","_","_","pati","NC","","_","_"
7,"vahatuṃ","_","_","vahatu","NC","","_","_"
8,"kṛṇu","_","_","kar","V","kṛ","_","_"
9,"tvam","_","_","tvat","PPR","","_","_"
1,"_","_","_","a","CNG","","_","_"
2,"_","_","_","bhrātṛ","NC","","_","_"
3,"_","_","_","ghna","JJ","","_","_"
4,"_","_","_","varuṇa","NC","","_","_"
5,"_","_","_","a","CNG","","_","_"
6,"_","_","_","paśu","NC","","_","_"
7,"_","_","_","ghna","JJ","","_","_"
8,"bṛhaspate","_","_","bṛhaspati","NC","","_","_"
1,"_","_","_","indra","NC","","_","_"
2,"_","_","_","a","CNG","","_","_"
3,"_","_","_","pati","NC","","_","_"
4,"_","_","_","ghna","JJ","","_","_"
5,"putriṇīm","_","_","putrin","JJ","","_","_"
6,"_","_","_","ā","CADP","","_","_"
7,"_","_","_","mat","PPR","","_","_"
8,"savitar","_","_","savitṛ","NC","","_","_"
9,"vaha","_","_","vah","V","vah","_","_"
1,"mā","_","_","mā","CNG","","_","_"
2,"hiṃsiṣṭaṃ","_","_","hiṃs","V","hiṃs","_","_"
3,"kumāryaṃ","_","_","kumārī","NC","","_","_"
4,"sthūṇe","_","_","sthūṇā","NC","","_","_"
5,"_","_","_","deva","NC","","_","_"
6,"_","_","_","kṛ","PPP","","_","_"
7,"pathi","_","_","pathin","NC","","_","_"
1,"śālāyā","_","_","śālā","NC","","_","_"
2,"devyā","_","_","deva","JJ","","_","_"
3,"dvāraṃ","_","_","dvāra","NC","","_","_"
4,"syonaṃ","_","_","syona","JJ","","_","_"
5,"kṛṇmo","_","_","kar","V","kṛ","_","_"
6,"_","_","_","vadhū","NC","","_","_"
7,"_","_","_","patha","NC","","_","_"
1,"_","_","_","brahman","NC","","_","_"
2,"_","_","_","apara","PPX","","_","_"
3,"yujyatāṃ","_","_","yuj","V","yuj","_","_"
4,"brahma","_","_","brahman","NC","","_","_"
5,"pūrvaṃ","_","_","pūrva","PPX","","_","_"
6,"_","_","_","brahman","NC","","_","_"
7,"_","_","_","antatas","CX","","_","_"
8,"madhyato","_","_","madhyatas","CX","","_","_"
9,"brahma","_","_","brahman","NC","","_","_"
10,"sarvataḥ","_","_","sarvatas","CX","","_","_"
1,"_","_","_","an","CX","","_","_"
2,"_","_","_","āvyādha","NC","","_","_"
3,"_","_","_","deva","NC","","_","_"
4,"_","_","_","pur","NC","","_","_"
5,"prapadya","_","_","prapad","CGDA","","_","_"
6,"śivā","_","_","śiva","JJ","","_","_"
7,"syonā","_","_","syona","JJ","","_","_"
8,"_","_","_","pati","NC","","_","_"
9,"_","_","_","loka","NC","","_","_"
10,"virāja","_","_","virāj","V","virāj","_","_"
