"WordID","word","NormSTEM","suffix","lemma","PoS","Root","NormSuffix","NormWord"
1,"janamejaya","_","_","janamejaya","NC","","_","_"
2,"uvāca","_","_","vak","V","vac","_","_"
1,"evaṃ","_","_","eva","CX","","_","_"
2,"nipātite","_","_","nipātay","PPP","","_","_"
3,"karṇe","_","_","karṇa","NC","","_","_"
4,"samare","_","_","samara","NC","","_","_"
5,"savyasācinā","_","_","savyasācin","NC","","_","_"
1,"_","_","_","alpa","JJ","","_","_"
2,"_","_","_","avaśiṣ","PPP","","_","_"
3,"kuravaḥ","_","_","kuru","NC","","_","_"
4,"kim","_","_","kiṃ","PRQ","","_","_"
5,"akurvata","_","_","kar","V","kṛ","_","_"
6,"vai","_","_","vai","CX","","_","_"
7,"dvija","_","_","dvija","NC","","_","_"
1,"udīryamāṇaṃ","_","_","udīray","KDP","","_","_"
2,"ca","_","_","ca","CCD","","_","_"
3,"balaṃ","_","_","bala","NC","","_","_"
4,"dṛṣṭvā","_","_","dṛś","CGDA","","_","_"
5,"rājā","_","_","rājan","NC","","_","_"
6,"suyodhanaḥ","_","_","suyodhana","NC","","_","_"
1,"pāṇḍavaiḥ","_","_","pāṇḍava","NC","","_","_"
2,"_","_","_","prāp","PPP","","_","_"
3,"_","_","_","kāla","NC","","_","_"
4,"ca","_","_","ca","CCD","","_","_"
5,"kiṃ","_","_","kiṃ","PRQ","","_","_"
6,"prāpadyata","_","_","prapad","V","prapad","_","_"
7,"kauravaḥ","_","_","kaurava","NC","","_","_"
1,"etad","_","_","tad","PRD","","_","_"
2,"_","_","_","iṣ","V","iṣ","_","_"
3,"_","_","_","mat","PPR","","_","_"
4,"śrotuṃ","_","_","śru","CGDI","","_","_"
5,"tad","_","_","tad","PRD","","_","_"
6,"ācakṣva","_","_","cakṣ","V","cakṣ","_","_"
7,"dvijottama","_","_","dvijottama","NC","","_","_"
1,"na","_","_","na","CNG","","_","_"
2,"hi","_","_","hi","CX","","_","_"
3,"tṛpyāmi","_","_","tṛp","V","tṛp","_","_"
4,"pūrveṣāṃ","_","_","pūrva","PPX","","_","_"
5,"_","_","_","śru","KDP","","_","_"
6,"_","_","_","carita","NC","","_","_"
7,"mahat","_","_","mahat","JJ","","_","_"
1,"vaiśaṃpāyana","_","_","vaiśampāyana","NC","","_","_"
2,"uvāca","_","_","vak","V","vac","_","_"
1,"tataḥ","_","_","tatas","CX","","_","_"
2,"karṇe","_","_","karṇa","NC","","_","_"
3,"hate","_","_","han","PPP","","_","_"
4,"rājan","_","_","rājan","NC","","_","_"
5,"dhārtarāṣṭraḥ","_","_","dhārtarāṣṭra","NC","","_","_"
6,"suyodhanaḥ","_","_","suyodhana","NC","","_","_"
1,"bhṛśaṃ","_","_","bhṛśa","CX","","_","_"
2,"_","_","_","śoka","NC","","_","_"
3,"_","_","_","arṇava","NC","","_","_"
4,"magno","_","_","majj","PPP","","_","_"
5,"nirāśaḥ","_","_","nirāśa","JJ","","_","_"
6,"sarvato","_","_","sarvatas","CX","","_","_"
7,"'bhavat","_","_","bhav","V","bhū","_","_"
1,"hā","_","_","hā","CX","","_","_"
2,"karṇa","_","_","karṇa","NC","","_","_"
3,"hā","_","_","hā","CX","","_","_"
4,"karṇa","_","_","karṇa","NC","","_","_"
5,"iti","_","_","iti","CQT","","_","_"
6,"śocamānaḥ","_","_","śuc","KDP","","_","_"
7,"punaḥ","_","_","punar","CAD","","_","_"
8,"punaḥ","_","_","punar","CAD","","_","_"
1,"kṛcchrāt","_","_","kṛcchra","NC","","_","_"
2,"_","_","_","sva","JJ","","_","_"
3,"_","_","_","śibira","NC","","_","_"
4,"_","_","_","prayā","V","prayā","_","_"
5,"_","_","_","han","PPP","","_","_"
6,"_","_","_","śeṣa","NC","","_","_"
7,"nṛpaiḥ","_","_","nṛpa","NC","","_","_"
8,"saha","_","_","saha","CX","","_","_"
1,"sa","_","_","tad","PRD","","_","_"
2,"samāśvāsyamāno","_","_","samāśvāsay","KDP","","_","_"
3,"'pi","_","_","api","CX","","_","_"
4,"hetubhiḥ","_","_","hetu","NC","","_","_"
5,"_","_","_","śāstra","NC","","_","_"
6,"_","_","_","niści","PPP","","_","_"
1,"rājabhir","_","_","rājan","NC","","_","_"
2,"_","_","_","na","CNG","","_","_"
3,"_","_","_","labh","V","labh","_","_"
4,"_","_","_","śarman","NC","","_","_"
5,"_","_","_","sūtaputra","NC","","_","_"
6,"_","_","_","vadha","NC","","_","_"
7,"smaran","_","_","smṛ","KDP","","_","_"
1,"sa","_","_","tad","PRD","","_","_"
2,"daivaṃ","_","_","daiva","NC","","_","_"
3,"_","_","_","balavat","JJ","","_","_"
4,"_","_","_","man","CGDA","","_","_"
5,"bhavitavyaṃ","_","_","bhū","KDG","","_","_"
6,"ca","_","_","ca","CCD","","_","_"
7,"pārthivaḥ","_","_","pārthiva","NC","","_","_"
1,"saṃgrāme","_","_","saṃgrāma","NC","","_","_"
2,"niścayaṃ","_","_","niścaya","NC","","_","_"
3,"kṛtvā","_","_","kṛ","CGDA","","_","_"
4,"punar","_","_","punar","CAD","","_","_"
5,"yuddhāya","_","_","yuddha","NC","","_","_"
6,"niryayau","_","_","niryā","V","niryā","_","_"
1,"śalyaṃ","_","_","śalya","NC","","_","_"
2,"senāpatiṃ","_","_","senāpati","NC","","_","_"
3,"kṛtvā","_","_","kṛ","CGDA","","_","_"
4,"vidhivad","_","_","vidhivat","CX","","_","_"
5,"_","_","_","rājan","NC","","_","_"
6,"_","_","_","puṃgava","NC","","_","_"
1,"raṇāya","_","_","raṇa","NC","","_","_"
2,"niryayau","_","_","niryā","V","niryā","_","_"
3,"rājā","_","_","rājan","NC","","_","_"
4,"_","_","_","han","PPP","","_","_"
5,"_","_","_","śeṣa","NC","","_","_"
6,"nṛpaiḥ","_","_","nṛpa","NC","","_","_"
7,"saha","_","_","saha","CX","","_","_"
1,"tataḥ","_","_","tatas","CX","","_","_"
2,"_","_","_","su","CAD","","_","_"
3,"_","_","_","tumula","JJ","","_","_"
4,"yuddhaṃ","_","_","yuddha","NC","","_","_"
5,"_","_","_","kuru","NC","","_","_"
6,"_","_","_","pāṇḍava","NC","","_","_"
7,"_","_","_","senā","NC","","_","_"
1,"babhūva","_","_","bhav","V","bhū","_","_"
2,"_","_","_","bharata","NC","","_","_"
3,"_","_","_","śreṣṭha","JJ","","_","_"
4,"_","_","_","deva","NC","","_","_"
5,"_","_","_","asura","NC","","_","_"
6,"_","_","_","raṇa","NC","","_","_"
7,"_","_","_","upama","JJ","","_","_"
1,"tataḥ","_","_","tatas","CX","","_","_"
2,"śalyo","_","_","śalya","NC","","_","_"
3,"_","_","_","mahat","JJ","","_","_"
4,"_","_","_","rāja","NC","","_","_"
5,"kṛtvā","_","_","kṛ","CGDA","","_","_"
6,"kadanam","_","_","kadana","NC","","_","_"
7,"āhave","_","_","āhava","NC","","_","_"
1,"_","_","_","pāṇḍu","NC","","_","_"
2,"_","_","_","sainya","NC","","_","_"
3,"madhyāhne","_","_","madhyāhna","NC","","_","_"
4,"dharmarājena","_","_","dharmarāja","NC","","_","_"
5,"pātitaḥ","_","_","pātay","PPP","","_","_"
1,"tato","_","_","tatas","CX","","_","_"
2,"duryodhano","_","_","duryodhana","NC","","_","_"
3,"rājā","_","_","rājan","NC","","_","_"
4,"_","_","_","han","PPP","","_","_"
5,"_","_","_","bandhu","NC","","_","_"
6,"_","_","_","raṇa","NC","","_","_"
7,"_","_","_","ajira","NC","","_","_"
1,"apasṛtya","_","_","apasṛ","CGDA","","_","_"
2,"hradaṃ","_","_","hrada","NC","","_","_"
3,"ghoraṃ","_","_","ghora","JJ","","_","_"
4,"viveśa","_","_","viś","V","viś","_","_"
5,"_","_","_","ripu","NC","","_","_"
6,"_","_","_","ja","JJ","","_","_"
7,"bhayāt","_","_","bhaya","NC","","_","_"
1,"_","_","_","atha","CAD","","_","_"
2,"_","_","_","aparāhṇa","NC","","_","_"
3,"_","_","_","tad","PRD","","_","_"
4,"_","_","_","ahar","NC","","_","_"
5,"parivārya","_","_","parivāray","CGDA","","_","_"
6,"_","_","_","mahat","JJ","","_","_"
7,"_","_","_","ratha","NC","","_","_"
1,"hradād","_","_","hrada","NC","","_","_"
2,"āhūya","_","_","āhvā","CGDA","","_","_"
3,"yogena","_","_","yoga","NC","","_","_"
4,"bhīmasenena","_","_","bhīmasa","NC","","_","_"
5,"pātitaḥ","_","_","pātay","PPP","","_","_"
1,"tasmin","_","_","tad","PRD","","_","_"
2,"hate","_","_","han","PPP","","_","_"
3,"_","_","_","mahat","JJ","","_","_"
4,"_","_","_","iṣvāsa","NC","","_","_"
5,"_","_","_","han","PPP","","_","_"
6,"_","_","_","śiṣ","PPP","","_","_"
7,"_","_","_","tri","NUM","","_","_"
8,"rathāḥ","_","_","ratha","NC","","_","_"
1,"saṃrambhān","_","_","saṃrambha","NC","","_","_"
2,"niśi","_","_","niś","NC","","_","_"
3,"_","_","_","rājan","NC","","_","_"
4,"_","_","_","indra","NC","","_","_"
5,"jaghnuḥ","_","_","han","V","han","_","_"
6,"_","_","_","pāñcāla","NC","","_","_"
7,"_","_","_","sainika","NC","","_","_"
1,"tataḥ","_","_","tatas","CX","","_","_"
2,"_","_","_","pūrvāhṇa","NC","","_","_"
3,"_","_","_","samaya","NC","","_","_"
4,"śibirād","_","_","śibira","NC","","_","_"
5,"etya","_","_","e","CGDA","","_","_"
6,"saṃjayaḥ","_","_","saṃjaya","NC","","_","_"
1,"praviveśa","_","_","praviś","V","praviś","_","_"
2,"purīṃ","_","_","purī","NC","","_","_"
3,"dīno","_","_","dīna","JJ","","_","_"
4,"_","_","_","duḥkha","NC","","_","_"
5,"_","_","_","śoka","NC","","_","_"
6,"_","_","_","samanvita","JJ","","_","_"
1,"praviśya","_","_","praviś","CGDA","","_","_"
2,"ca","_","_","ca","CCD","","_","_"
3,"puraṃ","_","_","pura","NC","","_","_"
4,"tūrṇaṃ","_","_","tūrṇa","CX","","_","_"
5,"_","_","_","bhuja","NC","","_","_"
6,"_","_","_","ucchri","CGDA","","_","_"
7,"duḥkhitaḥ","_","_","duḥkhita","JJ","","_","_"
1,"_","_","_","vip","KDP","","_","_"
2,"_","_","_","tatas","CX","","_","_"
3,"rājñaḥ","_","_","rājan","NC","","_","_"
4,"praviveśa","_","_","praviś","V","praviś","_","_"
5,"niveśanam","_","_","niveśana","NC","","_","_"
1,"ruroda","_","_","rod","V","rud","_","_"
2,"ca","_","_","ca","CCD","","_","_"
3,"_","_","_","nara","NC","","_","_"
4,"_","_","_","vyāghra","NC","","_","_"
5,"hā","_","_","hā","CX","","_","_"
6,"rājann","_","_","rājan","NC","","_","_"
7,"iti","_","_","iti","CQT","","_","_"
8,"duḥkhitaḥ","_","_","duḥkhita","JJ","","_","_"
1,"aho","_","_","aho","CX","","_","_"
2,"bata","_","_","bata","CX","","_","_"
3,"vivignāḥ","_","_","vivij","PPP","","_","_"
4,"sma","_","_","sma","CX","","_","_"
5,"nidhanena","_","_","nidhana","NC","","_","_"
6,"mahātmanaḥ","_","_","mahātman","JJ","","_","_"
1,"aho","_","_","aho","CX","","_","_"
2,"_","_","_","su","CAD","","_","_"
3,"_","_","_","balavat","JJ","","_","_"
4,"kālo","_","_","kāla","NC","","_","_"
5,"_","_","_","gati","NC","","_","_"
6,"_","_","_","ca","CCD","","_","_"
7,"paramā","_","_","parama","JJ","","_","_"
8,"tathā","_","_","tathā","CX","","_","_"
1,"_","_","_","śakra","NC","","_","_"
2,"_","_","_","tulya","JJ","","_","_"
3,"_","_","_","bala","NC","","_","_"
4,"sarve","_","_","sarva","JQ","","_","_"
5,"_","_","_","yatra","CX","","_","_"
6,"_","_","_","vadh","V","vadh","_","_"
7,"pārthivāḥ","_","_","pārthiva","NC","","_","_"
1,"_","_","_","dṛś","CGDA","","_","_"
2,"_","_","_","eva","CEM","","_","_"
3,"ca","_","_","ca","CCD","","_","_"
4,"puro","_","_","puras","CX","","_","_"
5,"rājañ","_","_","rājan","NC","","_","_"
6,"janaḥ","_","_","jana","NC","","_","_"
7,"sarvaḥ","_","_","sarva","JQ","","_","_"
8,"sa","_","_","tad","PRD","","_","_"
9,"saṃjayam","_","_","saṃjaya","NC","","_","_"
1,"praruroda","_","_","prarod","V","prarud","_","_"
2,"_","_","_","bhṛśa","JJ","","_","_"
3,"_","_","_","udvij","PPP","","_","_"
4,"hā","_","_","hā","CX","","_","_"
5,"rājann","_","_","rājan","NC","","_","_"
6,"iti","_","_","iti","CQT","","_","_"
7,"_","_","_","sa_saha","CX","","_","_"
8,"_","_","_","svara","NC","","_","_"
1,"ā","_","_","ā","CADP","","_","_"
2,"kumāraṃ","_","_","kumāra","NC","","_","_"
3,"_","_","_","nara","NC","","_","_"
4,"_","_","_","vyāghra","NC","","_","_"
5,"tat","_","_","tad","PRD","","_","_"
6,"puraṃ","_","_","pura","NC","","_","_"
7,"vai","_","_","vai","CX","","_","_"
8,"samantataḥ","_","_","samantataḥ","CX","","_","_"
1,"_","_","_","ārta","JJ","","_","_"
2,"_","_","_","nāda","NC","","_","_"
3,"_","_","_","mahat","JJ","","_","_"
4,"_","_","_","kar","V","kṛ","_","_"
5,"śrutvā","_","_","śru","CGDA","","_","_"
6,"vinihataṃ","_","_","vinihan","PPP","","_","_"
7,"nṛpam","_","_","nṛpa","NC","","_","_"
1,"_","_","_","dhāv","KDP","","_","_"
2,"_","_","_","ca","CCD","","_","_"
3,"_","_","_","api","CX","","_","_"
4,"_","_","_","paś","V","paś","_","_"
5,"_","_","_","ca","CCD","","_","_"
6,"tatra","_","_","tatra","CAD","","_","_"
7,"trīn","_","_","tri","NUM","","_","_"
8,"_","_","_","puruṣa","NC","","_","_"
9,"_","_","_","ṛṣabha","NC","","_","_"
1,"_","_","_","naś","PPP","","_","_"
2,"_","_","_","citta","NC","","_","_"
3,"_","_","_","iva","CCM","","_","_"
4,"_","_","_","unmad","PPP","","_","_"
5,"śokena","_","_","śoka","NC","","_","_"
6,"_","_","_","bhṛśa","JJ","","_","_"
7,"_","_","_","pīḍay","PPP","","_","_"
1,"tathā","_","_","tathā","CX","","_","_"
2,"sa","_","_","tad","PRD","","_","_"
3,"vihvalaḥ","_","_","vihvala","JJ","","_","_"
4,"sūtaḥ","_","_","sūta","NC","","_","_"
5,"praviśya","_","_","praviś","CGDA","","_","_"
6,"_","_","_","nṛpati","NC","","_","_"
7,"_","_","_","kṣaya","NC","","_","_"
1,"dadarśa","_","_","darś","V","dṛś","_","_"
2,"_","_","_","nṛpati","NC","","_","_"
3,"_","_","_","śreṣṭha","JJ","","_","_"
4,"prajñācakṣuṣam","_","_","prajñācakṣus","NC","","_","_"
5,"īśvaram","_","_","īśvara","NC","","_","_"
1,"dṛṣṭvā","_","_","dṛś","CGDA","","_","_"
2,"_","_","_","ca","CCD","","_","_"
3,"_","_","_","ās","PPP","","_","_"
4,"anaghaṃ","_","_","anagha","JJ","","_","_"
5,"samantāt","_","_","samantāt","CX","","_","_"
6,"parivāritam","_","_","parivāray","PPP","","_","_"
1,"snuṣābhir","_","_","snuṣā","NC","","_","_"
2,"_","_","_","bharata","NC","","_","_"
3,"_","_","_","śreṣṭha","JJ","","_","_"
4,"gāndhāryā","_","_","gāndhārī","NC","","_","_"
5,"vidureṇa","_","_","vidura","NC","","_","_"
6,"ca","_","_","ca","CCD","","_","_"
1,"_","_","_","tathā","CX","","_","_"
2,"_","_","_","anya","PPX","","_","_"
3,"_","_","_","ca","CCD","","_","_"
4,"_","_","_","suhṛd","NC","","_","_"
5,"_","_","_","ca","CCD","","_","_"
6,"_","_","_","jñāti","NC","","_","_"
7,"_","_","_","ca","CCD","","_","_"
8,"_","_","_","hita","NC","","_","_"
9,"_","_","_","eṣin","JJ","","_","_"
1,"tam","_","_","tad","PRD","","_","_"
2,"eva","_","_","eva","CEM","","_","_"
3,"_","_","_","ca","CCD","","_","_"
4,"_","_","_","artha","NC","","_","_"
5,"dhyāyantaṃ","_","_","dhyā","KDP","","_","_"
6,"karṇasya","_","_","karṇa","NC","","_","_"
7,"nidhanaṃ","_","_","nidhana","NC","","_","_"
8,"prati","_","_","prati","CADP","","_","_"
1,"rudann","_","_","rud","KDP","","_","_"
2,"_","_","_","eva","CEM","","_","_"
3,"_","_","_","abravīta","V","brū","_","_"
4,"vākyaṃ","_","_","vākya","NC","","_","_"
5,"rājānaṃ","_","_","rājan","NC","","_","_"
6,"janamejaya","_","_","janamejaya","NC","","_","_"
1,"_","_","_","na","CNG","","_","_"
2,"_","_","_","ati","CADP","","_","_"
3,"_","_","_","hṛṣ","PPP","","_","_"
4,"_","_","_","manas","NC","","_","_"
5,"sūto","_","_","sūta","NC","","_","_"
6,"_","_","_","bāṣpa","NC","","_","_"
7,"_","_","_","saṃdih","PPP","","_","_"
8,"girā","_","_","gir","NC","","_","_"
1,"saṃjayo","_","_","saṃjaya","NC","","_","_"
2,"'haṃ","_","_","mat","PPR","","_","_"
3,"_","_","_","nara","NC","","_","_"
4,"_","_","_","vyāghra","NC","","_","_"
5,"_","_","_","namas","NC","","_","_"
6,"_","_","_","tvat","PPR","","_","_"
7,"_","_","_","bharata","NC","","_","_"
8,"_","_","_","ṛṣabha","NC","","_","_"
1,"_","_","_","madra","NC","","_","_"
2,"_","_","_","adhipa","NC","","_","_"
3,"hataḥ","_","_","han","PPP","","_","_"
4,"śalyaḥ","_","_","śalya","NC","","_","_"
5,"śakuniḥ","_","_","śakuni","NC","","_","_"
6,"_","_","_","saubala","NC","","_","_"
7,"_","_","_","tathā","CX","","_","_"
1,"ulūkaḥ","_","_","ulūka","NC","","_","_"
2,"_","_","_","puruṣa","NC","","_","_"
3,"_","_","_","vyāghra","NC","","_","_"
4,"kaitavyo","_","_","kaitavya","NC","","_","_"
5,"_","_","_","dṛḍha","JJ","","_","_"
6,"_","_","_","vikrama","NC","","_","_"
1,"saṃśaptakā","_","_","saṃśaptaka","NC","","_","_"
2,"hatāḥ","_","_","han","PPP","","_","_"
3,"sarve","_","_","sarva","JQ","","_","_"
4,"_","_","_","kāmboja","NC","","_","_"
5,"_","_","_","ca","CCD","","_","_"
6,"śakaiḥ","_","_","śaka","NC","","_","_"
7,"saha","_","_","saha","CX","","_","_"
1,"_","_","_","mleccha","NC","","_","_"
2,"_","_","_","ca","CCD","","_","_"
3,"_","_","_","pārvatīya","NC","","_","_"
4,"_","_","_","ca","CCD","","_","_"
5,"_","_","_","yavana","NC","","_","_"
6,"_","_","_","ca","CCD","","_","_"
7,"nipātitāḥ","_","_","nipātay","PPP","","_","_"
1,"prācyā","_","_","prācya","JJ","","_","_"
2,"hatā","_","_","han","PPP","","_","_"
3,"_","_","_","mahat","JJ","","_","_"
4,"_","_","_","rāja","NC","","_","_"
5,"_","_","_","dākṣiṇātya","JJ","","_","_"
6,"_","_","_","ca","CCD","","_","_"
7,"sarvaśaḥ","_","_","sarvaśas","CX","","_","_"
1,"udīcyā","_","_","udīcya","JJ","","_","_"
2,"nihatāḥ","_","_","nihan","PPP","","_","_"
3,"sarve","_","_","sarva","JQ","","_","_"
4,"_","_","_","pratīcya","JJ","","_","_"
5,"_","_","_","ca","CCD","","_","_"
6,"narādhipa","_","_","narādhipa","NC","","_","_"
1,"rājāno","_","_","rājan","NC","","_","_"
2,"_","_","_","rājan","NC","","_","_"
3,"_","_","_","putra","NC","","_","_"
4,"_","_","_","ca","CCD","","_","_"
5,"sarvato","_","_","sarvatas","CX","","_","_"
6,"nihatā","_","_","nihan","PPP","","_","_"
7,"nṛpa","_","_","nṛpa","NC","","_","_"
1,"duryodhano","_","_","duryodhana","NC","","_","_"
2,"hato","_","_","han","PPP","","_","_"
3,"rājan","_","_","rājan","NC","","_","_"
4,"_","_","_","yathā","CCM","","_","_"
5,"_","_","_","vac","PPP","","_","_"
6,"pāṇḍavena","_","_","pāṇḍava","NC","","_","_"
7,"ca","_","_","ca","CCD","","_","_"
1,"_","_","_","bhañj","PPP","","_","_"
2,"_","_","_","saktha","NC","","_","_"
3,"_","_","_","mahat","JJ","","_","_"
4,"_","_","_","rāja","NC","","_","_"
5,"śete","_","_","śī","V","śī","_","_"
6,"pāṃsuṣu","_","_","pāṃsu","NC","","_","_"
7,"rūṣitaḥ","_","_","rūṣita","JJ","","_","_"
1,"dhṛṣṭadyumno","_","_","dhṛṣṭadyumna","NC","","_","_"
2,"hato","_","_","han","PPP","","_","_"
3,"rājañ","_","_","rājan","NC","","_","_"
4,"śikhaṇḍī","_","_","śikhaṇḍin","NC","","_","_"
5,"_","_","_","ca","CCD","","_","_"
6,"_","_","_","aparājita","JJ","","_","_"
1,"uttamaujā","_","_","uttamaujas","NC","","_","_"
2,"_","_","_","yudhāmanyu","NC","","_","_"
3,"_","_","_","tathā","CX","","_","_"
4,"rājan","_","_","rājan","NC","","_","_"
5,"prabhadrakāḥ","_","_","prabhadraka","NC","","_","_"
1,"_","_","_","pāñcāla","NC","","_","_"
2,"_","_","_","ca","CCD","","_","_"
3,"_","_","_","nara","NC","","_","_"
4,"_","_","_","vyāghra","NC","","_","_"
5,"_","_","_","cedi","NC","","_","_"
6,"_","_","_","ca","CCD","","_","_"
7,"niṣūditāḥ","_","_","niṣūday","PPP","","_","_"
1,"tava","_","_","tvat","PPR","","_","_"
2,"putrā","_","_","putra","NC","","_","_"
3,"hatāḥ","_","_","han","PPP","","_","_"
4,"sarve","_","_","sarva","JQ","","_","_"
5,"_","_","_","draupadeya","NC","","_","_"
6,"_","_","_","ca","CCD","","_","_"
7,"bhārata","_","_","bhārata","NC","","_","_"
1,"_","_","_","karṇa","NC","","_","_"
2,"_","_","_","putra","NC","","_","_"
3,"hataḥ","_","_","han","PPP","","_","_"
4,"śūro","_","_","śūra","NC","","_","_"
5,"vṛṣaseno","_","_","vṛṣasa","NC","","_","_"
6,"_","_","_","mahat","JJ","","_","_"
7,"_","_","_","bala","NC","","_","_"
1,"narā","_","_","nara","NC","","_","_"
2,"vinihatāḥ","_","_","vinihan","PPP","","_","_"
3,"sarve","_","_","sarva","JQ","","_","_"
4,"_","_","_","gaja","NC","","_","_"
5,"_","_","_","ca","CCD","","_","_"
6,"vinipātitāḥ","_","_","vinipātay","PPP","","_","_"
1,"_","_","_","rathin","NC","","_","_"
2,"_","_","_","ca","CCD","","_","_"
3,"_","_","_","nara","NC","","_","_"
4,"_","_","_","vyāghra","NC","","_","_"
5,"_","_","_","haya","NC","","_","_"
6,"_","_","_","ca","CCD","","_","_"
7,"nihatā","_","_","nihan","PPP","","_","_"
8,"yudhi","_","_","yudh","NC","","_","_"
1,"_","_","_","kiṃcit","PRI","","_","_"
2,"_","_","_","śeṣa","JJ","","_","_"
3,"ca","_","_","ca","CCD","","_","_"
4,"śibiraṃ","_","_","śibira","NC","","_","_"
5,"tāvakānāṃ","_","_","tāvaka","JJ","","_","_"
6,"kṛtaṃ","_","_","kṛ","PPP","","_","_"
7,"vibho","_","_","vibhu","JJ","","_","_"
1,"pāṇḍavānāṃ","_","_","pāṇḍava","NC","","_","_"
2,"ca","_","_","ca","CCD","","_","_"
3,"śūrāṇāṃ","_","_","śūra","NC","","_","_"
4,"samāsādya","_","_","samāsāday","CGDA","","_","_"
5,"parasparam","_","_","paraspara","PRC","","_","_"
1,"prāyaḥ","_","_","prāyas","CX","","_","_"
2,"_","_","_","strī","NC","","_","_"
3,"_","_","_","śeṣa","NC","","_","_"
4,"_","_","_","bhav","V","bhū","_","_"
5,"_","_","_","jagat","NC","","_","_"
6,"kālena","_","_","kāla","NC","","_","_"
7,"mohitam","_","_","mohay","PPP","","_","_"
1,"sapta","_","_","saptan","NUM","","_","_"
2,"pāṇḍavataḥ","_","_","pāṇḍava","NC","","_","_"
3,"śeṣā","_","_","śeṣa","JJ","","_","_"
4,"_","_","_","dhārtarāṣṭra","NC","","_","_"
5,"_","_","_","tathā","CX","","_","_"
6,"trayaḥ","_","_","tri","NUM","","_","_"
1,"te","_","_","tad","PRD","","_","_"
2,"_","_","_","ca","CCD","","_","_"
3,"_","_","_","eva","CEM","","_","_"
4,"bhrātaraḥ","_","_","bhrātṛ","NC","","_","_"
5,"pañca","_","_","pañcan","NUM","","_","_"
6,"vāsudevo","_","_","vāsudeva","NC","","_","_"
7,"'tha","_","_","atha","CAD","","_","_"
8,"sātyakiḥ","_","_","sātyaki","NC","","_","_"
1,"_","_","_","kṛpa","NC","","_","_"
2,"_","_","_","ca","CCD","","_","_"
3,"kṛtavarmā","_","_","kṛtavarman","NC","","_","_"
4,"ca","_","_","ca","CCD","","_","_"
5,"_","_","_","drauṇi","NC","","_","_"
6,"_","_","_","ca","CCD","","_","_"
7,"jayatāṃ","_","_","ji","KDP","","_","_"
8,"varaḥ","_","_","vara","JJ","","_","_"
1,"_","_","_","tvat","PPR","","_","_"
2,"_","_","_","api","CX","","_","_"
3,"_","_","_","tad","PRD","","_","_"
4,"_","_","_","mahat","JJ","","_","_"
5,"_","_","_","rāja","NC","","_","_"
6,"rathino","_","_","rathin","NC","","_","_"
7,"_","_","_","nṛpa","NC","","_","_"
8,"_","_","_","sattama","JJ","","_","_"
1,"akṣauhiṇīnāṃ","_","_","akṣauhiṇī","NC","","_","_"
2,"sarvāsāṃ","_","_","sarva","JQ","","_","_"
3,"sametānāṃ","_","_","same","PPP","","_","_"
4,"janeśvara","_","_","janeśvara","NC","","_","_"
1,"ete","_","_","tad","PRD","","_","_"
2,"śeṣā","_","_","śeṣa","JJ","","_","_"
3,"_","_","_","mahat","JJ","","_","_"
4,"_","_","_","rāja","NC","","_","_"
5,"sarve","_","_","sarva","JQ","","_","_"
6,"'nye","_","_","anya","PPX","","_","_"
7,"nidhanaṃ","_","_","nidhana","NC","","_","_"
8,"gatāḥ","_","_","ga","PPP","","_","_"
1,"kālena","_","_","kāla","NC","","_","_"
2,"nihataṃ","_","_","nihan","PPP","","_","_"
3,"sarvaṃ","_","_","sarva","JQ","","_","_"
4,"jagad","_","_","jagat","NC","","_","_"
5,"vai","_","_","vai","CX","","_","_"
6,"_","_","_","bharata","NC","","_","_"
7,"_","_","_","ṛṣabha","NC","","_","_"
1,"duryodhanaṃ","_","_","duryodhana","NC","","_","_"
2,"vai","_","_","vai","CX","","_","_"
3,"purataḥ","_","_","puratas","CX","","_","_"
4,"kṛtvā","_","_","kṛ","CGDA","","_","_"
5,"vairasya","_","_","vaira","NC","","_","_"
6,"bhārata","_","_","bhārata","NC","","_","_"
1,"_","_","_","tad","PRD","","_","_"
2,"_","_","_","śru","CGDA","","_","_"
3,"vacaḥ","_","_","vacas","NC","","_","_"
4,"krūraṃ","_","_","krūra","JJ","","_","_"
5,"dhṛtarāṣṭro","_","_","dhṛtarāṣṭra","NC","","_","_"
6,"janeśvaraḥ","_","_","janeśvara","NC","","_","_"
1,"nipapāta","_","_","nipat","V","nipat","_","_"
2,"_","_","_","mahat","JJ","","_","_"
3,"_","_","_","rāja","NC","","_","_"
4,"_","_","_","ga","PPP","","_","_"
5,"_","_","_","sattva","NC","","_","_"
6,"_","_","_","mahī","NC","","_","_"
7,"_","_","_","tala","NC","","_","_"
1,"_","_","_","tad","PRD","","_","_"
2,"_","_","_","nipat","PPP","","_","_"
3,"bhūmau","_","_","bhūmi","NC","","_","_"
4,"viduro","_","_","vidura","NC","","_","_"
5,"'pi","_","_","api","CX","","_","_"
6,"_","_","_","mahat","JJ","","_","_"
7,"_","_","_","yaśas","NC","","_","_"
1,"nipapāta","_","_","nipat","V","nipat","_","_"
2,"_","_","_","mahat","JJ","","_","_"
3,"_","_","_","rāja","NC","","_","_"
4,"_","_","_","rājan","NC","","_","_"
5,"_","_","_","vyasana","NC","","_","_"
6,"_","_","_","karśay","PPP","","_","_"
1,"gāndhārī","_","_","gāndhārī","NC","","_","_"
2,"ca","_","_","ca","CCD","","_","_"
3,"_","_","_","nṛpa","NC","","_","_"
4,"_","_","_","śreṣṭha","JJ","","_","_"
5,"_","_","_","sarva","JQ","","_","_"
6,"_","_","_","ca","CCD","","_","_"
7,"_","_","_","kuru","NC","","_","_"
8,"_","_","_","yoṣit","NC","","_","_"
1,"patitāḥ","_","_","pat","PPP","","_","_"
2,"sahasā","_","_","sahasā","CX","","_","_"
3,"bhūmau","_","_","bhūmi","NC","","_","_"
4,"śrutvā","_","_","śru","CGDA","","_","_"
5,"krūraṃ","_","_","krūra","JJ","","_","_"
6,"_","_","_","vacas","NC","","_","_"
7,"_","_","_","ca","CCD","","_","_"
8,"tāḥ","_","_","tad","PRD","","_","_"
1,"niḥsaṃjñaṃ","_","_","niḥsaṃjña","JJ","","_","_"
2,"patitaṃ","_","_","pat","PPP","","_","_"
3,"bhūmau","_","_","bhūmi","NC","","_","_"
4,"_","_","_","tadā","CAD","","_","_"
5,"_","_","_","as","V","as","_","_"
6,"_","_","_","rājan","NC","","_","_"
7,"_","_","_","maṇḍala","NC","","_","_"
1,"_","_","_","pralāpa","NC","","_","_"
2,"_","_","_","yuj","PPP","","_","_"
3,"mahatī","_","_","mahat","JJ","","_","_"
4,"kathā","_","_","kathā","NC","","_","_"
5,"nyastā","_","_","nyas","PPP","","_","_"
6,"paṭe","_","_","paṭa","NC","","_","_"
7,"yathā","_","_","yathā","CCM","","_","_"
1,"kṛcchreṇa","_","_","kṛcchra","NC","","_","_"
2,"tu","_","_","tu","CCD","","_","_"
3,"tato","_","_","tatas","CX","","_","_"
4,"rājā","_","_","rājan","NC","","_","_"
5,"dhṛtarāṣṭro","_","_","dhṛtarāṣṭra","NC","","_","_"
6,"mahīpatiḥ","_","_","mahīpati","NC","","_","_"
1,"śanair","_","_","śanais","CX","","_","_"
2,"alabhata","_","_","labh","V","labh","_","_"
3,"prāṇān","_","_","prāṇa","NC","","_","_"
4,"_","_","_","putra","NC","","_","_"
5,"_","_","_","vyasana","NC","","_","_"
6,"_","_","_","karśay","PPP","","_","_"
1,"labdhvā","_","_","labh","CGDA","","_","_"
2,"tu","_","_","tu","CCD","","_","_"
3,"sa","_","_","tad","PRD","","_","_"
4,"nṛpaḥ","_","_","nṛpa","NC","","_","_"
5,"saṃjñāṃ","_","_","saṃjñā","NC","","_","_"
6,"vepamānaḥ","_","_","vip","KDP","","_","_"
7,"_","_","_","su","CAD","","_","_"
8,"_","_","_","duḥkhita","JJ","","_","_"
1,"udīkṣya","_","_","udīkṣ","CGDA","","_","_"
2,"ca","_","_","ca","CCD","","_","_"
3,"diśaḥ","_","_","diś","NC","","_","_"
4,"sarvāḥ","_","_","sarva","JQ","","_","_"
5,"kṣattāraṃ","_","_","kṣattṛ","NC","","_","_"
6,"vākyam","_","_","vākya","NC","","_","_"
7,"abravīt","_","_","abravīta","V","brū","_","_"
1,"vidvan","_","_","vidvas","JJ","","_","_"
2,"kṣattar","_","_","kṣattṛ","NC","","_","_"
3,"_","_","_","mahat","JJ","","_","_"
4,"_","_","_","prājña","JJ","","_","_"
5,"tvaṃ","_","_","tvat","PPR","","_","_"
6,"gatir","_","_","gati","NC","","_","_"
7,"_","_","_","bharata","NC","","_","_"
8,"_","_","_","ṛṣabha","NC","","_","_"
1,"_","_","_","mat","PPR","","_","_"
2,"_","_","_","anātha","JJ","","_","_"
3,"_","_","_","su","CAD","","_","_"
4,"_","_","_","bhṛśa","CX","","_","_"
5,"putrair","_","_","putra","NC","","_","_"
6,"hīnasya","_","_","hā","PPP","","_","_"
7,"sarvaśaḥ","_","_","sarvaśas","CX","","_","_"
1,"evam","_","_","eva","CX","","_","_"
2,"uktvā","_","_","vac","CGDA","","_","_"
3,"tato","_","_","tatas","CX","","_","_"
4,"bhūyo","_","_","bhūyas","CX","","_","_"
5,"visaṃjño","_","_","visaṃjña","JJ","","_","_"
6,"nipapāta","_","_","nipat","V","nipat","_","_"
7,"ha","_","_","ha","CEM","","_","_"
1,"taṃ","_","_","tad","PRD","","_","_"
2,"tathā","_","_","tathā","CX","","_","_"
3,"patitaṃ","_","_","pat","PPP","","_","_"
4,"dṛṣṭvā","_","_","dṛś","CGDA","","_","_"
5,"bāndhavā","_","_","bāndhava","NC","","_","_"
6,"ye","_","_","yad","PRL","","_","_"
7,"'sya","_","_","ida","PRD","","_","_"
8,"kecana","_","_","kaścana","PRI","","_","_"
1,"_","_","_","śīta","JJ","","_","_"
2,"_","_","_","tu","CCD","","_","_"
3,"_","_","_","sic","V","sic","_","_"
4,"_","_","_","toya","NC","","_","_"
5,"vivyajur","_","_","vīj","V","vīj","_","_"
6,"vyajanair","_","_","vyajana","NC","","_","_"
7,"api","_","_","api","CX","","_","_"
1,"sa","_","_","tad","PRD","","_","_"
2,"tu","_","_","tu","CCD","","_","_"
3,"dīrgheṇa","_","_","dīrgha","JJ","","_","_"
4,"kālena","_","_","kāla","NC","","_","_"
5,"pratyāśvasto","_","_","pratyāśvas","PPP","","_","_"
6,"mahīpatiḥ","_","_","mahīpati","NC","","_","_"
1,"tūṣṇīṃ","_","_","tūṣṇīm","CX","","_","_"
2,"dadhyau","_","_","dhyā","V","dhyā","_","_"
3,"mahīpālaḥ","_","_","mahīpāla","NC","","_","_"
4,"_","_","_","putra","NC","","_","_"
5,"_","_","_","vyasana","NC","","_","_"
6,"_","_","_","karśay","PPP","","_","_"
1,"niḥśvasañ","_","_","niḥśvas","KDP","","_","_"
2,"jihmaga","_","_","jihmaga","NC","","_","_"
3,"iva","_","_","iva","CCM","","_","_"
4,"_","_","_","kumbha","NC","","_","_"
5,"_","_","_","kṣip","PPP","","_","_"
6,"viśāṃ","_","_","viś","NC","","_","_"
7,"pate","_","_","pati","NC","","_","_"
1,"saṃjayo","_","_","saṃjaya","NC","","_","_"
2,"_","_","_","api","CX","","_","_"
3,"_","_","_","rod","V","rud","_","_"
4,"tatra","_","_","tatra","CAD","","_","_"
5,"dṛṣṭvā","_","_","dṛś","CGDA","","_","_"
6,"rājānam","_","_","rājan","NC","","_","_"
7,"āturam","_","_","ātura","JJ","","_","_"
1,"tathā","_","_","tathā","CX","","_","_"
2,"sarvāḥ","_","_","sarva","JQ","","_","_"
3,"_","_","_","strī","NC","","_","_"
4,"_","_","_","ca","CCD","","_","_"
5,"_","_","_","eva","CEM","","_","_"
6,"gāndhārī","_","_","gāndhārī","NC","","_","_"
7,"ca","_","_","ca","CCD","","_","_"
8,"yaśasvinī","_","_","yaśasvin","JJ","","_","_"
1,"tato","_","_","tatas","CX","","_","_"
2,"dīrgheṇa","_","_","dīrgha","JJ","","_","_"
3,"kālena","_","_","kāla","NC","","_","_"
4,"viduraṃ","_","_","vidura","NC","","_","_"
5,"vākyam","_","_","vākya","NC","","_","_"
6,"abravīt","_","_","abravīta","V","brū","_","_"
1,"dhṛtarāṣṭro","_","_","dhṛtarāṣṭra","NC","","_","_"
2,"_","_","_","nara","NC","","_","_"
3,"_","_","_","vyāghra","NC","","_","_"
4,"muhyamāno","_","_","muh","KDP","","_","_"
5,"muhur","_","_","muhur","CX","","_","_"
6,"muhuḥ","_","_","muhur","CX","","_","_"
1,"gacchantu","_","_","gacch","V","gam","_","_"
2,"yoṣitaḥ","_","_","yoṣit","NC","","_","_"
3,"sarvā","_","_","sarva","JQ","","_","_"
4,"gāndhārī","_","_","gāndhārī","NC","","_","_"
5,"ca","_","_","ca","CCD","","_","_"
6,"yaśasvinī","_","_","yaśasvin","JJ","","_","_"
1,"_","_","_","tathā","CX","","_","_"
2,"_","_","_","ida","PRD","","_","_"
3,"suhṛdaḥ","_","_","suhṛd","NC","","_","_"
4,"sarve","_","_","sarva","JQ","","_","_"
5,"bhraśyate","_","_","bhraṃś","V","bhraṃś","_","_"
6,"me","_","_","mat","PPR","","_","_"
7,"mano","_","_","manas","NC","","_","_"
8,"bhṛśam","_","_","bhṛśa","CX","","_","_"
1,"evam","_","_","eva","CX","","_","_"
2,"_","_","_","vac","PPP","","_","_"
3,"_","_","_","tatas","CX","","_","_"
4,"kṣattā","_","_","kṣattṛ","NC","","_","_"
5,"tāḥ","_","_","tad","PRD","","_","_"
6,"striyo","_","_","strī","NC","","_","_"
7,"_","_","_","bharata","NC","","_","_"
8,"_","_","_","ṛṣabha","NC","","_","_"
1,"visarjayāmāsa","_","_","visarjay","V","visarjay","_","_"
2,"śanair","_","_","śanais","CX","","_","_"
3,"vepamānaḥ","_","_","vip","KDP","","_","_"
4,"punaḥ","_","_","punar","CAD","","_","_"
5,"punaḥ","_","_","punar","CAD","","_","_"
1,"_","_","_","niṣkra","V","niṣkra","_","_"
2,"_","_","_","tatas","CX","","_","_"
3,"_","_","_","sarva","JQ","","_","_"
4,"_","_","_","tad","PRD","","_","_"
5,"striyo","_","_","strī","NC","","_","_"
6,"_","_","_","bharata","NC","","_","_"
7,"_","_","_","ṛṣabha","NC","","_","_"
1,"_","_","_","suhṛd","NC","","_","_"
2,"_","_","_","ca","CCD","","_","_"
3,"tataḥ","_","_","tatas","CX","","_","_"
4,"sarve","_","_","sarva","JQ","","_","_"
5,"dṛṣṭvā","_","_","dṛś","CGDA","","_","_"
6,"rājānam","_","_","rājan","NC","","_","_"
7,"āturam","_","_","ātura","JJ","","_","_"
1,"tato","_","_","tatas","CX","","_","_"
2,"narapatiṃ","_","_","narapati","NC","","_","_"
3,"tatra","_","_","tatra","CAD","","_","_"
4,"_","_","_","labh","PPP","","_","_"
5,"_","_","_","saṃjñā","NC","","_","_"
6,"paraṃtapa","_","_","paraṃtapa","JJ","","_","_"
1,"avekṣya","_","_","avekṣ","CGDA","","_","_"
2,"saṃjayo","_","_","saṃjaya","NC","","_","_"
3,"dīno","_","_","dīna","JJ","","_","_"
4,"rodamānaṃ","_","_","rud","KDP","","_","_"
5,"_","_","_","bhṛśa","JJ","","_","_"
6,"_","_","_","ātura","JJ","","_","_"
1,"prāñjalir","_","_","prāñjali","JJ","","_","_"
2,"niḥśvasantaṃ","_","_","niḥśvas","KDP","","_","_"
3,"ca","_","_","ca","CCD","","_","_"
4,"taṃ","_","_","tad","PRD","","_","_"
5,"narendraṃ","_","_","narendra","NC","","_","_"
6,"muhur","_","_","muhur","CX","","_","_"
7,"muhuḥ","_","_","muhur","CX","","_","_"
1,"samāśvāsayata","_","_","samāśvāsay","V","samāśvāsay","_","_"
2,"kṣattā","_","_","kṣattṛ","NC","","_","_"
3,"vacasā","_","_","vacas","NC","","_","_"
4,"madhureṇa","_","_","madhura","JJ","","_","_"
5,"ha","_","_","ha","CEM","","_","_"
