"WordID","word","NormSTEM","suffix","lemma","PoS","Root","NormSuffix","NormWord"
1,"saṃjaya","_","_","saṃjaya","NC","","_","_"
2,"uvāca","_","_","vak","V","vac","_","_"
1,"bhīmasenaṃ","_","_","bhīmasa","NC","","_","_"
2,"tato","_","_","tatas","CX","","_","_"
3,"drauṇī","_","_","drauṇi","NC","","_","_"
4,"rājan","_","_","rājan","NC","","_","_"
5,"vivyādha","_","_","vyadh","V","vyadh","_","_"
6,"patriṇā","_","_","pattrin","NC","","_","_"
1,"tvarayā","_","_","tvarā","NC","","_","_"
2,"parayā","_","_","para","PPX","","_","_"
3,"yukto","_","_","yuj","PPP","","_","_"
4,"darśayann","_","_","darśay","KDP","","_","_"
5,"_","_","_","astra","NC","","_","_"
6,"_","_","_","lāghava","NC","","_","_"
1,"_","_","_","atha","CAD","","_","_"
2,"_","_","_","a","PRD","","_","_"
3,"punar","_","_","punar","CAD","","_","_"
4,"ājaghne","_","_","āhan","V","āhan","_","_"
5,"navatyā","_","_","navati","NC","","_","_"
6,"niśitaiḥ","_","_","niśā","PPP","","_","_"
7,"śaraiḥ","_","_","śara","NC","","_","_"
1,"_","_","_","sarva","JQ","","_","_"
2,"_","_","_","marman","NC","","_","_"
3,"samprekṣya","_","_","samprekṣ","CGDA","","_","_"
4,"_","_","_","marman","NC","","_","_"
5,"_","_","_","jña","JJ","","_","_"
6,"_","_","_","laghu","JJ","","_","_"
7,"_","_","_","hasta","NC","","_","_"
8,"_","_","_","vat","CX","","_","_"
1,"bhīmasenaḥ","_","_","bhīmasa","NC","","_","_"
2,"samākīrṇo","_","_","samākṛ","PPP","","_","_"
3,"drauṇinā","_","_","drauṇi","NC","","_","_"
4,"niśitaiḥ","_","_","niśā","PPP","","_","_"
5,"śaraiḥ","_","_","śara","NC","","_","_"
1,"rarāja","_","_","rāj","V","rāj","_","_"
2,"samare","_","_","samara","NC","","_","_"
3,"rājan","_","_","rājan","NC","","_","_"
4,"raśmivān","_","_","raśmivat","JJ","","_","_"
5,"iva","_","_","iva","CCM","","_","_"
6,"bhāskaraḥ","_","_","bhāskara","NC","","_","_"
1,"tataḥ","_","_","tatas","CX","","_","_"
2,"_","_","_","śara","NC","","_","_"
3,"_","_","_","sahasra","NUM","","_","_"
4,"_","_","_","su","CAD","","_","_"
5,"_","_","_","prayuj","PPP","","_","_"
6,"pāṇḍavaḥ","_","_","pāṇḍava","NC","","_","_"
1,"droṇaputram","_","_","droṇaputra","NC","","_","_"
2,"avacchādya","_","_","avacchāday","CGDA","","_","_"
3,"siṃhanādam","_","_","siṃhanāda","NC","","_","_"
4,"amuñcata","_","_","muñc","V","muc","_","_"
1,"śaraiḥ","_","_","śara","NC","","_","_"
2,"śarāṃs","_","_","śara","NC","","_","_"
3,"tato","_","_","tatas","CX","","_","_"
4,"drauṇiḥ","_","_","drauṇi","NC","","_","_"
5,"saṃvārya","_","_","saṃvāray","CGDA","","_","_"
6,"yudhi","_","_","yudh","NC","","_","_"
7,"pāṇḍavam","_","_","pāṇḍava","NC","","_","_"
1,"lalāṭe","_","_","lalāṭa","NC","","_","_"
2,"'bhyahanad","_","_","abhihan","V","abhihan","_","_"
3,"rājan","_","_","rājan","NC","","_","_"
4,"nārācena","_","_","nārāca","NC","","_","_"
5,"smayann","_","_","smi","KDP","","_","_"
6,"iva","_","_","iva","CCM","","_","_"
1,"_","_","_","lalāṭa","NC","","_","_"
2,"_","_","_","stha","JJ","","_","_"
3,"tato","_","_","tatas","CX","","_","_"
4,"bāṇaṃ","_","_","bāṇa","NC","","_","_"
5,"dhārayāmāsa","_","_","dhāray","V","dhāray","_","_"
6,"pāṇḍavaḥ","_","_","pāṇḍava","NC","","_","_"
1,"yathā","_","_","yathā","CCM","","_","_"
2,"śṛṅgaṃ","_","_","śṛṅga","NC","","_","_"
3,"vane","_","_","vana","NC","","_","_"
4,"dṛptaḥ","_","_","dṛp","PPP","","_","_"
5,"khaḍgo","_","_","khaḍga","NC","","_","_"
6,"dhārayate","_","_","dhar","V","dhṛ","_","_"
7,"nṛpa","_","_","nṛpa","NC","","_","_"
1,"tato","_","_","tatas","CX","","_","_"
2,"drauṇiṃ","_","_","drauṇi","NC","","_","_"
3,"raṇe","_","_","raṇa","NC","","_","_"
4,"bhīmo","_","_","bhīma","NC","","_","_"
5,"yatamānaṃ","_","_","yat","KDP","","_","_"
6,"parākramī","_","_","parākramin","JJ","","_","_"
1,"tribhir","_","_","tri","NUM","","_","_"
2,"vivyādha","_","_","vyadh","V","vyadh","_","_"
3,"nārācair","_","_","nārāca","NC","","_","_"
4,"lalāṭe","_","_","lalāṭa","NC","","_","_"
5,"vismayann","_","_","vismi","KDP","","_","_"
6,"iva","_","_","iva","CCM","","_","_"
1,"_","_","_","lalāṭa","NC","","_","_"
2,"_","_","_","stha","JJ","","_","_"
3,"tato","_","_","tatas","CX","","_","_"
4,"bāṇair","_","_","bāṇa","NC","","_","_"
5,"brāhmaṇaḥ","_","_","brāhmaṇa","NC","","_","_"
6,"sa","_","_","tad","PRD","","_","_"
7,"vyarocata","_","_","viroc","V","viruc","_","_"
1,"_","_","_","prāvṛṣ","NC","","_","_"
2,"_","_","_","iva","CCM","","_","_"
3,"yathā","_","_","yathā","CCM","","_","_"
4,"siktas","_","_","sic","PPP","","_","_"
5,"triśṛṅgaḥ","_","_","triśṛṅga","NC","","_","_"
6,"_","_","_","parvata","NC","","_","_"
7,"_","_","_","uttama","JJ","","_","_"
1,"tataḥ","_","_","tatas","CX","","_","_"
2,"_","_","_","śara","NC","","_","_"
3,"_","_","_","śata","NUM","","_","_"
4,"drauṇim","_","_","drauṇi","NC","","_","_"
5,"ardayāmāsa","_","_","arday","V","arday","_","_"
6,"pāṇḍavaḥ","_","_","pāṇḍava","NC","","_","_"
1,"na","_","_","na","CNG","","_","_"
2,"_","_","_","ca","CCD","","_","_"
3,"_","_","_","a","PRD","","_","_"
4,"kampayāmāsa","_","_","kampay","V","kampay","_","_"
5,"_","_","_","mātariśvan","NC","","_","_"
6,"_","_","_","iva","CCM","","_","_"
7,"parvatam","_","_","parvata","NC","","_","_"
1,"_","_","_","tathā","CX","","_","_"
2,"_","_","_","eva","CEM","","_","_"
3,"pāṇḍavaṃ","_","_","pāṇḍava","NC","","_","_"
4,"yuddhe","_","_","yuddha","NC","","_","_"
5,"drauṇiḥ","_","_","drauṇi","NC","","_","_"
6,"_","_","_","śara","NC","","_","_"
7,"_","_","_","śata","NUM","","_","_"
8,"śitaiḥ","_","_","śā","PPP","","_","_"
1,"_","_","_","na","CNG","","_","_"
2,"_","_","_","kampay","V","kampay","_","_"
3,"saṃhṛṣṭo","_","_","saṃhṛṣ","PPP","","_","_"
4,"_","_","_","vāri","NC","","_","_"
5,"_","_","_","ogha","NC","","_","_"
6,"iva","_","_","iva","CCM","","_","_"
7,"parvatam","_","_","parvata","NC","","_","_"
1,"tāv","_","_","tad","PRD","","_","_"
2,"anyonyaṃ","_","_","anyonya","PRC","","_","_"
3,"śarair","_","_","śara","NC","","_","_"
4,"ghoraiś","_","_","ghora","JJ","","_","_"
5,"chādayānau","_","_","chāday","KDP","","_","_"
6,"_","_","_","mahat","JJ","","_","_"
7,"_","_","_","ratha","NC","","_","_"
1,"_","_","_","ratha","NC","","_","_"
2,"_","_","_","caryā","NC","","_","_"
3,"_","_","_","ga","PPP","","_","_"
4,"śūrau","_","_","śūra","NC","","_","_"
5,"śuśubhāte","_","_","śuśubh","V","śuśubh","_","_"
6,"_","_","_","raṇa","NC","","_","_"
7,"_","_","_","utkaṭa","JJ","","_","_"
1,"ādityāv","_","_","āditya","NC","","_","_"
2,"iva","_","_","iva","CCM","","_","_"
3,"saṃdīptau","_","_","saṃdīp","PPP","","_","_"
4,"_","_","_","loka","NC","","_","_"
5,"_","_","_","kṣaya","NC","","_","_"
6,"_","_","_","kara","JJ","","_","_"
7,"ubhau","_","_","ubh","PPX","","_","_"
1,"_","_","_","sva","JJ","","_","_"
2,"_","_","_","raśmi","NC","","_","_"
3,"_","_","_","iva","CCM","","_","_"
4,"_","_","_","anyonya","PRC","","_","_"
5,"tāpayantau","_","_","tāpay","KDP","","_","_"
6,"_","_","_","śara","NC","","_","_"
7,"_","_","_","uttama","JJ","","_","_"
1,"_","_","_","kṛ","PPP","","_","_"
2,"_","_","_","pratikṛ","PPP","","_","_"
3,"yatnaṃ","_","_","yatna","NC","","_","_"
4,"kurvāṇau","_","_","kṛ","KDP","","_","_"
5,"ca","_","_","ca","CCD","","_","_"
6,"_","_","_","mahat","JJ","","_","_"
7,"_","_","_","raṇa","NC","","_","_"
1,"_","_","_","kṛ","PPP","","_","_"
2,"_","_","_","pratikṛ","PPP","","_","_"
3,"yatnaṃ","_","_","yatna","NC","","_","_"
4,"cakrāte","_","_","kar","V","kṛ","_","_"
5,"tāv","_","_","tad","PRD","","_","_"
6,"_","_","_","a","CNG","","_","_"
7,"_","_","_","bhī","PPP","","_","_"
8,"_","_","_","vat","CX","","_","_"
1,"vyāghrāv","_","_","vyāghra","NC","","_","_"
2,"iva","_","_","iva","CCM","","_","_"
3,"ca","_","_","ca","CCD","","_","_"
4,"saṃgrāme","_","_","saṃgrāma","NC","","_","_"
5,"ceratus","_","_","car","V","car","_","_"
6,"tau","_","_","tad","PRD","","_","_"
7,"_","_","_","mahat","JJ","","_","_"
8,"_","_","_","ratha","NC","","_","_"
1,"_","_","_","śara","NC","","_","_"
2,"_","_","_","daṃṣṭra","NC","","_","_"
3,"durādharṣau","_","_","durādharṣa","JJ","","_","_"
4,"_","_","_","cāpa","NC","","_","_"
5,"_","_","_","vyādā","PPP","","_","_"
6,"bhayānakau","_","_","bhayānaka","JJ","","_","_"
1,"abhūtāṃ","_","_","bhav","V","bhū","_","_"
2,"tāv","_","_","tad","PRD","","_","_"
3,"adṛśyau","_","_","adṛśya","JJ","","_","_"
4,"ca","_","_","ca","CCD","","_","_"
5,"_","_","_","śara","NC","","_","_"
6,"_","_","_","jāla","NC","","_","_"
7,"samantataḥ","_","_","samantataḥ","CX","","_","_"
1,"_","_","_","megha","NC","","_","_"
2,"_","_","_","jāla","NC","","_","_"
3,"iva","_","_","iva","CCM","","_","_"
4,"channau","_","_","chad","PPP","","_","_"
5,"gagane","_","_","gagana","NC","","_","_"
6,"_","_","_","candra","NC","","_","_"
7,"_","_","_","bhāskara","NC","","_","_"
1,"prakāśau","_","_","prakāśa","JJ","","_","_"
2,"ca","_","_","ca","CCD","","_","_"
3,"muhūrtena","_","_","muhūrta","NC","","_","_"
4,"_","_","_","tatra","CAD","","_","_"
5,"_","_","_","eva","CEM","","_","_"
6,"_","_","_","as","V","as","_","_"
7,"ariṃdamau","_","_","ariṃdama","JJ","","_","_"
1,"vimuktau","_","_","vimuc","PPP","","_","_"
2,"_","_","_","megha","NC","","_","_"
3,"_","_","_","jāla","NC","","_","_"
4,"_","_","_","śaśin","NC","","_","_"
5,"_","_","_","sūrya","NC","","_","_"
6,"yathā","_","_","yathā","CCM","","_","_"
7,"divi","_","_","div","NC","","_","_"
1,"apasavyaṃ","_","_","apasavya","JJ","","_","_"
2,"tataś","_","_","tatas","CX","","_","_"
3,"cakre","_","_","kar","V","kṛ","_","_"
4,"drauṇis","_","_","drauṇi","NC","","_","_"
5,"tatra","_","_","tatra","CAD","","_","_"
6,"vṛkodaram","_","_","vṛkodara","NC","","_","_"
1,"kirañ","_","_","kṛ","KDP","","_","_"
2,"_","_","_","śara","NC","","_","_"
3,"_","_","_","śata","NUM","","_","_"
4,"ugrair","_","_","ugra","JJ","","_","_"
5,"dhārābhir","_","_","dhārā","NC","","_","_"
6,"iva","_","_","iva","CCM","","_","_"
7,"parvatam","_","_","parvata","NC","","_","_"
1,"na","_","_","na","CNG","","_","_"
2,"tu","_","_","tu","CCD","","_","_"
3,"tan","_","_","tad","PRD","","_","_"
4,"mamṛṣe","_","_","mṛṣ","V","mṛṣ","_","_"
5,"bhīmaḥ","_","_","bhīma","NC","","_","_"
6,"śatror","_","_","śatru","NC","","_","_"
7,"_","_","_","vijaya","NC","","_","_"
8,"_","_","_","lakṣaṇa","NC","","_","_"
1,"praticakre","_","_","pratikar","V","pratikṛ","_","_"
2,"ca","_","_","ca","CCD","","_","_"
3,"taṃ","_","_","tad","PRD","","_","_"
4,"rājan","_","_","rājan","NC","","_","_"
5,"pāṇḍavo","_","_","pāṇḍava","NC","","_","_"
6,"'py","_","_","api","CX","","_","_"
7,"apasavyataḥ","_","_","apasavya","JJ","","_","_"
1,"maṇḍalānāṃ","_","_","maṇḍala","NC","","_","_"
2,"vibhāgeṣu","_","_","vibhāga","NC","","_","_"
3,"_","_","_","ga","PPP","","_","_"
4,"_","_","_","pratyāga","PPP","","_","_"
5,"ca","_","_","ca","CCD","","_","_"
1,"babhūva","_","_","bhav","V","bhū","_","_"
2,"tumulaṃ","_","_","tumula","JJ","","_","_"
3,"yuddhaṃ","_","_","yuddha","NC","","_","_"
4,"tayos","_","_","tad","PRD","","_","_"
5,"tatra","_","_","tatra","CAD","","_","_"
6,"_","_","_","mahat","JJ","","_","_"
7,"_","_","_","mṛdha","NC","","_","_"
1,"caritvā","_","_","car","CGDA","","_","_"
2,"vividhān","_","_","vividha","JJ","","_","_"
3,"mārgān","_","_","mārga","NC","","_","_"
4,"maṇḍalaṃ","_","_","maṇḍala","NC","","_","_"
5,"sthānam","_","_","sthāna","NC","","_","_"
6,"eva","_","_","eva","CEM","","_","_"
7,"ca","_","_","ca","CCD","","_","_"
1,"śaraiḥ","_","_","śara","NC","","_","_"
2,"_","_","_","pṛ","PPP","","_","_"
3,"_","_","_","āya","PPP","","_","_"
4,"_","_","_","utsṛj","PPP","","_","_"
5,"anyonyam","_","_","anyonya","PRC","","_","_"
6,"abhijaghnatuḥ","_","_","abhihan","V","abhihan","_","_"
1,"anyonyasya","_","_","anyonya","PRC","","_","_"
2,"vadhe","_","_","vadha","NC","","_","_"
3,"yatnaṃ","_","_","yatna","NC","","_","_"
4,"cakratus","_","_","kar","V","kṛ","_","_"
5,"tau","_","_","tad","PRD","","_","_"
6,"_","_","_","mahat","JJ","","_","_"
7,"_","_","_","ratha","NC","","_","_"
1,"īṣatur","_","_","iṣ","V","iṣ","_","_"
2,"virathaṃ","_","_","viratha","JJ","","_","_"
3,"_","_","_","ca","CCD","","_","_"
4,"_","_","_","eva","CEM","","_","_"
5,"kartum","_","_","kṛ","CGDI","","_","_"
6,"anyonyam","_","_","anyonya","PRC","","_","_"
7,"āhave","_","_","āhava","NC","","_","_"
1,"tato","_","_","tatas","CX","","_","_"
2,"drauṇir","_","_","drauṇi","NC","","_","_"
3,"_","_","_","mahat","JJ","","_","_"
4,"_","_","_","astra","NC","","_","_"
5,"prāduścakre","_","_","prāduṣkṛ","V","prāduṣkṛ","_","_"
6,"_","_","_","mahat","JJ","","_","_"
7,"_","_","_","ratha","NC","","_","_"
1,"tāny","_","_","tad","PRD","","_","_"
2,"astrair","_","_","astra","NC","","_","_"
3,"eva","_","_","eva","CEM","","_","_"
4,"samare","_","_","samara","NC","","_","_"
5,"pratijaghne","_","_","pratihan","V","pratihan","_","_"
6,"'sya","_","_","ida","PRD","","_","_"
7,"pāṇḍavaḥ","_","_","pāṇḍava","NC","","_","_"
1,"tato","_","_","tatas","CX","","_","_"
2,"ghoraṃ","_","_","ghora","JJ","","_","_"
3,"_","_","_","mahat","JJ","","_","_"
4,"_","_","_","rāja","NC","","_","_"
5,"_","_","_","astra","NC","","_","_"
6,"_","_","_","yuddha","NC","","_","_"
7,"avartata","_","_","vart","V","vṛt","_","_"
1,"_","_","_","graha","NC","","_","_"
2,"_","_","_","yuddha","NC","","_","_"
3,"yathā","_","_","yathā","CCM","","_","_"
4,"ghoraṃ","_","_","ghora","JJ","","_","_"
5,"_","_","_","prajā","NC","","_","_"
6,"_","_","_","saṃharaṇa","NC","","_","_"
7,"abhūt","_","_","bhav","V","bhū","_","_"
1,"te","_","_","tad","PRD","","_","_"
2,"bāṇāḥ","_","_","bāṇa","NC","","_","_"
3,"samasajjanta","_","_","saṃsañj","V","saṃsañj","_","_"
4,"kṣiptās","_","_","kṣip","PPP","","_","_"
5,"tābhyāṃ","_","_","tad","PRD","","_","_"
6,"tu","_","_","tu","CCD","","_","_"
7,"bhārata","_","_","bhārata","NC","","_","_"
1,"dyotayanto","_","_","dyotay","KDP","","_","_"
2,"diśaḥ","_","_","diś","NC","","_","_"
3,"sarvās","_","_","sarva","JQ","","_","_"
4,"tac","_","_","tad","PRD","","_","_"
5,"ca","_","_","ca","CCD","","_","_"
6,"sainyaṃ","_","_","sainya","NC","","_","_"
7,"samantataḥ","_","_","samantataḥ","CX","","_","_"
1,"_","_","_","bāṇa","NC","","_","_"
2,"_","_","_","saṃgha","NC","","_","_"
3,"_","_","_","āvṛ","PPP","","_","_"
4,"ghoram","_","_","ghora","JJ","","_","_"
5,"ākāśaṃ","_","_","ākāśa","NC","","_","_"
6,"samapadyata","_","_","saṃpad","V","saṃpad","_","_"
1,"_","_","_","ulkā","NC","","_","_"
2,"_","_","_","pāta","NC","","_","_"
3,"_","_","_","kṛ","PPP","","_","_"
4,"yadvat","_","_","yadvat","CX","","_","_"
5,"prajānāṃ","_","_","prajā","NC","","_","_"
6,"saṃkṣaye","_","_","saṃkṣaya","NC","","_","_"
7,"nṛpa","_","_","nṛpa","NC","","_","_"
1,"_","_","_","bāṇa","NC","","_","_"
2,"_","_","_","abhighāta","NC","","_","_"
3,"saṃjajñe","_","_","saṃjan","V","saṃjan","_","_"
4,"tatra","_","_","tatra","CAD","","_","_"
5,"bhārata","_","_","bhārata","NC","","_","_"
6,"pāvakaḥ","_","_","pāvaka","NC","","_","_"
1,"_","_","_","sa_saha","CX","","_","_"
2,"_","_","_","visphuliṅga","NC","","_","_"
3,"_","_","_","dīp","PPP","","_","_"
4,"_","_","_","arcis","NC","","_","_"
5,"so","_","_","tad","PRD","","_","_"
6,"'dahad","_","_","dah","V","dah","_","_"
7,"_","_","_","vāhinī","NC","","_","_"
8,"_","_","_","dvaya","NC","","_","_"
1,"tatra","_","_","tatra","CAD","","_","_"
2,"siddhā","_","_","siddha","NC","","_","_"
3,"_","_","_","mahat","JJ","","_","_"
4,"_","_","_","rāja","NC","","_","_"
5,"saṃpatanto","_","_","sampat","KDP","","_","_"
6,"'bruvan","_","_","abravīta","V","brū","_","_"
7,"vacaḥ","_","_","vacas","NC","","_","_"
1,"ati","_","_","ati","CADP","","_","_"
2,"yuddhāni","_","_","yuddha","NC","","_","_"
3,"sarvāṇi","_","_","sarva","JQ","","_","_"
4,"yuddham","_","_","yuddha","NC","","_","_"
5,"etat","_","_","tad","PRD","","_","_"
6,"tato","_","_","tatas","CX","","_","_"
7,"'dhikam","_","_","adhika","JJ","","_","_"
1,"_","_","_","sarva","JQ","","_","_"
2,"_","_","_","yuddha","NC","","_","_"
3,"_","_","_","ca","CCD","","_","_"
4,"_","_","_","tad","PRD","","_","_"
5,"kalāṃ","_","_","kalā","NC","","_","_"
6,"_","_","_","na","CNG","","_","_"
7,"_","_","_","arh","V","arh","_","_"
8,"ṣoḍaśīm","_","_","ṣoḍaśa","JJ","","_","_"
1,"_","_","_","na","CNG","","_","_"
2,"_","_","_","etādṛśa","JJ","","_","_"
3,"punar","_","_","punar","CAD","","_","_"
4,"yuddhaṃ","_","_","yuddha","NC","","_","_"
5,"na","_","_","na","CNG","","_","_"
6,"bhūtaṃ","_","_","bhū","PPP","","_","_"
7,"na","_","_","na","CNG","","_","_"
8,"bhaviṣyati","_","_","bhav","V","bhū","_","_"
1,"aho","_","_","aho","CX","","_","_"
2,"jñānena","_","_","jñāna","NC","","_","_"
3,"saṃyuktāv","_","_","saṃyuj","PPP","","_","_"
4,"ubhau","_","_","ubh","PPX","","_","_"
5,"_","_","_","ca","CCD","","_","_"
6,"_","_","_","ugra","JJ","","_","_"
7,"_","_","_","parākrama","NC","","_","_"
1,"aho","_","_","aho","CX","","_","_"
2,"bhīme","_","_","bhīma","NC","","_","_"
3,"balaṃ","_","_","bala","NC","","_","_"
4,"bhīmam","_","_","bhīma","JJ","","_","_"
5,"etayoś","_","_","tad","PRD","","_","_"
6,"ca","_","_","ca","CCD","","_","_"
7,"_","_","_","kṛtāstra","JJ","","_","_"
1,"aho","_","_","aho","CX","","_","_"
2,"vīryasya","_","_","vīrya","NC","","_","_"
3,"_","_","_","sāra","NC","","_","_"
5,"aho","_","_","aho","CX","","_","_"
6,"sauṣṭhavam","_","_","sauṣṭhava","NC","","_","_"
7,"etayoḥ","_","_","tad","PRD","","_","_"
1,"sthitāv","_","_","sthā","PPP","","_","_"
2,"etau","_","_","tad","PRD","","_","_"
3,"hi","_","_","hi","CX","","_","_"
4,"samare","_","_","samara","NC","","_","_"
5,"_","_","_","kāla","NC","","_","_"
6,"_","_","_","antaka","NC","","_","_"
7,"_","_","_","yama","NC","","_","_"
8,"_","_","_","upama","JJ","","_","_"
1,"rudrau","_","_","rudra","NC","","_","_"
2,"dvāv","_","_","dvi","NUM","","_","_"
3,"iva","_","_","iva","CCM","","_","_"
4,"sambhūtau","_","_","sambhū","PPP","","_","_"
5,"yathā","_","_","yathā","CCM","","_","_"
6,"dvāv","_","_","dvi","NUM","","_","_"
7,"iva","_","_","iva","CCM","","_","_"
8,"bhāskarau","_","_","bhāskara","NC","","_","_"
1,"yamau","_","_","yama","NC","","_","_"
2,"vā","_","_","vā","CCD","","_","_"
3,"_","_","_","puruṣa","NC","","_","_"
4,"_","_","_","vyāghra","NC","","_","_"
5,"_","_","_","ghora","JJ","","_","_"
6,"_","_","_","rūpa","NC","","_","_"
7,"imau","_","_","ida","PRD","","_","_"
8,"raṇe","_","_","raṇa","NC","","_","_"
1,"śrūyante","_","_","śṛṇ","V","śru","_","_"
2,"sma","_","_","sma","CX","","_","_"
3,"tadā","_","_","tadā","CAD","","_","_"
4,"vācaḥ","_","_","vāc","NC","","_","_"
5,"siddhānāṃ","_","_","siddha","NC","","_","_"
6,"vai","_","_","vai","CX","","_","_"
7,"muhur","_","_","muhur","CX","","_","_"
8,"muhuḥ","_","_","muhur","CX","","_","_"
1,"siṃhanādaś","_","_","siṃhanāda","NC","","_","_"
2,"ca","_","_","ca","CCD","","_","_"
3,"saṃjajñe","_","_","saṃjan","V","saṃjan","_","_"
4,"sametānāṃ","_","_","same","PPP","","_","_"
5,"divaukasām","_","_","divaukas","NC","","_","_"
1,"adbhutaṃ","_","_","adbhuta","JJ","","_","_"
2,"_","_","_","ca","CCD","","_","_"
3,"_","_","_","api","CX","","_","_"
4,"acintyaṃ","_","_","acintya","JJ","","_","_"
5,"ca","_","_","ca","CCD","","_","_"
6,"dṛṣṭvā","_","_","dṛś","CGDA","","_","_"
7,"karma","_","_","karman","NC","","_","_"
8,"tayor","_","_","tad","PRD","","_","_"
9,"mṛdhe","_","_","mṛdha","NC","","_","_"
1,"tau","_","_","tad","PRD","","_","_"
2,"śūrau","_","_","śūra","NC","","_","_"
3,"samare","_","_","samara","NC","","_","_"
4,"rājan","_","_","rājan","NC","","_","_"
5,"_","_","_","paraspara","PRC","","_","_"
6,"_","_","_","kṛ","PPP","","_","_"
7,"_","_","_","āgas","NC","","_","_"
1,"parasparam","_","_","paraspara","PRC","","_","_"
2,"udaikṣetāṃ","_","_","udīkṣ","V","udīkṣ","_","_"
3,"krodhād","_","_","krodha","NC","","_","_"
4,"udvṛtya","_","_","udvṛt","CGDA","","_","_"
5,"cakṣuṣī","_","_","cakṣus","NC","","_","_"
1,"_","_","_","krodha","NC","","_","_"
2,"_","_","_","rañj","PPP","","_","_"
3,"_","_","_","īkṣaṇa","NC","","_","_"
4,"tau","_","_","tad","PRD","","_","_"
5,"tu","_","_","tu","CCD","","_","_"
6,"krodhāt","_","_","krodha","NC","","_","_"
7,"_","_","_","prasphur","PPP","","_","_"
8,"_","_","_","adhara","NC","","_","_"
1,"krodhāt","_","_","krodha","NC","","_","_"
2,"_","_","_","saṃdaṃś","PPP","","_","_"
3,"_","_","_","daśana","NC","","_","_"
4,"_","_","_","saṃdaṃś","PPP","","_","_"
5,"_","_","_","daśanacchada","NC","","_","_"
1,"anyonyaṃ","_","_","anyonya","PRC","","_","_"
2,"chādayantau","_","_","chāday","KDP","","_","_"
3,"sma","_","_","sma","CX","","_","_"
4,"_","_","_","śara","NC","","_","_"
5,"_","_","_","vṛṣṭi","NC","","_","_"
6,"_","_","_","mahat","JJ","","_","_"
7,"_","_","_","ratha","NC","","_","_"
1,"_","_","_","śara","NC","","_","_"
2,"_","_","_","ambu","NC","","_","_"
3,"_","_","_","dhārā","NC","","_","_"
4,"samare","_","_","samara","NC","","_","_"
5,"_","_","_","śastra","NC","","_","_"
6,"_","_","_","vidyut","NC","","_","_"
7,"_","_","_","prakāśin","JJ","","_","_"
1,"tāv","_","_","tad","PRD","","_","_"
2,"anyonyaṃ","_","_","anyonya","PRC","","_","_"
3,"dhvajau","_","_","dhvaja","NC","","_","_"
4,"viddhvā","_","_","vyadh","CGDA","","_","_"
5,"sārathī","_","_","sārathi","NC","","_","_"
6,"ca","_","_","ca","CCD","","_","_"
7,"_","_","_","mahat","JJ","","_","_"
8,"_","_","_","ratha","NC","","_","_"
1,"anyonyasya","_","_","anyonya","PRC","","_","_"
2,"hayān","_","_","haya","NC","","_","_"
3,"viddhvā","_","_","vyadh","CGDA","","_","_"
4,"bibhidāte","_","_","bhid","V","bhid","_","_"
5,"parasparam","_","_","paraspara","PRC","","_","_"
1,"tataḥ","_","_","tatas","CX","","_","_"
2,"kruddhau","_","_","krudh","PPP","","_","_"
3,"_","_","_","mahat","JJ","","_","_"
4,"_","_","_","rāja","NC","","_","_"
5,"bāṇau","_","_","bāṇa","NC","","_","_"
6,"gṛhya","_","_","grah","CGDA","","_","_"
7,"_","_","_","mahat","JJ","","_","_"
8,"_","_","_","āhava","NC","","_","_"
1,"ubhau","_","_","ubh","PPX","","_","_"
2,"cikṣipatus","_","_","kṣip","V","kṣip","_","_"
3,"tūrṇam","_","_","tūrṇa","CX","","_","_"
4,"anyonyasya","_","_","anyonya","PRC","","_","_"
5,"_","_","_","vadha","NC","","_","_"
6,"_","_","_","eṣin","JJ","","_","_"
1,"tau","_","_","tad","PRD","","_","_"
2,"sāyakau","_","_","sāyaka","NC","","_","_"
3,"_","_","_","mahat","JJ","","_","_"
4,"_","_","_","rāja","NC","","_","_"
5,"dyotamānau","_","_","dyut","KDP","","_","_"
6,"_","_","_","camū","NC","","_","_"
7,"_","_","_","mukha","NC","","_","_"
1,"ājaghnāte","_","_","āhan","V","āhan","_","_"
2,"samāsādya","_","_","samāsāday","CGDA","","_","_"
3,"_","_","_","vajra","NC","","_","_"
4,"_","_","_","vega","NC","","_","_"
5,"durāsadau","_","_","durāsada","JJ","","_","_"
1,"tau","_","_","tad","PRD","","_","_"
2,"_","_","_","paraspara","PRC","","_","_"
3,"_","_","_","vega","NC","","_","_"
4,"ca","_","_","ca","CCD","","_","_"
5,"śarābhyāṃ","_","_","śara","NC","","_","_"
6,"ca","_","_","ca","CCD","","_","_"
7,"_","_","_","bhṛśa","JJ","","_","_"
8,"_","_","_","āhan","PPP","","_","_"
1,"nipetatur","_","_","nipat","V","nipat","_","_"
2,"_","_","_","mahat","JJ","","_","_"
3,"_","_","_","vīra","NC","","_","_"
4,"_","_","_","sva","JJ","","_","_"
5,"_","_","_","rathopastha","NC","","_","_"
6,"tadā","_","_","tadā","CAD","","_","_"
1,"tatas","_","_","tatas","CX","","_","_"
2,"tu","_","_","tu","CCD","","_","_"
3,"sārathir","_","_","sārathi","NC","","_","_"
4,"jñātvā","_","_","jñā","CGDA","","_","_"
5,"droṇaputram","_","_","droṇaputra","NC","","_","_"
6,"acetanam","_","_","acetana","JJ","","_","_"
1,"apovāha","_","_","apavah","V","apavah","_","_"
2,"raṇād","_","_","raṇa","NC","","_","_"
3,"rājan","_","_","rājan","NC","","_","_"
4,"_","_","_","sarva","JQ","","_","_"
5,"_","_","_","kṣatra","NC","","_","_"
6,"paśyataḥ","_","_","dṛś","KDP","","_","_"
1,"_","_","_","tathā","CX","","_","_"
2,"_","_","_","eva","CEM","","_","_"
3,"pāṇḍavaṃ","_","_","pāṇḍava","NC","","_","_"
4,"rājan","_","_","rājan","NC","","_","_"
5,"vihvalantaṃ","_","_","vihval","KDP","","_","_"
6,"muhur","_","_","muhur","CX","","_","_"
7,"muhuḥ","_","_","muhur","CX","","_","_"
1,"apovāha","_","_","apavah","V","apavah","_","_"
2,"_","_","_","ratha","NC","","_","_"
3,"_","_","_","āji","NC","","_","_"
4,"sārathiḥ","_","_","sārathi","NC","","_","_"
5,"_","_","_","śatru","NC","","_","_"
6,"_","_","_","tāpana","JJ","","_","_"
