"WordID","word","NormSTEM","suffix","lemma","PoS","Root","NormSuffix","NormWord"
1,"te","_","_","tad","PRD","","_","_"
2,"vā","_","_","vai","CX","","_","_"
3,"ime","_","_","ida","PRD","","_","_"
4,"itare","_","_","itara","PPX","","_","_"
5,"chandasī","_","_","chandas","NC","","_","_"
6,"gāyatrīm","_","_","gāyatrī","NC","","_","_"
7,"abhyavadetāṃ","_","_","abhivad","V","abhivad","_","_"
8,"vittaṃ","_","_","vitta","NC","","_","_"
9,"nāv","_","_","mat","PPR","","_","_"
10,"akṣarāṇy","_","_","akṣara","NC","","_","_"
11,"anuparyāgur","_","_","anuparyāgā","V","anuparyāgā","_","_"
12,"iti","_","_","iti","CQT","","_","_"
13,"_","_","_","na","CNG","","_","_"
14,"_","_","_","iti","CQT","","_","_"
15,"abravīd","_","_","abravīta","V","brū","_","_"
16,"gāyatrī","_","_","gāyatrī","NC","","_","_"
17,"yathāvittam","_","_","yathāvitta","CX","","_","_"
18,"eva","_","_","eva","CEM","","_","_"
19,"na","_","_","mat","PPR","","_","_"
20,"iti","_","_","iti","CQT","","_","_"
21,"te","_","_","tad","PRD","","_","_"
22,"deveṣu","_","_","deva","NC","","_","_"
23,"praśnam","_","_","praśna","NC","","_","_"
24,"aitāṃ","_","_","e","V","e","_","_"
25,"te","_","_","tad","PRD","","_","_"
26,"devā","_","_","deva","NC","","_","_"
27,"abruvan","_","_","abravīta","V","brū","_","_"
28,"yathāvittam","_","_","yathāvitta","CX","","_","_"
29,"eva","_","_","eva","CEM","","_","_"
30,"va","_","_","tvat","PPR","","_","_"
31,"iti","_","_","iti","CQT","","_","_"
32,"_","_","_","tasmāt","CX","","_","_"
33,"_","_","_","ha","CEM","","_","_"
34,"_","_","_","api","CX","","_","_"
35,"etarhi","_","_","etarhi","CX","","_","_"
36,"vittyāṃ","_","_","vitti","NC","","_","_"
37,"vyāhur","_","_","vyah","V","vyah","_","_"
38,"yathāvittam","_","_","yathāvitta","CX","","_","_"
39,"eva","_","_","eva","CEM","","_","_"
40,"na","_","_","mat","PPR","","_","_"
41,"iti","_","_","iti","CQT","","_","_"
42,"tato","_","_","tatas","CX","","_","_"
43,"vā","_","_","vai","CX","","_","_"
44,"_","_","_","aṣṭan","NUM","","_","_"
45,"_","_","_","akṣara","NC","","_","_"
46,"gāyatry","_","_","gāyatrī","NC","","_","_"
47,"abhavat","_","_","bhav","V","bhū","_","_"
48,"_","_","_","tri","NUM","","_","_"
49,"_","_","_","akṣara","NC","","_","_"
50,"triṣṭub","_","_","triṣṭubh","NC","","_","_"
51,"_","_","_","eka","PPX","","_","_"
52,"_","_","_","akṣara","NC","","_","_"
53,"jagatī","_","_","jagatī","NC","","_","_"
1,"_","_","_","tad","PRD","","_","_"
2,"_","_","_","aṣṭan","NUM","","_","_"
3,"_","_","_","akṣara","NC","","_","_"
4,"gāyatrī","_","_","gāyatrī","NC","","_","_"
5,"prātaḥsavanam","_","_","prātaḥsavana","NC","","_","_"
6,"udayacchan","_","_","udya","V","udya","_","_"
7,"_","_","_","na","CNG","","_","_"
8,"_","_","_","śakn","V","śak","_","_"
9,"triṣṭup","_","_","triṣṭubh","NC","","_","_"
10,"_","_","_","tri","NUM","","_","_"
11,"_","_","_","akṣara","NC","","_","_"
12,"mādhyaṃdinaṃ","_","_","mādhyaṃdina","JJ","","_","_"
13,"savanam","_","_","savana","NC","","_","_"
14,"udyantuṃ","_","_","udya","CGDI","","_","_"
15,"tāṃ","_","_","tad","PRD","","_","_"
16,"gāyatry","_","_","gāyatrī","NC","","_","_"
17,"abravīd","_","_","abravīta","V","brū","_","_"
18,"āyāny","_","_","e","V","e","_","_"
19,"api","_","_","api","CX","","_","_"
20,"me","_","_","mat","PPR","","_","_"
21,"_","_","_","atra","CAD","","_","_"
22,"_","_","_","as","V","as","_","_"
23,"iti","_","_","iti","CQT","","_","_"
24,"sā","_","_","tad","PRD","","_","_"
25,"_","_","_","tathā","CX","","_","_"
26,"_","_","_","iti","CQT","","_","_"
27,"abravīt","_","_","abravīta","V","brū","_","_"
28,"triṣṭup","_","_","triṣṭubh","NC","","_","_"
29,"tāṃ","_","_","tad","PRD","","_","_"
30,"vai","_","_","vai","CX","","_","_"
31,"_","_","_","mā","CNG","","_","_"
32,"_","_","_","tad","PRD","","_","_"
33,"aṣṭābhir","_","_","aṣṭan","NUM","","_","_"
34,"akṣarair","_","_","akṣara","NC","","_","_"
35,"_","_","_","upasaṃdhā","V","upasaṃdhā","_","_"
36,"_","_","_","iti","CQT","","_","_"
37,"_","_","_","tathā","CX","","_","_"
38,"_","_","_","iti","CQT","","_","_"
39,"tām","_","_","tad","PRD","","_","_"
40,"upasamadadhād","_","_","upasaṃdhā","V","upasaṃdhā","_","_"
41,"etad","_","_","tad","PRD","","_","_"
42,"vai","_","_","vai","CX","","_","_"
43,"tad","_","_","tad","PRD","","_","_"
44,"gāyatryai","_","_","gāyatrī","NC","","_","_"
45,"madhyaṃdine","_","_","madhyaṃdina","NC","","_","_"
46,"yan","_","_","yad","PRL","","_","_"
47,"_","_","_","marutvatīya","JJ","","_","_"
48,"_","_","_","uttara","JJ","","_","_"
49,"pratipado","_","_","pratipad","NC","","_","_"
50,"yaś","_","_","yad","PRL","","_","_"
51,"_","_","_","ca","CCD","","_","_"
52,"_","_","_","anucara","NC","","_","_"
53,"_","_","_","tad","PRD","","_","_"
54,"_","_","_","ekādaśan","NUM","","_","_"
55,"_","_","_","akṣara","NC","","_","_"
56,"bhūtvā","_","_","bhū","CGDA","","_","_"
57,"mādhyaṃdinaṃ","_","_","mādhyaṃdina","JJ","","_","_"
58,"savanam","_","_","savana","NC","","_","_"
59,"udayacchat","_","_","udya","V","udya","_","_"
1,"_","_","_","na","CNG","","_","_"
2,"_","_","_","śakn","V","śak","_","_"
3,"jagaty","_","_","jagatī","NC","","_","_"
4,"_","_","_","eka","PPX","","_","_"
5,"_","_","_","akṣara","NC","","_","_"
6,"tṛtīyasavanam","_","_","tṛtīyasavana","NC","","_","_"
7,"udyantuṃ","_","_","udya","CGDI","","_","_"
8,"tāṃ","_","_","tad","PRD","","_","_"
9,"gāyatry","_","_","gāyatrī","NC","","_","_"
10,"abravīd","_","_","abravīta","V","brū","_","_"
11,"āyāny","_","_","e","V","e","_","_"
12,"api","_","_","api","CX","","_","_"
13,"me","_","_","mat","PPR","","_","_"
14,"_","_","_","atra","CAD","","_","_"
15,"_","_","_","as","V","as","_","_"
16,"iti","_","_","iti","CQT","","_","_"
17,"sā","_","_","tad","PRD","","_","_"
18,"_","_","_","tathā","CX","","_","_"
19,"_","_","_","iti","CQT","","_","_"
20,"abravīj","_","_","abravīta","V","brū","_","_"
21,"jagatī","_","_","jagatī","NC","","_","_"
22,"tāṃ","_","_","tad","PRD","","_","_"
23,"vai","_","_","vai","CX","","_","_"
24,"_","_","_","mā","CNG","","_","_"
25,"_","_","_","tad","PRD","","_","_"
26,"ekādaśabhir","_","_","ekādaśan","NUM","","_","_"
27,"akṣarair","_","_","akṣara","NC","","_","_"
28,"_","_","_","upasaṃdhā","V","upasaṃdhā","_","_"
29,"_","_","_","iti","CQT","","_","_"
30,"_","_","_","tathā","CX","","_","_"
31,"_","_","_","iti","CQT","","_","_"
32,"tām","_","_","tad","PRD","","_","_"
33,"upasamadadhād","_","_","upasaṃdhā","V","upasaṃdhā","_","_"
34,"etad","_","_","tad","PRD","","_","_"
35,"vai","_","_","vai","CX","","_","_"
36,"tad","_","_","tad","PRD","","_","_"
37,"gāyatryai","_","_","gāyatrī","NC","","_","_"
38,"tṛtīyasavane","_","_","tṛtīyasavana","NC","","_","_"
39,"yad","_","_","yad","PRL","","_","_"
40,"_","_","_","vaiśvadeva","NC","","_","_"
41,"_","_","_","uttara","JJ","","_","_"
42,"pratipado","_","_","pratipad","NC","","_","_"
43,"yaś","_","_","yad","PRL","","_","_"
44,"_","_","_","ca","CCD","","_","_"
45,"_","_","_","anucara","NC","","_","_"
46,"sā","_","_","tad","PRD","","_","_"
47,"_","_","_","dvādaśan","NUM","","_","_"
48,"_","_","_","akṣara","NC","","_","_"
49,"bhūtvā","_","_","bhū","CGDA","","_","_"
50,"tṛtīyasavanam","_","_","tṛtīyasavana","NC","","_","_"
51,"udayacchat","_","_","udya","V","udya","_","_"
1,"tato","_","_","tatas","CX","","_","_"
2,"vā","_","_","vai","CX","","_","_"
3,"_","_","_","aṣṭan","NUM","","_","_"
4,"_","_","_","akṣara","NC","","_","_"
5,"gāyatry","_","_","gāyatrī","NC","","_","_"
6,"abhavad","_","_","bhav","V","bhū","_","_"
7,"_","_","_","ekādaśan","NUM","","_","_"
8,"_","_","_","akṣara","NC","","_","_"
9,"triṣṭub","_","_","triṣṭubh","NC","","_","_"
10,"_","_","_","dvādaśan","NUM","","_","_"
11,"_","_","_","akṣara","NC","","_","_"
12,"jagatī","_","_","jagatī","NC","","_","_"
1,"sarvaiś","_","_","sarva","JQ","","_","_"
2,"chandobhiḥ","_","_","chandas","NC","","_","_"
3,"_","_","_","samāvat","JJ","","_","_"
4,"_","_","_","vīrya","NC","","_","_"
5,"_","_","_","samāvat","JJ","","_","_"
6,"_","_","_","jāmi","NC","","_","_"
7,"rādhnoti","_","_","rādh","V","rādh","_","_"
8,"ya","_","_","yad","PRL","","_","_"
9,"evaṃ","_","_","eva","CX","","_","_"
10,"veda","_","_","vid","V","vid","_","_"
1,"ekaṃ","_","_","eka","PPX","","_","_"
2,"vai","_","_","vai","CX","","_","_"
3,"sat","_","_","as","KDP","","_","_"
4,"tat","_","_","tad","PRD","","_","_"
5,"_","_","_","tredhā","CX","","_","_"
6,"_","_","_","bhav","V","bhū","_","_"
7,"tasmād","_","_","tasmāt","CX","","_","_"
8,"āhur","_","_","ah","V","ah","_","_"
9,"dātavyam","_","_","dā","KDG","","_","_"
10,"evaṃ","_","_","eva","CX","","_","_"
11,"viduṣa","_","_","vid","KDP","","_","_"
12,"ity","_","_","iti","CQT","","_","_"
13,"ekaṃ","_","_","eka","PPX","","_","_"
14,"hi","_","_","hi","CX","","_","_"
15,"sat","_","_","as","KDP","","_","_"
16,"tat","_","_","tad","PRD","","_","_"
17,"_","_","_","tredhā","CX","","_","_"
18,"_","_","_","bhav","V","bhū","_","_"
