"WordID","word","NormSTEM","suffix","lemma","PoS","Root","NormSuffix","NormWord"
1,"vaiśampāyana","_","_","vaiśampāyana","NC","","_","_"
2,"uvāca","_","_","vak","V","vac","_","_"
1,"yājñasenyā","_","_","yājñasenī","NC","","_","_"
2,"vacaḥ","_","_","vacas","NC","","_","_"
3,"śrutvā","_","_","śru","CGDA","","_","_"
4,"bhīmaseno","_","_","bhīmasa","NC","","_","_"
5,"'tyamarṣaṇaḥ","_","_","atyamarṣaṇa","JJ","","_","_"
1,"niḥśvasann","_","_","niḥśvas","KDP","","_","_"
2,"upasaṃgamya","_","_","upasaṃga","CGDA","","_","_"
3,"kruddho","_","_","krudh","PPP","","_","_"
4,"rājānam","_","_","rājan","NC","","_","_"
5,"abravīt","_","_","abravīta","V","brū","_","_"
1,"rājyasya","_","_","rājya","NC","","_","_"
2,"padavīṃ","_","_","padavī","NC","","_","_"
3,"dharmyāṃ","_","_","dharmya","JJ","","_","_"
4,"vraja","_","_","vraj","V","vraj","_","_"
5,"_","_","_","sat","JJ","","_","_"
6,"_","_","_","puruṣa","NC","","_","_"
7,"_","_","_","ucita","JJ","","_","_"
1,"_","_","_","dharma","NC","","_","_"
2,"_","_","_","kāma","NC","","_","_"
3,"_","_","_","artha","NC","","_","_"
4,"_","_","_","hā","PPP","","_","_"
5,"kiṃ","_","_","kiṃ","PRQ","","_","_"
6,"no","_","_","mat","PPR","","_","_"
7,"vastuṃ","_","_","vas","CGDI","","_","_"
8,"_","_","_","tapas","NC","","_","_"
9,"_","_","_","vana","NC","","_","_"
1,"_","_","_","na","CNG","","_","_"
2,"_","_","_","eva","CEM","","_","_"
3,"dharmeṇa","_","_","dharma","NC","","_","_"
4,"tad","_","_","tad","PRD","","_","_"
5,"rājyaṃ","_","_","rājya","NC","","_","_"
6,"_","_","_","na","CNG","","_","_"
7,"_","_","_","ārjava","NC","","_","_"
8,"na","_","_","na","CNG","","_","_"
9,"_","_","_","ca","CCD","","_","_"
10,"_","_","_","ojas","NC","","_","_"
1,"_","_","_","akṣa","NC","","_","_"
2,"_","_","_","kūṭa","NC","","_","_"
3,"adhiṣṭhāya","_","_","adhiṣṭhā","CGDA","","_","_"
4,"hṛtaṃ","_","_","hṛ","PPP","","_","_"
5,"duryodhanena","_","_","duryodhana","NC","","_","_"
6,"naḥ","_","_","mat","PPR","","_","_"
1,"_","_","_","gomāyu","NC","","_","_"
2,"_","_","_","iva","CCM","","_","_"
3,"siṃhānāṃ","_","_","siṃha","NC","","_","_"
4,"durbalena","_","_","durbala","JJ","","_","_"
5,"balīyasām","_","_","balīyas","JJ","","_","_"
1,"āmiṣaṃ","_","_","āmiṣa","NC","","_","_"
2,"_","_","_","vighasa","NC","","_","_"
3,"_","_","_","āśa","NC","","_","_"
4,"tadvad","_","_","tadvat","CX","","_","_"
5,"rājyaṃ","_","_","rājya","NC","","_","_"
6,"hi","_","_","hi","CX","","_","_"
7,"no","_","_","mat","PPR","","_","_"
8,"hṛtam","_","_","hṛ","PPP","","_","_"
1,"_","_","_","dharma","NC","","_","_"
2,"_","_","_","leśa","NC","","_","_"
3,"_","_","_","praticchad","PPP","","_","_"
4,"prabhavaṃ","_","_","prabhava","NC","","_","_"
5,"_","_","_","dharma","NC","","_","_"
6,"_","_","_","kāma","NC","","_","_"
1,"artham","_","_","artha","NC","","_","_"
2,"utsṛjya","_","_","utsṛj","CGDA","","_","_"
3,"kiṃ","_","_","kiṃ","PRQ","","_","_"
4,"rājan","_","_","rājan","NC","","_","_"
5,"durgeṣu","_","_","durga","NC","","_","_"
6,"paritapyase","_","_","paritap","V","paritap","_","_"
1,"bhavato","_","_","bhavat","JJ","","_","_"
2,"'nuvidhānena","_","_","anuvidhāna","NC","","_","_"
3,"rājyaṃ","_","_","rājya","NC","","_","_"
4,"naḥ","_","_","mat","PPR","","_","_"
5,"paśyatāṃ","_","_","paś","KDP","","_","_"
6,"hṛtam","_","_","hṛ","PPP","","_","_"
1,"ahāryam","_","_","ahārya","JJ","","_","_"
2,"api","_","_","api","CX","","_","_"
3,"śakreṇa","_","_","śakra","NC","","_","_"
4,"guptaṃ","_","_","gup","PPP","","_","_"
5,"gāṇḍīvadhanvanā","_","_","gāṇḍīvadhanvan","NC","","_","_"
1,"kuṇīnām","_","_","kuṇi","JJ","","_","_"
2,"iva","_","_","iva","CCM","","_","_"
3,"bilvāni","_","_","bilva","NC","","_","_"
4,"paṅgūnām","_","_","paṅgu","JJ","","_","_"
5,"iva","_","_","iva","CCM","","_","_"
6,"dhenavaḥ","_","_","dhenu","NC","","_","_"
1,"hṛtam","_","_","hṛ","PPP","","_","_"
2,"aiśvaryam","_","_","aiśvarya","NC","","_","_"
3,"asmākaṃ","_","_","mat","PPR","","_","_"
4,"jīvatāṃ","_","_","jīv","KDP","","_","_"
5,"bhavataḥ","_","_","bhavat","JJ","","_","_"
6,"kṛte","_","_","kṛta","NC","","_","_"
1,"bhavataḥ","_","_","bhavat","JJ","","_","_"
2,"priyam","_","_","priya","JJ","","_","_"
3,"_","_","_","iti","CQT","","_","_"
4,"_","_","_","eva","CX","","_","_"
5,"mahad","_","_","mahat","JJ","","_","_"
6,"vyasanam","_","_","vyasana","NC","","_","_"
7,"īdṛśam","_","_","īdṛśa","JJ","","_","_"
1,"_","_","_","dharma","NC","","_","_"
2,"_","_","_","kāma","NC","","_","_"
3,"pratītasya","_","_","pratī","PPP","","_","_"
4,"pratipannāḥ","_","_","pratipad","PPP","","_","_"
5,"sma","_","_","sma","CX","","_","_"
6,"bhārata","_","_","bhārata","JJ","","_","_"
1,"karśayāmaḥ","_","_","karśay","V","karśay","_","_"
2,"_","_","_","sva","JJ","","_","_"
3,"_","_","_","mitra","NC","","_","_"
4,"nandayāmaś","_","_","nanday","V","nanday","_","_"
5,"ca","_","_","ca","CCD","","_","_"
6,"śātravān","_","_","śātrava","NC","","_","_"
1,"ātmānaṃ","_","_","ātman","NC","","_","_"
2,"bhavataḥ","_","_","bhavat","JJ","","_","_"
3,"śāstre","_","_","śāstra","NC","","_","_"
4,"niyamya","_","_","niya","CGDA","","_","_"
5,"_","_","_","bharata","NC","","_","_"
6,"_","_","_","ṛṣabha","NC","","_","_"
1,"yad","_","_","yat","CSB","","_","_"
2,"vayaṃ","_","_","mat","PPR","","_","_"
3,"na","_","_","na","CNG","","_","_"
4,"_","_","_","tadā","CAD","","_","_"
5,"_","_","_","eva","CEM","","_","_"
6,"_","_","_","tad","PRD","","_","_"
7,"dhārtarāṣṭrān","_","_","dhārtarāṣṭra","NC","","_","_"
1,"bhavataḥ","_","_","bhavat","JJ","","_","_"
2,"śāstram","_","_","śāstra","NC","","_","_"
3,"ādāya","_","_","ādā","CGDA","","_","_"
4,"tan","_","_","tad","PRD","","_","_"
5,"nas","_","_","mat","PPR","","_","_"
6,"tapati","_","_","tap","V","tap","_","_"
7,"duṣkṛtam","_","_","duṣkṛta","NC","","_","_"
1,"_","_","_","atha","CAD","","_","_"
2,"_","_","_","a","PRD","","_","_"
3,"anvavekṣasva","_","_","anvavekṣ","V","anvavekṣ","_","_"
4,"mṛgacaryām","_","_","mṛgacaryā","NC","","_","_"
5,"_","_","_","iva","CCM","","_","_"
6,"_","_","_","ātman","NC","","_","_"
1,"_","_","_","avīra","JJ","","_","_"
2,"_","_","_","ācar","PPP","","_","_"
3,"rājan","_","_","rājan","NC","","_","_"
4,"na","_","_","na","CNG","","_","_"
5,"balasthair","_","_","balastha","NC","","_","_"
6,"niṣevitām","_","_","niṣev","PPP","","_","_"
1,"yāṃ","_","_","yad","PRL","","_","_"
2,"na","_","_","na","CNG","","_","_"
3,"kṛṣṇo","_","_","kṛṣṇa","NC","","_","_"
4,"na","_","_","na","CNG","","_","_"
5,"bībhatsur","_","_","bībhatsu","JJ","","_","_"
6,"_","_","_","na","CNG","","_","_"
7,"_","_","_","abhimanyu","NC","","_","_"
8,"na","_","_","na","CNG","","_","_"
9,"sṛñjayaḥ","_","_","sṛñjaya","NC","","_","_"
1,"na","_","_","na","CNG","","_","_"
2,"_","_","_","ca","CCD","","_","_"
3,"_","_","_","mat","PPR","","_","_"
4,"abhinandāmi","_","_","abhinand","V","abhinand","_","_"
5,"na","_","_","na","CNG","","_","_"
6,"ca","_","_","ca","CCD","","_","_"
7,"_","_","_","mādrī","NC","","_","_"
8,"_","_","_","suta","NC","","_","_"
9,"_","_","_","ubh","PPX","","_","_"
1,"bhavān","_","_","bhavat","JJ","","_","_"
2,"dharmo","_","_","dharma","NC","","_","_"
3,"dharma","_","_","dharma","NC","","_","_"
4,"iti","_","_","iti","CQT","","_","_"
5,"satataṃ","_","_","satata","CX","","_","_"
6,"_","_","_","vrata","NC","","_","_"
7,"_","_","_","karśay","PPP","","_","_"
1,"kaccid","_","_","kiṃcit","PRI","","_","_"
2,"rājan","_","_","rājan","NC","","_","_"
3,"na","_","_","na","CNG","","_","_"
4,"nirvedād","_","_","nirveda","NC","","_","_"
5,"āpannaḥ","_","_","āpad","PPP","","_","_"
6,"_","_","_","klība","JJ","","_","_"
7,"_","_","_","jīvikā","NC","","_","_"
1,"durmanuṣyā","_","_","durmanuṣya","NC","","_","_"
2,"hi","_","_","hi","CX","","_","_"
3,"nirvedam","_","_","nirveda","NC","","_","_"
4,"aphalaṃ","_","_","aphala","JJ","","_","_"
5,"_","_","_","sarva","JQ","","_","_"
6,"_","_","_","ghātin","JJ","","_","_"
1,"aśaktāḥ","_","_","aśakta","JJ","","_","_"
2,"śriyam","_","_","śrī","NC","","_","_"
3,"āhartum","_","_","āhṛ","CGDI","","_","_"
4,"ātmanaḥ","_","_","ātman","NC","","_","_"
5,"kurvate","_","_","kar","V","kṛ","_","_"
6,"priyam","_","_","priya","JJ","","_","_"
1,"sa","_","_","tad","PRD","","_","_"
2,"bhavān","_","_","bhavat","JJ","","_","_"
3,"dṛṣṭimāñ","_","_","dṛṣṭimat","JJ","","_","_"
4,"śaktaḥ","_","_","śakta","JJ","","_","_"
5,"paśyann","_","_","paś","KDP","","_","_"
6,"ātmani","_","_","ātman","NC","","_","_"
7,"pauruṣam","_","_","pauruṣa","NC","","_","_"
1,"_","_","_","ānṛśaṃsya","NC","","_","_"
2,"_","_","_","para","PPX","","_","_"
3,"rājan","_","_","rājan","NC","","_","_"
4,"_","_","_","na","CNG","","_","_"
5,"_","_","_","anartha","JJ","","_","_"
6,"avabudhyase","_","_","avabodh","V","avabudh","_","_"
1,"asmān","_","_","mat","PPR","","_","_"
2,"amī","_","_","adas","PRD","","_","_"
3,"dhārtarāṣṭrāḥ","_","_","dhārtarāṣṭra","NC","","_","_"
4,"kṣamamāṇān","_","_","kṣa","KDP","","_","_"
5,"alaṃ","_","_","ala","CX","","_","_"
6,"sataḥ","_","_","as","KDP","","_","_"
1,"aśaktān","_","_","aśakta","JJ","","_","_"
2,"eva","_","_","eva","CEM","","_","_"
3,"manyante","_","_","man","V","man","_","_"
4,"_","_","_","tad","PRD","","_","_"
5,"_","_","_","duḥkha","NC","","_","_"
6,"_","_","_","na","CNG","","_","_"
7,"_","_","_","āhava","NC","","_","_"
8,"vadhaḥ","_","_","vadha","NC","","_","_"
1,"tatra","_","_","tatra","CAD","","_","_"
2,"ced","_","_","ced","CX","","_","_"
3,"yudhyamānānām","_","_","yudh","KDP","","_","_"
4,"ajihmam","_","_","ajihma","JJ","","_","_"
5,"anivartinām","_","_","anivartin","JJ","","_","_"
1,"sarvaśo","_","_","sarvaśas","CX","","_","_"
2,"hi","_","_","hi","CX","","_","_"
3,"vadhaḥ","_","_","vadha","NC","","_","_"
4,"śreyān","_","_","śreyas","JJ","","_","_"
5,"pretya","_","_","pre","CGDA","","_","_"
6,"_","_","_","loka","NC","","_","_"
7,"_","_","_","labh","V","labh","_","_"
1,"athavā","_","_","athavā","CX","","_","_"
2,"vayam","_","_","mat","PPR","","_","_"
3,"_","_","_","eva","CEM","","_","_"
4,"_","_","_","tad","PRD","","_","_"
5,"nihatya","_","_","nihan","CGDA","","_","_"
6,"_","_","_","bharata","NC","","_","_"
7,"_","_","_","ṛṣabha","NC","","_","_"
1,"ādadīmahi","_","_","ādad","V","ādā","_","_"
2,"gāṃ","_","_","go","NC","","_","_"
3,"sarvāṃ","_","_","sarva","JQ","","_","_"
4,"_","_","_","tathā","CX","","_","_"
5,"_","_","_","api","CX","","_","_"
6,"śreya","_","_","śreyas","NC","","_","_"
7,"eva","_","_","eva","CEM","","_","_"
8,"naḥ","_","_","mat","PPR","","_","_"
1,"sarvathā","_","_","sarvathā","CX","","_","_"
2,"kāryam","_","_","kṛ","KDG","","_","_"
3,"etan","_","_","tad","PRD","","_","_"
4,"naḥ","_","_","mat","PPR","","_","_"
5,"svadharmam","_","_","svadharma","NC","","_","_"
6,"anutiṣṭhatām","_","_","anuṣṭhā","KDP","","_","_"
1,"kāṅkṣatāṃ","_","_","kāṅkṣ","KDP","","_","_"
2,"vipulāṃ","_","_","vipula","JJ","","_","_"
3,"kīrtiṃ","_","_","kīrti","NC","","_","_"
4,"vairaṃ","_","_","vaira","NC","","_","_"
5,"praticikīrṣatām","_","_","praticikīrṣ","KDP","","_","_"
1,"_","_","_","ātman","NC","","_","_"
2,"_","_","_","artha","NC","","_","_"
3,"yudhyamānānāṃ","_","_","yudh","KDP","","_","_"
4,"vidite","_","_","vid","PPP","","_","_"
5,"_","_","_","kṛtya","NC","","_","_"
6,"_","_","_","lakṣaṇa","NC","","_","_"
1,"anyair","_","_","anya","PPX","","_","_"
2,"apahṛte","_","_","apahṛ","PPP","","_","_"
3,"rājye","_","_","rājya","NC","","_","_"
4,"_","_","_","praśaṃsā","NC","","_","_"
5,"_","_","_","eva","CEM","","_","_"
6,"na","_","_","na","CNG","","_","_"
7,"garhaṇā","_","_","garhaṇa","NC","","_","_"
1,"_","_","_","karśana","NC","","_","_"
2,"_","_","_","artha","NC","","_","_"
3,"hi","_","_","hi","CX","","_","_"
4,"yo","_","_","yad","PRL","","_","_"
5,"dharmo","_","_","dharma","NC","","_","_"
6,"mitrāṇām","_","_","mitra","NC","","_","_"
7,"ātmanas","_","_","ātman","NC","","_","_"
8,"tathā","_","_","tathā","CX","","_","_"
1,"vyasanaṃ","_","_","vyasana","NC","","_","_"
2,"nāma","_","_","nāma","CX","","_","_"
3,"tad","_","_","tad","PRD","","_","_"
4,"rājan","_","_","rājan","NC","","_","_"
5,"na","_","_","na","CNG","","_","_"
6,"sa","_","_","tad","PRD","","_","_"
7,"dharmaḥ","_","_","dharma","NC","","_","_"
8,"kudharma","_","_","kudharman","NC","","_","_"
9,"tat","_","_","tad","PRD","","_","_"
1,"sarvathā","_","_","sarvathā","CX","","_","_"
2,"_","_","_","dharma","NC","","_","_"
3,"_","_","_","nitya","JJ","","_","_"
4,"tu","_","_","tu","CCD","","_","_"
5,"puruṣaṃ","_","_","puruṣa","NC","","_","_"
6,"_","_","_","dharma","NC","","_","_"
7,"_","_","_","durbala","JJ","","_","_"
1,"jahatas","_","_","jah","V","hā","_","_"
2,"tāta","_","_","tāta","NC","","_","_"
3,"_","_","_","dharma","NC","","_","_"
4,"_","_","_","artha","NC","","_","_"
5,"pretaṃ","_","_","pre","PPP","","_","_"
6,"_","_","_","duḥkha","NC","","_","_"
7,"_","_","_","sukha","NC","","_","_"
8,"yathā","_","_","yathā","CCM","","_","_"
1,"yasya","_","_","yad","PRL","","_","_"
2,"dharmo","_","_","dharma","NC","","_","_"
3,"hi","_","_","hi","CX","","_","_"
4,"_","_","_","dharma","NC","","_","_"
5,"_","_","_","artha","NC","","_","_"
6,"_","_","_","kleśa","NC","","_","_"
7,"_","_","_","bhāj","JJ","","_","_"
8,"_","_","_","na","CNG","","_","_"
9,"sa","_","_","tad","PRD","","_","_"
10,"paṇḍitaḥ","_","_","paṇḍita","NC","","_","_"
1,"na","_","_","na","CNG","","_","_"
2,"sa","_","_","tad","PRD","","_","_"
3,"dharmasya","_","_","dharma","NC","","_","_"
4,"_","_","_","vid","V","vid","_","_"
5,"_","_","_","artha","NC","","_","_"
6,"_","_","_","sūrya","NC","","_","_"
7,"_","_","_","andha","JJ","","_","_"
8,"prabhām","_","_","prabhā","NC","","_","_"
9,"iva","_","_","iva","CCM","","_","_"
1,"yasya","_","_","yad","PRL","","_","_"
2,"_","_","_","ca","CCD","","_","_"
3,"_","_","_","artha","NC","","_","_"
4,"_","_","_","artha","NC","","_","_"
5,"_","_","_","eva","CEM","","_","_"
6,"_","_","_","artha","NC","","_","_"
7,"sa","_","_","tad","PRD","","_","_"
8,"ca","_","_","ca","CCD","","_","_"
9,"_","_","_","na","CNG","","_","_"
10,"_","_","_","artha","NC","","_","_"
11,"kovidaḥ","_","_","kovida","JJ","","_","_"
1,"rakṣate","_","_","rakṣ","V","rakṣ","_","_"
2,"bhṛtako","_","_","bhṛtaka","NC","","_","_"
3,"'raṇyaṃ","_","_","araṇya","NC","","_","_"
4,"yathā","_","_","yathā","CCM","","_","_"
5,"syāt","_","_","as","V","as","_","_"
6,"tādṛg","_","_","tādṛś","JJ","","_","_"
7,"eva","_","_","eva","CEM","","_","_"
8,"saḥ","_","_","tad","PRD","","_","_"
1,"ativelaṃ","_","_","ativela","CX","","_","_"
2,"hi","_","_","hi","CX","","_","_"
3,"yo","_","_","yad","PRL","","_","_"
4,"_","_","_","artha","NC","","_","_"
5,"_","_","_","arthin","JJ","","_","_"
6,"_","_","_","na","CNG","","_","_"
7,"_","_","_","itara","PPX","","_","_"
8,"_","_","_","anuṣṭhā","V","anuṣṭhā","_","_"
1,"sa","_","_","tad","PRD","","_","_"
2,"vadhyaḥ","_","_","vadh","KDG","","_","_"
3,"_","_","_","sarva","JQ","","_","_"
4,"_","_","_","bhūta","NC","","_","_"
5,"_","_","_","brahman","NC","","_","_"
6,"_","_","_","han","JJ","","_","_"
7,"_","_","_","iva","CCM","","_","_"
8,"jugupsitaḥ","_","_","jugupsita","JJ","","_","_"
1,"satataṃ","_","_","satata","CX","","_","_"
2,"yaś","_","_","yad","PRL","","_","_"
3,"ca","_","_","ca","CCD","","_","_"
4,"_","_","_","kāma","NC","","_","_"
5,"_","_","_","arthin","JJ","","_","_"
6,"_","_","_","na","CNG","","_","_"
7,"_","_","_","itara","PPX","","_","_"
8,"_","_","_","anuṣṭhā","V","anuṣṭhā","_","_"
1,"mitrāṇi","_","_","mitra","NC","","_","_"
2,"tasya","_","_","tad","PRD","","_","_"
3,"naśyanti","_","_","naś","V","naś","_","_"
4,"_","_","_","dharma","NC","","_","_"
5,"_","_","_","artha","NC","","_","_"
6,"ca","_","_","ca","CCD","","_","_"
7,"hīyate","_","_","jah","V","hā","_","_"
1,"tasya","_","_","tad","PRD","","_","_"
2,"_","_","_","dharma","NC","","_","_"
3,"_","_","_","artha","NC","","_","_"
4,"_","_","_","hā","PPP","","_","_"
5,"_","_","_","kāma","NC","","_","_"
6,"_","_","_","anta","NC","","_","_"
7,"nidhanaṃ","_","_","nidhana","NC","","_","_"
8,"dhruvam","_","_","dhruva","JJ","","_","_"
1,"kāmato","_","_","kāma","NC","","_","_"
2,"ramamāṇasya","_","_","ra","KDP","","_","_"
3,"_","_","_","mīna","NC","","_","_"
4,"_","_","_","iva","CCM","","_","_"
5,"_","_","_","ambhas","NC","","_","_"
6,"kṣaye","_","_","kṣaya","NC","","_","_"
1,"tasmād","_","_","tad","PRD","","_","_"
2,"_","_","_","dharma","NC","","_","_"
3,"_","_","_","artha","NC","","_","_"
4,"nityaṃ","_","_","nitya","CX","","_","_"
5,"na","_","_","na","CNG","","_","_"
6,"pramādyanti","_","_","pramad","V","pramad","_","_"
7,"paṇḍitāḥ","_","_","paṇḍita","NC","","_","_"
1,"prakṛtiḥ","_","_","prakṛti","NC","","_","_"
2,"sā","_","_","tad","PRD","","_","_"
3,"hi","_","_","hi","CX","","_","_"
4,"kāmasya","_","_","kāma","NC","","_","_"
5,"_","_","_","pāvaka","NC","","_","_"
6,"_","_","_","araṇi","NC","","_","_"
7,"yathā","_","_","yathā","CCM","","_","_"
1,"sarvathā","_","_","sarvathā","CX","","_","_"
2,"_","_","_","dharma","NC","","_","_"
3,"_","_","_","mūla","NC","","_","_"
4,"'rtho","_","_","artha","NC","","_","_"
5,"dharmaś","_","_","dharma","NC","","_","_"
6,"_","_","_","ca","CCD","","_","_"
7,"_","_","_","artha","NC","","_","_"
8,"_","_","_","parigraha","NC","","_","_"
1,"_","_","_","itaretara","PRC","","_","_"
2,"_","_","_","yoni","NC","","_","_"
3,"tau","_","_","tad","PRD","","_","_"
4,"viddhi","_","_","vid","V","vid","_","_"
5,"_","_","_","megha","NC","","_","_"
6,"_","_","_","udadhi","NC","","_","_"
7,"yathā","_","_","yathā","CCM","","_","_"
1,"_","_","_","dravya","NC","","_","_"
2,"_","_","_","artha","NC","","_","_"
3,"_","_","_","sparśa","NC","","_","_"
4,"_","_","_","saṃyoga","NC","","_","_"
5,"yā","_","_","yad","PRL","","_","_"
6,"prītir","_","_","prīti","NC","","_","_"
7,"upajāyate","_","_","upajan","V","upajan","_","_"
1,"sa","_","_","tad","PRD","","_","_"
2,"kāmaś","_","_","kāma","NC","","_","_"
3,"_","_","_","citta","NC","","_","_"
4,"_","_","_","saṃkalpa","NC","","_","_"
5,"śarīraṃ","_","_","śarīra","NC","","_","_"
6,"_","_","_","na","CNG","","_","_"
7,"_","_","_","ida","PRD","","_","_"
8,"vidyate","_","_","vid","V","vid","_","_"
1,"_","_","_","artha","NC","","_","_"
2,"_","_","_","arthin","JJ","","_","_"
3,"puruṣo","_","_","puruṣa","NC","","_","_"
4,"rājan","_","_","rājan","NC","","_","_"
5,"bṛhantaṃ","_","_","bṛhat","JJ","","_","_"
6,"dharmam","_","_","dharma","NC","","_","_"
7,"ṛcchati","_","_","ṛch","V","ṛch","_","_"
1,"artham","_","_","artha","NC","","_","_"
2,"ṛcchati","_","_","ṛch","V","ṛch","_","_"
3,"_","_","_","kāma","NC","","_","_"
4,"_","_","_","arthin","NC","","_","_"
5,"na","_","_","na","CNG","","_","_"
6,"_","_","_","kāma","NC","","_","_"
7,"_","_","_","anya","PPX","","_","_"
8,"_","_","_","ṛch","V","ṛch","_","_"
1,"na","_","_","na","CNG","","_","_"
2,"hi","_","_","hi","CX","","_","_"
3,"kāmena","_","_","kāma","NC","","_","_"
4,"kāmo","_","_","kāma","NC","","_","_"
5,"'nyaḥ","_","_","anya","PPX","","_","_"
6,"sādhyate","_","_","sādh","V","sādh","_","_"
7,"phalam","_","_","phala","NC","","_","_"
8,"eva","_","_","eva","CEM","","_","_"
9,"tat","_","_","tad","PRD","","_","_"
1,"upayogāt","_","_","upayoga","NC","","_","_"
2,"_","_","_","phala","NC","","_","_"
3,"_","_","_","iva","CCM","","_","_"
4,"kāṣṭhād","_","_","kāṣṭha","NC","","_","_"
5,"_","_","_","bhasman","NC","","_","_"
6,"_","_","_","iva","CCM","","_","_"
7,"paṇḍitaḥ","_","_","paṇḍita","NC","","_","_"
1,"_","_","_","ida","PRD","","_","_"
2,"_","_","_","śakunika","NC","","_","_"
3,"rājan","_","_","rājan","NC","","_","_"
4,"hanti","_","_","han","V","han","_","_"
5,"vaitaṃsiko","_","_","vaitaṃsika","NC","","_","_"
6,"yathā","_","_","yathā","CCM","","_","_"
1,"etad","_","_","tad","PRD","","_","_"
2,"rūpam","_","_","rūpa","NC","","_","_"
3,"adharmasya","_","_","adharma","NC","","_","_"
4,"bhūteṣu","_","_","bhūta","NC","","_","_"
5,"ca","_","_","ca","CCD","","_","_"
6,"vihiṃsatām","_","_","vihiṃs","KDP","","_","_"
1,"_","_","_","kāma","NC","","_","_"
2,"_","_","_","lobha","NC","","_","_"
3,"_","_","_","ca","CCD","","_","_"
4,"dharmasya","_","_","dharma","NC","","_","_"
5,"pravṛttiṃ","_","_","pravṛtti","NC","","_","_"
6,"yo","_","_","yad","PRL","","_","_"
7,"na","_","_","na","CNG","","_","_"
8,"paśyati","_","_","paś","V","paś","_","_"
1,"sa","_","_","tad","PRD","","_","_"
2,"vadhyaḥ","_","_","vadh","KDG","","_","_"
3,"_","_","_","sarva","JQ","","_","_"
4,"_","_","_","bhūta","NC","","_","_"
5,"pretya","_","_","pretya","CX","","_","_"
6,"_","_","_","ca","CCD","","_","_"
7,"_","_","_","iha","CAD","","_","_"
8,"ca","_","_","ca","CCD","","_","_"
9,"durmatiḥ","_","_","durmati","JJ","","_","_"
1,"vyaktaṃ","_","_","vyakta","JJ","","_","_"
2,"te","_","_","tvat","PPR","","_","_"
3,"vidito","_","_","vid","PPP","","_","_"
4,"rājann","_","_","rājan","NC","","_","_"
5,"artho","_","_","artha","NC","","_","_"
6,"_","_","_","dravya","NC","","_","_"
7,"_","_","_","parigraha","NC","","_","_"
1,"prakṛtiṃ","_","_","prakṛti","NC","","_","_"
2,"_","_","_","ca","CCD","","_","_"
3,"_","_","_","api","CX","","_","_"
4,"_","_","_","vid","V","vid","_","_"
5,"_","_","_","ida","PRD","","_","_"
6,"vikṛtiṃ","_","_","vikṛti","NC","","_","_"
7,"_","_","_","ca","CCD","","_","_"
8,"_","_","_","api","CX","","_","_"
9,"bhūyasīm","_","_","bhūyas","JJ","","_","_"
1,"tasya","_","_","tad","PRD","","_","_"
2,"nāśaṃ","_","_","nāśa","NC","","_","_"
3,"vināśaṃ","_","_","vināśa","NC","","_","_"
4,"vā","_","_","vā","CCD","","_","_"
5,"jarayā","_","_","jarā","NC","","_","_"
6,"maraṇena","_","_","maraṇa","NC","","_","_"
7,"vā","_","_","vā","CCD","","_","_"
1,"anartham","_","_","anartha","JJ","","_","_"
2,"iti","_","_","iti","CQT","","_","_"
3,"manyante","_","_","man","V","man","_","_"
4,"so","_","_","tad","PRD","","_","_"
5,"'yam","_","_","ida","PRD","","_","_"
6,"asmāsu","_","_","mat","PPR","","_","_"
7,"vartate","_","_","vart","V","vṛt","_","_"
1,"indriyāṇāṃ","_","_","indriya","NC","","_","_"
2,"ca","_","_","ca","CCD","","_","_"
3,"pañcānāṃ","_","_","pañcan","NUM","","_","_"
4,"manaso","_","_","manas","NC","","_","_"
5,"hṛdayasya","_","_","hṛdaya","NC","","_","_"
6,"ca","_","_","ca","CCD","","_","_"
1,"viṣaye","_","_","viṣaya","NC","","_","_"
2,"vartamānānāṃ","_","_","vṛt","KDP","","_","_"
3,"yā","_","_","yad","PRL","","_","_"
4,"prītir","_","_","prīti","NC","","_","_"
5,"upajāyate","_","_","upajan","V","upajan","_","_"
1,"sa","_","_","tad","PRD","","_","_"
2,"kāma","_","_","kāma","NC","","_","_"
3,"iti","_","_","iti","CQT","","_","_"
4,"me","_","_","mat","PPR","","_","_"
5,"buddhiḥ","_","_","buddhi","NC","","_","_"
6,"karmaṇāṃ","_","_","karman","NC","","_","_"
7,"phalam","_","_","phala","NC","","_","_"
8,"uttamam","_","_","uttama","JJ","","_","_"
1,"evam","_","_","eva","CX","","_","_"
2,"eva","_","_","eva","CEM","","_","_"
3,"pṛthag","_","_","pṛthak","CX","","_","_"
4,"dṛṣṭvā","_","_","dṛś","CGDA","","_","_"
5,"_","_","_","dharma","NC","","_","_"
6,"_","_","_","artha","NC","","_","_"
7,"kāmam","_","_","kāma","NC","","_","_"
8,"eva","_","_","eva","CEM","","_","_"
9,"ca","_","_","ca","CCD","","_","_"
1,"na","_","_","na","CNG","","_","_"
2,"_","_","_","dharma","NC","","_","_"
3,"_","_","_","para","PPX","","_","_"
4,"eva","_","_","eva","CEM","","_","_"
5,"syān","_","_","as","V","as","_","_"
6,"na","_","_","na","CNG","","_","_"
7,"_","_","_","ca","CCD","","_","_"
8,"_","_","_","artha","NC","","_","_"
9,"_","_","_","parama","JJ","","_","_"
10,"naraḥ","_","_","nara","NC","","_","_"
1,"na","_","_","na","CNG","","_","_"
2,"_","_","_","kāma","NC","","_","_"
3,"_","_","_","parama","JJ","","_","_"
4,"vā","_","_","vā","CCD","","_","_"
5,"syāt","_","_","as","V","as","_","_"
6,"sarvān","_","_","sarva","JQ","","_","_"
7,"seveta","_","_","sev","V","sev","_","_"
8,"sarvadā","_","_","sarvadā","CX","","_","_"
1,"dharmaṃ","_","_","dharma","NC","","_","_"
2,"pūrvaṃ","_","_","pūrva","CX","","_","_"
3,"dhanaṃ","_","_","dhana","NC","","_","_"
4,"madhye","_","_","madhya","NC","","_","_"
5,"jaghanye","_","_","jaghanya","JJ","","_","_"
6,"kāmam","_","_","kāma","NC","","_","_"
7,"ācaret","_","_","ācar","V","ācar","_","_"
1,"_","_","_","ahar","NC","","_","_"
2,"_","_","_","anucar","V","anucar","_","_"
3,"evam","_","_","eva","CX","","_","_"
4,"eṣa","_","_","tad","PRD","","_","_"
5,"_","_","_","śāstra","NC","","_","_"
6,"_","_","_","kṛ","PPP","","_","_"
7,"vidhiḥ","_","_","vidhi","NC","","_","_"
1,"kāmaṃ","_","_","kāma","NC","","_","_"
2,"pūrvaṃ","_","_","pūrva","CX","","_","_"
3,"dhanaṃ","_","_","dhana","NC","","_","_"
4,"madhye","_","_","madhya","NC","","_","_"
5,"jaghanye","_","_","jaghanya","JJ","","_","_"
6,"dharmam","_","_","dharma","NC","","_","_"
7,"ācaret","_","_","ācar","V","ācar","_","_"
1,"_","_","_","vayas","NC","","_","_"
2,"_","_","_","anucar","V","anucar","_","_"
3,"evam","_","_","eva","CX","","_","_"
4,"eṣa","_","_","tad","PRD","","_","_"
5,"_","_","_","śāstra","NC","","_","_"
6,"_","_","_","kṛ","PPP","","_","_"
7,"vidhiḥ","_","_","vidhi","NC","","_","_"
1,"dharmaṃ","_","_","dharma","NC","","_","_"
2,"_","_","_","ca","CCD","","_","_"
3,"_","_","_","artha","NC","","_","_"
4,"ca","_","_","ca","CCD","","_","_"
5,"kāmaṃ","_","_","kāma","NC","","_","_"
6,"ca","_","_","ca","CCD","","_","_"
7,"yathāvad","_","_","yathāvat","CX","","_","_"
8,"vadatāṃ","_","_","vad","KDP","","_","_"
9,"vara","_","_","vara","JJ","","_","_"
1,"vibhajya","_","_","vibhaj","CGDA","","_","_"
2,"kāle","_","_","kāla","NC","","_","_"
3,"_","_","_","kāla","NC","","_","_"
4,"_","_","_","jña","JJ","","_","_"
5,"sarvān","_","_","sarva","JQ","","_","_"
6,"seveta","_","_","sev","V","sev","_","_"
7,"paṇḍitaḥ","_","_","paṇḍita","NC","","_","_"
1,"mokṣo","_","_","mokṣa","NC","","_","_"
2,"vā","_","_","vā","CCD","","_","_"
3,"paramaṃ","_","_","parama","JJ","","_","_"
4,"śreya","_","_","śreyas","NC","","_","_"
5,"eṣa","_","_","tad","PRD","","_","_"
6,"rājan","_","_","rājan","NC","","_","_"
7,"_","_","_","sukha","NC","","_","_"
8,"_","_","_","arthin","JJ","","_","_"
1,"prāptir","_","_","prāpti","NC","","_","_"
2,"vā","_","_","vā","CCD","","_","_"
3,"buddhim","_","_","buddhi","NC","","_","_"
4,"āsthāya","_","_","āsthā","CGDA","","_","_"
5,"_","_","_","sa_saha","CX","","_","_"
6,"_","_","_","upāya","NC","","_","_"
7,"_","_","_","kuru","NC","","_","_"
8,"_","_","_","nandana","NC","","_","_"
1,"tad","_","_","tad","PRD","","_","_"
2,"_","_","_","vā","CCD","","_","_"
3,"_","_","_","āśu","JJ","","_","_"
4,"kriyatāṃ","_","_","kar","V","kṛ","_","_"
5,"rājan","_","_","rājan","NC","","_","_"
6,"prāptir","_","_","prāpti","NC","","_","_"
7,"_","_","_","vā","CCD","","_","_"
8,"_","_","_","api","CX","","_","_"
9,"_","_","_","adhiga","V","adhiga","_","_"
1,"jīvitaṃ","_","_","jīvita","NC","","_","_"
2,"_","_","_","hi","CX","","_","_"
3,"_","_","_","ātura","JJ","","_","_"
4,"_","_","_","iva","CCM","","_","_"
5,"duḥkham","_","_","duḥkha","NC","","_","_"
6,"_","_","_","antara","JJ","","_","_"
7,"_","_","_","vartin","JJ","","_","_"
1,"viditaś","_","_","vid","PPP","","_","_"
2,"_","_","_","ca","CCD","","_","_"
3,"_","_","_","eva","CEM","","_","_"
4,"te","_","_","tvat","PPR","","_","_"
5,"dharmaḥ","_","_","dharma","NC","","_","_"
6,"satataṃ","_","_","satata","CX","","_","_"
7,"caritaś","_","_","car","PPP","","_","_"
8,"ca","_","_","ca","CCD","","_","_"
9,"te","_","_","tvat","PPR","","_","_"
1,"jānate","_","_","jān","V","jñā","_","_"
2,"tvayi","_","_","tvat","PPR","","_","_"
3,"śaṃsanti","_","_","śaṃs","V","śaṃs","_","_"
4,"suhṛdaḥ","_","_","suhṛd","NC","","_","_"
5,"_","_","_","karman","NC","","_","_"
6,"_","_","_","codana","NC","","_","_"
1,"dānaṃ","_","_","dāna","NC","","_","_"
2,"yajñaḥ","_","_","yajña","NC","","_","_"
3,"satāṃ","_","_","as","KDP","","_","_"
4,"pūjā","_","_","pūjā","NC","","_","_"
5,"_","_","_","veda","NC","","_","_"
6,"_","_","_","dhāraṇa","NC","","_","_"
7,"ārjavam","_","_","ārjava","NC","","_","_"
1,"eṣa","_","_","tad","PRD","","_","_"
2,"dharmaḥ","_","_","dharma","NC","","_","_"
3,"paro","_","_","para","PPX","","_","_"
4,"rājan","_","_","rājan","NC","","_","_"
5,"phalavān","_","_","phalavat","JJ","","_","_"
6,"pretya","_","_","pretya","CX","","_","_"
7,"_","_","_","ca","CCD","","_","_"
8,"_","_","_","iha","CAD","","_","_"
9,"ca","_","_","ca","CCD","","_","_"
1,"eṣa","_","_","tad","PRD","","_","_"
2,"_","_","_","na","CNG","","_","_"
3,"_","_","_","artha","NC","","_","_"
4,"_","_","_","vihā","PPP","","_","_"
5,"śakyo","_","_","śakya","JJ","","_","_"
6,"rājan","_","_","rājan","NC","","_","_"
7,"niṣevitum","_","_","niṣev","CGDI","","_","_"
1,"akhilāḥ","_","_","akhila","JJ","","_","_"
2,"_","_","_","puruṣa","NC","","_","_"
3,"_","_","_","vyāghra","NC","","_","_"
4,"guṇāḥ","_","_","guṇa","NC","","_","_"
5,"syur","_","_","as","V","as","_","_"
6,"_","_","_","yadi","CSB","","_","_"
7,"_","_","_","api","CX","","_","_"
8,"_","_","_","itara","PPX","","_","_"
1,"_","_","_","dharma","NC","","_","_"
2,"_","_","_","mūla","NC","","_","_"
3,"jagad","_","_","jagat","NC","","_","_"
4,"rājan","_","_","rājan","NC","","_","_"
5,"_","_","_","na","CNG","","_","_"
6,"_","_","_","anya","PPX","","_","_"
7,"_","_","_","dharma","NC","","_","_"
8,"viśiṣyate","_","_","viśās","V","viśās","_","_"
1,"dharmaś","_","_","dharma","NC","","_","_"
2,"_","_","_","ca","CCD","","_","_"
3,"_","_","_","artha","NC","","_","_"
4,"mahatā","_","_","mahat","JJ","","_","_"
5,"śakyo","_","_","śakya","JJ","","_","_"
6,"rājan","_","_","rājan","NC","","_","_"
7,"niṣevitum","_","_","niṣev","CGDI","","_","_"
1,"na","_","_","na","CNG","","_","_"
2,"_","_","_","ca","CCD","","_","_"
3,"_","_","_","artha","NC","","_","_"
4,"_","_","_","bhaikṣa","NC","","_","_"
5,"_","_","_","caryā","NC","","_","_"
6,"_","_","_","na","CNG","","_","_"
7,"_","_","_","api","CX","","_","_"
8,"klaibyena","_","_","klaibya","NC","","_","_"
9,"karhicit","_","_","karhicit","CX","","_","_"
1,"vettuṃ","_","_","vid","CGDI","","_","_"
2,"śakyaḥ","_","_","śakya","JJ","","_","_"
3,"sadā","_","_","sadā","CAD","","_","_"
4,"rājan","_","_","rājan","NC","","_","_"
5,"kevalaṃ","_","_","kevala","JJ","","_","_"
6,"_","_","_","dharma","NC","","_","_"
7,"_","_","_","buddhi","NC","","_","_"
1,"pratiṣiddhā","_","_","pratiṣidh","PPP","","_","_"
2,"hi","_","_","hi","CX","","_","_"
3,"te","_","_","tvat","PPR","","_","_"
4,"yācñā","_","_","yācñā","NC","","_","_"
5,"yayā","_","_","yad","PRL","","_","_"
6,"sidhyati","_","_","sidh","V","sidh","_","_"
7,"vai","_","_","vai","CX","","_","_"
8,"dvijaḥ","_","_","dvija","NC","","_","_"
1,"_","_","_","tejas","NC","","_","_"
2,"_","_","_","eva","CEM","","_","_"
3,"_","_","_","artha","NC","","_","_"
4,"_","_","_","lipsā","NC","","_","_"
5,"yatasva","_","_","yat","V","yat","_","_"
6,"_","_","_","puruṣa","NC","","_","_"
7,"_","_","_","ṛṣabha","NC","","_","_"
1,"_","_","_","bhaikṣa","NC","","_","_"
2,"_","_","_","caryā","NC","","_","_"
3,"na","_","_","na","CNG","","_","_"
4,"vihitā","_","_","vidhā","PPP","","_","_"
5,"na","_","_","na","CNG","","_","_"
6,"ca","_","_","ca","CCD","","_","_"
7,"_","_","_","viś","NC","","_","_"
8,"_","_","_","śūdra","NC","","_","_"
9,"_","_","_","jīvikā","NC","","_","_"
1,"kṣatriyasya","_","_","kṣatriya","NC","","_","_"
2,"viśeṣeṇa","_","_","viśeṣa","NC","","_","_"
3,"dharmas","_","_","dharma","NC","","_","_"
4,"tu","_","_","tu","CCD","","_","_"
5,"balam","_","_","bala","NC","","_","_"
6,"aurasam","_","_","aurasa","JJ","","_","_"
1,"udāram","_","_","udāra","JJ","","_","_"
2,"eva","_","_","eva","CEM","","_","_"
3,"vidvāṃso","_","_","vidvas","JJ","","_","_"
4,"dharmaṃ","_","_","dharma","NC","","_","_"
5,"prāhur","_","_","prāh","V","prāh","_","_"
6,"manīṣiṇaḥ","_","_","manīṣin","JJ","","_","_"
1,"udāraṃ","_","_","udāra","JJ","","_","_"
2,"pratipadyasva","_","_","pratipad","V","pratipad","_","_"
3,"_","_","_","na","CNG","","_","_"
4,"_","_","_","avara","JJ","","_","_"
5,"sthātum","_","_","sthā","CGDI","","_","_"
6,"arhasi","_","_","arh","V","arh","_","_"
1,"anubudhyasva","_","_","anubodh","V","anubudh","_","_"
2,"_","_","_","rājan","NC","","_","_"
3,"_","_","_","indra","NC","","_","_"
4,"vettha","_","_","vid","V","vid","_","_"
5,"dharmān","_","_","dharma","NC","","_","_"
6,"sanātanān","_","_","sanātana","JJ","","_","_"
1,"_","_","_","krūra","JJ","","_","_"
2,"_","_","_","karman","NC","","_","_"
3,"_","_","_","abhijan","PPP","","_","_"
4,"'si","_","_","as","V","as","_","_"
5,"yasmād","_","_","yad","PRL","","_","_"
6,"udvijate","_","_","udvijā","V","udvij","_","_"
7,"janaḥ","_","_","jana","NC","","_","_"
1,"_","_","_","prajā","NC","","_","_"
2,"_","_","_","pālana","NC","","_","_"
3,"_","_","_","sambhū","PPP","","_","_"
4,"phalaṃ","_","_","phala","NC","","_","_"
5,"tava","_","_","tvat","PPR","","_","_"
6,"na","_","_","na","CNG","","_","_"
7,"garhitam","_","_","garh","PPP","","_","_"
1,"eṣa","_","_","tad","PRD","","_","_"
2,"te","_","_","tvat","PPR","","_","_"
3,"vihito","_","_","vidhā","PPP","","_","_"
4,"rājan","_","_","rājan","NC","","_","_"
5,"dhātrā","_","_","dhātṛ","NC","","_","_"
6,"dharmaḥ","_","_","dharma","NC","","_","_"
7,"sanātanaḥ","_","_","sanātana","JJ","","_","_"
1,"tasmād","_","_","tad","PRD","","_","_"
2,"vicalitaḥ","_","_","vical","PPP","","_","_"
3,"pārtha","_","_","pārtha","NC","","_","_"
4,"loke","_","_","loka","NC","","_","_"
5,"hāsyaṃ","_","_","hāsya","NC","","_","_"
6,"gamiṣyasi","_","_","gacch","V","gam","_","_"
1,"_","_","_","svadharma","NC","","_","_"
2,"_","_","_","hi","CX","","_","_"
3,"manuṣyāṇāṃ","_","_","manuṣya","NC","","_","_"
4,"calanaṃ","_","_","calana","NC","","_","_"
5,"na","_","_","na","CNG","","_","_"
6,"praśasyate","_","_","praśaṃs","V","praśaṃs","_","_"
1,"sa","_","_","tad","PRD","","_","_"
2,"kṣātraṃ","_","_","kṣātra","JJ","","_","_"
3,"hṛdayaṃ","_","_","hṛdaya","NC","","_","_"
4,"kṛtvā","_","_","kṛ","CGDA","","_","_"
5,"_","_","_","tyaj","CGDA","","_","_"
6,"_","_","_","ida","PRD","","_","_"
7,"śithilaṃ","_","_","śithila","JJ","","_","_"
8,"manaḥ","_","_","manas","NC","","_","_"
1,"vīryam","_","_","vīrya","NC","","_","_"
2,"āsthāya","_","_","āsthā","CGDA","","_","_"
3,"kaunteya","_","_","kaunteya","NC","","_","_"
4,"dhuram","_","_","dhura","NC","","_","_"
5,"udvaha","_","_","udvah","V","udvah","_","_"
6,"_","_","_","dhurya","NC","","_","_"
7,"_","_","_","vat","CX","","_","_"
1,"na","_","_","na","CNG","","_","_"
2,"hi","_","_","hi","CX","","_","_"
3,"_","_","_","kevala","JJ","","_","_"
4,"_","_","_","dharma","NC","","_","_"
5,"_","_","_","ātman","NC","","_","_"
6,"pṛthivīṃ","_","_","pṛthivī","NC","","_","_"
7,"jātu","_","_","jātu","CX","","_","_"
8,"kaścana","_","_","kaścana","PRI","","_","_"
1,"pārthivo","_","_","pārthiva","NC","","_","_"
2,"vyajayad","_","_","vijay","V","viji","_","_"
3,"rājan","_","_","rājan","NC","","_","_"
4,"na","_","_","na","CNG","","_","_"
5,"bhūtiṃ","_","_","bhūti","NC","","_","_"
6,"na","_","_","na","CNG","","_","_"
7,"punaḥ","_","_","punar","CAD","","_","_"
8,"śriyam","_","_","śrī","NC","","_","_"
1,"jihvāṃ","_","_","jihvā","NC","","_","_"
2,"dattvā","_","_","dā","CGDA","","_","_"
3,"bahūnāṃ","_","_","bahu","JJ","","_","_"
4,"hi","_","_","hi","CX","","_","_"
5,"kṣudrāṇāṃ","_","_","kṣudra","JJ","","_","_"
6,"_","_","_","lubh","PPP","","_","_"
7,"_","_","_","cetas","NC","","_","_"
1,"nikṛtyā","_","_","nikṛti","NC","","_","_"
2,"labhate","_","_","labh","V","labh","_","_"
3,"rājyam","_","_","rājya","NC","","_","_"
4,"āhāram","_","_","āhāra","NC","","_","_"
5,"iva","_","_","iva","CCM","","_","_"
6,"śalyakaḥ","_","_","śalyaka","NC","","_","_"
1,"bhrātaraḥ","_","_","bhrātṛ","NC","","_","_"
2,"_","_","_","pūrva","PPX","","_","_"
3,"_","_","_","jan","PPP","","_","_"
4,"_","_","_","ca","CCD","","_","_"
5,"_","_","_","su","CAD","","_","_"
6,"_","_","_","samṛdh","PPP","","_","_"
7,"ca","_","_","ca","CCD","","_","_"
8,"sarvaśaḥ","_","_","sarvaśas","CX","","_","_"
1,"nikṛtyā","_","_","nikṛti","NC","","_","_"
2,"nirjitā","_","_","nirji","PPP","","_","_"
3,"devair","_","_","deva","NC","","_","_"
4,"asurāḥ","_","_","asura","NC","","_","_"
5,"_","_","_","pāṇḍava","NC","","_","_"
6,"_","_","_","ṛṣabha","NC","","_","_"
1,"evaṃ","_","_","eva","CX","","_","_"
2,"balavataḥ","_","_","balavat","JJ","","_","_"
3,"sarvam","_","_","sarva","JQ","","_","_"
4,"iti","_","_","iti","CQT","","_","_"
5,"buddhvā","_","_","budh","CGDA","","_","_"
6,"mahīpate","_","_","mahīpati","NC","","_","_"
1,"jahi","_","_","jah","V","hā","_","_"
2,"śatrūn","_","_","śatru","NC","","_","_"
3,"_","_","_","mahat","JJ","","_","_"
4,"_","_","_","bāhu","NC","","_","_"
5,"parāṃ","_","_","para","PPX","","_","_"
6,"nikṛtim","_","_","nikṛti","NC","","_","_"
7,"āsthitaḥ","_","_","āsthā","PPP","","_","_"
1,"na","_","_","na","CNG","","_","_"
2,"_","_","_","hi","CX","","_","_"
3,"_","_","_","arjuna","NC","","_","_"
4,"_","_","_","sama","PPX","","_","_"
5,"kaścid","_","_","kiṃcit","PRI","","_","_"
6,"yudhi","_","_","yudh","NC","","_","_"
7,"yoddhā","_","_","yoddhṛ","NC","","_","_"
8,"dhanurdharaḥ","_","_","dhanurdhara","NC","","_","_"
1,"bhavitā","_","_","bhav","V","bhū","_","_"
2,"vā","_","_","vā","CCD","","_","_"
3,"pumān","_","_","puṃs","NC","","_","_"
4,"_","_","_","kiṃcit","PRI","","_","_"
5,"_","_","_","mat","PPR","","_","_"
6,"_","_","_","samā","NC","","_","_"
7,"vā","_","_","vā","CCD","","_","_"
8,"_","_","_","gadā","NC","","_","_"
9,"_","_","_","dhara","JJ","","_","_"
1,"sattvena","_","_","sattva","NC","","_","_"
2,"kurute","_","_","kar","V","kṛ","_","_"
3,"yuddhaṃ","_","_","yuddha","NC","","_","_"
4,"rājan","_","_","rājan","NC","","_","_"
5,"_","_","_","su","CAD","","_","_"
6,"_","_","_","balavat","JJ","","_","_"
7,"api","_","_","api","CX","","_","_"
1,"na","_","_","na","CNG","","_","_"
2,"pramāṇena","_","_","pramāṇa","NC","","_","_"
3,"_","_","_","na","CNG","","_","_"
4,"_","_","_","utsāha","NC","","_","_"
5,"_","_","_","sattva","NC","","_","_"
6,"_","_","_","stha","JJ","","_","_"
7,"bhava","_","_","bhav","V","bhū","_","_"
8,"pāṇḍava","_","_","pāṇḍava","NC","","_","_"
1,"sattvaṃ","_","_","sattva","NC","","_","_"
2,"hi","_","_","hi","CX","","_","_"
3,"mūlam","_","_","mūla","NC","","_","_"
4,"arthasya","_","_","artha","NC","","_","_"
5,"vitathaṃ","_","_","vitatha","JJ","","_","_"
6,"yad","_","_","yad","PRL","","_","_"
7,"_","_","_","atas","CX","","_","_"
8,"_","_","_","anyathā","CX","","_","_"
1,"na","_","_","na","CNG","","_","_"
2,"tu","_","_","tu","CCD","","_","_"
3,"prasaktaṃ","_","_","prasañj","PPP","","_","_"
4,"bhavati","_","_","bhav","V","bhū","_","_"
5,"_","_","_","vṛkṣa","NC","","_","_"
6,"_","_","_","chāyā","NC","","_","_"
7,"_","_","_","iva","CCM","","_","_"
8,"haimanī","_","_","haimana","JJ","","_","_"
1,"_","_","_","artha","NC","","_","_"
2,"_","_","_","tyāga","NC","","_","_"
3,"hi","_","_","hi","CX","","_","_"
4,"kāryaḥ","_","_","kṛ","KDG","","_","_"
5,"syād","_","_","as","V","as","_","_"
6,"arthaṃ","_","_","artha","NC","","_","_"
7,"śreyāṃsam","_","_","śreyāṃsa","NC","","_","_"
8,"icchatā","_","_","iṣ","KDP","","_","_"
1,"_","_","_","bīja","NC","","_","_"
2,"_","_","_","aupamya","NC","","_","_"
3,"kaunteya","_","_","kaunteya","NC","","_","_"
4,"mā","_","_","mā","CNG","","_","_"
5,"te","_","_","tvat","PPR","","_","_"
6,"bhūd","_","_","bhav","V","bhū","_","_"
7,"atra","_","_","atra","CAD","","_","_"
8,"saṃśayaḥ","_","_","saṃśaya","NC","","_","_"
1,"arthena","_","_","artha","NC","","_","_"
2,"tu","_","_","tu","CCD","","_","_"
3,"_","_","_","sama","PPX","","_","_"
4,"_","_","_","anartha","NC","","_","_"
5,"yatra","_","_","yatra","CX","","_","_"
6,"labhyeta","_","_","labh","V","labh","_","_"
7,"_","_","_","na","CNG","","_","_"
8,"_","_","_","udaya","NC","","_","_"
1,"na","_","_","na","CNG","","_","_"
2,"tatra","_","_","tatra","CAD","","_","_"
3,"vipaṇaḥ","_","_","vipaṇa","NC","","_","_"
4,"kāryaḥ","_","_","kṛ","KDG","","_","_"
5,"kharakaṇḍūyitaṃ","_","_","kharakaṇḍūyita","NC","","_","_"
6,"hi","_","_","hi","CX","","_","_"
7,"tat","_","_","tad","PRD","","_","_"
1,"evam","_","_","eva","CX","","_","_"
2,"eva","_","_","eva","CEM","","_","_"
3,"_","_","_","manuṣya","NC","","_","_"
4,"_","_","_","indra","NC","","_","_"
5,"dharmaṃ","_","_","dharma","NC","","_","_"
6,"_","_","_","tyaj","CGDA","","_","_"
7,"_","_","_","alpaka","JJ","","_","_"
8,"naraḥ","_","_","nara","NC","","_","_"
1,"bṛhantaṃ","_","_","bṛhat","JJ","","_","_"
2,"dharmam","_","_","dharma","NC","","_","_"
3,"āpnoti","_","_","āpn","V","āp","_","_"
4,"sa","_","_","tad","PRD","","_","_"
5,"buddha","_","_","budh","PPP","","_","_"
6,"iti","_","_","iti","CQT","","_","_"
7,"niścitaḥ","_","_","niści","PPP","","_","_"
1,"amitraṃ","_","_","amitra","NC","","_","_"
2,"_","_","_","mitra","NC","","_","_"
3,"_","_","_","sampad","PPP","","_","_"
4,"mitrair","_","_","mitra","NC","","_","_"
5,"bhindanti","_","_","bhid","V","bhid","_","_"
6,"paṇḍitāḥ","_","_","paṇḍita","NC","","_","_"
1,"bhinnair","_","_","bhid","PPP","","_","_"
2,"mitraiḥ","_","_","mitra","NC","","_","_"
3,"parityaktaṃ","_","_","parityaj","PPP","","_","_"
4,"durbalaṃ","_","_","durbala","JJ","","_","_"
5,"kurute","_","_","kar","V","kṛ","_","_"
6,"vaśe","_","_","vaśa","NC","","_","_"
1,"sattvena","_","_","sattva","NC","","_","_"
2,"kurute","_","_","kar","V","kṛ","_","_"
3,"yuddhaṃ","_","_","yuddha","NC","","_","_"
4,"rājan","_","_","rājan","NC","","_","_"
5,"_","_","_","su","CAD","","_","_"
6,"_","_","_","balavat","JJ","","_","_"
7,"api","_","_","api","CX","","_","_"
1,"_","_","_","na","CNG","","_","_"
2,"_","_","_","udyama","NC","","_","_"
3,"na","_","_","na","CNG","","_","_"
4,"hotrābhiḥ","_","_","hotrā","NC","","_","_"
5,"sarvāḥ","_","_","sarva","JQ","","_","_"
6,"svīkurute","_","_","svīkar","V","svīkṛ","_","_"
7,"prajāḥ","_","_","prajā","NC","","_","_"
1,"sarvathā","_","_","sarvathā","CX","","_","_"
2,"saṃhatair","_","_","saṃhan","PPP","","_","_"
3,"eva","_","_","eva","CEM","","_","_"
4,"durbalair","_","_","durbala","JJ","","_","_"
5,"balavān","_","_","balavat","JJ","","_","_"
6,"api","_","_","api","CX","","_","_"
1,"amitraḥ","_","_","amitra","NC","","_","_"
2,"śakyate","_","_","śakn","V","śak","_","_"
3,"hantuṃ","_","_","han","CGDI","","_","_"
4,"madhuhā","_","_","madhuhā","NC","","_","_"
5,"bhramarair","_","_","bhramara","NC","","_","_"
6,"iva","_","_","iva","CCM","","_","_"
1,"yathā","_","_","yathā","CCM","","_","_"
2,"rājan","_","_","rājan","NC","","_","_"
3,"prajāḥ","_","_","prajā","NC","","_","_"
4,"sarvāḥ","_","_","sarva","JQ","","_","_"
5,"sūryaḥ","_","_","sūrya","NC","","_","_"
6,"pāti","_","_","pib","V","pā","_","_"
7,"gabhastibhiḥ","_","_","gabhasti","NC","","_","_"
1,"atti","_","_","ad","V","ad","_","_"
2,"_","_","_","ca","CCD","","_","_"
3,"_","_","_","eva","CEM","","_","_"
4,"_","_","_","tathā","CX","","_","_"
5,"_","_","_","eva","CEM","","_","_"
6,"tvaṃ","_","_","tvat","PPR","","_","_"
7,"savituḥ","_","_","savitṛ","NC","","_","_"
8,"sadṛśo","_","_","sadṛśa","JJ","","_","_"
9,"bhava","_","_","bhav","V","bhū","_","_"
1,"_","_","_","tad","PRD","","_","_"
2,"_","_","_","hi","CX","","_","_"
3,"_","_","_","api","CX","","_","_"
4,"tapo","_","_","tapas","NC","","_","_"
5,"rājan","_","_","rājan","NC","","_","_"
6,"purāṇam","_","_","purāṇa","JJ","","_","_"
7,"iti","_","_","iti","CQT","","_","_"
8,"naḥ","_","_","mat","PPR","","_","_"
9,"śrutam","_","_","śru","PPP","","_","_"
1,"vidhinā","_","_","vidhi","NC","","_","_"
2,"pālanaṃ","_","_","pālana","NC","","_","_"
3,"bhūmer","_","_","bhūmi","NC","","_","_"
4,"yat","_","_","yad","PRL","","_","_"
5,"kṛtaṃ","_","_","kṛ","PPP","","_","_"
6,"naḥ","_","_","mat","PPR","","_","_"
7,"pitāmahaiḥ","_","_","pitāmaha","NC","","_","_"
1,"apeyāt","_","_","apai","V","ape","_","_"
2,"kila","_","_","kila","CX","","_","_"
3,"bhāḥ","_","_","bhās","NC","","_","_"
4,"_","_","_","sūrya","NC","","_","_"
5,"_","_","_","lakṣmī","NC","","_","_"
6,"candramasas","_","_","candramas","NC","","_","_"
7,"tathā","_","_","tathā","CX","","_","_"
1,"iti","_","_","iti","CQT","","_","_"
2,"loko","_","_","loka","NC","","_","_"
3,"vyavasito","_","_","vyavasā","PPP","","_","_"
4,"_","_","_","dṛś","CGDA","","_","_"
5,"_","_","_","ida","PRD","","_","_"
6,"bhavato","_","_","bhavat","JJ","","_","_"
7,"vyathām","_","_","vyathā","NC","","_","_"
1,"_","_","_","bhavat","JJ","","_","_"
2,"_","_","_","ca","CCD","","_","_"
3,"praśaṃsābhir","_","_","praśaṃsā","NC","","_","_"
4,"nindābhir","_","_","nindā","NC","","_","_"
5,"itarasya","_","_","itara","PPX","","_","_"
6,"ca","_","_","ca","CCD","","_","_"
1,"_","_","_","kathā","NC","","_","_"
2,"_","_","_","yuj","PPP","","_","_"
3,"pariṣadaḥ","_","_","pariṣad","NC","","_","_"
4,"pṛthag","_","_","pṛthak","CX","","_","_"
5,"rājan","_","_","rājan","NC","","_","_"
6,"samāgatāḥ","_","_","samāga","PPP","","_","_"
1,"idam","_","_","ida","PRD","","_","_"
2,"abhyadhikaṃ","_","_","abhyadhika","JJ","","_","_"
3,"rājan","_","_","rājan","NC","","_","_"
4,"brāhmaṇā","_","_","brāhmaṇa","NC","","_","_"
5,"guravaś","_","_","guru","NC","","_","_"
6,"ca","_","_","ca","CCD","","_","_"
7,"te","_","_","tvat","PPR","","_","_"
1,"sametāḥ","_","_","same","PPP","","_","_"
2,"_","_","_","kathay","V","kathay","_","_"
3,"_","_","_","iha","CAD","","_","_"
4,"muditāḥ","_","_","mud","PPP","","_","_"
5,"satyasaṃdhatām","_","_","satyasaṃdhatā","NC","","_","_"
1,"_","_","_","yat","CSB","","_","_"
2,"_","_","_","na","CNG","","_","_"
3,"_","_","_","moha","NC","","_","_"
4,"_","_","_","na","CNG","","_","_"
5,"_","_","_","kārpaṇya","NC","","_","_"
6,"_","_","_","na","CNG","","_","_"
7,"_","_","_","lobha","NC","","_","_"
8,"_","_","_","na","CNG","","_","_"
9,"_","_","_","bhaya","NC","","_","_"
10,"_","_","_","api","CX","","_","_"
1,"anṛtaṃ","_","_","anṛta","NC","","_","_"
2,"kiṃcid","_","_","kiṃcit","PRI","","_","_"
3,"uktaṃ","_","_","vac","PPP","","_","_"
4,"te","_","_","tvat","PPR","","_","_"
5,"na","_","_","na","CNG","","_","_"
6,"_","_","_","kāma","NC","","_","_"
7,"_","_","_","na","CNG","","_","_"
8,"_","_","_","artha","NC","","_","_"
9,"_","_","_","kāraṇa","NC","","_","_"
1,"yad","_","_","yad","PRL","","_","_"
2,"enaḥ","_","_","enas","NC","","_","_"
3,"kurute","_","_","kar","V","kṛ","_","_"
4,"kiṃcid","_","_","kiṃcit","PRI","","_","_"
5,"rājā","_","_","rājan","NC","","_","_"
6,"bhūmim","_","_","bhūmi","NC","","_","_"
7,"avāpnuvan","_","_","avāp","KDP","","_","_"
1,"sarvaṃ","_","_","sarva","JQ","","_","_"
2,"_","_","_","tad","PRD","","_","_"
3,"_","_","_","nud","V","nud","_","_"
4,"paścād","_","_","paścāt","CAD","","_","_"
5,"yajñair","_","_","yajña","NC","","_","_"
6,"_","_","_","vipula","JJ","","_","_"
7,"_","_","_","dakṣiṇā","NC","","_","_"
1,"brāhmaṇebhyo","_","_","brāhmaṇa","NC","","_","_"
2,"dadad","_","_","dā","KDP","","_","_"
3,"grāmān","_","_","grāma","NC","","_","_"
4,"_","_","_","go","NC","","_","_"
5,"_","_","_","ca","CCD","","_","_"
6,"rājan","_","_","rājan","NC","","_","_"
7,"sahasraśaḥ","_","_","sahasraśas","CX","","_","_"
1,"mucyate","_","_","muñc","V","muc","_","_"
2,"_","_","_","sarva","JQ","","_","_"
3,"_","_","_","pāpa","NC","","_","_"
4,"_","_","_","tamas","NC","","_","_"
5,"iva","_","_","iva","CCM","","_","_"
6,"candramāḥ","_","_","candramas","NC","","_","_"
1,"_","_","_","paura","NC","","_","_"
2,"_","_","_","jānapada","NC","","_","_"
3,"sarve","_","_","sarva","JQ","","_","_"
4,"prāyaśaḥ","_","_","prāyaśas","CX","","_","_"
5,"_","_","_","kuru","NC","","_","_"
6,"_","_","_","nandana","NC","","_","_"
1,"_","_","_","sa_saha","CX","","_","_"
2,"_","_","_","vṛddha","JJ","","_","_"
3,"_","_","_","bāla","JJ","","_","_"
4,"sahitāḥ","_","_","sahita","JJ","","_","_"
5,"śaṃsanti","_","_","śaṃs","V","śaṃs","_","_"
6,"tvāṃ","_","_","tvat","PPR","","_","_"
7,"yudhiṣṭhira","_","_","yudhiṣṭhira","NC","","_","_"
1,"_","_","_","śvan","NC","","_","_"
2,"_","_","_","dṛti","NC","","_","_"
3,"kṣīram","_","_","kṣīra","NC","","_","_"
4,"āsaktaṃ","_","_","āsañj","PPP","","_","_"
5,"brahma","_","_","brahman","NC","","_","_"
6,"vā","_","_","vā","CCD","","_","_"
7,"vṛṣale","_","_","vṛṣala","NC","","_","_"
8,"yathā","_","_","yathā","CCM","","_","_"
1,"satyaṃ","_","_","satya","NC","","_","_"
2,"stene","_","_","sta","NC","","_","_"
3,"balaṃ","_","_","bala","NC","","_","_"
4,"nāryāṃ","_","_","nārī","NC","","_","_"
5,"rājyaṃ","_","_","rājya","NC","","_","_"
6,"duryodhane","_","_","duryodhana","NC","","_","_"
7,"tathā","_","_","tathā","CX","","_","_"
1,"iti","_","_","iti","CQT","","_","_"
2,"nirvacanaṃ","_","_","nirvacana","NC","","_","_"
3,"loke","_","_","loka","NC","","_","_"
4,"ciraṃ","_","_","cira","CX","","_","_"
5,"carati","_","_","car","V","car","_","_"
6,"bhārata","_","_","bhārata","JJ","","_","_"
1,"api","_","_","api","CX","","_","_"
2,"_","_","_","ca","CCD","","_","_"
3,"_","_","_","tad","PRD","","_","_"
4,"_","_","_","strī","NC","","_","_"
5,"bālāḥ","_","_","bāla","NC","","_","_"
6,"svādhyāyam","_","_","svādhyāya","NC","","_","_"
7,"iva","_","_","iva","CCM","","_","_"
8,"kurvate","_","_","kar","V","kṛ","_","_"
1,"sa","_","_","tad","PRD","","_","_"
2,"bhavān","_","_","bhavat","JJ","","_","_"
3,"_","_","_","ratha","NC","","_","_"
4,"_","_","_","āsthā","CGDA","","_","_"
5,"_","_","_","sarva","JQ","","_","_"
6,"_","_","_","upakaraṇa","NC","","_","_"
7,"_","_","_","anvita","JJ","","_","_"
1,"tvaramāṇo","_","_","tvar","KDP","","_","_"
2,"'bhiniryātu","_","_","abhiniryā","V","abhiniryā","_","_"
3,"ciram","_","_","cira","CX","","_","_"
4,"_","_","_","artha","NC","","_","_"
5,"_","_","_","upapādaka","JJ","","_","_"
1,"vācayitvā","_","_","vācay","CGDA","","_","_"
2,"_","_","_","dvija","NC","","_","_"
3,"_","_","_","śreṣṭha","JJ","","_","_"
4,"_","_","_","adya","CX","","_","_"
5,"_","_","_","eva","CEM","","_","_"
6,"gajasāhvayam","_","_","gajasāhvaya","NC","","_","_"
1,"_","_","_","astra","NC","","_","_"
2,"_","_","_","vid","JJ","","_","_"
3,"parivṛto","_","_","parivṛ","PPP","","_","_"
4,"_","_","_","bhrātṛ","NC","","_","_"
5,"_","_","_","dṛḍha","JJ","","_","_"
6,"_","_","_","dhanvin","JJ","","_","_"
1,"_","_","_","āśīviṣa","NC","","_","_"
2,"_","_","_","sama","JJ","","_","_"
3,"vīrair","_","_","vīra","NC","","_","_"
4,"_","_","_","marut","NC","","_","_"
5,"_","_","_","iva","CCM","","_","_"
6,"vṛtrahā","_","_","vṛtrahan","NC","","_","_"
1,"amitrāṃs","_","_","amitra","NC","","_","_"
2,"tejasā","_","_","tejas","NC","","_","_"
3,"_","_","_","mṛd","KDP","","_","_"
4,"_","_","_","asura","NC","","_","_"
5,"_","_","_","iva","CCM","","_","_"
6,"_","_","_","ari","NC","","_","_"
7,"_","_","_","han","JJ","","_","_"
1,"_","_","_","śrī","NC","","_","_"
2,"_","_","_","ādad","V","ādā","_","_"
3,"kaunteya","_","_","kaunteya","NC","","_","_"
4,"dhārtarāṣṭrān","_","_","dhārtarāṣṭra","NC","","_","_"
5,"_","_","_","mahat","JJ","","_","_"
6,"_","_","_","bala","NC","","_","_"
1,"na","_","_","na","CNG","","_","_"
2,"hi","_","_","hi","CX","","_","_"
3,"_","_","_","gāṇḍīva","NC","","_","_"
4,"_","_","_","muc","PPP","","_","_"
5,"śarāṇāṃ","_","_","śara","NC","","_","_"
6,"_","_","_","gārdhra","JJ","","_","_"
7,"_","_","_","vāsas","NC","","_","_"
1,"sparśam","_","_","sparśa","NC","","_","_"
2,"_","_","_","āśīviṣa","NC","","_","_"
3,"_","_","_","ābha","JJ","","_","_"
4,"martyaḥ","_","_","martya","NC","","_","_"
5,"kaścana","_","_","kaścana","PRI","","_","_"
6,"saṃsahet","_","_","saṃsah","V","saṃsah","_","_"
1,"na","_","_","na","CNG","","_","_"
2,"sa","_","_","tad","PRD","","_","_"
3,"vīro","_","_","vīra","NC","","_","_"
4,"na","_","_","na","CNG","","_","_"
5,"mātaṃgo","_","_","mātaṃga","NC","","_","_"
6,"na","_","_","na","CNG","","_","_"
7,"_","_","_","as","KDP","","_","_"
8,"_","_","_","aśva","NC","","_","_"
9,"_","_","_","as","V","as","_","_"
10,"bhārata","_","_","bhārata","JJ","","_","_"
1,"yaḥ","_","_","yad","PRL","","_","_"
2,"saheta","_","_","sah","V","sah","_","_"
3,"_","_","_","gadā","NC","","_","_"
4,"_","_","_","vega","NC","","_","_"
5,"mama","_","_","mat","PPR","","_","_"
6,"kruddhasya","_","_","krudh","PPP","","_","_"
7,"saṃyuge","_","_","saṃyuga","NC","","_","_"
1,"sṛñjayaiḥ","_","_","sṛñjaya","NC","","_","_"
2,"saha","_","_","saha","CX","","_","_"
3,"kaikeyair","_","_","kaikeya","NC","","_","_"
4,"vṛṣṇīnām","_","_","vṛṣṇi","NC","","_","_"
5,"ṛṣabheṇa","_","_","ṛṣabha","NC","","_","_"
6,"ca","_","_","ca","CCD","","_","_"
1,"_","_","_","katha","CX","","_","_"
2,"_","_","_","svid","CX","","_","_"
3,"yudhi","_","_","yudh","NC","","_","_"
4,"kaunteya","_","_","kaunteya","NC","","_","_"
5,"rājyaṃ","_","_","rājya","NC","","_","_"
6,"na","_","_","na","CNG","","_","_"
7,"prāpnuyāmahe","_","_","prāpn","V","prāp","_","_"
