"WordID","word","NormSTEM","suffix","lemma","PoS","Root","NormSuffix","NormWord"
1,"devaṃ","_","_","deva","NC","","_","_"
2,"vo","_","_","tvat","PPR","","_","_"
3,"adya","_","_","adya","CX","","_","_"
4,"savitāram","_","_","savitṛ","NC","","_","_"
5,"eṣe","_","_","iṣ","V","iṣ","_","_"
6,"bhagaṃ","_","_","bhaga","NC","","_","_"
7,"ca","_","_","ca","CCD","","_","_"
8,"ratnaṃ","_","_","ratna","NC","","_","_"
9,"vibhajantam","_","_","vibhaj","KDP","","_","_"
10,"āyoḥ","_","_","āyu","NC","","_","_"
1,"ā","_","_","ā","CADP","","_","_"
2,"vāṃ","_","_","tvat","PPR","","_","_"
3,"narā","_","_","nṛ","NC","","_","_"
4,"_","_","_","puru","JJ","","_","_"
5,"_","_","_","bhuj","JJ","","_","_"
6,"vavṛtyāṃ","_","_","vart","V","vṛt","_","_"
7,"dive","_","_","diva","NC","","_","_"
8,"dive","_","_","diva","NC","","_","_"
9,"cid","_","_","cit","CEM","","_","_"
10,"aśvinā","_","_","aśvin","NC","","_","_"
11,"sakhīyan","_","_","sakhīy","KDP","","_","_"
1,"prati","_","_","prati","CADP","","_","_"
2,"prayāṇam","_","_","prayāṇa","NC","","_","_"
3,"asurasya","_","_","asura","NC","","_","_"
4,"vidvān","_","_","vid","KDP","","_","_"
5,"sūktair","_","_","sūkta","NC","","_","_"
6,"devaṃ","_","_","deva","NC","","_","_"
7,"savitāraṃ","_","_","savitṛ","NC","","_","_"
8,"duvasya","_","_","duvasy","V","duvasy","_","_"
1,"upa","_","_","upa","CADP","","_","_"
2,"bruvīta","_","_","abravīta","V","brū","_","_"
3,"namasā","_","_","namas","NC","","_","_"
4,"vijānañ","_","_","vijñā","KDP","","_","_"
5,"jyeṣṭhaṃ","_","_","jyeṣṭha","JJ","","_","_"
6,"ca","_","_","ca","CCD","","_","_"
7,"ratnaṃ","_","_","ratna","NC","","_","_"
8,"vibhajantam","_","_","vibhaj","KDP","","_","_"
9,"āyoḥ","_","_","āyu","NC","","_","_"
1,"_","_","_","a","CNG","","_","_"
2,"_","_","_","dattra","NC","","_","_"
3,"_","_","_","yā","JJ","","_","_"
4,"dayate","_","_","day","V","day","_","_"
5,"vāryāṇi","_","_","vārya","NC","","_","_"
6,"pūṣā","_","_","pūṣan","NC","","_","_"
7,"bhago","_","_","bhaga","NC","","_","_"
8,"aditir","_","_","aditi","NC","","_","_"
9,"vasta","_","_","vastu","NC","","_","_"
10,"usraḥ","_","_","usṛ","NC","","_","_"
1,"indro","_","_","indra","NC","","_","_"
2,"viṣṇur","_","_","viṣṇu","NC","","_","_"
3,"varuṇo","_","_","varuṇa","NC","","_","_"
4,"mitro","_","_","mitra","NC","","_","_"
5,"agnir","_","_","agni","NC","","_","_"
6,"ahāni","_","_","ahar","NC","","_","_"
7,"bhadrā","_","_","bhadra","JJ","","_","_"
8,"janayanta","_","_","janay","V","janay","_","_"
9,"dasmāḥ","_","_","dasma","NC","","_","_"
1,"tan","_","_","tad","PRD","","_","_"
2,"no","_","_","mat","PPR","","_","_"
3,"anarvā","_","_","anarvan","JJ","","_","_"
4,"savitā","_","_","savitṛ","NC","","_","_"
5,"varūthaṃ","_","_","varūtha","NC","","_","_"
6,"tat","_","_","tad","PRD","","_","_"
7,"sindhava","_","_","sindhu","NC","","_","_"
8,"iṣayanto","_","_","iṣay","KDP","","_","_"
9,"anu","_","_","anu","CADP","","_","_"
10,"gman","_","_","ga","V","ga","_","_"
1,"upa","_","_","upa","CADP","","_","_"
2,"yad","_","_","yat","CSB","","_","_"
3,"voce","_","_","vak","V","vac","_","_"
4,"adhvarasya","_","_","adhvara","NC","","_","_"
5,"hotā","_","_","hotṛ","NC","","_","_"
6,"rāyaḥ","_","_","rai","NC","","_","_"
7,"syāma","_","_","as","V","as","_","_"
8,"patayo","_","_","pati","NC","","_","_"
9,"_","_","_","vāja","NC","","_","_"
10,"_","_","_","ratna","NC","","_","_"
1,"pra","_","_","pra","CADP","","_","_"
2,"ye","_","_","yad","PRL","","_","_"
3,"vasubhya","_","_","vasu","JJ","","_","_"
4,"īvad","_","_","īvat","JJ","","_","_"
5,"ā","_","_","ā","CADP","","_","_"
6,"namo","_","_","namas","NC","","_","_"
7,"dur","_","_","dad","V","dā","_","_"
8,"ye","_","_","yad","PRL","","_","_"
9,"mitre","_","_","mitra","NC","","_","_"
10,"varuṇe","_","_","varuṇa","NC","","_","_"
11,"_","_","_","sūkta","NC","","_","_"
12,"_","_","_","vāc","NC","","_","_"
1,"avaitv","_","_","ave","V","ave","_","_"
2,"abhvaṃ","_","_","abhva","NC","","_","_"
3,"kṛṇutā","_","_","kar","V","kṛ","_","_"
4,"varīyo","_","_","varīyas","NC","","_","_"
5,"divaspṛthivyor","_","_","divaspṛthivī","NC","","_","_"
6,"avasā","_","_","avas","NC","","_","_"
7,"madema","_","_","mand","V","mand","_","_"
