"WordID","word","NormSTEM","suffix","lemma","PoS","Root","NormSuffix","NormWord"
1,"śuka","_","_","śuka","NC","","_","_"
2,"uvāca","_","_","vak","V","vac","_","_"
1,"yad","_","_","yad","PRL","","_","_"
2,"idaṃ","_","_","ida","PRD","","_","_"
3,"_","_","_","veda","NC","","_","_"
4,"_","_","_","vacana","NC","","_","_"
5,"kuru","_","_","kar","V","kṛ","_","_"
6,"karma","_","_","karman","NC","","_","_"
7,"_","_","_","tyaj","V","tyaj","_","_"
8,"_","_","_","iti","CQT","","_","_"
9,"ca","_","_","ca","CCD","","_","_"
1,"kāṃ","_","_","kiṃ","PRQ","","_","_"
2,"diśaṃ","_","_","diś","NC","","_","_"
3,"vidyayā","_","_","vidyā","NC","","_","_"
4,"yānti","_","_","yā","V","yā","_","_"
5,"kāṃ","_","_","kiṃ","PRQ","","_","_"
6,"ca","_","_","ca","CCD","","_","_"
7,"gacchanti","_","_","gacch","V","gam","_","_"
8,"karmaṇā","_","_","karman","NC","","_","_"
1,"etad","_","_","tad","PRD","","_","_"
2,"vai","_","_","vai","CX","","_","_"
3,"śrotum","_","_","śru","CGDI","","_","_"
4,"icchāmi","_","_","iṣ","V","iṣ","_","_"
5,"tad","_","_","tad","PRD","","_","_"
6,"bhavān","_","_","bhavat","JJ","","_","_"
7,"prabravītu","_","_","prabrū","V","prabrū","_","_"
8,"me","_","_","mat","PPR","","_","_"
1,"etat","_","_","tad","PRD","","_","_"
2,"_","_","_","tu","CCD","","_","_"
3,"_","_","_","anyonya","PRC","","_","_"
4,"_","_","_","vairūpya","NC","","_","_"
5,"vartate","_","_","vart","V","vṛt","_","_"
6,"pratikūlataḥ","_","_","pratikūla","JJ","","_","_"
1,"bhīṣma","_","_","bhīṣma","NC","","_","_"
2,"uvāca","_","_","vak","V","vac","_","_"
1,"_","_","_","iti","CQT","","_","_"
2,"_","_","_","vac","PPP","","_","_"
3,"_","_","_","prativak","V","prativac","_","_"
4,"_","_","_","ida","PRD","","_","_"
5,"_","_","_","parāśara","NC","","_","_"
6,"_","_","_","suta","NC","","_","_"
7,"sutam","_","_","suta","NC","","_","_"
1,"_","_","_","karman","NC","","_","_"
2,"_","_","_","vidyā","NC","","_","_"
3,"_","_","_","maya","JJ","","_","_"
4,"_","_","_","tad","PRD","","_","_"
5,"vyākhyāsyāmi","_","_","vyākhyās","V","vyākhyā","_","_"
6,"_","_","_","kṣara","JJ","","_","_"
7,"_","_","_","akṣara","JJ","","_","_"
1,"yāṃ","_","_","yad","PRL","","_","_"
2,"diśaṃ","_","_","diś","NC","","_","_"
3,"vidyayā","_","_","vidyā","NC","","_","_"
4,"yānti","_","_","yā","V","yā","_","_"
5,"yāṃ","_","_","yad","PRL","","_","_"
6,"ca","_","_","ca","CCD","","_","_"
7,"gacchanti","_","_","gacch","V","gam","_","_"
8,"karmaṇā","_","_","karman","NC","","_","_"
1,"_","_","_","śṛṇ","V","śru","_","_"
2,"_","_","_","ekamanas","JJ","","_","_"
3,"putra","_","_","putra","NC","","_","_"
4,"gahvaraṃ","_","_","gahvara","NC","","_","_"
5,"_","_","_","hi","CX","","_","_"
6,"_","_","_","tad","PRD","","_","_"
7,"antaram","_","_","antara","JJ","","_","_"
1,"asti","_","_","as","V","as","_","_"
2,"dharma","_","_","dharma","NC","","_","_"
3,"iti","_","_","iti","CQT","","_","_"
4,"proktaṃ","_","_","pravac","PPP","","_","_"
5,"_","_","_","na","CNG","","_","_"
6,"_","_","_","as","V","as","_","_"
7,"_","_","_","iti","CQT","","_","_"
8,"_","_","_","atra","CAD","","_","_"
9,"_","_","_","eva","CEM","","_","_"
10,"yo","_","_","yad","PRL","","_","_"
11,"vadet","_","_","vad","V","vad","_","_"
1,"tasya","_","_","tad","PRD","","_","_"
2,"pakṣasya","_","_","pakṣa","NC","","_","_"
3,"sadṛśam","_","_","sadṛśa","JJ","","_","_"
4,"idaṃ","_","_","ida","PRD","","_","_"
5,"mama","_","_","mat","PPR","","_","_"
6,"bhaved","_","_","bhav","V","bhū","_","_"
7,"atha","_","_","atha","CAD","","_","_"
1,"_","_","_","dvi","NUM","","_","_"
2,"_","_","_","ida","PRD","","_","_"
3,"_","_","_","atha","CAD","","_","_"
4,"panthānau","_","_","pathin","NC","","_","_"
5,"yatra","_","_","yatra","CX","","_","_"
6,"vedāḥ","_","_","veda","NC","","_","_"
7,"pratiṣṭhitāḥ","_","_","pratiṣṭhā","PPP","","_","_"
1,"_","_","_","pravṛtti","NC","","_","_"
2,"_","_","_","lakṣaṇa","NC","","_","_"
3,"dharmo","_","_","dharma","NC","","_","_"
4,"nivṛttau","_","_","nivṛtti","NC","","_","_"
5,"ca","_","_","ca","CCD","","_","_"
6,"_","_","_","su","CAD","","_","_"
7,"_","_","_","bhāṣ","PPP","","_","_"
1,"karmaṇā","_","_","karman","NC","","_","_"
2,"badhyate","_","_","bandh","V","bandh","_","_"
3,"jantur","_","_","jantu","NC","","_","_"
4,"vidyayā","_","_","vidyā","NC","","_","_"
5,"tu","_","_","tu","CCD","","_","_"
6,"pramucyate","_","_","pramuñc","V","pramuc","_","_"
1,"tasmāt","_","_","tasmāt","CX","","_","_"
2,"karma","_","_","karman","NC","","_","_"
3,"na","_","_","na","CNG","","_","_"
4,"kurvanti","_","_","kar","V","kṛ","_","_"
5,"yatayaḥ","_","_","yati","NC","","_","_"
6,"_","_","_","pāra","NC","","_","_"
7,"_","_","_","darśin","JJ","","_","_"
1,"karmaṇā","_","_","karman","NC","","_","_"
2,"jāyate","_","_","jan","V","jan","_","_"
3,"pretya","_","_","pre","CGDA","","_","_"
4,"mūrtimān","_","_","mūrtimat","JJ","","_","_"
5,"_","_","_","ṣoḍaśan","JJ","","_","_"
6,"_","_","_","ātmaka","JJ","","_","_"
1,"vidyayā","_","_","vidyā","NC","","_","_"
2,"jāyate","_","_","jan","V","jan","_","_"
3,"nityam","_","_","nitya","CX","","_","_"
4,"avyayo","_","_","avyaya","JJ","","_","_"
5,"_","_","_","hi","CX","","_","_"
6,"_","_","_","avyaya","JJ","","_","_"
7,"_","_","_","ātmaka","JJ","","_","_"
1,"karma","_","_","karman","NC","","_","_"
2,"_","_","_","tu","CCD","","_","_"
3,"_","_","_","eka","PPX","","_","_"
4,"praśaṃsanti","_","_","praśaṃs","V","praśaṃs","_","_"
5,"_","_","_","su","CAD","","_","_"
6,"_","_","_","alpabuddhitara","JJ","","_","_"
7,"narāḥ","_","_","nara","NC","","_","_"
1,"tena","_","_","tad","PRD","","_","_"
2,"te","_","_","tad","PRD","","_","_"
3,"_","_","_","deha","NC","","_","_"
4,"_","_","_","jāla","NC","","_","_"
5,"ramayanta","_","_","ramay","KDP","","_","_"
6,"upāsate","_","_","ās","V","ās","_","_"
1,"ye","_","_","yad","PRL","","_","_"
2,"tu","_","_","tu","CCD","","_","_"
3,"buddhiṃ","_","_","buddhi","NC","","_","_"
4,"parāṃ","_","_","para","PPX","","_","_"
5,"prāptā","_","_","prāp","PPP","","_","_"
6,"_","_","_","dharma","NC","","_","_"
7,"_","_","_","naipuṇya","NC","","_","_"
8,"_","_","_","darśin","JJ","","_","_"
1,"na","_","_","na","CNG","","_","_"
2,"te","_","_","tad","PRD","","_","_"
3,"karma","_","_","karman","NC","","_","_"
4,"praśaṃsanti","_","_","praśaṃs","V","praśaṃs","_","_"
5,"kūpaṃ","_","_","kūpa","NC","","_","_"
6,"nadyāṃ","_","_","nadī","NC","","_","_"
7,"pibann","_","_","pā","KDP","","_","_"
8,"iva","_","_","iva","CCM","","_","_"
1,"karmaṇaḥ","_","_","karman","NC","","_","_"
2,"phalam","_","_","phala","NC","","_","_"
3,"āpnoti","_","_","āpn","V","āp","_","_"
4,"_","_","_","sukha","NC","","_","_"
5,"_","_","_","duḥkha","NC","","_","_"
6,"_","_","_","bhava","NC","","_","_"
7,"_","_","_","abhava","NC","","_","_"
1,"vidyayā","_","_","vidyā","NC","","_","_"
2,"tad","_","_","tad","PRD","","_","_"
3,"avāpnoti","_","_","avāpn","V","avāp","_","_"
4,"yatra","_","_","yatra","CX","","_","_"
5,"gatvā","_","_","ga","CGDA","","_","_"
6,"na","_","_","na","CNG","","_","_"
7,"śocati","_","_","śuc","V","śuc","_","_"
1,"yatra","_","_","yatra","CX","","_","_"
2,"gatvā","_","_","ga","CGDA","","_","_"
3,"na","_","_","na","CNG","","_","_"
4,"mriyate","_","_","mar","V","mṛ","_","_"
5,"yatra","_","_","yatra","CX","","_","_"
6,"gatvā","_","_","ga","CGDA","","_","_"
7,"na","_","_","na","CNG","","_","_"
8,"jāyate","_","_","jan","V","jan","_","_"
1,"na","_","_","na","CNG","","_","_"
2,"jīryate","_","_","jar","V","jṛ","_","_"
3,"yatra","_","_","yatra","CX","","_","_"
4,"gatvā","_","_","ga","CGDA","","_","_"
5,"yatra","_","_","yatra","CX","","_","_"
6,"gatvā","_","_","ga","CGDA","","_","_"
7,"na","_","_","na","CNG","","_","_"
8,"vardhate","_","_","vṛdh","V","vṛdh","_","_"
1,"yatra","_","_","yatra","CX","","_","_"
2,"tad","_","_","tad","PRD","","_","_"
3,"brahma","_","_","brahman","NC","","_","_"
4,"paramam","_","_","parama","JJ","","_","_"
5,"avyaktam","_","_","avyakta","JJ","","_","_"
6,"ajaraṃ","_","_","ajara","JJ","","_","_"
7,"dhruvam","_","_","dhruva","JJ","","_","_"
1,"avyāhatam","_","_","avyāhata","JJ","","_","_"
2,"anāyāsam","_","_","anāyāsa","JJ","","_","_"
3,"amṛtaṃ","_","_","amṛta","JJ","","_","_"
4,"_","_","_","ca","CCD","","_","_"
5,"_","_","_","aviyogin","JJ","","_","_"
6,"ca","_","_","ca","CCD","","_","_"
1,"dvaṃdvair","_","_","dvaṃdva","NC","","_","_"
2,"yatra","_","_","yatra","CX","","_","_"
3,"na","_","_","na","CNG","","_","_"
4,"bādhyante","_","_","bādh","V","bādh","_","_"
5,"mānasena","_","_","mānasa","JJ","","_","_"
6,"ca","_","_","ca","CCD","","_","_"
7,"karmaṇā","_","_","karman","NC","","_","_"
1,"samāḥ","_","_","sama","PPX","","_","_"
2,"sarvatra","_","_","sarvatra","CX","","_","_"
3,"_","_","_","maitra","JJ","","_","_"
4,"_","_","_","ca","CCD","","_","_"
5,"_","_","_","sarva","JQ","","_","_"
6,"_","_","_","bhūta","NC","","_","_"
7,"_","_","_","hita","NC","","_","_"
8,"ratāḥ","_","_","ra","PPP","","_","_"
1,"_","_","_","vidyā","NC","","_","_"
2,"_","_","_","maya","JJ","","_","_"
3,"'nyaḥ","_","_","anya","PPX","","_","_"
4,"_","_","_","puruṣa","NC","","_","_"
5,"_","_","_","tāta","NC","","_","_"
6,"_","_","_","karman","NC","","_","_"
7,"_","_","_","maya","JJ","","_","_"
8,"'paraḥ","_","_","apara","PPX","","_","_"
1,"viddhi","_","_","vid","V","vid","_","_"
2,"candramasaṃ","_","_","candramas","NC","","_","_"
3,"darśe","_","_","darśa","NC","","_","_"
4,"sūkṣmayā","_","_","sūkṣma","JJ","","_","_"
5,"kalayā","_","_","kala","JJ","","_","_"
6,"sthitam","_","_","sthā","PPP","","_","_"
1,"tad","_","_","tad","PRD","","_","_"
2,"etad","_","_","tad","PRD","","_","_"
3,"ṛṣiṇā","_","_","ṛṣi","NC","","_","_"
4,"proktaṃ","_","_","pravac","PPP","","_","_"
5,"_","_","_","vistara","NC","","_","_"
6,"_","_","_","anumā","V","anumā","_","_"
1,"navajaṃ","_","_","navaja","JJ","","_","_"
2,"śaśinaṃ","_","_","śaśin","NC","","_","_"
3,"dṛṣṭvā","_","_","dṛś","CGDA","","_","_"
4,"vakraṃ","_","_","vakra","JJ","","_","_"
5,"tantum","_","_","tantu","NC","","_","_"
6,"_","_","_","iva","CCM","","_","_"
7,"_","_","_","ambara","NC","","_","_"
1,"_","_","_","ekādaśan","NUM","","_","_"
2,"_","_","_","vikāra","NC","","_","_"
3,"_","_","_","ātman","NC","","_","_"
4,"_","_","_","kalā","NC","","_","_"
5,"_","_","_","sambhāra","NC","","_","_"
6,"_","_","_","sambhṛ","PPP","","_","_"
1,"mūrtimān","_","_","mūrtimat","JJ","","_","_"
2,"iti","_","_","iti","CQT","","_","_"
3,"taṃ","_","_","tad","PRD","","_","_"
4,"viddhi","_","_","vid","V","vid","_","_"
5,"tāta","_","_","tāta","NC","","_","_"
6,"_","_","_","karman","NC","","_","_"
7,"_","_","_","guṇa","NC","","_","_"
8,"_","_","_","ātmaka","JJ","","_","_"
1,"devo","_","_","deva","NC","","_","_"
2,"yaḥ","_","_","yad","PRL","","_","_"
3,"_","_","_","saṃśri","PPP","","_","_"
4,"_","_","_","tad","PRD","","_","_"
5,"_","_","_","ap","CX","","_","_"
6,"_","_","_","bindu","NC","","_","_"
7,"iva","_","_","iva","CCM","","_","_"
8,"puṣkare","_","_","puṣkara","NC","","_","_"
1,"kṣetrajñaṃ","_","_","kṣetrajña","NC","","_","_"
2,"taṃ","_","_","tad","PRD","","_","_"
3,"_","_","_","vijān","V","vijñā","_","_"
4,"_","_","_","nitya","CX","","_","_"
5,"_","_","_","tyāga","NC","","_","_"
6,"_","_","_","ji","PPP","","_","_"
7,"_","_","_","ātmaka","JJ","","_","_"
1,"tamo","_","_","tamas","NC","","_","_"
2,"_","_","_","rajas","NC","","_","_"
3,"_","_","_","ca","CCD","","_","_"
4,"sattvaṃ","_","_","sattva","NC","","_","_"
5,"ca","_","_","ca","CCD","","_","_"
6,"viddhi","_","_","vid","V","vid","_","_"
7,"_","_","_","jīva","NC","","_","_"
8,"_","_","_","guṇa","NC","","_","_"
9,"imān","_","_","ida","PRD","","_","_"
1,"jīvam","_","_","jīva","NC","","_","_"
2,"_","_","_","ātman","NC","","_","_"
3,"_","_","_","guṇa","NC","","_","_"
4,"vidyād","_","_","vid","V","vid","_","_"
5,"ātmānaṃ","_","_","ātman","NC","","_","_"
6,"paramātmanaḥ","_","_","paramātman","NC","","_","_"
1,"_","_","_","sa_saha","CX","","_","_"
2,"_","_","_","cetanā","NC","","_","_"
3,"_","_","_","jīva","NC","","_","_"
4,"_","_","_","guṇa","NC","","_","_"
5,"vadanti","_","_","vad","V","vad","_","_"
6,"sa","_","_","tad","PRD","","_","_"
7,"ceṣṭate","_","_","ceṣṭ","V","ceṣṭ","_","_"
8,"ceṣṭayate","_","_","ceṣṭay","V","ceṣṭay","_","_"
9,"ca","_","_","ca","CCD","","_","_"
10,"sarvam","_","_","sarva","JQ","","_","_"
1,"tataḥ","_","_","tatas","CX","","_","_"
2,"paraṃ","_","_","para","CX","","_","_"
3,"kṣetravido","_","_","kṣetravid","NC","","_","_"
4,"vadanti","_","_","vad","V","vad","_","_"
5,"prāvartayad","_","_","pravartay","V","pravartay","_","_"
6,"yo","_","_","yad","PRL","","_","_"
7,"bhuvanāni","_","_","bhuvana","NC","","_","_"
8,"sapta","_","_","saptan","NUM","","_","_"
