"WordID","word","NormSTEM","suffix","lemma","PoS","Root","NormSuffix","NormWord"
1,"pra","_","_","pra","CADP","","_","_"
2,"kāravo","_","_","kāru","NC","","_","_"
3,"mananā","_","_","manana","NC","","_","_"
4,"vacyamānā","_","_","vañc","KDP","","_","_"
5,"devadrīcīṃ","_","_","devadryañc","JJ","","_","_"
6,"nayata","_","_","nay","V","nī","_","_"
7,"devayantaḥ","_","_","devay","KDP","","_","_"
1,"dakṣiṇāvāḍ","_","_","dakṣiṇāvah","JJ","","_","_"
2,"vājinī","_","_","vājin","JJ","","_","_"
3,"prācy","_","_","prāñc","JJ","","_","_"
4,"eti","_","_","e","V","i","_","_"
5,"havir","_","_","havis","NC","","_","_"
6,"bharanty","_","_","bhṛ","KDP","","_","_"
7,"agnaye","_","_","agni","NC","","_","_"
8,"ghṛtācī","_","_","ghṛtācī","NC","","_","_"
1,"ā","_","_","ā","CADP","","_","_"
2,"rodasī","_","_","rodas","NC","","_","_"
3,"apṛṇā","_","_","pṛ","V","pṛ","_","_"
4,"jāyamāna","_","_","jan","KDP","","_","_"
5,"uta","_","_","uta","CCD","","_","_"
6,"pra","_","_","pra","CADP","","_","_"
7,"rikthā","_","_","ric","V","ric","_","_"
8,"adha","_","_","adha","CX","","_","_"
9,"nu","_","_","nu","CX","","_","_"
10,"prayajyo","_","_","prayajyu","JJ","","_","_"
1,"divaś","_","_","div","NC","","_","_"
2,"cid","_","_","cit","CEM","","_","_"
3,"agne","_","_","agni","NC","","_","_"
4,"mahinā","_","_","mahina","NC","","_","_"
5,"pṛthivyā","_","_","pṛthivī","NC","","_","_"
6,"vacyantāṃ","_","_","vañc","V","vañc","_","_"
7,"te","_","_","tvat","PPR","","_","_"
8,"vahnayaḥ","_","_","vahni","NC","","_","_"
9,"_","_","_","saptan","NUM","","_","_"
10,"_","_","_","jihvā","NC","","_","_"
1,"dyauś","_","_","div","NC","","_","_"
2,"ca","_","_","ca","CCD","","_","_"
3,"tvā","_","_","tvat","PPR","","_","_"
4,"pṛthivī","_","_","pṛthivī","NC","","_","_"
5,"yajñiyāso","_","_","yajñiya","JJ","","_","_"
6,"ni","_","_","ni","CADP","","_","_"
7,"hotāraṃ","_","_","hotṛ","NC","","_","_"
8,"sādayante","_","_","sāday","V","sāday","_","_"
9,"damāya","_","_","dama","NC","","_","_"
1,"yadī","_","_","yadi","CSB","","_","_"
2,"viśo","_","_","viś","NC","","_","_"
3,"mānuṣīr","_","_","mānuṣa","JJ","","_","_"
4,"devayantīḥ","_","_","devay","KDP","","_","_"
5,"prayasvatīr","_","_","prayasvat","JJ","","_","_"
6,"īḍate","_","_","īḍ","V","īḍ","_","_"
7,"śukram","_","_","śukra","JJ","","_","_"
8,"arciḥ","_","_","arcis","NC","","_","_"
1,"mahān","_","_","mahat","JJ","","_","_"
2,"sadhasthe","_","_","sadhastha","NC","","_","_"
3,"dhruva","_","_","dhruva","JJ","","_","_"
4,"ā","_","_","ā","CADP","","_","_"
5,"niṣatto","_","_","niṣad","PPP","","_","_"
6,"'ntar","_","_","antar","CAD","","_","_"
7,"dyāvā","_","_","div","NC","","_","_"
8,"māhine","_","_","māhina","JJ","","_","_"
9,"haryamāṇaḥ","_","_","hary","KDP","","_","_"
1,"āskre","_","_","āskra","JJ","","_","_"
2,"sapatnī","_","_","sapatnī","NC","","_","_"
3,"ajare","_","_","ajara","JJ","","_","_"
4,"amṛkte","_","_","amṛkta","JJ","","_","_"
5,"sabardughe","_","_","sabardugha","JJ","","_","_"
6,"urugāyasya","_","_","urugāya","JJ","","_","_"
7,"dhenū","_","_","dhenu","NC","","_","_"
1,"vratā","_","_","vrata","NC","","_","_"
2,"te","_","_","tvat","PPR","","_","_"
3,"agne","_","_","agni","NC","","_","_"
4,"mahato","_","_","mahat","JJ","","_","_"
5,"mahāni","_","_","maha","JJ","","_","_"
6,"tava","_","_","tvat","PPR","","_","_"
7,"kratvā","_","_","kratu","NC","","_","_"
8,"rodasī","_","_","rodas","NC","","_","_"
9,"ā","_","_","ā","CADP","","_","_"
10,"tatantha","_","_","tan","V","tan","_","_"
1,"tvaṃ","_","_","tvat","PPR","","_","_"
2,"dūto","_","_","dūta","NC","","_","_"
3,"abhavo","_","_","bhav","V","bhū","_","_"
4,"jāyamānas","_","_","jan","KDP","","_","_"
6,"netā","_","_","nay","V","nī","_","_"
7,"vṛṣabha","_","_","vṛṣabha","NC","","_","_"
8,"carṣaṇīnām","_","_","carṣaṇi","NC","","_","_"
1,"ṛtasya","_","_","ṛta","NC","","_","_"
2,"vā","_","_","vā","CCD","","_","_"
3,"keśinā","_","_","keśin","JJ","","_","_"
4,"yogyābhir","_","_","yogyā","NC","","_","_"
5,"ghṛtasnuvā","_","_","ghṛtasnu","JJ","","_","_"
6,"rohitā","_","_","rohita","JJ","","_","_"
7,"dhuri","_","_","dhur","NC","","_","_"
8,"dhiṣva","_","_","dadh","V","dhā","_","_"
1,"_","_","_","atha","CAD","","_","_"
2,"_","_","_","ā","CADP","","_","_"
3,"vaha","_","_","vah","V","vah","_","_"
4,"devān","_","_","deva","NC","","_","_"
5,"deva","_","_","deva","NC","","_","_"
6,"viśvān","_","_","viśva","JQ","","_","_"
7,"_","_","_","su","CAD","","_","_"
8,"_","_","_","adhvara","NC","","_","_"
9,"kṛṇuhi","_","_","kar","V","kṛ","_","_"
10,"jātavedaḥ","_","_","jātavedas","NC","","_","_"
1,"divaś","_","_","div","NC","","_","_"
2,"cid","_","_","cit","CEM","","_","_"
3,"ā","_","_","ā","CADP","","_","_"
4,"te","_","_","tvat","PPR","","_","_"
5,"rucayanta","_","_","rucay","V","rucay","_","_"
6,"rokā","_","_","roka","NC","","_","_"
7,"uṣo","_","_","uṣas","NC","","_","_"
8,"vibhātīr","_","_","vibhā","KDP","","_","_"
9,"anu","_","_","anu","CADP","","_","_"
10,"bhāsi","_","_","bhā","V","bhā","_","_"
11,"pūrvīḥ","_","_","puru","JJ","","_","_"
1,"apo","_","_","apas","NC","","_","_"
2,"yad","_","_","yat","CSB","","_","_"
3,"agna","_","_","agni","NC","","_","_"
4,"uśadhag","_","_","uśadhak","JJ","","_","_"
5,"vaneṣu","_","_","vana","NC","","_","_"
6,"hotur","_","_","hotṛ","NC","","_","_"
7,"mandrasya","_","_","mandra","JJ","","_","_"
8,"panayanta","_","_","panay","V","panay","_","_"
9,"devāḥ","_","_","deva","NC","","_","_"
1,"urau","_","_","uru","JJ","","_","_"
2,"vā","_","_","vā","CCD","","_","_"
3,"ye","_","_","yad","PRL","","_","_"
4,"antarikṣe","_","_","antarikṣa","NC","","_","_"
5,"madanti","_","_","mat","V","mat","_","_"
6,"divo","_","_","div","NC","","_","_"
7,"vā","_","_","vā","CCD","","_","_"
8,"ye","_","_","yad","PRL","","_","_"
9,"rocane","_","_","rocana","NC","","_","_"
10,"santi","_","_","as","V","as","_","_"
11,"devāḥ","_","_","deva","NC","","_","_"
1,"ūmā","_","_","ūma","NC","","_","_"
2,"vā","_","_","vā","CCD","","_","_"
3,"ye","_","_","yad","PRL","","_","_"
4,"_","_","_","su","CAD","","_","_"
5,"_","_","_","hava","NC","","_","_"
6,"yajatrā","_","_","yajatra","JJ","","_","_"
7,"āyemire","_","_","āya","V","āya","_","_"
8,"rathyo","_","_","rathī","JJ","","_","_"
9,"agne","_","_","agni","NC","","_","_"
10,"aśvāḥ","_","_","aśva","NC","","_","_"
1,"_","_","_","ā","CADP","","_","_"
2,"_","_","_","ida","PRD","","_","_"
3,"agne","_","_","agni","NC","","_","_"
4,"_","_","_","sa_saha","CX","","_","_"
5,"_","_","_","ratha","NC","","_","_"
6,"yāhy","_","_","yā","V","yā","_","_"
7,"arvāṅ","_","_","arvāñc","JJ","","_","_"
8,"_","_","_","nānā","CX","","_","_"
9,"_","_","_","ratha","NC","","_","_"
10,"vā","_","_","vā","CCD","","_","_"
11,"vibhavo","_","_","vibhu","JJ","","_","_"
12,"hy","_","_","hi","CX","","_","_"
13,"aśvāḥ","_","_","aśva","NC","","_","_"
1,"patnīvatas","_","_","patnīvat","JJ","","_","_"
2,"triṃśataṃ","_","_","triṃśat","NC","","_","_"
3,"trīṃś","_","_","tri","NUM","","_","_"
4,"ca","_","_","ca","CCD","","_","_"
5,"devān","_","_","deva","NC","","_","_"
6,"anuṣvadham","_","_","anuṣvadha","CX","","_","_"
7,"ā","_","_","ā","CADP","","_","_"
8,"vaha","_","_","vah","V","vah","_","_"
9,"mādayasva","_","_","māday","V","māday","_","_"
1,"sa","_","_","tad","PRD","","_","_"
2,"hotā","_","_","hotṛ","NC","","_","_"
3,"yasya","_","_","yad","PRL","","_","_"
4,"rodasī","_","_","rodas","NC","","_","_"
5,"cid","_","_","cit","CEM","","_","_"
6,"urvī","_","_","urvī","NC","","_","_"
7,"yajñaṃ","_","_","yajña","NC","","_","_"
8,"yajñam","_","_","yajña","NC","","_","_"
9,"abhi","_","_","abhi","CADP","","_","_"
10,"vṛdhe","_","_","vṛdh","CGDI","","_","_"
11,"gṛṇītaḥ","_","_","gṛ","V","gṛ","_","_"
1,"prācī","_","_","prāñc","JJ","","_","_"
2,"_","_","_","adhvara","NC","","_","_"
3,"_","_","_","iva","CCM","","_","_"
4,"tasthatuḥ","_","_","tiṣṭh","V","sthā","_","_"
5,"sumeke","_","_","sumeka","JJ","","_","_"
6,"ṛtāvarī","_","_","ṛtāvan","JJ","","_","_"
7,"_","_","_","ṛta","NC","","_","_"
8,"_","_","_","jan","PPP","","_","_"
9,"satye","_","_","satya","JJ","","_","_"
1,"iḍām","_","_","iḍā","NC","","_","_"
2,"agne","_","_","agni","NC","","_","_"
3,"purudaṃsaṃ","_","_","purudaṃsa","JJ","","_","_"
4,"saniṃ","_","_","sani","NC","","_","_"
5,"goḥ","_","_","go","NC","","_","_"
6,"śaśvattamaṃ","_","_","śaśvattama","JJ","","_","_"
7,"havamānāya","_","_","hvā","KDP","","_","_"
8,"sādha","_","_","sādh","V","sādh","_","_"
1,"syān","_","_","as","V","as","_","_"
2,"naḥ","_","_","mat","PPR","","_","_"
3,"sūnus","_","_","sūnu","NC","","_","_"
4,"tanayo","_","_","tanaya","JJ","","_","_"
5,"_","_","_","vijāvan","JJ","","_","_"
6,"_","_","_","agni","NC","","_","_"
7,"sā","_","_","tad","PRD","","_","_"
8,"te","_","_","tvat","PPR","","_","_"
9,"sumatir","_","_","sumati","NC","","_","_"
10,"bhūtv","_","_","bhav","V","bhū","_","_"
11,"asme","_","_","mat","PPR","","_","_"
