"WordID","word","NormSTEM","suffix","lemma","PoS","Root","NormSuffix","NormWord"
1,"abodhy","_","_","bodh","V","budh","_","_"
2,"agnir","_","_","agni","NC","","_","_"
3,"jma","_","_","jm","NC","","_","_"
4,"ud","_","_","ud","CADP","","_","_"
5,"eti","_","_","e","V","i","_","_"
6,"sūryo","_","_","sūrya","NC","","_","_"
7,"vy","_","_","vi","CADP","","_","_"
8,"uṣāś","_","_","uṣas","NC","","_","_"
9,"candrā","_","_","candra","JJ","","_","_"
10,"mahy","_","_","mah","JJ","","_","_"
11,"āvo","_","_","vas","V","vas","_","_"
12,"arciṣā","_","_","arcis","NC","","_","_"
1,"āyukṣātām","_","_","āyuj","V","āyuj","_","_"
2,"aśvinā","_","_","aśvin","NC","","_","_"
3,"yātave","_","_","yā","CGDI","","_","_"
4,"ratham","_","_","ratha","NC","","_","_"
5,"prāsāvīd","_","_","prasuv","V","prasū","_","_"
6,"devaḥ","_","_","deva","NC","","_","_"
7,"savitā","_","_","savitṛ","NC","","_","_"
8,"jagat","_","_","jagat","NC","","_","_"
9,"pṛthak","_","_","pṛthak","CX","","_","_"
1,"yad","_","_","yat","CSB","","_","_"
2,"yuñjāthe","_","_","yuj","V","yuj","_","_"
3,"vṛṣaṇam","_","_","vṛṣan","JJ","","_","_"
4,"aśvinā","_","_","aśvin","NC","","_","_"
5,"rathaṃ","_","_","ratha","NC","","_","_"
6,"ghṛtena","_","_","ghṛta","NC","","_","_"
7,"no","_","_","mat","PPR","","_","_"
8,"madhunā","_","_","madhu","NC","","_","_"
9,"kṣatram","_","_","kṣatra","NC","","_","_"
10,"ukṣatam","_","_","ukṣ","V","ukṣ","_","_"
1,"asmākam","_","_","mat","PPR","","_","_"
2,"brahma","_","_","brahman","NC","","_","_"
3,"pṛtanāsu","_","_","pṛtanā","NC","","_","_"
4,"jinvataṃ","_","_","jinv","V","jinv","_","_"
5,"vayaṃ","_","_","mat","PPR","","_","_"
6,"dhanā","_","_","dhana","NC","","_","_"
7,"śūrasātā","_","_","śūrasāti","NC","","_","_"
8,"bhajemahi","_","_","bhaj","V","bhaj","_","_"
1,"arvāṅ","_","_","arvāñc","JJ","","_","_"
2,"_","_","_","tri","NUM","","_","_"
3,"_","_","_","cakra","NC","","_","_"
4,"_","_","_","madhu","NC","","_","_"
5,"_","_","_","vāhana","JJ","","_","_"
6,"ratho","_","_","ratha","NC","","_","_"
7,"_","_","_","jīra","JJ","","_","_"
8,"_","_","_","aśva","NC","","_","_"
9,"aśvinor","_","_","aśvin","NC","","_","_"
10,"yātu","_","_","yā","V","yā","_","_"
11,"suṣṭutaḥ","_","_","suṣṭuta","JJ","","_","_"
1,"_","_","_","tri","NUM","","_","_"
2,"_","_","_","vandhura","NC","","_","_"
3,"maghavā","_","_","maghavan","JJ","","_","_"
4,"_","_","_","viśva","JQ","","_","_"
5,"_","_","_","saubhaga","NC","","_","_"
6,"śaṃ","_","_","śa","CX","","_","_"
7,"na","_","_","mat","PPR","","_","_"
8,"ā","_","_","ā","CADP","","_","_"
9,"vakṣad","_","_","vah","V","vah","_","_"
10,"dvipade","_","_","dvipad","NC","","_","_"
11,"catuṣpade","_","_","catuṣpada","JJ","","_","_"
1,"ā","_","_","ā","CADP","","_","_"
2,"na","_","_","mat","PPR","","_","_"
3,"ūrjaṃ","_","_","ūrj","NC","","_","_"
4,"vahatam","_","_","vah","V","vah","_","_"
5,"aśvinā","_","_","aśvin","NC","","_","_"
6,"yuvam","_","_","tvat","PPR","","_","_"
7,"madhumatyā","_","_","madhumat","JJ","","_","_"
8,"naḥ","_","_","mat","PPR","","_","_"
9,"kaśayā","_","_","kaśā","NC","","_","_"
10,"mimikṣatam","_","_","mikṣ","V","mikṣ","_","_"
1,"_","_","_","pra","CADP","","_","_"
2,"_","_","_","āyus","NC","","_","_"
3,"tāriṣṭaṃ","_","_","tar","V","tṛ","_","_"
4,"nī","_","_","niḥ","CADP","","_","_"
5,"rapāṃsi","_","_","rapas","NC","","_","_"
6,"mṛkṣataṃ","_","_","mṛj","V","mṛj","_","_"
7,"sedhataṃ","_","_","sidh","V","sidh","_","_"
8,"dveṣo","_","_","dveṣas","NC","","_","_"
9,"bhavataṃ","_","_","bhav","V","bhū","_","_"
10,"sacābhuvā","_","_","sacābhū","NC","","_","_"
1,"yuvaṃ","_","_","tvat","PPR","","_","_"
2,"ha","_","_","ha","CEM","","_","_"
3,"garbhaṃ","_","_","garbha","NC","","_","_"
4,"jagatīṣu","_","_","jagatī","NC","","_","_"
5,"dhattho","_","_","dadh","V","dhā","_","_"
6,"yuvaṃ","_","_","tvat","PPR","","_","_"
7,"viśveṣu","_","_","viśva","JQ","","_","_"
8,"bhuvaneṣv","_","_","bhuvana","NC","","_","_"
9,"antaḥ","_","_","antar","CAD","","_","_"
1,"yuvam","_","_","tvat","PPR","","_","_"
2,"agniṃ","_","_","agni","NC","","_","_"
3,"ca","_","_","ca","CCD","","_","_"
4,"vṛṣaṇāv","_","_","vṛṣan","NC","","_","_"
5,"apaś","_","_","ap","NC","","_","_"
6,"ca","_","_","ca","CCD","","_","_"
7,"vanaspatīṃr","_","_","vanaspati","NC","","_","_"
8,"aśvināv","_","_","aśvin","NC","","_","_"
9,"airayethām","_","_","īray","V","īray","_","_"
1,"yuvaṃ","_","_","tvat","PPR","","_","_"
2,"ha","_","_","ha","CEM","","_","_"
3,"stho","_","_","as","V","as","_","_"
4,"bhiṣajā","_","_","bhiṣaj","NC","","_","_"
5,"bheṣajebhir","_","_","bheṣaja","NC","","_","_"
6,"atho","_","_","atho","CX","","_","_"
7,"ha","_","_","ha","CEM","","_","_"
8,"stho","_","_","as","V","as","_","_"
9,"rathyā","_","_","rathya","JJ","","_","_"
10,"rāthyebhiḥ","_","_","rāthya","NC","","_","_"
1,"atho","_","_","atho","CX","","_","_"
2,"ha","_","_","ha","CEM","","_","_"
3,"kṣatram","_","_","kṣatra","NC","","_","_"
4,"adhi","_","_","adhi","CADP","","_","_"
5,"dhattha","_","_","dadh","V","dhā","_","_"
6,"ugrā","_","_","ugra","JJ","","_","_"
7,"yo","_","_","yad","PRL","","_","_"
8,"vāṃ","_","_","tvat","PPR","","_","_"
9,"haviṣmān","_","_","haviṣmat","JJ","","_","_"
10,"manasā","_","_","manas","NC","","_","_"
11,"dadāśa","_","_","dāś","V","dāś","_","_"
