"WordID","word","NormSTEM","suffix","lemma","PoS","Root","NormSuffix","NormWord"
1,"vaiśaṃpāyana","_","_","vaiśampāyana","NC","","_","_"
2,"uvāca","_","_","vak","V","vac","_","_"
1,"tasmin","_","_","tad","PRD","","_","_"
2,"_","_","_","vākya","NC","","_","_"
3,"_","_","_","antara","NC","","_","_"
4,"vaktā","_","_","vaktṛ","JJ","","_","_"
5,"devasthāno","_","_","devasthāna","NC","","_","_"
6,"_","_","_","mahat","JJ","","_","_"
7,"_","_","_","tapas","NC","","_","_"
1,"abhinītataraṃ","_","_","abhinītatara","JJ","","_","_"
2,"vākyam","_","_","vākya","NC","","_","_"
3,"_","_","_","iti","CQT","","_","_"
4,"_","_","_","vak","V","vac","_","_"
5,"yudhiṣṭhiram","_","_","yudhiṣṭhira","NC","","_","_"
1,"yad","_","_","yad","PRL","","_","_"
2,"vacaḥ","_","_","vacas","NC","","_","_"
3,"_","_","_","phalguna","NC","","_","_"
4,"_","_","_","vac","PPP","","_","_"
5,"na","_","_","na","CNG","","_","_"
6,"jyāyo","_","_","jyāyas","JJ","","_","_"
7,"'sti","_","_","as","V","as","_","_"
8,"dhanād","_","_","dhana","NC","","_","_"
9,"iti","_","_","iti","CQT","","_","_"
1,"atra","_","_","atra","CAD","","_","_"
2,"te","_","_","tvat","PPR","","_","_"
3,"vartayiṣyāmi","_","_","vart","V","vṛt","_","_"
4,"tad","_","_","tad","PRD","","_","_"
5,"_","_","_","ekāgra","JJ","","_","_"
6,"_","_","_","manas","NC","","_","_"
7,"śṛṇu","_","_","śṛṇ","V","śru","_","_"
1,"ajātaśatro","_","_","ajātaśatru","NC","","_","_"
2,"dharmeṇa","_","_","dharma","NC","","_","_"
3,"kṛtsnā","_","_","kṛtsna","JJ","","_","_"
4,"te","_","_","tvat","PPR","","_","_"
5,"vasudhā","_","_","vasudhā","NC","","_","_"
6,"jitā","_","_","ji","PPP","","_","_"
1,"tāṃ","_","_","tad","PRD","","_","_"
2,"jitvā","_","_","ji","CGDA","","_","_"
3,"na","_","_","na","CNG","","_","_"
4,"vṛthā","_","_","vṛthā","CX","","_","_"
5,"_","_","_","rājan","NC","","_","_"
6,"_","_","_","tvat","PPR","","_","_"
7,"parityaktum","_","_","parityaj","CGDI","","_","_"
8,"arhasi","_","_","arh","V","arh","_","_"
1,"catuṣpadī","_","_","catuṣpada","JJ","","_","_"
2,"hi","_","_","hi","CX","","_","_"
3,"niḥ","_","_","niḥ_privativum","NC","","_","_"
3,"niḥśreṇī","_","_","śreṇī","NC","","_","_"
4,"_","_","_","karman","NC","","_","_"
5,"_","_","_","tad","PRD","","_","_"
6,"pratiṣṭhitā","_","_","pratiṣṭhā","PPP","","_","_"
1,"tāṃ","_","_","tad","PRD","","_","_"
2,"krameṇa","_","_","krameṇa","CX","","_","_"
3,"_","_","_","mahat","JJ","","_","_"
4,"_","_","_","bāhu","NC","","_","_"
5,"_","_","_","yathāvat","CX","","_","_"
6,"_","_","_","jay","V","ji","_","_"
7,"pārthiva","_","_","pārthiva","NC","","_","_"
1,"tasmāt","_","_","tasmāt","CX","","_","_"
2,"pārtha","_","_","pārtha","NC","","_","_"
3,"_","_","_","mahat","JJ","","_","_"
4,"_","_","_","yajña","NC","","_","_"
5,"yajasva","_","_","yaj","V","yaj","_","_"
6,"_","_","_","bahu","JJ","","_","_"
7,"_","_","_","dakṣiṇā","NC","","_","_"
1,"_","_","_","svādhyāya","NC","","_","_"
2,"_","_","_","yajña","NC","","_","_"
3,"ṛṣayo","_","_","ṛṣi","NC","","_","_"
4,"_","_","_","jñāna","NC","","_","_"
5,"_","_","_","yajña","NC","","_","_"
6,"_","_","_","tathā","CX","","_","_"
7,"_","_","_","apara","PPX","","_","_"
1,"_","_","_","karman","NC","","_","_"
2,"_","_","_","niṣṭhā","NC","","_","_"
3,"_","_","_","tu","CCD","","_","_"
4,"_","_","_","bodh","V","budh","_","_"
5,"_","_","_","tapas","NC","","_","_"
6,"_","_","_","niṣṭhā","NC","","_","_"
7,"_","_","_","ca","CCD","","_","_"
8,"bhārata","_","_","bhārata","NC","","_","_"
1,"vaikhānasānāṃ","_","_","vaikhānasa","NC","","_","_"
2,"_","_","_","rājan","NC","","_","_"
3,"_","_","_","indra","NC","","_","_"
4,"vacanaṃ","_","_","vacana","NC","","_","_"
5,"śrūyate","_","_","śṛṇ","V","śru","_","_"
6,"yathā","_","_","yathā","CCM","","_","_"
1,"īhate","_","_","īh","V","īh","_","_"
2,"_","_","_","dhana","NC","","_","_"
3,"_","_","_","hetu","NC","","_","_"
4,"_","_","_","yad","PRL","","_","_"
5,"_","_","_","tad","PRD","","_","_"
6,"_","_","_","anīhā","NC","","_","_"
7,"garīyasī","_","_","garīyas","JJ","","_","_"
1,"bhūyān","_","_","bhūyas","JJ","","_","_"
2,"doṣaḥ","_","_","doṣa","NC","","_","_"
3,"pravardheta","_","_","pravṛdh","V","pravṛdh","_","_"
4,"_","_","_","yad","PRL","","_","_"
5,"_","_","_","tad","PRD","","_","_"
6,"dhanam","_","_","dhana","NC","","_","_"
7,"apāśrayet","_","_","apāśri","V","apāśri","_","_"
1,"_","_","_","kṛcchra","NC","","_","_"
2,"_","_","_","ca","CCD","","_","_"
3,"_","_","_","dravya","NC","","_","_"
4,"_","_","_","saṃhāra","NC","","_","_"
5,"kurvanti","_","_","kar","V","kṛ","_","_"
6,"_","_","_","dhana","NC","","_","_"
7,"_","_","_","kāraṇa","NC","","_","_"
1,"dhanena","_","_","dhana","NC","","_","_"
2,"tṛṣito","_","_","tṛṣita","JJ","","_","_"
3,"'buddhyā","_","_","abuddhi","NC","","_","_"
4,"_","_","_","bhrūṇa","NC","","_","_"
5,"_","_","_","hatyā","NC","","_","_"
6,"na","_","_","na","CNG","","_","_"
7,"budhyate","_","_","bodh","V","budh","_","_"
1,"_","_","_","an","CX","","_","_"
2,"_","_","_","arh","KDP","","_","_"
3,"yad","_","_","yat","CSB","","_","_"
4,"dadāti","_","_","dad","V","dā","_","_"
5,"na","_","_","na","CNG","","_","_"
6,"dadāti","_","_","dad","V","dā","_","_"
7,"yad","_","_","yat","CSB","","_","_"
8,"arhate","_","_","arh","V","arh","_","_"
1,"_","_","_","anarha","JJ","","_","_"
2,"_","_","_","arha","JJ","","_","_"
3,"a","_","_","alpha_privativum","NC","","_","_"
3,"_","_","_","parijñāna","NC","","_","_"
4,"_","_","_","dāna","NC","","_","_"
5,"_","_","_","dharma","NC","","_","_"
6,"'pi","_","_","api","CX","","_","_"
7,"duṣkaraḥ","_","_","duṣkara","JJ","","_","_"
1,"yajñāya","_","_","yajña","NC","","_","_"
2,"sṛṣṭāni","_","_","sṛj","PPP","","_","_"
3,"dhanāni","_","_","dhana","NC","","_","_"
4,"dhātrā","_","_","dhātṛ","NC","","_","_"
5,"_","_","_","yaṣṭṛ","JJ","","_","_"
6,"_","_","_","ādiś","PPP","","_","_"
7,"puruṣo","_","_","puruṣa","NC","","_","_"
8,"rakṣitā","_","_","rakṣitṛ","JJ","","_","_"
9,"ca","_","_","ca","CCD","","_","_"
1,"tasmāt","_","_","tasmāt","CX","","_","_"
2,"sarvaṃ","_","_","sarva","JQ","","_","_"
3,"yajña","_","_","yajña","NC","","_","_"
4,"_","_","_","eva","CEM","","_","_"
5,"_","_","_","upayuj","KDG","","_","_"
6,"dhanaṃ","_","_","dhana","NC","","_","_"
7,"tato","_","_","tatas","CX","","_","_"
8,"'nantara","_","_","anantara","JJ","","_","_"
9,"eva","_","_","eva","CEM","","_","_"
10,"kāmaḥ","_","_","kāma","NC","","_","_"
1,"yajñair","_","_","yajña","NC","","_","_"
2,"indro","_","_","indra","NC","","_","_"
3,"vividhair","_","_","vividha","JJ","","_","_"
4,"annavadbhir","_","_","annavat","JJ","","_","_"
5,"devān","_","_","deva","NC","","_","_"
6,"sarvān","_","_","sarva","JQ","","_","_"
7,"_","_","_","abhiyā","V","abhiyā","_","_"
8,"_","_","_","mahat","JJ","","_","_"
9,"_","_","_","ojas","NC","","_","_"
1,"_","_","_","ta","CX","","_","_"
2,"_","_","_","indra","NC","","_","_"
4,"prāpya","_","_","prāp","CGDA","","_","_"
5,"vibhrājate","_","_","vibhrāj","V","vibhrāj","_","_"
6,"'sau","_","_","adas","PRD","","_","_"
7,"tasmād","_","_","tasmāt","CX","","_","_"
8,"yajñe","_","_","yajña","NC","","_","_"
9,"sarvam","_","_","sarva","JQ","","_","_"
10,"_","_","_","eva","CEM","","_","_"
11,"_","_","_","upayuj","KDG","","_","_"
1,"mahādevaḥ","_","_","mahādeva","NC","","_","_"
2,"sarvamedhe","_","_","sarvamedha","NC","","_","_"
3,"mahātmā","_","_","mahātman","JJ","","_","_"
4,"_","_","_","hu","CGDA","","_","_"
5,"_","_","_","ātman","NC","","_","_"
6,"devadevo","_","_","devadeva","NC","","_","_"
7,"vibhūtaḥ","_","_","vibhūta","JJ","","_","_"
1,"_","_","_","viśva","JQ","","_","_"
2,"_","_","_","loka","NC","","_","_"
3,"vyāpya","_","_","vyāp","CGDA","","_","_"
4,"viṣṭabhya","_","_","viṣṭambh","CGDA","","_","_"
5,"kīrtyā","_","_","kīrti","NC","","_","_"
6,"virocate","_","_","viroc","V","viruc","_","_"
7,"dyutimān","_","_","dyutimat","JJ","","_","_"
8,"kṛttivāsāḥ","_","_","kṛttivāsas","NC","","_","_"
1,"āvikṣitaḥ","_","_","āvikṣita","NC","","_","_"
2,"pārthivo","_","_","pārthiva","NC","","_","_"
3,"vai","_","_","vai","CX","","_","_"
4,"maruttaḥ","_","_","marutta","NC","","_","_"
5,"_","_","_","su","CAD","","_","_"
6,"_","_","_","ṛddhi","NC","","_","_"
7,"martyo","_","_","martya","NC","","_","_"
8,"yo","_","_","yad","PRL","","_","_"
9,"'jayad","_","_","jay","V","ji","_","_"
10,"devarājam","_","_","devarāja","NC","","_","_"
1,"yajñe","_","_","yajña","NC","","_","_"
2,"yasya","_","_","yad","PRL","","_","_"
3,"śrīḥ","_","_","śrī","NC","","_","_"
4,"svayaṃ","_","_","svaya","CX","","_","_"
5,"saṃniviṣṭā","_","_","saṃniviś","PPP","","_","_"
6,"yasmin","_","_","yad","PRL","","_","_"
7,"bhāṇḍaṃ","_","_","bhāṇḍa","NC","","_","_"
8,"kāñcanaṃ","_","_","kāñcana","JJ","","_","_"
9,"sarvam","_","_","sarva","JQ","","_","_"
10,"āsīt","_","_","as","V","as","_","_"
1,"hariścandraḥ","_","_","hariścandra","NC","","_","_"
2,"_","_","_","pārthiva","NC","","_","_"
3,"_","_","_","indra","NC","","_","_"
4,"_","_","_","śru","PPP","","_","_"
5,"_","_","_","tvat","PPR","","_","_"
6,"yajñair","_","_","yajña","NC","","_","_"
7,"iṣṭvā","_","_","yaj","CGDA","","_","_"
8,"_","_","_","puṇya","JJ","","_","_"
9,"_","_","_","kṛt","JJ","","_","_"
10,"_","_","_","vī","PPP","","_","_"
11,"_","_","_","śoka","NC","","_","_"
1,"ṛddhyā","_","_","ṛddhi","NC","","_","_"
2,"śakraṃ","_","_","śakra","NC","","_","_"
3,"yo","_","_","yad","PRL","","_","_"
4,"_","_","_","jay","V","ji","_","_"
5,"_","_","_","mānuṣa","NC","","_","_"
6,"saṃs","_","_","as","KDP","","_","_"
7,"tasmād","_","_","tasmāt","CX","","_","_"
8,"yajñe","_","_","yajña","NC","","_","_"
9,"sarvam","_","_","sarva","JQ","","_","_"
10,"_","_","_","eva","CEM","","_","_"
11,"_","_","_","upayuj","KDG","","_","_"
