"WordID","word","NormSTEM","suffix","lemma","PoS","Root","NormSuffix","NormWord"
1,"somāpūṣaṇā","_","_","somāpūṣan","NC","","_","_"
2,"jananā","_","_","janana","JJ","","_","_"
3,"rayīṇāṃ","_","_","rayi","NC","","_","_"
4,"jananā","_","_","janana","JJ","","_","_"
5,"divo","_","_","div","NC","","_","_"
6,"jananā","_","_","janana","JJ","","_","_"
7,"pṛthivyāḥ","_","_","pṛthivī","NC","","_","_"
1,"jātau","_","_","jan","PPP","","_","_"
2,"viśvasya","_","_","viśva","JQ","","_","_"
3,"bhuvanasya","_","_","bhuvana","NC","","_","_"
4,"gopau","_","_","gopa","NC","","_","_"
5,"devā","_","_","deva","NC","","_","_"
6,"akṛṇvann","_","_","kar","V","kṛ","_","_"
7,"amṛtasya","_","_","amṛta","NC","","_","_"
8,"nābhim","_","_","nābhi","NC","","_","_"
1,"imau","_","_","ida","PRD","","_","_"
2,"devau","_","_","deva","NC","","_","_"
3,"jāyamānau","_","_","jan","KDP","","_","_"
4,"_","_","_","juṣ","V","juṣ","_","_"
5,"_","_","_","ida","PRD","","_","_"
6,"tamāṃsi","_","_","tamas","NC","","_","_"
7,"gūhatām","_","_","guh","V","guh","_","_"
8,"a","_","_","alpha_privativum","JJ","","_","_"
8,"ajuṣṭā","_","_","juṣṭa","JJ","","_","_"
1,"ābhyām","_","_","ida","PRD","","_","_"
2,"indraḥ","_","_","indra","NC","","_","_"
3,"pakvam","_","_","pakva","JJ","","_","_"
4,"āmāsv","_","_","āma","JJ","","_","_"
5,"antaḥ","_","_","antar","CAD","","_","_"
6,"somāpūṣabhyāṃ","_","_","somāpūṣan","NC","","_","_"
7,"janad","_","_","jan","V","jan","_","_"
8,"usriyāsu","_","_","usriyā","NC","","_","_"
1,"somāpūṣaṇā","_","_","somāpūṣan","NC","","_","_"
2,"rajaso","_","_","rajas","NC","","_","_"
3,"vimānaṃ","_","_","vimā","KDP","","_","_"
4,"_","_","_","saptan","NUM","","_","_"
5,"_","_","_","cakra","NC","","_","_"
6,"ratham","_","_","ratha","NC","","_","_"
7,"_","_","_","a","CNG","","_","_"
8,"_","_","_","viśvaminva","JJ","","_","_"
1,"viṣūvṛtam","_","_","viṣūvṛt","JJ","","_","_"
2,"manasā","_","_","manas","NC","","_","_"
3,"yujyamānaṃ","_","_","yuj","KDP","","_","_"
4,"taṃ","_","_","tad","PRD","","_","_"
5,"jinvatho","_","_","jinv","V","jinv","_","_"
6,"vṛṣaṇā","_","_","vṛṣan","NC","","_","_"
7,"_","_","_","pañcan","NUM","","_","_"
8,"_","_","_","raśmi","NC","","_","_"
1,"divy","_","_","div","NC","","_","_"
2,"anyaḥ","_","_","anya","PPX","","_","_"
3,"sadanaṃ","_","_","sadana","NC","","_","_"
4,"cakra","_","_","kar","V","kṛ","_","_"
5,"uccā","_","_","uccā","CX","","_","_"
6,"pṛthivyām","_","_","pṛthivī","NC","","_","_"
7,"anyo","_","_","anya","PPX","","_","_"
8,"adhy","_","_","adhi","CADP","","_","_"
9,"antarikṣe","_","_","antarikṣa","NC","","_","_"
1,"tāv","_","_","tad","PRD","","_","_"
2,"asmabhyam","_","_","mat","PPR","","_","_"
3,"_","_","_","puru","JJ","","_","_"
4,"_","_","_","vāra","NC","","_","_"
5,"purukṣuṃ","_","_","purukṣu","JJ","","_","_"
6,"rāyas","_","_","rai","NC","","_","_"
7,"poṣaṃ","_","_","poṣa","NC","","_","_"
8,"vi","_","_","vi","CADP","","_","_"
9,"ṣyatāṃ","_","_","sā","V","sā","_","_"
10,"nābhim","_","_","nābhi","NC","","_","_"
11,"asme","_","_","mat","PPR","","_","_"
1,"viśvāny","_","_","viśva","JQ","","_","_"
2,"anyo","_","_","anya","PPX","","_","_"
3,"bhuvanā","_","_","bhuvana","NC","","_","_"
4,"jajāna","_","_","jan","V","jan","_","_"
5,"viśvam","_","_","viśva","JQ","","_","_"
6,"anyo","_","_","anya","PPX","","_","_"
7,"abhicakṣāṇa","_","_","abhicakṣ","KDP","","_","_"
8,"eti","_","_","e","V","i","_","_"
1,"somāpūṣaṇāv","_","_","somāpūṣan","NC","","_","_"
2,"avataṃ","_","_","av","V","av","_","_"
3,"dhiyam","_","_","dhī","NC","","_","_"
4,"me","_","_","mat","PPR","","_","_"
5,"yuvābhyāṃ","_","_","tvat","PPR","","_","_"
6,"viśvāḥ","_","_","viśva","JQ","","_","_"
7,"pṛtanā","_","_","pṛtanā","NC","","_","_"
8,"jayema","_","_","jay","V","ji","_","_"
1,"dhiyam","_","_","dhī","NC","","_","_"
2,"pūṣā","_","_","pūṣan","NC","","_","_"
3,"jinvatu","_","_","jinv","V","jinv","_","_"
4,"viśvaminvo","_","_","viśvaminva","JJ","","_","_"
5,"rayiṃ","_","_","rayi","NC","","_","_"
6,"somo","_","_","soma","NC","","_","_"
7,"_","_","_","rayi","NC","","_","_"
8,"_","_","_","pati","NC","","_","_"
9,"dadhātu","_","_","dadh","V","dhā","_","_"
1,"avatu","_","_","avatu","V","av","_","_"
2,"devy","_","_","devī","NC","","_","_"
3,"aditir","_","_","aditi","NC","","_","_"
4,"anarvā","_","_","anarvan","JJ","","_","_"
5,"bṛhad","_","_","bṛhat","JJ","","_","_"
6,"vadema","_","_","vad","V","vad","_","_"
7,"vidathe","_","_","vidatha","NC","","_","_"
8,"_","_","_","su","CAD","","_","_"
9,"_","_","_","vīra","NC","","_","_"
