"WordID","word","NormSTEM","suffix","lemma","PoS","Root","NormSuffix","NormWord"
NA,"<doc textid = ""dipamkarazrijjana_dazakuzalakarmapathadezana"" genre = ""śāstra"" title = ""daśākuśalakarmapathadeśanā"" author = ""dīpaṅkaraśrījñana_atiśa"" discourse = ""other"" tradition = ""madhyamaka-yogācāra"" period = ""commentarial"" source = ""gretil accessed april 2021 : http :// gretil.sub.uni-goettingen.d e/ greti l/ corpuste i/ sa_.xml"" date_range = ""11. ce"" notes = ""date range = 11. ce ? the skt originals of atiśa's works are lost; unable to find text on dsbc; presumably the source is this publication: ramesh chandra negi. atīśaviracitā ekādaśagranthaḥ: eleven treatises by atiśa. restored; translated and edited by ramesh chandra negi. bhoṭa-bhāratīya granthamālā; 24. varanasi: central institute of higher tibetan studies; 1992 but unable to access publ."" religion = ""buddh"" edition = ""dipankarasrijnana - =dipamkarasrijnana = atisa - :dasakusalakarmapathadesana source unknown "" digitization = ""members of the sanskrit buddhist input project"" segmentation_lemmatization = ""ligeia lugli & buddhist translators workbench team"" metadata_enrichment = ""bruno galasek-hul & buddhist translators workbench team"" proofreader = "" n/ a"" permission = ""permission for derivatives from m. mehner on behalf of gretil"" reconstructions = ""retranslated"">","","","","","","",""
NA,"<s number=""1"">","","","","","","",""
1,"daśā","DAŚ","ā","daśā","noun-adj","","ā","daśā"
2,"kuśala","KUŚAL","a","kuśala","noun-adj","","a","kuśala"
3,"karma","KARM","a","karman","noun-adj","","a","karma"
4,"patha","PATH","a","patha","noun-adj","","a","patha"
5,"deśanā","DEŚAN","ā","deśanā","noun-adj","","ā","deśanā"
6,"namo","NAM","o","namas","noun-adj","","aḥ","namaḥ"
7,"ratnatrayāya","RATNATRAY","āya","ratnatraya","noun-adj","","āya","ratnatrayāya"
NA,"</s>","","","","","","",""
NA,"<s number=""2"">","","","","","","",""
1,"kenacit","","","kimcit","ind","","","kimcit"
2,"sugati","SUGAT","i","sugati","noun-adj","","i","sugati"
3,"prāptu","PRĀPT","u","prāpta","noun-adj","","u","prāptu"
4,"kāmena","KĀM","ena","kāma","noun-adj","","ena","kāmena"
5,"heyā","HEY","ā","heya","noun-adj","","āḥ","heyāḥ"
6,"daśā","DAŚ","ā","daśā","noun-adj","","ā","daśā"
7,"kuśala","KUŚAL","a","kuśala","noun-adj","","a","kuśala"
8,"karma","KARM","a","karman","noun-adj","","a","karma"
9,"pathāḥ","PATH","āḥ","patha","noun-adj","","āḥ","pathāḥ"
10,"prakṛti","PRAKṚT","i","prakṛti","noun-adj","","i","prakṛti"
11,"sāvadyāḥ","SĀVADY","āḥ","sāvadya","noun-adj","","āḥ","sāvadyāḥ"
12,"tad","","","tad","pron","","","tad"
13,"yathā","","","yathā","ind","","","yathā"
14,"trividhaṃ","TRIVIDH","aṃ","trividha","noun-adj","","am","trividham"
15,"kāyikaṃ","KĀYIK","aṃ","kāyika","noun-adj","","am","kāyikam"
16,"karma","KARM","a","karman","noun-adj","","a","karma"
17,"vācikaṃ","VĀCIK","aṃ","vācika","noun-adj","","am","vācikam"
18,"tu","","","tu","ind","","","tu"
19,"caturvidham","CATURVIDH","am","caturvidha","noun-adj","","am","caturvidham"
20,"/","","","","punct","","","/"
21,"mānasaṃ","MĀNAS","aṃ","mānasa","noun-adj","","am","mānasam"
22,"tri","TR","i","tri","noun-adj","","i","tri"
23,"prakāraṃ","PRAKĀR","aṃ","prakāra","noun-adj","","am","prakāram"
24,"ca","","","ca","ind","","","ca"
25,"daś","DAŚ","a","daśa","noun-adj","","a","daśa"
26,"^aite","","","tad","pron","","","tad"
27,"a","","","alpha_privativum","ind","","","alpha_privativum"
28,"kuśalā","KUŚAL","ā","kuśala","noun-adj","","āḥ","kuśalāḥ"
29,"matāḥ","MAT","āḥ","mata","noun-adj","","āḥ","matāḥ"
30,"//","","","","punct","","","//"
31,"1","","","","ind","","",""
32,"//","","","","punct","","","//"
NA,"</s>","","","","","","",""
NA,"<s number=""3"">","","","","","","",""
1,"ete","","","tad","pron","","","tad"
2,"pravibhāgaśaḥ","PRAVIBHĀG","aśaḥ","pravibhāga","noun-adj","","aśaḥ","pravibhāgaśaḥ"
3,"vyākhyāyante","VYĀKHYĀ","yante","vyākhyā","verb","","yante","vyākhyāyante"
4,"tatra","","","tatra","ind","","","tatra"
5,"tāvat","","","tāvat","ind","","","tāvat"
6,"kāyikam","KĀYIK","am","kāyika","noun-adj","","am","kāyikam"
7,"prāṇātipātaḥ","PRĀṆĀTIPĀT","aḥ","prāṇātipāta","noun-adj","","aḥ","prāṇātipātaḥ"
8,"adattādānam","ADATTĀDĀN","am","adattādāna","noun-adj","","am","adattādānam"
9,"kāma","KĀM","a","kāma","noun-adj","","a","kāma"
10,"mithyācāraś","MITHYĀCĀR","aś","mithyācāra","noun-adj","","aḥ","mithyācāraḥ"
11,"c","","a","ca","ind","","a","ca"
12,"^eti","","","iti","ind","","","iti"
13,"/","","","","punct","","","/"
NA,"</s>","","","","","","",""
NA,"<s number=""4"">","","","","","","",""
1,"vācikam","VĀCIK","am","vācika","noun-adj","","am","vācikam"
2,"mṛṣāvādaḥ","MṚṢĀVĀD","aḥ","mṛṣāvāda","noun-adj","","aḥ","mṛṣāvādaḥ"
3,"paiśunyam","PAIŚUNY","am","paiśunya","noun-adj","","am","paiśunyam"
4,"pāruṣyam","PĀRUṢY","am","pāruṣya","noun-adj","","am","pāruṣyam"
5,"saṃbhinna","SAṂBHINN","a","saṃbhinna","noun-adj","","a","saṃbhinna"
6,"pralāpaś","PRALĀP","aś","pralāpa","noun-adj","","aḥ","pralāpaḥ"
7,"ca","","","ca","ind","","","ca"
8,"/","","","","punct","","","/"
NA,"</s>","","","","","","",""
NA,"<s number=""5"">","","","","","","",""
1,"mānasañ","MĀNAS","añ","mānasa","noun-adj","","ān","mānasān"
2,"ca","","","ca","ind","","","ca"
3,"abhidhyā","ABHIDHY","ā","abhidhyā","noun-adj","","ā","abhidhyā"
4,"vyāpādo","VYĀPĀD","o","vyāpāda","noun-adj","","aḥ","vyāpādaḥ"
5,"mithyādṛṣṭiś","MITHYĀDṚṢṬ","iś","mithyādṛṣṭi","noun-adj","","iś","mithyādṛṣṭiś"
6,"ca","","","ca","ind","","","ca"
7,"/","","","","punct","","","/"
NA,"</s>","","","","","","",""
NA,"<s number=""6"">","","","","","","",""
1,"tatra","","","tatra","ind","","","tatra"
2,"prāṇātipātas","PRĀṆĀTIPĀT","as","prāṇātipāta","noun-adj","","aḥ","prāṇātipātaḥ"
3,"tu","","","tu","ind","","","tu"
4,"prāṇi","PRĀṆ","i","prāṇin","noun-adj","","i","prāṇi"
5,"bhāvaḥ","BHĀV","aḥ","bhāva","noun-adj","","aḥ","bhāvaḥ"
6,"prāṇi","PRĀṆ","i","prāṇin","noun-adj","","i","prāṇi"
7,"saṃjñā","SAṂJÑ","ā","saṃjñā","noun-adj","","ā","saṃjñā"
8,"bhāvaḥ","BHĀV","aḥ","bhāva","noun-adj","","aḥ","bhāvaḥ"
9,"vadhaka","VADH","aka","vadhaka","noun-adj","","aka","vadhaka"
10,"citt","CITT","a","citta","noun-adj","","a","citta"
11,"^opasthitiḥ","UPASTHIT","iḥ","upasthiti","noun-adj","","iḥ","upasthitiḥ"
12,"etad","ETAD","","tad","pron","","","etad"
13,"upāya","UPĀY","a","upāya","noun-adj","","a","upāya"
14,"karaṇam","KARAṆ","am","karaṇa","noun-adj","","am","karaṇam"
15,"prāṇāvarodha","PRĀṆĀVARODH","a","prāṇāvarodha","noun-adj","","a","prāṇāvarodha"
16,"bhāvaś","BHĀV","aś","bhāva","noun-adj","","aḥ","bhāvaḥ"
17,"c","","a","ca","ind","","a","ca"
18,"^eti","","","iti","ind","","","iti"
19,"etat","ETAT","","tad","pron","","","etat"
20,"pañc","PAÑC","a","pañca","noun-adj","","a","pañca"
21,"^āṅgaiḥ","ĀṄG","aiḥ","aṅga","noun-adj","","air","āṅgair"
22,"saṃyukto","SAṂYUKT","o","saṃyukta","noun-adj","","aḥ","saṃyuktaḥ"
23,"bhavati","BHAV","ati","bhav","verb","bhū","ati","bhavati"
24,"prāṇātipātaḥ","PRĀṆĀTIPĀT","aḥ","prāṇātipāta","noun-adj","","aḥ","prāṇātipātaḥ"
25,"/","","","","punct","","","/"
NA,"</s>","","","","","","",""
NA,"<s number=""7"">","","","","","","",""
1,"tatra","","","tatra","ind","","","tatra"
2,"katamat","KATAM","at","katama","noun-adj","","at","katamat"
3,"adattādānam","ADATTĀDĀN","am","adattādāna","noun-adj","","am","adattādānam"
4,"/","","","","punct","","","/"
NA,"</s>","","","","","","",""
NA,"<s number=""8"">","","","","","","",""
1,"para","PAR","a","para","noun-adj","","a","para"
2,"bhāvaḥ","BHĀV","aḥ","bhāva","noun-adj","","aḥ","bhāvaḥ"
3,"paraparigraha","PARAPARIGRAH","a","paraparigraha","noun-adj","","a","paraparigraha"
4,"saṃjñatvam","SAṂJÑATV","am","saṃjñatva","noun-adj","","am","saṃjñatvam"
5,"ca","","","ca","ind","","","ca"
6,"steya","STEY","a","steya","noun-adj","","a","steya"
7,"citt","CITT","a","citta","noun-adj","","a","citta"
8,"^opasthitiḥ","UPASTHIT","iḥ","upasthiti","noun-adj","","iḥ","upasthitiḥ"
9,"tad","TAD","","tad","pron","","","tad"
10,"upāya","UPĀY","a","upāya","noun-adj","","a","upāya"
11,"karaṇam","KARAṆ","am","karaṇa","noun-adj","","am","karaṇam"
12,"sthāna","STHĀN","a","sthāna","noun-adj","","a","sthāna"
13,"cyutiś","CYUT","iś","cyuti","noun-adj","","iś","cyutiś"
14,"ca","","","ca","ind","","","ca"
15,"etat","ETAT","","tad","pron","","","etat"
16,"pañc","PAÑC","a","pañca","noun-adj","","a","pañca"
17,"^āṅga","ĀṄG","a","aṅga","noun-adj","","a","āṅga"
18,"saṃyuktaṃ","SAṂYUKT","aṃ","saṃyukta","noun-adj","","am","saṃyuktam"
19,"bhavaty","BHAV","aty","bhav","verb","bhū","ati","bhavati"
20,"adattādānam","ADATTĀDĀN","am","adattādāna","noun-adj","","am","adattādānam"
21,"/","","","","punct","","","/"
NA,"</s>","","","","","","",""
NA,"<s number=""9"">","","","","","","",""
1,"kāma","KĀM","a","kāma","noun-adj","","a","kāma"
2,"mithyācāras","MITHYĀCĀR","as","mithyācāra","noun-adj","","aḥ","mithyācāraḥ"
3,"tu","","","tu","ind","","","tu"
4,"caturvidhaḥ","CATURVIDH","aḥ","caturvidha","noun-adj","","aḥ","caturvidhaḥ"
5,"/","","","","punct","","","/"
NA,"</s>","","","","","","",""
NA,"<s number=""10"">","","","","","","",""
1,"asthānam","ASTHĀN","am","asthāna","noun-adj","","am","asthānam"
2,"akālaḥ","AKĀL","aḥ","akāla","noun-adj","","aḥ","akālaḥ"
3,"adeśaḥ","ADEŚ","aḥ","adeśa","noun-adj","","aḥ","adeśaḥ"
4,"agamyaś","AGAMY","aś","agamya","noun-adj","","aḥ","agamyaḥ"
5,"c","","a","ca","ind","","a","ca"
6,"^eti","","","iti","ind","","","iti"
7,"/","","","","punct","","","/"
NA,"</s>","","","","","","",""
NA,"<s number=""11"">","","","","","","",""
1,"tatra","","","tatra","ind","","","tatra"
2,"asthānaṃ","ASTHĀN","aṃ","asthāna","noun-adj","","am","asthānam"
3,"tu","","","tu","ind","","","tu"
4,"sad","SAD","","sat","noun-adj","","","sad"
5,"dharma","DHARM","a","dharma","noun-adj","","a","dharma"
6,"pratim","PRATIM","a","pratima","noun-adj","","a","pratima"
7,"^ādi","ĀD","i","ādi","noun-adj","","i","ādi"
8,"bodhisattva","BODHISATTV","a","bodhisattva","noun-adj","","a","bodhisattva"
9,"sthān","STHĀN","a","sthāna","noun-adj","","a","sthāna"
10,"^ācāry","ĀCĀRY","a","ācārya","noun-adj","","a","ācārya"
11,"^opādhyāya","UPĀDHYĀY","a","upādhyāya","noun-adj","","a","upādhyāya"
12,"dakṣiṇīya","DAKṢIṆĪY","a","dakṣiṇīya","noun-adj","","a","dakṣiṇīya"
13,"mātāpitṛ","MĀTĀPIT","ṛ","mātāpitṛ","noun-adj","","ṛ","mātāpitṛ"
14,"gurv","GUR","v","guru","noun-adj","","v","gurv"
15,"ādi","ĀD","i","ādi","noun-adj","","i","ādi"
16,"saṃnidhiḥ","SAṂNIDH","iḥ","saṃnidhi","noun-adj","","iḥ","saṃnidhiḥ"
17,"/","","","","punct","","","/"
NA,"</s>","","","","","","",""
NA,"<s number=""12"">","","","","","","",""
1,"akāla","AKĀL","a","akāla","noun-adj","","a","akāla"
2,"iti","","","iti","ind","","","iti"
3,"divase","DIVAS","e","divasa","noun-adj","","e","divase"
4,"ṛtumatī","ṚTUMAT","ī","ṛtumatī","noun-adj","","ī","ṛtumatī"
5,"garbhiṇī","GARBHIṆ","ī","garbhiṇī","noun-adj","","ī","garbhiṇī"
6,"śiśu","ŚIŚ","u","śiśu","noun-adj","","u","śiśu"
7,"poṣiṇībhiḥ","POṢ","iṇībhiḥ","poṣin","noun-adj","","iṇībhiḥ","poṣiṇībhiḥ"
8,"an","","","alpha_privativum","ind","","","alpha_privativum"
9,"icchā","ICCH","ā","icchā","noun-adj","","ā","icchā"
10,"duḥkha","DUḤKH","a","duḥkha","noun-adj","","a","duḥkha"
11,"daurmanasya","DAURMANASY","a","daurmanasya","noun-adj","","a","daurmanasya"
12,"pīḍitābhiḥ","PĪḌIT","ābhiḥ","pīḍita","noun-adj","","ābhiḥ","pīḍitābhiḥ"
13,"aṣṭāṅgo","AṢṬĀṄG","o","aṣṭāṅga","noun-adj","","aḥ","aṣṭāṅgaḥ"
14,"posath","POSATH","a","posatha","noun-adj","","a","posatha"
15,"^āvasthitau","AVASTHIT","au","avasthita","noun-adj","","au","avasthitau"
16,"ca","","","ca","ind","","","ca"
17,"/","","","","punct","","","/"
NA,"</s>","","","","","","",""
NA,"<s number=""13"">","","","","","","",""
1,"adeśa","ADEŚ","a","adeśa","noun-adj","","a","adeśa"
2,"iti","","","iti","ind","","","iti"
3,"mukhav","MUKH","av","mukha","noun-adj","","au","mukhau"
4,"arco","ARC","o","arca","noun-adj","","aḥ","arcaḥ"
5,"mārgatvaṃ","MĀRG","atvaṃ","mārgatva","noun-adj","","atvaṃ","mārgatvaṃ"
6,"kumāra","KUMĀR","a","kumāra","noun-adj","","a","kumāra"
7,"kanyayoḥ","KANY","ayoḥ","kanyā","noun-adj","","ayoḥ","kanyayoḥ"
8,"puraḥ","PUR","aḥ","pura","noun-adj","","aḥ","puraḥ"
9,"pṛṣṭha","PṚṢṬH","a","pṛṣṭha","noun-adj","","a","pṛṣṭha"
10,"randhratvaṃ","RANDHR","atvaṃ","randhra","noun-adj","","atvaṃ","randhratvaṃ"
11,"svagas","SVAG","as","svagā","noun-adj","","aḥ","svagaḥ"
12,"tatvaṃ","TATV","aṃ","tatva","noun-adj","","am","tatvam"
13,"ca","","","ca","ind","","","ca"
14,"/","","","","punct","","","/"
NA,"</s>","","","","","","",""
NA,"<s number=""14"">","","","","","","",""
1,"agamyās","AGAMY","ās","agamya","noun-adj","","āḥ","agamyāḥ"
2,"tu","","","tu","ind","","","tu"
3,"sarvāḥ","SARV","āḥ","sarva","noun-adj","","āḥ","sarvāḥ"
4,"parastriyaḥ","PARASTR","iyaḥ","","noun-adj","","iyaḥ","parastriyaḥ"
5,"dharma","DHARM","a","dharma","noun-adj","","a","dharma"
6,"dhvaja","DHVAJ","a","dhvaja","noun-adj","","a","dhvaja"
7,"kula","KUL","a","kula","noun-adj","","a","kula"
8,"rakṣitāḥ","RAKṢIT","āḥ","rakṣita","noun-adj","","āḥ","rakṣitāḥ"
9,"rāja","RĀJ","a","rājan","noun-adj","","a","rāja"
10,"rakṣitāḥ","RAKṢIT","āḥ","rakṣita","noun-adj","","āḥ","rakṣitāḥ"
11,"para","PAR","a","para","noun-adj","","a","para"
12,"parigṛhītā","PARIGṚHĪT","ā","parigṛhīta","noun-adj","","āḥ","parigṛhītāḥ"
13,"veśyāḥ","VEŚY","āḥ","veśya","noun-adj","","āḥ","veśyāḥ"
14,"sambandhinyaḥ","SAṂBANDH","inyaḥ","saṃbandhin","noun-adj","","inyaḥ","saṃbandhinyaḥ"
15,"tiraścyaś","TIRAŚCY","aś","tiraścya","noun-adj","","aḥ","tiraścyaḥ"
16,"ca","","","ca","ind","","","ca"
17,"/","","","","punct","","","/"
NA,"</s>","","","","","","",""
NA,"<s number=""15"">","","","","","","",""
1,"evaṃ","","","eva","ind","","","eva"
2,"sva","SV","a","sva","noun-adj","","a","sva"
3,"bhāryā","BHĀRY","ā","bhāryā","noun-adj","","ā","bhāryā"
4,"sevane","SEVAN","e","sevana","noun-adj","","e","sevane"
5,"api","","","api","ind","","","api"
6,"bhavati","BHAV","ati","bhav","verb","bhū","ati","bhavati"
7,"kāma","KĀM","a","kāma","noun-adj","","a","kāma"
8,"mithyācāraḥ","MITHYĀCĀR","aḥ","mithyācāra","noun-adj","","aḥ","mithyācāraḥ"
9,"/","","","","punct","","","/"
NA,"</s>","","","","","","",""
NA,"<s number=""16"">","","","","","","",""
1,"tatra","","","tatra","ind","","","tatra"
2,"mṛṣāvādas","MṚṢĀVĀD","as","mṛṣāvāda","noun-adj","","aḥ","mṛṣāvādaḥ"
3,"tu","","","tu","ind","","","tu"
4,"a","","","alpha_privativum","ind","","","alpha_privativum"
5,"vāstavikatvam","VĀSTAVIK","atvam","vāstavika","noun-adj","","atvam","vāstavikatvam"
6,"vastu","VAST","u","vastu","noun-adj","","u","vastu"
7,"sthiti","STHIT","i","sthiti","noun-adj","","i","sthiti"
8,"cyutiḥ","CYUT","iḥ","cyuti","noun-adj","","iḥ","cyutiḥ"
9,"mithyā","MITHY","ā","mithyā","noun-adj","","ā","mithyā"
10,"saṃjñā","SAṂJÑ","ā","saṃjñā","noun-adj","","ā","saṃjñā"
11,"bhāvaḥ","BHĀV","aḥ","bhāva","noun-adj","","aḥ","bhāvaḥ"
12,"mithy","MITHY","a","mithyā","noun-adj","","a","mithyā"
13,"^opāy","UPĀY","a","upāya","noun-adj","","a","upāya"
14,"^opasthitiś","UPASTHIT","iś","upasthiti","noun-adj","","iś","upasthitiś"
15,"ca","","","ca","ind","","","ca"
16,"tad","TAD","","tad","pron","","","tad"
17,"upāya","UPĀY","a","upāya","noun-adj","","a","upāya"
18,"karaṇan","KARAṆ","an","karaṇat","noun-adj","","ān","karaṇān"
19,"c","","a","ca","ind","","a","ca"
20,"^eti","","","iti","ind","","","iti"
21,"mithyā","MITHY","ā","mithyā","noun-adj","","ā","mithyā"
22,"vacan","VACAN","a","vacana","noun-adj","","a","vacana"
23,"^oktiś","UKT","iś","ukti","noun-adj","","iś","uktiś"
24,"ca","","","ca","ind","","","ca"
25,"ity","","","iti","ind","","","iti"
26,"etat","ETAT","","tad","pron","","","etat"
27,"pañc","PAÑC","a","pañca","noun-adj","","a","pañca"
28,"^āṅga","ĀṄG","a","aṅga","noun-adj","","a","āṅga"
29,"saṃyoge","SAṂYOG","e","saṃyoga","noun-adj","","e","saṃyoge"
30,"mṛṣāvādaḥ","MṚṢĀVĀD","aḥ","mṛṣāvāda","noun-adj","","aḥ","mṛṣāvādaḥ"
31,"/","","","","punct","","","/"
NA,"</s>","","","","","","",""
NA,"<s number=""17"">","","","","","","",""
1,"paiśunyaṃ","PAIŚUNY","aṃ","paiśunya","noun-adj","","am","paiśunyam"
2,"tu","","","tu","ind","","","tu"
3,"kliṣṭa","KLIṢṬ","a","kliṣṭa","noun-adj","","a","kliṣṭa"
4,"cittena","CITT","ena","citta","noun-adj","","ena","cittena"
5,"para","PAR","a","para","noun-adj","","a","para"
6,"bheda","BHED","a","bheda","noun-adj","","a","bheda"
7,"kathanam","KATHAN","am","kathana","noun-adj","","am","kathanam"
8,"/","","","","punct","","","/"
NA,"</s>","","","","","","",""
NA,"<s number=""18"">","","","","","","",""
1,"pāruṣyam","PĀRUṢY","am","pāruṣya","noun-adj","","am","pāruṣyam"
2,"iti","","","iti","ind","","","iti"
3,"para","PAR","a","para","noun-adj","","a","para"
4,"marmavedhi","MARMAVEDH","i","marmavedhin","noun-adj","","i","marmavedhi"
5,"dveṣa","DVEṢ","a","dveṣa","noun-adj","","a","dveṣa"
6,"vacanam","VACAN","am","vacana","noun-adj","","am","vacanam"
7,"/","","","","punct","","","/"
NA,"</s>","","","","","","",""
NA,"<s number=""19"">","","","","","","",""
1,"sambhinnapralāpa","SAṂBHINNAPRALĀP","a","saṃbhinnapralāpa","noun-adj","","a","saṃbhinnapralāpa"
2,"iti","","","iti","ind","","","iti"
3,"rāg","RĀG","a","rāga","noun-adj","","a","rāga"
4,"^opayuktatvād","UPAYUKT","atvād","upayukta","noun-adj","","atvād","upayuktatvād"
5,"āsakti","ĀSAKT","i","āsakti","noun-adj","","i","āsakti"
6,"yogād","YOG","ād","yoga","noun-adj","","āt","yogāt"
7,"vā","","","vā","ind","","","vā"
8,"a","","","alpha_privativum","ind","","","alpha_privativum"
9,"vācya","VĀCY","a","vācya","noun-adj","","a","vācya"
10,"vacanam","VACAN","am","vacana","noun-adj","","am","vacanam"
11,"/","","","","punct","","","/"
NA,"</s>","","","","","","",""
NA,"<s number=""20"">","","","","","","",""
1,"abhidhyeti","ABHIDHY","eti","abhidh","verb","","eti","abhidhyeti"
2,"para","PAR","a","para","noun-adj","","a","para"
3,"dhana","DHAN","a","dhana","noun-adj","","a","dhana"
4,"dravy","DRAVY","a","dravya","noun-adj","","a","dravya"
5,"^aiśvaryeṣu","AIŚVARY","eṣu","aiśvarya","noun-adj","","eṣu","aiśvaryeṣu"
6,"tīvr","TĪVR","a","tīvra","noun-adj","","a","tīvra"
7,"^āsakta","ĀSAKT","a","āsakta","noun-adj","","a","āsakta"
8,"cittatā","CITT","atā","cittatā","noun-adj","","atām","cittatām"
9,"/","","","","punct","","","/"
NA,"</s>","","","","","","",""
NA,"<s number=""21"">","","","","","","",""
1,"vyāpādas","VYĀPĀD","as","vyāpāda","noun-adj","","aḥ","vyāpādaḥ"
2,"tu","","","tu","ind","","","tu"
3,"sattveṣu","SATTV","eṣu","sattva","noun-adj","","eṣu","sattveṣu"
4,"vidveṣa","VIDVEṢ","a","vidveṣa","noun-adj","","a","vidveṣa"
5,"bhāvaḥ","BHĀV","aḥ","bhāva","noun-adj","","aḥ","bhāvaḥ"
6,"etān","","","tad","pron","","","tad"
7,"sattvān","SATTV","ān","sattva","noun-adj","","ān","sattvān"
8,"haniṣyāmi","HANIṢ","yāmi","han","verb","han","yāmi","haniṣyāmi"
9,"rotsyāmi","ROTS","yāmi","rudh","verb","rudh","yāmi","rotsyāmi"
10,"tāḍayiṣyāmi","TĀḌ","ayiṣyāmi","tāḍ","verb","","ayiṣyāmi","tāḍayiṣyāmi"
11,"bandhayiṣyāmi","BANDH","ayiṣyāmi","bandh","verb","bandh","ayiṣyāmi","bandhayiṣyāmi"
12,"iti","","","iti","ind","","","iti"
13,"cintanam","CINTAN","am","cintana","noun-adj","","am","cintanam"
14,"/","","","","punct","","","/"
NA,"</s>","","","","","","",""
NA,"<s number=""22"">","","","","","","",""
1,"mithyādṛṣṭir","MITHYĀDṚṢṬ","ir","mithyādṛṣṭi","noun-adj","","iḥ","mithyādṛṣṭiḥ"
2,"iti","","","iti","ind","","","iti"
3,"n","","a","na","ind","","a","na"
4,"^āsti","","","as","verb","as","",""
5,"dānam","DĀN","am","dāna","noun-adj","","am","dānam"
6,"na","","","na","ind","","","na"
7,"yajñaṃ","YAJÑ","aṃ","yajña","noun-adj","","am","yajñam"
8,"neh","","","","ind","","",""
9,"alokaḥ","ALOK","aḥ","aloka","noun-adj","","aḥ","alokaḥ"
10,"na","","","na","ind","","","na"
11,"para","PAR","a","para","noun-adj","","a","para"
12,"lokaḥ","LOK","aḥ","loka","noun-adj","","aḥ","lokaḥ"
13,"na","","","na","ind","","","na"
14,"śramaṇaḥ","ŚRAMAṆ","aḥ","śramaṇa","noun-adj","","aḥ","śramaṇaḥ"
15,"na","","","na","ind","","","na"
16,"brāhmaṇaḥ","BRĀHMAṆ","aḥ","brāhmaṇa","noun-adj","","aḥ","brāhmaṇaḥ"
17,"na","","","na","ind","","","na"
18,"devaḥ","DEV","aḥ","deva","noun-adj","","aḥ","devaḥ"
19,"na","","","na","ind","","","na"
20,"buddho","BUDDH","o","buddha","noun-adj","","aḥ","buddhaḥ"
21,"bhagavān","BHAGAV","ān","bhagavat","noun-adj","","ān","bhagavān"
22,"na","","","na","ind","","","na"
23,"arhan","ARH","an","arhat","noun-adj","","ān","arhān"
24,"na","","","na","ind","","","na"
25,"pratyekabuddhaḥ","PRATYEKABUDDH","aḥ","pratyekabuddha","noun-adj","","aḥ","pratyekabuddhaḥ"
26,"na","","","na","ind","","","na"
27,"su","","","su","ind","","","su"
28,"caritam","CARIT","am","carita","noun-adj","","am","caritam"
29,"na","","","na","ind","","","na"
30,"ca","","","ca","ind","","","ca"
31,"duś","","","duḥ","ind","","","duḥ"
32,"caritam","CARIT","am","carita","noun-adj","","am","caritam"
33,"na","","","na","ind","","","na"
34,"su","","","su","ind","","","su"
35,"kṛta","KṚT","a","kṛta","noun-adj","","a","kṛta"
36,"duṣkṛta","DUṢKṚT","a","duṣkṛta","noun-adj","","a","duṣkṛta"
37,"karmāṇāṃ","KARM","āṇāṃ","karman","noun-adj","","ānām","karmānām"
38,"phala","PHAL","a","phala","noun-adj","","a","phala"
39,"vipākaś","VIPĀK","aś","vipāka","noun-adj","","aḥ","vipākaḥ"
40,"c","","a","ca","ind","","a","ca"
41,"^eti","","","iti","ind","","","iti"
42,"/","","","","punct","","","/"
NA,"</s>","","","","","","",""
NA,"<s number=""23"">","","","","","","",""
1,"bhagavatā","BHAGAV","atā","bhagavat","noun-adj","","atām","bhagavatām"
2,"ukte","UKT","e","ukta","noun-adj","","e","ukte"
3,"ārya","ĀRY","a","ārya","noun-adj","","a","ārya"
4,"sad","SAD","","sat","noun-adj","","","sad"
5,"dharma","DHARM","a","dharma","noun-adj","","a","dharma"
6,"smṛty","SMṚT","y","smṛti","noun-adj","","i","smṛti"
7,"upasthāne","UPASTHĀN","e","upasthāna","noun-adj","","e","upasthāne"
8,"mahāyāna","MAHĀYĀN","a","mahāyāna","noun-adj","","a","mahāyāna"
9,"sūtre","SŪTR","e","sūtra","noun-adj","","e","sūtre"
10,"ca","","","ca","ind","","","ca"
11,"nirdiṣṭo","NIRDIṢṬ","o","nirdiṣṭa","noun-adj","","aḥ","nirdiṣṭaḥ"
12,"daśā","DAŚ","ā","daśā","noun-adj","","ā","daśā"
13,"kuśala","KUŚAL","a","kuśala","noun-adj","","a","kuśala"
14,"karma","KARM","a","karman","noun-adj","","a","karma"
15,"patho","PATH","o","patha","noun-adj","","aḥ","pathaḥ"
16,"ayaṃ","","","idam","pron","","","idam"
17,"tu","","","tu","ind","","","tu"
18,"mahā","MAH","ā","mahat","noun-adj","","ā","mahā"
19,"naraka","NARAK","a","naraka","noun-adj","","a","naraka"
20,"hetuḥ","HET","uḥ","hetu","noun-adj","","uḥ","hetuḥ"
21,"/","","","","punct","","","/"
NA,"</s>","","","","","","",""
NA,"<s number=""24"">","","","","","","",""
1,"daśā","DAŚ","ā","daśā","noun-adj","","ā","daśā"
2,"kuśala","KUŚAL","a","kuśala","noun-adj","","a","kuśala"
3,"karma","KARM","a","karman","noun-adj","","a","karma"
4,"patha","PATH","a","patha","noun-adj","","a","patha"
5,"sevanena","SEVAN","ena","sevana","noun-adj","","ena","sevanena"
6,"patanti","PAT","anti","pat","verb","pat","anti","patanti"
7,"sattvā","SATTV","ā","sattva","noun-adj","","āḥ","sattvāḥ"
8,"narakeṣu","NARAK","eṣu","naraka","noun-adj","","eṣu","narakeṣu"
9,"/","","","","punct","","","/"
NA,"</s>","","","","","","",""
NA,"<s number=""25"">","","","","","","",""
1,"mahācāryadī","MAHĀCĀRY","adī","mahācārya","noun-adj","","adī","mahācāryadī"
2,"paṅkar","PAṄK","ar","paṅka","noun-adj","","ar","paṅkar"
3,"aśrī","AŚR","ī","aśrī","noun-adj","","ī","aśrī"
4,"jñāna","JÑĀN","a","jñāna","noun-adj","","a","jñāna"
5,"pādena","PĀD","ena","pāda","noun-adj","","ena","pādena"
6,"praṇītā","PRAṆĪT","ā","praṇīta","noun-adj","","āḥ","praṇītāḥ"
7,"daśā","DAŚ","ā","daśā","noun-adj","","ā","daśā"
8,"kuśala","KUŚAL","a","kuśala","noun-adj","","a","kuśala"
9,"karma","KARM","a","karman","noun-adj","","a","karma"
10,"patha","PATH","a","patha","noun-adj","","a","patha"
11,"deśanā","DEŚAN","ā","deśanā","noun-adj","","ā","deśanā"
12,"samāptā","SAMĀPT","ā","samāpta","noun-adj","","ā","samāptā"
13,"/","","","","punct","","","/"
NA,"</s>","","","","","","",""
NA,"<s number=""26"">","","","","","","",""
1,"ten","","a","tad","pron","","a","tad"
2,"^aiva","","","eva","ind","","","eva"
3,"bhāratīy","BHĀRATĪY","a","bhāratīya","noun-adj","","a","bhāratīya"
4,"^opādhyāyena","UPĀDHYĀY","ena","upādhyāya","noun-adj","","ena","upādhyāyena"
5,"mahāsaṃ","MAHĀS","aṃ","mahāsi","noun-adj","","am","mahāsam"
6,"śodhakalo","ŚODHAK","alo","śodhaka","noun-adj","","alo","śodhakalo"
7,"kakṣuṣā","KAKṢ","uṣā","kakṣas","noun-adj","","uṣā","kakṣuṣā"
8,"bhikṣu","BHIKṢ","u","bhikṣu","noun-adj","","u","bhikṣu"
9,"jaya","JAY","a","jaya","noun-adj","","a","jaya"
10,"śīlena","ŚĪL","ena","śīla","noun-adj","","ena","śīlena"
11,"c","","a","ca","ind","","a","ca"
12,"^ānūditaḥ","ANŪDIT","aḥ","anūdita","noun-adj","","aḥ","anūditaḥ"
13,"sampāditaś","SAMPĀDIT","aś","sampādita","noun-adj","","aḥ","sampāditaḥ"
14,"ca","","","ca","ind","","","ca"
15,"//","","","","punct","","","//"
NA,"</s>","","","","","","",""
NA,"</doc>","","","","","","",""
