"WordID","word","NormSTEM","suffix","lemma","PoS","Root","NormSuffix","NormWord"
1,"samiddho","_","_","samindh","PPP","","_","_"
2,"adya","_","_","adya","CX","","_","_"
3,"manuṣo","_","_","manus","NC","","_","_"
4,"duroṇe","_","_","duroṇa","NC","","_","_"
5,"devo","_","_","deva","NC","","_","_"
6,"devān","_","_","deva","NC","","_","_"
7,"yajasi","_","_","yaj","V","yaj","_","_"
8,"jātavedaḥ","_","_","jātavedas","NC","","_","_"
1,"ā","_","_","ā","CADP","","_","_"
2,"ca","_","_","ca","CCD","","_","_"
3,"vaha","_","_","vah","V","vah","_","_"
4,"_","_","_","mitra","NC","","_","_"
5,"_","_","_","mahat","JJ","","_","_"
6,"cikitvān","_","_","cit","KDP","","_","_"
7,"tvaṃ","_","_","tvat","PPR","","_","_"
8,"dūtaḥ","_","_","dūta","NC","","_","_"
9,"kavir","_","_","kavi","JJ","","_","_"
10,"asi","_","_","as","V","as","_","_"
11,"pracetāḥ","_","_","pracetas","JJ","","_","_"
1,"tanūnapāt","_","_","tanūnapāt","NC","","_","_"
2,"patha","_","_","pathin","NC","","_","_"
3,"ṛtasya","_","_","ṛta","NC","","_","_"
4,"yānān","_","_","yāna","JJ","","_","_"
5,"madhvā","_","_","madhu","NC","","_","_"
6,"samañjant","_","_","samañj","KDP","","_","_"
7,"svadayā","_","_","svaday","V","svaday","_","_"
8,"sujihva","_","_","sujihva","NC","","_","_"
1,"manmāni","_","_","manman","NC","","_","_"
2,"dhībhir","_","_","dhī","NC","","_","_"
3,"uta","_","_","uta","CCD","","_","_"
4,"yajñam","_","_","yajña","NC","","_","_"
5,"ṛndhan","_","_","ṛdh","KDP","","_","_"
6,"devatrā","_","_","devatrā","CX","","_","_"
7,"ca","_","_","ca","CCD","","_","_"
8,"kṛṇuhy","_","_","kar","V","kṛ","_","_"
9,"adhvaram","_","_","adhvara","NC","","_","_"
10,"naḥ","_","_","mat","PPR","","_","_"
1,"ājuhvāna","_","_","āhu","KDP","","_","_"
2,"īḍyo","_","_","īḍ","KDG","","_","_"
3,"vandyaś","_","_","vand","KDG","","_","_"
4,"_","_","_","ca","CCD","","_","_"
5,"_","_","_","ā","CADP","","_","_"
6,"yāhy","_","_","yā","V","yā","_","_"
7,"agne","_","_","agni","NC","","_","_"
8,"vasubhiḥ","_","_","vasu","NC","","_","_"
9,"sajoṣāḥ","_","_","sajoṣas","JJ","","_","_"
1,"tvaṃ","_","_","tvat","PPR","","_","_"
2,"devānām","_","_","deva","NC","","_","_"
3,"asi","_","_","as","V","as","_","_"
4,"yahva","_","_","yahva","JJ","","_","_"
5,"hotā","_","_","hotṛ","NC","","_","_"
6,"sa","_","_","tad","PRD","","_","_"
7,"enān","_","_","a","PRD","","_","_"
8,"_","_","_","yaj","V","yaj","_","_"
9,"_","_","_","iṣay","PPP","","_","_"
10,"yajīyān","_","_","yajīyas","JJ","","_","_"
1,"prācīnaṃ","_","_","prācīna","JJ","","_","_"
2,"barhiḥ","_","_","barhis","NC","","_","_"
3,"pradiśā","_","_","pradiś","NC","","_","_"
4,"pṛthivyā","_","_","pṛthivī","NC","","_","_"
5,"vastor","_","_","vastu","NC","","_","_"
6,"asyā","_","_","ida","PRD","","_","_"
7,"vṛjyate","_","_","vṛj","V","vṛj","_","_"
8,"agre","_","_","agra","NC","","_","_"
9,"ahnām","_","_","ahar","NC","","_","_"
1,"vy","_","_","vi","CADP","","_","_"
2,"u","_","_","u","CEM","","_","_"
3,"prathate","_","_","prath","V","prath","_","_"
4,"vitaraṃ","_","_","vitara","CX","","_","_"
5,"varīyo","_","_","varīyas","JJ","","_","_"
6,"devebhyo","_","_","deva","NC","","_","_"
7,"aditaye","_","_","aditi","NC","","_","_"
8,"syonam","_","_","syona","JJ","","_","_"
1,"vyacasvatīr","_","_","vyacasvat","JJ","","_","_"
2,"urviyā","_","_","urviyā","CX","","_","_"
3,"vi","_","_","vi","CADP","","_","_"
4,"śrayantāṃ","_","_","śray","V","śri","_","_"
5,"patibhyo","_","_","pati","NC","","_","_"
6,"na","_","_","na","CNG","","_","_"
7,"janayaḥ","_","_","jani","NC","","_","_"
8,"śumbhamānāḥ","_","_","śubh","KDP","","_","_"
1,"devīr","_","_","deva","JJ","","_","_"
2,"dvāro","_","_","dvār","NC","","_","_"
3,"bṛhatīr","_","_","bṛhat","JJ","","_","_"
4,"viśvaminvā","_","_","viśvaminva","JJ","","_","_"
5,"devebhyo","_","_","deva","NC","","_","_"
6,"bhavata","_","_","bhav","V","bhū","_","_"
7,"_","_","_","su","CAD","","_","_"
8,"_","_","_","prāyaṇa","NC","","_","_"
1,"ā","_","_","ā","CADP","","_","_"
2,"suṣvayantī","_","_","yajata","JJ","","_","_"
3,"yajate","_","_","upāka","JJ","","_","_"
4,"upāke","_","_","uṣāsānaktā","NC","","_","_"
5,"uṣāsānaktā","_","_","sīd","V","sad","_","_"
6,"sadatāṃ","_","_","ni","CADP","","_","_"
7,"ni","_","_","yoni","NC","","_","_"
1,"divye","_","_","divya","JJ","","_","_"
2,"yoṣaṇe","_","_","yoṣaṇā","NC","","_","_"
3,"bṛhatī","_","_","bṛhat","JJ","","_","_"
4,"_","_","_","su","CAD","","_","_"
5,"_","_","_","rukma","NC","","_","_"
6,"adhi","_","_","adhi","CADP","","_","_"
7,"śriyaṃ","_","_","śrī","NC","","_","_"
8,"śukrapiśaṃ","_","_","śukrapiś","JJ","","_","_"
9,"dadhāne","_","_","dhā","KDP","","_","_"
1,"daivyā","_","_","daivya","JJ","","_","_"
2,"hotārā","_","_","hotṛ","NC","","_","_"
3,"prathamā","_","_","prathama","JJ","","_","_"
4,"_","_","_","su","CAD","","_","_"
5,"_","_","_","vāc","NC","","_","_"
6,"mimānā","_","_","mā","KDP","","_","_"
7,"yajñaṃ","_","_","yajña","NC","","_","_"
8,"manuṣo","_","_","manus","NC","","_","_"
9,"yajadhyai","_","_","yaj","CGDI","","_","_"
1,"pracodayantā","_","_","pracoday","KDP","","_","_"
2,"vidatheṣu","_","_","vidatha","NC","","_","_"
3,"kārū","_","_","kāru","NC","","_","_"
4,"prācīnaṃ","_","_","prācīna","JJ","","_","_"
5,"jyotiḥ","_","_","jyotis","NC","","_","_"
6,"pradiśā","_","_","pradiś","NC","","_","_"
7,"diśantā","_","_","diś","KDP","","_","_"
1,"ā","_","_","ā","CADP","","_","_"
2,"no","_","_","mat","PPR","","_","_"
3,"yajñaṃ","_","_","yajña","NC","","_","_"
4,"bhāratī","_","_","bhāratī","NC","","_","_"
5,"tūyam","_","_","tūya","JJ","","_","_"
6,"etv","_","_","e","V","i","_","_"
7,"iḍā","_","_","iḍā","NC","","_","_"
8,"manuṣvad","_","_","manuṣvat","CX","","_","_"
9,"iha","_","_","iha","CAD","","_","_"
10,"cetayantī","_","_","cetay","KDP","","_","_"
1,"tisro","_","_","tri","NUM","","_","_"
2,"devīr","_","_","devī","NC","","_","_"
3,"barhir","_","_","barhis","NC","","_","_"
4,"_","_","_","ā","CADP","","_","_"
5,"_","_","_","ida","PRD","","_","_"
6,"syonaṃ","_","_","syona","JJ","","_","_"
7,"sarasvatīḥ","_","_","sarasvatī","NC","","_","_"
8,"_","_","_","su","CAD","","_","_"
9,"_","_","_","apas","NC","","_","_"
10,"sadantām","_","_","sīd","V","sad","_","_"
1,"ya","_","_","yad","PRL","","_","_"
2,"ime","_","_","ida","PRD","","_","_"
3,"dyāvāpṛthivī","_","_","dyāvāpṛthivī","NC","","_","_"
4,"janitrī","_","_","janitrī","NC","","_","_"
5,"rūpair","_","_","rūpa","NC","","_","_"
6,"apiṃśad","_","_","piś","V","piś","_","_"
7,"bhuvanāni","_","_","bhuvana","NC","","_","_"
8,"viśvā","_","_","viśva","JQ","","_","_"
1,"tam","_","_","tad","PRD","","_","_"
2,"adya","_","_","adya","CX","","_","_"
3,"hotar","_","_","hotṛ","NC","","_","_"
4,"iṣito","_","_","iṣay","PPP","","_","_"
5,"yajīyān","_","_","yajīyas","JJ","","_","_"
6,"devaṃ","_","_","deva","NC","","_","_"
7,"tvaṣṭāram","_","_","tvaṣṭṛ","NC","","_","_"
8,"iha","_","_","iha","CAD","","_","_"
9,"yakṣi","_","_","yaj","V","yaj","_","_"
10,"vidvān","_","_","vid","KDP","","_","_"
1,"_","_","_","upa","CADP","","_","_"
2,"_","_","_","avasṛj","V","avasṛj","_","_"
3,"tmanyā","_","_","tmanī","NC","","_","_"
4,"samañjan","_","_","samañj","KDP","","_","_"
5,"devānāṃ","_","_","deva","NC","","_","_"
6,"pātha","_","_","pāthas","NC","","_","_"
7,"ṛtuthā","_","_","ṛtuthā","CX","","_","_"
8,"havīṃṣi","_","_","havis","NC","","_","_"
1,"vanaspatiḥ","_","_","vanaspati","NC","","_","_"
2,"śamitā","_","_","śamitṛ","NC","","_","_"
3,"devo","_","_","deva","NC","","_","_"
4,"agniḥ","_","_","agni","NC","","_","_"
5,"svadantu","_","_","svad","V","svad","_","_"
6,"havyaṃ","_","_","havya","NC","","_","_"
7,"madhunā","_","_","madhu","NC","","_","_"
8,"ghṛtena","_","_","ghṛta","NC","","_","_"
1,"sadyo","_","_","sadyas","CAD","","_","_"
2,"jāto","_","_","jan","PPP","","_","_"
3,"vy","_","_","vi","CADP","","_","_"
4,"amimīta","_","_","mā","V","mā","_","_"
5,"yajñam","_","_","yajña","NC","","_","_"
6,"agnir","_","_","agni","NC","","_","_"
7,"devānām","_","_","deva","NC","","_","_"
8,"abhavat","_","_","bhav","V","bhū","_","_"
9,"purogāḥ","_","_","purogā","NC","","_","_"
1,"asya","_","_","ida","PRD","","_","_"
2,"hotuḥ","_","_","hotṛ","NC","","_","_"
3,"praśiṣy","_","_","praśis","NC","","_","_"
4,"ṛtasya","_","_","ṛta","NC","","_","_"
5,"vāci","_","_","vāc","NC","","_","_"
6,"svāhākṛtaṃ","_","_","svāhākṛta","JJ","","_","_"
7,"havir","_","_","havis","NC","","_","_"
8,"adantu","_","_","ad","V","ad","_","_"
9,"devāḥ","_","_","deva","NC","","_","_"
