"WordID","word","NormSTEM","suffix","lemma","PoS","Root","NormSuffix","NormWord"
1,"_","_","_","atha","CAD","","_","_"
2,"_","_","_","atas","CX","","_","_"
3,"_","_","_","tṛṣṇā","NC","","_","_"
4,"_","_","_","cikitsita","NC","","_","_"
5,"vyākhyāsyāmaḥ","_","_","vyākhyās","V","vyākhyā","_","_"
1,"iti","_","_","iti","CQT","","_","_"
2,"ha","_","_","ha","CEM","","_","_"
3,"_","_","_","sma","CX","","_","_"
4,"_","_","_","ah","V","ah","_","_"
5,"_","_","_","bhagavat","JJ","","_","_"
6,"_","_","_","ātreya","NC","","_","_"
1,"_","_","_","jñāna","NC","","_","_"
2,"_","_","_","praśama","NC","","_","_"
3,"_","_","_","tapas","NC","","_","_"
4,"_","_","_","khyā","PPP","","_","_"
5,"_","_","_","atri","NC","","_","_"
6,"_","_","_","suta","NC","","_","_"
7,"_","_","_","jagat","NC","","_","_"
8,"_","_","_","hita","NC","","_","_"
9,"_","_","_","abhira","PPP","","_","_"
1,"tṛṣṇānāṃ","_","_","tṛṣṇā","NC","","_","_"
2,"_","_","_","praśama","NC","","_","_"
3,"_","_","_","artha","NC","","_","_"
4,"cikitsitaṃ","_","_","cikitsita","NC","","_","_"
5,"prāha","_","_","prāh","V","prāh","_","_"
6,"pañcānām","_","_","pañcan","NUM","","_","_"
1,"_","_","_","kṣobha","NC","","_","_"
2,"_","_","_","bhaya","NC","","_","_"
3,"_","_","_","śrama","NC","","_","_"
4,"api","_","_","api","CX","","_","_"
5,"śokāt","_","_","śoka","NC","","_","_"
6,"krodhād","_","_","krodha","NC","","_","_"
7,"_","_","_","vilaṅghana","NC","","_","_"
8,"_","_","_","madya","NC","","_","_"
1,"_","_","_","kṣāra","JJ","","_","_"
2,"_","_","_","amla","JJ","","_","_"
3,"_","_","_","lavaṇa","JJ","","_","_"
4,"_","_","_","kaṭuka","JJ","","_","_"
5,"_","_","_","uṣṇa","JJ","","_","_"
6,"_","_","_","rūkṣa","JJ","","_","_"
7,"_","_","_","śuṣka","JJ","","_","_"
8,"_","_","_","anna","NC","","_","_"
9,"_","_","_","sevā","NC","","_","_"
1,"_","_","_","dhātu","NC","","_","_"
2,"_","_","_","kṣaya","NC","","_","_"
3,"_","_","_","gada","NC","","_","_"
4,"_","_","_","karṣaṇa","NC","","_","_"
5,"_","_","_","vamana","NC","","_","_"
6,"_","_","_","ādi","NC","","_","_"
7,"_","_","_","atiyoga","NC","","_","_"
8,"_","_","_","sūrya","NC","","_","_"
9,"_","_","_","saṃtāpa","NC","","_","_"
1,"_","_","_","pitta","NC","","_","_"
2,"_","_","_","anila","NC","","_","_"
3,"pravṛddhau","_","_","pravṛdh","PPP","","_","_"
4,"saumyān","_","_","saumya","JJ","","_","_"
5,"dhātūṃś","_","_","dhātu","NC","","_","_"
6,"ca","_","_","ca","CCD","","_","_"
7,"śoṣayataḥ","_","_","śoṣay","V","śoṣay","_","_"
1,"_","_","_","rasa","NC","","_","_"
2,"_","_","_","vāhin","JJ","","_","_"
3,"_","_","_","ca","CCD","","_","_"
4,"nāḍīr","_","_","nāḍi","NC","","_","_"
5,"_","_","_","jihvā","NC","","_","_"
6,"_","_","_","mūla","NC","","_","_"
7,"_","_","_","gala","NC","","_","_"
8,"_","_","_","tāluka","NC","","_","_"
9,"_","_","_","kloman","NC","","_","_"
1,"saṃśoṣya","_","_","samśoṣay","CGDA","","_","_"
2,"nṛṇāṃ","_","_","nṛ","NC","","_","_"
3,"dehe","_","_","deha","NC","","_","_"
4,"_","_","_","kar","V","kṛ","_","_"
5,"_","_","_","tṛṣṇā","NC","","_","_"
6,"_","_","_","mahat","JJ","","_","_"
7,"_","_","_","bala","NC","","_","_"
8,"_","_","_","ave","PPP","","_","_"
1,"pītaṃ","_","_","pā","PPP","","_","_"
2,"pītaṃ","_","_","pā","PPP","","_","_"
3,"hi","_","_","hi","CX","","_","_"
4,"jalaṃ","_","_","jala","NC","","_","_"
5,"_","_","_","śoṣay","V","śoṣay","_","_"
6,"_","_","_","tāvat","JJ","","_","_"
7,"na","_","_","na","CNG","","_","_"
8,"yāti","_","_","yā","V","yā","_","_"
9,"śamam","_","_","śama","NC","","_","_"
1,"_","_","_","ghora","JJ","","_","_"
2,"_","_","_","vyādhi","NC","","_","_"
3,"_","_","_","kṛśa","JJ","","_","_"
4,"_","_","_","prabhav","V","prabhū","_","_"
5,"_","_","_","upasarga","NC","","_","_"
6,"_","_","_","bhū","PPP","","_","_"
7,"sā","_","_","tad","PRD","","_","_"
1,"prāgrūpaṃ","_","_","prāgrūpa","NC","","_","_"
2,"_","_","_","mukha","NC","","_","_"
3,"_","_","_","śoṣa","NC","","_","_"
4,"_","_","_","sva","JJ","","_","_"
5,"_","_","_","lakṣaṇa","NC","","_","_"
6,"_","_","_","sarvadā","CX","","_","_"
7,"_","_","_","ambu","NC","","_","_"
8,"_","_","_","kāmin","JJ","","_","_"
1,"tṛṣṇānāṃ","_","_","tṛṣṇā","NC","","_","_"
2,"sarvāsāṃ","_","_","sarva","JQ","","_","_"
3,"liṅgānāṃ","_","_","liṅga","NC","","_","_"
4,"_","_","_","lāghava","NC","","_","_"
5,"_","_","_","apāya","NC","","_","_"
1,"_","_","_","mukha","NC","","_","_"
2,"_","_","_","śoṣa","NC","","_","_"
3,"_","_","_","svarabheda","NC","","_","_"
4,"_","_","_","bhrama","NC","","_","_"
5,"_","_","_","saṃtāpa","NC","","_","_"
6,"_","_","_","pralāpa","NC","","_","_"
7,"_","_","_","saṃstambha","NC","","_","_"
1,"_","_","_","tālu","NC","","_","_"
2,"_","_","_","oṣṭha","NC","","_","_"
3,"_","_","_","kaṇṭha","NC","","_","_"
4,"_","_","_","jihvā","NC","","_","_"
5,"_","_","_","karkaśa","JJ","","_","_"
7,"_","_","_","citta","NC","","_","_"
8,"_","_","_","nāśa","NC","","_","_"
9,"ca","_","_","ca","CCD","","_","_"
1,"_","_","_","jihvā","NC","","_","_"
2,"_","_","_","nirgama","NC","","_","_"
3,"_","_","_","aruci","NC","","_","_"
4,"bādhiryaṃ","_","_","bādhirya","NC","","_","_"
5,"_","_","_","marman","NC","","_","_"
6,"_","_","_","dūyana","NC","","_","_"
7,"sādam","_","_","sāda","NC","","_","_"
1,"_","_","_","tṛṣṇā","NC","","_","_"
2,"_","_","_","udbhū","PPP","","_","_"
3,"kurute","_","_","kar","V","kṛ","_","_"
4,"pañcavidhāṃ","_","_","pañcavidha","JJ","","_","_"
5,"liṅgataḥ","_","_","liṅgatas","CX","","_","_"
6,"śṛṇu","_","_","śṛṇ","V","śru","_","_"
7,"tām","_","_","tad","PRD","","_","_"
1,"abdhātuṃ","_","_","abdhātu","NC","","_","_"
2,"_","_","_","deha","NC","","_","_"
3,"_","_","_","stha","JJ","","_","_"
4,"kupitaḥ","_","_","kup","PPP","","_","_"
5,"pavano","_","_","pavana","NC","","_","_"
6,"yadā","_","_","yadā","CSB","","_","_"
7,"viśoṣayati","_","_","viśoṣay","V","viśoṣay","_","_"
1,"_","_","_","tad","PRD","","_","_"
2,"_","_","_","śuṣka","JJ","","_","_"
3,"_","_","_","śuṣ","V","śuṣ","_","_"
4,"_","_","_","abala","JJ","","_","_"
5,"_","_","_","tṛṣ","V","tṛṣ","_","_"
6,"_","_","_","atha","CAD","","_","_"
7,"viśuṣyan","_","_","viśuṣ","KDP","","_","_"
1,"_","_","_","nidrā","NC","","_","_"
2,"_","_","_","nāśa","NC","","_","_"
3,"śiraso","_","_","śiras","NC","","_","_"
4,"_","_","_","bhrama","NC","","_","_"
5,"_","_","_","tathā","CX","","_","_"
6,"_","_","_","śuṣka","JJ","","_","_"
7,"_","_","_","virasa","JJ","","_","_"
8,"_","_","_","mukhatā","NC","","_","_"
9,"ca","_","_","ca","CCD","","_","_"
10,"_","_","_","srotas","NC","","_","_"
11,"_","_","_","avarodha","NC","","_","_"
12,"iti","_","_","iti","CQT","","_","_"
13,"ca","_","_","ca","CCD","","_","_"
14,"_","_","_","as","V","as","_","_"
15,"_","_","_","liṅga","NC","","_","_"
16,"_","_","_","vāta","NC","","_","_"
17,"_","_","_","tṛṣṇā","NC","","_","_"
1,"pittaṃ","_","_","pitta","NC","","_","_"
2,"_","_","_","man","PPP","","_","_"
3,"_","_","_","āgneya","JJ","","_","_"
4,"kupitaṃ","_","_","kup","PPP","","_","_"
5,"cet","_","_","ced","CX","","_","_"
6,"tāpayaty","_","_","tāpay","V","tāpay","_","_"
7,"apāṃ","_","_","ap","NC","","_","_"
8,"dhātum","_","_","dhātu","NC","","_","_"
1,"saṃtaptaḥ","_","_","saṃtap","PPP","","_","_"
2,"sa","_","_","tad","PRD","","_","_"
3,"hi","_","_","hi","CX","","_","_"
4,"_","_","_","janay","V","janay","_","_"
5,"_","_","_","tṛṣṇā","NC","","_","_"
6,"_","_","_","dāha","NC","","_","_"
7,"_","_","_","ulbaṇa","JJ","","_","_"
8,"nṛṇām","_","_","nṛ","NC","","_","_"
1,"_","_","_","tikta","JJ","","_","_"
2,"_","_","_","āsya","NC","","_","_"
4,"śiraso","_","_","śiras","NC","","_","_"
5,"dāhaḥ","_","_","dāha","NC","","_","_"
6,"_","_","_","śīta","JJ","","_","_"
7,"_","_","_","abhinandatā","NC","","_","_"
8,"mūrchā","_","_","mūrchā","NC","","_","_"
1,"_","_","_","pīta","JJ","","_","_"
2,"_","_","_","akṣi","NC","","_","_"
3,"_","_","_","mūtra","NC","","_","_"
4,"_","_","_","varcas","NC","","_","_"
6,"ākṛtiḥ","_","_","ākṛti","NC","","_","_"
7,"_","_","_","pitta","NC","","_","_"
8,"_","_","_","tṛṣṇā","NC","","_","_"
1,"tṛṣṇā","_","_","tṛṣṇā","NC","","_","_"
2,"_","_","_","yad","PRL","","_","_"
3,"_","_","_","āma","JJ","","_","_"
4,"_","_","_","prabhava","NC","","_","_"
5,"_","_","_","tad","PRD","","_","_"
6,"_","_","_","api","CX","","_","_"
7,"_","_","_","āgneya","JJ","","_","_"
8,"_","_","_","āma","JJ","","_","_"
9,"_","_","_","pitta","NC","","_","_"
10,"_","_","_","janay","PPP","","_","_"
1,"liṅgaṃ","_","_","liṅga","NC","","_","_"
2,"tasyāś","_","_","tad","PRD","","_","_"
3,"_","_","_","ca","CCD","","_","_"
4,"_","_","_","aruci","NC","","_","_"
5,"_","_","_","ādhmāna","NC","","_","_"
6,"_","_","_","kapha","NC","","_","_"
7,"_","_","_","praseka","NC","","_","_"
8,"ca","_","_","ca","CCD","","_","_"
1,"deho","_","_","deha","NC","","_","_"
2,"_","_","_","rasa","NC","","_","_"
3,"_","_","_","ja","JJ","","_","_"
4,"_","_","_","ambu","NC","","_","_"
5,"_","_","_","bhava","NC","","_","_"
6,"_","_","_","rasa","NC","","_","_"
7,"_","_","_","ca","CCD","","_","_"
8,"tasya","_","_","tad","PRD","","_","_"
9,"_","_","_","kṣaya","NC","","_","_"
10,"_","_","_","ca","CCD","","_","_"
11,"_","_","_","tṛṣ","V","tṛṣ","_","_"
12,"_","_","_","hi","CX","","_","_"
1,"_","_","_","dīna","JJ","","_","_"
2,"_","_","_","svara","NC","","_","_"
3,"pratāmyan","_","_","prata","KDP","","_","_"
4,"_","_","_","saṃśuṣka","JJ","","_","_"
5,"_","_","_","hṛdaya","NC","","_","_"
6,"_","_","_","gala","NC","","_","_"
7,"_","_","_","tālu","NC","","_","_"
1,"bhavati","_","_","bhav","V","bhū","_","_"
2,"khalu","_","_","khalu","CX","","_","_"
3,"_","_","_","yad","PRL","","_","_"
4,"_","_","_","upasarga","NC","","_","_"
5,"_","_","_","tṛṣṇā","NC","","_","_"
6,"sā","_","_","tad","PRD","","_","_"
7,"śoṣiṇī","_","_","śoṣin","JJ","","_","_"
8,"kaṣṭā","_","_","kaṣṭa","JJ","","_","_"
1,"_","_","_","jvara","NC","","_","_"
2,"_","_","_","meha","NC","","_","_"
3,"_","_","_","kṣaya","NC","","_","_"
4,"_","_","_","śoṣa","NC","","_","_"
5,"_","_","_","śvāsa","NC","","_","_"
6,"_","_","_","ādi","NC","","_","_"
7,"_","_","_","upasṛj","PPP","","_","_"
8,"_","_","_","deha","NC","","_","_"
1,"_","_","_","sarva","JQ","","_","_"
2,"_","_","_","tu","CCD","","_","_"
3,"_","_","_","ati","CADP","","_","_"
4,"_","_","_","prasañj","PPP","","_","_"
5,"_","_","_","roga","NC","","_","_"
6,"_","_","_","kṛśa","JJ","","_","_"
7,"_","_","_","vami","NC","","_","_"
8,"_","_","_","prasañj","PPP","","_","_"
1,"_","_","_","ghora","JJ","","_","_"
2,"_","_","_","upadrava","NC","","_","_"
3,"_","_","_","yuj","PPP","","_","_"
4,"tṛṣṇā","_","_","tṛṣṇā","NC","","_","_"
5,"maraṇāya","_","_","maraṇa","NC","","_","_"
6,"vijñeyāḥ","_","_","vijñā","KDG","","_","_"
