"WordID","word","NormSTEM","suffix","lemma","PoS","Root","NormSuffix","NormWord"
1,"yudhiṣṭhira","_","_","yudhiṣṭhira","NC","","_","_"
2,"uvāca","_","_","vak","V","vac","_","_"
1,"_","_","_","na","CNG","","_","_"
2,"_","_","_","iha","CAD","","_","_"
3,"paśyāmi","_","_","paś","V","paś","_","_"
4,"vibudhā","_","_","vibudha","NC","","_","_"
5,"rādheyam","_","_","rādheya","NC","","_","_"
6,"_","_","_","amita","JJ","","_","_"
7,"_","_","_","ojas","NC","","_","_"
1,"bhrātarau","_","_","bhrātṛ","NC","","_","_"
2,"ca","_","_","ca","CCD","","_","_"
3,"mahātmānau","_","_","mahātman","JJ","","_","_"
4,"_","_","_","yudhāmanyu","NC","","_","_"
5,"_","_","_","uttamaujas","NC","","_","_"
1,"juhuvur","_","_","hu","V","hu","_","_"
2,"ye","_","_","yad","PRL","","_","_"
3,"śarīrāṇi","_","_","śarīra","NC","","_","_"
4,"_","_","_","raṇa","NC","","_","_"
5,"_","_","_","vahni","NC","","_","_"
6,"_","_","_","mahat","JJ","","_","_"
7,"_","_","_","ratha","NC","","_","_"
1,"rājāno","_","_","rājan","NC","","_","_"
2,"_","_","_","rājan","NC","","_","_"
3,"_","_","_","putra","NC","","_","_"
4,"_","_","_","ca","CCD","","_","_"
5,"ye","_","_","yad","PRL","","_","_"
6,"_","_","_","mat","PPR","","_","_"
7,"_","_","_","artha","NC","","_","_"
8,"hatā","_","_","han","PPP","","_","_"
9,"raṇe","_","_","raṇa","NC","","_","_"
1,"kva","_","_","kva","CX","","_","_"
2,"te","_","_","tad","PRD","","_","_"
3,"_","_","_","mahat","JJ","","_","_"
4,"_","_","_","ratha","NC","","_","_"
5,"sarve","_","_","sarva","JQ","","_","_"
6,"_","_","_","śārdūla","NC","","_","_"
7,"_","_","_","sama","PPX","","_","_"
8,"_","_","_","vikrama","NC","","_","_"
1,"tair","_","_","tad","PRD","","_","_"
2,"_","_","_","api","CX","","_","_"
3,"_","_","_","ida","PRD","","_","_"
4,"jito","_","_","ji","PPP","","_","_"
5,"lokaḥ","_","_","loka","NC","","_","_"
6,"kaccit","_","_","kaccit","CX","","_","_"
7,"_","_","_","puruṣa","NC","","_","_"
8,"_","_","_","sattama","JJ","","_","_"
1,"yadi","_","_","yadi","CSB","","_","_"
2,"lokān","_","_","loka","NC","","_","_"
3,"imān","_","_","ida","PRD","","_","_"
4,"_","_","_","prāp","PPP","","_","_"
5,"_","_","_","tad","PRD","","_","_"
6,"ca","_","_","ca","CCD","","_","_"
7,"sarve","_","_","sarva","JQ","","_","_"
8,"_","_","_","mahat","JJ","","_","_"
9,"_","_","_","ratha","NC","","_","_"
1,"sthitaṃ","_","_","sthā","PPP","","_","_"
2,"vitta","_","_","vid","V","vid","_","_"
3,"hi","_","_","hi","CX","","_","_"
4,"māṃ","_","_","mat","PPR","","_","_"
5,"devāḥ","_","_","deva","NC","","_","_"
6,"sahitaṃ","_","_","sahita","JJ","","_","_"
7,"tair","_","_","tad","PRD","","_","_"
8,"mahātmabhiḥ","_","_","mahātman","JJ","","_","_"
1,"_","_","_","kaccit","CX","","_","_"
2,"_","_","_","na","CNG","","_","_"
3,"tair","_","_","tad","PRD","","_","_"
4,"avāpto","_","_","avāp","PPP","","_","_"
5,"'yaṃ","_","_","ida","PRD","","_","_"
6,"nṛpair","_","_","nṛpa","NC","","_","_"
7,"loko","_","_","loka","NC","","_","_"
8,"'kṣayaḥ","_","_","akṣaya","JJ","","_","_"
9,"śubhaḥ","_","_","śubha","JJ","","_","_"
1,"na","_","_","na","CNG","","_","_"
2,"tair","_","_","tad","PRD","","_","_"
3,"ahaṃ","_","_","mat","PPR","","_","_"
4,"vinā","_","_","vinā","CX","","_","_"
5,"vatsye","_","_","vas","V","vas","_","_"
6,"jñātibhir","_","_","jñāti","NC","","_","_"
7,"_","_","_","bhrātṛ","NC","","_","_"
8,"_","_","_","tathā","CX","","_","_"
1,"mātur","_","_","mātṛ","NC","","_","_"
2,"hi","_","_","hi","CX","","_","_"
3,"vacanaṃ","_","_","vacana","NC","","_","_"
4,"śrutvā","_","_","śru","CGDA","","_","_"
5,"tadā","_","_","tadā","CAD","","_","_"
6,"_","_","_","salila","NC","","_","_"
7,"_","_","_","karman","NC","","_","_"
1,"karṇasya","_","_","karṇa","NC","","_","_"
2,"kriyatāṃ","_","_","kar","V","kṛ","_","_"
3,"toyam","_","_","toya","NC","","_","_"
4,"iti","_","_","iti","CQT","","_","_"
5,"tapyāmi","_","_","tap","V","tap","_","_"
6,"tena","_","_","tad","PRD","","_","_"
7,"vai","_","_","vai","CX","","_","_"
1,"idaṃ","_","_","ida","PRD","","_","_"
2,"ca","_","_","ca","CCD","","_","_"
3,"paritapyāmi","_","_","paritap","V","paritap","_","_"
4,"punaḥ","_","_","punar","CAD","","_","_"
5,"punar","_","_","punar","CAD","","_","_"
6,"ahaṃ","_","_","mat","PPR","","_","_"
7,"surāḥ","_","_","sura","NC","","_","_"
1,"_","_","_","yat","CSB","","_","_"
2,"_","_","_","mātṛ","NC","","_","_"
3,"sadṛśau","_","_","sadṛśa","JJ","","_","_"
4,"pādau","_","_","pāda","NC","","_","_"
5,"_","_","_","tad","PRD","","_","_"
6,"_","_","_","mat","PPR","","_","_"
7,"_","_","_","amita","JJ","","_","_"
8,"_","_","_","ojas","NC","","_","_"
1,"_","_","_","dṛś","CGDA","","_","_"
2,"_","_","_","eva","CEM","","_","_"
3,"taṃ","_","_","tad","PRD","","_","_"
4,"_","_","_","na","CNG","","_","_"
5,"_","_","_","anuga","PPP","","_","_"
6,"karṇaṃ","_","_","karṇa","NC","","_","_"
7,"_","_","_","para","PPX","","_","_"
8,"_","_","_","bala","NC","","_","_"
9,"_","_","_","ardana","JJ","","_","_"
1,"na","_","_","na","CNG","","_","_"
2,"_","_","_","hi","CX","","_","_"
3,"_","_","_","mat","PPR","","_","_"
4,"_","_","_","karṇa","NC","","_","_"
5,"_","_","_","sahita","JJ","","_","_"
6,"_","_","_","jay","V","ji","_","_"
7,"_","_","_","śakra","NC","","_","_"
8,"'pi","_","_","api","CX","","_","_"
9,"saṃyuge","_","_","saṃyuga","NC","","_","_"
1,"tam","_","_","tad","PRD","","_","_"
2,"ahaṃ","_","_","mat","PPR","","_","_"
3,"_","_","_","yatra","CX","","_","_"
4,"_","_","_","tatrastha","JJ","","_","_"
5,"draṣṭum","_","_","dṛś","CGDI","","_","_"
6,"icchāmi","_","_","iṣ","V","iṣ","_","_"
7,"sūryajam","_","_","sūryaja","NC","","_","_"
1,"_","_","_","a","CNG","","_","_"
2,"_","_","_","vijñā","PPP","","_","_"
3,"mayā","_","_","mat","PPR","","_","_"
4,"yo","_","_","yad","PRL","","_","_"
5,"'sau","_","_","adas","PRD","","_","_"
6,"ghātitaḥ","_","_","ghātay","PPP","","_","_"
7,"savyasācinā","_","_","savyasācin","NC","","_","_"
1,"bhīmaṃ","_","_","bhīma","NC","","_","_"
2,"ca","_","_","ca","CCD","","_","_"
3,"_","_","_","bhīma","JJ","","_","_"
4,"_","_","_","vikra","PPP","","_","_"
5,"prāṇebhyo","_","_","prāṇa","NC","","_","_"
6,"'pi","_","_","api","CX","","_","_"
7,"priyaṃ","_","_","priya","JJ","","_","_"
8,"mama","_","_","mat","PPR","","_","_"
1,"arjunaṃ","_","_","arjuna","NC","","_","_"
2,"_","_","_","ca","CCD","","_","_"
3,"_","_","_","indra","NC","","_","_"
4,"_","_","_","saṃkāśa","NC","","_","_"
5,"yamau","_","_","yama","NC","","_","_"
6,"tau","_","_","tad","PRD","","_","_"
7,"ca","_","_","ca","CCD","","_","_"
8,"_","_","_","yama","NC","","_","_"
9,"_","_","_","upama","JJ","","_","_"
1,"draṣṭum","_","_","dṛś","CGDI","","_","_"
2,"icchāmi","_","_","iṣ","V","iṣ","_","_"
3,"tāṃ","_","_","tad","PRD","","_","_"
4,"_","_","_","ca","CCD","","_","_"
5,"_","_","_","mat","PPR","","_","_"
6,"pāñcālīṃ","_","_","pāñcālī","NC","","_","_"
7,"_","_","_","dharma","NC","","_","_"
8,"_","_","_","cārin","JJ","","_","_"
1,"na","_","_","na","CNG","","_","_"
2,"_","_","_","ca","CCD","","_","_"
3,"_","_","_","iha","CAD","","_","_"
4,"sthātum","_","_","sthā","CGDI","","_","_"
5,"icchāmi","_","_","iṣ","V","iṣ","_","_"
6,"satyam","_","_","satya","NC","","_","_"
7,"etad","_","_","tad","PRD","","_","_"
8,"bravīmi","_","_","abravīta","V","brū","_","_"
9,"vaḥ","_","_","tvat","PPR","","_","_"
1,"kiṃ","_","_","kiṃ","PRQ","","_","_"
2,"me","_","_","mat","PPR","","_","_"
3,"_","_","_","bhrātṛ","NC","","_","_"
4,"_","_","_","vihā","PPP","","_","_"
5,"svargeṇa","_","_","svarga","NC","","_","_"
6,"_","_","_","sura","NC","","_","_"
7,"_","_","_","sattama","JJ","","_","_"
1,"yatra","_","_","yatra","CX","","_","_"
2,"te","_","_","tad","PRD","","_","_"
3,"sa","_","_","tad","PRD","","_","_"
4,"mama","_","_","mat","PPR","","_","_"
5,"svargo","_","_","svarga","NC","","_","_"
6,"_","_","_","na","CNG","","_","_"
7,"_","_","_","ida","PRD","","_","_"
8,"svargo","_","_","svarga","NC","","_","_"
9,"mato","_","_","man","PPP","","_","_"
10,"mama","_","_","mat","PPR","","_","_"
1,"devā","_","_","deva","NC","","_","_"
2,"ūcuḥ","_","_","vak","V","vac","_","_"
1,"yadi","_","_","yadi","CSB","","_","_"
2,"vai","_","_","vai","CX","","_","_"
3,"tatra","_","_","tatra","CAD","","_","_"
4,"te","_","_","tvat","PPR","","_","_"
5,"śraddhā","_","_","śraddhā","NC","","_","_"
6,"gamyatāṃ","_","_","ga","V","ga","_","_"
7,"putra","_","_","putra","NC","","_","_"
8,"māciram","_","_","mācira","CX","","_","_"
1,"priye","_","_","priya","NC","","_","_"
2,"hi","_","_","hi","CX","","_","_"
3,"tava","_","_","tvat","PPR","","_","_"
4,"vartāmo","_","_","vart","V","vṛt","_","_"
5,"devarājasya","_","_","devarāja","NC","","_","_"
6,"śāsanāt","_","_","śāsana","NC","","_","_"
1,"vaiśaṃpāyana","_","_","vaiśampāyana","NC","","_","_"
2,"uvāca","_","_","vak","V","vac","_","_"
1,"_","_","_","iti","CQT","","_","_"
2,"_","_","_","vac","CGDA","","_","_"
3,"taṃ","_","_","tad","PRD","","_","_"
4,"tato","_","_","tatas","CX","","_","_"
5,"devā","_","_","deva","NC","","_","_"
6,"_","_","_","deva","NC","","_","_"
7,"_","_","_","dūta","NC","","_","_"
8,"upādiśan","_","_","upadiś","V","upadiś","_","_"
1,"yudhiṣṭhirasya","_","_","yudhiṣṭhira","NC","","_","_"
2,"suhṛdo","_","_","suhṛd","NC","","_","_"
3,"_","_","_","darśay","V","darśay","_","_"
4,"_","_","_","iti","CQT","","_","_"
5,"paraṃtapa","_","_","paraṃtapa","JJ","","_","_"
1,"tataḥ","_","_","tatas","CX","","_","_"
2,"_","_","_","kuntī","NC","","_","_"
3,"_","_","_","suta","NC","","_","_"
4,"rājā","_","_","rājan","NC","","_","_"
5,"_","_","_","deva","NC","","_","_"
6,"_","_","_","dūta","NC","","_","_"
7,"_","_","_","ca","CCD","","_","_"
8,"jagmatuḥ","_","_","ga","V","ga","_","_"
1,"sahitau","_","_","sahita","JJ","","_","_"
2,"_","_","_","rājan","NC","","_","_"
3,"_","_","_","śārdūla","NC","","_","_"
4,"yatra","_","_","yatra","CX","","_","_"
5,"te","_","_","tad","PRD","","_","_"
6,"_","_","_","puruṣa","NC","","_","_"
7,"_","_","_","ṛṣabha","NC","","_","_"
1,"agrato","_","_","agratas","CX","","_","_"
2,"_","_","_","deva","NC","","_","_"
3,"_","_","_","dūta","NC","","_","_"
4,"_","_","_","tu","CCD","","_","_"
5,"yayau","_","_","yā","V","yā","_","_"
6,"rājā","_","_","rājan","NC","","_","_"
7,"ca","_","_","ca","CCD","","_","_"
8,"pṛṣṭhataḥ","_","_","pṛṣṭhatas","CX","","_","_"
1,"panthānam","_","_","pathin","NC","","_","_"
2,"aśubhaṃ","_","_","aśubha","JJ","","_","_"
3,"durgaṃ","_","_","durga","JJ","","_","_"
4,"sevitaṃ","_","_","sev","PPP","","_","_"
5,"_","_","_","pāpa","JJ","","_","_"
6,"_","_","_","karman","NC","","_","_"
1,"tamasā","_","_","tamas","NC","","_","_"
2,"saṃvṛtaṃ","_","_","saṃvṛ","PPP","","_","_"
3,"ghoraṃ","_","_","ghora","JJ","","_","_"
4,"_","_","_","keśa","NC","","_","_"
5,"_","_","_","śaivala","NC","","_","_"
6,"_","_","_","śādvala","NC","","_","_"
1,"yuktaṃ","_","_","yuj","PPP","","_","_"
2,"_","_","_","pāpa","NC","","_","_"
3,"_","_","_","kṛt","JJ","","_","_"
4,"gandhair","_","_","gandha","NC","","_","_"
5,"_","_","_","māṃsa","NC","","_","_"
6,"_","_","_","śoṇita","NC","","_","_"
7,"_","_","_","kardama","JJ","","_","_"
1,"_","_","_","daṃśa","NC","","_","_"
2,"_","_","_","utthāna","NC","","_","_"
3,"_","_","_","sa_saha","CX","","_","_"
4,"_","_","_","jhillīka","NC","","_","_"
5,"_","_","_","makṣikā","NC","","_","_"
6,"_","_","_","maśaka","NC","","_","_"
7,"_","_","_","āvṛ","PPP","","_","_"
1,"_","_","_","itas","CX","","_","_"
2,"_","_","_","ca","CCD","","_","_"
3,"_","_","_","itas","CX","","_","_"
4,"_","_","_","ca","CCD","","_","_"
5,"kuṇapaiḥ","_","_","kuṇapa","NC","","_","_"
6,"samantāt","_","_","samantāt","CX","","_","_"
7,"parivāritam","_","_","parivāray","PPP","","_","_"
1,"_","_","_","asthi","NC","","_","_"
2,"_","_","_","keśa","NC","","_","_"
3,"_","_","_","samākṛ","PPP","","_","_"
4,"_","_","_","kṛmi","NC","","_","_"
5,"_","_","_","kīṭa","NC","","_","_"
6,"_","_","_","samākula","JJ","","_","_"
1,"jvalanena","_","_","jvalana","NC","","_","_"
2,"pradīptena","_","_","pradīp","PPP","","_","_"
3,"samantāt","_","_","samantāt","CX","","_","_"
4,"pariveṣṭitam","_","_","pariveṣṭay","PPP","","_","_"
1,"_","_","_","ayas","NC","","_","_"
2,"_","_","_","mukha","NC","","_","_"
3,"_","_","_","ca","CCD","","_","_"
4,"kākolair","_","_","kākola","NC","","_","_"
5,"_","_","_","gṛdhra","NC","","_","_"
6,"_","_","_","ca","CCD","","_","_"
7,"samabhidrutam","_","_","samabhidru","PPP","","_","_"
1,"_","_","_","sūci","NC","","_","_"
2,"_","_","_","mukha","NC","","_","_"
3,"_","_","_","tathā","CX","","_","_"
4,"pretair","_","_","preta","NC","","_","_"
5,"_","_","_","vindhya","NC","","_","_"
6,"_","_","_","śaila","NC","","_","_"
7,"_","_","_","upama","JJ","","_","_"
8,"vṛtam","_","_","vṛ","PPP","","_","_"
1,"_","_","_","medas","NC","","_","_"
2,"_","_","_","rudhira","NC","","_","_"
3,"_","_","_","yuj","PPP","","_","_"
4,"_","_","_","ca","CCD","","_","_"
5,"_","_","_","chid","PPP","","_","_"
6,"_","_","_","bāhu","NC","","_","_"
7,"_","_","_","ūru","NC","","_","_"
8,"_","_","_","pāṇi","NC","","_","_"
1,"_","_","_","nikṛt","PPP","","_","_"
2,"_","_","_","udara","NC","","_","_"
3,"_","_","_","pāda","NC","","_","_"
4,"_","_","_","ca","CCD","","_","_"
5,"tatra","_","_","tatra","CAD","","_","_"
6,"tatra","_","_","tatra","CAD","","_","_"
7,"praveritaiḥ","_","_","praverita","JJ","","_","_"
1,"sa","_","_","tad","PRD","","_","_"
2,"tat","_","_","tad","PRD","","_","_"
3,"_","_","_","kuṇapa","NC","","_","_"
4,"_","_","_","durgandha","JJ","","_","_"
5,"aśivaṃ","_","_","aśiva","JJ","","_","_"
6,"romaharṣaṇam","_","_","romaharṣaṇa","JJ","","_","_"
1,"jagāma","_","_","ga","V","ga","_","_"
2,"rājā","_","_","rājan","NC","","_","_"
3,"_","_","_","dharma","NC","","_","_"
4,"_","_","_","ātman","NC","","_","_"
5,"madhye","_","_","madhya","NC","","_","_"
6,"bahu","_","_","bahu","JJ","","_","_"
7,"vicintayan","_","_","vicintay","KDP","","_","_"
1,"_","_","_","darś","V","dṛś","_","_"
2,"_","_","_","uṣṇa","JJ","","_","_"
3,"_","_","_","udaka","NC","","_","_"
4,"pūrṇāṃ","_","_","pṛ","PPP","","_","_"
5,"nadīṃ","_","_","nadī","NC","","_","_"
6,"_","_","_","ca","CCD","","_","_"
7,"_","_","_","api","CX","","_","_"
8,"_","_","_","su","CAD","","_","_"
9,"_","_","_","durgama","JJ","","_","_"
1,"asipatravanaṃ","_","_","asipattravana","NC","","_","_"
2,"_","_","_","ca","CCD","","_","_"
3,"_","_","_","eva","CEM","","_","_"
4,"_","_","_","niśā","PPP","","_","_"
5,"_","_","_","kṣura","NC","","_","_"
6,"_","_","_","saṃvṛ","PPP","","_","_"
1,"_","_","_","karambha","NC","","_","_"
2,"_","_","_","vālukā","NC","","_","_"
3,"_","_","_","tap","PPP","","_","_"
4,"_","_","_","āyasa","JJ","","_","_"
5,"_","_","_","ca","CCD","","_","_"
6,"śilāḥ","_","_","śilā","NC","","_","_"
7,"pṛthak","_","_","pṛthak","CX","","_","_"
1,"_","_","_","loha","NC","","_","_"
2,"_","_","_","kumbhī","NC","","_","_"
3,"_","_","_","ca","CCD","","_","_"
4,"tailasya","_","_","taila","NC","","_","_"
5,"kvāthyamānāḥ","_","_","kvāthay","KDP","","_","_"
6,"samantataḥ","_","_","samantataḥ","CX","","_","_"
1,"kūṭaśālmalikaṃ","_","_","kūṭaśālmalika","NC","","_","_"
2,"_","_","_","ca","CCD","","_","_"
3,"_","_","_","api","CX","","_","_"
4,"duḥsparśaṃ","_","_","duḥsparśa","JJ","","_","_"
5,"_","_","_","tīkṣṇa","JJ","","_","_"
6,"_","_","_","kaṇṭaka","NC","","_","_"
1,"dadarśa","_","_","darś","V","dṛś","_","_"
2,"_","_","_","ca","CCD","","_","_"
3,"_","_","_","api","CX","","_","_"
4,"kaunteyo","_","_","kaunteya","NC","","_","_"
5,"yātanāḥ","_","_","yātanā","NC","","_","_"
6,"_","_","_","pāpa","NC","","_","_"
7,"_","_","_","karmin","JJ","","_","_"
1,"sa","_","_","tad","PRD","","_","_"
2,"taṃ","_","_","tad","PRD","","_","_"
3,"durgandham","_","_","durgandha","NC","","_","_"
4,"ālakṣya","_","_","ālakṣay","CGDA","","_","_"
5,"_","_","_","deva","NC","","_","_"
6,"_","_","_","dūta","NC","","_","_"
7,"uvāca","_","_","vak","V","vac","_","_"
8,"ha","_","_","ha","CEM","","_","_"
1,"kiyad","_","_","kiyat","JJ","","_","_"
2,"adhvānam","_","_","adhvan","NC","","_","_"
3,"asmābhir","_","_","mat","PPR","","_","_"
4,"gantavyam","_","_","ga","KDG","","_","_"
5,"idam","_","_","ida","PRD","","_","_"
6,"īdṛśam","_","_","īdṛśa","JJ","","_","_"
1,"kva","_","_","kva","CX","","_","_"
2,"ca","_","_","ca","CCD","","_","_"
3,"te","_","_","tad","PRD","","_","_"
4,"bhrātaro","_","_","bhrātṛ","NC","","_","_"
5,"mahyaṃ","_","_","mat","PPR","","_","_"
6,"_","_","_","tad","PRD","","_","_"
7,"_","_","_","mat","PPR","","_","_"
8,"_","_","_","ākhyā","CGDI","","_","_"
9,"arhasi","_","_","arh","V","arh","_","_"
1,"deśo","_","_","deśa","NC","","_","_"
2,"'yaṃ","_","_","ida","PRD","","_","_"
3,"_","_","_","kiṃ","PRQ","","_","_"
4,"_","_","_","ca","CCD","","_","_"
5,"devānām","_","_","deva","NC","","_","_"
6,"etad","_","_","tad","PRD","","_","_"
7,"icchāmi","_","_","iṣ","V","iṣ","_","_"
8,"veditum","_","_","vid","CGDI","","_","_"
1,"sa","_","_","tad","PRD","","_","_"
2,"saṃnivavṛte","_","_","saṃnivart","V","saṃnivṛt","_","_"
3,"śrutvā","_","_","śru","CGDA","","_","_"
4,"dharmarājasya","_","_","dharmarāja","NC","","_","_"
5,"bhāṣitam","_","_","bhāṣita","NC","","_","_"
1,"_","_","_","deva","NC","","_","_"
2,"_","_","_","dūta","NC","","_","_"
3,"_","_","_","abravīta","V","brū","_","_"
4,"_","_","_","ca","CCD","","_","_"
5,"_","_","_","a","PRD","","_","_"
6,"etāvad","_","_","etāvat","JJ","","_","_"
7,"gamanaṃ","_","_","gamana","NC","","_","_"
8,"tava","_","_","tvat","PPR","","_","_"
1,"nivartitavyaṃ","_","_","nivṛt","KDG","","_","_"
2,"hi","_","_","hi","CX","","_","_"
3,"mayā","_","_","mat","PPR","","_","_"
4,"_","_","_","tathā","CX","","_","_"
5,"_","_","_","as","V","as","_","_"
6,"_","_","_","vac","PPP","","_","_"
7,"divaukasaiḥ","_","_","divaukasa","NC","","_","_"
1,"yadi","_","_","yadi","CSB","","_","_"
2,"śrānto","_","_","śra","PPP","","_","_"
3,"'si","_","_","as","V","as","_","_"
4,"_","_","_","rājan","NC","","_","_"
5,"_","_","_","indra","NC","","_","_"
6,"tvam","_","_","tvat","PPR","","_","_"
7,"_","_","_","atha","CAD","","_","_"
8,"_","_","_","āga","CGDI","","_","_"
9,"arhasi","_","_","arh","V","arh","_","_"
1,"_","_","_","yudhiṣṭhira","NC","","_","_"
2,"_","_","_","tu","CCD","","_","_"
3,"_","_","_","nirvid","PPP","","_","_"
4,"_","_","_","tad","PRD","","_","_"
5,"gandhena","_","_","gandha","NC","","_","_"
6,"mūrchitaḥ","_","_","mūrchay","PPP","","_","_"
1,"nivartane","_","_","nivartana","NC","","_","_"
2,"_","_","_","dhṛ","PPP","","_","_"
3,"_","_","_","manas","NC","","_","_"
4,"paryāvartata","_","_","paryāvṛt","V","paryāvṛt","_","_"
5,"bhārata","_","_","bhārata","NC","","_","_"
1,"sa","_","_","tad","PRD","","_","_"
2,"saṃnivṛtto","_","_","saṃnivṛt","PPP","","_","_"
3,"_","_","_","dharma","NC","","_","_"
4,"_","_","_","ātman","NC","","_","_"
5,"_","_","_","duḥkha","NC","","_","_"
6,"_","_","_","śoka","NC","","_","_"
7,"_","_","_","samanvita","JJ","","_","_"
1,"śuśrāva","_","_","śṛṇ","V","śru","_","_"
2,"tatra","_","_","tatra","CAD","","_","_"
3,"vadatāṃ","_","_","vad","KDP","","_","_"
4,"dīnā","_","_","dīna","JJ","","_","_"
5,"vācaḥ","_","_","vāc","NC","","_","_"
6,"samantataḥ","_","_","samantataḥ","CX","","_","_"
1,"bho","_","_","bho","CX","","_","_"
2,"bho","_","_","bho","CX","","_","_"
3,"dharmaja","_","_","dharmaja","NC","","_","_"
4,"_","_","_","rājan","NC","","_","_"
5,"_","_","_","ṛṣi","NC","","_","_"
6,"_","_","_","puṇya","JJ","","_","_"
7,"_","_","_","abhijana","NC","","_","_"
8,"pāṇḍava","_","_","pāṇḍava","NC","","_","_"
1,"_","_","_","anugraha","NC","","_","_"
2,"_","_","_","artha","NC","","_","_"
3,"asmākaṃ","_","_","mat","PPR","","_","_"
4,"tiṣṭha","_","_","tiṣṭh","V","sthā","_","_"
5,"_","_","_","tāvat","CX","","_","_"
6,"_","_","_","muhūrtaka","NC","","_","_"
1,"tvayi","_","_","tvat","PPR","","_","_"
2,"durdharṣe","_","_","durdharṣa","JJ","","_","_"
3,"vāti","_","_","śṛṇ","V","vā","_","_"
4,"puṇyaḥ","_","_","puṇya","JJ","","_","_"
5,"samīraṇaḥ","_","_","samīraṇa","NC","","_","_"
1,"tava","_","_","tvat","PPR","","_","_"
2,"_","_","_","gandha","NC","","_","_"
3,"_","_","_","anuga","JJ","","_","_"
4,"_","_","_","tāta","NC","","_","_"
5,"_","_","_","yad","PRL","","_","_"
6,"_","_","_","mat","PPR","","_","_"
7,"sukham","_","_","sukha","NC","","_","_"
8,"āgamat","_","_","āgacch","V","āgam","_","_"
1,"te","_","_","tad","PRD","","_","_"
2,"vayaṃ","_","_","mat","PPR","","_","_"
3,"pārtha","_","_","pārtha","NC","","_","_"
4,"dīrghasya","_","_","dīrgha","JJ","","_","_"
5,"kālasya","_","_","kāla","NC","","_","_"
6,"_","_","_","puruṣa","NC","","_","_"
7,"_","_","_","ṛṣabha","NC","","_","_"
1,"sukham","_","_","sukha","NC","","_","_"
2,"_","_","_","āsāday","V","āsāday","_","_"
3,"_","_","_","tvat","PPR","","_","_"
4,"dṛṣṭvā","_","_","dṛś","CGDA","","_","_"
5,"_","_","_","rājan","NC","","_","_"
6,"_","_","_","sattama","JJ","","_","_"
1,"saṃtiṣṭhasva","_","_","saṃtiṣṭh","V","saṃsthā","_","_"
2,"_","_","_","mahat","JJ","","_","_"
3,"_","_","_","bāhu","NC","","_","_"
4,"muhūrtam","_","_","muhūrta","NC","","_","_"
5,"api","_","_","api","CX","","_","_"
6,"bhārata","_","_","bhārata","NC","","_","_"
1,"tvayi","_","_","tvat","PPR","","_","_"
2,"tiṣṭhati","_","_","sthā","KDP","","_","_"
3,"kauravya","_","_","kauravya","NC","","_","_"
4,"_","_","_","yātanā","NC","","_","_"
5,"_","_","_","mat","PPR","","_","_"
6,"_","_","_","na","CNG","","_","_"
7,"bādhate","_","_","bādh","V","bādh","_","_"
1,"evaṃ","_","_","eva","CX","","_","_"
2,"bahuvidhā","_","_","bahuvidha","JJ","","_","_"
3,"vācaḥ","_","_","vāc","NC","","_","_"
4,"kṛpaṇā","_","_","kṛpaṇa","JJ","","_","_"
5,"vedanāvatām","_","_","vedanāvat","JJ","","_","_"
1,"tasmin","_","_","tad","PRD","","_","_"
2,"deśe","_","_","deśa","NC","","_","_"
3,"sa","_","_","tad","PRD","","_","_"
4,"śuśrāva","_","_","śṛṇ","V","śru","_","_"
5,"samantād","_","_","samantāt","CX","","_","_"
6,"vadatāṃ","_","_","vad","KDP","","_","_"
7,"nṛpa","_","_","nṛpa","NC","","_","_"
1,"teṣāṃ","_","_","tad","PRD","","_","_"
2,"tad","_","_","tad","PRD","","_","_"
3,"vacanaṃ","_","_","vacana","NC","","_","_"
4,"śrutvā","_","_","śru","CGDA","","_","_"
5,"dayāvān","_","_","dayāvat","JJ","","_","_"
6,"_","_","_","dīna","JJ","","_","_"
7,"_","_","_","bhāṣin","JJ","","_","_"
1,"aho","_","_","aho","CX","","_","_"
2,"kṛcchram","_","_","kṛcchra","NC","","_","_"
3,"iti","_","_","iti","CQT","","_","_"
4,"prāha","_","_","prāh","V","prāh","_","_"
5,"tasthau","_","_","tiṣṭh","V","sthā","_","_"
6,"sa","_","_","tad","PRD","","_","_"
7,"ca","_","_","ca","CCD","","_","_"
8,"yudhiṣṭhiraḥ","_","_","yudhiṣṭhira","NC","","_","_"
1,"sa","_","_","tad","PRD","","_","_"
2,"tā","_","_","tad","PRD","","_","_"
3,"giraḥ","_","_","gir","NC","","_","_"
4,"purastād","_","_","purastāt","CX","","_","_"
5,"vai","_","_","vai","CX","","_","_"
6,"_","_","_","śru","PPP","","_","_"
7,"_","_","_","pūrva","PPX","","_","_"
8,"punaḥ","_","_","punar","CAD","","_","_"
9,"punaḥ","_","_","punar","CAD","","_","_"
1,"glānānāṃ","_","_","glā","PPP","","_","_"
2,"duḥkhitānāṃ","_","_","duḥkhita","JJ","","_","_"
3,"ca","_","_","ca","CCD","","_","_"
4,"_","_","_","na","CNG","","_","_"
5,"_","_","_","abhijān","V","abhijñā","_","_"
6,"pāṇḍavaḥ","_","_","pāṇḍava","NC","","_","_"
1,"_","_","_","a","CNG","","_","_"
2,"_","_","_","budh","KDP","","_","_"
3,"_","_","_","tad","PRD","","_","_"
4,"vāco","_","_","vāc","NC","","_","_"
5,"dharmaputro","_","_","dharmaputra","NC","","_","_"
6,"yudhiṣṭhiraḥ","_","_","yudhiṣṭhira","NC","","_","_"
1,"uvāca","_","_","vak","V","vac","_","_"
2,"ke","_","_","kiṃ","PRQ","","_","_"
3,"bhavanto","_","_","bhavat","JJ","","_","_"
4,"vai","_","_","vai","CX","","_","_"
5,"kimartham","_","_","kimartha","CX","","_","_"
6,"iha","_","_","iha","CAD","","_","_"
7,"tiṣṭhatha","_","_","tiṣṭh","V","sthā","_","_"
1,"_","_","_","iti","CQT","","_","_"
2,"_","_","_","vac","PPP","","_","_"
3,"_","_","_","tad","PRD","","_","_"
4,"tataḥ","_","_","tatas","CX","","_","_"
5,"sarve","_","_","sarva","JQ","","_","_"
6,"samantād","_","_","samantāt","CX","","_","_"
7,"avabhāṣire","_","_","avabhāṣ","V","avabhāṣ","_","_"
1,"karṇo","_","_","karṇa","NC","","_","_"
2,"'haṃ","_","_","mat","PPR","","_","_"
3,"bhīmaseno","_","_","bhīmasa","NC","","_","_"
4,"'ham","_","_","mat","PPR","","_","_"
5,"arjuno","_","_","arjuna","NC","","_","_"
6,"'ham","_","_","mat","PPR","","_","_"
7,"iti","_","_","iti","CQT","","_","_"
8,"prabho","_","_","prabhu","NC","","_","_"
1,"nakulaḥ","_","_","nakula","NC","","_","_"
2,"sahadevo","_","_","sahadeva","NC","","_","_"
3,"'haṃ","_","_","mat","PPR","","_","_"
4,"dhṛṣṭadyumno","_","_","dhṛṣṭadyumna","NC","","_","_"
5,"'ham","_","_","mat","PPR","","_","_"
6,"_","_","_","iti","CQT","","_","_"
7,"_","_","_","uta","CCD","","_","_"
1,"draupadī","_","_","draupadī","NC","","_","_"
2,"_","_","_","draupadeya","NC","","_","_"
3,"_","_","_","ca","CCD","","_","_"
4,"_","_","_","iti","CQT","","_","_"
5,"_","_","_","eva","CX","","_","_"
6,"te","_","_","tad","PRD","","_","_"
7,"vicukruśuḥ","_","_","vikroś","V","vikruś","_","_"
1,"tā","_","_","tad","PRD","","_","_"
2,"vācaḥ","_","_","vāc","NC","","_","_"
3,"sā","_","_","tad","PRD","","_","_"
4,"tadā","_","_","tadā","CAD","","_","_"
5,"śrutvā","_","_","śru","CGDA","","_","_"
6,"_","_","_","tad","PRD","","_","_"
7,"_","_","_","deśa","NC","","_","_"
8,"_","_","_","sadṛśa","JJ","","_","_"
9,"nṛpa","_","_","nṛpa","NC","","_","_"
1,"tato","_","_","tatas","CX","","_","_"
2,"vimamṛśe","_","_","vimṛś","V","vimṛś","_","_"
3,"rājā","_","_","rājan","NC","","_","_"
4,"kiṃ","_","_","kiṃ","PRQ","","_","_"
5,"_","_","_","nu","CX","","_","_"
6,"_","_","_","ida","PRD","","_","_"
7,"_","_","_","daiva","NC","","_","_"
8,"_","_","_","kāray","PPP","","_","_"
1,"kiṃ","_","_","kiṃ","PRQ","","_","_"
2,"nu","_","_","nu","CX","","_","_"
3,"tat","_","_","tad","PRD","","_","_"
4,"kaluṣaṃ","_","_","kaluṣa","NC","","_","_"
5,"karma","_","_","karman","NC","","_","_"
6,"kṛtam","_","_","kṛ","PPP","","_","_"
7,"ebhir","_","_","ida","PRD","","_","_"
8,"mahātmabhiḥ","_","_","mahātman","JJ","","_","_"
1,"karṇena","_","_","karṇa","NC","","_","_"
2,"draupadeyair","_","_","draupadeya","NC","","_","_"
3,"vā","_","_","vā","CCD","","_","_"
4,"pāñcālyā","_","_","pāñcālī","NC","","_","_"
5,"vā","_","_","vā","CCD","","_","_"
6,"_","_","_","su","CAD","","_","_"
7,"_","_","_","madhya","NC","","_","_"
1,"ya","_","_","yad","PRL","","_","_"
2,"ime","_","_","ida","PRD","","_","_"
3,"_","_","_","pāpa","JJ","","_","_"
4,"_","_","_","gandha","NC","","_","_"
5,"'smin","_","_","ida","PRD","","_","_"
6,"deśe","_","_","deśa","NC","","_","_"
7,"santi","_","_","as","V","as","_","_"
8,"_","_","_","su","CAD","","_","_"
9,"_","_","_","dāruṇa","JJ","","_","_"
1,"na","_","_","na","CNG","","_","_"
2,"hi","_","_","hi","CX","","_","_"
3,"jānāmi","_","_","jān","V","jñā","_","_"
4,"sarveṣāṃ","_","_","sarva","JQ","","_","_"
5,"duṣkṛtaṃ","_","_","duṣkṛta","NC","","_","_"
6,"_","_","_","puṇya","JJ","","_","_"
7,"_","_","_","karman","NC","","_","_"
1,"kiṃ","_","_","kiṃ","PRQ","","_","_"
2,"kṛtvā","_","_","kṛ","CGDA","","_","_"
3,"dhṛtarāṣṭrasya","_","_","dhṛtarāṣṭra","NC","","_","_"
4,"putro","_","_","putra","NC","","_","_"
5,"rājā","_","_","rājan","NC","","_","_"
6,"suyodhanaḥ","_","_","suyodhana","NC","","_","_"
1,"tathā","_","_","tathā","CX","","_","_"
2,"śriyā","_","_","śrī","NC","","_","_"
3,"yutaḥ","_","_","yuta","JJ","","_","_"
4,"pāpaḥ","_","_","pāpa","JJ","","_","_"
5,"saha","_","_","saha","CX","","_","_"
6,"sarvaiḥ","_","_","sarva","JQ","","_","_"
7,"padānugaiḥ","_","_","padānuga","JJ","","_","_"
1,"_","_","_","mahat","JJ","","_","_"
2,"_","_","_","indra","NC","","_","_"
3,"iva","_","_","iva","CCM","","_","_"
4,"lakṣmīvān","_","_","lakṣmīvat","JJ","","_","_"
5,"āste","_","_","ās","V","ās","_","_"
6,"_","_","_","parama","JJ","","_","_"
7,"_","_","_","pūjay","PPP","","_","_"
1,"_","_","_","kiṃ","PRQ","","_","_"
2,"_","_","_","idānīm","CX","","_","_"
3,"vikāro","_","_","vikāra","NC","","_","_"
4,"'yaṃ","_","_","ida","PRD","","_","_"
5,"yad","_","_","yat","CSB","","_","_"
6,"ime","_","_","ida","PRD","","_","_"
7,"narakaṃ","_","_","naraka","NC","","_","_"
8,"gatāḥ","_","_","ga","PPP","","_","_"
1,"_","_","_","sarva","JQ","","_","_"
2,"_","_","_","dharma","NC","","_","_"
3,"_","_","_","vid","JJ","","_","_"
4,"śūrāḥ","_","_","śūra","NC","","_","_"
5,"_","_","_","satya","NC","","_","_"
6,"_","_","_","āgama","NC","","_","_"
7,"_","_","_","parāyaṇa","NC","","_","_"
1,"_","_","_","kṣātra","JJ","","_","_"
2,"_","_","_","dharma","NC","","_","_"
3,"_","_","_","para","PPX","","_","_"
4,"prājñā","_","_","prājña","JJ","","_","_"
5,"yajvāno","_","_","yajvan","NC","","_","_"
6,"_","_","_","bhūri","JQ","","_","_"
7,"_","_","_","dakṣiṇā","NC","","_","_"
1,"kiṃ","_","_","kim","CX","","_","_"
2,"nu","_","_","nu","CX","","_","_"
3,"supto","_","_","svap","PPP","","_","_"
4,"'smi","_","_","as","V","as","_","_"
5,"jāgarmi","_","_","jāgṛ","V","jāgṛ","_","_"
6,"cetayāno","_","_","cetay","KDP","","_","_"
7,"na","_","_","na","CNG","","_","_"
8,"cetaye","_","_","cetay","V","cetay","_","_"
1,"aho","_","_","aho","CX","","_","_"
2,"_","_","_","citta","NC","","_","_"
3,"_","_","_","vikāra","NC","","_","_"
4,"'yaṃ","_","_","ida","PRD","","_","_"
5,"syād","_","_","as","V","as","_","_"
6,"vā","_","_","vā","CCD","","_","_"
7,"me","_","_","mat","PPR","","_","_"
8,"_","_","_","citta","NC","","_","_"
9,"_","_","_","vibhrama","NC","","_","_"
1,"evaṃ","_","_","eva","CX","","_","_"
2,"bahuvidhaṃ","_","_","bahuvidha","JJ","","_","_"
3,"rājā","_","_","rājan","NC","","_","_"
4,"vimamarśa","_","_","vimṛś","V","vimṛś","_","_"
5,"yudhiṣṭhiraḥ","_","_","yudhiṣṭhira","NC","","_","_"
1,"_","_","_","duḥkha","NC","","_","_"
2,"_","_","_","śoka","NC","","_","_"
3,"_","_","_","samāviś","PPP","","_","_"
4,"_","_","_","cintā","NC","","_","_"
5,"_","_","_","vyākulita","JJ","","_","_"
6,"_","_","_","indriya","NC","","_","_"
1,"krodham","_","_","krodha","NC","","_","_"
2,"_","_","_","āhāray","V","āhāray","_","_"
3,"_","_","_","ca","CCD","","_","_"
4,"_","_","_","eva","CEM","","_","_"
5,"tīvraṃ","_","_","tīvra","JJ","","_","_"
6,"dharmasuto","_","_","dharmasuta","NC","","_","_"
7,"nṛpaḥ","_","_","nṛpa","NC","","_","_"
1,"_","_","_","deva","NC","","_","_"
2,"_","_","_","ca","CCD","","_","_"
3,"garhayāmāsa","_","_","garhay","V","garhay","_","_"
4,"dharmaṃ","_","_","dharma","NC","","_","_"
5,"_","_","_","ca","CCD","","_","_"
6,"_","_","_","eva","CEM","","_","_"
7,"yudhiṣṭhiraḥ","_","_","yudhiṣṭhira","NC","","_","_"
1,"sa","_","_","tad","PRD","","_","_"
2,"_","_","_","tīvra","JJ","","_","_"
3,"_","_","_","gandha","NC","","_","_"
4,"_","_","_","saṃtap","PPP","","_","_"
5,"_","_","_","deva","NC","","_","_"
6,"_","_","_","dūta","NC","","_","_"
7,"uvāca","_","_","vak","V","vac","_","_"
8,"ha","_","_","ha","CEM","","_","_"
1,"gamyatāṃ","_","_","ga","V","ga","_","_"
2,"bhadra","_","_","bhadra","JJ","","_","_"
3,"yeṣāṃ","_","_","yad","PRL","","_","_"
4,"tvaṃ","_","_","tvat","PPR","","_","_"
5,"_","_","_","dūta","NC","","_","_"
6,"_","_","_","tad","PRD","","_","_"
7,"upāntikam","_","_","upāntika","NC","","_","_"
1,"na","_","_","na","CNG","","_","_"
2,"_","_","_","hi","CX","","_","_"
3,"_","_","_","mat","PPR","","_","_"
4,"tatra","_","_","tatra","CAD","","_","_"
5,"yāsyāmi","_","_","yā","V","yā","_","_"
6,"sthito","_","_","sthā","PPP","","_","_"
7,"_","_","_","as","V","as","_","_"
8,"_","_","_","iti","CQT","","_","_"
9,"nivedyatām","_","_","niveday","V","niveday","_","_"
1,"_","_","_","mat","PPR","","_","_"
2,"_","_","_","saṃśraya","NC","","_","_"
3,"ime","_","_","ida","PRD","","_","_"
4,"dūta","_","_","dūta","NC","","_","_"
5,"sukhino","_","_","sukhin","JJ","","_","_"
6,"bhrātaro","_","_","bhrātṛ","NC","","_","_"
7,"hi","_","_","hi","CX","","_","_"
8,"me","_","_","mat","PPR","","_","_"
1,"_","_","_","iti","CQT","","_","_"
2,"_","_","_","vac","PPP","","_","_"
3,"sa","_","_","tad","PRD","","_","_"
4,"tadā","_","_","tadā","CAD","","_","_"
5,"dūtaḥ","_","_","dūta","NC","","_","_"
6,"_","_","_","pāṇḍu","NC","","_","_"
7,"_","_","_","putra","NC","","_","_"
8,"dhīmatā","_","_","dhīmat","JJ","","_","_"
1,"jagāma","_","_","ga","V","ga","_","_"
2,"tatra","_","_","tatra","CAD","","_","_"
3,"_","_","_","yatra","CX","","_","_"
4,"_","_","_","ās","V","ās","_","_"
5,"_","_","_","deva","NC","","_","_"
6,"_","_","_","rāja","NC","","_","_"
7,"śatakratuḥ","_","_","śatakratu","NC","","_","_"
1,"nivedayāmāsa","_","_","niveday","V","niveday","_","_"
2,"ca","_","_","ca","CCD","","_","_"
3,"tad","_","_","tad","PRD","","_","_"
4,"_","_","_","dharmarāja","NC","","_","_"
5,"_","_","_","cikīrṣita","NC","","_","_"
1,"yathoktaṃ","_","_","yathokta","CX","","_","_"
2,"dharmaputreṇa","_","_","dharmaputra","NC","","_","_"
3,"sarvam","_","_","sarva","JQ","","_","_"
4,"eva","_","_","eva","CEM","","_","_"
5,"janādhipa","_","_","janādhipa","NC","","_","_"
