"WordID","word","NormSTEM","suffix","lemma","PoS","Root","NormSuffix","NormWord"
1,"stotriyaṃ","_","_","stotriya","NC","","_","_"
2,"śaṃsaty","_","_","śaṃs","V","śaṃs","_","_"
3,"ātmā","_","_","ātman","NC","","_","_"
4,"vai","_","_","vai","CX","","_","_"
5,"stotriyaḥ","_","_","stotriya","NC","","_","_"
1,"tam","_","_","tad","PRD","","_","_"
2,"madhyamayā","_","_","madhyama","JJ","","_","_"
3,"vācā","_","_","vāc","NC","","_","_"
4,"śaṃsaty","_","_","śaṃs","V","śaṃs","_","_"
5,"ātmānam","_","_","ātman","NC","","_","_"
6,"eva","_","_","eva","CEM","","_","_"
7,"tat","_","_","tad","PRD","","_","_"
8,"saṃskurute","_","_","saṃskar","V","saṃskṛ","_","_"
1,"anurūpaṃ","_","_","anurūpa","NC","","_","_"
2,"śaṃsati","_","_","śaṃs","V","śaṃs","_","_"
3,"prajā","_","_","prajā","NC","","_","_"
4,"vā","_","_","vai","CX","","_","_"
5,"anurūpaḥ","_","_","anurūpa","NC","","_","_"
1,"sa","_","_","tad","PRD","","_","_"
2,"uccaistarām","_","_","uccaistarām","CX","","_","_"
3,"_","_","_","iva","CCM","","_","_"
4,"_","_","_","anurūpa","NC","","_","_"
5,"śaṃstavyaḥ","_","_","śaṃs","KDG","","_","_"
6,"prajām","_","_","prajā","NC","","_","_"
7,"eva","_","_","eva","CEM","","_","_"
8,"_","_","_","tad","PRD","","_","_"
9,"_","_","_","śreyas","JJ","","_","_"
10,"ātmanaḥ","_","_","ātman","NC","","_","_"
11,"kurute","_","_","kar","V","kṛ","_","_"
1,"dhāyyāṃ","_","_","dhāyyā","NC","","_","_"
2,"śaṃsati","_","_","śaṃs","V","śaṃs","_","_"
3,"patnī","_","_","patnī","NC","","_","_"
4,"vai","_","_","vai","CX","","_","_"
5,"dhāyyā","_","_","dhāyyā","NC","","_","_"
1,"sā","_","_","tad","PRD","","_","_"
2,"nīcaistarām","_","_","nīcaistarām","CX","","_","_"
3,"iva","_","_","iva","CCM","","_","_"
4,"dhāyyā","_","_","dhāyyā","NC","","_","_"
5,"śaṃstavyā","_","_","śaṃs","KDG","","_","_"
1,"prativādinī","_","_","prativādin","JJ","","_","_"
2,"_","_","_","ha","CEM","","_","_"
3,"_","_","_","ida","PRD","","_","_"
4,"gṛheṣu","_","_","gṛha","NC","","_","_"
5,"patnī","_","_","patnī","NC","","_","_"
6,"bhavati","_","_","bhav","V","bhū","_","_"
7,"_","_","_","yatra","CX","","_","_"
8,"_","_","_","eva","CX","","_","_"
9,"vidvān","_","_","vid","KDP","","_","_"
10,"nīcaistarāṃ","_","_","nīcaistarām","CX","","_","_"
11,"dhāyyāṃ","_","_","dhāyyā","NC","","_","_"
12,"śaṃsati","_","_","śaṃs","V","śaṃs","_","_"
1,"pragāthaṃ","_","_","pragātha","NC","","_","_"
2,"śaṃsati","_","_","śaṃs","V","śaṃs","_","_"
1,"sa","_","_","tad","PRD","","_","_"
2,"svaravatyā","_","_","svaravat","JJ","","_","_"
3,"vācā","_","_","vāc","NC","","_","_"
4,"śaṃstavyaḥ","_","_","śaṃs","KDG","","_","_"
5,"paśavo","_","_","paśu","NC","","_","_"
6,"vai","_","_","vai","CX","","_","_"
7,"svaraḥ","_","_","svara","NC","","_","_"
8,"paśavaḥ","_","_","paśu","NC","","_","_"
9,"pragāthaḥ","_","_","pragātha","NC","","_","_"
10,"paśūnām","_","_","paśu","NC","","_","_"
11,"avaruddhyai","_","_","avaruddhi","NC","","_","_"
1,"indrasya","_","_","indra","NC","","_","_"
2,"nu","_","_","nu","CX","","_","_"
3,"vīryāṇi","_","_","vīrya","NC","","_","_"
4,"pra","_","_","pra","CADP","","_","_"
5,"vocam","_","_","vak","V","vac","_","_"
6,"iti","_","_","iti","CQT","","_","_"
7,"sūktaṃ","_","_","sūkta","NC","","_","_"
8,"śaṃsati","_","_","śaṃs","V","śaṃs","_","_"
1,"tad","_","_","tad","PRD","","_","_"
2,"vā","_","_","vai","CX","","_","_"
3,"etat","_","_","tad","PRD","","_","_"
4,"priyam","_","_","priya","JJ","","_","_"
5,"indrasya","_","_","indra","NC","","_","_"
6,"sūktaṃ","_","_","sūkta","NC","","_","_"
7,"niṣkevalyaṃ","_","_","niṣkevalya","JJ","","_","_"
8,"hairaṇyastūpam","_","_","hairaṇyastūpa","JJ","","_","_"
9,"etena","_","_","tad","PRD","","_","_"
10,"vai","_","_","vai","CX","","_","_"
11,"sūktena","_","_","sūkta","NC","","_","_"
12,"hiraṇyastūpa","_","_","hiraṇyastūpa","NC","","_","_"
13,"āṅgirasa","_","_","āṅgirasa","NC","","_","_"
14,"indrasya","_","_","indra","NC","","_","_"
15,"priyaṃ","_","_","priya","JJ","","_","_"
16,"_","_","_","dhāman","NC","","_","_"
17,"_","_","_","upaga","V","upaga","_","_"
18,"sa","_","_","tad","PRD","","_","_"
19,"paramaṃ","_","_","parama","JJ","","_","_"
20,"lokam","_","_","loka","NC","","_","_"
21,"ajayat","_","_","jay","V","ji","_","_"
1,"_","_","_","upa","CADP","","_","_"
2,"_","_","_","indra","NC","","_","_"
3,"priyaṃ","_","_","priya","JJ","","_","_"
4,"dhāma","_","_","dhāman","NC","","_","_"
5,"gacchati","_","_","gacch","V","gam","_","_"
6,"jayati","_","_","jay","V","ji","_","_"
7,"paramaṃ","_","_","parama","JJ","","_","_"
8,"lokaṃ","_","_","loka","NC","","_","_"
9,"ya","_","_","yad","PRL","","_","_"
10,"evaṃ","_","_","eva","CX","","_","_"
11,"veda","_","_","vid","V","vid","_","_"
1,"gṛhā","_","_","gṛha","NC","","_","_"
2,"vai","_","_","vai","CX","","_","_"
3,"pratiṣṭhā","_","_","pratiṣṭhā","NC","","_","_"
4,"sūktaṃ","_","_","sūkta","NC","","_","_"
5,"tat","_","_","tad","PRD","","_","_"
6,"pratiṣṭhitatamayā","_","_","pratiṣṭhitatama","JJ","","_","_"
7,"vācā","_","_","vāc","NC","","_","_"
8,"śaṃstavyaṃ","_","_","śaṃs","KDG","","_","_"
9,"tasmād","_","_","tasmāt","CX","","_","_"
10,"yady","_","_","yadi","CSB","","_","_"
11,"api","_","_","api","CX","","_","_"
12,"dūra","_","_","dūra","NC","","_","_"
13,"iva","_","_","iva","CCM","","_","_"
14,"_","_","_","paśu","NC","","_","_"
15,"_","_","_","labh","V","labh","_","_"
16,"gṛhān","_","_","gṛha","NC","","_","_"
17,"_","_","_","eva","CEM","","_","_"
18,"_","_","_","a","PRD","","_","_"
19,"ājigamiṣati","_","_","ājigamiṣ","V","ājigamiṣ","_","_"
20,"gṛhā","_","_","gṛha","NC","","_","_"
21,"hi","_","_","hi","CX","","_","_"
22,"paśūnām","_","_","paśu","NC","","_","_"
23,"pratiṣṭhā","_","_","pratiṣṭhā","NC","","_","_"
24,"pratiṣṭhā","_","_","pratiṣṭhā","NC","","_","_"
