"WordID","word","NormSTEM","suffix","lemma","PoS","Root","NormSuffix","NormWord"
1,"ṛtasya","_","_","ṛta","NC","","_","_"
2,"gopāv","_","_","gopā","NC","","_","_"
3,"adhi","_","_","adhi","CADP","","_","_"
4,"tiṣṭhatho","_","_","tiṣṭh","V","sthā","_","_"
5,"rathaṃ","_","_","ratha","NC","","_","_"
6,"_","_","_","satya","JJ","","_","_"
7,"_","_","_","dharman","NC","","_","_"
8,"parame","_","_","parama","JJ","","_","_"
9,"vyomani","_","_","vyoman","NC","","_","_"
1,"yam","_","_","yad","PRL","","_","_"
2,"atra","_","_","atra","CAD","","_","_"
3,"_","_","_","mitrāvaruṇa","NC","","_","_"
4,"_","_","_","av","V","av","_","_"
5,"yuvaṃ","_","_","tvat","PPR","","_","_"
6,"tasmai","_","_","tad","PRD","","_","_"
7,"vṛṣṭir","_","_","vṛṣṭi","NC","","_","_"
8,"madhumat","_","_","madhumat","JJ","","_","_"
9,"pinvate","_","_","pinv","V","pinv","_","_"
10,"divaḥ","_","_","div","NC","","_","_"
1,"samrājāv","_","_","samrāj","NC","","_","_"
2,"asya","_","_","ida","PRD","","_","_"
3,"bhuvanasya","_","_","bhuvana","NC","","_","_"
4,"rājatho","_","_","rāj","V","rāj","_","_"
5,"mitrāvaruṇā","_","_","mitrāvaruṇa","NC","","_","_"
6,"vidathe","_","_","vidatha","NC","","_","_"
7,"_","_","_","svar","CX","","_","_"
8,"_","_","_","dṛś","NC","","_","_"
1,"vṛṣṭiṃ","_","_","vṛṣṭi","NC","","_","_"
2,"vāṃ","_","_","tvat","PPR","","_","_"
3,"rādho","_","_","rādhas","NC","","_","_"
4,"_","_","_","amṛta","JJ","","_","_"
6,"īmahe","_","_","ī","V","ī","_","_"
7,"dyāvāpṛthivī","_","_","dyāvāpṛthivī","NC","","_","_"
8,"vi","_","_","vi","CADP","","_","_"
9,"caranti","_","_","car","V","car","_","_"
10,"tanyavaḥ","_","_","tanyu","JJ","","_","_"
1,"samrājā","_","_","samrāj","NC","","_","_"
2,"ugrā","_","_","ugra","JJ","","_","_"
3,"vṛṣabhā","_","_","vṛṣabha","NC","","_","_"
4,"divas","_","_","div","NC","","_","_"
5,"patī","_","_","pati","NC","","_","_"
6,"pṛthivyā","_","_","pṛthivī","NC","","_","_"
7,"mitrāvaruṇā","_","_","mitrāvaruṇa","NC","","_","_"
8,"vicarṣaṇī","_","_","vicarṣaṇi","JJ","","_","_"
1,"citrebhir","_","_","citra","JJ","","_","_"
2,"abhrair","_","_","abhra","NC","","_","_"
3,"upa","_","_","upa","CADP","","_","_"
4,"tiṣṭhatho","_","_","tiṣṭh","V","sthā","_","_"
5,"ravaṃ","_","_","rava","NC","","_","_"
6,"dyāṃ","_","_","div","NC","","_","_"
7,"varṣayatho","_","_","varṣay","V","varṣay","_","_"
8,"asurasya","_","_","asura","NC","","_","_"
9,"māyayā","_","_","māyā","NC","","_","_"
1,"māyā","_","_","māyā","NC","","_","_"
2,"vām","_","_","tvat","PPR","","_","_"
3,"mitrāvaruṇā","_","_","mitrāvaruṇa","NC","","_","_"
4,"divi","_","_","div","NC","","_","_"
5,"śritā","_","_","śri","PPP","","_","_"
6,"sūryo","_","_","sūrya","NC","","_","_"
7,"jyotiś","_","_","jyotis","NC","","_","_"
8,"carati","_","_","car","V","car","_","_"
9,"citram","_","_","citra","JJ","","_","_"
10,"āyudham","_","_","āyudha","NC","","_","_"
1,"tam","_","_","tad","PRD","","_","_"
2,"abhreṇa","_","_","abhra","NC","","_","_"
3,"vṛṣṭyā","_","_","vṛṣṭi","NC","","_","_"
4,"gūhatho","_","_","guh","V","guh","_","_"
5,"divi","_","_","div","NC","","_","_"
6,"parjanya","_","_","parjanya","NC","","_","_"
7,"drapsā","_","_","drapsa","NC","","_","_"
8,"madhumanta","_","_","madhumat","JJ","","_","_"
9,"īrate","_","_","īr","V","īr","_","_"
1,"rathaṃ","_","_","ratha","NC","","_","_"
2,"yuñjate","_","_","yuj","V","yuj","_","_"
3,"marutaḥ","_","_","marut","NC","","_","_"
4,"śubhe","_","_","śubh","CGDI","","_","_"
5,"sukhaṃ","_","_","sukha","JJ","","_","_"
6,"śūro","_","_","śūra","NC","","_","_"
7,"na","_","_","na","CNG","","_","_"
8,"mitrāvaruṇā","_","_","mitrāvaruṇa","NC","","_","_"
9,"gaviṣṭiṣu","_","_","gaviṣṭi","NC","","_","_"
1,"rajāṃsi","_","_","rajas","NC","","_","_"
2,"citrā","_","_","citra","JJ","","_","_"
3,"vi","_","_","vi","CADP","","_","_"
4,"caranti","_","_","car","V","car","_","_"
5,"tanyavo","_","_","tanyu","JJ","","_","_"
6,"divaḥ","_","_","div","NC","","_","_"
7,"samrājā","_","_","samrāj","NC","","_","_"
8,"payasā","_","_","payas","NC","","_","_"
9,"na","_","_","mat","PPR","","_","_"
10,"ukṣatam","_","_","ukṣ","V","ukṣ","_","_"
1,"vācaṃ","_","_","vāc","NC","","_","_"
2,"su","_","_","su","CAD","","_","_"
3,"mitrāvaruṇāv","_","_","mitrāvaruṇa","NC","","_","_"
4,"irāvatīm","_","_","irāvat","JJ","","_","_"
5,"parjanyaś","_","_","parjanya","NC","","_","_"
6,"citrāṃ","_","_","citra","JJ","","_","_"
7,"vadati","_","_","vad","V","vad","_","_"
8,"tviṣīmatīm","_","_","tviṣīmat","JJ","","_","_"
1,"abhrā","_","_","abhra","NC","","_","_"
2,"vasata","_","_","vas","V","vas","_","_"
3,"marutaḥ","_","_","marut","NC","","_","_"
4,"su","_","_","su","CAD","","_","_"
5,"māyayā","_","_","māyā","NC","","_","_"
6,"dyāṃ","_","_","div","NC","","_","_"
7,"varṣayatam","_","_","varṣay","V","varṣay","_","_"
8,"aruṇām","_","_","aruṇa","JJ","","_","_"
9,"arepasam","_","_","arepas","JJ","","_","_"
1,"dharmaṇā","_","_","dharman","NC","","_","_"
2,"mitrāvaruṇā","_","_","mitrāvaruṇa","NC","","_","_"
3,"vipaścitā","_","_","vipaścit","JJ","","_","_"
4,"vratā","_","_","vrata","NC","","_","_"
5,"rakṣethe","_","_","rakṣ","V","rakṣ","_","_"
6,"asurasya","_","_","asura","NC","","_","_"
7,"māyayā","_","_","māyā","NC","","_","_"
1,"ṛtena","_","_","ṛta","NC","","_","_"
2,"viśvam","_","_","viśva","JQ","","_","_"
3,"bhuvanaṃ","_","_","bhuvana","NC","","_","_"
4,"vi","_","_","vi","CADP","","_","_"
5,"rājathaḥ","_","_","rāj","V","rāj","_","_"
6,"sūryam","_","_","sūrya","NC","","_","_"
7,"ā","_","_","ā","CADP","","_","_"
8,"dhattho","_","_","dadh","V","dhā","_","_"
9,"divi","_","_","div","NC","","_","_"
10,"citryaṃ","_","_","citrya","JJ","","_","_"
11,"ratham","_","_","ratha","NC","","_","_"
