"WordID","word","NormSTEM","suffix","lemma","PoS","Root","NormSuffix","NormWord"
1,"atha","_","_","atha","CAD","","_","_"
2,"_","_","_","ha","CEM","","_","_"
3,"_","_","_","aikṣvāka","NC","","_","_"
4,"varuṇo","_","_","varuṇa","NC","","_","_"
5,"jagrāha","_","_","grah","V","grah","_","_"
6,"tasya","_","_","tad","PRD","","_","_"
7,"_","_","_","ha","CEM","","_","_"
8,"_","_","_","udara","NC","","_","_"
9,"jajñe","_","_","jan","V","jan","_","_"
10,"tad","_","_","tad","PRD","","_","_"
11,"u","_","_","u","CEM","","_","_"
12,"ha","_","_","ha","CEM","","_","_"
13,"rohitaḥ","_","_","rohita","NC","","_","_"
14,"śuśrāva","_","_","śṛṇ","V","śru","_","_"
15,"so","_","_","tad","PRD","","_","_"
16,"'raṇyād","_","_","araṇya","NC","","_","_"
17,"grāmam","_","_","grāma","NC","","_","_"
18,"eyāya","_","_","e","V","e","_","_"
19,"tam","_","_","tad","PRD","","_","_"
20,"indraḥ","_","_","indra","NC","","_","_"
21,"_","_","_","puruṣa","NC","","_","_"
22,"_","_","_","rūpa","NC","","_","_"
23,"_","_","_","parye","CGDA","","_","_"
24,"_","_","_","vak","V","vac","_","_"
25,"nānā","_","_","nānā","CX","","_","_"
26,"śrāntāya","_","_","śra","PPP","","_","_"
27,"śrīr","_","_","śrī","NC","","_","_"
28,"_","_","_","as","V","as","_","_"
29,"_","_","_","iti","CQT","","_","_"
30,"rohita","_","_","rohita","NC","","_","_"
31,"śuśruma","_","_","śṛṇ","V","śru","_","_"
32,"pāpo","_","_","pāpa","JJ","","_","_"
33,"nṛṣadvaro","_","_","nṛṣadvara","JJ","","_","_"
34,"jana","_","_","jana","NC","","_","_"
35,"indra","_","_","indra","NC","","_","_"
36,"_","_","_","id","CEM","","_","_"
37,"_","_","_","car","KDP","","_","_"
38,"sakhā","_","_","sakhi","NC","","_","_"
39,"_","_","_","car","V","car","_","_"
40,"_","_","_","eva","CEM","","_","_"
41,"_","_","_","iti","CQT","","_","_"
1,"_","_","_","car","V","car","_","_"
2,"_","_","_","eva","CEM","","_","_"
3,"_","_","_","iti","CQT","","_","_"
4,"vai","_","_","vai","CX","","_","_"
5,"mā","_","_","mat","PPR","","_","_"
6,"brāhmaṇo","_","_","brāhmaṇa","NC","","_","_"
7,"'vocad","_","_","vak","V","vac","_","_"
8,"iti","_","_","iti","CQT","","_","_"
9,"ha","_","_","ha","CEM","","_","_"
10,"dvitīyaṃ","_","_","dvitīya","JJ","","_","_"
11,"saṃvatsaram","_","_","saṃvatsara","NC","","_","_"
12,"araṇye","_","_","araṇya","NC","","_","_"
13,"cacāra","_","_","car","V","car","_","_"
14,"so","_","_","tad","PRD","","_","_"
15,"'raṇyād","_","_","araṇya","NC","","_","_"
16,"grāmam","_","_","grāma","NC","","_","_"
17,"eyāya","_","_","e","V","e","_","_"
18,"tam","_","_","tad","PRD","","_","_"
19,"indraḥ","_","_","indra","NC","","_","_"
20,"_","_","_","puruṣa","NC","","_","_"
21,"_","_","_","rūpa","NC","","_","_"
22,"_","_","_","parye","CGDA","","_","_"
23,"_","_","_","vak","V","vac","_","_"
24,"puṣpiṇyau","_","_","puṣpin","JJ","","_","_"
25,"carato","_","_","car","KDP","","_","_"
26,"jaṅghe","_","_","jaṅghā","NC","","_","_"
27,"bhūṣṇur","_","_","bhūṣṇu","JJ","","_","_"
28,"ātmā","_","_","ātman","NC","","_","_"
29,"phalagrahiḥ","_","_","phalagrahi","JJ","","_","_"
30,"śere","_","_","śī","V","śī","_","_"
31,"'sya","_","_","ida","PRD","","_","_"
32,"sarve","_","_","sarva","JQ","","_","_"
33,"pāpmānaḥ","_","_","pāpman","NC","","_","_"
34,"śrameṇa","_","_","śrama","NC","","_","_"
35,"prapathe","_","_","prapatha","NC","","_","_"
36,"hatāś","_","_","han","PPP","","_","_"
37,"_","_","_","car","V","car","_","_"
38,"_","_","_","eva","CEM","","_","_"
39,"_","_","_","iti","CQT","","_","_"
1,"_","_","_","car","V","car","_","_"
2,"_","_","_","eva","CEM","","_","_"
3,"_","_","_","iti","CQT","","_","_"
4,"vai","_","_","vai","CX","","_","_"
5,"mā","_","_","mat","PPR","","_","_"
6,"brāhmaṇo","_","_","brāhmaṇa","NC","","_","_"
7,"'vocad","_","_","vak","V","vac","_","_"
8,"iti","_","_","iti","CQT","","_","_"
9,"ha","_","_","ha","CEM","","_","_"
10,"tṛtīyaṃ","_","_","tṛtīya","JJ","","_","_"
11,"saṃvatsaram","_","_","saṃvatsara","NC","","_","_"
12,"araṇye","_","_","araṇya","NC","","_","_"
13,"cacāra","_","_","car","V","car","_","_"
14,"so","_","_","tad","PRD","","_","_"
15,"'raṇyād","_","_","araṇya","NC","","_","_"
16,"grāmam","_","_","grāma","NC","","_","_"
17,"eyāya","_","_","e","V","e","_","_"
18,"tam","_","_","tad","PRD","","_","_"
19,"indraḥ","_","_","indra","NC","","_","_"
20,"_","_","_","puruṣa","NC","","_","_"
21,"_","_","_","rūpa","NC","","_","_"
22,"_","_","_","parye","CGDA","","_","_"
23,"_","_","_","vak","V","vac","_","_"
24,"āste","_","_","ās","V","ās","_","_"
25,"bhaga","_","_","bhaga","NC","","_","_"
26,"_","_","_","ās","PPP","","_","_"
27,"_","_","_","ūrdhva","JJ","","_","_"
28,"tiṣṭhati","_","_","tiṣṭh","V","sthā","_","_"
29,"tiṣṭhataḥ","_","_","sthā","KDP","","_","_"
30,"śete","_","_","śī","V","śī","_","_"
31,"nipadyamānasya","_","_","nipad","KDP","","_","_"
32,"carāti","_","_","car","V","car","_","_"
33,"carato","_","_","car","KDP","","_","_"
34,"bhagaś","_","_","bhaga","NC","","_","_"
35,"_","_","_","car","V","car","_","_"
36,"_","_","_","eva","CEM","","_","_"
37,"_","_","_","iti","CQT","","_","_"
1,"_","_","_","car","V","car","_","_"
2,"_","_","_","eva","CEM","","_","_"
3,"_","_","_","iti","CQT","","_","_"
4,"vai","_","_","vai","CX","","_","_"
5,"mā","_","_","mat","PPR","","_","_"
6,"brāhmaṇo","_","_","brāhmaṇa","NC","","_","_"
7,"'vocad","_","_","vak","V","vac","_","_"
8,"iti","_","_","iti","CQT","","_","_"
9,"ha","_","_","ha","CEM","","_","_"
10,"caturthaṃ","_","_","caturtha","JJ","","_","_"
11,"saṃvatsaram","_","_","saṃvatsara","NC","","_","_"
12,"araṇye","_","_","araṇya","NC","","_","_"
13,"cacāra","_","_","car","V","car","_","_"
14,"so","_","_","tad","PRD","","_","_"
15,"'raṇyād","_","_","araṇya","NC","","_","_"
16,"grāmam","_","_","grāma","NC","","_","_"
17,"eyāya","_","_","e","V","e","_","_"
18,"tam","_","_","tad","PRD","","_","_"
19,"indraḥ","_","_","indra","NC","","_","_"
20,"_","_","_","puruṣa","NC","","_","_"
21,"_","_","_","rūpa","NC","","_","_"
22,"_","_","_","parye","CGDA","","_","_"
23,"_","_","_","vak","V","vac","_","_"
24,"kaliḥ","_","_","kali","NC","","_","_"
25,"śayāno","_","_","śī","KDP","","_","_"
26,"bhavati","_","_","bhav","V","bhū","_","_"
27,"saṃjihānas","_","_","saṃhā","KDP","","_","_"
28,"tu","_","_","tu","CCD","","_","_"
29,"dvāparaḥ","_","_","dvāpara","NC","","_","_"
30,"uttiṣṭhaṃs","_","_","utthā","KDP","","_","_"
31,"tretā","_","_","tretā","NC","","_","_"
32,"bhavati","_","_","bhav","V","bhū","_","_"
33,"kṛtaṃ","_","_","kṛta","NC","","_","_"
34,"sampadyate","_","_","saṃpad","V","saṃpad","_","_"
35,"caraṃś","_","_","car","KDP","","_","_"
36,"_","_","_","car","V","car","_","_"
37,"_","_","_","eva","CEM","","_","_"
38,"_","_","_","iti","CQT","","_","_"
1,"_","_","_","car","V","car","_","_"
2,"_","_","_","eva","CEM","","_","_"
3,"_","_","_","iti","CQT","","_","_"
4,"vai","_","_","vai","CX","","_","_"
5,"mā","_","_","mat","PPR","","_","_"
6,"brāhmaṇo","_","_","brāhmaṇa","NC","","_","_"
7,"'vocad","_","_","vak","V","vac","_","_"
8,"iti","_","_","iti","CQT","","_","_"
9,"ha","_","_","ha","CEM","","_","_"
10,"pañcamaṃ","_","_","pañcama","JJ","","_","_"
11,"saṃvatsaram","_","_","saṃvatsara","NC","","_","_"
12,"araṇye","_","_","araṇya","NC","","_","_"
13,"cacāra","_","_","car","V","car","_","_"
14,"so","_","_","tad","PRD","","_","_"
15,"'raṇyād","_","_","araṇya","NC","","_","_"
16,"grāmam","_","_","grāma","NC","","_","_"
17,"eyāya","_","_","e","V","e","_","_"
18,"tam","_","_","tad","PRD","","_","_"
19,"indraḥ","_","_","indra","NC","","_","_"
20,"_","_","_","puruṣa","NC","","_","_"
21,"_","_","_","rūpa","NC","","_","_"
22,"_","_","_","parye","CGDA","","_","_"
23,"_","_","_","vak","V","vac","_","_"
24,"caran","_","_","car","KDP","","_","_"
25,"vai","_","_","vai","CX","","_","_"
26,"madhu","_","_","madhu","NC","","_","_"
27,"vindati","_","_","vid","V","vid","_","_"
28,"caran","_","_","car","KDP","","_","_"
29,"svādum","_","_","svādu","JJ","","_","_"
30,"udumbaram","_","_","udumbara","NC","","_","_"
31,"sūryasya","_","_","sūrya","NC","","_","_"
32,"paśya","_","_","paś","V","paś","_","_"
33,"śremāṇaṃ","_","_","śreman","NC","","_","_"
34,"yo","_","_","yad","PRL","","_","_"
35,"na","_","_","na","CNG","","_","_"
36,"tandrayate","_","_","tandray","V","tandray","_","_"
37,"caraṃś","_","_","car","KDP","","_","_"
38,"_","_","_","car","V","car","_","_"
39,"_","_","_","eva","CEM","","_","_"
40,"_","_","_","iti","CQT","","_","_"
1,"_","_","_","car","V","car","_","_"
2,"_","_","_","eva","CEM","","_","_"
3,"_","_","_","iti","CQT","","_","_"
4,"vai","_","_","vai","CX","","_","_"
5,"mā","_","_","mat","PPR","","_","_"
6,"brāhmaṇo","_","_","brāhmaṇa","NC","","_","_"
7,"'vocad","_","_","vak","V","vac","_","_"
8,"iti","_","_","iti","CQT","","_","_"
9,"ha","_","_","ha","CEM","","_","_"
10,"ṣaṣṭhaṃ","_","_","ṣaṣṭha","JJ","","_","_"
11,"saṃvatsaram","_","_","saṃvatsara","NC","","_","_"
12,"araṇye","_","_","araṇya","NC","","_","_"
13,"cacāra","_","_","car","V","car","_","_"
14,"so","_","_","tad","PRD","","_","_"
15,"'jīgartaṃ","_","_","ajīgarta","NC","","_","_"
16,"sauyavasim","_","_","sauyavasi","NC","","_","_"
17,"ṛṣim","_","_","ṛṣi","NC","","_","_"
18,"_","_","_","aśanāyā","NC","","_","_"
19,"_","_","_","parī","PPP","","_","_"
20,"araṇya","_","_","araṇya","NC","","_","_"
21,"upeyāya","_","_","upai","V","upe","_","_"
1,"tasya","_","_","tad","PRD","","_","_"
2,"ha","_","_","ha","CEM","","_","_"
3,"trayaḥ","_","_","tri","NUM","","_","_"
4,"putrā","_","_","putra","NC","","_","_"
5,"āsuḥ","_","_","as","V","as","_","_"
6,"śunaḥpucchaḥ","_","_","śunaḥpuccha","NC","","_","_"
7,"śunaḥśepaḥ","_","_","śunaḥśepa","NC","","_","_"
8,"śunolāṅgūla","_","_","śunolāṅgūla","NC","","_","_"
9,"iti","_","_","iti","CQT","","_","_"
10,"taṃ","_","_","tad","PRD","","_","_"
11,"_","_","_","ha","CEM","","_","_"
12,"_","_","_","vak","V","vac","_","_"
13,"ṛṣe","_","_","ṛṣi","NC","","_","_"
14,"'haṃ","_","_","mat","PPR","","_","_"
15,"te","_","_","tvat","PPR","","_","_"
16,"śataṃ","_","_","śata","NUM","","_","_"
17,"dadāmy","_","_","dad","V","dā","_","_"
18,"aham","_","_","mat","PPR","","_","_"
19,"eṣām","_","_","ida","PRD","","_","_"
20,"_","_","_","eka","PPX","","_","_"
21,"_","_","_","ātman","NC","","_","_"
22,"niṣkrīṇā","_","_","niṣkrī","V","niṣkrī","_","_"
23,"iti","_","_","iti","CQT","","_","_"
24,"sa","_","_","tad","PRD","","_","_"
25,"jyeṣṭham","_","_","jyeṣṭha","JJ","","_","_"
26,"putraṃ","_","_","putra","NC","","_","_"
27,"nigṛhṇāna","_","_","nigrah","KDP","","_","_"
28,"uvāca","_","_","vak","V","vac","_","_"
29,"na","_","_","na","CNG","","_","_"
30,"nv","_","_","nu","CX","","_","_"
31,"imam","_","_","ida","PRD","","_","_"
32,"iti","_","_","iti","CQT","","_","_"
33,"_","_","_","na","CNG","","_","_"
34,"_","_","_","u","CEM","","_","_"
35,"_","_","_","eva","CEM","","_","_"
36,"_","_","_","ida","PRD","","_","_"
37,"iti","_","_","iti","CQT","","_","_"
38,"kaniṣṭham","_","_","kaniṣṭha","JJ","","_","_"
39,"mātā","_","_","mātṛ","NC","","_","_"
40,"tau","_","_","tad","PRD","","_","_"
41,"ha","_","_","ha","CEM","","_","_"
42,"madhyame","_","_","madhyama","JJ","","_","_"
43,"saṃpādayāṃcakratuḥ","_","_","sampāday","V","sampāday","_","_"
44,"śunaḥśepe","_","_","śunaḥśepa","NC","","_","_"
45,"tasya","_","_","tad","PRD","","_","_"
46,"ha","_","_","ha","CEM","","_","_"
47,"śataṃ","_","_","śata","NUM","","_","_"
48,"dattvā","_","_","dā","CGDA","","_","_"
49,"sa","_","_","tad","PRD","","_","_"
50,"tam","_","_","tad","PRD","","_","_"
51,"ādāya","_","_","ādā","CGDA","","_","_"
52,"so","_","_","tad","PRD","","_","_"
53,"'raṇyād","_","_","araṇya","NC","","_","_"
54,"grāmam","_","_","grāma","NC","","_","_"
55,"eyāya","_","_","e","V","e","_","_"
1,"sa","_","_","tad","PRD","","_","_"
2,"pitaram","_","_","pitṛ","NC","","_","_"
3,"_","_","_","e","CGDA","","_","_"
4,"_","_","_","vak","V","vac","_","_"
5,"tata","_","_","tata","NC","","_","_"
6,"_","_","_","hanta","CX","","_","_"
7,"_","_","_","mat","PPR","","_","_"
8,"_","_","_","ida","PRD","","_","_"
9,"_","_","_","ātman","NC","","_","_"
10,"niṣkrīṇā","_","_","niṣkrī","V","niṣkrī","_","_"
11,"iti","_","_","iti","CQT","","_","_"
12,"sa","_","_","tad","PRD","","_","_"
13,"varuṇaṃ","_","_","varuṇa","NC","","_","_"
14,"rājānam","_","_","rājan","NC","","_","_"
15,"_","_","_","upasṛ","V","upasṛ","_","_"
16,"_","_","_","ida","PRD","","_","_"
17,"tvā","_","_","tvat","PPR","","_","_"
18,"yajā","_","_","yaj","V","yaj","_","_"
19,"iti","_","_","iti","CQT","","_","_"
20,"_","_","_","tathā","CX","","_","_"
21,"_","_","_","iti","CQT","","_","_"
22,"bhūyān","_","_","bhūyas","JJ","","_","_"
23,"vai","_","_","vai","CX","","_","_"
24,"brāhmaṇaḥ","_","_","brāhmaṇa","NC","","_","_"
25,"kṣatriyād","_","_","kṣatriya","NC","","_","_"
26,"iti","_","_","iti","CQT","","_","_"
27,"varuṇa","_","_","varuṇa","NC","","_","_"
28,"uvāca","_","_","vak","V","vac","_","_"
29,"tasmā","_","_","tad","PRD","","_","_"
30,"etaṃ","_","_","tad","PRD","","_","_"
31,"rājasūyaṃ","_","_","rājasūya","NC","","_","_"
32,"_","_","_","yajña","NC","","_","_"
33,"_","_","_","kratu","NC","","_","_"
34,"provāca","_","_","pravak","V","pravac","_","_"
35,"tam","_","_","tad","PRD","","_","_"
36,"etam","_","_","tad","PRD","","_","_"
37,"abhiṣecanīye","_","_","abhiṣecanīya","NC","","_","_"
38,"puruṣam","_","_","puruṣa","NC","","_","_"
39,"paśum","_","_","paśu","NC","","_","_"
40,"ālebhe","_","_","ālabh","V","ālabh","_","_"
