"WordID","word","NormSTEM","suffix","lemma","PoS","Root","NormSuffix","NormWord"
1,"vaiśampāyana","_","_","vaiśampāyana","NC","","_","_"
2,"uvāca","_","_","vak","V","vac","_","_"
1,"gate","_","_","ga","PPP","","_","_"
2,"tu","_","_","tu","CCD","","_","_"
3,"vidure","_","_","vidura","NC","","_","_"
4,"rājann","_","_","rājan","NC","","_","_"
5,"āśramaṃ","_","_","āśrama","NC","","_","_"
6,"pāṇḍavān","_","_","pāṇḍava","NC","","_","_"
7,"prati","_","_","prati","CADP","","_","_"
1,"dhṛtarāṣṭro","_","_","dhṛtarāṣṭra","NC","","_","_"
2,"_","_","_","mahat","JJ","","_","_"
3,"_","_","_","prājña","JJ","","_","_"
4,"paryatapyata","_","_","paritap","V","paritap","_","_"
5,"bhārata","_","_","bhārata","JJ","","_","_"
1,"sa","_","_","tad","PRD","","_","_"
2,"_","_","_","sabhā","NC","","_","_"
3,"_","_","_","dvāra","NC","","_","_"
4,"āgamya","_","_","āga","CGDA","","_","_"
5,"_","_","_","vidura","NC","","_","_"
6,"_","_","_","smāra","NC","","_","_"
7,"_","_","_","mohay","PPP","","_","_"
1,"samakṣaṃ","_","_","samakṣa","JJ","","_","_"
2,"_","_","_","pārthiva","NC","","_","_"
3,"_","_","_","indra","NC","","_","_"
4,"_","_","_","pat","V","pat","_","_"
5,"_","_","_","āviś","PPP","","_","_"
6,"_","_","_","cetana","NC","","_","_"
1,"sa","_","_","tad","PRD","","_","_"
2,"tu","_","_","tu","CCD","","_","_"
3,"labdhvā","_","_","labh","CGDA","","_","_"
4,"punaḥ","_","_","punar","CAD","","_","_"
5,"saṃjñāṃ","_","_","saṃjñā","NC","","_","_"
6,"samutthāya","_","_","samutthā","CGDA","","_","_"
7,"_","_","_","mahī","NC","","_","_"
8,"_","_","_","tala","NC","","_","_"
1,"_","_","_","samīpa","NC","","_","_"
2,"_","_","_","upasthā","PPP","","_","_"
3,"rājā","_","_","rājan","NC","","_","_"
4,"saṃjayaṃ","_","_","saṃjaya","NC","","_","_"
5,"vākyam","_","_","vākya","NC","","_","_"
6,"abravīt","_","_","abravīta","V","brū","_","_"
1,"bhrātā","_","_","bhrātṛ","NC","","_","_"
2,"mama","_","_","mat","PPR","","_","_"
3,"suhṛc","_","_","suhṛd","NC","","_","_"
4,"_","_","_","ca","CCD","","_","_"
5,"_","_","_","eva","CEM","","_","_"
6,"sākṣād","_","_","sākṣāt","CX","","_","_"
7,"dharma","_","_","dharma","NC","","_","_"
8,"_","_","_","iva","CCM","","_","_"
9,"_","_","_","apara","PPX","","_","_"
1,"tasya","_","_","tad","PRD","","_","_"
2,"_","_","_","smṛ","CGDA","","_","_"
3,"_","_","_","adya","CX","","_","_"
4,"_","_","_","su","CAD","","_","_"
5,"_","_","_","bhṛśa","CX","","_","_"
6,"hṛdayaṃ","_","_","hṛdaya","NC","","_","_"
7,"_","_","_","dṛ","V","dṛ","_","_"
8,"_","_","_","iva","CCM","","_","_"
9,"me","_","_","mat","PPR","","_","_"
1,"tam","_","_","tad","PRD","","_","_"
2,"ānayasva","_","_","ānay","V","ānī","_","_"
3,"_","_","_","dharma","NC","","_","_"
4,"_","_","_","jña","JJ","","_","_"
5,"mama","_","_","mat","PPR","","_","_"
6,"bhrātaram","_","_","bhrātṛ","NC","","_","_"
7,"āśu","_","_","āśu","JJ","","_","_"
8,"vai","_","_","vai","CX","","_","_"
1,"iti","_","_","iti","CQT","","_","_"
2,"bruvan","_","_","brū","KDP","","_","_"
3,"sa","_","_","tad","PRD","","_","_"
4,"nṛpatiḥ","_","_","nṛpati","NC","","_","_"
5,"karuṇaṃ","_","_","karuṇa","JJ","","_","_"
6,"paryadevayat","_","_","paridevay","V","paridevay","_","_"
1,"_","_","_","paścāttāpa","NC","","_","_"
2,"_","_","_","abhisaṃtap","PPP","","_","_"
3,"_","_","_","vidura","NC","","_","_"
4,"_","_","_","smāra","NC","","_","_"
5,"_","_","_","karśay","PPP","","_","_"
1,"_","_","_","bhrātṛ","NC","","_","_"
2,"_","_","_","sneha","NC","","_","_"
3,"idaṃ","_","_","ida","PRD","","_","_"
4,"rājan","_","_","rājan","NC","","_","_"
5,"saṃjayaṃ","_","_","saṃjaya","NC","","_","_"
6,"vākyam","_","_","vākya","NC","","_","_"
7,"abravīt","_","_","abravīta","V","brū","_","_"
1,"gaccha","_","_","ga","V","ga","_","_"
2,"saṃjaya","_","_","saṃjaya","NC","","_","_"
3,"jānīhi","_","_","jān","V","jñā","_","_"
4,"bhrātaraṃ","_","_","bhrātṛ","NC","","_","_"
5,"viduraṃ","_","_","vidura","NC","","_","_"
6,"mama","_","_","mat","PPR","","_","_"
1,"yadi","_","_","yadi","CSB","","_","_"
2,"jīvati","_","_","jīv","V","jīv","_","_"
3,"roṣeṇa","_","_","roṣa","NC","","_","_"
4,"mayā","_","_","mat","PPR","","_","_"
5,"pāpena","_","_","pāpa","JJ","","_","_"
6,"nirdhutaḥ","_","_","nirdhū","PPP","","_","_"
1,"na","_","_","na","CNG","","_","_"
2,"hi","_","_","hi","CX","","_","_"
3,"tena","_","_","tad","PRD","","_","_"
4,"mama","_","_","mat","PPR","","_","_"
5,"bhrātrā","_","_","bhrātṛ","NC","","_","_"
6,"_","_","_","su","CAD","","_","_"
7,"_","_","_","sūkṣma","JJ","","_","_"
8,"api","_","_","api","CX","","_","_"
9,"kiṃcana","_","_","kaścana","PRI","","_","_"
1,"vyalīkaṃ","_","_","vyalīka","NC","","_","_"
2,"_","_","_","kṛ","PPP","","_","_"
3,"_","_","_","pūrva","PPX","","_","_"
4,"me","_","_","mat","PPR","","_","_"
5,"_","_","_","prājña","JJ","","_","_"
6,"_","_","_","amita","JJ","","_","_"
7,"_","_","_","buddhi","NC","","_","_"
1,"sa","_","_","tad","PRD","","_","_"
2,"vyalīkaṃ","_","_","vyalīka","NC","","_","_"
3,"kathaṃ","_","_","katha","CX","","_","_"
4,"prāpto","_","_","prāp","PPP","","_","_"
5,"mattaḥ","_","_","mat","PPR","","_","_"
6,"_","_","_","parama","JJ","","_","_"
7,"_","_","_","buddhimat","JJ","","_","_"
1,"na","_","_","na","CNG","","_","_"
2,"_","_","_","jah","V","hā","_","_"
3,"_","_","_","jīvita","NC","","_","_"
4,"prājñas","_","_","prājña","JJ","","_","_"
5,"taṃ","_","_","tad","PRD","","_","_"
6,"_","_","_","ga","V","ga","_","_"
7,"_","_","_","anaya","NC","","_","_"
8,"saṃjaya","_","_","saṃjaya","NC","","_","_"
1,"tasya","_","_","tad","PRD","","_","_"
2,"tad","_","_","tad","PRD","","_","_"
3,"vacanaṃ","_","_","vacana","NC","","_","_"
4,"śrutvā","_","_","śru","CGDA","","_","_"
5,"rājñas","_","_","rājan","NC","","_","_"
6,"tam","_","_","tad","PRD","","_","_"
7,"anumānya","_","_","anumānay","CGDA","","_","_"
8,"ca","_","_","ca","CCD","","_","_"
1,"saṃjayo","_","_","saṃjaya","NC","","_","_"
2,"bāḍham","_","_","bāḍha","JJ","","_","_"
3,"ity","_","_","iti","CQT","","_","_"
4,"uktvā","_","_","vac","CGDA","","_","_"
5,"prādravat","_","_","pradru","V","pradru","_","_"
6,"kāmyakaṃ","_","_","kāmyaka","NC","","_","_"
7,"vanam","_","_","vana","NC","","_","_"
1,"so","_","_","tad","PRD","","_","_"
2,"'cireṇa","_","_","acira","JJ","","_","_"
3,"samāsādya","_","_","samāsāday","CGDA","","_","_"
4,"tad","_","_","tad","PRD","","_","_"
5,"vanaṃ","_","_","vana","NC","","_","_"
6,"yatra","_","_","yatra","CX","","_","_"
7,"pāṇḍavāḥ","_","_","pāṇḍava","NC","","_","_"
1,"_","_","_","raurava","JJ","","_","_"
2,"_","_","_","ajina","NC","","_","_"
3,"_","_","_","saṃvye","PPP","","_","_"
4,"_","_","_","darś","V","dṛś","_","_"
5,"_","_","_","atha","CAD","","_","_"
6,"yudhiṣṭhiram","_","_","yudhiṣṭhira","NC","","_","_"
1,"vidureṇa","_","_","vidura","NC","","_","_"
2,"_","_","_","saha","CX","","_","_"
3,"_","_","_","ās","PPP","","_","_"
4,"brāhmaṇaiś","_","_","brāhmaṇa","NC","","_","_"
5,"ca","_","_","ca","CCD","","_","_"
6,"sahasraśaḥ","_","_","sahasraśas","CX","","_","_"
1,"bhrātṛbhiś","_","_","bhrātṛ","NC","","_","_"
2,"_","_","_","ca","CCD","","_","_"
3,"_","_","_","abhisaṃgup","PPP","","_","_"
4,"devair","_","_","deva","NC","","_","_"
5,"iva","_","_","iva","CCM","","_","_"
6,"śatakratum","_","_","śatakratu","NC","","_","_"
1,"yudhiṣṭhiram","_","_","yudhiṣṭhira","NC","","_","_"
2,"_","_","_","atha","CAD","","_","_"
3,"_","_","_","abhye","CGDA","","_","_"
4,"pūjayāmāsa","_","_","pūjay","V","pūjay","_","_"
5,"saṃjayaḥ","_","_","saṃjaya","NC","","_","_"
1,"_","_","_","bhīma","NC","","_","_"
2,"_","_","_","arjuna","NC","","_","_"
3,"_","_","_","yama","NC","","_","_"
4,"_","_","_","ca","CCD","","_","_"
5,"_","_","_","api","CX","","_","_"
6,"_","_","_","tad","PRD","","_","_"
7,"_","_","_","arha","JJ","","_","_"
8,"pratyapadyata","_","_","pratipad","V","pratipad","_","_"
1,"rājñā","_","_","rājan","NC","","_","_"
2,"pṛṣṭaḥ","_","_","pracch","PPP","","_","_"
3,"sa","_","_","tad","PRD","","_","_"
4,"kuśalaṃ","_","_","kuśala","NC","","_","_"
5,"_","_","_","sukha","NC","","_","_"
6,"_","_","_","ās","PPP","","_","_"
7,"ca","_","_","ca","CCD","","_","_"
8,"saṃjayaḥ","_","_","saṃjaya","NC","","_","_"
1,"_","_","_","śaṃs","V","śaṃs","_","_"
2,"_","_","_","āgamana","NC","","_","_"
3,"hetum","_","_","hetu","NC","","_","_"
4,"idaṃ","_","_","ida","PRD","","_","_"
5,"_","_","_","ca","CCD","","_","_"
6,"_","_","_","eva","CEM","","_","_"
7,"_","_","_","abravīta","V","brū","_","_"
8,"vacaḥ","_","_","vacas","NC","","_","_"
1,"rājā","_","_","rājan","NC","","_","_"
2,"smarati","_","_","smar","V","smṛ","_","_"
3,"te","_","_","tvat","PPR","","_","_"
4,"kṣattar","_","_","kṣattṛ","NC","","_","_"
5,"dhṛtarāṣṭro","_","_","dhṛtarāṣṭra","NC","","_","_"
6,"'mbikāsutaḥ","_","_","ambikāsuta","NC","","_","_"
1,"taṃ","_","_","tad","PRD","","_","_"
2,"paśya","_","_","paś","V","paś","_","_"
3,"gatvā","_","_","ga","CGDA","","_","_"
4,"tvaṃ","_","_","tvat","PPR","","_","_"
5,"kṣipraṃ","_","_","kṣipra","CX","","_","_"
6,"saṃjīvaya","_","_","saṃjīvay","V","saṃjīvay","_","_"
7,"ca","_","_","ca","CCD","","_","_"
8,"pārthivam","_","_","pārthiva","NC","","_","_"
1,"so","_","_","tad","PRD","","_","_"
2,"'numānya","_","_","anumānay","CGDA","","_","_"
3,"_","_","_","nara","NC","","_","_"
4,"_","_","_","śreṣṭha","JJ","","_","_"
5,"pāṇḍavān","_","_","pāṇḍava","NC","","_","_"
6,"_","_","_","kuru","NC","","_","_"
7,"_","_","_","nandana","NC","","_","_"
1,"niyogād","_","_","niyoga","NC","","_","_"
2,"_","_","_","rājan","NC","","_","_"
3,"_","_","_","siṃha","NC","","_","_"
4,"gantum","_","_","ga","CGDI","","_","_"
5,"arhasi","_","_","arh","V","arh","_","_"
6,"mānada","_","_","mānada","JJ","","_","_"
1,"evam","_","_","eva","CX","","_","_"
2,"uktas","_","_","vac","PPP","","_","_"
3,"tu","_","_","tu","CCD","","_","_"
4,"viduro","_","_","vidura","NC","","_","_"
5,"dhīmān","_","_","dhīmat","JJ","","_","_"
6,"_","_","_","sva","JJ","","_","_"
7,"_","_","_","jana","NC","","_","_"
8,"_","_","_","vatsala","JJ","","_","_"
1,"_","_","_","yudhiṣṭhira","NC","","_","_"
2,"_","_","_","anumata","NC","","_","_"
3,"punar","_","_","punar","CAD","","_","_"
4,"āyād","_","_","āyā","V","āyā","_","_"
5,"gajāhvayam","_","_","gajāhvaya","NC","","_","_"
1,"tam","_","_","tad","PRD","","_","_"
2,"abravīn","_","_","abravīta","V","brū","_","_"
3,"_","_","_","mahat","JJ","","_","_"
4,"_","_","_","prājña","JJ","","_","_"
5,"dhṛtarāṣṭraḥ","_","_","dhṛtarāṣṭra","NC","","_","_"
6,"pratāpavān","_","_","pratāpavat","JJ","","_","_"
1,"diṣṭyā","_","_","diṣṭi","NC","","_","_"
2,"prāpto","_","_","prāp","PPP","","_","_"
3,"'si","_","_","as","V","as","_","_"
4,"_","_","_","dharma","NC","","_","_"
5,"_","_","_","jña","JJ","","_","_"
6,"diṣṭyā","_","_","diṣṭi","NC","","_","_"
7,"smarasi","_","_","smar","V","smṛ","_","_"
8,"me","_","_","mat","PPR","","_","_"
9,"'nagha","_","_","anagha","JJ","","_","_"
1,"adya","_","_","adya","CX","","_","_"
2,"rātrau","_","_","rātri","NC","","_","_"
3,"divā","_","_","div","NC","","_","_"
4,"_","_","_","ca","CCD","","_","_"
5,"_","_","_","mat","PPR","","_","_"
6,"_","_","_","tvat","PPR","","_","_"
7,"_","_","_","kṛ","PPP","","_","_"
8,"_","_","_","bharata","NC","","_","_"
9,"_","_","_","ṛṣabha","NC","","_","_"
1,"prajāgare","_","_","prajāgara","NC","","_","_"
2,"prapaśyāmi","_","_","prapaś","V","prapaś","_","_"
3,"vicitraṃ","_","_","vicitra","JJ","","_","_"
4,"deham","_","_","deha","NC","","_","_"
5,"ātmanaḥ","_","_","ātman","NC","","_","_"
1,"so","_","_","tad","PRD","","_","_"
2,"'ṅkam","_","_","aṅka","NC","","_","_"
3,"ādāya","_","_","ādā","CGDA","","_","_"
4,"viduraṃ","_","_","vidura","NC","","_","_"
5,"_","_","_","mūrdhan","NC","","_","_"
6,"_","_","_","upāghrā","CGDA","","_","_"
7,"_","_","_","ca","CCD","","_","_"
8,"_","_","_","eva","CEM","","_","_"
9,"ha","_","_","ha","CEM","","_","_"
1,"kṣamyatām","_","_","kṣa","V","kṣa","_","_"
2,"iti","_","_","iti","CQT","","_","_"
3,"_","_","_","ca","CCD","","_","_"
4,"_","_","_","vak","V","vac","_","_"
5,"yad","_","_","yat","CSB","","_","_"
6,"ukto","_","_","vac","PPP","","_","_"
7,"'si","_","_","as","V","as","_","_"
8,"mayā","_","_","mat","PPR","","_","_"
9,"ruṣā","_","_","ruṣ","NC","","_","_"
1,"vidura","_","_","vidura","NC","","_","_"
2,"uvāca","_","_","vak","V","vac","_","_"
1,"kṣāntam","_","_","kṣa","PPP","","_","_"
2,"eva","_","_","eva","CEM","","_","_"
3,"mayā","_","_","mat","PPR","","_","_"
4,"rājan","_","_","rājan","NC","","_","_"
5,"gurur","_","_","guru","NC","","_","_"
6,"naḥ","_","_","mat","PPR","","_","_"
7,"paramo","_","_","parama","JJ","","_","_"
8,"bhavān","_","_","bhavat","JJ","","_","_"
1,"tathā","_","_","tathā","CX","","_","_"
2,"_","_","_","hi","CX","","_","_"
3,"_","_","_","as","V","as","_","_"
4,"āgataḥ","_","_","āga","PPP","","_","_"
5,"kṣipraṃ","_","_","kṣipra","CX","","_","_"
6,"_","_","_","tvat","PPR","","_","_"
7,"_","_","_","darśana","NC","","_","_"
8,"_","_","_","parāyaṇa","NC","","_","_"
1,"bhavanti","_","_","bhav","V","bhū","_","_"
2,"hi","_","_","hi","CX","","_","_"
3,"_","_","_","nara","NC","","_","_"
4,"_","_","_","vyāghra","NC","","_","_"
5,"puruṣā","_","_","puruṣa","NC","","_","_"
6,"_","_","_","dharma","NC","","_","_"
7,"_","_","_","cetas","NC","","_","_"
1,"_","_","_","dīna","JJ","","_","_"
2,"_","_","_","abhipātin","JJ","","_","_"
3,"rājan","_","_","rājan","NC","","_","_"
4,"_","_","_","na","CNG","","_","_"
5,"_","_","_","atra","CAD","","_","_"
6,"kāryā","_","_","kṛ","KDG","","_","_"
7,"vicāraṇā","_","_","vicāraṇā","NC","","_","_"
1,"pāṇḍoḥ","_","_","pāṇḍu","NC","","_","_"
2,"sutā","_","_","suta","NC","","_","_"
3,"yādṛśā","_","_","yādṛśa","JJ","","_","_"
4,"me","_","_","mat","PPR","","_","_"
5,"tādṛśā","_","_","tādṛśa","JJ","","_","_"
6,"me","_","_","mat","PPR","","_","_"
7,"sutās","_","_","suta","NC","","_","_"
8,"tava","_","_","tvat","PPR","","_","_"
1,"dīnā","_","_","dīna","JJ","","_","_"
2,"iti","_","_","iti","CQT","","_","_"
3,"hi","_","_","hi","CX","","_","_"
4,"me","_","_","mat","PPR","","_","_"
5,"buddhir","_","_","buddhi","NC","","_","_"
6,"_","_","_","abhipad","PPP","","_","_"
7,"_","_","_","adya","CX","","_","_"
8,"tān","_","_","tad","PRD","","_","_"
9,"prati","_","_","prati","CADP","","_","_"
1,"vaiśampāyana","_","_","vaiśampāyana","NC","","_","_"
2,"uvāca","_","_","vak","V","vac","_","_"
1,"anyonyam","_","_","anyonya","PRC","","_","_"
2,"_","_","_","anunī","CGDA","","_","_"
3,"_","_","_","eva","CX","","_","_"
4,"bhrātarau","_","_","bhrātṛ","NC","","_","_"
5,"tau","_","_","tad","PRD","","_","_"
6,"_","_","_","mahat","JJ","","_","_"
7,"_","_","_","dyuti","NC","","_","_"
1,"viduro","_","_","vidura","NC","","_","_"
2,"dhṛtarāṣṭraś","_","_","dhṛtarāṣṭra","NC","","_","_"
3,"ca","_","_","ca","CCD","","_","_"
4,"lebhāte","_","_","labh","V","labh","_","_"
5,"paramāṃ","_","_","parama","JJ","","_","_"
6,"mudam","_","_","mud","NC","","_","_"
