"WordID","word","NormSTEM","suffix","lemma","PoS","Root","NormSuffix","NormWord"
1,"aurva","_","_","aurva","NC","","_","_"
2,"uvāca","_","_","vak","V","vac","_","_"
1,"uktavān","_","_","vac","KDP","","_","_"
2,"asmi","_","_","as","V","as","_","_"
3,"yāṃ","_","_","yad","PRL","","_","_"
4,"krodhāt","_","_","krodha","NC","","_","_"
5,"pratijñāṃ","_","_","pratijñā","NC","","_","_"
6,"_","_","_","pitṛ","NC","","_","_"
7,"_","_","_","tadā","CAD","","_","_"
1,"_","_","_","sarva","JQ","","_","_"
2,"_","_","_","loka","NC","","_","_"
3,"_","_","_","vināśa","NC","","_","_"
4,"na","_","_","na","CNG","","_","_"
5,"sā","_","_","tad","PRD","","_","_"
6,"me","_","_","mat","PPR","","_","_"
7,"vitathā","_","_","vitatha","JJ","","_","_"
8,"bhavet","_","_","bhav","V","bhū","_","_"
1,"_","_","_","vṛthā","CX","","_","_"
2,"_","_","_","roṣa","NC","","_","_"
3,"_","_","_","pratijñā","NC","","_","_"
4,"hi","_","_","hi","CX","","_","_"
5,"_","_","_","na","CNG","","_","_"
6,"_","_","_","mat","PPR","","_","_"
7,"jīvitum","_","_","jīv","CGDI","","_","_"
8,"utsahe","_","_","utsaha","V","utsah","_","_"
1,"anistīrṇo","_","_","anistīrṇa","JJ","","_","_"
2,"hi","_","_","hi","CX","","_","_"
3,"māṃ","_","_","mat","PPR","","_","_"
4,"roṣo","_","_","roṣa","NC","","_","_"
5,"dahed","_","_","dah","V","dah","_","_"
6,"agnir","_","_","agni","NC","","_","_"
7,"_","_","_","iva","CCM","","_","_"
8,"_","_","_","araṇi","NC","","_","_"
1,"yo","_","_","yad","PRL","","_","_"
2,"hi","_","_","hi","CX","","_","_"
3,"kāraṇataḥ","_","_","kāraṇa","NC","","_","_"
4,"krodhaṃ","_","_","krodha","NC","","_","_"
5,"saṃjātaṃ","_","_","saṃjan","PPP","","_","_"
6,"kṣantum","_","_","kṣa","CGDI","","_","_"
7,"arhati","_","_","arh","V","arh","_","_"
1,"_","_","_","na","CNG","","_","_"
2,"_","_","_","ala","CX","","_","_"
3,"sa","_","_","tad","PRD","","_","_"
4,"manujaḥ","_","_","manuja","NC","","_","_"
5,"samyak","_","_","samyak","CX","","_","_"
6,"trivargaṃ","_","_","trivarga","NC","","_","_"
7,"parirakṣitum","_","_","parirakṣ","CGDI","","_","_"
1,"a","_","_","alpha_privativum","JJ","","_","_"
1,"aśiṣṭānāṃ","_","_","śiṣṭa","JJ","","_","_"
2,"niyantā","_","_","niyantṛ","NC","","_","_"
3,"hi","_","_","hi","CX","","_","_"
4,"śiṣṭānāṃ","_","_","śās","PPP","","_","_"
5,"parirakṣitā","_","_","parirakṣitṛ","JJ","","_","_"
1,"sthāne","_","_","sthāna","NC","","_","_"
2,"roṣaḥ","_","_","roṣa","NC","","_","_"
3,"prayuktaḥ","_","_","prayuj","PPP","","_","_"
4,"syān","_","_","as","V","as","_","_"
5,"nṛpaiḥ","_","_","nṛpa","NC","","_","_"
6,"_","_","_","svarga","NC","","_","_"
7,"_","_","_","jigīṣu","JJ","","_","_"
1,"aśrauṣam","_","_","śṛṇ","V","śru","_","_"
2,"aham","_","_","mat","PPR","","_","_"
3,"_","_","_","ūru","NC","","_","_"
4,"_","_","_","stha","JJ","","_","_"
5,"_","_","_","garbhaśayyā","NC","","_","_"
6,"_","_","_","ga","PPP","","_","_"
7,"_","_","_","tadā","CAD","","_","_"
1,"ārāvaṃ","_","_","ārāva","NC","","_","_"
2,"_","_","_","mātṛ","NC","","_","_"
3,"_","_","_","varga","NC","","_","_"
4,"bhṛgūṇāṃ","_","_","bhṛgu","NC","","_","_"
5,"kṣatriyair","_","_","kṣatriya","NC","","_","_"
6,"vadhe","_","_","vadha","NC","","_","_"
1,"_","_","_","sa_saha","CX","","_","_"
2,"_","_","_","amara","NC","","_","_"
3,"hi","_","_","hi","CX","","_","_"
4,"yadā","_","_","yadā","CSB","","_","_"
5,"lokair","_","_","loka","NC","","_","_"
6,"bhṛgūṇāṃ","_","_","bhṛgu","NC","","_","_"
7,"_","_","_","kṣatriya","NC","","_","_"
8,"_","_","_","adhama","JJ","","_","_"
1,"_","_","_","garbha","NC","","_","_"
2,"_","_","_","utsādana","NC","","_","_"
3,"kṣāntaṃ","_","_","kṣa","PPP","","_","_"
4,"tadā","_","_","tadā","CAD","","_","_"
5,"māṃ","_","_","mat","PPR","","_","_"
6,"manyur","_","_","manyu","NC","","_","_"
7,"āviśat","_","_","viś","V","viś","_","_"
1,"_","_","_","āp￞","PPP","","_","_"
2,"_","_","_","kośa","NC","","_","_"
3,"kila","_","_","kila","CX","","_","_"
4,"me","_","_","mat","PPR","","_","_"
5,"mātaraḥ","_","_","mātṛ","NC","","_","_"
6,"_","_","_","pitṛ","NC","","_","_"
7,"_","_","_","tathā","CX","","_","_"
1,"bhayāt","_","_","bhaya","NC","","_","_"
2,"sarveṣu","_","_","sarva","JQ","","_","_"
3,"lokeṣu","_","_","loka","NC","","_","_"
4,"_","_","_","na","CNG","","_","_"
5,"_","_","_","adhiga","V","adhiga","_","_"
6,"parāyaṇam","_","_","parāyaṇa","NC","","_","_"
1,"tān","_","_","tad","PRD","","_","_"
2,"bhṛgūṇāṃ","_","_","bhṛgu","NC","","_","_"
3,"tadā","_","_","tadā","CAD","","_","_"
4,"dārān","_","_","dāra","NC","","_","_"
5,"kaścin","_","_","kiṃcit","PRI","","_","_"
6,"_","_","_","na","CNG","","_","_"
7,"_","_","_","abhyavapad","V","abhyavapad","_","_"
1,"yadā","_","_","yadā","CSB","","_","_"
2,"tadā","_","_","tadā","CAD","","_","_"
3,"_","_","_","dhar","V","dhṛ","_","_"
4,"_","_","_","ida","PRD","","_","_"
5,"_","_","_","ūru","NC","","_","_"
6,"_","_","_","eka","PPX","","_","_"
7,"māṃ","_","_","mat","PPR","","_","_"
8,"śubhā","_","_","śubha","JJ","","_","_"
1,"pratiṣeddhā","_","_","pratiṣeddhṛ","JJ","","_","_"
2,"hi","_","_","hi","CX","","_","_"
3,"pāpasya","_","_","pāpa","NC","","_","_"
4,"yadā","_","_","yadā","CSB","","_","_"
5,"lokeṣu","_","_","loka","NC","","_","_"
6,"vidyate","_","_","vid","V","vid","_","_"
1,"tadā","_","_","tadā","CAD","","_","_"
2,"sarveṣu","_","_","sarva","JQ","","_","_"
3,"lokeṣu","_","_","loka","NC","","_","_"
4,"_","_","_","pāpa","NC","","_","_"
5,"_","_","_","kṛt","JJ","","_","_"
6,"_","_","_","na","CNG","","_","_"
7,"_","_","_","upapad","V","upapad","_","_"
1,"yadā","_","_","yadā","CSB","","_","_"
2,"tu","_","_","tu","CCD","","_","_"
3,"pratiṣeddhāraṃ","_","_","pratiṣeddhṛ","JJ","","_","_"
4,"pāpo","_","_","pāpa","JJ","","_","_"
5,"na","_","_","na","CNG","","_","_"
6,"labhate","_","_","labh","V","labh","_","_"
7,"kvacit","_","_","kvacid","CX","","_","_"
1,"tiṣṭhanti","_","_","tiṣṭh","V","sthā","_","_"
2,"bahavo","_","_","bahu","JJ","","_","_"
3,"loke","_","_","loka","NC","","_","_"
4,"tadā","_","_","tadā","CAD","","_","_"
5,"pāpeṣu","_","_","pāpa","JJ","","_","_"
6,"karmasu","_","_","karman","NC","","_","_"
1,"jānann","_","_","jñā","KDP","","_","_"
2,"api","_","_","api","CX","","_","_"
3,"ca","_","_","ca","CCD","","_","_"
4,"yaḥ","_","_","yad","PRL","","_","_"
5,"pāpaṃ","_","_","pāpa","NC","","_","_"
6,"śaktimān","_","_","śaktimat","JJ","","_","_"
7,"na","_","_","na","CNG","","_","_"
8,"niyacchati","_","_","niya","V","niya","_","_"
1,"īśaḥ","_","_","īśa","JJ","","_","_"
2,"san","_","_","as","KDP","","_","_"
3,"so","_","_","tad","PRD","","_","_"
4,"'pi","_","_","api","CX","","_","_"
5,"_","_","_","tad","PRD","","_","_"
6,"_","_","_","eva","CEM","","_","_"
7,"karmaṇā","_","_","karman","NC","","_","_"
8,"samprayujyate","_","_","samprayuj","V","saṃprayuj","_","_"
1,"_","_","_","rājan","NC","","_","_"
2,"_","_","_","ca","CCD","","_","_"
3,"_","_","_","īśvara","NC","","_","_"
4,"_","_","_","ca","CCD","","_","_"
5,"_","_","_","eva","CEM","","_","_"
6,"yadi","_","_","yadi","CSB","","_","_"
7,"vai","_","_","vai","CX","","_","_"
8,"pitaro","_","_","pitṛ","NC","","_","_"
9,"mama","_","_","mat","PPR","","_","_"
1,"śaktair","_","_","śak","PPP","","_","_"
2,"na","_","_","na","CNG","","_","_"
3,"śakitās","_","_","śak","PPP","","_","_"
4,"trātum","_","_","trā","CGDI","","_","_"
5,"iṣṭaṃ","_","_","iṣ","PPP","","_","_"
6,"_","_","_","man","CGDA","","_","_"
7,"_","_","_","iha","CAD","","_","_"
8,"jīvitam","_","_","jīvita","NC","","_","_"
1,"ata","_","_","atas","CX","","_","_"
2,"eṣām","_","_","ida","PRD","","_","_"
3,"ahaṃ","_","_","mat","PPR","","_","_"
4,"kruddho","_","_","krudh","PPP","","_","_"
5,"lokānām","_","_","loka","NC","","_","_"
6,"īśvaro","_","_","īśvara","NC","","_","_"
7,"'dya","_","_","adya","CX","","_","_"
8,"san","_","_","as","KDP","","_","_"
1,"bhavatāṃ","_","_","bhavat","JJ","","_","_"
2,"tu","_","_","tu","CCD","","_","_"
3,"vaco","_","_","vacas","NC","","_","_"
4,"_","_","_","na","CNG","","_","_"
5,"_","_","_","mat","PPR","","_","_"
6,"alaṃ","_","_","ala","CX","","_","_"
7,"samativartitum","_","_","samativṛt","CGDI","","_","_"
1,"mama","_","_","mat","PPR","","_","_"
2,"_","_","_","ca","CCD","","_","_"
3,"_","_","_","api","CX","","_","_"
4,"bhaved","_","_","bhav","V","bhū","_","_"
5,"etad","_","_","tad","PRD","","_","_"
6,"īśvarasya","_","_","īśvara","NC","","_","_"
7,"sato","_","_","as","KDP","","_","_"
8,"mahat","_","_","mahat","JJ","","_","_"
1,"upekṣamāṇasya","_","_","upekṣ","KDP","","_","_"
2,"punar","_","_","punar","CAD","","_","_"
3,"lokānāṃ","_","_","loka","NC","","_","_"
4,"kilbiṣād","_","_","kilbiṣa","NC","","_","_"
5,"bhayam","_","_","bhaya","NC","","_","_"
1,"_","_","_","yad","PRL","","_","_"
2,"_","_","_","ca","CCD","","_","_"
3,"_","_","_","ida","PRD","","_","_"
4,"_","_","_","manyu","NC","","_","_"
5,"_","_","_","ja","JJ","","_","_"
6,"me","_","_","mat","PPR","","_","_"
7,"'gnir","_","_","agni","NC","","_","_"
8,"lokān","_","_","loka","NC","","_","_"
9,"ādātum","_","_","ādā","CGDI","","_","_"
10,"icchati","_","_","iṣ","V","iṣ","_","_"
1,"dahed","_","_","dah","V","dah","_","_"
2,"eṣa","_","_","tad","PRD","","_","_"
3,"ca","_","_","ca","CCD","","_","_"
4,"mām","_","_","mat","PPR","","_","_"
5,"eva","_","_","eva","CEM","","_","_"
6,"nigṛhītaḥ","_","_","nigrah","PPP","","_","_"
7,"_","_","_","sva","JJ","","_","_"
8,"_","_","_","tejas","NC","","_","_"
1,"bhavatāṃ","_","_","bhavat","JJ","","_","_"
2,"ca","_","_","ca","CCD","","_","_"
3,"vijānāmi","_","_","vijān","V","vijñā","_","_"
4,"_","_","_","sarva","JQ","","_","_"
5,"_","_","_","loka","NC","","_","_"
6,"_","_","_","hita","NC","","_","_"
7,"_","_","_","īpsutā","NC","","_","_"
1,"tasmād","_","_","tad","PRD","","_","_"
2,"_","_","_","yad","PRL","","_","_"
3,"_","_","_","śreyas","NC","","_","_"
4,"yacchreyo","_","_","loka","NC","","_","_"
5,"lokānāṃ","_","_","mat","PPR","","_","_"
6,"_","_","_","ca","CCD","","_","_"
7,"_","_","_","īśvara","NC","","_","_"
1,"pitara","_","_","pitṛ","NC","","_","_"
2,"ūcuḥ","_","_","vak","V","vac","_","_"
1,"ya","_","_","yad","PRL","","_","_"
2,"eṣa","_","_","tad","PRD","","_","_"
3,"_","_","_","manyu","NC","","_","_"
4,"_","_","_","ja","JJ","","_","_"
5,"_","_","_","tvat","PPR","","_","_"
6,"'gnir","_","_","agni","NC","","_","_"
7,"lokān","_","_","loka","NC","","_","_"
8,"ādātum","_","_","ādā","CGDI","","_","_"
9,"icchati","_","_","iṣ","V","iṣ","_","_"
1,"apsu","_","_","ap","NC","","_","_"
2,"taṃ","_","_","tad","PRD","","_","_"
3,"muñca","_","_","muñc","V","muc","_","_"
4,"bhadraṃ","_","_","bhadra","NC","","_","_"
5,"te","_","_","tvat","PPR","","_","_"
6,"lokā","_","_","loka","NC","","_","_"
7,"hy","_","_","hi","CX","","_","_"
8,"apsu","_","_","ap","NC","","_","_"
9,"pratiṣṭhitāḥ","_","_","pratiṣṭhā","PPP","","_","_"
1,"kuru","_","_","kar","V","kṛ","_","_"
2,"tāta","_","_","tāta","NC","","_","_"
3,"vaco","_","_","vacas","NC","","_","_"
4,"'smākaṃ","_","_","mat","PPR","","_","_"
5,"mā","_","_","mat","PPR","","_","_"
6,"lokān","_","_","loka","NC","","_","_"
7,"hiṃsi","_","_","hiṃs","V","hiṃs","_","_"
8,"_","_","_","ca","CCD","","_","_"
9,"_","_","_","adhunā","CX","","_","_"
1,"_","_","_","āpas","NC","","_","_"
2,"_","_","_","maya","JJ","","_","_"
3,"_","_","_","sarva","JQ","","_","_"
4,"_","_","_","rasa","NC","","_","_"
5,"sarvam","_","_","sarva","JQ","","_","_"
6,"_","_","_","āpas","NC","","_","_"
7,"_","_","_","maya","JJ","","_","_"
8,"jagat","_","_","jagat","NC","","_","_"
1,"tasmād","_","_","tad","PRD","","_","_"
2,"apsu","_","_","ap","NC","","_","_"
3,"_","_","_","vimuñc","V","vimuc","_","_"
4,"_","_","_","ida","PRD","","_","_"
5,"_","_","_","krodha","NC","","_","_"
6,"_","_","_","agni","NC","","_","_"
7,"dvijasattama","_","_","dvijasattama","NC","","_","_"
1,"ayaṃ","_","_","ida","PRD","","_","_"
2,"tiṣṭhatu","_","_","tiṣṭh","V","sthā","_","_"
3,"te","_","_","tvat","PPR","","_","_"
4,"vipra","_","_","vipra","NC","","_","_"
5,"_","_","_","yadi","CSB","","_","_"
6,"_","_","_","iṣ","V","iṣ","_","_"
7,"_","_","_","mahat","JJ","","_","_"
8,"_","_","_","udadhi","NC","","_","_"
1,"_","_","_","manyu","NC","","_","_"
2,"_","_","_","ja","JJ","","_","_"
3,"'gnir","_","_","agni","NC","","_","_"
4,"dahann","_","_","dah","KDP","","_","_"
5,"āpo","_","_","ap","NC","","_","_"
6,"lokā","_","_","loka","NC","","_","_"
7,"_","_","_","hi","CX","","_","_"
8,"_","_","_","āpas","NC","","_","_"
9,"_","_","_","maya","JJ","","_","_"
10,"smṛtāḥ","_","_","smṛ","PPP","","_","_"
1,"evaṃ","_","_","eva","CX","","_","_"
2,"pratijñā","_","_","pratijñā","NC","","_","_"
3,"_","_","_","satya","JJ","","_","_"
4,"_","_","_","ida","PRD","","_","_"
5,"_","_","_","tvat","PPR","","_","_"
6,"_","_","_","anagha","JJ","","_","_"
7,"bhaviṣyati","_","_","bhav","V","bhū","_","_"
1,"na","_","_","na","CNG","","_","_"
2,"_","_","_","ca","CCD","","_","_"
3,"_","_","_","eva","CEM","","_","_"
4,"_","_","_","sa_saha","CX","","_","_"
5,"_","_","_","amara","NC","","_","_"
6,"lokā","_","_","loka","NC","","_","_"
7,"gamiṣyanti","_","_","gacch","V","gam","_","_"
8,"parābhavam","_","_","parābhava","NC","","_","_"
1,"vasiṣṭha","_","_","vasiṣṭha","NC","","_","_"
2,"uvāca","_","_","vak","V","vac","_","_"
1,"_","_","_","tatas","CX","","_","_"
2,"_","_","_","tad","PRD","","_","_"
3,"_","_","_","krodha","NC","","_","_"
4,"_","_","_","ja","JJ","","_","_"
5,"tāta","_","_","tāta","NC","","_","_"
6,"aurvo","_","_","aurva","NC","","_","_"
7,"'gniṃ","_","_","agni","NC","","_","_"
8,"varuṇālaye","_","_","varuṇālaya","NC","","_","_"
1,"utsasarja","_","_","utsasarja","V","utsṛj","_","_"
2,"sa","_","_","tad","PRD","","_","_"
3,"_","_","_","ca","CCD","","_","_"
4,"_","_","_","eva","CEM","","_","_"
5,"_","_","_","ap","NC","","_","_"
6,"upayuṅkte","_","_","upayuj","V","upayuj","_","_"
7,"mahodadhau","_","_","mahodadhi","NC","","_","_"
1,"_","_","_","mahat","JJ","","_","_"
2,"_","_","_","haya","NC","","_","_"
3,"_","_","_","śiras","NC","","_","_"
4,"bhūtvā","_","_","bhū","CGDA","","_","_"
5,"yat","_","_","yad","PRL","","_","_"
6,"tad","_","_","tad","PRD","","_","_"
7,"_","_","_","veda","NC","","_","_"
8,"_","_","_","vid","JJ","","_","_"
9,"viduḥ","_","_","vid","V","vid","_","_"
1,"tam","_","_","tad","PRD","","_","_"
2,"agnim","_","_","agni","NC","","_","_"
3,"udgiran","_","_","udgṛ","KDP","","_","_"
4,"vaktrāt","_","_","vaktra","NC","","_","_"
5,"_","_","_","pib","V","pā","_","_"
6,"_","_","_","ap","NC","","_","_"
7,"mahodadhau","_","_","mahodadhi","NC","","_","_"
1,"tasmāt","_","_","tad","PRD","","_","_"
2,"tvam","_","_","tvat","PPR","","_","_"
3,"api","_","_","api","CX","","_","_"
4,"bhadraṃ","_","_","bhadra","NC","","_","_"
5,"te","_","_","tvat","PPR","","_","_"
6,"na","_","_","na","CNG","","_","_"
7,"lokān","_","_","loka","NC","","_","_"
8,"hantum","_","_","han","CGDI","","_","_"
9,"arhasi","_","_","arh","V","arh","_","_"
1,"parāśara","_","_","parāśara","NC","","_","_"
2,"parān","_","_","para","PPX","","_","_"
3,"dharmāñ","_","_","dharma","NC","","_","_"
4,"jānañ","_","_","jñā","KDP","","_","_"
5,"jñānavatāṃ","_","_","jñānavat","JJ","","_","_"
6,"vara","_","_","vara","JJ","","_","_"
