"WordID","word","NormSTEM","suffix","lemma","PoS","Root","NormSuffix","NormWord"
1,"arātīyor","_","_","arātīyu","JJ","","_","_"
2,"bhrātṛvyasya","_","_","bhrātṛvya","NC","","_","_"
3,"durhārdo","_","_","durhārd","JJ","","_","_"
4,"dviṣataḥ","_","_","dviṣ","KDP","","_","_"
5,"śiraḥ","_","_","śiras","NC","","_","_"
1,"api","_","_","api","CX","","_","_"
2,"vṛścāmy","_","_","vraśc","V","vraśc","_","_"
3,"ojasā","_","_","ojas","NC","","_","_"
1,"varma","_","_","varman","NC","","_","_"
2,"mahyam","_","_","mat","PPR","","_","_"
3,"ayaṃ","_","_","ida","PRD","","_","_"
4,"maṇiḥ","_","_","maṇi","NC","","_","_"
5,"phālāj","_","_","phāla","NC","","_","_"
6,"jātaḥ","_","_","jan","PPP","","_","_"
7,"kariṣyati","_","_","kar","V","kṛ","_","_"
1,"pūrṇo","_","_","pṛ","PPP","","_","_"
2,"manthena","_","_","mantha","NC","","_","_"
3,"_","_","_","mat","PPR","","_","_"
4,"_","_","_","ga","V","ga","_","_"
5,"rasena","_","_","rasa","NC","","_","_"
6,"saha","_","_","saha","CX","","_","_"
7,"varcasā","_","_","varcas","NC","","_","_"
1,"yat","_","_","yat","CSB","","_","_"
2,"tvā","_","_","tvat","PPR","","_","_"
3,"śikvaḥ","_","_","śikva","JJ","","_","_"
4,"parāvadhīt","_","_","parāvadh","V","parāvadh","_","_"
5,"takṣā","_","_","takṣan","NC","","_","_"
6,"hastena","_","_","hasta","NC","","_","_"
7,"vāsyā","_","_","vāsi","NC","","_","_"
1,"āpas","_","_","ap","NC","","_","_"
2,"tvā","_","_","tvat","PPR","","_","_"
3,"tasmāj","_","_","tad","PRD","","_","_"
4,"jīvalāḥ","_","_","jīvala","JJ","","_","_"
5,"punantu","_","_","pū","V","pū","_","_"
6,"śucayaḥ","_","_","śuci","JJ","","_","_"
7,"śucim","_","_","śuci","JJ","","_","_"
1,"_","_","_","hiraṇya","NC","","_","_"
2,"_","_","_","sraj","NC","","_","_"
3,"ayaṃ","_","_","ida","PRD","","_","_"
4,"maṇiḥ","_","_","maṇi","NC","","_","_"
5,"śraddhāṃ","_","_","śraddhā","NC","","_","_"
6,"yajñaṃ","_","_","yajña","NC","","_","_"
7,"maho","_","_","mahas","NC","","_","_"
8,"dadhat","_","_","dhā","KDP","","_","_"
1,"gṛhe","_","_","gṛha","NC","","_","_"
2,"vasatu","_","_","vas","V","vas","_","_"
3,"no","_","_","mat","PPR","","_","_"
4,"'tithiḥ","_","_","atithi","NC","","_","_"
1,"tasmai","_","_","tad","PRD","","_","_"
2,"ghṛtaṃ","_","_","ghṛta","NC","","_","_"
3,"surāṃ","_","_","surā","NC","","_","_"
4,"madhv","_","_","madhu","NC","","_","_"
5,"_","_","_","anna","NC","","_","_"
6,"_","_","_","anna","NC","","_","_"
7,"kṣadāmahe","_","_","kṣad","V","kṣad","_","_"
1,"sa","_","_","tad","PRD","","_","_"
2,"naḥ","_","_","mat","PPR","","_","_"
3,"_","_","_","pitṛ","NC","","_","_"
4,"_","_","_","iva","CCM","","_","_"
5,"putrebhyaḥ","_","_","putra","NC","","_","_"
6,"śreyaḥ","_","_","śreyas","JJ","","_","_"
7,"śreyaś","_","_","śreyas","JJ","","_","_"
8,"cikitsatu","_","_","cikits","V","cikits","_","_"
9,"bhūyo","_","_","bhūyas","CX","","_","_"
10,"bhūyaḥ","_","_","bhūyas","CX","","_","_"
11,"śvaḥ","_","_","śvas","CX","","_","_"
12,"śvo","_","_","śvas","CX","","_","_"
13,"devebhyo","_","_","deva","NC","","_","_"
14,"maṇir","_","_","maṇi","NC","","_","_"
15,"etya","_","_","e","CGDA","","_","_"
1,"yam","_","_","yad","PRL","","_","_"
2,"abadhnād","_","_","bandh","V","bandh","_","_"
3,"bṛhaspatir","_","_","bṛhaspati","NC","","_","_"
4,"maṇiṃ","_","_","maṇi","NC","","_","_"
5,"phālaṃ","_","_","phāla","NC","","_","_"
6,"ghṛtaścutam","_","_","ghṛtaścut","JJ","","_","_"
7,"ugraṃ","_","_","ugra","JJ","","_","_"
8,"khadiram","_","_","khadira","NC","","_","_"
9,"ojase","_","_","ojas","NC","","_","_"
1,"tam","_","_","tad","PRD","","_","_"
2,"agniḥ","_","_","agni","NC","","_","_"
3,"praty","_","_","prati","CADP","","_","_"
4,"amuñcata","_","_","muñc","V","muc","_","_"
5,"so","_","_","tad","PRD","","_","_"
6,"asmai","_","_","ida","PRD","","_","_"
7,"duha","_","_","duh","V","duh","_","_"
8,"ājyaṃ","_","_","ājya","NC","","_","_"
9,"bhūyo","_","_","bhūyas","CX","","_","_"
10,"bhūyaḥ","_","_","bhūyas","CX","","_","_"
11,"śvaḥ","_","_","śvas","CX","","_","_"
12,"śvas","_","_","śvas","CX","","_","_"
13,"tena","_","_","tad","PRD","","_","_"
14,"tvaṃ","_","_","tvat","PPR","","_","_"
15,"dviṣato","_","_","dviṣ","KDP","","_","_"
16,"jahi","_","_","han","V","han","_","_"
1,"yam","_","_","yad","PRL","","_","_"
2,"abadhnād","_","_","bandh","V","bandh","_","_"
3,"bṛhaspatir","_","_","bṛhaspati","NC","","_","_"
4,"maṇiṃ","_","_","maṇi","NC","","_","_"
5,"phālaṃ","_","_","phāla","NC","","_","_"
6,"ghṛtaścutam","_","_","ghṛtaścut","JJ","","_","_"
7,"ugraṃ","_","_","ugra","JJ","","_","_"
8,"khadiram","_","_","khadira","NC","","_","_"
9,"ojase","_","_","ojas","NC","","_","_"
1,"tam","_","_","tad","PRD","","_","_"
2,"indraḥ","_","_","indra","NC","","_","_"
3,"praty","_","_","prati","CADP","","_","_"
4,"_","_","_","muñc","V","muc","_","_"
5,"_","_","_","ojas","NC","","_","_"
6,"vīryāya","_","_","vīrya","NC","","_","_"
7,"kam","_","_","kaṃ","CX","","_","_"
1,"so","_","_","tad","PRD","","_","_"
2,"asmai","_","_","ida","PRD","","_","_"
3,"balam","_","_","bala","NC","","_","_"
4,"id","_","_","id","CEM","","_","_"
5,"duhe","_","_","duh","V","duh","_","_"
6,"bhūyo","_","_","bhūyas","CX","","_","_"
7,"bhūyaḥ","_","_","bhūyas","CX","","_","_"
8,"śvaḥ","_","_","śvas","CX","","_","_"
9,"śvas","_","_","śvas","CX","","_","_"
10,"tena","_","_","tad","PRD","","_","_"
11,"tvaṃ","_","_","tvat","PPR","","_","_"
12,"dviṣato","_","_","dviṣ","KDP","","_","_"
13,"jahi","_","_","han","V","han","_","_"
1,"yam","_","_","yad","PRL","","_","_"
2,"abadhnād","_","_","bandh","V","bandh","_","_"
3,"bṛhaspatir","_","_","bṛhaspati","NC","","_","_"
4,"maṇiṃ","_","_","maṇi","NC","","_","_"
5,"phālaṃ","_","_","phāla","NC","","_","_"
6,"ghṛtaścutam","_","_","ghṛtaścut","JJ","","_","_"
7,"ugram","_","_","ugra","JJ","","_","_"
8,"khadiram","_","_","khadira","NC","","_","_"
9,"ojase","_","_","ojas","NC","","_","_"
1,"taṃ","_","_","tad","PRD","","_","_"
2,"somaḥ","_","_","soma","NC","","_","_"
3,"praty","_","_","prati","CADP","","_","_"
4,"amuñcata","_","_","muñc","V","muc","_","_"
5,"mahe","_","_","mah","JJ","","_","_"
6,"śrotrāya","_","_","śrotra","NC","","_","_"
7,"cakṣase","_","_","cakṣas","NC","","_","_"
1,"so","_","_","tad","PRD","","_","_"
2,"asmai","_","_","ida","PRD","","_","_"
3,"varca","_","_","varcas","NC","","_","_"
4,"id","_","_","id","CEM","","_","_"
5,"duhe","_","_","duh","V","duh","_","_"
6,"bhūyo","_","_","bhūyas","CX","","_","_"
7,"bhūyaḥ","_","_","bhūyas","CX","","_","_"
8,"śvaḥ","_","_","śvas","CX","","_","_"
9,"śvas","_","_","śvas","CX","","_","_"
10,"tena","_","_","tad","PRD","","_","_"
11,"tvam","_","_","tvat","PPR","","_","_"
12,"dviṣato","_","_","dviṣ","KDP","","_","_"
13,"jahi","_","_","han","V","han","_","_"
1,"yam","_","_","yad","PRL","","_","_"
2,"abadhnād","_","_","bandh","V","bandh","_","_"
3,"bṛhaspatir","_","_","bṛhaspati","NC","","_","_"
4,"maṇiṃ","_","_","maṇi","NC","","_","_"
5,"phālaṃ","_","_","phāla","NC","","_","_"
6,"ghṛtaścutam","_","_","ghṛtaścut","JJ","","_","_"
7,"ugraṃ","_","_","ugra","JJ","","_","_"
8,"khadiram","_","_","khadira","NC","","_","_"
9,"ojase","_","_","ojas","NC","","_","_"
1,"taṃ","_","_","tad","PRD","","_","_"
2,"sūryaḥ","_","_","sūrya","NC","","_","_"
3,"praty","_","_","prati","CADP","","_","_"
4,"amuñcata","_","_","muñc","V","muc","_","_"
5,"_","_","_","tad","PRD","","_","_"
6,"_","_","_","ida","PRD","","_","_"
7,"ajayad","_","_","jay","V","ji","_","_"
8,"diśaḥ","_","_","diś","NC","","_","_"
1,"so","_","_","tad","PRD","","_","_"
2,"asmai","_","_","ida","PRD","","_","_"
3,"bhūtim","_","_","bhūti","NC","","_","_"
4,"id","_","_","id","CEM","","_","_"
5,"duhe","_","_","duh","V","duh","_","_"
6,"bhūyo","_","_","bhūyas","CX","","_","_"
7,"bhūyaḥ","_","_","bhūyas","CX","","_","_"
8,"śvaḥ","_","_","śvas","CX","","_","_"
9,"śvas","_","_","śvas","CX","","_","_"
10,"tena","_","_","tad","PRD","","_","_"
11,"tvaṃ","_","_","tvat","PPR","","_","_"
12,"dviṣato","_","_","dviṣ","KDP","","_","_"
13,"jahi","_","_","han","V","han","_","_"
1,"yam","_","_","yad","PRL","","_","_"
2,"abadhnād","_","_","bandh","V","bandh","_","_"
3,"bṛhaspatir","_","_","bṛhaspati","NC","","_","_"
4,"maṇiṃ","_","_","maṇi","NC","","_","_"
5,"phālaṃ","_","_","phāla","NC","","_","_"
6,"ghṛtaścutam","_","_","ghṛtaścut","JJ","","_","_"
7,"ugram","_","_","ugra","JJ","","_","_"
8,"khadiram","_","_","khadira","NC","","_","_"
9,"ojase","_","_","ojas","NC","","_","_"
1,"tam","_","_","tad","PRD","","_","_"
2,"bibhrac","_","_","bhṛ","KDP","","_","_"
3,"candramā","_","_","candramas","NC","","_","_"
4,"maṇim","_","_","maṇi","NC","","_","_"
5,"asurāṇāṃ","_","_","asura","NC","","_","_"
6,"puro","_","_","pur","NC","","_","_"
7,"'jayad","_","_","jay","V","ji","_","_"
8,"dānavānāṃ","_","_","dānava","NC","","_","_"
9,"hiraṇyayīḥ","_","_","hiraṇyaya","JJ","","_","_"
1,"so","_","_","tad","PRD","","_","_"
2,"asmai","_","_","ida","PRD","","_","_"
3,"śriyam","_","_","śrī","NC","","_","_"
4,"id","_","_","id","CEM","","_","_"
5,"duhe","_","_","duh","V","duh","_","_"
6,"bhūyo","_","_","bhūyas","CX","","_","_"
7,"bhūyaḥ","_","_","bhūyas","CX","","_","_"
8,"śvaḥ","_","_","śvas","CX","","_","_"
9,"śvas","_","_","śvas","CX","","_","_"
10,"tena","_","_","tad","PRD","","_","_"
11,"tvaṃ","_","_","tvat","PPR","","_","_"
12,"dviṣato","_","_","dviṣ","KDP","","_","_"
13,"jahi","_","_","han","V","han","_","_"
1,"yam","_","_","yad","PRL","","_","_"
2,"abadhnād","_","_","bandh","V","bandh","_","_"
3,"bṛhaspatir","_","_","bṛhaspati","NC","","_","_"
4,"vātāya","_","_","vāta","NC","","_","_"
5,"maṇim","_","_","maṇi","NC","","_","_"
6,"āśave","_","_","āśu","JJ","","_","_"
1,"so","_","_","tad","PRD","","_","_"
2,"asmai","_","_","ida","PRD","","_","_"
3,"vājinam","_","_","vājina","NC","","_","_"
4,"id","_","_","id","CEM","","_","_"
5,"duhe","_","_","duh","V","duh","_","_"
6,"bhūyo","_","_","bhūyas","CX","","_","_"
7,"bhūyaḥ","_","_","bhūyas","CX","","_","_"
8,"śvaḥ","_","_","śvas","CX","","_","_"
9,"śvas","_","_","śvas","CX","","_","_"
10,"tena","_","_","tad","PRD","","_","_"
11,"tvaṃ","_","_","tvat","PPR","","_","_"
12,"dviṣato","_","_","dviṣ","KDP","","_","_"
13,"jahi","_","_","han","V","han","_","_"
1,"yam","_","_","yad","PRL","","_","_"
2,"abadhnād","_","_","bandh","V","bandh","_","_"
3,"bṛhaspatir","_","_","bṛhaspati","NC","","_","_"
4,"vātāya","_","_","vāta","NC","","_","_"
5,"maṇim","_","_","maṇi","NC","","_","_"
6,"āśave","_","_","āśu","JJ","","_","_"
1,"_","_","_","tad","PRD","","_","_"
2,"_","_","_","ida","PRD","","_","_"
3,"maṇinā","_","_","maṇi","NC","","_","_"
4,"kṛṣim","_","_","kṛṣi","NC","","_","_"
5,"aśvināv","_","_","aśvin","NC","","_","_"
6,"abhi","_","_","abhi","CADP","","_","_"
7,"rakṣataḥ","_","_","rakṣ","V","rakṣ","_","_"
1,"sa","_","_","tad","PRD","","_","_"
2,"bhiṣagbhyāṃ","_","_","bhiṣaj","NC","","_","_"
3,"maho","_","_","mahas","NC","","_","_"
4,"duhe","_","_","duh","V","duh","_","_"
5,"bhūyo","_","_","bhūyas","CX","","_","_"
6,"bhūyaḥ","_","_","bhūyas","CX","","_","_"
7,"śvaḥ","_","_","śvas","CX","","_","_"
8,"śvas","_","_","śvas","CX","","_","_"
9,"tena","_","_","tad","PRD","","_","_"
10,"tvaṃ","_","_","tvat","PPR","","_","_"
11,"dviṣato","_","_","dviṣ","KDP","","_","_"
12,"jahi","_","_","han","V","han","_","_"
1,"yam","_","_","yad","PRL","","_","_"
2,"abadhnād","_","_","bandh","V","bandh","_","_"
3,"bṛhaspatir","_","_","bṛhaspati","NC","","_","_"
4,"vātāya","_","_","vāta","NC","","_","_"
5,"maṇim","_","_","maṇi","NC","","_","_"
6,"āśave","_","_","āśu","JJ","","_","_"
1,"tam","_","_","tad","PRD","","_","_"
2,"bibhrat","_","_","bhṛ","KDP","","_","_"
3,"savitā","_","_","savitṛ","NC","","_","_"
4,"maṇiṃ","_","_","maṇi","NC","","_","_"
5,"_","_","_","tad","PRD","","_","_"
6,"_","_","_","ida","PRD","","_","_"
7,"ajayat","_","_","jay","V","ji","_","_"
8,"svaḥ","_","_","svar","NC","","_","_"
1,"so","_","_","tad","PRD","","_","_"
2,"asmai","_","_","ida","PRD","","_","_"
3,"sūnṛtāṃ","_","_","sūnṛtā","NC","","_","_"
4,"duhe","_","_","duh","V","duh","_","_"
5,"bhūyo","_","_","bhūyas","CX","","_","_"
6,"bhūyaḥ","_","_","bhūyas","CX","","_","_"
7,"śvaḥ","_","_","śvas","CX","","_","_"
8,"śvas","_","_","śvas","CX","","_","_"
9,"tena","_","_","tad","PRD","","_","_"
10,"tvaṃ","_","_","tvat","PPR","","_","_"
11,"dviṣato","_","_","dviṣ","KDP","","_","_"
12,"jahi","_","_","han","V","han","_","_"
1,"yam","_","_","yad","PRL","","_","_"
2,"abadhnād","_","_","bandh","V","bandh","_","_"
3,"bṛhaspatir","_","_","bṛhaspati","NC","","_","_"
4,"vātāya","_","_","vāta","NC","","_","_"
5,"maṇim","_","_","maṇi","NC","","_","_"
6,"āśave","_","_","āśu","JJ","","_","_"
1,"tam","_","_","tad","PRD","","_","_"
2,"āpo","_","_","ap","NC","","_","_"
3,"bibhratīr","_","_","bhṛ","KDP","","_","_"
4,"maṇiṃ","_","_","maṇi","NC","","_","_"
5,"sadā","_","_","sadā","CAD","","_","_"
6,"dhāvanty","_","_","dhāv","V","dhāv","_","_"
7,"akṣitāḥ","_","_","akṣita","JJ","","_","_"
1,"sa","_","_","tad","PRD","","_","_"
2,"ābhyo","_","_","ida","PRD","","_","_"
3,"'mṛtam","_","_","amṛta","NC","","_","_"
4,"id","_","_","id","CEM","","_","_"
5,"duhe","_","_","duh","V","duh","_","_"
6,"bhūyo","_","_","bhūyas","CX","","_","_"
7,"bhūyaḥ","_","_","bhūyas","CX","","_","_"
8,"śvaḥ","_","_","śvas","CX","","_","_"
9,"śvas","_","_","śvas","CX","","_","_"
10,"tena","_","_","tad","PRD","","_","_"
11,"tvaṃ","_","_","tvat","PPR","","_","_"
12,"dviṣato","_","_","dviṣ","KDP","","_","_"
13,"jahi","_","_","han","V","han","_","_"
1,"yam","_","_","yad","PRL","","_","_"
2,"abadhnād","_","_","bandh","V","bandh","_","_"
3,"bṛhaspatir","_","_","bṛhaspati","NC","","_","_"
4,"vātāya","_","_","vāta","NC","","_","_"
5,"maṇim","_","_","maṇi","NC","","_","_"
6,"āśave","_","_","āśu","JJ","","_","_"
1,"tam","_","_","tad","PRD","","_","_"
2,"rājā","_","_","rājan","NC","","_","_"
3,"varuṇo","_","_","varuṇa","NC","","_","_"
4,"maṇiṃ","_","_","maṇi","NC","","_","_"
5,"praty","_","_","prati","CADP","","_","_"
6,"amuñcata","_","_","muñc","V","muc","_","_"
7,"śaṃbhuvam","_","_","śambhū","JJ","","_","_"
1,"so","_","_","tad","PRD","","_","_"
2,"asmai","_","_","ida","PRD","","_","_"
3,"satyam","_","_","satya","NC","","_","_"
4,"id","_","_","id","CEM","","_","_"
5,"duhe","_","_","duh","V","duh","_","_"
6,"bhūyo","_","_","bhūyas","CX","","_","_"
7,"bhūyaḥ","_","_","bhūyas","CX","","_","_"
8,"śvaḥ","_","_","śvas","CX","","_","_"
9,"śvas","_","_","śvas","CX","","_","_"
10,"tena","_","_","tad","PRD","","_","_"
11,"tvaṃ","_","_","tvat","PPR","","_","_"
12,"dviṣato","_","_","dviṣ","KDP","","_","_"
13,"jahi","_","_","han","V","han","_","_"
1,"yam","_","_","yad","PRL","","_","_"
2,"abadhnād","_","_","bandh","V","bandh","_","_"
3,"bṛhaspatir","_","_","bṛhaspati","NC","","_","_"
4,"vātāya","_","_","vāta","NC","","_","_"
5,"maṇim","_","_","maṇi","NC","","_","_"
6,"āśave","_","_","āśu","JJ","","_","_"
1,"taṃ","_","_","tad","PRD","","_","_"
2,"devā","_","_","deva","NC","","_","_"
3,"bibhrato","_","_","bhṛ","KDP","","_","_"
4,"maṇiṃ","_","_","maṇi","NC","","_","_"
5,"_","_","_","sarva","JQ","","_","_"
6,"_","_","_","loka","NC","","_","_"
7,"_","_","_","yudh","NC","","_","_"
8,"_","_","_","jay","V","ji","_","_"
1,"sa","_","_","tad","PRD","","_","_"
2,"ebhyo","_","_","ida","PRD","","_","_"
3,"jitim","_","_","jiti","NC","","_","_"
4,"id","_","_","id","CEM","","_","_"
5,"duhe","_","_","duh","V","duh","_","_"
6,"bhūyo","_","_","bhūyas","CX","","_","_"
7,"bhūyaḥ","_","_","bhūyas","CX","","_","_"
8,"śvaḥ","_","_","śvas","CX","","_","_"
9,"śvas","_","_","śvas","CX","","_","_"
10,"tena","_","_","tad","PRD","","_","_"
11,"tvaṃ","_","_","tvat","PPR","","_","_"
12,"dviṣato","_","_","dviṣ","KDP","","_","_"
13,"jahi","_","_","han","V","han","_","_"
1,"yam","_","_","yad","PRL","","_","_"
2,"abadhnād","_","_","bandh","V","bandh","_","_"
3,"bṛhaspatir","_","_","bṛhaspati","NC","","_","_"
4,"vātāya","_","_","vāta","NC","","_","_"
5,"maṇim","_","_","maṇi","NC","","_","_"
6,"āśave","_","_","āśu","JJ","","_","_"
1,"tam","_","_","tad","PRD","","_","_"
2,"imaṃ","_","_","ida","PRD","","_","_"
3,"devatā","_","_","devatā","NC","","_","_"
4,"maṇiṃ","_","_","maṇi","NC","","_","_"
5,"praty","_","_","prati","CADP","","_","_"
6,"amuñcanta","_","_","muñc","V","muc","_","_"
7,"śambhuvam","_","_","śambhū","JJ","","_","_"
1,"sa","_","_","tad","PRD","","_","_"
2,"ābhyo","_","_","ida","PRD","","_","_"
3,"viśvam","_","_","viśva","JQ","","_","_"
4,"id","_","_","id","CEM","","_","_"
5,"duhe","_","_","duh","V","duh","_","_"
6,"bhūyo","_","_","bhūyas","CX","","_","_"
7,"bhūyaḥ","_","_","bhūyas","CX","","_","_"
8,"śvaḥ","_","_","śvas","CX","","_","_"
9,"śvas","_","_","śvas","CX","","_","_"
10,"tena","_","_","tad","PRD","","_","_"
11,"tvaṃ","_","_","tvat","PPR","","_","_"
12,"dviṣato","_","_","dviṣ","KDP","","_","_"
13,"jahi","_","_","han","V","han","_","_"
1,"ṛtavas","_","_","ṛtu","NC","","_","_"
2,"tam","_","_","tad","PRD","","_","_"
3,"_","_","_","bandh","V","bandh","_","_"
4,"_","_","_","ārtava","NC","","_","_"
5,"tam","_","_","tad","PRD","","_","_"
6,"abadhnata","_","_","bandh","V","bandh","_","_"
1,"saṃvatsaras","_","_","saṃvatsara","NC","","_","_"
2,"taṃ","_","_","tad","PRD","","_","_"
3,"baddhvā","_","_","bandh","CGDA","","_","_"
4,"sarvaṃ","_","_","sarva","JQ","","_","_"
5,"bhūtaṃ","_","_","bhū","PPP","","_","_"
6,"vi","_","_","vi","CADP","","_","_"
7,"rakṣati","_","_","rakṣ","V","rakṣ","_","_"
1,"antardeśā","_","_","antardeśa","NC","","_","_"
2,"abadhnata","_","_","bandh","V","bandh","_","_"
3,"pradiśas","_","_","pradiś","NC","","_","_"
4,"tam","_","_","tad","PRD","","_","_"
5,"abadhnata","_","_","bandh","V","bandh","_","_"
1,"_","_","_","prajāpati","NC","","_","_"
2,"_","_","_","sṛj","PPP","","_","_"
3,"maṇir","_","_","maṇi","NC","","_","_"
4,"dviṣato","_","_","dviṣ","KDP","","_","_"
5,"me","_","_","mat","PPR","","_","_"
6,"'dharāṁ","_","_","adhara","JJ","","_","_"
7,"akaḥ","_","_","kar","V","kṛ","_","_"
1,"atharvāṇo","_","_","atharvan","NC","","_","_"
2,"_","_","_","bandh","V","bandh","_","_"
3,"_","_","_","ātharvaṇa","NC","","_","_"
4,"abadhnata","_","_","bandh","V","bandh","_","_"
1,"tair","_","_","tad","PRD","","_","_"
2,"medino","_","_","medin","NC","","_","_"
3,"aṅgiraso","_","_","aṅgiras","NC","","_","_"
4,"dasyūnāṃ","_","_","dasyu","NC","","_","_"
5,"bibhiduḥ","_","_","bhid","V","bhid","_","_"
6,"puras","_","_","pur","NC","","_","_"
7,"tena","_","_","tad","PRD","","_","_"
8,"tvam","_","_","tvat","PPR","","_","_"
9,"dviṣato","_","_","dviṣ","KDP","","_","_"
10,"jahi","_","_","han","V","han","_","_"
1,"taṃ","_","_","tad","PRD","","_","_"
2,"dhātā","_","_","dhātṛ","NC","","_","_"
3,"praty","_","_","prati","CADP","","_","_"
4,"amuñcata","_","_","muñc","V","muc","_","_"
5,"sa","_","_","tad","PRD","","_","_"
6,"bhūtaṃ","_","_","bhū","PPP","","_","_"
7,"vy","_","_","vi","CADP","","_","_"
8,"akalpayat","_","_","kalpay","V","kalpay","_","_"
1,"tena","_","_","tad","PRD","","_","_"
2,"tvaṃ","_","_","tvat","PPR","","_","_"
3,"dviṣato","_","_","dviṣ","KDP","","_","_"
4,"jahi","_","_","han","V","han","_","_"
1,"yam","_","_","yad","PRL","","_","_"
2,"abadhnād","_","_","bandh","V","bandh","_","_"
3,"bṛhaspatir","_","_","bṛhaspati","NC","","_","_"
4,"devebhyo","_","_","deva","NC","","_","_"
5,"_","_","_","asura","NC","","_","_"
6,"_","_","_","kṣiti","NC","","_","_"
1,"sa","_","_","tad","PRD","","_","_"
2,"_","_","_","mat","PPR","","_","_"
3,"_","_","_","ida","PRD","","_","_"
4,"maṇir","_","_","maṇi","NC","","_","_"
5,"āgamad","_","_","āgacch","V","āgam","_","_"
6,"rasena","_","_","rasa","NC","","_","_"
7,"saha","_","_","saha","CX","","_","_"
8,"varcasā","_","_","varcas","NC","","_","_"
1,"yam","_","_","yad","PRL","","_","_"
2,"abadhnād","_","_","bandh","V","bandh","_","_"
3,"bṛhaspatir","_","_","bṛhaspati","NC","","_","_"
4,"devebhyo","_","_","deva","NC","","_","_"
5,"_","_","_","asura","NC","","_","_"
6,"_","_","_","kṣiti","NC","","_","_"
1,"sa","_","_","tad","PRD","","_","_"
2,"_","_","_","mat","PPR","","_","_"
3,"_","_","_","ida","PRD","","_","_"
4,"maṇir","_","_","maṇi","NC","","_","_"
5,"āgamat","_","_","āgacch","V","āgam","_","_"
6,"saha","_","_","saha","CX","","_","_"
7,"gobhir","_","_","go","NC","","_","_"
8,"_","_","_","aja","NC","","_","_"
9,"_","_","_","avi","NC","","_","_"
10,"annena","_","_","anna","NC","","_","_"
11,"prajayā","_","_","prajā","NC","","_","_"
12,"saha","_","_","saha","CX","","_","_"
1,"yam","_","_","yad","PRL","","_","_"
2,"abadhnād","_","_","bandh","V","bandh","_","_"
3,"bṛhaspatir","_","_","bṛhaspati","NC","","_","_"
4,"devebhyo","_","_","deva","NC","","_","_"
5,"_","_","_","asura","NC","","_","_"
6,"_","_","_","kṣiti","NC","","_","_"
1,"sa","_","_","tad","PRD","","_","_"
2,"_","_","_","mat","PPR","","_","_"
3,"_","_","_","ida","PRD","","_","_"
4,"maṇir","_","_","maṇi","NC","","_","_"
5,"āgamat","_","_","āgacch","V","āgam","_","_"
6,"saha","_","_","saha","CX","","_","_"
7,"_","_","_","vrīhi","NC","","_","_"
8,"_","_","_","yava","NC","","_","_"
9,"mahasā","_","_","mahas","NC","","_","_"
10,"bhūtyā","_","_","bhūti","NC","","_","_"
11,"saha","_","_","saha","CX","","_","_"
1,"yam","_","_","yad","PRL","","_","_"
2,"abadhnād","_","_","bandh","V","bandh","_","_"
3,"bṛhaspatir","_","_","bṛhaspati","NC","","_","_"
4,"devebhyo","_","_","deva","NC","","_","_"
5,"_","_","_","asura","NC","","_","_"
6,"_","_","_","kṣiti","NC","","_","_"
1,"sa","_","_","tad","PRD","","_","_"
2,"_","_","_","mat","PPR","","_","_"
3,"_","_","_","ida","PRD","","_","_"
4,"maṇir","_","_","maṇi","NC","","_","_"
5,"āgaman","_","_","āga","V","āga","_","_"
6,"madhor","_","_","madhu","NC","","_","_"
7,"ghṛtasya","_","_","ghṛta","NC","","_","_"
8,"dhārayā","_","_","dhārā","NC","","_","_"
9,"kīlālena","_","_","kīlāla","NC","","_","_"
10,"maṇiḥ","_","_","maṇi","NC","","_","_"
11,"saha","_","_","saha","CX","","_","_"
1,"yam","_","_","yad","PRL","","_","_"
2,"abadhnād","_","_","bandh","V","bandh","_","_"
3,"bṛhaspatir","_","_","bṛhaspati","NC","","_","_"
4,"devebhyo","_","_","deva","NC","","_","_"
5,"_","_","_","asura","NC","","_","_"
6,"_","_","_","kṣiti","NC","","_","_"
1,"sa","_","_","tad","PRD","","_","_"
2,"_","_","_","mat","PPR","","_","_"
3,"_","_","_","ida","PRD","","_","_"
4,"maṇir","_","_","maṇi","NC","","_","_"
5,"āgamad","_","_","āgacch","V","āgam","_","_"
6,"ūrjayā","_","_","ūrjā","NC","","_","_"
7,"payasā","_","_","payas","NC","","_","_"
8,"saha","_","_","saha","CX","","_","_"
9,"draviṇena","_","_","draviṇa","NC","","_","_"
10,"śriyā","_","_","śrī","NC","","_","_"
11,"saha","_","_","saha","CX","","_","_"
1,"yam","_","_","yad","PRL","","_","_"
2,"abadhnād","_","_","bandh","V","bandh","_","_"
3,"bṛhaspatir","_","_","bṛhaspati","NC","","_","_"
4,"devebhyo","_","_","deva","NC","","_","_"
5,"_","_","_","asura","NC","","_","_"
6,"_","_","_","kṣiti","NC","","_","_"
1,"sa","_","_","tad","PRD","","_","_"
2,"_","_","_","mat","PPR","","_","_"
3,"_","_","_","ida","PRD","","_","_"
4,"maṇir","_","_","maṇi","NC","","_","_"
5,"āgamat","_","_","āgacch","V","āgam","_","_"
6,"tejasā","_","_","tejas","NC","","_","_"
7,"tviṣyā","_","_","tviṣi","NC","","_","_"
8,"saha","_","_","saha","CX","","_","_"
9,"yaśasā","_","_","yaśas","NC","","_","_"
10,"kīrtyā","_","_","kīrti","NC","","_","_"
11,"saha","_","_","saha","CX","","_","_"
1,"yam","_","_","yad","PRL","","_","_"
2,"abadhnād","_","_","bandh","V","bandh","_","_"
3,"bṛhaspatir","_","_","bṛhaspati","NC","","_","_"
4,"devebhyo","_","_","deva","NC","","_","_"
5,"_","_","_","asura","NC","","_","_"
6,"_","_","_","kṣiti","NC","","_","_"
1,"sa","_","_","tad","PRD","","_","_"
2,"_","_","_","mat","PPR","","_","_"
3,"_","_","_","ida","PRD","","_","_"
4,"maṇir","_","_","maṇi","NC","","_","_"
5,"āgamat","_","_","āgacch","V","āgam","_","_"
6,"sarvābhir","_","_","sarva","JQ","","_","_"
7,"bhūtibhiḥ","_","_","bhūti","NC","","_","_"
8,"saha","_","_","saha","CX","","_","_"
1,"tam","_","_","tad","PRD","","_","_"
2,"imaṃ","_","_","ida","PRD","","_","_"
3,"devatā","_","_","devatā","NC","","_","_"
4,"maṇiṃ","_","_","maṇi","NC","","_","_"
5,"mahyaṃ","_","_","mat","PPR","","_","_"
6,"dadatu","_","_","dad","V","dā","_","_"
7,"puṣṭaye","_","_","puṣṭi","NC","","_","_"
1,"abhibhuṃ","_","_","abhibhu","JJ","","_","_"
2,"_","_","_","kṣatra","NC","","_","_"
3,"_","_","_","vardhana","JJ","","_","_"
4,"_","_","_","sapatna","NC","","_","_"
5,"_","_","_","dambhana","JJ","","_","_"
6,"maṇim","_","_","maṇi","NC","","_","_"
1,"brahmaṇā","_","_","brahman","NC","","_","_"
2,"tejasā","_","_","tejas","NC","","_","_"
3,"saha","_","_","saha","CX","","_","_"
4,"prati","_","_","prati","CADP","","_","_"
5,"muñcāmi","_","_","muñc","V","muc","_","_"
6,"me","_","_","mat","PPR","","_","_"
7,"śivam","_","_","śiva","JJ","","_","_"
1,"asapatnaḥ","_","_","asapatna","JJ","","_","_"
2,"_","_","_","sapatna","NC","","_","_"
3,"_","_","_","han","JJ","","_","_"
4,"sapatnān","_","_","sapatna","NC","","_","_"
5,"me","_","_","mat","PPR","","_","_"
6,"'dharāṁ","_","_","adhara","JJ","","_","_"
7,"akaḥ","_","_","kar","V","kṛ","_","_"
1,"uttaraṃ","_","_","uttara","JJ","","_","_"
2,"dviṣato","_","_","dviṣ","KDP","","_","_"
3,"mām","_","_","mat","PPR","","_","_"
4,"ayaṃ","_","_","ida","PRD","","_","_"
5,"maṇiḥ","_","_","maṇi","NC","","_","_"
6,"kṛṇotu","_","_","kar","V","kṛ","_","_"
7,"_","_","_","deva","NC","","_","_"
8,"_","_","_","jā","JJ","","_","_"
1,"yasya","_","_","yad","PRL","","_","_"
2,"lokā","_","_","loka","NC","","_","_"
3,"ime","_","_","ida","PRD","","_","_"
4,"trayaḥ","_","_","tri","NUM","","_","_"
5,"payo","_","_","payas","NC","","_","_"
6,"dugdham","_","_","duh","PPP","","_","_"
7,"upāsate","_","_","ās","V","ās","_","_"
1,"sa","_","_","tad","PRD","","_","_"
2,"_","_","_","mat","PPR","","_","_"
3,"_","_","_","ida","PRD","","_","_"
4,"adhi","_","_","adhi","CADP","","_","_"
5,"rohatu","_","_","roh","V","ruh","_","_"
6,"maṇiḥ","_","_","maṇi","NC","","_","_"
7,"śraiṣṭhyāya","_","_","śraiṣṭhya","NC","","_","_"
8,"mūrdhataḥ","_","_","mūrdhan","NC","","_","_"
1,"yaṃ","_","_","yad","PRL","","_","_"
2,"devāḥ","_","_","deva","NC","","_","_"
3,"pitaro","_","_","pitṛ","NC","","_","_"
4,"manuṣyā","_","_","manuṣya","NC","","_","_"
5,"upajīvanti","_","_","upajīv","V","upajīv","_","_"
6,"sarvadā","_","_","sarvadā","CX","","_","_"
1,"sa","_","_","tad","PRD","","_","_"
2,"_","_","_","mat","PPR","","_","_"
3,"_","_","_","ida","PRD","","_","_"
4,"adhi","_","_","adhi","CADP","","_","_"
5,"rohatu","_","_","roh","V","ruh","_","_"
6,"maṇiḥ","_","_","maṇi","NC","","_","_"
7,"śraiṣṭhyāya","_","_","śraiṣṭhya","NC","","_","_"
8,"mūrdhataḥ","_","_","mūrdhan","NC","","_","_"
1,"yathā","_","_","yathā","CCM","","_","_"
2,"bījam","_","_","bīja","NC","","_","_"
3,"urvarāyāṃ","_","_","urvarā","NC","","_","_"
4,"kṛṣṭe","_","_","kṛṣ","PPP","","_","_"
5,"phālena","_","_","phāla","NC","","_","_"
6,"rohati","_","_","roh","V","ruh","_","_"
1,"evā","_","_","eva","CEM","","_","_"
2,"mayi","_","_","mat","PPR","","_","_"
3,"prajā","_","_","prajā","NC","","_","_"
4,"paśavo","_","_","paśu","NC","","_","_"
5,"_","_","_","anna","NC","","_","_"
6,"_","_","_","anna","NC","","_","_"
7,"vi","_","_","vi","CADP","","_","_"
8,"rohatu","_","_","roh","V","ruh","_","_"
1,"yasmai","_","_","yad","PRL","","_","_"
2,"tvā","_","_","tvat","PPR","","_","_"
3,"_","_","_","yajña","NC","","_","_"
4,"_","_","_","vardhana","JJ","","_","_"
5,"maṇe","_","_","maṇi","NC","","_","_"
6,"pratyamucaṃ","_","_","pratimuñc","V","pratimuc","_","_"
7,"śivam","_","_","śiva","JJ","","_","_"
1,"taṃ","_","_","tad","PRD","","_","_"
2,"tvaṃ","_","_","tvat","PPR","","_","_"
3,"_","_","_","śata","NUM","","_","_"
4,"_","_","_","dakṣiṇā","NC","","_","_"
5,"maṇe","_","_","maṇi","NC","","_","_"
6,"śraiṣṭhyāya","_","_","śraiṣṭhya","NC","","_","_"
7,"jinvatāt","_","_","jinv","V","jinv","_","_"
1,"etam","_","_","tad","PRD","","_","_"
2,"idhmaṃ","_","_","idhma","NC","","_","_"
3,"samāhitaṃ","_","_","samādhā","PPP","","_","_"
4,"juṣāṇo","_","_","juṣ","KDP","","_","_"
5,"agne","_","_","agni","NC","","_","_"
6,"prati","_","_","prati","CADP","","_","_"
7,"harya","_","_","harya","V","hary","_","_"
8,"homaiḥ","_","_","homa","NC","","_","_"
1,"tasmin","_","_","tad","PRD","","_","_"
2,"videma","_","_","vid","V","vid","_","_"
3,"sumatiṃ","_","_","sumati","NC","","_","_"
4,"svasti","_","_","svasti","NC","","_","_"
5,"prajām","_","_","prajā","NC","","_","_"
6,"cakṣuḥ","_","_","cakṣus","NC","","_","_"
7,"paśūnt","_","_","paśu","NC","","_","_"
8,"samiddhe","_","_","samindh","PPP","","_","_"
9,"jātavedasi","_","_","jātavedas","NC","","_","_"
10,"brahmaṇā","_","_","brahman","NC","","_","_"
