"WordID","word","NormSTEM","suffix","lemma","PoS","Root","NormSuffix","NormWord"
1,"vaiśaṃpāyana","_","_","vaiśampāyana","NC","","_","_"
2,"uvāca","_","_","vak","V","vac","_","_"
1,"tataḥ","_","_","tatas","CX","","_","_"
2,"satyavatī","_","_","satyavatī","NC","","_","_"
3,"kāle","_","_","kāla","NC","","_","_"
4,"vadhūṃ","_","_","vadhū","NC","","_","_"
5,"snātām","_","_","snā","PPP","","_","_"
6,"ṛtau","_","_","ṛtu","NC","","_","_"
7,"tadā","_","_","tadā","CAD","","_","_"
1,"saṃveśayantī","_","_","saṃveśay","KDP","","_","_"
2,"śayane","_","_","śayana","NC","","_","_"
3,"śanakair","_","_","śanakais","CX","","_","_"
4,"vākyam","_","_","vākya","NC","","_","_"
5,"abravīt","_","_","abravīta","V","brū","_","_"
1,"kausalye","_","_","kausalyā","NC","","_","_"
2,"_","_","_","devara","NC","","_","_"
3,"_","_","_","tvat","PPR","","_","_"
4,"'sti","_","_","as","V","as","_","_"
5,"so","_","_","tad","PRD","","_","_"
6,"'dya","_","_","adya","CX","","_","_"
7,"_","_","_","tvat","PPR","","_","_"
8,"_","_","_","anupraviś","V","anupraviś","_","_"
1,"apramattā","_","_","apramatta","JJ","","_","_"
2,"_","_","_","pratīkṣ","V","pratīkṣ","_","_"
3,"_","_","_","a","PRD","","_","_"
4,"niśīthe","_","_","niśītha","NC","","_","_"
5,"āgamiṣyati","_","_","āga","KDP","","_","_"
1,"_","_","_","śvaśrū","NC","","_","_"
2,"_","_","_","tad","PRD","","_","_"
3,"vacanaṃ","_","_","vacana","NC","","_","_"
4,"śrutvā","_","_","śru","CGDA","","_","_"
5,"śayānā","_","_","śī","KDP","","_","_"
6,"śayane","_","_","śayana","NC","","_","_"
7,"śubhe","_","_","śubha","JJ","","_","_"
1,"_","_","_","tad","PRD","","_","_"
2,"_","_","_","cintay","V","cintay","_","_"
3,"tadā","_","_","tadā","CAD","","_","_"
4,"bhīṣmam","_","_","bhīṣma","NC","","_","_"
5,"_","_","_","anya","PPX","","_","_"
6,"_","_","_","ca","CCD","","_","_"
7,"_","_","_","kuru","NC","","_","_"
8,"_","_","_","puṃgava","NC","","_","_"
1,"tataḥ","_","_","tatas","CX","","_","_"
2,"_","_","_","svap","PPP","","_","_"
3,"_","_","_","jana","NC","","_","_"
4,"_","_","_","prāya","NC","","_","_"
5,"niśīthe","_","_","niśītha","NC","","_","_"
6,"bhagavān","_","_","bhagavat","JJ","","_","_"
7,"ṛṣiḥ","_","_","ṛṣi","NC","","_","_"
1,"tato","_","_","tatas","CX","","_","_"
2,"'mbikāyāṃ","_","_","ambikā","NC","","_","_"
3,"prathamaṃ","_","_","prathama","JJ","","_","_"
4,"niyuktaḥ","_","_","niyuj","PPP","","_","_"
5,"_","_","_","satya","JJ","","_","_"
6,"_","_","_","vāc","NC","","_","_"
7,"ṛṣiḥ","_","_","ṛṣi","NC","","_","_"
1,"dīpyamāneṣu","_","_","dīp","KDP","","_","_"
2,"dīpeṣu","_","_","dīpa","NC","","_","_"
3,"śayanaṃ","_","_","śayana","NC","","_","_"
4,"praviveśa","_","_","praviś","V","praviś","_","_"
5,"ha","_","_","ha","CEM","","_","_"
1,"satyavatyā","_","_","satyavatī","NC","","_","_"
2,"_","_","_","niyuj","PPP","","_","_"
3,"_","_","_","tu","CCD","","_","_"
4,"_","_","_","satya","JJ","","_","_"
5,"_","_","_","vāc","NC","","_","_"
6,"_","_","_","ṛṣi","NC","","_","_"
7,"_","_","_","sattama","JJ","","_","_"
1,"jagāma","_","_","ga","V","ga","_","_"
2,"tasyāḥ","_","_","tad","PRD","","_","_"
3,"śayanaṃ","_","_","śayana","NC","","_","_"
4,"vipule","_","_","vipula","JJ","","_","_"
5,"tapasi","_","_","tapas","NC","","_","_"
6,"sthitaḥ","_","_","sthā","PPP","","_","_"
1,"tasya","_","_","tad","PRD","","_","_"
2,"kṛṣṇasya","_","_","kṛṣṇa","NC","","_","_"
3,"kapilā","_","_","kapila","JJ","","_","_"
4,"jaṭā","_","_","jaṭā","NC","","_","_"
5,"dīpte","_","_","dīp","PPP","","_","_"
6,"ca","_","_","ca","CCD","","_","_"
7,"locane","_","_","locana","NC","","_","_"
1,"babhrūṇi","_","_","babhru","JJ","","_","_"
2,"_","_","_","ca","CCD","","_","_"
3,"_","_","_","eva","CEM","","_","_"
4,"śmaśrūṇi","_","_","śmaśru","NC","","_","_"
5,"dṛṣṭvā","_","_","dṛś","CGDA","","_","_"
6,"devī","_","_","devī","NC","","_","_"
7,"nyamīlayat","_","_","nimīlay","V","nimīlay","_","_"
1,"taṃ","_","_","tad","PRD","","_","_"
2,"samīkṣya","_","_","samīkṣ","CGDA","","_","_"
3,"tu","_","_","tu","CCD","","_","_"
4,"kausalyā","_","_","kausalyā","NC","","_","_"
5,"duṣprekṣyam","_","_","duṣprekṣya","JJ","","_","_"
6,"atathocitā","_","_","atathocita","JJ","","_","_"
1,"virūpam","_","_","virūpa","JJ","","_","_"
2,"iti","_","_","iti","CQT","","_","_"
3,"vitrastā","_","_","vitras","PPP","","_","_"
4,"_","_","_","saṃkuñc","CGDA","","_","_"
5,"_","_","_","as","V","as","_","_"
6,"nimīlitā","_","_","nimīlay","PPP","","_","_"
1,"virūpo","_","_","virūpa","JJ","","_","_"
2,"hi","_","_","hi","CX","","_","_"
3,"jaṭī","_","_","jaṭin","JJ","","_","_"
4,"_","_","_","ca","CCD","","_","_"
5,"_","_","_","api","CX","","_","_"
6,"durvarṇaḥ","_","_","durvarṇa","JJ","","_","_"
7,"puruṣaḥ","_","_","puruṣa","NC","","_","_"
8,"kṛśaḥ","_","_","kṛśa","JJ","","_","_"
1,"_","_","_","sugandha","NC","","_","_"
2,"_","_","_","itara","PPX","","_","_"
3,"_","_","_","gandha","NC","","_","_"
4,"_","_","_","ca","CCD","","_","_"
5,"sarvathā","_","_","sarvathā","CX","","_","_"
6,"duṣpradharṣaṇaḥ","_","_","duṣpradharṣaṇa","JJ","","_","_"
1,"saṃbabhūva","_","_","sambhav","V","sambhū","_","_"
2,"tayā","_","_","tad","PRD","","_","_"
3,"rātrau","_","_","rātri","NC","","_","_"
4,"mātuḥ","_","_","mātṛ","NC","","_","_"
5,"_","_","_","priya","NC","","_","_"
6,"_","_","_","cikīrṣā","NC","","_","_"
1,"bhayāt","_","_","bhaya","NC","","_","_"
2,"_","_","_","kāśi","NC","","_","_"
3,"_","_","_","sutā","NC","","_","_"
4,"taṃ","_","_","tad","PRD","","_","_"
5,"tu","_","_","tu","CCD","","_","_"
6,"_","_","_","na","CNG","","_","_"
7,"_","_","_","śakn","V","śak","_","_"
8,"abhivīkṣitum","_","_","abhivīkṣ","CGDI","","_","_"
1,"tato","_","_","tatas","CX","","_","_"
2,"niṣkrāntam","_","_","niṣkra","PPP","","_","_"
3,"āsādya","_","_","āsāday","CGDA","","_","_"
4,"mātā","_","_","mātṛ","NC","","_","_"
5,"putram","_","_","putra","NC","","_","_"
6,"_","_","_","atha","CAD","","_","_"
7,"_","_","_","abravīta","V","brū","_","_"
1,"_","_","_","api","CX","","_","_"
2,"_","_","_","ida","PRD","","_","_"
3,"guṇavān","_","_","guṇavat","JJ","","_","_"
4,"putra","_","_","putra","NC","","_","_"
5,"_","_","_","rājan","NC","","_","_"
6,"_","_","_","putra","NC","","_","_"
7,"bhaviṣyati","_","_","bhav","V","bhū","_","_"
1,"_","_","_","iti","CQT","","_","_"
2,"_","_","_","vac","PPP","","_","_"
3,"so","_","_","tad","PRD","","_","_"
4,"'bravīn","_","_","abravīta","V","brū","_","_"
5,"mātaḥ","_","_","mātṛ","NC","","_","_"
6,"kumāro","_","_","kumāra","NC","","_","_"
7,"_","_","_","mātṛ","NC","","_","_"
8,"_","_","_","doṣa","NC","","_","_"
1,"andho","_","_","andha","JJ","","_","_"
2,"_","_","_","nāga","NC","","_","_"
3,"_","_","_","ayuta","NC","","_","_"
4,"_","_","_","prāṇa","NC","","_","_"
5,"_","_","_","bhav","V","bhū","_","_"
6,"_","_","_","ambikā","NC","","_","_"
7,"_","_","_","udara","NC","","_","_"
1,"niśamya","_","_","niśāmay","CGDA","","_","_"
2,"tad","_","_","tad","PRD","","_","_"
3,"vaco","_","_","vacas","NC","","_","_"
4,"mātur","_","_","mātṛ","NC","","_","_"
5,"vyāsaḥ","_","_","vyāsa","NC","","_","_"
6,"_","_","_","parama","JJ","","_","_"
7,"_","_","_","buddhimat","JJ","","_","_"
1,"_","_","_","pravak","V","pravac","_","_"
2,"_","_","_","atīndriya","JJ","","_","_"
3,"_","_","_","jñāna","NC","","_","_"
4,"vidhinā","_","_","vidhi","NC","","_","_"
5,"sampracoditaḥ","_","_","sampracoday","PPP","","_","_"
1,"_","_","_","nāga","NC","","_","_"
2,"_","_","_","ayuta","NC","","_","_"
3,"_","_","_","sama","PPX","","_","_"
4,"_","_","_","prāṇa","NC","","_","_"
5,"vidvān","_","_","vidvas","JJ","","_","_"
6,"_","_","_","rājan","NC","","_","_"
7,"_","_","_","ṛṣi","NC","","_","_"
8,"_","_","_","sattama","JJ","","_","_"
1,"mahābhāgo","_","_","mahābhāga","JJ","","_","_"
2,"_","_","_","mahat","JJ","","_","_"
3,"_","_","_","vīrya","NC","","_","_"
4,"_","_","_","mahat","JJ","","_","_"
5,"_","_","_","buddhi","NC","","_","_"
6,"bhaviṣyati","_","_","bhav","V","bhū","_","_"
1,"tasya","_","_","tad","PRD","","_","_"
2,"_","_","_","ca","CCD","","_","_"
3,"_","_","_","api","CX","","_","_"
4,"śataṃ","_","_","śata","NUM","","_","_"
5,"putrā","_","_","putra","NC","","_","_"
6,"bhaviṣyanti","_","_","bhav","V","bhū","_","_"
7,"_","_","_","mahat","JJ","","_","_"
8,"_","_","_","bala","NC","","_","_"
1,"kiṃ","_","_","kiṃ","PRQ","","_","_"
2,"tu","_","_","tu","CCD","","_","_"
3,"mātuḥ","_","_","mātṛ","NC","","_","_"
4,"sa","_","_","tad","PRD","","_","_"
5,"vaiguṇyād","_","_","vaiguṇya","NC","","_","_"
6,"andha","_","_","andha","JJ","","_","_"
7,"eva","_","_","eva","CEM","","_","_"
8,"bhaviṣyati","_","_","bhav","V","bhū","_","_"
1,"tasya","_","_","tad","PRD","","_","_"
2,"tad","_","_","tad","PRD","","_","_"
3,"vacanaṃ","_","_","vacana","NC","","_","_"
4,"śrutvā","_","_","śru","CGDA","","_","_"
5,"mātā","_","_","mātṛ","NC","","_","_"
6,"putram","_","_","putra","NC","","_","_"
7,"_","_","_","atha","CAD","","_","_"
8,"_","_","_","abravīta","V","brū","_","_"
1,"_","_","_","alabdha","JJ","","_","_"
2,"_","_","_","lābha","NC","","_","_"
3,"putro","_","_","putra","NC","","_","_"
4,"'yaṃ","_","_","ida","PRD","","_","_"
5,"_","_","_","yadi","CSB","","_","_"
6,"_","_","_","andha","JJ","","_","_"
7,"vai","_","_","vai","CX","","_","_"
8,"bhaviṣyati","_","_","bhav","V","bhū","_","_"
1,"asya","_","_","ida","PRD","","_","_"
2,"vaṃśasya","_","_","vaṃśa","NC","","_","_"
3,"goptāraṃ","_","_","goptṛ","JJ","","_","_"
4,"satāṃ","_","_","as","KDP","","_","_"
5,"_","_","_","śoka","NC","","_","_"
6,"_","_","_","vināśana","JJ","","_","_"
1,"tasmād","_","_","tad","PRD","","_","_"
2,"avarajaṃ","_","_","avaraja","NC","","_","_"
3,"putraṃ","_","_","putra","NC","","_","_"
4,"_","_","_","janay","V","janay","_","_"
5,"_","_","_","anya","PPX","","_","_"
6,"_","_","_","nara","NC","","_","_"
7,"_","_","_","adhipa","NC","","_","_"
1,"bhrātur","_","_","bhrātṛ","NC","","_","_"
2,"_","_","_","bhāryā","NC","","_","_"
3,"_","_","_","apara","PPX","","_","_"
4,"_","_","_","ca","CCD","","_","_"
5,"_","_","_","ida","PRD","","_","_"
6,"_","_","_","rūpa","NC","","_","_"
7,"_","_","_","yauvana","NC","","_","_"
8,"_","_","_","śālin","JJ","","_","_"
1,"asyām","_","_","ida","PRD","","_","_"
2,"_","_","_","utpāday","V","utpāday","_","_"
3,"_","_","_","apatya","NC","","_","_"
4,"_","_","_","mat","PPR","","_","_"
5,"_","_","_","niyoga","NC","","_","_"
6,"_","_","_","guṇa","NC","","_","_"
7,"_","_","_","adhika","JJ","","_","_"
1,"_","_","_","na","CNG","","_","_"
2,"_","_","_","andha","JJ","","_","_"
3,"kurūṇāṃ","_","_","kuru","NC","","_","_"
4,"nṛpatir","_","_","nṛpati","NC","","_","_"
5,"_","_","_","anurūpa","JJ","","_","_"
6,"_","_","_","tapodhana","JJ","","_","_"
1,"_","_","_","jñāti","NC","","_","_"
2,"_","_","_","vaṃśa","NC","","_","_"
3,"goptāraṃ","_","_","goptṛ","JJ","","_","_"
4,"pitṝṇāṃ","_","_","pitṛ","NC","","_","_"
5,"_","_","_","vaṃśa","NC","","_","_"
6,"_","_","_","vardhana","JJ","","_","_"
1,"dvitīyaṃ","_","_","dvitīya","JJ","","_","_"
2,"_","_","_","kuru","NC","","_","_"
3,"_","_","_","vaṃśa","NC","","_","_"
4,"rājānaṃ","_","_","rājan","NC","","_","_"
5,"dātum","_","_","dā","CGDI","","_","_"
6,"arhasi","_","_","arh","V","arh","_","_"
1,"sa","_","_","tad","PRD","","_","_"
2,"_","_","_","tathā","CX","","_","_"
3,"_","_","_","iti","CQT","","_","_"
4,"pratijñāya","_","_","pratijñā","CGDA","","_","_"
5,"niścakrāma","_","_","niṣkra","V","niṣkra","_","_"
6,"_","_","_","mahat","JJ","","_","_"
7,"_","_","_","tapas","NC","","_","_"
1,"_","_","_","tad","PRD","","_","_"
2,"_","_","_","api","CX","","_","_"
3,"kālena","_","_","kāla","NC","","_","_"
4,"kausalyā","_","_","kausalyā","NC","","_","_"
5,"suṣuve","_","_","suv","V","sū","_","_"
6,"'ndhaṃ","_","_","andha","JJ","","_","_"
7,"tam","_","_","tad","PRD","","_","_"
8,"ātmajam","_","_","ātmaja","NC","","_","_"
1,"ambālikāṃ","_","_","ambālikā","NC","","_","_"
2,"samādhāya","_","_","samādhā","CGDA","","_","_"
3,"tasyāṃ","_","_","tad","PRD","","_","_"
4,"satyavatī","_","_","satyavatī","NC","","_","_"
5,"sutam","_","_","suta","NC","","_","_"
1,"bhūyo","_","_","bhūyas","CX","","_","_"
2,"niyojayāmāsa","_","_","niyojay","V","niyojay","_","_"
3,"saṃtānāya","_","_","saṃtāna","NC","","_","_"
4,"kulasya","_","_","kula","NC","","_","_"
5,"vai","_","_","vai","CX","","_","_"
1,"_","_","_","viṣad","PPP","","_","_"
2,"_","_","_","ambālikā","NC","","_","_"
3,"sādhvī","_","_","sādhu","JJ","","_","_"
4,"niṣaṇṇā","_","_","niṣad","PPP","","_","_"
5,"_","_","_","śayana","NC","","_","_"
6,"_","_","_","uttama","JJ","","_","_"
1,"ko","_","_","kiṃ","PRQ","","_","_"
2,"_","_","_","nu","CX","","_","_"
3,"_","_","_","e","V","i","_","_"
4,"_","_","_","iti","CQT","","_","_"
5,"dhyāyantī","_","_","dhyā","KDP","","_","_"
6,"niyatā","_","_","niya","PPP","","_","_"
7,"sampratīkṣate","_","_","sampratīkṣ","V","sampratīkṣ","_","_"
1,"dhṛtarāṣṭra","_","_","dhṛtarāṣṭra","NC","","_","_"
2,"_","_","_","yatas","CX","","_","_"
3,"_","_","_","tad","PRD","","_","_"
4,"_","_","_","dhṛtarāṣṭra","NC","","_","_"
5,"_","_","_","tatas","CX","","_","_"
6,"'bhavat","_","_","bhav","V","bhū","_","_"
1,"punar","_","_","punar","CAD","","_","_"
2,"eva","_","_","eva","CEM","","_","_"
3,"tu","_","_","tu","CCD","","_","_"
4,"sā","_","_","tad","PRD","","_","_"
5,"devī","_","_","devī","NC","","_","_"
6,"paribhāṣya","_","_","paribhāṣ","CGDA","","_","_"
7,"snuṣāṃ","_","_","snuṣā","NC","","_","_"
8,"tataḥ","_","_","tatas","CX","","_","_"
1,"ṛṣim","_","_","ṛṣi","NC","","_","_"
2,"āvāhayat","_","_","āvāhay","V","āvāhay","_","_"
3,"satyā","_","_","satyā","NC","","_","_"
4,"yathāpūrvam","_","_","yathāpūrva","JJ","","_","_"
5,"aninditā","_","_","anindita","JJ","","_","_"
1,"_","_","_","tatas","CX","","_","_"
2,"_","_","_","tad","PRD","","_","_"
3,"_","_","_","eva","CEM","","_","_"
4,"vidhinā","_","_","vidhi","NC","","_","_"
5,"_","_","_","mahat","JJ","","_","_"
6,"_","_","_","ṛṣi","NC","","_","_"
7,"_","_","_","tad","PRD","","_","_"
8,"apadyata","_","_","pad","V","pad","_","_"
1,"ambālikām","_","_","ambālikā","NC","","_","_"
2,"_","_","_","atha","CAD","","_","_"
3,"_","_","_","abhyāgā","V","abhyāgā","_","_"
4,"ṛṣiṃ","_","_","ṛṣi","NC","","_","_"
5,"dṛṣṭvā","_","_","dṛś","CGDA","","_","_"
6,"ca","_","_","ca","CCD","","_","_"
7,"_","_","_","tad","PRD","","_","_"
8,"_","_","_","api","CX","","_","_"
9,"tam","_","_","tad","PRD","","_","_"
1,"viṣaṇṇā","_","_","viṣad","PPP","","_","_"
2,"_","_","_","pāṇḍu","JJ","","_","_"
3,"_","_","_","saṃkāśa","NC","","_","_"
4,"samapadyata","_","_","saṃpad","V","saṃpad","_","_"
5,"bhārata","_","_","bhārata","NC","","_","_"
1,"tāṃ","_","_","tad","PRD","","_","_"
2,"bhītāṃ","_","_","bhī","PPP","","_","_"
3,"_","_","_","pāṇḍu","JJ","","_","_"
4,"_","_","_","saṃkāśa","NC","","_","_"
5,"viṣaṇṇāṃ","_","_","viṣad","PPP","","_","_"
6,"prekṣya","_","_","prekṣ","CGDA","","_","_"
7,"pārthiva","_","_","pārthiva","NC","","_","_"
1,"vyāsaḥ","_","_","vyāsa","NC","","_","_"
2,"_","_","_","satyavatī","NC","","_","_"
3,"_","_","_","putra","NC","","_","_"
4,"idaṃ","_","_","ida","PRD","","_","_"
5,"vacanam","_","_","vacana","NC","","_","_"
6,"abravīt","_","_","abravīta","V","brū","_","_"
1,"yasmāt","_","_","yasmāt","CX","","_","_"
2,"_","_","_","pāṇḍu","JJ","","_","_"
4,"āpannā","_","_","āpad","PPP","","_","_"
5,"virūpaṃ","_","_","virūpa","JJ","","_","_"
6,"prekṣya","_","_","prekṣ","CGDA","","_","_"
7,"mām","_","_","mat","PPR","","_","_"
8,"api","_","_","api","CX","","_","_"
1,"tasmād","_","_","tasmāt","CX","","_","_"
2,"eṣa","_","_","tad","PRD","","_","_"
3,"_","_","_","suta","NC","","_","_"
4,"_","_","_","tvat","PPR","","_","_"
5,"pāṇḍur","_","_","pāṇḍu","NC","","_","_"
6,"eva","_","_","eva","CEM","","_","_"
7,"bhaviṣyati","_","_","bhav","V","bhū","_","_"
1,"nāma","_","_","nāman","NC","","_","_"
2,"_","_","_","ca","CCD","","_","_"
3,"_","_","_","ida","PRD","","_","_"
4,"tad","_","_","tad","PRD","","_","_"
5,"_","_","_","eva","CEM","","_","_"
6,"_","_","_","iha","CAD","","_","_"
7,"bhaviṣyati","_","_","bhav","V","bhū","_","_"
8,"_","_","_","śubha","JJ","","_","_"
9,"_","_","_","ānana","NC","","_","_"
1,"_","_","_","iti","CQT","","_","_"
2,"_","_","_","vac","CGDA","","_","_"
3,"sa","_","_","tad","PRD","","_","_"
4,"nirākrāmad","_","_","nirākra","V","nirākra","_","_"
5,"bhagavān","_","_","bhagavat","JJ","","_","_"
6,"_","_","_","ṛṣi","NC","","_","_"
7,"_","_","_","sattama","JJ","","_","_"
1,"tato","_","_","tatas","CX","","_","_"
2,"niṣkrāntam","_","_","niṣkra","PPP","","_","_"
3,"ālokya","_","_","ālokay","CGDA","","_","_"
4,"satyā","_","_","satyā","NC","","_","_"
5,"putram","_","_","putra","NC","","_","_"
6,"abhāṣata","_","_","bhāṣ","V","bhāṣ","_","_"
1,"_","_","_","api","CX","","_","_"
2,"_","_","_","ida","PRD","","_","_"
3,"guṇavān","_","_","guṇavat","JJ","","_","_"
4,"putra","_","_","putra","NC","","_","_"
5,"_","_","_","rājan","NC","","_","_"
6,"_","_","_","putra","NC","","_","_"
7,"bhaviṣyati","_","_","bhav","V","bhū","_","_"
1,"kumāro","_","_","kumāra","NC","","_","_"
2,"brūhi","_","_","abravīta","V","brū","_","_"
3,"me","_","_","mat","PPR","","_","_"
4,"putra","_","_","putra","NC","","_","_"
5,"_","_","_","as","V","as","_","_"
6,"_","_","_","atra","CAD","","_","_"
7,"bhavitā","_","_","bhav","V","bhū","_","_"
8,"śubhaḥ","_","_","śubha","JJ","","_","_"
1,"śaśaṃsa","_","_","śaṃs","V","śaṃs","_","_"
2,"sa","_","_","tad","PRD","","_","_"
3,"punar","_","_","punar","CAD","","_","_"
4,"mātre","_","_","mātṛ","NC","","_","_"
5,"tasya","_","_","tad","PRD","","_","_"
6,"bālasya","_","_","bāla","NC","","_","_"
7,"_","_","_","pāṇḍu","JJ","","_","_"
1,"tam","_","_","tad","PRD","","_","_"
2,"uvāca","_","_","vak","V","vac","_","_"
3,"tato","_","_","tatas","CX","","_","_"
4,"mātā","_","_","mātṛ","NC","","_","_"
5,"_","_","_","api","CX","","_","_"
6,"_","_","_","atra","CAD","","_","_"
7,"bhavitā","_","_","bhav","V","bhū","_","_"
8,"śubhaḥ","_","_","śubha","JJ","","_","_"
1,"kumāro","_","_","kumāra","NC","","_","_"
2,"brūhi","_","_","abravīta","V","brū","_","_"
3,"me","_","_","mat","PPR","","_","_"
4,"tattvam","_","_","tattva","NC","","_","_"
5,"_","_","_","ṛṣi","NC","","_","_"
6,"_","_","_","tad","PRD","","_","_"
7,"pratyuvāca","_","_","prativak","V","prativac","_","_"
8,"ha","_","_","ha","CEM","","_","_"
1,"bhaviṣyati","_","_","bhav","V","bhū","_","_"
2,"_","_","_","su","CAD","","_","_"
3,"_","_","_","vikra","PPP","","_","_"
4,"kumāro","_","_","kumāra","NC","","_","_"
5,"dikṣu","_","_","diś","NC","","_","_"
6,"viśrutaḥ","_","_","viśru","PPP","","_","_"
1,"_","_","_","pāṇḍu","JJ","","_","_"
3,"_","_","_","varṇa","NC","","_","_"
4,"_","_","_","tad","PRD","","_","_"
5,"_","_","_","mātṛ","NC","","_","_"
6,"_","_","_","doṣa","NC","","_","_"
7,"bhaviṣyati","_","_","bhav","V","bhū","_","_"
1,"taṃ","_","_","tad","PRD","","_","_"
2,"mātā","_","_","mātṛ","NC","","_","_"
3,"punar","_","_","punar","CAD","","_","_"
4,"_","_","_","eva","CEM","","_","_"
5,"_","_","_","anya","PPX","","_","_"
6,"ekaṃ","_","_","eka","PPX","","_","_"
7,"putram","_","_","putra","NC","","_","_"
8,"ayācata","_","_","yāc","V","yāc","_","_"
1,"_","_","_","tathā","CX","","_","_"
2,"_","_","_","iti","CQT","","_","_"
3,"ca","_","_","ca","CCD","","_","_"
4,"_","_","_","mahat","JJ","","_","_"
5,"_","_","_","ṛṣi","NC","","_","_"
6,"_","_","_","tad","PRD","","_","_"
7,"mātaraṃ","_","_","mātṛ","NC","","_","_"
8,"pratyabhāṣata","_","_","pratibhāṣ","V","pratibhāṣ","_","_"
1,"tataḥ","_","_","tatas","CX","","_","_"
2,"kumāraṃ","_","_","kumāra","NC","","_","_"
3,"sā","_","_","tad","PRD","","_","_"
4,"devī","_","_","devī","NC","","_","_"
5,"_","_","_","prāp","PPP","","_","_"
6,"_","_","_","kāla","NC","","_","_"
7,"ajījanat","_","_","jan","V","jan","_","_"
1,"pāṇḍuṃ","_","_","pāṇḍu","NC","","_","_"
2,"_","_","_","lakṣaṇa","NC","","_","_"
3,"_","_","_","sampad","PPP","","_","_"
4,"dīpyamānam","_","_","dīp","KDP","","_","_"
5,"iva","_","_","iva","CCM","","_","_"
6,"śriyā","_","_","śrī","NC","","_","_"
1,"tasya","_","_","tad","PRD","","_","_"
2,"putrā","_","_","putra","NC","","_","_"
3,"_","_","_","mahat","JJ","","_","_"
4,"_","_","_","iṣvāsa","NC","","_","_"
5,"jajñire","_","_","jan","V","jan","_","_"
6,"pañca","_","_","pañcan","NUM","","_","_"
7,"pāṇḍavāḥ","_","_","pāṇḍava","NC","","_","_"
1,"tasya","_","_","tad","PRD","","_","_"
2,"putrā","_","_","putra","NC","","_","_"
3,"_","_","_","mahat","JJ","","_","_"
4,"_","_","_","iṣvāsa","NC","","_","_"
5,"_","_","_","jan","V","jan","_","_"
6,"_","_","_","iha","CAD","","_","_"
7,"pañca","_","_","pañcan","NUM","","_","_"
8,"vai","_","_","vai","CX","","_","_"
1,"_","_","_","iti","CQT","","_","_"
2,"_","_","_","vac","CGDA","","_","_"
3,"mātaraṃ","_","_","mātṛ","NC","","_","_"
4,"tatra","_","_","tatra","CAD","","_","_"
5,"so","_","_","tad","PRD","","_","_"
6,"'bhivādya","_","_","abhivāday","CGDA","","_","_"
7,"jagāma","_","_","ga","V","ga","_","_"
8,"ha","_","_","ha","CEM","","_","_"
1,"munau","_","_","muni","NC","","_","_"
2,"yāte","_","_","yā","PPP","","_","_"
3,"'mbikā","_","_","ambikā","NC","","_","_"
4,"putraṃ","_","_","putra","NC","","_","_"
5,"mahābhāgam","_","_","mahābhāga","JJ","","_","_"
6,"asūyata","_","_","suv","V","sū","_","_"
1,"dhṛtarāṣṭraṃ","_","_","dhṛtarāṣṭra","NC","","_","_"
2,"_","_","_","mahat","JJ","","_","_"
3,"_","_","_","prājña","JJ","","_","_"
4,"_","_","_","prajñā","NC","","_","_"
5,"_","_","_","cakṣus","NC","","_","_"
6,"īśvaram","_","_","īśvara","NC","","_","_"
1,"_","_","_","anujā","NC","","_","_"
2,"_","_","_","ambālikā","NC","","_","_"
3,"tatra","_","_","tatra","CAD","","_","_"
4,"putraṃ","_","_","putra","NC","","_","_"
5,"kāle","_","_","kāla","NC","","_","_"
6,"vyajāyata","_","_","vijan","V","vijan","_","_"
1,"pāṇḍuṃ","_","_","pāṇḍu","NC","","_","_"
2,"_","_","_","lakṣaṇa","NC","","_","_"
3,"_","_","_","sampad","PPP","","_","_"
4,"dīpyamānaṃ","_","_","dīp","KDP","","_","_"
5,"_","_","_","śrī","NC","","_","_"
6,"_","_","_","āvṛ","PPP","","_","_"
1,"tayor","_","_","tad","PRD","","_","_"
2,"_","_","_","janman","NC","","_","_"
3,"_","_","_","kriyā","NC","","_","_"
4,"sarvā","_","_","sarva","JQ","","_","_"
5,"yathāvad","_","_","yathāvat","CX","","_","_"
6,"anupūrvaśaḥ","_","_","anupūrvaśas","CX","","_","_"
1,"kārayāmāsa","_","_","kāray","V","kāray","_","_"
2,"vai","_","_","vai","CX","","_","_"
3,"bhīṣmo","_","_","bhīṣma","NC","","_","_"
4,"brāhmaṇair","_","_","brāhmaṇa","NC","","_","_"
5,"vedapāragaiḥ","_","_","vedapāraga","NC","","_","_"
1,"andhaṃ","_","_","andha","JJ","","_","_"
2,"_","_","_","dṛś","CGDA","","_","_"
3,"_","_","_","ambikā","NC","","_","_"
4,"_","_","_","putra","NC","","_","_"
5,"jātaṃ","_","_","jan","PPP","","_","_"
6,"satyavatī","_","_","satyavatī","NC","","_","_"
7,"sutam","_","_","suta","NC","","_","_"
1,"_","_","_","kausalyā","NC","","_","_"
2,"_","_","_","artha","NC","","_","_"
3,"samāhūya","_","_","samāhvā","CGDA","","_","_"
4,"putram","_","_","putra","NC","","_","_"
5,"anyam","_","_","anya","PPX","","_","_"
6,"ayācata","_","_","yāc","V","yāc","_","_"
1,"andho","_","_","andha","JJ","","_","_"
2,"'yam","_","_","ida","PRD","","_","_"
3,"anyam","_","_","anya","PPX","","_","_"
4,"icchāmi","_","_","iṣ","V","iṣ","_","_"
5,"_","_","_","kausalyā","NC","","_","_"
6,"_","_","_","tanaya","NC","","_","_"
7,"śubham","_","_","śubha","JJ","","_","_"
1,"evam","_","_","eva","CX","","_","_"
2,"ukto","_","_","vac","PPP","","_","_"
3,"_","_","_","mahat","JJ","","_","_"
4,"_","_","_","ṛṣi","NC","","_","_"
5,"_","_","_","tad","PRD","","_","_"
6,"mātaraṃ","_","_","mātṛ","NC","","_","_"
7,"pratyabhāṣata","_","_","pratibhāṣ","V","pratibhāṣ","_","_"
1,"niyatā","_","_","niya","PPP","","_","_"
2,"yadi","_","_","yadi","CSB","","_","_"
3,"kausalyā","_","_","kausalyā","NC","","_","_"
4,"bhaviṣyati","_","_","bhav","V","bhū","_","_"
5,"punaḥ","_","_","punar","CAD","","_","_"
6,"śubhā","_","_","śubha","JJ","","_","_"
1,"bhaviṣyati","_","_","bhav","V","bhū","_","_"
2,"kumāro","_","_","kumāra","NC","","_","_"
3,"'syāṃ","_","_","ida","PRD","","_","_"
4,"_","_","_","dharmaśāstra","NC","","_","_"
5,"_","_","_","artha","NC","","_","_"
6,"_","_","_","tattva","NC","","_","_"
7,"_","_","_","vid","JJ","","_","_"
1,"tāṃ","_","_","tad","PRD","","_","_"
2,"samādhāya","_","_","samādhā","CGDA","","_","_"
3,"vai","_","_","vai","CX","","_","_"
4,"bhūyaḥ","_","_","bhūyas","CX","","_","_"
5,"snuṣāṃ","_","_","snuṣā","NC","","_","_"
6,"satyavatī","_","_","satyavatī","NC","","_","_"
7,"tadā","_","_","tadā","CAD","","_","_"
1,"_","_","_","ṛtu","NC","","_","_"
2,"_","_","_","kāla","NC","","_","_"
3,"tato","_","_","tatas","CX","","_","_"
4,"jyeṣṭhāṃ","_","_","jyeṣṭha","JJ","","_","_"
5,"vadhūṃ","_","_","vadhū","NC","","_","_"
6,"tasmai","_","_","tad","PRD","","_","_"
7,"nyayojayat","_","_","nyayoja","V","niyojay","_","_"
1,"sā","_","_","tad","PRD","","_","_"
2,"tu","_","_","tu","CCD","","_","_"
3,"rūpaṃ","_","_","rūpa","NC","","_","_"
4,"ca","_","_","ca","CCD","","_","_"
5,"gandhaṃ","_","_","gandha","NC","","_","_"
6,"ca","_","_","ca","CCD","","_","_"
7,"_","_","_","mahat","JJ","","_","_"
8,"_","_","_","ṛṣi","NC","","_","_"
9,"pravicintya","_","_","pravicintay","CGDA","","_","_"
10,"tam","_","_","tad","PRD","","_","_"
1,"_","_","_","na","CNG","","_","_"
2,"_","_","_","kar","V","kṛ","_","_"
3,"vacanaṃ","_","_","vacana","NC","","_","_"
4,"devyā","_","_","devī","NC","","_","_"
5,"bhayāt","_","_","bhaya","NC","","_","_"
6,"_","_","_","sura","NC","","_","_"
7,"_","_","_","sutā","NC","","_","_"
8,"_","_","_","upama","JJ","","_","_"
1,"tataḥ","_","_","tatas","CX","","_","_"
2,"svair","_","_","sva","JJ","","_","_"
3,"bhūṣaṇair","_","_","bhūṣaṇa","NC","","_","_"
4,"dāsīṃ","_","_","dāsī","NC","","_","_"
5,"_","_","_","bhūṣay","CGDA","","_","_"
6,"_","_","_","apsaras","NC","","_","_"
7,"_","_","_","upama","JJ","","_","_"
1,"preṣayāmāsa","_","_","preṣay","V","preṣay","_","_"
2,"kṛṣṇāya","_","_","kṛṣṇa","NC","","_","_"
3,"tataḥ","_","_","tatas","CX","","_","_"
4,"_","_","_","kāśi","NC","","_","_"
5,"_","_","_","pati","NC","","_","_"
6,"sutā","_","_","sutā","NC","","_","_"
1,"dāsī","_","_","dāsī","NC","","_","_"
2,"ṛṣim","_","_","ṛṣi","NC","","_","_"
3,"anuprāptaṃ","_","_","anuprāp","PPP","","_","_"
4,"_","_","_","pratyudga","CGDA","","_","_"
5,"_","_","_","abhivāday","CGDA","","_","_"
6,"ca","_","_","ca","CCD","","_","_"
1,"_","_","_","saṃviś","V","saṃviś","_","_"
2,"_","_","_","abhyanujñā","PPP","","_","_"
3,"_","_","_","satkṛ","CGDA","","_","_"
4,"_","_","_","upacar","V","upacar","_","_"
5,"ha","_","_","ha","CEM","","_","_"
1,"upacāreṇa","_","_","upacāra","NC","","_","_"
2,"śīlena","_","_","śīla","NC","","_","_"
3,"_","_","_","rūpa","NC","","_","_"
4,"_","_","_","yauvana","NC","","_","_"
5,"_","_","_","sampad","NC","","_","_"
1,"_","_","_","vāc","NC","","_","_"
2,"_","_","_","bhāva","NC","","_","_"
3,"_","_","_","upapradāna","NC","","_","_"
4,"_","_","_","gātra","NC","","_","_"
5,"_","_","_","saṃsparśana","NC","","_","_"
6,"ca","_","_","ca","CCD","","_","_"
1,"_","_","_","kāma","NC","","_","_"
2,"_","_","_","upabhoga","NC","","_","_"
3,"tu","_","_","tu","CCD","","_","_"
4,"sa","_","_","tad","PRD","","_","_"
5,"tasyāṃ","_","_","tad","PRD","","_","_"
6,"tuṣṭim","_","_","tuṣṭi","NC","","_","_"
7,"agād","_","_","gā","V","gā","_","_"
8,"ṛṣiḥ","_","_","ṛṣi","NC","","_","_"
1,"tayā","_","_","tad","PRD","","_","_"
2,"_","_","_","saha","CX","","_","_"
3,"_","_","_","vas","PPP","","_","_"
4,"rātriṃ","_","_","rātri","NC","","_","_"
5,"_","_","_","mahat","JJ","","_","_"
6,"_","_","_","ṛṣi","NC","","_","_"
7,"prīyamāṇayā","_","_","prī","KDP","","_","_"
1,"uttiṣṭhann","_","_","utthā","KDP","","_","_"
2,"abravīd","_","_","abravīta","V","brū","_","_"
3,"enām","_","_","a","PRD","","_","_"
4,"abhujiṣyā","_","_","abhujiṣya","NC","","_","_"
5,"bhaviṣyasi","_","_","bhav","V","bhū","_","_"
1,"ayaṃ","_","_","ida","PRD","","_","_"
2,"ca","_","_","ca","CCD","","_","_"
3,"te","_","_","tvat","PPR","","_","_"
4,"śubhe","_","_","śubha","JJ","","_","_"
5,"garbhaḥ","_","_","garbha","NC","","_","_"
6,"śrīmān","_","_","śrīmat","JJ","","_","_"
7,"udaram","_","_","udara","NC","","_","_"
8,"āgataḥ","_","_","āga","PPP","","_","_"
1,"_","_","_","dharma","NC","","_","_"
2,"_","_","_","ātman","NC","","_","_"
3,"bhavitā","_","_","bhav","V","bhū","_","_"
4,"loke","_","_","loka","NC","","_","_"
5,"_","_","_","sarva","JQ","","_","_"
6,"_","_","_","buddhimat","JJ","","_","_"
7,"varaḥ","_","_","vara","JJ","","_","_"
1,"sa","_","_","tad","PRD","","_","_"
2,"jajñe","_","_","jan","V","jan","_","_"
3,"viduro","_","_","vidura","NC","","_","_"
4,"nāma","_","_","nāma","CX","","_","_"
5,"_","_","_","kṛṣṇadvaipāyana","NC","","_","_"
6,"_","_","_","ātmaja","NC","","_","_"
1,"dhṛtarāṣṭrasya","_","_","dhṛtarāṣṭra","NC","","_","_"
2,"ca","_","_","ca","CCD","","_","_"
3,"bhrātā","_","_","bhrātṛ","NC","","_","_"
4,"_","_","_","pāṇḍu","NC","","_","_"
5,"_","_","_","ca","CCD","","_","_"
6,"_","_","_","amita","JJ","","_","_"
7,"_","_","_","buddhimat","JJ","","_","_"
1,"dharmo","_","_","dharma","NC","","_","_"
2,"_","_","_","vidura","NC","","_","_"
3,"_","_","_","rūpa","NC","","_","_"
4,"śāpāt","_","_","śāpa","NC","","_","_"
5,"tasya","_","_","tad","PRD","","_","_"
6,"mahātmanaḥ","_","_","mahātman","JJ","","_","_"
1,"_","_","_","māṇḍavya","NC","","_","_"
2,"_","_","_","artha","NC","","_","_"
3,"_","_","_","tattva","NC","","_","_"
4,"_","_","_","jña","JJ","","_","_"
5,"_","_","_","kāma","NC","","_","_"
6,"_","_","_","krodha","NC","","_","_"
7,"_","_","_","vivarjay","PPP","","_","_"
1,"kṛṣṇadvaipāyano","_","_","kṛṣṇadvaipāyana","NC","","_","_"
2,"_","_","_","api","CX","","_","_"
3,"_","_","_","tad","PRD","","_","_"
4,"satyavatyai","_","_","satyavatī","NC","","_","_"
5,"nyavedayat","_","_","nyaveda","V","niveday","_","_"
1,"pralambham","_","_","pralambha","NC","","_","_"
2,"_","_","_","ātman","NC","","_","_"
3,"_","_","_","ca","CCD","","_","_"
4,"_","_","_","eva","CEM","","_","_"
5,"śūdrāyāḥ","_","_","śūdrā","NC","","_","_"
6,"_","_","_","putra","NC","","_","_"
7,"_","_","_","janman","NC","","_","_"
8,"ca","_","_","ca","CCD","","_","_"
1,"sa","_","_","tad","PRD","","_","_"
2,"_","_","_","dharma","NC","","_","_"
3,"_","_","_","anṛṇa","JJ","","_","_"
4,"bhūtvā","_","_","bhū","CGDA","","_","_"
5,"punar","_","_","punar","CAD","","_","_"
6,"mātrā","_","_","mātṛ","NC","","_","_"
7,"sametya","_","_","same","CGDA","","_","_"
8,"ca","_","_","ca","CCD","","_","_"
1,"tasyai","_","_","tad","PRD","","_","_"
2,"garbhaṃ","_","_","garbha","NC","","_","_"
3,"samāvedya","_","_","samāveday","CGDA","","_","_"
4,"_","_","_","tatra","CAD","","_","_"
5,"_","_","_","eva","CEM","","_","_"
6,"_","_","_","antardhā","V","antardhā","_","_"
1,"evaṃ","_","_","eva","CX","","_","_"
2,"vicitravīryasya","_","_","vicitravīrya","NC","","_","_"
3,"kṣetre","_","_","kṣetra","NC","","_","_"
4,"dvaipāyanād","_","_","dvaipāyana","NC","","_","_"
5,"api","_","_","api","CX","","_","_"
1,"jajñire","_","_","jan","V","jan","_","_"
2,"_","_","_","deva","NC","","_","_"
3,"_","_","_","garbha","NC","","_","_"
4,"_","_","_","ābha","JJ","","_","_"
5,"_","_","_","kuru","NC","","_","_"
6,"_","_","_","vaṃśa","NC","","_","_"
7,"_","_","_","vivardhana","JJ","","_","_"
1,"teṣu","_","_","tad","PRD","","_","_"
2,"triṣu","_","_","tri","NUM","","_","_"
3,"kumāreṣu","_","_","kumāra","NC","","_","_"
4,"jāteṣu","_","_","jan","PPP","","_","_"
5,"kurujāṅgalam","_","_","kurujāṅgala","NC","","_","_"
1,"kuravo","_","_","kuru","NC","","_","_"
2,"'tha","_","_","atha","CAD","","_","_"
3,"kurukṣetraṃ","_","_","kurukṣetra","NC","","_","_"
4,"sarvaṃ","_","_","sarva","JQ","","_","_"
5,"trayam","_","_","traya","NC","","_","_"
6,"avardhata","_","_","vṛdh","V","vṛdh","_","_"
1,"gandhavatyā","_","_","gandhavatī","NC","","_","_"
2,"_","_","_","tathā","CX","","_","_"
3,"_","_","_","eva","CEM","","_","_"
4,"_","_","_","vac","PPP","","_","_"
5,"_","_","_","dharma","NC","","_","_"
6,"_","_","_","rūpa","NC","","_","_"
7,"sutaṃ","_","_","suta","NC","","_","_"
8,"prati","_","_","prati","CADP","","_","_"
1,"_","_","_","na","CNG","","_","_"
2,"_","_","_","mat","PPR","","_","_"
3,"asmi","_","_","as","V","as","_","_"
4,"punar","_","_","punar","CAD","","_","_"
5,"yoktuṃ","_","_","yuj","CGDI","","_","_"
6,"śakto","_","_","śak","PPP","","_","_"
7,"mātaḥ","_","_","mātṛ","NC","","_","_"
8,"sutaṃ","_","_","suta","NC","","_","_"
9,"prati","_","_","prati","CADP","","_","_"
