"WordID","word","NormSTEM","suffix","lemma","PoS","Root","NormSuffix","NormWord"
1,"tasmai","_","_","tad","PRD","","_","_"
2,"prācyā","_","_","prāñc","JJ","","_","_"
3,"diśaḥ","_","_","diś","NC","","_","_"
1,"vāsantau","_","_","vāsanta","JJ","","_","_"
2,"māsau","_","_","māsa","NC","","_","_"
3,"goptārāv","_","_","goptṛ","JJ","","_","_"
4,"akurvan","_","_","kar","V","kṛ","_","_"
5,"bṛhac","_","_","bṛhat","NC","","_","_"
6,"ca","_","_","ca","CCD","","_","_"
7,"rathantaraṃ","_","_","rathaṃtara","NC","","_","_"
8,"_","_","_","ca","CCD","","_","_"
9,"_","_","_","anuṣṭhātṛ","NC","","_","_"
1,"vāsantāv","_","_","vāsanta","JJ","","_","_"
2,"enaṃ","_","_","a","PRD","","_","_"
3,"māsau","_","_","māsa","NC","","_","_"
4,"prācyā","_","_","prāñc","JJ","","_","_"
5,"diśo","_","_","diś","NC","","_","_"
6,"gopāyato","_","_","gopāy","V","gopāy","_","_"
7,"bṛhac","_","_","bṛhat","NC","","_","_"
8,"ca","_","_","ca","CCD","","_","_"
9,"rathantaraṃ","_","_","rathaṃtara","NC","","_","_"
10,"_","_","_","ca","CCD","","_","_"
11,"_","_","_","anuṣṭhā","V","anuṣṭhā","_","_"
12,"ya","_","_","yad","PRL","","_","_"
13,"evaṃ","_","_","eva","CX","","_","_"
14,"veda","_","_","vid","V","vid","_","_"
1,"tasmai","_","_","tad","PRD","","_","_"
2,"dakṣiṇāyā","_","_","dakṣiṇa","JJ","","_","_"
3,"diśaḥ","_","_","diś","NC","","_","_"
1,"graiṣmau","_","_","graiṣma","JJ","","_","_"
2,"māsau","_","_","māsa","NC","","_","_"
3,"goptārāv","_","_","goptṛ","JJ","","_","_"
4,"akurvan","_","_","kar","V","kṛ","_","_"
5,"yajñāyajñiyaṃ","_","_","yajñāyajñiya","NC","","_","_"
6,"ca","_","_","ca","CCD","","_","_"
7,"vāmadevyaṃ","_","_","vāmadevya","NC","","_","_"
8,"_","_","_","ca","CCD","","_","_"
9,"_","_","_","anuṣṭhātṛ","NC","","_","_"
1,"graiṣmāv","_","_","graiṣma","JJ","","_","_"
2,"enaṃ","_","_","a","PRD","","_","_"
3,"māsau","_","_","māsa","NC","","_","_"
4,"dakṣiṇāyā","_","_","dakṣiṇa","JJ","","_","_"
5,"diśo","_","_","diś","NC","","_","_"
6,"gopāyato","_","_","gopāy","V","gopāy","_","_"
7,"yajñāyajñiyaṃ","_","_","yajñāyajñiya","NC","","_","_"
8,"ca","_","_","ca","CCD","","_","_"
9,"vāmadevyaṃ","_","_","vāmadevya","NC","","_","_"
10,"_","_","_","ca","CCD","","_","_"
11,"_","_","_","anuṣṭhā","V","anuṣṭhā","_","_"
12,"ya","_","_","yad","PRL","","_","_"
13,"evaṃ","_","_","eva","CX","","_","_"
14,"veda","_","_","vid","V","vid","_","_"
1,"tasmai","_","_","tad","PRD","","_","_"
2,"pratīcyā","_","_","pratyañc","JJ","","_","_"
3,"diśaḥ","_","_","diś","NC","","_","_"
1,"vārṣikau","_","_","vārṣika","JJ","","_","_"
2,"māsau","_","_","māsa","NC","","_","_"
3,"goptārāv","_","_","goptṛ","JJ","","_","_"
4,"akurvan","_","_","kar","V","kṛ","_","_"
5,"vairūpaṃ","_","_","vairūpa","NC","","_","_"
6,"ca","_","_","ca","CCD","","_","_"
7,"vairājaṃ","_","_","vairāja","NC","","_","_"
8,"_","_","_","ca","CCD","","_","_"
9,"_","_","_","anuṣṭhātṛ","NC","","_","_"
1,"vārṣikāv","_","_","vārṣika","JJ","","_","_"
2,"enaṃ","_","_","a","PRD","","_","_"
3,"māsau","_","_","māsa","NC","","_","_"
4,"pratīcyā","_","_","pratyañc","JJ","","_","_"
5,"diśo","_","_","diś","NC","","_","_"
6,"gopāyato","_","_","gopāy","V","gopāy","_","_"
7,"vairūpaṃ","_","_","vairūpa","NC","","_","_"
8,"ca","_","_","ca","CCD","","_","_"
9,"vairājaṃ","_","_","vairāja","NC","","_","_"
10,"_","_","_","ca","CCD","","_","_"
11,"_","_","_","anuṣṭhā","V","anuṣṭhā","_","_"
12,"ya","_","_","yad","PRL","","_","_"
13,"evaṃ","_","_","eva","CX","","_","_"
14,"veda","_","_","vid","V","vid","_","_"
1,"tasmā","_","_","tad","PRD","","_","_"
2,"udīcyā","_","_","udañc","JJ","","_","_"
3,"diśaḥ","_","_","diś","NC","","_","_"
1,"śāradau","_","_","śārada","JJ","","_","_"
2,"māsau","_","_","māsa","NC","","_","_"
3,"goptārāv","_","_","goptṛ","JJ","","_","_"
4,"_","_","_","kar","V","kṛ","_","_"
5,"_","_","_","śyaita","NC","","_","_"
6,"ca","_","_","ca","CCD","","_","_"
7,"naudhasaṃ","_","_","naudhasa","NC","","_","_"
8,"_","_","_","ca","CCD","","_","_"
9,"_","_","_","anuṣṭhātṛ","NC","","_","_"
1,"śāradāv","_","_","śārada","JJ","","_","_"
2,"enaṃ","_","_","a","PRD","","_","_"
3,"māsāv","_","_","māsa","NC","","_","_"
4,"udīcyā","_","_","udañc","JJ","","_","_"
5,"diśo","_","_","diś","NC","","_","_"
6,"gopāyataḥ","_","_","gopāy","V","gopāy","_","_"
7,"śyaitaṃ","_","_","śyaita","NC","","_","_"
8,"ca","_","_","ca","CCD","","_","_"
9,"naudhasaṃ","_","_","naudhasa","NC","","_","_"
10,"_","_","_","ca","CCD","","_","_"
11,"_","_","_","anuṣṭhā","V","anuṣṭhā","_","_"
12,"ya","_","_","yad","PRL","","_","_"
13,"evaṃ","_","_","eva","CX","","_","_"
14,"veda","_","_","vid","V","vid","_","_"
1,"tasmai","_","_","tad","PRD","","_","_"
2,"dhruvāyā","_","_","dhruva","JJ","","_","_"
3,"diśaḥ","_","_","diś","NC","","_","_"
1,"haimanau","_","_","haimana","JJ","","_","_"
2,"māsau","_","_","māsa","NC","","_","_"
3,"goptārāv","_","_","goptṛ","JJ","","_","_"
4,"akurvan","_","_","kar","V","kṛ","_","_"
5,"bhūmiṃ","_","_","bhūmi","NC","","_","_"
6,"_","_","_","ca","CCD","","_","_"
7,"_","_","_","agni","NC","","_","_"
8,"_","_","_","ca","CCD","","_","_"
9,"_","_","_","anuṣṭhātṛ","NC","","_","_"
1,"haimanāv","_","_","haimana","JJ","","_","_"
2,"enaṃ","_","_","a","PRD","","_","_"
3,"māsau","_","_","māsa","NC","","_","_"
4,"dhruvāyā","_","_","dhruva","JJ","","_","_"
5,"diśo","_","_","diś","NC","","_","_"
6,"gopāyato","_","_","gopāy","V","gopāy","_","_"
7,"bhūmiś","_","_","bhūmi","NC","","_","_"
8,"_","_","_","ca","CCD","","_","_"
9,"_","_","_","agni","NC","","_","_"
10,"_","_","_","ca","CCD","","_","_"
11,"_","_","_","anuṣṭhā","V","anuṣṭhā","_","_"
12,"ya","_","_","yad","PRL","","_","_"
13,"evaṃ","_","_","eva","CX","","_","_"
14,"veda","_","_","vid","V","vid","_","_"
1,"tasmā","_","_","tad","PRD","","_","_"
2,"ūrdhvāyā","_","_","ūrdhva","JJ","","_","_"
3,"diśaḥ","_","_","diś","NC","","_","_"
1,"śaiśirau","_","_","śaiśira","JJ","","_","_"
2,"māsau","_","_","māsa","NC","","_","_"
3,"goptārāv","_","_","goptṛ","JJ","","_","_"
4,"akurvan","_","_","kar","V","kṛ","_","_"
5,"divaṃ","_","_","div","NC","","_","_"
6,"_","_","_","ca","CCD","","_","_"
7,"_","_","_","āditya","NC","","_","_"
8,"_","_","_","ca","CCD","","_","_"
9,"_","_","_","anuṣṭhātṛ","NC","","_","_"
1,"_","_","_","śaiśira","JJ","","_","_"
2,"_","_","_","a","PRD","","_","_"
3,"māsāv","_","_","māsa","NC","","_","_"
4,"ūrdhvāyā","_","_","ūrdhva","JJ","","_","_"
5,"diśo","_","_","diś","NC","","_","_"
6,"gopāyato","_","_","gopāy","V","gopāy","_","_"
7,"dyauś","_","_","div","NC","","_","_"
8,"_","_","_","ca","CCD","","_","_"
9,"_","_","_","āditya","NC","","_","_"
10,"_","_","_","ca","CCD","","_","_"
11,"_","_","_","anuṣṭhā","V","anuṣṭhā","_","_"
12,"ya","_","_","yad","PRL","","_","_"
13,"evaṃ","_","_","eva","CX","","_","_"
14,"veda","_","_","vid","V","vid","_","_"
