"WordID","word","NormSTEM","suffix","lemma","PoS","Root","NormSuffix","NormWord"
1,"saṃjaya","_","_","saṃjaya","NC","","_","_"
2,"uvāca","_","_","vak","V","vac","_","_"
1,"tad","_","_","tad","PRD","","_","_"
2,"_","_","_","udīr","PPP","","_","_"
3,"_","_","_","gaja","NC","","_","_"
4,"_","_","_","aśva","NC","","_","_"
5,"_","_","_","ogha","NC","","_","_"
6,"balaṃ","_","_","bala","NC","","_","_"
7,"tava","_","_","tvat","PPR","","_","_"
8,"janādhipa","_","_","janādhipa","NC","","_","_"
1,"_","_","_","pāṇḍu","NC","","_","_"
2,"_","_","_","senā","NC","","_","_"
3,"abhidrutya","_","_","abhidru","CGDA","","_","_"
4,"yodhayāmāsa","_","_","yodhay","V","yodhay","_","_"
5,"sarvataḥ","_","_","sarvatas","CX","","_","_"
1,"pāñcālāḥ","_","_","pāñcāla","NC","","_","_"
2,"_","_","_","kuru","NC","","_","_"
3,"_","_","_","ca","CCD","","_","_"
4,"_","_","_","eva","CEM","","_","_"
5,"yodhayantaḥ","_","_","yodhay","KDP","","_","_"
6,"parasparam","_","_","paraspara","PRC","","_","_"
1,"_","_","_","yama","NC","","_","_"
2,"_","_","_","rāṣṭra","NC","","_","_"
3,"mahate","_","_","mahat","JJ","","_","_"
4,"_","_","_","para","PPX","","_","_"
5,"_","_","_","loka","NC","","_","_"
6,"dīkṣitāḥ","_","_","dīkṣay","PPP","","_","_"
1,"śūrāḥ","_","_","śūra","NC","","_","_"
2,"śūraiḥ","_","_","śūra","NC","","_","_"
3,"samāgamya","_","_","samāga","CGDA","","_","_"
4,"_","_","_","śara","NC","","_","_"
5,"_","_","_","tomara","NC","","_","_"
6,"_","_","_","śakti","NC","","_","_"
1,"vivyadhuḥ","_","_","vyadh","V","vyadh","_","_"
2,"samare","_","_","samara","NC","","_","_"
3,"tūrṇaṃ","_","_","tūrṇa","CX","","_","_"
4,"_","_","_","nay","V","nī","_","_"
5,"_","_","_","ca","CCD","","_","_"
6,"_","_","_","eva","CEM","","_","_"
7,"_","_","_","yama","NC","","_","_"
8,"_","_","_","kṣaya","NC","","_","_"
1,"rathināṃ","_","_","rathin","NC","","_","_"
2,"rathibhiḥ","_","_","rathin","NC","","_","_"
3,"sārdhaṃ","_","_","sārdha","CX","","_","_"
4,"_","_","_","rudhira","NC","","_","_"
5,"_","_","_","srāvin","JJ","","_","_"
6,"dāruṇam","_","_","dāruṇa","JJ","","_","_"
1,"prāvartata","_","_","pravart","V","pravṛt","_","_"
2,"mahad","_","_","mahat","JJ","","_","_"
3,"yuddhaṃ","_","_","yuddha","NC","","_","_"
4,"nighnatām","_","_","nihan","KDP","","_","_"
5,"itaretaram","_","_","itaretara","PRC","","_","_"
1,"_","_","_","vāraṇa","NC","","_","_"
2,"_","_","_","ca","CCD","","_","_"
3,"_","_","_","mahat","JJ","","_","_"
4,"_","_","_","rāja","NC","","_","_"
5,"samāsādya","_","_","samāsāday","CGDA","","_","_"
6,"parasparam","_","_","paraspara","PRC","","_","_"
1,"viṣāṇair","_","_","viṣāṇa","NC","","_","_"
2,"dārayāmāsuḥ","_","_","dāray","V","dāray","_","_"
3,"_","_","_","saṃkrudh","PPP","","_","_"
4,"_","_","_","ca","CCD","","_","_"
5,"_","_","_","mada","NC","","_","_"
6,"_","_","_","utkaṭa","JJ","","_","_"
1,"_","_","_","haya","NC","","_","_"
2,"_","_","_","āroha","NC","","_","_"
3,"_","_","_","haya","NC","","_","_"
4,"_","_","_","āroha","NC","","_","_"
5,"_","_","_","prāsa","NC","","_","_"
6,"_","_","_","śakti","NC","","_","_"
7,"_","_","_","paraśvadha","NC","","_","_"
1,"_","_","_","bhid","V","bhid","_","_"
2,"_","_","_","tumula","JJ","","_","_"
3,"yuddhe","_","_","yuddha","NC","","_","_"
4,"prārthayanto","_","_","prārthay","KDP","","_","_"
5,"mahad","_","_","mahat","JJ","","_","_"
6,"yaśaḥ","_","_","yaśas","NC","","_","_"
1,"_","_","_","patti","NC","","_","_"
2,"_","_","_","ca","CCD","","_","_"
3,"_","_","_","mahat","JJ","","_","_"
4,"_","_","_","bāhu","NC","","_","_"
5,"śataśaḥ","_","_","śataśas","CX","","_","_"
6,"_","_","_","śastra","NC","","_","_"
7,"_","_","_","pāṇi","NC","","_","_"
1,"anyonyam","_","_","anyonya","PRC","","_","_"
2,"ārdayan","_","_","arday","V","arday","_","_"
3,"rājan","_","_","rājan","NC","","_","_"
4,"_","_","_","nitya","JJ","","_","_"
5,"_","_","_","yat","PPP","","_","_"
6,"parākrame","_","_","parākrama","NC","","_","_"
1,"gotrāṇāṃ","_","_","gotra","NC","","_","_"
2,"nāmadheyānāṃ","_","_","nāmadheya","NC","","_","_"
3,"kulānāṃ","_","_","kula","NC","","_","_"
4,"_","_","_","ca","CCD","","_","_"
5,"_","_","_","eva","CEM","","_","_"
6,"māriṣa","_","_","māriṣa","NC","","_","_"
1,"_","_","_","śravaṇa","NC","","_","_"
2,"_","_","_","hi","CX","","_","_"
3,"vijānīmaḥ","_","_","vijān","V","vijñā","_","_"
4,"pāñcālān","_","_","pāñcāla","NC","","_","_"
5,"kurubhiḥ","_","_","kuru","NC","","_","_"
6,"saha","_","_","saha","CX","","_","_"
1,"anyonyaṃ","_","_","anyonya","PRC","","_","_"
2,"samare","_","_","samara","NC","","_","_"
3,"yodhāḥ","_","_","yodha","NC","","_","_"
4,"_","_","_","śara","NC","","_","_"
5,"_","_","_","śakti","NC","","_","_"
6,"_","_","_","paraśvadha","NC","","_","_"
1,"preṣayan","_","_","preṣay","V","preṣay","_","_"
2,"_","_","_","para","PPX","","_","_"
3,"_","_","_","loka","NC","","_","_"
4,"vicaranto","_","_","vicar","KDP","","_","_"
5,"_","_","_","hi","CX","","_","_"
6,"_","_","_","abhīta","JJ","","_","_"
7,"_","_","_","vat","CX","","_","_"
1,"śarair","_","_","śara","NC","","_","_"
2,"daśa","_","_","daśan","NUM","","_","_"
3,"diśo","_","_","diś","NC","","_","_"
4,"_","_","_","rājan","NC","","_","_"
5,"_","_","_","tad","PRD","","_","_"
6,"muktaiḥ","_","_","muc","PPP","","_","_"
7,"sahasraśaḥ","_","_","sahasraśas","CX","","_","_"
1,"na","_","_","na","CNG","","_","_"
2,"bhrājanta","_","_","bhrāj","V","bhrāj","_","_"
3,"yathāpūrvaṃ","_","_","yathāpūrva","CX","","_","_"
4,"bhāskare","_","_","bhāskara","NC","","_","_"
5,"'staṃ","_","_","asta","NC","","_","_"
6,"gate","_","_","ga","PPP","","_","_"
7,"'pi","_","_","api","CX","","_","_"
8,"ca","_","_","ca","CCD","","_","_"
1,"tathā","_","_","tathā","CX","","_","_"
2,"prayudhyamāneṣu","_","_","prayudh","KDP","","_","_"
3,"pāṇḍaveyeṣu","_","_","pāṇḍaveya","NC","","_","_"
4,"nirbhayaḥ","_","_","nirbhaya","JJ","","_","_"
1,"duryodhano","_","_","duryodhana","NC","","_","_"
2,"_","_","_","mahat","JJ","","_","_"
3,"_","_","_","rāja","NC","","_","_"
4,"vyavagāhata","_","_","vyavagāh","V","vyavagāh","_","_"
5,"tad","_","_","tad","PRD","","_","_"
6,"balam","_","_","bala","NC","","_","_"
1,"saindhavasya","_","_","saindhava","NC","","_","_"
2,"_","_","_","vadha","NC","","_","_"
3,"_","_","_","eva","CEM","","_","_"
4,"bhṛśaṃ","_","_","bhṛśa","CX","","_","_"
5,"_","_","_","duḥkha","NC","","_","_"
6,"_","_","_","samanvita","JJ","","_","_"
1,"martavyam","_","_","mṛ","KDG","","_","_"
2,"iti","_","_","iti","CQT","","_","_"
3,"saṃcintya","_","_","saṃcintay","CGDA","","_","_"
4,"prāviśat","_","_","praviś","V","praviś","_","_"
5,"tu","_","_","tu","CCD","","_","_"
6,"_","_","_","dviṣ","KDP","","_","_"
7,"_","_","_","bala","NC","","_","_"
1,"nādayan","_","_","nāday","KDP","","_","_"
2,"_","_","_","ratha","NC","","_","_"
3,"_","_","_","ghoṣa","NC","","_","_"
4,"kampayann","_","_","kampay","KDP","","_","_"
5,"iva","_","_","iva","CCM","","_","_"
6,"medinīm","_","_","medinī","NC","","_","_"
1,"abhyavartata","_","_","abhivart","V","abhivṛt","_","_"
2,"_","_","_","putra","NC","","_","_"
3,"_","_","_","tvat","PPR","","_","_"
4,"pāṇḍavānām","_","_","pāṇḍava","NC","","_","_"
5,"anīkinīm","_","_","anīkinī","NC","","_","_"
1,"sa","_","_","tad","PRD","","_","_"
2,"_","_","_","saṃnipāta","NC","","_","_"
3,"_","_","_","tumula","JJ","","_","_"
4,"_","_","_","tad","PRD","","_","_"
5,"teṣāṃ","_","_","tad","PRD","","_","_"
6,"ca","_","_","ca","CCD","","_","_"
7,"bhārata","_","_","bhārata","NC","","_","_"
1,"abhavat","_","_","bhav","V","bhū","_","_"
2,"_","_","_","sarva","JQ","","_","_"
3,"_","_","_","sainya","NC","","_","_"
4,"_","_","_","abhāva","NC","","_","_"
5,"_","_","_","karaṇa","NC","","_","_"
6,"mahān","_","_","mahat","JJ","","_","_"
1,"_","_","_","madhyaṃdina","NC","","_","_"
2,"_","_","_","ga","PPP","","_","_"
3,"sūryaṃ","_","_","sūrya","NC","","_","_"
4,"pratapantaṃ","_","_","pratap","KDP","","_","_"
5,"gabhastibhiḥ","_","_","gabhasti","NC","","_","_"
1,"tathā","_","_","tathā","CX","","_","_"
2,"tava","_","_","tvat","PPR","","_","_"
3,"sutaṃ","_","_","suta","NC","","_","_"
4,"madhye","_","_","madhya","NC","","_","_"
5,"pratapantaṃ","_","_","pratap","KDP","","_","_"
6,"_","_","_","śara","NC","","_","_"
7,"_","_","_","ūrmi","NC","","_","_"
1,"na","_","_","na","CNG","","_","_"
2,"śekur","_","_","śakn","V","śak","_","_"
3,"bhārataṃ","_","_","bhārata","NC","","_","_"
4,"yuddhe","_","_","yudh","PPP","","_","_"
5,"pāṇḍavāḥ","_","_","pāṇḍava","NC","","_","_"
6,"samavekṣitum","_","_","samavekṣ","CGDI","","_","_"
1,"palāyane","_","_","palāyana","NC","","_","_"
2,"_","_","_","kṛ","PPP","","_","_"
3,"_","_","_","utsāha","NC","","_","_"
4,"nirutsāhā","_","_","nirutsāha","JJ","","_","_"
5,"_","_","_","dviṣ","KDP","","_","_"
6,"_","_","_","jaya","NC","","_","_"
1,"paryadhāvanta","_","_","paridhāv","V","paridhāv","_","_"
2,"pāñcālā","_","_","pāñcāla","NC","","_","_"
3,"vadhyamānā","_","_","vadh","KDP","","_","_"
4,"mahātmanā","_","_","mahātman","JJ","","_","_"
1,"_","_","_","rukma","NC","","_","_"
2,"_","_","_","puṅkha","NC","","_","_"
3,"_","_","_","prasad","PPP","","_","_"
4,"_","_","_","agra","NC","","_","_"
5,"_","_","_","tvat","PPR","","_","_"
6,"putreṇa","_","_","putra","NC","","_","_"
7,"dhanvinā","_","_","dhanvin","JJ","","_","_"
1,"ardyamānāḥ","_","_","arday","KDP","","_","_"
2,"_","_","_","śara","NC","","_","_"
3,"_","_","_","tūrṇa","CX","","_","_"
4,"nyapatan","_","_","nipat","V","nipat","_","_"
5,"_","_","_","pāṇḍu","NC","","_","_"
6,"_","_","_","sainika","NC","","_","_"
1,"na","_","_","na","CNG","","_","_"
2,"tādṛśaṃ","_","_","tādṛśa","JJ","","_","_"
3,"raṇe","_","_","raṇa","NC","","_","_"
4,"karma","_","_","karman","NC","","_","_"
5,"_","_","_","kṛ","KDP","","_","_"
6,"_","_","_","tu","CCD","","_","_"
7,"tāvakāḥ","_","_","tāvaka","JJ","","_","_"
1,"yādṛśaṃ","_","_","yādṛśa","JJ","","_","_"
2,"kṛtavān","_","_","kṛ","KDP","","_","_"
3,"rājā","_","_","rājan","NC","","_","_"
4,"_","_","_","putra","NC","","_","_"
5,"_","_","_","tvat","PPR","","_","_"
6,"viśāṃ","_","_","viś","NC","","_","_"
7,"pate","_","_","pati","NC","","_","_"
1,"putreṇa","_","_","putra","NC","","_","_"
2,"tava","_","_","tvat","PPR","","_","_"
3,"sā","_","_","tad","PRD","","_","_"
4,"senā","_","_","senā","NC","","_","_"
5,"pāṇḍavī","_","_","pāṇḍava","JJ","","_","_"
6,"mathitā","_","_","math","PPP","","_","_"
7,"raṇe","_","_","raṇa","NC","","_","_"
1,"nalinī","_","_","nalinī","NC","","_","_"
2,"_","_","_","dvirada","NC","","_","_"
3,"_","_","_","iva","CCM","","_","_"
4,"samantāt","_","_","samantāt","CX","","_","_"
5,"_","_","_","phulla","JJ","","_","_"
6,"_","_","_","paṅkaja","NC","","_","_"
1,"_","_","_","kṣi","PPP","","_","_"
2,"_","_","_","toya","NC","","_","_"
3,"_","_","_","anila","NC","","_","_"
4,"_","_","_","arka","NC","","_","_"
5,"_","_","_","han","PPP","","_","_"
6,"_","_","_","tviṣ","NC","","_","_"
7,"iva","_","_","iva","CCM","","_","_"
8,"padminī","_","_","padminī","NC","","_","_"
1,"babhūva","_","_","bhav","V","bhū","_","_"
2,"pāṇḍavī","_","_","pāṇḍava","JJ","","_","_"
3,"senā","_","_","senā","NC","","_","_"
4,"tava","_","_","tvat","PPR","","_","_"
5,"putrasya","_","_","putra","NC","","_","_"
6,"tejasā","_","_","tejas","NC","","_","_"
1,"_","_","_","pāṇḍu","NC","","_","_"
2,"_","_","_","senā","NC","","_","_"
3,"hatāṃ","_","_","han","PPP","","_","_"
4,"dṛṣṭvā","_","_","dṛś","CGDA","","_","_"
5,"tava","_","_","tvat","PPR","","_","_"
6,"putreṇa","_","_","putra","NC","","_","_"
7,"bhārata","_","_","bhārata","NC","","_","_"
1,"_","_","_","bhīmasa","NC","","_","_"
2,"_","_","_","puroga","JJ","","_","_"
3,"_","_","_","tu","CCD","","_","_"
4,"pāñcālāḥ","_","_","pāñcāla","NC","","_","_"
5,"samupādravan","_","_","samupadru","V","samupadru","_","_"
1,"sa","_","_","tad","PRD","","_","_"
2,"bhīmasenaṃ","_","_","bhīmasa","NC","","_","_"
3,"daśabhir","_","_","daśan","NUM","","_","_"
4,"_","_","_","mādrī","NC","","_","_"
5,"_","_","_","putra","NC","","_","_"
6,"_","_","_","tri","NUM","","_","_"
7,"_","_","_","tri","NUM","","_","_"
1,"_","_","_","virāṭa","NC","","_","_"
2,"_","_","_","drupada","NC","","_","_"
3,"ṣaḍbhiḥ","_","_","ṣaṣ","NUM","","_","_"
4,"śatena","_","_","śata","NUM","","_","_"
5,"ca","_","_","ca","CCD","","_","_"
6,"śikhaṇḍinam","_","_","śikhaṇḍin","NC","","_","_"
1,"dhṛṣṭadyumnaṃ","_","_","dhṛṣṭadyumna","NC","","_","_"
2,"ca","_","_","ca","CCD","","_","_"
3,"saptatyā","_","_","saptati","NC","","_","_"
4,"dharmaputraṃ","_","_","dharmaputra","NC","","_","_"
5,"ca","_","_","ca","CCD","","_","_"
6,"saptabhiḥ","_","_","saptan","NUM","","_","_"
1,"_","_","_","kekaya","NC","","_","_"
2,"_","_","_","ca","CCD","","_","_"
3,"_","_","_","eva","CEM","","_","_"
4,"_","_","_","cedi","NC","","_","_"
5,"_","_","_","ca","CCD","","_","_"
6,"bahubhir","_","_","bahu","JJ","","_","_"
7,"niśitaiḥ","_","_","niśā","PPP","","_","_"
8,"śaraiḥ","_","_","śara","NC","","_","_"
1,"sātvataṃ","_","_","sātvata","NC","","_","_"
2,"pañcabhir","_","_","pañcan","NUM","","_","_"
3,"viddhvā","_","_","vyadh","CGDA","","_","_"
4,"_","_","_","draupadeya","NC","","_","_"
5,"_","_","_","tri","NUM","","_","_"
6,"_","_","_","tri","NUM","","_","_"
1,"ghaṭotkacaṃ","_","_","ghaṭotkaca","NC","","_","_"
2,"ca","_","_","ca","CCD","","_","_"
3,"samare","_","_","samara","NC","","_","_"
4,"viddhvā","_","_","vyadh","CGDA","","_","_"
5,"siṃha","_","_","siṃha","NC","","_","_"
6,"_","_","_","iva","CCM","","_","_"
7,"_","_","_","nad","V","nad","_","_"
1,"_","_","_","śataśas","CX","","_","_"
2,"_","_","_","ca","CCD","","_","_"
3,"_","_","_","apara","PPX","","_","_"
4,"yodhān","_","_","yodha","NC","","_","_"
5,"_","_","_","sa_saha","CX","","_","_"
6,"_","_","_","dvipa","NC","","_","_"
7,"_","_","_","aśva","NC","","_","_"
8,"_","_","_","ratha","NC","","_","_"
9,"raṇe","_","_","raṇa","NC","","_","_"
1,"śarair","_","_","śara","NC","","_","_"
2,"_","_","_","avakṛt","V","avakṛt","_","_"
3,"_","_","_","ugra","JJ","","_","_"
4,"kruddho","_","_","krudh","PPP","","_","_"
5,"'ntaka","_","_","antaka","NC","","_","_"
6,"iva","_","_","iva","CCM","","_","_"
7,"prajāḥ","_","_","prajā","NC","","_","_"
1,"tasya","_","_","tad","PRD","","_","_"
2,"_","_","_","tad","PRD","","_","_"
3,"_","_","_","nihan","KDP","","_","_"
4,"śatrūn","_","_","śatru","NC","","_","_"
5,"_","_","_","rukma","NC","","_","_"
6,"_","_","_","pṛṣṭha","NC","","_","_"
7,"mahad","_","_","mahat","JJ","","_","_"
8,"dhanuḥ","_","_","dhanus","NC","","_","_"
1,"bhallābhyāṃ","_","_","bhalla","NC","","_","_"
2,"pāṇḍavo","_","_","pāṇḍava","NC","","_","_"
3,"_","_","_","jyeṣṭha","JJ","","_","_"
4,"_","_","_","tridhā","CX","","_","_"
5,"cicheda","_","_","chid","V","chid","_","_"
6,"māriṣa","_","_","māriṣa","NC","","_","_"
1,"vivyādha","_","_","vyadh","V","vyadh","_","_"
2,"_","_","_","ca","CCD","","_","_"
3,"_","_","_","a","PRD","","_","_"
4,"daśabhiḥ","_","_","daśan","NUM","","_","_"
5,"_","_","_","samyak","CX","","_","_"
6,"_","_","_","as","PPP","","_","_"
7,"śitaiḥ","_","_","śā","PPP","","_","_"
8,"śaraiḥ","_","_","śara","NC","","_","_"
1,"marmāṇi","_","_","marman","NC","","_","_"
2,"bhittvā","_","_","bhid","CGDA","","_","_"
3,"te","_","_","tad","PRD","","_","_"
4,"sarve","_","_","sarva","JQ","","_","_"
5,"saṃbhagnāḥ","_","_","sambhañj","PPP","","_","_"
6,"kṣitim","_","_","kṣiti","NC","","_","_"
7,"āviśan","_","_","āviś","V","āviś","_","_"
1,"tataḥ","_","_","tatas","CX","","_","_"
2,"pramuditā","_","_","pramud","PPP","","_","_"
3,"yodhāḥ","_","_","yodha","NC","","_","_"
4,"parivavrur","_","_","parivṛ","V","parivṛ","_","_"
5,"yudhiṣṭhiram","_","_","yudhiṣṭhira","NC","","_","_"
1,"_","_","_","vṛtra","NC","","_","_"
2,"_","_","_","hati","NC","","_","_"
3,"yathā","_","_","yathā","CCM","","_","_"
4,"devāḥ","_","_","deva","NC","","_","_"
5,"parivavruḥ","_","_","parivṛ","V","parivṛ","_","_"
6,"puraṃdaram","_","_","puraṃdara","NC","","_","_"
1,"tato","_","_","tatas","CX","","_","_"
2,"yudhiṣṭhiro","_","_","yudhiṣṭhira","NC","","_","_"
3,"rājā","_","_","rājan","NC","","_","_"
4,"tava","_","_","tvat","PPR","","_","_"
5,"putrasya","_","_","putra","NC","","_","_"
6,"māriṣa","_","_","māriṣa","NC","","_","_"
1,"śaraṃ","_","_","śara","NC","","_","_"
2,"_","_","_","parama","JJ","","_","_"
3,"_","_","_","durvāra","JJ","","_","_"
4,"preṣayāmāsa","_","_","preṣay","V","preṣay","_","_"
5,"saṃyuge","_","_","saṃyuga","NC","","_","_"
1,"sa","_","_","tad","PRD","","_","_"
2,"tena","_","_","tad","PRD","","_","_"
3,"_","_","_","bhṛśa","JJ","","_","_"
4,"_","_","_","saṃvyadh","PPP","","_","_"
5,"niṣasāda","_","_","niṣad","V","niṣad","_","_"
6,"_","_","_","ratha","NC","","_","_"
7,"_","_","_","uttama","JJ","","_","_"
1,"tataḥ","_","_","tatas","CX","","_","_"
2,"_","_","_","pāñcāla","NC","","_","_"
3,"_","_","_","sainya","NC","","_","_"
4,"bhṛśam","_","_","bhṛśa","CX","","_","_"
5,"āsīd","_","_","as","V","as","_","_"
6,"ravo","_","_","rava","NC","","_","_"
7,"mahān","_","_","mahat","JJ","","_","_"
1,"hato","_","_","han","PPP","","_","_"
2,"_","_","_","rājan","NC","","_","_"
3,"_","_","_","iti","CQT","","_","_"
4,"_","_","_","rājan","NC","","_","_"
5,"_","_","_","indra","NC","","_","_"
6,"muditānāṃ","_","_","mud","PPP","","_","_"
7,"samantataḥ","_","_","samantataḥ","CX","","_","_"
1,"_","_","_","bāṇa","NC","","_","_"
2,"_","_","_","śabda","NC","","_","_"
3,"_","_","_","rava","NC","","_","_"
4,"_","_","_","ca","CCD","","_","_"
5,"_","_","_","ugra","JJ","","_","_"
6,"śuśruve","_","_","śṛṇ","V","śru","_","_"
7,"tatra","_","_","tatra","CAD","","_","_"
8,"māriṣa","_","_","māriṣa","NC","","_","_"
1,"atha","_","_","atha","CAD","","_","_"
2,"droṇo","_","_","droṇa","NC","","_","_"
3,"drutaṃ","_","_","druta","CX","","_","_"
4,"tatra","_","_","tatra","CAD","","_","_"
5,"pratyadṛśyata","_","_","pratyadṛśya","V","pratidṛś","_","_"
6,"saṃyuge","_","_","saṃyuga","NC","","_","_"
1,"hṛṣṭo","_","_","hṛṣ","PPP","","_","_"
2,"_","_","_","duryodhana","NC","","_","_"
3,"_","_","_","ca","CCD","","_","_"
4,"_","_","_","api","CX","","_","_"
5,"dṛḍham","_","_","dṛḍha","JJ","","_","_"
6,"ādāya","_","_","ādā","CGDA","","_","_"
7,"kārmukam","_","_","kārmuka","NC","","_","_"
1,"tiṣṭha","_","_","tiṣṭh","V","sthā","_","_"
2,"_","_","_","tiṣṭh","V","sthā","_","_"
3,"_","_","_","iti","CQT","","_","_"
4,"rājānaṃ","_","_","rājan","NC","","_","_"
5,"bruvan","_","_","abravīta","V","brū","_","_"
6,"pāṇḍavam","_","_","pāṇḍava","NC","","_","_"
7,"abhyayāt","_","_","abhiyā","V","abhiyā","_","_"
1,"_","_","_","pratyudyā","V","pratyudyā","_","_"
2,"_","_","_","tad","PRD","","_","_"
3,"tvaritāḥ","_","_","tvar","PPP","","_","_"
4,"pāñcālā","_","_","pāñcāla","NC","","_","_"
5,"_","_","_","rājan","NC","","_","_"
6,"_","_","_","gṛddhin","JJ","","_","_"
1,"tān","_","_","tad","PRD","","_","_"
2,"droṇaḥ","_","_","droṇa","NC","","_","_"
3,"pratijagrāha","_","_","pratigrah","V","pratigrah","_","_"
4,"parīpsan","_","_","parīps","KDP","","_","_"
5,"kurusattamam","_","_","kurusattama","NC","","_","_"
1,"_","_","_","caṇḍa","JJ","","_","_"
2,"_","_","_","vāta","NC","","_","_"
3,"_","_","_","uddhan","PPP","","_","_"
4,"_","_","_","megha","NC","","_","_"
5,"_","_","_","nihan","KDP","","_","_"
6,"raśmimuco","_","_","raśmimuca","NC","","_","_"
7,"yathā","_","_","yathā","CCM","","_","_"
1,"tato","_","_","tatas","CX","","_","_"
2,"_","_","_","rājan","NC","","_","_"
3,"_","_","_","mahat","JJ","","_","_"
4,"āsīt","_","_","as","V","as","_","_"
5,"saṃgrāmo","_","_","saṃgrāma","NC","","_","_"
6,"_","_","_","bhūri","JQ","","_","_"
7,"_","_","_","vardhana","JJ","","_","_"
1,"tāvakānāṃ","_","_","tāvaka","JJ","","_","_"
2,"pareṣāṃ","_","_","para","PPX","","_","_"
3,"ca","_","_","ca","CCD","","_","_"
4,"sametānāṃ","_","_","same","PPP","","_","_"
5,"yuyutsayā","_","_","yuyutsā","NC","","_","_"
