"WordID","word","NormSTEM","suffix","lemma","PoS","Root","NormSuffix","NormWord"
1,"saṃjaya","_","_","saṃjaya","NC","","_","_"
2,"uvāca","_","_","vak","V","vac","_","_"
1,"parivartamāne","_","_","parivṛt","KDP","","_","_"
2,"_","_","_","tu","CCD","","_","_"
3,"_","_","_","āditya","NC","","_","_"
4,"tatra","_","_","tatra","CAD","","_","_"
5,"sūryasya","_","_","sūrya","NC","","_","_"
6,"raśmibhiḥ","_","_","raśmi","NC","","_","_"
1,"rajasā","_","_","rajas","NC","","_","_"
2,"_","_","_","kṛ","KDP","","_","_"
3,"_","_","_","ca","CCD","","_","_"
4,"_","_","_","mandībhū","PPP","","_","_"
5,"_","_","_","ca","CCD","","_","_"
6,"sainikāḥ","_","_","sainika","NC","","_","_"
1,"tiṣṭhatāṃ","_","_","sthā","KDP","","_","_"
2,"yudhyamānānāṃ","_","_","yudh","KDP","","_","_"
3,"punar","_","_","punar","CAD","","_","_"
4,"āvartatām","_","_","āvṛt","KDP","","_","_"
5,"api","_","_","api","CX","","_","_"
1,"bhajyatāṃ","_","_","bhañj","KDP","","_","_"
2,"jayatāṃ","_","_","ji","KDP","","_","_"
3,"_","_","_","ca","CCD","","_","_"
4,"_","_","_","eva","CEM","","_","_"
5,"jagāma","_","_","ga","V","ga","_","_"
6,"tad","_","_","tad","PRD","","_","_"
7,"ahaḥ","_","_","ahar","NC","","_","_"
8,"śanaiḥ","_","_","śanais","CX","","_","_"
1,"tathā","_","_","tathā","CX","","_","_"
2,"teṣu","_","_","tad","PRD","","_","_"
3,"viṣakteṣu","_","_","viṣañj","PPP","","_","_"
4,"sainyeṣu","_","_","sainya","NC","","_","_"
5,"_","_","_","jaya","NC","","_","_"
6,"_","_","_","gṛddhin","JJ","","_","_"
1,"arjuno","_","_","arjuna","NC","","_","_"
2,"_","_","_","vāsudeva","NC","","_","_"
3,"_","_","_","ca","CCD","","_","_"
4,"_","_","_","saindhava","NC","","_","_"
5,"_","_","_","eva","CEM","","_","_"
6,"jagmatuḥ","_","_","ga","V","ga","_","_"
1,"_","_","_","ratha","NC","","_","_"
2,"_","_","_","mārga","NC","","_","_"
3,"_","_","_","pramāṇa","NC","","_","_"
4,"tu","_","_","tu","CCD","","_","_"
5,"kaunteyo","_","_","kaunteya","NC","","_","_"
6,"niśitaiḥ","_","_","niśā","PPP","","_","_"
7,"śaraiḥ","_","_","śara","NC","","_","_"
1,"cakāra","_","_","kar","V","kṛ","_","_"
2,"tatra","_","_","tatra","CAD","","_","_"
3,"panthānaṃ","_","_","pathin","NC","","_","_"
4,"yayau","_","_","yā","V","yā","_","_"
5,"yena","_","_","yad","PRL","","_","_"
6,"janārdanaḥ","_","_","janārdana","NC","","_","_"
1,"yatra","_","_","yatra","CX","","_","_"
2,"yatra","_","_","yatra","CX","","_","_"
3,"ratho","_","_","ratha","NC","","_","_"
4,"yāti","_","_","yā","V","yā","_","_"
5,"pāṇḍavasya","_","_","pāṇḍava","NC","","_","_"
6,"mahātmanaḥ","_","_","mahātman","JJ","","_","_"
1,"tatra","_","_","tatra","CAD","","_","_"
2,"_","_","_","tatra","CAD","","_","_"
3,"_","_","_","eva","CEM","","_","_"
4,"dīryante","_","_","dṛ","V","dṛ","_","_"
5,"_","_","_","senā","NC","","_","_"
6,"_","_","_","tvat","PPR","","_","_"
7,"viśāṃ","_","_","viś","NC","","_","_"
8,"pate","_","_","pati","NC","","_","_"
1,"_","_","_","ratha","NC","","_","_"
2,"_","_","_","śikṣā","NC","","_","_"
3,"tu","_","_","tu","CCD","","_","_"
4,"dāśārho","_","_","dāśārha","NC","","_","_"
5,"darśayāmāsa","_","_","darśay","V","darśay","_","_"
6,"vīryavān","_","_","vīryavat","JJ","","_","_"
1,"_","_","_","uttama","JJ","","_","_"
2,"_","_","_","adhama","JJ","","_","_"
3,"_","_","_","madhya","JJ","","_","_"
4,"maṇḍalāni","_","_","maṇḍala","NC","","_","_"
5,"vidarśayan","_","_","vidarśay","KDP","","_","_"
1,"te","_","_","tad","PRD","","_","_"
2,"tu","_","_","tu","CCD","","_","_"
3,"_","_","_","nāman","NC","","_","_"
4,"_","_","_","aṅkay","PPP","","_","_"
5,"pītāḥ","_","_","pīta","JJ","","_","_"
6,"_","_","_","kāla","NC","","_","_"
7,"_","_","_","jvalana","NC","","_","_"
8,"_","_","_","saṃnibha","JJ","","_","_"
1,"_","_","_","snāyu","NC","","_","_"
2,"_","_","_","nah","PPP","","_","_"
3,"_","_","_","su","CAD","","_","_"
4,"_","_","_","parvan","NC","","_","_"
5,"pṛthavo","_","_","pṛthu","JJ","","_","_"
6,"_","_","_","dīrgha","JJ","","_","_"
7,"_","_","_","gāmin","JJ","","_","_"
1,"_","_","_","vaiṇava","JJ","","_","_"
2,"_","_","_","ayasmaya","JJ","","_","_"
3,"_","_","_","śara","NC","","_","_"
4,"_","_","_","su","CAD","","_","_"
5,"_","_","_","āya","PPP","","_","_"
6,"_","_","_","vividha","JJ","","_","_"
7,"_","_","_","ānana","NC","","_","_"
1,"rudhiraṃ","_","_","rudhira","NC","","_","_"
2,"patagaiḥ","_","_","pataga","NC","","_","_"
3,"sārdhaṃ","_","_","sārdha","CX","","_","_"
4,"prāṇināṃ","_","_","prāṇin","NC","","_","_"
5,"papur","_","_","pib","V","pā","_","_"
6,"āhave","_","_","āhava","NC","","_","_"
1,"_","_","_","ratha","NC","","_","_"
2,"_","_","_","sthā","PPP","","_","_"
3,"_","_","_","krośa","NC","","_","_"
4,"_","_","_","mātra","NC","","_","_"
5,"yān","_","_","yad","PRL","","_","_"
6,"_","_","_","as","V","as","_","_"
7,"_","_","_","arjuna","NC","","_","_"
8,"śarān","_","_","śara","NC","","_","_"
1,"rathe","_","_","ratha","NC","","_","_"
2,"krośam","_","_","krośa","NC","","_","_"
3,"atikrānte","_","_","atikra","PPP","","_","_"
4,"tasya","_","_","tad","PRD","","_","_"
5,"te","_","_","tad","PRD","","_","_"
6,"ghnanti","_","_","han","V","han","_","_"
7,"śātravān","_","_","śātrava","NC","","_","_"
1,"_","_","_","tārkṣya","NC","","_","_"
2,"_","_","_","māruta","NC","","_","_"
3,"_","_","_","raṃhas","NC","","_","_"
4,"vājibhiḥ","_","_","vājin","NC","","_","_"
5,"_","_","_","sādhu","JJ","","_","_"
6,"_","_","_","vāhin","JJ","","_","_"
1,"_","_","_","tathā","CX","","_","_"
2,"_","_","_","ga","V","ga","_","_"
3,"_","_","_","hṛṣīkeśa","NC","","_","_"
4,"kṛtsnaṃ","_","_","kṛtsna","JJ","","_","_"
5,"vismāpayañ","_","_","vismāpay","KDP","","_","_"
6,"jagat","_","_","jagat","NC","","_","_"
1,"na","_","_","na","CNG","","_","_"
2,"tathā","_","_","tathā","CX","","_","_"
3,"gacchati","_","_","gacch","V","gam","_","_"
4,"_","_","_","ratha","NC","","_","_"
5,"_","_","_","tapana","NC","","_","_"
6,"viśāṃ","_","_","viś","NC","","_","_"
7,"pate","_","_","pati","NC","","_","_"
1,"_","_","_","na","CNG","","_","_"
2,"_","_","_","indra","NC","","_","_"
3,"na","_","_","na","CNG","","_","_"
4,"ca","_","_","ca","CCD","","_","_"
5,"rudrasya","_","_","rudra","NC","","_","_"
6,"_","_","_","na","CNG","","_","_"
7,"_","_","_","api","CX","","_","_"
8,"vaiśravaṇasya","_","_","vaiśravaṇa","NC","","_","_"
9,"ca","_","_","ca","CCD","","_","_"
1,"_","_","_","na","CNG","","_","_"
2,"_","_","_","anya","PPX","","_","_"
3,"samare","_","_","samara","NC","","_","_"
4,"rājan","_","_","rājan","NC","","_","_"
5,"_","_","_","ga","PPP","","_","_"
6,"_","_","_","pūrva","PPX","","_","_"
7,"_","_","_","tathā","CX","","_","_"
8,"rathaḥ","_","_","ratha","NC","","_","_"
1,"yathā","_","_","yathā","CCM","","_","_"
2,"_","_","_","yā","V","yā","_","_"
3,"_","_","_","arjuna","NC","","_","_"
4,"_","_","_","manas","NC","","_","_"
5,"_","_","_","abhiprāya","NC","","_","_"
6,"_","_","_","śīghra","JJ","","_","_"
7,"_","_","_","ga","JJ","","_","_"
1,"praviśya","_","_","praviś","CGDA","","_","_"
2,"tu","_","_","tu","CCD","","_","_"
3,"raṇe","_","_","raṇa","NC","","_","_"
4,"rājan","_","_","rājan","NC","","_","_"
5,"keśavaḥ","_","_","keśava","NC","","_","_"
6,"_","_","_","para","PPX","","_","_"
7,"_","_","_","vīra","NC","","_","_"
8,"_","_","_","han","JJ","","_","_"
1,"_","_","_","senā","NC","","_","_"
2,"_","_","_","madhya","NC","","_","_"
3,"_","_","_","haya","NC","","_","_"
4,"_","_","_","tūrṇa","CX","","_","_"
5,"codayāmāsa","_","_","coday","V","coday","_","_"
6,"bhārata","_","_","bhārata","NC","","_","_"
1,"_","_","_","tatas","CX","","_","_"
2,"_","_","_","tad","PRD","","_","_"
3,"_","_","_","ratha","NC","","_","_"
4,"_","_","_","ogha","NC","","_","_"
5,"madhyaṃ","_","_","madhya","NC","","_","_"
6,"prāpya","_","_","prāp","CGDA","","_","_"
7,"_","_","_","haya","NC","","_","_"
8,"_","_","_","uttama","JJ","","_","_"
1,"kṛcchreṇa","_","_","kṛcchra","NC","","_","_"
2,"ratham","_","_","ratha","NC","","_","_"
3,"_","_","_","vah","V","vah","_","_"
4,"_","_","_","tad","PRD","","_","_"
5,"_","_","_","kṣudh","NC","","_","_"
6,"_","_","_","pipāsā","NC","","_","_"
7,"_","_","_","śrama","NC","","_","_"
8,"_","_","_","anvita","JJ","","_","_"
1,"_","_","_","kṣan","PPP","","_","_"
2,"_","_","_","ca","CCD","","_","_"
3,"bahubhiḥ","_","_","bahu","JJ","","_","_"
4,"śastrair","_","_","śastra","NC","","_","_"
5,"_","_","_","yuddha","NC","","_","_"
6,"_","_","_","śauṇḍa","JJ","","_","_"
7,"anekaśaḥ","_","_","anekaśas","CX","","_","_"
1,"maṇḍalāni","_","_","maṇḍala","NC","","_","_"
2,"vicitrāṇi","_","_","vicitra","JJ","","_","_"
3,"_","_","_","vicar","V","vicar","_","_"
4,"_","_","_","tad","PRD","","_","_"
5,"muhur","_","_","muhur","CX","","_","_"
6,"muhuḥ","_","_","muhur","CX","","_","_"
1,"hatānāṃ","_","_","han","PPP","","_","_"
2,"_","_","_","vājin","NC","","_","_"
3,"_","_","_","nāga","NC","","_","_"
4,"rathānāṃ","_","_","ratha","NC","","_","_"
5,"ca","_","_","ca","CCD","","_","_"
6,"naraiḥ","_","_","nara","NC","","_","_"
7,"saha","_","_","saha","CX","","_","_"
1,"upariṣṭād","_","_","upariṣṭāt","CX","","_","_"
2,"atikrāntāḥ","_","_","atikra","PPP","","_","_"
3,"_","_","_","śaila","NC","","_","_"
4,"_","_","_","ābha","JJ","","_","_"
5,"sahasraśaḥ","_","_","sahasraśas","CX","","_","_"
1,"etasminn","_","_","tad","PRD","","_","_"
2,"antare","_","_","antara","NC","","_","_"
3,"_","_","_","vīra","NC","","_","_"
4,"_","_","_","āvantya","NC","","_","_"
5,"bhrātarau","_","_","bhrātṛ","NC","","_","_"
6,"nṛpa","_","_","nṛpa","NC","","_","_"
1,"_","_","_","saha","CX","","_","_"
2,"_","_","_","senā","NC","","_","_"
3,"samārchetāṃ","_","_","samṛch","V","samṛch","_","_"
4,"pāṇḍavaṃ","_","_","pāṇḍava","NC","","_","_"
5,"_","_","_","kla","PPP","","_","_"
6,"_","_","_","vāhana","NC","","_","_"
1,"_","_","_","tad","PRD","","_","_"
2,"_","_","_","arjuna","NC","","_","_"
3,"catuḥṣaṣṭyā","_","_","catuḥṣaṣṭi","NC","","_","_"
4,"saptatyā","_","_","saptati","NC","","_","_"
5,"ca","_","_","ca","CCD","","_","_"
6,"janārdanam","_","_","janārdana","NC","","_","_"
1,"śarāṇāṃ","_","_","śara","NC","","_","_"
2,"ca","_","_","ca","CCD","","_","_"
3,"_","_","_","śata","NUM","","_","_"
4,"_","_","_","aśva","NC","","_","_"
5,"avidhyetāṃ","_","_","vyadh","V","vyadh","_","_"
6,"_","_","_","mudā","NC","","_","_"
7,"_","_","_","anvita","JJ","","_","_"
1,"_","_","_","tad","PRD","","_","_"
2,"_","_","_","arjuna","NC","","_","_"
3,"_","_","_","mahat","JJ","","_","_"
4,"_","_","_","rāja","NC","","_","_"
5,"navabhir","_","_","navan","NUM","","_","_"
6,"_","_","_","na","PPP","","_","_"
7,"_","_","_","parvan","NC","","_","_"
1,"ājaghāna","_","_","āhan","V","āhan","_","_"
2,"raṇe","_","_","raṇa","NC","","_","_"
3,"kruddho","_","_","krudh","PPP","","_","_"
4,"_","_","_","marman","NC","","_","_"
5,"_","_","_","jña","JJ","","_","_"
6,"_","_","_","marman","NC","","_","_"
7,"_","_","_","bhedin","JJ","","_","_"
1,"_","_","_","tatas","CX","","_","_"
2,"_","_","_","tad","PRD","","_","_"
3,"tu","_","_","tu","CCD","","_","_"
4,"_","_","_","śara","NC","","_","_"
5,"_","_","_","ogha","NC","","_","_"
6,"bībhatsuṃ","_","_","bībhatsu","NC","","_","_"
7,"_","_","_","saha","CX","","_","_"
8,"_","_","_","keśava","NC","","_","_"
1,"ācchādayetāṃ","_","_","ācchāday","V","ācchāday","_","_"
2,"saṃrabdhau","_","_","saṃrabh","PPP","","_","_"
3,"siṃhanādaṃ","_","_","siṃhanāda","NC","","_","_"
4,"ca","_","_","ca","CCD","","_","_"
5,"nedatuḥ","_","_","nad","V","nad","_","_"
1,"_","_","_","tad","PRD","","_","_"
2,"_","_","_","tu","CCD","","_","_"
3,"dhanuṣī","_","_","dhanus","NC","","_","_"
4,"citre","_","_","citra","JJ","","_","_"
5,"bhallābhyāṃ","_","_","bhalla","NC","","_","_"
6,"śvetavāhanaḥ","_","_","śvetavāhana","NC","","_","_"
1,"cicheda","_","_","chid","V","chid","_","_"
2,"samare","_","_","samara","NC","","_","_"
3,"tūrṇaṃ","_","_","tūrṇa","CX","","_","_"
4,"dhvajau","_","_","dhvaja","NC","","_","_"
5,"ca","_","_","ca","CCD","","_","_"
6,"_","_","_","kanaka","NC","","_","_"
7,"_","_","_","ujjvala","JJ","","_","_"
1,"_","_","_","atha","CAD","","_","_"
2,"_","_","_","anya","PPX","","_","_"
3,"dhanuṣī","_","_","dhanus","NC","","_","_"
4,"rājan","_","_","rājan","NC","","_","_"
5,"pragṛhya","_","_","pragrah","CGDA","","_","_"
6,"samare","_","_","samara","NC","","_","_"
7,"tadā","_","_","tadā","CAD","","_","_"
1,"pāṇḍavaṃ","_","_","pāṇḍava","NC","","_","_"
2,"_","_","_","bhṛśa","JJ","","_","_"
3,"_","_","_","saṃkrudh","PPP","","_","_"
4,"ardayāmāsatuḥ","_","_","arday","V","arday","_","_"
5,"śaraiḥ","_","_","śara","NC","","_","_"
1,"_","_","_","tad","PRD","","_","_"
2,"_","_","_","tu","CCD","","_","_"
3,"_","_","_","bhṛśa","JJ","","_","_"
4,"_","_","_","saṃkrudh","PPP","","_","_"
5,"śarābhyāṃ","_","_","śara","NC","","_","_"
6,"_","_","_","pāṇḍu","NC","","_","_"
7,"_","_","_","nandana","NC","","_","_"
1,"cicheda","_","_","chid","V","chid","_","_"
2,"dhanuṣī","_","_","dhanus","NC","","_","_"
3,"tūrṇaṃ","_","_","tūrṇa","CX","","_","_"
4,"bhūya","_","_","bhūyas","CX","","_","_"
5,"eva","_","_","eva","CEM","","_","_"
6,"dhanaṃjayaḥ","_","_","dhanaṃjaya","NC","","_","_"
1,"_","_","_","tathā","CX","","_","_"
2,"_","_","_","anya","PPX","","_","_"
3,"_","_","_","viśikha","NC","","_","_"
4,"_","_","_","tūrṇa","CX","","_","_"
5,"_","_","_","heman","NC","","_","_"
6,"_","_","_","puṅkha","NC","","_","_"
7,"_","_","_","śilā","NC","","_","_"
8,"_","_","_","śā","PPP","","_","_"
1,"_","_","_","han","V","han","_","_"
2,"_","_","_","aśva","NC","","_","_"
3,"_","_","_","sa_saha","CX","","_","_"
4,"_","_","_","padāta","NC","","_","_"
5,"_","_","_","tathā","CX","","_","_"
6,"_","_","_","ubh","PPX","","_","_"
7,"pārṣṇisārathī","_","_","pārṣṇisārathi","NC","","_","_"
1,"jyeṣṭhasya","_","_","jyeṣṭha","JJ","","_","_"
2,"ca","_","_","ca","CCD","","_","_"
3,"śiraḥ","_","_","śiras","NC","","_","_"
4,"kāyāt","_","_","kāya","NC","","_","_"
5,"kṣurapreṇa","_","_","kṣurapra","NC","","_","_"
6,"nyakṛntata","_","_","nikṛt","V","nikṛt","_","_"
1,"sa","_","_","tad","PRD","","_","_"
2,"papāta","_","_","pat","V","pat","_","_"
3,"hataḥ","_","_","han","PPP","","_","_"
4,"pṛthvyāṃ","_","_","pṛthvī","NC","","_","_"
5,"_","_","_","vāta","NC","","_","_"
6,"_","_","_","ruj","PPP","","_","_"
7,"iva","_","_","iva","CCM","","_","_"
8,"drumaḥ","_","_","druma","NC","","_","_"
1,"vindaṃ","_","_","vinda","NC","","_","_"
2,"tu","_","_","tu","CCD","","_","_"
3,"nihataṃ","_","_","nihan","PPP","","_","_"
4,"dṛṣṭvā","_","_","dṛś","CGDA","","_","_"
5,"anuvindaḥ","_","_","anuvinda","NC","","_","_"
6,"pratāpavān","_","_","pratāpavat","JJ","","_","_"
1,"_","_","_","han","PPP","","_","_"
2,"_","_","_","aśva","NC","","_","_"
3,"ratham","_","_","ratha","NC","","_","_"
4,"utsṛjya","_","_","utsṛj","CGDA","","_","_"
5,"gadāṃ","_","_","gadā","NC","","_","_"
6,"gṛhya","_","_","grah","CGDA","","_","_"
7,"_","_","_","mahat","JJ","","_","_"
8,"_","_","_","bala","NC","","_","_"
1,"abhyadravata","_","_","abhidru","V","abhidru","_","_"
2,"saṃgrāme","_","_","saṃgrāma","NC","","_","_"
3,"bhrātur","_","_","bhrātṛ","NC","","_","_"
4,"vadham","_","_","vadha","NC","","_","_"
5,"anusmaran","_","_","anusmṛ","KDP","","_","_"
1,"gadayā","_","_","gadā","NC","","_","_"
2,"gadināṃ","_","_","gadin","JJ","","_","_"
3,"śreṣṭho","_","_","śreṣṭha","JJ","","_","_"
4,"nṛtyann","_","_","nṛt","KDP","","_","_"
5,"iva","_","_","iva","CCM","","_","_"
6,"_","_","_","mahat","JJ","","_","_"
7,"_","_","_","ratha","NC","","_","_"
1,"_","_","_","anuvinda","NC","","_","_"
2,"_","_","_","tu","CCD","","_","_"
3,"gadayā","_","_","gadā","NC","","_","_"
4,"lalāṭe","_","_","lalāṭa","NC","","_","_"
5,"madhusūdanam","_","_","madhusūdana","NC","","_","_"
1,"spṛṣṭvā","_","_","spṛś","CGDA","","_","_"
2,"_","_","_","na","CNG","","_","_"
3,"_","_","_","kampay","V","kampay","_","_"
4,"kruddho","_","_","krudh","PPP","","_","_"
5,"mainākam","_","_","maināka","NC","","_","_"
6,"iva","_","_","iva","CCM","","_","_"
7,"parvatam","_","_","parvata","NC","","_","_"
1,"_","_","_","tad","PRD","","_","_"
2,"_","_","_","arjuna","NC","","_","_"
3,"śaraiḥ","_","_","śara","NC","","_","_"
4,"ṣaḍbhir","_","_","ṣaṣ","NUM","","_","_"
5,"grīvāṃ","_","_","grīvā","NC","","_","_"
6,"pādau","_","_","pāda","NC","","_","_"
7,"bhujau","_","_","bhuja","NC","","_","_"
8,"śiraḥ","_","_","śiras","NC","","_","_"
1,"nicakarta","_","_","nikṛt","V","nikṛt","_","_"
2,"sa","_","_","tad","PRD","","_","_"
3,"saṃchinnaḥ","_","_","saṃchid","PPP","","_","_"
4,"_","_","_","pat","V","pat","_","_"
5,"_","_","_","adri","NC","","_","_"
6,"_","_","_","caya","NC","","_","_"
7,"yathā","_","_","yathā","CCM","","_","_"
1,"_","_","_","tatas","CX","","_","_"
2,"_","_","_","tad","PRD","","_","_"
3,"nihatau","_","_","nihan","PPP","","_","_"
4,"dṛṣṭvā","_","_","dṛś","CGDA","","_","_"
5,"tayo","_","_","tad","PRD","","_","_"
6,"rājan","_","_","rājan","NC","","_","_"
7,"padānugāḥ","_","_","padānuga","JJ","","_","_"
1,"abhyadravanta","_","_","abhidru","V","abhidru","_","_"
2,"saṃkruddhāḥ","_","_","saṃkrudh","PPP","","_","_"
3,"kirantaḥ","_","_","kṛ","KDP","","_","_"
4,"śataśaḥ","_","_","śataśas","CX","","_","_"
5,"śarān","_","_","śara","NC","","_","_"
1,"tān","_","_","tad","PRD","","_","_"
2,"arjunaḥ","_","_","arjuna","NC","","_","_"
3,"_","_","_","śara","NC","","_","_"
4,"_","_","_","tūrṇa","CX","","_","_"
5,"nihatya","_","_","nihan","CGDA","","_","_"
6,"_","_","_","bharata","NC","","_","_"
7,"_","_","_","ṛṣabha","NC","","_","_"
1,"vyarocata","_","_","viroc","V","viruc","_","_"
2,"yathā","_","_","yathā","CCM","","_","_"
3,"vahnir","_","_","vahni","NC","","_","_"
4,"dāvaṃ","_","_","dāva","NC","","_","_"
5,"dagdhvā","_","_","dah","CGDA","","_","_"
6,"_","_","_","hima","NC","","_","_"
7,"_","_","_","atyaya","NC","","_","_"
1,"tayoḥ","_","_","tad","PRD","","_","_"
2,"senām","_","_","senā","NC","","_","_"
3,"atikramya","_","_","atikra","CGDA","","_","_"
4,"_","_","_","kṛcchra","NC","","_","_"
5,"_","_","_","niryā","V","niryā","_","_"
6,"dhanaṃjayaḥ","_","_","dhanaṃjaya","NC","","_","_"
1,"vibabhau","_","_","vibabha","V","vibhā","_","_"
2,"jaladān","_","_","jalada","NC","","_","_"
3,"bhittvā","_","_","bhid","CGDA","","_","_"
4,"divākara","_","_","divākara","NC","","_","_"
5,"_","_","_","iva","CCM","","_","_"
6,"_","_","_","udi","PPP","","_","_"
1,"taṃ","_","_","tad","PRD","","_","_"
2,"dṛṣṭvā","_","_","dṛś","CGDA","","_","_"
3,"_","_","_","kuru","NC","","_","_"
4,"_","_","_","tras","PPP","","_","_"
5,"_","_","_","prahṛṣ","PPP","","_","_"
6,"_","_","_","ca","CCD","","_","_"
7,"_","_","_","bhav","V","bhū","_","_"
8,"punaḥ","_","_","punar","CAD","","_","_"
1,"_","_","_","abhivṛṣ","V","abhivṛṣ","_","_"
2,"_","_","_","tadā","CAD","","_","_"
3,"pārthaṃ","_","_","pārtha","NC","","_","_"
4,"samantād","_","_","samantāt","CX","","_","_"
5,"_","_","_","bharata","NC","","_","_"
6,"_","_","_","ṛṣabha","NC","","_","_"
1,"śrāntaṃ","_","_","śra","PPP","","_","_"
2,"_","_","_","ca","CCD","","_","_"
3,"_","_","_","a","PRD","","_","_"
4,"samālakṣya","_","_","samālakṣay","CGDA","","_","_"
5,"jñātvā","_","_","jñā","CGDA","","_","_"
6,"dūre","_","_","dūra","NC","","_","_"
7,"ca","_","_","ca","CCD","","_","_"
8,"saindhavam","_","_","saindhava","NC","","_","_"
1,"siṃhanādena","_","_","siṃhanāda","NC","","_","_"
2,"mahatā","_","_","mahat","JJ","","_","_"
3,"sarvataḥ","_","_","sarvatas","CX","","_","_"
4,"paryavārayan","_","_","parivāray","V","parivāray","_","_"
1,"_","_","_","tad","PRD","","_","_"
2,"_","_","_","tu","CCD","","_","_"
3,"dṛṣṭvā","_","_","dṛś","CGDA","","_","_"
4,"_","_","_","su","CAD","","_","_"
5,"_","_","_","saṃrabh","PPP","","_","_"
6,"utsmayan","_","_","utsmi","KDP","","_","_"
7,"_","_","_","puruṣa","NC","","_","_"
8,"_","_","_","ṛṣabha","NC","","_","_"
1,"śanakair","_","_","śanakais","CX","","_","_"
2,"iva","_","_","iva","CCM","","_","_"
3,"dāśārham","_","_","dāśārha","NC","","_","_"
4,"arjuno","_","_","arjuna","NC","","_","_"
5,"vākyam","_","_","vākya","NC","","_","_"
6,"abravīt","_","_","abravīta","V","brū","_","_"
1,"_","_","_","śara","NC","","_","_"
2,"_","_","_","arday","PPP","","_","_"
3,"_","_","_","ca","CCD","","_","_"
4,"_","_","_","glā","PPP","","_","_"
5,"_","_","_","ca","CCD","","_","_"
6,"hayā","_","_","haya","NC","","_","_"
7,"dūre","_","_","dūra","NC","","_","_"
8,"ca","_","_","ca","CCD","","_","_"
9,"saindhavaḥ","_","_","saindhava","NC","","_","_"
1,"kim","_","_","kiṃ","PRQ","","_","_"
2,"_","_","_","iha","CAD","","_","_"
3,"_","_","_","anantara","CX","","_","_"
4,"kāryaṃ","_","_","kṛ","KDG","","_","_"
5,"jyāyiṣṭhaṃ","_","_","jyāyiṣṭha","JJ","","_","_"
6,"tava","_","_","tvat","PPR","","_","_"
7,"rocate","_","_","roc","V","ruc","_","_"
1,"brūhi","_","_","abravīta","V","brū","_","_"
2,"kṛṣṇa","_","_","kṛṣṇa","NC","","_","_"
3,"yathātattvaṃ","_","_","yathātattva","CX","","_","_"
4,"tvaṃ","_","_","tvat","PPR","","_","_"
5,"hi","_","_","hi","CX","","_","_"
6,"prājñatamaḥ","_","_","prājñatama","JJ","","_","_"
7,"sadā","_","_","sadā","CAD","","_","_"
1,"_","_","_","bhavat","JJ","","_","_"
2,"_","_","_","netra","NC","","_","_"
3,"raṇe","_","_","raṇa","NC","","_","_"
4,"śatrūn","_","_","śatru","NC","","_","_"
5,"_","_","_","vijay","V","viji","_","_"
6,"_","_","_","iha","CAD","","_","_"
7,"pāṇḍavāḥ","_","_","pāṇḍava","NC","","_","_"
1,"mama","_","_","mat","PPR","","_","_"
2,"_","_","_","tu","CCD","","_","_"
3,"_","_","_","anantara","CX","","_","_"
4,"kṛtyaṃ","_","_","kṛ","KDG","","_","_"
5,"yad","_","_","yad","PRL","","_","_"
6,"vai","_","_","vai","CX","","_","_"
7,"tat","_","_","tad","PRD","","_","_"
8,"saṃnibodha","_","_","saṃnibudh","V","saṃnibudh","_","_"
9,"me","_","_","mat","PPR","","_","_"
1,"hayān","_","_","haya","NC","","_","_"
2,"vimucya","_","_","vimuc","CGDA","","_","_"
3,"hi","_","_","hi","CX","","_","_"
4,"sukhaṃ","_","_","sukha","CX","","_","_"
5,"viśalyān","_","_","viśalya","JJ","","_","_"
6,"kuru","_","_","kar","V","kṛ","_","_"
7,"mādhava","_","_","mādhava","NC","","_","_"
1,"evam","_","_","eva","CX","","_","_"
2,"_","_","_","vac","PPP","","_","_"
3,"_","_","_","tu","CCD","","_","_"
4,"pārthena","_","_","pārtha","NC","","_","_"
5,"keśavaḥ","_","_","keśava","NC","","_","_"
6,"pratyuvāca","_","_","prativak","V","prativac","_","_"
7,"tam","_","_","tad","PRD","","_","_"
1,"_","_","_","mat","PPR","","_","_"
2,"_","_","_","api","CX","","_","_"
3,"_","_","_","tad","PRD","","_","_"
4,"_","_","_","man","PPP","","_","_"
5,"pārtha","_","_","pārtha","NC","","_","_"
6,"yad","_","_","yad","PRL","","_","_"
7,"idaṃ","_","_","ida","PRD","","_","_"
8,"te","_","_","tvat","PPR","","_","_"
9,"prabhāṣitam","_","_","prabhāṣ","PPP","","_","_"
1,"arjuna","_","_","arjuna","NC","","_","_"
2,"uvāca","_","_","vak","V","vac","_","_"
1,"aham","_","_","mat","PPR","","_","_"
2,"āvārayiṣyāmi","_","_","āvāray","V","āvāray","_","_"
3,"_","_","_","sarva","JQ","","_","_"
4,"_","_","_","sainya","NC","","_","_"
5,"keśava","_","_","keśava","NC","","_","_"
1,"tvam","_","_","tvat","PPR","","_","_"
2,"_","_","_","api","CX","","_","_"
3,"_","_","_","atra","CAD","","_","_"
4,"yathānyāyaṃ","_","_","yathānyāya","CX","","_","_"
5,"kuru","_","_","kar","V","kṛ","_","_"
6,"kāryam","_","_","kārya","NC","","_","_"
7,"anantaram","_","_","anantara","JJ","","_","_"
1,"saṃjaya","_","_","saṃjaya","NC","","_","_"
2,"uvāca","_","_","vak","V","vac","_","_"
1,"so","_","_","tad","PRD","","_","_"
2,"'vatīrya","_","_","avatṛ","CGDA","","_","_"
3,"rathopasthād","_","_","rathopastha","NC","","_","_"
4,"a","_","_","alpha_privativum","JJ","","_","_"
4,"asaṃbhrānto","_","_","sambhrānta","JJ","","_","_"
5,"dhanaṃjayaḥ","_","_","dhanaṃjaya","NC","","_","_"
1,"gāṇḍīvaṃ","_","_","gāṇḍīva","NC","","_","_"
2,"dhanur","_","_","dhanus","NC","","_","_"
3,"ādāya","_","_","ādā","CGDA","","_","_"
4,"tasthau","_","_","tiṣṭh","V","sthā","_","_"
5,"girir","_","_","giri","NC","","_","_"
6,"_","_","_","iva","CCM","","_","_"
7,"_","_","_","acala","JJ","","_","_"
1,"tam","_","_","tad","PRD","","_","_"
2,"abhyadhāvan","_","_","abhidhāv","V","abhidhāv","_","_"
3,"krośantaḥ","_","_","kruś","KDP","","_","_"
4,"kṣatriyā","_","_","kṣatriya","NC","","_","_"
5,"_","_","_","jaya","NC","","_","_"
6,"_","_","_","kāṅkṣin","JJ","","_","_"
1,"idaṃ","_","_","ida","PRD","","_","_"
2,"chidram","_","_","chidra","NC","","_","_"
3,"iti","_","_","iti","CQT","","_","_"
4,"jñātvā","_","_","jñā","CGDA","","_","_"
5,"_","_","_","dharaṇī","NC","","_","_"
6,"_","_","_","stha","JJ","","_","_"
7,"dhanaṃjayam","_","_","dhanaṃjaya","NC","","_","_"
1,"tam","_","_","tad","PRD","","_","_"
2,"ekaṃ","_","_","eka","PPX","","_","_"
3,"_","_","_","ratha","NC","","_","_"
4,"_","_","_","vaṃśa","NC","","_","_"
5,"mahatā","_","_","mahat","JJ","","_","_"
6,"paryavārayan","_","_","parivāray","V","parivāray","_","_"
1,"_","_","_","vikṛṣ","KDP","","_","_"
2,"_","_","_","ca","CCD","","_","_"
3,"cāpāni","_","_","cāpa","NC","","_","_"
4,"_","_","_","visṛj","KDP","","_","_"
5,"_","_","_","ca","CCD","","_","_"
6,"sāyakān","_","_","sāyaka","NC","","_","_"
1,"astrāṇi","_","_","astra","NC","","_","_"
2,"ca","_","_","ca","CCD","","_","_"
3,"vicitrāṇi","_","_","vicitra","JJ","","_","_"
4,"_","_","_","krudh","PPP","","_","_"
5,"_","_","_","tatra","CAD","","_","_"
6,"vyadarśayan","_","_","vidarśay","V","vidarśay","_","_"
1,"chādayantaḥ","_","_","chāday","KDP","","_","_"
2,"śaraiḥ","_","_","śara","NC","","_","_"
3,"pārthaṃ","_","_","pārtha","NC","","_","_"
4,"meghā","_","_","megha","NC","","_","_"
5,"iva","_","_","iva","CCM","","_","_"
6,"divākaram","_","_","divākara","NC","","_","_"
1,"abhyadravanta","_","_","abhidru","V","abhidru","_","_"
2,"vegena","_","_","vega","NC","","_","_"
3,"kṣatriyāḥ","_","_","kṣatriya","NC","","_","_"
4,"_","_","_","kṣatriya","NC","","_","_"
5,"_","_","_","ṛṣabha","NC","","_","_"
1,"_","_","_","ratha","NC","","_","_"
2,"_","_","_","siṃha","NC","","_","_"
3,"_","_","_","ratha","NC","","_","_"
4,"_","_","_","udāra","JJ","","_","_"
5,"siṃhaṃ","_","_","siṃha","NC","","_","_"
6,"mattā","_","_","mat","PPP","","_","_"
7,"iva","_","_","iva","CCM","","_","_"
8,"dvipāḥ","_","_","dvipa","NC","","_","_"
1,"tatra","_","_","tatra","CAD","","_","_"
2,"pārthasya","_","_","pārtha","NC","","_","_"
3,"bhujayor","_","_","bhuja","NC","","_","_"
4,"mahad","_","_","mahat","JJ","","_","_"
5,"balam","_","_","bala","NC","","_","_"
6,"adṛśyata","_","_","darś","V","dṛś","_","_"
1,"yat","_","_","yat","CSB","","_","_"
2,"kruddho","_","_","krudh","PPP","","_","_"
3,"bahulāḥ","_","_","bahula","JJ","","_","_"
4,"senāḥ","_","_","senā","NC","","_","_"
5,"sarvataḥ","_","_","sarvatas","CX","","_","_"
6,"samavārayat","_","_","saṃvāray","V","saṃvāray","_","_"
1,"astrair","_","_","astra","NC","","_","_"
2,"astrāṇi","_","_","astra","NC","","_","_"
3,"saṃvārya","_","_","saṃvāray","CGDA","","_","_"
4,"dviṣatāṃ","_","_","dviṣ","KDP","","_","_"
5,"sarvato","_","_","sarvatas","CX","","_","_"
6,"vibhuḥ","_","_","vibhu","JJ","","_","_"
1,"iṣubhir","_","_","iṣu","NC","","_","_"
2,"_","_","_","bahu","JJ","","_","_"
3,"_","_","_","tūrṇa","CX","","_","_"
4,"sarvān","_","_","sarva","JQ","","_","_"
5,"eva","_","_","eva","CEM","","_","_"
6,"samāvṛṇot","_","_","samāvṛ","V","samāvṛ","_","_"
1,"_","_","_","tatra","CAD","","_","_"
2,"_","_","_","antarikṣa","NC","","_","_"
3,"bāṇānāṃ","_","_","bāṇa","NC","","_","_"
4,"pragāḍhānāṃ","_","_","pragāh","PPP","","_","_"
5,"viśāṃ","_","_","viś","NC","","_","_"
6,"pate","_","_","pati","NC","","_","_"
1,"saṃgharṣeṇa","_","_","saṃgharṣa","NC","","_","_"
2,"_","_","_","mahat","JJ","","_","_"
3,"_","_","_","arciṣmat","JJ","","_","_"
4,"pāvakaḥ","_","_","pāvaka","NC","","_","_"
5,"samajāyata","_","_","saṃjan","V","saṃjan","_","_"
1,"tatra","_","_","tatra","CAD","","_","_"
2,"tatra","_","_","tatra","CAD","","_","_"
3,"_","_","_","mahat","JJ","","_","_"
4,"_","_","_","iṣvāsa","NC","","_","_"
5,"śvasadbhiḥ","_","_","śvas","KDP","","_","_"
6,"_","_","_","śoṇita","NC","","_","_"
7,"_","_","_","ukṣ","PPP","","_","_"
1,"hayair","_","_","haya","NC","","_","_"
2,"_","_","_","nāga","NC","","_","_"
3,"_","_","_","ca","CCD","","_","_"
4,"saṃbhinnair","_","_","sambhid","PPP","","_","_"
5,"_","_","_","nad","KDP","","_","_"
6,"_","_","_","ca","CCD","","_","_"
7,"_","_","_","ari","NC","","_","_"
8,"_","_","_","karśana","JJ","","_","_"
1,"_","_","_","saṃrabh","PPP","","_","_"
2,"_","_","_","ca","CCD","","_","_"
3,"_","_","_","ari","NC","","_","_"
4,"vīraiḥ","_","_","vīra","NC","","_","_"
5,"prārthayadbhir","_","_","prārthay","KDP","","_","_"
6,"jayaṃ","_","_","jaya","NC","","_","_"
7,"mṛdhe","_","_","mṛdha","NC","","_","_"
1,"ekasthair","_","_","ekastha","JJ","","_","_"
2,"bahubhiḥ","_","_","bahu","JJ","","_","_"
3,"kruddhair","_","_","krudh","PPP","","_","_"
4,"_","_","_","ūṣman","NC","","_","_"
5,"_","_","_","iva","CCM","","_","_"
6,"samajāyata","_","_","saṃjan","V","saṃjan","_","_"
1,"_","_","_","śara","NC","","_","_"
2,"_","_","_","ūrmin","JJ","","_","_"
3,"_","_","_","dhvaja","NC","","_","_"
4,"_","_","_","āvarta","NC","","_","_"
5,"_","_","_","nāga","NC","","_","_"
6,"_","_","_","nakra","NC","","_","_"
7,"duratyayam","_","_","duratyaya","JJ","","_","_"
1,"_","_","_","padāti","NC","","_","_"
2,"_","_","_","matsya","NC","","_","_"
3,"_","_","_","kalila","JJ","","_","_"
4,"_","_","_","śaṅkha","NC","","_","_"
5,"_","_","_","dundubhi","NC","","_","_"
6,"_","_","_","nisvana","NC","","_","_"
1,"asaṃkhyeyam","_","_","asaṃkhyeya","JJ","","_","_"
2,"apāraṃ","_","_","apāra","JJ","","_","_"
3,"ca","_","_","ca","CCD","","_","_"
4,"_","_","_","rajas","NC","","_","_"
5,"_","_","_","ābhīla","JJ","","_","_"
6,"atīva","_","_","atīva","CX","","_","_"
7,"ca","_","_","ca","CCD","","_","_"
1,"_","_","_","uṣṇīṣa","NC","","_","_"
2,"_","_","_","kamaṭha","NC","","_","_"
3,"_","_","_","chad","PPP","","_","_"
4,"_","_","_","patākā","NC","","_","_"
5,"_","_","_","pha","NC","","_","_"
6,"_","_","_","mālin","JJ","","_","_"
1,"_","_","_","ratha","NC","","_","_"
2,"_","_","_","sāgara","NC","","_","_"
3,"akṣobhyaṃ","_","_","akṣobhya","JJ","","_","_"
4,"_","_","_","mātaṃga","NC","","_","_"
5,"_","_","_","aṅga","JJ","","_","_"
6,"_","_","_","śilā","NC","","_","_"
7,"_","_","_","ci","PPP","","_","_"
1,"_","_","_","velā","NC","","_","_"
2,"_","_","_","bhū","PPP","","_","_"
3,"_","_","_","tadā","CAD","","_","_"
4,"pārthaḥ","_","_","pārtha","NC","","_","_"
5,"patribhiḥ","_","_","pattrin","NC","","_","_"
6,"samavārayat","_","_","saṃvāray","V","saṃvāray","_","_"
1,"tato","_","_","tatas","CX","","_","_"
2,"janārdanaḥ","_","_","janārdana","NC","","_","_"
3,"saṃkhye","_","_","saṃkhya","NC","","_","_"
4,"priyaṃ","_","_","priya","JJ","","_","_"
5,"_","_","_","puruṣa","NC","","_","_"
6,"_","_","_","sattama","JJ","","_","_"
1,"a","_","_","alpha_privativum","JJ","","_","_"
1,"asaṃbhrānto","_","_","sambhrānta","JJ","","_","_"
2,"_","_","_","mahat","JJ","","_","_"
3,"_","_","_","bāhu","NC","","_","_"
4,"arjunaṃ","_","_","arjuna","NC","","_","_"
5,"vākyam","_","_","vākya","NC","","_","_"
6,"abravīt","_","_","abravīta","V","brū","_","_"
1,"udapānam","_","_","udapāna","NC","","_","_"
2,"_","_","_","iha","CAD","","_","_"
3,"_","_","_","aśva","NC","","_","_"
4,"_","_","_","na","CNG","","_","_"
5,"_","_","_","ala","CX","","_","_"
6,"asti","_","_","as","V","as","_","_"
7,"raṇe","_","_","raṇa","NC","","_","_"
8,"'rjuna","_","_","arjuna","NC","","_","_"
1,"parīpsante","_","_","parīps","V","parīps","_","_"
2,"jalaṃ","_","_","jala","NC","","_","_"
3,"_","_","_","ca","CCD","","_","_"
4,"_","_","_","ida","PRD","","_","_"
5,"peyaṃ","_","_","pā","KDG","","_","_"
6,"na","_","_","na","CNG","","_","_"
7,"_","_","_","tu","CCD","","_","_"
8,"_","_","_","avagāhana","NC","","_","_"
1,"idam","_","_","ida","PRD","","_","_"
2,"_","_","_","as","V","as","_","_"
3,"_","_","_","iti","CQT","","_","_"
4,"a","_","_","alpha_privativum","JJ","","_","_"
4,"_","_","_","sambhrānta","JJ","","_","_"
5,"bruvann","_","_","brū","KDP","","_","_"
6,"astreṇa","_","_","astra","NC","","_","_"
7,"medinīm","_","_","medinī","NC","","_","_"
1,"_","_","_","abhihan","CGDA","","_","_"
2,"_","_","_","arjuna","NC","","_","_"
3,"_","_","_","kar","V","kṛ","_","_"
4,"_","_","_","vājin","NC","","_","_"
5,"_","_","_","pāna","NC","","_","_"
6,"saraḥ","_","_","saras","NC","","_","_"
7,"śubham","_","_","śubha","JJ","","_","_"
1,"_","_","_","śara","NC","","_","_"
2,"_","_","_","vaṃśa","NC","","_","_"
3,"_","_","_","śara","NC","","_","_"
4,"_","_","_","sthūṇā","NC","","_","_"
5,"_","_","_","śara","NC","","_","_"
6,"_","_","_","ācchādana","NC","","_","_"
7,"adbhutam","_","_","adbhuta","JJ","","_","_"
1,"_","_","_","śara","NC","","_","_"
2,"_","_","_","veśman","NC","","_","_"
3,"_","_","_","kar","V","kṛ","_","_"
4,"_","_","_","pārtha","NC","","_","_"
5,"_","_","_","tvaṣṭṛ","NC","","_","_"
6,"_","_","_","iva","CCM","","_","_"
7,"_","_","_","adbhuta","JJ","","_","_"
8,"_","_","_","karman","NC","","_","_"
9,"_","_","_","kṛt","JJ","","_","_"
1,"tataḥ","_","_","tatas","CX","","_","_"
2,"prahasya","_","_","prahas","CGDA","","_","_"
3,"govindaḥ","_","_","govinda","NC","","_","_"
4,"sādhu","_","_","sādhu","JJ","","_","_"
5,"_","_","_","sādhu","JJ","","_","_"
6,"_","_","_","iti","CQT","","_","_"
7,"_","_","_","atha","CAD","","_","_"
8,"_","_","_","abravīta","V","brū","_","_"
1,"_","_","_","śara","NC","","_","_"
2,"_","_","_","veśman","NC","","_","_"
3,"pārthena","_","_","pārtha","NC","","_","_"
4,"kṛte","_","_","kṛ","PPP","","_","_"
5,"_","_","_","tad","PRD","","_","_"
6,"_","_","_","mahat","JJ","","_","_"
7,"_","_","_","raṇa","NC","","_","_"
