"WordID","word","NormSTEM","suffix","lemma","PoS","Root","NormSuffix","NormWord"
1,"ya","_","_","yad","PRL","","_","_"
2,"ime","_","_","ida","PRD","","_","_"
3,"dyāvāpṛthivī","_","_","dyāvāpṛthivī","NC","","_","_"
4,"jajāna","_","_","jan","V","jan","_","_"
5,"yo","_","_","yad","PRL","","_","_"
6,"drāpim","_","_","drāpi","NC","","_","_"
7,"kṛtvā","_","_","kṛ","CGDA","","_","_"
8,"bhuvanāni","_","_","bhuvana","NC","","_","_"
9,"vaste","_","_","vas","V","vas","_","_"
1,"yasmin","_","_","yad","PRL","","_","_"
2,"kṣiyanti","_","_","kṣi","V","kṣi","_","_"
3,"pradiśaḥ","_","_","pradiś","NC","","_","_"
4,"ṣaḍ","_","_","ṣaṣ","NUM","","_","_"
5,"urvīr","_","_","uru","JJ","","_","_"
6,"yāḥ","_","_","yad","PRL","","_","_"
7,"pataṅgo","_","_","pataṃga","NC","","_","_"
8,"anu","_","_","anu","CADP","","_","_"
9,"vicākaśīti","_","_","vicākaś","V","vicākaś","_","_"
1,"tasya","_","_","tad","PRD","","_","_"
2,"devasya","_","_","deva","NC","","_","_"
3,"_","_","_","krudh","PPP","","_","_"
4,"_","_","_","tad","PRD","","_","_"
5,"āgo","_","_","āgas","NC","","_","_"
6,"ya","_","_","yad","PRL","","_","_"
7,"evaṃ","_","_","eva","CX","","_","_"
8,"vidvāṃsaṃ","_","_","vid","KDP","","_","_"
9,"brāhmaṇaṃ","_","_","brāhmaṇa","NC","","_","_"
10,"jināti","_","_","jyā","V","jyā","_","_"
1,"udvepaya","_","_","udvepay","V","udvepay","_","_"
2,"rohita","_","_","rohita","JJ","","_","_"
3,"prakṣiṇīhi","_","_","prakṣi","V","prakṣi","_","_"
4,"brahmajyasya","_","_","brahmajya","JJ","","_","_"
5,"pratimuñca","_","_","pratimuñc","V","pratimuc","_","_"
6,"pāśān","_","_","pāśa","NC","","_","_"
1,"yasmād","_","_","yad","PRL","","_","_"
2,"vātā","_","_","vāta","NC","","_","_"
3,"ṛtuthā","_","_","ṛtuthā","CX","","_","_"
4,"pavante","_","_","pū","V","pū","_","_"
5,"yasmāt","_","_","yad","PRL","","_","_"
6,"samudrā","_","_","samudra","NC","","_","_"
7,"adhi","_","_","adhi","CADP","","_","_"
8,"vikṣaranti","_","_","vikṣar","V","vikṣar","_","_"
1,"tasya","_","_","tad","PRD","","_","_"
2,"devasya","_","_","deva","NC","","_","_"
3,"_","_","_","krudh","PPP","","_","_"
4,"_","_","_","tad","PRD","","_","_"
5,"āgo","_","_","āgas","NC","","_","_"
6,"ya","_","_","yad","PRL","","_","_"
7,"evaṃ","_","_","eva","CX","","_","_"
8,"vidvāṃsaṃ","_","_","vid","KDP","","_","_"
9,"brāhmaṇaṃ","_","_","brāhmaṇa","NC","","_","_"
10,"jināti","_","_","jyā","V","jyā","_","_"
1,"udvepaya","_","_","udvepay","V","udvepay","_","_"
2,"rohita","_","_","rohita","JJ","","_","_"
3,"prakṣiṇīhi","_","_","prakṣi","V","prakṣi","_","_"
4,"brahmajyasya","_","_","brahmajya","JJ","","_","_"
5,"pratimuñca","_","_","pratimuñc","V","pratimuc","_","_"
6,"pāśān","_","_","pāśa","NC","","_","_"
1,"yo","_","_","yad","PRL","","_","_"
2,"mārayati","_","_","mar","V","mṛ","_","_"
3,"prāṇayati","_","_","prāṇī","V","prāṇī","_","_"
4,"yasmāt","_","_","yad","PRL","","_","_"
5,"prāṇanti","_","_","prāṇ","V","prāṇ","_","_"
6,"bhuvanāni","_","_","bhuvana","NC","","_","_"
7,"viśvā","_","_","viśva","JQ","","_","_"
1,"tasya","_","_","tad","PRD","","_","_"
2,"devasya","_","_","deva","NC","","_","_"
3,"_","_","_","krudh","PPP","","_","_"
4,"_","_","_","tad","PRD","","_","_"
5,"āgo","_","_","āgas","NC","","_","_"
6,"ya","_","_","yad","PRL","","_","_"
7,"evaṃ","_","_","eva","CX","","_","_"
8,"vidvāṃsaṃ","_","_","vid","KDP","","_","_"
9,"brāhmaṇaṃ","_","_","brāhmaṇa","NC","","_","_"
10,"jināti","_","_","jyā","V","jyā","_","_"
1,"udvepaya","_","_","udvepay","V","udvepay","_","_"
2,"rohita","_","_","rohita","JJ","","_","_"
3,"prakṣiṇīhi","_","_","prakṣi","V","prakṣi","_","_"
4,"brahmajyasya","_","_","brahmajya","JJ","","_","_"
5,"pratimuñca","_","_","pratimuñc","V","pratimuc","_","_"
6,"pāśān","_","_","pāśa","NC","","_","_"
1,"yaḥ","_","_","yad","PRL","","_","_"
2,"prāṇena","_","_","prāṇa","NC","","_","_"
3,"dyāvāpṛthivī","_","_","dyāvāpṛthivī","NC","","_","_"
4,"tarpayaty","_","_","tarpay","V","tarpay","_","_"
5,"apānena","_","_","apāna","NC","","_","_"
6,"samudrasya","_","_","samudra","NC","","_","_"
7,"jaṭharaṃ","_","_","jaṭhara","NC","","_","_"
8,"yaḥ","_","_","yad","PRL","","_","_"
9,"piparti","_","_","pṛ","V","pṛ","_","_"
1,"tasya","_","_","tad","PRD","","_","_"
2,"devasya","_","_","deva","NC","","_","_"
3,"_","_","_","krudh","PPP","","_","_"
4,"_","_","_","tad","PRD","","_","_"
5,"āgo","_","_","āgas","NC","","_","_"
6,"ya","_","_","yad","PRL","","_","_"
7,"evaṃ","_","_","eva","CX","","_","_"
8,"vidvāṃsaṃ","_","_","vid","KDP","","_","_"
9,"brāhmaṇaṃ","_","_","brāhmaṇa","NC","","_","_"
10,"jināti","_","_","jyā","V","jyā","_","_"
1,"udvepaya","_","_","udvepay","V","udvepay","_","_"
2,"rohita","_","_","rohita","JJ","","_","_"
3,"prakṣiṇīhi","_","_","prakṣi","V","prakṣi","_","_"
4,"brahmajyasya","_","_","brahmajya","JJ","","_","_"
5,"pratimuñca","_","_","pratimuñc","V","pratimuc","_","_"
6,"pāśān","_","_","pāśa","NC","","_","_"
1,"yasmin","_","_","yad","PRL","","_","_"
2,"virāṭ","_","_","virāj","NC","","_","_"
3,"parameṣṭhī","_","_","parameṣṭhin","NC","","_","_"
4,"prajāpatir","_","_","prajāpati","NC","","_","_"
5,"agnir","_","_","agni","NC","","_","_"
6,"vaiśvānaraḥ","_","_","vaiśvānara","NC","","_","_"
7,"saha","_","_","saha","CX","","_","_"
8,"paṅktyā","_","_","paṅkti","NC","","_","_"
9,"śritaḥ","_","_","śri","PPP","","_","_"
1,"yaḥ","_","_","yad","PRL","","_","_"
2,"parasya","_","_","para","PPX","","_","_"
3,"prāṇaṃ","_","_","prāṇa","NC","","_","_"
4,"paramasya","_","_","parama","JJ","","_","_"
5,"teja","_","_","tejas","NC","","_","_"
6,"ādade","_","_","ādad","V","ādā","_","_"
1,"tasya","_","_","tad","PRD","","_","_"
2,"devasya","_","_","deva","NC","","_","_"
3,"_","_","_","krudh","PPP","","_","_"
4,"_","_","_","tad","PRD","","_","_"
5,"āgo","_","_","āgas","NC","","_","_"
6,"ya","_","_","yad","PRL","","_","_"
7,"evaṃ","_","_","eva","CX","","_","_"
8,"vidvāṃsaṃ","_","_","vid","KDP","","_","_"
9,"brāhmaṇaṃ","_","_","brāhmaṇa","NC","","_","_"
10,"jināti","_","_","jyā","V","jyā","_","_"
1,"yasmin","_","_","yad","PRL","","_","_"
2,"ṣaḍ","_","_","ṣaṣ","NUM","","_","_"
3,"urvīḥ","_","_","uru","JJ","","_","_"
4,"pañca","_","_","pañcan","NUM","","_","_"
5,"diśo","_","_","diś","NC","","_","_"
6,"adhiśritāś","_","_","adhiśri","PPP","","_","_"
7,"catasra","_","_","catur","NUM","","_","_"
8,"āpo","_","_","ap","NC","","_","_"
9,"yajñasya","_","_","yajña","NC","","_","_"
10,"trayo","_","_","tri","NUM","","_","_"
11,"'kṣarāḥ","_","_","akṣara","JJ","","_","_"
1,"yo","_","_","yad","PRL","","_","_"
2,"antarā","_","_","antarā","CX","","_","_"
3,"rodasī","_","_","rodas","NC","","_","_"
4,"kruddhaś","_","_","krudh","PPP","","_","_"
5,"_","_","_","cakṣus","NC","","_","_"
6,"_","_","_","īkṣ","V","īkṣ","_","_"
1,"tasya","_","_","tad","PRD","","_","_"
2,"devasya","_","_","deva","NC","","_","_"
3,"_","_","_","krudh","PPP","","_","_"
4,"_","_","_","tad","PRD","","_","_"
5,"āgo","_","_","āgas","NC","","_","_"
6,"ya","_","_","yad","PRL","","_","_"
7,"evaṃ","_","_","eva","CX","","_","_"
8,"vidvāṃsaṃ","_","_","vid","KDP","","_","_"
9,"brāhmaṇam","_","_","brāhmaṇa","NC","","_","_"
10,"jināti","_","_","jyā","V","jyā","_","_"
1,"yo","_","_","yad","PRL","","_","_"
2,"_","_","_","anna","NC","","_","_"
3,"_","_","_","āda","JJ","","_","_"
4,"_","_","_","anna","NC","","_","_"
5,"_","_","_","pati","NC","","_","_"
6,"babhūva","_","_","bhav","V","bhū","_","_"
7,"brahmaṇaspatir","_","_","brahmaṇaspati","NC","","_","_"
8,"uta","_","_","uta","CCD","","_","_"
9,"yaḥ","_","_","yad","PRL","","_","_"
1,"bhūto","_","_","bhū","PPP","","_","_"
2,"bhaviṣyat","_","_","bhū","KDP","","_","_"
3,"bhuvanasya","_","_","bhuvana","NC","","_","_"
4,"yas","_","_","yad","PRL","","_","_"
5,"patiḥ","_","_","pati","NC","","_","_"
1,"tasya","_","_","tad","PRD","","_","_"
2,"devasya","_","_","deva","NC","","_","_"
3,"_","_","_","krudh","PPP","","_","_"
4,"_","_","_","tad","PRD","","_","_"
5,"āgo","_","_","āgas","NC","","_","_"
6,"ya","_","_","yad","PRL","","_","_"
7,"evaṃ","_","_","eva","CX","","_","_"
8,"vidvāṃsaṃ","_","_","vid","KDP","","_","_"
9,"brāhmaṇaṃ","_","_","brāhmaṇa","NC","","_","_"
10,"jināti","_","_","jyā","V","jyā","_","_"
1,"ahorātrair","_","_","ahorātra","NC","","_","_"
2,"vimitaṃ","_","_","vimā","PPP","","_","_"
3,"_","_","_","triṃśat","NC","","_","_"
4,"_","_","_","aṅga","NC","","_","_"
5,"trayodaśaṃ","_","_","trayodaśa","JJ","","_","_"
6,"māsaṃ","_","_","māsa","NC","","_","_"
7,"yo","_","_","yad","PRL","","_","_"
8,"nirmimīte","_","_","nirmā","V","nirmā","_","_"
1,"tasya","_","_","tad","PRD","","_","_"
2,"devasya","_","_","deva","NC","","_","_"
3,"_","_","_","krudh","PPP","","_","_"
4,"_","_","_","tad","PRD","","_","_"
5,"āgo","_","_","āgas","NC","","_","_"
6,"ya","_","_","yad","PRL","","_","_"
7,"evaṃ","_","_","eva","CX","","_","_"
8,"vidvāṃsaṃ","_","_","vid","KDP","","_","_"
9,"brāhmaṇaṃ","_","_","brāhmaṇa","NC","","_","_"
10,"jināti","_","_","jyā","V","jyā","_","_"
1,"udvepaya","_","_","udvepay","V","udvepay","_","_"
2,"rohita","_","_","rohita","JJ","","_","_"
3,"prakṣiṇīhi","_","_","prakṣi","V","prakṣi","_","_"
4,"brahmajyasya","_","_","brahmajya","JJ","","_","_"
5,"pratimuñca","_","_","pratimuñc","V","pratimuc","_","_"
6,"pāśān","_","_","pāśa","NC","","_","_"
1,"kṛṣṇaṃ","_","_","kṛṣṇa","JJ","","_","_"
2,"niyānaṃ","_","_","niyāna","NC","","_","_"
3,"harayaḥ","_","_","hari","JJ","","_","_"
4,"suparṇā","_","_","suparṇa","NC","","_","_"
5,"apo","_","_","ap","NC","","_","_"
6,"vasānā","_","_","vas","KDP","","_","_"
7,"divam","_","_","div","NC","","_","_"
8,"utpatanti","_","_","utpat","V","utpat","_","_"
1,"ta","_","_","tad","PRD","","_","_"
2,"āvavṛtrant","_","_","āvart","V","āvṛt","_","_"
3,"sadanād","_","_","sadana","NC","","_","_"
4,"ṛtasya","_","_","ṛta","NC","","_","_"
1,"tasya","_","_","tad","PRD","","_","_"
2,"devasya","_","_","deva","NC","","_","_"
3,"_","_","_","krudh","PPP","","_","_"
4,"_","_","_","tad","PRD","","_","_"
5,"āgo","_","_","āgas","NC","","_","_"
6,"ya","_","_","yad","PRL","","_","_"
7,"evaṃ","_","_","eva","CX","","_","_"
8,"vidvāṃsaṃ","_","_","vid","KDP","","_","_"
9,"brāhmaṇaṃ","_","_","brāhmaṇa","NC","","_","_"
10,"jināti","_","_","jyā","V","jyā","_","_"
1,"yat","_","_","yad","PRL","","_","_"
2,"te","_","_","tvat","PPR","","_","_"
3,"candraṃ","_","_","candra","JJ","","_","_"
4,"kaśyapa","_","_","kaśyapa","NC","","_","_"
5,"rocanāvad","_","_","rocanāvat","JJ","","_","_"
6,"yat","_","_","yad","PRL","","_","_"
7,"saṃhitaṃ","_","_","saṃdhā","PPP","","_","_"
8,"puṣkalaṃ","_","_","puṣkala","JJ","","_","_"
9,"_","_","_","citra","JJ","","_","_"
10,"_","_","_","bhānu","NC","","_","_"
11,"yasmint","_","_","yad","PRL","","_","_"
12,"sūryā","_","_","sūrya","NC","","_","_"
13,"ārpitāḥ","_","_","ārpay","PPP","","_","_"
14,"sapta","_","_","saptan","NUM","","_","_"
15,"sākam","_","_","sāka","CX","","_","_"
1,"tasya","_","_","tad","PRD","","_","_"
2,"devasya","_","_","deva","NC","","_","_"
3,"_","_","_","krudh","PPP","","_","_"
4,"_","_","_","tad","PRD","","_","_"
5,"āgo","_","_","āgas","NC","","_","_"
6,"ya","_","_","yad","PRL","","_","_"
7,"evaṃ","_","_","eva","CX","","_","_"
8,"vidvāṃsaṃ","_","_","vid","KDP","","_","_"
9,"brāhmaṇaṃ","_","_","brāhmaṇa","NC","","_","_"
10,"jināti","_","_","jyā","V","jyā","_","_"
1,"udvepaya","_","_","udvepay","V","udvepay","_","_"
2,"rohita","_","_","rohita","JJ","","_","_"
3,"prakṣiṇīhi","_","_","prakṣi","V","prakṣi","_","_"
4,"brahmajyasya","_","_","brahmajya","JJ","","_","_"
5,"pratimuñca","_","_","pratimuñc","V","pratimuc","_","_"
6,"pāśān","_","_","pāśa","NC","","_","_"
1,"bṛhad","_","_","bṛhat","NC","","_","_"
2,"enam","_","_","a","PRD","","_","_"
3,"anuvaste","_","_","anuvas","V","anuvas","_","_"
4,"purastād","_","_","purastāt","CX","","_","_"
5,"rathaṃtaraṃ","_","_","rathaṃtara","NC","","_","_"
6,"pratigṛhṇāti","_","_","pratigrah","V","pratigrah","_","_"
7,"paścāt","_","_","paścāt","CAD","","_","_"
1,"jyotir","_","_","jyotis","NC","","_","_"
2,"vasāne","_","_","vas","KDP","","_","_"
3,"sadam","_","_","sada","CAD","","_","_"
4,"apramādam","_","_","apramāda","JJ","","_","_"
1,"tasya","_","_","tad","PRD","","_","_"
2,"devasya","_","_","deva","NC","","_","_"
3,"_","_","_","krudh","PPP","","_","_"
4,"_","_","_","tad","PRD","","_","_"
5,"āgo","_","_","āgas","NC","","_","_"
6,"ya","_","_","yad","PRL","","_","_"
7,"evaṃ","_","_","eva","CX","","_","_"
8,"vidvāṃsaṃ","_","_","vid","KDP","","_","_"
9,"brāhmaṇaṃ","_","_","brāhmaṇa","NC","","_","_"
10,"jināti","_","_","jyā","V","jyā","_","_"
1,"bṛhad","_","_","bṛhat","NC","","_","_"
2,"anyataḥ","_","_","anyatas","CX","","_","_"
3,"pakṣa","_","_","pakṣa","NC","","_","_"
4,"āsīd","_","_","as","V","as","_","_"
5,"rathaṃtaram","_","_","rathaṃtara","NC","","_","_"
6,"anyataḥ","_","_","anyatas","CX","","_","_"
7,"sabale","_","_","sabala","JJ","","_","_"
8,"sadhrīcī","_","_","sadhryañc","JJ","","_","_"
1,"yad","_","_","yat","CSB","","_","_"
2,"rohitam","_","_","rohita","JJ","","_","_"
3,"ajanayanta","_","_","janay","V","janay","_","_"
4,"devāḥ","_","_","deva","NC","","_","_"
1,"tasya","_","_","tad","PRD","","_","_"
2,"devasya","_","_","deva","NC","","_","_"
3,"_","_","_","krudh","PPP","","_","_"
4,"_","_","_","tad","PRD","","_","_"
5,"āgo","_","_","āgas","NC","","_","_"
6,"ya","_","_","yad","PRL","","_","_"
7,"evaṃ","_","_","eva","CX","","_","_"
8,"vidvāṃsaṃ","_","_","vid","KDP","","_","_"
9,"brāhmaṇaṃ","_","_","brāhmaṇa","NC","","_","_"
10,"jināti","_","_","jyā","V","jyā","_","_"
1,"sa","_","_","tad","PRD","","_","_"
2,"varuṇaḥ","_","_","varuṇa","NC","","_","_"
3,"sāyam","_","_","sāya","CX","","_","_"
4,"agnir","_","_","agni","NC","","_","_"
5,"bhavati","_","_","bhav","V","bhū","_","_"
6,"sa","_","_","sa_saha","CX","","_","_"
7,"mitro","_","_","mitra","NC","","_","_"
8,"bhavati","_","_","bhav","V","bhū","_","_"
9,"prātar","_","_","prātar","CX","","_","_"
10,"udyan","_","_","udi","KDP","","_","_"
1,"sa","_","_","tad","PRD","","_","_"
2,"savitā","_","_","savitṛ","NC","","_","_"
3,"_","_","_","bhū","CGDA","","_","_"
4,"_","_","_","antarikṣa","NC","","_","_"
5,"yāti","_","_","yā","V","yā","_","_"
6,"sa","_","_","tad","PRD","","_","_"
7,"indro","_","_","indra","NC","","_","_"
8,"bhūtvā","_","_","bhū","CGDA","","_","_"
9,"tapati","_","_","tap","V","tap","_","_"
10,"madhyato","_","_","madhyatas","CX","","_","_"
11,"divam","_","_","div","NC","","_","_"
1,"tasya","_","_","tad","PRD","","_","_"
2,"devasya","_","_","deva","NC","","_","_"
3,"_","_","_","krudh","PPP","","_","_"
4,"_","_","_","tad","PRD","","_","_"
5,"āgo","_","_","āgas","NC","","_","_"
6,"ya","_","_","yad","PRL","","_","_"
7,"evaṃ","_","_","eva","CX","","_","_"
8,"vidvāṃsaṃ","_","_","vid","KDP","","_","_"
9,"brāhmaṇaṃ","_","_","brāhmaṇa","NC","","_","_"
10,"jināti","_","_","jyā","V","jyā","_","_"
1,"sahasrāhṇyaṃ","_","_","sahasrāhnya","NC","","_","_"
2,"viyatāv","_","_","viya","PPP","","_","_"
3,"asya","_","_","ida","PRD","","_","_"
4,"pakṣau","_","_","pakṣa","NC","","_","_"
5,"harer","_","_","hari","JJ","","_","_"
6,"haṃsasya","_","_","haṃsa","NC","","_","_"
7,"patataḥ","_","_","pat","KDP","","_","_"
8,"svargam","_","_","svarga","NC","","_","_"
1,"sa","_","_","tad","PRD","","_","_"
2,"devānt","_","_","deva","NC","","_","_"
3,"sarvān","_","_","sarva","JQ","","_","_"
4,"urasy","_","_","uras","NC","","_","_"
5,"upadadya","_","_","upadā","CGDA","","_","_"
6,"saṃpaśyan","_","_","saṃpaś","KDP","","_","_"
7,"yāti","_","_","yā","V","yā","_","_"
8,"bhuvanāni","_","_","bhuvana","NC","","_","_"
9,"viśvā","_","_","viśva","JQ","","_","_"
1,"tasya","_","_","tad","PRD","","_","_"
2,"devasya","_","_","deva","NC","","_","_"
3,"_","_","_","krudh","PPP","","_","_"
4,"_","_","_","tad","PRD","","_","_"
5,"āgo","_","_","āgas","NC","","_","_"
6,"ya","_","_","yad","PRL","","_","_"
7,"evaṃ","_","_","eva","CX","","_","_"
8,"vidvāṃsaṃ","_","_","vid","KDP","","_","_"
9,"brāhmaṇaṃ","_","_","brāhmaṇa","NC","","_","_"
10,"jināti","_","_","jyā","V","jyā","_","_"
1,"ayaṃ","_","_","ida","PRD","","_","_"
2,"sa","_","_","tad","PRD","","_","_"
3,"devo","_","_","deva","NC","","_","_"
4,"apsv","_","_","ap","NC","","_","_"
5,"antaḥ","_","_","antar","CAD","","_","_"
6,"_","_","_","sahasra","NUM","","_","_"
7,"_","_","_","mūla","NC","","_","_"
8,"_","_","_","paru","NC","","_","_"
9,"_","_","_","śāka","NC","","_","_"
10,"attriḥ","_","_","atri","NC","","_","_"
1,"ya","_","_","yad","PRL","","_","_"
2,"idaṃ","_","_","ida","PRD","","_","_"
3,"viśvaṃ","_","_","viśva","JQ","","_","_"
4,"bhuvanaṃ","_","_","bhuvana","NC","","_","_"
5,"jajāna","_","_","jan","V","jan","_","_"
1,"tasya","_","_","tad","PRD","","_","_"
2,"devasya","_","_","deva","NC","","_","_"
3,"_","_","_","krudh","PPP","","_","_"
4,"_","_","_","tad","PRD","","_","_"
5,"āgo","_","_","āgas","NC","","_","_"
6,"ya","_","_","yad","PRL","","_","_"
7,"evaṃ","_","_","eva","CX","","_","_"
8,"vidvāṃsaṃ","_","_","vid","KDP","","_","_"
9,"brāhmaṇaṃ","_","_","brāhmaṇa","NC","","_","_"
10,"jināti","_","_","jyā","V","jyā","_","_"
1,"śukraṃ","_","_","śukra","JJ","","_","_"
2,"vahanti","_","_","vahan","V","vah","_","_"
3,"harayo","_","_","hari","NC","","_","_"
4,"raghuṣyado","_","_","raghuṣyad","JJ","","_","_"
5,"devaṃ","_","_","deva","NC","","_","_"
6,"divi","_","_","div","NC","","_","_"
7,"varcasā","_","_","varcas","NC","","_","_"
8,"bhrājamānam","_","_","bhrāj","KDP","","_","_"
1,"_","_","_","yad","PRL","","_","_"
2,"_","_","_","ūrdhva","JJ","","_","_"
3,"divaṃ","_","_","div","NC","","_","_"
4,"tanvas","_","_","tanu","NC","","_","_"
5,"tapanty","_","_","tap","V","tap","_","_"
6,"arvāṅ","_","_","arvāñc","JJ","","_","_"
7,"_","_","_","su","CAD","","_","_"
8,"_","_","_","varṇa","NC","","_","_"
9,"paṭarair","_","_","paṭara","NC","","_","_"
10,"vibhāti","_","_","vibhā","V","vibhā","_","_"
1,"tasya","_","_","tad","PRD","","_","_"
2,"devasya","_","_","deva","NC","","_","_"
3,"_","_","_","krudh","PPP","","_","_"
4,"_","_","_","tad","PRD","","_","_"
5,"āgo","_","_","āgas","NC","","_","_"
6,"ya","_","_","yad","PRL","","_","_"
7,"evaṃ","_","_","eva","CX","","_","_"
8,"vidvāṃsaṃ","_","_","vid","KDP","","_","_"
9,"brāhmaṇaṃ","_","_","brāhmaṇa","NC","","_","_"
10,"jināti","_","_","jyā","V","jyā","_","_"
1,"_","_","_","yad","PRL","","_","_"
2,"_","_","_","āditya","NC","","_","_"
3,"haritaḥ","_","_","harit","JJ","","_","_"
4,"saṃvahanti","_","_","saṃvah","V","saṃvah","_","_"
5,"yena","_","_","yad","PRL","","_","_"
6,"yajñena","_","_","yajña","NC","","_","_"
7,"bahavo","_","_","bahu","JJ","","_","_"
8,"yanti","_","_","e","V","i","_","_"
9,"prajānantaḥ","_","_","prajñā","KDP","","_","_"
1,"yad","_","_","yad","PRL","","_","_"
2,"ekaṃ","_","_","eka","PPX","","_","_"
3,"jyotir","_","_","jyotis","NC","","_","_"
4,"bahudhā","_","_","bahudhā","CX","","_","_"
5,"vibhāti","_","_","vibhā","V","vibhā","_","_"
1,"tasya","_","_","tad","PRD","","_","_"
2,"devasya","_","_","deva","NC","","_","_"
3,"_","_","_","krudh","PPP","","_","_"
4,"_","_","_","tad","PRD","","_","_"
5,"āgo","_","_","āgas","NC","","_","_"
6,"ya","_","_","yad","PRL","","_","_"
7,"evaṃ","_","_","eva","CX","","_","_"
8,"vidvāṃsaṃ","_","_","vid","KDP","","_","_"
9,"brāhmaṇaṃ","_","_","brāhmaṇa","NC","","_","_"
10,"jināti","_","_","jyā","V","jyā","_","_"
1,"sapta","_","_","saptan","NUM","","_","_"
2,"yuñjanti","_","_","yuj","V","yuj","_","_"
3,"ratham","_","_","ratha","NC","","_","_"
4,"_","_","_","eka","PPX","","_","_"
5,"_","_","_","cakra","NC","","_","_"
6,"eko","_","_","eka","PPX","","_","_"
7,"aśvo","_","_","aśva","NC","","_","_"
8,"vahati","_","_","vah","V","vah","_","_"
9,"_","_","_","saptan","NUM","","_","_"
10,"_","_","_","nāman","NC","","_","_"
1,"_","_","_","tri","NUM","","_","_"
2,"_","_","_","nābhi","NC","","_","_"
3,"cakram","_","_","cakra","NC","","_","_"
4,"ajaram","_","_","ajara","JJ","","_","_"
5,"anarvaṃ","_","_","anarva","JJ","","_","_"
6,"_","_","_","yatra","CX","","_","_"
7,"_","_","_","ida","PRD","","_","_"
8,"viśvā","_","_","viśva","JQ","","_","_"
9,"_","_","_","bhuvana","NC","","_","_"
10,"_","_","_","adhiṣṭhā","V","adhiṣṭhā","_","_"
1,"tasya","_","_","tad","PRD","","_","_"
2,"devasya","_","_","deva","NC","","_","_"
3,"_","_","_","krudh","PPP","","_","_"
4,"_","_","_","tad","PRD","","_","_"
5,"āgo","_","_","āgas","NC","","_","_"
6,"ya","_","_","yad","PRL","","_","_"
7,"evaṃ","_","_","eva","CX","","_","_"
8,"vidvāṃsaṃ","_","_","vid","KDP","","_","_"
9,"brāhmaṇaṃ","_","_","brāhmaṇa","NC","","_","_"
10,"jināti","_","_","jyā","V","jyā","_","_"
1,"aṣṭadhā","_","_","aṣṭadhā","CX","","_","_"
2,"yukto","_","_","yuj","PPP","","_","_"
3,"vahati","_","_","vah","V","vah","_","_"
4,"vahnir","_","_","vahni","NC","","_","_"
5,"ugraḥ","_","_","ugra","JJ","","_","_"
6,"pitā","_","_","pitṛ","NC","","_","_"
7,"devānāṃ","_","_","deva","NC","","_","_"
8,"janitā","_","_","janitṛ","NC","","_","_"
9,"matīnām","_","_","mati","NC","","_","_"
1,"ṛtasya","_","_","ṛta","NC","","_","_"
2,"tantuṃ","_","_","tantu","NC","","_","_"
3,"manasā","_","_","manas","NC","","_","_"
4,"mimānaḥ","_","_","mā","KDP","","_","_"
5,"sarvā","_","_","sarva","JQ","","_","_"
6,"diśaḥ","_","_","diś","NC","","_","_"
7,"pavate","_","_","pū","V","pū","_","_"
8,"mātariśvā","_","_","mātariśvan","NC","","_","_"
1,"tasya","_","_","tad","PRD","","_","_"
2,"devasya","_","_","deva","NC","","_","_"
3,"_","_","_","krudh","PPP","","_","_"
4,"_","_","_","tad","PRD","","_","_"
5,"āgo","_","_","āgas","NC","","_","_"
6,"ya","_","_","yad","PRL","","_","_"
7,"evaṃ","_","_","eva","CX","","_","_"
8,"vidvāṃsaṃ","_","_","vid","KDP","","_","_"
9,"brāhmaṇaṃ","_","_","brāhmaṇa","NC","","_","_"
10,"jināti","_","_","jyā","V","jyā","_","_"
1,"samyañcaṃ","_","_","samyañc","JJ","","_","_"
2,"tantuṃ","_","_","tantu","NC","","_","_"
3,"pradiśo","_","_","pradiś","NC","","_","_"
4,"'nu","_","_","anu","CADP","","_","_"
5,"sarvā","_","_","sarva","JQ","","_","_"
6,"antar","_","_","antar","CAD","","_","_"
7,"gāyatryām","_","_","gāyatrī","NC","","_","_"
8,"amṛtasya","_","_","amṛta","NC","","_","_"
9,"garbhe","_","_","garbha","NC","","_","_"
1,"tasya","_","_","tad","PRD","","_","_"
2,"devasya","_","_","deva","NC","","_","_"
3,"_","_","_","krudh","PPP","","_","_"
4,"_","_","_","tad","PRD","","_","_"
5,"āgo","_","_","āgas","NC","","_","_"
6,"ya","_","_","yad","PRL","","_","_"
7,"evaṃ","_","_","eva","CX","","_","_"
8,"vidvāṃsaṃ","_","_","vid","KDP","","_","_"
9,"brāhmaṇaṃ","_","_","brāhmaṇa","NC","","_","_"
10,"jināti","_","_","jyā","V","jyā","_","_"
1,"udvepaya","_","_","udvepay","V","udvepay","_","_"
2,"rohita","_","_","rohita","JJ","","_","_"
3,"prakṣiṇīhi","_","_","prakṣi","V","prakṣi","_","_"
4,"brahmajyasya","_","_","brahmajya","JJ","","_","_"
5,"pratimuñca","_","_","pratimuñc","V","pratimuc","_","_"
6,"pāśān","_","_","pāśa","NC","","_","_"
1,"nimrucas","_","_","nimruc","NC","","_","_"
2,"tisro","_","_","tri","NUM","","_","_"
3,"vyuṣo","_","_","vyuṣ","NC","","_","_"
4,"ha","_","_","ha","CEM","","_","_"
5,"tisras","_","_","tri","NUM","","_","_"
6,"trīṇi","_","_","tri","NUM","","_","_"
7,"rajāṃsi","_","_","rajas","NC","","_","_"
8,"divo","_","_","div","NC","","_","_"
9,"aṅga","_","_","aṅga","CEM","","_","_"
10,"tisraḥ","_","_","tri","NUM","","_","_"
1,"vidmā","_","_","vid","V","vid","_","_"
2,"te","_","_","tvat","PPR","","_","_"
3,"agne","_","_","agni","NC","","_","_"
4,"tredhā","_","_","tredhā","CX","","_","_"
5,"janitraṃ","_","_","janitra","NC","","_","_"
6,"tredhā","_","_","tredhā","CX","","_","_"
7,"devānāṃ","_","_","deva","NC","","_","_"
8,"janimāni","_","_","janiman","NC","","_","_"
9,"vidma","_","_","vid","V","vid","_","_"
1,"tasya","_","_","tad","PRD","","_","_"
2,"devasya","_","_","deva","NC","","_","_"
3,"_","_","_","krudh","PPP","","_","_"
4,"_","_","_","tad","PRD","","_","_"
5,"āgo","_","_","āgas","NC","","_","_"
6,"ya","_","_","yad","PRL","","_","_"
7,"evaṃ","_","_","eva","CX","","_","_"
8,"vidvāṃsaṃ","_","_","vid","KDP","","_","_"
9,"brāhmaṇaṃ","_","_","brāhmaṇa","NC","","_","_"
10,"jināti","_","_","jyā","V","jyā","_","_"
1,"vi","_","_","vi","CADP","","_","_"
2,"ya","_","_","yad","PRL","","_","_"
3,"aurṇot","_","_","vṛ","V","vṛ","_","_"
4,"pṛthivīṃ","_","_","pṛthivī","NC","","_","_"
5,"jāyamāna","_","_","jan","KDP","","_","_"
6,"ā","_","_","ā","CADP","","_","_"
7,"samudram","_","_","samudra","NC","","_","_"
8,"adadhāt","_","_","dadh","V","dhā","_","_"
9,"antarikṣe","_","_","antarikṣa","NC","","_","_"
1,"tasya","_","_","tad","PRD","","_","_"
2,"devasya","_","_","deva","NC","","_","_"
3,"_","_","_","krudh","PPP","","_","_"
4,"_","_","_","tad","PRD","","_","_"
5,"āgo","_","_","āgas","NC","","_","_"
6,"ya","_","_","yad","PRL","","_","_"
7,"evaṃ","_","_","eva","CX","","_","_"
8,"vidvāṃsaṃ","_","_","vid","KDP","","_","_"
9,"brāhmaṇaṃ","_","_","brāhmaṇa","NC","","_","_"
10,"jināti","_","_","jyā","V","jyā","_","_"
1,"udvepaya","_","_","udvepay","V","udvepay","_","_"
2,"rohita","_","_","rohita","JJ","","_","_"
3,"prakṣiṇīhi","_","_","prakṣi","V","prakṣi","_","_"
4,"brahmajyasya","_","_","brahmajya","JJ","","_","_"
5,"pratimuñca","_","_","pratimuñc","V","pratimuc","_","_"
6,"pāśān","_","_","pāśa","NC","","_","_"
1,"tvam","_","_","tvat","PPR","","_","_"
2,"agne","_","_","agni","NC","","_","_"
3,"kratubhiḥ","_","_","kratu","NC","","_","_"
4,"ketubhir","_","_","ketu","NC","","_","_"
5,"hito","_","_","hi","PPP","","_","_"
6,"'rkaḥ","_","_","arka","NC","","_","_"
7,"samiddha","_","_","samindh","PPP","","_","_"
8,"udarocathā","_","_","udruc","V","udruc","_","_"
9,"divi","_","_","div","NC","","_","_"
1,"kim","_","_","kiṃ","PRQ","","_","_"
2,"abhyārcan","_","_","abhyarc","V","abhyarc","_","_"
3,"marutaḥ","_","_","marut","NC","","_","_"
4,"_","_","_","pṛśni","NC","","_","_"
5,"_","_","_","mātṛ","NC","","_","_"
6,"yad","_","_","yat","CSB","","_","_"
7,"rohitam","_","_","rohita","JJ","","_","_"
8,"ajanayanta","_","_","janay","V","janay","_","_"
9,"devāḥ","_","_","deva","NC","","_","_"
1,"tasya","_","_","tad","PRD","","_","_"
2,"devasya","_","_","deva","NC","","_","_"
3,"_","_","_","krudh","PPP","","_","_"
4,"_","_","_","tad","PRD","","_","_"
5,"āgo","_","_","āgas","NC","","_","_"
6,"ya","_","_","yad","PRL","","_","_"
7,"evaṃ","_","_","eva","CX","","_","_"
8,"vidvāṃsaṃ","_","_","vid","KDP","","_","_"
9,"brāhmaṇaṃ","_","_","brāhmaṇa","NC","","_","_"
10,"jināti","_","_","jyā","V","jyā","_","_"
1,"ya","_","_","yad","PRL","","_","_"
2,"_","_","_","ātman","NC","","_","_"
3,"_","_","_","dā","JJ","","_","_"
4,"_","_","_","bala","NC","","_","_"
5,"_","_","_","dā","JJ","","_","_"
6,"yasya","_","_","yad","PRL","","_","_"
7,"viśva","_","_","viśva","JQ","","_","_"
8,"upāsate","_","_","ās","V","ās","_","_"
9,"praśiṣaṃ","_","_","praśis","NC","","_","_"
10,"yasya","_","_","yad","PRL","","_","_"
11,"devāḥ","_","_","deva","NC","","_","_"
1,"yo","_","_","yad","PRL","","_","_"
2,"_","_","_","ida","PRD","","_","_"
3,"_","_","_","īś","V","īś","_","_"
4,"dvipado","_","_","dvipad","NC","","_","_"
5,"yaś","_","_","yad","PRL","","_","_"
6,"catuṣpadaḥ","_","_","catuṣpada","JJ","","_","_"
1,"tasya","_","_","tad","PRD","","_","_"
2,"devasya","_","_","deva","NC","","_","_"
3,"_","_","_","krudh","PPP","","_","_"
4,"_","_","_","tad","PRD","","_","_"
5,"āgo","_","_","āgas","NC","","_","_"
6,"ya","_","_","yad","PRL","","_","_"
7,"evaṃ","_","_","eva","CX","","_","_"
8,"vidvāṃsaṃ","_","_","vid","KDP","","_","_"
9,"brāhmaṇaṃ","_","_","brāhmaṇa","NC","","_","_"
10,"jināti","_","_","jyā","V","jyā","_","_"
1,"_","_","_","eka","PPX","","_","_"
2,"_","_","_","pād","NC","","_","_"
3,"_","_","_","dvi","NUM","","_","_"
4,"_","_","_","pada","NC","","_","_"
5,"bhūyo","_","_","bhūyas","CX","","_","_"
6,"vicakrame","_","_","vikra","V","vikra","_","_"
7,"_","_","_","dvi","NUM","","_","_"
8,"_","_","_","pād","NC","","_","_"
9,"_","_","_","tri","NUM","","_","_"
10,"_","_","_","pād","NC","","_","_"
11,"abhyeti","_","_","abhī","V","abhī","_","_"
12,"paścāt","_","_","paścāt","CAD","","_","_"
1,"catuṣpāc","_","_","catuṣpād","NC","","_","_"
2,"cakre","_","_","kar","V","kṛ","_","_"
3,"_","_","_","dvi","NUM","","_","_"
4,"_","_","_","pad","NC","","_","_"
5,"abhisvare","_","_","abhisvara","NC","","_","_"
6,"saṃpaśyan","_","_","saṃpaś","KDP","","_","_"
7,"paṅktim","_","_","paṅkti","NC","","_","_"
8,"upatiṣṭhamānaḥ","_","_","upasthā","KDP","","_","_"
1,"tasya","_","_","tad","PRD","","_","_"
2,"devasya","_","_","deva","NC","","_","_"
3,"_","_","_","krudh","PPP","","_","_"
4,"_","_","_","tad","PRD","","_","_"
5,"āgo","_","_","āgas","NC","","_","_"
6,"ya","_","_","yad","PRL","","_","_"
7,"evaṃ","_","_","eva","CX","","_","_"
8,"vidvāṃsaṃ","_","_","vid","KDP","","_","_"
9,"brāhmaṇaṃ","_","_","brāhmaṇa","NC","","_","_"
10,"jināti","_","_","jyā","V","jyā","_","_"
1,"kṛṣṇāyāḥ","_","_","kṛṣṇa","JJ","","_","_"
2,"putro","_","_","putra","NC","","_","_"
3,"arjuno","_","_","arjuna","JJ","","_","_"
4,"rātryā","_","_","rātri","NC","","_","_"
5,"vatso","_","_","vatsa","NC","","_","_"
6,"'jāyata","_","_","jan","V","jan","_","_"
1,"sa","_","_","tad","PRD","","_","_"
2,"ha","_","_","ha","CEM","","_","_"
3,"dyām","_","_","div","NC","","_","_"
4,"adhirohati","_","_","adhiroh","V","adhiruh","_","_"
5,"ruho","_","_","ruh","NC","","_","_"
6,"ruroha","_","_","roh","V","ruh","_","_"
7,"rohitaḥ","_","_","rohita","JJ","","_","_"
