"WordID","word","NormSTEM","suffix","lemma","PoS","Root","NormSuffix","NormWord"
1,"indra","_","_","indra","NC","","_","_"
2,"uvāca","_","_","vak","V","vac","_","_"
1,"evaṃvīryaḥ","_","_","evaṃvīrya","JJ","","_","_"
2,"_","_","_","sarva","JQ","","_","_"
3,"_","_","_","dharma","NC","","_","_"
4,"_","_","_","upapad","PPP","","_","_"
5,"kṣātraḥ","_","_","kṣātra","JJ","","_","_"
6,"śreṣṭhaḥ","_","_","śreṣṭha","JJ","","_","_"
7,"_","_","_","sarva","JQ","","_","_"
8,"_","_","_","dharma","NC","","_","_"
9,"dharmaḥ","_","_","dharma","NC","","_","_"
1,"pālyo","_","_","pālay","KDG","","_","_"
2,"yuṣmābhir","_","_","tvat","PPR","","_","_"
3,"_","_","_","loka","NC","","_","_"
4,"_","_","_","siṃha","NC","","_","_"
5,"udārair","_","_","udāra","JJ","","_","_"
6,"viparyaye","_","_","viparyaya","NC","","_","_"
7,"syād","_","_","as","V","as","_","_"
8,"abhāvaḥ","_","_","abhāva","NC","","_","_"
9,"prajānām","_","_","prajā","NC","","_","_"
1,"bhuvaḥ","_","_","bhū","NC","","_","_"
2,"saṃskāraṃ","_","_","saṃskāra","NC","","_","_"
3,"_","_","_","rājan","NC","","_","_"
4,"_","_","_","saṃskāra","NC","","_","_"
5,"_","_","_","yoga","NC","","_","_"
6,"_","_","_","a","CNG","","_","_"
7,"_","_","_","bhaikṣa","NC","","_","_"
8,"_","_","_","caryā","NC","","_","_"
9,"pālanaṃ","_","_","pālana","NC","","_","_"
10,"ca","_","_","ca","CCD","","_","_"
11,"prajānām","_","_","prajā","NC","","_","_"
1,"vidyād","_","_","vid","V","vid","_","_"
2,"rājā","_","_","rājan","NC","","_","_"
3,"_","_","_","sarva","JQ","","_","_"
4,"_","_","_","bhūta","NC","","_","_"
5,"_","_","_","anukampā","NC","","_","_"
6,"_","_","_","deha","NC","","_","_"
7,"_","_","_","tyāga","NC","","_","_"
8,"_","_","_","ca","CCD","","_","_"
9,"_","_","_","āhava","NC","","_","_"
10,"dharmam","_","_","dharma","NC","","_","_"
11,"agryam","_","_","agrya","JJ","","_","_"
1,"tyāgaṃ","_","_","tyāga","NC","","_","_"
2,"śreṣṭhaṃ","_","_","śreṣṭha","JJ","","_","_"
3,"munayo","_","_","muni","NC","","_","_"
4,"vai","_","_","vai","CX","","_","_"
5,"vadanti","_","_","vad","V","vad","_","_"
6,"_","_","_","sarva","JQ","","_","_"
7,"_","_","_","śreṣṭha","JJ","","_","_"
8,"yaḥ","_","_","yad","PRL","","_","_"
9,"śarīraṃ","_","_","śarīra","NC","","_","_"
10,"tyajeta","_","_","tyaj","V","tyaj","_","_"
1,"nityaṃ","_","_","nitya","CX","","_","_"
2,"tyaktaṃ","_","_","tyaj","PPP","","_","_"
3,"_","_","_","rājan","NC","","_","_"
4,"_","_","_","dharma","NC","","_","_"
5,"sarvaṃ","_","_","sarva","JQ","","_","_"
6,"pratyakṣaṃ","_","_","pratyakṣa","JJ","","_","_"
7,"te","_","_","tvat","PPR","","_","_"
8,"bhūmipālāḥ","_","_","bhūmipāla","NC","","_","_"
9,"_","_","_","sadā","CAD","","_","_"
10,"_","_","_","tad","PRD","","_","_"
1,"_","_","_","bahu","JJ","","_","_"
2,"_","_","_","śruti","NC","","_","_"
3,"_","_","_","guru","NC","","_","_"
4,"_","_","_","śuśrūṣā","NC","","_","_"
5,"vā","_","_","vā","CCD","","_","_"
6,"parasya","_","_","para","PPX","","_","_"
7,"vā","_","_","vā","CCD","","_","_"
8,"saṃhananād","_","_","saṃhanana","NC","","_","_"
9,"vadanti","_","_","vad","V","vad","_","_"
1,"nityaṃ","_","_","nitya","CX","","_","_"
2,"dharmaṃ","_","_","dharma","NC","","_","_"
3,"kṣatriyo","_","_","kṣatriya","NC","","_","_"
4,"brahmacārī","_","_","brahmacārin","NC","","_","_"
5,"cared","_","_","car","V","car","_","_"
6,"eko","_","_","eka","PPX","","_","_"
7,"_","_","_","hi","CX","","_","_"
8,"_","_","_","āśrama","NC","","_","_"
9,"_","_","_","dharma","NC","","_","_"
10,"_","_","_","kāma","NC","","_","_"
1,"_","_","_","sāmānya","JJ","","_","_"
2,"_","_","_","artha","NC","","_","_"
3,"vyavahāre","_","_","vyavahāra","NC","","_","_"
4,"pravṛtte","_","_","pravṛt","PPP","","_","_"
5,"_","_","_","priya","JJ","","_","_"
6,"_","_","_","apriya","JJ","","_","_"
7,"varjayann","_","_","varjay","KDP","","_","_"
8,"eva","_","_","eva","CEM","","_","_"
9,"yatnāt","_","_","yatna","NC","","_","_"
1,"_","_","_","cāturvarṇya","NC","","_","_"
2,"_","_","_","sthāpana","NC","","_","_"
3,"_","_","_","pālana","NC","","_","_"
4,"_","_","_","ca","CCD","","_","_"
5,"_","_","_","tad","PRD","","_","_"
6,"_","_","_","tad","PRD","","_","_"
7,"yogair","_","_","yoga","NC","","_","_"
8,"niyamair","_","_","niyama","NC","","_","_"
9,"_","_","_","aurasa","NC","","_","_"
10,"_","_","_","ca","CCD","","_","_"
1,"_","_","_","sarva","JQ","","_","_"
2,"_","_","_","udyoga","NC","","_","_"
3,"āśramaṃ","_","_","āśrama","NC","","_","_"
4,"dharmam","_","_","dharma","NC","","_","_"
5,"āhuḥ","_","_","ah","V","ah","_","_"
6,"kṣātraṃ","_","_","kṣātra","JJ","","_","_"
7,"jyeṣṭhaṃ","_","_","jyeṣṭha","JJ","","_","_"
8,"_","_","_","sarva","JQ","","_","_"
9,"_","_","_","dharma","NC","","_","_"
10,"_","_","_","upapad","PPP","","_","_"
1,"svaṃ","_","_","sva","JJ","","_","_"
2,"svaṃ","_","_","sva","JJ","","_","_"
3,"dharmaṃ","_","_","dharma","NC","","_","_"
4,"ye","_","_","yad","PRL","","_","_"
5,"na","_","_","na","CNG","","_","_"
6,"caranti","_","_","car","V","car","_","_"
7,"varṇās","_","_","varṇa","NC","","_","_"
8,"_","_","_","tad","PRD","","_","_"
9,"_","_","_","tad","PRD","","_","_"
10,"dharmān","_","_","dharma","NC","","_","_"
11,"ayathāvad","_","_","ayathāvat","CX","","_","_"
12,"vadanti","_","_","vad","V","vad","_","_"
1,"nirmaryāde","_","_","nirmaryāda","JJ","","_","_"
2,"nityam","_","_","nitya","CX","","_","_"
3,"arthe","_","_","artha","NC","","_","_"
4,"vinaṣṭān","_","_","vinaś","PPP","","_","_"
5,"_","_","_","ah","V","ah","_","_"
6,"_","_","_","tad","PRD","","_","_"
7,"vai","_","_","vai","CX","","_","_"
8,"_","_","_","paśu","NC","","_","_"
9,"_","_","_","bhū","PPP","","_","_"
10,"_","_","_","manuṣya","NC","","_","_"
1,"yathā","_","_","yathā","CCM","","_","_"
2,"nītiṃ","_","_","nīti","NC","","_","_"
3,"_","_","_","gamay","V","gamay","_","_"
4,"_","_","_","artha","NC","","_","_"
5,"_","_","_","lobha","NC","","_","_"
6,"_","_","_","śreyas","JJ","","_","_"
7,"_","_","_","tasmāt","CX","","_","_"
8,"āśramaḥ","_","_","āśrama","NC","","_","_"
9,"_","_","_","kṣatra","NC","","_","_"
10,"_","_","_","dharma","NC","","_","_"
1,"traividyānāṃ","_","_","traividya","JJ","","_","_"
2,"yā","_","_","yad","PRL","","_","_"
3,"gatir","_","_","gati","NC","","_","_"
4,"brāhmaṇānāṃ","_","_","brāhmaṇa","NC","","_","_"
5,"_","_","_","yad","PRL","","_","_"
6,"_","_","_","ca","CCD","","_","_"
7,"_","_","_","eva","CEM","","_","_"
8,"_","_","_","vac","PPP","","_","_"
9,"_","_","_","atha","CAD","","_","_"
10,"_","_","_","āśrama","NC","","_","_"
11,"brāhmaṇānām","_","_","brāhmaṇa","NC","","_","_"
1,"etat","_","_","tad","PRD","","_","_"
2,"karma","_","_","karman","NC","","_","_"
3,"_","_","_","brāhmaṇa","NC","","_","_"
4,"_","_","_","ah","V","ah","_","_"
5,"agryam","_","_","agrya","JJ","","_","_"
6,"anyat","_","_","anya","PPX","","_","_"
7,"kurvañ","_","_","kṛ","KDP","","_","_"
8,"_","_","_","śūdra","NC","","_","_"
9,"_","_","_","vat","CX","","_","_"
10,"_","_","_","śastra","NC","","_","_"
11,"_","_","_","vadh","KDG","","_","_"
1,"_","_","_","cāturāśramya","NC","","_","_"
2,"_","_","_","dharma","NC","","_","_"
3,"_","_","_","ca","CCD","","_","_"
4,"_","_","_","veda","NC","","_","_"
5,"_","_","_","dharma","NC","","_","_"
6,"_","_","_","ca","CCD","","_","_"
7,"pārthiva","_","_","pārthiva","NC","","_","_"
1,"_","_","_","brāhmaṇa","NC","","_","_"
2,"_","_","_","anuga","KDG","","_","_"
3,"_","_","_","na","CNG","","_","_"
4,"_","_","_","anya","PPX","","_","_"
5,"vidyāt","_","_","vid","V","vid","_","_"
6,"kathaṃcana","_","_","kathaṃcana","CX","","_","_"
1,"anyathā","_","_","anyathā","CX","","_","_"
2,"vartamānasya","_","_","vṛt","KDP","","_","_"
3,"na","_","_","na","CNG","","_","_"
4,"sā","_","_","tad","PRD","","_","_"
5,"vṛttiḥ","_","_","vṛtti","NC","","_","_"
6,"prakalpyate","_","_","prakalpay","V","prakalpay","_","_"
1,"karmaṇā","_","_","karman","NC","","_","_"
2,"vyajyate","_","_","vyañj","V","vyañj","_","_"
3,"dharmo","_","_","dharma","NC","","_","_"
4,"_","_","_","yathā","CCM","","_","_"
5,"_","_","_","eva","CEM","","_","_"
6,"śvā","_","_","śvan","NC","","_","_"
7,"_","_","_","tathā","CX","","_","_"
8,"_","_","_","eva","CEM","","_","_"
9,"saḥ","_","_","tad","PRD","","_","_"
1,"yo","_","_","yad","PRL","","_","_"
2,"_","_","_","vikarman","NC","","_","_"
3,"_","_","_","sthā","PPP","","_","_"
4,"vipro","_","_","vipra","NC","","_","_"
5,"na","_","_","na","CNG","","_","_"
6,"sa","_","_","tad","PRD","","_","_"
7,"_","_","_","sat","JJ","","_","_"
8,"_","_","_","māna","NC","","_","_"
9,"arhati","_","_","arh","V","arh","_","_"
1,"_","_","_","karman","NC","","_","_"
2,"_","_","_","anupayuñjāna","JJ","","_","_"
3,"a","_","_","alpha_privativum","JJ","","_","_"
3,"aviśvāsyaṃ","_","_","viśvāsya","JJ","","_","_"
4,"hi","_","_","hi","CX","","_","_"
5,"taṃ","_","_","tad","PRD","","_","_"
6,"viduḥ","_","_","vid","V","vid","_","_"
1,"ete","_","_","tad","PRD","","_","_"
2,"dharmāḥ","_","_","dharma","NC","","_","_"
3,"_","_","_","sarva","JQ","","_","_"
4,"_","_","_","varṇa","NC","","_","_"
5,"_","_","_","ca","CCD","","_","_"
6,"vīrair","_","_","vīra","NC","","_","_"
7,"utkraṣṭavyāḥ","_","_","utkṛṣ","KDG","","_","_"
8,"kṣatriyair","_","_","kṣatriya","NC","","_","_"
9,"eṣa","_","_","tad","PRD","","_","_"
10,"dharmaḥ","_","_","dharma","NC","","_","_"
1,"_","_","_","tasmāt","CX","","_","_"
2,"_","_","_","jyeṣṭha","JJ","","_","_"
3,"_","_","_","rājan","NC","","_","_"
4,"_","_","_","dharma","NC","","_","_"
5,"na","_","_","na","CNG","","_","_"
6,"_","_","_","ca","CCD","","_","_"
7,"_","_","_","anya","PPX","","_","_"
8,"_","_","_","vīrya","NC","","_","_"
9,"_","_","_","jyeṣṭha","JJ","","_","_"
10,"_","_","_","vīra","NC","","_","_"
11,"_","_","_","dharma","NC","","_","_"
12,"matā","_","_","man","PPP","","_","_"
13,"me","_","_","mat","PPR","","_","_"
1,"_","_","_","māndhātṛ","NC","","_","_"
2,"_","_","_","vak","V","vac","_","_"
1,"yavanāḥ","_","_","yavana","NC","","_","_"
2,"kirātā","_","_","kirāta","NC","","_","_"
3,"_","_","_","gāndhāra","NC","","_","_"
4,"_","_","_","cīna","NC","","_","_"
5,"_","_","_","śabara","NC","","_","_"
6,"_","_","_","barbara","NC","","_","_"
1,"_","_","_","śaka","NC","","_","_"
2,"_","_","_","tuṣāra","NC","","_","_"
3,"_","_","_","kahva","NC","","_","_"
4,"_","_","_","ca","CCD","","_","_"
5,"_","_","_","pahlava","NC","","_","_"
6,"_","_","_","ca","CCD","","_","_"
7,"_","_","_","andhra","NC","","_","_"
8,"_","_","_","madraka","NC","","_","_"
1,"oḍrāḥ","_","_","oḍra","NC","","_","_"
2,"pulindā","_","_","pulinda","NC","","_","_"
3,"ramaṭhāḥ","_","_","ramaṭha","NC","","_","_"
4,"kācā","_","_","kāca","NC","","_","_"
5,"_","_","_","mleccha","NC","","_","_"
6,"_","_","_","ca","CCD","","_","_"
7,"sarvaśaḥ","_","_","sarvaśas","CX","","_","_"
1,"_","_","_","brahman","NC","","_","_"
2,"_","_","_","kṣatra","NC","","_","_"
3,"_","_","_","prasū","PPP","","_","_"
4,"_","_","_","ca","CCD","","_","_"
5,"vaiśyāḥ","_","_","vaiśya","NC","","_","_"
6,"_","_","_","śūdra","NC","","_","_"
7,"_","_","_","ca","CCD","","_","_"
8,"mānavāḥ","_","_","mānava","NC","","_","_"
1,"kathaṃ","_","_","katha","CX","","_","_"
2,"dharmaṃ","_","_","dharma","NC","","_","_"
3,"_","_","_","car","V","car","_","_"
4,"_","_","_","tad","PRD","","_","_"
5,"sarve","_","_","sarva","JQ","","_","_"
6,"_","_","_","viṣaya","NC","","_","_"
7,"_","_","_","vāsin","JJ","","_","_"
1,"_","_","_","madvidha","JJ","","_","_"
2,"_","_","_","ca","CCD","","_","_"
3,"kathaṃ","_","_","katha","CX","","_","_"
4,"sthāpyāḥ","_","_","sthāpay","KDG","","_","_"
5,"sarve","_","_","sarva","JQ","","_","_"
6,"te","_","_","tad","PRD","","_","_"
7,"_","_","_","dasyu","NC","","_","_"
8,"_","_","_","jīvin","JJ","","_","_"
1,"etad","_","_","tad","PRD","","_","_"
2,"_","_","_","iṣ","V","iṣ","_","_"
3,"_","_","_","mat","PPR","","_","_"
4,"śrotuṃ","_","_","śru","CGDI","","_","_"
5,"_","_","_","bhagavat","JJ","","_","_"
6,"_","_","_","tad","PRD","","_","_"
7,"bravīhi","_","_","abravīta","V","brū","_","_"
8,"me","_","_","mat","PPR","","_","_"
1,"tvaṃ","_","_","tvat","PPR","","_","_"
2,"_","_","_","bandhu","NC","","_","_"
3,"_","_","_","bhū","PPP","","_","_"
4,"_","_","_","hi","CX","","_","_"
5,"_","_","_","mat","PPR","","_","_"
6,"kṣatriyāṇāṃ","_","_","kṣatriya","NC","","_","_"
7,"sureśvara","_","_","sureśvara","NC","","_","_"
1,"indra","_","_","indra","NC","","_","_"
2,"uvāca","_","_","vak","V","vac","_","_"
1,"_","_","_","mātā","NC","","_","_"
2,"_","_","_","pitṛ","NC","","_","_"
3,"hi","_","_","hi","CX","","_","_"
4,"kartavyā","_","_","kṛ","KDG","","_","_"
5,"śuśrūṣā","_","_","śuśrūṣā","NC","","_","_"
6,"_","_","_","sarva","JQ","","_","_"
7,"_","_","_","dasyu","NC","","_","_"
1,"_","_","_","ācārya","NC","","_","_"
2,"_","_","_","guru","NC","","_","_"
3,"_","_","_","śuśrūṣā","NC","","_","_"
4,"_","_","_","tathā","CX","","_","_"
5,"_","_","_","eva","CEM","","_","_"
6,"_","_","_","āśrama","NC","","_","_"
7,"_","_","_","vāsin","JJ","","_","_"
1,"bhūmipālānāṃ","_","_","bhūmipāla","NC","","_","_"
2,"ca","_","_","ca","CCD","","_","_"
3,"śuśrūṣā","_","_","śuśrūṣā","NC","","_","_"
4,"kartavyā","_","_","kṛ","KDG","","_","_"
5,"_","_","_","sarva","JQ","","_","_"
6,"_","_","_","dasyu","NC","","_","_"
1,"_","_","_","veda","NC","","_","_"
2,"_","_","_","dharma","NC","","_","_"
3,"_","_","_","kriyā","NC","","_","_"
4,"_","_","_","ca","CCD","","_","_"
5,"_","_","_","eva","CEM","","_","_"
6,"teṣāṃ","_","_","tad","PRD","","_","_"
7,"dharmo","_","_","dharma","NC","","_","_"
8,"vidhīyate","_","_","vidadh","V","vidhā","_","_"
1,"_","_","_","pitṛ","NC","","_","_"
2,"_","_","_","yajña","NC","","_","_"
3,"_","_","_","tathā","CX","","_","_"
4,"kūpāḥ","_","_","kūpa","NC","","_","_"
5,"_","_","_","prapā","NC","","_","_"
6,"_","_","_","ca","CCD","","_","_"
7,"śayanāni","_","_","śayana","NC","","_","_"
8,"ca","_","_","ca","CCD","","_","_"
1,"dānāni","_","_","dāna","NC","","_","_"
2,"ca","_","_","ca","CCD","","_","_"
3,"yathākālaṃ","_","_","yathākāla","CX","","_","_"
4,"dvijeṣu","_","_","dvija","NC","","_","_"
5,"dadyur","_","_","dad","V","dā","_","_"
6,"eva","_","_","eva","CEM","","_","_"
7,"te","_","_","tad","PRD","","_","_"
1,"ahiṃsā","_","_","ahiṃsā","NC","","_","_"
2,"satyam","_","_","satya","NC","","_","_"
3,"akrodho","_","_","akrodha","NC","","_","_"
4,"_","_","_","vṛtti","NC","","_","_"
5,"_","_","_","dāya","NC","","_","_"
6,"_","_","_","anupālana","NC","","_","_"
1,"bharaṇaṃ","_","_","bharaṇa","NC","","_","_"
2,"_","_","_","putra","NC","","_","_"
3,"_","_","_","dāra","NC","","_","_"
4,"śaucam","_","_","śauca","NC","","_","_"
5,"adroha","_","_","adroha","NC","","_","_"
6,"eva","_","_","eva","CEM","","_","_"
7,"ca","_","_","ca","CCD","","_","_"
1,"dakṣiṇā","_","_","dakṣiṇā","NC","","_","_"
2,"_","_","_","sarva","JQ","","_","_"
3,"_","_","_","yajña","NC","","_","_"
4,"dātavyā","_","_","dā","KDG","","_","_"
5,"bhūtim","_","_","bhūti","NC","","_","_"
6,"icchatā","_","_","iṣ","KDP","","_","_"
1,"pākayajñā","_","_","pākayajña","NC","","_","_"
2,"_","_","_","mahārha","JJ","","_","_"
3,"_","_","_","ca","CCD","","_","_"
4,"kartavyāḥ","_","_","kṛ","KDG","","_","_"
5,"_","_","_","sarva","JQ","","_","_"
6,"_","_","_","dasyu","NC","","_","_"
1,"_","_","_","tad","PRD","","_","_"
2,"_","_","_","evaṃprakāra","JJ","","_","_"
3,"vihitāni","_","_","vidhā","PPP","","_","_"
4,"_","_","_","purā","CX","","_","_"
5,"_","_","_","anagha","JJ","","_","_"
1,"_","_","_","sarva","JQ","","_","_"
2,"_","_","_","loka","NC","","_","_"
3,"karmāṇi","_","_","karman","NC","","_","_"
4,"_","_","_","kṛ","KDG","","_","_"
5,"_","_","_","iha","CAD","","_","_"
6,"pārthiva","_","_","pārthiva","NC","","_","_"
1,"_","_","_","māndhātṛ","NC","","_","_"
2,"_","_","_","vak","V","vac","_","_"
1,"dṛśyante","_","_","darś","V","dṛś","_","_"
2,"mānavā","_","_","mānava","NC","","_","_"
3,"loke","_","_","loka","NC","","_","_"
4,"_","_","_","sarva","JQ","","_","_"
5,"_","_","_","varṇa","NC","","_","_"
6,"dasyavaḥ","_","_","dasyu","NC","","_","_"
1,"_","_","_","liṅga","NC","","_","_"
2,"_","_","_","antara","JJ","","_","_"
3,"vartamānā","_","_","vṛt","KDP","","_","_"
4,"āśrameṣu","_","_","āśrama","NC","","_","_"
5,"_","_","_","catur","NUM","","_","_"
6,"_","_","_","api","CX","","_","_"
1,"indra","_","_","indra","NC","","_","_"
2,"uvāca","_","_","vak","V","vac","_","_"
1,"vinaṣṭāyāṃ","_","_","vinaś","PPP","","_","_"
2,"daṇḍanītau","_","_","daṇḍanīti","NC","","_","_"
3,"_","_","_","rājan","NC","","_","_"
4,"_","_","_","dharma","NC","","_","_"
5,"nirākṛte","_","_","nirākṛ","PPP","","_","_"
1,"sampramuhyanti","_","_","sampramuh","V","sampramuh","_","_"
2,"bhūtāni","_","_","bhūta","NC","","_","_"
3,"_","_","_","rājan","NC","","_","_"
4,"_","_","_","daurātmya","NC","","_","_"
5,"nṛpa","_","_","nṛpa","NC","","_","_"
1,"asaṃkhyātā","_","_","asaṃkhyāta","JJ","","_","_"
2,"bhaviṣyanti","_","_","bhav","V","bhū","_","_"
3,"bhikṣavo","_","_","bhikṣu","NC","","_","_"
4,"_","_","_","liṅgin","JJ","","_","_"
5,"_","_","_","tathā","CX","","_","_"
1,"āśramāṇāṃ","_","_","āśrama","NC","","_","_"
2,"_","_","_","vikalpa","NC","","_","_"
3,"_","_","_","ca","CCD","","_","_"
4,"nivṛtte","_","_","nivṛt","PPP","","_","_"
5,"'smin","_","_","ida","PRD","","_","_"
6,"kṛte","_","_","kṛta","NC","","_","_"
7,"yuge","_","_","yuga","NC","","_","_"
1,"aśṛṇvānāḥ","_","_","aśṛṇvāna","JJ","","_","_"
2,"purāṇānāṃ","_","_","purāṇa","JJ","","_","_"
3,"dharmāṇāṃ","_","_","dharma","NC","","_","_"
4,"pravarā","_","_","pravara","JJ","","_","_"
5,"gatīḥ","_","_","gati","NC","","_","_"
1,"utpathaṃ","_","_","utpatha","NC","","_","_"
2,"pratipatsyante","_","_","pratipad","V","pratipad","_","_"
3,"_","_","_","kāma","NC","","_","_"
4,"_","_","_","manyu","NC","","_","_"
5,"_","_","_","samīray","PPP","","_","_"
1,"yadā","_","_","yadā","CSB","","_","_"
2,"nivartyate","_","_","nivartay","V","nivartay","_","_"
3,"pāpo","_","_","pāpa","JJ","","_","_"
4,"daṇḍanītyā","_","_","daṇḍanīti","NC","","_","_"
5,"mahātmabhiḥ","_","_","mahātman","JJ","","_","_"
1,"tadā","_","_","tadā","CAD","","_","_"
2,"dharmo","_","_","dharma","NC","","_","_"
3,"na","_","_","na","CNG","","_","_"
4,"calate","_","_","cal","V","cal","_","_"
5,"_","_","_","sat","JJ","","_","_"
6,"_","_","_","bhū","PPP","","_","_"
7,"śāśvataḥ","_","_","śāśvata","JJ","","_","_"
8,"paraḥ","_","_","para","PPX","","_","_"
1,"_","_","_","para","PPX","","_","_"
2,"_","_","_","loka","NC","","_","_"
3,"_","_","_","guru","NC","","_","_"
4,"_","_","_","ca","CCD","","_","_"
5,"_","_","_","eva","CEM","","_","_"
6,"rājānaṃ","_","_","rājan","NC","","_","_"
7,"yo","_","_","yad","PRL","","_","_"
8,"'vamanyate","_","_","avaman","V","avaman","_","_"
1,"na","_","_","na","CNG","","_","_"
2,"tasya","_","_","tad","PRD","","_","_"
3,"dattaṃ","_","_","dā","PPP","","_","_"
4,"na","_","_","na","CNG","","_","_"
5,"hutaṃ","_","_","hu","PPP","","_","_"
6,"na","_","_","na","CNG","","_","_"
7,"śrāddhaṃ","_","_","śrāddha","NC","","_","_"
8,"phalati","_","_","phal","V","phal","_","_"
9,"kvacit","_","_","kvacid","CX","","_","_"
1,"mānuṣāṇām","_","_","mānuṣa","NC","","_","_"
2,"adhipatiṃ","_","_","adhipati","NC","","_","_"
3,"_","_","_","deva","NC","","_","_"
4,"_","_","_","bhū","PPP","","_","_"
5,"sanātanam","_","_","sanātana","JJ","","_","_"
1,"_","_","_","deva","NC","","_","_"
2,"_","_","_","ca","CCD","","_","_"
3,"bahu","_","_","bahu","JJ","","_","_"
4,"manyante","_","_","man","V","man","_","_"
5,"_","_","_","dharma","NC","","_","_"
6,"_","_","_","kāma","NC","","_","_"
7,"nareśvaram","_","_","nareśvara","NC","","_","_"
1,"prajāpatir","_","_","prajāpati","NC","","_","_"
2,"hi","_","_","hi","CX","","_","_"
3,"bhagavān","_","_","bhagavat","JJ","","_","_"
4,"yaḥ","_","_","yad","PRL","","_","_"
5,"sarvam","_","_","sarva","JQ","","_","_"
6,"_","_","_","sṛj","V","sṛj","_","_"
7,"_","_","_","jagat","NC","","_","_"
1,"sa","_","_","tad","PRD","","_","_"
2,"_","_","_","pravṛtti","NC","","_","_"
3,"_","_","_","nivṛtti","NC","","_","_"
4,"_","_","_","artha","NC","","_","_"
5,"dharmāṇāṃ","_","_","dharma","NC","","_","_"
6,"kṣatram","_","_","kṣatra","NC","","_","_"
7,"icchati","_","_","iṣ","V","iṣ","_","_"
1,"pravṛttasya","_","_","pravṛt","PPP","","_","_"
2,"hi","_","_","hi","CX","","_","_"
3,"dharmasya","_","_","dharma","NC","","_","_"
4,"buddhyā","_","_","buddhi","NC","","_","_"
5,"yaḥ","_","_","yad","PRL","","_","_"
6,"smarate","_","_","smar","V","smṛ","_","_"
7,"gatim","_","_","gati","NC","","_","_"
1,"sa","_","_","tad","PRD","","_","_"
2,"me","_","_","mat","PPR","","_","_"
3,"_","_","_","man","KDG","","_","_"
4,"_","_","_","ca","CCD","","_","_"
5,"_","_","_","pūjay","KDG","","_","_"
6,"_","_","_","ca","CCD","","_","_"
7,"tatra","_","_","tatra","CAD","","_","_"
8,"kṣatraṃ","_","_","kṣatra","NC","","_","_"
9,"pratiṣṭhitam","_","_","pratiṣṭhā","PPP","","_","_"
1,"bhīṣma","_","_","bhīṣma","NC","","_","_"
2,"uvāca","_","_","vak","V","vac","_","_"
1,"evam","_","_","eva","CX","","_","_"
2,"uktvā","_","_","vac","CGDA","","_","_"
3,"sa","_","_","tad","PRD","","_","_"
4,"_","_","_","bhagavat","NC","","_","_"
5,"_","_","_","marut","NC","","_","_"
6,"_","_","_","gaṇa","NC","","_","_"
7,"_","_","_","vṛ","PPP","","_","_"
8,"prabhuḥ","_","_","prabhu","JJ","","_","_"
1,"jagāma","_","_","ga","V","ga","_","_"
2,"bhavanaṃ","_","_","bhavana","NC","","_","_"
3,"viṣṇur","_","_","viṣṇu","NC","","_","_"
4,"akṣaraṃ","_","_","akṣara","JJ","","_","_"
5,"paramaṃ","_","_","parama","JJ","","_","_"
6,"padam","_","_","pada","NC","","_","_"
1,"evaṃ","_","_","eva","CX","","_","_"
2,"pravartite","_","_","pravartay","PPP","","_","_"
3,"dharme","_","_","dharma","NC","","_","_"
4,"purā","_","_","purā","CX","","_","_"
5,"_","_","_","su","CAD","","_","_"
6,"_","_","_","car","PPP","","_","_"
7,"'nagha","_","_","anagha","JJ","","_","_"
1,"kaḥ","_","_","kiṃ","PRQ","","_","_"
2,"kṣatram","_","_","kṣatra","NC","","_","_"
3,"avamanyeta","_","_","avaman","V","avaman","_","_"
4,"cetanāvān","_","_","cetanāvat","JJ","","_","_"
5,"_","_","_","bahu","JJ","","_","_"
6,"_","_","_","śruta","NC","","_","_"
1,"anyāyena","_","_","anyāya","NC","","_","_"
2,"pravṛttāni","_","_","pravṛt","PPP","","_","_"
3,"nivṛttāni","_","_","nivṛt","PPP","","_","_"
4,"_","_","_","tathā","CX","","_","_"
5,"_","_","_","eva","CEM","","_","_"
6,"ca","_","_","ca","CCD","","_","_"
1,"antarā","_","_","antarā","CX","","_","_"
2,"vilayaṃ","_","_","vilaya","NC","","_","_"
3,"yānti","_","_","yā","V","yā","_","_"
4,"yathā","_","_","yathā","CCM","","_","_"
5,"pathi","_","_","pathin","NC","","_","_"
1,"ādau","_","_","ādi","NC","","_","_"
2,"pravartite","_","_","pravartay","PPP","","_","_"
3,"cakre","_","_","cakra","NC","","_","_"
4,"_","_","_","tathā","CX","","_","_"
5,"_","_","_","eva","CEM","","_","_"
6,"_","_","_","ādi","NC","","_","_"
7,"_","_","_","parāyaṇa","NC","","_","_"
1,"vartasva","_","_","vart","V","vṛt","_","_"
2,"_","_","_","puruṣa","NC","","_","_"
3,"_","_","_","vyāghra","NC","","_","_"
4,"saṃvijānāmi","_","_","saṃvijñā","V","saṃvijñā","_","_"
5,"te","_","_","tvat","PPR","","_","_"
6,"'nagha","_","_","anagha","JJ","","_","_"
