"WordID","word","NormSTEM","suffix","lemma","PoS","Root","NormSuffix","NormWord"
1,"vyāsa","_","_","vyāsa","NC","","_","_"
2,"uvāca","_","_","vak","V","vac","_","_"
1,"_","_","_","pracch","KDP","","_","_"
2,"_","_","_","tvat","PPR","","_","_"
3,"_","_","_","sat","JJ","","_","_"
4,"_","_","_","putra","NC","","_","_"
5,"yathāvad","_","_","yathāvat","CX","","_","_"
6,"iha","_","_","iha","CAD","","_","_"
7,"tattvataḥ","_","_","tattva","NC","","_","_"
1,"_","_","_","sāṃkhya","NC","","_","_"
2,"_","_","_","nyāya","NC","","_","_"
3,"saṃyuktaṃ","_","_","saṃyuj","PPP","","_","_"
4,"yad","_","_","yad","PRL","","_","_"
5,"etat","_","_","tad","PRD","","_","_"
6,"kīrtitaṃ","_","_","kīrtay","PPP","","_","_"
7,"mayā","_","_","mat","PPR","","_","_"
1,"_","_","_","yoga","NC","","_","_"
2,"_","_","_","kṛtya","NC","","_","_"
3,"tu","_","_","tu","CCD","","_","_"
4,"te","_","_","tvat","PPR","","_","_"
5,"kṛtsnaṃ","_","_","kṛtsna","JJ","","_","_"
6,"vartayiṣyāmi","_","_","vart","V","vṛt","_","_"
7,"_","_","_","tad","PRD","","_","_"
8,"_","_","_","śṛṇ","V","śru","_","_"
1,"ekatvaṃ","_","_","ekatva","NC","","_","_"
2,"_","_","_","buddhi","NC","","_","_"
3,"_","_","_","manas","NC","","_","_"
4,"indriyāṇāṃ","_","_","indriya","NC","","_","_"
5,"ca","_","_","ca","CCD","","_","_"
6,"sarvaśaḥ","_","_","sarvaśas","CX","","_","_"
1,"ātmano","_","_","ātman","NC","","_","_"
2,"_","_","_","dhyāyin","JJ","","_","_"
3,"_","_","_","tāta","NC","","_","_"
4,"jñānam","_","_","jñāna","NC","","_","_"
5,"etad","_","_","tad","PRD","","_","_"
6,"anuttamam","_","_","anuttama","JJ","","_","_"
1,"tad","_","_","tad","PRD","","_","_"
2,"etad","_","_","tad","PRD","","_","_"
3,"upaśāntena","_","_","upaśa","PPP","","_","_"
4,"_","_","_","da","PPP","","_","_"
5,"_","_","_","adhyātma","NC","","_","_"
6,"_","_","_","śīlin","JJ","","_","_"
1,"_","_","_","ātman","NC","","_","_"
2,"_","_","_","ārāma","NC","","_","_"
3,"buddhena","_","_","budh","PPP","","_","_"
4,"boddhavyaṃ","_","_","budh","KDG","","_","_"
5,"_","_","_","śuci","JJ","","_","_"
6,"_","_","_","karman","NC","","_","_"
1,"_","_","_","yoga","NC","","_","_"
2,"_","_","_","doṣa","NC","","_","_"
3,"samucchidya","_","_","samucchid","CGDA","","_","_"
4,"pañca","_","_","pañcan","NUM","","_","_"
5,"yān","_","_","yad","PRL","","_","_"
6,"kavayo","_","_","kavi","NC","","_","_"
7,"viduḥ","_","_","vid","V","vid","_","_"
1,"kāmaṃ","_","_","kāma","NC","","_","_"
2,"krodhaṃ","_","_","krodha","NC","","_","_"
3,"ca","_","_","ca","CCD","","_","_"
4,"lobhaṃ","_","_","lobha","NC","","_","_"
5,"ca","_","_","ca","CCD","","_","_"
6,"bhayaṃ","_","_","bhaya","NC","","_","_"
7,"svapnaṃ","_","_","svapna","NC","","_","_"
8,"ca","_","_","ca","CCD","","_","_"
9,"pañcamam","_","_","pañcama","JJ","","_","_"
1,"krodhaṃ","_","_","krodha","NC","","_","_"
2,"śamena","_","_","śama","NC","","_","_"
3,"jayati","_","_","jay","V","ji","_","_"
4,"kāmaṃ","_","_","kāma","NC","","_","_"
5,"_","_","_","saṃkalpa","NC","","_","_"
6,"_","_","_","varjana","NC","","_","_"
1,"_","_","_","sattva","NC","","_","_"
2,"_","_","_","saṃsevana","NC","","_","_"
3,"dhīro","_","_","dhīra","JJ","","_","_"
4,"nidrām","_","_","nidrā","NC","","_","_"
5,"ucchettum","_","_","ucchid","CGDI","","_","_"
6,"arhati","_","_","arh","V","arh","_","_"
1,"dhṛtyā","_","_","dhṛti","NC","","_","_"
2,"_","_","_","śiśna","NC","","_","_"
3,"_","_","_","udara","NC","","_","_"
4,"rakṣet","_","_","rakṣ","V","rakṣ","_","_"
5,"_","_","_","pāṇi","NC","","_","_"
6,"_","_","_","pāda","NC","","_","_"
7,"ca","_","_","ca","CCD","","_","_"
8,"cakṣuṣā","_","_","cakṣus","NC","","_","_"
1,"_","_","_","cakṣus","NC","","_","_"
2,"_","_","_","śrotra","NC","","_","_"
3,"ca","_","_","ca","CCD","","_","_"
4,"manasā","_","_","manas","NC","","_","_"
5,"mano","_","_","manas","NC","","_","_"
6,"vācaṃ","_","_","vāc","NC","","_","_"
7,"ca","_","_","ca","CCD","","_","_"
8,"karmaṇā","_","_","karman","NC","","_","_"
1,"apramādād","_","_","apramāda","NC","","_","_"
2,"bhayaṃ","_","_","bhaya","NC","","_","_"
3,"_","_","_","jah","V","hā","_","_"
4,"_","_","_","lobha","NC","","_","_"
5,"_","_","_","prājña","JJ","","_","_"
6,"_","_","_","upasevana","NC","","_","_"
1,"evam","_","_","eva","CX","","_","_"
2,"etān","_","_","tad","PRD","","_","_"
3,"_","_","_","yoga","NC","","_","_"
4,"_","_","_","doṣa","NC","","_","_"
5,"_","_","_","jay","V","ji","_","_"
6,"_","_","_","nitya","CX","","_","_"
7,"atandritaḥ","_","_","atandrita","JJ","","_","_"
1,"_","_","_","agni","NC","","_","_"
2,"_","_","_","ca","CCD","","_","_"
3,"_","_","_","brāhmaṇa","NC","","_","_"
4,"_","_","_","ca","CCD","","_","_"
5,"_","_","_","arc","V","arc","_","_"
6,"devatāḥ","_","_","devatā","NC","","_","_"
7,"praṇameta","_","_","praṇa","V","praṇa","_","_"
8,"ca","_","_","ca","CCD","","_","_"
1,"varjayed","_","_","vṛj","V","vṛj","_","_"
2,"ruṣitāṃ","_","_","ruṣ","PPP","","_","_"
3,"vācaṃ","_","_","vāc","NC","","_","_"
4,"_","_","_","hiṃsā","NC","","_","_"
5,"_","_","_","yuj","PPP","","_","_"
6,"manonugām","_","_","manonuga","JJ","","_","_"
1,"brahma","_","_","brahman","NC","","_","_"
2,"_","_","_","tejas","NC","","_","_"
3,"_","_","_","maya","JJ","","_","_"
4,"śukraṃ","_","_","śukra","JJ","","_","_"
5,"yasya","_","_","yad","PRL","","_","_"
6,"sarvam","_","_","sarva","JQ","","_","_"
7,"idaṃ","_","_","ida","PRD","","_","_"
8,"rasaḥ","_","_","rasa","NC","","_","_"
1,"ekasya","_","_","eka","PPX","","_","_"
2,"bhūtaṃ","_","_","bhū","PPP","","_","_"
3,"bhūtasya","_","_","bhūta","NC","","_","_"
4,"dvayaṃ","_","_","dvaya","NC","","_","_"
5,"_","_","_","sthāvara","JJ","","_","_"
6,"_","_","_","jaṅgama","JJ","","_","_"
1,"dhyānam","_","_","dhyāna","NC","","_","_"
2,"adhyayanaṃ","_","_","adhyayana","NC","","_","_"
3,"dānaṃ","_","_","dāna","NC","","_","_"
4,"satyaṃ","_","_","satya","NC","","_","_"
5,"hrīr","_","_","hrī","NC","","_","_"
6,"ārjavaṃ","_","_","ārjava","NC","","_","_"
7,"kṣamā","_","_","kṣamā","NC","","_","_"
1,"śaucam","_","_","śauca","NC","","_","_"
2,"_","_","_","āhāra","NC","","_","_"
3,"_","_","_","saṃśuddhi","NC","","_","_"
4,"indriyāṇāṃ","_","_","indriya","NC","","_","_"
5,"ca","_","_","ca","CCD","","_","_"
6,"nigrahaḥ","_","_","nigraha","NC","","_","_"
1,"etair","_","_","tad","PRD","","_","_"
2,"vivardhate","_","_","vivṛdh","V","vivṛdh","_","_"
3,"tejaḥ","_","_","tejas","NC","","_","_"
4,"pāpmānaṃ","_","_","pāpman","NC","","_","_"
5,"_","_","_","ca","CCD","","_","_"
6,"_","_","_","apakṛṣ","V","apakṛṣ","_","_"
1,"sidhyanti","_","_","sidh","V","sidh","_","_"
2,"_","_","_","ca","CCD","","_","_"
3,"_","_","_","ida","PRD","","_","_"
4,"_","_","_","sarva","JQ","","_","_"
5,"_","_","_","artha","NC","","_","_"
6,"vijñānaṃ","_","_","vijñāna","NC","","_","_"
7,"ca","_","_","ca","CCD","","_","_"
8,"pravartate","_","_","pravart","V","pravṛt","_","_"
1,"samaḥ","_","_","sama","PPX","","_","_"
2,"sarveṣu","_","_","sarva","JQ","","_","_"
3,"bhūteṣu","_","_","bhūta","NC","","_","_"
4,"_","_","_","labh","PPP","","_","_"
5,"_","_","_","alabdha","JJ","","_","_"
6,"vartayan","_","_","vartay","KDP","","_","_"
1,"tu","_","_","tu","CCD","","_","_"
2,"tejasvī","_","_","tejasvin","JJ","","_","_"
3,"_","_","_","laghu","JJ","","_","_"
4,"_","_","_","āhāra","NC","","_","_"
5,"_","_","_","ji","PPP","","_","_"
6,"_","_","_","indriya","NC","","_","_"
1,"_","_","_","kāma","NC","","_","_"
2,"_","_","_","krodha","NC","","_","_"
3,"vaśe","_","_","vaśa","NC","","_","_"
4,"kṛtvā","_","_","kṛ","CGDA","","_","_"
5,"ninīṣed","_","_","ninīṣ","V","ninīṣ","_","_"
6,"brahmaṇaḥ","_","_","brahman","NC","","_","_"
7,"padam","_","_","pada","NC","","_","_"
1,"_","_","_","manas","NC","","_","_"
2,"_","_","_","ca","CCD","","_","_"
3,"_","_","_","indriya","NC","","_","_"
4,"ca","_","_","ca","CCD","","_","_"
5,"_","_","_","kṛ","CGDA","","_","_"
6,"_","_","_","aikāgrya","NC","","_","_"
7,"samāhitaḥ","_","_","samāhita","JJ","","_","_"
1,"prāg","_","_","prāk","CX","","_","_"
2,"_","_","_","rātra","NC","","_","_"
3,"_","_","_","apararātra","NC","","_","_"
4,"_","_","_","dhāray","V","dhāray","_","_"
5,"_","_","_","manas","NC","","_","_"
6,"ātmanā","_","_","ātman","NC","","_","_"
1,"jantoḥ","_","_","jantu","NC","","_","_"
2,"_","_","_","pañcan","NUM","","_","_"
3,"_","_","_","indriya","NC","","_","_"
4,"_","_","_","ida","PRD","","_","_"
5,"yad","_","_","yad","PRL","","_","_"
6,"ekaṃ","_","_","eka","PPX","","_","_"
7,"chidram","_","_","chidra","NC","","_","_"
8,"indriyam","_","_","indriya","NC","","_","_"
1,"tato","_","_","tatas","CX","","_","_"
2,"'sya","_","_","ida","PRD","","_","_"
3,"sravati","_","_","srav","V","sru","_","_"
4,"prajñā","_","_","prajñā","NC","","_","_"
5,"dṛteḥ","_","_","dṛti","NC","","_","_"
6,"pādād","_","_","pāda","NC","","_","_"
7,"_","_","_","iva","CCM","","_","_"
8,"_","_","_","udaka","NC","","_","_"
1,"_","_","_","manas","NC","","_","_"
2,"_","_","_","tu","CCD","","_","_"
3,"pūrvam","_","_","pūrva","CX","","_","_"
4,"ādadyāt","_","_","ādad","V","ādā","_","_"
5,"kumīnān","_","_","kumīna","NC","","_","_"
6,"iva","_","_","iva","CCM","","_","_"
7,"_","_","_","matsya","NC","","_","_"
8,"_","_","_","han","JJ","","_","_"
1,"tataḥ","_","_","tatas","CX","","_","_"
2,"śrotraṃ","_","_","śrotra","NC","","_","_"
3,"_","_","_","tatas","CX","","_","_"
4,"_","_","_","cakṣus","NC","","_","_"
5,"jihvāṃ","_","_","jihvā","NC","","_","_"
6,"ghrāṇaṃ","_","_","ghrāṇa","NC","","_","_"
7,"ca","_","_","ca","CCD","","_","_"
8,"_","_","_","yoga","NC","","_","_"
9,"_","_","_","vid","JJ","","_","_"
1,"tata","_","_","tatas","CX","","_","_"
2,"etāni","_","_","tad","PRD","","_","_"
3,"saṃyamya","_","_","saṃya","CGDA","","_","_"
4,"manasi","_","_","manas","NC","","_","_"
5,"sthāpayed","_","_","tiṣṭh","V","sthā","_","_"
6,"yatiḥ","_","_","yati","NC","","_","_"
1,"_","_","_","tathā","CX","","_","_"
2,"_","_","_","eva","CEM","","_","_"
3,"_","_","_","apoh","CGDA","","_","_"
4,"_","_","_","saṃkalpa","NC","","_","_"
5,"_","_","_","manas","NC","","_","_"
6,"_","_","_","hi","CX","","_","_"
7,"_","_","_","ātman","NC","","_","_"
8,"dhārayet","_","_","dhar","V","dhṛ","_","_"
1,"pañca","_","_","pañcan","NUM","","_","_"
2,"jñānena","_","_","jñāna","NC","","_","_"
3,"saṃdhāya","_","_","saṃdhā","CGDA","","_","_"
4,"manasi","_","_","manas","NC","","_","_"
5,"sthāpayed","_","_","tiṣṭh","V","sthā","_","_"
6,"yatiḥ","_","_","yati","NC","","_","_"
1,"_","_","_","yadā","CSB","","_","_"
2,"_","_","_","tad","PRD","","_","_"
3,"_","_","_","avatiṣṭh","V","avasthā","_","_"
4,"_","_","_","manas","NC","","_","_"
5,"_","_","_","ṣaṣṭha","JJ","","_","_"
6,"_","_","_","ca","CCD","","_","_"
7,"_","_","_","ātman","NC","","_","_"
1,"prasīdanti","_","_","prasīd","V","prasad","_","_"
2,"ca","_","_","ca","CCD","","_","_"
3,"saṃsthāya","_","_","saṃsthā","CGDA","","_","_"
4,"tadā","_","_","tadā","CAD","","_","_"
5,"brahma","_","_","brahman","NC","","_","_"
6,"prakāśate","_","_","prakāś","V","prakāś","_","_"
1,"vidhūma","_","_","vidhūma","JJ","","_","_"
2,"iva","_","_","iva","CCM","","_","_"
3,"_","_","_","dīp","PPP","","_","_"
4,"_","_","_","arci","NC","","_","_"
5,"āditya","_","_","āditya","NC","","_","_"
6,"iva","_","_","iva","CCM","","_","_"
7,"dīptimān","_","_","dīptimat","JJ","","_","_"
1,"vaidyuto","_","_","vaidyuta","JJ","","_","_"
2,"'gnir","_","_","agni","NC","","_","_"
3,"_","_","_","iva","CCM","","_","_"
4,"_","_","_","ākāśa","NC","","_","_"
5,"_","_","_","darś","V","dṛś","_","_"
6,"_","_","_","ātman","NC","","_","_"
7,"ātmanā","_","_","ātman","NC","","_","_"
1,"sarvaṃ","_","_","sarva","JQ","","_","_"
2,"ca","_","_","ca","CCD","","_","_"
3,"tatra","_","_","tatra","CAD","","_","_"
4,"sarvatra","_","_","sarvatra","CX","","_","_"
5,"_","_","_","vyāpaka","JJ","","_","_"
7,"_","_","_","ca","CCD","","_","_"
8,"dṛśyate","_","_","darś","V","dṛś","_","_"
1,"taṃ","_","_","tad","PRD","","_","_"
2,"paśyanti","_","_","paś","V","paś","_","_"
3,"mahātmāno","_","_","mahātman","JJ","","_","_"
4,"brāhmaṇā","_","_","brāhmaṇa","NC","","_","_"
5,"ye","_","_","yad","PRL","","_","_"
6,"manīṣiṇaḥ","_","_","manīṣin","JJ","","_","_"
1,"dhṛtimanto","_","_","dhṛtimat","JJ","","_","_"
2,"_","_","_","mahat","JJ","","_","_"
3,"_","_","_","prājña","JJ","","_","_"
4,"_","_","_","sarva","JQ","","_","_"
5,"_","_","_","bhūta","NC","","_","_"
6,"_","_","_","hita","NC","","_","_"
7,"ratāḥ","_","_","ra","PPP","","_","_"
1,"evaṃ","_","_","eva","CX","","_","_"
2,"parimitaṃ","_","_","parimā","PPP","","_","_"
3,"kālam","_","_","kāla","NC","","_","_"
4,"ācaran","_","_","ācar","KDP","","_","_"
5,"_","_","_","saṃśita","JJ","","_","_"
6,"_","_","_","vrata","NC","","_","_"
1,"āsīno","_","_","ās","PPP","","_","_"
2,"hi","_","_","hi","CX","","_","_"
3,"_","_","_","rahas","NC","","_","_"
4,"_","_","_","eka","PPX","","_","_"
5,"gacched","_","_","gacch","V","gam","_","_"
6,"_","_","_","akṣara","JJ","","_","_"
7,"_","_","_","sātmya","NC","","_","_"
1,"pramoho","_","_","pramoha","NC","","_","_"
2,"bhrama","_","_","bhrama","NC","","_","_"
3,"āvarto","_","_","āvarta","NC","","_","_"
4,"_","_","_","ghrāṇa","NC","","_","_"
5,"_","_","_","śravaṇa","NC","","_","_"
6,"_","_","_","darśana","NC","","_","_"
1,"adbhutāni","_","_","adbhuta","JJ","","_","_"
2,"_","_","_","rasa","NC","","_","_"
3,"_","_","_","sparśa","NC","","_","_"
4,"_","_","_","śīta","JJ","","_","_"
5,"_","_","_","uṣṇa","JJ","","_","_"
6,"_","_","_","māruta","NC","","_","_"
7,"_","_","_","ākṛti","NC","","_","_"
1,"pratibhām","_","_","pratibhā","NC","","_","_"
2,"_","_","_","upasarga","NC","","_","_"
3,"_","_","_","ca","CCD","","_","_"
4,"_","_","_","api","CX","","_","_"
5,"_","_","_","upasaṃgrah","CGDA","","_","_"
6,"yogataḥ","_","_","yoga","NC","","_","_"
1,"_","_","_","tad","PRD","","_","_"
2,"_","_","_","tattva","NC","","_","_"
3,"_","_","_","vid","JJ","","_","_"
4,"anādṛtya","_","_","anādṛtya","CX","","_","_"
5,"_","_","_","sva","JJ","","_","_"
6,"_","_","_","ātman","NC","","_","_"
7,"_","_","_","eva","CEM","","_","_"
8,"nivartayet","_","_","nivart","V","nivṛt","_","_"
1,"kuryāt","_","_","kar","V","kṛ","_","_"
2,"paricayaṃ","_","_","paricaya","NC","","_","_"
3,"yoge","_","_","yoga","NC","","_","_"
4,"traikālyaṃ","_","_","traikālya","NC","","_","_"
5,"niyato","_","_","niya","PPP","","_","_"
6,"muniḥ","_","_","muni","NC","","_","_"
1,"_","_","_","giri","NC","","_","_"
2,"_","_","_","śṛṅga","NC","","_","_"
3,"tathā","_","_","tathā","CX","","_","_"
4,"caitye","_","_","caitya","NC","","_","_"
5,"_","_","_","vṛkṣa","NC","","_","_"
6,"_","_","_","agra","NC","","_","_"
7,"ca","_","_","ca","CCD","","_","_"
8,"yojayet","_","_","yuj","V","yuj","_","_"
1,"_","_","_","saṃniya","CGDA","","_","_"
2,"_","_","_","indriya","NC","","_","_"
3,"_","_","_","grāma","NC","","_","_"
4,"goṣṭhe","_","_","goṣṭha","NC","","_","_"
5,"_","_","_","bhāṇḍa","NC","","_","_"
6,"_","_","_","manas","NC","","_","_"
7,"iva","_","_","iva","CCM","","_","_"
1,"_","_","_","ekāgra","JJ","","_","_"
2,"_","_","_","cintay","V","cintay","_","_"
3,"_","_","_","nitya","CX","","_","_"
4,"_","_","_","yoga","NC","","_","_"
5,"_","_","_","na","CNG","","_","_"
6,"_","_","_","udvejay","V","udvejay","_","_"
7,"_","_","_","manas","NC","","_","_"
1,"_","_","_","yad","PRL","","_","_"
2,"_","_","_","upāya","NC","","_","_"
3,"śakyeta","_","_","śakn","V","śak","_","_"
4,"saṃniyantuṃ","_","_","saṃniya","CGDI","","_","_"
5,"calaṃ","_","_","cala","JJ","","_","_"
6,"manaḥ","_","_","manas","NC","","_","_"
1,"taṃ","_","_","tad","PRD","","_","_"
2,"taṃ","_","_","tad","PRD","","_","_"
3,"yukto","_","_","yuj","PPP","","_","_"
4,"niṣeveta","_","_","niṣev","V","niṣev","_","_"
5,"na","_","_","na","CNG","","_","_"
6,"_","_","_","ca","CCD","","_","_"
7,"_","_","_","eva","CEM","","_","_"
8,"vicalet","_","_","vical","V","vical","_","_"
9,"tataḥ","_","_","tatas","CX","","_","_"
1,"śūnyā","_","_","śūnya","JJ","","_","_"
2,"_","_","_","giri","NC","","_","_"
3,"_","_","_","guhā","NC","","_","_"
4,"_","_","_","ca","CCD","","_","_"
5,"_","_","_","eva","CEM","","_","_"
6,"devatāyatanāni","_","_","devatāyatana","NC","","_","_"
7,"ca","_","_","ca","CCD","","_","_"
1,"_","_","_","śūnya","JJ","","_","_"
2,"_","_","_","āgāra","NC","","_","_"
3,"_","_","_","ca","CCD","","_","_"
4,"_","_","_","ekāgra","JJ","","_","_"
5,"_","_","_","nivāsa","NC","","_","_"
6,"_","_","_","artha","NC","","_","_"
7,"upakramet","_","_","upakram","V","upakram","_","_"
1,"_","_","_","na","CNG","","_","_"
2,"_","_","_","abhiṣvaj","V","abhiṣvaj","_","_"
3,"paraṃ","_","_","para","PPX","","_","_"
4,"vācā","_","_","vāc","NC","","_","_"
5,"karmaṇā","_","_","karman","NC","","_","_"
6,"_","_","_","manas","NC","","_","_"
7,"_","_","_","api","CX","","_","_"
8,"vā","_","_","vā","CCD","","_","_"
1,"upekṣako","_","_","upekṣaka","JJ","","_","_"
2,"_","_","_","ya","PPP","","_","_"
3,"_","_","_","āhāra","NC","","_","_"
4,"_","_","_","labh","PPP","","_","_"
5,"_","_","_","alabdha","JJ","","_","_"
6,"samo","_","_","sama","PPX","","_","_"
7,"bhavet","_","_","bhav","V","bhū","_","_"
1,"_","_","_","yad","PRL","","_","_"
2,"_","_","_","ca","CCD","","_","_"
3,"_","_","_","a","PRD","","_","_"
4,"abhinandeta","_","_","abhinand","V","abhinand","_","_"
5,"_","_","_","yad","PRL","","_","_"
6,"_","_","_","ca","CCD","","_","_"
7,"_","_","_","a","PRD","","_","_"
8,"apavādayet","_","_","apavāday","V","apavāday","_","_"
1,"_","_","_","samasta","JJ","","_","_"
2,"_","_","_","ca","CCD","","_","_"
3,"_","_","_","api","CX","","_","_"
4,"_","_","_","ubhaya","JJ","","_","_"
5,"_","_","_","na","CNG","","_","_"
6,"_","_","_","abhidhyāy","V","abhidhyai","_","_"
7,"_","_","_","śubha","JJ","","_","_"
8,"_","_","_","aśubha","JJ","","_","_"
1,"na","_","_","na","CNG","","_","_"
2,"prahṛṣyeta","_","_","prahṛṣ","V","prahṛṣ","_","_"
3,"lābheṣu","_","_","lābha","NC","","_","_"
4,"_","_","_","na","CNG","","_","_"
5,"_","_","_","alābha","NC","","_","_"
6,"ca","_","_","ca","CCD","","_","_"
7,"cintayet","_","_","cint","V","cint","_","_"
1,"samaḥ","_","_","sama","PPX","","_","_"
2,"sarveṣu","_","_","sarva","JQ","","_","_"
3,"bhūteṣu","_","_","bhūta","NC","","_","_"
4,"sadharmā","_","_","sadharman","JJ","","_","_"
5,"mātariśvanaḥ","_","_","mātariśvan","NC","","_","_"
1,"evaṃ","_","_","eva","CX","","_","_"
2,"_","_","_","sarva","JQ","","_","_"
3,"_","_","_","ātman","NC","","_","_"
4,"sādhoḥ","_","_","sādhu","JJ","","_","_"
5,"sarvatra","_","_","sarvatra","CX","","_","_"
6,"_","_","_","sama","PPX","","_","_"
7,"_","_","_","darśin","JJ","","_","_"
1,"_","_","_","ṣaṣ","NUM","","_","_"
2,"_","_","_","māsa","NC","","_","_"
3,"_","_","_","nitya","JJ","","_","_"
4,"_","_","_","yuj","PPP","","_","_"
5,"_","_","_","śabdabrahman","NC","","_","_"
6,"_","_","_","ativart","V","ativṛt","_","_"
1,"_","_","_","vedanā","NC","","_","_"
2,"_","_","_","ārta","JJ","","_","_"
3,"prajā","_","_","prajā","NC","","_","_"
4,"dṛṣṭvā","_","_","dṛś","CGDA","","_","_"
5,"_","_","_","sama","PPX","","_","_"
6,"_","_","_","loṣṭa","NC","","_","_"
7,"_","_","_","aśman","NC","","_","_"
8,"_","_","_","kāñcana","NC","","_","_"
1,"_","_","_","tad","PRD","","_","_"
2,"_","_","_","nira","PPP","","_","_"
3,"mārge","_","_","mārga","NC","","_","_"
4,"_","_","_","vira","V","vira","_","_"
5,"_","_","_","na","CNG","","_","_"
6,"vimohitaḥ","_","_","vimohay","PPP","","_","_"
1,"api","_","_","api","CX","","_","_"
2,"_","_","_","varṇa","NC","","_","_"
3,"_","_","_","avakṛṣ","PPP","","_","_"
4,"_","_","_","tu","CCD","","_","_"
5,"nārī","_","_","nārī","NC","","_","_"
6,"vā","_","_","vā","CCD","","_","_"
7,"_","_","_","dharma","NC","","_","_"
8,"_","_","_","kāṅkṣin","JJ","","_","_"
1,"_","_","_","tad","PRD","","_","_"
2,"_","_","_","api","CX","","_","_"
3,"_","_","_","tad","PRD","","_","_"
4,"mārgeṇa","_","_","mārga","NC","","_","_"
5,"gacchetāṃ","_","_","gacch","V","gam","_","_"
6,"paramāṃ","_","_","parama","JJ","","_","_"
7,"gatim","_","_","gati","NC","","_","_"
1,"ajaṃ","_","_","aja","JJ","","_","_"
2,"purāṇam","_","_","purāṇa","JJ","","_","_"
3,"ajaraṃ","_","_","ajara","JJ","","_","_"
4,"sanātanaṃ","_","_","sanātana","JJ","","_","_"
5,"yad","_","_","yad","PRL","","_","_"
6,"indriyair","_","_","indriya","NC","","_","_"
7,"upalabhate","_","_","upalabh","V","upalabh","_","_"
8,"naro","_","_","nara","NC","","_","_"
9,"'calaḥ","_","_","acala","JJ","","_","_"
1,"aṇor","_","_","aṇu","JJ","","_","_"
2,"aṇīyo","_","_","aṇīyas","JJ","","_","_"
3,"mahato","_","_","mahat","JJ","","_","_"
4,"mahattaraṃ","_","_","mahattara","JJ","","_","_"
5,"_","_","_","tad","PRD","","_","_"
6,"_","_","_","ātman","NC","","_","_"
7,"paśyati","_","_","paś","V","paś","_","_"
8,"yukta","_","_","yuj","PPP","","_","_"
9,"ātmavān","_","_","ātmavat","JJ","","_","_"
1,"idaṃ","_","_","ida","PRD","","_","_"
2,"_","_","_","mahat","JJ","","_","_"
3,"_","_","_","ṛṣi","NC","","_","_"
4,"vacanaṃ","_","_","vacana","NC","","_","_"
5,"mahātmano","_","_","mahātman","JJ","","_","_"
6,"yathāvad","_","_","yathāvat","CX","","_","_"
7,"uktaṃ","_","_","vac","PPP","","_","_"
8,"_","_","_","manas","NC","","_","_"
9,"_","_","_","anudṛś","CGDA","","_","_"
10,"ca","_","_","ca","CCD","","_","_"
1,"avekṣya","_","_","avekṣ","CGDA","","_","_"
2,"_","_","_","ca","CCD","","_","_"
3,"_","_","_","e","V","i","_","_"
4,"_","_","_","parameṣṭhin","NC","","_","_"
5,"_","_","_","sātmya","NC","","_","_"
7,"prayānti","_","_","prai","V","prai","_","_"
8,"yāṃ","_","_","yad","PRL","","_","_"
9,"_","_","_","bhūta","NC","","_","_"
10,"_","_","_","gati","NC","","_","_"
11,"manīṣiṇaḥ","_","_","manīṣin","JJ","","_","_"
