"WordID","word","NormSTEM","suffix","lemma","PoS","Root","NormSuffix","NormWord"
1,"dhṛtarāṣṭra","_","_","dhṛtarāṣṭra","NC","","_","_"
2,"uvāca","_","_","vak","V","vac","_","_"
1,"sarva","_","_","sarva","JQ","","_","_"
2,"ete","_","_","tad","PRD","","_","_"
3,"_","_","_","mahat","JJ","","_","_"
4,"_","_","_","utsāha","NC","","_","_"
5,"ye","_","_","yad","PRL","","_","_"
6,"tvayā","_","_","tvat","PPR","","_","_"
7,"parikīrtitāḥ","_","_","parikīrtay","PPP","","_","_"
1,"_","_","_","ekatas","CX","","_","_"
2,"_","_","_","tu","CCD","","_","_"
3,"_","_","_","eva","CEM","","_","_"
4,"te","_","_","tad","PRD","","_","_"
5,"sarve","_","_","sarva","JQ","","_","_"
6,"sametā","_","_","same","PPP","","_","_"
7,"bhīma","_","_","bhīma","NC","","_","_"
8,"ekataḥ","_","_","ekatas","CX","","_","_"
1,"_","_","_","bhīmasa","NC","","_","_"
2,"_","_","_","hi","CX","","_","_"
3,"me","_","_","mat","PPR","","_","_"
4,"bhūyo","_","_","bhūyas","JJ","","_","_"
5,"bhayaṃ","_","_","bhaya","NC","","_","_"
6,"saṃjāyate","_","_","saṃjan","V","saṃjan","_","_"
7,"mahat","_","_","mahat","JJ","","_","_"
1,"kruddhād","_","_","krudh","PPP","","_","_"
2,"amarṣaṇāt","_","_","amarṣaṇa","JJ","","_","_"
3,"tāta","_","_","tāta","NC","","_","_"
4,"vyāghrād","_","_","vyāghra","NC","","_","_"
5,"iva","_","_","iva","CCM","","_","_"
6,"mahāruroḥ","_","_","mahāruru","NC","","_","_"
1,"jāgarmi","_","_","jāgṛ","V","jāgṛ","_","_"
2,"rātrayaḥ","_","_","rātri","NC","","_","_"
3,"sarvā","_","_","sarva","JQ","","_","_"
4,"dīrgham","_","_","dīrgha","JJ","","_","_"
5,"uṣṇaṃ","_","_","uṣṇa","JJ","","_","_"
6,"ca","_","_","ca","CCD","","_","_"
7,"niḥśvasan","_","_","niḥśvas","KDP","","_","_"
1,"bhīto","_","_","bhī","PPP","","_","_"
2,"vṛkodarāt","_","_","vṛkodara","NC","","_","_"
3,"tāta","_","_","tāta","NC","","_","_"
4,"siṃhāt","_","_","siṃha","NC","","_","_"
5,"paśur","_","_","paśu","NC","","_","_"
6,"_","_","_","iva","CCM","","_","_"
7,"_","_","_","abala","JJ","","_","_"
1,"na","_","_","na","CNG","","_","_"
2,"hi","_","_","hi","CX","","_","_"
3,"tasya","_","_","tad","PRD","","_","_"
4,"_","_","_","mahat","JJ","","_","_"
5,"_","_","_","bāhu","NC","","_","_"
6,"_","_","_","śakra","NC","","_","_"
7,"_","_","_","pratima","JJ","","_","_"
8,"_","_","_","tejas","NC","","_","_"
1,"sainye","_","_","sainya","NC","","_","_"
2,"'smin","_","_","ida","PRD","","_","_"
3,"pratipaśyāmi","_","_","pratipaś","V","pratipaś","_","_"
4,"ya","_","_","yad","PRL","","_","_"
5,"enaṃ","_","_","a","PRD","","_","_"
6,"viṣahed","_","_","viṣah","V","viṣah","_","_"
7,"yudhi","_","_","yudh","NC","","_","_"
1,"_","_","_","amarṣaṇa","JJ","","_","_"
2,"_","_","_","ca","CCD","","_","_"
3,"kaunteyo","_","_","kaunteya","NC","","_","_"
4,"_","_","_","dṛḍha","JJ","","_","_"
5,"_","_","_","vaira","NC","","_","_"
6,"_","_","_","ca","CCD","","_","_"
7,"pāṇḍavaḥ","_","_","pāṇḍava","NC","","_","_"
1,"_","_","_","anarman","NC","","_","_"
2,"_","_","_","hāsin","JJ","","_","_"
3,"_","_","_","sa_saha","CX","","_","_"
4,"_","_","_","unmāda","NC","","_","_"
5,"_","_","_","tiryañc","JJ","","_","_"
6,"_","_","_","prekṣin","JJ","","_","_"
7,"_","_","_","mahat","JJ","","_","_"
8,"_","_","_","svana","NC","","_","_"
1,"_","_","_","mahat","JJ","","_","_"
2,"_","_","_","vega","NC","","_","_"
3,"_","_","_","mahat","JJ","","_","_"
4,"_","_","_","utsāha","NC","","_","_"
5,"_","_","_","mahat","JJ","","_","_"
6,"_","_","_","bāhu","NC","","_","_"
7,"_","_","_","mahat","JJ","","_","_"
8,"_","_","_","bala","NC","","_","_"
1,"mandānāṃ","_","_","manda","JJ","","_","_"
2,"mama","_","_","mat","PPR","","_","_"
3,"putrāṇāṃ","_","_","putra","NC","","_","_"
4,"_","_","_","yuddha","NC","","_","_"
5,"_","_","_","anta","NC","","_","_"
6,"kariṣyati","_","_","kar","V","kṛ","_","_"
1,"_","_","_","ūru","NC","","_","_"
2,"_","_","_","grāha","NC","","_","_"
3,"_","_","_","grah","PPP","","_","_"
4,"gadāṃ","_","_","gadā","NC","","_","_"
5,"bibhrad","_","_","bhṛ","KDP","","_","_"
6,"vṛkodaraḥ","_","_","vṛkodara","NC","","_","_"
1,"kurūṇām","_","_","kuru","NC","","_","_"
2,"ṛṣabho","_","_","ṛṣabha","NC","","_","_"
3,"yuddhe","_","_","yuddha","NC","","_","_"
4,"daṇḍapāṇir","_","_","daṇḍapāṇi","NC","","_","_"
5,"_","_","_","iva","CCM","","_","_"
6,"_","_","_","antaka","NC","","_","_"
1,"_","_","_","śaikyāyasa","JJ","","_","_"
2,"_","_","_","maya","JJ","","_","_"
3,"ghorāṃ","_","_","ghora","JJ","","_","_"
4,"gadāṃ","_","_","gadā","NC","","_","_"
5,"_","_","_","kāñcana","NC","","_","_"
6,"_","_","_","bhūṣay","PPP","","_","_"
1,"_","_","_","manas","NC","","_","_"
2,"_","_","_","mat","PPR","","_","_"
3,"prapaśyāmi","_","_","prapaś","V","prapaś","_","_"
4,"brahmadaṇḍam","_","_","brahmadaṇḍa","NC","","_","_"
5,"_","_","_","iva","CCM","","_","_"
6,"_","_","_","udya","PPP","","_","_"
1,"yathā","_","_","yathā","CCM","","_","_"
2,"rurūṇāṃ","_","_","ruru","NC","","_","_"
3,"yūtheṣu","_","_","yūtha","NC","","_","_"
4,"siṃho","_","_","siṃha","NC","","_","_"
5,"_","_","_","jan","PPP","","_","_"
6,"_","_","_","bala","NC","","_","_"
7,"_","_","_","car","V","car","_","_"
1,"māmakeṣu","_","_","māmaka","JJ","","_","_"
2,"tathā","_","_","tathā","CX","","_","_"
3,"bhīmo","_","_","bhīma","NC","","_","_"
4,"baleṣu","_","_","bala","NC","","_","_"
5,"vicariṣyati","_","_","vicar","V","vicar","_","_"
1,"sarveṣāṃ","_","_","sarva","JQ","","_","_"
2,"mama","_","_","mat","PPR","","_","_"
3,"putrāṇāṃ","_","_","putra","NC","","_","_"
4,"sa","_","_","tad","PRD","","_","_"
5,"ekaḥ","_","_","eka","PPX","","_","_"
6,"_","_","_","krūra","JJ","","_","_"
7,"_","_","_","vikrama","NC","","_","_"
1,"_","_","_","bahu","JJ","","_","_"
2,"_","_","_","āśin","JJ","","_","_"
3,"_","_","_","vipratīpa","JJ","","_","_"
4,"_","_","_","ca","CCD","","_","_"
5,"bālye","_","_","bālya","NC","","_","_"
6,"'pi","_","_","api","CX","","_","_"
7,"rabhasaḥ","_","_","rabhasa","JJ","","_","_"
8,"sadā","_","_","sadā","CAD","","_","_"
1,"udvepate","_","_","udvip","V","udvip","_","_"
2,"me","_","_","mat","PPR","","_","_"
3,"hṛdayaṃ","_","_","hṛdaya","NC","","_","_"
4,"yadā","_","_","yadā","CSB","","_","_"
5,"_","_","_","duryodhana","NC","","_","_"
6,"_","_","_","ādi","NC","","_","_"
1,"bālye","_","_","bālya","NC","","_","_"
2,"'pi","_","_","api","CX","","_","_"
3,"tena","_","_","tad","PRD","","_","_"
4,"yudhyanto","_","_","yudh","KDP","","_","_"
5,"_","_","_","vāraṇa","NC","","_","_"
6,"_","_","_","iva","CCM","","_","_"
7,"marditāḥ","_","_","marday","PPP","","_","_"
1,"tasya","_","_","tad","PRD","","_","_"
2,"vīryeṇa","_","_","vīrya","NC","","_","_"
3,"saṃkliṣṭā","_","_","saṃkliś","PPP","","_","_"
4,"nityam","_","_","nitya","CX","","_","_"
5,"eva","_","_","eva","CEM","","_","_"
6,"sutā","_","_","suta","NC","","_","_"
7,"mama","_","_","mat","PPR","","_","_"
1,"sa","_","_","tad","PRD","","_","_"
2,"eva","_","_","eva","CEM","","_","_"
3,"hetur","_","_","hetu","NC","","_","_"
4,"bhedasya","_","_","bheda","NC","","_","_"
5,"bhīmo","_","_","bhīma","NC","","_","_"
6,"_","_","_","bhīma","JJ","","_","_"
7,"_","_","_","parākrama","NC","","_","_"
1,"grasamānam","_","_","gras","KDP","","_","_"
2,"anīkāni","_","_","anīka","NC","","_","_"
3,"_","_","_","nara","NC","","_","_"
4,"_","_","_","vāraṇa","NC","","_","_"
5,"_","_","_","vājin","NC","","_","_"
1,"_","_","_","darś","V","dṛś","_","_"
2,"_","_","_","iva","CCM","","_","_"
3,"_","_","_","agratas","CX","","_","_"
4,"bhīmaṃ","_","_","bhīma","NC","","_","_"
5,"_","_","_","krodha","NC","","_","_"
6,"_","_","_","mūrchay","PPP","","_","_"
7,"āhave","_","_","āhava","NC","","_","_"
1,"astre","_","_","astra","NC","","_","_"
2,"_","_","_","droṇa","NC","","_","_"
3,"_","_","_","arjuna","NC","","_","_"
4,"_","_","_","sama","PPX","","_","_"
5,"_","_","_","vāyu","NC","","_","_"
6,"_","_","_","vega","NC","","_","_"
7,"_","_","_","sama","PPX","","_","_"
8,"jave","_","_","java","NC","","_","_"
1,"_","_","_","saṃjaya","NC","","_","_"
2,"_","_","_","ācakṣ","V","ācakṣ","_","_"
3,"me","_","_","mat","PPR","","_","_"
4,"śūraṃ","_","_","śūra","NC","","_","_"
5,"bhīmasenam","_","_","bhīmasa","NC","","_","_"
6,"amarṣaṇam","_","_","amarṣaṇa","JJ","","_","_"
1,"_","_","_","ati","CADP","","_","_"
2,"_","_","_","lābha","NC","","_","_"
3,"tu","_","_","tu","CCD","","_","_"
4,"manye","_","_","man","V","man","_","_"
5,"'haṃ","_","_","mat","PPR","","_","_"
6,"yat","_","_","yat","CSB","","_","_"
7,"tena","_","_","tad","PRD","","_","_"
8,"_","_","_","ripu","NC","","_","_"
9,"_","_","_","ghātin","JJ","","_","_"
1,"_","_","_","tadā","CAD","","_","_"
2,"_","_","_","eva","CEM","","_","_"
3,"na","_","_","na","CNG","","_","_"
4,"hatāḥ","_","_","han","PPP","","_","_"
5,"sarve","_","_","sarva","JQ","","_","_"
6,"mama","_","_","mat","PPR","","_","_"
7,"putrā","_","_","putra","NC","","_","_"
8,"manasvinā","_","_","manasvin","JJ","","_","_"
1,"yena","_","_","yad","PRL","","_","_"
2,"_","_","_","bhīma","JJ","","_","_"
3,"_","_","_","bala","NC","","_","_"
4,"yakṣā","_","_","yakṣa","NC","","_","_"
5,"_","_","_","rākṣasa","NC","","_","_"
6,"_","_","_","ca","CCD","","_","_"
7,"samāhatāḥ","_","_","samāhan","PPP","","_","_"
1,"kathaṃ","_","_","katha","CX","","_","_"
2,"tasya","_","_","tad","PRD","","_","_"
3,"raṇe","_","_","raṇa","NC","","_","_"
4,"vegaṃ","_","_","vega","NC","","_","_"
5,"mānuṣaḥ","_","_","mānuṣa","NC","","_","_"
6,"prasahiṣyati","_","_","prasah","V","prasah","_","_"
1,"na","_","_","na","CNG","","_","_"
2,"sa","_","_","tad","PRD","","_","_"
3,"jātu","_","_","jātu","CX","","_","_"
4,"vaśe","_","_","vaśa","NC","","_","_"
5,"tasthau","_","_","tiṣṭh","V","sthā","_","_"
6,"mama","_","_","mat","PPR","","_","_"
7,"bālo","_","_","bāla","NC","","_","_"
8,"'pi","_","_","api","CX","","_","_"
9,"saṃjaya","_","_","saṃjaya","NC","","_","_"
1,"kiṃ","_","_","kim","CX","","_","_"
2,"punar","_","_","punar","CAD","","_","_"
3,"mama","_","_","mat","PPR","","_","_"
4,"duṣputraiḥ","_","_","duṣputra","NC","","_","_"
5,"kliṣṭaḥ","_","_","kliś","PPP","","_","_"
6,"saṃprati","_","_","samprati","CX","","_","_"
7,"pāṇḍavaḥ","_","_","pāṇḍava","NC","","_","_"
1,"niṣṭhuraḥ","_","_","niṣṭhura","JJ","","_","_"
2,"sa","_","_","tad","PRD","","_","_"
3,"ca","_","_","ca","CCD","","_","_"
4,"naiṣṭhuryād","_","_","naiṣṭhurya","NC","","_","_"
5,"bhajyed","_","_","bhañj","V","bhañj","_","_"
6,"api","_","_","api","CX","","_","_"
7,"na","_","_","na","CNG","","_","_"
8,"saṃnamet","_","_","saṃna","V","saṃna","_","_"
1,"_","_","_","tiryañc","JJ","","_","_"
2,"_","_","_","prekṣin","JJ","","_","_"
3,"_","_","_","saṃhan","PPP","","_","_"
4,"_","_","_","bhrū","NC","","_","_"
5,"kathaṃ","_","_","katha","CX","","_","_"
6,"śāmyed","_","_","śa","V","śa","_","_"
7,"vṛkodaraḥ","_","_","vṛkodara","NC","","_","_"
1,"_","_","_","bṛhat","JJ","","_","_"
2,"_","_","_","aṃsa","NC","","_","_"
3,"'pratibalo","_","_","apratibala","JJ","","_","_"
4,"_","_","_","gaura","JJ","","_","_"
5,"_","_","_","tāla","NC","","_","_"
6,"_","_","_","iva","CCM","","_","_"
7,"_","_","_","udga","PPP","","_","_"
1,"pramāṇato","_","_","pramāṇa","NC","","_","_"
2,"bhīmasenaḥ","_","_","bhīmasa","NC","","_","_"
3,"_","_","_","prādeśa","NC","","_","_"
4,"_","_","_","adhika","JJ","","_","_"
5,"'rjunāt","_","_","arjuna","NC","","_","_"
1,"javena","_","_","java","NC","","_","_"
2,"vājino","_","_","vājin","NC","","_","_"
3,"'tyeti","_","_","atye","V","atī","_","_"
4,"_","_","_","bala","NC","","_","_"
5,"_","_","_","atye","V","atī","_","_"
6,"kuñjarān","_","_","kuñjara","NC","","_","_"
1,"_","_","_","avyakta","NC","","_","_"
2,"_","_","_","jalpin","JJ","","_","_"
3,"_","_","_","madhu","NC","","_","_"
4,"_","_","_","akṣa","NC","","_","_"
5,"madhyamaḥ","_","_","madhyama","JJ","","_","_"
6,"pāṇḍavo","_","_","pāṇḍava","NC","","_","_"
7,"balī","_","_","balin","JJ","","_","_"
1,"iti","_","_","iti","CQT","","_","_"
2,"bālye","_","_","bālya","NC","","_","_"
3,"śrutaḥ","_","_","śru","PPP","","_","_"
4,"pūrvaṃ","_","_","pūrva","CX","","_","_"
5,"mayā","_","_","mat","PPR","","_","_"
6,"_","_","_","vyāsa","NC","","_","_"
7,"_","_","_","mukha","NC","","_","_"
8,"purā","_","_","purā","CX","","_","_"
1,"rūpato","_","_","rūpa","NC","","_","_"
2,"_","_","_","vīrya","NC","","_","_"
3,"_","_","_","ca","CCD","","_","_"
4,"_","_","_","eva","CEM","","_","_"
5,"yāthātathyena","_","_","yāthātathya","NC","","_","_"
6,"pāṇḍavaḥ","_","_","pāṇḍava","NC","","_","_"
1,"āyasena","_","_","āyasa","JJ","","_","_"
2,"sa","_","_","tad","PRD","","_","_"
3,"daṇḍena","_","_","daṇḍa","NC","","_","_"
4,"_","_","_","ratha","NC","","_","_"
5,"_","_","_","nāga","NC","","_","_"
6,"_","_","_","haya","NC","","_","_"
7,"_","_","_","nara","NC","","_","_"
1,"haniṣyati","_","_","han","V","han","_","_"
2,"raṇe","_","_","raṇa","NC","","_","_"
3,"kruddho","_","_","krudh","PPP","","_","_"
4,"bhīmaḥ","_","_","bhīma","NC","","_","_"
5,"praharatāṃ","_","_","prahṛ","KDP","","_","_"
6,"varaḥ","_","_","vara","JJ","","_","_"
1,"amarṣī","_","_","amarṣin","JJ","","_","_"
2,"_","_","_","nitya","JJ","","_","_"
3,"_","_","_","saṃrabh","PPP","","_","_"
4,"raudraḥ","_","_","raudra","JJ","","_","_"
5,"_","_","_","krūra","JJ","","_","_"
6,"_","_","_","parākrama","NC","","_","_"
1,"mama","_","_","mat","PPR","","_","_"
2,"tāta","_","_","tāta","NC","","_","_"
3,"pratīpāni","_","_","pratīpa","JJ","","_","_"
4,"kurvan","_","_","kṛ","KDP","","_","_"
5,"pūrvaṃ","_","_","pūrva","CX","","_","_"
6,"vimānitaḥ","_","_","vimānay","PPP","","_","_"
1,"niṣkīrṇām","_","_","niṣkṝ","PPP","","_","_"
2,"āyasīṃ","_","_","āyasa","JJ","","_","_"
3,"sthūlāṃ","_","_","sthūla","JJ","","_","_"
4,"_","_","_","su","CAD","","_","_"
5,"_","_","_","parva","NC","","_","_"
6,"kāñcanīṃ","_","_","kāñcana","JJ","","_","_"
7,"gadām","_","_","gadā","NC","","_","_"
1,"śataghnīṃ","_","_","śataghnī","NC","","_","_"
2,"_","_","_","śata","NUM","","_","_"
3,"_","_","_","nirhrāda","NC","","_","_"
4,"kathaṃ","_","_","katha","CX","","_","_"
5,"śakṣyanti","_","_","śakn","V","śak","_","_"
6,"me","_","_","mat","PPR","","_","_"
7,"sutāḥ","_","_","suta","NC","","_","_"
1,"apāram","_","_","apāra","JJ","","_","_"
2,"_","_","_","aplava","JJ","","_","_"
3,"_","_","_","agādha","JJ","","_","_"
4,"samudraṃ","_","_","samudra","NC","","_","_"
5,"_","_","_","śara","NC","","_","_"
6,"_","_","_","vegin","JJ","","_","_"
1,"_","_","_","bhīmasa","NC","","_","_"
2,"_","_","_","maya","JJ","","_","_"
3,"durgaṃ","_","_","durga","JJ","","_","_"
4,"tāta","_","_","tāta","NC","","_","_"
5,"_","_","_","manda","JJ","","_","_"
6,"_","_","_","titīrṣu","JJ","","_","_"
1,"krośato","_","_","kruś","KDP","","_","_"
2,"me","_","_","mat","PPR","","_","_"
3,"na","_","_","na","CNG","","_","_"
4,"śṛṇvanti","_","_","śṛṇ","V","śru","_","_"
5,"bālāḥ","_","_","bāla","NC","","_","_"
6,"_","_","_","paṇḍita","NC","","_","_"
7,"_","_","_","mānin","JJ","","_","_"
1,"viṣamaṃ","_","_","viṣama","JJ","","_","_"
2,"_","_","_","na","CNG","","_","_"
3,"_","_","_","avabodh","V","avabudh","_","_"
4,"prapātaṃ","_","_","prapāta","NC","","_","_"
5,"_","_","_","madhu","NC","","_","_"
6,"_","_","_","darśin","JJ","","_","_"
1,"saṃyugaṃ","_","_","saṃyuga","NC","","_","_"
2,"ye","_","_","yad","PRL","","_","_"
3,"kariṣyanti","_","_","kar","V","kṛ","_","_"
4,"_","_","_","nara","NC","","_","_"
5,"_","_","_","rūpa","NC","","_","_"
6,"vāyunā","_","_","vāyu","NC","","_","_"
1,"niyataṃ","_","_","niyata","CX","","_","_"
2,"coditā","_","_","coday","PPP","","_","_"
3,"dhātrā","_","_","dhātṛ","NC","","_","_"
4,"_","_","_","siṃha","NC","","_","_"
5,"_","_","_","iva","CCM","","_","_"
6,"_","_","_","mahat","JJ","","_","_"
7,"_","_","_","mṛga","NC","","_","_"
1,"śaikyāṃ","_","_","śaikya","JJ","","_","_"
2,"tāta","_","_","tāta","NC","","_","_"
3,"catuṣkiṣkuṃ","_","_","catuṣkiṣku","JJ","","_","_"
4,"_","_","_","ṣaṣ","NUM","","_","_"
5,"_","_","_","asra","NC","","_","_"
6,"_","_","_","amita","JJ","","_","_"
7,"_","_","_","ojas","NC","","_","_"
1,"prahitāṃ","_","_","prahi","PPP","","_","_"
2,"_","_","_","duḥkha","JJ","","_","_"
3,"_","_","_","saṃsparśa","NC","","_","_"
4,"kathaṃ","_","_","katha","CX","","_","_"
5,"śakṣyanti","_","_","śakn","V","śak","_","_"
6,"me","_","_","mat","PPR","","_","_"
7,"sutāḥ","_","_","suta","NC","","_","_"
1,"gadāṃ","_","_","gadā","NC","","_","_"
2,"_","_","_","bhrāmay","KDP","","_","_"
3,"_","_","_","tad","PRD","","_","_"
4,"bhindato","_","_","bhid","KDP","","_","_"
5,"_","_","_","hastin","NC","","_","_"
6,"_","_","_","mastaka","NC","","_","_"
1,"lelihānasya","_","_","lelih","KDP","","_","_"
2,"bāṣpam","_","_","bāṣpa","NC","","_","_"
3,"utsṛjato","_","_","utsṛj","KDP","","_","_"
4,"muhuḥ","_","_","muhur","CX","","_","_"
1,"uddiśya","_","_","uddiś","CGDA","","_","_"
2,"pātān","_","_","pāta","NC","","_","_"
3,"patataḥ","_","_","pat","KDP","","_","_"
4,"kurvato","_","_","kṛ","KDP","","_","_"
5,"bhairavān","_","_","bhairava","JJ","","_","_"
6,"ravān","_","_","rava","NC","","_","_"
1,"pratīpān","_","_","pratīpa","NC","","_","_"
2,"patato","_","_","pat","KDP","","_","_"
3,"mattān","_","_","mat","PPP","","_","_"
4,"kuñjarān","_","_","kuñjara","NC","","_","_"
5,"pratigarjataḥ","_","_","pratigarj","KDP","","_","_"
1,"vigāhya","_","_","vigāh","CGDA","","_","_"
2,"_","_","_","ratha","NC","","_","_"
3,"_","_","_","mārga","NC","","_","_"
4,"varān","_","_","vara","JJ","","_","_"
5,"uddiśya","_","_","uddiś","CGDA","","_","_"
6,"nighnataḥ","_","_","nihan","KDP","","_","_"
1,"agneḥ","_","_","agni","NC","","_","_"
2,"_","_","_","prajval","PPP","","_","_"
3,"_","_","_","iva","CCM","","_","_"
4,"api","_","_","api","CX","","_","_"
5,"mucyeta","_","_","muñc","V","muc","_","_"
6,"me","_","_","mat","PPR","","_","_"
7,"prajā","_","_","prajā","NC","","_","_"
1,"vīthīṃ","_","_","vīthi","NC","","_","_"
2,"_","_","_","kṛ","KDP","","_","_"
3,"_","_","_","mahat","JJ","","_","_"
4,"_","_","_","bāhu","NC","","_","_"
5,"_","_","_","drāvay","KDP","","_","_"
6,"_","_","_","mat","PPR","","_","_"
7,"vāhinīm","_","_","vāhinī","NC","","_","_"
1,"nṛtyann","_","_","nṛt","KDP","","_","_"
2,"iva","_","_","iva","CCM","","_","_"
3,"_","_","_","gadā","NC","","_","_"
4,"_","_","_","pāṇi","NC","","_","_"
5,"_","_","_","yuga","NC","","_","_"
6,"_","_","_","anta","NC","","_","_"
7,"darśayiṣyati","_","_","darś","V","dṛś","_","_"
1,"prabhinna","_","_","prabhid","PPP","","_","_"
2,"iva","_","_","iva","CCM","","_","_"
3,"mātaṅgaḥ","_","_","mātaṃga","NC","","_","_"
4,"prabhañjan","_","_","prabhañj","KDP","","_","_"
5,"puṣpitān","_","_","puṣpita","JJ","","_","_"
6,"drumān","_","_","druma","NC","","_","_"
1,"pravekṣyati","_","_","praviś","V","praviś","_","_"
2,"raṇe","_","_","raṇa","NC","","_","_"
3,"senāṃ","_","_","senā","NC","","_","_"
4,"putrāṇāṃ","_","_","putra","NC","","_","_"
5,"me","_","_","mat","PPR","","_","_"
6,"vṛkodaraḥ","_","_","vṛkodara","NC","","_","_"
1,"kurvan","_","_","kṛ","KDP","","_","_"
2,"rathān","_","_","ratha","NC","","_","_"
3,"vipuruṣān","_","_","vipuruṣa","JJ","","_","_"
4,"vidhvajān","_","_","vidhvaja","JJ","","_","_"
5,"_","_","_","bhañj","PPP","","_","_"
6,"_","_","_","puṣkara","NC","","_","_"
1,"ārujan","_","_","āruj","KDP","","_","_"
2,"_","_","_","puruṣa","NC","","_","_"
3,"_","_","_","vyāghra","NC","","_","_"
4,"rathinaḥ","_","_","rathin","NC","","_","_"
5,"_","_","_","sādin","NC","","_","_"
6,"_","_","_","tathā","CX","","_","_"
1,"_","_","_","gaṅgā","NC","","_","_"
2,"_","_","_","vega","NC","","_","_"
3,"_","_","_","iva","CCM","","_","_"
4,"_","_","_","ānūpa","JJ","","_","_"
5,"_","_","_","tīra","NC","","_","_"
6,"_","_","_","ja","JJ","","_","_"
7,"vividhān","_","_","vividha","JJ","","_","_"
8,"drumān","_","_","druma","NC","","_","_"
1,"pravekṣyati","_","_","praviś","V","praviś","_","_"
2,"_","_","_","mahat","JJ","","_","_"
3,"_","_","_","senā","NC","","_","_"
4,"putrāṇāṃ","_","_","putra","NC","","_","_"
5,"mama","_","_","mat","PPR","","_","_"
6,"saṃjaya","_","_","saṃjaya","NC","","_","_"
1,"vaśaṃ","_","_","vaśa","NC","","_","_"
2,"nūnaṃ","_","_","nūna","CX","","_","_"
3,"gamiṣyanti","_","_","gacch","V","gam","_","_"
4,"_","_","_","bhīmasa","NC","","_","_"
5,"_","_","_","bala","NC","","_","_"
6,"_","_","_","arday","PPP","","_","_"
1,"mama","_","_","mat","PPR","","_","_"
2,"_","_","_","putra","NC","","_","_"
3,"_","_","_","ca","CCD","","_","_"
4,"_","_","_","bhṛtya","NC","","_","_"
5,"_","_","_","ca","CCD","","_","_"
6,"_","_","_","rājan","NC","","_","_"
7,"_","_","_","ca","CCD","","_","_"
8,"_","_","_","eva","CEM","","_","_"
9,"saṃjaya","_","_","saṃjaya","NC","","_","_"
1,"yena","_","_","yad","PRL","","_","_"
2,"rājā","_","_","rājan","NC","","_","_"
3,"_","_","_","mahat","JJ","","_","_"
4,"_","_","_","vīrya","NC","","_","_"
5,"_","_","_","praviś","CGDA","","_","_"
6,"_","_","_","antaḥpura","NC","","_","_"
7,"purā","_","_","purā","CX","","_","_"
1,"_","_","_","vāsudeva","NC","","_","_"
2,"_","_","_","sahāya","NC","","_","_"
3,"jarāsaṃdho","_","_","jarāsaṃdha","NC","","_","_"
4,"nipātitaḥ","_","_","nipātay","PPP","","_","_"
1,"_","_","_","kṛtsna","JJ","","_","_"
2,"_","_","_","ida","PRD","","_","_"
3,"pṛthivī","_","_","pṛthivī","NC","","_","_"
4,"devī","_","_","devī","NC","","_","_"
5,"jarāsaṃdhena","_","_","jarāsaṃdha","NC","","_","_"
6,"dhīmatā","_","_","dhīmat","JJ","","_","_"
1,"_","_","_","māgadha","NC","","_","_"
2,"_","_","_","indra","NC","","_","_"
3,"balinā","_","_","balin","JJ","","_","_"
4,"vaśe","_","_","vaśa","NC","","_","_"
5,"kṛtvā","_","_","kṛ","CGDA","","_","_"
6,"pratāpitā","_","_","pratāpay","PPP","","_","_"
1,"_","_","_","bhīṣma","NC","","_","_"
2,"_","_","_","pratāpa","NC","","_","_"
3,"kuravo","_","_","kuru","NC","","_","_"
4,"_","_","_","naya","NC","","_","_"
5,"_","_","_","andhaka","NC","","_","_"
6,"_","_","_","vṛṣṇi","NC","","_","_"
1,"te","_","_","tad","PRD","","_","_"
2,"na","_","_","na","CNG","","_","_"
3,"tasya","_","_","tad","PRD","","_","_"
4,"vaśaṃ","_","_","vaśa","NC","","_","_"
5,"jagmuḥ","_","_","ga","V","ga","_","_"
6,"kevalaṃ","_","_","kevala","JJ","","_","_"
7,"daivam","_","_","daiva","NC","","_","_"
8,"eva","_","_","eva","CEM","","_","_"
9,"vā","_","_","vā","CCD","","_","_"
1,"sa","_","_","tad","PRD","","_","_"
2,"gatvā","_","_","ga","CGDA","","_","_"
3,"_","_","_","pāṇḍu","NC","","_","_"
4,"_","_","_","putra","NC","","_","_"
5,"tarasā","_","_","taras","NC","","_","_"
6,"_","_","_","bāhu","NC","","_","_"
7,"_","_","_","śālin","JJ","","_","_"
1,"anāyudhena","_","_","anāyudha","JJ","","_","_"
2,"vīreṇa","_","_","vīra","NC","","_","_"
3,"nihataḥ","_","_","nihan","PPP","","_","_"
4,"kiṃ","_","_","kim","CX","","_","_"
5,"tato","_","_","tatas","CX","","_","_"
6,"'dhikam","_","_","adhika","JJ","","_","_"
1,"_","_","_","dīrgha","JJ","","_","_"
2,"_","_","_","kāla","NC","","_","_"
3,"saṃsiktaṃ","_","_","saṃsic","PPP","","_","_"
4,"viṣam","_","_","viṣa","NC","","_","_"
5,"āśīviṣo","_","_","āśīviṣa","NC","","_","_"
6,"yathā","_","_","yathā","CCM","","_","_"
1,"sa","_","_","tad","PRD","","_","_"
2,"mokṣyati","_","_","muñc","V","muc","_","_"
3,"raṇe","_","_","raṇa","NC","","_","_"
4,"tejaḥ","_","_","tejas","NC","","_","_"
5,"putreṣu","_","_","putra","NC","","_","_"
6,"mama","_","_","mat","PPR","","_","_"
7,"saṃjaya","_","_","saṃjaya","NC","","_","_"
1,"_","_","_","mahat","JJ","","_","_"
2,"_","_","_","indra","NC","","_","_"
3,"iva","_","_","iva","CCM","","_","_"
4,"vajreṇa","_","_","vajra","NC","","_","_"
5,"dānavān","_","_","dānava","NC","","_","_"
6,"_","_","_","deva","NC","","_","_"
7,"_","_","_","sattama","JJ","","_","_"
1,"bhīmaseno","_","_","bhīmasa","NC","","_","_"
2,"_","_","_","gadā","NC","","_","_"
3,"_","_","_","pāṇi","NC","","_","_"
4,"sūdayiṣyati","_","_","sūday","V","sūday","_","_"
5,"me","_","_","mat","PPR","","_","_"
6,"sutān","_","_","suta","NC","","_","_"
1,"aviṣahyam","_","_","aviṣahya","JJ","","_","_"
2,"anāvāryaṃ","_","_","anāvārya","JJ","","_","_"
3,"_","_","_","tīvra","JJ","","_","_"
4,"_","_","_","vega","NC","","_","_"
5,"_","_","_","parākrama","NC","","_","_"
1,"_","_","_","darś","V","dṛś","_","_"
2,"_","_","_","iva","CCM","","_","_"
3,"_","_","_","ati","CADP","","_","_"
4,"_","_","_","tāmra","JJ","","_","_"
5,"_","_","_","akṣa","NC","","_","_"
6,"āpatantaṃ","_","_","āpat","KDP","","_","_"
7,"vṛkodaram","_","_","vṛkodara","NC","","_","_"
1,"virathasya","_","_","viratha","JJ","","_","_"
2,"vivarmaṇaḥ","_","_","vivarman","JJ","","_","_"
1,"bāhubhyāṃ","_","_","bāhu","NC","","_","_"
2,"yudhyamānasya","_","_","yudh","KDP","","_","_"
3,"_","_","_","kiṃ","PRQ","","_","_"
4,"_","_","_","tiṣṭh","V","sthā","_","_"
5,"agrataḥ","_","_","agratas","CX","","_","_"
6,"pumān","_","_","puṃs","NC","","_","_"
1,"bhīṣmo","_","_","bhīṣma","NC","","_","_"
2,"_","_","_","droṇa","NC","","_","_"
3,"_","_","_","ca","CCD","","_","_"
4,"vipro","_","_","vipra","NC","","_","_"
5,"'yaṃ","_","_","ida","PRD","","_","_"
6,"kṛpaḥ","_","_","kṛpa","NC","","_","_"
7,"_","_","_","śāradvata","NC","","_","_"
8,"_","_","_","tathā","CX","","_","_"
1,"_","_","_","jān","V","jñā","_","_"
2,"_","_","_","tad","PRD","","_","_"
3,"_","_","_","yathā","CCM","","_","_"
4,"_","_","_","eva","CEM","","_","_"
5,"_","_","_","mat","PPR","","_","_"
6,"_","_","_","vīrya","NC","","_","_"
7,"_","_","_","jña","JJ","","_","_"
8,"_","_","_","tad","PRD","","_","_"
9,"dhīmataḥ","_","_","dhīmat","JJ","","_","_"
1,"_","_","_","ārya","JJ","","_","_"
2,"_","_","_","vrata","NC","","_","_"
3,"tu","_","_","tu","CCD","","_","_"
4,"jānantaḥ","_","_","jñā","KDP","","_","_"
5,"_","_","_","saṃgara","NC","","_","_"
6,"_","_","_","na","CNG","","_","_"
7,"bibhitsavaḥ","_","_","bibhitsu","JJ","","_","_"
1,"_","_","_","senā","NC","","_","_"
2,"_","_","_","mukha","NC","","_","_"
3,"sthāsyanti","_","_","tiṣṭh","V","sthā","_","_"
4,"māmakānāṃ","_","_","māmaka","JJ","","_","_"
5,"_","_","_","nara","NC","","_","_"
6,"_","_","_","ṛṣabha","NC","","_","_"
1,"balīyaḥ","_","_","balīyas","JJ","","_","_"
2,"sarvato","_","_","sarvatas","CX","","_","_"
3,"diṣṭaṃ","_","_","diṣṭa","NC","","_","_"
4,"puruṣasya","_","_","puruṣa","NC","","_","_"
5,"viśeṣataḥ","_","_","viśeṣataḥ","CX","","_","_"
1,"paśyann","_","_","dṛś","KDP","","_","_"
2,"api","_","_","api","CX","","_","_"
3,"jayaṃ","_","_","jaya","NC","","_","_"
4,"teṣāṃ","_","_","tad","PRD","","_","_"
5,"na","_","_","na","CNG","","_","_"
6,"niyacchāmi","_","_","niya","V","niya","_","_"
7,"yat","_","_","yat","CSB","","_","_"
8,"sutān","_","_","suta","NC","","_","_"
1,"te","_","_","tad","PRD","","_","_"
2,"purāṇaṃ","_","_","purāṇa","JJ","","_","_"
3,"_","_","_","mahat","JJ","","_","_"
4,"_","_","_","iṣvāsa","NC","","_","_"
5,"mārgam","_","_","mārga","NC","","_","_"
6,"aindraṃ","_","_","aindra","JJ","","_","_"
7,"samāsthitāḥ","_","_","samāsthā","PPP","","_","_"
1,"tyakṣyanti","_","_","tyaj","V","tyaj","_","_"
2,"tumule","_","_","tumula","NC","","_","_"
3,"prāṇān","_","_","prāṇa","NC","","_","_"
4,"rakṣantaḥ","_","_","rakṣ","KDP","","_","_"
5,"pārthivaṃ","_","_","pārthiva","JJ","","_","_"
6,"yaśaḥ","_","_","yaśas","NC","","_","_"
1,"_","_","_","yathā","CCM","","_","_"
2,"_","_","_","ida","PRD","","_","_"
3,"_","_","_","māmaka","JJ","","_","_"
4,"_","_","_","tāta","NC","","_","_"
5,"_","_","_","tathā","CX","","_","_"
6,"_","_","_","ida","PRD","","_","_"
7,"pāṇḍavā","_","_","pāṇḍava","NC","","_","_"
8,"api","_","_","api","CX","","_","_"
1,"pautrā","_","_","pautra","NC","","_","_"
2,"bhīṣmasya","_","_","bhīṣma","NC","","_","_"
3,"_","_","_","śiṣya","NC","","_","_"
4,"_","_","_","ca","CCD","","_","_"
5,"droṇasya","_","_","droṇa","NC","","_","_"
6,"ca","_","_","ca","CCD","","_","_"
7,"kṛpasya","_","_","kṛpa","NC","","_","_"
8,"ca","_","_","ca","CCD","","_","_"
1,"yat","_","_","yad","PRL","","_","_"
2,"_","_","_","tu","CCD","","_","_"
3,"_","_","_","mat","PPR","","_","_"
4,"āśrayaṃ","_","_","āśraya","NC","","_","_"
5,"kiṃcid","_","_","kiṃcit","PRI","","_","_"
6,"dattam","_","_","dā","PPP","","_","_"
7,"iṣṭaṃ","_","_","iṣ","PPP","","_","_"
8,"ca","_","_","ca","CCD","","_","_"
9,"saṃjaya","_","_","saṃjaya","NC","","_","_"
1,"_","_","_","tad","PRD","","_","_"
2,"_","_","_","apaciti","NC","","_","_"
3,"_","_","_","ārya","JJ","","_","_"
5,"kartāraḥ","_","_","kar","V","kṛ","_","_"
6,"_","_","_","sthavira","JJ","","_","_"
7,"_","_","_","tri","NUM","","_","_"
1,"ādadānasya","_","_","ādā","KDP","","_","_"
2,"śastraṃ","_","_","śastra","NC","","_","_"
3,"hi","_","_","hi","CX","","_","_"
4,"_","_","_","kṣatra","NC","","_","_"
5,"_","_","_","dharma","NC","","_","_"
6,"parīpsataḥ","_","_","parīps","KDP","","_","_"
1,"nidhanaṃ","_","_","nidhana","NC","","_","_"
2,"_","_","_","brāhmaṇa","NC","","_","_"
3,"_","_","_","āji","NC","","_","_"
4,"varam","_","_","vara","NC","","_","_"
5,"_","_","_","eva","CEM","","_","_"
6,"_","_","_","ah","V","ah","_","_"
7,"uttamam","_","_","uttama","JJ","","_","_"
1,"sa","_","_","tad","PRD","","_","_"
2,"vai","_","_","vai","CX","","_","_"
3,"śocāmi","_","_","śuc","V","śuc","_","_"
4,"sarvān","_","_","sarva","JQ","","_","_"
5,"vai","_","_","vai","CX","","_","_"
6,"ye","_","_","yad","PRL","","_","_"
7,"yuyutsanti","_","_","yuyuts","V","yuyuts","_","_"
8,"pāṇḍavān","_","_","pāṇḍava","NC","","_","_"
1,"vikruṣṭaṃ","_","_","vikruś","PPP","","_","_"
2,"_","_","_","vidura","NC","","_","_"
3,"_","_","_","ādau","CX","","_","_"
4,"tad","_","_","tad","PRD","","_","_"
5,"etad","_","_","tad","PRD","","_","_"
6,"bhayam","_","_","bhaya","NC","","_","_"
7,"āgatam","_","_","āga","PPP","","_","_"
1,"na","_","_","na","CNG","","_","_"
2,"tu","_","_","tu","CCD","","_","_"
3,"manye","_","_","man","V","man","_","_"
4,"vighātāya","_","_","vighāta","NC","","_","_"
5,"jñānaṃ","_","_","jñāna","NC","","_","_"
6,"duḥkhasya","_","_","duḥkha","NC","","_","_"
7,"saṃjaya","_","_","saṃjaya","NC","","_","_"
1,"_","_","_","bhav","V","bhū","_","_"
2,"_","_","_","ati","CADP","","_","_"
3,"_","_","_","bala","NC","","_","_"
4,"_","_","_","hi","CX","","_","_"
5,"_","_","_","tad","PRD","","_","_"
6,"_","_","_","jñāna","NC","","_","_"
7,"_","_","_","api","CX","","_","_"
8,"_","_","_","upaghātaka","JJ","","_","_"
1,"ṛṣayo","_","_","ṛṣi","NC","","_","_"
2,"_","_","_","hi","CX","","_","_"
3,"_","_","_","api","CX","","_","_"
4,"nirmuktāḥ","_","_","nirmuc","PPP","","_","_"
5,"paśyanto","_","_","dṛś","KDP","","_","_"
6,"_","_","_","loka","NC","","_","_"
7,"_","_","_","saṃgraha","NC","","_","_"
1,"sukhe","_","_","sukha","NC","","_","_"
2,"bhavanti","_","_","bhav","V","bhū","_","_"
3,"_","_","_","sukhin","JJ","","_","_"
4,"_","_","_","tathā","CX","","_","_"
5,"duḥkhena","_","_","duḥkha","NC","","_","_"
6,"duḥkhitāḥ","_","_","duḥkhita","JJ","","_","_"
1,"kiṃ","_","_","kim","CX","","_","_"
2,"punar","_","_","punar","CAD","","_","_"
3,"yo","_","_","yad","PRL","","_","_"
4,"'ham","_","_","mat","PPR","","_","_"
5,"_","_","_","āsañj","PPP","","_","_"
6,"_","_","_","tatra","CAD","","_","_"
7,"tatra","_","_","tatra","CAD","","_","_"
8,"sahasradhā","_","_","sahasradhā","CX","","_","_"
1,"putreṣu","_","_","putra","NC","","_","_"
2,"_","_","_","rājya","NC","","_","_"
3,"_","_","_","dāra","NC","","_","_"
4,"_","_","_","pautra","NC","","_","_"
5,"_","_","_","api","CX","","_","_"
6,"ca","_","_","ca","CCD","","_","_"
7,"bandhuṣu","_","_","bandhu","NC","","_","_"
1,"saṃśaye","_","_","saṃśaya","NC","","_","_"
2,"tu","_","_","tu","CCD","","_","_"
3,"_","_","_","mahat","JJ","","_","_"
4,"_","_","_","ida","PRD","","_","_"
5,"kiṃ","_","_","kiṃ","PRQ","","_","_"
6,"nu","_","_","nu","CX","","_","_"
7,"me","_","_","mat","PPR","","_","_"
8,"kṣamam","_","_","kṣama","JJ","","_","_"
9,"uttamam","_","_","uttama","JJ","","_","_"
1,"vināśaṃ","_","_","vināśa","NC","","_","_"
2,"_","_","_","hi","CX","","_","_"
3,"_","_","_","eva","CEM","","_","_"
4,"paśyāmi","_","_","paś","V","paś","_","_"
5,"kurūṇām","_","_","kuru","NC","","_","_"
6,"anucintayan","_","_","anucintay","KDP","","_","_"
1,"_","_","_","dyūta","NC","","_","_"
2,"_","_","_","pramukha","JJ","","_","_"
3,"ābhāti","_","_","ābhā","V","ābhā","_","_"
4,"kurūṇāṃ","_","_","kuru","NC","","_","_"
5,"vyasanaṃ","_","_","vyasana","NC","","_","_"
6,"mahat","_","_","mahat","JJ","","_","_"
1,"_","_","_","manda","JJ","","_","_"
2,"_","_","_","aiśvarya","NC","","_","_"
3,"_","_","_","kāma","NC","","_","_"
4,"lobhāt","_","_","lobha","NC","","_","_"
5,"pāpam","_","_","pāpa","NC","","_","_"
6,"idaṃ","_","_","ida","PRD","","_","_"
7,"kṛtam","_","_","kṛ","PPP","","_","_"
1,"manye","_","_","man","V","man","_","_"
2,"_","_","_","paryāya","NC","","_","_"
3,"_","_","_","dharma","NC","","_","_"
4,"'yaṃ","_","_","ida","PRD","","_","_"
5,"_","_","_","kāla","NC","","_","_"
6,"_","_","_","atyanta","JJ","","_","_"
7,"_","_","_","gāmin","JJ","","_","_"
1,"cakre","_","_","cakra","NC","","_","_"
2,"pradhir","_","_","pradhi","NC","","_","_"
3,"_","_","_","iva","CCM","","_","_"
4,"_","_","_","āsañj","PPP","","_","_"
5,"_","_","_","na","CNG","","_","_"
6,"_","_","_","ida","PRD","","_","_"
7,"śakyaṃ","_","_","śakya","JJ","","_","_"
8,"palāyitum","_","_","palāy","CGDI","","_","_"
1,"kiṃ","_","_","kiṃ","PRQ","","_","_"
2,"nu","_","_","nu","CX","","_","_"
3,"kāryaṃ","_","_","kṛ","KDG","","_","_"
4,"kathaṃ","_","_","katha","CX","","_","_"
5,"kuryāṃ","_","_","kar","V","kṛ","_","_"
6,"kva","_","_","kva","CX","","_","_"
7,"nu","_","_","nu","CX","","_","_"
8,"gacchāmi","_","_","gacch","V","gam","_","_"
9,"saṃjaya","_","_","saṃjaya","NC","","_","_"
1,"ete","_","_","tad","PRD","","_","_"
2,"naśyanti","_","_","naś","V","naś","_","_"
3,"kuravo","_","_","kuru","NC","","_","_"
4,"mandāḥ","_","_","manda","JJ","","_","_"
5,"_","_","_","kāla","NC","","_","_"
6,"_","_","_","vaśa","NC","","_","_"
7,"gatāḥ","_","_","ga","PPP","","_","_"
1,"avaśo","_","_","avaśa","JJ","","_","_"
2,"'haṃ","_","_","mat","PPR","","_","_"
3,"purā","_","_","purā","CX","","_","_"
4,"tāta","_","_","tāta","NC","","_","_"
5,"putrāṇāṃ","_","_","putra","NC","","_","_"
6,"nihate","_","_","nihan","PPP","","_","_"
7,"śate","_","_","śata","NUM","","_","_"
1,"śroṣyāmi","_","_","śṛṇ","V","śru","_","_"
2,"ninadaṃ","_","_","ninada","NC","","_","_"
3,"strīṇāṃ","_","_","strī","NC","","_","_"
4,"kathaṃ","_","_","katha","CX","","_","_"
5,"māṃ","_","_","mat","PPR","","_","_"
6,"maraṇaṃ","_","_","maraṇa","NC","","_","_"
7,"spṛśet","_","_","spṛś","V","spṛś","_","_"
1,"yathā","_","_","yathā","CCM","","_","_"
2,"nidāghe","_","_","nidāgha","NC","","_","_"
3,"jvalanaḥ","_","_","jvalana","NC","","_","_"
4,"samiddho","_","_","samindh","PPP","","_","_"
5,"dahet","_","_","dah","V","dah","_","_"
6,"kakṣaṃ","_","_","kakṣa","NC","","_","_"
7,"vāyunā","_","_","vāyu","NC","","_","_"
8,"codyamānaḥ","_","_","coday","KDP","","_","_"
1,"_","_","_","gadā","NC","","_","_"
2,"_","_","_","hasta","NC","","_","_"
3,"_","_","_","pāṇḍava","NC","","_","_"
4,"_","_","_","tadvat","CX","","_","_"
5,"eva","_","_","eva","CEM","","_","_"
6,"hantā","_","_","han","V","han","_","_"
7,"madīyān","_","_","madīya","JJ","","_","_"
8,"sahito","_","_","sahita","JJ","","_","_"
9,"'rjunena","_","_","arjuna","NC","","_","_"
