"WordID","word","NormSTEM","suffix","lemma","PoS","Root","NormSuffix","NormWord"
1,"upanayanaṃ","_","_","upanayana","NC","","_","_"
2,"vyākhyāsyāmaḥ","_","_","vyākhyās","V","vyākhyā","_","_"
1,"sa","_","_","tad","PRD","","_","_"
2,"_","_","_","purastāt","CX","","_","_"
3,"_","_","_","eva","CEM","","_","_"
4,"_","_","_","sambhāra","NC","","_","_"
5,"_","_","_","upakalpay","V","upakalpay","_","_"
6,"_","_","_","pālāśa","JJ","","_","_"
7,"_","_","_","idhma","NC","","_","_"
8,"_","_","_","khādira","JJ","","_","_"
9,"_","_","_","audumbara","JJ","","_","_"
10,"vaikaṅkataṃ","_","_","vaikaṅkata","JJ","","_","_"
11,"_","_","_","vā","CCD","","_","_"
12,"_","_","_","tad","PRD","","_","_"
13,"_","_","_","vṛkṣīya","JJ","","_","_"
14,"eva","_","_","eva","CEM","","_","_"
15,"darvīṃ","_","_","darvī","NC","","_","_"
16,"karoti","_","_","kar","V","kṛ","_","_"
17,"_","_","_","tvac","CX","","_","_"
18,"_","_","_","bila","NC","","_","_"
19,"_","_","_","mūla","NC","","_","_"
20,"_","_","_","daṇḍa","NC","","_","_"
21,"_","_","_","aratni","NC","","_","_"
22,"_","_","_","catur","NUM","","_","_"
23,"_","_","_","aṅgula","NC","","_","_"
24,"bilaṃ","_","_","bila","NC","","_","_"
25,"karoti","_","_","kar","V","kṛ","_","_"
1,"_","_","_","sāday","V","sāday","_","_"
2,"_","_","_","ācārika","NC","","_","_"
3,"_","_","_","karman","NC","","_","_"
4,"_","_","_","iti","CQT","","_","_"
5,"vijñāyate","_","_","vijān","V","vijñā","_","_"
1,"_","_","_","garbha","NC","","_","_"
2,"_","_","_","aṣṭama","JJ","","_","_"
3,"_","_","_","brāhmaṇa","NC","","_","_"
4,"_","_","_","upanay","V","upanī","_","_"
5,"_","_","_","garbha","NC","","_","_"
6,"_","_","_","ekādaśa","JJ","","_","_"
7,"rājanyaṃ","_","_","rājanya","NC","","_","_"
8,"_","_","_","garbha","NC","","_","_"
9,"_","_","_","dvādaśa","JJ","","_","_"
10,"vaiśyaṃ","_","_","vaiśya","NC","","_","_"
11,"_","_","_","garbha","NC","","_","_"
12,"_","_","_","navama","JJ","","_","_"
13,"_","_","_","brāhmaṇa","NC","","_","_"
14,"_","_","_","iti","CQT","","_","_"
15,"_","_","_","apara","PPX","","_","_"
16,"vāsāṃsi","_","_","vāsas","NC","","_","_"
17,"_","_","_","samāmnā","V","samāmnā","_","_"
18,"_","_","_","aiṇeya","JJ","","_","_"
19,"brāhmaṇo","_","_","brāhmaṇa","NC","","_","_"
20,"vasīta","_","_","vas","V","vas","_","_"
21,"rauravaṃ","_","_","raurava","JJ","","_","_"
22,"rājanyo","_","_","rājanya","NC","","_","_"
23,"_","_","_","basta","NC","","_","_"
24,"_","_","_","ajina","NC","","_","_"
25,"vaiśyo","_","_","vaiśya","NC","","_","_"
26,"_","_","_","yad","PRL","","_","_"
27,"_","_","_","ajina","NC","","_","_"
28,"dhārayed","_","_","dhar","V","dhṛ","_","_"
29,"_","_","_","dhāray","V","dhāray","_","_"
30,"_","_","_","kṣatra","NC","","_","_"
31,"_","_","_","vardhay","V","vardhay","_","_"
32,"_","_","_","ubhaya","JJ","","_","_"
33,"_","_","_","dhṛ","KDG","","_","_"
34,"_","_","_","ubhaya","JJ","","_","_"
35,"_","_","_","vṛddhi","NC","","_","_"
36,"dhāryamubhayorvṛddhyā","_","_","iti","CQT","","_","_"
37,"iti","_","_","vijān","V","vijñā","_","_"
38,"vijñāyate","_","_","vasanta","NC","","_","_"
39,"_","_","_","brāhmaṇa","NC","","_","_"
40,"_","_","_","upanay","V","upanī","_","_"
41,"brāhmaṇamupanayīta","_","_","grīṣma","NC","","_","_"
42,"grīṣme","_","_","hemanta","NC","","_","_"
43,"hemante","_","_","vā","CCD","","_","_"
44,"vā","_","_","rājanya","NC","","_","_"
45,"rājanyaṃ","_","_","śarad","NC","","_","_"
46,"śaradi","_","_","vaiśya","NC","","_","_"
47,"vaiśyaṃ","_","_","varṣā","NC","","_","_"
48,"varṣāsu","_","_","rathakāra","NC","","_","_"
49,"rathakāraṃ","_","_","śiśira","NC","","_","_"
50,"śiśire","_","_","vā","CCD","","_","_"
51,"_","_","_","sarva","JQ","","_","_"
52,"_","_","_","āpūryamāṇapakṣa","NC","","_","_"
53,"sarvānāpūryamāṇapakṣe","_","_","puṇya","JJ","","_","_"
54,"puṇye","_","_","nakṣatra","NC","","_","_"
55,"nakṣatre","_","_","viśeṣeṇa","CX","","_","_"
56,"viśeṣeṇa","_","_","puṃnāmadheya","JJ","","_","_"
57,"puṃnāmadheya","_","_","āśay","PPP","","_","_"
58,"āśitasya","_","_","kumāra","NC","","_","_"
59,"_","_","_","keśa","NC","","_","_"
60,"_","_","_","vāpay","CGDA","","_","_"
61,"_","_","_","snā","PPP","","_","_"
62,"_","_","_","alaṃkṛ","PPP","","_","_"
63,"_","_","_","ahata","JJ","","_","_"
64,"snātamalaṃkṛtamahataṃ","_","_","vāsas","NC","","_","_"
65,"vāsaḥ","_","_","paridhāpay","CGDA","","_","_"
66,"_","_","_","prācīna","JJ","","_","_"
67,"_","_","_","pravaṇa","NC","","_","_"
68,"_","_","_","udīcīna","JJ","","_","_"
69,"_","_","_","pravaṇa","NC","","_","_"
70,"udīcīnapravaṇe","_","_","sama","PPX","","_","_"
71,"same","_","_","vā","CCD","","_","_"
72,"vā","_","_","deśa","NC","","_","_"
73,"_","_","_","sthaṇḍila","NC","","_","_"
74,"_","_","_","uddhan","CGDA","","_","_"
75,"_","_","_","avokṣ","CGDA","","_","_"
76,"_","_","_","agni","NC","","_","_"
77,"sthaṇḍilamuddhatyāvokṣyāgniṃ","_","_","math","CGDA","","_","_"
78,"mathitvā","_","_","laukika","JJ","","_","_"
79,"_","_","_","vā","CCD","","_","_"
80,"_","_","_","āhṛ","CGDA","","_","_"
81,"_","_","_","nivap","CGDA","","_","_"
82,"_","_","_","upasamādhā","V","upasamādhā","_","_"
1,"_","_","_","prāñc","JJ","","_","_"
2,"_","_","_","agra","NC","","_","_"
3,"_","_","_","darbha","NC","","_","_"
4,"_","_","_","agni","NC","","_","_"
5,"_","_","_","paristṛ","V","paristṛ","_","_"
6,"_","_","_","api","CX","","_","_"
7,"_","_","_","vā","CCD","","_","_"
8,"_","_","_","udañc","JJ","","_","_"
9,"_","_","_","agra","NC","","_","_"
10,"_","_","_","paścāt","CAD","","_","_"
11,"_","_","_","purastāt","CX","","_","_"
12,"_","_","_","ca","CCD","","_","_"
13,"bhavanti","_","_","bhav","V","bhū","_","_"
14,"dakṣiṇaḥ","_","_","dakṣiṇa","JJ","","_","_"
15,"pakṣa","_","_","pakṣa","NC","","_","_"
16,"_","_","_","upariṣṭāt","CX","","_","_"
17,"_","_","_","bhav","V","bhū","_","_"
18,"_","_","_","adhastāt","CX","","_","_"
19,"_","_","_","uttara","JJ","","_","_"
20,"_","_","_","dakṣiṇa","JJ","","_","_"
21,"_","_","_","agni","NC","","_","_"
22,"_","_","_","brahman","NC","","_","_"
23,"_","_","_","āyatana","NC","","_","_"
24,"_","_","_","darbha","NC","","_","_"
25,"_","_","_","saṃstṛ","CGDA","","_","_"
26,"mayi","_","_","mat","PPR","","_","_"
27,"_","_","_","grah","V","grah","_","_"
28,"_","_","_","agra","NC","","_","_"
29,"_","_","_","agni","NC","","_","_"
30,"_","_","_","iti","CQT","","_","_"
31,"_","_","_","dvi","NUM","","_","_"
32,"_","_","_","ātman","NC","","_","_"
33,"_","_","_","agni","NC","","_","_"
34,"_","_","_","dhyā","CGDA","","_","_"
35,"_","_","_","uttara","JJ","","_","_"
36,"_","_","_","agni","NC","","_","_"
37,"pātrebhyaḥ","_","_","pātra","NC","","_","_"
38,"saṃstīrya","_","_","saṃstṛ","CGDA","","_","_"
39,"yathārthaṃ","_","_","yathārtha","CX","","_","_"
40,"dravyāṇi","_","_","dravya","NC","","_","_"
41,"_","_","_","prayuj","V","prayuj","_","_"
42,"_","_","_","aśman","NC","","_","_"
43,"_","_","_","ahata","JJ","","_","_"
44,"vāso","_","_","vāsas","NC","","_","_"
45,"'jinaṃ","_","_","ajina","NC","","_","_"
46,"mauñjīṃ","_","_","mauñjī","NC","","_","_"
47,"mekhalāṃ","_","_","mekhalā","NC","","_","_"
48,"trivṛtaṃ","_","_","trivṛt","NC","","_","_"
49,"brāhmaṇasya","_","_","brāhmaṇa","NC","","_","_"
50,"maurvīṃ","_","_","maurvī","NC","","_","_"
51,"rājanyasya","_","_","rājanya","NC","","_","_"
52,"sautrīṃ","_","_","sautra","JJ","","_","_"
53,"vaiśyasya","_","_","vaiśya","NC","","_","_"
54,"bailvaṃ","_","_","bailva","JJ","","_","_"
55,"pālāśaṃ","_","_","pālāśa","JJ","","_","_"
56,"vā","_","_","vā","CCD","","_","_"
57,"daṇḍaṃ","_","_","daṇḍa","NC","","_","_"
58,"brāhmaṇasya","_","_","brāhmaṇa","NC","","_","_"
59,"naiyagrodhaṃ","_","_","naiyagrodha","JJ","","_","_"
60,"_","_","_","rājanya","NC","","_","_"
61,"_","_","_","audumbara","JJ","","_","_"
62,"_","_","_","vaiśya","NC","","_","_"
63,"_","_","_","ekaviṃśati","NC","","_","_"
64,"_","_","_","dāru","NC","","_","_"
65,"_","_","_","idhma","NC","","_","_"
66,"_","_","_","saṃnah","V","saṃnah","_","_"
67,"_","_","_","āhuti","NC","","_","_"
68,"_","_","_","parimāṇa","NC","","_","_"
69,"vā","_","_","vā","CCD","","_","_"
70,"_","_","_","tad","PRD","","_","_"
71,"_","_","_","śamī","NC","","_","_"
72,"paridhīn","_","_","paridhi","NC","","_","_"
73,"upasaṃnahyati","_","_","upasaṃnah","V","upasaṃnah","_","_"
74,"darvīṃ","_","_","darvī","NC","","_","_"
75,"_","_","_","kūrca","NC","","_","_"
76,"_","_","_","ājya","NC","","_","_"
77,"_","_","_","sthālī","NC","","_","_"
78,"_","_","_","praṇītā","NC","","_","_"
79,"_","_","_","praṇayana","NC","","_","_"
80,"_","_","_","prokṣaṇī","NC","","_","_"
81,"_","_","_","pātra","NC","","_","_"
82,"_","_","_","upaveṣa","NC","","_","_"
83,"yena","_","_","yad","PRL","","_","_"
84,"_","_","_","ca","CCD","","_","_"
85,"_","_","_","artha","NC","","_","_"
86,"_","_","_","sakṛt","CX","","_","_"
87,"_","_","_","eva","CEM","","_","_"
88,"sarvāṇi","_","_","sarva","JQ","","_","_"
89,"yathopapādaṃ","_","_","yathopapāda","CX","","_","_"
90,"_","_","_","vā","CCD","","_","_"
91,"_","_","_","tad","PRD","","_","_"
92,"_","_","_","kāla","NC","","_","_"
93,"brahmā","_","_","brahman","NC","","_","_"
94,"yajñopavītaṃ","_","_","yajñopavīta","NC","","_","_"
95,"_","_","_","kṛ","CGDA","","_","_"
96,"_","_","_","ap","NC","","_","_"
97,"_","_","_","āca","CGDA","","_","_"
98,"_","_","_","apara","PPX","","_","_"
99,"_","_","_","agni","NC","","_","_"
100,"_","_","_","atikra","CGDA","","_","_"
101,"dakṣiṇato","_","_","dakṣiṇatas","CX","","_","_"
102,"_","_","_","brahman","NC","","_","_"
103,"_","_","_","āyatana","NC","","_","_"
104,"_","_","_","tṛṇa","NC","","_","_"
105,"_","_","_","niras","CGDA","","_","_"
106,"_","_","_","ap","NC","","_","_"
107,"_","_","_","upaspṛś","CGDA","","_","_"
108,"_","_","_","agni","NC","","_","_"
109,"_","_","_","abhimukha","JJ","","_","_"
110,"_","_","_","upaviś","V","upaviś","_","_"
111,"_","_","_","apara","PPX","","_","_"
112,"_","_","_","agni","NC","","_","_"
113,"_","_","_","prāñc","JJ","","_","_"
114,"_","_","_","mukha","NC","","_","_"
115,"upaviśya","_","_","upaviś","CGDA","","_","_"
116,"samāvaprachinnāgrau","_","_","darbha","NC","","_","_"
117,"_","_","_","prādeśa","NC","","_","_"
118,"_","_","_","mātra","NC","","_","_"
119,"prādeśamātrau","_","_","pavitra","NC","","_","_"
120,"_","_","_","kṛ","CGDA","","_","_"
121,"_","_","_","anya","PPX","","_","_"
122,"kṛtvānyena","_","_","nakha","NC","","_","_"
123,"_","_","_","chid","CGDA","","_","_"
124,"_","_","_","ap","NC","","_","_"
125,"chittvādbhir","_","_","anumṛj","CGDA","","_","_"
1,"_","_","_","pavitra","NC","","_","_"
2,"_","_","_","antardhā","PPP","","_","_"
3,"pātre","_","_","pātra","NC","","_","_"
4,"'pa","_","_","ap","NC","","_","_"
5,"_","_","_","ānī","CGDA","","_","_"
6,"_","_","_","upabila","JJ","","_","_"
7,"pātraṃ","_","_","pātra","NC","","_","_"
8,"_","_","_","pūray","CGDA","","_","_"
9,"_","_","_","udañc","JJ","","_","_"
10,"_","_","_","agra","NC","","_","_"
11,"pavitrābhyāṃ","_","_","pavitra","NC","","_","_"
12,"_","_","_","tris","CX","","_","_"
13,"_","_","_","utpū","CGDA","","_","_"
14,"samaṃ","_","_","sama","CX","","_","_"
15,"_","_","_","prāṇa","NC","","_","_"
16,"_","_","_","dhāray","KDP","","_","_"
17,"'viṣiñcan","_","_","aviṣiñcat","JJ","","_","_"
18,"_","_","_","har","V","hṛ","_","_"
19,"_","_","_","uttara","JJ","","_","_"
20,"_","_","_","agni","NC","","_","_"
21,"praṇītāḥ","_","_","praṇītā","NC","","_","_"
22,"sādayitvā","_","_","sāday","CGDA","","_","_"
23,"_","_","_","darbha","NC","","_","_"
24,"a","_","_","alpha_privativum","V","apidhā","_","_"
24,"_","_","_","pidhā","V","apidhā","_","_"
25,"_","_","_","praṇītā","NC","","_","_"
26,"_","_","_","vat","CX","","_","_"
27,"_","_","_","prokṣaṇī","NC","","_","_"
28,"saṃskṛtya","_","_","saṃskṛ","CGDA","","_","_"
29,"_","_","_","bilavat","JJ","","_","_"
30,"_","_","_","uttāna","JJ","","_","_"
31,"kṛtvā","_","_","kṛ","CGDA","","_","_"
32,"_","_","_","viṣa","NC","","_","_"
33,"_","_","_","idhma","NC","","_","_"
34,"triḥ","_","_","tris","CX","","_","_"
35,"sarvābhiḥ","_","_","sarva","JQ","","_","_"
36,"prokṣati","_","_","prokṣ","V","prokṣ","_","_"
37,"darvīṃ","_","_","darvī","NC","","_","_"
38,"niṣṭapya","_","_","niṣṭap","CGDA","","_","_"
39,"saṃmṛjya","_","_","sammṛj","CGDA","","_","_"
40,"punar","_","_","punar","CAD","","_","_"
41,"niṣṭapya","_","_","niṣṭap","CGDA","","_","_"
42,"nidadhāti","_","_","nidadh","V","nidhā","_","_"
43,"_","_","_","sammārga","NC","","_","_"
44,"_","_","_","abhyukṣ","CGDA","","_","_"
45,"_","_","_","agni","NC","","_","_"
46,"_","_","_","ādadh","V","ādhā","_","_"
47,"_","_","_","pavitra","NC","","_","_"
48,"_","_","_","antardhā","PPP","","_","_"
49,"_","_","_","ājya","NC","","_","_"
50,"_","_","_","sthālī","NC","","_","_"
51,"ājyaṃ","_","_","ājya","NC","","_","_"
52,"_","_","_","nirvap","CGDA","","_","_"
53,"_","_","_","uttara","JJ","","_","_"
54,"_","_","_","agni","NC","","_","_"
55,"_","_","_","aṅgāra","NC","","_","_"
56,"_","_","_","nirūh","CGDA","","_","_"
57,"_","_","_","tad","PRD","","_","_"
58,"_","_","_","adhiśri","CGDA","","_","_"
59,"_","_","_","avadyotay","CGDA","","_","_"
60,"_","_","_","darbha","NC","","_","_"
61,"_","_","_","taruṇa","NC","","_","_"
62,"pratyasya","_","_","pratyas","CGDA","","_","_"
63,"triḥ","_","_","tris","CX","","_","_"
64,"paryagni","_","_","paryagni","CX","","_","_"
65,"_","_","_","kṛ","CGDA","","_","_"
66,"_","_","_","udañc","JJ","","_","_"
67,"_","_","_","udvāsay","CGDA","","_","_"
68,"_","_","_","aṅgāra","NC","","_","_"
69,"_","_","_","pratyūh","CGDA","","_","_"
70,"_","_","_","udañc","JJ","","_","_"
71,"_","_","_","agra","NC","","_","_"
72,"pavitrābhyāṃ","_","_","pavitra","NC","","_","_"
73,"_","_","_","punar","CAD","","_","_"
74,"_","_","_","āhāra","NC","","_","_"
75,"_","_","_","tris","CX","","_","_"
76,"_","_","_","utpū","CGDA","","_","_"
77,"pavitre","_","_","pavitra","NC","","_","_"
78,"_","_","_","agni","NC","","_","_"
79,"_","_","_","ādhā","CGDA","","_","_"
80,"śamyābhiḥ","_","_","śamyā","NC","","_","_"
81,"_","_","_","paridadh","V","paridhā","_","_"
82,"_","_","_","apara","PPX","","_","_"
83,"_","_","_","agni","NC","","_","_"
84,"_","_","_","udīcīna","JJ","","_","_"
85,"_","_","_","kumba","NC","","_","_"
86,"śamyāṃ","_","_","śamī","NC","","_","_"
87,"nidadhāti","_","_","nidadh","V","nidhā","_","_"
88,"saṃspṛṣṭe","_","_","saṃspṛś","PPP","","_","_"
89,"madhyamayā","_","_","madhyamā","NC","","_","_"
90,"_","_","_","prācīna","JJ","","_","_"
91,"_","_","_","kumba","NC","","_","_"
92,"_","_","_","dakṣiṇa","JJ","","_","_"
93,"_","_","_","uttara","JJ","","_","_"
94,"_","_","_","ca","CCD","","_","_"
95,"_","_","_","apara","PPX","","_","_"
96,"_","_","_","agni","NC","","_","_"
97,"_","_","_","udañc","JJ","","_","_"
98,"_","_","_","agra","NC","","_","_"
99,"kūrcaṃ","_","_","kūrca","NC","","_","_"
100,"nidhāya","_","_","nidhā","CGDA","","_","_"
101,"_","_","_","tad","PRD","","_","_"
102,"_","_","_","prāñc","JJ","","_","_"
103,"_","_","_","mukha","NC","","_","_"
104,"upaviśati","_","_","upaviś","V","upaviś","_","_"
105,"yajñopavītaṃ","_","_","yajñopavīta","NC","","_","_"
106,"_","_","_","kṛ","CGDA","","_","_"
107,"_","_","_","ap","NC","","_","_"
108,"ācamya","_","_","āca","CGDA","","_","_"
109,"dakṣiṇataḥ","_","_","dakṣiṇatas","CX","","_","_"
110,"kumāra","_","_","kumāra","NC","","_","_"
111,"_","_","_","upaviś","CGDA","","_","_"
112,"_","_","_","anvārabh","V","anvārabh","_","_"
1,"atha","_","_","atha","CAD","","_","_"
2,"puṃsavanaṃ","_","_","puṃsavana","NC","","_","_"
3,"tṛtīye","_","_","tṛtīya","JJ","","_","_"
4,"māsi","_","_","mās","NC","","_","_"
5,"_","_","_","caturtha","JJ","","_","_"
6,"_","_","_","ādi","NC","","_","_"
7,"vā","_","_","vā","CCD","","_","_"
8,"tiṣyeṇa","_","_","tiṣya","NC","","_","_"
9,"vā","_","_","vā","CCD","","_","_"
10,"hastena","_","_","hasta","NC","","_","_"
11,"_","_","_","vā","CCD","","_","_"
12,"_","_","_","anurādhā","NC","","_","_"
13,"_","_","_","vā","CCD","","_","_"
14,"_","_","_","uttara","JJ","","_","_"
15,"_","_","_","vā","CCD","","_","_"
16,"_","_","_","proṣṭhapada","NC","","_","_"
17,"_","_","_","nyagrodha","NC","","_","_"
18,"_","_","_","avarodha","NC","","_","_"
19,"_","_","_","āhṛ","CGDA","","_","_"
20,"_","_","_","anavasnāta","JJ","","_","_"
21,"kumāryā","_","_","kumārī","NC","","_","_"
22,"dṛṣatputre","_","_","dṛṣatputra","NC","","_","_"
23,"dṛṣatputreṇa","_","_","dṛṣatputra","NC","","_","_"
24,"_","_","_","peṣay","CGDA","","_","_"
25,"_","_","_","antara","JJ","","_","_"
26,"_","_","_","āgāra","NC","","_","_"
27,"_","_","_","agni","NC","","_","_"
28,"_","_","_","upasamādhā","CGDA","","_","_"
29,"_","_","_","jaya","NC","","_","_"
30,"_","_","_","abhyātāna","NC","","_","_"
31,"_","_","_","rāṣṭrabhṛt","NC","","_","_"
32,"iti","_","_","iti","CQT","","_","_"
33,"_","_","_","hu","CGDA","","_","_"
34,"_","_","_","tad","PRD","","_","_"
35,"_","_","_","āhuti","NC","","_","_"
36,"_","_","_","hu","V","hu","_","_"
37,"_","_","_","yad","PRL","","_","_"
38,"_","_","_","tvat","PPR","","_","_"
39,"hṛdā","_","_","hṛd","NC","","_","_"
40,"_","_","_","kiri","NC","","_","_"
41,"_","_","_","iti","CQT","","_","_"
42,"catasro","_","_","catur","NUM","","_","_"
43,"_","_","_","apara","PPX","","_","_"
44,"_","_","_","agni","NC","","_","_"
45,"_","_","_","prāñc","JJ","","_","_"
46,"_","_","_","uttāna","JJ","","_","_"
47,"_","_","_","nipātay","CGDA","","_","_"
48,"_","_","_","atha","CAD","","_","_"
49,"_","_","_","ida","PRD","","_","_"
50,"dakṣiṇe","_","_","dakṣiṇa","JJ","","_","_"
51,"_","_","_","nāsikā","NC","","_","_"
52,"_","_","_","chidra","NC","","_","_"
53,"_","_","_","aṅguṣṭha","NC","","_","_"
54,"_","_","_","anunay","V","anunī","_","_"
55,"_","_","_","puṃsavana","NC","","_","_"
56,"_","_","_","as","V","as","_","_"
57,"_","_","_","adas","PRD","","_","_"
58,"iti","_","_","iti","CQT","","_","_"
59,"sā","_","_","tad","PRD","","_","_"
60,"_","_","_","hā","CX","","_","_"
61,"_","_","_","iti","CQT","","_","_"
62,"_","_","_","ah","V","ah","_","_"
63,"_","_","_","puṃs","NC","","_","_"
64,"_","_","_","eva","CEM","","_","_"
65,"_","_","_","janay","V","janay","_","_"
66,"_","_","_","atha","CAD","","_","_"
67,"kṣipraṃsuvanaṃ","_","_","kṣipraṃsuvana","NC","","_","_"
68,"yajñopavītaṃ","_","_","yajñopavīta","NC","","_","_"
69,"_","_","_","kṛ","CGDA","","_","_"
70,"_","_","_","ap","NC","","_","_"
71,"_","_","_","āca","CGDA","","_","_"
72,"_","_","_","anāprīta","JJ","","_","_"
73,"_","_","_","śarāva","NC","","_","_"
74,"_","_","_","anusrotasa","JJ","","_","_"
75,"_","_","_","udaka","NC","","_","_"
76,"_","_","_","āhṛ","CGDA","","_","_"
77,"_","_","_","pattas","CX","","_","_"
78,"_","_","_","tūryantī","NC","","_","_"
79,"nidhāya","_","_","nidhā","CGDA","","_","_"
80,"_","_","_","mūrdhañchoṣyat","JJ","","_","_"
81,"_","_","_","abhimṛś","V","abhimṛś","_","_"
82,"_","_","_","daśan","NUM","","_","_"
83,"_","_","_","tvat","PPR","","_","_"
84,"_","_","_","aṅguli","NC","","_","_"
85,"_","_","_","abhimṛś","V","abhimṛś","_","_"
86,"_","_","_","daśan","NUM","","_","_"
87,"_","_","_","māsya","JJ","","_","_"
88,"sūtavā","_","_","sū","CGDI","","_","_"
89,"_","_","_","iti","CQT","","_","_"
90,"_","_","_","atha","CAD","","_","_"
91,"_","_","_","a","PRD","","_","_"
92,"adbhir","_","_","ap","NC","","_","_"
93,"avokṣati","_","_","avokṣ","V","avokṣ","_","_"
94,"_","_","_","yathā","CCM","","_","_"
95,"_","_","_","eva","CEM","","_","_"
96,"vātaḥ","_","_","vāta","NC","","_","_"
97,"pavate","_","_","pū","V","pū","_","_"
98,"yathā","_","_","yathā","CCM","","_","_"
99,"samudra","_","_","samudra","NC","","_","_"
100,"ejati","_","_","ej","V","ej","_","_"
1,"evaṃ","_","_","eva","CX","","_","_"
2,"kumāra","_","_","kumāra","NC","","_","_"
3,"ejatu","_","_","ej","V","ej","_","_"
4,"saha","_","_","saha","CX","","_","_"
5,"_","_","_","jarāyu","NC","","_","_"
6,"_","_","_","avapad","V","avapad","_","_"
7,"_","_","_","iti","CQT","","_","_"
8,"_","_","_","atha","CAD","","_","_"
9,"_","_","_","yadi","CSB","","_","_"
10,"_","_","_","aparā","NC","","_","_"
11,"na","_","_","na","CNG","","_","_"
12,"_","_","_","pat","V","pat","_","_"
13,"_","_","_","pāṇi","NC","","_","_"
14,"_","_","_","udaka","NC","","_","_"
15,"_","_","_","ādā","CGDA","","_","_"
16,"_","_","_","mūrdhan","NC","","_","_"
17,"_","_","_","a","PRD","","_","_"
18,"_","_","_","avasic","V","avasic","_","_"
19,"_","_","_","tila","NC","","_","_"
20,"_","_","_","da","JJ","","_","_"
21,"'vapadyasva","_","_","avapad","V","avapad","_","_"
22,"na","_","_","na","CNG","","_","_"
23,"_","_","_","māṃsa","NC","","_","_"
24,"_","_","_","as","V","as","_","_"
25,"no","_","_","no","CX","","_","_"
26,"_","_","_","dala","NC","","_","_"
27,"_","_","_","avapad","V","avapad","_","_"
28,"_","_","_","adas","PRD","","_","_"
29,"_","_","_","iti","CQT","","_","_"
30,"yadi","_","_","yadi","CSB","","_","_"
31,"garbhaḥ","_","_","garbha","NC","","_","_"
32,"sraṃsed","_","_","sraṃs","V","sraṃs","_","_"
33,"ārdreṇa","_","_","ārdra","JJ","","_","_"
34,"pāṇinā","_","_","pāṇi","NC","","_","_"
35,"trir","_","_","tris","CX","","_","_"
36,"ūrdhvaṃ","_","_","ūrdhva","CX","","_","_"
37,"nābher","_","_","nābhi","NC","","_","_"
38,"unmṛjet","_","_","unmṛj","V","unmṛj","_","_"
39,"parāñcaṃ","_","_","parāñc","JJ","","_","_"
40,"tvā","_","_","tvat","PPR","","_","_"
41,"_","_","_","na","CNG","","_","_"
42,"_","_","_","arvāñc","JJ","","_","_"
43,"tvaṣṭā","_","_","tvaṣṭṛ","NC","","_","_"
44,"badhnātu","_","_","bandh","V","bandh","_","_"
45,"bandhanaiḥ","_","_","bandhana","NC","","_","_"
1,"sa","_","_","tad","PRD","","_","_"
2,"_","_","_","ṛtu","NC","","_","_"
3,"_","_","_","upaśī","V","upaśī","_","_"
4,"_","_","_","daśan","NUM","","_","_"
5,"_","_","_","māsa","NC","","_","_"
6,"_","_","_","avīra","JJ","","_","_"
7,"_","_","_","han","JJ","","_","_"
8,"_","_","_","iti","CQT","","_","_"
