"WordID","word","NormSTEM","suffix","lemma","PoS","Root","NormSuffix","NormWord"
1,"vāsudeva","_","_","vāsudeva","NC","","_","_"
2,"uvāca","_","_","vak","V","vac","_","_"
1,"tato","_","_","tatas","CX","","_","_"
2,"'haṃ","_","_","mat","PPR","","_","_"
3,"_","_","_","bharata","NC","","_","_"
4,"_","_","_","śreṣṭha","JJ","","_","_"
5,"pragṛhya","_","_","pragrah","CGDA","","_","_"
6,"ruciraṃ","_","_","rucira","JJ","","_","_"
7,"dhanuḥ","_","_","dhanus","NC","","_","_"
1,"śarair","_","_","śara","NC","","_","_"
2,"apātayaṃ","_","_","pātay","V","pātay","_","_"
3,"_","_","_","saubha","NC","","_","_"
4,"_","_","_","śiras","NC","","_","_"
5,"_","_","_","vibudha","NC","","_","_"
6,"_","_","_","dviṣ","JJ","","_","_"
1,"śarāṃś","_","_","śara","NC","","_","_"
2,"_","_","_","ca","CCD","","_","_"
3,"_","_","_","āśīviṣa","NC","","_","_"
4,"_","_","_","ākāra","NC","","_","_"
5,"_","_","_","ūrdhva","JJ","","_","_"
6,"_","_","_","ga","JJ","","_","_"
7,"_","_","_","tigma","JJ","","_","_"
8,"_","_","_","tejas","NC","","_","_"
1,"_","_","_","śālva","NC","","_","_"
2,"_","_","_","rāja","NC","","_","_"
3,"_","_","_","śārṅga","NC","","_","_"
4,"_","_","_","muc","PPP","","_","_"
5,"suvāsasaḥ","_","_","suvāsas","JJ","","_","_"
1,"tato","_","_","tatas","CX","","_","_"
2,"_","_","_","na","CNG","","_","_"
3,"_","_","_","darś","V","dṛś","_","_"
4,"tadā","_","_","tadā","CAD","","_","_"
5,"saubhaṃ","_","_","saubha","NC","","_","_"
6,"_","_","_","kuru","NC","","_","_"
7,"_","_","_","kula","NC","","_","_"
8,"_","_","_","udvaha","JJ","","_","_"
1,"antarhitaṃ","_","_","antardhā","PPP","","_","_"
2,"_","_","_","māyā","NC","","_","_"
3,"_","_","_","bhav","V","bhū","_","_"
4,"tato","_","_","tatas","CX","","_","_"
5,"'haṃ","_","_","mat","PPR","","_","_"
6,"vismito","_","_","vismi","PPP","","_","_"
7,"'bhavam","_","_","bhav","V","bhū","_","_"
1,"atha","_","_","atha","CAD","","_","_"
2,"_","_","_","dānava","NC","","_","_"
3,"_","_","_","saṃgha","NC","","_","_"
4,"te","_","_","tad","PRD","","_","_"
5,"_","_","_","vikṛ","PPP","","_","_"
6,"_","_","_","ānana","NC","","_","_"
7,"_","_","_","mūrdhaja","NC","","_","_"
1,"udakrośan","_","_","utkroś","V","utkruś","_","_"
2,"_","_","_","mahat","JJ","","_","_"
3,"_","_","_","rāja","NC","","_","_"
4,"viṣṭhite","_","_","viṣṭhā","PPP","","_","_"
5,"mayi","_","_","mat","PPR","","_","_"
6,"bhārata","_","_","bhārata","JJ","","_","_"
1,"tato","_","_","tatas","CX","","_","_"
2,"'straṃ","_","_","astra","NC","","_","_"
3,"śabdasāhaṃ","_","_","śabdasāha","JJ","","_","_"
4,"vai","_","_","vai","CX","","_","_"
5,"tvaramāṇo","_","_","tvar","KDP","","_","_"
6,"_","_","_","mahat","JJ","","_","_"
7,"_","_","_","āhava","NC","","_","_"
1,"ayojayaṃ","_","_","yojay","V","yojay","_","_"
2,"_","_","_","tad","PRD","","_","_"
3,"_","_","_","vadha","NC","","_","_"
4,"tataḥ","_","_","tatas","CX","","_","_"
5,"śabda","_","_","śabda","NC","","_","_"
6,"upāramat","_","_","upara","V","upara","_","_"
1,"hatās","_","_","han","PPP","","_","_"
2,"te","_","_","tad","PRD","","_","_"
3,"dānavāḥ","_","_","dānava","NC","","_","_"
4,"sarve","_","_","sarva","JQ","","_","_"
5,"yaiḥ","_","_","yad","PRL","","_","_"
6,"sa","_","_","tad","PRD","","_","_"
7,"śabda","_","_","śabda","NC","","_","_"
8,"udīritaḥ","_","_","udīray","PPP","","_","_"
1,"śarair","_","_","śara","NC","","_","_"
2,"_","_","_","āditya","NC","","_","_"
3,"_","_","_","saṃkāśa","NC","","_","_"
4,"jvalitaiḥ","_","_","jval","PPP","","_","_"
5,"_","_","_","śabda","NC","","_","_"
6,"_","_","_","sādhana","NC","","_","_"
1,"tasminn","_","_","tad","PRD","","_","_"
2,"uparate","_","_","upara","PPP","","_","_"
3,"śabde","_","_","śabda","NC","","_","_"
4,"punar","_","_","punar","CAD","","_","_"
5,"_","_","_","eva","CEM","","_","_"
6,"_","_","_","anyatas","CX","","_","_"
7,"'bhavat","_","_","bhav","V","bhū","_","_"
1,"śabdo","_","_","śabda","NC","","_","_"
2,"'paro","_","_","apara","PPX","","_","_"
3,"_","_","_","mahat","JJ","","_","_"
4,"_","_","_","rāja","NC","","_","_"
5,"_","_","_","tatra","CAD","","_","_"
6,"_","_","_","api","CX","","_","_"
7,"prāharaṃ","_","_","prahar","V","prahṛ","_","_"
8,"śarān","_","_","śara","NC","","_","_"
1,"evaṃ","_","_","eva","CX","","_","_"
2,"daśa","_","_","daśan","NUM","","_","_"
3,"diśaḥ","_","_","diś","NC","","_","_"
4,"sarvās","_","_","sarva","JQ","","_","_"
5,"tiryag","_","_","tiryañc","JJ","","_","_"
6,"ūrdhvaṃ","_","_","ūrdhva","CX","","_","_"
7,"ca","_","_","ca","CCD","","_","_"
8,"bhārata","_","_","bhārata","JJ","","_","_"
1,"nādayāmāsur","_","_","nāday","V","nāday","_","_"
2,"asurās","_","_","asura","NC","","_","_"
3,"te","_","_","tad","PRD","","_","_"
4,"_","_","_","ca","CCD","","_","_"
5,"_","_","_","api","CX","","_","_"
6,"nihatā","_","_","nihan","PPP","","_","_"
7,"mayā","_","_","mat","PPR","","_","_"
1,"tataḥ","_","_","tatas","CX","","_","_"
2,"prāgjyotiṣaṃ","_","_","prāgjyotiṣa","NC","","_","_"
3,"gatvā","_","_","ga","CGDA","","_","_"
4,"punar","_","_","punar","CAD","","_","_"
5,"eva","_","_","eva","CEM","","_","_"
6,"vyadṛśyata","_","_","vidarś","V","vidṛś","_","_"
1,"saubhaṃ","_","_","saubha","NC","","_","_"
2,"_","_","_","kāma","NC","","_","_"
3,"_","_","_","gama","JJ","","_","_"
4,"vīra","_","_","vīra","NC","","_","_"
5,"mohayan","_","_","mohay","KDP","","_","_"
6,"mama","_","_","mat","PPR","","_","_"
7,"cakṣuṣī","_","_","cakṣus","NC","","_","_"
1,"tato","_","_","tatas","CX","","_","_"
2,"_","_","_","loka","NC","","_","_"
3,"_","_","_","anta","NC","","_","_"
4,"_","_","_","karaṇa","NC","","_","_"
5,"dānavo","_","_","dānava","NC","","_","_"
6,"_","_","_","vānara","NC","","_","_"
7,"_","_","_","ākṛti","NC","","_","_"
1,"_","_","_","śilā","NC","","_","_"
2,"_","_","_","varṣa","NC","","_","_"
3,"sahasā","_","_","sahas","NC","","_","_"
4,"mahatā","_","_","mahat","JJ","","_","_"
5,"māṃ","_","_","mat","PPR","","_","_"
6,"samāvṛṇot","_","_","samāvṛ","V","samāvṛ","_","_"
1,"so","_","_","tad","PRD","","_","_"
2,"'haṃ","_","_","mat","PPR","","_","_"
3,"_","_","_","parvata","NC","","_","_"
4,"_","_","_","varṣa","NC","","_","_"
5,"vadhyamānaḥ","_","_","vadh","KDP","","_","_"
6,"samantataḥ","_","_","samantataḥ","CX","","_","_"
1,"valmīka","_","_","valmīka","NC","","_","_"
2,"iva","_","_","iva","CCM","","_","_"
3,"_","_","_","rājan","NC","","_","_"
4,"_","_","_","indra","NC","","_","_"
5,"_","_","_","parvata","NC","","_","_"
6,"_","_","_","upaci","PPP","","_","_"
7,"'bhavam","_","_","bhav","V","bhū","_","_"
1,"tato","_","_","tatas","CX","","_","_"
2,"'haṃ","_","_","mat","PPR","","_","_"
3,"_","_","_","parvata","NC","","_","_"
4,"_","_","_","cita","JJ","","_","_"
5,"_","_","_","sa_saha","CX","","_","_"
6,"_","_","_","haya","NC","","_","_"
7,"_","_","_","saha","CX","","_","_"
8,"_","_","_","sārathi","NC","","_","_"
1,"a","_","_","alpha_privativum","NC","","_","_"
1,"aprakhyātim","_","_","prakhyāti","NC","","_","_"
2,"iyāṃ","_","_","e","V","i","_","_"
3,"rājan","_","_","rājan","NC","","_","_"
4,"_","_","_","sa_saha","CX","","_","_"
5,"_","_","_","dhvaja","NC","","_","_"
6,"parvataiś","_","_","parvata","NC","","_","_"
7,"citaḥ","_","_","cita","JJ","","_","_"
1,"tato","_","_","tatas","CX","","_","_"
2,"_","_","_","vṛṣṇi","NC","","_","_"
3,"_","_","_","pravīra","NC","","_","_"
4,"ye","_","_","yad","PRL","","_","_"
5,"_","_","_","mat","PPR","","_","_"
6,"_","_","_","as","V","as","_","_"
7,"sainikās","_","_","sainika","NC","","_","_"
8,"tadā","_","_","tadā","CAD","","_","_"
1,"te","_","_","tad","PRD","","_","_"
2,"_","_","_","bhaya","NC","","_","_"
3,"_","_","_","ārta","JJ","","_","_"
4,"diśaḥ","_","_","diś","NC","","_","_"
5,"sarvāḥ","_","_","sarva","JQ","","_","_"
6,"sahasā","_","_","sahas","NC","","_","_"
7,"vipradudruvuḥ","_","_","vipradru","V","vipradru","_","_"
1,"tato","_","_","tatas","CX","","_","_"
2,"hāhākṛtaṃ","_","_","hāhākṛta","JJ","","_","_"
3,"sarvam","_","_","sarva","JQ","","_","_"
4,"abhūt","_","_","bhav","V","bhū","_","_"
5,"kila","_","_","kila","CX","","_","_"
6,"viśāṃ","_","_","viś","NC","","_","_"
7,"pate","_","_","pati","NC","","_","_"
1,"dyauś","_","_","div","NC","","_","_"
2,"ca","_","_","ca","CCD","","_","_"
3,"bhūmiś","_","_","bhūmi","NC","","_","_"
4,"ca","_","_","ca","CCD","","_","_"
5,"khaṃ","_","_","kha","NC","","_","_"
6,"_","_","_","ca","CCD","","_","_"
7,"_","_","_","eva","CEM","","_","_"
8,"_","_","_","adṛśyamāna","JJ","","_","_"
9,"tathā","_","_","tathā","CX","","_","_"
10,"mayi","_","_","mat","PPR","","_","_"
1,"tato","_","_","tatas","CX","","_","_"
2,"_","_","_","viṣad","PPP","","_","_"
3,"_","_","_","manas","NC","","_","_"
4,"mama","_","_","mat","PPR","","_","_"
5,"rājan","_","_","rājan","NC","","_","_"
6,"_","_","_","suhṛd","NC","","_","_"
7,"_","_","_","jana","NC","","_","_"
1,"ruruduś","_","_","rod","V","rud","_","_"
2,"cukruśuś","_","_","kroś","V","kruś","_","_"
3,"_","_","_","ca","CCD","","_","_"
4,"_","_","_","eva","CEM","","_","_"
5,"_","_","_","duḥkha","NC","","_","_"
6,"_","_","_","śoka","NC","","_","_"
7,"_","_","_","samanvita","JJ","","_","_"
1,"dviṣatāṃ","_","_","dviṣ","KDP","","_","_"
2,"ca","_","_","ca","CCD","","_","_"
3,"praharṣo","_","_","praharṣa","NC","","_","_"
4,"'bhūd","_","_","bhav","V","bhū","_","_"
5,"ārtiś","_","_","ārti","NC","","_","_"
6,"_","_","_","ca","CCD","","_","_"
7,"a","_","_","alpha_privativum","JJ","","_","_"
7,"_","_","_","dviṣat","JJ","","_","_"
8,"api","_","_","api","CX","","_","_"
1,"evaṃ","_","_","eva","CX","","_","_"
2,"vijitavān","_","_","viji","KDP","","_","_"
3,"vīra","_","_","vīra","NC","","_","_"
4,"paścād","_","_","paścāt","CAD","","_","_"
5,"aśrauṣam","_","_","śṛṇ","V","śru","_","_"
6,"acyuta","_","_","acyuta","NC","","_","_"
1,"tato","_","_","tatas","CX","","_","_"
2,"'ham","_","_","mat","PPR","","_","_"
3,"astraṃ","_","_","astra","NC","","_","_"
4,"dayitaṃ","_","_","dayita","JJ","","_","_"
5,"_","_","_","sarva","JQ","","_","_"
6,"_","_","_","pāṣāṇa","NC","","_","_"
7,"_","_","_","bhedana","JJ","","_","_"
1,"vajram","_","_","vajra","NC","","_","_"
2,"udyamya","_","_","udya","CGDA","","_","_"
3,"tān","_","_","tad","PRD","","_","_"
4,"sarvān","_","_","sarva","JQ","","_","_"
5,"parvatān","_","_","parvata","NC","","_","_"
6,"samaśātayam","_","_","saṃśātay","V","saṃśātay","_","_"
1,"tataḥ","_","_","tatas","CX","","_","_"
2,"_","_","_","parvata","NC","","_","_"
3,"_","_","_","bhāra","NC","","_","_"
4,"_","_","_","ārta","JJ","","_","_"
5,"_","_","_","manda","JJ","","_","_"
6,"_","_","_","prāṇa","NC","","_","_"
7,"_","_","_","viceṣṭita","NC","","_","_"
1,"hayā","_","_","haya","NC","","_","_"
2,"mama","_","_","mat","PPR","","_","_"
3,"_","_","_","mahat","JJ","","_","_"
4,"_","_","_","rāja","NC","","_","_"
5,"vepamānā","_","_","vip","KDP","","_","_"
6,"_","_","_","iva","CCM","","_","_"
7,"_","_","_","bhav","V","bhū","_","_"
1,"_","_","_","megha","NC","","_","_"
2,"_","_","_","jāla","NC","","_","_"
3,"_","_","_","iva","CCM","","_","_"
4,"_","_","_","ākāśa","NC","","_","_"
5,"_","_","_","vidāray","CGDA","","_","_"
6,"_","_","_","abhyudi","PPP","","_","_"
7,"ravim","_","_","ravi","NC","","_","_"
1,"dṛṣṭvā","_","_","dṛś","CGDA","","_","_"
2,"māṃ","_","_","mat","PPR","","_","_"
3,"bāndhavāḥ","_","_","bāndhava","NC","","_","_"
4,"sarve","_","_","sarva","JQ","","_","_"
5,"harṣam","_","_","harṣa","NC","","_","_"
6,"āhārayan","_","_","āhāray","V","āhāray","_","_"
7,"punaḥ","_","_","punar","CAD","","_","_"
1,"tato","_","_","tatas","CX","","_","_"
2,"mām","_","_","mat","PPR","","_","_"
3,"abravīt","_","_","abravīta","V","brū","_","_"
4,"sūtaḥ","_","_","sūta","NC","","_","_"
5,"prāñjaliḥ","_","_","prāñjali","JJ","","_","_"
6,"praṇato","_","_","praṇa","PPP","","_","_"
7,"nṛpa","_","_","nṛpa","NC","","_","_"
1,"sādhu","_","_","sādhu","JJ","","_","_"
2,"saṃpaśya","_","_","sampaś","V","saṃpaś","_","_"
3,"vārṣṇeya","_","_","vārṣṇeya","NC","","_","_"
4,"śālvaṃ","_","_","śālva","NC","","_","_"
5,"_","_","_","saubha","NC","","_","_"
6,"_","_","_","pati","NC","","_","_"
7,"sthitam","_","_","sthā","PPP","","_","_"
1,"alaṃ","_","_","ala","CX","","_","_"
2,"_","_","_","kṛṣṇa","NC","","_","_"
3,"_","_","_","avaman","V","avaman","_","_"
4,"_","_","_","a","PRD","","_","_"
5,"sādhu","_","_","sādhu","JJ","","_","_"
6,"yatnaṃ","_","_","yatna","NC","","_","_"
7,"samācara","_","_","samācar","V","samācar","_","_"
1,"mārdavaṃ","_","_","mārdava","NC","","_","_"
2,"sakhitāṃ","_","_","sakhitā","NC","","_","_"
3,"_","_","_","ca","CCD","","_","_"
4,"_","_","_","eva","CEM","","_","_"
5,"śālvād","_","_","śālva","NC","","_","_"
6,"adya","_","_","adya","CX","","_","_"
7,"vyapāhara","_","_","vyapāhṛ","V","vyapāhṛ","_","_"
1,"jahi","_","_","jah","V","hā","_","_"
2,"śālvaṃ","_","_","śālva","NC","","_","_"
3,"_","_","_","mahat","JJ","","_","_"
4,"_","_","_","bāhu","NC","","_","_"
5,"_","_","_","mā","CNG","","_","_"
6,"_","_","_","a","PRD","","_","_"
7,"jīvaya","_","_","jīvay","V","jīvay","_","_"
8,"keśava","_","_","keśava","NC","","_","_"
1,"sarvaiḥ","_","_","sarva","JQ","","_","_"
2,"parākramair","_","_","parākrama","NC","","_","_"
3,"vīra","_","_","vīra","NC","","_","_"
4,"vadhyaḥ","_","_","vadh","KDG","","_","_"
5,"śatrur","_","_","śatru","NC","","_","_"
6,"_","_","_","amitra","NC","","_","_"
7,"_","_","_","han","JJ","","_","_"
1,"na","_","_","na","CNG","","_","_"
2,"śatrur","_","_","śatru","NC","","_","_"
3,"avamantavyo","_","_","avaman","KDG","","_","_"
4,"durbalo","_","_","durbala","JJ","","_","_"
5,"'pi","_","_","api","CX","","_","_"
6,"balīyasā","_","_","balīyas","JJ","","_","_"
1,"yo","_","_","yad","PRL","","_","_"
2,"'pi","_","_","api","CX","","_","_"
3,"syāt","_","_","as","V","as","_","_"
4,"pīṭhagaḥ","_","_","pīṭhaga","NC","","_","_"
5,"kaścit","_","_","kiṃcit","PRI","","_","_"
6,"kiṃ","_","_","kiṃ","PRQ","","_","_"
7,"punaḥ","_","_","punar","CAD","","_","_"
8,"samare","_","_","samara","NC","","_","_"
9,"sthitaḥ","_","_","sthā","PPP","","_","_"
1,"sa","_","_","tad","PRD","","_","_"
2,"tvaṃ","_","_","tvat","PPR","","_","_"
3,"_","_","_","puruṣa","NC","","_","_"
4,"_","_","_","śārdūla","NC","","_","_"
5,"_","_","_","sarva","JQ","","_","_"
6,"_","_","_","yatna","NC","","_","_"
7,"imaṃ","_","_","ida","PRD","","_","_"
8,"prabho","_","_","prabhu","NC","","_","_"
1,"jahi","_","_","jah","V","hā","_","_"
2,"_","_","_","vṛṣṇi","NC","","_","_"
3,"_","_","_","kula","NC","","_","_"
4,"_","_","_","śreṣṭha","JJ","","_","_"
5,"mā","_","_","mā","CNG","","_","_"
6,"tvāṃ","_","_","tvat","PPR","","_","_"
7,"kālo","_","_","kāla","NC","","_","_"
8,"'tyagāt","_","_","atigā","V","atigā","_","_"
9,"punaḥ","_","_","punar","CAD","","_","_"
1,"_","_","_","na","CNG","","_","_"
2,"_","_","_","tad","PRD","","_","_"
3,"_","_","_","mārdava","NC","","_","_"
4,"_","_","_","sādhya","JJ","","_","_"
5,"vai","_","_","vai","CX","","_","_"
6,"mato","_","_","man","PPP","","_","_"
7,"_","_","_","na","CNG","","_","_"
8,"_","_","_","api","CX","","_","_"
9,"sakhā","_","_","sakhi","NC","","_","_"
10,"tava","_","_","tvat","PPR","","_","_"
1,"yena","_","_","yad","PRL","","_","_"
2,"tvaṃ","_","_","tvat","PPR","","_","_"
3,"yodhito","_","_","yodhay","PPP","","_","_"
4,"vīra","_","_","vīra","NC","","_","_"
5,"dvārakā","_","_","dvārakā","NC","","_","_"
6,"_","_","_","ca","CCD","","_","_"
7,"_","_","_","avamarday","PPP","","_","_"
1,"evamādi","_","_","evamādi","JJ","","_","_"
2,"tu","_","_","tu","CCD","","_","_"
3,"kaunteya","_","_","kaunteya","NC","","_","_"
4,"_","_","_","śru","CGDA","","_","_"
5,"_","_","_","mat","PPR","","_","_"
6,"sārather","_","_","sārathi","NC","","_","_"
7,"vacaḥ","_","_","vacas","NC","","_","_"
1,"_","_","_","tad","PRD","","_","_"
2,"_","_","_","tvat","PPR","","_","_"
3,"etad","_","_","tad","PRD","","_","_"
4,"iti","_","_","iti","CQT","","_","_"
5,"jñātvā","_","_","jñā","CGDA","","_","_"
6,"yuddhe","_","_","yuddha","NC","","_","_"
7,"matim","_","_","mati","NC","","_","_"
8,"adhārayam","_","_","dhāray","V","dhāray","_","_"
1,"vadhāya","_","_","vadha","NC","","_","_"
2,"_","_","_","śālva","NC","","_","_"
3,"_","_","_","rāja","NC","","_","_"
4,"saubhasya","_","_","saubha","NC","","_","_"
5,"ca","_","_","ca","CCD","","_","_"
6,"nipātane","_","_","nipātana","NC","","_","_"
1,"dārukaṃ","_","_","dāruka","NC","","_","_"
2,"_","_","_","ca","CCD","","_","_"
3,"_","_","_","abravīta","V","brū","_","_"
4,"vīra","_","_","vīra","NC","","_","_"
5,"muhūrtaṃ","_","_","muhūrta","NC","","_","_"
6,"sthīyatām","_","_","tiṣṭh","V","sthā","_","_"
7,"iti","_","_","iti","CQT","","_","_"
1,"tato","_","_","tatas","CX","","_","_"
2,"'pratihataṃ","_","_","apratihata","JJ","","_","_"
3,"divyam","_","_","divya","JJ","","_","_"
4,"abhedyam","_","_","abhedya","JJ","","_","_"
5,"ativīryavat","_","_","ativīryavat","JJ","","_","_"
1,"āgneyam","_","_","āgneya","JJ","","_","_"
2,"astraṃ","_","_","astra","NC","","_","_"
3,"dayitaṃ","_","_","dayita","JJ","","_","_"
4,"_","_","_","sarva","JQ","","_","_"
5,"_","_","_","sāha","JJ","","_","_"
6,"_","_","_","mahat","JJ","","_","_"
7,"_","_","_","prabhā","NC","","_","_"
1,"yakṣāṇāṃ","_","_","yakṣa","NC","","_","_"
2,"rākṣasānāṃ","_","_","rākṣasa","NC","","_","_"
3,"ca","_","_","ca","CCD","","_","_"
4,"dānavānāṃ","_","_","dānava","NC","","_","_"
5,"ca","_","_","ca","CCD","","_","_"
6,"saṃyuge","_","_","saṃyuga","NC","","_","_"
1,"rājñāṃ","_","_","rājan","NC","","_","_"
2,"ca","_","_","ca","CCD","","_","_"
3,"pratilomānāṃ","_","_","pratiloma","JJ","","_","_"
4,"_","_","_","bhasman","NC","","_","_"
5,"_","_","_","anta","NC","","_","_"
6,"_","_","_","karaṇa","NC","","_","_"
7,"mahat","_","_","mahat","JJ","","_","_"
1,"_","_","_","kṣura","NC","","_","_"
2,"_","_","_","anta","NC","","_","_"
3,"amalaṃ","_","_","amala","JJ","","_","_"
4,"cakraṃ","_","_","cakra","NC","","_","_"
5,"_","_","_","kāla","NC","","_","_"
6,"_","_","_","antaka","NC","","_","_"
7,"_","_","_","yama","NC","","_","_"
8,"_","_","_","upama","JJ","","_","_"
1,"atulaṃ","_","_","atula","JJ","","_","_"
2,"dviṣatāṃ","_","_","dviṣ","KDP","","_","_"
3,"ca","_","_","ca","CCD","","_","_"
4,"nibarhaṇam","_","_","nibarhaṇa","JJ","","_","_"
1,"jahi","_","_","jah","V","hā","_","_"
2,"saubhaṃ","_","_","saubha","NC","","_","_"
3,"_","_","_","sva","JJ","","_","_"
4,"_","_","_","vīrya","NC","","_","_"
5,"ye","_","_","yad","PRL","","_","_"
6,"_","_","_","ca","CCD","","_","_"
7,"_","_","_","atra","CAD","","_","_"
8,"ripavo","_","_","ripu","NC","","_","_"
9,"mama","_","_","mat","PPR","","_","_"
1,"ity","_","_","iti","CQT","","_","_"
2,"uktvā","_","_","vac","CGDA","","_","_"
3,"_","_","_","bhuja","NC","","_","_"
4,"_","_","_","vīrya","NC","","_","_"
5,"tasmai","_","_","tad","PRD","","_","_"
6,"prāhiṇavaṃ","_","_","prahi","V","prahi","_","_"
7,"ruṣā","_","_","ruṣ","NC","","_","_"
1,"rūpaṃ","_","_","rūpa","NC","","_","_"
2,"_","_","_","sudarśana","NC","","_","_"
3,"_","_","_","as","V","as","_","_"
4,"ākāśe","_","_","ākāśa","NC","","_","_"
5,"patatas","_","_","pat","KDP","","_","_"
6,"tadā","_","_","tadā","CAD","","_","_"
1,"_","_","_","dvitīya","JJ","","_","_"
2,"_","_","_","iva","CCM","","_","_"
3,"sūryasya","_","_","sūrya","NC","","_","_"
4,"_","_","_","yuga","NC","","_","_"
5,"_","_","_","anta","NC","","_","_"
6,"pariviṣyataḥ","_","_","pariviṣ","KDP","","_","_"
1,"tat","_","_","tad","PRD","","_","_"
2,"samāsādya","_","_","samāsāday","CGDA","","_","_"
3,"nagaraṃ","_","_","nagara","NC","","_","_"
4,"saubhaṃ","_","_","saubha","NC","","_","_"
5,"_","_","_","vyapaga","PPP","","_","_"
6,"_","_","_","tviṣā","NC","","_","_"
1,"madhyena","_","_","madhya","NC","","_","_"
2,"pāṭayāmāsa","_","_","pāṭay","V","pāṭay","_","_"
3,"krakaco","_","_","krakaca","NC","","_","_"
4,"_","_","_","dāru","NC","","_","_"
5,"_","_","_","iva","CCM","","_","_"
6,"_","_","_","ucchri","PPP","","_","_"
1,"dvidhā","_","_","dvidhā","CX","","_","_"
2,"kṛtaṃ","_","_","kṛ","PPP","","_","_"
3,"tataḥ","_","_","tatas","CX","","_","_"
4,"saubhaṃ","_","_","saubha","NC","","_","_"
5,"_","_","_","sudarśana","NC","","_","_"
6,"_","_","_","bala","NC","","_","_"
7,"_","_","_","han","PPP","","_","_"
1,"_","_","_","maheśvara","NC","","_","_"
2,"_","_","_","śara","NC","","_","_"
3,"_","_","_","uddhū","PPP","","_","_"
4,"papāta","_","_","pat","V","pat","_","_"
5,"tripuraṃ","_","_","tripura","NC","","_","_"
6,"yathā","_","_","yathā","CCM","","_","_"
1,"tasmin","_","_","tad","PRD","","_","_"
2,"nipatite","_","_","nipat","PPP","","_","_"
3,"saubhe","_","_","saubha","NC","","_","_"
4,"cakram","_","_","cakra","NC","","_","_"
5,"āgāt","_","_","āgā","V","āgā","_","_"
6,"karaṃ","_","_","kara","NC","","_","_"
7,"mama","_","_","mat","PPR","","_","_"
1,"punaś","_","_","punar","CAD","","_","_"
2,"_","_","_","ca","CCD","","_","_"
3,"_","_","_","uddhū","CGDA","","_","_"
4,"vegena","_","_","vega","NC","","_","_"
5,"_","_","_","śālva","NC","","_","_"
6,"_","_","_","iti","CQT","","_","_"
7,"aham","_","_","mat","PPR","","_","_"
8,"abruvam","_","_","abravīta","V","brū","_","_"
1,"tataḥ","_","_","tatas","CX","","_","_"
2,"śālvaṃ","_","_","śālva","NC","","_","_"
3,"gadāṃ","_","_","gadā","NC","","_","_"
4,"gurvīm","_","_","gurvī","NC","","_","_"
5,"āvidhyantaṃ","_","_","āvyadh","KDP","","_","_"
6,"_","_","_","mahat","JJ","","_","_"
7,"_","_","_","āhava","NC","","_","_"
1,"dvidhā","_","_","dvidhā","CX","","_","_"
2,"cakāra","_","_","kar","V","kṛ","_","_"
3,"sahasā","_","_","sahas","NC","","_","_"
4,"prajajvāla","_","_","prajval","V","prajval","_","_"
5,"ca","_","_","ca","CCD","","_","_"
6,"tejasā","_","_","tejas","NC","","_","_"
1,"tasmin","_","_","tad","PRD","","_","_"
2,"nipatite","_","_","nipat","PPP","","_","_"
3,"vīre","_","_","vīra","NC","","_","_"
4,"dānavās","_","_","dānava","NC","","_","_"
5,"_","_","_","tras","PPP","","_","_"
6,"_","_","_","cetas","NC","","_","_"
1,"_","_","_","hāhā","NC","","_","_"
2,"_","_","_","bhū","PPP","","_","_"
3,"diśo","_","_","diś","NC","","_","_"
4,"jagmur","_","_","ga","V","ga","_","_"
5,"arditā","_","_","arday","PPP","","_","_"
6,"mama","_","_","mat","PPR","","_","_"
7,"sāyakaiḥ","_","_","sāyaka","NC","","_","_"
1,"tato","_","_","tatas","CX","","_","_"
2,"'haṃ","_","_","mat","PPR","","_","_"
3,"samavasthāpya","_","_","samavasthāpay","CGDA","","_","_"
4,"rathaṃ","_","_","ratha","NC","","_","_"
5,"_","_","_","saubha","NC","","_","_"
6,"_","_","_","samīpatas","CX","","_","_"
1,"śaṅkhaṃ","_","_","śaṅkha","NC","","_","_"
2,"pradhmāpya","_","_","pradhmāpay","CGDA","","_","_"
3,"harṣeṇa","_","_","harṣa","NC","","_","_"
4,"suhṛdaḥ","_","_","suhṛd","NC","","_","_"
5,"paryaharṣayam","_","_","pariharṣay","V","pariharṣay","_","_"
1,"tan","_","_","tad","PRD","","_","_"
2,"_","_","_","meru","NC","","_","_"
3,"_","_","_","śikhara","NC","","_","_"
4,"_","_","_","ākāra","NC","","_","_"
5,"_","_","_","vidhvaṃs","PPP","","_","_"
6,"_","_","_","aṭṭāla","NC","","_","_"
7,"_","_","_","gopura","NC","","_","_"
1,"dahyamānam","_","_","dah","KDP","","_","_"
2,"abhiprekṣya","_","_","abhiprekṣ","CGDA","","_","_"
3,"striyas","_","_","strī","NC","","_","_"
4,"tāḥ","_","_","tad","PRD","","_","_"
5,"sampradudruvuḥ","_","_","sampradru","V","sampradru","_","_"
1,"evaṃ","_","_","eva","CX","","_","_"
2,"nihatya","_","_","nihan","CGDA","","_","_"
3,"samare","_","_","samara","NC","","_","_"
4,"śālvaṃ","_","_","śālva","NC","","_","_"
5,"saubhaṃ","_","_","saubha","NC","","_","_"
6,"nipātya","_","_","nipātay","CGDA","","_","_"
7,"ca","_","_","ca","CCD","","_","_"
1,"ānartān","_","_","ānarta","NC","","_","_"
2,"punar","_","_","punar","CAD","","_","_"
3,"āgamya","_","_","āga","CGDA","","_","_"
4,"suhṛdāṃ","_","_","suhṛd","NC","","_","_"
5,"prītim","_","_","prīti","NC","","_","_"
6,"āvaham","_","_","āvah","V","āvah","_","_"
1,"etasmāt","_","_","tad","PRD","","_","_"
2,"kāraṇād","_","_","kāraṇa","NC","","_","_"
3,"rājan","_","_","rājan","NC","","_","_"
4,"_","_","_","na","CNG","","_","_"
5,"_","_","_","ga","V","ga","_","_"
6,"nāgasāhvayam","_","_","nāgasāhvaya","NC","","_","_"
1,"yady","_","_","yadi","CSB","","_","_"
2,"agāṃ","_","_","gā","V","gā","_","_"
3,"_","_","_","para","PPX","","_","_"
4,"_","_","_","vīra","NC","","_","_"
5,"_","_","_","ghna","JJ","","_","_"
6,"na","_","_","na","CNG","","_","_"
7,"hi","_","_","hi","CX","","_","_"
8,"jīvet","_","_","jīv","V","jīv","_","_"
9,"suyodhanaḥ","_","_","suyodhana","NC","","_","_"
1,"vaiśampāyana","_","_","vaiśampāyana","NC","","_","_"
2,"uvāca","_","_","vak","V","vac","_","_"
1,"evam","_","_","eva","CX","","_","_"
2,"uktvā","_","_","vac","CGDA","","_","_"
3,"_","_","_","mahat","JJ","","_","_"
4,"_","_","_","bāhu","NC","","_","_"
5,"kauravaṃ","_","_","kaurava","NC","","_","_"
6,"puruṣottamaḥ","_","_","puruṣottama","NC","","_","_"
1,"āmantrya","_","_","āmantray","CGDA","","_","_"
2,"prayayau","_","_","prayā","V","prayā","_","_"
3,"dhīmān","_","_","dhīmat","JJ","","_","_"
4,"pāṇḍavān","_","_","pāṇḍava","NC","","_","_"
5,"madhusūdanaḥ","_","_","madhusūdana","NC","","_","_"
1,"abhivādya","_","_","abhivāday","CGDA","","_","_"
2,"_","_","_","mahat","JJ","","_","_"
3,"_","_","_","bāhu","NC","","_","_"
4,"dharmarājaṃ","_","_","dharmarāja","NC","","_","_"
5,"yudhiṣṭhiram","_","_","yudhiṣṭhira","NC","","_","_"
1,"rājñā","_","_","rājan","NC","","_","_"
2,"mūrdhany","_","_","mūrdhan","NC","","_","_"
3,"upāghrāto","_","_","upāghrā","PPP","","_","_"
4,"bhīmena","_","_","bhīma","NC","","_","_"
5,"ca","_","_","ca","CCD","","_","_"
6,"_","_","_","mahat","JJ","","_","_"
7,"_","_","_","bhuja","NC","","_","_"
1,"subhadrām","_","_","subhadrā","NC","","_","_"
2,"abhimanyuṃ","_","_","abhimanyu","NC","","_","_"
3,"ca","_","_","ca","CCD","","_","_"
4,"ratham","_","_","ratha","NC","","_","_"
5,"āropya","_","_","āropay","CGDA","","_","_"
6,"kāñcanam","_","_","kāñcana","JJ","","_","_"
1,"āruroha","_","_","āroh","V","āruh","_","_"
2,"rathaṃ","_","_","ratha","NC","","_","_"
3,"kṛṣṇaḥ","_","_","kṛṣṇa","NC","","_","_"
4,"pāṇḍavair","_","_","pāṇḍava","NC","","_","_"
5,"abhipūjitaḥ","_","_","abhipūjay","PPP","","_","_"
1,"_","_","_","sainya","NC","","_","_"
2,"_","_","_","sugrīva","NC","","_","_"
3,"_","_","_","yuj","PPP","","_","_"
4,"_","_","_","ratha","NC","","_","_"
5,"_","_","_","āditya","NC","","_","_"
6,"_","_","_","varcas","NC","","_","_"
1,"dvārakāṃ","_","_","dvārakā","NC","","_","_"
2,"prayayau","_","_","prayā","V","prayā","_","_"
3,"kṛṣṇaḥ","_","_","kṛṣṇa","NC","","_","_"
4,"samāśvāsya","_","_","samāśvāsay","CGDA","","_","_"
5,"yudhiṣṭhiram","_","_","yudhiṣṭhira","NC","","_","_"
1,"tataḥ","_","_","tatas","CX","","_","_"
2,"prayāte","_","_","prayā","PPP","","_","_"
3,"dāśārhe","_","_","dāśārha","NC","","_","_"
4,"dhṛṣṭadyumno","_","_","dhṛṣṭadyumna","NC","","_","_"
5,"'pi","_","_","api","CX","","_","_"
6,"pārṣataḥ","_","_","pārṣata","NC","","_","_"
1,"draupadeyān","_","_","draupadeya","NC","","_","_"
2,"upādāya","_","_","upādā","CGDA","","_","_"
3,"prayayau","_","_","prayā","V","prayā","_","_"
4,"_","_","_","sva","JJ","","_","_"
5,"_","_","_","pura","NC","","_","_"
6,"tadā","_","_","tadā","CAD","","_","_"
1,"dhṛṣṭaketuḥ","_","_","dhṛṣṭaketu","NC","","_","_"
2,"svasāraṃ","_","_","svasṛ","NC","","_","_"
3,"ca","_","_","ca","CCD","","_","_"
4,"_","_","_","samādā","CGDA","","_","_"
5,"_","_","_","atha","CAD","","_","_"
6,"_","_","_","cedi","NC","","_","_"
7,"_","_","_","rāj","NC","","_","_"
1,"jagāma","_","_","ga","V","ga","_","_"
2,"pāṇḍavān","_","_","pāṇḍava","NC","","_","_"
3,"dṛṣṭvā","_","_","dṛś","CGDA","","_","_"
4,"ramyāṃ","_","_","ramya","JJ","","_","_"
5,"śuktimatīṃ","_","_","śuktimatī","NC","","_","_"
6,"purīm","_","_","purī","NC","","_","_"
1,"_","_","_","kekaya","NC","","_","_"
2,"_","_","_","ca","CCD","","_","_"
3,"_","_","_","api","CX","","_","_"
4,"anujñātāḥ","_","_","anujñā","PPP","","_","_"
5,"_","_","_","kaunteya","NC","","_","_"
6,"_","_","_","amita","JJ","","_","_"
7,"_","_","_","ojas","NC","","_","_"
1,"āmantrya","_","_","āmantray","CGDA","","_","_"
2,"pāṇḍavān","_","_","pāṇḍava","NC","","_","_"
3,"sarvān","_","_","sarva","JQ","","_","_"
4,"prayayus","_","_","prayā","V","prayā","_","_"
5,"te","_","_","tad","PRD","","_","_"
6,"'pi","_","_","api","CX","","_","_"
7,"bhārata","_","_","bhārata","JJ","","_","_"
1,"brāhmaṇāś","_","_","brāhmaṇa","NC","","_","_"
2,"ca","_","_","ca","CCD","","_","_"
3,"viśaś","_","_","viś","NC","","_","_"
4,"_","_","_","ca","CCD","","_","_"
5,"_","_","_","eva","CEM","","_","_"
6,"tathā","_","_","tathā","CX","","_","_"
7,"_","_","_","viṣaya","NC","","_","_"
8,"_","_","_","vāsin","JJ","","_","_"
1,"visṛjyamānāḥ","_","_","visṛj","KDP","","_","_"
2,"_","_","_","su","CAD","","_","_"
3,"_","_","_","bhṛśa","CX","","_","_"
4,"na","_","_","na","CNG","","_","_"
5,"tyajanti","_","_","tyaj","V","tyaj","_","_"
6,"sma","_","_","sma","CX","","_","_"
7,"pāṇḍavān","_","_","pāṇḍava","NC","","_","_"
1,"samavāyaḥ","_","_","samavāya","NC","","_","_"
2,"sa","_","_","tad","PRD","","_","_"
3,"_","_","_","rājan","NC","","_","_"
4,"_","_","_","indra","NC","","_","_"
5,"_","_","_","su","CAD","","_","_"
6,"_","_","_","mahat","JJ","","_","_"
7,"_","_","_","adbhuta","JJ","","_","_"
8,"_","_","_","darśana","NC","","_","_"
1,"āsīn","_","_","as","V","as","_","_"
2,"mahātmanāṃ","_","_","mahātman","JJ","","_","_"
3,"teṣāṃ","_","_","tad","PRD","","_","_"
4,"kāmyake","_","_","kāmyaka","NC","","_","_"
5,"_","_","_","bharata","NC","","_","_"
6,"_","_","_","ṛṣabha","NC","","_","_"
1,"yudhiṣṭhiras","_","_","yudhiṣṭhira","NC","","_","_"
2,"tu","_","_","tu","CCD","","_","_"
3,"viprāṃs","_","_","vipra","NC","","_","_"
4,"tān","_","_","tad","PRD","","_","_"
5,"anumānya","_","_","anumānay","CGDA","","_","_"
6,"mahāmanāḥ","_","_","mahāmanas","JJ","","_","_"
1,"śaśāsa","_","_","śās","V","śās","_","_"
2,"puruṣān","_","_","puruṣa","NC","","_","_"
3,"kāle","_","_","kāla","NC","","_","_"
4,"rathān","_","_","ratha","NC","","_","_"
5,"_","_","_","yojay","V","yojay","_","_"
6,"_","_","_","iti","CQT","","_","_"
7,"ha","_","_","ha","CEM","","_","_"
