"WordID","word","NormSTEM","suffix","lemma","PoS","Root","NormSuffix","NormWord"
1,"_","_","_","atha","CAD","","_","_"
2,"_","_","_","atas","CX","","_","_"
3,"khuḍḍikāṃ","_","_","khuḍḍikā","NC","","_","_"
4,"garbhāvakrāntiṃ","_","_","garbhāvakrānti","NC","","_","_"
5,"śārīraṃ","_","_","śārīra","NC","","_","_"
6,"vyākhyāsyāmaḥ","_","_","vyākhyās","V","vyākhyā","_","_"
1,"iti","_","_","iti","CQT","","_","_"
2,"ha","_","_","ha","CEM","","_","_"
3,"_","_","_","sma","CX","","_","_"
4,"_","_","_","ah","V","ah","_","_"
5,"_","_","_","bhagavat","JJ","","_","_"
6,"_","_","_","ātreya","NC","","_","_"
1,"_","_","_","puruṣa","NC","","_","_"
2,"_","_","_","anupahata","JJ","","_","_"
3,"_","_","_","retas","NC","","_","_"
4,"_","_","_","strī","NC","","_","_"
5,"_","_","_","ca","CCD","","_","_"
6,"a","_","_","alpha_privativum","JJ","","_","_"
6,"_","_","_","praduṣṭa","JJ","","_","_"
7,"_","_","_","yoni","NC","","_","_"
8,"_","_","_","śoṇita","NC","","_","_"
9,"_","_","_","garbhāśaya","NC","","_","_"
10,"yadā","_","_","yadā","CSB","","_","_"
11,"bhavati","_","_","bhav","V","bhū","_","_"
12,"saṃsargaḥ","_","_","saṃsarga","NC","","_","_"
13,"_","_","_","ṛtu","NC","","_","_"
14,"_","_","_","kāla","NC","","_","_"
15,"yadā","_","_","yadā","CSB","","_","_"
16,"_","_","_","ca","CCD","","_","_"
17,"_","_","_","ida","PRD","","_","_"
18,"_","_","_","tathā","CX","","_","_"
19,"_","_","_","yuj","PPP","","_","_"
20,"saṃsarge","_","_","saṃsarga","NC","","_","_"
21,"_","_","_","śukra","NC","","_","_"
22,"_","_","_","śoṇita","NC","","_","_"
23,"_","_","_","saṃsarga","NC","","_","_"
24,"_","_","_","antar","CAD","","_","_"
25,"_","_","_","garbhāśaya","NC","","_","_"
26,"_","_","_","ga","PPP","","_","_"
27,"jīvo","_","_","jīva","NC","","_","_"
28,"'vakrāmati","_","_","avakra","V","avakra","_","_"
29,"_","_","_","sattva","NC","","_","_"
30,"_","_","_","saṃprayoga","NC","","_","_"
31,"_","_","_","tadā","CAD","","_","_"
32,"garbho","_","_","garbha","NC","","_","_"
33,"'bhinirvartate","_","_","abhinirvart","V","abhinirvṛt","_","_"
34,"sa","_","_","tad","PRD","","_","_"
35,"_","_","_","sātmya","JJ","","_","_"
36,"_","_","_","rasa","NC","","_","_"
37,"_","_","_","upayoga","NC","","_","_"
38,"_","_","_","aroga","JJ","","_","_"
39,"'bhivardhate","_","_","abhivṛdh","V","abhivṛdh","_","_"
40,"_","_","_","samyak","CX","","_","_"
41,"_","_","_","upacāra","NC","","_","_"
42,"_","_","_","ca","CCD","","_","_"
43,"_","_","_","upacar","KDP","","_","_"
44,"tataḥ","_","_","tatas","CX","","_","_"
45,"_","_","_","prāp","PPP","","_","_"
46,"_","_","_","kāla","NC","","_","_"
47,"_","_","_","sarva","JQ","","_","_"
48,"_","_","_","indriya","NC","","_","_"
49,"_","_","_","upapad","PPP","","_","_"
50,"_","_","_","paripṛ","PPP","","_","_"
51,"_","_","_","śarīra","NC","","_","_"
52,"_","_","_","bala","NC","","_","_"
53,"_","_","_","varṇa","NC","","_","_"
54,"_","_","_","sattva","NC","","_","_"
55,"_","_","_","saṃhanana","NC","","_","_"
56,"_","_","_","sampad","NC","","_","_"
57,"_","_","_","upe","PPP","","_","_"
58,"sukhena","_","_","sukha","CX","","_","_"
59,"jāyate","_","_","jan","V","jan","_","_"
60,"_","_","_","samudaya","NC","","_","_"
61,"_","_","_","ida","PRD","","_","_"
62,"bhāvānāṃ","_","_","bhāva","NC","","_","_"
63,"_","_","_","mātṛ","NC","","_","_"
64,"_","_","_","ja","JJ","","_","_"
65,"_","_","_","ca","CCD","","_","_"
66,"_","_","_","ida","PRD","","_","_"
67,"garbhaḥ","_","_","garbha","NC","","_","_"
68,"_","_","_","pitṛ","NC","","_","_"
69,"_","_","_","ja","JJ","","_","_"
70,"_","_","_","ca","CCD","","_","_"
71,"_","_","_","ātman","NC","","_","_"
72,"_","_","_","ja","JJ","","_","_"
73,"_","_","_","ca","CCD","","_","_"
74,"_","_","_","sātmya","NC","","_","_"
75,"_","_","_","ja","JJ","","_","_"
76,"_","_","_","ca","CCD","","_","_"
77,"_","_","_","rasa","NC","","_","_"
78,"_","_","_","ja","JJ","","_","_"
79,"_","_","_","ca","CCD","","_","_"
80,"asti","_","_","as","V","as","_","_"
81,"ca","_","_","ca","CCD","","_","_"
82,"khalu","_","_","khalu","CX","","_","_"
83,"_","_","_","sattva","NC","","_","_"
84,"_","_","_","aupapāduka","JJ","","_","_"
85,"_","_","_","iti","CQT","","_","_"
86,"_","_","_","ha","CEM","","_","_"
87,"_","_","_","vak","V","vac","_","_"
88,"_","_","_","bhagavat","JJ","","_","_"
89,"_","_","_","ātreya","NC","","_","_"
1,"_","_","_","na","CNG","","_","_"
2,"_","_","_","iti","CQT","","_","_"
3,"bharadvājaḥ","_","_","bharadvāja","NC","","_","_"
4,"kiṃ","_","_","kiṃ","PRQ","","_","_"
5,"kāraṇaṃ","_","_","kāraṇa","NC","","_","_"
6,"na","_","_","na","CNG","","_","_"
7,"hi","_","_","hi","CX","","_","_"
8,"mātā","_","_","mātṛ","NC","","_","_"
9,"na","_","_","na","CNG","","_","_"
10,"pitā","_","_","pitṛ","NC","","_","_"
11,"_","_","_","na","CNG","","_","_"
12,"_","_","_","ātman","NC","","_","_"
13,"na","_","_","na","CNG","","_","_"
14,"sātmyaṃ","_","_","sātmya","NC","","_","_"
15,"na","_","_","na","CNG","","_","_"
16,"_","_","_","pāna","NC","","_","_"
17,"_","_","_","aśana","NC","","_","_"
18,"_","_","_","bhakṣya","NC","","_","_"
19,"_","_","_","lehya","NC","","_","_"
20,"_","_","_","upayoga","NC","","_","_"
21,"garbhaṃ","_","_","garbha","NC","","_","_"
22,"janayanti","_","_","jan","V","jan","_","_"
23,"na","_","_","na","CNG","","_","_"
24,"ca","_","_","ca","CCD","","_","_"
25,"_","_","_","para","PPX","","_","_"
26,"_","_","_","loka","NC","","_","_"
27,"_","_","_","e","CGDA","","_","_"
28,"garbhaṃ","_","_","garbha","NC","","_","_"
29,"_","_","_","sattva","NC","","_","_"
30,"_","_","_","avakra","V","avakra","_","_"
1,"yadi","_","_","yadi","CSB","","_","_"
2,"hi","_","_","hi","CX","","_","_"
3,"_","_","_","mātā","NC","","_","_"
4,"_","_","_","pitṛ","NC","","_","_"
5,"garbhaṃ","_","_","garbha","NC","","_","_"
6,"janayetāṃ","_","_","janay","V","janay","_","_"
7,"bhūyasyaḥ","_","_","bhūyas","JJ","","_","_"
8,"striyaḥ","_","_","strī","NC","","_","_"
9,"_","_","_","puṃs","NC","","_","_"
10,"_","_","_","ca","CCD","","_","_"
11,"bhūyāṃsaḥ","_","_","bhūyas","JJ","","_","_"
12,"_","_","_","putra","NC","","_","_"
13,"_","_","_","kāma","NC","","_","_"
14,"te","_","_","tad","PRD","","_","_"
15,"sarve","_","_","sarva","JQ","","_","_"
16,"_","_","_","putra","NC","","_","_"
17,"_","_","_","janman","NC","","_","_"
18,"_","_","_","abhisaṃdhā","CGDA","","_","_"
19,"_","_","_","maithuna","NC","","_","_"
20,"_","_","_","dharma","NC","","_","_"
21,"_","_","_","āpad","KDP","","_","_"
22,"_","_","_","putra","NC","","_","_"
23,"_","_","_","eva","CEM","","_","_"
24,"janayeyur","_","_","janay","V","janay","_","_"
25,"duhitṝr","_","_","duhitṛ","NC","","_","_"
26,"vā","_","_","vā","CCD","","_","_"
27,"_","_","_","duhitṛ","NC","","_","_"
28,"_","_","_","kāma","NC","","_","_"
29,"na","_","_","na","CNG","","_","_"
30,"tu","_","_","tu","CCD","","_","_"
31,"kāścit","_","_","kiṃcit","PRI","","_","_"
32,"striyaḥ","_","_","strī","NC","","_","_"
33,"_","_","_","kiṃcit","PRI","","_","_"
34,"_","_","_","vā","CCD","","_","_"
35,"puruṣā","_","_","puruṣa","NC","","_","_"
36,"nirapatyāḥ","_","_","nirapatya","JJ","","_","_"
37,"_","_","_","as","V","as","_","_"
38,"_","_","_","apatya","NC","","_","_"
39,"_","_","_","kāma","NC","","_","_"
40,"vā","_","_","vā","CCD","","_","_"
1,"na","_","_","na","CNG","","_","_"
2,"_","_","_","ca","CCD","","_","_"
3,"_","_","_","ātman","NC","","_","_"
4,"_","_","_","ātman","NC","","_","_"
5,"janayati","_","_","jan","V","jan","_","_"
1,"yadi","_","_","yadi","CSB","","_","_"
2,"_","_","_","hi","CX","","_","_"
3,"_","_","_","ātman","NC","","_","_"
4,"_","_","_","ātman","NC","","_","_"
5,"_","_","_","janay","V","janay","_","_"
6,"_","_","_","jan","PPP","","_","_"
7,"vā","_","_","vā","CCD","","_","_"
8,"janayed","_","_","jan","V","jan","_","_"
9,"ātmānam","_","_","ātman","NC","","_","_"
10,"ajāto","_","_","ajāta","JJ","","_","_"
11,"vā","_","_","vā","CCD","","_","_"
12,"_","_","_","tad","PRD","","_","_"
13,"_","_","_","ca","CCD","","_","_"
14,"_","_","_","ubhayathā","CX","","_","_"
15,"_","_","_","api","CX","","_","_"
16,"_","_","_","ayukta","JJ","","_","_"
1,"na","_","_","na","CNG","","_","_"
2,"hi","_","_","hi","CX","","_","_"
3,"jāto","_","_","jan","PPP","","_","_"
4,"janayati","_","_","jan","V","jan","_","_"
5,"sattvāt","_","_","sattva","NC","","_","_"
6,"na","_","_","na","CNG","","_","_"
7,"_","_","_","ca","CCD","","_","_"
8,"_","_","_","ajāta","JJ","","_","_"
9,"_","_","_","janay","V","janay","_","_"
10,"_","_","_","asattva","NC","","_","_"
11,"_","_","_","tasmāt","CX","","_","_"
12,"_","_","_","ubhayathā","CX","","_","_"
13,"_","_","_","api","CX","","_","_"
14,"_","_","_","anupapatti","NC","","_","_"
1,"tiṣṭhatu","_","_","tiṣṭh","V","sthā","_","_"
2,"_","_","_","tāvat","CX","","_","_"
3,"_","_","_","tad","PRD","","_","_"
1,"_","_","_","yadi","CSB","","_","_"
2,"_","_","_","ida","PRD","","_","_"
3,"_","_","_","ātman","NC","","_","_"
4,"_","_","_","ātman","NC","","_","_"
5,"śakto","_","_","śak","PPP","","_","_"
6,"janayituṃ","_","_","janay","CGDI","","_","_"
7,"syāt","_","_","as","V","as","_","_"
8,"na","_","_","na","CNG","","_","_"
9,"_","_","_","tu","CCD","","_","_"
10,"_","_","_","a","PRD","","_","_"
11,"_","_","_","iṣ","PPP","","_","_"
12,"_","_","_","eva","CEM","","_","_"
13,"kathaṃ","_","_","katha","CX","","_","_"
14,"yoniṣu","_","_","yoni","NC","","_","_"
15,"_","_","_","janay","V","janay","_","_"
16,"_","_","_","vaśin","JJ","","_","_"
17,"_","_","_","apratihata","JJ","","_","_"
18,"_","_","_","gati","NC","","_","_"
19,"kāmarūpiṇaṃ","_","_","kāmarūpin","JJ","","_","_"
20,"_","_","_","tejas","NC","","_","_"
21,"_","_","_","bala","NC","","_","_"
22,"_","_","_","java","NC","","_","_"
23,"_","_","_","varṇa","NC","","_","_"
24,"_","_","_","sattva","NC","","_","_"
25,"_","_","_","saṃhanana","NC","","_","_"
26,"_","_","_","samudi","PPP","","_","_"
27,"ajaram","_","_","ajara","JJ","","_","_"
28,"a","_","_","alpha_privativum","JJ","","_","_"
28,"arujam","_","_","ruj","JJ","","_","_"
29,"amaram","_","_","amara","JJ","","_","_"
30,"evaṃvidhaṃ","_","_","evaṃvidha","JJ","","_","_"
31,"_","_","_","hi","CX","","_","_"
32,"_","_","_","ātman","NC","","_","_"
33,"_","_","_","ātman","NC","","_","_"
34,"_","_","_","iṣ","V","iṣ","_","_"
35,"_","_","_","atas","CX","","_","_"
36,"vā","_","_","vā","CCD","","_","_"
37,"bhūyaḥ","_","_","bhūyas","CX","","_","_"
1,"_","_","_","asātmya","NC","","_","_"
2,"_","_","_","ja","JJ","","_","_"
3,"_","_","_","ca","CCD","","_","_"
4,"_","_","_","ida","PRD","","_","_"
5,"garbhaḥ","_","_","garbha","NC","","_","_"
1,"yadi","_","_","yadi","CSB","","_","_"
2,"hi","_","_","hi","CX","","_","_"
3,"_","_","_","sātmya","NC","","_","_"
4,"_","_","_","ja","JJ","","_","_"
5,"syāt","_","_","as","V","as","_","_"
6,"tarhi","_","_","tarhi","CX","","_","_"
7,"_","_","_","sātmya","NC","","_","_"
8,"_","_","_","sevin","JJ","","_","_"
9,"_","_","_","eva","CEM","","_","_"
10,"_","_","_","ekānta","CX","","_","_"
11,"prajā","_","_","prajā","NC","","_","_"
12,"syāt","_","_","as","V","as","_","_"
13,"_","_","_","asātmya","NC","","_","_"
14,"_","_","_","sevin","JJ","","_","_"
15,"_","_","_","ca","CCD","","_","_"
16,"_","_","_","nikhila","CX","","_","_"
17,"_","_","_","anapatya","JJ","","_","_"
18,"syuḥ","_","_","as","V","as","_","_"
19,"_","_","_","tad","PRD","","_","_"
20,"_","_","_","ca","CCD","","_","_"
21,"_","_","_","ubhaya","JJ","","_","_"
22,"_","_","_","ubhayatra","CX","","_","_"
23,"_","_","_","eva","CEM","","_","_"
24,"dṛśyate","_","_","darś","V","dṛś","_","_"
1,"_","_","_","arasa","NC","","_","_"
2,"_","_","_","ja","JJ","","_","_"
3,"_","_","_","ca","CCD","","_","_"
4,"_","_","_","ida","PRD","","_","_"
5,"garbhaḥ","_","_","garbha","NC","","_","_"
1,"yadi","_","_","yadi","CSB","","_","_"
2,"hi","_","_","hi","CX","","_","_"
3,"_","_","_","rasa","NC","","_","_"
4,"_","_","_","ja","JJ","","_","_"
5,"syāt","_","_","as","V","as","_","_"
6,"na","_","_","na","CNG","","_","_"
7,"kecit","_","_","kiṃcit","PRI","","_","_"
8,"_","_","_","strī","NC","","_","_"
9,"_","_","_","puruṣa","NC","","_","_"
10,"_","_","_","anapatya","JJ","","_","_"
11,"syuḥ","_","_","as","V","as","_","_"
12,"na","_","_","na","CNG","","_","_"
13,"hi","_","_","hi","CX","","_","_"
14,"_","_","_","kiṃcit","PRI","","_","_"
15,"_","_","_","as","V","as","_","_"
16,"_","_","_","ida","PRD","","_","_"
17,"yo","_","_","yad","PRL","","_","_"
18,"_","_","_","rasa","NC","","_","_"
19,"_","_","_","na","CNG","","_","_"
20,"_","_","_","upayuj","V","upayuj","_","_"
21,"_","_","_","śreṣṭha","JJ","","_","_"
22,"_","_","_","rasa","NC","","_","_"
23,"_","_","_","upayogin","JJ","","_","_"
24,"_","_","_","ced","CX","","_","_"
25,"_","_","_","garbha","NC","","_","_"
26,"jāyanta","_","_","jan","V","jan","_","_"
27,"_","_","_","iti","CQT","","_","_"
28,"_","_","_","abhipre","PPP","","_","_"
29,"_","_","_","iti","CQT","","_","_"
30,"evaṃ","_","_","eva","CX","","_","_"
31,"saty","_","_","as","KDP","","_","_"
32,"_","_","_","āja","JJ","","_","_"
33,"_","_","_","aurabhra","JJ","","_","_"
34,"_","_","_","mārga","JJ","","_","_"
35,"_","_","_","māyūra","JJ","","_","_"
36,"_","_","_","go","CX","","_","_"
37,"_","_","_","kṣīra","NC","","_","_"
38,"_","_","_","dadhi","NC","","_","_"
39,"_","_","_","ghṛta","NC","","_","_"
40,"_","_","_","madhu","NC","","_","_"
41,"_","_","_","taila","NC","","_","_"
42,"_","_","_","saindhava","NC","","_","_"
43,"_","_","_","ikṣu","NC","","_","_"
44,"_","_","_","rasa","NC","","_","_"
45,"_","_","_","mudga","NC","","_","_"
46,"_","_","_","śāli","NC","","_","_"
47,"_","_","_","bhṛ","PPP","","_","_"
48,"_","_","_","eva","CEM","","_","_"
49,"_","_","_","ekānta","CX","","_","_"
50,"prajā","_","_","prajā","NC","","_","_"
51,"syāt","_","_","as","V","as","_","_"
52,"_","_","_","śyāmāka","NC","","_","_"
53,"_","_","_","varaka","NC","","_","_"
54,"_","_","_","uddālaka","NC","","_","_"
55,"_","_","_","koradūṣaka","NC","","_","_"
56,"_","_","_","kanda","NC","","_","_"
57,"_","_","_","mūla","NC","","_","_"
58,"_","_","_","bhakṣa","NC","","_","_"
59,"_","_","_","ca","CCD","","_","_"
60,"_","_","_","nikhila","CX","","_","_"
61,"_","_","_","anapatya","JJ","","_","_"
62,"syuḥ","_","_","as","V","as","_","_"
63,"_","_","_","tad","PRD","","_","_"
64,"_","_","_","ca","CCD","","_","_"
65,"_","_","_","ubhaya","JJ","","_","_"
66,"_","_","_","ubhayatra","CX","","_","_"
67,"dṛśyate","_","_","darś","V","dṛś","_","_"
1,"na","_","_","na","CNG","","_","_"
2,"_","_","_","khalu","CX","","_","_"
3,"_","_","_","api","CX","","_","_"
4,"_","_","_","para","PPX","","_","_"
5,"_","_","_","loka","NC","","_","_"
6,"_","_","_","e","CGDA","","_","_"
7,"sattvaṃ","_","_","sattva","NC","","_","_"
8,"_","_","_","garbha","NC","","_","_"
9,"_","_","_","avakra","V","avakra","_","_"
10,"yadi","_","_","yadi","CSB","","_","_"
11,"_","_","_","hi","CX","","_","_"
12,"_","_","_","a","PRD","","_","_"
13,"_","_","_","avakra","V","avakra","_","_"
14,"_","_","_","na","CNG","","_","_"
15,"_","_","_","ida","PRD","","_","_"
16,"kiṃcit","_","_","kiṃcit","PRI","","_","_"
17,"paurvadehikaṃ","_","_","paurvadehika","JJ","","_","_"
18,"_","_","_","as","V","as","_","_"
19,"_","_","_","avidita","JJ","","_","_"
20,"_","_","_","aśruta","JJ","","_","_"
21,"a","_","_","alpha_privativum","JJ","","_","_"
21,"_","_","_","dṛṣṭa","JJ","","_","_"
22,"vā","_","_","vā","CCD","","_","_"
23,"sa","_","_","tad","PRD","","_","_"
24,"ca","_","_","ca","CCD","","_","_"
25,"_","_","_","tad","PRD","","_","_"
26,"_","_","_","ca","CCD","","_","_"
27,"na","_","_","na","CNG","","_","_"
28,"_","_","_","kiṃcit","PRI","","_","_"
29,"_","_","_","api","CX","","_","_"
30,"smarati","_","_","smar","V","smṛ","_","_"
1,"tasmād","_","_","tasmāt","CX","","_","_"
2,"etad","_","_","tad","PRD","","_","_"
3,"brūmahe","_","_","abravīta","V","brū","_","_"
4,"a","_","_","alpha_privativum","NC","","_","_"
4,"_","_","_","mātṛ","NC","","_","_"
5,"_","_","_","ja","JJ","","_","_"
6,"_","_","_","ca","CCD","","_","_"
7,"_","_","_","ida","PRD","","_","_"
8,"garbho","_","_","garbha","NC","","_","_"
9,"a","_","_","alpha_privativum","NC","","_","_"
9,"_","_","_","pitṛ","NC","","_","_"
10,"_","_","_","ja","JJ","","_","_"
11,"_","_","_","ca","CCD","","_","_"
12,"_","_","_","anātman","NC","","_","_"
13,"_","_","_","ja","JJ","","_","_"
14,"_","_","_","ca","CCD","","_","_"
15,"_","_","_","asātmya","NC","","_","_"
16,"_","_","_","ja","JJ","","_","_"
17,"_","_","_","ca","CCD","","_","_"
18,"_","_","_","arasa","NC","","_","_"
19,"_","_","_","ja","JJ","","_","_"
20,"_","_","_","ca","CCD","","_","_"
21,"na","_","_","na","CNG","","_","_"
22,"_","_","_","ca","CCD","","_","_"
23,"_","_","_","as","V","as","_","_"
24,"_","_","_","sattva","NC","","_","_"
25,"_","_","_","aupapāduka","JJ","","_","_"
26,"_","_","_","iti","CQT","","_","_"
1,"_","_","_","na","CNG","","_","_"
2,"_","_","_","iti","CQT","","_","_"
3,"_","_","_","bhagavat","JJ","","_","_"
4,"_","_","_","ātreya","NC","","_","_"
5,"sarvebhya","_","_","sarva","JQ","","_","_"
6,"ebhyo","_","_","ida","PRD","","_","_"
7,"bhāvebhyaḥ","_","_","bhāva","NC","","_","_"
8,"samuditebhyo","_","_","samudi","PPP","","_","_"
9,"garbho","_","_","garbha","NC","","_","_"
10,"'bhinirvartate","_","_","abhinirvart","V","abhinirvṛt","_","_"
1,"_","_","_","mātṛ","NC","","_","_"
2,"_","_","_","ja","JJ","","_","_"
3,"_","_","_","ca","CCD","","_","_"
4,"_","_","_","ida","PRD","","_","_"
5,"garbhaḥ","_","_","garbha","NC","","_","_"
1,"na","_","_","na","CNG","","_","_"
2,"hi","_","_","hi","CX","","_","_"
3,"_","_","_","mātṛ","NC","","_","_"
4,"_","_","_","vinā","CX","","_","_"
5,"_","_","_","garbha","NC","","_","_"
6,"_","_","_","utpatti","NC","","_","_"
7,"syāt","_","_","as","V","as","_","_"
8,"na","_","_","na","CNG","","_","_"
9,"ca","_","_","ca","CCD","","_","_"
10,"janma","_","_","janman","NC","","_","_"
11,"_","_","_","jarāyu","NC","","_","_"
12,"_","_","_","ja","JJ","","_","_"
1,"yāni","_","_","yad","PRL","","_","_"
2,"_","_","_","khalu","CX","","_","_"
3,"_","_","_","ida","PRD","","_","_"
4,"garbhasya","_","_","garbha","NC","","_","_"
5,"_","_","_","mātṛ","NC","","_","_"
6,"_","_","_","ja","JJ","","_","_"
7,"yāni","_","_","yad","PRL","","_","_"
8,"_","_","_","ca","CCD","","_","_"
9,"_","_","_","ida","PRD","","_","_"
10,"mātṛtaḥ","_","_","mātṛ","NC","","_","_"
11,"sambhavataḥ","_","_","sambhū","KDP","","_","_"
12,"sambhavanti","_","_","sambhav","V","sambhū","_","_"
13,"_","_","_","tad","PRD","","_","_"
14,"_","_","_","anuvyākhyā","V","anuvyākhyā","_","_"
15,"tad","_","_","tad","PRD","","_","_"
16,"yathā","_","_","yathā","CCM","","_","_"
17,"tvak","_","_","tvac","NC","","_","_"
18,"ca","_","_","ca","CCD","","_","_"
19,"lohitaṃ","_","_","lohita","NC","","_","_"
20,"ca","_","_","ca","CCD","","_","_"
21,"māṃsaṃ","_","_","māṃsa","NC","","_","_"
22,"ca","_","_","ca","CCD","","_","_"
23,"_","_","_","medas","NC","","_","_"
24,"_","_","_","ca","CCD","","_","_"
25,"_","_","_","nābhi","NC","","_","_"
26,"_","_","_","ca","CCD","","_","_"
27,"hṛdayaṃ","_","_","hṛdaya","NC","","_","_"
28,"ca","_","_","ca","CCD","","_","_"
29,"kloma","_","_","kloman","NC","","_","_"
30,"ca","_","_","ca","CCD","","_","_"
31,"_","_","_","yakṛt","NC","","_","_"
32,"_","_","_","ca","CCD","","_","_"
33,"plīhā","_","_","plīhan","NC","","_","_"
34,"ca","_","_","ca","CCD","","_","_"
35,"vṛkkau","_","_","vṛkka","NC","","_","_"
36,"ca","_","_","ca","CCD","","_","_"
37,"_","_","_","vasti","NC","","_","_"
38,"_","_","_","ca","CCD","","_","_"
39,"purīṣādhānaṃ","_","_","purīṣādhāna","NC","","_","_"
40,"_","_","_","ca","CCD","","_","_"
41,"_","_","_","āmāśaya","NC","","_","_"
42,"_","_","_","ca","CCD","","_","_"
43,"_","_","_","pakvāśaya","NC","","_","_"
44,"_","_","_","ca","CCD","","_","_"
45,"_","_","_","uttaraguda","NC","","_","_"
46,"_","_","_","ca","CCD","","_","_"
47,"_","_","_","adharaguda","NC","","_","_"
48,"ca","_","_","ca","CCD","","_","_"
49,"kṣudrāntraṃ","_","_","kṣudrāntra","NC","","_","_"
50,"ca","_","_","ca","CCD","","_","_"
51,"sthūlāntraṃ","_","_","sthūlāntra","NC","","_","_"
52,"ca","_","_","ca","CCD","","_","_"
53,"vapā","_","_","vapā","NC","","_","_"
54,"ca","_","_","ca","CCD","","_","_"
55,"vapāvahanaṃ","_","_","vapāvahana","NC","","_","_"
56,"_","_","_","ca","CCD","","_","_"
57,"_","_","_","iti","CQT","","_","_"
1,"_","_","_","pitṛ","NC","","_","_"
2,"_","_","_","ja","JJ","","_","_"
3,"_","_","_","ca","CCD","","_","_"
4,"_","_","_","ida","PRD","","_","_"
5,"garbhaḥ","_","_","garbha","NC","","_","_"
1,"_","_","_","na","CNG","","_","_"
2,"_","_","_","hi","CX","","_","_"
3,"_","_","_","pitṛ","NC","","_","_"
4,"_","_","_","ṛte","CX","","_","_"
5,"_","_","_","garbha","NC","","_","_"
6,"_","_","_","utpatti","NC","","_","_"
7,"syāt","_","_","as","V","as","_","_"
8,"na","_","_","na","CNG","","_","_"
9,"ca","_","_","ca","CCD","","_","_"
10,"janma","_","_","janman","NC","","_","_"
11,"_","_","_","jarāyu","NC","","_","_"
12,"_","_","_","ja","JJ","","_","_"
1,"yāni","_","_","yad","PRL","","_","_"
2,"_","_","_","khalu","CX","","_","_"
3,"_","_","_","ida","PRD","","_","_"
4,"garbhasya","_","_","garbha","NC","","_","_"
5,"_","_","_","pitṛ","NC","","_","_"
6,"_","_","_","ja","JJ","","_","_"
7,"yāni","_","_","yad","PRL","","_","_"
8,"_","_","_","ca","CCD","","_","_"
9,"_","_","_","ida","PRD","","_","_"
10,"pitṛtaḥ","_","_","pitṛ","NC","","_","_"
11,"sambhavataḥ","_","_","sambhū","KDP","","_","_"
12,"sambhavanti","_","_","sambhav","V","sambhū","_","_"
13,"_","_","_","tad","PRD","","_","_"
14,"_","_","_","anuvyākhyā","V","anuvyākhyā","_","_"
15,"tad","_","_","tad","PRD","","_","_"
16,"yathā","_","_","yathā","CCM","","_","_"
17,"_","_","_","keśa","NC","","_","_"
18,"_","_","_","śmaśru","NC","","_","_"
19,"_","_","_","nakha","NC","","_","_"
20,"_","_","_","loman","NC","","_","_"
21,"_","_","_","danta","NC","","_","_"
22,"_","_","_","asthi","NC","","_","_"
23,"_","_","_","sirā","NC","","_","_"
24,"_","_","_","snāyu","NC","","_","_"
25,"_","_","_","dhamani","NC","","_","_"
26,"śukraṃ","_","_","śukra","NC","","_","_"
27,"_","_","_","ca","CCD","","_","_"
28,"_","_","_","iti","CQT","","_","_"
1,"_","_","_","ātman","NC","","_","_"
2,"_","_","_","ja","JJ","","_","_"
3,"_","_","_","ca","CCD","","_","_"
4,"_","_","_","ida","PRD","","_","_"
5,"garbhaḥ","_","_","garbha","NC","","_","_"
1,"_","_","_","garbha","NC","","_","_"
2,"_","_","_","ātman","NC","","_","_"
3,"_","_","_","hi","CX","","_","_"
4,"_","_","_","antarātman","NC","","_","_"
5,"yaḥ","_","_","yad","PRL","","_","_"
6,"taṃ","_","_","tad","PRD","","_","_"
7,"jīva","_","_","jīva","NC","","_","_"
8,"_","_","_","iti","CQT","","_","_"
9,"_","_","_","ācakṣ","V","ācakṣ","_","_"
10,"śāśvatam","_","_","śāśvata","JJ","","_","_"
11,"a","_","_","alpha_privativum","JJ","","_","_"
11,"arujam","_","_","ruj","JJ","","_","_"
12,"ajaram","_","_","ajara","JJ","","_","_"
13,"amaram","_","_","amara","JJ","","_","_"
14,"akṣayam","_","_","akṣaya","JJ","","_","_"
15,"abhedyam","_","_","abhedya","JJ","","_","_"
16,"a","_","_","alpha_privativum","JJ","","_","_"
17,"a","_","_","alpha_privativum","JJ","","_","_"
17,"aloḍyaṃ","_","_","loḍya","JJ","","_","_"
18,"_","_","_","viśva","JQ","","_","_"
19,"_","_","_","rūpa","NC","","_","_"
20,"_","_","_","viśva","JQ","","_","_"
21,"_","_","_","karman","NC","","_","_"
22,"avyaktam","_","_","avyakta","JJ","","_","_"
23,"anādim","_","_","anādi","JJ","","_","_"
24,"a","_","_","alpha_privativum","JJ","","_","_"
24,"anidhanam","_","_","nidhana","JJ","","_","_"
25,"akṣaram","_","_","akṣara","JJ","","_","_"
26,"api","_","_","api","CX","","_","_"
1,"sa","_","_","tad","PRD","","_","_"
2,"_","_","_","garbhāśaya","NC","","_","_"
3,"_","_","_","anupraviś","CGDA","","_","_"
4,"_","_","_","śukra","NC","","_","_"
5,"_","_","_","śoṇita","NC","","_","_"
6,"_","_","_","saṃyoga","NC","","_","_"
7,"_","_","_","e","CGDA","","_","_"
8,"_","_","_","garbha","NC","","_","_"
10,"_","_","_","janay","V","janay","_","_"
11,"_","_","_","ātman","NC","","_","_"
12,"_","_","_","ātman","NC","","_","_"
13,"_","_","_","ātman","NC","","_","_"
14,"_","_","_","saṃjñā","NC","","_","_"
15,"hi","_","_","hi","CX","","_","_"
16,"garbhe","_","_","garbha","NC","","_","_"
1,"tasya","_","_","tad","PRD","","_","_"
2,"_","_","_","punar","CAD","","_","_"
3,"_","_","_","ātman","NC","","_","_"
4,"_","_","_","janman","NC","","_","_"
5,"_","_","_","anādi","JJ","","_","_"
7,"_","_","_","na","CNG","","_","_"
8,"_","_","_","upapad","V","upapad","_","_"
9,"_","_","_","tasmāt","CX","","_","_"
10,"_","_","_","na","CNG","","_","_"
11,"jāta","_","_","jan","PPP","","_","_"
12,"_","_","_","eva","CEM","","_","_"
13,"_","_","_","ida","PRD","","_","_"
14,"_","_","_","ajāta","JJ","","_","_"
15,"garbhaṃ","_","_","garbha","NC","","_","_"
16,"janayati","_","_","jan","V","jan","_","_"
17,"ajāto","_","_","ajāta","JJ","","_","_"
18,"_","_","_","hi","CX","","_","_"
19,"_","_","_","ida","PRD","","_","_"
20,"_","_","_","ajāta","JJ","","_","_"
21,"garbhaṃ","_","_","garbha","NC","","_","_"
22,"janayati","_","_","jan","V","jan","_","_"
23,"sa","_","_","tad","PRD","","_","_"
24,"_","_","_","ca","CCD","","_","_"
25,"_","_","_","eva","CEM","","_","_"
26,"garbhaḥ","_","_","garbha","NC","","_","_"
27,"_","_","_","kāla","NC","","_","_"
28,"_","_","_","antara","NC","","_","_"
29,"_","_","_","bāla","JJ","","_","_"
30,"_","_","_","yuvan","JJ","","_","_"
31,"_","_","_","sthavira","JJ","","_","_"
32,"_","_","_","bhāva","NC","","_","_"
33,"prāpnoti","_","_","prāpn","V","prāp","_","_"
34,"sa","_","_","tad","PRD","","_","_"
35,"yasyāṃ","_","_","yad","PRL","","_","_"
36,"_","_","_","yad","PRL","","_","_"
37,"_","_","_","avasthā","NC","","_","_"
38,"vartate","_","_","vart","V","vṛt","_","_"
39,"tasyāṃ","_","_","tad","PRD","","_","_"
40,"tasyāṃ","_","_","tad","PRD","","_","_"
41,"jāto","_","_","jan","PPP","","_","_"
42,"bhavati","_","_","bhav","V","bhū","_","_"
43,"yā","_","_","yad","PRL","","_","_"
44,"_","_","_","tu","CCD","","_","_"
45,"_","_","_","ida","PRD","","_","_"
46,"puraskṛtā","_","_","puraskṛ","PPP","","_","_"
47,"tasyāṃ","_","_","tad","PRD","","_","_"
48,"_","_","_","jan","KDP","","_","_"
49,"_","_","_","ca","CCD","","_","_"
50,"tasmāt","_","_","tasmāt","CX","","_","_"
51,"sa","_","_","tad","PRD","","_","_"
52,"eva","_","_","eva","CEM","","_","_"
53,"_","_","_","jan","PPP","","_","_"
54,"_","_","_","ca","CCD","","_","_"
55,"_","_","_","ajāta","JJ","","_","_"
56,"_","_","_","ca","CCD","","_","_"
57,"_","_","_","yugapad","CX","","_","_"
58,"_","_","_","bhav","V","bhū","_","_"
59,"_","_","_","yad","PRL","","_","_"
60,"_","_","_","ca","CCD","","_","_"
61,"_","_","_","tad","PRD","","_","_"
62,"_","_","_","ubhaya","JJ","","_","_"
63,"sambhavati","_","_","sambhav","V","sambhū","_","_"
64,"_","_","_","jan","PPP","","_","_"
66,"_","_","_","jan","KDP","","_","_"
68,"ca","_","_","ca","CCD","","_","_"
69,"sa","_","_","tad","PRD","","_","_"
70,"jāto","_","_","jan","PPP","","_","_"
71,"janyate","_","_","jan","V","jan","_","_"
72,"sa","_","_","tad","PRD","","_","_"
73,"_","_","_","ca","CCD","","_","_"
74,"_","_","_","eva","CEM","","_","_"
75,"_","_","_","anāgata","JJ","","_","_"
76,"_","_","_","avasthā","NC","","_","_"
77,"_","_","_","antara","JJ","","_","_"
78,"_","_","_","ajāta","JJ","","_","_"
79,"janayaty","_","_","jan","V","jan","_","_"
80,"_","_","_","ātman","NC","","_","_"
81,"_","_","_","ātman","NC","","_","_"
1,"sato","_","_","as","KDP","","_","_"
2,"_","_","_","hi","CX","","_","_"
3,"_","_","_","avasthā","NC","","_","_"
4,"_","_","_","antara","JJ","","_","_"
5,"_","_","_","gamana","NC","","_","_"
6,"_","_","_","mātra","NC","","_","_"
7,"_","_","_","eva","CEM","","_","_"
8,"hi","_","_","hi","CX","","_","_"
9,"janma","_","_","janman","NC","","_","_"
10,"_","_","_","ca","CCD","","_","_"
11,"_","_","_","vak","V","vac","_","_"
12,"tatra","_","_","tatra","CAD","","_","_"
13,"tatra","_","_","tatra","CAD","","_","_"
14,"vayasi","_","_","vayas","NC","","_","_"
15,"tasyāṃ","_","_","tad","PRD","","_","_"
16,"_","_","_","tad","PRD","","_","_"
17,"_","_","_","avasthā","NC","","_","_"
18,"yathā","_","_","yathā","CCM","","_","_"
19,"_","_","_","as","KDP","","_","_"
20,"_","_","_","eva","CEM","","_","_"
21,"_","_","_","śukra","NC","","_","_"
22,"_","_","_","śoṇita","NC","","_","_"
23,"_","_","_","jīva","NC","","_","_"
24,"prāk","_","_","prāk","CX","","_","_"
25,"_","_","_","saṃyoga","NC","","_","_"
26,"_","_","_","garbha","NC","","_","_"
28,"na","_","_","na","CNG","","_","_"
29,"bhavati","_","_","bhav","V","bhū","_","_"
30,"_","_","_","tad","PRD","","_","_"
31,"_","_","_","ca","CCD","","_","_"
32,"_","_","_","saṃyoga","NC","","_","_"
33,"_","_","_","bhav","V","bhū","_","_"
34,"yathā","_","_","yathā","CCM","","_","_"
35,"_","_","_","as","KDP","","_","_"
36,"_","_","_","tad","PRD","","_","_"
37,"_","_","_","eva","CEM","","_","_"
38,"puruṣasya","_","_","puruṣa","NC","","_","_"
39,"_","_","_","prāk","CX","","_","_"
40,"_","_","_","apatya","NC","","_","_"
41,"_","_","_","pitṛ","NC","","_","_"
43,"na","_","_","na","CNG","","_","_"
44,"bhavati","_","_","bhav","V","bhū","_","_"
45,"_","_","_","tad","PRD","","_","_"
46,"_","_","_","ca","CCD","","_","_"
47,"_","_","_","apatya","NC","","_","_"
48,"_","_","_","bhav","V","bhū","_","_"
49,"tathā","_","_","tathā","CX","","_","_"
50,"_","_","_","as","KDP","","_","_"
51,"_","_","_","tad","PRD","","_","_"
52,"_","_","_","eva","CEM","","_","_"
53,"garbhasya","_","_","garbha","NC","","_","_"
54,"tasyāṃ","_","_","tad","PRD","","_","_"
55,"_","_","_","tad","PRD","","_","_"
56,"_","_","_","avasthā","NC","","_","_"
57,"_","_","_","jan","PPP","","_","_"
59,"_","_","_","ajāta","JJ","","_","_"
61,"_","_","_","ca","CCD","","_","_"
62,"_","_","_","vak","V","vac","_","_"
1,"na","_","_","na","CNG","","_","_"
2,"khalu","_","_","khalu","CX","","_","_"
3,"garbhasya","_","_","garbha","NC","","_","_"
4,"na","_","_","na","CNG","","_","_"
5,"ca","_","_","ca","CCD","","_","_"
6,"_","_","_","mātṛ","NC","","_","_"
7,"_","_","_","na","CNG","","_","_"
8,"_","_","_","pitṛ","NC","","_","_"
9,"_","_","_","na","CNG","","_","_"
10,"_","_","_","ca","CCD","","_","_"
11,"_","_","_","ātman","NC","","_","_"
12,"_","_","_","sarva","JQ","","_","_"
13,"_","_","_","bhāva","NC","","_","_"
14,"_","_","_","yatheṣṭa","JJ","","_","_"
15,"_","_","_","kārin","JJ","","_","_"
17,"_","_","_","as","V","as","_","_"
18,"te","_","_","tad","PRD","","_","_"
19,"kiṃcit","_","_","kiṃcit","PRI","","_","_"
20,"_","_","_","sva","JJ","","_","_"
21,"_","_","_","vaśa","NC","","_","_"
22,"kurvanti","_","_","kar","V","kṛ","_","_"
23,"kiṃcit","_","_","kiṃcit","PRI","","_","_"
24,"_","_","_","karman","NC","","_","_"
25,"_","_","_","vaśa","NC","","_","_"
26,"_","_","_","kvacid","CX","","_","_"
27,"_","_","_","ca","CCD","","_","_"
28,"_","_","_","ida","PRD","","_","_"
29,"_","_","_","karaṇa","NC","","_","_"
30,"_","_","_","śakti","NC","","_","_"
31,"_","_","_","bhav","V","bhū","_","_"
32,"_","_","_","kvacid","CX","","_","_"
33,"_","_","_","na","CNG","","_","_"
34,"bhavati","_","_","bhav","V","bhū","_","_"
1,"yatra","_","_","yatra","CX","","_","_"
2,"_","_","_","sattva","NC","","_","_"
3,"_","_","_","ādi","NC","","_","_"
4,"_","_","_","karaṇa","NC","","_","_"
5,"_","_","_","sampad","NC","","_","_"
6,"_","_","_","tatra","CAD","","_","_"
7,"_","_","_","yathābala","CX","","_","_"
8,"_","_","_","eva","CEM","","_","_"
9,"_","_","_","yatheṣṭa","JJ","","_","_"
10,"_","_","_","kārin","JJ","","_","_"
12,"ato","_","_","atas","CX","","_","_"
13,"'nyathā","_","_","anyathā","CX","","_","_"
14,"viparyayaḥ","_","_","viparyaya","NC","","_","_"
1,"na","_","_","na","CNG","","_","_"
2,"ca","_","_","ca","CCD","","_","_"
3,"_","_","_","karaṇa","NC","","_","_"
4,"_","_","_","doṣa","NC","","_","_"
5,"_","_","_","akaraṇa","NC","","_","_"
6,"_","_","_","ātman","NC","","_","_"
7,"sambhavati","_","_","sambhav","V","sambhū","_","_"
8,"_","_","_","garbha","NC","","_","_"
9,"_","_","_","janana","NC","","_","_"
10,"dṛṣṭaṃ","_","_","dṛś","PPP","","_","_"
11,"ceṣṭā","_","_","ceṣṭā","NC","","_","_"
12,"_","_","_","yoni","NC","","_","_"
13,"_","_","_","aiśvarya","NC","","_","_"
14,"_","_","_","mokṣa","NC","","_","_"
15,"_","_","_","ca","CCD","","_","_"
16,"_","_","_","ātman","NC","","_","_"
17,"_","_","_","vid","JJ","","_","_"
18,"_","_","_","ātman","NC","","_","_"
19,"_","_","_","āyat","PPP","","_","_"
1,"_","_","_","na","CNG","","_","_"
2,"_","_","_","hi","CX","","_","_"
3,"_","_","_","anya","PPX","","_","_"
4,"_","_","_","sukha","NC","","_","_"
5,"_","_","_","duḥkha","NC","","_","_"
6,"kartā","_","_","kartṛ","JJ","","_","_"
1,"na","_","_","na","CNG","","_","_"
2,"_","_","_","ca","CCD","","_","_"
3,"_","_","_","anyatas","CX","","_","_"
4,"garbho","_","_","garbha","NC","","_","_"
5,"jāyate","_","_","jan","V","jan","_","_"
6,"jāyamānaḥ","_","_","jan","KDP","","_","_"
7,"_","_","_","na","CNG","","_","_"
8,"_","_","_","aṅkura","NC","","_","_"
9,"_","_","_","utpatti","NC","","_","_"
10,"_","_","_","abīja","NC","","_","_"
1,"yāni","_","_","yad","PRL","","_","_"
2,"tu","_","_","tu","CCD","","_","_"
3,"_","_","_","khalu","CX","","_","_"
4,"_","_","_","ida","PRD","","_","_"
5,"_","_","_","garbha","NC","","_","_"
6,"_","_","_","ātman","NC","","_","_"
7,"_","_","_","ja","JJ","","_","_"
8,"yāni","_","_","yad","PRL","","_","_"
9,"_","_","_","ca","CCD","","_","_"
10,"_","_","_","ida","PRD","","_","_"
11,"_","_","_","ātman","NC","","_","_"
12,"sambhavataḥ","_","_","sambhū","KDP","","_","_"
13,"sambhavanti","_","_","sambhav","V","sambhū","_","_"
14,"_","_","_","tad","PRD","","_","_"
15,"_","_","_","anuvyākhyā","V","anuvyākhyā","_","_"
16,"_","_","_","tad","PRD","","_","_"
17,"_","_","_","yathā","CCM","","_","_"
18,"tāsu","_","_","tad","PRD","","_","_"
19,"tāsu","_","_","tad","PRD","","_","_"
20,"_","_","_","yoni","NC","","_","_"
21,"_","_","_","utpatti","NC","","_","_"
22,"_","_","_","āyus","NC","","_","_"
23,"_","_","_","ātman","NC","","_","_"
24,"_","_","_","jñāna","NC","","_","_"
25,"mana","_","_","manas","NC","","_","_"
26,"indriyāṇi","_","_","indriya","NC","","_","_"
27,"_","_","_","prāṇa","NC","","_","_"
28,"_","_","_","apāna","NC","","_","_"
29,"preraṇaṃ","_","_","preraṇa","NC","","_","_"
30,"_","_","_","dhāraṇa","NC","","_","_"
31,"_","_","_","ākṛti","NC","","_","_"
32,"_","_","_","svara","NC","","_","_"
33,"_","_","_","varṇa","NC","","_","_"
34,"_","_","_","viśeṣa","NC","","_","_"
35,"_","_","_","sukha","NC","","_","_"
36,"_","_","_","duḥkha","NC","","_","_"
37,"_","_","_","icchā","NC","","_","_"
38,"_","_","_","dveṣa","NC","","_","_"
39,"cetanā","_","_","cetanā","NC","","_","_"
40,"_","_","_","dhṛti","NC","","_","_"
41,"_","_","_","buddhi","NC","","_","_"
42,"_","_","_","smṛti","NC","","_","_"
43,"_","_","_","ahaṃkāra","NC","","_","_"
44,"_","_","_","prayatna","NC","","_","_"
45,"_","_","_","ca","CCD","","_","_"
46,"_","_","_","iti","CQT","","_","_"
1,"_","_","_","sātmya","NC","","_","_"
2,"_","_","_","ja","JJ","","_","_"
3,"_","_","_","ca","CCD","","_","_"
4,"_","_","_","ida","PRD","","_","_"
5,"garbhaḥ","_","_","garbha","NC","","_","_"
1,"na","_","_","na","CNG","","_","_"
2,"_","_","_","hi","CX","","_","_"
3,"_","_","_","asātmya","NC","","_","_"
4,"_","_","_","sevin","JJ","","_","_"
6,"antareṇa","_","_","antareṇa","CX","","_","_"
7,"_","_","_","strī","NC","","_","_"
8,"_","_","_","puruṣa","NC","","_","_"
9,"_","_","_","vandhya","JJ","","_","_"
11,"_","_","_","as","V","as","_","_"
12,"garbheṣu","_","_","garbha","NC","","_","_"
13,"_","_","_","vā","CCD","","_","_"
14,"_","_","_","api","CX","","_","_"
15,"_","_","_","aniṣṭa","JJ","","_","_"
16,"bhāvaḥ","_","_","bhāva","NC","","_","_"
1,"yāvat","_","_","yāvat","CX","","_","_"
2,"_","_","_","khalu","CX","","_","_"
3,"_","_","_","asātmya","NC","","_","_"
4,"_","_","_","sevin","JJ","","_","_"
5,"_","_","_","strī","NC","","_","_"
6,"_","_","_","puruṣa","NC","","_","_"
7,"trayo","_","_","tri","NUM","","_","_"
8,"doṣāḥ","_","_","doṣa","NC","","_","_"
9,"prakupitāḥ","_","_","prakup","PPP","","_","_"
10,"_","_","_","śarīra","NC","","_","_"
11,"_","_","_","upasṛp","KDP","","_","_"
12,"na","_","_","na","CNG","","_","_"
13,"_","_","_","śukra","NC","","_","_"
14,"_","_","_","śoṇita","NC","","_","_"
15,"_","_","_","garbhāśaya","NC","","_","_"
16,"_","_","_","upaghāta","NC","","_","_"
17,"_","_","_","upapad","V","upapad","_","_"
18,"tāvat","_","_","tāvat","CX","","_","_"
19,"samarthā","_","_","samartha","JJ","","_","_"
20,"_","_","_","garbha","NC","","_","_"
21,"_","_","_","janana","NC","","_","_"
22,"bhavanti","_","_","bhav","V","bhū","_","_"
1,"_","_","_","sātmya","NC","","_","_"
2,"_","_","_","sevin","JJ","","_","_"
3,"punaḥ","_","_","punar","CAD","","_","_"
4,"_","_","_","strī","NC","","_","_"
5,"_","_","_","puruṣa","NC","","_","_"
6,"_","_","_","anupahata","JJ","","_","_"
7,"_","_","_","śukra","NC","","_","_"
8,"_","_","_","śoṇita","NC","","_","_"
9,"_","_","_","garbhāśaya","NC","","_","_"
10,"_","_","_","ṛtu","NC","","_","_"
11,"_","_","_","kāla","NC","","_","_"
12,"saṃnipatitānāṃ","_","_","saṃnipat","PPP","","_","_"
13,"_","_","_","jīva","NC","","_","_"
14,"_","_","_","anavakramaṇa","NC","","_","_"
15,"garbhā","_","_","garbha","NC","","_","_"
16,"na","_","_","na","CNG","","_","_"
17,"prādurbhavanti","_","_","prādurbhav","V","prādurbhū","_","_"
1,"na","_","_","na","CNG","","_","_"
2,"hi","_","_","hi","CX","","_","_"
3,"kevalaṃ","_","_","kevala","CX","","_","_"
4,"_","_","_","sātmya","NC","","_","_"
5,"_","_","_","ja","JJ","","_","_"
6,"_","_","_","eva","CEM","","_","_"
7,"_","_","_","ida","PRD","","_","_"
8,"garbhaḥ","_","_","garbha","NC","","_","_"
9,"samudayo","_","_","samudaya","NC","","_","_"
10,"'tra","_","_","atra","CAD","","_","_"
11,"_","_","_","kāraṇa","NC","","_","_"
12,"_","_","_","vak","V","vac","_","_"
1,"yāni","_","_","yad","PRL","","_","_"
2,"_","_","_","khalu","CX","","_","_"
3,"_","_","_","ida","PRD","","_","_"
4,"garbhasya","_","_","garbha","NC","","_","_"
5,"_","_","_","sātmya","NC","","_","_"
6,"_","_","_","ja","JJ","","_","_"
7,"yāni","_","_","yad","PRL","","_","_"
8,"_","_","_","ca","CCD","","_","_"
9,"_","_","_","ida","PRD","","_","_"
10,"sātmyataḥ","_","_","sātmya","NC","","_","_"
11,"sambhavataḥ","_","_","sambhū","KDP","","_","_"
12,"sambhavanti","_","_","sambhav","V","sambhū","_","_"
13,"_","_","_","tad","PRD","","_","_"
14,"_","_","_","anuvyākhyā","V","anuvyākhyā","_","_"
15,"tad","_","_","tad","PRD","","_","_"
16,"_","_","_","yathā","CCM","","_","_"
17,"_","_","_","ārogya","NC","","_","_"
18,"anālasyam","_","_","anālasya","NC","","_","_"
19,"_","_","_","alolupa","JJ","","_","_"
21,"_","_","_","indriya","NC","","_","_"
22,"_","_","_","prasāda","NC","","_","_"
23,"_","_","_","svara","NC","","_","_"
24,"_","_","_","varṇa","NC","","_","_"
25,"_","_","_","bīja","NC","","_","_"
26,"_","_","_","sampad","NC","","_","_"
27,"_","_","_","praharṣa","NC","","_","_"
28,"_","_","_","bhūyas","JJ","","_","_"
30,"_","_","_","ca","CCD","","_","_"
31,"_","_","_","iti","CQT","","_","_"
1,"_","_","_","rasa","NC","","_","_"
2,"_","_","_","ja","JJ","","_","_"
3,"_","_","_","ca","CCD","","_","_"
4,"_","_","_","ida","PRD","","_","_"
5,"garbhaḥ","_","_","garbha","NC","","_","_"
1,"na","_","_","na","CNG","","_","_"
2,"hi","_","_","hi","CX","","_","_"
3,"_","_","_","rasa","NC","","_","_"
4,"_","_","_","ṛte","CX","","_","_"
5,"mātuḥ","_","_","mātṛ","NC","","_","_"
6,"_","_","_","prāṇayātrā","NC","","_","_"
7,"_","_","_","api","CX","","_","_"
8,"syāt","_","_","as","V","as","_","_"
9,"kiṃ","_","_","kiṃ","PRQ","","_","_"
10,"_","_","_","punar","CAD","","_","_"
11,"_","_","_","garbha","NC","","_","_"
12,"_","_","_","janman","NC","","_","_"
1,"na","_","_","na","CNG","","_","_"
2,"_","_","_","ca","CCD","","_","_"
3,"_","_","_","eva","CEM","","_","_"
4,"a","_","_","alpha_privativum","CX","","_","_"
4,"_","_","_","samyak","CX","","_","_"
5,"_","_","_","upayuj","KDP","","_","_"
6,"rasā","_","_","rasa","NC","","_","_"
7,"_","_","_","garbha","NC","","_","_"
8,"_","_","_","abhinirvartay","V","abhinirvartay","_","_"
9,"na","_","_","na","CNG","","_","_"
10,"ca","_","_","ca","CCD","","_","_"
11,"kevalaṃ","_","_","kevala","CX","","_","_"
12,"_","_","_","samyak","CX","","_","_"
13,"_","_","_","upayoga","NC","","_","_"
14,"_","_","_","eva","CEM","","_","_"
15,"rasānāṃ","_","_","rasa","NC","","_","_"
16,"_","_","_","garbha","NC","","_","_"
17,"_","_","_","abhinirvṛtti","NC","","_","_"
18,"_","_","_","bhav","V","bhū","_","_"
19,"samudāyo","_","_","samudāya","NC","","_","_"
20,"_","_","_","api","CX","","_","_"
21,"_","_","_","atra","CAD","","_","_"
22,"_","_","_","kāraṇa","NC","","_","_"
23,"_","_","_","vak","V","vac","_","_"
1,"yāni","_","_","yad","PRL","","_","_"
2,"tu","_","_","tu","CCD","","_","_"
3,"_","_","_","khalu","CX","","_","_"
4,"_","_","_","ida","PRD","","_","_"
5,"garbhasya","_","_","garbha","NC","","_","_"
6,"_","_","_","rasa","NC","","_","_"
7,"_","_","_","ja","JJ","","_","_"
8,"yāni","_","_","yad","PRL","","_","_"
9,"_","_","_","ca","CCD","","_","_"
10,"_","_","_","ida","PRD","","_","_"
11,"rasataḥ","_","_","rasa","NC","","_","_"
12,"sambhavataḥ","_","_","sambhū","KDP","","_","_"
13,"sambhavanti","_","_","sambhav","V","sambhū","_","_"
14,"_","_","_","tad","PRD","","_","_"
15,"_","_","_","anuvyākhyā","V","anuvyākhyā","_","_"
16,"tad","_","_","tad","PRD","","_","_"
17,"yathā","_","_","yathā","CCM","","_","_"
18,"_","_","_","śarīra","NC","","_","_"
19,"_","_","_","abhinirvṛtti","NC","","_","_"
20,"_","_","_","abhivṛddhi","NC","","_","_"
21,"_","_","_","prāṇa","NC","","_","_"
22,"_","_","_","anubandha","NC","","_","_"
23,"_","_","_","tṛpti","NC","","_","_"
24,"_","_","_","puṣṭi","NC","","_","_"
25,"_","_","_","utsāha","NC","","_","_"
26,"_","_","_","ca","CCD","","_","_"
27,"_","_","_","iti","CQT","","_","_"
1,"asti","_","_","as","V","as","_","_"
2,"khalu","_","_","khalu","CX","","_","_"
3,"_","_","_","sattva","NC","","_","_"
4,"_","_","_","aupapāduka","JJ","","_","_"
5,"_","_","_","yad","PRL","","_","_"
6,"_","_","_","jīva","NC","","_","_"
7,"_","_","_","spṛś","JJ","","_","_"
8,"_","_","_","śarīra","NC","","_","_"
9,"_","_","_","abhisambandh","V","abhisambandh","_","_"
10,"_","_","_","yad","PRL","","_","_"
11,"_","_","_","apagamana","NC","","_","_"
12,"_","_","_","puraskṛ","PPP","","_","_"
13,"_","_","_","śīla","NC","","_","_"
14,"_","_","_","ida","PRD","","_","_"
15,"vyāvartate","_","_","vyāvart","V","vyāvṛt","_","_"
16,"bhaktir","_","_","bhakti","NC","","_","_"
17,"viparyasyate","_","_","viparyas","V","viparyas","_","_"
18,"_","_","_","sarva","JQ","","_","_"
19,"_","_","_","indriya","NC","","_","_"
20,"_","_","_","upatap","V","upatap","_","_"
21,"balaṃ","_","_","bala","NC","","_","_"
22,"hīyate","_","_","jah","V","hā","_","_"
23,"vyādhaya","_","_","vyādhi","NC","","_","_"
24,"āpyāyyante","_","_","āpyāyay","V","āpyāyay","_","_"
25,"_","_","_","yad","PRL","","_","_"
26,"_","_","_","hā","PPP","","_","_"
27,"_","_","_","prāṇa","NC","","_","_"
28,"_","_","_","jah","V","hā","_","_"
29,"yad","_","_","yad","PRL","","_","_"
30,"indriyāṇām","_","_","indriya","NC","","_","_"
31,"abhigrāhakaṃ","_","_","abhigrāhaka","JJ","","_","_"
32,"ca","_","_","ca","CCD","","_","_"
33,"mana","_","_","manas","NC","","_","_"
34,"_","_","_","iti","CQT","","_","_"
35,"_","_","_","abhidadh","V","abhidhā","_","_"
36,"_","_","_","tad","PRD","","_","_"
37,"_","_","_","trividha","JJ","","_","_"
38,"ākhyāyate","_","_","ākhyā","V","ākhyā","_","_"
39,"śuddhaṃ","_","_","śuddha","JJ","","_","_"
40,"rājasaṃ","_","_","rājasa","JJ","","_","_"
41,"_","_","_","tāmasa","JJ","","_","_"
42,"_","_","_","iti","CQT","","_","_"
1,"_","_","_","yad","PRL","","_","_"
2,"_","_","_","ida","PRD","","_","_"
3,"khalu","_","_","khalu","CX","","_","_"
4,"mano","_","_","manas","NC","","_","_"
5,"bhūyiṣṭhaṃ","_","_","bhūyiṣṭha","JJ","","_","_"
6,"tena","_","_","tad","PRD","","_","_"
7,"dvitīyāyām","_","_","dvitīya","JJ","","_","_"
8,"ā","_","_","jāti","NC","","_","_"
9,"jātau","_","_","saṃprayoga","NC","","_","_"
10,"saṃprayogo","_","_","bhav","V","bhū","_","_"
11,"bhavati","_","_","yadā","CSB","","_","_"
12,"yadā","_","_","tu","CCD","","_","_"
13,"_","_","_","tad","PRD","","_","_"
14,"_","_","_","eva","CEM","","_","_"
15,"tenaiva","_","_","śuddha","JJ","","_","_"
16,"śuddhena","_","_","saṃyuj","V","saṃyuj","_","_"
17,"saṃyujyate","_","_","tadā","CAD","","_","_"
18,"_","_","_","jāti","NC","","_","_"
19,"_","_","_","atikra","PPP","","_","_"
20,"jāteratikrāntāyā","_","_","api","CX","","_","_"
21,"api","_","_","smar","V","smṛ","_","_"
1,"smārtaṃ","_","_","smārta","JJ","","_","_"
2,"hi","_","_","hi","CX","","_","_"
3,"_","_","_","jñāna","NC","","_","_"
4,"_","_","_","ātman","NC","","_","_"
5,"_","_","_","tad","PRD","","_","_"
6,"_","_","_","eva","CEM","","_","_"
7,"manaso","_","_","manas","NC","","_","_"
8,"_","_","_","anubandha","NC","","_","_"
9,"_","_","_","anuvart","V","anuvṛt","_","_"
10,"_","_","_","yad","PRL","","_","_"
11,"_","_","_","anuvṛtti","NC","","_","_"
12,"puraskṛtya","_","_","puraskṛ","CGDA","","_","_"
13,"puruṣo","_","_","puruṣa","NC","","_","_"
14,"jātismara","_","_","jātismara","JJ","","_","_"
15,"_","_","_","iti","CQT","","_","_"
16,"_","_","_","vak","V","vac","_","_"
1,"yāni","_","_","yad","PRL","","_","_"
2,"_","_","_","khalu","CX","","_","_"
3,"_","_","_","ida","PRD","","_","_"
4,"garbhasya","_","_","garbha","NC","","_","_"
5,"_","_","_","sattva","NC","","_","_"
6,"_","_","_","ja","JJ","","_","_"
7,"_","_","_","yad","PRL","","_","_"
8,"_","_","_","ida","PRD","","_","_"
9,"sattvataḥ","_","_","sattva","NC","","_","_"
10,"sambhavataḥ","_","_","sambhū","KDP","","_","_"
11,"sambhavanti","_","_","sambhav","V","sambhū","_","_"
12,"_","_","_","tad","PRD","","_","_"
13,"_","_","_","anuvyākhyā","V","anuvyākhyā","_","_"
14,"tad","_","_","tad","PRD","","_","_"
15,"yathā","_","_","yathā","CCM","","_","_"
16,"bhaktiḥ","_","_","bhakti","NC","","_","_"
17,"śīlaṃ","_","_","śīla","NC","","_","_"
18,"śaucaṃ","_","_","śauca","NC","","_","_"
19,"dveṣaḥ","_","_","dveṣa","NC","","_","_"
20,"_","_","_","smṛti","NC","","_","_"
21,"_","_","_","moha","NC","","_","_"
22,"_","_","_","tyāga","NC","","_","_"
23,"mātsaryaṃ","_","_","mātsarya","NC","","_","_"
24,"śauryaṃ","_","_","śaurya","NC","","_","_"
25,"bhayaṃ","_","_","bhaya","NC","","_","_"
26,"_","_","_","krodha","NC","","_","_"
27,"_","_","_","tandrā","NC","","_","_"
28,"_","_","_","utsāha","NC","","_","_"
29,"_","_","_","taikṣṇya","NC","","_","_"
30,"mārdavaṃ","_","_","mārdava","NC","","_","_"
31,"_","_","_","gāmbhīrya","NC","","_","_"
32,"_","_","_","anavasthita","JJ","","_","_"
34,"_","_","_","iti","CQT","","_","_"
35,"_","_","_","evamādi","JJ","","_","_"
36,"_","_","_","ca","CCD","","_","_"
37,"_","_","_","anya","PPX","","_","_"
38,"te","_","_","tad","PRD","","_","_"
39,"_","_","_","sattva","NC","","_","_"
40,"_","_","_","vikāra","NC","","_","_"
41,"_","_","_","yad","PRL","","_","_"
42,"_","_","_","uttara","JJ","","_","_"
43,"_","_","_","kāla","NC","","_","_"
44,"_","_","_","sattva","NC","","_","_"
45,"_","_","_","bheda","NC","","_","_"
46,"_","_","_","adhikṛ","CGDA","","_","_"
47,"_","_","_","upadiś","V","upadiś","_","_"
1,"nānāvidhāni","_","_","nānāvidha","JJ","","_","_"
2,"khalu","_","_","khalu","CX","","_","_"
3,"sattvāni","_","_","sattva","NC","","_","_"
4,"tāni","_","_","tad","PRD","","_","_"
5,"_","_","_","sarva","JQ","","_","_"
6,"_","_","_","eka","PPX","","_","_"
7,"_","_","_","puruṣa","NC","","_","_"
8,"bhavanti","_","_","bhav","V","bhū","_","_"
9,"na","_","_","na","CNG","","_","_"
10,"ca","_","_","ca","CCD","","_","_"
11,"_","_","_","bhav","V","bhū","_","_"
12,"_","_","_","eka","PPX","","_","_"
13,"_","_","_","kāla","NC","","_","_"
14,"ekaṃ","_","_","eka","PPX","","_","_"
15,"tu","_","_","tu","CCD","","_","_"
16,"_","_","_","prāyas","CX","","_","_"
17,"_","_","_","vṛtti","NC","","_","_"
18,"_","_","_","ah","V","ah","_","_"
1,"_","_","_","eva","CX","","_","_"
2,"_","_","_","ida","PRD","","_","_"
3,"_","_","_","nānāvidha","JJ","","_","_"
4,"_","_","_","ida","PRD","","_","_"
5,"_","_","_","garbha","NC","","_","_"
6,"_","_","_","kara","JJ","","_","_"
7,"bhāvānāṃ","_","_","bhāva","NC","","_","_"
8,"_","_","_","samudāya","NC","","_","_"
9,"_","_","_","abhinirvart","V","abhinirvṛt","_","_"
10,"garbhaḥ","_","_","garbha","NC","","_","_"
11,"yathā","_","_","yathā","CCM","","_","_"
12,"kūṭāgāraṃ","_","_","kūṭāgāra","NC","","_","_"
13,"_","_","_","nānā","CX","","_","_"
14,"_","_","_","dravya","NC","","_","_"
15,"_","_","_","samudāya","NC","","_","_"
16,"yathā","_","_","yathā","CCM","","_","_"
17,"vā","_","_","vā","CCD","","_","_"
18,"ratho","_","_","ratha","NC","","_","_"
19,"_","_","_","nānā","CX","","_","_"
20,"_","_","_","ratha","NC","","_","_"
21,"_","_","_","aṅga","NC","","_","_"
22,"_","_","_","samudāya","NC","","_","_"
23,"tasmād","_","_","tasmāt","CX","","_","_"
24,"etad","_","_","tad","PRD","","_","_"
25,"avocāma","_","_","vak","V","vac","_","_"
26,"_","_","_","mātṛ","NC","","_","_"
27,"_","_","_","ja","JJ","","_","_"
28,"_","_","_","ca","CCD","","_","_"
29,"_","_","_","ida","PRD","","_","_"
30,"garbhaḥ","_","_","garbha","NC","","_","_"
31,"_","_","_","pitṛ","NC","","_","_"
32,"_","_","_","ja","JJ","","_","_"
33,"_","_","_","ca","CCD","","_","_"
34,"_","_","_","ātman","NC","","_","_"
35,"_","_","_","ja","JJ","","_","_"
36,"_","_","_","ca","CCD","","_","_"
37,"_","_","_","sātmya","NC","","_","_"
38,"_","_","_","ja","JJ","","_","_"
39,"_","_","_","ca","CCD","","_","_"
40,"_","_","_","rasa","NC","","_","_"
41,"_","_","_","ja","JJ","","_","_"
42,"_","_","_","ca","CCD","","_","_"
43,"asti","_","_","as","V","as","_","_"
44,"ca","_","_","ca","CCD","","_","_"
45,"_","_","_","sattva","NC","","_","_"
46,"_","_","_","aupapāduka","JJ","","_","_"
47,"_","_","_","iti","CQT","","_","_"
1,"bharadvāja","_","_","bharadvāja","NC","","_","_"
2,"uvāca","_","_","vak","V","vac","_","_"
3,"_","_","_","yadi","CSB","","_","_"
4,"_","_","_","ida","PRD","","_","_"
5,"eṣāṃ","_","_","ida","PRD","","_","_"
6,"nānāvidhānāṃ","_","_","nānāvidha","JJ","","_","_"
7,"_","_","_","garbha","NC","","_","_"
8,"_","_","_","kara","JJ","","_","_"
9,"bhāvānāṃ","_","_","bhāva","NC","","_","_"
10,"_","_","_","samudāya","NC","","_","_"
11,"_","_","_","abhinirvart","V","abhinirvṛt","_","_"
12,"garbhaḥ","_","_","garbha","NC","","_","_"
13,"_","_","_","katha","CX","","_","_"
14,"_","_","_","ida","PRD","","_","_"
15,"saṃdhīyate","_","_","saṃdadh","V","saṃdhā","_","_"
16,"yadi","_","_","yadi","CSB","","_","_"
17,"_","_","_","ca","CCD","","_","_"
18,"_","_","_","api","CX","","_","_"
19,"saṃdhīyate","_","_","saṃdadh","V","saṃdhā","_","_"
20,"kasmāt","_","_","kasmāt","CX","","_","_"
21,"_","_","_","samudāya","NC","","_","_"
22,"_","_","_","prabhava","NC","","_","_"
23,"san","_","_","as","KDP","","_","_"
24,"garbho","_","_","garbha","NC","","_","_"
25,"_","_","_","manuṣya","NC","","_","_"
26,"_","_","_","vigraha","NC","","_","_"
27,"jāyate","_","_","jan","V","jan","_","_"
28,"_","_","_","manuṣya","NC","","_","_"
29,"_","_","_","ca","CCD","","_","_"
30,"_","_","_","manuṣya","NC","","_","_"
31,"_","_","_","prabhava","NC","","_","_"
32,"ucyate","_","_","vak","V","vac","_","_"
33,"tatra","_","_","tatra","CAD","","_","_"
34,"_","_","_","ced","CX","","_","_"
35,"_","_","_","iṣ","PPP","","_","_"
36,"_","_","_","tad","PRD","","_","_"
37,"_","_","_","yad","PRL","","_","_"
38,"_","_","_","manuṣya","NC","","_","_"
39,"_","_","_","manuṣya","NC","","_","_"
40,"_","_","_","prabhava","NC","","_","_"
41,"_","_","_","tasmāt","CX","","_","_"
42,"_","_","_","eva","CEM","","_","_"
43,"_","_","_","manuṣya","NC","","_","_"
44,"_","_","_","vigraha","NC","","_","_"
45,"jāyate","_","_","jan","V","jan","_","_"
46,"yathā","_","_","yathā","CCM","","_","_"
47,"gaur","_","_","go","NC","","_","_"
48,"_","_","_","go","CX","","_","_"
49,"_","_","_","prabhava","NC","","_","_"
50,"yathā","_","_","yathā","CCM","","_","_"
51,"_","_","_","ca","CCD","","_","_"
52,"_","_","_","aśva","NC","","_","_"
53,"_","_","_","aśva","NC","","_","_"
54,"_","_","_","prabhava","NC","","_","_"
55,"iti","_","_","iti","CQT","","_","_"
56,"evaṃ","_","_","eva","CX","","_","_"
57,"sati","_","_","as","KDP","","_","_"
58,"_","_","_","yad","PRL","","_","_"
59,"_","_","_","vac","PPP","","_","_"
60,"_","_","_","agre","CX","","_","_"
61,"_","_","_","samudaya","NC","","_","_"
62,"_","_","_","ātmaka","JJ","","_","_"
63,"iti","_","_","iti","CQT","","_","_"
64,"_","_","_","tad","PRD","","_","_"
65,"_","_","_","ayukta","JJ","","_","_"
1,"yadi","_","_","yadi","CSB","","_","_"
2,"ca","_","_","ca","CCD","","_","_"
3,"manuṣyo","_","_","manuṣya","NC","","_","_"
4,"_","_","_","manuṣya","NC","","_","_"
5,"_","_","_","prabhava","NC","","_","_"
6,"kasmāj","_","_","kasmāt","CX","","_","_"
7,"_","_","_","jaḍa","JJ","","_","_"
8,"_","_","_","andha","JJ","","_","_"
9,"_","_","_","kubja","JJ","","_","_"
10,"_","_","_","mūka","JJ","","_","_"
11,"_","_","_","vāmana","JJ","","_","_"
12,"_","_","_","minmina","JJ","","_","_"
13,"_","_","_","vyaṅga","JJ","","_","_"
14,"_","_","_","unmad","PPP","","_","_"
15,"_","_","_","kuṣṭhin","JJ","","_","_"
16,"_","_","_","kilāsin","JJ","","_","_"
17,"jātāḥ","_","_","jan","PPP","","_","_"
18,"_","_","_","pitṛ","NC","","_","_"
19,"_","_","_","sadṛśa","JJ","","_","_"
20,"_","_","_","rūpa","NC","","_","_"
21,"na","_","_","na","CNG","","_","_"
22,"bhavanti","_","_","bhav","V","bhū","_","_"
1,"_","_","_","atha","CAD","","_","_"
2,"_","_","_","atra","CAD","","_","_"
3,"_","_","_","api","CX","","_","_"
4,"_","_","_","buddhi","NC","","_","_"
5,"_","_","_","eva","CX","","_","_"
6,"_","_","_","as","V","as","_","_"
7,"_","_","_","sva","JJ","","_","_"
8,"_","_","_","eva","CEM","","_","_"
9,"_","_","_","ida","PRD","","_","_"
10,"_","_","_","ātman","NC","","_","_"
11,"cakṣuṣā","_","_","cakṣus","NC","","_","_"
12,"rūpāṇi","_","_","rūpa","NC","","_","_"
13,"vetti","_","_","vid","V","vid","_","_"
14,"śrotreṇa","_","_","śrotra","NC","","_","_"
15,"śabdān","_","_","śabda","NC","","_","_"
16,"ghrāṇena","_","_","ghrāṇa","NC","","_","_"
17,"gandhān","_","_","gandha","NC","","_","_"
18,"rasanena","_","_","rasana","NC","","_","_"
19,"rasān","_","_","rasa","NC","","_","_"
20,"sparśanena","_","_","sparśana","NC","","_","_"
21,"sparśān","_","_","sparśa","NC","","_","_"
22,"buddhyā","_","_","buddhi","NC","","_","_"
23,"_","_","_","budh","KDG","","_","_"
24,"_","_","_","iti","CQT","","_","_"
25,"_","_","_","ida","PRD","","_","_"
26,"hetunā","_","_","hetu","NC","","_","_"
27,"na","_","_","na","CNG","","_","_"
28,"_","_","_","jaḍa","JJ","","_","_"
29,"_","_","_","ādi","NC","","_","_"
30,"jātāḥ","_","_","jan","PPP","","_","_"
31,"_","_","_","pitṛ","NC","","_","_"
32,"_","_","_","sadṛśa","JJ","","_","_"
33,"bhavanti","_","_","bhav","V","bhū","_","_"
1,"_","_","_","atra","CAD","","_","_"
2,"_","_","_","api","CX","","_","_"
3,"_","_","_","pratijñāhāni","NC","","_","_"
4,"_","_","_","doṣa","NC","","_","_"
5,"syāt","_","_","as","V","as","_","_"
6,"_","_","_","eva","CX","","_","_"
7,"_","_","_","vac","PPP","","_","_"
8,"_","_","_","hi","CX","","_","_"
9,"_","_","_","ātman","NC","","_","_"
10,"_","_","_","as","KDP","","_","_"
11,"_","_","_","indriya","NC","","_","_"
12,"jñaḥ","_","_","jña","NC","","_","_"
13,"_","_","_","as","V","as","_","_"
14,"_","_","_","asat","JJ","","_","_"
15,"_","_","_","ajña","JJ","","_","_"
16,"yatra","_","_","yatra","CX","","_","_"
17,"_","_","_","ca","CCD","","_","_"
18,"_","_","_","tad","PRD","","_","_"
19,"_","_","_","ubhaya","JJ","","_","_"
20,"sambhavati","_","_","sambhav","V","sambhū","_","_"
21,"_","_","_","jña","JJ","","_","_"
23,"_","_","_","ajña","JJ","","_","_"
25,"ca","_","_","ca","CCD","","_","_"
26,"_","_","_","sa_saha","CX","","_","_"
27,"_","_","_","vikāra","NC","","_","_"
28,"_","_","_","ca","CCD","","_","_"
29,"_","_","_","ātman","NC","","_","_"
1,"yadi","_","_","yadi","CSB","","_","_"
2,"ca","_","_","ca","CCD","","_","_"
3,"_","_","_","darśana","NC","","_","_"
4,"_","_","_","ādi","NC","","_","_"
5,"_","_","_","ātman","NC","","_","_"
6,"viṣayān","_","_","viṣaya","NC","","_","_"
7,"vetti","_","_","vid","V","vid","_","_"
8,"nirindriyo","_","_","nirindriya","JJ","","_","_"
9,"_","_","_","darśana","NC","","_","_"
10,"_","_","_","ādi","NC","","_","_"
11,"_","_","_","viraha","NC","","_","_"
12,"_","_","_","ajña","JJ","","_","_"
13,"syāt","_","_","as","V","as","_","_"
14,"_","_","_","ajña","JJ","","_","_"
16,"_","_","_","akāraṇa","NC","","_","_"
17,"_","_","_","akāraṇa","NC","","_","_"
19,"_","_","_","ca","CCD","","_","_"
20,"_","_","_","na","CNG","","_","_"
21,"_","_","_","ātman","NC","","_","_"
22,"_","_","_","iti","CQT","","_","_"
23,"_","_","_","vāc","NC","","_","_"
24,"_","_","_","vastu","NC","","_","_"
25,"_","_","_","mātra","NC","","_","_"
26,"etad","_","_","tad","PRD","","_","_"
27,"_","_","_","vacana","NC","","_","_"
28,"_","_","_","anartha","JJ","","_","_"
29,"_","_","_","as","V","as","_","_"
30,"_","_","_","iti","CQT","","_","_"
1,"ātreya","_","_","ātreya","NC","","_","_"
2,"uvāca","_","_","vak","V","vac","_","_"
3,"_","_","_","purastāt","CX","","_","_"
4,"_","_","_","tad","PRD","","_","_"
5,"pratijñātaṃ","_","_","pratijñā","PPP","","_","_"
6,"sattvaṃ","_","_","sattva","NC","","_","_"
7,"jīvaṃ","_","_","jīva","NC","","_","_"
8,"_","_","_","spṛś","JJ","","_","_"
9,"_","_","_","śarīra","NC","","_","_"
10,"_","_","_","abhisambandh","V","abhisambandh","_","_"
11,"_","_","_","iti","CQT","","_","_"
1,"_","_","_","yasmāt","CX","","_","_"
2,"_","_","_","tu","CCD","","_","_"
3,"_","_","_","samudāya","NC","","_","_"
4,"_","_","_","prabhava","NC","","_","_"
5,"san","_","_","as","KDP","","_","_"
6,"sa","_","_","tad","PRD","","_","_"
7,"garbho","_","_","garbha","NC","","_","_"
8,"_","_","_","manuṣya","NC","","_","_"
9,"_","_","_","vigraha","NC","","_","_"
10,"jāyate","_","_","jan","V","jan","_","_"
11,"manuṣyo","_","_","manuṣya","NC","","_","_"
12,"_","_","_","manuṣya","NC","","_","_"
13,"_","_","_","prabhava","NC","","_","_"
14,"_","_","_","iti","CQT","","_","_"
15,"_","_","_","vak","V","vac","_","_"
16,"_","_","_","tad","PRD","","_","_"
17,"_","_","_","vak","V","vac","_","_"
18,"bhūtānāṃ","_","_","bhūta","NC","","_","_"
19,"caturvidhā","_","_","caturvidha","JJ","","_","_"
20,"yonir","_","_","yoni","NC","","_","_"
21,"bhavati","_","_","bhav","V","bhū","_","_"
22,"_","_","_","jarāyu","NC","","_","_"
23,"_","_","_","aṇḍa","NC","","_","_"
24,"_","_","_","sveda","NC","","_","_"
25,"_","_","_","udbhid","NC","","_","_"
1,"tāsāṃ","_","_","tad","PRD","","_","_"
2,"khalu","_","_","khalu","CX","","_","_"
3,"_","_","_","catur","NUM","","_","_"
4,"_","_","_","api","CX","","_","_"
5,"_","_","_","yoni","NC","","_","_"
6,"_","_","_","ekaika","PRC","","_","_"
7,"_","_","_","yoni","NC","","_","_"
8,"_","_","_","aparisaṃkhyeya","JJ","","_","_"
9,"_","_","_","bheda","NC","","_","_"
10,"bhavati","_","_","bhav","V","bhū","_","_"
11,"bhūtānām","_","_","bhūta","NC","","_","_"
12,"_","_","_","ākṛti","NC","","_","_"
13,"_","_","_","viśeṣa","NC","","_","_"
14,"_","_","_","aparisaṃkhyeya","JJ","","_","_"
1,"tatra","_","_","tatra","CAD","","_","_"
2,"_","_","_","jarāyu","NC","","_","_"
3,"_","_","_","ja","JJ","","_","_"
4,"_","_","_","aṇḍa","NC","","_","_"
5,"_","_","_","ja","JJ","","_","_"
6,"ca","_","_","ca","CCD","","_","_"
7,"_","_","_","prāṇin","NC","","_","_"
8,"_","_","_","tad","PRD","","_","_"
9,"_","_","_","garbha","NC","","_","_"
10,"_","_","_","kara","JJ","","_","_"
11,"bhāvā","_","_","bhāva","NC","","_","_"
12,"yāṃ","_","_","yad","PRL","","_","_"
13,"yāṃ","_","_","yad","PRL","","_","_"
14,"_","_","_","yoni","NC","","_","_"
15,"_","_","_","āpady","V","āpad","_","_"
16,"tasyāṃ","_","_","tad","PRD","","_","_"
17,"tasyāṃ","_","_","tad","PRD","","_","_"
18,"yonau","_","_","yoni","NC","","_","_"
19,"_","_","_","tathā","CX","","_","_"
20,"_","_","_","tathā","CX","","_","_"
21,"_","_","_","rūpa","NC","","_","_"
22,"bhavanti","_","_","bhav","V","bhū","_","_"
23,"yathā","_","_","yathā","CCM","","_","_"
24,"_","_","_","kanaka","NC","","_","_"
25,"_","_","_","rajata","NC","","_","_"
26,"_","_","_","tāmra","NC","","_","_"
27,"_","_","_","trapu","NC","","_","_"
28,"_","_","_","sīsaka","NC","","_","_"
29,"_","_","_","āsic","KDP","","_","_"
30,"teṣu","_","_","tad","PRD","","_","_"
31,"teṣu","_","_","tad","PRD","","_","_"
32,"_","_","_","madhūcchiṣṭa","NC","","_","_"
33,"_","_","_","vigraha","NC","","_","_"
34,"tāni","_","_","tad","PRD","","_","_"
35,"yadā","_","_","yadā","CSB","","_","_"
36,"_","_","_","manuṣya","NC","","_","_"
37,"_","_","_","bimba","NC","","_","_"
38,"_","_","_","āpady","V","āpad","_","_"
39,"tadā","_","_","tadā","CAD","","_","_"
40,"_","_","_","manuṣya","NC","","_","_"
41,"_","_","_","vigraha","NC","","_","_"
42,"jāyante","_","_","jan","V","jan","_","_"
43,"tasmāt","_","_","tasmāt","CX","","_","_"
44,"_","_","_","samudāya","NC","","_","_"
45,"_","_","_","prabhava","NC","","_","_"
46,"san","_","_","as","KDP","","_","_"
47,"garbho","_","_","garbha","NC","","_","_"
48,"_","_","_","manuṣya","NC","","_","_"
49,"_","_","_","vigraha","NC","","_","_"
50,"jāyate","_","_","jan","V","jan","_","_"
51,"_","_","_","manuṣya","NC","","_","_"
52,"_","_","_","ca","CCD","","_","_"
53,"_","_","_","manuṣya","NC","","_","_"
54,"_","_","_","prabhava","NC","","_","_"
55,"ucyate","_","_","vak","V","vac","_","_"
56,"_","_","_","tad","PRD","","_","_"
57,"_","_","_","yoni","NC","","_","_"
1,"_","_","_","yad","PRL","","_","_"
2,"_","_","_","ca","CCD","","_","_"
3,"_","_","_","vac","PPP","","_","_"
4,"yadi","_","_","yadi","CSB","","_","_"
5,"ca","_","_","ca","CCD","","_","_"
6,"manuṣyo","_","_","manuṣya","NC","","_","_"
7,"_","_","_","manuṣya","NC","","_","_"
8,"_","_","_","prabhava","NC","","_","_"
9,"_","_","_","kasmāt","CX","","_","_"
10,"_","_","_","na","CNG","","_","_"
11,"_","_","_","jaḍa","JJ","","_","_"
12,"_","_","_","ādi","NC","","_","_"
13,"jātāḥ","_","_","jan","PPP","","_","_"
14,"_","_","_","pitṛ","NC","","_","_"
15,"_","_","_","sadṛśa","JJ","","_","_"
16,"_","_","_","rūpa","NC","","_","_"
17,"_","_","_","bhav","V","bhū","_","_"
18,"_","_","_","iti","CQT","","_","_"
19,"_","_","_","tatra","CAD","","_","_"
20,"_","_","_","vak","V","vac","_","_"
21,"yasya","_","_","yad","PRL","","_","_"
22,"yasya","_","_","yad","PRL","","_","_"
23,"_","_","_","hi","CX","","_","_"
24,"_","_","_","aṅga","NC","","_","_"
25,"_","_","_","avayava","NC","","_","_"
26,"bīje","_","_","bīja","NC","","_","_"
27,"_","_","_","bīja","NC","","_","_"
28,"_","_","_","bhāga","NC","","_","_"
29,"upatapto","_","_","upatap","PPP","","_","_"
30,"bhavati","_","_","bhav","V","bhū","_","_"
31,"tasya","_","_","tad","PRD","","_","_"
32,"_","_","_","tad","PRD","","_","_"
33,"_","_","_","aṅga","NC","","_","_"
34,"_","_","_","avayava","NC","","_","_"
35,"_","_","_","vikṛti","NC","","_","_"
36,"_","_","_","upajan","V","upajan","_","_"
37,"_","_","_","na","CNG","","_","_"
38,"_","_","_","upajan","V","upajan","_","_"
39,"_","_","_","ca","CCD","","_","_"
40,"_","_","_","anupatāpa","NC","","_","_"
41,"_","_","_","tasmāt","CX","","_","_"
42,"_","_","_","ubhaya","JJ","","_","_"
43,"_","_","_","upapatti","NC","","_","_"
44,"_","_","_","api","CX","","_","_"
45,"_","_","_","atra","CAD","","_","_"
1,"sarvasya","_","_","sarva","JQ","","_","_"
2,"_","_","_","ca","CCD","","_","_"
3,"_","_","_","ātman","NC","","_","_"
4,"_","_","_","ja","JJ","","_","_"
5,"_","_","_","indriya","NC","","_","_"
6,"teṣāṃ","_","_","tad","PRD","","_","_"
7,"_","_","_","bhāva","NC","","_","_"
8,"_","_","_","abhāva","NC","","_","_"
9,"_","_","_","hetu","NC","","_","_"
10,"_","_","_","daiva","NC","","_","_"
11,"_","_","_","tasmāt","CX","","_","_"
12,"_","_","_","na","CNG","","_","_"
13,"_","_","_","ekāntataḥ","CX","","_","_"
14,"_","_","_","jaḍa","JJ","","_","_"
15,"_","_","_","ādi","NC","","_","_"
16,"jātāḥ","_","_","jan","PPP","","_","_"
17,"_","_","_","pitṛ","NC","","_","_"
18,"_","_","_","sadṛśa","JJ","","_","_"
19,"_","_","_","rūpa","NC","","_","_"
20,"bhavanti","_","_","bhav","V","bhū","_","_"
1,"na","_","_","na","CNG","","_","_"
2,"_","_","_","ca","CCD","","_","_"
3,"_","_","_","ātman","NC","","_","_"
4,"_","_","_","as","KDP","","_","_"
5,"_","_","_","indriya","NC","","_","_"
6,"jñaḥ","_","_","jña","NC","","_","_"
7,"asatsu","_","_","asat","JJ","","_","_"
8,"vā","_","_","vā","CCD","","_","_"
9,"_","_","_","bhav","V","bhū","_","_"
10,"_","_","_","ajña","JJ","","_","_"
11,"na","_","_","na","CNG","","_","_"
12,"_","_","_","hi","CX","","_","_"
13,"_","_","_","asattva","JJ","","_","_"
14,"_","_","_","kadācid","CX","","_","_"
15,"_","_","_","ātman","NC","","_","_"
16,"_","_","_","sattva","NC","","_","_"
17,"_","_","_","viśeṣa","NC","","_","_"
18,"_","_","_","ca","CCD","","_","_"
19,"_","_","_","upalabh","V","upalabh","_","_"
20,"_","_","_","jñāna","NC","","_","_"
21,"_","_","_","viśeṣa","NC","","_","_"
22,"iti","_","_","iti","CQT","","_","_"
1,"bhavanti","_","_","bhav","V","bhū","_","_"
2,"_","_","_","ca","CCD","","_","_"
3,"_","_","_","atra","CAD","","_","_"
1,"na","_","_","na","CNG","","_","_"
2,"_","_","_","kartṛ","JJ","","_","_"
3,"_","_","_","indriya","NC","","_","_"
4,"_","_","_","abhāva","NC","","_","_"
5,"_","_","_","kārya","NC","","_","_"
6,"_","_","_","jñāna","NC","","_","_"
7,"pravartate","_","_","pravart","V","pravṛt","_","_"
1,"yā","_","_","yad","PRL","","_","_"
2,"kriyā","_","_","kriyā","NC","","_","_"
3,"vartate","_","_","vart","V","vṛt","_","_"
4,"bhāvaiḥ","_","_","bhāva","NC","","_","_"
5,"sā","_","_","tad","PRD","","_","_"
6,"vinā","_","_","vinā","CX","","_","_"
7,"_","_","_","tad","PRD","","_","_"
8,"_","_","_","na","CNG","","_","_"
9,"vartate","_","_","vart","V","vṛt","_","_"
1,"_","_","_","jñā","KDP","","_","_"
2,"_","_","_","api","CX","","_","_"
3,"mṛdo","_","_","mṛd","NC","","_","_"
4,"'bhāvāt","_","_","abhāva","NC","","_","_"
5,"_","_","_","kumbha","NC","","_","_"
6,"_","_","_","kṛt","JJ","","_","_"
7,"_","_","_","na","CNG","","_","_"
8,"pravartate","_","_","pravart","V","pravṛt","_","_"
1,"śrūyatāṃ","_","_","śṛṇ","V","śru","_","_"
2,"_","_","_","ca","CCD","","_","_"
3,"_","_","_","ida","PRD","","_","_"
4,"_","_","_","adhyātma","NC","","_","_"
5,"_","_","_","ātman","NC","","_","_"
6,"_","_","_","jñāna","NC","","_","_"
7,"_","_","_","bala","NC","","_","_"
8,"mahat","_","_","mahat","JJ","","_","_"
1,"indriyāṇi","_","_","indriya","NC","","_","_"
2,"ca","_","_","ca","CCD","","_","_"
3,"saṃkṣipya","_","_","saṃkṣip","CGDA","","_","_"
4,"manaḥ","_","_","manas","NC","","_","_"
5,"saṃkṣipya","_","_","saṃkṣip","CGDA","","_","_"
6,"cañcalam","_","_","cañcala","JJ","","_","_"
1,"_","_","_","praviś","CGDA","","_","_"
2,"_","_","_","adhyātma","NC","","_","_"
3,"_","_","_","ātman","NC","","_","_"
4,"_","_","_","jña","JJ","","_","_"
5,"sve","_","_","sva","JJ","","_","_"
6,"jñāne","_","_","jñāna","NC","","_","_"
7,"paryavasthitaḥ","_","_","paryavasthā","PPP","","_","_"
1,"_","_","_","sarvatra","CX","","_","_"
2,"a","_","_","alpha_privativum","PPP","","_","_"
2,"_","_","_","vadhā","PPP","","_","_"
3,"_","_","_","jñāna","NC","","_","_"
4,"_","_","_","sarva","JQ","","_","_"
5,"_","_","_","bhāva","NC","","_","_"
6,"parīkṣate","_","_","parīkṣ","V","parīkṣ","_","_"
1,"gṛhṇīṣva","_","_","grah","V","grah","_","_"
2,"_","_","_","ca","CCD","","_","_"
3,"_","_","_","ida","PRD","","_","_"
4,"_","_","_","apara","PPX","","_","_"
5,"bharadvāja","_","_","bharadvāja","NC","","_","_"
6,"vinirṇayam","_","_","vinirṇaya","NC","","_","_"
1,"_","_","_","nivṛt","PPP","","_","_"
2,"_","_","_","indriya","NC","","_","_"
3,"_","_","_","vāc","NC","","_","_"
4,"_","_","_","ceṣṭā","NC","","_","_"
5,"suptaḥ","_","_","svap","PPP","","_","_"
6,"_","_","_","svapna","NC","","_","_"
7,"_","_","_","ga","PPP","","_","_"
8,"yadā","_","_","yadā","CSB","","_","_"
1,"viṣayān","_","_","viṣaya","NC","","_","_"
2,"_","_","_","sukha","NC","","_","_"
3,"_","_","_","duḥkha","NC","","_","_"
4,"ca","_","_","ca","CCD","","_","_"
5,"vetti","_","_","vid","V","vid","_","_"
6,"_","_","_","na","CNG","","_","_"
7,"_","_","_","ajña","JJ","","_","_"
8,"_","_","_","api","CX","","_","_"
9,"_","_","_","atas","CX","","_","_"
10,"smṛtaḥ","_","_","smṛ","PPP","","_","_"
1,"_","_","_","na","CNG","","_","_"
2,"_","_","_","ātman","NC","","_","_"
3,"_","_","_","jñāna","NC","","_","_"
4,"_","_","_","ṛte","CX","","_","_"
5,"_","_","_","ca","CCD","","_","_"
6,"_","_","_","eka","PPX","","_","_"
7,"jñānaṃ","_","_","jñāna","NC","","_","_"
8,"kiṃcit","_","_","kiṃcit","PRI","","_","_"
9,"pravartate","_","_","pravart","V","pravṛt","_","_"
1,"na","_","_","na","CNG","","_","_"
2,"_","_","_","hi","CX","","_","_"
3,"_","_","_","eka","PPX","","_","_"
4,"vartate","_","_","vart","V","vṛt","_","_"
5,"bhāvo","_","_","bhāva","NC","","_","_"
6,"vartate","_","_","vart","V","vṛt","_","_"
7,"_","_","_","na","CNG","","_","_"
8,"_","_","_","api","CX","","_","_"
9,"_","_","_","ahetuka","JJ","","_","_"
1,"_","_","_","tasmāt","CX","","_","_"
2,"_","_","_","jña","NC","","_","_"
3,"_","_","_","prakṛti","NC","","_","_"
4,"_","_","_","ca","CCD","","_","_"
5,"_","_","_","ātman","NC","","_","_"
6,"draṣṭā","_","_","draṣṭṛ","NC","","_","_"
7,"_","_","_","kāraṇa","NC","","_","_"
8,"_","_","_","eva","CEM","","_","_"
9,"ca","_","_","ca","CCD","","_","_"
1,"_","_","_","sarva","JQ","","_","_"
2,"_","_","_","tad","PRD","","_","_"
3,"_","_","_","bharadvāja","NC","","_","_"
4,"nirṇītaṃ","_","_","nirṇī","PPP","","_","_"
5,"jahi","_","_","jah","V","hā","_","_"
6,"saṃśayam","_","_","saṃśaya","NC","","_","_"
1,"tatra","_","_","tatra","CAD","","_","_"
2,"ślokau","_","_","śloka","NC","","_","_"
1,"_","_","_","hetu","NC","","_","_"
2,"_","_","_","garbha","NC","","_","_"
3,"nirvṛttau","_","_","nirvṛtti","NC","","_","_"
4,"vṛddhau","_","_","vṛddhi","NC","","_","_"
5,"janmani","_","_","janman","NC","","_","_"
6,"_","_","_","ca","CCD","","_","_"
7,"_","_","_","eva","CEM","","_","_"
8,"yaḥ","_","_","yad","PRL","","_","_"
1,"_","_","_","punarvasu","NC","","_","_"
2,"_","_","_","mati","NC","","_","_"
3,"_","_","_","yad","PRL","","_","_"
4,"ca","_","_","ca","CCD","","_","_"
5,"_","_","_","bharadvāja","NC","","_","_"
6,"_","_","_","mati","NC","","_","_"
7,"_","_","_","ca","CCD","","_","_"
8,"yā","_","_","yad","PRL","","_","_"
1,"_","_","_","pratijñā","NC","","_","_"
2,"_","_","_","pratiṣedha","NC","","_","_"
3,"_","_","_","ca","CCD","","_","_"
4,"_","_","_","viśada","JJ","","_","_"
5,"_","_","_","ca","CCD","","_","_"
6,"_","_","_","ātman","NC","","_","_"
7,"_","_","_","nirṇaya","NC","","_","_"
1,"_","_","_","garbhāvakrānti","NC","","_","_"
2,"_","_","_","uddiś","CGDA","","_","_"
3,"khuḍḍīkāṃ","_","_","khuḍḍikā","NC","","_","_"
4,"_","_","_","tad","PRD","","_","_"
5,"_","_","_","prakāśay","PPP","","_","_"
