"WordID","word","NormSTEM","suffix","lemma","PoS","Root","NormSuffix","NormWord"
NA,"<doc textid = ""kauzikaprajjaparamitasutra"" genre = ""sūtra"" title = ""kauśikaprajñāpāramitāsūtra"" author = ""n / a"" discourse = ""prajñāpāramitā"" tradition = ""tantra"" period = ""commentarial"" source = ""gretil accessed aug 2019 : http :// gretil.sub.uni-goettingen.d e/ greti l/ corpuste i/ sa_gretilbuddh _ kausikaprajnaparamitasutra base on the e. by p.l. vaiya in_ mahayana-sutra-samgrahah_final.xml"" date_range = ""very late' conze "" notes = ""alternative genre: tantra ; alternative discourse: tantra; see e. conze. perfect wisdom. the short prajñāpāramitā texts 1993 pp. ivv and 157-160 english tr.; late text compilation tantra; incorporates mantra and citations from other pp texts see conze; the short prajnaparamita texts; 1973 ; alternative genre: tantra ; alternative discourse: tantra; see e. conze. perfect wisdom. the short prajñāpāramitā texts 1993 pp. iv-v and 157-160 english tr."" religion = ""buddh"" edition = ""based on p.l. vaidya 1961"" digitization = ""members of the sanskrit buddhist input project"" segmentation_lemmatization = ""ligeia lugli & buddhist translators workbench team"" metadata_enrichment = ""bruno galasek-hul & buddhist translators workbench team"" proofreader = "" n/ a"" permission = ""permission for derivatives from m. mehner on behalf of gretil"" reconstructions = ""none"">","","","","","","",""
NA,"<page number=""95"">","","","","","","",""
3,"kauśika","KAUŚIK","a","kauśika","noun-adj","","a","kauśika"
4,"prajñāpāramitā","PRAJÑĀPĀRAMIT","ā","prajñāpāramitā","noun-adj","","ā","prajñāpāramitā"
5,"sūtram","SŪTR","am","sūtra","noun-adj","","am","sūtram"
6,"/","","","","punct","","","/"
NA,"</s>","","","","","","",""
NA,"<s number=""1"">","","","","","","",""
1,"namo","NAM","o","namas","noun-adj","","aḥ","namaḥ"
2,"sarva","SARV","a","sarva","noun-adj","","a","sarva"
3,"buddha","BUDDH","a","buddha","noun-adj","","a","buddha"
4,"bodhisattvebhyaḥ","BODHISATTV","ebhyaḥ","bodhisattva","noun-adj","","ebhyaḥ","bodhisattvebhyaḥ"
5,"//","","","","punct","","","//"
NA,"</s>","","","","","","",""
NA,"<s number=""2"">","","","","","","",""
1,"evaṃ","","","eva","ind","","","eva"
2,"mayā","","","mat","pron","","","mat"
3,"śrutam","ŚRUT","am","śruta","noun-adj","","am","śrutam"
4,"/","","","","punct","","","/"
NA,"</s>","","","","","","",""
NA,"<s number=""3"">","","","","","","",""
1,"ekasmin","EK","asmin","eka","noun-adj","","asmin","ekasmin"
2,"samaye","SAMAY","e","samaya","noun-adj","","e","samaye"
3,"bhagavān","BHAGAV","ān","bhagavat","noun-adj","","ān","bhagavān"
4,"rājagṛhe","RĀJAGṚH","e","rājagṛha","noun-adj","","e","rājagṛhe"
5,"viharati","VIHAR","ati","vihar","verb","vihṛ","ati","viharati"
6,"sma","","","sma","ind","","","sma"
7,"gṛdhra","GṚDHR","a","gṛdhra","noun-adj","","a","gṛdhra"
8,"kūṭe","KŪṬ","e","kūṭa","noun-adj","","e","kūṭe"
9,"parvate","PARVAT","e","parvata","noun-adj","","e","parvate"
10,"mahatā","MAHAT","ā","mahat","noun-adj","","ā","mahatā"
11,"bhikṣu","BHIKṢ","u","bhikṣu","noun-adj","","u","bhikṣu"
12,"saṃghena","SAṂGH","ena","saṃgha","noun-adj","","ena","saṃghena"
13,"sār","SĀR","","sāra","noun-adj","","","sār"
14,"dhaman","DHAMAN","a","dhamana","noun-adj","","a","dhamana"
15,"^ekaiś","EK","aiś","eka","noun-adj","","aiś","ekaiś"
16,"ca","","","ca","ind","","","ca"
17,"bodhisattva","BODHISATTV","a","bodhisattva","noun-adj","","a","bodhisattva"
18,"śatasahasraiḥ","ŚATASAHASR","aiḥ","śatasahasra","noun-adj","","air","śatasahasrair"
19,"sarvaiḥ","SARV","aiḥ","sarva","noun-adj","","air","sarvair"
20,"kumāra","KUMĀR","a","kumāra","noun-adj","","a","kumāra"
21,"bhūtaiḥ","BHŪT","aiḥ","bhūta","noun-adj","","air","bhūtair"
22,"/","","","","punct","","","/"
NA,"</s>","","","","","","",""
NA,"<s number=""4"">","","","","","","",""
1,"tatra","","","tatra","ind","","","tatra"
2,"khalu","KHAL","u","khalu","noun-adj","","u","khalu"
3,"bhagavān","BHAGAV","ān","bhagavat","noun-adj","","ān","bhagavān"
4,"śakraṃ","ŚAKR","aṃ","śakra","noun-adj","","am","śakram"
5,"devānām","DEV","ānām","deva","noun-adj","","ānām","devānām"
6,"indram","INDR","am","indra","noun-adj","","am","indram"
7,"āmantrayate","AMANTR","ayate","amantr","verb","","yate","amantryate"
8,"sma","","","sma","ind","","","sma"
9,"//","","","","punct","","","//"
NA,"</s>","","","","","","",""
NA,"<s number=""5"">","","","","","","",""
1,"ayaṃ","AYAṂ","","idam","pron","","","ayaṃ"
2,"kauśika","KAUŚIK","a","kauśika","noun-adj","","a","kauśika"
3,"prajñāpāramitāyāḥ","PRAJÑĀPĀRAMIT","āyāḥ","prajñāpāramitā","noun-adj","","āyāḥ","prajñāpāramitāyāḥ"
4,"arthaḥ","ARTH","aḥ","artha","noun-adj","","aḥ","arthaḥ"
5,"—","","","","punct","","","—"
6,"prajñāpāramitā","PRAJÑĀPĀRAMIT","ā","prajñāpāramitā","noun-adj","","ā","prajñāpāramitā"
7,"na","","","na","ind","","","na"
8,"dvayena","DVAY","ena","dvaya","noun-adj","","ena","dvayena"
9,"draṣṭavyā","DRAṢ","ṭavyā","darś","verb","dṛś","ṭavyā","draṣṭavyā"
10,"na","","","na","ind","","","na"
11,"a","","","alpha_privativum","ind","","","alpha_privativum"
12,"dvayena","DVAY","ena","dvaya","noun-adj","","ena","dvayena"
13,"/","","","","punct","","","/"
NA,"</s>","","","","","","",""
NA,"<s number=""6"">","","","","","","",""
1,"na","","","na","ind","","","na"
2,"nimittato","NIMITT","ato","nimitta","noun-adj","","ataḥ","nimittataḥ"
3,"na","","","na","ind","","","na"
4,"a","","","alpha_privativum","ind","","","alpha_privativum"
5,"nimittataḥ","NIMITT","ataḥ","nimitta","noun-adj","","ataḥ","nimittataḥ"
6,"/","","","","punct","","","/"
NA,"</s>","","","","","","",""
NA,"<s number=""7"">","","","","","","",""
1,"na","","","na","ind","","","na"
2,"āyūhato","ĀYŪHAT","o","āyūhata","noun-adj","","aḥ","āyūhataḥ"
3,"na","","","na","ind","","","na"
4,"nir","","","niḥ_privativum","ind","","","niḥ_privativum"
5,"āyūhataḥ","ĀYŪHAT","aḥ","āyūhata","noun-adj","","aḥ","āyūhataḥ"
6,"/","","","","punct","","","/"
NA,"</s>","","","","","","",""
NA,"<s number=""8"">","","","","","","",""
1,"n","","","na","ind","","","na"
2,"otkṣepato","UTKṢEP","ato","utkṣepa","noun-adj","","ataḥ","utkṣepataḥ"
3,"na","","","na","ind","","","na"
4,"prakṣepataḥ","PRAKṢEP","ataḥ","prakṣepa","noun-adj","","ataḥ","prakṣepataḥ"
5,"/","","","","punct","","","/"
NA,"</s>","","","","","","",""
NA,"<s number=""9"">","","","","","","",""
1,"na","","","na","ind","","","na"
2,"saṃkleśato","SAṂKLEŚ","ato","saṃkleśa","noun-adj","","ataḥ","saṃkleśataḥ"
3,"na","","","na","ind","","","na"
4,"a","","","alpha_privativum","ind","","","alpha_privativum"
5,"saṃkleśataḥ","SAṂKLEŚ","ataḥ","saṃkleśa","noun-adj","","ataḥ","saṃkleśataḥ"
6,"/","","","","punct","","","/"
NA,"</s>","","","","","","",""
NA,"<s number=""10"">","","","","","","",""
1,"na","","","na","ind","","","na"
2,"vyavadānato","VYAVADĀN","ato","vyavadāna","noun-adj","","ataḥ","vyavadānataḥ"
3,"na","","","na","ind","","","na"
4,"a","","","alpha_privativum","ind","","","alpha_privativum"
5,"vyavadānataḥ","VYAVADĀN","ataḥ","vyavadāna","noun-adj","","ataḥ","vyavadānataḥ"
6,"/","","","","punct","","","/"
NA,"</s>","","","","","","",""
NA,"<s number=""11"">","","","","","","",""
1,"n","","","na","ind","","","na"
2,"otsargato","UTSARG","ato","utsarga","noun-adj","","ataḥ","utsargataḥ"
3,"na","","","na","ind","","","na"
4,"an","","","alpha_privativum","ind","","","alpha_privativum"
5,"utsargataḥ","UTSARG","ataḥ","utsarga","noun-adj","","ataḥ","utsargataḥ"
6,"/","","","","punct","","","/"
NA,"</s>","","","","","","",""
NA,"<s number=""12"">","","","","","","",""
1,"na","","","na","ind","","","na"
2,"sthānato","STHĀN","ato","sthāna","noun-adj","","ataḥ","sthānataḥ"
3,"na","","","na","ind","","","na"
4,"asthānataḥ","ASTHĀNAT","aḥ","asthānatā","noun-adj","","aḥ","asthānataḥ"
5,"/","","","","punct","","","/"
NA,"</s>","","","","","","",""
NA,"<s number=""13"">","","","","","","",""
1,"na","","","na","ind","","","na"
2,"yogato","YOG","ato","yoga","noun-adj","","ataḥ","yogataḥ"
3,"na","","","na","ind","","","na"
4,"a","","","alpha_privativum","ind","","","alpha_privativum"
5,"yogataḥ","YOG","ataḥ","yoga","noun-adj","","ataḥ","yogataḥ"
6,"/","","","","punct","","","/"
NA,"</s>","","","","","","",""
NA,"<s number=""14"">","","","","","","",""
1,"na","","","na","ind","","","na"
2,"saṃbandhato","SAṂBANDH","ato","saṃbandha","noun-adj","","ataḥ","saṃbandhataḥ"
3,"na","","","na","ind","","","na"
4,"a","","","alpha_privativum","ind","","","alpha_privativum"
5,"saṃbandhataḥ","SAṂBANDH","ataḥ","saṃbandha","noun-adj","","ataḥ","saṃbandhataḥ"
6,"/","","","","punct","","","/"
NA,"</s>","","","","","","",""
NA,"<s number=""15"">","","","","","","",""
1,"na","","","na","ind","","","na"
2,"pratyayato","PRATYAY","ato","pratyaya","noun-adj","","ataḥ","pratyayataḥ"
3,"na","","","na","ind","","","na"
4,"a","","","alpha_privativum","ind","","","alpha_privativum"
5,"pratyayataḥ","PRATYAY","ataḥ","pratyaya","noun-adj","","ataḥ","pratyayataḥ"
6,"/","","","","punct","","","/"
NA,"</s>","","","","","","",""
NA,"<s number=""16"">","","","","","","",""
1,"na","","","na","ind","","","na"
2,"dharmato","DHARM","ato","dharma","noun-adj","","ataḥ","dharmataḥ"
3,"na","","","na","ind","","","na"
4,"a","","","alpha_privativum","ind","","","alpha_privativum"
5,"dharmataḥ","DHARMAT","aḥ","dharmatas","noun-adj","","aḥ","dharmataḥ"
6,"/","","","","punct","","","/"
NA,"</s>","","","","","","",""
NA,"<s number=""17"">","","","","","","",""
1,"na","","","na","ind","","","na"
2,"tathatayā","TATHAT","ayā","tathatā","noun-adj","","ayā","tathatayā"
3,"na","","","na","ind","","","na"
4,"a","","","alpha_privativum","ind","","","alpha_privativum"
5,"tathatayā","TATHAT","ayā","tathatā","noun-adj","","ayā","tathatayā"
6,"na","","","na","ind","","","na"
7,"bhūtakoṭyā","BHŪTAKOṬ","yā","bhūtakoṭi","noun-adj","","yāḥ","bhūtakoṭyāḥ"
8,"na","","","na","ind","","","na"
9,"a","","","alpha_privativum","ind","","","alpha_privativum"
10,"bhūtakoṭyā","BHŪTAKOṬ","yā","bhūtakoṭi","noun-adj","","yāḥ","bhūtakoṭyāḥ"
11,"veditavyā","VED","itavyā","vid","verb","vid","itavyā","veditavyā"
12,"//","","","","punct","","","//"
NA,"</s>","","","","","","",""
NA,"<s number=""18"">","","","","","","",""
1,"evam","","","eva","ind","","","eva"
2,"ev","","","eva","ind","","","eva"
3,"āyaṃ","ĀYAṂ","","idam","pron","","","āyaṃ"
4,"sa","","","tad","pron","","","tad"
5,"kauśika","KAUŚIK","a","kauśika","noun-adj","","a","kauśika"
6,"prajñāpāramitāyāḥ","PRAJÑĀPĀRAMIT","āyāḥ","prajñāpāramitā","noun-adj","","āyāḥ","prajñāpāramitāyāḥ"
7,"arthaḥ","ARTH","aḥ","artha","noun-adj","","aḥ","arthaḥ"
8,"/","","","","punct","","","/"
NA,"</s>","","","","","","",""
NA,"<s number=""19"">","","","","","","",""
1,"tadyathā","","","tadyathā","ind","","","tadyathā"
2,"sarvadharmasamatvāt","SARVADHARMASAM","atvāt","sarvadharmasamatva","noun-adj","","atvāt","sarvadharmasamatvāt"
3,"prajñāpāramitā","PRAJÑĀPĀRAMIT","ā","prajñāpāramitā","noun-adj","","ā","prajñāpāramitā"
4,"samā","SAM","ā","samā","noun-adj","","ā","samā"
5,"/","","","","punct","","","/"
NA,"</s>","","","","","","",""
NA,"<s number=""20"">","","","","","","",""
1,"sarva","SARV","a","sarva","noun-adj","","a","sarva"
2,"dharma","DHARM","a","dharma","noun-adj","","a","dharma"
3,"viviktatvāt","VIVIKT","atvāt","viviktatva","noun-adj","","atvāt","viviktatvāt"
4,"prajñāpāramitā","PRAJÑĀPĀRAMIT","ā","prajñāpāramitā","noun-adj","","ā","prajñāpāramitā"
5,"viviktā","VIVIKT","ā","vivikta","noun-adj","","ā","viviktā"
6,"/","","","","punct","","","/"
NA,"</s>","","","","","","",""
NA,"<s number=""21"">","","","","","","",""
1,"sarva","SARV","a","sarva","noun-adj","","a","sarva"
2,"dharm","DHARM","","dharma","noun-adj","","","dharm"
3,"ā","","","alpha_privativum","ind","","","alpha_privativum"
4,"calatvāt","CAL","atvāt","calatva","noun-adj","","atvāt","calatvāt"
5,"prajñāpāramitā","PRAJÑĀPĀRAMIT","ā","prajñāpāramitā","noun-adj","","ā","prajñāpāramitā"
6,"a","","","alpha_privativum","ind","","","alpha_privativum"
7,"calā","CAL","ā","cala","noun-adj","","ā","calā"
8,"/","","","","punct","","","/"
NA,"</s>","","","","","","",""
NA,"<s number=""22"">","","","","","","",""
1,"sarva","SARV","a","sarva","noun-adj","","a","sarva"
2,"dharmām","DHARM","ām","dharmā","noun-adj","","ām","dharmām"
3,"anyatvāt","ANY","atvāt","anyatva","noun-adj","","atvāt","anyatvāt"
4,"prajñāpāramitā","PRAJÑĀPĀRAMIT","ā","prajñāpāramitā","noun-adj","","ā","prajñāpāramitā"
5,"a","","","alpha_privativum","ind","","","alpha_privativum"
6,"manyatā","MANY","atā","manyatā","noun-adj","","atām","manyatām"
7,"/","","","","punct","","","/"
NA,"</s>","","","","","","",""
NA,"<s number=""23"">","","","","","","",""
1,"sarva","SARV","a","sarva","noun-adj","","a","sarva"
2,"dharm","DHARM","a","dharma","noun-adj","","a","dharma"
3,"^ābhīrutvāt","ĀBHĪR","utvāt","ābhīrutva","noun-adj","","utvāt","ābhīrutvāt"
4,"prajñāpāramitā","PRAJÑĀPĀRAMIT","ā","prajñāpāramitā","noun-adj","","ā","prajñāpāramitā"
5,"abhīru","ABHĪR","u","abhīru","noun-adj","","u","abhīru"
6,"/","","","","punct","","","/"
NA,"</s>","","","","","","",""
NA,"<s number=""24"">","","","","","","",""
1,"sarva","SARV","a","sarva","noun-adj","","a","sarva"
2,"dharm","DHARM","a","dharma","noun-adj","","a","dharma"
3,"^ācchambhitatayā","ĀCCHAMBHIT","atayā","ācchaṃbhitatā","noun-adj","","atayā","ācchambhitatayā"
4,"prajñāpāramitā","PRAJÑĀPĀRAMIT","ā","prajñāpāramitā","noun-adj","","ā","prajñāpāramitā"
5,"acchambhī","ACCHAMBH","ī","acchambhin","noun-adj","","ī","acchambhī"
6,"/","","","","punct","","","/"
NA,"</s>","","","","","","",""
NA,"<s number=""25"">","","","","","","",""
1,"sarva","SARV","a","sarva","noun-adj","","a","sarva"
2,"dharm","DHARM","a","dharma","noun-adj","","a","dharma"
3,"^aika","EK","a","eka","noun-adj","","a","eka"
4,"rasatvāt","RAS","atvāt","rasatva","noun-adj","","atvāt","rasatvāt"
5,"prajñāpāramitā","PRAJÑĀPĀRAMIT","ā","prajñāpāramitā","noun-adj","","ā","prajñāpāramitā"
6,"eka","EK","a","eka","noun-adj","","a","eka"
7,"rasā","RAS","ā","rasā","noun-adj","","ā","rasā"
8,"/","","","","punct","","","/"
NA,"</s>","","","","","","",""
NA,"<s number=""26"">","","","","","","",""
1,"sarva","SARV","a","sarva","noun-adj","","a","sarva"
2,"dharm","DHARM","","dharma","noun-adj","","","dharm"
3,"ān","","","alpha_privativum","ind","","","alpha_privativum"
4,"utpādatvāt","UTPĀD","atvāt","utpādatva","noun-adj","","atvāt","utpādatvāt"
5,"prajñāpāramitā","PRAJÑĀPĀRAMIT","ā","prajñāpāramitā","noun-adj","","ā","prajñāpāramitā"
6,"an","","","alpha_privativum","ind","","","alpha_privativum"
7,"utpādā","UTPĀD","ā","utpāda","noun-adj","","ā","utpādā"
8,"/","","","","punct","","","/"
NA,"</s>","","","","","","",""
NA,"<s number=""27"">","","","","","","",""
1,"sarva","SARV","a","sarva","noun-adj","","a","sarva"
2,"dharm","DHARM","","dharma","noun-adj","","","dharm"
3,"ā","","","alpha_privativum","ind","","","alpha_privativum"
4,"nirodhatvāt","NIRODH","atvāt","nirodhatva","noun-adj","","atvāt","nirodhatvāt"
5,"prajñāpāramitā","PRAJÑĀPĀRAMIT","ā","prajñāpāramitā","noun-adj","","ā","prajñāpāramitā"
6,"a","","","alpha_privativum","ind","","","alpha_privativum"
7,"nirodhā","NIRODH","ā","nirodha","noun-adj","","ā","nirodhā"
8,"/","","","","punct","","","/"
NA,"</s>","","","","","","",""
NA,"<s number=""28"">","","","","","","",""
1,"gagana","GAGAN","a","gagana","noun-adj","","a","gagana"
2,"kalpatvāt","KALP","atvāt","kalpatva","noun-adj","","atvāt","kalpatvāt"
3,"sarva","SARV","a","sarva","noun-adj","","a","sarva"
4,"dharmāṇāṃ","DHARM","āṇāṃ","dharma","noun-adj","","ānām","dharmānām"
5,"prajñāpāramitā","PRAJÑĀPĀRAMIT","ā","prajñāpāramitā","noun-adj","","ā","prajñāpāramitā"
6,"gagana","GAGAN","a","gagana","noun-adj","","a","gagana"
7,"kalpā","KALP","ā","kalpa","noun-adj","","ā","kalpā"
8,"/","","","","punct","","","/"
NA,"</s>","","","","","","",""
NA,"<s number=""29"">","","","","","","",""
1,"rūpā","RŪP","ā","rūpā","noun-adj","","ā","rūpā"
2,"paryantatvāt","PARYANT","atvāt","paryanta","noun-adj","","atvāt","paryantatvāt"
3,"prajñāpāramitā","PRAJÑĀPĀRAMIT","ā","prajñāpāramitā","noun-adj","","ā","prajñāpāramitā"
4,"aparyantā","APARYANT","ā","aparyanta","noun-adj","","ā","aparyantā"
5,"/","","","","punct","","","/"
NA,"</s>","","","","","","",""
NA,"<s number=""30"">","","","","","","",""
1,"evaṃ","","","eva","ind","","","eva"
2,"vedanā","VEDAN","ā","vedanā","noun-adj","","ā","vedanā"
3,"saṃjñā","SAṂJÑ","ā","saṃjñā","noun-adj","","ā","saṃjñā"
4,"saṃskāra","SAṂSKĀR","a","saṃskāra","noun-adj","","a","saṃskāra"
5,"vijñān","VIJÑĀN","","vijñāna","noun-adj","","","vijñān"
6,"ā","","","alpha_privativum","ind","","","alpha_privativum"
7,"paryantatvāt","PARYANT","atvāt","paryanta","noun-adj","","atvāt","paryantatvāt"
8,"prajñāpāramitā","PRAJÑĀPĀRAMIT","ā","prajñāpāramitā","noun-adj","","ā","prajñāpāramitā"
9,"aparyantā","APARYANT","ā","aparyanta","noun-adj","","ā","aparyantā"
10,"/","","","","punct","","","/"
NA,"</s>","","","","","","",""
NA,"<s number=""31"">","","","","","","",""
1,"pṛthivī","PṚTHIV","ī","pṛthivī","noun-adj","","ī","pṛthivī"
2,"dhātv","DHĀT","v","dhātu","noun-adj","","v","dhātv"
3,"aparyantatvāt","APARYANT","atvāt","aparyanta","noun-adj","","atvāt","aparyantatvāt"
4,"prajñāpāramitā","PRAJÑĀPĀRAMIT","ā","prajñāpāramitā","noun-adj","","ā","prajñāpāramitā"
5,"aparyantā","APARYANT","ā","aparyanta","noun-adj","","ā","aparyantā"
6,"/","","","","punct","","","/"
NA,"</s>","","","","","","",""
NA,"<s number=""32"">","","","","","","",""
1,"evam","","","eva","ind","","","eva"
2,"ab","AB","","ap","noun-adj","","","ab"
3,"dhātu","DHĀT","u","dhātu","noun-adj","","u","dhātu"
4,"—","","","","punct","","","—"
5,"tejo","TEJ","o","teja","noun-adj","","aḥ","tejaḥ"
6,"dhātu","DHĀT","u","dhātu","noun-adj","","u","dhātu"
7,"—","","","","punct","","","—"
8,"vāyu","VĀY","u","vāyu","noun-adj","","u","vāyu"
9,"dhātu","DHĀT","u","dhātu","noun-adj","","u","dhātu"
10,"—","","","","punct","","","—"
11,"ākāśa","ĀKĀŚ","a","ākāśa","noun-adj","","a","ākāśa"
12,"dhātu","DHĀT","u","dhātu","noun-adj","","u","dhātu"
13,"—","","","","punct","","","—"
14,"vijñāna","VIJÑĀN","a","vijñāna","noun-adj","","a","vijñāna"
15,"dhātv","DHĀT","v","dhātu","noun-adj","","v","dhātv"
16,"aparyantatvāt","APARYANT","atvāt","aparyanta","noun-adj","","atvāt","aparyantatvāt"
17,"prajñāpāramitā","PRAJÑĀPĀRAMIT","ā","prajñāpāramitā","noun-adj","","ā","prajñāpāramitā"
18,"aparyantā","APARYANT","ā","aparyanta","noun-adj","","ā","aparyantā"
19,"/","","","","punct","","","/"
NA,"</s>","","","","","","",""
NA,"<s number=""33"">","","","","","","",""
1,"sumerv","SUMER","v","sumeru","noun-adj","","v","sumerv"
2,"aparyantatvāt","APARYANT","atvāt","aparyanta","noun-adj","","atvāt","aparyantatvāt"
3,"prajñāpāramitā","PRAJÑĀPĀRAMIT","ā","prajñāpāramitā","noun-adj","","ā","prajñāpāramitā"
4,"aparyantā","APARYANT","ā","aparyanta","noun-adj","","ā","aparyantā"
5,"/","","","","punct","","","/"
NA,"</s>","","","","","","",""
NA,"<s number=""34"">","","","","","","",""
1,"samudrā","SAMUDR","ā","samudra","noun-adj","","āḥ","samudrāḥ"
2,"paryantatvāt","PARYANT","atvāt","paryanta","noun-adj","","atvāt","paryantatvāt"
3,"prajñāpāramitā","PRAJÑĀPĀRAMIT","ā","prajñāpāramitā","noun-adj","","ā","prajñāpāramitā"
4,"aparyantā","APARYANT","ā","aparyanta","noun-adj","","ā","aparyantā"
5,"/","","","","punct","","","/"
NA,"</s>","","","","","","",""
NA,"<s number=""35"">","","","","","","",""
1,"vajra","VAJR","a","vajra","noun-adj","","a","vajra"
2,"samatvāt","SAM","atvāt","samatva","noun-adj","","atvāt","samatvāt"
3,"prajñāpāramitā","PRAJÑĀPĀRAMIT","ā","prajñāpāramitā","noun-adj","","ā","prajñāpāramitā"
4,"samā","SAM","ā","samā","noun-adj","","ā","samā"
5,"/","","","","punct","","","/"
NA,"</s>","","","","","","",""
NA,"<s number=""36"">","","","","","","",""
1,"sarva","SARV","a","sarva","noun-adj","","a","sarva"
2,"dharm","DHARM","","dharma","noun-adj","","","dharm"
3,"ā","","","alpha_privativum","ind","","","alpha_privativum"
4,"bhedatvāt","BHED","atvāt","bhedatva","noun-adj","","atvāt","bhedatvāt"
5,"prajñāpāramitā","PRAJÑĀPĀRAMIT","ā","prajñāpāramitā","noun-adj","","ā","prajñāpāramitā"
6,"a","","","alpha_privativum","ind","","","alpha_privativum"
7,"bhedā","BHED","ā","bheda","noun-adj","","ā","bhedā"
8,"/","","","","punct","","","/"
NA,"</s>","","","","","","",""
NA,"<s number=""37"">","","","","","","",""
1,"sarva","SARV","a","sarva","noun-adj","","a","sarva"
2,"dharma","DHARM","a","dharma","noun-adj","","a","dharma"
3,"svabhāv","SVABHĀV","a","svabhāva","noun-adj","","a","svabhāva"
4,"^ānupalabdhitvāt","ANUPALABDH","itvāt","anupalabdhitva","noun-adj","","itvāt","anupalabdhitvāt"
5,"prajñāpāramitā","PRAJÑĀPĀRAMIT","ā","prajñāpāramitā","noun-adj","","ā","prajñāpāramitā"
6,"anupalabdhiḥ","ANUPALABDH","iḥ","anupalabdhi","noun-adj","","iḥ","anupalabdhiḥ"
7,"/","","","","punct","","","/"
NA,"</s>","","","","","","",""
NA,"<s number=""38"">","","","","","","",""
1,"sarva","SARV","a","sarva","noun-adj","","a","sarva"
2,"dharma","DHARM","a","dharma","noun-adj","","a","dharma"
3,"vibhāvanā","VIBHĀVAN","ā","vibhāvanā","noun-adj","","ā","vibhāvanā"
4,"—","","","","punct","","","—"
5,"samatvāt","SAM","atvāt","samatva","noun-adj","","atvāt","samatvāt"
6,"prajñā","PRAJÑ","ā","prajñā","noun-adj","","ā","prajñā"
7,"pāramitā","PĀRAMIT","ā","pāramitā","noun-adj","","ā","pāramitā"
8,"a","","","alpha_privativum","ind","","","alpha_privativum"
9,"vibhāvanā","VIBHĀVAN","ā","vibhāvanā","noun-adj","","ā","vibhāvanā"
10,"—","","","","punct","","","—"
11,"samā","SAM","ā","samā","noun-adj","","ā","samā"
12,"/","","","","punct","","","/"
NA,"</s>","","","","","","",""
NA,"<s number=""39"">","","","","","","",""
1,"sarva","SARV","a","sarva","noun-adj","","a","sarva"
2,"dharma","DHARM","a","dharma","noun-adj","","a","dharma"
3,"niśceṣṭatvāt","NIŚCEṢṬ","atvāt","niśceṣṭatva","noun-adj","","atvāt","niśceṣṭatvāt"
4,"prajñāpāramitā","PRAJÑĀPĀRAMIT","ā","prajñāpāramitā","noun-adj","","ā","prajñāpāramitā"
5,"niśceṣṭā","NIŚCEṢṬ","ā","niśceṣṭā","noun-adj","","ā","niśceṣṭā"
6,"/","","","","punct","","","/"
NA,"</s>","","","","","","",""
NA,"<s number=""40"">","","","","","","",""
1,"sarva","SARV","a","sarva","noun-adj","","a","sarva"
2,"dharm","DHARM","","dharma","noun-adj","","","dharm"
3,"ā","","","alpha_privativum","ind","","","alpha_privativum"
4,"cintyatvāt","CINTY","atvāt","cintya","noun-adj","","atvāt","cintyatvāt"
5,"prajñāpāramitā","PRAJÑĀPĀRAMIT","ā","prajñāpāramitā","noun-adj","","ā","prajñāpāramitā"
6,"a","","","alpha_privativum","ind","","","alpha_privativum"
7,"cinty","CINTY","a","cintya","noun-adj","","a","cintya"
8,"^eti","","","iti","ind","","","iti"
9,"//","","","","punct","","","//"
NA,"</s>","","","","","","",""
NA,"<s number=""41"">","","","","","","",""
1,"evaṃ","","","eva","ind","","","eva"
2,"dāna","DĀN","a","dāna","noun-adj","","a","dāna"
3,"pāramitā","PĀRAMIT","ā","pāramitā","noun-adj","","ā","pāramitā"
4,"—","","","","punct","","","—"
5,"śīla","ŚĪL","a","śīla","noun-adj","","a","śīla"
6,"pāramitā","PĀRAMIT","ā","pāramitā","noun-adj","","ā","pāramitā"
7,"—","","","","punct","","","—"
8,"kṣānti","KṢĀNT","i","kṣānti","noun-adj","","i","kṣānti"
9,"pāramitā","PĀRAMIT","ā","pāramitā","noun-adj","","ā","pāramitā"
10,"—","","","","punct","","","—"
11,"vīrya","VĪRY","a","vīrya","noun-adj","","a","vīrya"
12,"pāramitā","PĀRAMIT","ā","pāramitā","noun-adj","","ā","pāramitā"
13,"—","","","","punct","","","—"
14,"dhyāna","DHYĀN","a","dhyāna","noun-adj","","a","dhyāna"
15,"pāramitā","PĀRAMIT","ā","pāramitā","noun-adj","","ā","pāramitā"
16,"—","","","","punct","","","—"
17,"prajñāpāramitā","PRAJÑĀPĀRAMIT","ā","prajñāpāramitā","noun-adj","","ā","prajñāpāramitā"
18,"trimaṇḍala","TRIMAṆḌAL","a","trimaṇḍala","noun-adj","","a","trimaṇḍala"
19,"pariśuddhy","PARIŚUDDH","y","pariśuddhi","noun-adj","","i","pariśuddhi"
20,"aparyantatvāt","APARYANT","atvāt","aparyanta","noun-adj","","atvāt","aparyantatvāt"
21,"prajñāpāramitā","PRAJÑĀPĀRAMIT","ā","prajñāpāramitā","noun-adj","","ā","prajñāpāramitā"
22,"aparyantā","APARYANT","ā","aparyanta","noun-adj","","āḥ","aparyantāḥ"
23,"iti","","","iti","ind","","","iti"
24,"//","","","","punct","","","//"
NA,"</s>","","","","","","",""
NA,"<s number=""42"">","","","","","","",""
1,"prajñāpāramitā","PRAJÑĀPĀRAMIT","ā","prajñāpāramitā","noun-adj","","ā","prajñāpāramitā"
2,"ucyate","UC","yate","vak","verb","vac","yate","ucyate"
3,"yaduta","","","yaduta","ind","","","yaduta"
4,"aṣṭādaśa","AṢṬĀDAŚ","a","aṣtādaśa","noun-adj","","a","aṣṭādaśa"
5,"śūnyatā","ŚŪNYAT","ā","śūnyatā","noun-adj","","ā","śūnyatā"
6,"/","","","","punct","","","/"
NA,"</s>","","","","","","",""
NA,"<s number=""43"">","","","","","","",""
1,"tadyathā","","","tadyathā","ind","","","tadyathā"
2,"—","","","","punct","","","—"
3,"ādhyātma","ADHYĀTM","a","adhyātma","noun-adj","","a","adhyātma"
4,"śūnyatā","ŚŪNYAT","ā","śūnyatā","noun-adj","","ā","śūnyatā"
5,"bahirdhā","BAHIRDH","ā","bahirdhā","noun-adj","","ā","bahirdhā"
6,"śūnyatā","ŚŪNYAT","ā","śūnyatā","noun-adj","","ā","śūnyatā"
7,"ādhyātm","ADHYĀTM","","adhyātma","noun-adj","","","adhyātm"
8,"ā","","","alpha_privativum","ind","","","alpha_privativum"
9,"bahirdhā","BAHIRDH","ā","bahirdhā","noun-adj","","ā","bahirdhā"
10,"śūnyatā","ŚŪNYAT","ā","śūnyatā","noun-adj","","ā","śūnyatā"
11,"śūnyatā","ŚŪNYAT","ā","śūnyatā","noun-adj","","ā","śūnyatā"
12,"śūnyatā","ŚŪNYAT","ā","śūnyatā","noun-adj","","ā","śūnyatā"
13,"mahā","MAH","ā","mahat","noun-adj","","ā","mahā"
14,"śūnyatā","ŚŪNYAT","ā","śūnyatā","noun-adj","","ā","śūnyatā"
15,"paramārtha","PARAMĀRTH","a","paramārtha","noun-adj","","a","paramārtha"
16,"śūnyatā","ŚŪNYAT","ā","śūnyatā","noun-adj","","ā","śūnyatā"
17,"saṃskṛta","SAṂSKṚT","a","saṃskṛta","noun-adj","","a","saṃskṛta"
18,"śūnyatā","ŚŪNYAT","ā","śūnyatā","noun-adj","","ā","śūnyatā"
19,"a","","","alpha_privativum","ind","","","alpha_privativum"
20,"saṃskṛta","SAṂSKṚT","a","saṃskṛta","noun-adj","","a","saṃskṛta"
21,"śūnyatā","ŚŪNYAT","ā","śūnyatā","noun-adj","","ā","śūnyatā"
22,"atyanta","ATYANT","a","atyanta","noun-adj","","a","atyanta"
23,"śūnyatā","ŚŪNYAT","ā","śūnyatā","noun-adj","","ā","śūnyatā"
24,"an","","","alpha_privativum","ind","","","alpha_privativum"
25,"ādy","ĀD","y","ādi","noun-adj","","i","ādi"
26,"agra","AGR","a","agra","noun-adj","","a","agra"
27,"śūnyatā","ŚŪNYAT","ā","śūnyatā","noun-adj","","ā","śūnyatā"
28,"anapakāra","ANAPAKĀR","a","anapakāra","noun-adj","","a","anapakāra"
29,"śūnyatā","ŚŪNYAT","ā","śūnyatā","noun-adj","","ā","śūnyatā"
30,"prakṛti","PRAKṚT","i","prakṛti","noun-adj","","i","prakṛti"
31,"śūnyatā","ŚŪNYAT","ā","śūnyatā","noun-adj","","ā","śūnyatā"
32,"sva","SV","a","sva","noun-adj","","a","sva"
33,"lakṣaṇa","LAKṢAṆ","a","lakṣaṇa","noun-adj","","a","lakṣaṇa"
34,"śūnyatā","ŚŪNYAT","ā","śūnyatā","noun-adj","","ā","śūnyatā"
35,"sarva","SARV","a","sarva","noun-adj","","a","sarva"
36,"dharma","DHARM","a","dharma","noun-adj","","a","dharma"
37,"śūnyatā","ŚŪNYAT","ā","śūnyatā","noun-adj","","ā","śūnyatā"
38,"anupalambha","ANUPALAM","a","anupalambha","noun-adj","","a","anupalama"
39,"śūnyatā","ŚŪNYAT","ā","śūnyatā","noun-adj","","ā","śūnyatā"
40,"a","","","alpha_privativum","ind","","","alpha_privativum"
41,"bhāva","BHĀV","a","bhāva","noun-adj","","a","bhāva"
42,"śūnyatā","ŚŪNYAT","ā","śūnyatā","noun-adj","","ā","śūnyatā"
43,"svabhāva","SVABHĀV","a","svabhāva","noun-adj","","a","svabhāva"
44,"śūnyatā","ŚŪNYAT","ā","śūnyatā","noun-adj","","ā","śūnyatā"
45,"a","","","alpha_privativum","ind","","","alpha_privativum"
46,"bhāva","BHĀV","a","bhāva","noun-adj","","a","bhāva"
47,"svabhāva","SVABHĀV","a","svabhāva","noun-adj","","a","svabhāva"
48,"śūnyatā","ŚŪNYAT","ā","śūnyatā","noun-adj","","ā","śūnyatā"
49,"iti","","","iti","ind","","","iti"
50,"/","","","","punct","","","/"
NA,"</s>","","","","","","",""
NA,"<s number=""44"">","","","","","","",""
1,"ayam","AYAM","","idam","pron","","","ayam"
2,"ucyate","UC","yate","vak","verb","vac","yate","ucyate"
3,"saṃkṣiptena","SAṂKṢIPTEN","a","saṃkṣiptena","noun-adj","","a","saṃkṣiptena"
4,"prajñāpāramit","PRAJÑĀPĀRAMIT","a","prajñāpāramita","noun-adj","","a","prajñāpāramita"
5,"^eti","","","iti","ind","","","iti"
6,"//","","","","punct","","","//"
NA,"</s>","","","","","","",""
NA,"<s number=""45"">","","","","","","",""
NA,"</page>","","","","","","",""
NA,"<page number=""96"">","","","","","","",""
3,"tārakā","TĀRAK","ā","tārakā","noun-adj","","ā","tārakā"
4,"timiraṃ","TIMIR","aṃ","timira","noun-adj","","am","timiram"
5,"dīpo","DĪP","o","dīpa","noun-adj","","aḥ","dīpaḥ"
6,"māy","MĀY","a","māyā","noun-adj","","a","māyā"
7,"^āvaśyāya","AVAŚYĀY","a","avaśyāya","noun-adj","","a","avaśyāya"
8,"buddhu","BUDDH","u","buddha","noun-adj","","u","buddhu"
9,"dam","DAM","","dama","noun-adj","","","dam"
10,"/","","","","punct","","","/"
NA,"</s>","","","","","","",""
NA,"<s number=""46"">","","","","","","",""
1,"supinaṃ","SUPIN","aṃ","supina","noun-adj","","am","supinam"
2,"vidyu","VIDY","u","vidya","noun-adj","","u","vidyu"
3,"dabhraṃ","DABHR","aṃ","dabhra","noun-adj","","am","dabhram"
4,"ca","","","ca","ind","","","ca"
5,"evaṃ","","","eva","ind","","","eva"
6,"draṣṭavya","DRAṢ","ṭavya","darś","verb","dṛś","ṭavya","draṣṭavya"
7,"saṃskṛtam","SAṂSKṚT","am","saṃskṛta","noun-adj","","am","saṃskṛtam"
8,"iti","","","iti","ind","","","iti"
9,"//","","","","punct","","","//"
NA,"</s>","","","","","","",""
NA,"<s number=""47"">","","","","","","",""
1,"a","","","alpha_privativum","ind","","","alpha_privativum"
2,"nirodham","NIRODH","am","nirodha","noun-adj","","am","nirodham"
3,"an","","","alpha_privativum","ind","","","alpha_privativum"
4,"utpādam","UTPĀD","am","utpāda","noun-adj","","am","utpādam"
5,"anucchedam","ANUCCHED","am","anuccheda","noun-adj","","am","anucchedam"
6,"aśāśvatam","AŚĀŚVAT","am","aśāśvata","noun-adj","","am","aśāśvatam"
7,"/","","","","punct","","","/"
NA,"</s>","","","","","","",""
NA,"<s number=""48"">","","","","","","",""
1,"an","","","alpha_privativum","ind","","","alpha_privativum"
2,"ek","EK","a","eka","noun-adj","","a","eka"
3,"^ārtha","ARTH","a","artha","noun-adj","","a","artha"
4,"manān","MANĀN","a","manāna","noun-adj","","a","manāna"
5,"^ārtham","ARTH","am","artha","noun-adj","","am","artham"
6,"an","","","alpha_privativum","ind","","","alpha_privativum"
7,"āgamam","ĀGAM","am","āgama","noun-adj","","am","āgamam"
8,"a","","","alpha_privativum","ind","","","alpha_privativum"
9,"nirgamam","NIRGAM","am","nirgama","noun-adj","","am","nirgamam"
10,"//","","","","punct","","","//"
NA,"</s>","","","","","","",""
NA,"<s number=""49"">","","","","","","",""
1,"yaḥ","","","yad","pron","","","yad"
2,"pratītyasamutpādaṃ","PRATĪTYASAMUTPĀD","aṃ","pratītyasamutpāda","noun-adj","","am","pratītyasamutpādam"
3,"prapañc","PRAPAÑC","a","prapañca","noun-adj","","a","prapañca"
4,"^opaśamaṃ","UPAŚAM","aṃ","upaśama","noun-adj","","am","upaśamam"
5,"śivam","ŚIV","am","śiva","noun-adj","","am","śivam"
6,"/","","","","punct","","","/"
NA,"</s>","","","","","","",""
NA,"<s number=""50"">","","","","","","",""
1,"deśayām","DEŚ","ayām","diś","verb","diś","ayām","deśayām"
2,"āsa","","","as","verb","as","",""
3,"saṃbuddhas","SAṂBUDDH","as","saṃbuddha","noun-adj","","aḥ","saṃbuddhaḥ"
4,"taṃ","","","tad","pron","","","tad"
5,"vande","VAND","e","vanda","noun-adj","","e","vande"
6,"vadatāṃ","VAD","atāṃ","vad","verb","vad","atām","vadatām"
7,"varam","VAR","am","vara","noun-adj","","am","varam"
8,"//","","","","punct","","","//"
NA,"</s>","","","","","","",""
NA,"<s number=""51"">","","","","","","",""
1,"namo","NAM","o","namas","noun-adj","","aḥ","namaḥ"
2,"daśasu","DAŚ","asu","daśa","noun-adj","","asu","daśasu"
3,"dikṣu","DIK","ṣu","dik","noun-adj","","ṣu","dikṣu"
4,"sarveṣām","SARV","eṣām","sarva","noun-adj","","eṣām","sarveṣām"
5,"atīt","ATĪT","a","atīta","noun-adj","","a","atīta"
6,"^ānāgata","ANĀGAT","a","anāgata","noun-adj","","a","anāgata"
7,"pratyutpannānāṃ","PRATYUTPANN","ānāṃ","pratyutpanna","noun-adj","","ānām","pratyutpannānām"
8,"trayāṇāṃ","TRAY","āṇāṃ","tri","noun-adj","","ānām","trayānām"
9,"ratnānām","RATN","ānām","ratna","noun-adj","","ānām","ratnānām"
10,"/","","","","punct","","","/"
NA,"</s>","","","","","","",""
NA,"<s number=""52"">","","","","","","",""
1,"namo","NAM","o","namas","noun-adj","","aḥ","namaḥ"
2,"bhagavatyai","BHAGAV","atyai","bhagava","noun-adj","","atyai","bhagavatyai"
3,"prajñāpāramitāyai","PRAJÑĀPĀRAMIT","āyai","prajñāpāramitā","noun-adj","","āyai","prajñāpāramitāyai"
4,"sarva","SARV","a","sarva","noun-adj","","a","sarva"
5,"tathāgatasu","TATHĀGAT","asu","tathāgata","noun-adj","","asu","tathāgatasu"
6,"nibhāyai","NIBH","āyai","nibha","noun-adj","","āyai","nibhāyai"
7,"sarva","SARV","a","sarva","noun-adj","","a","sarva"
8,"tathāgat","TATHĀGAT","a","tathāgata","noun-adj","","a","tathāgata"
9,"^ānujñāta","ANUJÑĀT","a","anujñāta","noun-adj","","a","anujñāta"
10,"vijñātāyai","VIJÑĀT","āyai","vijñāta","noun-adj","","āyai","vijñātāyai"
11,"/","","","","punct","","","/"
12,"oṃ","","","oṃ","ind","","","oṃ"
13,"prajñe","PRAJÑ","e","prajñā","noun-adj","","e","prajñe"
14,"mahāprajñe","MAHĀPRAJÑ","e","mahāprajñā","noun-adj","","e","mahāprajñe"
15,"prajñ","PRAJÑ","a","prajñā","noun-adj","","a","prajñā"
16,"^āvabhāse","AVABHĀS","e","avabhāsa","noun-adj","","e","avabhāse"
17,"prajñā","PRAJÑ","","prajñā","noun-adj","","","prajñ"
18,"loka","ĀLOK","a","loka","noun-adj","","a","āloka"
19,"kāri","KĀR","i","kāri","noun-adj","","i","kāri"
20,"a","","","alpha_privativum","ind","","","alpha_privativum"
21,"jñāna","JÑĀN","a","jñāna","noun-adj","","a","jñāna"
22,"vidhamane","VIDHAMAN","e","vidhamana","noun-adj","","e","vidhamane"
23,"siddhe","SIDDH","e","siddha","noun-adj","","e","siddhe"
24,"su","","","su","ind","","","su"
25,"siddhe","SIDDH","e","siddha","noun-adj","","e","siddhe"
26,"siddhya","SIDDHY","a","siddhya","noun-adj","","a","siddhya"
27,"mane","MAN","e","manas","noun-adj","","e","mane"
28,"bhagavate","BHAGAV","ate","bhagavat","noun-adj","","ate","bhagavate"
29,"sarv","SARV","a","sarva","noun-adj","","a","sarva"
30,"^āṅga","ĀṄG","a","āṅga","noun-adj","","a","āṅga"
31,"sundari","SUNDAR","i","sundari","noun-adj","","i","sundari"
32,"bhakti","BHAKT","i","bhakti","noun-adj","","i","bhakti"
33,"vatsale","VATSAL","e","vatsala","noun-adj","","e","vatsale"
34,"prasāra","PRASĀR","a","prasāra","noun-adj","","a","prasāra"
35,"haste","HAST","e","hasta","noun-adj","","e","haste"
36,"samāśvāsa","SAMĀŚVĀS","a","samāśvāsa","noun-adj","","a","samāśvāsa"
37,"kare","KAR","e","kara","noun-adj","","e","kare"
38,"sidhya","SIDHY","a","sidhya","noun-adj","","a","sidhya"
39,"sidhya","SIDHY","a","sidhya","noun-adj","","a","sidhya"
40,";","","","","punct","","",";"
41,"budhya","BUDH","ya","bodh","verb","budh","ya","budhya"
42,"budhya","BUDH","ya","bodh","verb","budh","ya","budhya"
43,";","","","","punct","","",";"
44,"kampa","KAMPA","a","kampa","noun-adj","","a","kampaa"
45,"kampa","KAMPA","a","kampa","noun-adj","","a","kampaa"
46,";","","","","punct","","",";"
47,"cala","CAL","a","cala","noun-adj","","a","cala"
48,"cala","CAL","a","cala","noun-adj","","a","cala"
49,";","","","","punct","","",";"
50,"rāva","RĀV","a","rāva","noun-adj","","a","rāva"
51,"rāva","RĀV","a","rāva","noun-adj","","a","rāva"
52,";","","","","punct","","",";"
53,"āgaccha","ĀGACCH","a","āgaccha","noun-adj","āga","a","āgaccha"
54,"bhagavate","BHAGAV","ate","bhagavat","noun-adj","","ate","bhagavate"
55,"mā","","","mā","ind","","","mā"
56,"vilamba","VILAMBA","a","vilamba","noun-adj","","a","vilambaa"
57,"svāhā","SVĀH","ā","svāhā","noun-adj","","ā","svāhā"
58,"//","","","","punct","","","//"
NA,"</s>","","","","","","",""
NA,"<s number=""53"">","","","","","","",""
1,"namo","NAM","o","namas","noun-adj","","aḥ","namaḥ"
2,"dharmodgatasya","DHARMODGAT","asya","dharmodgata","noun-adj","","asya","dharmodgatasya"
3,"bodhisattvasya","BODHISATTV","asya","bodhisattva","noun-adj","","asya","bodhisattvasya"
4,"mahāsattvasya","MAHĀSATTV","asya","mahāsattva","noun-adj","","asya","mahāsattvasya"
5,"mahā","MAH","ā","mahat","noun-adj","","ā","mahā"
6,"kāruṇakasya","KĀRUṆ","akasya","kāruṇaka","noun-adj","","akasya","kāruṇakasya"
7,"//","","","","punct","","","//"
NA,"</s>","","","","","","",""
NA,"<s number=""54"">","","","","","","",""
1,"namo","NAM","o","namas","noun-adj","","aḥ","namaḥ"
2,"prajñāpāramitāyai","PRAJÑĀPĀRAMIT","āyai","prajñāpāramitā","noun-adj","","āyai","prajñāpāramitāyai"
3,"/","","","","punct","","","/"
NA,"</s>","","","","","","",""
NA,"<s number=""55"">","","","","","","",""
1,"tadyathā","","","tadyathā","ind","","","tadyathā"
2,"—","","","","punct","","","—"
3,"muni","MUN","i","muni","noun-adj","","i","muni"
4,"dharme","DHARM","e","dharma","noun-adj","","e","dharme"
5,"saṃgraha","SAṂGRAH","a","saṃgraha","noun-adj","","a","saṃgraha"
6,"dharme","DHARM","e","dharma","noun-adj","","e","dharme"
7,"anugraha","ANUGRAH","a","anugraha","noun-adj","","a","anugraha"
8,"dharme","DHARM","e","dharma","noun-adj","","e","dharme"
9,"vimokṣa","VIMOKṢ","a","vimokṣa","noun-adj","","a","vimokṣa"
10,"dharme","DHARM","e","dharma","noun-adj","","e","dharme"
11,"sattv","SATTV","a","sattva","noun-adj","","a","sattva"
12,"^ānugraha","ANUGRAH","a","anugraha","noun-adj","","a","anugraha"
13,"dharme","DHARM","e","dharma","noun-adj","","e","dharme"
14,"vaiśramaṇa","VAIŚRAMAṆ","a","vaiśramaṇa","noun-adj","","a","vaiśramaṇa"
15,"dharme","DHARM","e","dharma","noun-adj","","e","dharme"
16,"samantan","SAMANT","an","samantat","noun-adj","","ān","samantān"
17,"upari","UPAR","i","upari","noun-adj","","i","upari"
18,"vartana","VARTAN","a","vartana","noun-adj","","a","vartana"
19,"dharme","DHARM","e","dharma","noun-adj","","e","dharme"
20,"guṇi","GUṆ","i","guṇin","noun-adj","","i","guṇi"
21,"graha","GRAH","a","graha","noun-adj","","a","graha"
22,"saṃgraha","SAṂGRAH","a","saṃgraha","noun-adj","","a","saṃgraha"
23,"dharmesarv","DHARM","esarva","dharma","noun-adj","","esarva","dharmesarva"
24,"^ānugata","ANUGAT","a","anugata","noun-adj","","a","anugata"
25,"dharme","DHARM","e","dharma","noun-adj","","e","dharme"
26,"sarva","SARV","a","sarva","noun-adj","","a","sarva"
27,"kāla","KĀL","a","kāla","noun-adj","","a","kāla"
28,"paripūrṇa","PARIPŪRṆ","a","paripūrṇa","noun-adj","","a","paripūrṇa"
29,"dharme","DHARM","e","dharma","noun-adj","","e","dharme"
30,"svāhā","SVĀH","ā","svāhā","noun-adj","","ā","svāhā"
31,"//","","","","punct","","","//"
NA,"</s>","","","","","","",""
NA,"<s number=""56"">","","","","","","",""
1,"namo","NAM","o","namas","noun-adj","","aḥ","namaḥ"
2,"prajñāpāramitāyai","PRAJÑĀPĀRAMIT","āyai","prajñāpāramitā","noun-adj","","āyai","prajñāpāramitāyai"
3,"/","","","","punct","","","/"
NA,"</s>","","","","","","",""
NA,"<s number=""57"">","","","","","","",""
1,"tadyathā","","","tadyathā","ind","","","tadyathā"
2,"—","","","","punct","","","—"
3,"a","","","alpha_privativum","ind","","","alpha_privativum"
4,"khane","KHAN","e","khana","noun-adj","","e","khane"
5,"nikhane","NIKHAN","e","nikhan","noun-adj","","e","nikhane"
6,"mukhana","MUKH","ana","mukha","noun-adj","","ana","mukhana"
7,"ne","","","na","ind","","","na"
8,"khanea","KHAN","ea","khana","noun-adj","","ea","khanea"
9,"vara","VAR","a","vara","noun-adj","","a","vara"
10,"vandane","VANDAN","e","vandana","noun-adj","","e","vandane"
11,"paṭane","PAṬ","ane","paṭa","noun-adj","","ane","paṭane"
12,"paṭane","PAṬ","ane","paṭa","noun-adj","","ane","paṭane"
13,"paṭare","PAṬAR","e","paṭara","noun-adj","","e","paṭare"
14,"svāhā","SVĀH","ā","svāhā","noun-adj","","ā","svāhā"
15,"//","","","","punct","","","//"
NA,"</s>","","","","","","",""
NA,"<s number=""58"">","","","","","","",""
1,"namo","NAM","o","namas","noun-adj","","aḥ","namaḥ"
2,"prajñāpāramitāyai","PRAJÑĀPĀRAMIT","āyai","prajñāpāramitā","noun-adj","","āyai","prajñāpāramitāyai"
3,"/","","","","punct","","","/"
NA,"</s>","","","","","","",""
NA,"<s number=""59"">","","","","","","",""
1,"tadyathā","","","tadyathā","ind","","","tadyathā"
2,"—","","","","punct","","","—"
3,"gaṅgā","GAṄG","ā","gaṅgā","noun-adj","","ā","gaṅgā"
4,"gaṅgā","GAṄG","ā","gaṅgā","noun-adj","","ā","gaṅgā"
5,"na","","","na","ind","","","na"
6,"tīr","TĪR","a","tīra","noun-adj","","a","tīra"
7,"^āvabhāsa","AVABHĀS","a","avabhāsa","noun-adj","","a","avabhāsa"
8,"gaṅgā","GAṄG","ā","gaṅgā","noun-adj","","ā","gaṅgā"
9,"svāhā","SVĀH","ā","svāhā","noun-adj","","ā","svāhā"
10,"//","","","","punct","","","//"
NA,"</s>","","","","","","",""
NA,"<s number=""60"">","","","","","","",""
1,"namo","NAM","o","namas","noun-adj","","aḥ","namaḥ"
2,"prajñāpāramitāyai","PRAJÑĀPĀRAMIT","āyai","prajñāpāramitā","noun-adj","","āyai","prajñāpāramitāyai"
3,"/","","","","punct","","","/"
NA,"</s>","","","","","","",""
NA,"<s number=""61"">","","","","","","",""
1,"tadyathā","","","tadyathā","ind","","","tadyathā"
2,"śrī","ŚRĪ","","śrī","noun-adj","","","śrī"
3,"ye","","","yad","pron","","","yad"
4,"śrī","ŚRĪ","","śrī","noun-adj","","","śrī"
5,"ye","","","yad","pron","","","yad"
6,"muni","MUN","i","muni","noun-adj","","i","muni"
7,"śrī","ŚRĪ","","śrī","noun-adj","","","śrī"
8,"ye","","","yad","pron","","","yad"
9,"śrī","ŚRĪ","","śrī","noun-adj","","","śrī"
10,"yase","","","yaśa","ind","","","yaśa"
11,"svāhā","SVĀH","ā","svāhā","noun-adj","","ā","svāhā"
12,"//","","","","punct","","","//"
NA,"</s>","","","","","","",""
NA,"<s number=""62"">","","","","","","",""
1,"namo","NAM","o","namas","noun-adj","","aḥ","namaḥ"
2,"prajñāpāramitāyai","PRAJÑĀPĀRAMIT","āyai","prajñāpāramitā","noun-adj","","āyai","prajñāpāramitāyai"
3,"/","","","","punct","","","/"
NA,"</s>","","","","","","",""
NA,"<s number=""63"">","","","","","","",""
1,"tadyathā","","","tadyathā","ind","","","tadyathā"
2,"—oṃ","","","","punct","","","—oṃ"
3,"vajra","VAJR","a","vajra","noun-adj","","a","vajra"
4,"bale","BAL","e","bala","noun-adj","","e","bale"
5,"svāhā","SVĀH","ā","svāhā","noun-adj","","ā","svāhā"
6,"//","","","","punct","","","//"
NA,"</s>","","","","","","",""
NA,"<s number=""64"">","","","","","","",""
1,"namo","NAM","o","namas","noun-adj","","aḥ","namaḥ"
2,"prajñāpāramitāyai","PRAJÑĀPĀRAMIT","āyai","prajñāpāramitā","noun-adj","","āyai","prajñāpāramitāyai"
3,"/","","","","punct","","","/"
NA,"</s>","","","","","","",""
NA,"<s number=""65"">","","","","","","",""
1,"tadyathā","","","tadyathā","ind","","","tadyathā"
2,"—oṃ","","","","punct","","","—oṃ"
3,"hrī","HR","ī","hrī","noun-adj","","ī","hrī"
4,"śrī","ŚRĪ","","śrī","noun-adj","","","śrī"
5,"dhī","","","dhī","ind","","","dhī"
6,"śruti","ŚRUT","i","śruti","noun-adj","","i","śruti"
7,"smṛti","SMṚT","i","smṛti","noun-adj","","i","smṛti"
8,"mati","MAT","i","mati","noun-adj","","i","mati"
9,"gati","GAT","i","gati","noun-adj","","i","gati"
10,"vijaye","VIJAY","e","vijaya","noun-adj","","e","vijaye"
11,"svāhā","SVĀH","ā","svāhā","noun-adj","","ā","svāhā"
12,"//","","","","punct","","","//"
NA,"</s>","","","","","","",""
NA,"<s number=""66"">","","","","","","",""
1,"namo","NAM","o","namas","noun-adj","","aḥ","namaḥ"
2,"prajñāpāramitāyai","PRAJÑĀPĀRAMIT","āyai","prajñāpāramitā","noun-adj","","āyai","prajñāpāramitāyai"
3,"/","","","","punct","","","/"
NA,"</s>","","","","","","",""
NA,"<s number=""67"">","","","","","","",""
1,"tadyathā","","","tadyathā","ind","","","tadyathā"
2,"—","","","","punct","","","—"
3,"bambari","BAṂB","ari","baṃbā","noun-adj","","ari","baṃbari"
4,"bambari","BAṂB","ari","baṃbā","noun-adj","","ari","baṃbari"
5,"mahāb","MAH","āb","mahat","noun-adj","","āb","mahāb"
6,"ambari","AṂBAR","i","aṃbari","noun-adj","","i","aṃbari"
7,"būru","","","","ind","","",""
8,"būru","","","","ind","","",""
9,"mahābūru","MAH","ābūru","mahat","noun-adj","","ābūru","mahābūru"
10,"svāhā","SVĀH","ā","svāhā","noun-adj","","ā","svāhā"
11,"//","","","","punct","","","//"
NA,"</s>","","","","","","",""
NA,"<s number=""68"">","","","","","","",""
1,"namaḥ","NAM","aḥ","namas","noun-adj","","aḥ","namaḥ"
2,"prajñāpāramitāyai","PRAJÑĀPĀRAMIT","āyai","prajñāpāramitā","noun-adj","","āyai","prajñāpāramitāyai"
3,"/","","","","punct","","","/"
NA,"</s>","","","","","","",""
NA,"<s number=""69"">","","","","","","",""
1,"tadyathā","","","tadyathā","ind","","","tadyathā"
2,"—","","","","punct","","","—"
3,"hūte","HŪT","e","hūta","noun-adj","","e","hūte"
4,"hūte","HŪT","e","hūta","noun-adj","","e","hūte"
5,"hū","","","","ind","","",""
6,"vit","VIT","a","vid","noun-adj","","a","vita"
7,"^āśane","ĀŚAN","e","āśana","noun-adj","","e","āśane"
8,"sarva","SARV","a","sarva","noun-adj","","a","sarva"
9,"—","","","","punct","","","—"
10,"karm","KARM","a","karman","noun-adj","","a","karma"
11,"^āvaraṇane","ĀVARAṆ","ane","āvaraṇa","noun-adj","","ane","āvaraṇane"
12,"svāhā","SVĀH","ā","svāhā","noun-adj","","ā","svāhā"
NA,"</s>","","","","","","",""
NA,"<s number=""70"">","","","","","","",""
1,"//","","","","punct","","","//"
2,"namaḥ","NAM","aḥ","namas","noun-adj","","aḥ","namaḥ"
3,"prajñāpāramitāyai","PRAJÑĀPĀRAMIT","āyai","prajñāpāramitā","noun-adj","","āyai","prajñāpāramitāyai"
4,"/","","","","punct","","","/"
NA,"</s>","","","","","","",""
NA,"<s number=""71"">","","","","","","",""
1,"tadyathā","","","tadyathā","ind","","","tadyathā"
2,"—oṃo","","","","punct","","","—oṃo"
3,"rolik","ROL","ik","rolika","noun-adj","","ik","rolik"
4,"svāhā","SVĀH","ā","svāhā","noun-adj","","ā","svāhā"
5,"//","","","","punct","","","//"
NA,"</s>","","","","","","",""
NA,"<s number=""72"">","","","","","","",""
1,"namo","NAM","o","namas","noun-adj","","aḥ","namaḥ"
2,"prajñāpāramitāyai","PRAJÑĀPĀRAMIT","āyai","prajñāpāramitā","noun-adj","","āyai","prajñāpāramitāyai"
3,"/","","","","punct","","","/"
NA,"</s>","","","","","","",""
NA,"<s number=""73"">","","","","","","",""
1,"tadyathā","","","tadyathā","ind","","","tadyathā"
2,"—oṃ","","","","punct","","","—oṃ"
3,"sarva","SARV","a","sarva","noun-adj","","a","sarva"
4,"vit","VIT","","vid","noun-adj","","","vit"
5,"svāhā","SVĀH","ā","svāhā","noun-adj","","ā","svāhā"
6,"//","","","","punct","","","//"
NA,"</s>","","","","","","",""
NA,"<s number=""74"">","","","","","","",""
1,"namaḥ","NAM","aḥ","namas","noun-adj","","aḥ","namaḥ"
2,"prajñāpāramitāyai","PRAJÑĀPĀRAMIT","āyai","prajñāpāramitā","noun-adj","","āyai","prajñāpāramitāyai"
3,"/","","","","punct","","","/"
NA,"</s>","","","","","","",""
NA,"<s number=""75"">","","","","","","",""
1,"tadyathā","","","tadyathā","ind","","","tadyathā"
2,"—","","","","punct","","","—"
3,"gate","GAT","e","gata","noun-adj","","e","gate"
4,"gate","GAT","e","gata","noun-adj","","e","gate"
5,"pāragate","PĀRAGAT","e","pāragata","noun-adj","","e","pāragate"
6,"pāra","PĀR","a","pāra","noun-adj","","a","pāra"
7,"saṃgate","SAṂGAT","e","saṃgata","noun-adj","","e","saṃgate"
8,"bodhi","BODH","i","bodhi","noun-adj","","i","bodhi"
9,"svāhā","SVĀH","ā","svāhā","noun-adj","","ā","svāhā"
10,"//","","","","punct","","","//"
NA,"</s>","","","","","","",""
NA,"<s number=""76"">","","","","","","",""
1,"idam","IDAM","","idam","pron","","","idam"
2,"avocad","AVOCAD","","vak","verb","","","avocad"
3,"bhagavān","BHAGAV","ān","bhagavat","noun-adj","","ān","bhagavān"
4,"/","","","","punct","","","/"
NA,"</s>","","","","","","",""
NA,"<s number=""77"">","","","","","","",""
1,"āttamanā","ĀTTAMAN","ā","āttamanas","noun-adj","","ā","āttamanā"
2,"āyuṣmān","ĀYUṢM","ān","āyuṣmat","noun-adj","","ān","āyuṣmān"
3,"sāri","SĀR","i","sāri","noun-adj","","i","sāri"
4,"putraḥ","PUTR","aḥ","putra","noun-adj","","aḥ","putraḥ"
5,"śakro","ŚAKR","o","śakra","noun-adj","","aḥ","śakraḥ"
6,"devānām","DEV","ānām","deva","noun-adj","","ānām","devānām"
7,"indras","INDR","as","indra","noun-adj","","aḥ","indraḥ"
8,"te","","","tad","pron","","","tad"
9,"ca","","","ca","ind","","","ca"
10,"bodhisattvā","BODHISATTV","ā","bodhisattva","noun-adj","","āḥ","bodhisattvāḥ"
11,"mahāsattvāḥ","MAHĀSATTV","āḥ","mahāsattva","noun-adj","","āḥ","mahāsattvāḥ"
12,"sā","","","tad","pron","","","tad"
13,"ca","","","ca","ind","","","ca"
14,"sarvāvatī","SARV","āvatī","sarvāvat","noun-adj","","āvatī","sarvāvatī"
15,"parṣad","PARṢAD","","parṣad","noun-adj","","","parṣad"
16,"sad","SAD","","sat","noun-adj","","","sad"
17,"eva","","","eva","ind","","","eva"
18,"gandharva","GANDHARV","a","gandharva","noun-adj","","a","gandharva"
19,"mānuṣ","MĀNUṢ","a","mānuṣa","noun-adj","","a","mānuṣa"
20,"^āsuraś","ĀSUR","aś","āsura","noun-adj","","aḥ","āsuraḥ"
21,"ca","","","ca","ind","","","ca"
22,"loko","LOK","o","loka","noun-adj","","aḥ","lokaḥ"
23,"bhagavato","BHAGAV","ato","bhagavat","noun-adj","","ataḥ","bhagavataḥ"
24,"bhāṣitam","BHĀṢIT","am","bhāṣita","noun-adj","","am","bhāṣitam"
25,"abhyanandan","ABHYANAND","an","abhyanand","noun-adj","","ān","abhyanandān"
26,"//","","","","punct","","","//"
NA,"</s>","","","","","","",""
NA,"</page>","","","","","","",""
NA,"</doc>","","","","","","",""
