"WordID","word","NormSTEM","suffix","lemma","PoS","Root","NormSuffix","NormWord"
1,"tad","_","_","tad","PRD","","_","_"
2,"_","_","_","yad","PRL","","_","_"
3,"_","_","_","eva","CX","","_","_"
4,"vidvān","_","_","vid","KDP","","_","_"
5,"vrātya","_","_","vrātya","NC","","_","_"
6,"uddhṛteṣv","_","_","uddhṛ","PPP","","_","_"
7,"agniṣv","_","_","agni","NC","","_","_"
8,"adhiśrite","_","_","adhiśri","PPP","","_","_"
9,"'gnihotre","_","_","agnihotra","NC","","_","_"
10,"'tithir","_","_","atithi","NC","","_","_"
11,"gṛhān","_","_","gṛha","NC","","_","_"
12,"āgacchet","_","_","āgacch","V","āgam","_","_"
1,"svayam","_","_","svaya","CX","","_","_"
2,"enam","_","_","a","PRD","","_","_"
3,"abhyudetya","_","_","abhyude","CGDA","","_","_"
4,"brūyād","_","_","abravīta","V","brū","_","_"
5,"_","_","_","vrātya","NC","","_","_"
6,"_","_","_","atisṛj","V","atisṛj","_","_"
7,"_","_","_","hu","V","hu","_","_"
8,"_","_","_","iti","CQT","","_","_"
1,"sa","_","_","tad","PRD","","_","_"
2,"_","_","_","ca","CCD","","_","_"
3,"_","_","_","atisṛj","V","atisṛj","_","_"
4,"juhuyān","_","_","hu","V","hu","_","_"
5,"na","_","_","na","CNG","","_","_"
6,"_","_","_","ca","CCD","","_","_"
7,"_","_","_","atisṛj","V","atisṛj","_","_"
8,"na","_","_","na","CNG","","_","_"
9,"juhuyāt","_","_","hu","V","hu","_","_"
1,"sa","_","_","tad","PRD","","_","_"
2,"ya","_","_","yad","PRL","","_","_"
3,"evaṃ","_","_","eva","CX","","_","_"
4,"viduṣā","_","_","vid","KDP","","_","_"
5,"_","_","_","vrātya","NC","","_","_"
6,"_","_","_","atisṛj","PPP","","_","_"
7,"juhoti","_","_","hu","V","hu","_","_"
1,"pra","_","_","pra","CADP","","_","_"
2,"pitṛyāṇaṃ","_","_","pitṛyāṇa","JJ","","_","_"
3,"panthāṃ","_","_","pathin","NC","","_","_"
4,"jānāti","_","_","jān","V","jñā","_","_"
5,"pra","_","_","pra","CADP","","_","_"
6,"_","_","_","deva","NC","","_","_"
7,"_","_","_","yāna","JJ","","_","_"
1,"na","_","_","na","CNG","","_","_"
2,"deveṣv","_","_","deva","NC","","_","_"
3,"āvṛścate","_","_","āvraśc","V","āvraśc","_","_"
4,"hutam","_","_","hu","PPP","","_","_"
5,"asya","_","_","ida","PRD","","_","_"
6,"bhavati","_","_","bhav","V","bhū","_","_"
1,"pary","_","_","pari","CADP","","_","_"
2,"_","_","_","ida","PRD","","_","_"
3,"_","_","_","ida","PRD","","_","_"
4,"loka","_","_","loka","NC","","_","_"
5,"āyatanaṃ","_","_","āyatana","NC","","_","_"
6,"śiṣyate","_","_","śās","V","śās","_","_"
7,"ya","_","_","yad","PRL","","_","_"
8,"evaṃ","_","_","eva","CX","","_","_"
9,"viduṣā","_","_","vid","KDP","","_","_"
10,"_","_","_","vrātya","NC","","_","_"
11,"_","_","_","atisṛj","PPP","","_","_"
12,"juhoti","_","_","hu","V","hu","_","_"
1,"atha","_","_","atha","CAD","","_","_"
2,"ya","_","_","yad","PRL","","_","_"
3,"evaṃ","_","_","eva","CX","","_","_"
4,"viduṣā","_","_","vid","KDP","","_","_"
5,"_","_","_","vrātya","NC","","_","_"
6,"_","_","_","an","CX","","_","_"
7,"_","_","_","atisṛj","PPP","","_","_"
8,"juhoti","_","_","hu","V","hu","_","_"
1,"na","_","_","na","CNG","","_","_"
2,"pitṛyāṇaṃ","_","_","pitṛyāṇa","JJ","","_","_"
3,"panthāṃ","_","_","pathin","NC","","_","_"
4,"jānāti","_","_","jān","V","jñā","_","_"
5,"na","_","_","na","CNG","","_","_"
6,"_","_","_","deva","NC","","_","_"
7,"_","_","_","yāna","JJ","","_","_"
1,"ā","_","_","ā","CADP","","_","_"
2,"deveṣu","_","_","deva","NC","","_","_"
3,"vṛścate","_","_","vraśc","V","vraśc","_","_"
4,"ahutam","_","_","ahuta","JJ","","_","_"
5,"asya","_","_","ida","PRD","","_","_"
6,"bhavati","_","_","bhav","V","bhū","_","_"
1,"_","_","_","na","CNG","","_","_"
2,"_","_","_","ida","PRD","","_","_"
3,"_","_","_","ida","PRD","","_","_"
4,"_","_","_","loka","NC","","_","_"
5,"āyatanaṃ","_","_","āyatana","NC","","_","_"
6,"śiṣyate","_","_","śās","V","śās","_","_"
7,"ya","_","_","yad","PRL","","_","_"
8,"evaṃ","_","_","eva","CX","","_","_"
9,"viduṣā","_","_","vid","KDP","","_","_"
10,"_","_","_","vrātya","NC","","_","_"
11,"_","_","_","an","CX","","_","_"
12,"_","_","_","atisṛj","PPP","","_","_"
13,"juhoti","_","_","hu","V","hu","_","_"
