"WordID","word","NormSTEM","suffix","lemma","PoS","Root","NormSuffix","NormWord"
1,"_","_","_","atha","CAD","","_","_"
2,"_","_","_","atas","CX","","_","_"
3,"navegāndhāraṇīyam","_","_","navegāndhāraṇīya","NC","","_","_"
4,"adhyāyaṃ","_","_","adhyāya","NC","","_","_"
5,"vyākhyāsyāmaḥ","_","_","vyākhyās","V","vyākhyā","_","_"
1,"iti","_","_","iti","CQT","","_","_"
2,"ha","_","_","ha","CEM","","_","_"
3,"_","_","_","sma","CX","","_","_"
4,"_","_","_","ah","V","ah","_","_"
5,"_","_","_","bhagavat","JJ","","_","_"
6,"_","_","_","ātreya","NC","","_","_"
1,"na","_","_","na","CNG","","_","_"
2,"vegān","_","_","vega","NC","","_","_"
3,"_","_","_","dhāray","V","dhāray","_","_"
4,"_","_","_","dhīmat","JJ","","_","_"
5,"_","_","_","jan","PPP","","_","_"
6,"_","_","_","mūtra","NC","","_","_"
7,"_","_","_","purīṣa","NC","","_","_"
1,"na","_","_","na","CNG","","_","_"
2,"retaso","_","_","retas","NC","","_","_"
3,"na","_","_","na","CNG","","_","_"
4,"vātasya","_","_","vāta","NC","","_","_"
5,"na","_","_","na","CNG","","_","_"
6,"chardyāḥ","_","_","chardi","NC","","_","_"
7,"_","_","_","kṣavathu","NC","","_","_"
8,"_","_","_","na","CNG","","_","_"
9,"ca","_","_","ca","CCD","","_","_"
1,"_","_","_","na","CNG","","_","_"
2,"_","_","_","udgāra","NC","","_","_"
3,"na","_","_","na","CNG","","_","_"
4,"jṛmbhāyā","_","_","jṛmbhā","NC","","_","_"
5,"na","_","_","na","CNG","","_","_"
6,"vegān","_","_","vega","NC","","_","_"
7,"_","_","_","kṣudh","NC","","_","_"
8,"_","_","_","pipāsā","NC","","_","_"
1,"na","_","_","na","CNG","","_","_"
2,"bāṣpasya","_","_","bāṣpa","NC","","_","_"
3,"na","_","_","na","CNG","","_","_"
4,"nidrāyā","_","_","nidrā","NC","","_","_"
5,"niḥśvāsasya","_","_","niḥśvāsa","NC","","_","_"
6,"śrameṇa","_","_","śrama","NC","","_","_"
7,"ca","_","_","ca","CCD","","_","_"
1,"etān","_","_","tad","PRD","","_","_"
2,"dhārayato","_","_","dhāray","KDP","","_","_"
3,"jātān","_","_","jan","PPP","","_","_"
4,"vegān","_","_","vega","NC","","_","_"
5,"rogā","_","_","roga","NC","","_","_"
6,"bhavanti","_","_","bhav","V","bhū","_","_"
7,"ye","_","_","yad","PRL","","_","_"
1,"_","_","_","pṛthak","CX","","_","_"
2,"_","_","_","pṛthak","CX","","_","_"
3,"_","_","_","cikitsā","NC","","_","_"
4,"_","_","_","artha","NC","","_","_"
5,"_","_","_","tad","PRD","","_","_"
6,"_","_","_","mat","PPR","","_","_"
7,"nigadataḥ","_","_","nigad","KDP","","_","_"
8,"śṛṇu","_","_","śṛṇ","V","śru","_","_"
1,"_","_","_","vasti","NC","","_","_"
2,"_","_","_","mehana","NC","","_","_"
3,"śūlaṃ","_","_","śūla","NC","","_","_"
4,"mūtrakṛcchraṃ","_","_","mūtrakṛcchra","NC","","_","_"
5,"_","_","_","śiras","NC","","_","_"
6,"_","_","_","rujā","NC","","_","_"
1,"vināmo","_","_","vināma","NC","","_","_"
2,"_","_","_","vaṅkṣaṇa","NC","","_","_"
3,"_","_","_","ānāha","NC","","_","_"
4,"_","_","_","as","V","as","_","_"
5,"_","_","_","liṅga","NC","","_","_"
6,"_","_","_","mūtra","NC","","_","_"
7,"_","_","_","nigraha","NC","","_","_"
1,"_","_","_","sveda","NC","","_","_"
2,"_","_","_","avagāhana","NC","","_","_"
3,"_","_","_","abhyaṅga","NC","","_","_"
4,"_","_","_","sarpis","NC","","_","_"
5,"_","_","_","ca","CCD","","_","_"
6,"_","_","_","avapīḍaka","NC","","_","_"
1,"mūtre","_","_","mūtra","NC","","_","_"
2,"pratihate","_","_","pratihan","PPP","","_","_"
3,"_","_","_","kar","V","kṛ","_","_"
4,"_","_","_","trividha","JJ","","_","_"
5,"_","_","_","vasti","NC","","_","_"
6,"_","_","_","karman","NC","","_","_"
7,"ca","_","_","ca","CCD","","_","_"
1,"_","_","_","pakvāśaya","NC","","_","_"
2,"_","_","_","śiras","NC","","_","_"
3,"_","_","_","śūla","NC","","_","_"
4,"_","_","_","vāta","NC","","_","_"
5,"_","_","_","varcas","NC","","_","_"
6,"_","_","_","apravartana","NC","","_","_"
1,"_","_","_","piṇḍikā","NC","","_","_"
2,"_","_","_","udveṣṭana","NC","","_","_"
3,"_","_","_","ādhmāna","NC","","_","_"
4,"purīṣe","_","_","purīṣa","NC","","_","_"
5,"_","_","_","as","V","as","_","_"
6,"_","_","_","vidhāray","PPP","","_","_"
1,"_","_","_","sveda","NC","","_","_"
2,"_","_","_","abhyaṅga","NC","","_","_"
3,"_","_","_","avagāha","NC","","_","_"
4,"_","_","_","ca","CCD","","_","_"
5,"vartayo","_","_","vartī","NC","","_","_"
6,"_","_","_","vasti","NC","","_","_"
7,"_","_","_","karman","NC","","_","_"
8,"ca","_","_","ca","CCD","","_","_"
1,"hitaṃ","_","_","hita","JJ","","_","_"
2,"pratihate","_","_","pratihan","PPP","","_","_"
3,"_","_","_","varcas","NC","","_","_"
4,"_","_","_","anna","NC","","_","_"
5,"_","_","_","pāna","NC","","_","_"
6,"pramāthi","_","_","pramāthin","JJ","","_","_"
7,"ca","_","_","ca","CCD","","_","_"
1,"meḍhre","_","_","meḍhra","NC","","_","_"
2,"vṛṣaṇayoḥ","_","_","vṛṣaṇa","NC","","_","_"
3,"_","_","_","śūla","NC","","_","_"
4,"_","_","_","aṅgamarda","NC","","_","_"
5,"hṛdi","_","_","hṛd","NC","","_","_"
6,"vyathā","_","_","vyathā","NC","","_","_"
1,"bhavet","_","_","bhav","V","bhū","_","_"
2,"pratihate","_","_","pratihan","PPP","","_","_"
3,"śukre","_","_","śukra","NC","","_","_"
4,"vibaddhaṃ","_","_","vibandh","PPP","","_","_"
5,"_","_","_","mūtra","NC","","_","_"
6,"_","_","_","eva","CEM","","_","_"
7,"ca","_","_","ca","CCD","","_","_"
1,"_","_","_","tatra","CAD","","_","_"
2,"_","_","_","abhyaṅga","NC","","_","_"
3,"_","_","_","avagāha","NC","","_","_"
4,"_","_","_","ca","CCD","","_","_"
5,"madirā","_","_","madirā","NC","","_","_"
6,"caraṇāyudhāḥ","_","_","caraṇāyudha","NC","","_","_"
1,"śāliḥ","_","_","śāli","NC","","_","_"
2,"payo","_","_","payas","NC","","_","_"
3,"_","_","_","nirūha","NC","","_","_"
4,"_","_","_","ca","CCD","","_","_"
5,"śastaṃ","_","_","śaṃs","PPP","","_","_"
6,"_","_","_","maithuna","NC","","_","_"
7,"_","_","_","eva","CEM","","_","_"
8,"ca","_","_","ca","CCD","","_","_"
1,"saṅgo","_","_","saṅga","NC","","_","_"
2,"_","_","_","viṣ","NC","","_","_"
3,"_","_","_","mūtra","NC","","_","_"
4,"_","_","_","vāta","NC","","_","_"
5,"_","_","_","ādhmāna","NC","","_","_"
6,"vedanā","_","_","vedanā","NC","","_","_"
7,"klamaḥ","_","_","klama","NC","","_","_"
1,"jaṭhare","_","_","jaṭhara","NC","","_","_"
2,"_","_","_","vāta","NC","","_","_"
3,"_","_","_","ja","JJ","","_","_"
4,"_","_","_","ca","CCD","","_","_"
5,"_","_","_","anya","PPX","","_","_"
6,"rogāḥ","_","_","roga","NC","","_","_"
7,"_","_","_","as","V","as","_","_"
8,"_","_","_","vāta","NC","","_","_"
9,"_","_","_","nigraha","NC","","_","_"
1,"_","_","_","sneha","NC","","_","_"
2,"_","_","_","sveda","NC","","_","_"
3,"_","_","_","vidhi","NC","","_","_"
4,"_","_","_","tatra","CAD","","_","_"
5,"vartayo","_","_","vartī","NC","","_","_"
6,"bhojanāni","_","_","bhojana","NC","","_","_"
7,"ca","_","_","ca","CCD","","_","_"
1,"pānāni","_","_","pāna","NC","","_","_"
2,"_","_","_","vasti","NC","","_","_"
3,"_","_","_","ca","CCD","","_","_"
4,"_","_","_","eva","CEM","","_","_"
5,"śastaṃ","_","_","śaṃs","PPP","","_","_"
6,"_","_","_","vāta","NC","","_","_"
7,"_","_","_","anulomana","JJ","","_","_"
1,"_","_","_","kaṇḍū","NC","","_","_"
2,"_","_","_","koṭha","NC","","_","_"
3,"_","_","_","aruci","NC","","_","_"
4,"_","_","_","vyaṅga","NC","","_","_"
5,"_","_","_","śotha","NC","","_","_"
6,"_","_","_","pāṇḍu","NC","","_","_"
7,"_","_","_","āmaya","NC","","_","_"
8,"_","_","_","jvara","NC","","_","_"
1,"_","_","_","kuṣṭha","NC","","_","_"
2,"_","_","_","hṛllāsa","NC","","_","_"
3,"_","_","_","vīsarpa","NC","","_","_"
4,"_","_","_","chardi","NC","","_","_"
5,"_","_","_","nigraha","NC","","_","_"
6,"_","_","_","ja","JJ","","_","_"
7,"gadāḥ","_","_","gada","NC","","_","_"
1,"bhuktvā","_","_","bhuj","CGDA","","_","_"
2,"pracchardanaṃ","_","_","pracchardana","NC","","_","_"
3,"dhūmo","_","_","dhūma","NC","","_","_"
4,"laṅghanaṃ","_","_","laṅghana","NC","","_","_"
5,"_","_","_","rakta","NC","","_","_"
6,"_","_","_","mokṣaṇa","NC","","_","_"
1,"_","_","_","rūkṣa","JJ","","_","_"
2,"_","_","_","anna","NC","","_","_"
3,"_","_","_","pāna","NC","","_","_"
4,"vyāyāmo","_","_","vyāyāma","NC","","_","_"
5,"_","_","_","vireka","NC","","_","_"
6,"_","_","_","ca","CCD","","_","_"
7,"_","_","_","atra","CAD","","_","_"
8,"śasyate","_","_","śaṃs","V","śaṃs","_","_"
1,"_","_","_","manyā","NC","","_","_"
2,"_","_","_","stambha","NC","","_","_"
3,"_","_","_","śiras","NC","","_","_"
4,"_","_","_","śūla","NC","","_","_"
5,"_","_","_","ardita","NC","","_","_"
6,"_","_","_","ardhāvabhedaka","NC","","_","_"
1,"indriyāṇāṃ","_","_","indriya","NC","","_","_"
2,"ca","_","_","ca","CCD","","_","_"
3,"daurbalyaṃ","_","_","daurbalya","NC","","_","_"
4,"kṣavathoḥ","_","_","kṣavathu","NC","","_","_"
5,"_","_","_","as","V","as","_","_"
6,"_","_","_","vidhāraṇa","NC","","_","_"
1,"_","_","_","tatra","CAD","","_","_"
2,"_","_","_","ūrdhva","JJ","","_","_"
3,"_","_","_","jatruka","NC","","_","_"
4,"_","_","_","abhyaṅga","NC","","_","_"
5,"svedo","_","_","sveda","NC","","_","_"
6,"dhūmaḥ","_","_","dhūma","NC","","_","_"
7,"_","_","_","sa_saha","CX","","_","_"
8,"_","_","_","nāvana","NC","","_","_"
1,"hitaṃ","_","_","hita","JJ","","_","_"
2,"_","_","_","vāta","NC","","_","_"
3,"_","_","_","ghna","JJ","","_","_"
4,"_","_","_","ādya","NC","","_","_"
5,"ca","_","_","ca","CCD","","_","_"
6,"ghṛtaṃ","_","_","ghṛta","NC","","_","_"
7,"_","_","_","ca","CCD","","_","_"
8,"_","_","_","auttarabhaktika","JJ","","_","_"
1,"hikkā","_","_","hikkā","NC","","_","_"
2,"_","_","_","śvāsa","NC","","_","_"
3,"_","_","_","aruci","NC","","_","_"
4,"kampo","_","_","kampa","NC","","_","_"
5,"vibandho","_","_","vibandha","NC","","_","_"
6,"_","_","_","hṛdaya","NC","","_","_"
7,"_","_","_","uras","NC","","_","_"
1,"_","_","_","udgāra","NC","","_","_"
2,"_","_","_","nigraha","NC","","_","_"
3,"_","_","_","tatra","CAD","","_","_"
4,"_","_","_","hikkā","NC","","_","_"
5,"_","_","_","tulya","JJ","","_","_"
6,"auṣadham","_","_","auṣadha","NC","","_","_"
1,"_","_","_","vināma","NC","","_","_"
2,"_","_","_","ākṣepa","NC","","_","_"
3,"_","_","_","saṃkoca","NC","","_","_"
4,"suptiḥ","_","_","supti","NC","","_","_"
5,"kampaḥ","_","_","kampa","NC","","_","_"
6,"pravepanam","_","_","pravepana","NC","","_","_"
1,"jṛmbhāyā","_","_","jṛmbhā","NC","","_","_"
2,"_","_","_","nigraha","NC","","_","_"
3,"_","_","_","tatra","CAD","","_","_"
4,"sarvaṃ","_","_","sarva","JQ","","_","_"
5,"_","_","_","vāta","NC","","_","_"
6,"_","_","_","ghna","JJ","","_","_"
7,"_","_","_","auṣadha","NC","","_","_"
1,"_","_","_","kārśya","NC","","_","_"
2,"_","_","_","daurbalya","NC","","_","_"
3,"_","_","_","vaivarṇya","NC","","_","_"
4,"_","_","_","aṅgamarda","NC","","_","_"
5,"_","_","_","aruci","NC","","_","_"
6,"_","_","_","bhrama","NC","","_","_"
1,"_","_","_","kṣudh","NC","","_","_"
2,"_","_","_","vega","NC","","_","_"
3,"_","_","_","nigraha","NC","","_","_"
4,"_","_","_","tatra","CAD","","_","_"
5,"_","_","_","snigdha","JJ","","_","_"
6,"_","_","_","uṣṇa","JJ","","_","_"
7,"laghu","_","_","laghu","JJ","","_","_"
8,"bhojanam","_","_","bhojana","NC","","_","_"
1,"_","_","_","kaṇṭha","NC","","_","_"
2,"_","_","_","āsya","NC","","_","_"
3,"_","_","_","śoṣa","NC","","_","_"
4,"bādhiryaṃ","_","_","bādhirya","NC","","_","_"
5,"śramaḥ","_","_","śrama","NC","","_","_"
6,"sādo","_","_","sāda","NC","","_","_"
7,"hṛdi","_","_","hṛd","NC","","_","_"
8,"vyathā","_","_","vyathā","NC","","_","_"
1,"_","_","_","pipāsā","NC","","_","_"
2,"_","_","_","nigraha","NC","","_","_"
3,"_","_","_","tatra","CAD","","_","_"
4,"śītaṃ","_","_","śīta","JJ","","_","_"
5,"_","_","_","tarpaṇa","NC","","_","_"
6,"_","_","_","iṣ","V","iṣ","_","_"
1,"_","_","_","pratiśyāya","NC","","_","_"
2,"_","_","_","akṣi","NC","","_","_"
3,"_","_","_","roga","NC","","_","_"
4,"_","_","_","ca","CCD","","_","_"
5,"_","_","_","hṛd","NC","","_","_"
6,"_","_","_","roga","NC","","_","_"
7,"_","_","_","ca","CCD","","_","_"
8,"_","_","_","aruci","NC","","_","_"
9,"_","_","_","bhrama","NC","","_","_"
1,"_","_","_","bāṣpa","NC","","_","_"
2,"_","_","_","nigrahaṇa","NC","","_","_"
3,"_","_","_","tatra","CAD","","_","_"
4,"svapno","_","_","svapna","NC","","_","_"
5,"madyaṃ","_","_","madya","NC","","_","_"
6,"priyāḥ","_","_","priya","JJ","","_","_"
7,"kathāḥ","_","_","kathā","NC","","_","_"
1,"_","_","_","jṛmbhā","NC","","_","_"
2,"_","_","_","aṅgamarda","NC","","_","_"
3,"_","_","_","tandrā","NC","","_","_"
4,"ca","_","_","ca","CCD","","_","_"
5,"_","_","_","śiras","NC","","_","_"
6,"_","_","_","roga","NC","","_","_"
7,"_","_","_","akṣi","NC","","_","_"
8,"_","_","_","gaurava","NC","","_","_"
1,"_","_","_","nidrā","NC","","_","_"
2,"_","_","_","vidhāraṇa","NC","","_","_"
3,"_","_","_","tatra","CAD","","_","_"
4,"svapnaḥ","_","_","svapna","NC","","_","_"
5,"saṃvāhanāni","_","_","saṃvāhana","NC","","_","_"
6,"ca","_","_","ca","CCD","","_","_"
1,"_","_","_","gulma","NC","","_","_"
2,"_","_","_","hṛd","NC","","_","_"
3,"_","_","_","roga","NC","","_","_"
4,"_","_","_","sammoha","NC","","_","_"
5,"_","_","_","śrama","NC","","_","_"
6,"_","_","_","niḥśvāsa","NC","","_","_"
7,"_","_","_","dhāraṇa","NC","","_","_"
1,"jāyante","_","_","jan","V","jan","_","_"
2,"tatra","_","_","tatra","CAD","","_","_"
3,"viśrāmo","_","_","viśrāma","NC","","_","_"
4,"_","_","_","vāta","NC","","_","_"
5,"_","_","_","ghna","JJ","","_","_"
6,"_","_","_","ca","CCD","","_","_"
7,"kriyā","_","_","kriyā","NC","","_","_"
8,"hitāḥ","_","_","hita","JJ","","_","_"
1,"_","_","_","vega","NC","","_","_"
2,"_","_","_","nigraha","NC","","_","_"
3,"_","_","_","ja","JJ","","_","_"
4,"rogā","_","_","roga","NC","","_","_"
5,"ya","_","_","yad","PRL","","_","_"
6,"ete","_","_","tad","PRD","","_","_"
7,"parikīrtitāḥ","_","_","parikīrtay","PPP","","_","_"
1,"_","_","_","iṣ","KDP","","_","_"
2,"_","_","_","tad","PRD","","_","_"
3,"_","_","_","anutpatti","NC","","_","_"
4,"_","_","_","vega","NC","","_","_"
5,"_","_","_","tad","PRD","","_","_"
6,"_","_","_","na","CNG","","_","_"
7,"dhārayet","_","_","dhar","V","dhṛ","_","_"
1,"_","_","_","ida","PRD","","_","_"
2,"_","_","_","tu","CCD","","_","_"
3,"_","_","_","dhāray","V","dhāray","_","_"
4,"_","_","_","vega","NC","","_","_"
5,"_","_","_","hita","NC","","_","_"
6,"_","_","_","arthin","JJ","","_","_"
7,"pretya","_","_","pre","CGDA","","_","_"
8,"_","_","_","ca","CCD","","_","_"
9,"_","_","_","iha","CAD","","_","_"
10,"ca","_","_","ca","CCD","","_","_"
1,"sāhasānām","_","_","sāhasa","NC","","_","_"
2,"aśastānāṃ","_","_","aśasta","JJ","","_","_"
3,"_","_","_","manas","NC","","_","_"
4,"_","_","_","vāc","NC","","_","_"
5,"_","_","_","kāya","NC","","_","_"
6,"_","_","_","karman","NC","","_","_"
1,"_","_","_","lobha","NC","","_","_"
2,"_","_","_","śoka","NC","","_","_"
3,"_","_","_","bhaya","NC","","_","_"
4,"_","_","_","krodha","NC","","_","_"
5,"_","_","_","māna","NC","","_","_"
6,"_","_","_","vega","NC","","_","_"
7,"vidhārayet","_","_","vidhar","V","vidhṛ","_","_"
1,"_","_","_","nairlajjya","NC","","_","_"
2,"_","_","_","īrṣyā","NC","","_","_"
3,"_","_","_","atirāga","NC","","_","_"
4,"_","_","_","abhidhyā","NC","","_","_"
5,"_","_","_","ca","CCD","","_","_"
6,"buddhimān","_","_","buddhimat","JJ","","_","_"
1,"_","_","_","puruṣa","NC","","_","_"
2,"_","_","_","atimātra","JJ","","_","_"
3,"_","_","_","sūcaka","JJ","","_","_"
4,"_","_","_","anṛta","JJ","","_","_"
5,"ca","_","_","ca","CCD","","_","_"
1,"_","_","_","vākya","NC","","_","_"
2,"_","_","_","akāla","NC","","_","_"
3,"_","_","_","yuj","PPP","","_","_"
4,"_","_","_","dhāray","V","dhāray","_","_"
5,"_","_","_","vega","NC","","_","_"
6,"_","_","_","utthā","PPP","","_","_"
1,"_","_","_","deha","NC","","_","_"
2,"_","_","_","pravṛtti","NC","","_","_"
3,"_","_","_","yad","PRL","","_","_"
4,"_","_","_","kiṃcit","PRI","","_","_"
5,"_","_","_","vid","V","vid","_","_"
6,"_","_","_","para","PPX","","_","_"
7,"_","_","_","pīḍā","NC","","_","_"
1,"_","_","_","strī","NC","","_","_"
2,"_","_","_","bhoga","NC","","_","_"
3,"_","_","_","steya","NC","","_","_"
4,"_","_","_","hiṃsā","NC","","_","_"
5,"_","_","_","ādya","JJ","","_","_"
6,"tasyā","_","_","tad","PRD","","_","_"
7,"_","_","_","vega","NC","","_","_"
8,"_","_","_","vidhāray","V","vidhāray","_","_"
1,"_","_","_","puṇya","JJ","","_","_"
2,"_","_","_","śabda","NC","","_","_"
3,"_","_","_","vipāpa","JJ","","_","_"
5,"_","_","_","manas","NC","","_","_"
6,"_","_","_","vāc","NC","","_","_"
7,"_","_","_","kāya","NC","","_","_"
8,"_","_","_","karman","NC","","_","_"
1,"_","_","_","dharma","NC","","_","_"
2,"_","_","_","artha","NC","","_","_"
3,"_","_","_","kāma","NC","","_","_"
4,"puruṣaḥ","_","_","puruṣa","NC","","_","_"
5,"sukhī","_","_","sukhin","JJ","","_","_"
6,"bhuṅkte","_","_","bhuj","V","bhuj","_","_"
7,"cinoti","_","_","cin","V","ci","_","_"
8,"ca","_","_","ca","CCD","","_","_"
1,"_","_","_","śarīra","NC","","_","_"
2,"_","_","_","ceṣṭā","NC","","_","_"
3,"yā","_","_","yad","PRL","","_","_"
4,"ceṣṭā","_","_","ceṣṭā","NC","","_","_"
5,"_","_","_","sthairya","NC","","_","_"
6,"_","_","_","artha","NC","","_","_"
7,"_","_","_","bala","NC","","_","_"
8,"_","_","_","vardhin","JJ","","_","_"
1,"_","_","_","deha","NC","","_","_"
2,"_","_","_","vyāyāma","NC","","_","_"
3,"_","_","_","saṃkhyā","PPP","","_","_"
4,"mātrayā","_","_","mātrā","NC","","_","_"
5,"tāṃ","_","_","tad","PRD","","_","_"
6,"samācaret","_","_","samācar","V","samācar","_","_"
1,"lāghavaṃ","_","_","lāghava","NC","","_","_"
2,"_","_","_","karman","NC","","_","_"
3,"_","_","_","sāmarthya","NC","","_","_"
4,"sthairyaṃ","_","_","sthairya","NC","","_","_"
5,"_","_","_","duḥkha","NC","","_","_"
6,"_","_","_","sahiṣṇu","JJ","","_","_"
1,"_","_","_","doṣa","NC","","_","_"
2,"_","_","_","kṣaya","NC","","_","_"
3,"_","_","_","agni","NC","","_","_"
4,"_","_","_","vṛddhi","NC","","_","_"
5,"_","_","_","ca","CCD","","_","_"
6,"_","_","_","vyāyāma","NC","","_","_"
7,"_","_","_","upajan","V","upajan","_","_"
1,"śramaḥ","_","_","śrama","NC","","_","_"
2,"klamaḥ","_","_","klama","NC","","_","_"
3,"_","_","_","kṣaya","NC","","_","_"
4,"_","_","_","tṛṣṇā","NC","","_","_"
5,"raktapittaṃ","_","_","raktapitta","NC","","_","_"
6,"pratāmakaḥ","_","_","pratāmaka","NC","","_","_"
1,"_","_","_","ati","CADP","","_","_"
2,"_","_","_","vyāyāma","NC","","_","_"
3,"kāso","_","_","kāsa","NC","","_","_"
4,"_","_","_","jvara","NC","","_","_"
5,"_","_","_","chardi","NC","","_","_"
6,"_","_","_","ca","CCD","","_","_"
7,"jāyate","_","_","jan","V","jan","_","_"
1,"_","_","_","hṛdaya","NC","","_","_"
2,"_","_","_","ādi","NC","","_","_"
3,"_","_","_","uparodha","NC","","_","_"
4,"_","_","_","ca","CCD","","_","_"
5,"iti","_","_","iti","CQT","","_","_"
6,"_","_","_","vyāyāma","NC","","_","_"
7,"_","_","_","lakṣaṇa","NC","","_","_"
1,"_","_","_","vyāyāma","NC","","_","_"
2,"_","_","_","hāsya","NC","","_","_"
3,"_","_","_","bhāṣya","NC","","_","_"
4,"_","_","_","adhvan","NC","","_","_"
5,"_","_","_","grāmyadharma","NC","","_","_"
6,"_","_","_","prajāgara","NC","","_","_"
1,"_","_","_","na","CNG","","_","_"
2,"_","_","_","ucita","JJ","","_","_"
3,"_","_","_","api","CX","","_","_"
4,"seveta","_","_","sev","V","sev","_","_"
5,"_","_","_","buddhimat","JJ","","_","_"
6,"_","_","_","ati","CADP","","_","_"
7,"_","_","_","mātrā","NC","","_","_"
1,"_","_","_","tad","PRD","","_","_"
2,"_","_","_","evaṃvidha","JJ","","_","_"
3,"_","_","_","ca","CCD","","_","_"
4,"_","_","_","anya","PPX","","_","_"
5,"yo","_","_","yad","PRL","","_","_"
6,"'timātraṃ","_","_","atimātra","CX","","_","_"
7,"niṣevate","_","_","niṣev","V","niṣev","_","_"
1,"gajaṃ","_","_","gaja","NC","","_","_"
2,"siṃha","_","_","siṃha","NC","","_","_"
3,"_","_","_","iva","CCM","","_","_"
4,"_","_","_","ākṛṣ","KDP","","_","_"
5,"sahasā","_","_","sahasā","CX","","_","_"
6,"sa","_","_","tad","PRD","","_","_"
7,"vinaśyate","_","_","vinaś","V","vinaś","_","_"
1,"te","_","_","tad","PRD","","_","_"
2,"_","_","_","varjay","V","varjay","_","_"
3,"_","_","_","vyāyāma","NC","","_","_"
4,"_","_","_","kṣudh","PPP","","_","_"
5,"_","_","_","tṛṣita","JJ","","_","_"
6,"_","_","_","ca","CCD","","_","_"
7,"ye","_","_","yad","PRL","","_","_"
1,"_","_","_","ucita","JJ","","_","_"
2,"_","_","_","ahita","JJ","","_","_"
3,"_","_","_","dhīmat","JJ","","_","_"
4,"kramaśo","_","_","kramaśas","CX","","_","_"
5,"_","_","_","vira","V","vira","_","_"
6,"_","_","_","nara","NC","","_","_"
1,"hitaṃ","_","_","hita","JJ","","_","_"
2,"krameṇa","_","_","krameṇa","CX","","_","_"
3,"seveta","_","_","sev","V","sev","_","_"
4,"_","_","_","krama","NC","","_","_"
5,"_","_","_","ca","CCD","","_","_"
6,"_","_","_","atra","CAD","","_","_"
7,"_","_","_","upadiś","V","upadiś","_","_"
1,"_","_","_","prakṣepa","NC","","_","_"
2,"_","_","_","apacaya","NC","","_","_"
3,"tābhyāṃ","_","_","tad","PRD","","_","_"
4,"kramaḥ","_","_","krama","NC","","_","_"
5,"pādāṃśiko","_","_","pādāṃśika","JJ","","_","_"
6,"bhavet","_","_","bhav","V","bhū","_","_"
1,"_","_","_","eka","PPX","","_","_"
2,"_","_","_","antara","NC","","_","_"
3,"_","_","_","tatas","CX","","_","_"
4,"_","_","_","ca","CCD","","_","_"
5,"_","_","_","ūrdhva","JJ","","_","_"
6,"_","_","_","dvi","NUM","","_","_"
7,"_","_","_","antara","NC","","_","_"
8,"_","_","_","tri","NUM","","_","_"
9,"_","_","_","antara","NC","","_","_"
10,"tathā","_","_","tathā","CX","","_","_"
1,"_","_","_","krameṇa","CX","","_","_"
2,"a","_","_","alpha_privativum","PPP","","_","_"
2,"_","_","_","paci","PPP","","_","_"
3,"doṣāḥ","_","_","doṣa","NC","","_","_"
4,"_","_","_","krameṇa","CX","","_","_"
5,"_","_","_","upaci","PPP","","_","_"
6,"guṇāḥ","_","_","guṇa","NC","","_","_"
1,"santo","_","_","sat","JJ","","_","_"
2,"_","_","_","yā","V","yā","_","_"
3,"_","_","_","apunarbhāva","NC","","_","_"
4,"a","_","_","alpha_privativum","JJ","","_","_"
4,"_","_","_","prakampya","JJ","","_","_"
5,"bhavanti","_","_","bhav","V","bhū","_","_"
6,"ca","_","_","ca","CCD","","_","_"
1,"_","_","_","sama","PPX","","_","_"
2,"_","_","_","pitta","NC","","_","_"
3,"_","_","_","anila","NC","","_","_"
4,"_","_","_","kapha","NC","","_","_"
5,"_","_","_","kiṃcit","PRI","","_","_"
6,"_","_","_","garbha","NC","","_","_"
7,"_","_","_","ādi","NC","","_","_"
8,"mānavāḥ","_","_","mānava","NC","","_","_"
1,"dṛśyante","_","_","darś","V","dṛś","_","_"
2,"vātalāḥ","_","_","vātala","JJ","","_","_"
3,"_","_","_","kiṃcit","PRI","","_","_"
4,"_","_","_","pittala","JJ","","_","_"
5,"_","_","_","śleṣmala","JJ","","_","_"
6,"_","_","_","tathā","CX","","_","_"
1,"_","_","_","tad","PRD","","_","_"
2,"_","_","_","anātura","JJ","","_","_"
3,"pūrve","_","_","pūrva","PPX","","_","_"
4,"_","_","_","vātala","JJ","","_","_"
5,"_","_","_","ādya","JJ","","_","_"
6,"_","_","_","sadā","CAD","","_","_"
7,"_","_","_","ātura","JJ","","_","_"
1,"_","_","_","hi","CX","","_","_"
2,"_","_","_","ida","PRD","","_","_"
3,"_","_","_","deha","NC","","_","_"
4,"_","_","_","prakṛti","NC","","_","_"
5,"_","_","_","vak","V","vac","_","_"
1,"_","_","_","viparīta","JJ","","_","_"
2,"_","_","_","guṇa","NC","","_","_"
3,"_","_","_","tad","PRD","","_","_"
4,"_","_","_","svastha","JJ","","_","_"
5,"_","_","_","vṛtti","NC","","_","_"
6,"_","_","_","vidhi","NC","","_","_"
7,"_","_","_","hita","JJ","","_","_"
1,"_","_","_","sama","PPX","","_","_"
2,"_","_","_","sarva","JQ","","_","_"
3,"_","_","_","rasa","NC","","_","_"
4,"sātmyaṃ","_","_","sātmya","NC","","_","_"
5,"_","_","_","sama","PPX","","_","_"
6,"_","_","_","dhātu","NC","","_","_"
7,"praśasyate","_","_","praśaṃs","V","praśaṃs","_","_"
1,"dve","_","_","dvi","NUM","","_","_"
2,"adhaḥ","_","_","adhas","CX","","_","_"
3,"sapta","_","_","saptan","NUM","","_","_"
4,"śirasi","_","_","śiras","NC","","_","_"
5,"khāni","_","_","kha","NC","","_","_"
6,"_","_","_","sveda","NC","","_","_"
7,"_","_","_","mukha","NC","","_","_"
8,"ca","_","_","ca","CCD","","_","_"
1,"malāyanāni","_","_","malāyana","NC","","_","_"
2,"bādhyante","_","_","bādh","V","bādh","_","_"
3,"_","_","_","duṣ","PPP","","_","_"
4,"_","_","_","mātra","NC","","_","_"
5,"_","_","_","adhika","JJ","","_","_"
6,"_","_","_","mala","NC","","_","_"
1,"_","_","_","mala","NC","","_","_"
2,"_","_","_","buddhi","NC","","_","_"
3,"_","_","_","guru","JJ","","_","_"
5,"_","_","_","lāghava","NC","","_","_"
6,"_","_","_","mala","NC","","_","_"
7,"_","_","_","saṃkṣaya","NC","","_","_"
1,"malāyanānāṃ","_","_","malāyana","NC","","_","_"
2,"budhyeta","_","_","bodh","V","budh","_","_"
3,"_","_","_","saṅga","NC","","_","_"
4,"_","_","_","utsarga","NC","","_","_"
5,"_","_","_","atīva","CX","","_","_"
6,"ca","_","_","ca","CCD","","_","_"
1,"tān","_","_","tad","PRD","","_","_"
2,"_","_","_","doṣa","NC","","_","_"
3,"_","_","_","liṅga","NC","","_","_"
4,"_","_","_","ādiś","CGDA","","_","_"
5,"vyādhīn","_","_","vyādhi","NC","","_","_"
6,"_","_","_","sādhay","KDG","","_","_"
7,"_","_","_","upācar","V","upācar","_","_"
1,"_","_","_","vyādhi","NC","","_","_"
2,"_","_","_","hetu","NC","","_","_"
3,"_","_","_","pratidvaṃdva","NC","","_","_"
4,"_","_","_","mātrā","NC","","_","_"
5,"_","_","_","kāla","NC","","_","_"
6,"vicārayan","_","_","vicāray","KDP","","_","_"
1,"_","_","_","viṣama","JJ","","_","_"
2,"_","_","_","svastha","JJ","","_","_"
3,"_","_","_","vṛtta","NC","","_","_"
4,"_","_","_","tad","PRD","","_","_"
5,"_","_","_","roga","NC","","_","_"
6,"_","_","_","tathā","CX","","_","_"
7,"_","_","_","apara","PPX","","_","_"
1,"jāyante","_","_","jan","V","jan","_","_"
2,"'nāturas","_","_","anātura","JJ","","_","_"
3,"tasmāt","_","_","tasmāt","CX","","_","_"
4,"_","_","_","svastha","JJ","","_","_"
5,"_","_","_","vṛtta","NC","","_","_"
6,"_","_","_","para","PPX","","_","_"
7,"bhavet","_","_","bhav","V","bhū","_","_"
1,"_","_","_","mādhava","NC","","_","_"
2,"_","_","_","prathama","JJ","","_","_"
3,"māsi","_","_","mās","NC","","_","_"
4,"_","_","_","nabhasya","NC","","_","_"
5,"_","_","_","prathama","JJ","","_","_"
6,"punaḥ","_","_","punar","CAD","","_","_"
1,"_","_","_","sahasya","NC","","_","_"
2,"_","_","_","prathama","JJ","","_","_"
3,"_","_","_","ca","CCD","","_","_"
4,"_","_","_","eva","CEM","","_","_"
5,"_","_","_","hāray","V","hāray","_","_"
6,"_","_","_","doṣa","NC","","_","_"
7,"_","_","_","saṃcaya","NC","","_","_"
1,"_","_","_","snih","PPP","","_","_"
2,"_","_","_","svid","PPP","","_","_"
3,"_","_","_","śarīra","NC","","_","_"
4,"_","_","_","ūrdhva","CX","","_","_"
5,"_","_","_","ca","CCD","","_","_"
6,"_","_","_","adhas","CX","","_","_"
7,"_","_","_","ca","CCD","","_","_"
8,"nityaśaḥ","_","_","nityaśas","CX","","_","_"
1,"_","_","_","vasti","NC","","_","_"
2,"_","_","_","karman","NC","","_","_"
3,"tataḥ","_","_","tatas","CX","","_","_"
4,"_","_","_","kar","V","kṛ","_","_"
5,"_","_","_","nasya","NC","","_","_"
6,"_","_","_","karman","NC","","_","_"
7,"ca","_","_","ca","CCD","","_","_"
8,"buddhimān","_","_","buddhimat","JJ","","_","_"
1,"yathākramaṃ","_","_","yathākrama","CX","","_","_"
2,"_","_","_","yathāyogya","JJ","","_","_"
3,"_","_","_","atas","CX","","_","_"
4,"ūrdhvaṃ","_","_","ūrdhva","CX","","_","_"
5,"prayojayet","_","_","prayuj","V","prayuj","_","_"
1,"rasāyanāni","_","_","rasāyana","NC","","_","_"
2,"siddhāni","_","_","sidh","PPP","","_","_"
3,"_","_","_","vṛṣya","NC","","_","_"
4,"_","_","_","yoga","NC","","_","_"
5,"_","_","_","ca","CCD","","_","_"
6,"_","_","_","kāla","NC","","_","_"
7,"_","_","_","vid","JJ","","_","_"
1,"_","_","_","roga","NC","","_","_"
2,"_","_","_","tathā","CX","","_","_"
3,"na","_","_","na","CNG","","_","_"
4,"jāyante","_","_","jan","V","jan","_","_"
5,"_","_","_","prakṛti","NC","","_","_"
6,"_","_","_","stha","JJ","","_","_"
7,"dhātuṣu","_","_","dhātu","NC","","_","_"
1,"_","_","_","dhātu","NC","","_","_"
2,"_","_","_","ca","CCD","","_","_"
3,"_","_","_","abhivṛdh","V","abhivṛdh","_","_"
4,"jarā","_","_","jarā","NC","","_","_"
5,"_","_","_","māndya","NC","","_","_"
6,"_","_","_","upai","V","upe","_","_"
7,"ca","_","_","ca","CCD","","_","_"
1,"_","_","_","vidhi","NC","","_","_"
2,"_","_","_","tad","PRD","","_","_"
3,"vikārāṇām","_","_","vikāra","NC","","_","_"
4,"anutpattau","_","_","anutpatti","NC","","_","_"
5,"nidarśitaḥ","_","_","nidarśay","PPP","","_","_"
1,"_","_","_","nija","JJ","","_","_"
2,"_","_","_","itara","PPX","","_","_"
3,"tu","_","_","tu","CCD","","_","_"
4,"_","_","_","pṛthak","CX","","_","_"
5,"_","_","_","eva","CEM","","_","_"
6,"_","_","_","upadiś","V","upadiś","_","_"
1,"ye","_","_","yad","PRL","","_","_"
2,"_","_","_","bhūta","NC","","_","_"
3,"_","_","_","viṣa","NC","","_","_"
4,"_","_","_","vāyu","NC","","_","_"
5,"_","_","_","agni","NC","","_","_"
6,"_","_","_","samprahāra","NC","","_","_"
7,"_","_","_","ādi","NC","","_","_"
8,"_","_","_","sambhava","NC","","_","_"
1,"_","_","_","nṛ","NC","","_","_"
2,"_","_","_","āgantu","JJ","","_","_"
3,"rogāḥ","_","_","roga","NC","","_","_"
4,"prajñā","_","_","prajñā","NC","","_","_"
5,"_","_","_","tad","PRD","","_","_"
6,"_","_","_","aparādh","V","aparādh","_","_"
1,"_","_","_","īrṣyā","NC","","_","_"
2,"_","_","_","śoka","NC","","_","_"
3,"_","_","_","bhaya","NC","","_","_"
4,"_","_","_","krodha","NC","","_","_"
5,"_","_","_","māna","NC","","_","_"
6,"_","_","_","dveṣa","NC","","_","_"
7,"_","_","_","ādi","NC","","_","_"
8,"_","_","_","ca","CCD","","_","_"
9,"ye","_","_","yad","PRL","","_","_"
1,"_","_","_","manas","NC","","_","_"
2,"_","_","_","vikāra","NC","","_","_"
3,"_","_","_","tad","PRD","","_","_"
4,"_","_","_","api","CX","","_","_"
5,"_","_","_","vac","PPP","","_","_"
6,"sarve","_","_","sarva","JQ","","_","_"
7,"_","_","_","prajñāparādha","NC","","_","_"
8,"_","_","_","ja","JJ","","_","_"
1,"tyāgaḥ","_","_","tyāga","NC","","_","_"
2,"_","_","_","prajñāparādha","NC","","_","_"
3,"_","_","_","indriya","NC","","_","_"
4,"_","_","_","upaśama","NC","","_","_"
5,"smṛtiḥ","_","_","smṛti","NC","","_","_"
1,"_","_","_","deśa","NC","","_","_"
2,"_","_","_","kāla","NC","","_","_"
3,"_","_","_","ātman","NC","","_","_"
4,"_","_","_","vijñāna","NC","","_","_"
5,"_","_","_","sat","JJ","","_","_"
6,"_","_","_","vṛtta","NC","","_","_"
7,"_","_","_","anuvartana","NC","","_","_"
1,"_","_","_","āgantu","JJ","","_","_"
2,"_","_","_","anutpatti","NC","","_","_"
3,"_","_","_","tad","PRD","","_","_"
4,"mārgo","_","_","mārga","NC","","_","_"
5,"nidarśitaḥ","_","_","nidarśay","PPP","","_","_"
1,"prājñaḥ","_","_","prājña","JJ","","_","_"
2,"_","_","_","prāk","CX","","_","_"
3,"_","_","_","eva","CEM","","_","_"
4,"tat","_","_","tad","PRD","","_","_"
5,"_","_","_","kar","V","kṛ","_","_"
6,"_","_","_","hita","JJ","","_","_"
7,"_","_","_","vid","V","vid","_","_"
8,"_","_","_","yad","PRL","","_","_"
9,"_","_","_","ātman","NC","","_","_"
1,"_","_","_","āpta","NC","","_","_"
2,"_","_","_","upadeśa","NC","","_","_"
3,"_","_","_","prajñāna","NC","","_","_"
4,"_","_","_","pratipatti","NC","","_","_"
5,"_","_","_","ca","CCD","","_","_"
6,"kāraṇam","_","_","kāraṇa","NC","","_","_"
1,"_","_","_","vikāra","NC","","_","_"
2,"_","_","_","anutpatti","NC","","_","_"
3,"_","_","_","utpad","PPP","","_","_"
4,"ca","_","_","ca","CCD","","_","_"
5,"śāntaye","_","_","śānti","NC","","_","_"
1,"_","_","_","pāpa","JJ","","_","_"
2,"_","_","_","vṛtta","NC","","_","_"
3,"_","_","_","vacas","NC","","_","_"
4,"_","_","_","sattva","NC","","_","_"
5,"sūcakāḥ","_","_","sūcaka","JJ","","_","_"
6,"_","_","_","kalaha","NC","","_","_"
7,"_","_","_","priya","JJ","","_","_"
1,"_","_","_","marman","NC","","_","_"
2,"_","_","_","upahāsin","JJ","","_","_"
3,"lubdhāḥ","_","_","lubh","PPP","","_","_"
4,"_","_","_","para","PPX","","_","_"
5,"_","_","_","vṛddhi","NC","","_","_"
6,"_","_","_","dviṣ","JJ","","_","_"
7,"śaṭhāḥ","_","_","śaṭha","JJ","","_","_"
1,"_","_","_","para","PPX","","_","_"
2,"_","_","_","apavāda","NC","","_","_"
3,"_","_","_","rati","NC","","_","_"
4,"_","_","_","capala","JJ","","_","_"
5,"_","_","_","ripu","NC","","_","_"
6,"_","_","_","sevin","JJ","","_","_"
1,"_","_","_","nirghṛṇa","JJ","","_","_"
2,"_","_","_","tyaj","PPP","","_","_"
3,"_","_","_","dharman","NC","","_","_"
4,"parivarjyā","_","_","parivarjay","KDG","","_","_"
5,"_","_","_","nara","NC","","_","_"
6,"_","_","_","adhama","JJ","","_","_"
1,"_","_","_","buddhi","NC","","_","_"
2,"_","_","_","vidyā","NC","","_","_"
3,"_","_","_","vayas","NC","","_","_"
4,"_","_","_","śīla","NC","","_","_"
5,"_","_","_","dhairya","NC","","_","_"
6,"_","_","_","smṛti","NC","","_","_"
7,"_","_","_","samādhi","NC","","_","_"
1,"_","_","_","vṛddha","NC","","_","_"
2,"_","_","_","upasevin","JJ","","_","_"
3,"vṛddhāḥ","_","_","vṛddha","JJ","","_","_"
4,"_","_","_","svabhāva","NC","","_","_"
5,"_","_","_","jña","JJ","","_","_"
6,"_","_","_","ga","PPP","","_","_"
7,"_","_","_","vyathā","NC","","_","_"
1,"_","_","_","su","CAD","","_","_"
2,"_","_","_","mukha","NC","","_","_"
3,"_","_","_","sarva","JQ","","_","_"
4,"_","_","_","bhūta","NC","","_","_"
5,"praśāntāḥ","_","_","praśa","PPP","","_","_"
6,"_","_","_","śaṃs","PPP","","_","_"
7,"_","_","_","vrata","NC","","_","_"
1,"sevyāḥ","_","_","sev","KDG","","_","_"
2,"_","_","_","sat","JJ","","_","_"
3,"_","_","_","mārga","NC","","_","_"
4,"_","_","_","vaktṛ","JJ","","_","_"
5,"_","_","_","puṇya","JJ","","_","_"
6,"_","_","_","śravaṇa","NC","","_","_"
7,"_","_","_","darśana","NC","","_","_"
1,"_","_","_","āhāra","NC","","_","_"
2,"_","_","_","ācāra","NC","","_","_"
3,"_","_","_","ceṣṭā","NC","","_","_"
4,"_","_","_","sukha","NC","","_","_"
5,"_","_","_","arthin","JJ","","_","_"
6,"pretya","_","_","pre","CGDA","","_","_"
7,"_","_","_","ca","CCD","","_","_"
8,"_","_","_","iha","CAD","","_","_"
9,"ca","_","_","ca","CCD","","_","_"
1,"paraṃ","_","_","para","PPX","","_","_"
2,"_","_","_","prayatna","NC","","_","_"
3,"_","_","_","ātiṣṭh","V","āsthā","_","_"
4,"_","_","_","buddhimat","JJ","","_","_"
5,"_","_","_","hita","JJ","","_","_"
6,"_","_","_","sevana","NC","","_","_"
1,"na","_","_","na","CNG","","_","_"
2,"naktaṃ","_","_","nakta","NC","","_","_"
3,"dadhi","_","_","dadhi","NC","","_","_"
4,"bhuñjīta","_","_","bhuj","V","bhuj","_","_"
5,"na","_","_","na","CNG","","_","_"
6,"_","_","_","ca","CCD","","_","_"
7,"_","_","_","api","CX","","_","_"
8,"a","_","_","alpha_privativum","JJ","","_","_"
8,"_","_","_","ghṛta","JJ","","_","_"
9,"_","_","_","śarkarā","NC","","_","_"
1,"_","_","_","na","CNG","","_","_"
2,"a","_","_","alpha_privativum","JJ","","_","_"
2,"_","_","_","mudga","JJ","","_","_"
3,"_","_","_","yūṣa","NC","","_","_"
4,"_","_","_","na","CNG","","_","_"
5,"a","_","_","alpha_privativum","JJ","","_","_"
5,"_","_","_","kṣaudra","JJ","","_","_"
6,"_","_","_","na","CNG","","_","_"
7,"_","_","_","uṣṇa","JJ","","_","_"
8,"_","_","_","na","CNG","","_","_"
9,"_","_","_","āmalaka","NC","","_","_"
10,"_","_","_","vinā","CX","","_","_"
1,"_","_","_","jvara","NC","","_","_"
2,"_","_","_","asṛkpitta","NC","","_","_"
3,"_","_","_","vīsarpa","NC","","_","_"
4,"_","_","_","kuṣṭha","NC","","_","_"
5,"_","_","_","pāṇḍu","NC","","_","_"
6,"_","_","_","āmaya","NC","","_","_"
7,"_","_","_","bhrama","NC","","_","_"
1,"_","_","_","prāpn","V","prāp","_","_"
2,"_","_","_","kāmalā","NC","","_","_"
3,"_","_","_","ca","CCD","","_","_"
4,"_","_","_","ugra","NC","","_","_"
5,"vidhiṃ","_","_","vidhi","NC","","_","_"
6,"hitvā","_","_","hā","CGDA","","_","_"
7,"_","_","_","dadhi","NC","","_","_"
8,"_","_","_","priya","JJ","","_","_"
1,"tatra","_","_","tatra","CAD","","_","_"
2,"ślokāḥ","_","_","śloka","NC","","_","_"
1,"vegā","_","_","vega","NC","","_","_"
2,"_","_","_","vega","NC","","_","_"
3,"_","_","_","samuttha","JJ","","_","_"
4,"_","_","_","ca","CCD","","_","_"
5,"_","_","_","roga","NC","","_","_"
6,"_","_","_","tad","PRD","","_","_"
7,"ca","_","_","ca","CCD","","_","_"
8,"bheṣajam","_","_","bheṣaja","NC","","_","_"
1,"yeṣāṃ","_","_","yad","PRL","","_","_"
2,"vegā","_","_","vega","NC","","_","_"
3,"_","_","_","vidhṛ","KDG","","_","_"
4,"_","_","_","ca","CCD","","_","_"
5,"_","_","_","yad","PRL","","_","_"
6,"_","_","_","artha","NC","","_","_"
7,"_","_","_","yad","PRL","","_","_"
8,"_","_","_","hita","JJ","","_","_"
9,"_","_","_","ahita","JJ","","_","_"
1,"ucite","_","_","ucita","JJ","","_","_"
2,"_","_","_","ca","CCD","","_","_"
3,"_","_","_","ahita","JJ","","_","_"
4,"varjye","_","_","varjay","KDG","","_","_"
5,"sevye","_","_","sev","KDG","","_","_"
6,"_","_","_","ca","CCD","","_","_"
7,"_","_","_","anucita","JJ","","_","_"
8,"kramaḥ","_","_","krama","NC","","_","_"
1,"yathāprakṛti","_","_","yathāprakṛti","CX","","_","_"
2,"_","_","_","ca","CCD","","_","_"
3,"_","_","_","āhāra","NC","","_","_"
4,"_","_","_","malāyana","NC","","_","_"
5,"_","_","_","gada","NC","","_","_"
6,"_","_","_","auṣadha","NC","","_","_"
1,"_","_","_","bhū","KDP","","_","_"
2,"_","_","_","anutpatti","NC","","_","_"
3,"_","_","_","roga","NC","","_","_"
4,"_","_","_","auṣadha","NC","","_","_"
5,"ca","_","_","ca","CCD","","_","_"
6,"yat","_","_","yad","PRL","","_","_"
1,"varjyāḥ","_","_","varjay","KDG","","_","_"
2,"_","_","_","sev","KDG","","_","_"
3,"_","_","_","ca","CCD","","_","_"
4,"puruṣā","_","_","puruṣa","NC","","_","_"
5,"_","_","_","dhīmat","JJ","","_","_"
6,"_","_","_","ātman","NC","","_","_"
7,"_","_","_","sukha","NC","","_","_"
8,"_","_","_","arthin","JJ","","_","_"
1,"vidhinā","_","_","vidhi","NC","","_","_"
2,"dadhi","_","_","dadhi","NC","","_","_"
3,"sevyaṃ","_","_","sev","KDG","","_","_"
4,"ca","_","_","ca","CCD","","_","_"
5,"yena","_","_","yad","PRL","","_","_"
6,"_","_","_","yasmāt","CX","","_","_"
7,"_","_","_","tad","PRD","","_","_"
8,"_","_","_","atri","NC","","_","_"
9,"_","_","_","ja","JJ","","_","_"
1,"navegāndhāraṇe","_","_","navegāndhāraṇa","NC","","_","_"
2,"'dhyāye","_","_","adhyāya","NC","","_","_"
3,"_","_","_","sarva","JQ","","_","_"
4,"_","_","_","eva","CEM","","_","_"
5,"_","_","_","vad","V","vad","_","_"
6,"_","_","_","muni","NC","","_","_"
1,"_","_","_","iti","CQT","","_","_"
2,"_","_","_","agniveśa","NC","","_","_"
3,"_","_","_","kṛ","PPP","","_","_"
4,"tantre","_","_","tantra","NC","","_","_"
5,"_","_","_","caraka","NC","","_","_"
6,"_","_","_","pratisaṃskṛ","PPP","","_","_"
7,"ślokasthāne","_","_","ślokasthāna","NC","","_","_"
8,"navegāndhāraṇīyo","_","_","navegāndhāraṇīya","NC","","_","_"
9,"nāma","_","_","nāma","CX","","_","_"
10,"saptamo","_","_","saptama","JJ","","_","_"
11,"'dhyāyāḥ","_","_","adhyāya","NC","","_","_"
