"WordID","word","NormSTEM","suffix","lemma","PoS","Root","NormSuffix","NormWord"
1,"yudhiṣṭhira","_","_","yudhiṣṭhira","NC","","_","_"
2,"uvāca","_","_","vak","V","vac","_","_"
1,"dahyamānāya","_","_","dah","KDP","","_","_"
2,"viprāya","_","_","vipra","NC","","_","_"
3,"yaḥ","_","_","yad","PRL","","_","_"
4,"_","_","_","praya","V","praya","_","_"
5,"_","_","_","upānah","NC","","_","_"
1,"yat","_","_","yad","PRL","","_","_"
2,"phalaṃ","_","_","phala","NC","","_","_"
3,"tasya","_","_","tad","PRD","","_","_"
4,"bhavati","_","_","bhav","V","bhū","_","_"
5,"_","_","_","tad","PRD","","_","_"
6,"_","_","_","mat","PPR","","_","_"
7,"brūhi","_","_","abravīta","V","brū","_","_"
8,"pitāmaha","_","_","pitāmaha","NC","","_","_"
1,"bhīṣma","_","_","bhīṣma","NC","","_","_"
2,"uvāca","_","_","vak","V","vac","_","_"
1,"upānahau","_","_","upānah","NC","","_","_"
2,"prayacched","_","_","praya","V","praya","_","_"
3,"yo","_","_","yad","PRL","","_","_"
4,"brāhmaṇebhyaḥ","_","_","brāhmaṇa","NC","","_","_"
5,"samāhitaḥ","_","_","samāhita","JJ","","_","_"
1,"mardate","_","_","mṛd","V","mṛd","_","_"
2,"kaṇṭakān","_","_","kaṇṭaka","NC","","_","_"
3,"sarvān","_","_","sarva","JQ","","_","_"
4,"_","_","_","viṣama","JJ","","_","_"
5,"_","_","_","nistṛ","V","nistṛ","_","_"
6,"_","_","_","api","CX","","_","_"
1,"sa","_","_","tad","PRD","","_","_"
2,"śatrūṇām","_","_","śatru","NC","","_","_"
3,"upari","_","_","upari","CX","","_","_"
4,"ca","_","_","ca","CCD","","_","_"
5,"saṃtiṣṭhati","_","_","saṃtiṣṭh","V","saṃsthā","_","_"
6,"yudhiṣṭhira","_","_","yudhiṣṭhira","NC","","_","_"
1,"yānaṃ","_","_","yāna","NC","","_","_"
2,"_","_","_","ca","CCD","","_","_"
3,"_","_","_","aśvatarī","NC","","_","_"
4,"_","_","_","yuj","PPP","","_","_"
5,"tasya","_","_","tad","PRD","","_","_"
6,"śubhraṃ","_","_","śubhra","JJ","","_","_"
7,"viśāṃ","_","_","viś","NC","","_","_"
8,"pate","_","_","pati","NC","","_","_"
1,"upatiṣṭhati","_","_","upatiṣṭh","V","upasthā","_","_"
2,"kaunteya","_","_","kaunteya","NC","","_","_"
3,"_","_","_","rūpya","NC","","_","_"
4,"_","_","_","kāñcana","NC","","_","_"
5,"_","_","_","bhūṣaṇa","NC","","_","_"
1,"śakaṭaṃ","_","_","śakaṭa","NC","","_","_"
2,"_","_","_","damya","NC","","_","_"
3,"_","_","_","saṃyuj","PPP","","_","_"
4,"dattaṃ","_","_","dā","PPP","","_","_"
5,"bhavati","_","_","bhav","V","bhū","_","_"
6,"_","_","_","ca","CCD","","_","_"
7,"_","_","_","eva","CEM","","_","_"
8,"hi","_","_","hi","CX","","_","_"
1,"yudhiṣṭhira","_","_","yudhiṣṭhira","NC","","_","_"
2,"uvāca","_","_","vak","V","vac","_","_"
1,"yat","_","_","yad","PRL","","_","_"
2,"phalaṃ","_","_","phala","NC","","_","_"
3,"_","_","_","tila","NC","","_","_"
4,"_","_","_","dāna","NC","","_","_"
5,"ca","_","_","ca","CCD","","_","_"
6,"_","_","_","bhūmi","NC","","_","_"
7,"_","_","_","dāna","NC","","_","_"
8,"ca","_","_","ca","CCD","","_","_"
9,"kīrtitam","_","_","kīrtay","PPP","","_","_"
1,"_","_","_","go","CX","","_","_"
2,"_","_","_","pradāna","NC","","_","_"
3,"_","_","_","anna","NC","","_","_"
4,"_","_","_","dāna","NC","","_","_"
5,"ca","_","_","ca","CCD","","_","_"
6,"_","_","_","bhūyas","CX","","_","_"
7,"_","_","_","tad","PRD","","_","_"
8,"brūhi","_","_","abravīta","V","brū","_","_"
9,"kaurava","_","_","kaurava","NC","","_","_"
1,"bhīṣma","_","_","bhīṣma","NC","","_","_"
2,"uvāca","_","_","vak","V","vac","_","_"
1,"śṛṇuṣva","_","_","śṛṇ","V","śru","_","_"
2,"mama","_","_","mat","PPR","","_","_"
3,"kaunteya","_","_","kaunteya","NC","","_","_"
4,"_","_","_","tila","NC","","_","_"
5,"_","_","_","dāna","NC","","_","_"
6,"yat","_","_","yad","PRL","","_","_"
7,"phalam","_","_","phala","NC","","_","_"
1,"niśamya","_","_","niśāmay","CGDA","","_","_"
2,"ca","_","_","ca","CCD","","_","_"
3,"yathānyāyaṃ","_","_","yathānyāya","CX","","_","_"
4,"prayaccha","_","_","prayaccha","V","praya","_","_"
5,"kurusattama","_","_","kurusattama","NC","","_","_"
1,"pitṝṇāṃ","_","_","pitṛ","NC","","_","_"
2,"prathamaṃ","_","_","prathama","JJ","","_","_"
3,"bhojyaṃ","_","_","bhojya","NC","","_","_"
4,"tilāḥ","_","_","tila","NC","","_","_"
5,"sṛṣṭāḥ","_","_","sṛj","PPP","","_","_"
6,"svayaṃbhuvā","_","_","svayambhu","NC","","_","_"
1,"_","_","_","tila","NC","","_","_"
2,"_","_","_","dāna","NC","","_","_"
3,"vai","_","_","vai","CX","","_","_"
4,"tasmāt","_","_","tasmāt","CX","","_","_"
5,"_","_","_","pitṛ","NC","","_","_"
6,"_","_","_","pakṣa","NC","","_","_"
7,"pramodate","_","_","pramod","V","pramud","_","_"
1,"_","_","_","māgha","NC","","_","_"
2,"_","_","_","māsa","NC","","_","_"
3,"tilān","_","_","tila","NC","","_","_"
4,"_","_","_","yad","PRL","","_","_"
5,"_","_","_","tu","CCD","","_","_"
6,"brāhmaṇebhyaḥ","_","_","brāhmaṇa","NC","","_","_"
7,"prayacchati","_","_","praya","V","praya","_","_"
1,"_","_","_","sarva","JQ","","_","_"
2,"_","_","_","sattva","NC","","_","_"
3,"_","_","_","samākṛ","PPP","","_","_"
4,"narakaṃ","_","_","naraka","NC","","_","_"
5,"sa","_","_","tad","PRD","","_","_"
6,"na","_","_","na","CNG","","_","_"
7,"paśyati","_","_","paś","V","paś","_","_"
1,"_","_","_","sarva","JQ","","_","_"
2,"_","_","_","kāma","NC","","_","_"
3,"sa","_","_","tad","PRD","","_","_"
4,"yajate","_","_","yaj","V","yaj","_","_"
5,"_","_","_","yad","PRL","","_","_"
6,"_","_","_","tila","NC","","_","_"
7,"yajate","_","_","yaj","V","yaj","_","_"
8,"pitṝn","_","_","pitṛ","NC","","_","_"
1,"na","_","_","na","CNG","","_","_"
2,"_","_","_","ca","CCD","","_","_"
3,"_","_","_","a","CNG","","_","_"
4,"_","_","_","kāma","NC","","_","_"
5,"dātavyaṃ","_","_","dā","KDG","","_","_"
6,"_","_","_","tila","NC","","_","_"
7,"_","_","_","śrāddha","NC","","_","_"
8,"kathaṃcana","_","_","kathaṃcana","CX","","_","_"
1,"_","_","_","mahat","JJ","","_","_"
2,"_","_","_","ṛṣi","NC","","_","_"
3,"_","_","_","kaśyapa","NC","","_","_"
4,"_","_","_","tad","PRD","","_","_"
5,"gātrebhyaḥ","_","_","gātra","NC","","_","_"
6,"_","_","_","prasṛ","PPP","","_","_"
7,"_","_","_","tila","NC","","_","_"
1,"tato","_","_","tatas","CX","","_","_"
2,"divyaṃ","_","_","divya","JJ","","_","_"
3,"gatā","_","_","ga","PPP","","_","_"
4,"bhāvaṃ","_","_","bhāva","NC","","_","_"
5,"pradāneṣu","_","_","pradāna","NC","","_","_"
6,"tilāḥ","_","_","tila","NC","","_","_"
7,"prabho","_","_","prabhu","NC","","_","_"
1,"pauṣṭikā","_","_","pauṣṭika","JJ","","_","_"
2,"_","_","_","rūpa","NC","","_","_"
3,"_","_","_","da","JJ","","_","_"
4,"_","_","_","ca","CCD","","_","_"
5,"_","_","_","eva","CEM","","_","_"
6,"tathā","_","_","tathā","CX","","_","_"
7,"_","_","_","pāpa","NC","","_","_"
8,"_","_","_","vināśana","JJ","","_","_"
1,"tasmāt","_","_","tasmāt","CX","","_","_"
2,"_","_","_","sarva","JQ","","_","_"
3,"_","_","_","pradāna","NC","","_","_"
4,"_","_","_","tila","NC","","_","_"
5,"_","_","_","dāna","NC","","_","_"
6,"viśiṣyate","_","_","viśās","V","viśās","_","_"
1,"_","_","_","āpastamba","NC","","_","_"
2,"_","_","_","ca","CCD","","_","_"
3,"medhāvī","_","_","medhāvin","JJ","","_","_"
4,"_","_","_","śaṅkha","NC","","_","_"
5,"_","_","_","ca","CCD","","_","_"
6,"_","_","_","likhita","NC","","_","_"
7,"_","_","_","tathā","CX","","_","_"
1,"_","_","_","mahat","JJ","","_","_"
2,"_","_","_","ṛṣi","NC","","_","_"
3,"_","_","_","gautama","NC","","_","_"
4,"_","_","_","ca","CCD","","_","_"
5,"_","_","_","api","CX","","_","_"
6,"_","_","_","tila","NC","","_","_"
7,"_","_","_","dāna","NC","","_","_"
8,"divaṃ","_","_","div","NC","","_","_"
9,"gatāḥ","_","_","ga","PPP","","_","_"
1,"_","_","_","tila","NC","","_","_"
2,"_","_","_","homa","NC","","_","_"
3,"_","_","_","para","PPX","","_","_"
4,"viprāḥ","_","_","vipra","NC","","_","_"
5,"sarve","_","_","sarva","JQ","","_","_"
6,"_","_","_","saṃya","PPP","","_","_"
7,"_","_","_","maithuna","NC","","_","_"
1,"samā","_","_","sama","PPX","","_","_"
2,"gavyena","_","_","gavya","JJ","","_","_"
3,"haviṣā","_","_","havis","NC","","_","_"
4,"pravṛttiṣu","_","_","pravṛtti","NC","","_","_"
5,"ca","_","_","ca","CCD","","_","_"
6,"saṃsthitāḥ","_","_","saṃsthā","PPP","","_","_"
1,"sarveṣām","_","_","sarva","JQ","","_","_"
2,"eva","_","_","eva","CEM","","_","_"
3,"dānānāṃ","_","_","dāna","NC","","_","_"
4,"_","_","_","tila","NC","","_","_"
5,"_","_","_","dāna","NC","","_","_"
6,"paraṃ","_","_","para","PPX","","_","_"
7,"smṛtam","_","_","smṛ","PPP","","_","_"
1,"akṣayaṃ","_","_","akṣaya","JJ","","_","_"
2,"_","_","_","sarva","JQ","","_","_"
3,"_","_","_","dāna","NC","","_","_"
4,"_","_","_","tila","NC","","_","_"
5,"_","_","_","dāna","NC","","_","_"
6,"_","_","_","iha","CAD","","_","_"
7,"_","_","_","vak","V","vac","_","_"
1,"utpanne","_","_","utpad","PPP","","_","_"
2,"ca","_","_","ca","CCD","","_","_"
3,"purā","_","_","purā","CX","","_","_"
4,"havye","_","_","havya","NC","","_","_"
5,"_","_","_","kuśika","NC","","_","_"
6,"_","_","_","ṛṣi","NC","","_","_"
7,"paraṃtapa","_","_","paraṃtapa","JJ","","_","_"
1,"tilair","_","_","tila","NC","","_","_"
2,"_","_","_","agni","NC","","_","_"
3,"_","_","_","traya","NC","","_","_"
4,"hutvā","_","_","hu","CGDA","","_","_"
5,"prāptavān","_","_","prāp","KDP","","_","_"
6,"gatim","_","_","gati","NC","","_","_"
7,"uttamām","_","_","uttama","JJ","","_","_"
1,"iti","_","_","iti","CQT","","_","_"
2,"proktaṃ","_","_","pravac","PPP","","_","_"
3,"kuruśreṣṭha","_","_","kuruśreṣṭha","NC","","_","_"
4,"_","_","_","tila","NC","","_","_"
5,"_","_","_","dāna","NC","","_","_"
6,"anuttamam","_","_","anuttama","JJ","","_","_"
1,"vidhānaṃ","_","_","vidhāna","NC","","_","_"
2,"yena","_","_","yad","PRL","","_","_"
3,"vidhinā","_","_","vidhi","NC","","_","_"
4,"tilānām","_","_","tila","NC","","_","_"
5,"iha","_","_","iha","CAD","","_","_"
6,"śasyate","_","_","śaṃs","V","śaṃs","_","_"
1,"ata","_","_","atas","CX","","_","_"
2,"ūrdhvaṃ","_","_","ūrdhva","CX","","_","_"
3,"_","_","_","nibodh","V","nibudh","_","_"
4,"_","_","_","ida","PRD","","_","_"
5,"devānāṃ","_","_","deva","NC","","_","_"
6,"yaṣṭum","_","_","yaj","CGDI","","_","_"
7,"icchatām","_","_","iṣ","KDP","","_","_"
1,"samāgamaṃ","_","_","samāgama","NC","","_","_"
2,"_","_","_","mahat","JJ","","_","_"
3,"_","_","_","rāja","NC","","_","_"
4,"brahmaṇā","_","_","brahman","NC","","_","_"
5,"vai","_","_","vai","CX","","_","_"
6,"svayaṃbhuvā","_","_","svayambhu","NC","","_","_"
1,"devāḥ","_","_","deva","NC","","_","_"
2,"sametya","_","_","same","CGDA","","_","_"
3,"brahmāṇaṃ","_","_","brahman","NC","","_","_"
4,"_","_","_","bhūmi","NC","","_","_"
5,"_","_","_","bhāga","NC","","_","_"
6,"yiyakṣavaḥ","_","_","yiyakṣu","JJ","","_","_"
1,"śubhaṃ","_","_","śubha","JJ","","_","_"
2,"deśam","_","_","deśa","NC","","_","_"
3,"ayācanta","_","_","yāc","V","yāc","_","_"
4,"yajema","_","_","yaj","V","yaj","_","_"
5,"iti","_","_","iti","CQT","","_","_"
6,"pārthiva","_","_","pārthiva","NC","","_","_"
1,"devā","_","_","deva","NC","","_","_"
2,"ūcuḥ","_","_","vak","V","vac","_","_"
1,"_","_","_","bhagavat","JJ","","_","_"
2,"_","_","_","tvat","PPR","","_","_"
3,"prabhur","_","_","prabhu","JJ","","_","_"
4,"bhūmeḥ","_","_","bhūmi","NC","","_","_"
5,"sarvasya","_","_","sarva","JQ","","_","_"
6,"tridivasya","_","_","tridiva","NC","","_","_"
7,"ca","_","_","ca","CCD","","_","_"
1,"yajemahi","_","_","yaj","V","yaj","_","_"
2,"mahābhāga","_","_","mahābhāga","JJ","","_","_"
3,"yajñaṃ","_","_","yajña","NC","","_","_"
4,"_","_","_","bhavat","JJ","","_","_"
5,"_","_","_","anujñā","NC","","_","_"
1,"_","_","_","na","CNG","","_","_"
2,"_","_","_","ananujñāta","JJ","","_","_"
3,"_","_","_","bhūmi","NC","","_","_"
4,"hi","_","_","hi","CX","","_","_"
5,"yajñasya","_","_","yajña","NC","","_","_"
6,"phalam","_","_","phala","NC","","_","_"
7,"aśnute","_","_","aśn","V","aś","_","_"
1,"tvaṃ","_","_","tvat","PPR","","_","_"
2,"hi","_","_","hi","CX","","_","_"
3,"sarvasya","_","_","sarva","JQ","","_","_"
4,"jagataḥ","_","_","jagat","NC","","_","_"
5,"sthāvarasya","_","_","sthāvara","JJ","","_","_"
6,"carasya","_","_","cara","JJ","","_","_"
7,"ca","_","_","ca","CCD","","_","_"
1,"prabhur","_","_","prabhu","NC","","_","_"
2,"bhavasi","_","_","bhav","V","bhū","_","_"
3,"tasmāt","_","_","tasmāt","CX","","_","_"
4,"tvaṃ","_","_","tvat","PPR","","_","_"
5,"samanujñātum","_","_","samanujñā","CGDI","","_","_"
6,"arhasi","_","_","arh","V","arh","_","_"
1,"_","_","_","brahman","NC","","_","_"
2,"_","_","_","vak","V","vac","_","_"
1,"dadāmi","_","_","dad","V","dā","_","_"
2,"_","_","_","medinī","NC","","_","_"
3,"_","_","_","bhāga","NC","","_","_"
4,"bhavadbhyo","_","_","bhavat","JJ","","_","_"
5,"'haṃ","_","_","mat","PPR","","_","_"
6,"_","_","_","sura","NC","","_","_"
7,"_","_","_","ṛṣabha","NC","","_","_"
1,"yasmin","_","_","yad","PRL","","_","_"
2,"deśe","_","_","deśa","NC","","_","_"
3,"kariṣyadhvaṃ","_","_","kar","V","kṛ","_","_"
4,"yajñaṃ","_","_","yajña","NC","","_","_"
5,"_","_","_","kāśyapa","NC","","_","_"
6,"_","_","_","nandana","NC","","_","_"
1,"devā","_","_","deva","NC","","_","_"
2,"ūcuḥ","_","_","vak","V","vac","_","_"
1,"bhagavan","_","_","bhagavat","JJ","","_","_"
2,"_","_","_","kṛ","PPP","","_","_"
3,"_","_","_","kāma","NC","","_","_"
4,"smo","_","_","as","V","as","_","_"
5,"_","_","_","yaj","V","yaj","_","_"
6,"_","_","_","tu","CCD","","_","_"
7,"_","_","_","āp","PPP","","_","_"
8,"_","_","_","dakṣiṇā","NC","","_","_"
1,"imaṃ","_","_","ida","PRD","","_","_"
2,"tu","_","_","tu","CCD","","_","_"
3,"deśaṃ","_","_","deśa","NC","","_","_"
4,"munayaḥ","_","_","muni","NC","","_","_"
5,"paryupāsanta","_","_","paryupās","V","paryupās","_","_"
6,"nityadā","_","_","nityadā","CX","","_","_"
1,"bhīṣma","_","_","bhīṣma","NC","","_","_"
2,"uvāca","_","_","vak","V","vac","_","_"
1,"tato","_","_","tatas","CX","","_","_"
2,"_","_","_","agastya","NC","","_","_"
3,"_","_","_","ca","CCD","","_","_"
4,"_","_","_","kaṇva","NC","","_","_"
5,"_","_","_","ca","CCD","","_","_"
6,"bhṛgur","_","_","bhṛgu","NC","","_","_"
7,"atrir","_","_","atri","NC","","_","_"
8,"vṛṣākapiḥ","_","_","vṛṣākapi","NC","","_","_"
1,"asito","_","_","asita","NC","","_","_"
2,"_","_","_","devala","NC","","_","_"
3,"_","_","_","ca","CCD","","_","_"
4,"_","_","_","eva","CEM","","_","_"
5,"_","_","_","deva","NC","","_","_"
6,"_","_","_","yajña","NC","","_","_"
7,"upāgaman","_","_","upaga","V","upaga","_","_"
1,"tato","_","_","tatas","CX","","_","_"
2,"devā","_","_","deva","NC","","_","_"
3,"mahātmāna","_","_","mahātman","JJ","","_","_"
4,"ījire","_","_","yaj","V","yaj","_","_"
5,"yajñam","_","_","yajña","NC","","_","_"
6,"acyuta","_","_","acyuta","NC","","_","_"
1,"tathā","_","_","tathā","CX","","_","_"
2,"samāpayāmāsur","_","_","samāpay","V","samāpay","_","_"
3,"yathākālaṃ","_","_","yathākāla","CX","","_","_"
4,"_","_","_","sura","NC","","_","_"
5,"_","_","_","ṛṣabha","NC","","_","_"
1,"ta","_","_","tad","PRD","","_","_"
2,"_","_","_","iṣ","PPP","","_","_"
3,"_","_","_","yajña","NC","","_","_"
4,"_","_","_","tridaśa","NC","","_","_"
5,"_","_","_","himavat","NC","","_","_"
6,"_","_","_","acala","NC","","_","_"
7,"_","_","_","uttama","JJ","","_","_"
1,"ṣaṣṭham","_","_","ṣaṣṭha","JJ","","_","_"
2,"aṃśaṃ","_","_","aṃśa","NC","","_","_"
3,"_","_","_","kratu","NC","","_","_"
4,"_","_","_","tad","PRD","","_","_"
5,"_","_","_","bhūmi","NC","","_","_"
6,"_","_","_","dāna","NC","","_","_"
7,"pracakrire","_","_","prakar","V","prakṛ","_","_"
1,"_","_","_","prādeśa","NC","","_","_"
2,"_","_","_","mātra","NC","","_","_"
3,"_","_","_","bhūmi","NC","","_","_"
4,"_","_","_","tu","CCD","","_","_"
5,"yo","_","_","yad","PRL","","_","_"
6,"dadyād","_","_","dad","V","dā","_","_"
7,"anupaskṛtam","_","_","anupaskṛta","JJ","","_","_"
1,"na","_","_","na","CNG","","_","_"
2,"sīdati","_","_","sīd","V","sad","_","_"
3,"sa","_","_","tad","PRD","","_","_"
4,"kṛcchreṣu","_","_","kṛcchra","NC","","_","_"
5,"na","_","_","na","CNG","","_","_"
6,"ca","_","_","ca","CCD","","_","_"
7,"_","_","_","durga","NC","","_","_"
8,"_","_","_","avāp","V","avāp","_","_"
1,"_","_","_","śīta","JJ","","_","_"
2,"_","_","_","vāta","NC","","_","_"
3,"_","_","_","ātapa","NC","","_","_"
4,"_","_","_","saha","JJ","","_","_"
5,"_","_","_","gṛha","NC","","_","_"
6,"_","_","_","bhūmi","NC","","_","_"
7,"_","_","_","su","CAD","","_","_"
8,"_","_","_","saṃskṛ","PPP","","_","_"
1,"pradāya","_","_","pradā","CGDA","","_","_"
2,"_","_","_","sura","NC","","_","_"
3,"_","_","_","loka","NC","","_","_"
4,"_","_","_","stha","JJ","","_","_"
5,"_","_","_","puṇya","NC","","_","_"
6,"_","_","_","anta","NC","","_","_"
7,"'pi","_","_","api","CX","","_","_"
8,"na","_","_","na","CNG","","_","_"
9,"cālyate","_","_","cālay","V","cālay","_","_"
1,"mudito","_","_","mud","PPP","","_","_"
2,"vasate","_","_","vas","V","vas","_","_"
3,"prājñaḥ","_","_","prājña","JJ","","_","_"
4,"śakreṇa","_","_","śakra","NC","","_","_"
5,"saha","_","_","saha","CX","","_","_"
6,"pārthiva","_","_","pārthiva","NC","","_","_"
1,"_","_","_","pratiśraya","NC","","_","_"
2,"_","_","_","pradātṛ","JJ","","_","_"
3,"ca","_","_","ca","CCD","","_","_"
4,"so","_","_","tad","PRD","","_","_"
5,"'pi","_","_","api","CX","","_","_"
6,"svarge","_","_","svarga","NC","","_","_"
7,"mahīyate","_","_","mahīy","V","mahīy","_","_"
1,"_","_","_","adhyāpaka","NC","","_","_"
2,"_","_","_","kula","NC","","_","_"
3,"jātaḥ","_","_","jan","PPP","","_","_"
4,"śrotriyo","_","_","śrotriya","NC","","_","_"
5,"_","_","_","niya","PPP","","_","_"
6,"_","_","_","indriya","NC","","_","_"
1,"gṛhe","_","_","gṛha","NC","","_","_"
2,"yasya","_","_","yad","PRL","","_","_"
3,"vaset","_","_","vas","V","vas","_","_"
4,"tuṣṭaḥ","_","_","tuṣ","PPP","","_","_"
5,"pradhānaṃ","_","_","pradhāna","JJ","","_","_"
6,"lokam","_","_","loka","NC","","_","_"
7,"aśnute","_","_","aśn","V","aś","_","_"
1,"tathā","_","_","tathā","CX","","_","_"
2,"_","_","_","go","NC","","_","_"
3,"_","_","_","artha","NC","","_","_"
4,"śaraṇaṃ","_","_","śaraṇa","NC","","_","_"
5,"_","_","_","śīta","JJ","","_","_"
6,"_","_","_","varṣa","NC","","_","_"
7,"_","_","_","saha","JJ","","_","_"
8,"mahat","_","_","mahat","JJ","","_","_"
1,"āsaptamaṃ","_","_","āsaptama","JJ","","_","_"
2,"tārayati","_","_","tar","V","tṛ","_","_"
3,"kulaṃ","_","_","kula","NC","","_","_"
4,"_","_","_","bharata","NC","","_","_"
5,"_","_","_","sattama","JJ","","_","_"
1,"_","_","_","kṣetra","NC","","_","_"
2,"_","_","_","bhūmi","NC","","_","_"
3,"dadal","_","_","dā","KDP","","_","_"
4,"loke","_","_","loka","NC","","_","_"
5,"putra","_","_","putra","NC","","_","_"
6,"śriyam","_","_","śrī","NC","","_","_"
7,"avāpnuyāt","_","_","avāpn","V","avāp","_","_"
1,"_","_","_","ratna","NC","","_","_"
2,"_","_","_","bhūmi","NC","","_","_"
3,"pradattvā","_","_","pradā","CGDA","","_","_"
4,"tu","_","_","tu","CCD","","_","_"
5,"_","_","_","kula","NC","","_","_"
6,"_","_","_","vaṃśa","NC","","_","_"
7,"vivardhayet","_","_","vivardhay","V","vivardhay","_","_"
1,"na","_","_","na","CNG","","_","_"
2,"_","_","_","ca","CCD","","_","_"
3,"_","_","_","ūṣara","JJ","","_","_"
4,"na","_","_","na","CNG","","_","_"
5,"nirdagdhāṃ","_","_","nirdah","PPP","","_","_"
6,"mahīṃ","_","_","mahī","NC","","_","_"
7,"dadyāt","_","_","dad","V","dā","_","_"
8,"kathaṃcana","_","_","kathaṃcana","CX","","_","_"
1,"na","_","_","na","CNG","","_","_"
2,"_","_","_","śmaśāna","NC","","_","_"
3,"_","_","_","parī","PPP","","_","_"
4,"ca","_","_","ca","CCD","","_","_"
5,"na","_","_","na","CNG","","_","_"
6,"ca","_","_","ca","CCD","","_","_"
7,"_","_","_","pāpa","JJ","","_","_"
8,"_","_","_","niṣev","PPP","","_","_"
1,"pārakye","_","_","pārakya","JJ","","_","_"
2,"_","_","_","bhūmi","NC","","_","_"
3,"_","_","_","deśa","NC","","_","_"
4,"tu","_","_","tu","CCD","","_","_"
5,"pitṝṇāṃ","_","_","pitṛ","NC","","_","_"
6,"nirvapet","_","_","nirvap","V","nirvap","_","_"
7,"tu","_","_","tu","CCD","","_","_"
8,"yaḥ","_","_","yad","PRL","","_","_"
1,"tad","_","_","tad","PRD","","_","_"
2,"_","_","_","bhūmi","NC","","_","_"
3,"_","_","_","svāmin","NC","","_","_"
4,"_","_","_","pitṛ","NC","","_","_"
5,"_","_","_","śrāddha","NC","","_","_"
6,"_","_","_","karman","NC","","_","_"
7,"vihanyate","_","_","vihan","V","vihan","_","_"
1,"tasmāt","_","_","tasmāt","CX","","_","_"
2,"krītvā","_","_","krī","CGDA","","_","_"
3,"mahīṃ","_","_","mahī","NC","","_","_"
4,"dadyāt","_","_","dad","V","dā","_","_"
5,"_","_","_","su","CAD","","_","_"
6,"_","_","_","alpa","JJ","","_","_"
7,"api","_","_","api","CX","","_","_"
8,"vicakṣaṇaḥ","_","_","vicakṣaṇa","JJ","","_","_"
1,"piṇḍaḥ","_","_","piṇḍa","NC","","_","_"
2,"pitṛbhyo","_","_","pitṛ","NC","","_","_"
3,"datto","_","_","dā","PPP","","_","_"
4,"vai","_","_","vai","CX","","_","_"
5,"tasyāṃ","_","_","tad","PRD","","_","_"
6,"bhavati","_","_","bhav","V","bhū","_","_"
7,"śāśvataḥ","_","_","śāśvata","JJ","","_","_"
1,"_","_","_","aṭavī","NC","","_","_"
2,"_","_","_","parvata","NC","","_","_"
3,"_","_","_","ca","CCD","","_","_"
4,"_","_","_","eva","CEM","","_","_"
5,"_","_","_","nadī","NC","","_","_"
6,"_","_","_","tīrtha","NC","","_","_"
7,"yāni","_","_","yad","PRL","","_","_"
8,"ca","_","_","ca","CCD","","_","_"
1,"_","_","_","sarva","JQ","","_","_"
2,"_","_","_","asvāmika","JJ","","_","_"
3,"_","_","_","ah","V","ah","_","_"
4,"na","_","_","na","CNG","","_","_"
5,"hi","_","_","hi","CX","","_","_"
6,"tatra","_","_","tatra","CAD","","_","_"
7,"parigrahaḥ","_","_","parigraha","NC","","_","_"
1,"_","_","_","iti","CQT","","_","_"
2,"_","_","_","tad","PRD","","_","_"
3,"_","_","_","bhūmi","NC","","_","_"
4,"_","_","_","dāna","NC","","_","_"
5,"phalam","_","_","phala","NC","","_","_"
6,"uktaṃ","_","_","vac","PPP","","_","_"
7,"viśāṃ","_","_","viś","NC","","_","_"
8,"pate","_","_","pati","NC","","_","_"
1,"ataḥ","_","_","atas","CX","","_","_"
2,"paraṃ","_","_","para","CX","","_","_"
3,"tu","_","_","tu","CCD","","_","_"
4,"_","_","_","go","CX","","_","_"
5,"_","_","_","dāna","NC","","_","_"
6,"kīrtayiṣyāmi","_","_","kīrtay","V","kīrtay","_","_"
7,"te","_","_","tvat","PPR","","_","_"
8,"'nagha","_","_","anagha","JJ","","_","_"
1,"gāvo","_","_","go","NC","","_","_"
2,"_","_","_","adhika","JJ","","_","_"
3,"_","_","_","tapasvin","NC","","_","_"
4,"yasmāt","_","_","yasmāt","CX","","_","_"
5,"sarvebhya","_","_","sarva","JQ","","_","_"
6,"eva","_","_","eva","CEM","","_","_"
7,"ca","_","_","ca","CCD","","_","_"
1,"_","_","_","tasmāt","CX","","_","_"
2,"_","_","_","maheśvara","NC","","_","_"
3,"_","_","_","deva","NC","","_","_"
4,"_","_","_","tapas","NC","","_","_"
5,"_","_","_","tad","PRD","","_","_"
6,"samāsthitaḥ","_","_","samāsthā","PPP","","_","_"
1,"_","_","_","brahman","NC","","_","_"
2,"_","_","_","loka","NC","","_","_"
3,"_","_","_","vas","V","vas","_","_"
4,"_","_","_","tad","PRD","","_","_"
5,"somena","_","_","soma","NC","","_","_"
6,"saha","_","_","saha","CX","","_","_"
7,"bhārata","_","_","bhārata","NC","","_","_"
1,"āsāṃ","_","_","ida","PRD","","_","_"
2,"_","_","_","brahman","NC","","_","_"
3,"_","_","_","ṛṣi","NC","","_","_"
4,"siddhāḥ","_","_","siddha","NC","","_","_"
5,"prārthayanti","_","_","prārthay","V","prārthay","_","_"
6,"parāṃ","_","_","para","PPX","","_","_"
7,"gatim","_","_","gati","NC","","_","_"
1,"payasā","_","_","payas","NC","","_","_"
2,"haviṣā","_","_","havis","NC","","_","_"
3,"dadhnā","_","_","dadhi","NC","","_","_"
4,"_","_","_","śakṛt","NC","","_","_"
5,"_","_","_","api","CX","","_","_"
6,"_","_","_","atha","CAD","","_","_"
7,"carmaṇā","_","_","carman","NC","","_","_"
1,"_","_","_","asthi","NC","","_","_"
2,"_","_","_","ca","CCD","","_","_"
3,"_","_","_","upakar","V","upakṛ","_","_"
4,"śṛṅgair","_","_","śṛṅga","NC","","_","_"
5,"_","_","_","vāla","NC","","_","_"
6,"_","_","_","ca","CCD","","_","_"
7,"bhārata","_","_","bhārata","NC","","_","_"
1,"_","_","_","na","CNG","","_","_"
2,"_","_","_","ida","PRD","","_","_"
3,"_","_","_","śīta","NC","","_","_"
4,"_","_","_","ātapa","NC","","_","_"
5,"syātāṃ","_","_","as","V","as","_","_"
6,"_","_","_","sadā","CAD","","_","_"
7,"_","_","_","tad","PRD","","_","_"
8,"karma","_","_","karman","NC","","_","_"
9,"kurvate","_","_","kar","V","kṛ","_","_"
1,"na","_","_","na","CNG","","_","_"
2,"varṣaṃ","_","_","varṣa","NC","","_","_"
3,"viṣamaṃ","_","_","viṣama","NC","","_","_"
4,"_","_","_","vā","CCD","","_","_"
5,"_","_","_","api","CX","","_","_"
6,"duḥkham","_","_","duḥkha","NC","","_","_"
7,"āsāṃ","_","_","ida","PRD","","_","_"
8,"_","_","_","bhav","V","bhū","_","_"
9,"_","_","_","uta","CCD","","_","_"
1,"brāhmaṇaiḥ","_","_","brāhmaṇa","NC","","_","_"
2,"sahitā","_","_","sahita","JJ","","_","_"
3,"yānti","_","_","yā","V","yā","_","_"
4,"tasmāt","_","_","tasmāt","CX","","_","_"
5,"parataraṃ","_","_","paratara","JJ","","_","_"
6,"padam","_","_","pada","NC","","_","_"
1,"ekaṃ","_","_","eka","PPX","","_","_"
2,"_","_","_","go","CX","","_","_"
3,"_","_","_","brāhmaṇa","NC","","_","_"
4,"tasmāt","_","_","tasmāt","CX","","_","_"
5,"pravadanti","_","_","pravad","V","pravad","_","_"
6,"manīṣiṇaḥ","_","_","manīṣin","JJ","","_","_"
1,"rantidevasya","_","_","rantideva","NC","","_","_"
2,"yajñe","_","_","yajña","NC","","_","_"
3,"tāḥ","_","_","tad","PRD","","_","_"
4,"_","_","_","paśu","NC","","_","_"
6,"_","_","_","upakalpay","PPP","","_","_"
1,"_","_","_","tatas","CX","","_","_"
2,"_","_","_","carmaṇvatī","NC","","_","_"
3,"rājan","_","_","rājan","NC","","_","_"
4,"_","_","_","go","CX","","_","_"
5,"_","_","_","carman","NC","","_","_"
6,"pravartitā","_","_","pravartay","PPP","","_","_"
1,"_","_","_","paśu","NC","","_","_"
3,"_","_","_","ca","CCD","","_","_"
4,"vinirmuktāḥ","_","_","vinirmuc","PPP","","_","_"
5,"_","_","_","pradāna","NC","","_","_"
6,"_","_","_","upakalpay","PPP","","_","_"
1,"tā","_","_","tad","PRD","","_","_"
2,"imā","_","_","ida","PRD","","_","_"
3,"_","_","_","vipra","NC","","_","_"
4,"_","_","_","mukhya","JJ","","_","_"
5,"yo","_","_","yad","PRL","","_","_"
6,"dadāti","_","_","dad","V","dā","_","_"
7,"mahīpate","_","_","mahīpati","NC","","_","_"
1,"nistared","_","_","nistṛ","V","nistṛ","_","_"
2,"āpadaṃ","_","_","āpad","NC","","_","_"
3,"kṛcchrāṃ","_","_","kṛcchra","JJ","","_","_"
4,"_","_","_","viṣama","NC","","_","_"
5,"_","_","_","stha","JJ","","_","_"
6,"'pi","_","_","api","CX","","_","_"
7,"pārthiva","_","_","pārthiva","NC","","_","_"
1,"gavāṃ","_","_","go","NC","","_","_"
2,"_","_","_","sahasra","NUM","","_","_"
3,"_","_","_","da","JJ","","_","_"
4,"pretya","_","_","pre","CGDA","","_","_"
5,"narakaṃ","_","_","naraka","NC","","_","_"
6,"na","_","_","na","CNG","","_","_"
7,"prapaśyati","_","_","prapaś","V","prapaś","_","_"
1,"sarvatra","_","_","sarvatra","CX","","_","_"
2,"vijayaṃ","_","_","vijaya","NC","","_","_"
3,"_","_","_","ca","CCD","","_","_"
4,"_","_","_","api","CX","","_","_"
5,"labhate","_","_","labh","V","labh","_","_"
6,"_","_","_","manuja","NC","","_","_"
7,"_","_","_","adhipa","NC","","_","_"
1,"amṛtaṃ","_","_","amṛta","NC","","_","_"
2,"vai","_","_","vai","CX","","_","_"
3,"gavāṃ","_","_","go","NC","","_","_"
4,"kṣīram","_","_","kṣīra","NC","","_","_"
5,"_","_","_","iti","CQT","","_","_"
6,"_","_","_","ah","V","ah","_","_"
7,"tridaśādhipaḥ","_","_","tridaśādhipa","NC","","_","_"
1,"tasmād","_","_","tasmāt","CX","","_","_"
2,"dadāti","_","_","dad","V","dā","_","_"
3,"yo","_","_","yad","PRL","","_","_"
4,"dhenum","_","_","dhenu","NC","","_","_"
5,"amṛtaṃ","_","_","amṛta","NC","","_","_"
6,"sa","_","_","tad","PRD","","_","_"
7,"prayacchati","_","_","praya","V","praya","_","_"
1,"agnīnām","_","_","agni","NC","","_","_"
2,"avyayaṃ","_","_","avyaya","JJ","","_","_"
3,"_","_","_","hi","CX","","_","_"
4,"_","_","_","tad","PRD","","_","_"
5,"dhaumyaṃ","_","_","dhaumya","NC","","_","_"
6,"_","_","_","veda","NC","","_","_"
7,"_","_","_","vid","JJ","","_","_"
8,"viduḥ","_","_","vid","V","vid","_","_"
1,"tasmād","_","_","tasmāt","CX","","_","_"
2,"dadāti","_","_","dad","V","dā","_","_"
3,"yo","_","_","yad","PRL","","_","_"
4,"dhenuṃ","_","_","dhenu","NC","","_","_"
5,"sa","_","_","tad","PRD","","_","_"
6,"haumyaṃ","_","_","haumya","JJ","","_","_"
7,"samprayacchati","_","_","saṃprayacch","V","sampraya","_","_"
1,"svargo","_","_","svarga","NC","","_","_"
2,"vai","_","_","vai","CX","","_","_"
3,"mūrtimān","_","_","mūrtimat","JJ","","_","_"
4,"eṣa","_","_","tad","PRD","","_","_"
5,"vṛṣabhaṃ","_","_","vṛṣabha","NC","","_","_"
6,"yo","_","_","yad","PRL","","_","_"
7,"gavāṃ","_","_","go","NC","","_","_"
8,"patim","_","_","pati","NC","","_","_"
1,"vipre","_","_","vipra","NC","","_","_"
2,"_","_","_","guṇa","NC","","_","_"
3,"_","_","_","yuta","JJ","","_","_"
4,"dadyāt","_","_","dad","V","dā","_","_"
5,"sa","_","_","tad","PRD","","_","_"
6,"vai","_","_","vai","CX","","_","_"
7,"svarge","_","_","svarga","NC","","_","_"
8,"mahīyate","_","_","mahīy","V","mahīy","_","_"
1,"prāṇā","_","_","prāṇa","NC","","_","_"
2,"vai","_","_","vai","CX","","_","_"
3,"prāṇinām","_","_","prāṇin","NC","","_","_"
4,"ete","_","_","tad","PRD","","_","_"
5,"procyante","_","_","pravak","V","pravac","_","_"
6,"_","_","_","bharata","NC","","_","_"
7,"_","_","_","ṛṣabha","NC","","_","_"
1,"tasmād","_","_","tasmāt","CX","","_","_"
2,"dadāti","_","_","dad","V","dā","_","_"
3,"yo","_","_","yad","PRL","","_","_"
4,"dhenuṃ","_","_","dhenu","NC","","_","_"
5,"prāṇān","_","_","prāṇa","NC","","_","_"
6,"vai","_","_","vai","CX","","_","_"
7,"sa","_","_","tad","PRD","","_","_"
8,"prayacchati","_","_","praya","V","praya","_","_"
1,"gāvaḥ","_","_","go","NC","","_","_"
2,"śaraṇyā","_","_","śaraṇya","JJ","","_","_"
3,"bhūtānām","_","_","bhūta","NC","","_","_"
4,"iti","_","_","iti","CQT","","_","_"
5,"_","_","_","veda","NC","","_","_"
6,"_","_","_","vid","JJ","","_","_"
7,"viduḥ","_","_","vid","V","vid","_","_"
1,"tasmād","_","_","tasmāt","CX","","_","_"
2,"dadāti","_","_","dad","V","dā","_","_"
3,"yo","_","_","yad","PRL","","_","_"
4,"dhenuṃ","_","_","dhenu","NC","","_","_"
5,"śaraṇaṃ","_","_","śaraṇa","NC","","_","_"
6,"samprayacchati","_","_","saṃprayacch","V","sampraya","_","_"
1,"na","_","_","na","CNG","","_","_"
2,"_","_","_","vadha","NC","","_","_"
3,"_","_","_","artha","NC","","_","_"
4,"pradātavyā","_","_","pradā","KDG","","_","_"
5,"na","_","_","na","CNG","","_","_"
6,"kīnāśe","_","_","kīnāśa","NC","","_","_"
7,"na","_","_","na","CNG","","_","_"
8,"nāstike","_","_","nāstika","NC","","_","_"
1,"_","_","_","go","CX","","_","_"
2,"_","_","_","jīvin","JJ","","_","_"
3,"na","_","_","na","CNG","","_","_"
4,"dātavyā","_","_","dā","KDG","","_","_"
5,"tathā","_","_","tathā","CX","","_","_"
6,"gauḥ","_","_","go","NC","","_","_"
7,"_","_","_","puruṣa","NC","","_","_"
8,"_","_","_","ṛṣabha","NC","","_","_"
1,"dadāti","_","_","dad","V","dā","_","_"
2,"tādṛśānāṃ","_","_","tādṛśa","JJ","","_","_"
3,"vai","_","_","vai","CX","","_","_"
4,"naro","_","_","nara","NC","","_","_"
5,"gāḥ","_","_","go","NC","","_","_"
6,"_","_","_","pāpa","JJ","","_","_"
7,"_","_","_","karman","NC","","_","_"
1,"akṣayaṃ","_","_","akṣaya","JJ","","_","_"
2,"narakaṃ","_","_","naraka","NC","","_","_"
3,"_","_","_","yā","V","yā","_","_"
4,"_","_","_","iti","CQT","","_","_"
5,"_","_","_","eva","CX","","_","_"
6,"āhur","_","_","ah","V","ah","_","_"
7,"manīṣiṇaḥ","_","_","manīṣin","JJ","","_","_"
1,"na","_","_","na","CNG","","_","_"
2,"kṛśāṃ","_","_","kṛśa","JJ","","_","_"
3,"_","_","_","pāpa","JJ","","_","_"
4,"_","_","_","vatsa","NC","","_","_"
5,"vā","_","_","vā","CCD","","_","_"
6,"vandhyāṃ","_","_","vandhya","JJ","","_","_"
7,"_","_","_","roga","NC","","_","_"
8,"_","_","_","anvita","JJ","","_","_"
9,"tathā","_","_","tathā","CX","","_","_"
1,"na","_","_","na","CNG","","_","_"
2,"vyaṅgāṃ","_","_","vyaṅga","JJ","","_","_"
3,"na","_","_","na","CNG","","_","_"
4,"pariśrāntāṃ","_","_","pariśra","PPP","","_","_"
5,"dadyād","_","_","dad","V","dā","_","_"
6,"gāṃ","_","_","go","NC","","_","_"
7,"brāhmaṇāya","_","_","brāhmaṇa","NC","","_","_"
8,"vai","_","_","vai","CX","","_","_"
1,"_","_","_","daśan","NUM","","_","_"
2,"_","_","_","go","CX","","_","_"
3,"_","_","_","sahasra","NUM","","_","_"
4,"_","_","_","da","JJ","","_","_"
5,"samyak","_","_","samyak","CX","","_","_"
6,"śakreṇa","_","_","śakra","NC","","_","_"
7,"saha","_","_","saha","CX","","_","_"
8,"modate","_","_","mod","V","mud","_","_"
1,"_","_","_","akṣaya","JJ","","_","_"
2,"_","_","_","labh","V","labh","_","_"
3,"_","_","_","loka","NC","","_","_"
4,"_","_","_","nara","NC","","_","_"
5,"_","_","_","śata","NUM","","_","_"
6,"_","_","_","sahasra","NUM","","_","_"
7,"_","_","_","da","JJ","","_","_"
1,"_","_","_","iti","CQT","","_","_"
2,"_","_","_","tad","PRD","","_","_"
3,"_","_","_","go","CX","","_","_"
4,"_","_","_","pradāna","NC","","_","_"
5,"ca","_","_","ca","CCD","","_","_"
6,"_","_","_","tila","NC","","_","_"
7,"_","_","_","dāna","NC","","_","_"
8,"ca","_","_","ca","CCD","","_","_"
9,"kīrtitam","_","_","kīrtay","PPP","","_","_"
1,"tathā","_","_","tathā","CX","","_","_"
2,"_","_","_","bhūmi","NC","","_","_"
3,"_","_","_","pradāna","NC","","_","_"
4,"ca","_","_","ca","CCD","","_","_"
5,"_","_","_","śṛṇ","V","śru","_","_"
6,"_","_","_","anna","NC","","_","_"
7,"ca","_","_","ca","CCD","","_","_"
8,"bhārata","_","_","bhārata","NC","","_","_"
1,"_","_","_","anna","NC","","_","_"
2,"_","_","_","dāna","NC","","_","_"
3,"pradhānaṃ","_","_","pradhāna","NC","","_","_"
4,"hi","_","_","hi","CX","","_","_"
5,"kaunteya","_","_","kaunteya","NC","","_","_"
6,"paricakṣate","_","_","paricakṣ","V","paricakṣ","_","_"
1,"annasya","_","_","anna","NC","","_","_"
2,"hi","_","_","hi","CX","","_","_"
3,"pradānena","_","_","pradāna","NC","","_","_"
4,"rantidevo","_","_","rantideva","NC","","_","_"
5,"divaṃ","_","_","div","NC","","_","_"
6,"gataḥ","_","_","ga","PPP","","_","_"
1,"śrāntāya","_","_","śra","PPP","","_","_"
2,"_","_","_","kṣudh","PPP","","_","_"
3,"_","_","_","anna","NC","","_","_"
4,"yaḥ","_","_","yad","PRL","","_","_"
5,"prayacchati","_","_","praya","V","praya","_","_"
6,"bhūmipa","_","_","bhūmipa","NC","","_","_"
1,"svāyaṃbhuvaṃ","_","_","svāyambhuva","NC","","_","_"
2,"mahābhāgaṃ","_","_","mahābhāga","JJ","","_","_"
3,"sa","_","_","tad","PRD","","_","_"
4,"paśyati","_","_","paś","V","paś","_","_"
5,"narādhipa","_","_","narādhipa","NC","","_","_"
1,"na","_","_","na","CNG","","_","_"
2,"hiraṇyair","_","_","hiraṇya","NC","","_","_"
3,"na","_","_","na","CNG","","_","_"
4,"vāsobhir","_","_","vāsas","NC","","_","_"
5,"_","_","_","na","CNG","","_","_"
6,"_","_","_","aśva","NC","","_","_"
7,"_","_","_","dāna","NC","","_","_"
8,"bhārata","_","_","bhārata","NC","","_","_"
1,"prāpnuvanti","_","_","prāpn","V","prāp","_","_"
2,"narāḥ","_","_","nara","NC","","_","_"
3,"śreyo","_","_","śreyas","NC","","_","_"
4,"_","_","_","yathā","CCM","","_","_"
5,"_","_","_","iha","CAD","","_","_"
6,"_","_","_","anna","NC","","_","_"
7,"_","_","_","prada","JJ","","_","_"
8,"prabho","_","_","prabhu","NC","","_","_"
1,"annaṃ","_","_","anna","NC","","_","_"
2,"vai","_","_","vai","CX","","_","_"
3,"paramaṃ","_","_","parama","JJ","","_","_"
4,"dravyam","_","_","dravya","NC","","_","_"
5,"annaṃ","_","_","anna","NC","","_","_"
6,"_","_","_","śrī","NC","","_","_"
7,"_","_","_","ca","CCD","","_","_"
8,"parā","_","_","para","PPX","","_","_"
9,"matā","_","_","man","PPP","","_","_"
1,"annāt","_","_","anna","NC","","_","_"
2,"prāṇaḥ","_","_","prāṇa","NC","","_","_"
3,"prabhavati","_","_","prabhav","V","prabhū","_","_"
4,"tejo","_","_","tejas","NC","","_","_"
5,"vīryaṃ","_","_","vīrya","NC","","_","_"
6,"balaṃ","_","_","bala","NC","","_","_"
7,"tathā","_","_","tathā","CX","","_","_"
1,"sadbhyo","_","_","sat","JJ","","_","_"
2,"dadāti","_","_","dad","V","dā","_","_"
3,"_","_","_","yad","PRL","","_","_"
4,"_","_","_","ca","CCD","","_","_"
5,"_","_","_","anna","NC","","_","_"
6,"_","_","_","sadā","CAD","","_","_"
7,"_","_","_","ekāgra","JJ","","_","_"
8,"_","_","_","manas","NC","","_","_"
9,"naraḥ","_","_","nara","NC","","_","_"
1,"na","_","_","na","CNG","","_","_"
2,"sa","_","_","tad","PRD","","_","_"
3,"_","_","_","durga","NC","","_","_"
4,"_","_","_","avāp","V","avāp","_","_"
5,"_","_","_","iti","CQT","","_","_"
6,"_","_","_","eva","CX","","_","_"
7,"āha","_","_","ah","V","ah","_","_"
8,"parāśaraḥ","_","_","parāśara","NC","","_","_"
1,"arcayitvā","_","_","arcay","CGDA","","_","_"
2,"yathānyāyaṃ","_","_","yathānyāya","CX","","_","_"
3,"devebhyo","_","_","deva","NC","","_","_"
4,"'nnaṃ","_","_","anna","NC","","_","_"
5,"nivedayet","_","_","nivid","V","nivid","_","_"
1,"_","_","_","yad","PRL","","_","_"
2,"_","_","_","anna","NC","","_","_"
3,"hi","_","_","hi","CX","","_","_"
4,"naro","_","_","nara","NC","","_","_"
5,"_","_","_","rājan","NC","","_","_"
6,"_","_","_","tad","PRD","","_","_"
7,"_","_","_","anna","NC","","_","_"
8,"_","_","_","tad","PRD","","_","_"
9,"devatāḥ","_","_","devatā","NC","","_","_"
1,"kaumudyāṃ","_","_","kaumudī","NC","","_","_"
2,"_","_","_","śukla","NC","","_","_"
3,"_","_","_","pakṣa","NC","","_","_"
4,"tu","_","_","tu","CCD","","_","_"
5,"yo","_","_","yad","PRL","","_","_"
6,"_","_","_","anna","NC","","_","_"
7,"_","_","_","dāna","NC","","_","_"
8,"_","_","_","kar","V","kṛ","_","_"
9,"_","_","_","uta","CCD","","_","_"
1,"sa","_","_","tad","PRD","","_","_"
2,"saṃtarati","_","_","saṃtar","V","saṃtṛ","_","_"
3,"durgāṇi","_","_","durga","NC","","_","_"
4,"pretya","_","_","pre","CGDA","","_","_"
5,"_","_","_","ca","CCD","","_","_"
6,"_","_","_","ānantya","NC","","_","_"
7,"aśnute","_","_","aśn","V","aś","_","_"
1,"_","_","_","a","CNG","","_","_"
2,"_","_","_","bhuj","CGDA","","_","_"
3,"_","_","_","atithi","NC","","_","_"
4,"_","_","_","ca","CCD","","_","_"
5,"_","_","_","anna","NC","","_","_"
6,"prayacched","_","_","praya","V","praya","_","_"
7,"yaḥ","_","_","yad","PRL","","_","_"
8,"samāhitaḥ","_","_","samāhita","JJ","","_","_"
1,"sa","_","_","tad","PRD","","_","_"
2,"vai","_","_","vai","CX","","_","_"
3,"_","_","_","brahman","NC","","_","_"
4,"_","_","_","vid","JJ","","_","_"
5,"lokān","_","_","loka","NC","","_","_"
6,"prāpnuyād","_","_","prāpn","V","prāp","_","_"
7,"_","_","_","bharata","NC","","_","_"
8,"_","_","_","ṛṣabha","NC","","_","_"
1,"_","_","_","su","CAD","","_","_"
2,"_","_","_","kṛcchra","JJ","","_","_"
3,"āpadaṃ","_","_","āpad","NC","","_","_"
4,"_","_","_","prāp","PPP","","_","_"
5,"_","_","_","ca","CCD","","_","_"
6,"_","_","_","anna","NC","","_","_"
7,"_","_","_","da","JJ","","_","_"
8,"_","_","_","puruṣa","NC","","_","_"
9,"_","_","_","tar","V","tṛ","_","_"
1,"pāpaṃ","_","_","pāpa","NC","","_","_"
2,"tarati","_","_","tar","V","tṛ","_","_"
3,"_","_","_","ca","CCD","","_","_"
4,"_","_","_","eva","CEM","","_","_"
5,"_","_","_","iha","CAD","","_","_"
6,"duṣkṛtaṃ","_","_","duṣkṛta","NC","","_","_"
7,"_","_","_","ca","CCD","","_","_"
8,"_","_","_","apakṛṣ","V","apakṛṣ","_","_"
1,"_","_","_","iti","CQT","","_","_"
2,"_","_","_","tad","PRD","","_","_"
3,"_","_","_","anna","NC","","_","_"
4,"_","_","_","dāna","NC","","_","_"
5,"_","_","_","tila","NC","","_","_"
6,"_","_","_","dāna","NC","","_","_"
7,"_","_","_","ca","CCD","","_","_"
8,"_","_","_","eva","CEM","","_","_"
9,"ha","_","_","ha","CEM","","_","_"
1,"_","_","_","bhūmi","NC","","_","_"
2,"_","_","_","dāna","NC","","_","_"
3,"ca","_","_","ca","CCD","","_","_"
4,"phalaṃ","_","_","phala","NC","","_","_"
5,"_","_","_","go","CX","","_","_"
6,"_","_","_","dāna","NC","","_","_"
7,"ca","_","_","ca","CCD","","_","_"
8,"kīrtitam","_","_","kīrtay","PPP","","_","_"
