"WordID","word","NormSTEM","suffix","lemma","PoS","Root","NormSuffix","NormWord"
1,"mahi","_","_","mahi","JJ","","_","_"
2,"vo","_","_","tvat","PPR","","_","_"
3,"mahatām","_","_","mahat","JJ","","_","_"
4,"avo","_","_","avas","NC","","_","_"
5,"varuṇa","_","_","varuṇa","NC","","_","_"
6,"mitra","_","_","mitra","NC","","_","_"
7,"dāśuṣe","_","_","dāś","KDP","","_","_"
1,"yam","_","_","yad","PRL","","_","_"
2,"ādityā","_","_","āditya","NC","","_","_"
3,"abhi","_","_","abhi","CADP","","_","_"
4,"druho","_","_","druh","NC","","_","_"
5,"rakṣathā","_","_","rakṣ","V","rakṣ","_","_"
6,"_","_","_","na","CNG","","_","_"
7,"_","_","_","īṃ","CX","","_","_"
8,"aghaṃ","_","_","agha","NC","","_","_"
9,"naśad","_","_","naś","V","naś","_","_"
10,"anehaso","_","_","anehas","JJ","","_","_"
11,"va","_","_","tvat","PPR","","_","_"
12,"ūtayaḥ","_","_","ūti","NC","","_","_"
13,"_","_","_","su","CAD","","_","_"
14,"_","_","_","ūti","NC","","_","_"
15,"va","_","_","tvat","PPR","","_","_"
16,"ūtayaḥ","_","_","ūti","NC","","_","_"
1,"vidā","_","_","vid","V","vid","_","_"
2,"devā","_","_","deva","NC","","_","_"
3,"aghānām","_","_","agha","NC","","_","_"
4,"ādityāso","_","_","āditya","NC","","_","_"
5,"apākṛtim","_","_","apākṛti","NC","","_","_"
1,"pakṣā","_","_","pakṣa","NC","","_","_"
2,"vayo","_","_","vi","NC","","_","_"
3,"_","_","_","yathā","CCM","","_","_"
4,"_","_","_","upari","CX","","_","_"
5,"vy","_","_","vi","CADP","","_","_"
6,"asme","_","_","mat","PPR","","_","_"
7,"śarma","_","_","śarman","NC","","_","_"
8,"_","_","_","ya","V","ya","_","_"
9,"_","_","_","anehas","JJ","","_","_"
10,"va","_","_","tvat","PPR","","_","_"
11,"ūtayaḥ","_","_","ūti","NC","","_","_"
12,"_","_","_","su","CAD","","_","_"
13,"_","_","_","ūti","NC","","_","_"
14,"va","_","_","tvat","PPR","","_","_"
15,"ūtayaḥ","_","_","ūti","NC","","_","_"
1,"vy","_","_","vi","CADP","","_","_"
2,"asme","_","_","mat","PPR","","_","_"
3,"adhi","_","_","adhi","CADP","","_","_"
4,"śarma","_","_","śarman","NC","","_","_"
5,"tat","_","_","tad","PRD","","_","_"
6,"pakṣā","_","_","pakṣa","NC","","_","_"
7,"vayo","_","_","vi","NC","","_","_"
8,"na","_","_","na","CNG","","_","_"
9,"yantana","_","_","ya","V","ya","_","_"
1,"viśvāni","_","_","viśva","JQ","","_","_"
2,"_","_","_","viśva","JQ","","_","_"
3,"_","_","_","vedas","NC","","_","_"
4,"varūthyā","_","_","varūthya","JJ","","_","_"
5,"manāmahe","_","_","man","V","man","_","_"
6,"'nehaso","_","_","anehas","JJ","","_","_"
7,"va","_","_","tvat","PPR","","_","_"
8,"ūtayaḥ","_","_","ūti","NC","","_","_"
9,"_","_","_","su","CAD","","_","_"
10,"_","_","_","ūti","NC","","_","_"
11,"va","_","_","tvat","PPR","","_","_"
12,"ūtayaḥ","_","_","ūti","NC","","_","_"
1,"yasmā","_","_","yad","PRL","","_","_"
2,"arāsata","_","_","rā","V","rā","_","_"
3,"kṣayaṃ","_","_","kṣaya","NC","","_","_"
4,"jīvātuṃ","_","_","jīvātu","NC","","_","_"
5,"ca","_","_","ca","CCD","","_","_"
6,"pracetasaḥ","_","_","pracetas","JJ","","_","_"
1,"manor","_","_","manu","NC","","_","_"
2,"viśvasya","_","_","viśva","JQ","","_","_"
3,"_","_","_","gha","CX","","_","_"
4,"_","_","_","id","CEM","","_","_"
5,"ima","_","_","ida","PRD","","_","_"
6,"ādityā","_","_","āditya","NC","","_","_"
7,"rāya","_","_","rai","NC","","_","_"
8,"īśate","_","_","īśata","V","īś","_","_"
9,"'nehaso","_","_","anehas","JJ","","_","_"
10,"va","_","_","tvat","PPR","","_","_"
11,"ūtayaḥ","_","_","ūti","NC","","_","_"
12,"_","_","_","su","CAD","","_","_"
13,"_","_","_","ūti","NC","","_","_"
14,"va","_","_","tvat","PPR","","_","_"
15,"ūtayaḥ","_","_","ūti","NC","","_","_"
1,"pari","_","_","pari","CADP","","_","_"
2,"ṇo","_","_","mat","PPR","","_","_"
3,"vṛṇajann","_","_","vṛj","V","vṛj","_","_"
4,"aghā","_","_","agha","NC","","_","_"
5,"durgāṇi","_","_","durga","NC","","_","_"
6,"rathyo","_","_","rathī","JJ","","_","_"
7,"yathā","_","_","yathā","CCM","","_","_"
1,"_","_","_","as","V","as","_","_"
2,"_","_","_","id","CEM","","_","_"
3,"indrasya","_","_","indra","NC","","_","_"
4,"śarmaṇy","_","_","śarman","NC","","_","_"
5,"ādityānām","_","_","āditya","NC","","_","_"
6,"_","_","_","uta","CCD","","_","_"
7,"_","_","_","avas","NC","","_","_"
8,"anehaso","_","_","anehas","JJ","","_","_"
9,"va","_","_","tvat","PPR","","_","_"
10,"ūtayaḥ","_","_","ūti","NC","","_","_"
11,"_","_","_","su","CAD","","_","_"
12,"_","_","_","ūti","NC","","_","_"
13,"va","_","_","tvat","PPR","","_","_"
14,"ūtayaḥ","_","_","ūti","NC","","_","_"
1,"_","_","_","parihvṛt","NC","","_","_"
2,"_","_","_","id","CEM","","_","_"
3,"anā","_","_","anā","CX","","_","_"
4,"jano","_","_","jana","NC","","_","_"
5,"yuṣmādattasya","_","_","yuṣmādatta","JJ","","_","_"
6,"vāyati","_","_","vā","V","vā","_","_"
1,"devā","_","_","deva","NC","","_","_"
2,"adabhram","_","_","adabhra","JJ","","_","_"
3,"āśa","_","_","aś","V","aś","_","_"
4,"vo","_","_","tvat","PPR","","_","_"
5,"yam","_","_","yad","PRL","","_","_"
6,"ādityā","_","_","āditya","NC","","_","_"
7,"_","_","_","hi","V","hi","_","_"
8,"_","_","_","anehas","JJ","","_","_"
9,"va","_","_","tvat","PPR","","_","_"
10,"ūtayaḥ","_","_","ūti","NC","","_","_"
11,"_","_","_","su","CAD","","_","_"
12,"_","_","_","ūti","NC","","_","_"
13,"va","_","_","tvat","PPR","","_","_"
14,"ūtayaḥ","_","_","ūti","NC","","_","_"
1,"na","_","_","na","CNG","","_","_"
2,"taṃ","_","_","tad","PRD","","_","_"
3,"tigmaṃ","_","_","tigma","JJ","","_","_"
4,"cana","_","_","cana","CX","","_","_"
5,"tyajo","_","_","tyajas","NC","","_","_"
6,"na","_","_","na","CNG","","_","_"
7,"drāsad","_","_","drā","V","drā","_","_"
8,"abhi","_","_","abhi","CADP","","_","_"
9,"taṃ","_","_","tad","PRD","","_","_"
10,"guru","_","_","guru","JJ","","_","_"
1,"yasmā","_","_","yad","PRL","","_","_"
2,"u","_","_","u","CEM","","_","_"
3,"śarma","_","_","śarman","NC","","_","_"
4,"sapratha","_","_","saprathas","JJ","","_","_"
5,"ādityāso","_","_","āditya","NC","","_","_"
6,"arādhvam","_","_","rā","V","rā","_","_"
7,"anehaso","_","_","anehas","JJ","","_","_"
8,"va","_","_","tvat","PPR","","_","_"
9,"ūtayaḥ","_","_","ūti","NC","","_","_"
10,"_","_","_","su","CAD","","_","_"
11,"_","_","_","ūti","NC","","_","_"
12,"va","_","_","tvat","PPR","","_","_"
13,"ūtayaḥ","_","_","ūti","NC","","_","_"
1,"yuṣme","_","_","tvat","PPR","","_","_"
2,"devā","_","_","deva","NC","","_","_"
3,"api","_","_","api","CX","","_","_"
4,"ṣmasi","_","_","as","V","as","_","_"
5,"yudhyanta","_","_","yudh","KDP","","_","_"
6,"iva","_","_","iva","CCM","","_","_"
7,"varmasu","_","_","varman","NC","","_","_"
1,"yūyam","_","_","tvat","PPR","","_","_"
2,"maho","_","_","mah","JJ","","_","_"
3,"na","_","_","mat","PPR","","_","_"
4,"enaso","_","_","enas","NC","","_","_"
5,"yūyam","_","_","tvat","PPR","","_","_"
6,"arbhād","_","_","arbha","JJ","","_","_"
7,"_","_","_","uruṣy","V","uruṣy","_","_"
8,"_","_","_","anehas","JJ","","_","_"
9,"va","_","_","tvat","PPR","","_","_"
10,"ūtayaḥ","_","_","ūti","NC","","_","_"
11,"_","_","_","su","CAD","","_","_"
12,"_","_","_","ūti","NC","","_","_"
13,"va","_","_","tvat","PPR","","_","_"
14,"ūtayaḥ","_","_","ūti","NC","","_","_"
1,"aditir","_","_","aditi","NC","","_","_"
2,"na","_","_","mat","PPR","","_","_"
3,"uruṣyatv","_","_","uruṣy","V","uruṣy","_","_"
4,"aditiḥ","_","_","aditi","NC","","_","_"
5,"śarma","_","_","śarman","NC","","_","_"
6,"yacchatu","_","_","ya","V","ya","_","_"
1,"mātā","_","_","mātṛ","NC","","_","_"
2,"mitrasya","_","_","mitra","NC","","_","_"
3,"revato","_","_","revat","JJ","","_","_"
4,"'ryamṇo","_","_","aryaman","NC","","_","_"
5,"varuṇasya","_","_","varuṇa","NC","","_","_"
6,"_","_","_","ca","CCD","","_","_"
7,"_","_","_","anehas","JJ","","_","_"
8,"va","_","_","tvat","PPR","","_","_"
9,"ūtayaḥ","_","_","ūti","NC","","_","_"
10,"_","_","_","su","CAD","","_","_"
11,"_","_","_","ūti","NC","","_","_"
12,"va","_","_","tvat","PPR","","_","_"
13,"ūtayaḥ","_","_","ūti","NC","","_","_"
1,"yad","_","_","yad","PRL","","_","_"
2,"devāḥ","_","_","deva","NC","","_","_"
3,"śarma","_","_","śarman","NC","","_","_"
4,"śaraṇaṃ","_","_","śaraṇa","JJ","","_","_"
5,"yad","_","_","yad","PRL","","_","_"
6,"bhadraṃ","_","_","bhadra","JJ","","_","_"
7,"yad","_","_","yad","PRL","","_","_"
8,"anāturam","_","_","anātura","JJ","","_","_"
1,"_","_","_","tri","NUM","","_","_"
2,"_","_","_","dhātu","NC","","_","_"
3,"yad","_","_","yad","PRL","","_","_"
4,"varūthyaṃ","_","_","varūthya","JJ","","_","_"
5,"tad","_","_","tad","PRD","","_","_"
6,"asmāsu","_","_","mat","PPR","","_","_"
7,"vi","_","_","vi","CADP","","_","_"
8,"_","_","_","ya","V","ya","_","_"
9,"_","_","_","anehas","JJ","","_","_"
10,"va","_","_","tvat","PPR","","_","_"
11,"ūtayaḥ","_","_","ūti","NC","","_","_"
12,"_","_","_","su","CAD","","_","_"
13,"_","_","_","ūti","NC","","_","_"
14,"va","_","_","tvat","PPR","","_","_"
15,"ūtayaḥ","_","_","ūti","NC","","_","_"
1,"ādityā","_","_","āditya","NC","","_","_"
2,"ava","_","_","ava","CX","","_","_"
3,"hi","_","_","hi","CX","","_","_"
4,"_","_","_","khyā","V","khyā","_","_"
5,"_","_","_","adhi","CADP","","_","_"
6,"kūlād","_","_","kūla","NC","","_","_"
7,"iva","_","_","iva","CCM","","_","_"
8,"spaśaḥ","_","_","spaś","NC","","_","_"
1,"_","_","_","su","CAD","","_","_"
2,"_","_","_","tīrtha","NC","","_","_"
3,"arvato","_","_","arvat","NC","","_","_"
4,"_","_","_","yathā","CCM","","_","_"
5,"_","_","_","anu","CADP","","_","_"
6,"no","_","_","mat","PPR","","_","_"
7,"neṣathā","_","_","nay","V","nī","_","_"
8,"sugam","_","_","suga","NC","","_","_"
9,"anehaso","_","_","anehas","JJ","","_","_"
10,"va","_","_","tvat","PPR","","_","_"
11,"ūtayaḥ","_","_","ūti","NC","","_","_"
12,"_","_","_","su","CAD","","_","_"
13,"_","_","_","ūti","NC","","_","_"
14,"va","_","_","tvat","PPR","","_","_"
15,"ūtayaḥ","_","_","ūti","NC","","_","_"
1,"_","_","_","na","CNG","","_","_"
2,"_","_","_","iha","CAD","","_","_"
3,"bhadraṃ","_","_","bhadra","JJ","","_","_"
4,"rakṣasvine","_","_","rakṣasvin","JJ","","_","_"
5,"_","_","_","na","CNG","","_","_"
6,"a","_","_","alpha_privativum","CGDI","","_","_"
6,"_","_","_","vayā","CGDI","","_","_"
7,"_","_","_","na","CNG","","_","_"
8,"_","_","_","upayā","CGDI","","_","_"
9,"uta","_","_","uta","CCD","","_","_"
1,"gave","_","_","go","NC","","_","_"
2,"ca","_","_","ca","CCD","","_","_"
3,"bhadraṃ","_","_","bhadra","JJ","","_","_"
4,"dhenave","_","_","dhenu","NC","","_","_"
5,"vīrāya","_","_","vīra","NC","","_","_"
6,"ca","_","_","ca","CCD","","_","_"
7,"śravasyate","_","_","śravasy","KDP","","_","_"
8,"'nehaso","_","_","anehas","JJ","","_","_"
9,"va","_","_","tvat","PPR","","_","_"
10,"ūtayaḥ","_","_","ūti","NC","","_","_"
11,"_","_","_","su","CAD","","_","_"
12,"_","_","_","ūti","NC","","_","_"
13,"va","_","_","tvat","PPR","","_","_"
14,"ūtayaḥ","_","_","ūti","NC","","_","_"
1,"yad","_","_","yad","PRL","","_","_"
2,"āvir","_","_","āvis","CX","","_","_"
3,"yad","_","_","yad","PRL","","_","_"
4,"apīcyaṃ","_","_","apīcya","JJ","","_","_"
5,"devāso","_","_","deva","NC","","_","_"
6,"asti","_","_","as","V","as","_","_"
7,"duṣkṛtam","_","_","duṣkṛta","NC","","_","_"
1,"trite","_","_","trita","NC","","_","_"
2,"tad","_","_","tad","PRD","","_","_"
3,"viśvam","_","_","viśva","JQ","","_","_"
4,"āptya","_","_","āptya","NC","","_","_"
5,"āre","_","_","āre","CX","","_","_"
6,"asmad","_","_","mat","PPR","","_","_"
7,"_","_","_","dadh","V","dhā","_","_"
8,"_","_","_","anehas","JJ","","_","_"
9,"va","_","_","tvat","PPR","","_","_"
10,"ūtayaḥ","_","_","ūti","NC","","_","_"
11,"_","_","_","su","CAD","","_","_"
12,"_","_","_","ūti","NC","","_","_"
13,"va","_","_","tvat","PPR","","_","_"
14,"ūtayaḥ","_","_","ūti","NC","","_","_"
1,"yac","_","_","yad","PRL","","_","_"
2,"ca","_","_","ca","CCD","","_","_"
3,"goṣu","_","_","go","NC","","_","_"
4,"duṣṣvapnyaṃ","_","_","duḥṣvapnya","NC","","_","_"
5,"yac","_","_","yad","PRL","","_","_"
6,"_","_","_","ca","CCD","","_","_"
7,"_","_","_","mat","PPR","","_","_"
8,"duhitar","_","_","duhitṛ","NC","","_","_"
9,"divaḥ","_","_","div","NC","","_","_"
1,"tritāya","_","_","trita","NC","","_","_"
2,"tad","_","_","tad","PRD","","_","_"
3,"vibhāvary","_","_","vibhāvarī","NC","","_","_"
4,"āptyāya","_","_","āptya","NC","","_","_"
5,"parā","_","_","parā","CADP","","_","_"
6,"_","_","_","vah","V","vah","_","_"
7,"_","_","_","anehas","JJ","","_","_"
8,"va","_","_","tvat","PPR","","_","_"
9,"ūtayaḥ","_","_","ūti","NC","","_","_"
10,"_","_","_","su","CAD","","_","_"
11,"_","_","_","ūti","NC","","_","_"
12,"va","_","_","tvat","PPR","","_","_"
13,"ūtayaḥ","_","_","ūti","NC","","_","_"
1,"niṣkaṃ","_","_","niṣka","NC","","_","_"
2,"vā","_","_","vā","CCD","","_","_"
3,"ghā","_","_","gha","CX","","_","_"
4,"kṛṇavate","_","_","kar","V","kṛ","_","_"
5,"srajaṃ","_","_","sraj","NC","","_","_"
6,"vā","_","_","vā","CCD","","_","_"
7,"duhitar","_","_","duhitṛ","NC","","_","_"
8,"divaḥ","_","_","div","NC","","_","_"
1,"trite","_","_","trita","NC","","_","_"
2,"duṣṣvapnyaṃ","_","_","duḥṣvapnya","NC","","_","_"
3,"sarvam","_","_","sarva","JQ","","_","_"
4,"āptye","_","_","āptya","NC","","_","_"
5,"pari","_","_","pari","CADP","","_","_"
6,"dadmasy","_","_","dad","V","dā","_","_"
7,"anehaso","_","_","anehas","JJ","","_","_"
8,"va","_","_","tvat","PPR","","_","_"
9,"ūtayaḥ","_","_","ūti","NC","","_","_"
10,"_","_","_","su","CAD","","_","_"
11,"_","_","_","ūti","NC","","_","_"
12,"va","_","_","tvat","PPR","","_","_"
13,"ūtayaḥ","_","_","ūti","NC","","_","_"
1,"_","_","_","tad","PRD","","_","_"
2,"_","_","_","anna","NC","","_","_"
3,"_","_","_","tad","PRD","","_","_"
4,"_","_","_","apas","NC","","_","_"
5,"tam","_","_","tad","PRD","","_","_"
6,"bhāgam","_","_","bhāga","NC","","_","_"
7,"upaseduṣe","_","_","upasad","KDP","","_","_"
1,"tritāya","_","_","trita","NC","","_","_"
2,"ca","_","_","ca","CCD","","_","_"
3,"dvitāya","_","_","dvita","NC","","_","_"
4,"_","_","_","ca","CCD","","_","_"
5,"_","_","_","uṣas","NC","","_","_"
6,"duṣṣvapnyaṃ","_","_","duḥṣvapnya","NC","","_","_"
7,"_","_","_","vah","V","vah","_","_"
8,"_","_","_","anehas","JJ","","_","_"
9,"va","_","_","tvat","PPR","","_","_"
10,"ūtayaḥ","_","_","ūti","NC","","_","_"
11,"_","_","_","su","CAD","","_","_"
12,"_","_","_","ūti","NC","","_","_"
13,"va","_","_","tvat","PPR","","_","_"
14,"ūtayaḥ","_","_","ūti","NC","","_","_"
1,"yathā","_","_","yathā","CCM","","_","_"
2,"kalāṃ","_","_","kalā","NC","","_","_"
3,"yathā","_","_","yathā","CCM","","_","_"
4,"śaphaṃ","_","_","śapha","NC","","_","_"
5,"yatha","_","_","yathā","CCM","","_","_"
6,"ṛṇaṃ","_","_","ṛṇa","NC","","_","_"
7,"saṃnayāmasi","_","_","saṃnay","V","saṃnī","_","_"
1,"evā","_","_","eva","CEM","","_","_"
2,"duṣṣvapnyaṃ","_","_","duḥṣvapnya","NC","","_","_"
3,"sarvam","_","_","sarva","JQ","","_","_"
4,"āptye","_","_","āptya","NC","","_","_"
5,"saṃ","_","_","sa","CADP","","_","_"
6,"nayāmasy","_","_","nay","V","nī","_","_"
7,"anehaso","_","_","anehas","JJ","","_","_"
8,"va","_","_","tvat","PPR","","_","_"
9,"ūtayaḥ","_","_","ūti","NC","","_","_"
10,"_","_","_","su","CAD","","_","_"
11,"_","_","_","ūti","NC","","_","_"
12,"va","_","_","tvat","PPR","","_","_"
13,"ūtayaḥ","_","_","ūti","NC","","_","_"
1,"_","_","_","jay","V","ji","_","_"
2,"_","_","_","adya","CX","","_","_"
3,"_","_","_","san","V","san","_","_"
4,"_","_","_","ca","CCD","","_","_"
5,"_","_","_","bhav","V","bhū","_","_"
6,"_","_","_","anāgas","JJ","","_","_"
7,"vayam","_","_","mat","PPR","","_","_"
1,"uṣo","_","_","uṣas","NC","","_","_"
2,"yasmād","_","_","yad","PRL","","_","_"
3,"duṣṣvapnyād","_","_","duḥṣvapnya","NC","","_","_"
4,"_","_","_","bhī","V","bhī","_","_"
5,"_","_","_","apa","CX","","_","_"
6,"tad","_","_","tad","PRD","","_","_"
7,"ucchatv","_","_","vas","V","vas","_","_"
8,"anehaso","_","_","anehas","JJ","","_","_"
9,"va","_","_","tvat","PPR","","_","_"
10,"ūtayaḥ","_","_","ūti","NC","","_","_"
11,"_","_","_","su","CAD","","_","_"
12,"_","_","_","ūti","NC","","_","_"
13,"va","_","_","tvat","PPR","","_","_"
14,"ūtayaḥ","_","_","ūti","NC","","_","_"
