"WordID","word","NormSTEM","suffix","lemma","PoS","Root","NormSuffix","NormWord"
NA,"<doc textid = ""nispannayogavali"" genre = ""sādhana"" title = ""niṣpannayogāvalī"" author = ""abhayākaragupta"" discourse = ""tantra"" tradition = ""tantra"" period = ""commentarial"" source = ""gretil accessed aug 2019 : http :// gretil.sub.uni-goettingen.d e/ greti l/ corpuste i/ sa_.xml"" date_range = ""11.-12. ce"" notes = ""alternative genre: tantra"" religion = ""buddh"" edition = ""based on the ed. by r.o. meisezahl 1976"" digitization = ""k. wille"" segmentation_lemmatization = ""ligeia lugli & buddhist translators workbench team"" metadata_enrichment = ""bruno galasek-hul & buddhist translators workbench team"" proofreader = "" n/ a"" permission = ""permission for derivatives from m. mehner on behalf of gretil"" reconstructions = ""none"">","","","","","","",""
NA,"<page number=""223"">","","","","","","",""
NA,"<s number=""1"">","","","","","","",""
1,"oṃ","","","oṃ","ind","","","oṃ"
2,"namaḥ","NAM","aḥ","namas","noun-adj","","aḥ","namaḥ"
3,"śrī","ŚRĪ","","śrī","noun-adj","","","śrī"
4,"vajra","VAJR","a","vajra","noun-adj","","a","vajra"
5,"sattvāya","SATTV","āya","sattva","noun-adj","","āya","sattvāya"
6,"//","","","","punct","","","//"
NA,"</s>","","","","","","",""
NA,"<s number=""2"">","","","","","","",""
1,"jyotibhir","JYOT","ibhir","jyotis","noun-adj","","ibhiḥ","jyotibhiḥ"
2,"vijitaṃ","VIJIT","aṃ","vijita","noun-adj","","am","vijitam"
3,"yad","","","yad","pron","","","yad"
4,"asya","","","idam","pron","","","idam"
5,"jagatīṃ","JAGAT","īṃ","jagat","noun-adj","","īm","jagatīm"
6,"jiṣṇv","JIṢṆ","v","jiṣṇu","noun-adj","","v","jiṣṇv"
7,"antaratva","ANTAR","atva","antaratva","noun-adj","","atva","antaratva"
8,"tamo","TAMO","","tamas","noun-adj","","","tamo"
9,"?","","","","punct","","","?"
NA,"</s>","","","","","","",""
NA,"<s number=""3"">","","","","","","",""
1,"yac","","","yad","pron","","","yad"
2,"c","","a","ca","ind","","a","ca"
3,"^ā","","","alpha_privativum","ind","","","alpha_privativum"
4,"dvaita","DVAIT","a","dvaita","noun-adj","","a","dvaita"
5,"daśārṇa","DAŚĀRṆ","a","daśārṇa","noun-adj","","a","daśārṇa"
6,"saty","SATY","","satya","noun-adj","","","saty"
7,"api","","","api","ind","","","api"
8,"parīṇāmo","PARĪṆĀM","o","parīṇāma","noun-adj","","aḥ","parīṇāmaḥ"
9,"guṇ","GUṆ","a","guṇa","noun-adj","","a","guṇa"
10,"^aughaḥ","AUGH","aḥ","augha","noun-adj","","aḥ","aughaḥ"
11,"śriyām","ŚRIY","ām","śrī","noun-adj","","ām","śriyām"
12,"/","","","","punct","","","/"
NA,"</page>","","","","","","",""
NA,"<page number=""224"">","","","","","","",""
15,"yat","","","yad","pron","","","yad"
16,"kāruṇyatar","KĀRUṆY","atar","kāruṇya","noun-adj","","atar","kāruṇyatar"
17,"āmṛt","ĀMṚT","a","āmṛta","noun-adj","","a","āmṛta"
18,"^ārdra","ĀRDR","a","ārdra","noun-adj","","a","ārdra"
19,"hṛdayair","HṚDAY","air","hṛdaya","noun-adj","","air","hṛdayair"
20,"uhyanti","UH","yanti","uh","verb","","yanti","uhyanti"
21,"taṃ","","","tad","pron","","","tad"
22,"vajriṇas","VAJR","iṇas","vajrin","noun-adj","","inaḥ","vajrinaḥ"
23,"tair","","","tad","pron","","","tad"
24,"etac","ETAC","","tad","pron","","","etac"
25,"carit","CARIT","a","carita","noun-adj","","a","carita"
26,"^ādbhutāni","ADBHUT","āni","adbhuta","noun-adj","","āni","adbhutāni"
27,"nija","NIJ","a","nija","noun-adj","","a","nija"
28,"dhī","DH","ī","dhī","noun-adj","","ī","dhī"
29,"dhāmāni","DHĀM","āni","dhāma","noun-adj","","āni","dhāmāni"
30,"dhāvantu","DHĀV","antu","dhāv","verb","","anti","dhāvanti"
31,"vaḥ","","","yuṣmat","pron","","","yuṣmat"
32,"//","","","","punct","","","//"
NA,"</s>","","","","","","",""
NA,"<s number=""4"">","","","","","","",""
1,"vajr","VAJR","a","vajra","noun-adj","","a","vajra"
2,"^āvalī","ĀVAL","ī","avalī","noun-adj","","ī","āvalī"
3,"maṇḍita","MAṆḌIT","a","maṇḍita","noun-adj","","a","maṇḍita"
4,"maṇḍaleṣu","MAṆḌAL","eṣu","maṇḍala","noun-adj","","eṣu","maṇḍaleṣu"
5,"drāg","DRĀG","","drāga","noun-adj","","","drāg"
6,"vajra","VAJR","a","vajra","noun-adj","","a","vajra"
7,"bhṛc","BHṚ","c","bhṛa","noun-adj","","c","bhṛc"
8,"cāru","CĀR","u","cāru","noun-adj","","u","cāru"
9,"caritram","CARITR","am","caritra","noun-adj","","am","caritram"
10,"uccaiḥ","UCC","aiḥ","ucca","noun-adj","","air","uccair"
11,"/","","","","punct","","","/"
12,"tad","TAD","","tad","pron","","","tad"
13,"añcitais","AÑCIT","ais","añcita","noun-adj","","ais","añcitais"
14,"tad","TAD","","tad","pron","","","tad"
15,"vaca","VAC","a","vaca","noun-adj","","a","vaca"
16,"nirmit","NIRMIT","a","nirmita","noun-adj","","a","nirmita"
17,"^aughair","AUGH","air","augha","noun-adj","","air","aughair"
18,"a","","","alpha_privativum","ind","","","alpha_privativum"
19,"mogham","MOGH","am","mogha","noun-adj","","am","mogham"
20,"agryāṃ","AGRY","āṃ","agrya","noun-adj","","ām","agryām"
21,"śriyam","ŚRIY","am","śrī","noun-adj","","am","śriyam"
22,"ādadhātu","ĀDADHĀ","tu","ādadh","verb","ādhā","tums","ādadhātums"
23,"//","","","","punct","","","//"
NA,"</s>","","","","","","",""
NA,"<s number=""5"">","","","","","","",""
1,"iha","","","iha","ind","","","iha"
2,"hi","","","hi","ind","","","hi"
3,"mṛdu","MṚD","u","mṛdu","noun-adj","","u","mṛdu"
4,"madhya","MADHY","a","madhya","noun-adj","","a","madhya"
5,"kramābhyāṃ","KRAM","ābhyāṃ","krama","noun-adj","","ābhyām","kramābhyām"
6,"su","","","su","ind","","","su"
7,"bhāvita","BHĀVIT","a","bhāvita","noun-adj","","a","bhāvita"
8,"samādher","SAMĀDH","er","samādhi","noun-adj","","eḥ","samādheḥ"
9,"adhimātra","ADHIMĀTR","a","adhimātra","noun-adj","","a","adhimātra"
10,"prajñasya","PRAJÑ","asya","prajñā","noun-adj","","asya","prajñasya"
11,"bhagavatā","BHAGAV","atā","bhagavat","noun-adj","","atām","bhagavatām"
12,"/","","","","punct","","","/"
NA,"</s>","","","","","","",""
NA,"<s number=""6"">","","","","","","",""
1,"sarvākāravaropetaḥ","SARVĀKĀRAVAROPET","aḥ","sarvākāravaropeta","noun-adj","","aḥ","sarvākāravaropetaḥ"
2,"sphurat","SPHUR","at","sphurat","noun-adj","","at","sphurat"
3,"saṃhāra","SAṂHĀR","a","saṃhāra","noun-adj","","a","saṃhāra"
4,"kārakaḥ","KĀRAK","aḥ","kāraka","noun-adj","","aḥ","kārakaḥ"
5,"/","","","","punct","","","/"
6,"jhat","","","","ind","","",""
7,"iti","","","iti","ind","","","iti"
8,"jñāna","JÑĀN","a","jñāna","noun-adj","","a","jñāna"
9,"niṣpanno","NIṢPANN","o","niṣpanna","noun-adj","","aḥ","niṣpannaḥ"
10,"yogo","YOG","o","yoga","noun-adj","","aḥ","yogaḥ"
11,"niṣpanna","NIṢPANN","a","niṣpanna","noun-adj","","a","niṣpanna"
12,"ucyate","UC","yate","vak","verb","vac","yate","ucyate"
13,"//","","","","punct","","","//"
NA,"</s>","","","","","","",""
NA,"<s number=""7"">","","","","","","",""
1,"sa","","","tad","pron","","","tad"
2,"hi","","","hi","ind","","","hi"
3,"tvāṃ","","","tvat","pron","","","tvat"
4,"sarva","SARV","a","sarva","noun-adj","","a","sarva"
5,"sattvāṃś","SATTV","āṃś","sattva","noun-adj","","āṃś","sattvāṃś"
6,"ca","","","ca","ind","","","ca"
7,"vajradharatvaṃ","VAJRADHAR","atvaṃ","vajradharatva","noun-adj","","atvaṃ","vajradharatvaṃ"
8,"prāpayitum","PRĀPAY","itum","prāpn","verb","prāp","tums","prāpaytums"
9,"abhyutsāhavān","ABHYUTSĀH","avān","abhyutsāhavat","noun-adj","","avān","abhyutsāhavān"
10,"skandha","SKANDH","a","skandha","noun-adj","","a","skandha"
11,"dhātv","DHĀT","v","dhātu","noun-adj","","v","dhātv"
12,"āyatan","ĀYATAN","","āyatana","noun-adj","","","āyatan"
13,"ādikaṃ","ĀDIK","aṃ","ādika","noun-adj","","am","ādikam"
14,"pratibimbam","PRATI","am","pratibimba","noun-adj","","am","pratiam"
15,"ayaṃ","AYAṂ","","idam","pron","","","ayaṃ"
16,"śūnyat","ŚŪN","yat","śūnyatā","noun-adj","","yat","śūnyat"
17,"aika","EK","a","eka","noun-adj","","a","eka"
18,"rasaṃ","RAS","aṃ","rasa","noun-adj","","am","rasam"
19,"niścinvan","NIŚCIN","van","niścin","verb","niści","van","niścinvan"
20,"/","","","","punct","","","/"
NA,"</s>","","","","","","",""
NA,"<s number=""8"">","","","","","","",""
1,"prabhāsvaraṃ","PRABHĀSVAR","aṃ","prabhāsvara","noun-adj","","am","prabhāsvaram"
2,"praviśya","PRAVIŚY","a","praviś","verb","praviś","a","praviśya"
3,"jhat","","","","ind","","",""
4,"iti","","","iti","ind","","","iti"
5,"saparikara","SAPARIKAR","a","saparikara","noun-adj","","a","saparikara"
6,"kūṭ","KŪṬ","a","kūṭa","noun-adj","","a","kūṭa"
7,"^āgar","ĀGAR","a","āgara","noun-adj","","a","āgara"
8,"^odara","UDAR","a","udara","noun-adj","","a","udara"
9,"maṇḍala","MAṆḌAL","a","maṇḍala","noun-adj","","a","maṇḍala"
10,"māṇḍaleya","MĀṆḌALEY","a","māṇḍaleya","noun-adj","","a","māṇḍaleya"
11,"parikaritaḥ","PARIKAR","itaḥ","parikarita","noun-adj","","itaḥ","parikaritaḥ"
12,"kuleśa","KUL","eśa","kula","noun-adj","","eśa","kuleśa"
13,"bhūṣito","BHŪṢIT","o","bhūṣita","noun-adj","","aḥ","bhūṣitaḥ"
NA,"</page>","","","","","","",""
NA,"<page number=""225"">","","","","","","",""
16,"hṛd","HṚD","","hṛdi","noun-adj","","","hṛd"
17,"bīja","BĪJ","a","bīja","noun-adj","","a","bīja"
18,"yuktaḥ","YUKT","aḥ","yukta","noun-adj","","aḥ","yuktaḥ"
19,"śūnyatā","ŚŪNYAT","ā","śūnyatā","noun-adj","","ā","śūnyatā"
20,"karuṇ","KARUṆ","","karuṇa","noun-adj","","","karuṇ"
21,"aika","EK","a","eka","noun-adj","","a","eka"
22,"rasa","RAS","a","rasa","noun-adj","","a","rasa"
23,"mahā","MAH","ā","mahat","noun-adj","","ā","mahā"
24,"sukham","SUKH","am","sukha","noun-adj","","am","sukham"
25,"ayaḥ","","","","ind","","",""
26,"śrī","ŚRĪ","","śrī","noun-adj","","","śrī"
27,"vajra","VAJR","a","vajra","noun-adj","","a","vajra"
28,"sattva","SATTV","a","sattva","noun-adj","","a","sattva"
29,"mañjuvajr","MAÑJUVAJR","a","mañjuvajra","noun-adj","","a","mañjuvajra"
30,"^ādi","ĀD","i","ādi","noun-adj","","i","ādi"
31,"rūpo","RŪP","o","rūpa","noun-adj","","aḥ","rūpaḥ"
32,"a","","","alpha_privativum","ind","","","alpha_privativum"
33,"parimita","PARIMIT","a","parimita","noun-adj","","a","parimita"
34,"tathāgata","TATHĀGAT","a","tathāgata","noun-adj","","a","tathāgata"
35,"devī","DEV","ī","devī","noun-adj","","ī","devī"
36,"bodhisattva","BODHISATTV","a","bodhisattva","noun-adj","","a","bodhisattva"
37,"krodh","KRODH","a","krodha","noun-adj","","a","krodha"
38,"^ādīn","ĀD","īn","ādi","noun-adj","","īn","ādīn"
39,"sphārayet","SPHĀRAY","et","sphār","verb","","et","sphārayet"
40,"/","","","","punct","","","/"
NA,"</s>","","","","","","",""
NA,"<s number=""9"">","","","","","","",""
1,"dharma","DHARM","a","dharma","noun-adj","","a","dharma"
2,"deśan","DEŚAN","a","deśana","noun-adj","","a","deśana"
3,"^ādibhir","ĀD","ibhir","ādi","noun-adj","","ibhiḥ","ādibhiḥ"
4,"yathā","","","yathā","ind","","","yathā"
5,"bhavyaṃ","BHAVY","aṃ","bhavya","noun-adj","","am","bhavyam"
6,"parahitāni","PARAHIT","āni","parahita","noun-adj","","āni","parahitāni"
7,"kurvāṇaḥ","KURVĀṆ","aḥ","kurvāṇa","noun-adj","","aḥ","kurvāṇaḥ"
8,"para","PAR","a","para","noun-adj","","a","para"
9,"puṇy","PUṆY","a","puṇya","noun-adj","","a","puṇya"
10,"^āvadhiṃ","ĀVADH","iṃ","avadh","noun-adj","","im","āvadhim"
11,"sthāpayan","STHĀP","ayan","tiṣṭh","verb","sthā","ayan","sthāpayan"
12,"saṃharaṃś","SAṂHAR","aṃś","saṃhara","noun-adj","","aṃś","saṃharaṃś"
13,"c","","a","ca","ind","","a","ca"
14,"^ā","","","alpha_privativum","ind","","","alpha_privativum"
15,"cintya","CINTY","a","cintya","noun-adj","","a","cintya"
16,"mūrtir","MŪRT","ir","mūrti","noun-adj","","iḥ","mūrtiḥ"
17,"udeti","UDET","i","udeti","noun-adj","","i","udeti"
18,"//","","","","punct","","","//"
NA,"</s>","","","","","","",""
NA,"<s number=""10"">","","","","","","",""
1,"tatr","","","tatra","ind","","","tatra"
2,"āyaṃ","ĀYAṂ","","idam","pron","","","āyaṃ"
3,"parikar","PARIKAR","a","parikara","noun-adj","","a","parikara"
4,"^ādiḥ","ĀD","iḥ","ādi","noun-adj","","iḥ","ādiḥ"
5,"/","","","","punct","","","/"
NA,"</s>","","","","","","",""
NA,"<s number=""11"">","","","","","","",""
1,"āras","ĀRAS","","ārasa","noun-adj","","","āras"
2,"ā","","","alpha_privativum","ind","","","alpha_privativum"
3,"talam","TAL","am","tala","noun-adj","","am","talam"
4,"abhimata","ABHIMAT","a","abhimata","noun-adj","","a","abhimata"
5,"prasarā","PRASAR","ā","prasarā","noun-adj","","ā","prasarā"
6,"ghan","GHAN","a","ghana","noun-adj","","a","ghana"
7,"^aika","EK","a","eka","noun-adj","","a","eka"
8,"sārā","SĀR","ā","sāra","noun-adj","","āḥ","sārāḥ"
9,"jvalantī","JVAL","antī","jvala","noun-adj","","antī","jvalantī"
10,"vajra","VAJR","a","vajra","noun-adj","","a","vajra"
11,"mayī","MAY","ī","mayī","noun-adj","","ī","mayī"
12,"bhūmiḥ","BHŪM","iḥ","bhūmi","noun-adj","","iḥ","bhūmiḥ"
13,"kalp","KALP","a","kalpa","noun-adj","","a","kalpa"
14,"^ānta","ANT","a","anta","noun-adj","","a","anta"
15,"jvalana","JVALAN","a","jvalana","noun-adj","","a","jvalana"
16,"vana","VAN","a","vana","noun-adj","","a","vana"
17,"mayūkha","MAYŪKH","a","mayūkha","noun-adj","","a","mayūkha"
18,"jvāl","JVĀL","a","jvāla","noun-adj","","a","jvāla"
19,"^āvalī","ĀVAL","ī","avalī","noun-adj","","ī","āvalī"
20,"sīmābandhā","SĪMĀBANDH","ā","sīmābandha","noun-adj","","ā","sīmābandhā"
21,"/","","","","punct","","","/"
NA,"</s>","","","","","","",""
NA,"<s number=""10"">","","","","","","",""
1,"āras","ĀRAS","","ārasa","noun-adj","","","āras"
2,"ā","","","alpha_privativum","ind","","","alpha_privativum"
3,"talam","TAL","am","tala","noun-adj","","am","talam"
4,"upary","UPAR","y","upari","noun-adj","","i","upari"
5,"atyuccair","ATYUCC","air","atyucc","noun-adj","","air","atyuccair"
6,"ghananibuḍa","GHAN","anibuḍa","ghana","noun-adj","","anibuḍa","ghananibuḍa"
7,"jvalad","JVAL","ad","jvalat","noun-adj","","at","jvalat"
8,"vajra","VAJR","a","vajra","noun-adj","","a","vajra"
9,"prākār","PRĀKĀR","a","prākāra","noun-adj","","a","prākāra"
10,"^ordhve","ŪRDHV","e","ūrdhva","noun-adj","","e","ūrdhve"
11,"niḥsaṃdhy","NIḤSAṂDH","y","niḥsaṃdhi","noun-adj","","i","niḥsaṃdhi"
12,"eka","EK","a","eka","noun-adj","","a","eka"
13,"khaṇḍī","KHAṆḌ","ī","khaṇḍī","noun-adj","","ī","khaṇḍī"
14,"bhūtam","BHŪT","am","bhūta","noun-adj","","am","bhūtam"
15,"upari","UPAR","i","upari","noun-adj","","i","upari"
16,"vajra","VAJR","a","vajra","noun-adj","","a","vajra"
17,"śara","ŚAR","a","śara","noun-adj","","a","śara"
18,"jālādho","JĀL","ādho","jāla","noun-adj","","ādho","jālādho"
19,"vajra","VAJR","a","vajra","noun-adj","","a","vajra"
20,"vitāna","VITĀN","a","vitāna","noun-adj","","a","vitāna"
21,"maṇḍitaṃ","MAṆḌIT","aṃ","maṇḍita","noun-adj","","am","maṇḍitam"
22,"jvalad","JVAL","ad","jvalat","noun-adj","","at","jvalat"
23,"vajra","VAJR","a","vajra","noun-adj","","a","vajra"
24,"pañjaraṃ","PAÑJAR","aṃ","pañjara","noun-adj","","am","pañjaram"
25,"tad","TAD","","tad","pron","","","tad"
26,"abhyantara","ABHYANTAR","a","abhyantara","noun-adj","","a","abhyantara"
27,"sthita","STHIT","a","sthita","noun-adj","","a","sthita"
28,"viśv","VIŚV","a","viśva","noun-adj","","a","viśva"
29,"^ābja","ABJ","a","abja","noun-adj","","a","abja"
30,"sūrya","SŪR","ya","sūrya","noun-adj","","ya","sūrya"
31,"stha","STH","a","stha","noun-adj","","a","stha"
32,"pīta","PĪT","a","pīta","noun-adj","","a","pīta"
33,"dakṣiṇāvarta","DAKṢIṆĀVART","a","dakṣiṇāvarta","noun-adj","","a","dakṣiṇāvarta"
34,"bhramad","BHRAM","ad","bhramat","noun-adj","","at","bhramat"
35,"daśāra","DAŚ","āra","daśṛ","noun-adj","","āra","daśāra"
36,"cakraṃ","CAKR","aṃ","cakra","noun-adj","","am","cakram"
37,"ca","","","ca","ind","","","ca"
NA,"</page>","","","","","","",""
NA,"<page number=""61"">","","","","","","",""
40,"//","","","","punct","","","//"
NA,"</s>","","","","","","",""
NA,"<s number=""11"">","","","","","","",""
NA,"</page>","","","","","","",""
NA,"<page number=""226"">","","","","","","",""
3,"tatra","","","tatra","ind","","","tatra"
4,"pūrvasyām","PŪRV","asyām","pūrva","noun-adj","","asyām","pūrvasyām"
5,"ā","","","alpha_privativum","ind","","","alpha_privativum"
6,"rāyāṃ","RĀY","āṃ","rāyā","noun-adj","","ām","rāyām"
7,"yamāntakaḥ","YAMĀNT","akaḥ","yamāntaka","noun-adj","","akaḥ","yamāntakaḥ"
8,"kṛṣṇaḥ","KṚṢṆ","aḥ","kṛṣṇa","noun-adj","","aḥ","kṛṣṇaḥ"
9,"sita","SIT","a","sita","noun-adj","","a","sita"
10,"rakta","RAKT","a","rakta","noun-adj","","a","rakta"
11,"mukhaḥ","MUKH","aḥ","mukha","noun-adj","","aḥ","mukhaḥ"
12,"kṛṣṇa","KṚṢṆ","a","kṛṣṇa","noun-adj","","a","kṛṣṇa"
13,"vajra","VAJR","a","vajra","noun-adj","","a","vajra"
14,"mudgara","MUDGAR","a","mudgara","noun-adj","","a","mudgara"
15,"khaḍga","KHAḌG","a","khaḍga","noun-adj","","a","khaḍga"
16,"maṇi","MAṆ","i","maṇi","noun-adj","","i","maṇi"
17,"kamala","KAMAL","a","kamala","noun-adj","","a","kamala"
18,"dhārī","DHĀR","ī","dhārin","noun-adj","","ī","dhārī"
19,"/","","","","punct","","","/"
NA,"</s>","","","","","","",""
NA,"<s number=""12"">","","","","","","",""
1,"dakṣiṇasyāṃ","DAKṢIṆ","asyāṃ","dakṣiṇa","noun-adj","","asyāṃ","dakṣiṇasyāṃ"
2,"prajñāntakaḥ","PRAJÑĀNTAK","aḥ","prajñāntaka","noun-adj","","aḥ","prajñāntakaḥ"
3,"sitaḥ","SIT","aḥ","sita","noun-adj","","aḥ","sitaḥ"
4,"kṛṣṇa","KṚṢṆ","a","kṛṣṇa","noun-adj","","a","kṛṣṇa"
5,"rakta","RAKT","a","rakta","noun-adj","","a","rakta"
6,"mukho","MUKH","o","mukha","noun-adj","","aḥ","mukhaḥ"
7,"vajr","VAJR","a","vajra","noun-adj","","a","vajra"
8,"^āṅkita","ĀṄKIT","a","āṅkita","noun-adj","","a","āṅkita"
9,"sita","SIT","a","sita","noun-adj","","a","sita"
10,"daṇḍāsi","DAṆḌ","āsi","daṇḍa","noun-adj","","āsi","daṇḍāsi"
11,"maṇi","MAṆ","i","maṇi","noun-adj","","i","maṇi"
12,"padma","PADM","a","padma","noun-adj","","a","padma"
13,"dhārī","DHĀR","ī","dhārin","noun-adj","","ī","dhārī"
14,"/","","","","punct","","","/"
NA,"</s>","","","","","","",""
NA,"<s number=""13"">","","","","","","",""
1,"paścimāyāṃ","PAŚCIM","āyāṃ","paścima","noun-adj","","āyām","paścimāyām"
2,"padmāntako","PADMĀNTAK","o","padmāntaka","noun-adj","","aḥ","padmāntakaḥ"
3,"rakto","RAKT","o","rakta","noun-adj","","aḥ","raktaḥ"
4,"nīla","NĪL","a","nīla","noun-adj","","a","nīla"
5,"sitāsyo","SIT","āsyo","sita","noun-adj","","āsyo","sitāsyo"
6,"rakta","RAKT","a","rakta","noun-adj","","a","rakta"
7,"padmāsi","PADM","āsi","padma","noun-adj","","āsi","padmāsi"
8,"maṇi","MAṆ","i","maṇi","noun-adj","","i","maṇi"
9,"cakra","CAK","ra","caka","noun-adj","","ra","cakra"
10,"dhāri","DHĀR","i","dhāri","noun-adj","","i","dhāri"
11,"/","","","","punct","","","/"
NA,"</s>","","","","","","",""
NA,"<s number=""14"">","","","","","","",""
1,"uttarasyāṃ","UTTAR","asyāṃ","uttara","noun-adj","","asyāṃ","uttarasyāṃ"
2,"vighnāntakaḥ","VIGHNĀNTAK","aḥ","vighnāntaka","noun-adj","","aḥ","vighnāntakaḥ"
3,"kṛṣṇaḥ","KṚṢṆ","aḥ","kṛṣṇa","noun-adj","","aḥ","kṛṣṇaḥ"
4,"sita","SIT","a","sita","noun-adj","","a","sita"
5,"rakta","RAKT","a","rakta","noun-adj","","a","rakta"
6,"mukhaḥ","MUKH","aḥ","mukha","noun-adj","","aḥ","mukhaḥ"
7,"karāla","KARĀL","a","karāla","noun-adj","","a","karāla"
8,"vajrāsi","VAJR","āsi","vajra","noun-adj","","āsi","vajrāsi"
9,"maṇi","MAṆ","i","maṇi","noun-adj","","i","maṇi"
10,"padma","PADM","a","padma","noun-adj","","a","padma"
11,"dhārī","DHĀR","ī","dhārin","noun-adj","","ī","dhārī"
12,"/","","","","punct","","","/"
NA,"</s>","","","","","","",""
NA,"<s number=""15"">","","","","","","",""
1,"āgneyyāṃ","ĀGNEY","yāṃ","āgneyī","noun-adj","","yām","āgneyyām"
2,"ṭakkirājo","ṬAKKIRĀJ","o","ṭakkirāja","noun-adj","","aḥ","ṭakkirājaḥ"
3,"nīlaḥ","NĪL","aḥ","nīla","noun-adj","","aḥ","nīlaḥ"
4,"sita","SIT","a","sita","noun-adj","","a","sita"
5,"raktāsyo","RAKT","āsyo","rakta","noun-adj","","āsyo","raktāsyo"
6,"aṅkuśa","AṄKUŚ","a","aṅkuśa","noun-adj","","a","aṅkuśa"
7,"khaḍga","KHAḌG","a","khaḍga","noun-adj","","a","khaḍga"
8,"maṇi","MAṆ","i","maṇi","noun-adj","","i","maṇi"
9,"saroja","SAROJ","a","saroja","noun-adj","","a","saroja"
10,"dhārī","DHĀR","ī","dhārin","noun-adj","","ī","dhārī"
11,"/","","","","punct","","","/"
NA,"</s>","","","","","","",""
NA,"<s number=""16"">","","","","","","",""
1,"nairṛtyāṃ","NAIRṚTY","āṃ","nairṛtya","noun-adj","","ām","nairṛtyām"
2,"nīladaṇḍaḥ","NĪLADAṆḌ","aḥ","nīladaṇḍa","noun-adj","","aḥ","nīladaṇḍaḥ"
3,"kṛṣṇaḥ","KṚṢṆ","aḥ","kṛṣṇa","noun-adj","","aḥ","kṛṣṇaḥ"
4,"sita","SIT","a","sita","noun-adj","","a","sita"
5,"raktāsyo","RAKT","āsyo","rakta","noun-adj","","āsyo","raktāsyo"
6,"nīladaṇḍa","NĪLADAṆḌ","a","nīladaṇḍa","noun-adj","","a","nīladaṇḍa"
7,"khaḍga","KHAḌG","a","khaḍga","noun-adj","","a","khaḍga"
8,"maṇy","MAṆ","y","maṇi","noun-adj","","i","maṇi"
9,"abja","ABJ","a","abja","noun-adj","","a","abja"
10,"dhārī","DHĀR","ī","dhārin","noun-adj","","ī","dhārī"
11,"/","","","","punct","","","/"
NA,"</s>","","","","","","",""
NA,"<s number=""17"">","","","","","","",""
1,"vāyavyāṃ","VĀYAVY","āṃ","vāyavya","noun-adj","","ām","vāyavyām"
2,"mahābalaḥ","MAHĀBAL","aḥ","mahābala","noun-adj","","aḥ","mahābalaḥ"
3,"kṛṣṇaḥ","KṚṢṆ","aḥ","kṛṣṇa","noun-adj","","aḥ","kṛṣṇaḥ"
4,"sita","SIT","a","sita","noun-adj","","a","sita"
5,"rakta","RAKT","a","rakta","noun-adj","","a","rakta"
6,"mukhas","MUKH","as","mukha","noun-adj","","aḥ","mukhaḥ"
7,"triśūlāsi","TRIŚŪL","āsi","triśūla","noun-adj","","āsi","triśūlāsi"
8,"maṇi","MAṆ","i","maṇi","noun-adj","","i","maṇi"
9,"kamala","KAMAL","a","kamala","noun-adj","","a","kamala"
10,"dhārī","DHĀR","ī","dhārin","noun-adj","","ī","dhārī"
11,"/","","","","punct","","","/"
NA,"</s>","","","","","","",""
NA,"<s number=""18"">","","","","","","",""
1,"aiśānyām","AIŚĀN","yām","aiśānī","noun-adj","","yām","aiśānyām"
2,"a","","","alpha_privativum","ind","","","alpha_privativum"
3,"calo","CAL","o","cala","noun-adj","","aḥ","calaḥ"
4,"nīlaḥ","NĪL","aḥ","nīla","noun-adj","","aḥ","nīlaḥ"
5,"sita","SIT","a","sita","noun-adj","","a","sita"
6,"raktāsyaḥ","RAKT","āsyaḥ","rakta","noun-adj","","āsyaḥ","raktāsyaḥ"
7,"khaḍga","KHAḌG","a","khaḍga","noun-adj","","a","khaḍga"
8,"vajra","VAJR","a","vajra","noun-adj","","a","vajra"
9,"maṇi","MAṆ","i","maṇi","noun-adj","","i","maṇi"
10,"padma","PADM","a","padma","noun-adj","","a","padma"
11,"dhārī","DHĀR","ī","dhārin","noun-adj","","ī","dhārī"
12,"/","","","","punct","","","/"
NA,"</s>","","","","","","",""
NA,"<s number=""19"">","","","","","","",""
1,"ūrdhvam","ŪRDHV","am","ūrdhva","noun-adj","","am","ūrdhvam"
2,"uṣṇīṣa","UṢṆĪṢ","a","uṣṇīṣa","noun-adj","","a","uṣṇīṣa"
3,"cakravartī","CAKRAVART","ī","cakravartin","noun-adj","","ī","cakravartī"
4,"pīto","PĪT","o","pīta","noun-adj","","aḥ","pītaḥ"
5,"nīla","NĪL","a","nīla","noun-adj","","a","nīla"
6,"raktāsyaḥ","RAKT","āsyaḥ","rakta","noun-adj","","āsyaḥ","raktāsyaḥ"
7,"pīta","PĪT","a","pīta","noun-adj","","a","pīta"
8,"cakra","CAKR","a","cakra","noun-adj","","a","cakra"
9,"khaḍga","KHAḌG","a","khaḍga","noun-adj","","a","khaḍga"
10,"maṇi","MAṆ","i","maṇi","noun-adj","","i","maṇi"
11,"padma","PADM","a","padma","noun-adj","","a","padma"
12,"dhārī","DHĀR","ī","dhārin","noun-adj","","ī","dhārī"
13,"/","","","","punct","","","/"
NA,"</s>","","","","","","",""
NA,"<s number=""20"">","","","","","","",""
1,"adhaḥ","","","adha","ind","","","adha"
2,"sumbharājo","SUṂBHARĀJ","o","suṃbharāja","noun-adj","","aḥ","suṃbharājaḥ"
3,"nīlaḥ","NĪL","aḥ","nīla","noun-adj","","aḥ","nīlaḥ"
4,"sita","SIT","a","sita","noun-adj","","a","sita"
5,"raktāsyo","RAKT","āsyo","rakta","noun-adj","","āsyo","raktāsyo"
6,"vajra","VAJR","a","vajra","noun-adj","","a","vajra"
7,"khaḍga","KHAḌG","a","khaḍga","noun-adj","","a","khaḍga"
8,"maṇika","MAṆIK","a","maṇika","noun-adj","","a","maṇika"
9,"mala","MAL","a","mala","noun-adj","","a","mala"
10,"bhṛt","BHṚ","t","bhṛta","noun-adj","","t","bhṛt"
11,"//","","","","punct","","","//"
NA,"</s>","","","","","","",""
NA,"<s number=""21"">","","","","","","",""
NA,"</page>","","","","","","",""
NA,"<page number=""227"">","","","","","","",""
3,"tatr","","","tatra","ind","","","tatra"
4,"oṣṇīṣa","UṢṆĪṢ","a","uṣṇīṣa","noun-adj","","a","uṣṇīṣa"
5,"ṭakkya","ṬAK","kya","ṭakk","noun-adj","","kya","ṭakkya"
6,"cala","CAL","a","cala","noun-adj","","a","cala"
7,"sumbhā","SUṂBH","ā","suṃbhā","noun-adj","","ā","suṃbhā"
8,"ratnamukuṭino","RATNAMUKUṬ","ino","ratnamukuṭin","noun-adj","","inaḥ","ratnamukuṭinaḥ"
9,"vicitra","VICITR","a","vicitra","noun-adj","","a","vicitra"
10,"ratn","RATN","a","ratna","noun-adj","","a","ratna"
11,"^ābharaṇā","ĀBHARAṆ","ā","ābharaṇa","noun-adj","","āḥ","ābharaṇāḥ"
12,"lalitā","LALIT","ā","lalitā","noun-adj","","ā","lalitā"
13,"īṣad","ĪṢAD","","īṣat","noun-adj","","","īṣad"
14,"darśita","DARŚIT","a","darśita","noun-adj","","a","darśita"
15,"daṃṣṭrā","DAṂṢṬR","ā","daṃṣṭra","noun-adj","","āḥ","daṃṣṭrāḥ"
16,"vigata","VIGAT","a","vigata","noun-adj","","a","vigata"
17,"śmaśravaḥ","ŚMAŚR","avaḥ","śmaśru","noun-adj","","avaḥ","śmaśravaḥ"
18,"/","","","","punct","","","/"
NA,"</s>","","","","","","",""
NA,"<s number=""22"">","","","","","","",""
1,"tad","TAD","","tad","pron","","","tad"
2,"anye","ANY","e","anya","pron","","e","anye"
3,"vikṛta","VIKṚT","a","vikṛta","noun-adj","","a","vikṛta"
4,"rūpāḥ","RŪP","āḥ","rūpa","noun-adj","","āḥ","rūpāḥ"
5,"sabhrūbhaṅgāḥ","SABHRŪBHAṄG","āḥ","sabhrūbhaṅga","noun-adj","","āḥ","sabhrūbhaṅgāḥ"
6,"piṅg","PIṄG","a","piṅga","noun-adj","","a","piṅga"
7,"^ordhvake","ŪRDHV","ake","ūrdhvaka","noun-adj","","ake","ūrdhvake"
8,"śabhrū","ŚABH","rū","śabh","noun-adj","","rū","śabhrū"
9,"śmaśravo","ŚMAŚR","avo","śmaśru","noun-adj","","avo","śmaśravo"
10,"vyāvṛtta","VYĀVṚTT","a","vyāvṛtta","noun-adj","","a","vyāvṛtta"
11,"daṃṣṭr","DAṂṢṬR","","daṃṣṭra","noun-adj","","","daṃṣṭr"
12,"ā","","","alpha_privativum","ind","","","alpha_privativum"
13,"karāla","KARĀL","a","karāla","noun-adj","","a","karāla"
14,"vaktrā","VAKTR","ā","vaktra","noun-adj","","āḥ","vaktrāḥ"
15,"lalaj","LAL","aj","lalat","noun-adj","","at","lalat"
16,"jihvā","JIHV","ā","jihvā","noun-adj","","ā","jihvā"
17,"aṭṭ","AṬṬ","a","aṭṭa","noun-adj","","a","aṭṭa"
18,"^āṭṭah","ĀṬṬAH","a","āṭṭaha","noun-adj","","a","āṭṭaha"
19,"^āsinaḥ","ĀSIN","aḥ","āsina","noun-adj","","aḥ","āsinaḥ"
20,"krūr","KRŪR","a","krūra","noun-adj","","a","krūra"
21,"^āṣṭa","AṢṬ","a","aṣṭa","noun-adj","","a","aṣṭa"
22,"nāga","NĀG","a","nāga","noun-adj","","a","nāga"
23,"bhūṣanā","BHŪṢ","anā","bhūṣa","noun-adj","","anā","bhūṣanā"
24,"vāmanāḥ","VĀMAN","āḥ","vāmana","noun-adj","","āḥ","vāmanāḥ"
25,"pīnās","PĪN","ās","pīna","noun-adj","","āḥ","pīnāḥ"
26,"tundilāḥ","TUNDIL","āḥ","tundila","noun-adj","","āḥ","tundilāḥ"
27,"/","","","","punct","","","/"
NA,"</s>","","","","","","",""
NA,"<s number=""23"">","","","","","","",""
1,"daś","DAŚ","a","daśa","noun-adj","","a","daśa"
2,"^āpy","","","api","ind","","","api"
3,"ete","","","tad","pron","","","tad"
4,"sah","","a","sa_saha","ind","","a","sa_saha"
5,"^āsanair","ĀSAN","air","āsana","noun-adj","","air","āsanair"
6,"niścalāḥ","NIŚCAL","āḥ","niścala","noun-adj","","āḥ","niścalāḥ"
7,"pratyālīḍhen","PRATYĀLĪḌH","en","pratyālīḍha","noun-adj","","ena","pratyālīḍhena"
8,"ārāgreṣv","ĀRĀG","reṣv","arāga","noun-adj","","reṣv","ārāgreṣv"
9,"īṣada","ĪṢAD","a","īṣada","noun-adj","","a","īṣada"
10,"lagna","LAGN","a","lagna","noun-adj","","a","lagna"
11,"viśv","VIŚV","a","viśva","noun-adj","","a","viśva"
12,"^ābja","ABJ","a","abja","noun-adj","","a","abja"
13,"sūrya","SŪRY","a","sūrya","noun-adj","","a","sūrya"
14,"sthāḥ","STH","āḥ","stha","noun-adj","","āḥ","sthāḥ"
15,"sūryaprabhāḥ","SŪRYAPRABH","āḥ","sūryaprabha","noun-adj","","āḥ","sūryaprabhāḥ"
16,"sa","","","tad","pron","","","tad"
17,"roṣaṇā","ROṢAṆ","ā","roṣaṇa","noun-adj","","āḥ","roṣaṇāḥ"
18,"jvalanto","JVAL","anto","jvala","noun-adj","","antaḥ","jvalantaḥ"
19,"nadanto","NAD","anto","nada","noun-adj","","antaḥ","nadantaḥ"
20,"ati","","","ati","ind","","","ati"
21,"bhīmāḥ","BHĪM","āḥ","bhīma","noun-adj","","āḥ","bhīmāḥ"
22,"pralay","PRALAY","","pralaya","noun-adj","","","pralay"
23,"ā","","","alpha_privativum","ind","","","alpha_privativum"
24,"nala","NAL","a","nala","noun-adj","","a","nala"
25,"pratima","PRATIM","a","pratima","noun-adj","","a","pratima"
26,"mayūkha","MAYŪKH","a","mayūkha","noun-adj","","a","mayūkha"
27,"mukhair","MUKH","air","mukha","noun-adj","","air","mukhair"
28,"a","","","alpha_privativum","ind","","","alpha_privativum"
29,"parimit","PARIMIT","a","parimita","noun-adj","","a","parimita"
30,"^ātmaka","ĀTM","aka","ātmaka","noun-adj","","aka","ātmaka"
31,"mūrti","MŪRT","i","mūrti","noun-adj","","i","mūrti"
32,"nirmāṇaiś","NIRMĀṆ","aiś","nirmāṇa","noun-adj","","aiś","nirmāṇaiś"
33,"ca","","","ca","ind","","","ca"
34,"niravadhi","NIRAVADH","i","niravadhi","noun-adj","","i","niravadhi"
35,"dhātu","DHĀT","u","dhātu","noun-adj","","u","dhātu"
36,"trayeṣu","TRAY","eṣu","tri","noun-adj","","eṣu","trayeṣu"
37,"vighn","VIGHN","a","vighna","noun-adj","","a","vighna"
38,"^augham","AUGH","am","augha","noun-adj","","am","augham"
39,"a","","","alpha_privativum","ind","","","alpha_privativum"
40,"khilam","KHIL","am","khila","noun-adj","","am","khilam"
41,"a","","","alpha_privativum","ind","","","alpha_privativum"
42,"sakṛn","SAKṚ","n","sakṛt","noun-adj","","n","sakṛn"
43,"nirmūlayantaḥ","NIRMŪLAY","antaḥ","nirmūlayat","noun-adj","","antaḥ","nirmūlayantaḥ"
44,"/","","","","punct","","","/"
NA,"</s>","","","","","","",""
NA,"<s number=""24"">","","","","","","",""
1,"ṣaḍ","ṢAḌ","","ṣaḍi","noun-adj","","","ṣaḍ"
2,"bhujāḥ","BHUJ","āḥ","bhuja","noun-adj","","āḥ","bhujāḥ"
3,"pradhāna","PRADHĀN","a","pradhāna","noun-adj","","a","pradhāna"
4,"bhujābhyāṃ","BHUJ","ābhyāṃ","bhuja","noun-adj","","ābhyām","bhujābhyām"
5,"svābha","","","svābhū","ind","","","svābhū"
6,"prajñ","PRAJÑ","a","prajñā","noun-adj","","a","prajñā"
7,"^āliṅgitās","ĀLIṄGIT","ās","āliṅgita","noun-adj","","āḥ","āliṅgitāḥ"
8,"tri","TR","i","tri","noun-adj","","i","tri"
9,"mukhāḥ","MUKH","āḥ","mukha","noun-adj","","āḥ","mukhāḥ"
10,"/","","","","punct","","","/"
NA,"</s>","","","","","","",""
NA,"<s number=""25"">","","","","","","",""
1,"mukhaṃ","MUKH","aṃ","mukha","noun-adj","","am","mukham"
2,"tu","","","tu","ind","","","tu"
3,"mūlaṃ","MŪL","aṃ","mūla","noun-adj","","am","mūlam"
4,"śarir","ŚAR","ir","śari","noun-adj","","iḥ","śariḥ"
5,"a","","","alpha_privativum","ind","","","alpha_privativum"
6,"varṇaṃ","VARṆ","aṃ","varṇa","noun-adj","","am","varṇam"
7,"sa","","","tad","pron","","","tad"
8,"vyavāmaṃ","VYAV","āmaṃ","vyave","noun-adj","","āmaṃ","vyavāmaṃ"
9,"ca","","","ca","ind","","","ca"
10,"yath","","a","yathā","ind","","a","yathā"
11,"^okta","UKT","a","ukta","noun-adj","","a","ukta"
12,"varṇaṃ","VARṆ","aṃ","varṇa","noun-adj","","am","varṇam"
13,"pratimukhaṃ","PRATIMUKH","aṃ","pratimukha","noun-adj","","am","pratimukham"
14,"rakta","RAKT","a","rakta","noun-adj","","a","rakta"
15,"vartula","VARTUL","a","vartula","noun-adj","","a","vartula"
16,"netra","NETR","a","netra","noun-adj","","a","netra"
17,"trayam","TRAY","am","tri","noun-adj","","am","trayam"
18,"//","","","","punct","","","//"
NA,"</s>","","","","","","",""
NA,"<s number=""26"">","","","","","","",""
NA,"</page>","","","","","","",""
NA,"<page number=""228"">","","","","","","",""
3,"cakraṃ","CAKR","aṃ","cakra","noun-adj","","am","cakram"
4,"c","","a","ca","ind","","a","ca"
5,"^ātibhra","ATIBHR","a","atibhrū","noun-adj","","a","atibhra"
6,"maṇān","MAṆ","ān","maṇa","noun-adj","","ān","maṇān"
7,"niścal","NIŚCAL","a","niścala","noun-adj","","a","niścala"
8,"^opamaṃ","UPAM","aṃ","upama","noun-adj","","am","upamam"
9,"nirantaraṃ","NIRANTAR","aṃ","nirantara","noun-adj","","am","nirantaram"
10,"sphurad","SPHUR","ad","sphurat","noun-adj","","at","sphurat"
11,"an","","","alpha_privativum","ind","","","alpha_privativum"
12,"eka","EK","a","eka","noun-adj","","a","eka"
13,"jvālā","JVĀL","ā","jvālā","noun-adj","","ā","jvālā"
14,"kalāpaṃ","KALĀP","aṃ","kalāpa","noun-adj","","am","kalāpam"
15,"tasya","","","tad","pron","","","tad"
16,"n","","","na","ind","","","na"
17,"ābhyantare","ĀBHYANTAR","e","abhyantara","noun-adj","","e","ābhyantare"
18,"adhaḥ","","","adha","ind","","","adha"
19,"sūk","SŪK","a","sūka","noun-adj","","a","sūka"
20,"^opari","UPAR","i","upari","noun-adj","","i","upari"
21,"viśāla","VIŚĀL","a","viśāla","noun-adj","","a","viśāla"
22,"trikoṇa","TRIK","oṇa","trika","noun-adj","","oṇa","trikoṇa"
23,"dhavala","DHAVAL","a","dhavala","noun-adj","","a","dhavala"
24,"dharm","DHARM","a","dharma","noun-adj","","a","dharma"
25,"^oday","UDAY","a","udaya","noun-adj","","a","udaya"
26,"^āntaradhaḥ","ĀNTAR","adhaḥ","antara","noun-adj","","adhaḥ","āntaradhaḥ"
27,"koṇ","KOṆ","a","koṇa","noun-adj","","a","koṇa"
28,"^odara","UDAR","a","udara","noun-adj","","a","udara"
29,"gata","GAT","a","gata","noun-adj","","a","gata"
30,"viśva","VIŚV","a","viśva","noun-adj","","a","viśva"
31,"dala","DAL","a","dala","noun-adj","","a","dala"
32,"kamal","KAMAL","a","kamala","noun-adj","","a","kamala"
33,"^opari","UPAR","i","upari","noun-adj","","i","upari"
34,"viśva","VIŚV","a","viśva","noun-adj","","a","viśva"
35,"kuliśa","KULIŚ","a","kuliśa","noun-adj","","a","kuliśa"
36,"sahitā","SAHIT","ā","sahitā","noun-adj","","ā","sahitā"
37,"tad","TAD","","tad","pron","","","tad"
38,"vajrasya","VAJR","asya","vajra","noun-adj","","asya","vajrasya"
39,"digārā","DIG","ārā","digṛ","noun-adj","","ārā","digārā"
40,"yathāyogaṃ","YATHĀYOG","aṃ","yathāyoga","noun-adj","","am","yathāyogam"
41,"vairocan","VAIROCAN","a","vairocana","noun-adj","","a","vairocana"
42,"^ādi","ĀD","i","ādi","noun-adj","","i","ādi"
43,"sama","SAM","a","sama","noun-adj","","a","sama"
44,"varṇā","VARṆ","ā","varṇa","noun-adj","","āḥ","varṇāḥ"
45,"vedī","VED","ī","vedī","noun-adj","","ī","vedī"
46,"ca","","","ca","ind","","","ca"
47,"/","","","","punct","","","/"
NA,"</s>","","","","","","",""
NA,"<s number=""27"">","","","","","","",""
1,"tasyāṃ","","","tad","pron","","","tad"
2,"pañca","PAÑC","a","pañca","noun-adj","","a","pañca"
3,"varṇa","VARṆ","a","varṇa","noun-adj","","a","varṇa"
4,"ratna","RATN","a","ratna","noun-adj","","a","ratna"
5,"pariniṣpannaṃ","PARINIṢPANN","aṃ","pariniṣpanna","noun-adj","","am","pariniṣpannam"
6,"bhāsvan","BHĀSV","an","bhāsvat","noun-adj","","ān","bhāsvān"
7,"munīndra","MUNĪNDR","a","munīndra","noun-adj","","a","munīndra"
8,"maṇḍala","MAṆḌAL","a","maṇḍala","noun-adj","","a","maṇḍala"
9,"citrāṃś","CITR","āṃś","citra","noun-adj","","āṃś","citrāṃś"
10,"uvy","","","","ind","","",""
11,"āpta","ĀPT","a","āpta","noun-adj","","a","āpta"
12,"sarva","SARV","a","sarva","noun-adj","","a","sarva"
13,"dik","DI","k","dik","noun-adj","","k","dik"
14,"cakraṃ","CAKR","aṃ","cakra","noun-adj","","am","cakram"
15,"kūṭāgāram","KŪṬĀGĀR","am","kūṭāgāra","noun-adj","","am","kūṭāgāram"
16,"/","","","","punct","","","/"
NA,"</s>","","","","","","",""
NA,"<s number=""28"">","","","","","","",""
1,"tasya","","","tad","pron","","","tad"
2,"madhye","MADHY","e","madhya","noun-adj","","e","madhye"
3,"bhagavān","BHAGAV","ān","bhagavat","noun-adj","","ān","bhagavān"
4,"vajra","VAJR","a","vajra","noun-adj","","a","vajra"
5,"sattvo","SATTV","o","sattva","noun-adj","","aḥ","sattvaḥ"
6,"mañjuvajra","MAÑJUVAJR","a","mañjuvajra","noun-adj","","a","mañjuvajra"
7,"rūpaḥ","RŪP","aḥ","rūpa","noun-adj","","aḥ","rūpaḥ"
8,"kuṅkum","KUṄKUM","a","kuṅkuma","noun-adj","","a","kuṅkuma"
9,"^āruṇaḥ","ĀRUṆ","aḥ","aruṇa","noun-adj","","aḥ","āruṇaḥ"
10,"kṛṣṇa","KṚṢṆ","a","kṛṣṇa","noun-adj","","a","kṛṣṇa"
11,"sita","SIT","a","sita","noun-adj","","a","sita"
12,"savy","SAV","y","savya","noun-adj","","i","savi"
13,"etara","ITAR","a","itara","noun-adj","","a","itara"
14,"vadanaḥ","VADAN","aḥ","vadana","noun-adj","","aḥ","vadanaḥ"
15,"pradhāna","PRADHĀN","a","pradhāna","noun-adj","","a","pradhāna"
16,"bhujābhyāṃ","BHUJ","ābhyāṃ","bhuja","noun-adj","","ābhyām","bhujābhyām"
17,"svābha","","","svābhū","ind","","","svābhū"
18,"prajñ","PRAJÑ","a","prajñā","noun-adj","","a","prajñā"
19,"^āliṅgito","ĀLIṄGIT","o","āliṅgita","noun-adj","","aḥ","āliṅgitaḥ"
20,"asi","","","as","verb","as","",""
21,"śar","ŚAR","a","śara","noun-adj","","a","śara"
22,"^endī","END","ī","endh","noun-adj","","ī","endī"
23,"vara","VAR","a","vara","noun-adj","","a","vara"
24,"cāpa","CĀP","a","cāpa","noun-adj","","a","cāpa"
25,"dharo","DHAR","o","dhara","noun-adj","","aḥ","dharaḥ"
26,"ratnamukuṭī","RATNAMUKUṬ","ī","ratnamukuṭa","noun-adj","","ī","ratnamukuṭī"
27,"vicitra","VICITR","a","vicitra","noun-adj","","a","vicitra"
28,"ratn","RATN","a","ratna","noun-adj","","a","ratna"
29,"^ādy","ĀD","y","ādi","noun-adj","","i","ādi"
30,"ābharaṇo","ĀBHARAṆ","o","ābharaṇa","noun-adj","","aḥ","ābharaṇaḥ"
31,"anantābhaḥ","ANANT","ābhaḥ","anantā","noun-adj","","ābhaḥ","anantābhaḥ"
32,"/","","","","punct","","","/"
NA,"</s>","","","","","","",""
NA,"<s number=""29"">","","","","","","",""
1,"tasya","","","tad","pron","","","tad"
2,"pūrvasyāṃ","PŪRV","asyāṃ","pūrva","noun-adj","","asyāṃ","pūrvasyāṃ"
3,"diśi","DIŚ","i","dik","noun-adj","","i","diśi"
4,"vairocanaḥ","VAIROCAN","aḥ","vairocana","noun-adj","","aḥ","vairocanaḥ"
5,"sitaḥ","SIT","aḥ","sita","noun-adj","","aḥ","sitaḥ"
6,"kṛṣṇa","KṚṢṆ","a","kṛṣṇa","noun-adj","","a","kṛṣṇa"
7,"rakta","RAKT","a","rakta","noun-adj","","a","rakta"
8,"s","","","su","ind","","","su"
9,"avy","AVY","","avya","noun-adj","","","avy"
10,"etara","ITAR","a","itara","noun-adj","","a","itara"
11,"mukhaḥ","MUKH","aḥ","mukha","noun-adj","","aḥ","mukhaḥ"
12,"sit","SIT","a","sita","noun-adj","","a","sita"
13,"^āṣṭāra","AṢṬ","āra","aṣṭṛ","noun-adj","","āra","aṣṭāra"
14,"cakrāsi","CAKR","āsi","cakra","noun-adj","","āsi","cakrāsi"
15,"maṇi","MAṆ","i","maṇi","noun-adj","","i","maṇi"
16,"kamaladharaḥ","KAMALADHAR","aḥ","kamaladhara","noun-adj","","aḥ","kamaladharaḥ"
17,"/","","","","punct","","","/"
NA,"</s>","","","","","","",""
NA,"<s number=""30"">","","","","","","",""
1,"dakṣiṇasyāṃ","DAKṢIṆ","asyāṃ","dakṣiṇa","noun-adj","","asyāṃ","dakṣiṇasyāṃ"
2,"ratneśaḥ","RATNEŚ","aḥ","ratneśa","noun-adj","","aḥ","ratneśaḥ"
3,"pīto","PĪT","o","pīta","noun-adj","","aḥ","pītaḥ"
4,"navāṃś","NAV","āṃś","nava","noun-adj","","āṃś","navāṃś"
5,"a","","","alpha_privativum","ind","","","alpha_privativum"
6,"marakata","MARAKAT","a","marakata","noun-adj","","a","marakata"
7,"ratnāsi","RATN","āsi","ratna","noun-adj","","āsi","ratnāsi"
8,"cakra","CAKR","a","cakra","noun-adj","","a","cakra"
9,"padmad","PADM","ad","padmat","noun-adj","","at","padmat"
10,"haraḥ","HAR","aḥ","hara","noun-adj","","aḥ","haraḥ"
11,"/","","","","punct","","","/"
NA,"</s>","","","","","","",""
NA,"<s number=""31"">","","","","","","",""
1,"paści","PAŚC","i","paści","noun-adj","","i","paści"
2,"māyām","MĀY","ām","māyā","noun-adj","","ām","māyām"
3,"amitābho","AMITĀBH","o","amitābha","noun-adj","","aḥ","amitābhaḥ"
4,"rakto","RAKT","o","rakta","noun-adj","","aḥ","raktaḥ"
5,"rakta","RAKT","a","rakta","noun-adj","","a","rakta"
6,"padmāsi","PADM","āsi","padma","noun-adj","","āsi","padmāsi"
7,"maṇi","MAṆ","i","maṇi","noun-adj","","i","maṇi"
8,"cakra","CAKR","a","cakra","noun-adj","","a","cakra"
9,"dharaḥ","DHAR","aḥ","dhara","noun-adj","","aḥ","dharaḥ"
10,"/","","","","punct","","","/"
NA,"</s>","","","","","","",""
NA,"<s number=""32"">","","","","","","",""
1,"uttarasyām","UTTAR","asyām","uttara","noun-adj","","asyām","uttarasyām"
2,"amoghasiddhir","AMOGHASIDDH","ir","amoghasiddhi","noun-adj","","iḥ","amoghasiddhiḥ"
3,"haritaḥ","HARIT","aḥ","harita","noun-adj","","aḥ","haritaḥ"
4,"khaḍga","KHAḌG","a","khaḍga","noun-adj","","a","khaḍga"
5,"cakra","CAKR","a","cakra","noun-adj","","a","cakra"
6,"maṇi","MAṆ","i","maṇi","noun-adj","","i","maṇi"
7,"kamaladharaḥ","KAMALADHAR","aḥ","kamaladhara","noun-adj","","aḥ","kamaladharaḥ"
NA,"</page>","","","","","","",""
NA,"<page number=""1"">","","","","","","",""
10,"/","","","","punct","","","/"
NA,"</s>","","","","","","",""
NA,"<s number=""33"">","","","","","","",""
1,"trayo","TRAY","o","tra","noun-adj","","aḥ","trayaḥ"
2,"amī","","","adas","pron","","","adas"
3,"kṛṣṇa","KṚṢṆ","a","kṛṣṇa","noun-adj","","a","kṛṣṇa"
4,"sita","SIT","a","sita","noun-adj","","a","sita"
5,"savy","SAV","y","savya","noun-adj","","i","savi"
6,"etara","ITAR","a","itara","noun-adj","","a","itara"
7,"vaktrāḥ","VAKTR","āḥ","vaktra","noun-adj","","āḥ","vaktrāḥ"
8,"sarve","SARV","e","sarva","noun-adj","","e","sarve"
9,"tathāgatā","TATHĀGAT","ā","tathāgata","noun-adj","","āḥ","tathāgatāḥ"
10,"ratnamukuṭino","RATNAMUKUṬ","ino","ratnamukuṭin","noun-adj","","inaḥ","ratnamukuṭinaḥ"
11,"vicitra","VICITR","a","vicitra","noun-adj","","a","vicitra"
12,"ratn","RATN","a","ratna","noun-adj","","a","ratna"
13,"^ābharaṇāḥ","ĀBHARAṆ","āḥ","ābharaṇa","noun-adj","","āḥ","ābharaṇāḥ"
14,"/","","","","punct","","","/"
NA,"</s>","","","","","","",""
NA,"<s number=""34"">","","","","","","",""
1,"āgneyyāṃ","ĀGNEY","yāṃ","āgneyī","noun-adj","","yām","āgneyyām"
2,"locanā","LOCAN","ā","locana","noun-adj","","āḥ","locanāḥ"
3,"vairocana","VAIROCAN","a","vairocana","noun-adj","","a","vairocana"
4,"samā","SAM","ā","sama","noun-adj","","ā","samā"
5,"/","","","","punct","","","/"
NA,"</s>","","","","","","",""
NA,"<s number=""35"">","","","","","","",""
1,"nairṛtyāṃ","NAIRṚTY","āṃ","nairṛtya","noun-adj","","ām","nairṛtyām"
NA,"</page>","","","","","","",""
NA,"<page number=""229"">","","","","","","",""
4,"māmakī","MĀMAK","ī","māmakī","noun-adj","","ī","māmakī"
5,"akṣobhya","AKṢOBHY","a","akṣobhya","noun-adj","","a","akṣobhya"
6,"samā","SAM","ā","sama","noun-adj","","āḥ","samāḥ"
7,"rakt","RAKT","a","rakta","noun-adj","","a","rakta"
8,"^otpalāsi","UTPAL","āsi","utpala","noun-adj","","āsi","utpalāsi"
9,"maṇi","MAṆ","i","maṇi","noun-adj","","i","maṇi"
10,"padma","PADM","a","padma","noun-adj","","a","padma"
11,"dharā","DHAR","ā","dhara","noun-adj","","āḥ","dharāḥ"
12,"sarva","SARV","a","sarva","noun-adj","","a","sarva"
13,"sādhaneṣu","SĀDHAN","eṣu","sādhana","noun-adj","","eṣu","sādhaneṣu"
14,"tathā","","","tathā","ind","","","tathā"
15,"pāṭhāt","PĀṬH","āt","pāṭha","noun-adj","","āt","pāṭhāt"
16,"/","","","","punct","","","/"
NA,"</s>","","","","","","",""
NA,"<s number=""36"">","","","","","","",""
1,"vāyavyāṃ","VĀYAVY","āṃ","vāyavya","noun-adj","","ām","vāyavyām"
2,"pāṇḍarā","PĀṆḌAR","ā","pāṇḍarā","noun-adj","","ā","pāṇḍarā"
3,"amitābha","AMITĀBH","a","amitābha","noun-adj","","a","amitābha"
4,"samā","SAM","ā","sama","noun-adj","","ā","samā"
5,"/","","","","punct","","","/"
NA,"</s>","","","","","","",""
NA,"<s number=""37"">","","","","","","",""
1,"aiśānyāṃ","AIŚĀN","yāṃ","aiśānī","noun-adj","","yām","aiśānyām"
2,"tārā","TĀR","ā","tārā","noun-adj","","ā","tārā"
3,"ratneśa","RATNEŚ","a","ratneśa","noun-adj","","a","ratneśa"
4,"samā","SAM","ā","sama","noun-adj","","āḥ","samāḥ"
5,"pīt","PĪT","a","pīta","noun-adj","","a","pīta"
6,"^otpalāsi","UTPAL","āsi","utpala","noun-adj","","āsi","utpalāsi"
7,"maṇi","MAṆ","i","maṇi","noun-adj","","i","maṇi"
8,"padma","PADM","a","padma","noun-adj","","a","padma"
9,"dharā","DHAR","ā","dhara","noun-adj","","ā","dharā"
10,"/","","","","punct","","","/"
NA,"</s>","","","","","","",""
NA,"<s number=""38"">","","","","","","",""
1,"ato","","","atas","ind","","","atas"
2,"garbha","GARBH","a","garbha","noun-adj","","a","garbha"
3,"puṭād","PUṬ","ād","puṭa","noun-adj","","āt","puṭāt"
4,"bahir","BAH","ir","bahis","noun-adj","","iḥ","bahiḥ"
5,"āgneya","ĀGNEY","a","āgneya","noun-adj","","a","āgneya"
6,"koṇe","KOṆ","e","koṇa","noun-adj","","e","koṇe"
7,"rūpa","RŪP","a","rūpa","noun-adj","","a","rūpa"
8,"vajrā","VAJR","ā","vajra","noun-adj","","āḥ","vajrāḥ"
9,"vairocana","VAIROCAN","a","vairocana","noun-adj","","a","vairocana"
10,"sadṛśī","SADṚŚ","ī","sadṛśa","noun-adj","","ī","sadṛśī"
11,"ratna","RATN","a","ratna","noun-adj","","a","ratna"
12,"darpaṇāsi","DARPAṆ","āsi","darpaṇa","noun-adj","","āsi","darpaṇāsi"
13,"maṇy","MAṆ","y","maṇi","noun-adj","","i","maṇi"
14,"abja","ABJ","a","abja","noun-adj","","a","abja"
15,"dharā","DHAR","ā","dhara","noun-adj","","ā","dharā"
16,"/","","","","punct","","","/"
NA,"</s>","","","","","","",""
NA,"<s number=""39"">","","","","","","",""
1,"nairṛtye","NAIRṚTY","e","nairṛtya","noun-adj","","e","nairṛtye"
2,"śabda","ŚABD","a","śabda","noun-adj","","a","śabda"
3,"vajrā","VAJR","ā","vajra","noun-adj","","āḥ","vajrāḥ"
4,"akṣobhya","AKṢOBHY","a","akṣobhya","noun-adj","","a","akṣobhya"
5,"samā","SAM","ā","sama","noun-adj","","āḥ","samāḥ"
6,"nīla","NĪL","a","nīla","noun-adj","","a","nīla"
7,"vīṇā","VĪṆ","ā","vīṇā","noun-adj","","ā","vīṇā"
8,"kṛpāṇa","KṚPĀṆ","a","kṛpāṇa","noun-adj","","a","kṛpāṇa"
9,"maṇy","MAṆ","y","maṇi","noun-adj","","i","maṇi"
10,"abja","ABJ","a","abja","noun-adj","","a","abja"
11,"dharā","DHAR","ā","dhara","noun-adj","","ā","dharā"
12,"/","","","","punct","","","/"
NA,"</s>","","","","","","",""
NA,"<s number=""40"">","","","","","","",""
1,"vāyavye","VĀYAVY","e","vāyavya","noun-adj","","e","vāyavye"
2,"gandha","GANDH","a","gandha","noun-adj","","a","gandha"
3,"vajrā","VAJR","ā","vajra","noun-adj","","āḥ","vajrāḥ"
4,"ratneśa","RATNEŚ","a","ratneśa","noun-adj","","a","ratneśa"
5,"samā","SAM","ā","sama","noun-adj","","āḥ","samāḥ"
6,"pīta","PĪT","a","pīta","noun-adj","","a","pīta"
7,"gandha","GANDH","a","gandha","noun-adj","","a","gandha"
8,"śaṅkhāsi","ŚAṄKH","āsi","śaṅkha","noun-adj","","āsi","śaṅkhāsi"
9,"cakr","CAKR","a","cakra","noun-adj","","a","cakra"
10,"^ābja","ABJ","a","abja","noun-adj","","a","abja"
11,"dharā","DHAR","ā","dhara","noun-adj","","ā","dharā"
12,"/","","","","punct","","","/"
NA,"</s>","","","","","","",""
NA,"<s number=""41"">","","","","","","",""
1,"aiśāne","AIŚĀN","e","aiśāna","noun-adj","","e","aiśāne"
2,"rasa","RAS","a","rasa","noun-adj","","a","rasa"
3,"vajrā","VAJR","ā","vajra","noun-adj","","āḥ","vajrāḥ"
4,"amitābha","AMITĀBH","a","amitābha","noun-adj","","a","amitābha"
5,"sadṛśī","SADṚŚ","ī","sadṛśa","noun-adj","","ī","sadṛśī"
6,"raktarasa","RAKT","arasa","rakta","noun-adj","","arasa","raktarasa"
7,"pātrāsi","PĀTR","āsi","pātra","noun-adj","","āsi","pātrāsi"
8,"maṇi","MAṆ","i","maṇi","noun-adj","","i","maṇi"
9,"cakra","CAKR","a","cakra","noun-adj","","a","cakra"
10,"dharā","DHAR","ā","dhara","noun-adj","","ā","dharā"
11,"/","","","","punct","","","/"
NA,"</s>","","","","","","",""
NA,"<s number=""42"">","","","","","","",""
1,"prāg","PRĀG","","prāñc","noun-adj","","","prāg"
2,"dvār","DVĀR","a","dvāra","noun-adj","","a","dvāra"
3,"^ottara","UTTAR","a","uttara","noun-adj","","a","uttara"
4,"pārśve","PĀRŚV","e","pārśva","noun-adj","","e","pārśve"
5,"sparśa","SPARŚ","a","sparśa","noun-adj","","a","sparśa"
6,"vajrā","VAJR","ā","vajra","noun-adj","","āḥ","vajrāḥ"
7,"amoghasiddhi","AMOGHASIDDH","i","amoghasiddhi","noun-adj","","i","amoghasiddhi"
8,"samā","SAM","ā","sama","noun-adj","","āḥ","samāḥ"
9,"viśva","VIŚV","a","viśva","noun-adj","","a","viśva"
10,"varṇa","VARṆ","a","varṇa","noun-adj","","a","varṇa"
11,"vastrāsi","VASTR","āsi","vastra","noun-adj","","āsi","vastrāsi"
12,"maṇy","MAṆ","y","maṇi","noun-adj","","i","maṇi"
13,"abja","ABJ","a","abja","noun-adj","","a","abja"
14,"dharā","DHAR","ā","dhara","noun-adj","","ā","dharā"
15,"/","","","","punct","","","/"
NA,"</s>","","","","","","",""
NA,"<s number=""43"">","","","","","","",""
1,"prāg","PRĀG","","prāñc","noun-adj","","","prāg"
2,"dvāra","DVĀR","a","dvāra","noun-adj","","a","dvāra"
3,"dakṣiṇa","DAKṢIṆ","a","dakṣiṇa","noun-adj","","a","dakṣiṇa"
4,"pārśve","PĀRŚV","e","pārśva","noun-adj","","e","pārśve"
5,"dharmadhātu","DHARMADHĀT","u","dharmadhātu","noun-adj","","u","dharmadhātu"
6,"vajrā","VAJR","ā","vajra","noun-adj","","āḥ","vajrāḥ"
7,"vajra","VAJR","a","vajra","noun-adj","","a","vajra"
8,"sattva","SATTV","a","sattva","noun-adj","","a","sattva"
9,"samā","SAM","ā","sama","noun-adj","","āḥ","samāḥ"
10,"dhavala","DHAVAL","a","dhavala","noun-adj","","a","dhavala"
11,"dharm","DHARM","a","dharma","noun-adj","","a","dharma"
12,"^odayāsi","UD","ayāsi","uda","noun-adj","","ayāsi","udayāsi"
13,"maṇy","MAṆ","y","maṇi","noun-adj","","i","maṇi"
14,"abja","ABJ","a","abja","noun-adj","","a","abja"
15,"dharā","DHAR","ā","dhara","noun-adj","","ā","dharā"
16,"//","","","","punct","","","//"
NA,"</s>","","","","","","",""
NA,"<s number=""44"">","","","","","","",""
1,"etā","","","tad","pron","","","tad"
2,"mañjuvajr","MAÑJUVAJR","a","mañjuvajra","noun-adj","","a","mañjuvajra"
3,"^ādi","ĀD","i","ādi","noun-adj","","i","ādi"
4,"devatās","DEVAT","ās","devatā","noun-adj","","āḥ","devatāḥ"
5,"tri","TR","i","tri","noun-adj","","i","tri"
6,"vadanāḥ","VADAN","āḥ","vadana","noun-adj","","āḥ","vadanāḥ"
7,"ṣaḍ","ṢAḌ","","ṣaḍi","noun-adj","","","ṣaḍ"
8,"bhujāḥ","BHUJ","āḥ","bhuja","noun-adj","","āḥ","bhujāḥ"
9,"/","","","","punct","","","/"
NA,"</s>","","","","","","",""
NA,"<s number=""45"">","","","","","","",""
1,"ādyacih","ĀDY","acih","ādya","noun-adj","","acih","ādyacih"
2,"nad","NAD","","nadī","noun-adj","","","nad"
3,"vayaṃ","VAYAṂ","","asmat","pron","","","vayaṃ"
4,"sa","","","tad","pron","","","tad"
5,"vyābhyām","VYĀBH","yām","vyābhi","noun-adj","","yām","vyābhyām"
6,"apara","APAR","a","apara","noun-adj","","a","apara"
7,"dvayaṃ","DVAY","aṃ","dvaya","noun-adj","","am","dvayam"
8,"vāmābhyāṃ","VĀM","ābhyāṃ","vāma","noun-adj","","ābhyām","vāmābhyām"
9,"dadhānāḥ","DADHĀN","āḥ","dadhāna","noun-adj","","āḥ","dadhānāḥ"
10,"/","","","","punct","","","/"
NA,"</s>","","","","","","",""
NA,"<s number=""46"">","","","","","","",""
1,"sarvatra","SARV","atra","sarvatra","noun-adj","","atra","sarvatra"
2,"mūla","MŪL","a","mūla","noun-adj","","a","mūla"
3,"mukhaṃ","MUKH","aṃ","mukha","noun-adj","","am","mukham"
4,"śarir","ŚAR","ir","śari","noun-adj","","iḥ","śariḥ"
5,"a","","","alpha_privativum","ind","","","alpha_privativum"
6,"varṇam","VARṆ","am","varṇa","noun-adj","","am","varṇam"
7,"eva","","","eva","ind","","","eva"
8,"/","","","","punct","","","/"
NA,"</s>","","","","","","",""
NA,"<s number=""47"">","","","","","","",""
1,"pūrv","PŪRV","a","pūrva","noun-adj","","a","pūrva"
2,"^ādi","ĀD","i","ādi","noun-adj","","i","ādi"
3,"dvāreṣu","DVĀR","eṣu","dvāra","noun-adj","","eṣu","dvāreṣu"
4,"yamāntaka","YAMĀNT","aka","yamāntaka","noun-adj","","aka","yamāntaka"
5,"prajñāntaka","PRAJÑĀNTAK","a","prajñāntaka","noun-adj","","a","prajñāntaka"
6,"padmāntak","PADMĀNTAK","a","padmāntaka","noun-adj","","a","padmāntaka"
7,"^āmṛtakuṇḍalayaḥ","AMṚTAKUṆḌAL","ayaḥ","amṛtakuṇḍalī","noun-adj","","ayaḥ","amṛtakuṇḍalayaḥ"
8,"//","","","","punct","","","//"
NA,"</s>","","","","","","",""
NA,"<s number=""48"">","","","","","","",""
NA,"</page>","","","","","","",""
NA,"<page number=""230"">","","","","","","",""
3,"atra","","","atra","ind","","","atra"
4,"mañjuvajra","MAÑJUVAJR","a","mañjuvajra","noun-adj","","a","mañjuvajra"
5,"vairocana","VAIROCAN","a","vairocana","noun-adj","","a","vairocana"
6,"daśa","DAŚ","a","daśa","noun-adj","","a","daśa"
7,"devyaś","DEVY","aś","devya","noun-adj","","aḥ","devyaḥ"
8,"candreṣu","CANDR","eṣu","candra","noun-adj","","eṣu","candreṣu"
9,"vajra","VAJR","a","vajra","noun-adj","","a","vajra"
10,"paryaṅkiṇo","PARYAṄK","iṇo","paryaṅkin","noun-adj","","inaḥ","paryaṅkinaḥ"
11,"anye","ANY","e","anya","pron","","e","anye"
12,"sūryeṣu","SŪRY","eṣu","sūrya","noun-adj","","eṣu","sūryeṣu"
13,"candra","CANDR","a","candra","noun-adj","","a","candra"
14,"sūrya","SŪRY","a","sūrya","noun-adj","","a","sūrya"
15,"taleṣu","TAL","eṣu","tala","noun-adj","","eṣu","taleṣu"
16,"viśvapadmāni","VIŚVAPADM","āni","viśvapadmā","noun-adj","","āni","viśvapadmāni"
17,"/","","","","punct","","","/"
NA,"</s>","","","","","","",""
NA,"<s number=""49"">","","","","","","",""
1,"tathāgatāḥ","TATHĀGAT","āḥ","tathāgata","noun-adj","","āḥ","tathāgatāḥ"
2,"pradhāna","PRADHĀN","a","pradhāna","noun-adj","","a","pradhāna"
3,"bhujābhyāṃ","BHUJ","ābhyāṃ","bhuja","noun-adj","","ābhyām","bhujābhyām"
4,"svābha","","","svābhū","ind","","","svābhū"
5,"prajñ","PRAJÑ","a","prajñā","noun-adj","","a","prajñā"
6,"^āliṅgitā","ĀLIṄGIT","ā","āliṅgita","noun-adj","","āḥ","āliṅgitāḥ"
7,"devyas","DEVY","as","devya","noun-adj","","aḥ","devyaḥ"
8,"tu","","","tu","ind","","","tu"
9,"svābham","","","","ind","","",""
10,"upāyam","UPĀY","am","upāya","noun-adj","","am","upāyam"
11,"//","","","","punct","","","//"
NA,"</s>","","","","","","",""
NA,"<s number=""50"">","","","","","","",""
1,"kul","KUL","a","kula","noun-adj","","a","kula"
2,"^ādhipatis","ADHIPAT","is","adhipat","noun-adj","","is","adhipatis"
3,"tu","","","tu","ind","","","tu"
4,"śirasi","ŚIRAS","i","śiras","noun-adj","","i","śirasi"
5,"mañjuvajr","MAÑJUVAJR","a","mañjuvajra","noun-adj","","a","mañjuvajra"
6,"^ādi","ĀD","i","ādi","noun-adj","","i","ādi"
7,"tathāgata","TATHĀGAT","a","tathāgata","noun-adj","","a","tathāgata"
8,"māmakī","MĀMAK","ī","māmakī","noun-adj","","ī","māmakī"
9,"śabda","ŚABD","a","śabda","noun-adj","","a","śabda"
10,"vajr","VAJR","a","vajra","noun-adj","","a","vajra"
11,"^ārakṣā","ĀRAKṢ","ā","ārakṣā","noun-adj","","ā","ārakṣā"
12,"cakra","CAKR","a","cakra","noun-adj","","a","cakra"
13,"gat","GAT","a","gata","noun-adj","","a","gata"
14,"^āṣṭa","AṢṬ","a","aṣṭa","noun-adj","","a","aṣṭa"
15,"krodhānām","KRODH","ānām","krodha","noun-adj","","ānām","krodhānām"
16,"akṣobhyaḥ","AKṢOBHY","aḥ","akṣobhya","noun-adj","","aḥ","akṣobhyaḥ"
17,"/","","","","punct","","","/"
NA,"</s>","","","","","","",""
NA,"<s number=""51"">","","","","","","",""
1,"locan","LOCAN","","locana","noun-adj","","","locan"
2,"ā","","","alpha_privativum","ind","","","alpha_privativum"
3,"rūpa","RŪP","a","rūpa","noun-adj","","a","rūpa"
4,"vajrā","VAJR","ā","vajra","noun-adj","","āḥ","vajrāḥ"
5,"yamāntakānāṃ","YAMĀNT","akānāṃ","yamāntaka","noun-adj","","akānāṃ","yamāntakānāṃ"
6,"vairocanaḥ","VAIROCAN","aḥ","vairocana","noun-adj","","aḥ","vairocanaḥ"
7,"/","","","","punct","","","/"
NA,"</s>","","","","","","",""
NA,"<s number=""52"">","","","","","","",""
1,"gandha","GANDH","a","gandha","noun-adj","","a","gandha"
2,"vajrāyā","VAJRĀY","ā","vajrāya","noun-adj","","āḥ","vajrāyāḥ"
3,"ratneśaḥ","RATNEŚ","aḥ","ratneśa","noun-adj","","aḥ","ratneśaḥ"
4,"/","","","","punct","","","/"
NA,"</s>","","","","","","",""
NA,"<s number=""53"">","","","","","","",""
1,"pāṇḍar","PĀṆḌAR","a","pāṇḍara","noun-adj","","a","pāṇḍara"
2,"^ārasa","ĀRAS","a","ārasa","noun-adj","","a","ārasa"
3,"vajrā","VAJR","ā","vajra","noun-adj","","āḥ","vajrāḥ"
4,"padmāntakānām","PADMĀNTAK","ānām","padmāntaka","noun-adj","","ānām","padmāntakānām"
5,"amitābhaḥ","AMITĀBH","aḥ","amitābha","noun-adj","","aḥ","amitābhaḥ"
6,"/","","","","punct","","","/"
NA,"</s>","","","","","","",""
NA,"<s number=""54"">","","","","","","",""
1,"tār","TĀR","a","tāra","noun-adj","","a","tāra"
2,"^āsparśa","ĀSPARŚ","a","asparśa","noun-adj","","a","āsparśa"
3,"vajrayor","VAJR","ayor","vajra","noun-adj","","ayoḥ","vajrayoḥ"
4,"amoghasiddhiḥ","AMOGHASIDDH","iḥ","amoghasiddhi","noun-adj","","iḥ","amoghasiddhiḥ"
5,"/","","","","punct","","","/"
NA,"</s>","","","","","","",""
NA,"<s number=""55"">","","","","","","",""
1,"dharmadhātu","DHARMADHĀT","u","dharmadhātu","noun-adj","","u","dharmadhātu"
2,"vajrāyā","VAJRĀY","ā","vajrāya","noun-adj","","āḥ","vajrāyāḥ"
3,"vajradharaḥ","VAJRADHAR","aḥ","vajradhara","noun-adj","","aḥ","vajradharaḥ"
4,"/","","","","punct","","","/"
NA,"</s>","","","","","","",""
NA,"<s number=""56"">","","","","","","",""
1,"akṣobhya","AKṢOBHY","a","akṣobhya","noun-adj","","a","akṣobhya"
2,"ity","","","iti","ind","","","iti"
3,"anye","ANY","e","anya","pron","","e","anye"
4,"//","","","","punct","","","//"
NA,"</s>","","","","","","",""
NA,"<s number=""57"">","","","","","","",""
1,"vajra","VAJR","a","vajra","noun-adj","","a","vajra"
2,"sattvo","SATTV","o","sattva","noun-adj","","aḥ","sattvaḥ"
3,"atreṣad","","","","ind","","",""
4,"rakt","RAKT","a","rakta","noun-adj","","a","rakta"
5,"^ānuviddha","ANUVIDDH","a","anuviddha","noun-adj","","a","anuviddha"
6,"sita","SIT","a","sita","noun-adj","","a","sita"
7,"varṇo","VARṆ","o","varṇa","noun-adj","","aḥ","varṇaḥ"
8,"nīla","NĪL","a","nīla","noun-adj","","a","nīla"
9,"rakta","RAKT","a","rakta","noun-adj","","a","rakta"
10,"savy","SAV","y","savya","noun-adj","","i","savi"
11,"etara","ITAR","a","itara","noun-adj","","a","itara"
12,"vaktraḥ","VAKTR","aḥ","vaktra","noun-adj","","aḥ","vaktraḥ"
13,"pradhāna","PRADHĀN","a","pradhāna","noun-adj","","a","pradhāna"
14,"bhujābhyāṃ","BHUJ","ābhyāṃ","bhuja","noun-adj","","ābhyām","bhujābhyām"
15,"svābha","","","svābhū","ind","","","svābhū"
16,"prajñ","PRAJÑ","a","prajñā","noun-adj","","a","prajñā"
17,"^āliṅgito","ĀLIṄGIT","o","āliṅgita","noun-adj","","aḥ","āliṅgitaḥ"
18,"nīla","NĪL","a","nīla","noun-adj","","a","nīla"
19,"vajrāsi","VAJR","āsi","vajra","noun-adj","","āsi","vajrāsi"
20,"maṇi","MAṆ","i","maṇi","noun-adj","","i","maṇi"
21,"kamala","KAMAL","a","kamala","noun-adj","","a","kamala"
22,"dhārī","DHĀR","ī","dhārin","noun-adj","","ī","dhārī"
23,"viśvapadma","VIŚVAPADM","a","viśvapadmā","noun-adj","","a","viśvapadmā"
24,"candr","CANDR","a","candra","noun-adj","","a","candra"
25,"^āsanaś","ĀSAN","aś","āsana","noun-adj","","aḥ","āsanaḥ"
26,"candraprabho","CANDRAPRABH","o","candraprabha","noun-adj","","aḥ","candraprabhaḥ"
27,"vajra","VAJR","a","vajra","noun-adj","","a","vajra"
28,"paryaṅkī","PARYAṄK","ī","paryaṅkin","noun-adj","","ī","paryaṅkī"
29,"ratnamukuṭī","RATNAMUKUṬ","ī","ratnamukuṭa","noun-adj","","ī","ratnamukuṭī"
30,"ratn","RATN","a","ratna","noun-adj","","a","ratna"
31,"^ābharaṇo","ĀBHARAṆ","o","ābharaṇa","noun-adj","","aḥ","ābharaṇaḥ"
32,"akṣobhya","AKṢOBHY","a","akṣobhya","noun-adj","","a","akṣobhya"
33,"mudritaḥ","MUDRIT","aḥ","mudrita","noun-adj","","aḥ","mudritaḥ"
34,"//","","","","punct","","","//"
NA,"</s>","","","","","","",""
NA,"<s number=""58"">","","","","","","",""
1,"iha","","","iha","ind","","","iha"
2,"mañjuvajrasya","MAÑJUVAJR","asya","mañjuvajra","noun-adj","","asya","mañjuvajrasya"
3,"stan","STAN","","stana","noun-adj","","","stan"
4,"āntare","ĀNTAR","e","antara","noun-adj","","e","āntare"
5,"samaya","SAMAY","a","samaya","noun-adj","","a","samaya"
6,"sattva","SATTV","a","sattva","noun-adj","","a","sattva"
7,"sadṛśaṃ","SADṚŚ","aṃ","sadṛśa","noun-adj","","am","sadṛśam"
8,"jñāna","JÑĀN","a","jñāna","noun-adj","","a","jñāna"
9,"sattvaṃ","SATTV","aṃ","sattva","noun-adj","","am","sattvam"
10,"tad","TAD","","tad","pron","","","tad"
11,"dhṛc","DHṚ","c","dhṛa","noun-adj","","c","dhṛc"
12,"candre","CANDR","e","candra","noun-adj","","e","candre"
13,"khaḍga","KHAḌG","a","khaḍga","noun-adj","","a","khaḍga"
14,"muṣṭi","MUṢṬ","i","muṣṭi","noun-adj","","i","muṣṭi"
15,"candra","CANDR","a","candra","noun-adj","","a","candra"
16,"sthaṃm","STH","aṃm","stha","noun-adj","","aṃm","sthaṃm"
17,"aṃbī","AṂB","ī","aṃbī","noun-adj","","ī","aṃbī"
18,"jam","J","am","ja","noun-adj","","am","jam"
19,"/","","","","punct","","","/"
NA,"</s>","","","","","","",""
NA,"<s number=""59"">","","","","","","",""
1,"śāśvata","ŚĀŚVAT","a","śāśvata","noun-adj","","a","śāśvata"
2,"ratneś","RATN","eś","ratni","noun-adj","","eś","ratneś"
3,"āmitābh","AMITĀBH","a","amitābha","noun-adj","","a","amitābha"
4,"^āmoghasiddhya","AMOGHASIDDH","ya","","noun-adj","","ya","amoghasiddhya"
5,"kṣobhyānāṃ","KṢOBHY","ānāṃ","kṣobhya","noun-adj","","ānām","kṣobhyānām"
6,"hṛdi","HṚD","i","hṛdi","noun-adj","","i","hṛdi"
7,"cihne","CIHN","e","cihna","noun-adj","","e","cihne"
8,"yathāyogaṃ","YATHĀYOG","aṃ","yathāyoga","noun-adj","","am","yathāyogam"
9,"candre","CANDR","e","candra","noun-adj","","e","candre"
10,"sūrye","SŪRY","e","sūrya","noun-adj","","e","sūrye"
11,"vā","","","vā","ind","","","vā"
12,"vuṃāṃ","VUṂ","āṃ","vumā","noun-adj","","ām","vuṃām"
13,"jrīṃ","","","","ind","","",""
14,"khaṃ","","","kha","ind","","","kha"
15,"hūṃ","","","","ind","","",""
16,"/","","","","punct","","","/"
NA,"</s>","","","","","","",""
NA,"<s number=""60"">","","","","","","",""
1,"locan","LOCAN","a","locana","noun-adj","","a","locana"
2,"^ādi","ĀD","i","ādi","noun-adj","","i","ādi"
3,"devīnāṃ","DEV","īnāṃ","devi","noun-adj","","īnām","devīnām"
4,"ioṃ","","","","ind","","",""
5,"māṃ","","","mat","pron","","","mat"
6,"pāṃ","","","pāma","ind","","","pāma"
7,"tāṃ","","","tad","pron","","","tad"
8,"jaḥ","","","ja","ind","","","ja"
9,"hūṃ","","","","ind","","",""
10,"vaṃ","","","vama","ind","","","vama"
11,"hoḥ","","","","ind","","",""
12,"khaṃ","","","kha","ind","","","kha"
13,"raṃ","","","","ind","","",""
14,"/","","","","punct","","","/"
NA,"</s>","","","","","","",""
NA,"<s number=""61"">","","","","","","",""
1,"krodhānāṃ","KRODH","ānāṃ","krodha","noun-adj","","ānām","krodhānām"
2,"hūṃ","","","","ind","","",""
3,"/","","","","punct","","","/"
NA,"</s>","","","","","","",""
NA,"<s number=""62"">","","","","","","",""
1,"sarva","SARV","a","sarva","noun-adj","","a","sarva"
2,"devatānāṃ","DEVAT","ānāṃ","devatā","noun-adj","","ānām","devatānām"
3,"hṛdaya","HṚDAY","a","hṛdaya","noun-adj","","a","hṛdaya"
4,"mantrā","MANTR","ā","mantrā","noun-adj","","ā","mantrā"
5,"vajr","VAJR","a","vajra","noun-adj","","a","vajra"
6,"^āvalyāṃ","ĀVAL","yāṃ","āvali","noun-adj","","yām","āvalyām"
7,"uktāḥ","UKT","āḥ","ukta","noun-adj","","āḥ","uktāḥ"
8,"//","","","","punct","","","//"
NA,"</s>","","","","","","",""
NA,"<s number=""63"">","","","","","","",""
NA,"</page>","","","","","","",""
NA,"<page number=""231"">","","","","","","",""
3,"iha","","","iha","ind","","","iha"
4,"niṣpanna","NIṢPANN","a","niṣpanna","noun-adj","","a","niṣpanna"
5,"yoginaś","YOG","inaś","yogin","noun-adj","","inaḥ","yoginaḥ"
6,"cakṣur","CAKṢ","ur","cakṣus","noun-adj","","ur","cakṣur"
7,"ādy","ĀD","y","ādi","noun-adj","","i","ādi"
8,"adhiṣṭhānaṃ","ADHIṢṬHĀN","aṃ","adhiṣṭhāna","noun-adj","","am","adhiṣṭhānam"
9,"jñāna","JÑĀN","a","jñāna","noun-adj","","a","jñāna"
10,"sattva","SATTV","a","sattva","noun-adj","","a","sattva"
11,"praveś","PRAVEŚ","a","praveśa","noun-adj","","a","praveśa"
12,"^ādikaṃ","ĀDIK","aṃ","ādika","noun-adj","","am","ādikam"
13,"ca","","","ca","ind","","","ca"
14,"n","","","na","ind","","","na"
15,"oktam","UKT","am","ukta","noun-adj","","am","uktam"
16,"//","","","","punct","","","//"
NA,"</s>","","","","","","",""
NA,"<s number=""64"">","","","","","","",""
1,"tad","TAD","","tad","pron","","","tad"
2,"antareṇ","ANTAR","eṇa","antara","noun-adj","","ena","antarena"
3,"^āpy","","","api","ind","","","api"
4,"a","","","alpha_privativum","ind","","","alpha_privativum"
5,"parimit","PARIMIT","","parimita","noun-adj","","","parimit"
6,"ā","","","alpha_privativum","ind","","","alpha_privativum"
7,"cintya","CINTY","a","cintya","noun-adj","","a","cintya"
8,"cakṣur","CAKṢ","ur","cakṣus","noun-adj","","ur","cakṣur"
9,"abhijñ","ABHIJÑ","a","abhijña","noun-adj","","a","abhijña"
10,"^ādi","ĀD","i","ādi","noun-adj","","i","ādi"
11,"guṇa","GUṆ","a","guṇa","noun-adj","","a","guṇa"
12,"grāma","GRĀM","a","grāma","noun-adj","","a","grāma"
13,"ramaṇīya","RAMAṆĪY","a","ramaṇīya","noun-adj","","a","ramaṇīya"
14,"mūrter","MŪRT","er","mūrti","noun-adj","","eḥ","mūrteḥ"
15,"abhīṣṭa","ABHĪṢṬ","a","abhīṣṭa","noun-adj","","a","abhīṣṭa"
16,"devatāyāḥ","DEVAT","āyāḥ","devatā","noun-adj","","āyāḥ","devatāyāḥ"
17,"sakṛd","SAKṚ","d","sakṛt","noun-adj","","d","sakṛd"
18,"eva","","","eva","ind","","","eva"
19,"su","","","su","ind","","","su"
20,"pariśuddha","PARIŚUDDH","a","pariśuddha","noun-adj","","a","pariśuddha"
21,"sarv","SARV","a","sarva","noun-adj","","a","sarva"
22,"^ākāra","ĀKĀR","a","ākāra","noun-adj","","a","ākāra"
23,"pariniṣpatter","PARINIṢPATT","er","pariniṣpatti","noun-adj","","eḥ","pariniṣpatteḥ"
24,"muhur","MUH","ur","muhu","noun-adj","","ur","muhur"
25,"muhur","MUH","ur","muhu","noun-adj","","ur","muhur"
26,"adhimokṣa","ADHIMOKṢ","a","adhimokṣa","noun-adj","","a","adhimokṣa"
27,"dārḍhyāt","DĀRḌHY","āt","dārḍhya","noun-adj","","āt","dārḍhyāt"
28,"/","","","","punct","","","/"
NA,"</s>","","","","","","",""
NA,"<s number=""65"">","","","","","","",""
1,"hṛn","","","","ind","","",""
2,"mantr","MANTR","a","mantra","noun-adj","","a","mantra"
3,"^ādi","ĀD","i","ādi","noun-adj","","i","ādi"
4,"kathanaṃ","KATHAN","aṃ","kathana","noun-adj","","am","kathanam"
5,"tu","","","tu","ind","","","tu"
6,"kalaś","KALAŚ","a","kalaśa","noun-adj","","a","kalaśa"
7,"^ādhivāsanā","ADHIVĀSAN","ā","adhivāsanā","noun-adj","","ā","adhivāsanā"
8,"diṣu","D","iṣu","di","noun-adj","","iṣu","diṣu"
9,"prayog","PRAYOG","a","prayoga","noun-adj","","a","prayoga"
10,"^ārtham","ARTH","am","artha","noun-adj","","am","artham"
11,"//","","","","punct","","","//"
NA,"</s>","","","","","","",""
NA,"<s number=""66"">","","","","","","",""
1,"yadā","","","yadā","ind","","","yadā"
2,"tu","","","tu","ind","","","tu"
3,"madhye","MADHY","e","madhya","noun-adj","","e","madhye"
4,"anyas","ANY","as","anya","pron","","aḥ","anyaḥ"
5,"tathāgato","TATHĀGAT","o","tathāgata","noun-adj","","aḥ","tathāgataḥ"
6,"bhavati","BHAV","ati","bhav","verb","bhū","ati","bhavati"
7,"nāyakas","NĀYAK","as","nāyaka","noun-adj","","aḥ","nāyakaḥ"
8,"tadā","","","tadā","ind","","","tadā"
9,"madhya","MADHY","a","madhya","noun-adj","","a","madhya"
10,"sthitas","STHIT","as","sthita","noun-adj","","aḥ","sthitaḥ"
11,"tasya","","","tad","pron","","","tad"
12,"sthāne","STHĀN","e","sthāna","noun-adj","","e","sthāne"
13,"tiṣṭhet","TIṢṬH","et","tiṣṭh","verb","sthā","et","tiṣṭhet"
14,"/","","","","punct","","","/"
NA,"</s>","","","","","","",""
NA,"<s number=""67"">","","","","","","",""
1,"amitābhaḥ","AMITĀBH","aḥ","amitābha","noun-adj","","aḥ","amitābhaḥ"
2,"śubhro","ŚUBHR","o","śubhra","noun-adj","","aḥ","śubhraḥ"
3,"api","","","api","ind","","","api"
4,"bhavati","BHAV","ati","bhav","verb","bhū","ati","bhavati"
5,"śuklā","ŚUKL","ā","śuklā","noun-adj","","ā","śuklā"
6,"dharmāḥ","DHARM","āḥ","dharma","noun-adj","","āḥ","dharmāḥ"
7,"prakṛty","PRAKṚT","ya","prakṛti","noun-adj","","ya","prakṛtya"
8,"^eti","","","iti","ind","","","iti"
9,"vāgīśasy","VĀGĪŚ","asya","vāgīśa","noun-adj","","asya","vāgīśasya"
10,"^ātra","","","atra","ind","","","atra"
11,"śuklat","ŚUKL","ata","śuklat","noun-adj","","ati","śuklati"
12,"^ety","","","iti","ind","","","iti"
13,"ukteḥ","UKT","eḥ","ukti","noun-adj","","eḥ","ukteḥ"
14,"//","","","","punct","","","//"
NA,"</s>","","","","","","",""
NA,"<s number=""68"">","","","","","","",""
1,"iha","","","iha","ind","","","iha"
2,"vakṣyamā","VAKṢ","yamā","vakṣas","noun-adj","","yamā","vakṣyamā"
3,"neṣu","NEṢ","u","neṣa","noun-adj","","u","neṣu"
4,"ca","","","ca","ind","","","ca"
5,"mandaleṣu","MAND","aleṣu","manda","noun-adj","","aleṣu","mandaleṣu"
6,"yasyā","","","yad","pron","","","yad"
7,"māṇḍaleya","MĀṆḌALEY","a","māṇḍaleya","noun-adj","","a","māṇḍaleya"
8,"devatāyā","DEVAT","āyā","devatā","noun-adj","","āyāḥ","devatāyāḥ"
9,"mukhyato","MUKHY","ato","mukhya","noun-adj","","ataḥ","mukhyataḥ"
10,"yat","","","yad","pron","","","yad"
11,"sthānam","STHĀN","am","sthāna","noun-adj","","am","sthānam"
12,"ucyate","UC","yate","vak","verb","vac","yate","ucyate"
13,"tasmin","TASMIN","","tad","pron","","","tasmin"
14,"s","","a","sa_saha","ind","","a","sa_saha"
15,"^aiva","","","eva","ind","","","eva"
16,"pradhānatayā","PRADHĀN","atayā","pradhānatā","noun-adj","","atayā","pradhānatayā"
17,"maṇḍaleś","MAṆḌAL","eś","maṇḍali","noun-adj","","eś","maṇḍaleś"
18,"abhimukhī","ABHIMUKH","ī","abhimukhī","noun-adj","","ī","abhimukhī"
19,"/","","","","punct","","","/"
NA,"</s>","","","","","","",""
NA,"<s number=""69"">","","","","","","",""
1,"tad","TAD","","tad","pron","","","tad"
2,"āliṅgitā","ĀLIṄGIT","ā","āliṅgita","noun-adj","","āḥ","āliṅgitāḥ"
3,"tu","","","tu","ind","","","tu"
4,"tad","TAD","","tad","pron","","","tad"
5,"abhimukhy","ABHIMUKH","y","abhimukhi","noun-adj","","i","abhimukhi"
6,"eva","","","eva","ind","","","eva"
7,"para","PAR","a","para","noun-adj","","a","para"
8,"sthāna","STHĀN","a","sthāna","noun-adj","","a","sthāna"
9,"gamanāt","GAMAN","āt","gamana","noun-adj","","āt","gamanāt"
10,"//","","","","punct","","","//"
NA,"</s>","","","","","","",""
NA,"<s number=""70"">","","","","","","",""
1,"atra","","","atra","ind","","","atra"
2,"kūṭāgārasya","KŪṬĀGĀR","asya","kūṭāgāra","noun-adj","","asya","kūṭāgārasya"
3,"vajra","VAJR","a","vajra","noun-adj","","a","vajra"
4,"bhūmy","BHŪM","y","bhūmi","noun-adj","","i","bhūmi"
5,"ādi","ĀD","i","ādi","noun-adj","","i","ādi"
6,"parito","PAR","ito","paritas","noun-adj","","ito","parito"
7,"vajra","VAJR","a","vajra","noun-adj","","a","vajra"
8,"pañjaraṃ","PAÑJAR","aṃ","pañjara","noun-adj","","am","pañjaram"
9,"rakṣā","RAKṢ","ā","rakṣā","noun-adj","","ā","rakṣā"
10,"cakraṃ","CAKR","aṃ","cakra","noun-adj","","am","cakram"
11,"dharm","DHARM","a","dharma","noun-adj","","a","dharma"
12,"^odayā","UDAY","ā","udaya","noun-adj","","ā","udayā"
13,"c","","a","ca","ind","","a","ca"
14,"^eti","","","iti","ind","","","iti"
15,"trayaḥ","TRAY","aḥ","tri","noun-adj","","aḥ","trayaḥ"
16,"parikarāḥ","PARIKAR","āḥ","parikara","noun-adj","","āḥ","parikarāḥ"
17,"/","","","","punct","","","/"
NA,"</s>","","","","","","",""
NA,"<s number=""71"">","","","","","","",""
1,"tatra","","","tatra","ind","","","tatra"
2,"vajra","VAJR","a","vajra","noun-adj","","a","vajra"
3,"pañjaraṃ","PAÑJAR","aṃ","pañjara","noun-adj","","am","pañjaram"
4,"vakṣyamā","VAKṢ","yamā","vakṣas","noun-adj","","yamā","vakṣyamā"
5,"nānām","NĀN","ām","nānā","noun-adj","","ām","nānām"
6,"api","","","api","ind","","","api"
7,"sarveṣāṃ","SARV","eṣāṃ","sarva","noun-adj","","eṣāṃ","sarveṣāṃ"
8,"kūṭāgārāṇāṃ","KŪṬĀGĀR","āṇāṃ","kūṭāgāra","noun-adj","","ānām","kūṭāgārānām"
9,"rakṣā","RAKṢ","ā","rakṣā","noun-adj","","ā","rakṣā"
10,"cakraṃ","CAKR","aṃ","cakra","noun-adj","","am","cakram"
NA,"</page>","","","","","","",""
NA,"<page number=""232"">","","","","","","",""
13,"dharm","DHARM","a","dharma","noun-adj","","a","dharma"
14,"^odayā","UDAY","ā","udaya","noun-adj","","āḥ","udayāḥ"
15,"ca","","","ca","ind","","","ca"
16,"keṣāṃcid","","","kimcit","ind","","","kimcit"
17,"ev","","a","eva","ind","","a","eva"
18,"^eti","","","iti","ind","","","iti"
19,"vakṣyāmaḥ","VAKṢ","yāmaḥ","vak","verb","vac","yāmaḥ","vakṣyāmaḥ"
20,"/","","","","punct","","","/"
NA,"</s>","","","","","","",""
NA,"<s number=""72"">","","","","","","",""
1,"lekhya","LEKHY","a","lekhya","noun-adj","","a","lekhya"
2,"kūṭāgārāṇāṃ","KŪṬĀGĀR","āṇāṃ","kūṭāgāra","noun-adj","","ānām","kūṭāgārānām"
3,"tu","","","tu","ind","","","tu"
4,"dharmadhātu","DHARMADHĀT","u","dharmadhātu","noun-adj","","u","dharmadhātu"
5,"svaru","SVAR","u","svaru","noun-adj","","u","svaru"
6,"ūpadharm","UPADHARM","a","upadharma","noun-adj","","a","upadharma"
7,"^odayāyā","UDAY","āyā","udayā","noun-adj","","āyāḥ","udayāyāḥ"
8,"dharmadhātv","DHARMADHĀT","v","dharmadhātu","noun-adj","","v","dharmadhātv"
9,"antargatasya","ANTARGAT","asya","antargata","noun-adj","","asya","antargatasya"
10,"vā","","","vā","ind","","","vā"
11,"sūcakaṃ","SŪCAK","aṃ","sūcaka","noun-adj","","am","sūcakam"
12,"likhanam","LIKHAN","am","likhana","noun-adj","","am","likhanam"
13,"uktaṃ","UKT","aṃ","ukta","noun-adj","","am","uktam"
14,"vajr","VAJR","a","vajra","noun-adj","","a","vajra"
15,"^āvalyām","ĀVAL","yām","āvali","noun-adj","","yām","āvalyām"
16,"//","","","","punct","","","//"
NA,"</s>","","","","","","",""
NA,"<s number=""73"">","","","","","","",""
1,"yathā","","","yathā","ind","","","yathā"
2,"bāhyaṃ","BĀHY","aṃ","bāhya","noun-adj","","am","bāhyam"
3,"tath","","a","tathā","ind","","a","tathā"
4,"^ādhyātmam","ADHYĀTM","am","adhyātma","noun-adj","","am","adhyātmam"
5,"ity","","","iti","ind","","","iti"
6,"utpanna","UTPANN","a","utpanna","noun-adj","","a","utpanna"
7,"krama","KRAM","a","krama","noun-adj","","a","krama"
8,"maṇḍala","MAṆḌAL","a","maṇḍala","noun-adj","","a","maṇḍala"
9,"pratipādan","PRATIPĀDAN","a","pratipādana","noun-adj","","a","pratipādana"
10,"^ākṛtena","ĀKṚT","ena","akṛta","noun-adj","","ena","ākṛtena"
11,"lokadhātoś","LOKADHĀT","oś","lokadhātu","noun-adj","","oś","lokadhātoś"
12,"cakravāḍa","CAKRAVĀḌ","a","cakravāḍa","noun-adj","","a","cakravāḍa"
13,"sūcakaṃ","SŪCAK","aṃ","sūcaka","noun-adj","","am","sūcakam"
14,"vajr","VAJR","a","vajra","noun-adj","","a","vajra"
15,"^āvalī","ĀVAL","ī","avalī","noun-adj","","ī","āvalī"
16,"likhanaṃ","LIKHAN","aṃ","likhana","noun-adj","","am","likhanam"
17,"ca","","","ca","ind","","","ca"
18,"niyamen","NIYAM","ena","niyama","noun-adj","","ena","niyamena"
19,"^aiva","","","eva","ind","","","eva"
20,"/","","","","punct","","","/"
NA,"</s>","","","","","","",""
NA,"<s number=""74"">","","","","","","",""
1,"n","","a","na","ind","","a","na"
2,"^aivaṃ","","","eva","ind","","","eva"
3,"rakṣā","RAKṢ","ā","rakṣā","noun-adj","","ā","rakṣā"
4,"cakram","CAKR","am","cakra","noun-adj","","am","cakram"
5,"ato","","","atas","ind","","","atas"
6,"na","","","na","ind","","","na"
7,"likhyate","LIKH","yate","likh","verb","likh","yate","likhyate"
8,"/","","","","punct","","","/"
NA,"</s>","","","","","","",""
NA,"<s number=""75"">","","","","","","",""
1,"vighna","VIGHN","a","vighna","noun-adj","","a","vighna"
2,"nivāraṇaṃ","NIVĀRAṆ","aṃ","nivāraṇa","noun-adj","","am","nivāraṇam"
3,"tv","","","tu","ind","","","tu"
4,"anyathā","ANYATH","ā","anyathā","ind","","ā","anyathā"
5,"kriyate","KRI","yate","kar","verb","kṛ","yate","kriyate"
6,"/","","","","punct","","","/"
NA,"</s>","","","","","","",""
NA,"<s number=""76"">","","","","","","",""
1,"api","","","api","ind","","","api"
2,"ca","","","ca","ind","","","ca"
3,"śūnyat","ŚŪNYAT","a","śūnyatā","noun-adj","","a","śūnyatā"
4,"^aiva","","","eva","ind","","","eva"
5,"bhagavatī","BHAGAV","atī","bhagavat","noun-adj","","ati","bhagavati"
6,"nikhila","NIKHIL","a","nikhila","noun-adj","","a","nikhila"
7,"vighn","VIGHN","a","vighna","noun-adj","","a","vighna"
8,"^aughaṃ","AUGH","aṃ","augha","noun-adj","","am","augham"
9,"samūlam","SAMŪL","am","samūla","noun-adj","","am","samūlam"
10,"unmūlayituṃ","UNMŪL","ayituṃ","unmūl","verb","","ayituṃ","unmūlayituṃ"
11,"prabhavati","PRABHAV","ati","prabhav","verb","prabhū","ati","prabhavati"
12,"iti","","","iti","ind","","","iti"
13,"tad","TAD","","tad","pron","","","tad"
14,"adhimokṣa","ADHIMOKṢ","a","adhimokṣa","noun-adj","","a","adhimokṣa"
15,"dṛḍ","DṚḌ","","dṛḍu","noun-adj","","","dṛḍ"
16,"hatvam","HATV","am","hatva","noun-adj","","am","hatvam"
17,"ev","","","eva","ind","","","eva"
18,"ādar","ĀDAR","a","ādara","noun-adj","","a","ādara"
19,"^otpādanāya","UTPĀDAN","āya","utpādana","noun-adj","","āya","utpādanāya"
20,"rakṣā","RAKṢ","ā","rakṣā","noun-adj","","ā","rakṣā"
21,"cakra","CAKR","a","cakra","noun-adj","","a","cakra"
22,"likhanaṃ","LIKHAN","aṃ","likhana","noun-adj","","am","likhanam"
23,"na","","","na","ind","","","na"
24,"varṇitaṃ","VARṆIT","aṃ","varṇita","noun-adj","","am","varṇitam"
25,"lekhya","LEKHY","a","lekhya","noun-adj","","a","lekhya"
26,"maṇḍaleṣu","MAṆḌAL","eṣu","maṇḍala","noun-adj","","eṣu","maṇḍaleṣu"
27,"/","","","","punct","","","/"
NA,"</s>","","","","","","",""
NA,"<s number=""77"">","","","","","","",""
1,"bhāvya","BHĀVY","a","bhāvya","noun-adj","","a","bhāvya"
2,"maṇḍaleṣu","MAṆḌAL","eṣu","maṇḍala","noun-adj","","eṣu","maṇḍaleṣu"
3,"tu","","","tu","ind","","","tu"
4,"kvacid","","","kva","ind","","","kva"
5,"eva","","","eva","ind","","","eva"
6,"tad","TAD","","tad","pron","","","tad"
7,"bhāvan","BHĀVAN","a","bhāvana","noun-adj","","a","bhāvana"
8,"^oktā","UKT","ā","ukta","noun-adj","","āḥ","uktāḥ"
9,"na","","","na","ind","","","na"
10,"sarveṣu","SARV","eṣu","sarva","noun-adj","","eṣu","sarveṣu"
11,"/","","","","punct","","","/"
NA,"</s>","","","","","","",""
NA,"<s number=""78"">","","","","","","",""
1,"vighna","VIGHN","a","vighna","noun-adj","","a","vighna"
2,"ghāt","GHĀT","a","ghāta","noun-adj","","a","ghāta"
3,"^ān","","","alpha_privativum","ind","","","alpha_privativum"
4,"antaraṃ","ANTAR","aṃ","antara","noun-adj","","am","antaram"
5,"śūnyatā","ŚŪNYAT","ā","śūnyatā","noun-adj","","ā","śūnyatā"
6,"praveśād","PRAVEŚ","ād","praveśa","noun-adj","","āt","praveśāt"
7,"bhāvya","BHĀVY","a","bhāvya","noun-adj","","a","bhāvya"
8,"maṇḍale","MAṆḌAL","e","maṇḍala","noun-adj","","e","maṇḍale"
9,"api","","","api","ind","","","api"
10,"rakṣā","RAKṢ","ā","rakṣā","noun-adj","","ā","rakṣā"
11,"cakraṃ","CAKR","aṃ","cakra","noun-adj","","am","cakram"
12,"n","","a","na","ind","","a","na"
13,"^āsty","","","as","verb","as","",""
14,"ato","","","atas","ind","","","atas"
15,"na","","","na","ind","","","na"
16,"likhyate","LIKH","yate","likh","verb","likh","yate","likhyate"
17,"c","","","ca","ind","","","ca"
18,"aitat","AITAT","","tad","pron","","","aitat"
19,"/","","","","punct","","","/"
NA,"</s>","","","","","","",""
NA,"<s number=""79"">","","","","","","",""
1,"evaṃ","","","eva","ind","","","eva"
2,"tarhi","","","tarhi","ind","","","tarhi"
3,"vajra","VAJR","a","vajra","noun-adj","","a","vajra"
4,"prākāram","PRĀKĀR","am","prākāra","noun-adj","","am","prākāram"
5,"api","","","api","ind","","","api"
6,"cakravāḍa","CAKRAVĀḌ","a","cakravāḍa","noun-adj","","a","cakravāḍa"
7,"sūcakaṃ","SŪCAK","aṃ","sūcaka","noun-adj","","am","sūcakam"
8,"na","","","na","ind","","","na"
9,"likhitavyam","LIKH","itavyam","likh","verb","likh","itavyam","likhitavyam"
10,"/","","","","punct","","","/"
NA,"</s>","","","","","","",""
NA,"<s number=""80"">","","","","","","",""
1,"atha","","","atha","ind","","","atha"
2,"kūṭāgār","KŪṬĀGĀR","a","kūṭāgāra","noun-adj","","a","kūṭāgāra"
3,"^otpattau","UTPATT","au","utpatti","noun-adj","","au","utpattau"
NA,"</page>","","","","","","",""
NA,"<page number=""233"">","","","","","","",""
6,"tad","TAD","","tad","pron","","","tad"
7,"utpadyate","UTPAD","yate","utpad","verb","utpad","yate","utpadyate"
8,"/","","","","punct","","","/"
NA,"</s>","","","","","","",""
NA,"<s number=""81"">","","","","","","",""
1,"na","","","na","ind","","","na"
2,"hi","","","hi","ind","","","hi"
3,"bhagavatā","BHAGAV","atā","bhagavat","noun-adj","","atām","bhagavatām"
4,"vajra","VAJR","a","vajra","noun-adj","","a","vajra"
5,"prākārasya","PRĀKĀR","asya","prākāra","noun-adj","","asya","prākārasya"
6,"dvitīya","DVITĪY","a","dvitīya","noun-adj","","a","dvitīya"
7,"vār","VĀR","a","vāra","noun-adj","","a","vāra"
8,"^otpattiḥ","UTPATT","iḥ","utpatti","noun-adj","","iḥ","utpattiḥ"
9,"kvacid","","","kva","ind","","","kva"
10,"uktā","UKT","ā","ukta","noun-adj","","ā","uktā"
11,"//","","","","punct","","","//"
NA,"</s>","","","","","","",""
NA,"<s number=""82"">","","","","","","",""
1,"kiṃ","","","kim","pron","","","kim"
2,"vā","","","vā","ind","","","vā"
3,"dvir","DV","ir","dvi","noun-adj","","iḥ","dviḥ"
4,"utpattyā","UTPATT","yā","utpatti","noun-adj","","yāḥ","utpattyāḥ"
5,"/","","","","punct","","","/"
NA,"</s>","","","","","","",""
NA,"<s number=""83"">","","","","","","",""
1,"sakṛd","SAKṚ","d","sakṛt","noun-adj","","d","sakṛd"
2,"utpannam","UTPANN","am","utpanna","noun-adj","","am","utpannam"
3,"eva","","","eva","ind","","","eva"
4,"hi","","","hi","ind","","","hi"
5,"vajrabhū","VAJR","abhū","vajra","noun-adj","","abhū","vajrabhū"
6,"bandha","BANDH","a","bandha","noun-adj","","a","bandha"
7,"prākār","PRĀKĀR","a","prākāra","noun-adj","","a","prākāra"
8,"^ādikaṃ","ĀDIK","aṃ","ādika","noun-adj","","am","ādikam"
9,"samasta","SAMAST","a","samasta","noun-adj","","a","samasta"
10,"samāropa","SAMĀROP","a","samāropa","noun-adj","","a","samāropa"
11,"śūnyatā","ŚŪNYAT","ā","śūnyatā","noun-adj","","ā","śūnyatā"
12,"svabhāvaṃ","SVABHĀV","aṃ","svabhāva","noun-adj","","am","svabhāvam"
13,"māyām","MĀY","ām","māyā","noun-adj","","ām","māyām"
14,"ayam","","","idam","pron","","","idam"
15,"avatiṣṭhata","AVATIṢṬH","ata","avatiṣṭh","verb","avasthā","ati","avatiṣṭhati"
16,"eva","","","eva","ind","","","eva"
17,"/","","","","punct","","","/"
NA,"</s>","","","","","","",""
NA,"<s number=""84"">","","","","","","",""
1,"vidya","VIDY","a","vidya","noun-adj","","a","vidya"
2,"mānatve","MĀNATV","e","mānatva","noun-adj","","e","mānatve"
3,"api","","","api","ind","","","api"
4,"rakṣā","RAKṢ","ā","rakṣā","noun-adj","","ā","rakṣā"
5,"cakrasya","CAKR","asya","cakra","noun-adj","","asya","cakrasya"
6,"maṇḍaleṣv","MAṆḌAL","eṣv","maṇḍala","noun-adj","","eṣu","maṇḍaleṣu"
7,"a","","","alpha_privativum","ind","","","alpha_privativum"
8,"likhano","LIKHAN","o","likhana","noun-adj","","aḥ","likhanaḥ"
9,"pattir","PATT","ir","patti","noun-adj","","iḥ","pattiḥ"
10,"ukt","UKT","a","ukta","noun-adj","","a","ukta"
11,"^aiva","","","eva","ind","","","eva"
12,"/","","","","punct","","","/"
NA,"</s>","","","","","","",""
NA,"<s number=""85"">","","","","","","",""
1,"kaiś","","","kim","pron","","","kim"
2,"cit","CIT","","cid","noun-adj","","","cit"
3,"tu","","","tu","ind","","","tu"
4,"kvacid","","","kva","ind","","","kva"
5,"rakṣā","RAKṢ","ā","rakṣā","noun-adj","","ā","rakṣā"
6,"cakram","CAKR","am","cakra","noun-adj","","am","cakram"
7,"api","","","api","ind","","","api"
8,"likhituṃ","LIKH","ituṃ","likh","verb","","tums","likhtums"
9,"saṃ","","","śaṃs","ind","","","śaṃs"
10,"manyate","MAN","yate","man","verb","man","yate","manyate"
11,"//","","","","punct","","","//"
NA,"</s>","","","","","","",""
NA,"</page>","","","","","","",""
NA,"</doc>","","","","","","",""
