"WordID","word","NormSTEM","suffix","lemma","PoS","Root","NormSuffix","NormWord"
1,"janamejaya","_","_","janamejaya","NC","","_","_"
2,"uvāca","_","_","vak","V","vac","_","_"
1,"_","_","_","śara","NC","","_","_"
2,"_","_","_","talpa","NC","","_","_"
3,"_","_","_","śī","KDP","","_","_"
4,"_","_","_","tu","CCD","","_","_"
5,"bharatānāṃ","_","_","bharata","NC","","_","_"
6,"pitāmahaḥ","_","_","pitāmaha","NC","","_","_"
1,"katham","_","_","katha","CX","","_","_"
2,"utsṛṣṭavān","_","_","utsṛj","KDP","","_","_"
3,"dehaṃ","_","_","deha","NC","","_","_"
4,"kaṃ","_","_","kiṃ","PRQ","","_","_"
5,"ca","_","_","ca","CCD","","_","_"
6,"yogam","_","_","yoga","NC","","_","_"
7,"adhārayat","_","_","dhāray","V","dhāray","_","_"
1,"vaiśaṃpāyana","_","_","vaiśampāyana","NC","","_","_"
2,"uvāca","_","_","vak","V","vac","_","_"
1,"_","_","_","śṛṇ","V","śru","_","_"
2,"_","_","_","avahita","JJ","","_","_"
3,"rājañ","_","_","rājan","NC","","_","_"
4,"śucir","_","_","śuci","JJ","","_","_"
5,"bhūtvā","_","_","bhū","CGDA","","_","_"
6,"samāhitaḥ","_","_","samāhita","JJ","","_","_"
1,"bhīṣmasya","_","_","bhīṣma","NC","","_","_"
2,"_","_","_","kuru","NC","","_","_"
3,"_","_","_","śārdūla","NC","","_","_"
4,"_","_","_","deha","NC","","_","_"
5,"_","_","_","utsarga","NC","","_","_"
6,"mahātmanaḥ","_","_","mahātman","JJ","","_","_"
1,"_","_","_","nivṛt","PPP","","_","_"
2,"_","_","_","mātra","NC","","_","_"
3,"_","_","_","tu","CCD","","_","_"
4,"_","_","_","ayana","NC","","_","_"
5,"uttare","_","_","uttara","JJ","","_","_"
6,"vai","_","_","vai","CX","","_","_"
7,"divākare","_","_","divākara","NC","","_","_"
1,"samāveśayad","_","_","samāveśay","V","samāveśay","_","_"
2,"ātmānam","_","_","ātman","NC","","_","_"
3,"_","_","_","ātman","NC","","_","_"
4,"_","_","_","eva","CEM","","_","_"
5,"samāhitaḥ","_","_","samāhita","JJ","","_","_"
1,"_","_","_","vikṛ","PPP","","_","_"
2,"_","_","_","aṃśu","NC","","_","_"
3,"_","_","_","iva","CCM","","_","_"
4,"_","_","_","āditya","NC","","_","_"
5,"bhīṣmaḥ","_","_","bhīṣma","NC","","_","_"
6,"_","_","_","śara","NC","","_","_"
7,"_","_","_","śata","NUM","","_","_"
8,"_","_","_","ci","PPP","","_","_"
1,"śiśye","_","_","śī","V","śī","_","_"
2,"paramayā","_","_","parama","JJ","","_","_"
3,"lakṣmyā","_","_","lakṣmī","NC","","_","_"
4,"vṛto","_","_","vṛ","PPP","","_","_"
5,"_","_","_","brāhmaṇa","NC","","_","_"
6,"_","_","_","sattama","JJ","","_","_"
1,"vyāsena","_","_","vyāsa","NC","","_","_"
2,"vedaśravasā","_","_","vedaśravas","NC","","_","_"
3,"nāradena","_","_","nārada","NC","","_","_"
4,"_","_","_","sura","NC","","_","_"
5,"_","_","_","ṛṣi","NC","","_","_"
1,"devasthānena","_","_","devasthāna","NC","","_","_"
2,"vātsyena","_","_","vātsya","NC","","_","_"
3,"_","_","_","tathā","CX","","_","_"
4,"_","_","_","aśmakasumantu","NC","","_","_"
1,"_","_","_","tad","PRD","","_","_"
2,"_","_","_","ca","CCD","","_","_"
3,"_","_","_","anya","PPX","","_","_"
4,"_","_","_","muni","NC","","_","_"
5,"_","_","_","gaṇa","NC","","_","_"
6,"mahābhāgair","_","_","mahābhāga","JJ","","_","_"
7,"mahātmabhiḥ","_","_","mahātman","JJ","","_","_"
1,"_","_","_","śraddhā","NC","","_","_"
2,"_","_","_","dama","NC","","_","_"
3,"_","_","_","puraskāra","NC","","_","_"
4,"_","_","_","vṛ","PPP","","_","_"
5,"_","_","_","candra","NC","","_","_"
6,"iva","_","_","iva","CCM","","_","_"
7,"grahaiḥ","_","_","graha","NC","","_","_"
1,"_","_","_","bhīṣma","NC","","_","_"
2,"_","_","_","tu","CCD","","_","_"
3,"_","_","_","puruṣa","NC","","_","_"
4,"_","_","_","vyāghra","NC","","_","_"
5,"karmaṇā","_","_","karman","NC","","_","_"
6,"manasā","_","_","manas","NC","","_","_"
7,"girā","_","_","gir","NC","","_","_"
1,"_","_","_","śara","NC","","_","_"
2,"_","_","_","talpa","NC","","_","_"
3,"_","_","_","ga","PPP","","_","_"
4,"kṛṣṇaṃ","_","_","kṛṣṇa","NC","","_","_"
5,"pradadhyau","_","_","pradadhya","V","pradhyā","_","_"
6,"prāñjaliḥ","_","_","prāñjali","JJ","","_","_"
7,"sthitaḥ","_","_","sthā","PPP","","_","_"
1,"svareṇa","_","_","svara","NC","","_","_"
2,"_","_","_","puṣ","PPP","","_","_"
3,"_","_","_","nāda","NC","","_","_"
4,"tuṣṭāva","_","_","stu","V","stu","_","_"
5,"madhusūdanam","_","_","madhusūdana","NC","","_","_"
1,"yogeśvaraṃ","_","_","yogeśvara","NC","","_","_"
2,"padmanābhaṃ","_","_","padmanābha","NC","","_","_"
3,"viṣṇuṃ","_","_","viṣṇu","NC","","_","_"
4,"jiṣṇuṃ","_","_","jiṣṇu","NC","","_","_"
5,"jagatpatim","_","_","jagatpati","NC","","_","_"
1,"kṛtāñjaliḥ","_","_","kṛtāñjali","JJ","","_","_"
2,"śucir","_","_","śuci","JJ","","_","_"
3,"bhūtvā","_","_","bhū","CGDA","","_","_"
4,"_","_","_","vāc","NC","","_","_"
5,"_","_","_","vid","JJ","","_","_"
6,"pravaraḥ","_","_","pravara","JJ","","_","_"
7,"prabhum","_","_","prabhu","NC","","_","_"
1,"bhīṣmaḥ","_","_","bhīṣma","NC","","_","_"
2,"_","_","_","parama","JJ","","_","_"
3,"_","_","_","dharma","NC","","_","_"
4,"_","_","_","ātman","NC","","_","_"
5,"vāsudevam","_","_","vāsudeva","NC","","_","_"
6,"_","_","_","atha","CAD","","_","_"
7,"_","_","_","stu","V","stu","_","_"
1,"ārirādhayiṣuḥ","_","_","ārirādhayiṣu","JJ","","_","_"
2,"kṛṣṇaṃ","_","_","kṛṣṇa","NC","","_","_"
3,"vācaṃ","_","_","vāc","NC","","_","_"
4,"jigamiṣāmi","_","_","jigamiṣ","V","jigamiṣ","_","_"
5,"yām","_","_","yad","PRL","","_","_"
1,"tayā","_","_","tad","PRD","","_","_"
2,"_","_","_","vyāsa","NC","","_","_"
3,"_","_","_","samāsin","JJ","","_","_"
4,"prīyatāṃ","_","_","prī","V","prī","_","_"
5,"puruṣottamaḥ","_","_","puruṣottama","NC","","_","_"
1,"śuciḥ","_","_","śuci","JJ","","_","_"
2,"śuciṣadaṃ","_","_","śuciṣad","JJ","","_","_"
3,"haṃsaṃ","_","_","haṃsa","NC","","_","_"
4,"_","_","_","tad","PRD","","_","_"
5,"_","_","_","para","PPX","","_","_"
6,"parameṣṭhinam","_","_","parameṣṭhin","NC","","_","_"
1,"yuktvā","_","_","yuj","CGDA","","_","_"
2,"_","_","_","sarva","JQ","","_","_"
3,"_","_","_","ātman","NC","","_","_"
4,"_","_","_","ātman","NC","","_","_"
5,"taṃ","_","_","tad","PRD","","_","_"
6,"prapadye","_","_","prapad","V","prapad","_","_"
7,"prajāpatim","_","_","prajāpati","NC","","_","_"
1,"yasmin","_","_","yad","PRL","","_","_"
2,"viśvāni","_","_","viśva","JQ","","_","_"
3,"bhūtāni","_","_","bhūta","NC","","_","_"
4,"tiṣṭhanti","_","_","tiṣṭh","V","sthā","_","_"
5,"ca","_","_","ca","CCD","","_","_"
6,"viśanti","_","_","viś","V","viś","_","_"
7,"ca","_","_","ca","CCD","","_","_"
1,"_","_","_","guṇa","NC","","_","_"
2,"_","_","_","bhū","PPP","","_","_"
3,"bhūteśe","_","_","bhūteśa","NC","","_","_"
4,"sūtre","_","_","sūtra","NC","","_","_"
5,"_","_","_","maṇi","NC","","_","_"
6,"_","_","_","gaṇa","NC","","_","_"
7,"iva","_","_","iva","CCM","","_","_"
1,"_","_","_","yad","PRL","","_","_"
2,"_","_","_","nitya","JJ","","_","_"
3,"tate","_","_","tan","PPP","","_","_"
4,"tantau","_","_","tantu","NC","","_","_"
5,"dṛḍhe","_","_","dṛḍha","JJ","","_","_"
6,"srag","_","_","sraj","NC","","_","_"
7,"iva","_","_","iva","CCM","","_","_"
8,"tiṣṭhati","_","_","tiṣṭh","V","sthā","_","_"
1,"_","_","_","as","KDP","","_","_"
2,"_","_","_","asat","JJ","","_","_"
3,"_","_","_","granth","PPP","","_","_"
4,"viśvaṃ","_","_","viśva","JQ","","_","_"
5,"_","_","_","viśva","JQ","","_","_"
6,"_","_","_","aṅga","NC","","_","_"
7,"viśvakarmaṇi","_","_","viśvakarman","NC","","_","_"
1,"hariṃ","_","_","hari","NC","","_","_"
2,"_","_","_","sahasra","NUM","","_","_"
3,"_","_","_","śiras","NC","","_","_"
4,"_","_","_","sahasra","NUM","","_","_"
5,"_","_","_","caraṇa","NC","","_","_"
6,"_","_","_","īkṣaṇa","NC","","_","_"
1,"prāhur","_","_","prāh","V","prāh","_","_"
2,"nārāyaṇaṃ","_","_","nārāyaṇa","NC","","_","_"
3,"devaṃ","_","_","deva","NC","","_","_"
4,"yaṃ","_","_","yad","PRL","","_","_"
5,"viśvasya","_","_","viśva","JQ","","_","_"
6,"parāyaṇam","_","_","parāyaṇa","NC","","_","_"
1,"aṇīyasām","_","_","aṇīyas","JJ","","_","_"
2,"aṇīyāṃsaṃ","_","_","aṇīyas","JJ","","_","_"
3,"sthaviṣṭhaṃ","_","_","sthaviṣṭha","JJ","","_","_"
4,"ca","_","_","ca","CCD","","_","_"
5,"sthavīyasām","_","_","sthavīyas","JJ","","_","_"
1,"garīyasāṃ","_","_","garīyas","JJ","","_","_"
2,"gariṣṭhaṃ","_","_","gariṣṭha","JJ","","_","_"
3,"ca","_","_","ca","CCD","","_","_"
4,"śreṣṭhaṃ","_","_","śreṣṭha","JJ","","_","_"
5,"ca","_","_","ca","CCD","","_","_"
6,"śreyasām","_","_","śreyas","JJ","","_","_"
7,"api","_","_","api","CX","","_","_"
1,"yaṃ","_","_","yad","PRL","","_","_"
2,"_","_","_","vāka","NC","","_","_"
3,"_","_","_","anuvāka","NC","","_","_"
4,"niṣatsūpaniṣatsu","_","_","ca","CCD","","_","_"
1,"gṛṇanti","_","_","gṝ","V","gṝ","_","_"
2,"_","_","_","satya","JJ","","_","_"
3,"_","_","_","karman","NC","","_","_"
4,"satyaṃ","_","_","satya","JJ","","_","_"
5,"satyeṣu","_","_","satya","JJ","","_","_"
6,"sāmasu","_","_","sāman","NC","","_","_"
1,"_","_","_","catur","NUM","","_","_"
2,"_","_","_","catur","NUM","","_","_"
3,"_","_","_","ātman","NC","","_","_"
4,"_","_","_","sattva","NC","","_","_"
5,"_","_","_","stha","JJ","","_","_"
6,"sātvatāṃ","_","_","sātvat","NC","","_","_"
7,"patim","_","_","pati","NC","","_","_"
1,"yaṃ","_","_","yad","PRL","","_","_"
2,"divyair","_","_","divya","JJ","","_","_"
3,"devam","_","_","deva","NC","","_","_"
4,"arcanti","_","_","ṛc","V","ṛc","_","_"
5,"guhyaiḥ","_","_","guhya","JJ","","_","_"
6,"_","_","_","parama","JJ","","_","_"
7,"_","_","_","nāman","NC","","_","_"
1,"yaṃ","_","_","yad","PRL","","_","_"
2,"devaṃ","_","_","deva","NC","","_","_"
3,"devakī","_","_","devakī","NC","","_","_"
4,"devī","_","_","devī","NC","","_","_"
5,"vasudevād","_","_","vasudeva","NC","","_","_"
6,"ajījanat","_","_","jan","V","jan","_","_"
1,"bhaumasya","_","_","bhauma","NC","","_","_"
2,"brahmaṇo","_","_","brahman","NC","","_","_"
3,"guptyai","_","_","gupti","NC","","_","_"
4,"dīptam","_","_","dīp","PPP","","_","_"
5,"agnim","_","_","agni","NC","","_","_"
6,"_","_","_","iva","CCM","","_","_"
7,"_","_","_","araṇi","NC","","_","_"
1,"yam","_","_","yad","PRL","","_","_"
2,"ananyo","_","_","ananya","JJ","","_","_"
3,"_","_","_","vyape","PPP","","_","_"
4,"_","_","_","āśī","NC","","_","_"
5,"ātmānaṃ","_","_","ātman","NC","","_","_"
6,"_","_","_","vī","PPP","","_","_"
7,"_","_","_","kalmaṣa","NC","","_","_"
1,"_","_","_","yaj","CGDA","","_","_"
2,"_","_","_","ānantya","NC","","_","_"
3,"govindaṃ","_","_","govinda","NC","","_","_"
4,"_","_","_","darś","V","dṛś","_","_"
5,"_","_","_","ātman","NC","","_","_"
6,"_","_","_","avasthā","PPP","","_","_"
1,"purāṇe","_","_","purāṇa","NC","","_","_"
2,"puruṣaḥ","_","_","puruṣa","NC","","_","_"
3,"prokto","_","_","pravac","PPP","","_","_"
4,"brahmā","_","_","brahman","NC","","_","_"
5,"prokto","_","_","pravac","PPP","","_","_"
6,"_","_","_","yuga","NC","","_","_"
7,"_","_","_","ādi","NC","","_","_"
1,"kṣaye","_","_","kṣaya","NC","","_","_"
2,"saṃkarṣaṇaḥ","_","_","saṃkarṣaṇa","NC","","_","_"
3,"_","_","_","pravac","PPP","","_","_"
4,"_","_","_","tad","PRD","","_","_"
5,"upāsyam","_","_","upās","KDG","","_","_"
6,"upāsmahe","_","_","upās","V","upās","_","_"
1,"_","_","_","ati","CADP","","_","_"
2,"_","_","_","vāyu","NC","","_","_"
3,"_","_","_","indra","NC","","_","_"
4,"_","_","_","karman","NC","","_","_"
5,"_","_","_","ati","CADP","","_","_"
6,"_","_","_","sūrya","NC","","_","_"
7,"_","_","_","agni","NC","","_","_"
8,"_","_","_","tejas","NC","","_","_"
1,"_","_","_","ati","CADP","","_","_"
2,"_","_","_","buddhīndriya","NC","","_","_"
3,"_","_","_","ātman","NC","","_","_"
4,"taṃ","_","_","tad","PRD","","_","_"
5,"prapadye","_","_","prapad","V","prapad","_","_"
6,"prajāpatim","_","_","prajāpati","NC","","_","_"
1,"yaṃ","_","_","yad","PRL","","_","_"
2,"vai","_","_","vai","CX","","_","_"
3,"viśvasya","_","_","viśva","JQ","","_","_"
4,"kartāraṃ","_","_","kartṛ","JJ","","_","_"
5,"_","_","_","jagat","NC","","_","_"
6,"_","_","_","sthā","KDP","","_","_"
7,"patim","_","_","pati","NC","","_","_"
1,"vadanti","_","_","vad","V","vad","_","_"
2,"jagato","_","_","jagat","NC","","_","_"
3,"'dhyakṣam","_","_","adhyakṣa","NC","","_","_"
4,"akṣaraṃ","_","_","akṣara","JJ","","_","_"
5,"paramaṃ","_","_","parama","JJ","","_","_"
6,"padam","_","_","pada","NC","","_","_"
1,"_","_","_","hiraṇya","NC","","_","_"
2,"_","_","_","varṇa","NC","","_","_"
3,"yaṃ","_","_","yad","PRL","","_","_"
4,"garbham","_","_","garbha","NC","","_","_"
5,"aditir","_","_","aditi","NC","","_","_"
6,"daityanāśanam","_","_","daityanāśana","NC","","_","_"
1,"ekaṃ","_","_","eka","PPX","","_","_"
2,"dvādaśadhā","_","_","dvādaśadhā","CX","","_","_"
3,"jajñe","_","_","jan","V","jan","_","_"
4,"tasmai","_","_","tad","PRD","","_","_"
5,"_","_","_","sūrya","NC","","_","_"
6,"_","_","_","ātman","NC","","_","_"
7,"namaḥ","_","_","namas","NC","","_","_"
1,"śukle","_","_","śukla","NC","","_","_"
2,"devān","_","_","deva","NC","","_","_"
3,"pitṝn","_","_","pitṛ","NC","","_","_"
4,"kṛṣṇe","_","_","kṛṣṇa","NC","","_","_"
5,"_","_","_","tarpay","V","tarpay","_","_"
6,"_","_","_","amṛta","NC","","_","_"
7,"yaḥ","_","_","yad","PRL","","_","_"
1,"_","_","_","yad","PRL","","_","_"
2,"_","_","_","ca","CCD","","_","_"
3,"rājā","_","_","rājan","NC","","_","_"
4,"dvijātīnāṃ","_","_","dvijāti","NC","","_","_"
5,"tasmai","_","_","tad","PRD","","_","_"
6,"_","_","_","soma","NC","","_","_"
7,"_","_","_","ātman","NC","","_","_"
8,"namaḥ","_","_","namas","NC","","_","_"
1,"_","_","_","mahat","JJ","","_","_"
2,"_","_","_","tamas","NC","","_","_"
3,"pāre","_","_","pāra","NC","","_","_"
4,"puruṣaṃ","_","_","puruṣa","NC","","_","_"
5,"_","_","_","jvalana","NC","","_","_"
6,"_","_","_","dyuti","NC","","_","_"
1,"yaṃ","_","_","yad","PRL","","_","_"
2,"jñātvā","_","_","jñā","CGDA","","_","_"
3,"mṛtyum","_","_","mṛtyu","NC","","_","_"
4,"atyeti","_","_","atye","V","atī","_","_"
5,"tasmai","_","_","tad","PRD","","_","_"
6,"_","_","_","jñā","KDG","","_","_"
7,"_","_","_","ātman","NC","","_","_"
8,"namaḥ","_","_","namas","NC","","_","_"
1,"yaṃ","_","_","yad","PRL","","_","_"
2,"bṛhantaṃ","_","_","bṛhat","JJ","","_","_"
3,"_","_","_","bṛhatī","NC","","_","_"
4,"_","_","_","uktha","NC","","_","_"
5,"yam","_","_","yad","PRL","","_","_"
6,"agnau","_","_","agni","NC","","_","_"
7,"yaṃ","_","_","yad","PRL","","_","_"
8,"_","_","_","mahat","JJ","","_","_"
9,"_","_","_","adhvara","NC","","_","_"
1,"yaṃ","_","_","yad","PRL","","_","_"
2,"_","_","_","vipra","NC","","_","_"
3,"_","_","_","saṃgha","NC","","_","_"
4,"gāyanti","_","_","gāy","V","gai","_","_"
5,"tasmai","_","_","tad","PRD","","_","_"
6,"_","_","_","veda","NC","","_","_"
7,"_","_","_","ātman","NC","","_","_"
8,"namaḥ","_","_","namas","NC","","_","_"
1,"_","_","_","ṛc","NC","","_","_"
2,"_","_","_","yajus","NC","","_","_"
3,"_","_","_","sāman","NC","","_","_"
4,"_","_","_","dhāman","NC","","_","_"
5,"_","_","_","daśārdha","JJ","","_","_"
6,"_","_","_","havis","NC","","_","_"
7,"_","_","_","ākṛti","NC","","_","_"
1,"yaṃ","_","_","yad","PRL","","_","_"
2,"saptatantuṃ","_","_","saptatantu","NC","","_","_"
3,"tanvanti","_","_","tan","V","tan","_","_"
4,"tasmai","_","_","tad","PRD","","_","_"
5,"yajñātmane","_","_","yajñātman","NC","","_","_"
6,"namaḥ","_","_","namas","NC","","_","_"
1,"yaḥ","_","_","yad","PRL","","_","_"
2,"suparṇo","_","_","suparṇa","NC","","_","_"
3,"yajur","_","_","yajus","NC","","_","_"
4,"nāma","_","_","nāma","CX","","_","_"
5,"_","_","_","chandas","NC","","_","_"
6,"_","_","_","gātra","NC","","_","_"
7,"_","_","_","trivṛt","NC","","_","_"
8,"_","_","_","śiras","NC","","_","_"
1,"_","_","_","rathaṃtara","NC","","_","_"
2,"_","_","_","bṛhatī","NC","","_","_"
3,"_","_","_","akṣa","NC","","_","_"
4,"_","_","_","tad","PRD","","_","_"
5,"_","_","_","stotra","NC","","_","_"
6,"_","_","_","ātman","NC","","_","_"
7,"namaḥ","_","_","namas","NC","","_","_"
1,"yaḥ","_","_","yad","PRL","","_","_"
2,"_","_","_","sahasra","NUM","","_","_"
3,"_","_","_","sava","NC","","_","_"
4,"satre","_","_","sattra","NC","","_","_"
5,"jajñe","_","_","jan","V","jan","_","_"
6,"viśvasṛjām","_","_","viśvasṛj","NC","","_","_"
7,"ṛṣiḥ","_","_","ṛṣi","NC","","_","_"
1,"_","_","_","hiraṇya","NC","","_","_"
2,"_","_","_","varṇa","NC","","_","_"
3,"_","_","_","śakuni","NC","","_","_"
4,"_","_","_","tad","PRD","","_","_"
5,"_","_","_","haṃsa","NC","","_","_"
6,"_","_","_","ātman","NC","","_","_"
7,"namaḥ","_","_","namas","NC","","_","_"
1,"_","_","_","pada","NC","","_","_"
2,"_","_","_","aṅga","NC","","_","_"
3,"_","_","_","saṃdhi","NC","","_","_"
4,"_","_","_","parvan","NC","","_","_"
5,"_","_","_","svara","NC","","_","_"
6,"_","_","_","vyañjana","NC","","_","_"
7,"_","_","_","lakṣaṇa","NC","","_","_"
1,"yam","_","_","yad","PRL","","_","_"
2,"āhur","_","_","ah","V","ah","_","_"
3,"akṣaraṃ","_","_","akṣara","JJ","","_","_"
4,"nityaṃ","_","_","nitya","JJ","","_","_"
5,"tasmai","_","_","tad","PRD","","_","_"
6,"_","_","_","vāc","NC","","_","_"
7,"_","_","_","ātman","NC","","_","_"
8,"namaḥ","_","_","namas","NC","","_","_"
1,"_","_","_","yad","PRL","","_","_"
2,"_","_","_","cin","V","ci","_","_"
3,"satāṃ","_","_","sat","JJ","","_","_"
4,"setum","_","_","setu","NC","","_","_"
5,"_","_","_","ṛta","NC","","_","_"
6,"_","_","_","amṛta","NC","","_","_"
7,"_","_","_","yoni","NC","","_","_"
1,"_","_","_","dharma","NC","","_","_"
2,"_","_","_","artha","NC","","_","_"
3,"_","_","_","vyavahāra","NC","","_","_"
4,"_","_","_","aṅga","NC","","_","_"
5,"_","_","_","tad","PRD","","_","_"
6,"_","_","_","satya","NC","","_","_"
7,"_","_","_","ātman","NC","","_","_"
8,"namaḥ","_","_","namas","NC","","_","_"
1,"yaṃ","_","_","yad","PRL","","_","_"
2,"_","_","_","pṛthak","CX","","_","_"
3,"_","_","_","dharma","NC","","_","_"
4,"_","_","_","caraṇa","NC","","_","_"
5,"_","_","_","pṛthak","CX","","_","_"
6,"_","_","_","dharma","NC","","_","_"
7,"_","_","_","phala","NC","","_","_"
8,"_","_","_","eṣin","JJ","","_","_"
1,"_","_","_","pṛthak","CX","","_","_"
2,"_","_","_","dharma","NC","","_","_"
3,"samarcanti","_","_","samarc","V","samarc","_","_"
4,"tasmai","_","_","tad","PRD","","_","_"
5,"_","_","_","dharma","NC","","_","_"
6,"_","_","_","ātman","NC","","_","_"
7,"namaḥ","_","_","namas","NC","","_","_"
1,"yaṃ","_","_","yad","PRL","","_","_"
2,"taṃ","_","_","tad","PRD","","_","_"
3,"_","_","_","vyakta","JJ","","_","_"
4,"_","_","_","stha","JJ","","_","_"
5,"avyaktaṃ","_","_","avyakta","JJ","","_","_"
6,"vicinvanti","_","_","vicin","V","vici","_","_"
7,"_","_","_","mahat","JJ","","_","_"
8,"_","_","_","ṛṣi","NC","","_","_"
1,"kṣetre","_","_","kṣetra","NC","","_","_"
2,"kṣetrajñam","_","_","kṣetrajña","NC","","_","_"
3,"āsīnaṃ","_","_","ās","PPP","","_","_"
4,"tasmai","_","_","tad","PRD","","_","_"
5,"_","_","_","kṣetra","NC","","_","_"
6,"_","_","_","ātman","NC","","_","_"
7,"namaḥ","_","_","namas","NC","","_","_"
1,"yaṃ","_","_","yad","PRL","","_","_"
2,"_","_","_","dṛś","NC","","_","_"
3,"_","_","_","ātman","NC","","_","_"
4,"_","_","_","ātman","NC","","_","_"
5,"_","_","_","stha","JJ","","_","_"
6,"vṛtaṃ","_","_","vṛ","PPP","","_","_"
7,"ṣoḍaśabhir","_","_","ṣoḍaśan","JJ","","_","_"
8,"guṇaiḥ","_","_","guṇa","NC","","_","_"
1,"prāhuḥ","_","_","prāh","V","prāh","_","_"
2,"saptadaśaṃ","_","_","saptadaśa","JJ","","_","_"
3,"_","_","_","sāṃkhya","NC","","_","_"
4,"_","_","_","tad","PRD","","_","_"
5,"_","_","_","sāṃkhya","NC","","_","_"
6,"_","_","_","ātman","NC","","_","_"
7,"namaḥ","_","_","namas","NC","","_","_"
1,"yaṃ","_","_","yad","PRL","","_","_"
2,"vinidrā","_","_","vinidra","JJ","","_","_"
3,"_","_","_","ji","PPP","","_","_"
4,"_","_","_","śvāsa","NC","","_","_"
5,"_","_","_","sattva","NC","","_","_"
6,"_","_","_","stha","JJ","","_","_"
7,"_","_","_","saṃya","PPP","","_","_"
8,"_","_","_","indriya","NC","","_","_"
1,"jyotiḥ","_","_","jyotis","NC","","_","_"
2,"paśyanti","_","_","paś","V","paś","_","_"
3,"_","_","_","yuj","KDP","","_","_"
4,"_","_","_","tad","PRD","","_","_"
5,"_","_","_","yoga","NC","","_","_"
6,"_","_","_","ātman","NC","","_","_"
7,"namaḥ","_","_","namas","NC","","_","_"
1,"_","_","_","apuṇya","JJ","","_","_"
2,"_","_","_","puṇya","JJ","","_","_"
3,"_","_","_","uparama","NC","","_","_"
4,"yaṃ","_","_","yad","PRL","","_","_"
5,"_","_","_","punarbhava","NC","","_","_"
6,"_","_","_","nirbhaya","JJ","","_","_"
1,"śāntāḥ","_","_","śa","PPP","","_","_"
2,"saṃnyāsino","_","_","saṃnyāsin","JJ","","_","_"
3,"yānti","_","_","yā","V","yā","_","_"
4,"tasmai","_","_","tad","PRD","","_","_"
5,"_","_","_","mokṣa","NC","","_","_"
6,"_","_","_","ātman","NC","","_","_"
7,"namaḥ","_","_","namas","NC","","_","_"
1,"yo","_","_","yad","PRL","","_","_"
2,"'sau","_","_","adas","PRD","","_","_"
3,"_","_","_","yuga","NC","","_","_"
4,"_","_","_","sahasra","NUM","","_","_"
5,"_","_","_","anta","NC","","_","_"
6,"_","_","_","pradīp","PPP","","_","_"
7,"_","_","_","arcis","NC","","_","_"
8,"vibhāvasuḥ","_","_","vibhāvasu","NC","","_","_"
1,"saṃbhakṣayati","_","_","saṃbhakṣay","V","saṃbhakṣay","_","_"
2,"bhūtāni","_","_","bhūta","NC","","_","_"
3,"tasmai","_","_","tad","PRD","","_","_"
4,"_","_","_","ghora","JJ","","_","_"
5,"_","_","_","ātman","NC","","_","_"
6,"namaḥ","_","_","namas","NC","","_","_"
1,"saṃbhakṣya","_","_","sambhakṣ","CGDA","","_","_"
2,"_","_","_","sarva","JQ","","_","_"
3,"_","_","_","bhūta","NC","","_","_"
4,"kṛtvā","_","_","kṛ","CGDA","","_","_"
5,"_","_","_","ca","CCD","","_","_"
6,"_","_","_","ekārṇava","NC","","_","_"
7,"jagat","_","_","jagat","NC","","_","_"
1,"bālaḥ","_","_","bāla","NC","","_","_"
2,"svapiti","_","_","svapita","V","svap","_","_"
3,"_","_","_","yad","PRL","","_","_"
4,"_","_","_","ca","CCD","","_","_"
5,"_","_","_","eka","PPX","","_","_"
6,"_","_","_","tad","PRD","","_","_"
7,"_","_","_","māyā","NC","","_","_"
8,"_","_","_","ātman","NC","","_","_"
9,"namaḥ","_","_","namas","NC","","_","_"
1,"_","_","_","sahasra","NUM","","_","_"
2,"_","_","_","śiras","NC","","_","_"
3,"tasmai","_","_","tad","PRD","","_","_"
4,"_","_","_","puruṣa","NC","","_","_"
5,"_","_","_","amita","JJ","","_","_"
6,"_","_","_","ātman","NC","","_","_"
1,"_","_","_","catur","NUM","","_","_"
2,"_","_","_","samudra","NC","","_","_"
3,"_","_","_","paryāya","NC","","_","_"
4,"_","_","_","yoganidrā","NC","","_","_"
5,"_","_","_","ātman","NC","","_","_"
6,"namaḥ","_","_","namas","NC","","_","_"
1,"ajasya","_","_","aja","NC","","_","_"
2,"_","_","_","nābhi","NC","","_","_"
3,"_","_","_","adhi","CADP","","_","_"
4,"_","_","_","eka","PPX","","_","_"
5,"yasmin","_","_","yad","PRL","","_","_"
6,"viśvaṃ","_","_","viśva","JQ","","_","_"
7,"pratiṣṭhitam","_","_","pratiṣṭhā","PPP","","_","_"
1,"puṣkaraṃ","_","_","puṣkara","NC","","_","_"
2,"puṣkarākṣasya","_","_","puṣkarākṣa","NC","","_","_"
3,"tasmai","_","_","tad","PRD","","_","_"
4,"_","_","_","padma","NC","","_","_"
5,"_","_","_","ātman","NC","","_","_"
6,"namaḥ","_","_","namas","NC","","_","_"
1,"yasya","_","_","yad","PRL","","_","_"
2,"keśeṣu","_","_","keśa","NC","","_","_"
3,"jīmūtā","_","_","jīmūta","NC","","_","_"
4,"nadyaḥ","_","_","nadī","NC","","_","_"
5,"_","_","_","sarva","JQ","","_","_"
6,"_","_","_","aṅga","NC","","_","_"
7,"_","_","_","saṃdhi","NC","","_","_"
1,"kukṣau","_","_","kukṣi","NC","","_","_"
2,"_","_","_","samudra","NC","","_","_"
3,"_","_","_","catur","NUM","","_","_"
4,"_","_","_","tad","PRD","","_","_"
5,"_","_","_","toya","NC","","_","_"
6,"_","_","_","ātman","NC","","_","_"
7,"namaḥ","_","_","namas","NC","","_","_"
1,"_","_","_","yuga","NC","","_","_"
2,"_","_","_","āvart","V","āvṛt","_","_"
3,"yo","_","_","yad","PRL","","_","_"
4,"'ṃśair","_","_","aṃśa","NC","","_","_"
5,"_","_","_","dina","NC","","_","_"
6,"_","_","_","ṛtu","NC","","_","_"
7,"_","_","_","anaya","NC","","_","_"
8,"_","_","_","hāyana","NC","","_","_"
1,"_","_","_","sarga","NC","","_","_"
2,"_","_","_","pralaya","NC","","_","_"
3,"kartā","_","_","kartṛ","JJ","","_","_"
4,"tasmai","_","_","tad","PRD","","_","_"
5,"_","_","_","kāla","NC","","_","_"
6,"_","_","_","ātman","NC","","_","_"
7,"namaḥ","_","_","namas","NC","","_","_"
1,"brahma","_","_","brahman","NC","","_","_"
2,"vaktraṃ","_","_","vaktra","NC","","_","_"
3,"bhujau","_","_","bhuja","NC","","_","_"
4,"kṣatraṃ","_","_","kṣatra","NC","","_","_"
5,"kṛtsnam","_","_","kṛtsna","JJ","","_","_"
6,"_","_","_","ūru","NC","","_","_"
7,"_","_","_","udara","NC","","_","_"
8,"viśaḥ","_","_","viś","NC","","_","_"
1,"pādau","_","_","pāda","NC","","_","_"
2,"_","_","_","yad","PRL","","_","_"
3,"_","_","_","āśri","PPP","","_","_"
4,"_","_","_","śūdra","NC","","_","_"
5,"_","_","_","tad","PRD","","_","_"
6,"_","_","_","varṇa","NC","","_","_"
7,"_","_","_","ātman","NC","","_","_"
8,"namaḥ","_","_","namas","NC","","_","_"
1,"_","_","_","yad","PRL","","_","_"
2,"_","_","_","agni","NC","","_","_"
3,"āsyaṃ","_","_","āsya","NC","","_","_"
4,"dyaur","_","_","div","NC","","_","_"
5,"mūrdhā","_","_","mūrdhan","NC","","_","_"
6,"khaṃ","_","_","kha","NC","","_","_"
7,"_","_","_","nābhi","NC","","_","_"
8,"_","_","_","caraṇa","NC","","_","_"
9,"kṣitiḥ","_","_","kṣiti","NC","","_","_"
1,"_","_","_","sūrya","NC","","_","_"
2,"_","_","_","cakṣus","NC","","_","_"
3,"diśaḥ","_","_","diś","NC","","_","_"
4,"śrotre","_","_","śrotra","NC","","_","_"
5,"tasmai","_","_","tad","PRD","","_","_"
6,"_","_","_","loka","NC","","_","_"
7,"_","_","_","ātman","NC","","_","_"
8,"namaḥ","_","_","namas","NC","","_","_"
1,"viṣaye","_","_","viṣaya","NC","","_","_"
2,"vartamānānāṃ","_","_","vṛt","KDP","","_","_"
3,"yaṃ","_","_","yad","PRL","","_","_"
4,"taṃ","_","_","tad","PRD","","_","_"
5,"vaiśeṣikair","_","_","vaiśeṣika","JJ","","_","_"
6,"guṇaiḥ","_","_","guṇa","NC","","_","_"
1,"prāhur","_","_","prāh","V","prāh","_","_"
2,"_","_","_","viṣaya","NC","","_","_"
3,"_","_","_","goptṛ","JJ","","_","_"
4,"tasmai","_","_","tad","PRD","","_","_"
5,"_","_","_","goptṛ","JJ","","_","_"
6,"_","_","_","ātman","NC","","_","_"
7,"namaḥ","_","_","namas","NC","","_","_"
1,"_","_","_","anna","NC","","_","_"
2,"_","_","_","pāna","NC","","_","_"
3,"_","_","_","indhana","NC","","_","_"
4,"_","_","_","maya","NC","","_","_"
5,"_","_","_","rasa","NC","","_","_"
6,"_","_","_","prāṇa","NC","","_","_"
7,"_","_","_","vivardhana","JJ","","_","_"
1,"yo","_","_","yad","PRL","","_","_"
2,"dhārayati","_","_","dhar","V","dhṛ","_","_"
3,"bhūtāni","_","_","bhūta","NC","","_","_"
4,"tasmai","_","_","tad","PRD","","_","_"
5,"_","_","_","prāṇa","NC","","_","_"
6,"_","_","_","ātman","NC","","_","_"
7,"namaḥ","_","_","namas","NC","","_","_"
1,"paraḥ","_","_","para","PPX","","_","_"
2,"kālāt","_","_","kāla","NC","","_","_"
3,"paro","_","_","para","PPX","","_","_"
4,"yajñāt","_","_","yajña","NC","","_","_"
5,"paraḥ","_","_","para","PPX","","_","_"
6,"_","_","_","as","KDP","","_","_"
7,"_","_","_","asat","JJ","","_","_"
8,"_","_","_","ca","CCD","","_","_"
9,"yaḥ","_","_","yad","PRL","","_","_"
1,"anādir","_","_","anādi","JJ","","_","_"
2,"ādir","_","_","ādi","NC","","_","_"
3,"viśvasya","_","_","viśva","JQ","","_","_"
4,"tasmai","_","_","tad","PRD","","_","_"
5,"viśvātmane","_","_","viśvātman","NC","","_","_"
6,"namaḥ","_","_","namas","NC","","_","_"
1,"yo","_","_","yad","PRL","","_","_"
2,"mohayati","_","_","moh","V","mohay","_","_"
3,"bhūtāni","_","_","bhūta","NC","","_","_"
4,"_","_","_","sneha","NC","","_","_"
5,"_","_","_","rāga","NC","","_","_"
6,"_","_","_","anubandhana","NC","","_","_"
1,"sargasya","_","_","sarga","NC","","_","_"
2,"_","_","_","rakṣaṇa","NC","","_","_"
3,"_","_","_","artha","NC","","_","_"
4,"tasmai","_","_","tad","PRD","","_","_"
5,"_","_","_","moha","NC","","_","_"
6,"_","_","_","ātman","NC","","_","_"
7,"namaḥ","_","_","namas","NC","","_","_"
1,"_","_","_","ātman","NC","","_","_"
2,"_","_","_","jñāna","NC","","_","_"
3,"idaṃ","_","_","ida","PRD","","_","_"
4,"jñānaṃ","_","_","jñāna","NC","","_","_"
5,"jñātvā","_","_","jñā","CGDA","","_","_"
6,"_","_","_","pañcan","NUM","","_","_"
7,"_","_","_","avasthā","PPP","","_","_"
1,"yaṃ","_","_","yad","PRL","","_","_"
2,"jñānino","_","_","jñānin","JJ","","_","_"
3,"'dhigacchanti","_","_","adhiga","V","adhiga","_","_"
4,"tasmai","_","_","tad","PRD","","_","_"
5,"_","_","_","jñāna","NC","","_","_"
6,"_","_","_","ātman","NC","","_","_"
7,"namaḥ","_","_","namas","NC","","_","_"
1,"_","_","_","aprameya","JJ","","_","_"
2,"_","_","_","śarīra","NC","","_","_"
3,"sarvato","_","_","sarvatas","CX","","_","_"
4,"_","_","_","ananta","JJ","","_","_"
5,"_","_","_","cakṣus","NC","","_","_"
1,"_","_","_","apāra","JJ","","_","_"
2,"_","_","_","parimā","KDG","","_","_"
3,"tasmai","_","_","tad","PRD","","_","_"
4,"_","_","_","cintay","KDG","","_","_"
5,"_","_","_","ātman","NC","","_","_"
6,"namaḥ","_","_","namas","NC","","_","_"
1,"jaṭine","_","_","jaṭin","NC","","_","_"
2,"daṇḍine","_","_","daṇḍin","NC","","_","_"
3,"nityaṃ","_","_","nitya","CX","","_","_"
4,"_","_","_","lamba","JJ","","_","_"
5,"_","_","_","udara","NC","","_","_"
6,"_","_","_","śarīrin","JJ","","_","_"
1,"_","_","_","kamaṇḍalu","NC","","_","_"
2,"_","_","_","niṣaṅga","NC","","_","_"
3,"tasmai","_","_","tad","PRD","","_","_"
4,"_","_","_","brahman","NC","","_","_"
5,"_","_","_","ātman","NC","","_","_"
6,"namaḥ","_","_","namas","NC","","_","_"
1,"śūline","_","_","śūlin","NC","","_","_"
2,"_","_","_","tridaśa","NC","","_","_"
3,"_","_","_","īśa","NC","","_","_"
4,"tryambakāya","_","_","tryambaka","NC","","_","_"
5,"mahātmane","_","_","mahātman","JJ","","_","_"
1,"_","_","_","bhasman","NC","","_","_"
2,"_","_","_","dih","PPP","","_","_"
3,"_","_","_","ūrdhva","JJ","","_","_"
4,"_","_","_","liṅga","NC","","_","_"
5,"tasmai","_","_","tad","PRD","","_","_"
6,"_","_","_","rudra","NC","","_","_"
7,"_","_","_","ātman","NC","","_","_"
8,"namaḥ","_","_","namas","NC","","_","_"
1,"_","_","_","pañcabhūta","NC","","_","_"
2,"_","_","_","ātman","NC","","_","_"
3,"_","_","_","bhū","PPP","","_","_"
4,"_","_","_","bhūta","NC","","_","_"
5,"_","_","_","ādi","NC","","_","_"
6,"_","_","_","nidhana","NC","","_","_"
7,"_","_","_","ātman","NC","","_","_"
1,"_","_","_","akrodha","NC","","_","_"
2,"_","_","_","droha","NC","","_","_"
3,"_","_","_","moha","NC","","_","_"
4,"tasmai","_","_","tad","PRD","","_","_"
5,"_","_","_","śa","PPP","","_","_"
6,"_","_","_","ātman","NC","","_","_"
7,"namaḥ","_","_","namas","NC","","_","_"
1,"yasmin","_","_","yad","PRL","","_","_"
2,"sarvaṃ","_","_","sarva","JQ","","_","_"
3,"yataḥ","_","_","yatas","CX","","_","_"
4,"sarvaṃ","_","_","sarva","JQ","","_","_"
5,"yaḥ","_","_","yad","PRL","","_","_"
6,"sarvaṃ","_","_","sarva","JQ","","_","_"
7,"_","_","_","sarvatas","CX","","_","_"
8,"_","_","_","ca","CCD","","_","_"
9,"yaḥ","_","_","yad","PRL","","_","_"
1,"_","_","_","yad","PRL","","_","_"
2,"_","_","_","ca","CCD","","_","_"
3,"_","_","_","sarva","JQ","","_","_"
4,"_","_","_","maya","JJ","","_","_"
5,"nityaṃ","_","_","nitya","CX","","_","_"
6,"tasmai","_","_","tad","PRD","","_","_"
7,"sarvātmane","_","_","sarvātman","NC","","_","_"
8,"namaḥ","_","_","namas","NC","","_","_"
1,"_","_","_","viśvakarman","NC","","_","_"
2,"_","_","_","namas","NC","","_","_"
3,"_","_","_","tvat","PPR","","_","_"
4,"'stu","_","_","as","V","as","_","_"
5,"viśvātman","_","_","viśvātman","NC","","_","_"
6,"_","_","_","viśva","JQ","","_","_"
7,"_","_","_","sambhava","NC","","_","_"
1,"apavargo","_","_","apavarga","NC","","_","_"
2,"'si","_","_","as","V","as","_","_"
3,"bhūtānāṃ","_","_","bhūta","NC","","_","_"
4,"pañcānāṃ","_","_","pañcan","NUM","","_","_"
5,"parataḥ","_","_","paratas","CX","","_","_"
6,"sthitaḥ","_","_","sthā","PPP","","_","_"
1,"_","_","_","namas","NC","","_","_"
2,"_","_","_","tvat","PPR","","_","_"
3,"triṣu","_","_","tri","NUM","","_","_"
4,"lokeṣu","_","_","loka","NC","","_","_"
5,"_","_","_","namas","NC","","_","_"
6,"_","_","_","tvat","PPR","","_","_"
7,"_","_","_","paratas","CX","","_","_"
8,"_","_","_","tri","NUM","","_","_"
1,"_","_","_","namas","NC","","_","_"
2,"_","_","_","tvat","PPR","","_","_"
3,"dikṣu","_","_","diś","NC","","_","_"
4,"sarvāsu","_","_","sarva","JQ","","_","_"
5,"tvaṃ","_","_","tvat","PPR","","_","_"
6,"hi","_","_","hi","CX","","_","_"
7,"_","_","_","sarva","JQ","","_","_"
8,"_","_","_","parāyaṇa","NC","","_","_"
1,"_","_","_","namas","NC","","_","_"
2,"_","_","_","tvat","PPR","","_","_"
3,"bhagavan","_","_","bhagavat","NC","","_","_"
4,"viṣṇo","_","_","viṣṇu","NC","","_","_"
5,"lokānāṃ","_","_","loka","NC","","_","_"
6,"_","_","_","prabhava","NC","","_","_"
7,"_","_","_","apyaya","NC","","_","_"
1,"tvaṃ","_","_","tvat","PPR","","_","_"
2,"hi","_","_","hi","CX","","_","_"
3,"kartā","_","_","kartṛ","NC","","_","_"
4,"hṛṣīkeśa","_","_","hṛṣīkeśa","NC","","_","_"
5,"saṃhartā","_","_","saṃhartṛ","JJ","","_","_"
6,"_","_","_","ca","CCD","","_","_"
7,"_","_","_","aparājita","JJ","","_","_"
1,"tena","_","_","ta","CX","","_","_"
2,"paśyāmi","_","_","paś","V","paś","_","_"
3,"te","_","_","tvat","PPR","","_","_"
4,"divyān","_","_","divya","JJ","","_","_"
5,"bhāvān","_","_","bhāva","NC","","_","_"
6,"hi","_","_","hi","CX","","_","_"
7,"triṣu","_","_","tri","NUM","","_","_"
8,"vartmasu","_","_","vartman","NC","","_","_"
1,"_","_","_","tad","PRD","","_","_"
2,"_","_","_","ca","CCD","","_","_"
3,"paśyāmi","_","_","paś","V","paś","_","_"
4,"tattvena","_","_","tattva","NC","","_","_"
5,"yat","_","_","yad","PRL","","_","_"
6,"te","_","_","tvat","PPR","","_","_"
7,"rūpaṃ","_","_","rūpa","NC","","_","_"
8,"sanātanam","_","_","sanātana","JJ","","_","_"
1,"divaṃ","_","_","diva","NC","","_","_"
2,"te","_","_","tvat","PPR","","_","_"
3,"śirasā","_","_","śiras","NC","","_","_"
4,"vyāptaṃ","_","_","vyāp","PPP","","_","_"
5,"padbhyāṃ","_","_","pad","NC","","_","_"
6,"devī","_","_","devī","NC","","_","_"
7,"vasuṃdharā","_","_","vasuṃdharā","NC","","_","_"
1,"vikrameṇa","_","_","vikrama","NC","","_","_"
2,"trayo","_","_","tri","NUM","","_","_"
3,"lokāḥ","_","_","loka","NC","","_","_"
4,"puruṣo","_","_","puruṣa","NC","","_","_"
5,"'si","_","_","as","V","as","_","_"
6,"sanātanaḥ","_","_","sanātana","JJ","","_","_"
1,"_","_","_","atasī","NC","","_","_"
2,"_","_","_","puṣpa","NC","","_","_"
3,"_","_","_","saṃkāśa","NC","","_","_"
4,"_","_","_","pīta","JJ","","_","_"
5,"_","_","_","vāsas","NC","","_","_"
6,"acyutam","_","_","acyuta","NC","","_","_"
1,"ye","_","_","yad","PRL","","_","_"
2,"namasyanti","_","_","namasy","V","namasy","_","_"
3,"govindaṃ","_","_","govinda","NC","","_","_"
4,"na","_","_","na","CNG","","_","_"
5,"teṣāṃ","_","_","tad","PRD","","_","_"
6,"vidyate","_","_","vid","V","vid","_","_"
7,"bhayam","_","_","bhaya","NC","","_","_"
1,"yathā","_","_","yathā","CCM","","_","_"
2,"_","_","_","viṣṇu","NC","","_","_"
3,"_","_","_","maya","JJ","","_","_"
4,"satyaṃ","_","_","satya","NC","","_","_"
5,"yathā","_","_","yathā","CCM","","_","_"
6,"_","_","_","viṣṇu","NC","","_","_"
7,"_","_","_","maya","JJ","","_","_"
8,"haviḥ","_","_","havis","NC","","_","_"
1,"yathā","_","_","yathā","CCM","","_","_"
2,"_","_","_","viṣṇu","NC","","_","_"
3,"_","_","_","maya","JJ","","_","_"
4,"sarvaṃ","_","_","sarva","JQ","","_","_"
5,"pāpmā","_","_","pāpman","NC","","_","_"
6,"me","_","_","mat","PPR","","_","_"
7,"naśyatāṃ","_","_","naś","V","naś","_","_"
8,"tathā","_","_","tathā","CX","","_","_"
1,"tvāṃ","_","_","tvat","PPR","","_","_"
2,"prapannāya","_","_","prapad","PPP","","_","_"
3,"bhaktāya","_","_","bhakta","NC","","_","_"
4,"gatim","_","_","gati","NC","","_","_"
5,"iṣṭāṃ","_","_","iṣ","PPP","","_","_"
6,"jigīṣave","_","_","jigīṣu","JJ","","_","_"
1,"_","_","_","yad","PRL","","_","_"
2,"_","_","_","śreyas","NC","","_","_"
3,"puṇḍarīkākṣa","_","_","puṇḍarīkākṣa","NC","","_","_"
4,"tad","_","_","tad","PRD","","_","_"
5,"dhyāyasva","_","_","dhyāy","V","dhyai","_","_"
6,"surottama","_","_","surottama","NC","","_","_"
1,"iti","_","_","iti","CQT","","_","_"
2,"_","_","_","vidyā","NC","","_","_"
3,"_","_","_","tapas","NC","","_","_"
4,"_","_","_","yoni","NC","","_","_"
5,"ayonir","_","_","ayoni","JJ","","_","_"
6,"viṣṇur","_","_","viṣṇu","NC","","_","_"
7,"īḍitaḥ","_","_","īḍ","PPP","","_","_"
1,"_","_","_","vāc","NC","","_","_"
2,"_","_","_","yajña","NC","","_","_"
3,"_","_","_","arcay","PPP","","_","_"
4,"devaḥ","_","_","deva","NC","","_","_"
5,"prīyatāṃ","_","_","prī","V","prī","_","_"
6,"me","_","_","mat","PPR","","_","_"
7,"janārdanaḥ","_","_","janārdana","NC","","_","_"
1,"etāvad","_","_","etāvat","JJ","","_","_"
2,"uktvā","_","_","vac","CGDA","","_","_"
3,"vacanaṃ","_","_","vacana","NC","","_","_"
4,"_","_","_","bhīṣma","NC","","_","_"
5,"_","_","_","tad","PRD","","_","_"
6,"_","_","_","ga","PPP","","_","_"
7,"_","_","_","mānasa","NC","","_","_"
1,"nama","_","_","namas","NC","","_","_"
2,"_","_","_","iti","CQT","","_","_"
3,"_","_","_","eva","CEM","","_","_"
4,"kṛṣṇāya","_","_","kṛṣṇa","NC","","_","_"
5,"praṇāmam","_","_","praṇāma","NC","","_","_"
6,"akarot","_","_","kar","V","kṛ","_","_"
7,"tadā","_","_","tadā","CAD","","_","_"
1,"abhigamya","_","_","abhiga","CGDA","","_","_"
2,"tu","_","_","tu","CCD","","_","_"
3,"yogena","_","_","yoga","NC","","_","_"
4,"bhaktiṃ","_","_","bhakti","NC","","_","_"
5,"bhīṣmasya","_","_","bhīṣma","NC","","_","_"
6,"mādhavaḥ","_","_","mādhava","NC","","_","_"
1,"_","_","_","traikālya","NC","","_","_"
2,"_","_","_","darśana","NC","","_","_"
3,"jñānaṃ","_","_","jñāna","NC","","_","_"
4,"divyaṃ","_","_","divya","JJ","","_","_"
5,"dātuṃ","_","_","dā","CGDI","","_","_"
6,"yayau","_","_","yā","V","yā","_","_"
7,"hariḥ","_","_","hari","NC","","_","_"
1,"tasmin","_","_","tad","PRD","","_","_"
2,"uparate","_","_","upara","PPP","","_","_"
3,"śabde","_","_","śabda","NC","","_","_"
4,"_","_","_","tatas","CX","","_","_"
5,"_","_","_","tad","PRD","","_","_"
6,"_","_","_","brahman","NC","","_","_"
7,"_","_","_","vādin","JJ","","_","_"
1,"bhīṣmaṃ","_","_","bhīṣma","NC","","_","_"
2,"vāgbhir","_","_","vāc","NC","","_","_"
3,"_","_","_","bāṣpa","NC","","_","_"
4,"_","_","_","kaṇṭha","NC","","_","_"
5,"_","_","_","tad","PRD","","_","_"
6,"ānarcur","_","_","arc","V","arc","_","_"
7,"_","_","_","mahat","JJ","","_","_"
8,"_","_","_","mati","NC","","_","_"
1,"te","_","_","tad","PRD","","_","_"
2,"_","_","_","stu","KDP","","_","_"
3,"_","_","_","ca","CCD","","_","_"
4,"_","_","_","vipra","NC","","_","_"
5,"_","_","_","agrya","JJ","","_","_"
6,"keśavaṃ","_","_","keśava","NC","","_","_"
7,"puruṣottamam","_","_","puruṣottama","NC","","_","_"
1,"bhīṣmaṃ","_","_","bhīṣma","NC","","_","_"
2,"ca","_","_","ca","CCD","","_","_"
3,"śanakaiḥ","_","_","śanakais","CX","","_","_"
4,"sarve","_","_","sarva","JQ","","_","_"
5,"praśaśaṃsuḥ","_","_","praśaṃs","V","praśaṃs","_","_"
6,"punaḥ","_","_","punar","CAD","","_","_"
7,"punaḥ","_","_","punar","CAD","","_","_"
1,"viditvā","_","_","vid","CGDA","","_","_"
2,"_","_","_","bhakti","NC","","_","_"
3,"_","_","_","yoga","NC","","_","_"
4,"tu","_","_","tu","CCD","","_","_"
5,"bhīṣmasya","_","_","bhīṣma","NC","","_","_"
6,"puruṣottamaḥ","_","_","puruṣottama","NC","","_","_"
1,"_","_","_","sahas","NC","","_","_"
2,"_","_","_","utthā","CGDA","","_","_"
3,"saṃhṛṣṭo","_","_","saṃhṛṣ","PPP","","_","_"
4,"yānam","_","_","yāna","NC","","_","_"
5,"_","_","_","eva","CEM","","_","_"
6,"_","_","_","anupad","V","anupad","_","_"
1,"keśavaḥ","_","_","keśava","NC","","_","_"
2,"_","_","_","sātyaki","NC","","_","_"
3,"_","_","_","ca","CCD","","_","_"
4,"_","_","_","eva","CEM","","_","_"
5,"_","_","_","ratha","NC","","_","_"
6,"_","_","_","eka","PPX","","_","_"
7,"jagmatuḥ","_","_","ga","V","ga","_","_"
1,"apareṇa","_","_","apara","PPX","","_","_"
2,"mahātmānau","_","_","mahātman","JJ","","_","_"
3,"_","_","_","yudhiṣṭhira","NC","","_","_"
4,"_","_","_","dhanaṃjaya","NC","","_","_"
1,"bhīmaseno","_","_","bhīmasa","NC","","_","_"
2,"yamau","_","_","yama","NC","","_","_"
3,"_","_","_","ca","CCD","","_","_"
4,"_","_","_","ubh","PPX","","_","_"
5,"ratham","_","_","ratha","NC","","_","_"
6,"ekaṃ","_","_","eka","PPX","","_","_"
7,"samāsthitau","_","_","samāsthā","PPP","","_","_"
1,"kṛpo","_","_","kṛpa","NC","","_","_"
2,"yuyutsuḥ","_","_","yuyutsu","NC","","_","_"
3,"_","_","_","sūta","NC","","_","_"
4,"_","_","_","ca","CCD","","_","_"
5,"_","_","_","saṃjaya","NC","","_","_"
6,"_","_","_","ca","CCD","","_","_"
7,"_","_","_","apara","PPX","","_","_"
8,"ratham","_","_","ratha","NC","","_","_"
1,"te","_","_","tad","PRD","","_","_"
2,"rathair","_","_","ratha","NC","","_","_"
3,"_","_","_","nagara","NC","","_","_"
4,"_","_","_","ākāra","NC","","_","_"
5,"prayātāḥ","_","_","prayā","PPP","","_","_"
6,"_","_","_","puruṣa","NC","","_","_"
7,"_","_","_","ṛṣabha","NC","","_","_"
1,"_","_","_","nemi","NC","","_","_"
2,"_","_","_","ghoṣa","NC","","_","_"
3,"mahatā","_","_","mahat","JJ","","_","_"
4,"kampayanto","_","_","kampay","KDP","","_","_"
5,"vasuṃdharām","_","_","vasuṃdharā","NC","","_","_"
1,"tato","_","_","tatas","CX","","_","_"
2,"giraḥ","_","_","gir","NC","","_","_"
3,"_","_","_","puruṣa","NC","","_","_"
4,"_","_","_","vara","JJ","","_","_"
5,"_","_","_","tvat","PPR","","_","_"
6,"_","_","_","anvita","JJ","","_","_"
7,"_","_","_","dvija","NC","","_","_"
8,"_","_","_","īray","PPP","","_","_"
9,"pathi","_","_","pathin","NC","","_","_"
10,"_","_","_","su","CAD","","_","_"
11,"_","_","_","manas","NC","","_","_"
12,"sa","_","_","tad","PRD","","_","_"
13,"śuśruve","_","_","śṛṇ","V","śru","_","_"
1,"kṛtāñjaliṃ","_","_","kṛtāñjali","JJ","","_","_"
2,"praṇatam","_","_","praṇa","PPP","","_","_"
3,"_","_","_","atha","CAD","","_","_"
4,"_","_","_","apara","PPX","","_","_"
5,"janaṃ","_","_","jana","NC","","_","_"
6,"sa","_","_","tad","PRD","","_","_"
7,"_","_","_","keśin","NC","","_","_"
8,"_","_","_","han","JJ","","_","_"
9,"_","_","_","mud","PPP","","_","_"
10,"_","_","_","manas","NC","","_","_"
11,"_","_","_","abhinand","V","abhinand","_","_"
