"WordID","word","NormSTEM","suffix","lemma","PoS","Root","NormSuffix","NormWord"
1,"idam","_","_","ida","PRD","","_","_"
2,"ugrāya","_","_","ugra","JJ","","_","_"
3,"babhrave","_","_","babhru","JJ","","_","_"
4,"namo","_","_","namas","NC","","_","_"
5,"yo","_","_","yad","PRL","","_","_"
6,"akṣeṣu","_","_","akṣa","NC","","_","_"
7,"_","_","_","tanū","NC","","_","_"
8,"_","_","_","vaśin","JJ","","_","_"
1,"ghṛtena","_","_","ghṛta","NC","","_","_"
2,"kaliṃ","_","_","kali","NC","","_","_"
3,"śikṣāmi","_","_","śikṣ","V","śikṣ","_","_"
4,"sa","_","_","tad","PRD","","_","_"
5,"no","_","_","mat","PPR","","_","_"
6,"_","_","_","mṛḍ","V","mṛḍ","_","_"
7,"_","_","_","īdṛśa","JJ","","_","_"
1,"ghṛtam","_","_","ghṛta","NC","","_","_"
2,"apsarābhyo","_","_","apsaras","NC","","_","_"
3,"vaha","_","_","vah","V","vah","_","_"
4,"tvam","_","_","tvat","PPR","","_","_"
5,"agne","_","_","agni","NC","","_","_"
6,"pāṃsūn","_","_","pāṃsu","NC","","_","_"
7,"akṣebhyaḥ","_","_","akṣa","NC","","_","_"
8,"sikatā","_","_","sikatā","NC","","_","_"
9,"apaś","_","_","ap","NC","","_","_"
10,"ca","_","_","ca","CCD","","_","_"
1,"_","_","_","yathā","CCM","","_","_"
2,"_","_","_","bhaga","NC","","_","_"
3,"_","_","_","havya","NC","","_","_"
4,"_","_","_","dāti","NC","","_","_"
5,"juṣāṇā","_","_","juṣ","KDP","","_","_"
6,"madanti","_","_","mat","V","mat","_","_"
7,"devā","_","_","deva","NC","","_","_"
8,"ubhayāni","_","_","ubhaya","JJ","","_","_"
9,"havyā","_","_","havya","NC","","_","_"
1,"apsarasaḥ","_","_","apsaras","NC","","_","_"
2,"sadhamādaṃ","_","_","sadhamāda","NC","","_","_"
3,"madanti","_","_","mat","V","mat","_","_"
4,"havirdhānam","_","_","havirdhāna","NC","","_","_"
5,"antarā","_","_","antarā","CX","","_","_"
6,"sūryaṃ","_","_","sūrya","NC","","_","_"
7,"ca","_","_","ca","CCD","","_","_"
1,"tā","_","_","tad","PRD","","_","_"
2,"me","_","_","mat","PPR","","_","_"
3,"hastau","_","_","hasta","NC","","_","_"
4,"saṃ","_","_","sa","CADP","","_","_"
5,"sṛjantu","_","_","sṛj","V","sṛj","_","_"
6,"ghṛtena","_","_","ghṛta","NC","","_","_"
7,"sapatnaṃ","_","_","sapatna","NC","","_","_"
8,"me","_","_","mat","PPR","","_","_"
9,"kitavam","_","_","kitava","NC","","_","_"
10,"randhayantu","_","_","randhay","V","randhay","_","_"
1,"ādinavaṃ","_","_","ādinava","NC","","_","_"
2,"pratidīvne","_","_","pratidīvan","NC","","_","_"
3,"_","_","_","ghṛta","NC","","_","_"
4,"_","_","_","mat","PPR","","_","_"
5,"abhikṣara","_","_","abhikṣar","V","abhikṣar","_","_"
1,"vṛkṣam","_","_","vṛkṣa","NC","","_","_"
2,"_","_","_","iva","CCM","","_","_"
3,"_","_","_","aśani","NC","","_","_"
4,"jahi","_","_","han","V","han","_","_"
5,"yo","_","_","yad","PRL","","_","_"
6,"asmān","_","_","mat","PPR","","_","_"
7,"pratidīvyati","_","_","pratidīv","V","pratidīv","_","_"
1,"yo","_","_","yad","PRL","","_","_"
2,"no","_","_","mat","PPR","","_","_"
3,"dyuve","_","_","dhana","NC","","_","_"
4,"dhanam","_","_","ida","PRD","","_","_"
5,"idaṃ","_","_","kar","V","kṛ","_","_"
6,"cakāra","_","_","yad","PRL","","_","_"
7,"yo","_","_","akṣa","NC","","_","_"
8,"akṣāṇāṃ","_","_","glahana","NC","","_","_"
9,"glahanaṃ","_","_","śeṣaṇa","NC","","_","_"
10,"śeṣaṇaṃ","_","_","ca","CCD","","_","_"
1,"sa","_","_","tad","PRD","","_","_"
2,"no","_","_","mat","PPR","","_","_"
3,"devo","_","_","deva","NC","","_","_"
4,"havir","_","_","havis","NC","","_","_"
5,"idaṃ","_","_","ida","PRD","","_","_"
6,"juṣāṇo","_","_","juṣ","KDP","","_","_"
7,"gandharvebhiḥ","_","_","gandharva","NC","","_","_"
8,"sadhamādaṃ","_","_","sadhamāda","NC","","_","_"
9,"madema","_","_","mand","V","mand","_","_"
1,"saṃvasava","_","_","saṃvasu","NC","","_","_"
2,"iti","_","_","iti","CQT","","_","_"
3,"vo","_","_","tvat","PPR","","_","_"
4,"nāmadheyam","_","_","nāmadheya","NC","","_","_"
5,"ugraṃpaśyā","_","_","ugrampaśya","JJ","","_","_"
6,"_","_","_","rāṣṭra","NC","","_","_"
7,"_","_","_","bhṛt","JJ","","_","_"
8,"hy","_","_","hi","CX","","_","_"
9,"akṣāḥ","_","_","akṣa","NC","","_","_"
1,"tebhyo","_","_","tad","PRD","","_","_"
2,"va","_","_","tvat","PPR","","_","_"
3,"indavo","_","_","indu","NC","","_","_"
4,"haviṣā","_","_","havis","NC","","_","_"
5,"vidhema","_","_","vidh","V","vidh","_","_"
6,"vayaṃ","_","_","mat","PPR","","_","_"
7,"syāma","_","_","as","V","as","_","_"
8,"patayo","_","_","pati","NC","","_","_"
9,"rayīṇām","_","_","rayi","NC","","_","_"
1,"devān","_","_","deva","NC","","_","_"
2,"yan","_","_","yat","CSB","","_","_"
3,"nāthito","_","_","nāth","PPP","","_","_"
4,"huve","_","_","hvā","V","hvā","_","_"
5,"brahmacaryaṃ","_","_","brahmacarya","NC","","_","_"
6,"yad","_","_","yat","CSB","","_","_"
7,"ūṣima","_","_","vas","V","vas","_","_"
1,"akṣān","_","_","akṣa","NC","","_","_"
2,"yad","_","_","yat","CSB","","_","_"
3,"babhrūn","_","_","babhru","JJ","","_","_"
4,"ālabhe","_","_","ālabh","V","ālabh","_","_"
5,"te","_","_","tad","PRD","","_","_"
6,"no","_","_","mat","PPR","","_","_"
7,"mṛḍantv","_","_","mṛḍ","V","mṛḍ","_","_"
8,"īdṛśe","_","_","īdṛśa","JJ","","_","_"
