"WordID","word","NormSTEM","suffix","lemma","PoS","Root","NormSuffix","NormWord"
"","<s number = ""1"">","","","","","","",""
"1","ādi","ĀD","i","ādi","noun-adj","","i","ādi"
"2","anātha","ANĀTH","a","anātha","noun-adj","","a","anātha"
"3","anuttara","ANUTTAR","a","anuttara","noun-adj","","a","anuttara"
"4","prakāśa","PRAKĀŚ","a","prakāśa","noun-adj","","a","prakāśa"
"5","pañcāśikā","PAÑCĀŚIK","ā","pañcāśikā","noun-adj","","ā","pañcāśikā"
"6","om","","","oṃ","ind","","","oṃ"
"7","namaḥ","NAM","aḥ","namas","noun-adj","","aḥ","namaḥ"
"8","anuttara","ANUTTAR","a","anuttara","noun-adj","","a","anuttara"
"9","prakāśa","PRAKĀŚ","a","prakāśa","noun-adj","","a","prakāśa"
"10","śaṅkarāya","ŚAṄKAR","āya","śaṅkara","","","āya","śaṅkarāya"
"11","a","","","alpha_privativum","ind","","","alpha_privativum"
"12","kṛtrima","KṚTRIM","a","kṛtrima","noun-adj","","a","kṛtrima"
"13","aham","AHAM","","mat","pron","","","aham"
"14","āmarśa","ĀMARŚ","a","āmarśa","noun-adj","","a","āmarśa"
"15","prakāśa","PRAKĀŚ","a","prakāśa","noun-adj","","a","prakāśa"
"16","eka","EK","a","eka","noun-adj","","a","eka"
"17","ghanaḥ","GHAN","aḥ","ghana","noun-adj","","aḥ","ghanaḥ"
"18","śivaḥ","ŚIV","aḥ","śiva","noun-adj","","aḥ","śivaḥ"
"19","śaktyā","ŚAKT","yā","śakti","noun-adj","","yāḥ","śaktyāḥ"
"20","vimarśa","VIMARŚ","a","vimarśa","noun-adj","","a","vimarśa"
"21","vapuṣā","VAPUṢ","ā","vapuṣa","noun-adj","","āḥ","vapuṣāḥ"
"22","sva","SV","a","sva","noun-adj","","a","sva"
"23","ātmanaḥ","ĀTM","anaḥ","ātman","noun-adj","","anaḥ","ātmanaḥ"
"24","ananya","ANANY","a","ananya","noun-adj","","a","ananya"
"25","rūpayā","RŪPAY","ā","rūpa","noun-adj","","ā","rūpayā"
"26","//","","","","punct","","","//"
"","</s>","","","","","","",""
"","<s number = ""2"">","","","","","","",""
"1","śiva","ŚIV","a","śiva","noun-adj","","a","śiva"
"2","ādi","ĀD","i","ādi","noun-adj","","i","ādi"
"3","kṣiti","KṢIT","i","kṣiti","noun-adj","","i","kṣiti"
"4","paryantam","PARYANT","am","paryanta","noun-adj","","am","paryantam"
"5","viśvam","VIŚV","am","viśva","noun-adj","","am","viśvam"
"6","vapuḥ","VAP","uḥ","vapu","noun-adj","","uḥ","vapuḥ"
"7","udañcayan","UDAÑCAY","an","udañcay","","","ān","udañcayān"
"8","pañca","PAÑC","a","pañca","noun-adj","","a","pañca"
"9","kṛtya","KṚTY","a","kṛtya","noun-adj","","a","kṛtya"
"10","mahā","MAH","ā","mahat","","","ā","mahā"
"11","nāṭya","NĀṬY","a","nāṭya","","","a","nāṭya"
"12","rasikaḥ","RASIK","aḥ","rasika","noun-adj","","aḥ","rasikaḥ"
"13","krīḍati","KRĪḌ","ati","krīḍ","verb","krīḍ","ati","krīḍati"
"14","prabhuḥ","PRABH","uḥ","prabhu","noun-adj","","uḥ","prabhuḥ"
"15","//","","","","punct","","","//"
"","</s>","","","","","","",""
"","<s number = ""3"">","","","","","","",""
"1","pṛthak","PṚTHAK","","pṛthak","noun-adj","","","pṛthak"
"2","artham","ARTH","am","artha","noun-adj","","am","artham"
"3","arthavat","ARTH","avat","arthavat","noun-adj","","avat","arthavat"
"4","tā","","","tad","pron","","","tad"
"5","viśva","VIŚV","a","viśva","noun-adj","","a","viśva"
"6","viśva","VIŚV","a","viśva","noun-adj","","a","viśva"
"7","śarīrayoḥ","ŚARĪR","ayoḥ","śarīra","noun-adj","","ayoḥ","śarīrayoḥ"
"8","na","","","na","ind","","","na"
"9","viśva","VIŚV","a","viśva","noun-adj","","a","viśva"
"10","viśva","VIŚV","a","viśva","noun-adj","","a","viśva"
"11","vapuṣoḥ","VAPUṢ","oḥ","vapuṣu","noun-adj","","oḥ","vapuṣoḥ"
"12","bhinna","BHINN","a","bhinna","noun-adj","","a","bhinna"
"13","tā","","","tad","pron","","","tad"
"14","kā","","","kim","pron","","","kim"
"15","api","","","api","ind","","","api"
"16","tāttvikī","TĀTTVIK","ī","tāttvika","noun-adj","","ī","tāttvikī"
"17","//","","","","punct","","","//"
"","</s>","","","","","","",""
"","<s number = ""4"">","","","","","","",""
"1","bhede","BHED","e","bheda","noun-adj","","e","bhede"
"2","sattā","SATT","ā","sattā","noun-adj","","ā","sattā"
"3","sphurat","SPHUR","at","sphurat","noun-adj","","at","sphurat"
"4","tābhyām","","","tad","pron","","","tad"
"5","bhinnam","BHINN","am","bhinna","noun-adj","","am","bhinnam"
"6","kim","","","kim","pron","","","kim"
"7","tu","","","tu","ind","","","tu"
"8","jagat","JAGAT","","jagat","noun-adj","","","jagat"
"9","bhavet","BHAV","et","bhav","verb","bhū","et","bhavet"
"10","sattā","SATT","ā","sattā","noun-adj","","ā","sattā"
"11","sphurattā","SPHUR","attā","sphura","noun-adj","","attā","sphurattā"
"12","saṃbandhāt","SAṂBANDH","āt","saṃbandha","noun-adj","","āt","saṃbandhāt"
"13","satta","SATT","a","sattā","noun-adj","","a","sattā"
"14","ābhānam","ABHĀN","am","abhāna","noun-adj","","am","abhānam"
"15","ca","","","ca","ind","","","ca"
"16","tat","TAT","","tad","pron","","","tat"
"17","na","","","na","ind","","","na"
"18","ced","","","ced","ind","","","ced"
"19","//","","","","punct","","","//"
"","</s>","","","","","","",""
"","<s number = ""5"">","","","","","","",""
"1","asataḥ","ASAT","aḥ","asatī","noun-adj","","aḥ","asataḥ"
"2","kim","","","kim","pron","","","kim"
"3","sataḥ","SAT","aḥ","sat","noun-adj","","aḥ","sataḥ"
"4","tābhyām","","","tad","pron","","","tad"
"5","saṃbandhaḥ","SAṂBANDH","aḥ","saṃbandha","noun-adj","","aḥ","saṃbandhaḥ"
"6","saḥ","","","tad","pron","","","tad"
"7","ayam","AYAM","","idam","pron","","","ayam"
"8","iṣyate","IṢ","yate","iṣ","verb","iṣ","yate","iṣyate"
"9","sva","SV","a","sva","noun-adj","","a","sva"
"10","rūpa","RŪP","a","rūpa","noun-adj","","a","rūpa"
"11","lābha","LĀBH","a","lābha","noun-adj","","a","lābha"
"12","sulabhaḥ","SULABH","aḥ","sulabha","noun-adj","","aḥ","sulabhaḥ"
"13","saṃbandhaḥ","SAṂBANDH","aḥ","saṃbandha","noun-adj","","aḥ","saṃbandhaḥ"
"14","na","","","na","ind","","","na"
"15","hi","","","hi","ind","","","hi"
"16","avastunaḥ","AVAST","unaḥ","avastu","noun-adj","","unaḥ","avastunaḥ"
"17","//","","","","punct","","","//"
"","</s>","","","","","","",""
"","<s number = ""6"">","","","","","","",""
"1","na","","","na","ind","","","na"
"2","labdha","LABDH","a","labdha","noun-adj","","a","labdha"
"3","rūpa","RŪP","a","rūpa","noun-adj","","a","rūpa"
"4","saṃbandhe","SAṂBANDH","e","saṃbandha","noun-adj","","e","saṃbandhe"
"5","tābhyām","","","tad","pron","","","tad"
"6","kim","","","kim","pron","","","kim"
"7","cit","CIT","","cid","noun-adj","","","cit"
"8","upekṣyate","UPEKṢ","yate","upaīkṣ","verb","upaīkṣ","yate","upekṣyate"
"9","upekṣāyām","UPEKṢĀY","ām","upekṣā","noun-adj","","ām","upekṣāyām"
"10","avasthānam","AVASTHĀN","am","avasthāna","noun-adj","","am","avasthānam"
"11","na","","","na","ind","","","na"
"12","syāt","","","as","verb","as","",""
"13","etasya","","","tad","pron","","","tad"
"14","kim","","","kim","pron","","","kim"
"15","cana","CAN","a","cana","noun-adj","","a","cana"
"16","//","","","","punct","","","//"
"","</s>","","","","","","",""
"","<s number = ""7"">","","","","","","",""
"1","svabhāvataḥ","SVABHĀV","ataḥ","svabhāva","noun-adj","","ataḥ","svabhāvataḥ"
"2","sphurat","SPHUR","at","sphurat","noun-adj","","at","sphurat"
"3","tā","","","tad","pron","","","tad"
"4","ca","","","ca","ind","","","ca"
"5","sattā","SATT","ā","sattā","noun-adj","","ā","sattā"
"6","ca","","","ca","ind","","","ca"
"7","na","","","na","ind","","","na"
"8","vināśinī","VINĀŚ","inī","vināśin","noun-adj","","inī","vināśinī"
"9","vināśa","VINĀŚ","a","vināśa","noun-adj","","a","vināśa"
"10","anabhupagame","","","","","","",""
"11","jaḍatā","JAḌ","atā","jaḍatā","noun-adj","","atām","jaḍatām"
"12","api","","","api","ind","","","api"
"13","nivartate","NIVART","ate","nivart","verb","nivṛt","ate","nivartate"
"14","//","","","","punct","","","//"
"","</s>","","","","","","",""
"","<s number = ""8"">","","","","","","",""
"1","tatas","","","tatas","ind","","","tatas"
"2","gati","GAT","i","gati","noun-adj","","i","gati"
"3","antara","ANTAR","a","antara","noun-adj","","a","antara"
"4","abhāvāt","ABHĀV","āt","abhāva","noun-adj","","āt","abhāvāt"
"5","cit","CIT","","cid","noun-adj","","","cit"
"6","eva","","","eva","ind","","","eva"
"7","pariśiṣyate","PARIŚIṢY","ate","pariśās","verb","pariśās","ate","pariśiṣyate"
"8","sataḥ","SAT","aḥ","sat","noun-adj","","aḥ","sataḥ"
"9","cit","CIT","","cid","noun-adj","","","cit"
"10","aikyam","AIKY","am","aikya","noun-adj","","am","aikyam"
"11","prakṛtam","PRAKṚT","am","prakṛta","noun-adj","","am","prakṛtam"
"12","kadā","KAD","ā","kadā","noun-adj","","ā","kadā"
"13","cit","CIT","","cid","noun-adj","","","cit"
"14","na","","","na","ind","","","na"
"15","nivartate","NIVART","ate","nivart","verb","nivṛt","ate","nivartate"
"16","//","","","","punct","","","//"
"","</s>","","","","","","",""
"","<s number = ""9"">","","","","","","",""
"1","prakāśe","PRAKĀŚ","e","prakāśa","noun-adj","","e","prakāśe"
"2","ananyatas","ANANYAT","as","ananyatā","","","aḥ","ananyataḥ"
"3","bhāvaḥ","BHĀV","aḥ","bhāva","noun-adj","","aḥ","bhāvaḥ"
"4","svātantrya","SVĀTANTRY","a","svātantrya","noun-adj","","a","svātantrya"
"5","ullāsa","ULLĀS","a","ullāsa","noun-adj","","a","ullāsa"
"6","kevalaḥ","KEVAL","aḥ","kevala","noun-adj","","aḥ","kevalaḥ"
"7","parichinna","PARICHI","nna","parichia","","","nna","parichinna"
"8","ātmikā","ĀTM","ikā","ātmika","noun-adj","","ikā","ātmikā"
"9","śaktiḥ","ŚAKT","iḥ","śakti","noun-adj","","iḥ","śaktiḥ"
"10","śambhoḥ","ŚAMBH","oḥ","śambhu","noun-adj","","oḥ","śambhoḥ"
"11","viśva","VIŚV","a","viśva","noun-adj","","a","viśva"
"12","atiśāyinaḥ","ATIŚĀY","inaḥ","atiśāyin","noun-adj","","inaḥ","atiśāyinaḥ"
"13","//","","","","punct","","","//"
"","</s>","","","","","","",""
"","<s number = ""10"">","","","","","","",""
"1","yat","","","yad","pron","","","yad"
"2","prakāśa","PRAKĀŚ","a","prakāśa","noun-adj","","a","prakāśa"
"3","ātmakam","ĀTM","akam","ātmaka","noun-adj","","akam","ātmakam"
"4","sarvam","SARV","am","sarva","noun-adj","","am","sarvam"
"5","tamaḥ","TAM","aḥ","tama","noun-adj","","aḥ","tamaḥ"
"6","kevala","KEVAL","a","kevala","noun-adj","","a","kevala"
"7","tām","","","tad","pron","","","tad"
"8","gatam","GAT","am","gata","noun-adj","","am","gatam"
"9","yat","","","yad","pron","","","yad"
"10","ca","","","ca","ind","","","ca"
"11","kim","","","kim","pron","","","kim"
"12","cit","CIT","","cid","noun-adj","","","cit"
"13","jagat","JAGAT","","jagat","noun-adj","","","jagat"
"14","etat","ETAT","","tad","pron","","","etat"
"15","prakāśāt","PRAKĀŚ","āt","prakāśa","noun-adj","","āt","prakāśāt"
"16","atiricyate","ATIRIC","yate","atiric","verb","","yate","atiricyate"
"17","//","","","","punct","","","//"
"","</s>","","","","","","",""
"","<s number = ""11"">","","","","","","",""
"1","vimṛśya","VIMṚŚY","a","vimṛśya","noun-adj","","a","vimṛśya"
"2","saraṇīm","SARAṆ","īm","saraṇī","","","īm","saraṇīm"
"3","prāptam","PRĀPT","am","prāpta","noun-adj","","am","prāptam"
"4","iti","","","iti","ind","","","iti"
"5","eṣā","","","tad","pron","","","tad"
"6","tāttvikī","TĀTTVIK","ī","tāttvika","noun-adj","","ī","tāttvikī"
"7","matiḥ","MAT","iḥ","mati","noun-adj","","iḥ","matiḥ"
"8","avabhāsa","AVABHĀS","a","avabhāsa","noun-adj","","a","avabhāsa"
"9","eka","EK","a","eka","noun-adj","","a","eka"
"10","tānānām","TĀN","ānām","tāna","","","ānām","tānānām"
"11","matiḥ","MAT","iḥ","mati","noun-adj","","iḥ","matiḥ"
"12","ekā","EK","ā","eka","noun-adj","","āḥ","ekāḥ"
"13","atra","","","atra","ind","","","atra"
"14","sākṣiṇī","SĀKṢ","iṇī","sākṣin","noun-adj","","inī","sākṣinī"
"15","//","","","","punct","","","//"
"","</s>","","","","","","",""
"","<s number = ""12"">","","","","","","",""
"1","kim","","","kim","pron","","","kim"
"2","pramāṇāiḥ","","","","","","",""
"3","varākaiḥ","VARĀK","aiḥ","varāka","","","air","varākair"
"4","taiḥ","","","tad","pron","","","tad"
"5","cid","","cid","cid","","","cid","cid"
"6","ānupr","ĀNUPR","","ānupra","","","","ānupr"
"7","āṇita","ĀṆ","ita","āṇita","","","ita","āṇita"
"8","ātmabhiḥ","ĀTM","abhiḥ","ātman","noun-adj","","abhiḥ","ātmabhiḥ"
"9","na","","","na","ind","","","na"
"10","hi","","","hi","ind","","","hi"
"11","vaikartanam","VAIKARTAN","am","vaikartana","","","am","vaikartanam"
"12","jyotiḥ","JYOT","iḥ","jyotis","noun-adj","","iḥ","jyotiḥ"
"13","dīpa","DĪP","a","dīpa","noun-adj","","a","dīpa"
"14","ālokam","ĀLOK","am","āloka","noun-adj","","am","ālokam"
"15","apekṣate","APEKṢ","ate","apekṣ","verb","","ate","apekṣate"
"16","//","","","","punct","","","//"
"","</s>","","","","","","",""
"","<s number = ""13"">","","","","","","",""
"1","śaktipāta","ŚAKTIPĀT","a","śaktipāta","","","a","śaktipāta"
"2","pavitre","PAVITR","e","pavitra","noun-adj","","e","pavitre"
"3","asmin","ASMIN","","idam","pron","","","asmin"
"4","dhī","","","dhī","ind","","","dhī"
"5","tattve","TATTV","e","tattva","noun-adj","","e","tattve"
"6","ca","","","ca","ind","","","ca"
"7","parīkṣyatām","PARĪKṢYAT","ām","parīkṣyatā","noun-adj","","ām","parīkṣyatām"
"8","ādarśa","ĀDARŚ","a","ādarśa","noun-adj","","a","ādarśa"
"9","vimalā","VIMAL","ā","vimala","noun-adj","","āḥ","vimalāḥ"
"10","bhoge","BHOG","e","bhoga","noun-adj","","e","bhoge"
"11","na","","","na","ind","","","na"
"12","tu","","","tu","ind","","","tu"
"13","sarvam","SARV","am","sarva","noun-adj","","am","sarvam"
"14","prakāśate","PRAKĀŚ","ate","prakāś","verb","prakāś","ate","prakāśate"
"15","//","","","","punct","","","//"
"","</s>","","","","","","",""
"","<s number = ""14"">","","","","","","",""
"1","ittham","ITTH","am","ittha","noun-adj","","am","ittham"
"2","cit","CIT","","cid","noun-adj","","","cit"
"3","ātmakam","ĀTM","akam","ātmaka","noun-adj","","akam","ātmakam"
"4","sarvam","SARV","am","sarva","noun-adj","","am","sarvam"
"5","ṣaṭ","ṢAṬ","","ṣaṭ","","","","ṣaṭ"
"6","triṃśat","TRIṂŚ","at","triṃśat","","","at","triṃśat"
"7","bheda","BHED","a","bheda","noun-adj","","a","bheda"
"8","tattvataḥ","TATTV","ataḥ","tattva","noun-adj","","ataḥ","tattvataḥ"
"9","ādau","ĀD","au","ādi","noun-adj","","au","ādau"
"10","śuddha","ŚUDDH","a","śuddha","noun-adj","","a","śuddha"
"11","ātmakam","ĀTM","akam","ātmaka","noun-adj","","akam","ātmakam"
"12","tattvam","TATTV","am","tattva","noun-adj","","am","tattvam"
"13","pañca","PAÑC","a","pañca","noun-adj","","a","pañca"
"14","dhā","DH","ā","dhā","noun-adj","","ā","dhā"
"15","tamasaḥ","TAMAS","aḥ","tamas","noun-adj","","aḥ","tamasaḥ"
"16","param","PARAM","","parama","noun-adj","","","param"
"17","//","","","","punct","","","//"
"","</s>","","","","","","",""
"","<s number = ""15"">","","","","","","",""
"1","śivaḥ","ŚIV","aḥ","śiva","noun-adj","","aḥ","śivaḥ"
"2","śaktiḥ","ŚAKT","iḥ","śakti","noun-adj","","iḥ","śaktiḥ"
"3","ca","","","ca","ind","","","ca"
"4","sād","SĀD","","sāda","","","","sād"
"5","ākhyam","ĀKHY","am","ākhya","","","am","ākhyam"
"6","īśaḥ","ĪŚ","aḥ","īśa","noun-adj","","aḥ","īśaḥ"
"7","vidyā","VIDY","ā","vidyā","noun-adj","","ā","vidyā"
"8","iti","","","iti","ind","","","iti"
"9","bhidyate","BHID","yate","bhid","verb","bhid","yate","bhidyate"
"10","akṣa","AKṢ","a","akṣa","noun-adj","","a","akṣa"
"11","ādi","ĀD","i","ādi","noun-adj","","i","ādi"
"12","śānta","ŚĀNT","a","śānta","noun-adj","","a","śānta"
"13","varṇa","VARṆ","a","varṇa","noun-adj","","a","varṇa"
"14","āt","","","","","","",""
"15","māni","MĀN","i","mānin","","","i","māni"
"16","ram","RAM","","rama","","","","ram"
"17","āyi","ĀY","i","āyin","","","i","āyi"
"18","śivena","ŚIV","ena","śiva","noun-adj","","ena","śivena"
"19","tu","","","tu","ind","","","tu"
"20","//","","","","punct","","","//"
"","</s>","","","","","","",""
"","<s number = ""16"">","","","","","","",""
"1","kalā","KAL","ā","kalā","noun-adj","","ā","kalā"
"2","vidyā","VIDY","ā","vidyā","noun-adj","","ā","vidyā"
"3","rāga","RĀG","a","rāga","noun-adj","","a","rāga"
"4","kāla","KĀL","a","kāla","noun-adj","","a","kāla"
"5","niyatiḥ","NIYAT","iḥ","niyati","noun-adj","","iḥ","niyatiḥ"
"6","bandhaḥ","BANDH","aḥ","bandha","noun-adj","","aḥ","bandhaḥ"
"7","ucyate","UC","yate","vak","verb","vac","yate","ucyate"
"8","māyā","MĀY","ā","māyā","noun-adj","","ā","māyā"
"9","pūrvaḥ","PŪRV","aḥ","pūrva","noun-adj","","aḥ","pūrvaḥ"
"10","vakāra","VAKĀR","a","vakāra","noun-adj","","a","vakāra"
"11","ādi","ĀD","i","ādi","noun-adj","","i","ādi"
"12","kṣa","KṢ","a","kṣa","noun-adj","","a","kṣa"
"13","kāra","KĀR","a","kāra","noun-adj","","a","kāra"
"14","anta","ANT","a","anta","noun-adj","","a","anta"
"15","akṣara","AKṢAR","a","akṣara","noun-adj","","a","akṣara"
"16","ātmakaḥ","ĀTM","akaḥ","ātmaka","noun-adj","","akaḥ","ātmakaḥ"
"17","//","","","","punct","","","//"
"","</s>","","","","","","",""
"","<s number = ""17"">","","","","","","",""
"1","pumān","PUM","ān","puma","noun-adj","","ān","pumān"
"2","śaktiḥ","ŚAKT","iḥ","śakti","noun-adj","","iḥ","śaktiḥ"
"3","manaḥ","MAN","aḥ","manas","noun-adj","","aḥ","manaḥ"
"4","buddhiḥ","BUDDH","iḥ","buddhi","noun-adj","","iḥ","buddhiḥ"
"5","ahaṃkāra","AHAṂKĀR","a","ahaṃkāra","noun-adj","","a","ahaṃkāra"
"6","ādi","ĀD","i","ādi","noun-adj","","i","ādi"
"7","pañcakam","PAÑC","akam","pañcaka","noun-adj","","akam","pañcakam"
"8","śrotra","ŚROTR","a","śrotra","noun-adj","","a","śrotra"
"9","ādi","ĀD","i","ādi","noun-adj","","i","ādi"
"10","pañcakam","PAÑC","akam","pañcaka","noun-adj","","akam","pañcakam"
"11","tādi","TĀD","i","tādṛ","noun-adj","","i","tādi"
"12","ṭādi","","","","","","",""
"13","vāc","VĀC","","vāk","noun-adj","","","vāc"
"14","ādi","ĀD","i","ādi","noun-adj","","i","ādi"
"15","pañcakam","PAÑC","akam","pañcaka","noun-adj","","akam","pañcakam"
"16","//","","","","punct","","","//"
"","</s>","","","","","","",""
"","<s number = ""18"">","","","","","","",""
"1","tanmātra","TANMĀTR","a","tanmātra","noun-adj","","a","tanmātra"
"2","pañcakam","PAÑC","akam","pañcaka","noun-adj","","akam","pañcakam"
"3","ca","","","ca","ind","","","ca"
"4","ādi","ĀD","i","ādi","noun-adj","","i","ādi"
"5","kādi","","","","","","",""
"6","vyoma","VYOM","a","vyoma","noun-adj","","a","vyoma"
"7","ādi","ĀD","i","ādi","noun-adj","","i","ādi"
"8","pañcakam","PAÑC","akam","pañcaka","noun-adj","","akam","pañcakam"
"9","sisṛkṣoḥ","SISṚKṢ","oḥ","sisṛkṣu","","","oḥ","sisṛkṣoḥ"
"10","prathama","PRATHAM","a","prathama","noun-adj","","a","prathama"
"11","spandaḥ","SPAND","aḥ","spanda","noun-adj","","aḥ","spandaḥ"
"12","śivatattvam","ŚIVATATTV","am","śivatattva","","","am","śivatattvam"
"13","vibhoḥ","VIBH","oḥ","vibhu","noun-adj","","oḥ","vibhoḥ"
"14","smṛtam","SMṚT","am","smṛta","noun-adj","","am","smṛtam"
"15","//","","","","punct","","","//"
"","</s>","","","","","","",""
"","<s number = ""19"">","","","","","","",""
"1","icchā","ICCH","ā","icchā","noun-adj","","ā","icchā"
"2","eva","","","eva","ind","","","eva"
"3","sa","","","tad","pron","","","tad"
"4","aparimlānā","APARIMLĀN","ā","aparimlāna","","","āḥ","aparimlānāḥ"
"5","śakti","ŚAKT","i","śakti","noun-adj","","i","śakti"
"6","tattvam","TATTV","am","tattva","noun-adj","","am","tattvam"
"7","udañcayan","UDAÑCAY","an","udañcay","","","ān","udañcayān"
"8","sva","SV","a","sva","noun-adj","","a","sva"
"9","icchayā","ICCHAY","ā","icchayā","noun-adj","","ā","icchayā"
"10","a","","","alpha_privativum","ind","","","alpha_privativum"
"11","sūcitam","SŪCIT","am","sūcita","noun-adj","","am","sūcitam"
"12","viśvam","VIŚV","am","viśva","noun-adj","","am","viśvam"
"13","ācchādya","ĀCCHĀDY","a","ācchādya","noun-adj","","a","ācchādya"
"14","āh","","","","","","",""
"15","antayā","ANTAY","ā","antaya","","","āḥ","antayāḥ"
"16","sthitam","STHIT","am","sthita","noun-adj","","am","sthitam"
"17","//","","","","punct","","","//"
"","</s>","","","","","","",""
"","<s number = ""20"">","","","","","","",""
"1","saḥ","","","tad","pron","","","tad"
"2","eva","","","eva","ind","","","eva"
"3","tattvam","TATTV","am","tattva","noun-adj","","am","tattvam"
"4","sād","SĀD","","sāda","","","","sād"
"5","ākhyam","ĀKHY","am","ākhya","","","am","ākhyam"
"6","sarva","SARV","a","sarva","noun-adj","","a","sarva"
"7","anugrahaṇa","ANUGRAHAṆ","a","anugrahaṇa","","","a","anugrahaṇa"
"8","udyatam","UDYAT","am","udyata","noun-adj","","am","udyatam"
"9","saḥ","","","tad","pron","","","tad"
"10","eva","","","eva","ind","","","eva"
"11","īśvara","ĪŚVAR","a","īśvara","noun-adj","","a","īśvara"
"12","tattvam","TATTV","am","tattva","noun-adj","","am","tattvam"
"13","syāt","","","as","verb","as","",""
"14","paśyan","PAŚ","yan","paśyana","noun-adj","","yan","paśyan"
"15","viśvam","VIŚV","am","viśva","noun-adj","","am","viśvam"
"16","idantayā","IDANT","ayā","idantā","noun-adj","","ayā","idantayā"
"17","//","","","","punct","","","//"
"","</s>","","","","","","",""
"","<s number = ""21"">","","","","","","",""
"1","idanta","IDANT","a","idantā","","","a","idantā"
"2","āh","","","","","","",""
"3","antayoḥ","ANTAY","oḥ","antaya","","","oḥ","antayoḥ"
"4","aikyam","AIKY","am","aikya","noun-adj","","am","aikyam"
"5","iti","","","iti","ind","","","iti"
"6","vidyā","VIDY","ā","vidyā","noun-adj","","ā","vidyā"
"7","nigadyate","NIGAD","yate","nigad","verb","nigad","yate","nigadyate"
"8","sva","SV","a","sva","noun-adj","","a","sva"
"9","aṅga","AṄG","a","aṅga","noun-adj","","a","aṅga"
"10","kalpeṣu","KALP","eṣu","kalpa","noun-adj","","eṣu","kalpeṣu"
"11","bhāveṣu","BHĀV","eṣu","bhāva","noun-adj","","eṣu","bhāveṣu"
"12","māyā","MĀY","ā","māyā","noun-adj","","ā","māyā"
"13","tattvam","TATTV","am","tattva","noun-adj","","am","tattvam"
"14","vibheda","VIBHED","a","vibheda","noun-adj","","a","vibheda"
"15","dhīḥ","DH","īḥ","dhī","noun-adj","","īḥ","dhīḥ"
"16","//","","","","punct","","","//"
"","</s>","","","","","","",""
"","<s number = ""22"">","","","","","","",""
"1","māyā","MĀY","ā","māyā","noun-adj","","ā","māyā"
"2","gṛhīta","GṚHĪT","a","gṛhīta","noun-adj","","a","gṛhīta"
"3","saṃkocaḥ","SAṂKOC","aḥ","saṃkoca","noun-adj","","aḥ","saṃkocaḥ"
"4","śivaḥ","ŚIV","aḥ","śiva","noun-adj","","aḥ","śivaḥ"
"5","puṃtattvam","","","","","","",""
"6","ucyate","UC","yate","vak","verb","vac","yate","ucyate"
"7","ayam","AYAM","","idam","pron","","","ayam"
"8","eva","","","eva","ind","","","eva"
"9","hi","","","hi","ind","","","hi"
"10","saṃsārī","SAṂSĀR","ī","saṃsārin","noun-adj","","ī","saṃsārī"
"11","jīvaḥ","JĪV","aḥ","jīva","noun-adj","","aḥ","jīvaḥ"
"12","bhoktā","BHOKT","ā","bhoktṛ","noun-adj","","ā","bhoktā"
"13","eva","","","eva","ind","","","eva"
"14","dṛśyate","DṚŚ","yate","darś","verb","dṛś","yate","dṛśyate"
"15","//","","","","punct","","","//"
"","</s>","","","","","","",""
"","<s number = ""23"">","","","","","","",""
"1","jñatva","JÑ","atva","jñatva","noun-adj","","atva","jñatva"
"2","kartṛtva","KART","ṛtva","kartṛ","noun-adj","","ṛtva","kartṛtva"
"3","pūrṇatva","PŪRṆ","atva","pūrṇatva","noun-adj","","atva","pūrṇatva"
"4","nitya","NITY","a","nitya","noun-adj","","a","nitya"
"5","tvāni","","","","ind","","",""
"6","asya","","","idam","pron","","","idam"
"7","śaktayaḥ","ŚAKT","ayaḥ","śakti","noun-adj","","ayaḥ","śaktayaḥ"
"8","tad","TAD","","tad","pron","","","tad"
"9","saṃkocāt","SAṂKOC","āt","saṃkoca","noun-adj","","āt","saṃkocāt"
"10","saṃkucitaḥ","SAṂKUCIT","aḥ","saṃkucita","noun-adj","","aḥ","saṃkucitaḥ"
"11","kalā","KAL","ā","kalā","noun-adj","","ā","kalā"
"12","ādi","ĀD","i","ādi","noun-adj","","i","ādi"
"13","ātma","ĀTM","a","ātman","noun-adj","","a","ātma"
"14","tayā","","","tad","pron","","","tad"
"15","mataḥ","MAT","aḥ","mata","noun-adj","","aḥ","mataḥ"
"16","//","","","","punct","","","//"
"","</s>","","","","","","",""
"","<s number = ""24"">","","","","","","",""
"1","māyā","MĀY","ā","māyā","noun-adj","","ā","māyā"
"2","ātmakam","ĀTM","akam","ātmaka","noun-adj","","akam","ātmakam"
"3","kalā","KAL","ā","kalā","noun-adj","","ā","kalā"
"4","nāma","NĀM","a","nāman","noun-adj","","a","nāma"
"5","kiṃcitkartṛtva","KIṂCI","tkartṛtva","kiṃcia","","","tkartṛtva","kiṃcitkartṛtva"
"6","kāraṇam","KĀRAṆ","am","kāraṇa","noun-adj","","am","kāraṇam"
"7","kālaḥ","KĀL","aḥ","kāla","noun-adj","","aḥ","kālaḥ"
"8","pariccheda","PARICCHED","a","pariccheda","noun-adj","","a","pariccheda"
"9","karaḥ","KAR","aḥ","kara","noun-adj","","aḥ","karaḥ"
"10","niyatiḥ","NIYAT","iḥ","niyati","noun-adj","","iḥ","niyatiḥ"
"11","ca","","","ca","ind","","","ca"
"12","idam","IDAM","","idam","pron","","","idam"
"13","eva","","","eva","ind","","","eva"
"14","me","","","mat","pron","","","mat"
"15","//","","","","punct","","","//"
"","</s>","","","","","","",""
"","<s number = ""25"">","","","","","","",""
"1","kartavyam","KAR","tavyam","kar","verb","kṛ","tavyam","kartavyam"
"2","na","","","na","ind","","","na"
"3","anyat","ANY","at","anya","pron","","at","anyat"
"4","iti","","","iti","ind","","","iti"
"5","eṣā","","","tad","pron","","","tad"
"6","vyavasthā","VYAVASTH","ā","vyavasthā","noun-adj","","ā","vyavasthā"
"7","yantraṇā","YANTR","aṇā","yantra","noun-adj","","aṇā","yantraṇā"
"8","kṛitiḥ","","","","","","",""
"9","prakṛtiḥ","PRAKṚT","iḥ","prakṛti","noun-adj","","iḥ","prakṛtiḥ"
"10","guṇa","GUṆ","a","guṇa","noun-adj","","a","guṇa"
"11","sāmyam","SĀMY","am","sāmya","noun-adj","","am","sāmyam"
"12","syāt","","","as","verb","as","",""
"13","ahaṃkāra","AHAṂKĀR","a","ahaṃkāra","noun-adj","","a","ahaṃkāra"
"14","ādi","ĀD","i","ādi","noun-adj","","i","ādi"
"15","janma","JANM","a","janma","noun-adj","","a","janma"
"16","bhūḥ","","","bhu","ind","","","bhu"
"17","//","","","","punct","","","//"
"","</s>","","","","","","",""
"","<s number = ""26"">","","","","","","",""
"1","aham","AHAM","","mat","pron","","","aham"
"2","mama","MAM","a","mat","pron","","a","mama"
"3","idam","IDAM","","idam","pron","","","idam"
"4","iti","","","iti","ind","","","iti"
"5","etat","ETAT","","tad","pron","","","etat"
"6","buddhi","BUDDH","i","buddhi","noun-adj","","i","buddhi"
"7","hetuḥ","HET","uḥ","hetu","noun-adj","","uḥ","hetuḥ"
"8","ahaṃkṛtiḥ","AHAṂKṚT","iḥ","ahaṃkṛti","","","iḥ","ahaṃkṛtiḥ"
"9","buddhiḥ","BUDDH","iḥ","buddhi","noun-adj","","iḥ","buddhiḥ"
"10","adhyavasāyasya","ADHYAVASĀY","asya","adhyavasāya","noun-adj","","asya","adhyavasāyasya"
"11","kāraṇam","KĀRAṆ","am","kāraṇa","noun-adj","","am","kāraṇam"
"12","niścaya","NIŚCAY","a","niścaya","noun-adj","","a","niścaya"
"13","ātmanaḥ","ĀTM","anaḥ","ātman","noun-adj","","anaḥ","ātmanaḥ"
"14","//","","","","punct","","","//"
"","</s>","","","","","","",""
"","<s number = ""27"">","","","","","","",""
"1","saṃkalpasya","SAṂKALP","asya","saṃkalpa","noun-adj","","asya","saṃkalpasya"
"2","vikalpasya","VIKALP","asya","vikalpa","noun-adj","","asya","vikalpasya"
"3","bījam","BĪJ","am","bīja","noun-adj","","am","bījam"
"4","manaḥ","MAN","aḥ","manas","noun-adj","","aḥ","manaḥ"
"5","udīryate","UDĪR","yate","udīr","verb","udīr","yate","udīryate"
"6","vacana","VACAN","a","vacana","noun-adj","","a","vacana"
"7","ādeḥ","ĀD","eḥ","ādi","noun-adj","","eḥ","ādeḥ"
"8","ca","","","ca","ind","","","ca"
"9","śabda","ŚABD","a","śabda","noun-adj","","a","śabda"
"10","ādeḥ","ĀD","eḥ","ādi","noun-adj","","eḥ","ādeḥ"
"11","vāc","VĀC","","vāk","noun-adj","","","vāc"
"12","ādi","ĀD","i","ādi","noun-adj","","i","ādi"
"13","śravaṇa","ŚRAVAṆ","a","śravaṇa","noun-adj","","a","śravaṇa"
"14","ādikam","ĀDIK","am","ādika","noun-adj","","am","ādikam"
"15","//","","","","punct","","","//"
"","</s>","","","","","","",""
"","<s number = ""28"">","","","","","","",""
"1","kāraṇam","KĀRAṆ","am","kāraṇa","noun-adj","","am","kāraṇam"
"2","śravaṇa","ŚRAVAṆ","a","śravaṇa","noun-adj","","a","śravaṇa"
"3","ādīnām","ĀD","īnām","ādi","noun-adj","","īnām","ādīnām"
"4","grāhyam","GRĀH","yam","grāhya","noun-adj","","yam","grāhyam"
"5","tanmātra","TANMĀTR","a","tanmātra","noun-adj","","a","tanmātra"
"6","pañcakam","PAÑC","akam","pañcaka","noun-adj","","akam","pañcakam"
"7","ākāśādi","","","","","","",""
"8","avakāśa","AVAKĀŚ","a","avakāśa","noun-adj","","a","avakāśa"
"9","ādi","ĀD","i","ādi","noun-adj","","i","ādi"
"10","kāraṇam","KĀRAṆ","am","kāraṇa","noun-adj","","am","kāraṇam"
"11","bhūta","BHŪT","a","bhūta","noun-adj","","a","bhūta"
"12","pañcakam","PAÑC","akam","pañcaka","noun-adj","","akam","pañcakam"
"13","//","","","","punct","","","//"
"","</s>","","","","","","",""
"","<s number = ""29"">","","","","","","",""
"1","parāpara","PARĀP","ara","parāpa","noun-adj","","ara","parāpara"
"2","aśakti","AŚAKT","i","aśakti","noun-adj","","i","aśakti"
"3","maye","MAY","e","maya","noun-adj","","e","maye"
"4","śuddhe","ŚUDDH","e","śuddha","noun-adj","","e","śuddhe"
"5","vidyā","VIDY","ā","vidyā","noun-adj","","ā","vidyā"
"6","ādi","ĀD","i","ādi","noun-adj","","i","ādi"
"7","pañcakam","PAÑC","akam","pañcaka","noun-adj","","akam","pañcakam"
"8","tat","TAT","","tad","pron","","","tat"
"9","anyat","ANY","at","anya","pron","","at","anyat"
"10","a","","","alpha_privativum","ind","","","alpha_privativum"
"11","parā","PAR","ā","para","","","āḥ","parāḥ"
"12","śaktiḥ","ŚAKT","iḥ","śakti","","","iḥ","śaktiḥ"
"13","iti","","","iti","ind","","","iti"
"14","etat","ETAT","","tad","pron","","","etat"
"15","tattvam","TATTV","am","tattva","noun-adj","","am","tattvam"
"16","īritam","ĪRIT","am","īrita","noun-adj","","am","īritam"
"17","//","","","","punct","","","//"
"","</s>","","","","","","",""
"","<s number = ""30"">","","","","","","",""
"1","iyam","","","idam","pron","","","idam"
"2","devī","DEV","ī","devī","noun-adj","","ī","devī"
"3","parā","PAR","ā","para","noun-adj","","āḥ","parāḥ"
"4","śaktiḥ","ŚAKT","iḥ","śakti","noun-adj","","iḥ","śaktiḥ"
"5","śuddha","ŚUDDH","a","śuddha","noun-adj","","a","śuddha"
"6","aśuddha","AŚUDDH","a","aśuddha","noun-adj","","a","aśuddha"
"7","adhva","ADHV","a","adhvan","noun-adj","","a","adhva"
"8","garbhiṇī","GARBH","iṇī","garbhin","noun-adj","","inī","garbhinī"
"9","pṛthivī","PṚTHIV","ī","pṛthivī","noun-adj","","ī","pṛthivī"
"10","ādīni","ĀD","īni","ādi","noun-adj","","īni","ādīni"
"11","tattvāni","TATTV","āni","tattva","noun-adj","","āni","tattvāni"
"12","ya","","","yad","pron","","","yad"
"13","dāl","DĀL","","dāla","","","","dāl"
"14","īnāni","ĪNĀN","i","īnāni","","","i","īnāni"
"15","kāraṇe","KĀRAṆ","e","kāraṇa","noun-adj","","e","kāraṇe"
"16","//","","","","punct","","","//"
"","</s>","","","","","","",""
"","<s number = ""31"">","","","","","","",""
"1","tadā","","","tadā","ind","","","tadā"
"2","kāraṇa","KĀRAṆ","a","kāraṇa","noun-adj","","a","kāraṇa"
"3","mātrāṇi","MĀTR","āṇi","mātra","noun-adj","","āni","mātrāni"
"4","bahis","BAH","is","bahis","noun-adj","","is","bahis"
"5","udvamate","UDVAM","ate","udvam","verb","","ate","udvamate"
"6","vibhuḥ","VIBH","uḥ","vibhu","noun-adj","","uḥ","vibhuḥ"
"7","anuttara","ANUTTAR","a","anuttara","noun-adj","","a","anuttara"
"8","icche","ICCH","e","iṣ","noun-adj","iṣ","e","icche"
"9","unmeṣe","UNMEṢ","e","unmeṣa","","","e","unmeṣe"
"10","ānanda","ĀNAND","a","ānanda","noun-adj","","a","ānanda"
"11","īśanam","ĪŚAN","am","īśana","","","am","īśanam"
"12","ūna","ŪN","a","ūna","noun-adj","","a","ūna"
"13","tā","","","tad","pron","","","tad"
"14","//","","","","punct","","","//"
"","</s>","","","","","","",""
"","<s number = ""32"">","","","","","","",""
"1","kriyā","KRIY","ā","kriyā","noun-adj","","ā","kriyā"
"2","icchā","ICCH","ā","icchā","noun-adj","","ā","icchā"
"3","jñāna","JÑĀN","a","jñāna","noun-adj","","a","jñāna"
"4","śaktīnām","ŚAKT","īnām","śakti","noun-adj","","īnām","śaktīnām"
"5","sattā","SATT","ā","sattā","noun-adj","","ā","sattā"
"6","ṣaṭ","ṢAṬ","","ṣaṭ","noun-adj","","","ṣaṭ"
"7","ḍḍḍ","","","","","","",""
"8","icche","ICCH","e","iṣ","","iṣ","e","icche"
"9","śana","ŚAN","a","śana","","","a","śana"
"10","antara","ANTAR","a","antara","noun-adj","","a","antara"
"11","ārūḍhā","ĀRŪḌH","ā","ārūḍha","noun-adj","","āḥ","ārūḍhāḥ"
"12","sphuṭa","SPHUṬ","a","sphuṭa","noun-adj","","a","sphuṭa"
"13","a","","","alpha_privativum","ind","","","alpha_privativum"
"14","sphuṭa","SPHUṬ","a","sphuṭa","noun-adj","","a","sphuṭa"
"15","jagat","JAGAT","","jagat","noun-adj","","","jagat"
"16","mayī","MAY","ī","mayī","noun-adj","","ī","mayī"
"17","//","","","","punct","","","//"
"","</s>","","","","","","",""
"","<s number = ""33"">","","","","","","",""
"1","anuttara","ANUTTAR","a","anuttara","noun-adj","","a","anuttara"
"2","ityādi","","","","ind","","",""
"3","tripadyeṣu","TRIPADY","eṣu","tripadya","","","eṣu","tripadyeṣu"
"4","artha","ARTH","a","artha","noun-adj","","a","artha"
"5","a","","","alpha_privativum","ind","","","alpha_privativum"
"6","saṃgatyā","SAṂGATY","ā","saṃgatyā","noun-adj","","ā","saṃgatyā"
"7","pāṭhā","PĀṬH","ā","pāṭha","noun-adj","","āḥ","pāṭhāḥ"
"8","śuddhiḥ","ŚUDDH","iḥ","śuddhi","noun-adj","","iḥ","śuddhiḥ"
"9","pratibhāti","PRATIBHĀ","ti","pratibhā","verb","","ti","pratibhāti"
"10","catvāraḥ","CATVĀR","aḥ","catur","noun-adj","","aḥ","catvāraḥ"
"11","paratas","PAR","atas","para","noun-adj","","ataḥ","parataḥ"
"12","varṇāḥ","VARṆ","āḥ","varṇa","noun-adj","","āḥ","varṇāḥ"
"13","ṣaṇḍa","ṢAṆḌ","a","ṣaṇḍa","noun-adj","","a","ṣaṇḍa"
"14","ātmānaḥ","ĀTM","ānaḥ","ātman","noun-adj","","anaḥ","ātmanaḥ"
"15","pracoditāḥ","PRACODIT","āḥ","pracodita","noun-adj","","āḥ","pracoditāḥ"
"16","anuttara","ANUTTAR","a","anuttara","noun-adj","","a","anuttara"
"17","ānanda","ĀNAND","a","ānanda","noun-adj","","a","ānanda"
"18","śāktiḥ","ŚĀKT","iḥ","śākta","noun-adj","","iḥ","śāktiḥ"
"19","trikoṇāt","TRIKOṆ","āt","trikoṇa","","","āt","trikoṇāt"
"20","vṛtti","VṚTT","i","vṛtti","noun-adj","","i","vṛtti"
"21","yogataḥ","YOG","ataḥ","yoga","noun-adj","","ataḥ","yogataḥ"
"22","//","","","","punct","","","//"
"","</s>","","","","","","",""
"","<s number = ""34"">","","","","","","",""
"1","tathā","","","tathā","ind","","","tathā"
"2","eva","","","eva","ind","","","eva"
"3","ūneṣa","","","","","","",""
"4","yogena","YOG","ena","yoga","noun-adj","","ena","yogena"
"5","kriyāśakteḥ","KRIYĀŚAKT","eḥ","kriyāśakti","","","eḥ","kriyāśakteḥ"
"6","sphuṭam","SPHUṬ","am","sphuṭa","noun-adj","","am","sphuṭam"
"7","vapuḥ","VAP","uḥ","vapu","noun-adj","","uḥ","vapuḥ"
"8","uktam","UKT","am","ukta","noun-adj","","am","uktam"
"9","tri","TR","i","tri","noun-adj","","i","tri"
"10","śakti","ŚAKT","i","śakti","noun-adj","","i","śakti"
"11","saṃghaṭṭāt","SAṂGHAṬṬ","āt","saṃghaṭṭa","","","āt","saṃghaṭṭāt"
"12","triśūlam","TRIŚŪL","am","triśūla","noun-adj","","am","triśūlam"
"13","dvaita","DVAIT","a","dvaita","noun-adj","","a","dvaita"
"14","ghasmaram","GHASMAR","am","ghasmara","","","am","ghasmaram"
"15","//","","","","punct","","","//"
"","</s>","","","","","","",""
"","<s number = ""35"">","","","","","","",""
"1","paraspara","PARASPAR","a","paraspara","noun-adj","","a","paraspara"
"2","virodhe","VIRODH","e","virodha","noun-adj","","e","virodhe"
"3","tu","","","tu","ind","","","tu"
"4","kāryeṣu","KĀRY","eṣu","kārya","noun-adj","","eṣu","kāryeṣu"
"5","pravirohati","PRAVIROHAT","i","pravirohati","","","i","pravirohati"
"6","na","","","na","ind","","","na"
"7","kathaṃcid","KATHAṂ","cid","kathama","","","cid","kathaṃcid"
"8","upādeyam","UPĀDEY","am","upādeya","noun-adj","","am","upādeyam"
"9","āsām","","","","ind","","",""
"10","rūpam","RŪP","am","rūpa","noun-adj","","am","rūpam"
"11","idam","IDAM","","idam","pron","","","idam"
"12","bhavet","BHAV","et","bhav","verb","bhū","et","bhavet"
"13","//","","","","punct","","","//"
"","</s>","","","","","","",""
"","<s number = ""36"">","","","","","","",""
"1","binduḥ","BIND","uḥ","bindu","noun-adj","","uḥ","binduḥ"
"2","vedyasya","VEDY","asya","vedya","noun-adj","","asya","vedyasya"
"3","saṃskāraḥ","SAṂSKĀR","aḥ","saṃskāra","noun-adj","","aḥ","saṃskāraḥ"
"4","vimarśaḥ","VIMARŚ","aḥ","vimarśa","noun-adj","","aḥ","vimarśaḥ"
"5","sargaḥ","SARG","aḥ","sarga","noun-adj","","aḥ","sargaḥ"
"6","iti","","","iti","ind","","","iti"
"7","asau","","","adas","pron","","","adas"
"8","kalā","KAL","ā","kalā","noun-adj","","ā","kalā"
"9","ṣoḍaśaka","ṢOḌAŚ","aka","ṣoḍaśaka","noun-adj","","aka","ṣoḍaśaka"
"10","ākārā","ĀKĀR","ā","ākāra","noun-adj","","āḥ","ākārāḥ"
"11","śaktiḥ","ŚAKT","iḥ","śakti","noun-adj","","iḥ","śaktiḥ"
"12","vijayate","VIJA","yate","vijay","verb","viji","yate","vijayate"
"13","parā","PAR","ā","para","noun-adj","","ā","parā"
"14","//","","","","punct","","","//"
"","</s>","","","","","","",""
"","<s number = ""37"">","","","","","","",""
"1","tithayaḥ","TITH","ayaḥ","tithi","noun-adj","","ayaḥ","tithayaḥ"
"2","pratipad","PRATIPAD","","pratipad","noun-adj","","","pratipad"
"3","pūrvāḥ","PŪRV","āḥ","pūrva","noun-adj","","āḥ","pūrvāḥ"
"4","pañcadaśa","PAÑCADAŚ","a","pañcadaśa","noun-adj","","a","pañcadaśa"
"5","iti","","","iti","ind","","","iti"
"6","māyayā","MĀY","ayā","māyā","noun-adj","","ayā","māyayā"
"7","sūryācandramasau","SŪRYĀCANDRAMASA","u","sūryācandramasau","noun-adj","","u","sūryācandramasau"
"8","svāntaḥ","SVĀNT","aḥ","svānta","noun-adj","","aḥ","svāntaḥ"
"9","carantau","CAR","antau","carat","noun-adj","","antau","carantau"
"10","sthiti","STHIT","i","sthiti","noun-adj","","i","sthiti"
"11","hetave","HET","ave","hetu","noun-adj","","ave","hetave"
"12","//","","","","punct","","","//"
"","</s>","","","","","","",""
"","<s number = ""38"">","","","","","","",""
"1","yathā","","","yathā","ind","","","yathā"
"2","vimarśa","VIMARŚ","a","vimarśa","noun-adj","","a","vimarśa"
"3","vapuṣaḥ","VAPUṢ","aḥ","vapuṣa","noun-adj","","aḥ","vapuṣaḥ"
"4","sargasya","SARG","asya","sarga","","","asya","sargasya"
"5","ādyāḥ","ĀD","yāḥ","ādi","noun-adj","","yāḥ","ādyāḥ"
"6","kalāḥ","KAL","āḥ","kala","noun-adj","","āḥ","kalāḥ"
"7","smṛtāḥ","SMṚT","āḥ","smṛta","noun-adj","","āḥ","smṛtāḥ"
"8","dvi","DV","i","dvi","noun-adj","","i","dvi"
"9","dhā","DH","ā","dhā","noun-adj","","ā","dhā"
"10","iyam","","","idam","pron","","","idam"
"11","mātṛkā","MĀTṚK","ā","mātṛkā","noun-adj","","ā","mātṛkā"
"12","devī","DEV","ī","devī","noun-adj","","ī","devī"
"13","bīja","BĪJ","a","bīja","noun-adj","","a","bīja"
"14","yoni","YON","i","yoni","noun-adj","","i","yoni"
"15","ātmanā","ĀTM","anā","ātman","noun-adj","","anā","ātmanā"
"16","sthitāḥ","STHIT","āḥ","sthita","noun-adj","","āḥ","sthitāḥ"
"17","//","","","","punct","","","//"
"","</s>","","","","","","",""
"","<s number = ""39"">","","","","","","",""
"1","nitya","NITY","a","nitya","noun-adj","","a","nitya"
"2","pravṛtta","PRAVṚTT","a","pravṛtta","noun-adj","","a","pravṛtta"
"3","śṛṅgāṭa","ŚṚṄGĀṬ","a","śṛṅgāṭa","noun-adj","","a","śṛṅgāṭa"
"4","vapuḥ","VAP","uḥ","vapu","noun-adj","","uḥ","vapuḥ"
"5","viśvasya","VIŚV","asya","viśva","noun-adj","","asya","viśvasya"
"6","janma","JANM","a","janma","noun-adj","","a","janma"
"7","bhūḥ","","","bhu","ind","","","bhu"
"8","hṛdayam","HṚDAY","am","hṛdaya","noun-adj","","am","hṛdayam"
"9","bījam","BĪJ","am","bīja","noun-adj","","am","bījam"
"10","etasyām","","","tad","pron","","","tad"
"11","sāram","SĀR","am","sāra","noun-adj","","am","sāram"
"12","yat","","","yad","pron","","","yad"
"13","tat","TAT","","tad","pron","","","tat"
"14","param","PARAM","","parama","noun-adj","","","param"
"15","mahaḥ","MAH","aḥ","mahat","noun-adj","","aḥ","mahaḥ"
"16","//","","","","punct","","","//"
"","</s>","","","","","","",""
"","<s number = ""40"">","","","","","","",""
"1","vaṭa","VAṬ","a","vaṭa","noun-adj","","a","vaṭa"
"2","bīje","BĪJ","e","bīja","noun-adj","","e","bīje"
"3","yathā","","","yathā","ind","","","yathā"
"4","vṛkṣaḥ","VṚKṢ","aḥ","vṛkṣa","noun-adj","","aḥ","vṛkṣaḥ"
"5","tathā","","","tathā","ind","","","tathā"
"6","atra","","","atra","ind","","","atra"
"7","nihitam","NIHIT","am","nihita","noun-adj","","am","nihitam"
"8","jagat","JAGAT","","jagat","noun-adj","","","jagat"
"9","vicāryamāṇe","VICĀR","yamāṇe","vicar","verb","vicar","yamāṇe","vicāryamāṇe"
"10","na","","","na","ind","","","na"
"11","eva","","","eva","ind","","","eva"
"12","idam","IDAM","","idam","pron","","","idam"
"13","kāraṇāt","KĀRAṆ","āt","kāraṇa","noun-adj","","āt","kāraṇāt"
"14","atiricyate","ATIRIC","yate","atiric","verb","","yate","atiricyate"
"15","//","","","","punct","","","//"
"","</s>","","","","","","",""
"","<s number = ""41"">","","","","","","",""
"1","mṛd","MṚD","","mṛdu","noun-adj","","","mṛd"
"2","ādeḥ","ĀD","eḥ","ādi","noun-adj","","eḥ","ādeḥ"
"3","kalaśa","KALAŚ","a","kalaśa","noun-adj","","a","kalaśa"
"4","ādīnām","ĀD","īnām","ādi","noun-adj","","īnām","ādīnām"
"5","tattvam","TATTV","am","tattva","noun-adj","","am","tattvam"
"6","na","","","na","ind","","","na"
"7","anyat","ANY","at","anya","pron","","at","anyat"
"8","nirūpaṇe","NIRŪPAṆ","e","nirūpaṇa","noun-adj","","e","nirūpaṇe"
"9","iti","","","iti","ind","","","iti"
"10","āhuḥ","ĀH","uḥ","ah","verb","ah","uḥ","āhuḥ"
"11","tattva","TATTV","a","tattva","noun-adj","","a","tattva"
"12","vādinyaḥ","VĀD","inyaḥ","vādin","","","inyaḥ","vādinyaḥ"
"13","śrutīnām","ŚRUT","īnām","śruti","noun-adj","","īnām","śrutīnām"
"14","antimāḥ","ANTIM","āḥ","antima","","","āḥ","antimāḥ"
"15","giraḥ","GIR","aḥ","gira","noun-adj","","aḥ","giraḥ"
"16","//","","","","punct","","","//"
"","</s>","","","","","","",""
"","<s number = ""42"">","","","","","","",""
"1","idam","IDAM","","idam","pron","","","idam"
"2","sarvam","SARV","am","sarva","noun-adj","","am","sarvam"
"3","sat","SAT","","sat","noun-adj","","","sat"
"4","eva","","","eva","ind","","","eva"
"5","āsīt","ĀSĪT","","asy","verb","asy","","āsīt"
"6","agre","AGR","e","agra","noun-adj","","e","agre"
"7","iti","","","iti","ind","","","iti"
"8","viniścayāt","VINIŚCAY","āt","viniścaya","noun-adj","","āt","viniścayāt"
"9","sattā","SATT","ā","sattā","noun-adj","","ā","sattā"
"10","vācini","VĀC","ini","vāk","noun-adj","","ini","vācini"
"11","bīje","BĪJ","e","bīja","noun-adj","","e","bīje"
"12","asmin","ASMIN","","idam","pron","","","asmin"
"13","bhāti","BHĀT","i","bhāti","noun-adj","","i","bhāti"
"14","māyā","MĀY","ā","māyā","noun-adj","","ā","māyā"
"15","tu","","","tu","ind","","","tu"
"16","idam","IDAM","","idam","pron","","","idam"
"17","jagat","JAGAT","","jagat","noun-adj","","","jagat"
"18","//","","","","punct","","","//"
"","</s>","","","","","","",""
"","<s number = ""43"">","","","","","","",""
"1","vilupta","VILUPT","a","vilupta","noun-adj","","a","vilupta"
"2","pratyaya","PRATYAY","a","pratyaya","noun-adj","","a","pratyaya"
"3","ākāram","ĀKĀR","am","ākāra","noun-adj","","am","ākāram"
"4","etat","ETAT","","tad","pron","","","etat"
"5","sa","","","tad","pron","","","tad"
"6","pariśiṣyate","PARIŚIṢY","ate","pariśās","verb","pariśās","ate","pariśiṣyate"
"7","tatas","","","tatas","ind","","","tatas"
"8","jñāna","JÑĀN","a","jñāna","noun-adj","","a","jñāna"
"9","kriyā","KRIY","ā","kriyā","noun-adj","","ā","kriyā"
"10","sāra","SĀR","a","sāra","noun-adj","","a","sāra"
"11","vidyeśvara","VIDYEŚVAR","a","vidyeśvara","","","a","vidyeśvara"
"12","sadāśivāḥ","SADĀŚIV","āḥ","sadāśiva","","","āḥ","sadāśivāḥ"
"13","//","","","","punct","","","//"
"","</s>","","","","","","",""
"","<s number = ""44"">","","","","","","",""
"1","śakti","ŚAKT","i","śakti","noun-adj","","i","śakti"
"2","triśūle","TRIŚŪL","e","triśūla","noun-adj","","e","triśūle"
"3","līyante","LĪ","yante","lī","verb","lī","yante","līyante"
"4","caturdaśa","CATURDAŚ","a","caturdaśa","noun-adj","","a","caturdaśa"
"5","kalā","KAL","ā","kalā","noun-adj","","ā","kalā"
"6","ātmani","ĀTM","ani","ātman","noun-adj","","āni","ātmāni"
"7","ūrdhva","ŪRDHV","a","ūrdhva","noun-adj","","a","ūrdhva"
"8","adhas","ADH","as","adha","noun-adj","","aḥ","adhaḥ"
"9","sṛṣṭi","SṚṢṬ","i","sṛṣṭi","noun-adj","","i","sṛṣṭi"
"10","vapuṣi","VAPUṢ","i","vapuṣi","noun-adj","","i","vapuṣi"
"11","sarvam","SARV","am","sarva","noun-adj","","am","sarvam"
"12","līnam","LĪN","am","līna","noun-adj","","am","līnam"
"13","atas","","","atas","ind","","","atas"
"14","//","","","","punct","","","//"
"","</s>","","","","","","",""
"","<s number = ""45"">","","","","","","",""
"1","ittham","ITTH","am","ittha","noun-adj","","am","ittham"
"2","parasyām","PAR","asyām","para","noun-adj","","asyām","parasyām"
"3","saṃvittau","SAṂVITT","au","saṃvitti","noun-adj","","au","saṃvittau"
"4","sarvam","SARV","am","sarva","noun-adj","","am","sarvam"
"5","saṃkucitam","SAṂKUCIT","am","saṃkucita","","","am","saṃkucitam"
"6","kramāt","KRAM","āt","krama","noun-adj","","āt","kramāt"
"7","athavā","ATHAV","ā","athavā","noun-adj","","ā","athavā"
"8","manasā","MAN","asā","manas","noun-adj","","asā","manasā"
"9","atīte","ATĪT","e","atīta","noun-adj","","e","atīte"
"10","yatra","","","yatra","ind","","","yatra"
"11","kvāpi","KVĀP","i","kvāpi","noun-adj","","i","kvāpi"
"12","nirañjane","NIRAÑJAN","e","nirañjana","noun-adj","","e","nirañjane"
"13","//","","","","punct","","","//"
"","</s>","","","","","","",""
"","<s number = ""46"">","","","","","","",""
"1","ṣaṭ","ṢAṬ","","ṣaṭ","","","","ṣaṭ"
"2","triṃśat","TRIṂŚ","at","triṃśat","","","at","triṃśat"
"3","tattva","TATTV","a","tattva","noun-adj","","a","tattva"
"4","laharī","LAHAR","ī","laharī","noun-adj","","ī","laharī"
"5","kalaha","KALAH","a","kalaha","noun-adj","","a","kalaha"
"6","atīta","ATĪT","a","atīta","noun-adj","","a","atīta"
"7","gocare","GOCAR","e","gocara","noun-adj","","e","gocare"
"8","viśvātmani","VIŚVĀTMAN","i","viśvātmanas","","","i","viśvātmani"
"9","mahā","MAH","ā","mahat","noun-adj","","ā","mahā"
"10","mantre","MANTR","e","mantra","noun-adj","","e","mantre"
"11","svabhāve","SVABHĀV","e","svabhāva","noun-adj","","e","svabhāve"
"12","sā","","","tad","pron","","","tad"
"13","vilīyate","VILĪ","yate","vilī","verb","vilī","yate","vilīyate"
"14","//","","","","punct","","","//"
"","</s>","","","","","","",""
"","<s number = ""47"">","","","","","","",""
"1","kṛtaḥ","KṚT","aḥ","kṛta","noun-adj","","aḥ","kṛtaḥ"
"2","ca","","","ca","ind","","","ca"
"3","ainmathite","","","","","","",""
"4","dhāmni","DHĀM","ni","dhāman","noun-adj","","nā","dhāmnā"
"5","dīpte","DĪPT","e","dīpta","noun-adj","","e","dīpte"
"6","kena","","","kim","pron","","","kim"
"7","api","","","api","ind","","","api"
"8","hetunā","HET","unā","hetu","noun-adj","","unā","hetunā"
"9","sarvam","SARV","am","sarva","noun-adj","","am","sarvam"
"10","haviḥ","HAV","iḥ","havi","noun-adj","","iḥ","haviḥ"
"11","idam","IDAM","","idam","pron","","","idam"
"12","juhvan","JUH","van","juhvat","noun-adj","","van","juhvan"
"13","na","","","na","ind","","","na"
"14","dāridryeṇa","DĀRIDRY","eṇa","dāridrya","noun-adj","","ena","dāridryena"
"15","pīḍyate","PĪḌ","yate","pīḍ","verb","","yate","pīḍyate"
"16","//","","","","punct","","","//"
"","</s>","","","","","","",""
"","<s number = ""48"">","","","","","","",""
"1","pañca","PAÑC","a","pañca","noun-adj","","a","pañca"
"2","pañca","PAÑC","a","pañca","noun-adj","","a","pañca"
"3","ātmakam","ĀTM","akam","ātmaka","noun-adj","","akam","ātmakam"
"4","viśvam","VIŚV","am","viśva","noun-adj","","am","viśvam"
"5","pañca","PAÑC","a","pañca","noun-adj","","a","pañca"
"6","spanda","SPAND","a","spanda","noun-adj","","a","spanda"
"7","vijṛmbhitam","VIJṚMBH","itam","vijṛmbhita","noun-adj","","itam","vijṛmbhitam"
"8","saṃkocayat","SAṂKOCAY","at","saṃkocayat","","","at","saṃkocayat"
"9","parāmarśāt","PARĀMARŚ","āt","parāmarśa","noun-adj","","āt","parāmarśāt"
"10","sāmānya","SĀMĀNY","a","sāmānya","noun-adj","","a","sāmānya"
"11","spanda","SPAND","a","spanda","noun-adj","","a","spanda"
"12","kevalam","KEVAL","am","kevala","noun-adj","","am","kevalam"
"13","//","","","","punct","","","//"
"","</s>","","","","","","",""
"","<s number = ""49"">","","","","","","",""
"1","ahami","AHAM","i","aham","noun-adj","","i","ahami"
"2","pralayam","PRALAY","am","pralaya","noun-adj","","am","pralayam"
"3","kurvan","KUR","van","kar","verb","kṛ","van","kurvan"
"4","idamaḥ","IDAM","aḥ","idama","","","aḥ","idamaḥ"
"5","pratiyoginaḥ","PRATIYOG","inaḥ","pratiyogin","noun-adj","","inaḥ","pratiyoginaḥ"
"6","parākrama","PARĀKRAM","a","parākrama","noun-adj","","a","parākrama"
"7","paraḥ","PAR","aḥ","para","noun-adj","","aḥ","paraḥ"
"8","bhuṅkte","BHUṄKT","e","bhuṅkte","noun-adj","","e","bhuṅkte"
"9","svabhāvam","SVABHĀV","am","svabhāva","noun-adj","","am","svabhāvam"
"10","aśiva","AŚIV","a","aśiva","noun-adj","","a","aśiva"
"11","apaham","APAH","am","apaha","noun-adj","","am","apaham"
"12","//","","","","punct","","","//"
"","</s>","","","","","","",""
"","<s number = ""50"">","","","","","","",""
"1","iti","","","iti","ind","","","iti"
"2","ṣaṣ","ṢAṢ","","ṣaṣa","noun-adj","","","ṣaṣ"
"3","adhika","ADHIK","a","adhika","noun-adj","","a","adhika"
"4","triṃśat","TRIṂŚAT","","triṃśata","noun-adj","","","triṃśat"
"5","bheda","BHED","a","bheda","noun-adj","","a","bheda"
"6","prasakta","PRASAKT","a","prasakta","noun-adj","","a","prasakta"
"7","jagat","JAGAT","","jagat","noun-adj","","","jagat"
"8","tanuḥ","TAN","uḥ","tanu","noun-adj","","uḥ","tanuḥ"
"9","prasarati","PRASAR","ati","prasar","verb","","ati","prasarati"
"10","mahā","MAH","ā","mahat","noun-adj","","ā","mahā"
"11","śakti","ŚAKT","i","śakti","noun-adj","","i","śakti"
"12","ullekha","ULLEKH","a","ullekha","noun-adj","","a","ullekha"
"13","vicitra","VICITR","a","vicitra","noun-adj","","a","vicitra"
"14","mahā","MAH","ā","mahat","","","ā","mahā"
"15","paṭī","PAṬ","ī","paṭi","","","ī","paṭī"
"16","jayati","JA","yati","jay","verb","ji","yati","jayati"
"17","bahuśas","BAHUŚ","as","bahuśas","","","aḥ","bahuśaḥ"
"18","spanda","SPAND","a","spanda","noun-adj","","a","spanda"
"19","ākārā","ĀKĀR","ā","ākāra","noun-adj","","āḥ","ākārāḥ"
"20","parā","PAR","ā","para","noun-adj","","āḥ","parāḥ"
"21","cit","CIT","","cid","noun-adj","","","cit"
"22","anuttarāḥ","ANUTTAR","āḥ","anuttara","noun-adj","","āḥ","anuttarāḥ"
"23","vimṛśata","VIMṚŚ","ata","vimṛśa","","","ati","vimṛśati"
"24","janāḥ","JAN","āḥ","jana","noun-adj","","āḥ","janāḥ"
"25","kim","","","kim","pron","","","kim"
"26","no","","","nas","ind","","","nas"
"27","svabhāva","SVABHĀV","a","svabhāva","noun-adj","","a","svabhāva"
"28","vijṛmbhitam","VIJṚMBH","itam","vijṛmbhita","noun-adj","","itam","vijṛmbhitam"
"29","//","","","","punct","","","//"
"","</s>","","","","","","",""
"","<s number = ""51"">","","","","","","",""
"1","iti","","","iti","ind","","","iti"
"2","śrī","ŚRĪ","","śrī","noun-adj","","","śrī"
"3","mat","MAT","","mat","pron","","","mat"
"4","ādi","ĀD","i","ādi","noun-adj","","i","ādi"
"5","anātha","ANĀTH","a","anātha","noun-adj","","a","anātha"
"6","viracitā","VIRACIT","ā","viracitā","noun-adj","","ā","viracitā"
"7","anuttara","ANUTTAR","a","anuttara","noun-adj","","a","anuttara"
"8","prakāśa","PRAKĀŚ","a","prakāśa","noun-adj","","a","prakāśa"
"9","pañcāśikā","PAÑCĀŚIK","ā","pañcāśikā","noun-adj","","ā","pañcāśikā"
"10","samāptā","SAMĀPT","ā","samāpta","noun-adj","","āḥ","samāptāḥ"
"11","sā","","","tad","pron","","","tad"
"12","iyam","","","idam","pron","","","idam"
"13","kāśmīra","KĀŚMĪR","a","kāśmīra","noun-adj","","a","kāśmīra"
"14","bhūpāla","BHŪPĀL","a","bhūpāla","noun-adj","","a","bhūpāla"
"15","saṃśritena","SAṂŚRIT","ena","saṃśrita","noun-adj","","ena","saṃśritena"
"16","prakāśitā","PRAKĀŚIT","ā","prakāśita","noun-adj","","āḥ","prakāśitāḥ"
"17","satā","SAT","ā","sat","noun-adj","","ā","satā"
"18","mukunda","MUKUND","a","mukunda","","","a","mukunda"
"19","rāmeṇa","RĀM","eṇa","rāma","","","ena","rāmena"
"20","sat","SAT","","sat","noun-adj","","","sat"
"21","mude","MUD","e","muda","noun-adj","","e","mude"
"22","astu","","","as","verb","as","",""
"23","śive","ŚIV","e","śiva","noun-adj","","e","śive"
"24","arpitāḥ","ARPIT","āḥ","arpita","noun-adj","","āḥ","arpitāḥ"
"25","//","","","","punct","","","//"
"","</s>","","","","","","",""
