"WordID","word","NormSTEM","suffix","lemma","PoS","Root","NormSuffix","NormWord"
1,"atha","_","_","atha","CAD","","_","_"
2,"_","_","_","vindhya","NC","","_","_"
3,"_","_","_","antara","NC","","_","_"
4,"tatra","_","_","tatra","CAD","","_","_"
5,"_","_","_","vatsa","NC","","_","_"
6,"_","_","_","rāja","NC","","_","_"
7,"tiṣṭhataḥ","_","_","sthā","KDP","","_","_"
1,"pārśvaṃ","_","_","pārśva","NC","","_","_"
2,"_","_","_","caṇḍamahāsa","NC","","_","_"
3,"_","_","_","pratīhāra","NC","","_","_"
4,"samāyayau","_","_","samāyā","V","samāyā","_","_"
1,"sa","_","_","tad","PRD","","_","_"
2,"_","_","_","ca","CCD","","_","_"
3,"_","_","_","āga","CGDA","","_","_"
4,"_","_","_","praṇa","CGDA","","_","_"
5,"_","_","_","a","PRD","","_","_"
6,"_","_","_","rājan","NC","","_","_"
7,"_","_","_","ida","PRD","","_","_"
8,"_","_","_","abravīta","V","brū","_","_"
1,"rājā","_","_","rājan","NC","","_","_"
2,"_","_","_","caṇḍamahāsa","NC","","_","_"
3,"_","_","_","tvat","PPR","","_","_"
4,"_","_","_","saṃdiś","KDP","","_","_"
5,"_","_","_","ida","PRD","","_","_"
1,"yuktaṃ","_","_","yukta","JJ","","_","_"
2,"vāsavadattā","_","_","vāsavadattā","NC","","_","_"
3,"_","_","_","yat","CSB","","_","_"
4,"_","_","_","svaya","CX","","_","_"
5,"_","_","_","eva","CEM","","_","_"
6,"tvayā","_","_","tvat","PPR","","_","_"
7,"hṛtā","_","_","hṛ","PPP","","_","_"
1,"_","_","_","tad","PRD","","_","_"
2,"_","_","_","artha","NC","","_","_"
3,"_","_","_","eva","CEM","","_","_"
4,"hi","_","_","hi","CX","","_","_"
5,"mayā","_","_","mat","PPR","","_","_"
6,"_","_","_","tvat","PPR","","_","_"
7,"_","_","_","ānī","PPP","","_","_"
8,"_","_","_","iha","CAD","","_","_"
9,"_","_","_","bhav","V","bhū","_","_"
1,"saṃyatasya","_","_","saṃya","PPP","","_","_"
2,"ca","_","_","ca","CCD","","_","_"
3,"_","_","_","na","CNG","","_","_"
4,"_","_","_","eva","CEM","","_","_"
5,"_","_","_","iha","CAD","","_","_"
6,"_","_","_","dā","PPP","","_","_"
7,"_","_","_","tad","PRD","","_","_"
8,"te","_","_","tvat","PPR","","_","_"
9,"mayā","_","_","mat","PPR","","_","_"
10,"svayam","_","_","svaya","CX","","_","_"
1,"_","_","_","na","CNG","","_","_"
2,"_","_","_","eva","CX","","_","_"
3,"_","_","_","mat","PPR","","_","_"
4,"te","_","_","tvat","PPR","","_","_"
5,"_","_","_","prīti","NC","","_","_"
6,"_","_","_","bhav","V","bhū","_","_"
7,"_","_","_","iti","CQT","","_","_"
8,"viśaṅkinā","_","_","viśaṅkin","JJ","","_","_"
1,"tad","_","_","tad","PRD","","_","_"
2,"idānīm","_","_","idānīm","CX","","_","_"
3,"avidhinā","_","_","avidhi","NC","","_","_"
4,"_","_","_","mat","PPR","","_","_"
5,"_","_","_","ida","PRD","","_","_"
6,"duhitur","_","_","duhitṛ","NC","","_","_"
7,"yathā","_","_","yathā","CCM","","_","_"
1,"na","_","_","na","CNG","","_","_"
2,"vivāho","_","_","vivāha","NC","","_","_"
3,"bhaved","_","_","bhav","V","bhū","_","_"
4,"rājan","_","_","rājan","NC","","_","_"
5,"pratīkṣethās","_","_","pratīkṣ","V","pratīkṣ","_","_"
6,"tathā","_","_","tathā","CX","","_","_"
7,"manāk","_","_","manāk","CX","","_","_"
1,"gopālako","_","_","gopālaka","NC","","_","_"
2,"hi","_","_","hi","CX","","_","_"
3,"_","_","_","nacirāt","CX","","_","_"
4,"_","_","_","atra","CAD","","_","_"
5,"_","_","_","eva","CEM","","_","_"
6,"_","_","_","e","V","e","_","_"
7,"_","_","_","mat","PPR","","_","_"
8,"_","_","_","suta","NC","","_","_"
1,"sa","_","_","tad","PRD","","_","_"
2,"_","_","_","ca","CCD","","_","_"
3,"_","_","_","ida","PRD","","_","_"
4,"_","_","_","svasṛ","NC","","_","_"
5,"_","_","_","udvāha","NC","","_","_"
6,"yathāvidhi","_","_","yathāvidhi","CX","","_","_"
7,"vidhāsyati","_","_","vidadh","V","vidhā","_","_"
1,"_","_","_","iti","CQT","","_","_"
2,"_","_","_","ida","PRD","","_","_"
3,"_","_","_","vatsa","NC","","_","_"
4,"_","_","_","rāja","NC","","_","_"
5,"_","_","_","saṃdeśa","NC","","_","_"
6,"a","_","_","alpha_privativum","CGDA","","_","_"
6,"_","_","_","vadhā","CGDA","","_","_"
7,"saḥ","_","_","tad","PRD","","_","_"
1,"_","_","_","tad","PRD","","_","_"
2,"_","_","_","tad","PRD","","_","_"
3,"_","_","_","vāsavadattā","NC","","_","_"
4,"pratīhāro","_","_","pratīhāra","NC","","_","_"
5,"nyavedayat","_","_","nyaveda","V","niveday","_","_"
1,"tataḥ","_","_","tatas","CX","","_","_"
2,"_","_","_","sa_saha","CX","","_","_"
3,"_","_","_","ānanda","NC","","_","_"
4,"sākaṃ","_","_","sāka","CX","","_","_"
5,"tayā","_","_","tad","PRD","","_","_"
6,"vāsavadattayā","_","_","vāsavadattā","NC","","_","_"
1,"hṛṣṭo","_","_","hṛṣ","PPP","","_","_"
2,"_","_","_","vatsa","NC","","_","_"
3,"_","_","_","īśvara","NC","","_","_"
4,"_","_","_","kar","V","kṛ","_","_"
5,"_","_","_","kauśāmbī","NC","","_","_"
6,"_","_","_","gamana","NC","","_","_"
7,"manaḥ","_","_","manas","NC","","_","_"
1,"_","_","_","gopālaka","NC","","_","_"
2,"_","_","_","āgamana","NC","","_","_"
3,"pratīkṣethāṃ","_","_","pratīkṣ","V","pratīkṣ","_","_"
4,"_","_","_","tvat","PPR","","_","_"
5,"_","_","_","iha","CAD","","_","_"
1,"_","_","_","tad","PRD","","_","_"
2,"_","_","_","eva","CEM","","_","_"
3,"saha","_","_","saha","CX","","_","_"
4,"_","_","_","paścāt","CAD","","_","_"
5,"_","_","_","ca","CCD","","_","_"
6,"_","_","_","kauśāmbī","NC","","_","_"
7,"_","_","_","āga","V","āga","_","_"
1,"_","_","_","iti","CQT","","_","_"
2,"_","_","_","vac","CGDA","","_","_"
3,"sthāpayāmāsa","_","_","sthāpay","V","sthāpay","_","_"
4,"sa","_","_","tad","PRD","","_","_"
5,"_","_","_","tatra","CAD","","_","_"
6,"_","_","_","eva","CEM","","_","_"
7,"mahīpatiḥ","_","_","mahīpati","NC","","_","_"
1,"śvāśuraṃ","_","_","śvāśura","JJ","","_","_"
2,"taṃ","_","_","tad","PRD","","_","_"
3,"pratīhāraṃ","_","_","pratīhāra","NC","","_","_"
4,"_","_","_","sva","JJ","","_","_"
5,"_","_","_","mitra","NC","","_","_"
6,"ca","_","_","ca","CCD","","_","_"
7,"pulindakam","_","_","pulindaka","NC","","_","_"
1,"tato","_","_","tatas","CX","","_","_"
2,"'nuyāto","_","_","anuyā","PPP","","_","_"
3,"_","_","_","nāga","NC","","_","_"
4,"_","_","_","indra","NC","","_","_"
5,"_","_","_","sru","KDP","","_","_"
6,"_","_","_","mada","NC","","_","_"
7,"_","_","_","nirjhara","NC","","_","_"
1,"_","_","_","anurāga","NC","","_","_"
2,"_","_","_","āga","PPP","","_","_"
3,"_","_","_","vindhya","NC","","_","_"
4,"_","_","_","prāgbhāra","NC","","_","_"
5,"_","_","_","iva","CCM","","_","_"
6,"jaṅgamaiḥ","_","_","jaṅgama","JJ","","_","_"
1,"_","_","_","turaṃga","NC","","_","_"
2,"_","_","_","sainya","NC","","_","_"
3,"_","_","_","saṃghāta","NC","","_","_"
4,"_","_","_","khura","NC","","_","_"
5,"_","_","_","āghāta","NC","","_","_"
6,"_","_","_","sa_saha","CX","","_","_"
7,"_","_","_","śabda","NC","","_","_"
1,"stūyamāna","_","_","stu","KDP","","_","_"
2,"_","_","_","iva","CCM","","_","_"
3,"_","_","_","utkra","PPP","","_","_"
4,"_","_","_","bandin","NC","","_","_"
5,"_","_","_","saṃdarbha","NC","","_","_"
6,"bhuvā","_","_","bhū","NC","","_","_"
1,"_","_","_","nabhas","NC","","_","_"
2,"_","_","_","vilaṅghin","JJ","","_","_"
3,"_","_","_","senā","NC","","_","_"
4,"_","_","_","rajas","NC","","_","_"
5,"_","_","_","rāśi","NC","","_","_"
6,"uddhataiḥ","_","_","uddhan","PPP","","_","_"
1,"_","_","_","sapakṣa","NC","","_","_"
2,"_","_","_","bhūbhṛt","NC","","_","_"
3,"_","_","_","ullāsa","NC","","_","_"
4,"_","_","_","śaṅkā","NC","","_","_"
5,"kurvañ","_","_","kṛ","KDP","","_","_"
6,"śatakratoḥ","_","_","śatakratu","NC","","_","_"
1,"sa","_","_","tad","PRD","","_","_"
2,"pratasthe","_","_","pratiṣṭh","V","prasthā","_","_"
3,"tato","_","_","tatas","CX","","_","_"
4,"devyā","_","_","devī","NC","","_","_"
5,"saha","_","_","saha","CX","","_","_"
6,"vāsavadattayā","_","_","vāsavadattā","NC","","_","_"
1,"_","_","_","sva","JJ","","_","_"
2,"_","_","_","purī","NC","","_","_"
3,"prati","_","_","prati","CADP","","_","_"
4,"_","_","_","rājan","NC","","_","_"
5,"_","_","_","indra","NC","","_","_"
6,"_","_","_","prātar","CX","","_","_"
7,"_","_","_","eva","CEM","","_","_"
8,"_","_","_","apara","PPX","","_","_"
9,"'hani","_","_","ahar","NC","","_","_"
1,"_","_","_","tatas","CX","","_","_"
2,"_","_","_","ca","CCD","","_","_"
3,"_","_","_","divasa","NC","","_","_"
4,"_","_","_","dvitra","JJ","","_","_"
5,"_","_","_","viṣaya","NC","","_","_"
6,"_","_","_","tad","PRD","","_","_"
7,"_","_","_","avāp","CGDA","","_","_"
8,"saḥ","_","_","tad","PRD","","_","_"
1,"viśaśrāma","_","_","viśra","V","viśra","_","_"
2,"_","_","_","niśā","NC","","_","_"
3,"_","_","_","eka","PPX","","_","_"
4,"_","_","_","rumaṇvat","NC","","_","_"
5,"_","_","_","mandira","NC","","_","_"
6,"nṛpaḥ","_","_","nṛpa","NC","","_","_"
1,"_","_","_","anyedyus","CX","","_","_"
2,"_","_","_","tad","PRD","","_","_"
3,"ca","_","_","ca","CCD","","_","_"
4,"kauśāmbīṃ","_","_","kauśāmbī","NC","","_","_"
5,"_","_","_","cirāt","CX","","_","_"
6,"_","_","_","prāp","PPP","","_","_"
7,"_","_","_","mahat","JJ","","_","_"
8,"_","_","_","utsava","NC","","_","_"
1,"_","_","_","mārga","NC","","_","_"
2,"_","_","_","utsuka","JJ","","_","_"
3,"_","_","_","unmukha","JJ","","_","_"
4,"_","_","_","jana","NC","","_","_"
5,"praviveśa","_","_","praviś","V","praviś","_","_"
6,"_","_","_","priyā","NC","","_","_"
7,"_","_","_","sakha","NC","","_","_"
1,"tadā","_","_","tadā","CAD","","_","_"
2,"ca","_","_","ca","CCD","","_","_"
3,"_","_","_","strī","NC","","_","_"
4,"_","_","_","ārabh","PPP","","_","_"
5,"_","_","_","maṅgala","JJ","","_","_"
6,"_","_","_","snāna","NC","","_","_"
7,"_","_","_","maṇḍana","NC","","_","_"
1,"_","_","_","cirāt","CX","","_","_"
2,"_","_","_","upāga","PPP","","_","_"
3,"patyau","_","_","pati","NC","","_","_"
4,"babhau","_","_","bhā","V","bhā","_","_"
5,"_","_","_","nārī","NC","","_","_"
6,"_","_","_","iva","CCM","","_","_"
7,"sā","_","_","tad","PRD","","_","_"
8,"purī","_","_","purī","NC","","_","_"
1,"_","_","_","darś","V","dṛś","_","_"
2,"_","_","_","ca","CCD","","_","_"
3,"_","_","_","atra","CAD","","_","_"
4,"_","_","_","paura","NC","","_","_"
5,"_","_","_","tad","PRD","","_","_"
6,"_","_","_","vatsa","NC","","_","_"
7,"_","_","_","rāja","NC","","_","_"
8,"_","_","_","vadhū","NC","","_","_"
9,"_","_","_","sakha","NC","","_","_"
1,"_","_","_","praśa","PPP","","_","_"
2,"_","_","_","śoka","NC","","_","_"
3,"śikhinaḥ","_","_","śikhin","NC","","_","_"
4,"_","_","_","sa_saha","CX","","_","_"
5,"_","_","_","vidyut","NC","","_","_"
6,"_","_","_","iva","CCM","","_","_"
7,"_","_","_","ambuda","NC","","_","_"
1,"_","_","_","harmya","NC","","_","_"
2,"_","_","_","agra","NC","","_","_"
3,"_","_","_","stha","JJ","","_","_"
4,"_","_","_","ca","CCD","","_","_"
5,"pidadhuḥ","_","_","pidhā","V","pidhā","_","_"
6,"_","_","_","paura","NC","","_","_"
7,"_","_","_","nārī","NC","","_","_"
8,"_","_","_","mukha","NC","","_","_"
9,"_","_","_","nabhas","NC","","_","_"
1,"_","_","_","vyoman","NC","","_","_"
2,"_","_","_","gaṅgā","NC","","_","_"
3,"_","_","_","taṭa","NC","","_","_"
4,"_","_","_","utphulla","JJ","","_","_"
5,"_","_","_","heman","NC","","_","_"
6,"_","_","_","amburuha","NC","","_","_"
7,"_","_","_","vibhrama","NC","","_","_"
1,"tataḥ","_","_","tatas","CX","","_","_"
2,"svaṃ","_","_","sva","JJ","","_","_"
3,"_","_","_","rājan","NC","","_","_"
4,"_","_","_","bhavana","NC","","_","_"
5,"_","_","_","vatsa","NC","","_","_"
6,"_","_","_","rāja","NC","","_","_"
7,"viveśa","_","_","viś","V","viś","_","_"
8,"saḥ","_","_","tad","PRD","","_","_"
1,"_","_","_","nṛpa","NC","","_","_"
2,"_","_","_","śrī","NC","","_","_"
3,"_","_","_","iva","CCM","","_","_"
4,"_","_","_","aparā","NC","","_","_"
5,"saha","_","_","saha","CX","","_","_"
6,"vāsavadattayā","_","_","vāsavadattā","NC","","_","_"
1,"_","_","_","sevā","NC","","_","_"
2,"_","_","_","āga","PPP","","_","_"
3,"_","_","_","nṛpa","NC","","_","_"
4,"_","_","_","ākṛ","PPP","","_","_"
5,"_","_","_","māgadha","NC","","_","_"
6,"_","_","_","udgā","PPP","","_","_"
7,"_","_","_","maṅgala","NC","","_","_"
1,"_","_","_","svap","PPP","","_","_"
2,"_","_","_","prabudh","PPP","","_","_"
3,"_","_","_","iva","CCM","","_","_"
4,"_","_","_","tad","PRD","","_","_"
5,"_","_","_","rāj","V","rāj","_","_"
6,"_","_","_","rājan","NC","","_","_"
7,"_","_","_","gṛha","NC","","_","_"
8,"tadā","_","_","tadā","CAD","","_","_"
1,"atha","_","_","atha","CAD","","_","_"
2,"vāsavadattāyā","_","_","vāsavadattā","NC","","_","_"
3,"bhrātā","_","_","bhrātṛ","NC","","_","_"
4,"gopālako","_","_","gopālaka","NC","","_","_"
5,"'cirāt","_","_","acirāt","CX","","_","_"
1,"āyayau","_","_","āyā","V","āyā","_","_"
2,"saha","_","_","saha","CX","","_","_"
3,"kṛtvā","_","_","kṛ","CGDA","","_","_"
4,"tau","_","_","tad","PRD","","_","_"
5,"_","_","_","pratīhāra","NC","","_","_"
6,"_","_","_","pulindaka","NC","","_","_"
1,"_","_","_","kṛ","PPP","","_","_"
2,"_","_","_","pratyudgama","NC","","_","_"
3,"rājñā","_","_","rājan","NC","","_","_"
4,"_","_","_","tad","PRD","","_","_"
5,"_","_","_","ānanda","NC","","_","_"
6,"_","_","_","iva","CCM","","_","_"
7,"_","_","_","apara","PPX","","_","_"
1,"prāpa","_","_","prāpn","V","prāp","_","_"
2,"vāsavadattā","_","_","vāsavadattā","NC","","_","_"
3,"sā","_","_","tad","PRD","","_","_"
4,"_","_","_","praharṣa","NC","","_","_"
5,"_","_","_","utphulla","JJ","","_","_"
6,"_","_","_","locana","NC","","_","_"
1,"amuṃ","_","_","adas","PRD","","_","_"
2,"_","_","_","bhrātṛ","NC","","_","_"
3,"_","_","_","tad","PRD","","_","_"
4,"paśyantyā","_","_","dṛś","KDP","","_","_"
5,"mā","_","_","mā","CNG","","_","_"
6,"sma","_","_","sma","CX","","_","_"
7,"_","_","_","bhav","V","bhū","_","_"
8,"_","_","_","trapā","NC","","_","_"
1,"ity","_","_","iti","CQT","","_","_"
2,"eva","_","_","eva","CEM","","_","_"
3,"tasyās","_","_","tad","PRD","","_","_"
4,"_","_","_","tad","PRD","","_","_"
5,"_","_","_","kāla","NC","","_","_"
6,"_","_","_","rudh","V","rudh","_","_"
7,"_","_","_","aśru","NC","","_","_"
8,"vilocane","_","_","vilocana","NC","","_","_"
1,"_","_","_","pitṛ","NC","","_","_"
2,"_","_","_","saṃdeśa","NC","","_","_"
3,"_","_","_","vākya","NC","","_","_"
4,"_","_","_","ca","CCD","","_","_"
5,"tena","_","_","tad","PRD","","_","_"
6,"_","_","_","protsāhay","PPP","","_","_"
7,"_","_","_","atha","CAD","","_","_"
8,"sā","_","_","tad","PRD","","_","_"
1,"mene","_","_","man","V","man","_","_"
2,"_","_","_","kṛtārtha","JJ","","_","_"
3,"_","_","_","ātman","NC","","_","_"
4,"_","_","_","sva","JJ","","_","_"
5,"_","_","_","jana","NC","","_","_"
6,"samāgatam","_","_","samāga","PPP","","_","_"
1,"tato","_","_","tatas","CX","","_","_"
2,"_","_","_","yathāvat","CX","","_","_"
3,"_","_","_","vart","V","vṛt","_","_"
4,"tasyā","_","_","tad","PRD","","_","_"
5,"_","_","_","vatsa","NC","","_","_"
6,"_","_","_","īśvara","NC","","_","_"
7,"ca","_","_","ca","CCD","","_","_"
1,"vyagro","_","_","vyagra","JJ","","_","_"
2,"gopālako","_","_","gopālaka","NC","","_","_"
3,"_","_","_","anyedyus","CX","","_","_"
4,"_","_","_","tatra","CAD","","_","_"
5,"_","_","_","udvāha","NC","","_","_"
6,"_","_","_","mahat","JJ","","_","_"
7,"_","_","_","utsava","NC","","_","_"
1,"_","_","_","rati","NC","","_","_"
2,"_","_","_","vallī","NC","","_","_"
3,"_","_","_","nava","JJ","","_","_"
4,"_","_","_","udbhid","PPP","","_","_"
5,"_","_","_","iva","CCM","","_","_"
6,"_","_","_","pallava","NC","","_","_"
7,"_","_","_","ujjvala","JJ","","_","_"
1,"pāṇiṃ","_","_","pāṇi","NC","","_","_"
2,"vāsavadattāyāḥ","_","_","vāsavadattā","NC","","_","_"
3,"so","_","_","tad","PRD","","_","_"
4,"'tha","_","_","atha","CAD","","_","_"
5,"_","_","_","vatsa","NC","","_","_"
6,"_","_","_","īśvara","NC","","_","_"
7,"'grahīt","_","_","grah","V","grah","_","_"
1,"_","_","_","tad","PRD","","_","_"
2,"_","_","_","api","CX","","_","_"
3,"_","_","_","priya","JJ","","_","_"
4,"_","_","_","kara","NC","","_","_"
5,"_","_","_","sparśa","NC","","_","_"
6,"_","_","_","sāndra","JJ","","_","_"
7,"_","_","_","ānanda","NC","","_","_"
8,"_","_","_","nimīlay","PPP","","_","_"
1,"_","_","_","sa_saha","CX","","_","_"
2,"_","_","_","kampa","NC","","_","_"
3,"_","_","_","sveda","NC","","_","_"
4,"_","_","_","dih","PPP","","_","_"
5,"_","_","_","aṅga","JJ","","_","_"
6,"_","_","_","gāḍha","JJ","","_","_"
7,"_","_","_","romāñca","NC","","_","_"
8,"_","_","_","carcay","PPP","","_","_"
1,"_","_","_","su","CAD","","_","_"
2,"_","_","_","sammohana","NC","","_","_"
3,"_","_","_","vāyavya","JJ","","_","_"
4,"_","_","_","vāruṇa","JJ","","_","_"
5,"_","_","_","astra","NC","","_","_"
6,"_","_","_","nirantara","JJ","","_","_"
1,"_","_","_","vyadh","PPP","","_","_"
2,"_","_","_","iva","CCM","","_","_"
3,"_","_","_","puṣpa","NC","","_","_"
4,"_","_","_","cāpa","NC","","_","_"
5,"_","_","_","tad","PRD","","_","_"
6,"_","_","_","kṣaṇa","NC","","_","_"
7,"samalakṣyata","_","_","saṃlakṣay","V","saṃlakṣay","_","_"
1,"dṛśi","_","_","dṛś","NC","","_","_"
2,"_","_","_","dhūma","NC","","_","_"
3,"_","_","_","abhitāmra","JJ","","_","_"
4,"tasyā","_","_","tad","PRD","","_","_"
5,"_","_","_","vahni","NC","","_","_"
6,"_","_","_","pradakṣiṇa","JJ","","_","_"
1,"madirā","_","_","madirā","NC","","_","_"
2,"_","_","_","mada","NC","","_","_"
3,"_","_","_","mādhurya","NC","","_","_"
4,"_","_","_","sūtra","NC","","_","_"
5,"_","_","_","pāta","NC","","_","_"
6,"_","_","_","iva","CCM","","_","_"
7,"_","_","_","kar","V","kṛ","_","_"
1,"_","_","_","gopālaka","NC","","_","_"
2,"_","_","_","arpay","PPP","","_","_"
3,"ratnai","_","_","ratna","NC","","_","_"
4,"rājñāṃ","_","_","rājan","NC","","_","_"
5,"_","_","_","ca","CCD","","_","_"
6,"_","_","_","upāyana","NC","","_","_"
7,"_","_","_","tadā","CAD","","_","_"
1,"_","_","_","pṛ","PPP","","_","_"
2,"_","_","_","kośa","NC","","_","_"
3,"dadhau","_","_","satya","JJ","","_","_"
4,"_","_","_","vatsa","NC","","_","_"
5,"_","_","_","īśa","NC","","_","_"
6,"_","_","_","rājan","NC","","_","_"
7,"_","_","_","rājan","NC","","_","_"
1,"_","_","_","nirvartay","PPP","","_","_"
2,"_","_","_","vivāha","NC","","_","_"
3,"_","_","_","tad","PRD","","_","_"
4,"_","_","_","ādi","NC","","_","_"
5,"lokasya","_","_","loka","NC","","_","_"
6,"cakṣuṣi","_","_","cakṣus","NC","","_","_"
1,"_","_","_","vadhū","NC","","_","_"
2,"_","_","_","vara","JJ","","_","_"
3,"viviśatuḥ","_","_","viś","V","viś","_","_"
4,"_","_","_","paścāt","CAD","","_","_"
5,"_","_","_","sva","JJ","","_","_"
6,"_","_","_","vāsa","NC","","_","_"
7,"_","_","_","veśman","NC","","_","_"
1,"atha","_","_","atha","CAD","","_","_"
2,"saṃmānayāmāsa","_","_","saṃmānay","V","saṃmānay","_","_"
3,"_","_","_","paṭṭabandha","NC","","_","_"
4,"_","_","_","ādi","NC","","_","_"
5,"svayam","_","_","svaya","CX","","_","_"
1,"_","_","_","nija","JJ","","_","_"
2,"_","_","_","utsava","NC","","_","_"
3,"_","_","_","vatsa","NC","","_","_"
4,"_","_","_","rāja","NC","","_","_"
5,"_","_","_","gopālaka","NC","","_","_"
6,"_","_","_","pulindaka","NC","","_","_"
1,"rājñāṃ","_","_","rājan","NC","","_","_"
2,"_","_","_","saṃmānana","NC","","_","_"
3,"_","_","_","artha","NC","","_","_"
4,"ca","_","_","ca","CCD","","_","_"
5,"paurāṇāṃ","_","_","paura","NC","","_","_"
6,"ca","_","_","ca","CCD","","_","_"
7,"yathocitam","_","_","yathocita","JJ","","_","_"
1,"_","_","_","yaugaṃdharāyaṇa","NC","","_","_"
2,"_","_","_","tad","PRD","","_","_"
3,"_","_","_","rumaṇvat","NC","","_","_"
4,"_","_","_","ca","CCD","","_","_"
5,"nyayujyata","_","_","niyuj","V","niyuj","_","_"
1,"tato","_","_","tatas","CX","","_","_"
2,"_","_","_","abravīta","V","brū","_","_"
3,"_","_","_","rumaṇvat","NC","","_","_"
4,"_","_","_","eva","CX","","_","_"
5,"yaugandharāyaṇaḥ","_","_","yaugaṃdharāyaṇa","NC","","_","_"
1,"rājñā","_","_","rājan","NC","","_","_"
2,"kaṣṭe","_","_","kaṣṭa","NC","","_","_"
3,"niyuktau","_","_","niyuj","PPP","","_","_"
4,"svo","_","_","as","V","as","_","_"
5,"_","_","_","loka","NC","","_","_"
6,"_","_","_","citta","NC","","_","_"
7,"hi","_","_","hi","CX","","_","_"
8,"durgraham","_","_","durgraha","JJ","","_","_"
1,"_","_","_","a","CNG","","_","_"
2,"_","_","_","rañjay","PPP","","_","_"
3,"_","_","_","ca","CCD","","_","_"
4,"bālo","_","_","bāla","JJ","","_","_"
5,"'pi","_","_","api","CX","","_","_"
6,"_","_","_","roṣa","NC","","_","_"
7,"_","_","_","utpāday","V","utpāday","_","_"
8,"_","_","_","dhruva","CX","","_","_"
1,"tathā","_","_","tathā","CX","","_","_"
2,"ca","_","_","ca","CCD","","_","_"
3,"_","_","_","śṛṇ","V","śru","_","_"
4,"_","_","_","ida","PRD","","_","_"
5,"_","_","_","bālavinaṣṭaka","NC","","_","_"
6,"_","_","_","kathā","NC","","_","_"
7,"sakhe","_","_","sakhi","NC","","_","_"
1,"babhūva","_","_","bhav","V","bhū","_","_"
2,"_","_","_","rudraśarman","NC","","_","_"
3,"_","_","_","ākhyā","NC","","_","_"
4,"kaścana","_","_","kaścana","PRI","","_","_"
5,"brāhmaṇaḥ","_","_","brāhmaṇa","NC","","_","_"
6,"purā","_","_","purā","CX","","_","_"
1,"_","_","_","bhav","V","bhū","_","_"
2,"_","_","_","ca","CCD","","_","_"
3,"tasya","_","_","tad","PRD","","_","_"
4,"dve","_","_","dvi","NUM","","_","_"
5,"gṛhiṇyau","_","_","gṛhiṇī","NC","","_","_"
6,"gṛhamedhinaḥ","_","_","gṛhamedhin","JJ","","_","_"
1,"ekā","_","_","eka","PPX","","_","_"
2,"sutaṃ","_","_","suta","NC","","_","_"
3,"_","_","_","prasū","CGDA","","_","_"
4,"_","_","_","eva","CEM","","_","_"
5,"tasya","_","_","tad","PRD","","_","_"
6,"_","_","_","pañcatva","NC","","_","_"
7,"_","_","_","āyā","V","āyā","_","_"
1,"_","_","_","tad","PRD","","_","_"
2,"_","_","_","suta","NC","","_","_"
3,"_","_","_","apara","PPX","","_","_"
4,"_","_","_","mātṛ","NC","","_","_"
5,"_","_","_","ca","CCD","","_","_"
6,"haste","_","_","hasta","NC","","_","_"
7,"_","_","_","tad","PRD","","_","_"
8,"_","_","_","arpay","PPP","","_","_"
9,"'tha","_","_","atha","CAD","","_","_"
10,"saḥ","_","_","tad","PRD","","_","_"
1,"sā","_","_","tad","PRD","","_","_"
2,"ca","_","_","ca","CCD","","_","_"
3,"_","_","_","kiṃcit","PRI","","_","_"
4,"_","_","_","vivṛdh","PPP","","_","_"
5,"rūkṣaṃ","_","_","rūkṣa","JJ","","_","_"
6,"_","_","_","tad","PRD","","_","_"
7,"_","_","_","aśana","NC","","_","_"
8,"dadau","_","_","dad","V","dā","_","_"
1,"so","_","_","tad","PRD","","_","_"
2,"'pi","_","_","api","CX","","_","_"
3,"_","_","_","tad","PRD","","_","_"
4,"_","_","_","bhav","V","bhū","_","_"
5,"_","_","_","bāla","NC","","_","_"
6,"_","_","_","dhūsara","JJ","","_","_"
7,"_","_","_","aṅga","NC","","_","_"
8,"_","_","_","pṛthu","JJ","","_","_"
9,"_","_","_","udara","NC","","_","_"
1,"_","_","_","mātṛ","NC","","_","_"
2,"_","_","_","hā","PPP","","_","_"
3,"_","_","_","tvat","PPR","","_","_"
4,"_","_","_","ida","PRD","","_","_"
5,"me","_","_","mat","PPR","","_","_"
6,"kathaṃ","_","_","katha","CX","","_","_"
7,"_","_","_","śiśu","NC","","_","_"
8,"_","_","_","upekṣ","PPP","","_","_"
1,"iti","_","_","iti","CQT","","_","_"
2,"_","_","_","tad","PRD","","_","_"
3,"_","_","_","apara","PPX","","_","_"
4,"patnīṃ","_","_","patnī","NC","","_","_"
5,"_","_","_","rudraśarman","NC","","_","_"
6,"_","_","_","atha","CAD","","_","_"
7,"so","_","_","tad","PRD","","_","_"
8,"'bhyadhāt","_","_","abhidadh","V","abhidhā","_","_"
1,"sevyamāno","_","_","sev","KDP","","_","_"
2,"'pi","_","_","api","CX","","_","_"
3,"hi","_","_","hi","CX","","_","_"
4,"_","_","_","sneha","NC","","_","_"
5,"_","_","_","īdṛś","JJ","","_","_"
6,"_","_","_","eva","CEM","","_","_"
7,"_","_","_","kiṃ","PRQ","","_","_"
8,"_","_","_","api","CX","","_","_"
9,"_","_","_","adas","PRD","","_","_"
1,"kiṃ","_","_","kiṃ","PRQ","","_","_"
2,"_","_","_","kar","V","kṛ","_","_"
3,"_","_","_","mat","PPR","","_","_"
4,"_","_","_","ida","PRD","","_","_"
5,"_","_","_","iti","CQT","","_","_"
6,"_","_","_","tad","PRD","","_","_"
7,"_","_","_","api","CX","","_","_"
8,"_","_","_","eva","CX","","_","_"
9,"_","_","_","pati","NC","","_","_"
10,"_","_","_","abravīta","V","brū","_","_"
1,"_","_","_","nūna","CX","","_","_"
2,"_","_","_","evaṃsvabhāva","JJ","","_","_"
3,"_","_","_","ida","PRD","","_","_"
4,"_","_","_","iti","CQT","","_","_"
5,"mene","_","_","man","V","man","_","_"
6,"ca","_","_","ca","CCD","","_","_"
7,"sa","_","_","tad","PRD","","_","_"
8,"dvijaḥ","_","_","dvija","NC","","_","_"
1,"_","_","_","strī","NC","","_","_"
2,"_","_","_","alīka","NC","","_","_"
3,"_","_","_","muh","PPP","","_","_"
4,"hi","_","_","hi","CX","","_","_"
5,"vacaḥ","_","_","vacas","NC","","_","_"
6,"ko","_","_","kiṃ","PRQ","","_","_"
7,"manyate","_","_","man","V","man","_","_"
8,"mṛṣā","_","_","mṛṣā","CX","","_","_"
1,"bāla","_","_","bāla","NC","","_","_"
2,"eva","_","_","eva","CEM","","_","_"
3,"vinaṣṭo","_","_","vinaś","PPP","","_","_"
4,"_","_","_","ida","PRD","","_","_"
5,"_","_","_","iti","CQT","","_","_"
6,"bālavinaṣṭakaḥ","_","_","bālavinaṣṭaka","NC","","_","_"
1,"nāmnā","_","_","nāman","NC","","_","_"
2,"sa","_","_","tad","PRD","","_","_"
3,"_","_","_","bālaka","NC","","_","_"
4,"_","_","_","tatra","CAD","","_","_"
5,"saṃvṛtto","_","_","saṃvṛt","PPP","","_","_"
6,"_","_","_","bhav","V","bhū","_","_"
7,"_","_","_","pitṛ","NC","","_","_"
8,"_","_","_","gṛha","NC","","_","_"
1,"_","_","_","adas","PRD","","_","_"
2,"_","_","_","apara","PPX","","_","_"
3,"_","_","_","mātṛ","NC","","_","_"
4,"māṃ","_","_","mat","PPR","","_","_"
5,"kadarthayati","_","_","kadarthay","V","kadarthay","_","_"
6,"sarvadā","_","_","sarvadā","CX","","_","_"
1,"varaṃ","_","_","vara","JJ","","_","_"
2,"pratikriyāṃ","_","_","pratikriyā","NC","","_","_"
3,"_","_","_","kiṃcit","PRI","","_","_"
4,"_","_","_","tad","PRD","","_","_"
5,"_","_","_","tad","PRD","","_","_"
6,"_","_","_","kar","V","kṛ","_","_"
7,"_","_","_","mat","PPR","","_","_"
1,"iti","_","_","iti","CQT","","_","_"
2,"saṃcintayāmāsa","_","_","saṃcintay","V","saṃcintay","_","_"
3,"so","_","_","tad","PRD","","_","_"
4,"'tha","_","_","atha","CAD","","_","_"
5,"bālavinaṣṭakaḥ","_","_","bālavinaṣṭaka","NC","","_","_"
1,"_","_","_","vyatī","PPP","","_","_"
2,"_","_","_","pañcan","NUM","","_","_"
3,"_","_","_","varṣa","NC","","_","_"
4,"'pi","_","_","api","CX","","_","_"
5,"vayasā","_","_","vayas","NC","","_","_"
6,"bata","_","_","bata","CX","","_","_"
7,"buddhimān","_","_","buddhimat","JJ","","_","_"
1,"_","_","_","atha","CAD","","_","_"
2,"_","_","_","āga","PPP","","_","_"
3,"_","_","_","rājan","NC","","_","_"
4,"_","_","_","kula","NC","","_","_"
5,"_","_","_","gad","V","gad","_","_"
6,"pitaraṃ","_","_","pitṛ","NC","","_","_"
7,"rahaḥ","_","_","rahas","NC","","_","_"
1,"tāta","_","_","tāta","NC","","_","_"
2,"dvau","_","_","dvi","NUM","","_","_"
3,"mama","_","_","mat","PPR","","_","_"
4,"tātau","_","_","tāta","NC","","_","_"
5,"sta","_","_","as","V","as","_","_"
6,"_","_","_","iti","CQT","","_","_"
7,"a","_","_","alpha_privativum","JJ","","_","_"
7,"_","_","_","vispaṣṭa","JJ","","_","_"
8,"girā","_","_","gir","NC","","_","_"
1,"evaṃ","_","_","eva","CX","","_","_"
2,"_","_","_","pratyaha","CX","","_","_"
3,"_","_","_","ah","V","ah","_","_"
4,"sma","_","_","sma","CX","","_","_"
5,"sa","_","_","tad","PRD","","_","_"
6,"bālaḥ","_","_","bāla","NC","","_","_"
7,"so","_","_","tad","PRD","","_","_"
8,"'pi","_","_","api","CX","","_","_"
9,"_","_","_","tad","PRD","","_","_"
10,"_","_","_","pitṛ","NC","","_","_"
1,"tāṃ","_","_","tad","PRD","","_","_"
2,"_","_","_","sa_saha","CX","","_","_"
3,"_","_","_","upapati","NC","","_","_"
4,"_","_","_","āśaṅk","CGDA","","_","_"
5,"bhāryāṃ","_","_","bhāryā","NC","","_","_"
6,"sparśe","_","_","sparśa","NC","","_","_"
7,"_","_","_","api","CX","","_","_"
8,"_","_","_","varjay","V","varjay","_","_"
1,"_","_","_","tad","PRD","","_","_"
2,"_","_","_","api","CX","","_","_"
3,"dadhyau","_","_","dhyā","V","dhyā","_","_"
4,"vinā","_","_","vinā","CX","","_","_"
5,"doṣaṃ","_","_","doṣa","NC","","_","_"
6,"_","_","_","kasmāt","CX","","_","_"
7,"_","_","_","mat","PPR","","_","_"
8,"kupitaḥ","_","_","kup","PPP","","_","_"
9,"patiḥ","_","_","pati","NC","","_","_"
1,"_","_","_","kiṃcit","PRI","","_","_"
2,"_","_","_","bālavinaṣṭa","NC","","_","_"
3,"kṛtaṃ","_","_","kṛ","PPP","","_","_"
4,"_","_","_","kiṃcit","PRI","","_","_"
5,"_","_","_","bhav","V","bhū","_","_"
6,"_","_","_","iti","CQT","","_","_"
1,"_","_","_","sa_saha","CX","","_","_"
2,"_","_","_","ādara","NC","","_","_"
3,"snapayitvā","_","_","snapay","CGDA","","_","_"
4,"ca","_","_","ca","CCD","","_","_"
5,"dattvā","_","_","dā","CGDA","","_","_"
6,"snigdhaṃ","_","_","snigdha","JJ","","_","_"
7,"ca","_","_","ca","CCD","","_","_"
8,"bhojanam","_","_","bhojana","NC","","_","_"
1,"_","_","_","kṛ","CGDA","","_","_"
2,"_","_","_","utsaṅga","NC","","_","_"
3,"ca","_","_","ca","CCD","","_","_"
4,"papraccha","_","_","pṛcch","V","prach","_","_"
5,"sā","_","_","tad","PRD","","_","_"
6,"taṃ","_","_","tad","PRD","","_","_"
7,"bālavinaṣṭakam","_","_","bālavinaṣṭaka","NC","","_","_"
1,"putra","_","_","putra","NC","","_","_"
2,"kiṃ","_","_","kim","CX","","_","_"
3,"_","_","_","roṣay","PPP","","_","_"
4,"_","_","_","tāta","NC","","_","_"
5,"rudraśarmā","_","_","rudraśarman","NC","","_","_"
6,"tvayā","_","_","tvat","PPR","","_","_"
7,"mayi","_","_","mat","PPR","","_","_"
1,"_","_","_","tad","PRD","","_","_"
2,"_","_","_","śru","CGDA","","_","_"
3,"_","_","_","eva","CEM","","_","_"
4,"sa","_","_","tad","PRD","","_","_"
5,"tāṃ","_","_","tad","PRD","","_","_"
6,"bālo","_","_","bāla","NC","","_","_"
7,"_","_","_","gad","V","gad","_","_"
8,"_","_","_","apara","PPX","","_","_"
9,"_","_","_","mātṛ","NC","","_","_"
1,"ato","_","_","atas","CX","","_","_"
2,"'dhikaṃ","_","_","adhika","JJ","","_","_"
3,"te","_","_","tvat","PPR","","_","_"
4,"kartāsmi","_","_","kar","V","kṛ","_","_"
5,"na","_","_","na","CNG","","_","_"
6,"_","_","_","ced","CX","","_","_"
7,"_","_","_","adya","CX","","_","_"
8,"_","_","_","api","CX","","_","_"
9,"śāmyasi","_","_","śa","V","śa","_","_"
1,"_","_","_","sva","JJ","","_","_"
2,"_","_","_","putra","NC","","_","_"
3,"_","_","_","poṣin","JJ","","_","_"
4,"_","_","_","kasmāt","CX","","_","_"
5,"_","_","_","tvat","PPR","","_","_"
6,"māṃ","_","_","mat","PPR","","_","_"
7,"kliśnāsi","_","_","kliś","V","kliś","_","_"
8,"sarvadā","_","_","sarvadā","CX","","_","_"
1,"_","_","_","tad","PRD","","_","_"
2,"_","_","_","śru","CGDA","","_","_"
3,"praṇatā","_","_","praṇa","PPP","","_","_"
4,"sā","_","_","tad","PRD","","_","_"
5,"taṃ","_","_","tad","PRD","","_","_"
6,"babhāṣe","_","_","bhāṣ","V","bhāṣ","_","_"
7,"_","_","_","śapatha","NC","","_","_"
8,"_","_","_","uttara","JJ","","_","_"
1,"_","_","_","punar","CAD","","_","_"
2,"_","_","_","na","CNG","","_","_"
3,"_","_","_","eva","CX","","_","_"
4,"kariṣyāmi","_","_","kar","V","kṛ","_","_"
5,"_","_","_","tad","PRD","","_","_"
6,"_","_","_","prasāda","NC","","_","_"
7,"me","_","_","mat","PPR","","_","_"
8,"patim","_","_","pati","NC","","_","_"
1,"tataḥ","_","_","tatas","CX","","_","_"
2,"sa","_","_","tad","PRD","","_","_"
3,"bālo","_","_","bāla","NC","","_","_"
4,"_","_","_","vad","V","vad","_","_"
5,"_","_","_","tad","PRD","","_","_"
6,"_","_","_","tarhi","CX","","_","_"
7,"_","_","_","āyā","PPP","","_","_"
8,"_","_","_","mat","PPR","","_","_"
9,"_","_","_","pitṛ","NC","","_","_"
1,"ādarśaṃ","_","_","ādarśa","NC","","_","_"
2,"_","_","_","darśay","V","darśay","_","_"
3,"_","_","_","eka","PPX","","_","_"
4,"_","_","_","tvat","PPR","","_","_"
5,"_","_","_","ceṭī","NC","","_","_"
6,"_","_","_","vid","V","vid","_","_"
7,"_","_","_","mat","PPR","","_","_"
8,"param","_","_","para","PPX","","_","_"
1,"_","_","_","tathā","CX","","_","_"
2,"_","_","_","iti","CQT","","_","_"
3,"_","_","_","vac","CGDA","","_","_"
4,"tayā","_","_","tad","PRD","","_","_"
5,"ceṭī","_","_","ceṭī","NC","","_","_"
6,"niyuktā","_","_","niyuj","PPP","","_","_"
7,"rudraśarmaṇaḥ","_","_","rudraśarman","NC","","_","_"
1,"āgatasya","_","_","āga","PPP","","_","_"
2,"_","_","_","kṣaṇa","NC","","_","_"
3,"_","_","_","tad","PRD","","_","_"
4,"darśayāmāsa","_","_","darśay","V","darśay","_","_"
5,"darpaṇam","_","_","darpaṇa","NC","","_","_"
1,"tatra","_","_","tatra","CAD","","_","_"
2,"_","_","_","tad","PRD","","_","_"
3,"_","_","_","eva","CEM","","_","_"
4,"_","_","_","tad","PRD","","_","_"
5,"_","_","_","kāla","NC","","_","_"
6,"pratibimbaṃ","_","_","pratibimba","NC","","_","_"
7,"sa","_","_","tad","PRD","","_","_"
8,"darśayan","_","_","darśay","KDP","","_","_"
1,"so","_","_","tad","PRD","","_","_"
2,"'yaṃ","_","_","ida","PRD","","_","_"
3,"dvitīyas","_","_","dvitīya","JJ","","_","_"
4,"tāto","_","_","tāta","NC","","_","_"
5,"me","_","_","mat","PPR","","_","_"
6,"_","_","_","tāta","NC","","_","_"
7,"_","_","_","iti","CQT","","_","_"
8,"_","_","_","ah","V","ah","_","_"
9,"sma","_","_","sma","CX","","_","_"
10,"bālakaḥ","_","_","bālaka","NC","","_","_"
1,"_","_","_","tad","PRD","","_","_"
2,"_","_","_","śru","CGDA","","_","_"
3,"_","_","_","viga","PPP","","_","_"
4,"_","_","_","āśaṅkā","NC","","_","_"
5,"_","_","_","tad","PRD","","_","_"
6,"_","_","_","akāraṇa","NC","","_","_"
7,"_","_","_","dūṣay","PPP","","_","_"
1,"patnīṃ","_","_","patnī","NC","","_","_"
2,"prati","_","_","prati","CADP","","_","_"
3,"prasanno","_","_","prasad","PPP","","_","_"
4,"_","_","_","bhav","V","bhū","_","_"
5,"_","_","_","rudraśarman","NC","","_","_"
6,"_","_","_","tadā","CAD","","_","_"
7,"_","_","_","eva","CEM","","_","_"
8,"saḥ","_","_","tad","PRD","","_","_"
1,"_","_","_","eva","CX","","_","_"
2,"_","_","_","utpāday","V","utpāday","_","_"
3,"_","_","_","doṣa","NC","","_","_"
4,"bālo","_","_","bāla","NC","","_","_"
5,"'pi","_","_","api","CX","","_","_"
6,"vikṛtiṃ","_","_","vikṛti","NC","","_","_"
7,"gataḥ","_","_","ga","PPP","","_","_"
1,"_","_","_","tad","PRD","","_","_"
2,"_","_","_","ida","PRD","","_","_"
3,"rañjanīyo","_","_","rañjay","KDG","","_","_"
4,"naḥ","_","_","mat","PPR","","_","_"
5,"_","_","_","samyak","CX","","_","_"
6,"_","_","_","parikara","NC","","_","_"
7,"'khilaḥ","_","_","akhila","JJ","","_","_"
1,"_","_","_","iti","CQT","","_","_"
2,"_","_","_","vac","CGDA","","_","_"
3,"_","_","_","sa_saha","CX","","_","_"
4,"_","_","_","rumaṇvatka","NC","","_","_"
5,"so","_","_","tad","PRD","","_","_"
6,"'tha","_","_","atha","CAD","","_","_"
7,"yaugandharāyaṇaḥ","_","_","yaugaṃdharāyaṇa","NC","","_","_"
1,"sarvaṃ","_","_","sarva","JQ","","_","_"
2,"saṃmānayāmāsa","_","_","saṃmānay","V","saṃmānay","_","_"
3,"_","_","_","vatsa","NC","","_","_"
4,"_","_","_","rājan","NC","","_","_"
5,"_","_","_","utsava","NC","","_","_"
6,"janam","_","_","jana","NC","","_","_"
1,"tathā","_","_","tathā","CX","","_","_"
2,"ca","_","_","ca","CCD","","_","_"
3,"_","_","_","rājan","NC","","_","_"
4,"_","_","_","loka","NC","","_","_"
5,"tau","_","_","tad","PRD","","_","_"
6,"_","_","_","rañjay","V","rañjay","_","_"
7,"_","_","_","yathā","CCM","","_","_"
1,"_","_","_","mat","PPR","","_","_"
2,"_","_","_","eka","PPX","","_","_"
3,"_","_","_","pravaṇa","JJ","","_","_"
4,"_","_","_","tad","PRD","","_","_"
5,"_","_","_","iti","CQT","","_","_"
6,"sarvo","_","_","sarva","JQ","","_","_"
7,"_","_","_","api","CX","","_","_"
8,"_","_","_","man","V","man","_","_"
1,"tau","_","_","tad","PRD","","_","_"
2,"_","_","_","ca","CCD","","_","_"
3,"_","_","_","api","CX","","_","_"
4,"_","_","_","pūjay","V","pūjay","_","_"
5,"_","_","_","rājan","NC","","_","_"
6,"sacivau","_","_","saciva","NC","","_","_"
7,"_","_","_","sva","JJ","","_","_"
8,"_","_","_","kara","NC","","_","_"
9,"_","_","_","arpay","PPP","","_","_"
1,"_","_","_","vastra","NC","","_","_"
2,"_","_","_","aṅgarāga","NC","","_","_"
3,"_","_","_","ābharaṇa","NC","","_","_"
4,"_","_","_","grāma","NC","","_","_"
5,"_","_","_","ca","CCD","","_","_"
6,"_","_","_","sa_saha","CX","","_","_"
7,"_","_","_","vasantaka","NC","","_","_"
1,"_","_","_","kṛ","PPP","","_","_"
2,"_","_","_","udvāha","NC","","_","_"
3,"_","_","_","utsava","NC","","_","_"
4,"so","_","_","tad","PRD","","_","_"
5,"'tha","_","_","atha","CAD","","_","_"
6,"yukto","_","_","yuj","PPP","","_","_"
7,"_","_","_","vatsa","NC","","_","_"
8,"_","_","_","īśvara","NC","","_","_"
9,"_","_","_","tad","PRD","","_","_"
1,"_","_","_","manoratha","NC","","_","_"
2,"_","_","_","phala","NC","","_","_"
3,"_","_","_","eva","CEM","","_","_"
4,"mene","_","_","man","V","man","_","_"
5,"vāsavadattayā","_","_","vāsavadattā","NC","","_","_"
1,"_","_","_","cirāt","CX","","_","_"
2,"_","_","_","unmudray","PPP","","_","_"
3,"_","_","_","sneha","NC","","_","_"
4,"_","_","_","kiṃ","PRQ","","_","_"
5,"_","_","_","api","CX","","_","_"
6,"_","_","_","bhav","V","bhū","_","_"
7,"satataṃ","_","_","satata","CX","","_","_"
8,"tayoḥ","_","_","tad","PRD","","_","_"
1,"_","_","_","niśa","PPP","","_","_"
2,"_","_","_","kliś","PPP","","_","_"
3,"_","_","_","cakrāhva","NC","","_","_"
4,"_","_","_","rīti","NC","","_","_"
5,"_","_","_","hṛdya","JJ","","_","_"
6,"_","_","_","rasa","NC","","_","_"
7,"_","_","_","krama","NC","","_","_"
1,"yathā","_","_","yathā","CCM","","_","_"
2,"yathā","_","_","yathā","CCM","","_","_"
3,"ca","_","_","ca","CCD","","_","_"
4,"daṃpatyoḥ","_","_","dampati","NC","","_","_"
5,"prauḍhiṃ","_","_","prauḍhi","NC","","_","_"
6,"paricayo","_","_","paricaya","NC","","_","_"
7,"yayau","_","_","yā","V","yā","_","_"
1,"_","_","_","tad","PRD","","_","_"
2,"_","_","_","tathā","CX","","_","_"
3,"tathā","_","_","tathā","CX","","_","_"
4,"prema","_","_","preman","NC","","_","_"
5,"_","_","_","navībhāva","NC","","_","_"
6,"_","_","_","iva","CCM","","_","_"
7,"_","_","_","āyā","V","āyā","_","_"
1,"gopālako","_","_","gopālaka","NC","","_","_"
2,"'tha","_","_","atha","CAD","","_","_"
3,"_","_","_","vivāha","NC","","_","_"
4,"_","_","_","kartṛ","JJ","","_","_"
5,"saṃdeśataḥ","_","_","saṃdeśa","NC","","_","_"
6,"pituḥ","_","_","pitṛ","NC","","_","_"
1,"prayayau","_","_","prayā","V","prayā","_","_"
2,"_","_","_","śīghra","CX","","_","_"
3,"_","_","_","āvṛtti","NC","","_","_"
4,"_","_","_","vatsa","NC","","_","_"
5,"_","_","_","rāja","NC","","_","_"
6,"yācitaḥ","_","_","yāc","PPP","","_","_"
1,"so","_","_","tad","PRD","","_","_"
2,"'pi","_","_","api","CX","","_","_"
3,"_","_","_","vatsa","NC","","_","_"
4,"_","_","_","īśvara","NC","","_","_"
5,"jātu","_","_","jātu","CX","","_","_"
6,"capalaḥ","_","_","capala","JJ","","_","_"
7,"_","_","_","pūrva","PPX","","_","_"
8,"_","_","_","saṃga","PPP","","_","_"
1,"guptaṃ","_","_","gup","PPP","","_","_"
2,"viracitāṃ","_","_","viracitā","NC","","_","_"
3,"nāma","_","_","nāma","CX","","_","_"
4,"bheje","_","_","bhaj","V","bhaj","_","_"
5,"_","_","_","antaḥpura","NC","","_","_"
6,"_","_","_","cārikā","NC","","_","_"
1,"_","_","_","tad","PRD","","_","_"
2,"_","_","_","gotra","NC","","_","_"
3,"_","_","_","skhal","PPP","","_","_"
4,"devīṃ","_","_","devī","NC","","_","_"
5,"_","_","_","pāda","NC","","_","_"
6,"_","_","_","lag","PPP","","_","_"
7,"prasādayan","_","_","prasāday","KDP","","_","_"
1,"lebhe","_","_","labh","V","labh","_","_"
2,"_","_","_","subhaga","JJ","","_","_"
3,"_","_","_","sāmrājya","NC","","_","_"
4,"_","_","_","abhiṣic","PPP","","_","_"
5,"_","_","_","tad","PRD","","_","_"
6,"_","_","_","aśru","NC","","_","_"
1,"kiṃca","_","_","kiṃca","CX","","_","_"
2,"bandhumatīṃ","_","_","bandhumatī","NC","","_","_"
3,"nāma","_","_","nāma","CX","","_","_"
4,"_","_","_","rājan","NC","","_","_"
5,"_","_","_","putrī","NC","","_","_"
6,"_","_","_","bhuja","NC","","_","_"
7,"_","_","_","arjay","PPP","","_","_"
1,"gopālakena","_","_","gopālaka","NC","","_","_"
2,"prahitāṃ","_","_","prahi","PPP","","_","_"
3,"kanyāṃ","_","_","kanyā","NC","","_","_"
4,"devyā","_","_","devī","NC","","_","_"
5,"upāyanam","_","_","upāyana","NC","","_","_"
1,"tayā","_","_","tad","PRD","","_","_"
2,"_","_","_","mañjulikā","NC","","_","_"
3,"_","_","_","iti","CQT","","_","_"
4,"_","_","_","eva","CEM","","_","_"
5,"_","_","_","nāman","NC","","_","_"
6,"_","_","_","anya","PPX","","_","_"
7,"_","_","_","eva","CEM","","_","_"
8,"gopitām","_","_","gopay","PPP","","_","_"
1,"_","_","_","apara","PPX","","_","_"
2,"_","_","_","iva","CCM","","_","_"
3,"_","_","_","lāvaṇya","NC","","_","_"
4,"_","_","_","jaladhi","NC","","_","_"
5,"_","_","_","udga","PPP","","_","_"
6,"śriyam","_","_","śrī","NC","","_","_"
1,"_","_","_","vasantaka","NC","","_","_"
2,"_","_","_","sahāya","NC","","_","_"
3,"_","_","_","saṃdṛś","CGDA","","_","_"
4,"_","_","_","udyāna","NC","","_","_"
5,"_","_","_","latā","NC","","_","_"
6,"_","_","_","gṛha","NC","","_","_"
1,"_","_","_","gāndharva","JJ","","_","_"
2,"_","_","_","vidhi","NC","","_","_"
3,"_","_","_","gup","PPP","","_","_"
4,"_","_","_","upaya","V","upaya","_","_"
5,"sa","_","_","tad","PRD","","_","_"
6,"bhūpatiḥ","_","_","bhūpati","NC","","_","_"
1,"_","_","_","tad","PRD","","_","_"
2,"_","_","_","ca","CCD","","_","_"
3,"_","_","_","vāsavadattā","NC","","_","_"
4,"_","_","_","ida","PRD","","_","_"
5,"dadarśa","_","_","darś","V","dṛś","_","_"
6,"_","_","_","nibhṛta","JJ","","_","_"
7,"_","_","_","sthā","PPP","","_","_"
1,"pracukopa","_","_","prakup","V","prakup","_","_"
2,"ca","_","_","ca","CCD","","_","_"
3,"baddhvā","_","_","bandh","CGDA","","_","_"
4,"ca","_","_","ca","CCD","","_","_"
5,"sā","_","_","tad","PRD","","_","_"
6,"nināya","_","_","nay","V","nī","_","_"
7,"vasantakam","_","_","vasantaka","NC","","_","_"
1,"tataḥ","_","_","tatas","CX","","_","_"
2,"pravrājikāṃ","_","_","pravrājikā","NC","","_","_"
3,"tasyāḥ","_","_","tad","PRD","","_","_"
4,"sakhīṃ","_","_","sakhī","NC","","_","_"
5,"_","_","_","pitṛ","NC","","_","_"
6,"_","_","_","kula","NC","","_","_"
7,"_","_","_","āga","PPP","","_","_"
1,"sa","_","_","tad","PRD","","_","_"
2,"sāṃkṛtyāyanīṃ","_","_","sāṃkṛtyāyanī","NC","","_","_"
3,"nāma","_","_","nāma","CX","","_","_"
4,"śaraṇaṃ","_","_","śaraṇa","NC","","_","_"
5,"śiśriye","_","_","śray","V","śri","_","_"
6,"nṛpaḥ","_","_","nṛpa","NC","","_","_"
1,"sā","_","_","tad","PRD","","_","_"
2,"tāṃ","_","_","tad","PRD","","_","_"
3,"prasādya","_","_","prasāday","CGDA","","_","_"
4,"mahiṣīṃ","_","_","mahiṣī","NC","","_","_"
5,"tayā","_","_","tad","PRD","","_","_"
6,"_","_","_","tad","PRD","","_","_"
7,"_","_","_","eva","CEM","","_","_"
8,"_","_","_","kṛ","PPP","","_","_"
9,"_","_","_","ājñā","NC","","_","_"
1,"dadau","_","_","dad","V","dā","_","_"
2,"bandhumatīṃ","_","_","bandhumatī","NC","","_","_"
3,"rājñe","_","_","rājan","NC","","_","_"
4,"peśalaṃ","_","_","peśala","JJ","","_","_"
5,"hi","_","_","hi","CX","","_","_"
6,"_","_","_","satī","NC","","_","_"
7,"_","_","_","manas","NC","","_","_"
1,"_","_","_","tatas","CX","","_","_"
2,"_","_","_","tad","PRD","","_","_"
3,"_","_","_","bandhana","NC","","_","_"
4,"_","_","_","devī","NC","","_","_"
5,"sā","_","_","tad","PRD","","_","_"
6,"mumoca","_","_","muñc","V","muc","_","_"
7,"vasantakam","_","_","vasantaka","NC","","_","_"
1,"sa","_","_","tad","PRD","","_","_"
2,"_","_","_","ca","CCD","","_","_"
3,"_","_","_","āga","CGDA","","_","_"
4,"_","_","_","agratas","CX","","_","_"
5,"rājñīṃ","_","_","rājñī","NC","","_","_"
6,"_","_","_","has","KDP","","_","_"
7,"_","_","_","iti","CQT","","_","_"
8,"jagāda","_","_","gad","V","gad","_","_"
9,"tām","_","_","tad","PRD","","_","_"
1,"_","_","_","bandhumatī","NC","","_","_"
2,"_","_","_","aparādh","PPP","","_","_"
3,"ca","_","_","ca","CCD","","_","_"
4,"kiṃ","_","_","kiṃ","PRQ","","_","_"
5,"mayā","_","_","mat","PPR","","_","_"
6,"devi","_","_","devī","NC","","_","_"
7,"te","_","_","tvat","PPR","","_","_"
8,"kṛtam","_","_","kṛ","PPP","","_","_"
1,"ḍuṇḍubheṣu","_","_","ḍuṇḍubha","NC","","_","_"
2,"praharatha","_","_","prahar","V","prahṛ","_","_"
3,"kruddhā","_","_","krudh","PPP","","_","_"
4,"yūyam","_","_","tvat","PPR","","_","_"
5,"ahīn","_","_","ahi","NC","","_","_"
6,"prati","_","_","prati","CADP","","_","_"
1,"_","_","_","tad","PRD","","_","_"
2,"_","_","_","tvat","PPR","","_","_"
3,"_","_","_","upamāna","NC","","_","_"
4,"me","_","_","mat","PPR","","_","_"
5,"_","_","_","vyācakṣ","V","vyācakṣ","_","_"
6,"_","_","_","iti","CQT","","_","_"
7,"kutūhalāt","_","_","kutūhala","NC","","_","_"
1,"devyā","_","_","devī","NC","","_","_"
2,"_","_","_","pracch","PPP","","_","_"
3,"_","_","_","tad","PRD","","_","_"
4,"so","_","_","tad","PRD","","_","_"
5,"'tha","_","_","atha","CAD","","_","_"
6,"_","_","_","punar","CAD","","_","_"
7,"_","_","_","ah","V","ah","_","_"
8,"vasantakaḥ","_","_","vasantaka","NC","","_","_"
1,"purā","_","_","purā","CX","","_","_"
2,"_","_","_","kiṃ","PRQ","","_","_"
3,"_","_","_","api","CX","","_","_"
4,"_","_","_","ruru","NC","","_","_"
5,"_","_","_","nāma","CX","","_","_"
6,"_","_","_","muni","NC","","_","_"
7,"_","_","_","putra","NC","","_","_"
8,"yadṛcchayā","_","_","yadṛcchā","NC","","_","_"
1,"paribhraman","_","_","paribhra","KDP","","_","_"
2,"_","_","_","darś","V","dṛś","_","_"
3,"_","_","_","eka","PPX","","_","_"
4,"kanyām","_","_","kanyā","NC","","_","_"
5,"_","_","_","adbhuta","JJ","","_","_"
6,"_","_","_","darśana","NC","","_","_"
1,"_","_","_","vidyādhara","NC","","_","_"
2,"_","_","_","samutpad","PPP","","_","_"
3,"menakāyāṃ","_","_","menakā","NC","","_","_"
4,"dyuyoṣiti","_","_","dyuyoṣit","NC","","_","_"
1,"sthūlakeśena","_","_","sthūlakeśa","NC","","_","_"
2,"muninā","_","_","muni","NC","","_","_"
3,"_","_","_","vardhay","PPP","","_","_"
4,"_","_","_","āśrama","NC","","_","_"
5,"nije","_","_","nija","JJ","","_","_"
1,"sā","_","_","tad","PRD","","_","_"
2,"ca","_","_","ca","CCD","","_","_"
3,"pramadvarā","_","_","pramadvarā","NC","","_","_"
4,"nāma","_","_","nāma","CX","","_","_"
5,"dṛṣṭā","_","_","dṛś","PPP","","_","_"
6,"tasya","_","_","tad","PRD","","_","_"
7,"_","_","_","ruru","NC","","_","_"
8,"_","_","_","manas","NC","","_","_"
1,"jahāra","_","_","har","V","hṛ","_","_"
2,"so","_","_","tad","PRD","","_","_"
3,"'tha","_","_","atha","CAD","","_","_"
4,"gatvā","_","_","ga","CGDA","","_","_"
5,"tāṃ","_","_","tad","PRD","","_","_"
6,"_","_","_","sthūlakeśa","NC","","_","_"
7,"_","_","_","yāc","V","yāc","_","_"
1,"sthūlakeśo","_","_","sthūlakeśa","NC","","_","_"
2,"'pi","_","_","api","CX","","_","_"
3,"tāṃ","_","_","tad","PRD","","_","_"
4,"tasmai","_","_","tad","PRD","","_","_"
5,"pratiśuśrāva","_","_","pratiśṛṇ","V","pratiśru","_","_"
6,"kanyakām","_","_","kanyakā","NC","","_","_"
1,"āsanne","_","_","āsad","PPP","","_","_"
2,"ca","_","_","ca","CCD","","_","_"
3,"vivāhe","_","_","vivāha","NC","","_","_"
4,"_","_","_","tad","PRD","","_","_"
5,"_","_","_","akasmāt","CX","","_","_"
6,"_","_","_","daṃś","KDP","","_","_"
7,"_","_","_","ahi","NC","","_","_"
1,"tato","_","_","tatas","CX","","_","_"
2,"_","_","_","viṣad","PPP","","_","_"
3,"_","_","_","hṛdaya","NC","","_","_"
4,"_","_","_","śṛṇ","V","śru","_","_"
5,"_","_","_","ida","PRD","","_","_"
6,"giraṃ","_","_","gir","NC","","_","_"
7,"divi","_","_","div","NC","","_","_"
1,"etāṃ","_","_","tad","PRD","","_","_"
2,"_","_","_","kṣi","PPP","","_","_"
3,"_","_","_","āyus","NC","","_","_"
4,"_","_","_","brahman","NC","","_","_"
5,"_","_","_","sva","JJ","","_","_"
6,"_","_","_","āyus","NC","","_","_"
7,"'rdhena","_","_","ardha","NC","","_","_"
8,"jīvaya","_","_","jīvay","V","jīvay","_","_"
1,"_","_","_","tad","PRD","","_","_"
2,"_","_","_","śru","CGDA","","_","_"
3,"sa","_","_","tad","PRD","","_","_"
4,"dadau","_","_","dad","V","dā","_","_"
5,"tasyai","_","_","tad","PRD","","_","_"
6,"_","_","_","tadā","CAD","","_","_"
7,"_","_","_","eva","CEM","","_","_"
8,"_","_","_","ardha","NC","","_","_"
9,"_","_","_","nija","JJ","","_","_"
10,"_","_","_","āyus","NC","","_","_"
1,"pratyujjijīva","_","_","pratyujjīv","V","pratyujjīv","_","_"
2,"sā","_","_","tad","PRD","","_","_"
3,"tena","_","_","tad","PRD","","_","_"
4,"so","_","_","tad","PRD","","_","_"
5,"'pi","_","_","api","CX","","_","_"
6,"tāṃ","_","_","tad","PRD","","_","_"
7,"pariṇītavān","_","_","pariṇī","KDP","","_","_"
1,"atha","_","_","atha","CAD","","_","_"
2,"kruddho","_","_","krudh","PPP","","_","_"
3,"_","_","_","ruru","NC","","_","_"
4,"_","_","_","nitya","CX","","_","_"
5,"yaṃ","_","_","yad","PRL","","_","_"
6,"yaṃ","_","_","yad","PRL","","_","_"
7,"sarpaṃ","_","_","sarpa","NC","","_","_"
8,"dadarśa","_","_","darś","V","dṛś","_","_"
9,"saḥ","_","_","tad","PRD","","_","_"
1,"taṃ","_","_","tad","PRD","","_","_"
2,"taṃ","_","_","tad","PRD","","_","_"
3,"jaghāna","_","_","han","V","han","_","_"
4,"bhāryā","_","_","bhāryā","NC","","_","_"
5,"me","_","_","mat","PPR","","_","_"
6,"_","_","_","daṃś","PPP","","_","_"
7,"_","_","_","adas","PRD","","_","_"
8,"_","_","_","bhav","V","bhū","_","_"
9,"_","_","_","iti","CQT","","_","_"
1,"_","_","_","atha","CAD","","_","_"
2,"_","_","_","eka","PPX","","_","_"
3,"taṃ","_","_","tad","PRD","","_","_"
4,"jighāṃsantaṃ","_","_","jighāṃs","KDP","","_","_"
5,"_","_","_","martya","NC","","_","_"
6,"_","_","_","vāc","NC","","_","_"
7,"_","_","_","ha","CEM","","_","_"
8,"ḍuṇḍubhaḥ","_","_","ḍuṇḍubha","NC","","_","_"
1,"ahibhyaḥ","_","_","ahi","NC","","_","_"
2,"kupito","_","_","kup","PPP","","_","_"
3,"brahman","_","_","brahman","NC","","_","_"
4,"haṃsi","_","_","han","V","han","_","_"
5,"tvaṃ","_","_","tvat","PPR","","_","_"
6,"ḍuṇḍubhān","_","_","ḍuṇḍubha","NC","","_","_"
7,"katham","_","_","katha","CX","","_","_"
1,"ahinā","_","_","ahi","NC","","_","_"
2,"te","_","_","tvat","PPR","","_","_"
3,"priyā","_","_","priyā","NC","","_","_"
4,"daṣṭā","_","_","daṃś","PPP","","_","_"
5,"vibhinnau","_","_","vibhid","PPP","","_","_"
6,"_","_","_","ca","CCD","","_","_"
7,"_","_","_","ahi","NC","","_","_"
8,"_","_","_","ḍuṇḍubha","NC","","_","_"
1,"ahayaḥ","_","_","ahi","NC","","_","_"
2,"_","_","_","sa_saha","CX","","_","_"
3,"_","_","_","viṣa","NC","","_","_"
4,"sarve","_","_","sarva","JQ","","_","_"
5,"nirviṣā","_","_","nirviṣa","JJ","","_","_"
6,"ḍuṇḍubhā","_","_","ḍuṇḍubha","NC","","_","_"
7,"iti","_","_","iti","CQT","","_","_"
1,"_","_","_","tad","PRD","","_","_"
2,"_","_","_","śru","CGDA","","_","_"
3,"_","_","_","prativad","V","prativad","_","_"
4,"_","_","_","tad","PRD","","_","_"
5,"sakhe","_","_","sakhi","NC","","_","_"
6,"ko","_","_","kiṃ","PRQ","","_","_"
7,"nu","_","_","nu","CX","","_","_"
8,"_","_","_","bhavat","JJ","","_","_"
9,"_","_","_","iti","CQT","","_","_"
1,"ḍuṇḍubho","_","_","ḍuṇḍubha","NC","","_","_"
2,"_","_","_","api","CX","","_","_"
3,"_","_","_","vad","V","vad","_","_"
4,"_","_","_","brahman","NC","","_","_"
5,"_","_","_","mat","PPR","","_","_"
6,"_","_","_","śāpa","NC","","_","_"
7,"_","_","_","cyu","PPP","","_","_"
8,"muniḥ","_","_","muni","NC","","_","_"
1,"_","_","_","bhavat","JJ","","_","_"
2,"_","_","_","saṃvāda","NC","","_","_"
3,"_","_","_","paryanta","NC","","_","_"
4,"śāpo","_","_","śāpa","NC","","_","_"
5,"'yam","_","_","ida","PRD","","_","_"
6,"abhavac","_","_","bhav","V","bhū","_","_"
7,"ca","_","_","ca","CCD","","_","_"
8,"me","_","_","mat","PPR","","_","_"
1,"ity","_","_","iti","CQT","","_","_"
2,"_","_","_","vac","CGDA","","_","_"
3,"_","_","_","antardhā","PPP","","_","_"
4,"tasmin","_","_","tad","PRD","","_","_"
5,"bhūyas","_","_","bhūyas","CX","","_","_"
6,"tān","_","_","tad","PRD","","_","_"
7,"_","_","_","na","CNG","","_","_"
8,"_","_","_","vadh","V","vadh","_","_"
9,"guruḥ","_","_","guru","NC","","_","_"
1,"_","_","_","tad","PRD","","_","_"
2,"_","_","_","tad","PRD","","_","_"
3,"_","_","_","upamāna","NC","","_","_"
4,"tava","_","_","tvat","PPR","","_","_"
5,"devi","_","_","devī","NC","","_","_"
6,"_","_","_","mat","PPR","","_","_"
7,"_","_","_","vad","PPP","","_","_"
1,"ḍuṇḍubheṣu","_","_","ḍuṇḍubha","NC","","_","_"
2,"praharatha","_","_","prahar","V","prahṛ","_","_"
3,"kruddhā","_","_","krudh","PPP","","_","_"
4,"_","_","_","tvat","PPR","","_","_"
5,"_","_","_","ahi","NC","","_","_"
6,"_","_","_","iti","CQT","","_","_"
1,"_","_","_","eva","CX","","_","_"
2,"_","_","_","abhidhā","CGDA","","_","_"
3,"vacanaṃ","_","_","vacana","NC","","_","_"
4,"_","_","_","sa_saha","CX","","_","_"
5,"_","_","_","narman","NC","","_","_"
6,"_","_","_","hāsa","NC","","_","_"
7,"vasantake","_","_","vasantaka","NC","","_","_"
8,"virate","_","_","vira","PPP","","_","_"
1,"vāsavadattā","_","_","vāsavadattā","NC","","_","_"
2,"taṃ","_","_","tad","PRD","","_","_"
3,"prati","_","_","prati","CADP","","_","_"
4,"tutoṣa","_","_","tuṣ","V","tuṣ","_","_"
5,"pārśve","_","_","pārśva","NC","","_","_"
6,"sthitāṃ","_","_","sthā","PPP","","_","_"
7,"patyuḥ","_","_","pati","NC","","_","_"
1,"iti","_","_","iti","CQT","","_","_"
2,"_","_","_","madhu","NC","","_","_"
3,"_","_","_","madhura","JJ","","_","_"
4,"_","_","_","vatsa","NC","","_","_"
5,"_","_","_","rāja","NC","","_","_"
6,"_","_","_","caraṇa","NC","","_","_"
7,"_","_","_","ga","PPP","","_","_"
8,"_","_","_","kup","PPP","","_","_"
9,"_","_","_","anunāthana","JJ","","_","_"
1,"_","_","_","satata","CX","","_","_"
2,"_","_","_","udayana","NC","","_","_"
3,"_","_","_","kar","V","kṛ","_","_"
4,"devyā","_","_","devī","NC","","_","_"
5,"_","_","_","vividha","JJ","","_","_"
6,"_","_","_","vasantaka","NC","","_","_"
7,"_","_","_","kauśala","NC","","_","_"
8,"kāmī","_","_","kāmin","NC","","_","_"
1,"rasanā","_","_","rasanā","NC","","_","_"
2,"_","_","_","madirā","NC","","_","_"
3,"_","_","_","rasa","NC","","_","_"
4,"_","_","_","eka","PPX","","_","_"
5,"_","_","_","sañj","PPP","","_","_"
6,"_","_","_","kala","JJ","","_","_"
7,"_","_","_","vīṇā","NC","","_","_"
8,"_","_","_","rava","NC","","_","_"
9,"_","_","_","rāgin","JJ","","_","_"
10,"_","_","_","śruti","NC","","_","_"
11,"_","_","_","ca","CCD","","_","_"
1,"_","_","_","dayitā","NC","","_","_"
2,"_","_","_","mukha","NC","","_","_"
3,"_","_","_","niścala","JJ","","_","_"
4,"ca","_","_","ca","CCD","","_","_"
5,"dṛṣṭiḥ","_","_","dṛṣṭi","NC","","_","_"
6,"sukhinas","_","_","sukhin","JJ","","_","_"
7,"tasya","_","_","tad","PRD","","_","_"
8,"sadā","_","_","sadā","CAD","","_","_"
9,"babhūva","_","_","bhav","V","bhū","_","_"
10,"rājñaḥ","_","_","rājan","NC","","_","_"
