"WordID","word","NormSTEM","suffix","lemma","PoS","Root","NormSuffix","NormWord"
1,"harim","_","_","hari","JJ","","_","_"
2,"mṛjanty","_","_","mṛj","V","mṛj","_","_"
3,"aruṣo","_","_","aruṣa","JJ","","_","_"
4,"na","_","_","na","CNG","","_","_"
5,"yujyate","_","_","yuj","V","yuj","_","_"
6,"saṃ","_","_","sa","CADP","","_","_"
7,"dhenubhiḥ","_","_","dhenu","NC","","_","_"
8,"kalaśe","_","_","kalaśa","NC","","_","_"
9,"somo","_","_","soma","NC","","_","_"
10,"ajyate","_","_","añj","V","añj","_","_"
1,"ud","_","_","ud","CADP","","_","_"
2,"vācam","_","_","vāc","NC","","_","_"
3,"īrayati","_","_","īr","V","īr","_","_"
4,"hinvate","_","_","hi","V","hi","_","_"
5,"matī","_","_","mati","NC","","_","_"
6,"puruṣṭutasya","_","_","puruṣṭuta","JJ","","_","_"
7,"kati","_","_","kati","CX","","_","_"
8,"cit","_","_","cit","CEM","","_","_"
9,"paripriyaḥ","_","_","pariprī","JJ","","_","_"
1,"sākaṃ","_","_","sāka","CX","","_","_"
2,"vadanti","_","_","vad","V","vad","_","_"
3,"bahavo","_","_","bahu","JJ","","_","_"
4,"manīṣiṇa","_","_","manīṣin","JJ","","_","_"
5,"indrasya","_","_","indra","NC","","_","_"
6,"somaṃ","_","_","soma","NC","","_","_"
7,"jaṭhare","_","_","jaṭhara","NC","","_","_"
8,"yad","_","_","yat","CSB","","_","_"
9,"āduhuḥ","_","_","āduh","V","āduh","_","_"
1,"yadī","_","_","yadi","CSB","","_","_"
2,"mṛjanti","_","_","mṛj","V","mṛj","_","_"
3,"_","_","_","su","CAD","","_","_"
4,"_","_","_","gabhasti","NC","","_","_"
5,"naraḥ","_","_","nṛ","NC","","_","_"
6,"sanīﾱābhir","_","_","sanīḍa","JJ","","_","_"
7,"daśabhiḥ","_","_","daśan","NUM","","_","_"
8,"kāmyam","_","_","kāmya","JJ","","_","_"
9,"madhu","_","_","madhu","NC","","_","_"
1,"_","_","_","a","CNG","","_","_"
2,"_","_","_","ra","KDP","","_","_"
3,"aty","_","_","ati","CADP","","_","_"
4,"eti","_","_","e","V","i","_","_"
5,"gā","_","_","go","NC","","_","_"
6,"abhi","_","_","abhi","CADP","","_","_"
7,"sūryasya","_","_","sūrya","NC","","_","_"
8,"priyaṃ","_","_","priya","JJ","","_","_"
9,"duhitus","_","_","duhitṛ","NC","","_","_"
10,"tiro","_","_","tiras","CX","","_","_"
11,"ravam","_","_","rava","NC","","_","_"
1,"anv","_","_","anu","CADP","","_","_"
2,"asmai","_","_","ida","PRD","","_","_"
3,"joṣam","_","_","joṣa","NC","","_","_"
4,"abharad","_","_","bhṛ","V","bhṛ","_","_"
5,"vinaṅgṛsaḥ","_","_","vinaṅgṛsa","NC","","_","_"
6,"saṃ","_","_","sa","CADP","","_","_"
7,"dvayībhiḥ","_","_","dvayī","NC","","_","_"
8,"svasṛbhiḥ","_","_","svasṛ","NC","","_","_"
9,"kṣeti","_","_","kṣi","V","kṣi","_","_"
10,"jāmibhiḥ","_","_","jāmi","JJ","","_","_"
1,"_","_","_","nṛ","NC","","_","_"
2,"_","_","_","dhū","PPP","","_","_"
3,"adriṣuto","_","_","adriṣuta","JJ","","_","_"
4,"barhiṣi","_","_","barhis","NC","","_","_"
5,"priyaḥ","_","_","priya","JJ","","_","_"
6,"patir","_","_","pati","NC","","_","_"
7,"gavām","_","_","go","NC","","_","_"
8,"pradiva","_","_","pradiv","JJ","","_","_"
9,"indur","_","_","indu","NC","","_","_"
10,"ṛtviyaḥ","_","_","ṛtviya","JJ","","_","_"
1,"purandhivān","_","_","puraṃdhivat","JJ","","_","_"
2,"manuṣo","_","_","manus","NC","","_","_"
3,"_","_","_","yajña","NC","","_","_"
4,"_","_","_","sādhana","JJ","","_","_"
5,"śucir","_","_","śuci","JJ","","_","_"
6,"dhiyā","_","_","dhī","NC","","_","_"
7,"pavate","_","_","pū","V","pū","_","_"
8,"soma","_","_","soma","NC","","_","_"
9,"indra","_","_","indra","NC","","_","_"
10,"te","_","_","tvat","PPR","","_","_"
1,"_","_","_","nṛ","NC","","_","_"
2,"_","_","_","bāhu","NC","","_","_"
3,"codito","_","_","coday","PPP","","_","_"
4,"dhārayā","_","_","dhārā","NC","","_","_"
5,"suto","_","_","su","PPP","","_","_"
6,"'nuṣvadham","_","_","anuṣvadha","CX","","_","_"
7,"pavate","_","_","pū","V","pū","_","_"
8,"soma","_","_","soma","NC","","_","_"
9,"indra","_","_","indra","NC","","_","_"
10,"te","_","_","tvat","PPR","","_","_"
1,"āprāḥ","_","_","āprā","V","āprā","_","_"
2,"kratūn","_","_","kratu","NC","","_","_"
3,"sam","_","_","sa","CADP","","_","_"
4,"ajair","_","_","jay","V","ji","_","_"
5,"adhvare","_","_","adhvara","NC","","_","_"
6,"matīr","_","_","mati","NC","","_","_"
7,"ver","_","_","vi","NC","","_","_"
8,"na","_","_","na","CNG","","_","_"
9,"druṣac","_","_","druṣad","JJ","","_","_"
10,"camvor","_","_","camū","NC","","_","_"
11,"_","_","_","āsīd","V","āsad","_","_"
12,"_","_","_","hari","JJ","","_","_"
1,"aṃśuṃ","_","_","aṃśu","NC","","_","_"
2,"duhanti","_","_","duh","V","duh","_","_"
3,"stanayantam","_","_","stanay","KDP","","_","_"
4,"akṣitaṃ","_","_","akṣit","JJ","","_","_"
5,"kaviṃ","_","_","kavi","NC","","_","_"
6,"kavayo","_","_","kavi","NC","","_","_"
7,"'paso","_","_","apas","JJ","","_","_"
8,"manīṣiṇaḥ","_","_","manīṣin","JJ","","_","_"
1,"sam","_","_","sa","CADP","","_","_"
2,"ī","_","_","ī","CX","","_","_"
3,"gāvo","_","_","go","NC","","_","_"
4,"matayo","_","_","mati","NC","","_","_"
5,"yanti","_","_","e","V","i","_","_"
6,"saṃyata","_","_","saṃyat","JJ","","_","_"
7,"ṛtasya","_","_","ṛta","NC","","_","_"
8,"yonā","_","_","yoni","NC","","_","_"
9,"sadane","_","_","sadana","NC","","_","_"
10,"punarbhuvaḥ","_","_","punarbhū","NC","","_","_"
1,"nābhā","_","_","nābhi","NC","","_","_"
2,"pṛthivyā","_","_","pṛthivī","NC","","_","_"
3,"dharuṇo","_","_","dharuṇa","JJ","","_","_"
4,"maho","_","_","mah","JJ","","_","_"
5,"divo","_","_","div","NC","","_","_"
6,"'pām","_","_","ap","NC","","_","_"
7,"ūrmau","_","_","ūrmi","NC","","_","_"
8,"sindhuṣv","_","_","sindhu","NC","","_","_"
9,"antar","_","_","antar","CAD","","_","_"
10,"ukṣitaḥ","_","_","ukṣ","PPP","","_","_"
1,"indrasya","_","_","indra","NC","","_","_"
2,"vajro","_","_","vajra","NC","","_","_"
3,"vṛṣabho","_","_","vṛṣabha","NC","","_","_"
4,"vibhūvasuḥ","_","_","vibhūvasu","JJ","","_","_"
5,"somo","_","_","soma","NC","","_","_"
6,"hṛde","_","_","hṛd","NC","","_","_"
7,"pavate","_","_","pū","V","pū","_","_"
8,"cāru","_","_","cāru","JJ","","_","_"
9,"matsaraḥ","_","_","matsara","JJ","","_","_"
1,"sa","_","_","tad","PRD","","_","_"
2,"tū","_","_","tu","CCD","","_","_"
3,"pavasva","_","_","pū","V","pū","_","_"
4,"pari","_","_","pari","CADP","","_","_"
5,"pārthivaṃ","_","_","pārthiva","JJ","","_","_"
6,"raja","_","_","rajas","NC","","_","_"
7,"stotre","_","_","stotṛ","JJ","","_","_"
8,"śikṣann","_","_","śikṣ","KDP","","_","_"
9,"ādhūnvate","_","_","ādhū","KDP","","_","_"
10,"ca","_","_","ca","CCD","","_","_"
11,"_","_","_","su","CAD","","_","_"
12,"_","_","_","kratu","NC","","_","_"
1,"mā","_","_","mā","CNG","","_","_"
2,"no","_","_","mat","PPR","","_","_"
3,"nir","_","_","niḥ","CADP","","_","_"
4,"bhāg","_","_","bhaj","V","bhaj","_","_"
5,"vasunaḥ","_","_","vasu","NC","","_","_"
6,"_","_","_","sādana","NC","","_","_"
7,"_","_","_","spṛś","JJ","","_","_"
8,"rayim","_","_","rayi","NC","","_","_"
9,"piśaṅgam","_","_","piśaṅga","JJ","","_","_"
10,"bahulaṃ","_","_","bahula","JJ","","_","_"
11,"vasīmahi","_","_","vas","V","vas","_","_"
1,"ā","_","_","ā","CADP","","_","_"
2,"tū","_","_","tu","CCD","","_","_"
3,"na","_","_","mat","PPR","","_","_"
4,"indo","_","_","indu","NC","","_","_"
5,"_","_","_","śata","NUM","","_","_"
6,"_","_","_","dātu","NC","","_","_"
7,"aśvyaṃ","_","_","aśvya","JJ","","_","_"
8,"_","_","_","sahasra","NUM","","_","_"
9,"_","_","_","dātu","NC","","_","_"
10,"_","_","_","paśumat","JJ","","_","_"
11,"_","_","_","hiraṇyavat","JJ","","_","_"
1,"upa","_","_","upa","CADP","","_","_"
2,"māsva","_","_","mā","V","mā","_","_"
3,"bṛhatī","_","_","bṛhat","JJ","","_","_"
4,"revatīr","_","_","revat","JJ","","_","_"
5,"iṣo","_","_","iṣ","NC","","_","_"
6,"'dhi","_","_","adhi","CADP","","_","_"
7,"stotrasya","_","_","stotra","NC","","_","_"
8,"pavamāna","_","_","pū","KDP","","_","_"
9,"no","_","_","mat","PPR","","_","_"
10,"gahi","_","_","ga","V","ga","_","_"
