"WordID","word","NormSTEM","suffix","lemma","PoS","Root","NormSuffix","NormWord"
1,"yudhiṣṭhira","_","_","yudhiṣṭhira","NC","","_","_"
2,"uvāca","_","_","vak","V","vac","_","_"
1,"pitāmaha","_","_","pitāmaha","NC","","_","_"
2,"_","_","_","mahat","JJ","","_","_"
3,"_","_","_","prājña","JJ","","_","_"
4,"yudhi","_","_","yudh","NC","","_","_"
5,"_","_","_","satya","JJ","","_","_"
6,"_","_","_","parākrama","NC","","_","_"
1,"śrotum","_","_","śru","CGDI","","_","_"
2,"icchāmi","_","_","iṣ","V","iṣ","_","_"
3,"kārtsnyena","_","_","kārtsnya","NC","","_","_"
4,"kṛṣṇam","_","_","kṛṣṇa","NC","","_","_"
5,"avyayam","_","_","avyaya","JJ","","_","_"
6,"īśvaram","_","_","īśvara","NC","","_","_"
1,"_","_","_","yad","PRL","","_","_"
2,"_","_","_","ca","CCD","","_","_"
3,"_","_","_","ida","PRD","","_","_"
4,"tejaḥ","_","_","tejas","NC","","_","_"
5,"_","_","_","su","CAD","","_","_"
6,"_","_","_","mahat","JJ","","_","_"
7,"_","_","_","yad","PRL","","_","_"
8,"_","_","_","ca","CCD","","_","_"
9,"karma","_","_","karman","NC","","_","_"
10,"purātanam","_","_","purātana","JJ","","_","_"
1,"_","_","_","tad","PRD","","_","_"
2,"_","_","_","mat","PPR","","_","_"
3,"sarvaṃ","_","_","sarva","JQ","","_","_"
4,"yathātattvaṃ","_","_","yathātattva","CX","","_","_"
5,"prabrūhi","_","_","prabrū","V","prabrū","_","_"
6,"_","_","_","bharata","NC","","_","_"
7,"_","_","_","ṛṣabha","NC","","_","_"
1,"_","_","_","tiryagyoni","NC","","_","_"
2,"_","_","_","ga","PPP","","_","_"
3,"rūpaṃ","_","_","rūpa","NC","","_","_"
4,"kathaṃ","_","_","katha","CX","","_","_"
5,"dhāritavān","_","_","dhāray","KDP","","_","_"
6,"hariḥ","_","_","hari","NC","","_","_"
1,"kena","_","_","kiṃ","PRQ","","_","_"
2,"_","_","_","kārya","NC","","_","_"
3,"_","_","_","visarga","NC","","_","_"
4,"_","_","_","tad","PRD","","_","_"
5,"_","_","_","mat","PPR","","_","_"
6,"brūhi","_","_","abravīta","V","brū","_","_"
7,"pitāmaha","_","_","pitāmaha","NC","","_","_"
1,"bhīṣma","_","_","bhīṣma","NC","","_","_"
2,"uvāca","_","_","vak","V","vac","_","_"
1,"_","_","_","purā","CX","","_","_"
2,"_","_","_","mat","PPR","","_","_"
3,"mṛgayāṃ","_","_","mṛgayā","NC","","_","_"
4,"yāto","_","_","yā","PPP","","_","_"
5,"_","_","_","mārkaṇḍeya","NC","","_","_"
6,"_","_","_","āśrama","NC","","_","_"
7,"sthitaḥ","_","_","sthā","PPP","","_","_"
1,"_","_","_","tatra","CAD","","_","_"
2,"_","_","_","paś","V","paś","_","_"
3,"_","_","_","muni","NC","","_","_"
4,"_","_","_","gaṇa","NC","","_","_"
5,"samāsīnān","_","_","samās","PPP","","_","_"
6,"sahasraśaḥ","_","_","sahasraśas","CX","","_","_"
1,"_","_","_","tatas","CX","","_","_"
2,"_","_","_","tad","PRD","","_","_"
3,"madhuparkeṇa","_","_","madhuparka","NC","","_","_"
4,"pūjāṃ","_","_","pūjā","NC","","_","_"
5,"cakrur","_","_","kar","V","kṛ","_","_"
6,"atho","_","_","atho","CX","","_","_"
7,"mayi","_","_","mat","PPR","","_","_"
1,"pratigṛhya","_","_","pratigrah","CGDA","","_","_"
2,"ca","_","_","ca","CCD","","_","_"
3,"tāṃ","_","_","tad","PRD","","_","_"
4,"pūjāṃ","_","_","pūjā","NC","","_","_"
5,"pratyanandam","_","_","pratinand","V","pratinand","_","_"
6,"ṛṣīn","_","_","ṛṣi","NC","","_","_"
7,"aham","_","_","mat","PPR","","_","_"
1,"_","_","_","kathā","NC","","_","_"
2,"_","_","_","tad","PRD","","_","_"
3,"kathitā","_","_","kathay","PPP","","_","_"
4,"tatra","_","_","tatra","CAD","","_","_"
5,"kaśyapena","_","_","kaśyapa","NC","","_","_"
6,"_","_","_","mahat","JJ","","_","_"
7,"_","_","_","ṛṣi","NC","","_","_"
1,"_","_","_","manas","NC","","_","_"
2,"_","_","_","prahlādin","JJ","","_","_"
3,"divyāṃ","_","_","divya","JJ","","_","_"
4,"tām","_","_","tad","PRD","","_","_"
5,"_","_","_","iha","CAD","","_","_"
6,"_","_","_","ekamanas","JJ","","_","_"
7,"śṛṇu","_","_","śṛṇ","V","śru","_","_"
1,"purā","_","_","purā","CX","","_","_"
2,"_","_","_","dānava","NC","","_","_"
3,"_","_","_","mukhya","JJ","","_","_"
4,"hi","_","_","hi","CX","","_","_"
5,"_","_","_","krodha","NC","","_","_"
6,"_","_","_","lobha","NC","","_","_"
7,"_","_","_","samanvita","JJ","","_","_"
1,"balena","_","_","bala","NC","","_","_"
2,"mattāḥ","_","_","mat","PPP","","_","_"
3,"śataśo","_","_","śataśas","CX","","_","_"
4,"_","_","_","naraka","NC","","_","_"
5,"_","_","_","ādya","JJ","","_","_"
6,"_","_","_","mahat","JJ","","_","_"
7,"_","_","_","asura","NC","","_","_"
1,"_","_","_","tathā","CX","","_","_"
2,"_","_","_","eva","CEM","","_","_"
3,"_","_","_","ca","CCD","","_","_"
4,"_","_","_","anya","PPX","","_","_"
5,"bahavo","_","_","bahu","JJ","","_","_"
6,"dānavā","_","_","dānava","NC","","_","_"
7,"_","_","_","yuddha","NC","","_","_"
8,"_","_","_","durmada","JJ","","_","_"
1,"na","_","_","na","CNG","","_","_"
2,"sahante","_","_","sah","V","sah","_","_"
3,"sma","_","_","sma","CX","","_","_"
4,"devānāṃ","_","_","deva","NC","","_","_"
5,"samṛddhiṃ","_","_","samṛddhi","NC","","_","_"
6,"tām","_","_","tad","PRD","","_","_"
7,"anuttamām","_","_","anuttama","JJ","","_","_"
1,"dānavair","_","_","dānava","NC","","_","_"
2,"_","_","_","arday","KDP","","_","_"
3,"_","_","_","tu","CCD","","_","_"
4,"devā","_","_","deva","NC","","_","_"
5,"_","_","_","devarṣi","NC","","_","_"
6,"_","_","_","tathā","CX","","_","_"
1,"na","_","_","na","CNG","","_","_"
2,"śarma","_","_","śarman","NC","","_","_"
3,"lebhire","_","_","labh","V","labh","_","_"
4,"rājan","_","_","rājan","NC","","_","_"
5,"_","_","_","viś","KDP","","_","_"
6,"_","_","_","tatas","CX","","_","_"
7,"_","_","_","tatas","CX","","_","_"
1,"pṛthivīṃ","_","_","pṛthivī","NC","","_","_"
2,"_","_","_","ca","CCD","","_","_"
3,"_","_","_","ārta","JJ","","_","_"
4,"_","_","_","rūpa","NC","","_","_"
5,"te","_","_","tad","PRD","","_","_"
6,"samapaśyan","_","_","sampaś","V","saṃpaś","_","_"
7,"divaukasaḥ","_","_","divaukas","NC","","_","_"
1,"dānavair","_","_","dānava","NC","","_","_"
2,"abhisaṃkīrṇāṃ","_","_","abhisaṃkṛ","PPP","","_","_"
3,"_","_","_","ghora","JJ","","_","_"
4,"_","_","_","rūpa","NC","","_","_"
5,"_","_","_","mahat","JJ","","_","_"
6,"_","_","_","bala","NC","","_","_"
1,"_","_","_","bhāra","NC","","_","_"
2,"_","_","_","ārta","JJ","","_","_"
3,"apakṛṣṭāṃ","_","_","apakṛṣ","PPP","","_","_"
4,"ca","_","_","ca","CCD","","_","_"
5,"duḥkhitāṃ","_","_","duḥkhita","JJ","","_","_"
6,"saṃnimajjatīm","_","_","saṃnimajj","KDP","","_","_"
1,"_","_","_","atha","CAD","","_","_"
2,"_","_","_","āditeya","NC","","_","_"
3,"saṃtrastā","_","_","saṃtras","PPP","","_","_"
4,"brahmāṇam","_","_","brahman","NC","","_","_"
5,"idam","_","_","ida","PRD","","_","_"
6,"abruvan","_","_","abravīta","V","brū","_","_"
1,"kathaṃ","_","_","katha","CX","","_","_"
2,"śakyāmahe","_","_","śakn","V","śak","_","_"
3,"brahman","_","_","brahman","NC","","_","_"
4,"dānavair","_","_","dānava","NC","","_","_"
5,"upamardanam","_","_","upamardana","NC","","_","_"
1,"_","_","_","svayambhu","NC","","_","_"
2,"_","_","_","tad","PRD","","_","_"
3,"_","_","_","vak","V","vac","_","_"
4,"_","_","_","ida","PRD","","_","_"
5,"nisṛṣṭo","_","_","nisṛj","PPP","","_","_"
6,"'tra","_","_","atra","CAD","","_","_"
7,"vidhir","_","_","vidhi","NC","","_","_"
8,"mayā","_","_","mat","PPR","","_","_"
1,"te","_","_","tad","PRD","","_","_"
2,"_","_","_","vara","NC","","_","_"
3,"_","_","_","abhisaṃmad","PPP","","_","_"
4,"balena","_","_","bala","NC","","_","_"
5,"ca","_","_","ca","CCD","","_","_"
6,"madena","_","_","mada","NC","","_","_"
7,"ca","_","_","ca","CCD","","_","_"
1,"_","_","_","na","CNG","","_","_"
2,"_","_","_","avabodh","V","avabudh","_","_"
3,"saṃmūḍhā","_","_","sammuh","PPP","","_","_"
4,"viṣṇum","_","_","viṣṇu","NC","","_","_"
5,"_","_","_","avyakta","JJ","","_","_"
6,"_","_","_","darśana","NC","","_","_"
1,"_","_","_","varāha","NC","","_","_"
2,"_","_","_","rūpin","JJ","","_","_"
3,"devam","_","_","deva","NC","","_","_"
4,"adhṛṣyam","_","_","adhṛṣya","JJ","","_","_"
5,"amarair","_","_","amara","NC","","_","_"
6,"api","_","_","api","CX","","_","_"
1,"eṣa","_","_","tad","PRD","","_","_"
2,"vegena","_","_","vega","NC","","_","_"
3,"gatvā","_","_","ga","CGDA","","_","_"
4,"hi","_","_","hi","CX","","_","_"
5,"yatra","_","_","yatra","CX","","_","_"
6,"te","_","_","tad","PRD","","_","_"
7,"_","_","_","dānava","NC","","_","_"
8,"_","_","_","adhama","JJ","","_","_"
1,"_","_","_","antar","CAD","","_","_"
2,"_","_","_","bhūmi","NC","","_","_"
3,"_","_","_","ga","PPP","","_","_"
4,"ghorā","_","_","ghora","JJ","","_","_"
5,"nivasanti","_","_","nivas","V","nivas","_","_"
6,"sahasraśaḥ","_","_","sahasraśas","CX","","_","_"
1,"śamayiṣyati","_","_","śamay","V","śamay","_","_"
2,"śrutvā","_","_","śru","CGDA","","_","_"
3,"te","_","_","tad","PRD","","_","_"
4,"jahṛṣuḥ","_","_","hṛṣ","V","hṛṣ","_","_"
5,"_","_","_","sura","NC","","_","_"
6,"_","_","_","sattama","JJ","","_","_"
1,"tato","_","_","tatas","CX","","_","_"
2,"viṣṇur","_","_","viṣṇu","NC","","_","_"
3,"_","_","_","mahat","JJ","","_","_"
4,"_","_","_","tejas","NC","","_","_"
5,"vārāhaṃ","_","_","vārāha","JJ","","_","_"
6,"rūpam","_","_","rūpa","NC","","_","_"
7,"āśritaḥ","_","_","āśri","PPP","","_","_"
1,"_","_","_","antar","CAD","","_","_"
2,"_","_","_","bhūmi","NC","","_","_"
3,"sampraviśya","_","_","sampraviś","CGDA","","_","_"
4,"jagāma","_","_","ga","V","ga","_","_"
5,"ditijān","_","_","ditija","NC","","_","_"
6,"prati","_","_","prati","CADP","","_","_"
1,"dṛṣṭvā","_","_","dṛś","CGDA","","_","_"
2,"ca","_","_","ca","CCD","","_","_"
3,"sahitāḥ","_","_","sahita","JJ","","_","_"
4,"sarve","_","_","sarva","JQ","","_","_"
5,"daityāḥ","_","_","daitya","NC","","_","_"
6,"sattvam","_","_","sattva","NC","","_","_"
7,"amānuṣam","_","_","amānuṣa","JJ","","_","_"
1,"prasahya","_","_","prasah","CGDA","","_","_"
2,"sahasā","_","_","sahas","NC","","_","_"
3,"sarve","_","_","sarva","JQ","","_","_"
4,"saṃtasthuḥ","_","_","saṃtiṣṭh","V","saṃsthā","_","_"
5,"_","_","_","kāla","NC","","_","_"
6,"_","_","_","mohay","PPP","","_","_"
1,"sarve","_","_","sarva","JQ","","_","_"
2,"ca","_","_","ca","CCD","","_","_"
3,"samabhidrutya","_","_","samabhidru","CGDA","","_","_"
4,"varāhaṃ","_","_","varāha","NC","","_","_"
5,"jagṛhuḥ","_","_","grah","V","grah","_","_"
6,"samam","_","_","sama","CX","","_","_"
1,"_","_","_","saṃkrudh","PPP","","_","_"
2,"_","_","_","ca","CCD","","_","_"
3,"varāhaṃ","_","_","varāha","NC","","_","_"
4,"taṃ","_","_","tad","PRD","","_","_"
5,"vyakarṣanta","_","_","vikṛṣ","V","vikṛṣ","_","_"
6,"samantataḥ","_","_","samantataḥ","CX","","_","_"
1,"_","_","_","dānava","NC","","_","_"
2,"_","_","_","indra","NC","","_","_"
3,"_","_","_","mahat","JJ","","_","_"
4,"_","_","_","kāya","NC","","_","_"
5,"_","_","_","mahat","JJ","","_","_"
6,"_","_","_","vīrya","NC","","_","_"
7,"_","_","_","bala","NC","","_","_"
8,"_","_","_","ucchri","PPP","","_","_"
1,"_","_","_","na","CNG","","_","_"
2,"_","_","_","śakn","V","śak","_","_"
3,"_","_","_","ca","CCD","","_","_"
4,"kiṃcit","_","_","kiṃcit","PRI","","_","_"
5,"te","_","_","tad","PRD","","_","_"
6,"tasya","_","_","tad","PRD","","_","_"
7,"kartuṃ","_","_","kṛ","CGDI","","_","_"
8,"tadā","_","_","tadā","CAD","","_","_"
9,"vibho","_","_","vibhu","JJ","","_","_"
1,"tato","_","_","tatas","CX","","_","_"
2,"'gaman","_","_","ga","V","ga","_","_"
3,"vismayaṃ","_","_","vismaya","NC","","_","_"
4,"te","_","_","tad","PRD","","_","_"
5,"_","_","_","dānava","NC","","_","_"
6,"_","_","_","indra","NC","","_","_"
7,"bhayāt","_","_","bhaya","NC","","_","_"
8,"tadā","_","_","tadā","CAD","","_","_"
1,"saṃśayaṃ","_","_","saṃśaya","NC","","_","_"
2,"gatam","_","_","ga","PPP","","_","_"
3,"ātmānaṃ","_","_","ātman","NC","","_","_"
4,"menire","_","_","man","V","man","_","_"
5,"ca","_","_","ca","CCD","","_","_"
6,"sahasraśaḥ","_","_","sahasraśas","CX","","_","_"
1,"tato","_","_","tatas","CX","","_","_"
2,"_","_","_","deva","NC","","_","_"
3,"_","_","_","ādi","NC","","_","_"
4,"_","_","_","deva","NC","","_","_"
5,"sa","_","_","tad","PRD","","_","_"
6,"_","_","_","yoga","NC","","_","_"
7,"_","_","_","ātman","NC","","_","_"
8,"_","_","_","yoga","NC","","_","_"
9,"_","_","_","sārathi","NC","","_","_"
1,"yogam","_","_","yoga","NC","","_","_"
2,"āsthāya","_","_","āsthā","CGDA","","_","_"
3,"_","_","_","bhagavat","NC","","_","_"
4,"_","_","_","tadā","CAD","","_","_"
5,"_","_","_","bharata","NC","","_","_"
6,"_","_","_","sattama","JJ","","_","_"
1,"vinanāda","_","_","vinad","V","vinad","_","_"
2,"_","_","_","mahat","JJ","","_","_"
3,"_","_","_","nāda","NC","","_","_"
4,"kṣobhayan","_","_","kṣobhay","KDP","","_","_"
5,"_","_","_","daitya","NC","","_","_"
6,"_","_","_","dānava","NC","","_","_"
1,"saṃnāditā","_","_","saṃnāday","PPP","","_","_"
2,"yena","_","_","yad","PRL","","_","_"
3,"lokāḥ","_","_","loka","NC","","_","_"
4,"_","_","_","sarva","JQ","","_","_"
5,"_","_","_","ca","CCD","","_","_"
6,"_","_","_","eva","CEM","","_","_"
7,"diśo","_","_","diś","NC","","_","_"
8,"daśa","_","_","daśan","NUM","","_","_"
1,"tena","_","_","tad","PRD","","_","_"
2,"_","_","_","saṃnāda","NC","","_","_"
3,"_","_","_","śabda","NC","","_","_"
4,"lokāḥ","_","_","loka","NC","","_","_"
5,"saṃkṣobham","_","_","saṃkṣobha","NC","","_","_"
6,"āgaman","_","_","āga","V","āga","_","_"
1,"_","_","_","sambhra","PPP","","_","_"
2,"_","_","_","ca","CCD","","_","_"
3,"diśaḥ","_","_","diś","NC","","_","_"
4,"sarvā","_","_","sarva","JQ","","_","_"
5,"devāḥ","_","_","deva","NC","","_","_"
6,"_","_","_","śakra","NC","","_","_"
7,"_","_","_","purogama","JJ","","_","_"
1,"nirviceṣṭaṃ","_","_","nirviceṣṭa","JJ","","_","_"
2,"_","_","_","jagat","NC","","_","_"
3,"_","_","_","ca","CCD","","_","_"
4,"_","_","_","api","CX","","_","_"
5,"_","_","_","bhav","V","bhū","_","_"
6,"_","_","_","ati","CADP","","_","_"
7,"_","_","_","bhṛśa","CX","","_","_"
8,"tadā","_","_","tadā","CAD","","_","_"
1,"sthāvaraṃ","_","_","sthāvara","JJ","","_","_"
2,"jaṅgamaṃ","_","_","jaṅgama","JJ","","_","_"
3,"_","_","_","ca","CCD","","_","_"
4,"_","_","_","eva","CEM","","_","_"
5,"tena","_","_","tad","PRD","","_","_"
6,"nādena","_","_","nāda","NC","","_","_"
7,"mohitam","_","_","mohay","PPP","","_","_"
1,"_","_","_","tatas","CX","","_","_"
2,"_","_","_","tad","PRD","","_","_"
3,"dānavāḥ","_","_","dānava","NC","","_","_"
4,"sarve","_","_","sarva","JQ","","_","_"
5,"tena","_","_","tad","PRD","","_","_"
6,"śabdena","_","_","śabda","NC","","_","_"
7,"bhīṣitāḥ","_","_","bhīṣita","JJ","","_","_"
1,"petur","_","_","pat","V","pat","_","_"
2,"_","_","_","gatāsu","JJ","","_","_"
3,"_","_","_","ca","CCD","","_","_"
4,"_","_","_","eva","CEM","","_","_"
5,"_","_","_","viṣṇu","NC","","_","_"
6,"_","_","_","tejas","NC","","_","_"
7,"_","_","_","vimohay","PPP","","_","_"
1,"_","_","_","rasātala","NC","","_","_"
2,"_","_","_","ga","PPP","","_","_"
3,"_","_","_","ca","CCD","","_","_"
4,"_","_","_","eva","CEM","","_","_"
5,"_","_","_","varāha","NC","","_","_"
6,"_","_","_","tridaśa","NC","","_","_"
7,"_","_","_","dviṣ","JJ","","_","_"
1,"khuraiḥ","_","_","khura","NC","","_","_"
2,"saṃdārayāmāsa","_","_","saṃdāray","V","saṃdāray","_","_"
3,"_","_","_","māṃsa","NC","","_","_"
4,"_","_","_","medas","NC","","_","_"
5,"_","_","_","asthi","NC","","_","_"
6,"_","_","_","saṃcaya","NC","","_","_"
1,"nādena","_","_","nāda","NC","","_","_"
2,"tena","_","_","tad","PRD","","_","_"
3,"mahatā","_","_","mahat","JJ","","_","_"
4,"sanātana","_","_","sanātana","NC","","_","_"
5,"iti","_","_","iti","CQT","","_","_"
6,"smṛtaḥ","_","_","smṛ","PPP","","_","_"
1,"padmanābho","_","_","padmanābha","NC","","_","_"
2,"mahāyogī","_","_","mahāyogin","NC","","_","_"
3,"_","_","_","bhūta","NC","","_","_"
4,"_","_","_","ācārya","NC","","_","_"
5,"sa","_","_","tad","PRD","","_","_"
6,"_","_","_","bhūta","NC","","_","_"
7,"_","_","_","rāj","NC","","_","_"
1,"tato","_","_","tatas","CX","","_","_"
2,"_","_","_","deva","NC","","_","_"
3,"_","_","_","gaṇa","NC","","_","_"
4,"sarve","_","_","sarva","JQ","","_","_"
5,"pitāmaham","_","_","pitāmaha","NC","","_","_"
6,"upābruvan","_","_","upabrū","V","upabrū","_","_"
1,"nādo","_","_","nāda","NC","","_","_"
2,"'yaṃ","_","_","ida","PRD","","_","_"
3,"kīdṛśo","_","_","kīdṛśa","JJ","","_","_"
4,"deva","_","_","deva","NC","","_","_"
5,"_","_","_","na","CNG","","_","_"
6,"_","_","_","a","PRD","","_","_"
7,"vidma","_","_","vid","V","vid","_","_"
8,"vayaṃ","_","_","mat","PPR","","_","_"
9,"vibho","_","_","vibhu","JJ","","_","_"
1,"ko","_","_","kiṃ","PRQ","","_","_"
2,"'sau","_","_","adas","PRD","","_","_"
3,"hi","_","_","hi","CX","","_","_"
4,"kasya","_","_","kiṃ","PRQ","","_","_"
5,"vā","_","_","vā","CCD","","_","_"
6,"nādo","_","_","nāda","NC","","_","_"
7,"yena","_","_","yad","PRL","","_","_"
8,"vihvalitaṃ","_","_","vihval","PPP","","_","_"
9,"jagat","_","_","jagat","NC","","_","_"
1,"etasminn","_","_","tad","PRD","","_","_"
2,"antare","_","_","antara","NC","","_","_"
3,"viṣṇur","_","_","viṣṇu","NC","","_","_"
4,"vārāhaṃ","_","_","vārāha","JJ","","_","_"
5,"rūpam","_","_","rūpa","NC","","_","_"
6,"āsthitaḥ","_","_","āsthā","PPP","","_","_"
1,"_","_","_","utthā","V","utthā","_","_"
2,"_","_","_","mahādeva","NC","","_","_"
3,"stūyamāno","_","_","stu","KDP","","_","_"
4,"_","_","_","mahat","JJ","","_","_"
5,"_","_","_","ṛṣi","NC","","_","_"
1,"pitāmaha","_","_","pitāmaha","NC","","_","_"
2,"uvāca","_","_","vak","V","vac","_","_"
1,"nihatya","_","_","nihan","CGDA","","_","_"
2,"_","_","_","dānava","NC","","_","_"
3,"_","_","_","pati","NC","","_","_"
4,"_","_","_","mahat","JJ","","_","_"
5,"_","_","_","varṣman","NC","","_","_"
6,"_","_","_","mahat","JJ","","_","_"
7,"_","_","_","bala","NC","","_","_"
1,"eṣa","_","_","tad","PRD","","_","_"
2,"devo","_","_","deva","NC","","_","_"
3,"mahāyogī","_","_","mahāyogin","NC","","_","_"
4,"bhūtātmā","_","_","bhūtātman","NC","","_","_"
5,"bhūtabhāvanaḥ","_","_","bhūtabhāvana","NC","","_","_"
1,"_","_","_","sarva","JQ","","_","_"
2,"_","_","_","bhūta","NC","","_","_"
3,"_","_","_","īśvara","NC","","_","_"
4,"yogī","_","_","yogin","NC","","_","_"
5,"yonir","_","_","yoni","NC","","_","_"
6,"ātmā","_","_","ātman","NC","","_","_"
7,"_","_","_","tathā","CX","","_","_"
8,"_","_","_","ātman","NC","","_","_"
1,"sthirībhavata","_","_","sthirībhav","V","sthirībhū","_","_"
2,"kṛṣṇo","_","_","kṛṣṇa","NC","","_","_"
3,"'yaṃ","_","_","ida","PRD","","_","_"
4,"_","_","_","sarva","JQ","","_","_"
5,"_","_","_","pāpa","NC","","_","_"
6,"_","_","_","praṇāśana","JJ","","_","_"
1,"kṛtvā","_","_","kṛ","CGDA","","_","_"
2,"_","_","_","karman","NC","","_","_"
3,"_","_","_","ati","CADP","","_","_"
4,"_","_","_","sādhu","JJ","","_","_"
5,"_","_","_","tad","PRD","","_","_"
6,"aśakyam","_","_","aśakya","JJ","","_","_"
7,"_","_","_","amita","JJ","","_","_"
8,"_","_","_","prabhā","NC","","_","_"
1,"samāyātaḥ","_","_","samāyā","PPP","","_","_"
2,"svam","_","_","sva","JJ","","_","_"
3,"ātmānaṃ","_","_","ātman","NC","","_","_"
4,"mahābhāgo","_","_","mahābhāga","JJ","","_","_"
5,"_","_","_","mahat","JJ","","_","_"
6,"_","_","_","dyuti","NC","","_","_"
1,"padmanābho","_","_","padmanābha","NC","","_","_"
2,"mahāyogī","_","_","mahāyogin","NC","","_","_"
3,"bhūtātmā","_","_","bhūtātman","NC","","_","_"
4,"bhūtabhāvanaḥ","_","_","bhūtabhāvana","NC","","_","_"
1,"na","_","_","na","CNG","","_","_"
2,"saṃtāpo","_","_","saṃtāpa","NC","","_","_"
3,"na","_","_","na","CNG","","_","_"
4,"bhīḥ","_","_","bhī","NC","","_","_"
5,"kāryā","_","_","kṛ","KDG","","_","_"
6,"śoko","_","_","śoka","NC","","_","_"
7,"vā","_","_","vā","CCD","","_","_"
8,"_","_","_","sura","NC","","_","_"
9,"_","_","_","sattama","JJ","","_","_"
1,"vidhir","_","_","vidhi","NC","","_","_"
2,"eṣa","_","_","tad","PRD","","_","_"
3,"_","_","_","prabhāva","NC","","_","_"
4,"_","_","_","ca","CCD","","_","_"
5,"kālaḥ","_","_","kāla","NC","","_","_"
6,"_","_","_","saṃkṣaya","NC","","_","_"
7,"_","_","_","kāraka","JJ","","_","_"
1,"lokān","_","_","loka","NC","","_","_"
2,"_","_","_","dhāray","KDP","","_","_"
3,"_","_","_","ida","PRD","","_","_"
4,"nādo","_","_","nāda","NC","","_","_"
5,"mukto","_","_","muc","PPP","","_","_"
6,"mahātmanā","_","_","mahātman","JJ","","_","_"
1,"sa","_","_","tad","PRD","","_","_"
2,"eva","_","_","eva","CEM","","_","_"
3,"hi","_","_","hi","CX","","_","_"
4,"mahābhāgaḥ","_","_","mahābhāga","JJ","","_","_"
5,"_","_","_","sarva","JQ","","_","_"
6,"_","_","_","loka","NC","","_","_"
7,"_","_","_","namaskṛ","PPP","","_","_"
1,"acyutaḥ","_","_","acyuta","NC","","_","_"
2,"puṇḍarīkākṣaḥ","_","_","puṇḍarīkākṣa","NC","","_","_"
3,"_","_","_","sarva","JQ","","_","_"
4,"_","_","_","bhūta","NC","","_","_"
5,"_","_","_","samudbhava","NC","","_","_"
