"WordID","word","NormSTEM","suffix","lemma","PoS","Root","NormSuffix","NormWord"
1,"bhavā","_","_","bhav","V","bhū","_","_"
2,"mitro","_","_","mitra","NC","","_","_"
3,"na","_","_","na","CNG","","_","_"
4,"śevyo","_","_","śevya","JJ","","_","_"
5,"_","_","_","ghṛta","NC","","_","_"
6,"_","_","_","āsuti","NC","","_","_"
7,"_","_","_","vibhū","PPP","","_","_"
8,"_","_","_","dyumna","NC","","_","_"
9,"_","_","_","eva","JJ","","_","_"
10,"_","_","_","yā","JJ","","_","_"
11,"u","_","_","u","CEM","","_","_"
12,"saprathāḥ","_","_","saprathas","JJ","","_","_"
1,"adhā","_","_","adha","CX","","_","_"
2,"te","_","_","tvat","PPR","","_","_"
3,"viṣṇo","_","_","viṣṇu","NC","","_","_"
4,"viduṣā","_","_","vid","KDP","","_","_"
5,"cid","_","_","cit","CEM","","_","_"
6,"ardhya","_","_","ṛdh","KDG","","_","_"
7,"stomo","_","_","stoma","NC","","_","_"
8,"yajñaś","_","_","yajña","NC","","_","_"
9,"ca","_","_","ca","CCD","","_","_"
10,"rādhyo","_","_","rādh","KDG","","_","_"
11,"haviṣmatā","_","_","haviṣmat","JJ","","_","_"
1,"yaḥ","_","_","yad","PRL","","_","_"
2,"pūrvyāya","_","_","pūrvya","JJ","","_","_"
3,"vedhase","_","_","vedhas","NC","","_","_"
4,"navīyase","_","_","navīyas","JJ","","_","_"
5,"_","_","_","sumat","CX","","_","_"
6,"_","_","_","jānī","NC","","_","_"
7,"viṣṇave","_","_","viṣṇu","NC","","_","_"
8,"dadāśati","_","_","dāś","V","dāś","_","_"
1,"yo","_","_","yad","PRL","","_","_"
2,"jātam","_","_","jāta","NC","","_","_"
3,"asya","_","_","ida","PRD","","_","_"
4,"mahato","_","_","mahat","JJ","","_","_"
5,"mahi","_","_","mahi","JJ","","_","_"
6,"bravat","_","_","abravīta","V","brū","_","_"
7,"_","_","_","tad","PRD","","_","_"
8,"_","_","_","id","CEM","","_","_"
9,"u","_","_","u","CEM","","_","_"
10,"śravobhir","_","_","śravas","NC","","_","_"
11,"yujyaṃ","_","_","yujya","JJ","","_","_"
12,"cid","_","_","cit","CEM","","_","_"
13,"abhy","_","_","abhi","CADP","","_","_"
14,"asat","_","_","as","V","as","_","_"
1,"tam","_","_","tad","PRD","","_","_"
2,"u","_","_","u","CEM","","_","_"
3,"stotāraḥ","_","_","stu","V","stu","_","_"
4,"pūrvyaṃ","_","_","pūrvya","JJ","","_","_"
5,"yathā","_","_","yathā","CCM","","_","_"
6,"vida","_","_","vid","V","vid","_","_"
7,"ṛtasya","_","_","ṛta","NC","","_","_"
8,"garbhaṃ","_","_","garbha","NC","","_","_"
9,"januṣā","_","_","janus","NC","","_","_"
10,"pipartana","_","_","pṛ","V","pṛ","_","_"
1,"_","_","_","ā","CADP","","_","_"
2,"_","_","_","ida","PRD","","_","_"
3,"jānanto","_","_","jñā","KDP","","_","_"
4,"nāma","_","_","nāman","NC","","_","_"
5,"cid","_","_","cit","CEM","","_","_"
6,"vivaktana","_","_","vak","V","vac","_","_"
7,"mahas","_","_","mah","JJ","","_","_"
8,"te","_","_","tvat","PPR","","_","_"
9,"viṣṇo","_","_","viṣṇu","NC","","_","_"
10,"sumatim","_","_","sumati","NC","","_","_"
11,"bhajāmahe","_","_","bhaj","V","bhaj","_","_"
1,"tam","_","_","tad","PRD","","_","_"
2,"asya","_","_","ida","PRD","","_","_"
3,"rājā","_","_","rājan","NC","","_","_"
4,"varuṇas","_","_","varuṇa","NC","","_","_"
5,"tam","_","_","tad","PRD","","_","_"
6,"aśvinā","_","_","aśvin","NC","","_","_"
7,"kratuṃ","_","_","kratu","NC","","_","_"
8,"sacanta","_","_","sac","V","sac","_","_"
9,"mārutasya","_","_","māruta","JJ","","_","_"
10,"vedhasaḥ","_","_","vedhas","NC","","_","_"
1,"dādhāra","_","_","dhar","V","dhṛ","_","_"
2,"dakṣam","_","_","dakṣa","NC","","_","_"
3,"uttamam","_","_","uttama","JJ","","_","_"
4,"_","_","_","ahar","NC","","_","_"
5,"_","_","_","vid","JJ","","_","_"
6,"vrajaṃ","_","_","vraja","NC","","_","_"
7,"ca","_","_","ca","CCD","","_","_"
8,"viṣṇuḥ","_","_","viṣṇu","NC","","_","_"
9,"sakhivāṁ","_","_","sakhivat","JJ","","_","_"
10,"aporṇute","_","_","apavṛ","V","apavṛ","_","_"
1,"ā","_","_","ā","CADP","","_","_"
2,"yo","_","_","yad","PRL","","_","_"
3,"vivāya","_","_","vye","V","vī","_","_"
4,"sacathāya","_","_","sacatha","NC","","_","_"
5,"daivya","_","_","daivya","JJ","","_","_"
6,"indrāya","_","_","indra","NC","","_","_"
7,"viṣṇuḥ","_","_","viṣṇu","NC","","_","_"
8,"_","_","_","su","CAD","","_","_"
9,"_","_","_","kṛt","JJ","","_","_"
10,"sukṛttaraḥ","_","_","sukṛttara","JJ","","_","_"
1,"vedhā","_","_","vedhas","NC","","_","_"
2,"ajinvat","_","_","jinv","V","jinv","_","_"
3,"triṣadhastha","_","_","triṣadhastha","JJ","","_","_"
4,"āryam","_","_","ārya","NC","","_","_"
5,"ṛtasya","_","_","ṛta","NC","","_","_"
6,"bhāge","_","_","bhāga","NC","","_","_"
7,"yajamānam","_","_","yaj","KDP","","_","_"
8,"ābhajat","_","_","ābhaj","V","ābhaj","_","_"
