"WordID","word","NormSTEM","suffix","lemma","PoS","Root","NormSuffix","NormWord"
1,"vaiśaṃpāyana","_","_","vaiśampāyana","NC","","_","_"
2,"uvāca","_","_","vak","V","vac","_","_"
1,"dhṛtarāṣṭre","_","_","dhṛtarāṣṭra","NC","","_","_"
2,"ca","_","_","ca","CCD","","_","_"
3,"pāṇḍau","_","_","pāṇḍu","NC","","_","_"
4,"ca","_","_","ca","CCD","","_","_"
5,"vidure","_","_","vidura","NC","","_","_"
6,"ca","_","_","ca","CCD","","_","_"
7,"mahātmani","_","_","mahātman","JJ","","_","_"
1,"teṣu","_","_","tad","PRD","","_","_"
2,"triṣu","_","_","tri","NUM","","_","_"
3,"kumāreṣu","_","_","kumāra","NC","","_","_"
4,"jāteṣu","_","_","jan","PPP","","_","_"
5,"kurujāṅgalam","_","_","kurujāṅgala","NC","","_","_"
1,"kuravo","_","_","kuru","NC","","_","_"
2,"'tha","_","_","atha","CAD","","_","_"
3,"kurukṣetraṃ","_","_","kurukṣetra","NC","","_","_"
4,"trayam","_","_","traya","NC","","_","_"
5,"etad","_","_","tad","PRD","","_","_"
6,"avardhata","_","_","vṛdh","V","vṛdh","_","_"
1,"_","_","_","ūrdhva","JJ","","_","_"
2,"_","_","_","sasya","NC","","_","_"
3,"_","_","_","bhav","V","bhū","_","_"
4,"bhūmiḥ","_","_","bhūmi","NC","","_","_"
5,"sasyāni","_","_","sasya","NC","","_","_"
6,"phalavanti","_","_","phalavat","JJ","","_","_"
7,"ca","_","_","ca","CCD","","_","_"
1,"_","_","_","yathā","CCM","","_","_"
2,"_","_","_","ṛtu","NC","","_","_"
3,"_","_","_","varṣin","JJ","","_","_"
4,"parjanyo","_","_","parjanya","NC","","_","_"
5,"_","_","_","bahu","JJ","","_","_"
6,"_","_","_","puṣpa","NC","","_","_"
7,"_","_","_","phala","NC","","_","_"
8,"drumāḥ","_","_","druma","NC","","_","_"
1,"vāhanāni","_","_","vāhana","NC","","_","_"
2,"prahṛṣṭāni","_","_","prahṛṣ","PPP","","_","_"
3,"muditā","_","_","mud","PPP","","_","_"
4,"_","_","_","mṛga","NC","","_","_"
5,"_","_","_","pakṣin","NC","","_","_"
1,"gandhavanti","_","_","gandhavat","JJ","","_","_"
2,"ca","_","_","ca","CCD","","_","_"
3,"mālyāni","_","_","mālya","NC","","_","_"
4,"rasavanti","_","_","rasavat","JJ","","_","_"
5,"phalāni","_","_","phala","NC","","_","_"
6,"ca","_","_","ca","CCD","","_","_"
1,"_","_","_","vaṇij","NC","","_","_"
2,"_","_","_","ca","CCD","","_","_"
3,"_","_","_","avakṛ","V","avakṛ","_","_"
4,"_","_","_","nagara","NC","","_","_"
5,"_","_","_","atha","CAD","","_","_"
6,"śilpibhiḥ","_","_","śilpin","NC","","_","_"
1,"_","_","_","śūra","NC","","_","_"
2,"_","_","_","ca","CCD","","_","_"
3,"_","_","_","kṛtavidya","JJ","","_","_"
4,"_","_","_","ca","CCD","","_","_"
5,"_","_","_","as","KDP","","_","_"
6,"_","_","_","ca","CCD","","_","_"
7,"sukhino","_","_","sukhin","JJ","","_","_"
8,"'bhavan","_","_","bhav","V","bhū","_","_"
1,"_","_","_","na","CNG","","_","_"
2,"_","_","_","bhav","V","bhū","_","_"
3,"dasyavaḥ","_","_","dasyu","NC","","_","_"
4,"kecin","_","_","kiṃcit","PRI","","_","_"
5,"_","_","_","na","CNG","","_","_"
6,"_","_","_","adharma","NC","","_","_"
7,"_","_","_","ruci","NC","","_","_"
8,"janāḥ","_","_","jana","NC","","_","_"
1,"_","_","_","pradeśa","NC","","_","_"
2,"_","_","_","api","CX","","_","_"
3,"rāṣṭrāṇāṃ","_","_","rāṣṭra","NC","","_","_"
4,"kṛtaṃ","_","_","kṛta","NC","","_","_"
5,"yugam","_","_","yuga","NC","","_","_"
6,"avartata","_","_","vart","V","vṛt","_","_"
1,"_","_","_","dāna","NC","","_","_"
2,"_","_","_","kriyā","NC","","_","_"
3,"_","_","_","dharma","NC","","_","_"
4,"_","_","_","śīla","NC","","_","_"
5,"_","_","_","yajña","NC","","_","_"
6,"_","_","_","vrata","NC","","_","_"
7,"_","_","_","parāyaṇa","NC","","_","_"
1,"_","_","_","anyonya","PRC","","_","_"
2,"_","_","_","prīti","NC","","_","_"
3,"_","_","_","saṃyuj","PPP","","_","_"
4,"vyavardhanta","_","_","vivṛdh","V","vivṛdh","_","_"
5,"_","_","_","prajā","NC","","_","_"
6,"_","_","_","tadā","CAD","","_","_"
1,"_","_","_","māna","NC","","_","_"
2,"_","_","_","krodha","NC","","_","_"
3,"_","_","_","vihā","PPP","","_","_"
4,"_","_","_","ca","CCD","","_","_"
5,"janā","_","_","jana","NC","","_","_"
6,"_","_","_","lobha","NC","","_","_"
7,"_","_","_","vivarjay","PPP","","_","_"
1,"anyonyam","_","_","anyonya","PRC","","_","_"
2,"abhyavardhanta","_","_","abhivṛdh","V","abhivṛdh","_","_"
3,"_","_","_","dharma","NC","","_","_"
4,"_","_","_","uttara","NC","","_","_"
5,"avartata","_","_","vart","V","vṛt","_","_"
1,"tan","_","_","tad","PRD","","_","_"
2,"_","_","_","mahodadhi","NC","","_","_"
3,"_","_","_","vat","CX","","_","_"
4,"pūrṇaṃ","_","_","pṛ","PPP","","_","_"
5,"nagaraṃ","_","_","nagara","NC","","_","_"
6,"vai","_","_","vai","CX","","_","_"
7,"vyarocata","_","_","viroc","V","viruc","_","_"
1,"_","_","_","dvāra","NC","","_","_"
2,"_","_","_","toraṇa","NC","","_","_"
3,"_","_","_","niryūha","NC","","_","_"
4,"yuktam","_","_","yuj","PPP","","_","_"
5,"_","_","_","abhra","NC","","_","_"
6,"_","_","_","caya","NC","","_","_"
7,"_","_","_","upama","JJ","","_","_"
1,"_","_","_","prāsāda","NC","","_","_"
2,"_","_","_","śata","NUM","","_","_"
3,"_","_","_","sambādha","NC","","_","_"
4,"_","_","_","mahat","JJ","","_","_"
5,"_","_","_","indra","NC","","_","_"
6,"_","_","_","pura","NC","","_","_"
7,"_","_","_","saṃnibha","JJ","","_","_"
1,"nadīṣu","_","_","nadī","NC","","_","_"
2,"_","_","_","vana","NC","","_","_"
3,"_","_","_","khaṇḍa","NC","","_","_"
4,"_","_","_","vāpī","NC","","_","_"
5,"_","_","_","palvala","NC","","_","_"
6,"_","_","_","sānu","NC","","_","_"
1,"kānaneṣu","_","_","kānana","NC","","_","_"
2,"ca","_","_","ca","CCD","","_","_"
3,"ramyeṣu","_","_","ramya","JJ","","_","_"
4,"vijahrur","_","_","vihar","V","vihṛ","_","_"
5,"muditā","_","_","mud","PPP","","_","_"
6,"janāḥ","_","_","jana","NC","","_","_"
1,"uttaraiḥ","_","_","uttara","JJ","","_","_"
2,"kurubhiḥ","_","_","kuru","NC","","_","_"
3,"sārdhaṃ","_","_","sārdha","CX","","_","_"
4,"dakṣiṇāḥ","_","_","dakṣiṇa","JJ","","_","_"
5,"_","_","_","kuru","NC","","_","_"
6,"_","_","_","tadā","CAD","","_","_"
1,"vispardhamānā","_","_","vispṛdh","KDP","","_","_"
2,"_","_","_","vicar","V","vicar","_","_"
3,"_","_","_","tathā","CX","","_","_"
4,"_","_","_","siddha","NC","","_","_"
5,"_","_","_","ṛṣi","NC","","_","_"
6,"_","_","_","cāraṇa","NC","","_","_"
1,"_","_","_","na","CNG","","_","_"
2,"_","_","_","bhav","V","bhū","_","_"
3,"kṛpaṇaḥ","_","_","kṛpaṇa","JJ","","_","_"
4,"kaścin","_","_","kiṃcit","PRI","","_","_"
5,"_","_","_","na","CNG","","_","_"
6,"_","_","_","bhav","V","bhū","_","_"
7,"vidhavāḥ","_","_","vidhavā","NC","","_","_"
8,"striyaḥ","_","_","strī","NC","","_","_"
1,"tasmiñ","_","_","tad","PRD","","_","_"
2,"janapade","_","_","janapada","NC","","_","_"
3,"ramye","_","_","ramya","JJ","","_","_"
4,"bahavaḥ","_","_","bahu","JJ","","_","_"
5,"kurubhiḥ","_","_","kuru","NC","","_","_"
6,"kṛtāḥ","_","_","kṛ","PPP","","_","_"
1,"_","_","_","kūpa","NC","","_","_"
2,"_","_","_","ārāma","NC","","_","_"
3,"_","_","_","sabhā","NC","","_","_"
4,"_","_","_","vāpī","NC","","_","_"
5,"_","_","_","brāhmaṇa","NC","","_","_"
6,"_","_","_","āvasatha","NC","","_","_"
7,"_","_","_","tathā","CX","","_","_"
1,"babhūvuḥ","_","_","bhav","V","bhū","_","_"
2,"_","_","_","sarva","JQ","","_","_"
3,"_","_","_","ṛddhi","NC","","_","_"
4,"_","_","_","yuta","JJ","","_","_"
5,"_","_","_","tad","PRD","","_","_"
6,"rāṣṭre","_","_","rāṣṭra","NC","","_","_"
7,"_","_","_","sadā","CAD","","_","_"
8,"_","_","_","utsava","NC","","_","_"
1,"svāhākāraiḥ","_","_","svāhākāra","NC","","_","_"
2,"_","_","_","svadhā","NC","","_","_"
3,"_","_","_","ca","CCD","","_","_"
4,"saṃnivāsaḥ","_","_","saṃnivāsa","NC","","_","_"
5,"_","_","_","kuru","NC","","_","_"
6,"_","_","_","vas","PPP","","_","_"
1,"bhīṣmeṇa","_","_","bhīṣma","NC","","_","_"
2,"śāstrato","_","_","śāstra","NC","","_","_"
3,"rājan","_","_","rājan","NC","","_","_"
4,"sarvataḥ","_","_","sarvatas","CX","","_","_"
5,"parirakṣite","_","_","parirakṣ","PPP","","_","_"
1,"babhūva","_","_","bhav","V","bhū","_","_"
2,"_","_","_","ramaṇīya","JJ","","_","_"
3,"_","_","_","ca","CCD","","_","_"
4,"_","_","_","caitya","NC","","_","_"
5,"_","_","_","yūpa","NC","","_","_"
6,"_","_","_","śata","NUM","","_","_"
7,"_","_","_","aṅkay","PPP","","_","_"
1,"sa","_","_","tad","PRD","","_","_"
2,"deśaḥ","_","_","deśa","NC","","_","_"
3,"_","_","_","para","PPX","","_","_"
4,"_","_","_","rāṣṭra","NC","","_","_"
5,"_","_","_","pratigrah","CGDA","","_","_"
6,"_","_","_","abhivardhay","PPP","","_","_"
1,"bhīṣmeṇa","_","_","bhīṣma","NC","","_","_"
2,"vihitaṃ","_","_","vidhā","PPP","","_","_"
3,"rāṣṭre","_","_","rāṣṭra","NC","","_","_"
4,"_","_","_","dharma","NC","","_","_"
5,"_","_","_","cakra","NC","","_","_"
6,"avartata","_","_","vart","V","vṛt","_","_"
1,"kriyamāṇeṣu","_","_","kṛ","KDP","","_","_"
2,"kṛtyeṣu","_","_","kṛtya","NC","","_","_"
3,"kumārāṇāṃ","_","_","kumāra","NC","","_","_"
4,"mahātmanām","_","_","mahātman","JJ","","_","_"
1,"_","_","_","paura","NC","","_","_"
2,"_","_","_","jānapada","NC","","_","_"
3,"sarve","_","_","sarva","JQ","","_","_"
4,"babhūvuḥ","_","_","bhav","V","bhū","_","_"
5,"_","_","_","satata","JJ","","_","_"
6,"_","_","_","utsava","NC","","_","_"
1,"gṛheṣu","_","_","gṛha","NC","","_","_"
2,"_","_","_","kuru","NC","","_","_"
3,"_","_","_","mukhya","JJ","","_","_"
4,"paurāṇāṃ","_","_","paura","NC","","_","_"
5,"ca","_","_","ca","CCD","","_","_"
6,"_","_","_","nara","NC","","_","_"
7,"_","_","_","adhipa","NC","","_","_"
1,"dīyatāṃ","_","_","dad","V","dā","_","_"
2,"bhujyatāṃ","_","_","bhuj","V","bhuj","_","_"
3,"_","_","_","ca","CCD","","_","_"
4,"_","_","_","iti","CQT","","_","_"
5,"vāco","_","_","vāc","NC","","_","_"
6,"'śrūyanta","_","_","śṛṇ","V","śru","_","_"
7,"sarvaśaḥ","_","_","sarvaśas","CX","","_","_"
1,"_","_","_","dhṛtarāṣṭra","NC","","_","_"
2,"_","_","_","ca","CCD","","_","_"
3,"_","_","_","pāṇḍu","NC","","_","_"
4,"_","_","_","ca","CCD","","_","_"
5,"_","_","_","vidura","NC","","_","_"
6,"_","_","_","ca","CCD","","_","_"
7,"mahāmatiḥ","_","_","mahāmati","JJ","","_","_"
1,"_","_","_","janman","NC","","_","_"
2,"_","_","_","prabhṛti","CX","","_","_"
3,"bhīṣmeṇa","_","_","bhīṣma","NC","","_","_"
4,"_","_","_","putra","NC","","_","_"
5,"_","_","_","vat","CX","","_","_"
6,"paripālitāḥ","_","_","paripālay","PPP","","_","_"
1,"_","_","_","vaidika","JJ","","_","_"
2,"_","_","_","adhyayana","NC","","_","_"
3,"yukto","_","_","yuj","PPP","","_","_"
4,"_","_","_","nīti","NC","","_","_"
5,"_","_","_","śāstra","NC","","_","_"
6,"pāragaḥ","_","_","pāraga","JJ","","_","_"
1,"bhīṣmeṇa","_","_","bhīṣma","NC","","_","_"
2,"rājā","_","_","rājan","NC","","_","_"
3,"kauravyo","_","_","kauravya","NC","","_","_"
4,"dhṛtarāṣṭro","_","_","dhṛtarāṣṭra","NC","","_","_"
5,"'bhiṣecitaḥ","_","_","abhiṣecay","PPP","","_","_"
1,"dhanurvede","_","_","dhanurveda","NC","","_","_"
2,"_","_","_","aśva","NC","","_","_"
3,"_","_","_","pṛṣṭha","NC","","_","_"
4,"ca","_","_","ca","CCD","","_","_"
5,"_","_","_","gadā","NC","","_","_"
6,"_","_","_","yuddha","NC","","_","_"
7,"_","_","_","asi","NC","","_","_"
8,"_","_","_","carman","NC","","_","_"
1,"_","_","_","tathā","CX","","_","_"
2,"_","_","_","eva","CEM","","_","_"
3,"_","_","_","gaja","NC","","_","_"
4,"_","_","_","śikṣā","NC","","_","_"
5,"astreṣu","_","_","astra","NC","","_","_"
6,"vividheṣu","_","_","vividha","JJ","","_","_"
7,"ca","_","_","ca","CCD","","_","_"
1,"_","_","_","artha","NC","","_","_"
2,"_","_","_","dharma","NC","","_","_"
3,"_","_","_","pradhāna","NC","","_","_"
4,"vidyāsu","_","_","vidyā","NC","","_","_"
5,"vividhāsu","_","_","vividha","JJ","","_","_"
6,"ca","_","_","ca","CCD","","_","_"
1,"gataḥ","_","_","ga","PPP","","_","_"
2,"pāraṃ","_","_","pāra","NC","","_","_"
3,"yadā","_","_","yadā","CSB","","_","_"
4,"_","_","_","pāṇḍu","NC","","_","_"
5,"_","_","_","tadā","CAD","","_","_"
6,"senāpatiḥ","_","_","senāpati","NC","","_","_"
7,"kṛtaḥ","_","_","kṛ","PPP","","_","_"
1,"_","_","_","dhṛtarāṣṭra","NC","","_","_"
2,"_","_","_","tu","CCD","","_","_"
3,"_","_","_","acakṣuṣṭva","NC","","_","_"
4,"rājyaṃ","_","_","rājya","NC","","_","_"
5,"na","_","_","na","CNG","","_","_"
6,"pratyapadyata","_","_","pratipad","V","pratipad","_","_"
1,"_","_","_","avara","JJ","","_","_"
3,"_","_","_","ca","CCD","","_","_"
4,"viduraḥ","_","_","vidura","NC","","_","_"
5,"_","_","_","pāṇḍu","NC","","_","_"
6,"_","_","_","ca","CCD","","_","_"
7,"_","_","_","as","V","as","_","_"
8,"mahīpatiḥ","_","_","mahīpati","NC","","_","_"
1,"amātyo","_","_","amātya","NC","","_","_"
2,"_","_","_","manuja","NC","","_","_"
3,"_","_","_","indra","NC","","_","_"
4,"bāla","_","_","bāla","NC","","_","_"
5,"eva","_","_","eva","CEM","","_","_"
6,"yaśasvinaḥ","_","_","yaśasvin","JJ","","_","_"
1,"praṇetā","_","_","praṇetṛ","NC","","_","_"
2,"_","_","_","sarva","JQ","","_","_"
3,"_","_","_","dharma","NC","","_","_"
4,"bhīṣmeṇa","_","_","bhīṣma","NC","","_","_"
5,"viduraḥ","_","_","vidura","NC","","_","_"
6,"kṛtaḥ","_","_","kṛ","PPP","","_","_"
1,"_","_","_","sarva","JQ","","_","_"
2,"_","_","_","śāstra","NC","","_","_"
3,"_","_","_","artha","NC","","_","_"
4,"_","_","_","tattva","NC","","_","_"
5,"_","_","_","jña","JJ","","_","_"
6,"_","_","_","buddhi","NC","","_","_"
7,"_","_","_","medhā","NC","","_","_"
8,"_","_","_","paṭu","JJ","","_","_"
9,"yuvā","_","_","yuvan","NC","","_","_"
1,"_","_","_","bhāva","NC","","_","_"
2,"_","_","_","āgama","NC","","_","_"
3,"_","_","_","yuj","PPP","","_","_"
4,"sarvaṃ","_","_","sarva","JQ","","_","_"
5,"vedayate","_","_","vid","V","vid","_","_"
6,"jagat","_","_","jagat","NC","","_","_"
1,"pranaṣṭaḥ","_","_","praṇaś","PPP","","_","_"
2,"śaṃtanor","_","_","śaṃtanu","NC","","_","_"
3,"vaṃśaḥ","_","_","vaṃśa","NC","","_","_"
4,"bhīṣmeṇa","_","_","bhīṣma","NC","","_","_"
5,"punar","_","_","punar","CAD","","_","_"
6,"uddhṛtaḥ","_","_","uddhṛ","PPP","","_","_"
1,"tato","_","_","tatas","CX","","_","_"
2,"nirvacanaṃ","_","_","nirvacana","NC","","_","_"
3,"satsu","_","_","as","KDP","","_","_"
4,"tad","_","_","tad","PRD","","_","_"
5,"idaṃ","_","_","ida","PRD","","_","_"
6,"paripaṭhyate","_","_","paripaṭh","V","paripaṭh","_","_"
1,"kausalyā","_","_","kausalyā","NC","","_","_"
2,"vīrasūḥ","_","_","vīrasū","NC","","_","_"
3,"strīṇāṃ","_","_","strī","NC","","_","_"
4,"deśānāṃ","_","_","deśa","NC","","_","_"
5,"kurujāṅgalam","_","_","kurujāṅgala","NC","","_","_"
1,"bhīṣmo","_","_","bhīṣma","NC","","_","_"
2,"_","_","_","dharma","NC","","_","_"
3,"_","_","_","bhṛt","JJ","","_","_"
4,"śreṣṭhaḥ","_","_","śreṣṭha","JJ","","_","_"
5,"purāṇāṃ","_","_","pura","NC","","_","_"
6,"gajasāhvayam","_","_","gajasāhvaya","NC","","_","_"
1,"te","_","_","tad","PRD","","_","_"
2,"trayaḥ","_","_","tri","NUM","","_","_"
3,"_","_","_","kāla","NC","","_","_"
4,"_","_","_","yoga","NC","","_","_"
5,"kumārā","_","_","kumāra","NC","","_","_"
6,"janamejaya","_","_","janamejaya","NC","","_","_"
1,"avardhanta","_","_","vṛdh","V","vṛdh","_","_"
2,"mahātmāno","_","_","mahātman","JJ","","_","_"
3,"nandayantaḥ","_","_","nanday","KDP","","_","_"
4,"_","_","_","suhṛd","NC","","_","_"
5,"_","_","_","jana","NC","","_","_"
1,"saṃskāraiḥ","_","_","saṃskāra","NC","","_","_"
2,"_","_","_","saṃskṛ","PPP","","_","_"
3,"_","_","_","tad","PRD","","_","_"
4,"tu","_","_","tu","CCD","","_","_"
5,"_","_","_","vrata","NC","","_","_"
6,"_","_","_","adhyayana","NC","","_","_"
7,"_","_","_","saṃyuta","JJ","","_","_"
1,"_","_","_","śrama","NC","","_","_"
2,"_","_","_","vyāyāma","NC","","_","_"
3,"_","_","_","kuśala","JJ","","_","_"
4,"samapadyanta","_","_","sampad","V","sampad","_","_"
5,"yauvanam","_","_","yauvana","NC","","_","_"
1,"dhanurvede","_","_","dhanurveda","NC","","_","_"
2,"_","_","_","aśva","NC","","_","_"
3,"_","_","_","pṛṣṭha","NC","","_","_"
4,"ca","_","_","ca","CCD","","_","_"
5,"_","_","_","gadā","NC","","_","_"
6,"_","_","_","yuddha","NC","","_","_"
7,"_","_","_","asi","NC","","_","_"
8,"_","_","_","carman","NC","","_","_"
1,"_","_","_","tathā","CX","","_","_"
2,"_","_","_","eva","CEM","","_","_"
3,"_","_","_","gaja","NC","","_","_"
4,"_","_","_","śikṣā","NC","","_","_"
5,"_","_","_","nīti","NC","","_","_"
6,"_","_","_","śāstra","NC","","_","_"
7,"ca","_","_","ca","CCD","","_","_"
8,"pāragāḥ","_","_","pāraga","JJ","","_","_"
1,"_","_","_","itihāsa","NC","","_","_"
2,"_","_","_","purāṇa","NC","","_","_"
3,"_","_","_","nānā","CX","","_","_"
4,"_","_","_","śikṣā","NC","","_","_"
5,"_","_","_","ca","CCD","","_","_"
6,"_","_","_","abhibhu","JJ","","_","_"
1,"_","_","_","veda","NC","","_","_"
2,"_","_","_","vedāṅga","NC","","_","_"
3,"_","_","_","tattva","NC","","_","_"
4,"_","_","_","jña","JJ","","_","_"
5,"sarvatra","_","_","sarvatra","CX","","_","_"
6,"_","_","_","kṛ","PPP","","_","_"
7,"_","_","_","niśrama","NC","","_","_"
1,"pāṇḍur","_","_","pāṇḍu","NC","","_","_"
2,"dhanuṣi","_","_","dhanus","NC","","_","_"
3,"vikrānto","_","_","vikra","PPP","","_","_"
4,"narebhyo","_","_","nara","NC","","_","_"
5,"'bhyadhiko","_","_","abhyadhika","JJ","","_","_"
6,"'bhavat","_","_","bhav","V","bhū","_","_"
1,"_","_","_","ati","CADP","","_","_"
2,"_","_","_","anya","PPX","","_","_"
3,"balavān","_","_","balavat","JJ","","_","_"
4,"āsīd","_","_","as","V","as","_","_"
5,"dhṛtarāṣṭro","_","_","dhṛtarāṣṭra","NC","","_","_"
6,"mahīpatiḥ","_","_","mahīpati","NC","","_","_"
1,"triṣu","_","_","tri","NUM","","_","_"
2,"lokeṣu","_","_","loka","NC","","_","_"
3,"na","_","_","na","CNG","","_","_"
4,"_","_","_","tu","CCD","","_","_"
5,"_","_","_","as","V","as","_","_"
6,"kaścid","_","_","kiṃcit","PRI","","_","_"
7,"_","_","_","vidura","NC","","_","_"
8,"_","_","_","saṃmā","PPP","","_","_"
1,"_","_","_","dharma","NC","","_","_"
2,"_","_","_","nitya","JJ","","_","_"
3,"_","_","_","tatas","CX","","_","_"
4,"rājan","_","_","rājan","NC","","_","_"
5,"dharme","_","_","dharma","NC","","_","_"
6,"ca","_","_","ca","CCD","","_","_"
7,"paramaṃ","_","_","parama","NC","","_","_"
8,"gataḥ","_","_","ga","PPP","","_","_"
1,"atha","_","_","atha","CAD","","_","_"
2,"śuśrāva","_","_","śṛṇ","V","śru","_","_"
3,"viprebhyo","_","_","vipra","NC","","_","_"
4,"yādavasya","_","_","yādava","NC","","_","_"
5,"mahīpateḥ","_","_","mahīpati","NC","","_","_"
1,"_","_","_","rūpa","NC","","_","_"
2,"_","_","_","yauvana","NC","","_","_"
3,"_","_","_","sampad","PPP","","_","_"
4,"sutāṃ","_","_","sutā","NC","","_","_"
5,"_","_","_","sāgaragā","NC","","_","_"
6,"_","_","_","suta","NC","","_","_"
1,"subalasya","_","_","subala","NC","","_","_"
2,"ca","_","_","ca","CCD","","_","_"
3,"kalyāṇīṃ","_","_","kalyāṇa","JJ","","_","_"
4,"_","_","_","gāndhāra","NC","","_","_"
5,"_","_","_","adhipati","NC","","_","_"
6,"sutām","_","_","sutā","NC","","_","_"
1,"sutāṃ","_","_","sutā","NC","","_","_"
2,"ca","_","_","ca","CCD","","_","_"
3,"_","_","_","madra","NC","","_","_"
4,"_","_","_","rāja","NC","","_","_"
5,"_","_","_","rūpa","NC","","_","_"
6,"_","_","_","apratima","JJ","","_","_"
7,"bhuvi","_","_","bhū","NC","","_","_"
1,"pranaṣṭaṃ","_","_","praṇaś","PPP","","_","_"
2,"śaṃtanor","_","_","śaṃtanu","NC","","_","_"
3,"vaṃśaṃ","_","_","vaṃśa","NC","","_","_"
4,"samīkṣya","_","_","samīkṣ","CGDA","","_","_"
5,"punar","_","_","punar","CAD","","_","_"
6,"uddhṛtam","_","_","uddhṛ","PPP","","_","_"
1,"tato","_","_","tatas","CX","","_","_"
2,"nirvacanaṃ","_","_","nirvacana","NC","","_","_"
3,"loke","_","_","loka","NC","","_","_"
4,"_","_","_","sarva","JQ","","_","_"
5,"_","_","_","rāṣṭra","NC","","_","_"
6,"_","_","_","vart","V","vṛt","_","_"
1,"vīrasūnāṃ","_","_","vīrasū","NC","","_","_"
2,"_","_","_","kāśi","NC","","_","_"
3,"_","_","_","sutā","NC","","_","_"
4,"deśānāṃ","_","_","deśa","NC","","_","_"
5,"kurujāṅgalam","_","_","kurujāṅgala","NC","","_","_"
1,"_","_","_","sarva","JQ","","_","_"
2,"_","_","_","dharma","NC","","_","_"
3,"_","_","_","vid","JJ","","_","_"
4,"bhīṣmaḥ","_","_","bhīṣma","NC","","_","_"
5,"purāṇāṃ","_","_","pura","NC","","_","_"
6,"gajasāhvayam","_","_","gajasāhvaya","NC","","_","_"
1,"_","_","_","dhṛtarāṣṭra","NC","","_","_"
2,"_","_","_","tu","CCD","","_","_"
3,"_","_","_","acakṣuṣṭva","NC","","_","_"
4,"rājyaṃ","_","_","rājya","NC","","_","_"
5,"na","_","_","na","CNG","","_","_"
6,"pratyapadyata","_","_","pratipad","V","pratipad","_","_"
1,"_","_","_","karaṇatva","NC","","_","_"
2,"_","_","_","ca","CCD","","_","_"
3,"viduraḥ","_","_","vidura","NC","","_","_"
4,"pāṇḍur","_","_","pāṇḍu","NC","","_","_"
5,"āsīn","_","_","as","V","as","_","_"
6,"mahīpatiḥ","_","_","mahīpati","NC","","_","_"
1,"kadācid","_","_","kadācid","CX","","_","_"
2,"atha","_","_","atha","CAD","","_","_"
3,"gāṅgeyaḥ","_","_","gāṅgeya","NC","","_","_"
4,"_","_","_","sarva","JQ","","_","_"
5,"_","_","_","nīti","NC","","_","_"
6,"_","_","_","viśārada","JJ","","_","_"
1,"viduraṃ","_","_","vidura","NC","","_","_"
2,"_","_","_","dharma","NC","","_","_"
3,"_","_","_","tattva","NC","","_","_"
4,"_","_","_","jña","JJ","","_","_"
5,"vākyam","_","_","vākya","NC","","_","_"
6,"āha","_","_","ah","V","ah","_","_"
7,"yathocitam","_","_","yathocita","JJ","","_","_"
1,"tataḥ","_","_","tatas","CX","","_","_"
2,"kāle","_","_","kāla","NC","","_","_"
3,"bahutithe","_","_","bahutitha","JJ","","_","_"
4,"bhīṣmo","_","_","bhīṣma","NC","","_","_"
5,"viduram","_","_","vidura","NC","","_","_"
6,"abravīt","_","_","abravīta","V","brū","_","_"
