"WordID","word","NormSTEM","suffix","lemma","PoS","Root","NormSuffix","NormWord"
1,"eṣa","_","_","tad","PRD","","_","_"
2,"kavir","_","_","kavi","NC","","_","_"
3,"abhiṣṭutaḥ","_","_","abhiṣṭu","PPP","","_","_"
4,"pavitre","_","_","pavitra","NC","","_","_"
5,"adhi","_","_","adhi","CADP","","_","_"
6,"tośate","_","_","tuś","V","tuś","_","_"
1,"punāno","_","_","pū","KDP","","_","_"
2,"ghnann","_","_","han","KDP","","_","_"
3,"apa","_","_","apa","CX","","_","_"
4,"sridhaḥ","_","_","sridh","NC","","_","_"
1,"eṣa","_","_","tad","PRD","","_","_"
2,"indrāya","_","_","indra","NC","","_","_"
3,"vāyave","_","_","vāyu","NC","","_","_"
4,"_","_","_","svar","NC","","_","_"
5,"_","_","_","jit","JJ","","_","_"
6,"pari","_","_","pari","CADP","","_","_"
7,"ṣicyate","_","_","sic","V","sic","_","_"
1,"pavitre","_","_","pavitra","NC","","_","_"
2,"_","_","_","dakṣa","NC","","_","_"
3,"_","_","_","sādhana","JJ","","_","_"
1,"eṣa","_","_","tad","PRD","","_","_"
2,"nṛbhir","_","_","nṛ","NC","","_","_"
3,"vi","_","_","vi","CADP","","_","_"
4,"nīyate","_","_","nay","V","nī","_","_"
5,"divo","_","_","div","NC","","_","_"
6,"mūrdhā","_","_","mūrdhan","NC","","_","_"
7,"vṛṣā","_","_","vṛṣan","NC","","_","_"
8,"sutaḥ","_","_","su","PPP","","_","_"
1,"somo","_","_","soma","NC","","_","_"
2,"vaneṣu","_","_","vana","NC","","_","_"
3,"_","_","_","viśva","JQ","","_","_"
4,"_","_","_","vid","JJ","","_","_"
1,"eṣa","_","_","tad","PRD","","_","_"
2,"gavyur","_","_","gavyu","JJ","","_","_"
3,"acikradat","_","_","krand","V","krand","_","_"
4,"pavamāno","_","_","pū","KDP","","_","_"
5,"hiraṇyayuḥ","_","_","hiraṇyayu","JJ","","_","_"
1,"induḥ","_","_","indu","NC","","_","_"
2,"satrājid","_","_","satrājit","JJ","","_","_"
3,"astṛtaḥ","_","_","astṛta","JJ","","_","_"
1,"eṣa","_","_","tad","PRD","","_","_"
2,"sūryeṇa","_","_","sūrya","NC","","_","_"
3,"hāsate","_","_","hās","V","hās","_","_"
4,"pavamāno","_","_","pū","KDP","","_","_"
5,"adhi","_","_","adhi","CADP","","_","_"
6,"dyavi","_","_","div","NC","","_","_"
1,"pavitre","_","_","pavitra","NC","","_","_"
2,"matsaro","_","_","matsara","JJ","","_","_"
3,"madaḥ","_","_","mada","NC","","_","_"
1,"eṣa","_","_","tad","PRD","","_","_"
2,"śuṣmy","_","_","śuṣmin","JJ","","_","_"
3,"asiṣyadad","_","_","syand","V","syand","_","_"
4,"antarikṣe","_","_","antarikṣa","NC","","_","_"
5,"vṛṣā","_","_","vṛṣan","NC","","_","_"
6,"hariḥ","_","_","hari","JJ","","_","_"
1,"punāna","_","_","pū","KDP","","_","_"
2,"indur","_","_","indu","NC","","_","_"
3,"indram","_","_","indra","NC","","_","_"
4,"ā","_","_","ā","CADP","","_","_"
