"WordID","word","NormSTEM","suffix","lemma","PoS","Root","NormSuffix","NormWord"
1,"dhīrā","_","_","dhīra","JJ","","_","_"
2,"tv","_","_","tu","CCD","","_","_"
3,"asya","_","_","ida","PRD","","_","_"
4,"mahinā","_","_","mahina","NC","","_","_"
5,"janūṃṣi","_","_","janus","NC","","_","_"
6,"vi","_","_","vi","CADP","","_","_"
7,"yas","_","_","yad","PRL","","_","_"
8,"tastambha","_","_","stambh","V","stambh","_","_"
9,"rodasī","_","_","rodasī","NC","","_","_"
10,"cid","_","_","cit","CEM","","_","_"
11,"urvī","_","_","uru","JJ","","_","_"
1,"pra","_","_","pra","CADP","","_","_"
2,"nākam","_","_","nāka","NC","","_","_"
3,"ṛṣvaṃ","_","_","ṛṣva","JJ","","_","_"
4,"nunude","_","_","nud","V","nud","_","_"
5,"bṛhantaṃ","_","_","bṛhat","JJ","","_","_"
6,"dvitā","_","_","dvitā","CX","","_","_"
7,"nakṣatram","_","_","nakṣatra","NC","","_","_"
8,"paprathac","_","_","prath","V","prath","_","_"
9,"ca","_","_","ca","CCD","","_","_"
10,"bhūma","_","_","bhūman","NC","","_","_"
1,"uta","_","_","uta","CCD","","_","_"
2,"svayā","_","_","sva","JJ","","_","_"
3,"tanvā","_","_","tanū","NC","","_","_"
4,"saṃ","_","_","sa","CADP","","_","_"
5,"vade","_","_","vad","V","vad","_","_"
6,"tat","_","_","tad","PRD","","_","_"
7,"kadā","_","_","kadā","CX","","_","_"
8,"nv","_","_","nu","CX","","_","_"
9,"antar","_","_","antar","CAD","","_","_"
10,"varuṇe","_","_","varuṇa","NC","","_","_"
11,"bhuvāni","_","_","bhav","V","bhū","_","_"
1,"kim","_","_","kim","CX","","_","_"
2,"me","_","_","mat","PPR","","_","_"
3,"havyam","_","_","havya","NC","","_","_"
4,"_","_","_","a","CNG","","_","_"
5,"_","_","_","hṛ","KDP","","_","_"
6,"juṣeta","_","_","juṣ","V","juṣ","_","_"
7,"kadā","_","_","kadā","CX","","_","_"
8,"mṛﾱīkaṃ","_","_","mṛḍīka","NC","","_","_"
9,"sumanā","_","_","sumanas","JJ","","_","_"
10,"abhi","_","_","abhi","CADP","","_","_"
11,"khyam","_","_","khyā","V","khyā","_","_"
1,"pṛcche","_","_","pracch","V","pracch","_","_"
2,"tad","_","_","tad","PRD","","_","_"
3,"eno","_","_","enas","NC","","_","_"
4,"varuṇa","_","_","varuṇa","NC","","_","_"
5,"_","_","_","didṛkṣu","JJ","","_","_"
6,"_","_","_","upa","CADP","","_","_"
7,"_","_","_","u","CEM","","_","_"
8,"emi","_","_","e","V","i","_","_"
9,"cikituṣo","_","_","cit","KDP","","_","_"
10,"vipṛccham","_","_","vipracch","CGDI","","_","_"
1,"samānam","_","_","samāna","JJ","","_","_"
2,"in","_","_","id","CEM","","_","_"
3,"me","_","_","mat","PPR","","_","_"
4,"kavayaś","_","_","kavi","NC","","_","_"
5,"cid","_","_","cit","CEM","","_","_"
6,"āhur","_","_","ah","V","ah","_","_"
7,"ayaṃ","_","_","ida","PRD","","_","_"
8,"ha","_","_","ha","CEM","","_","_"
9,"tubhyaṃ","_","_","tvat","PPR","","_","_"
10,"varuṇo","_","_","varuṇa","NC","","_","_"
11,"hṛṇīte","_","_","har","V","hṛ","_","_"
1,"kim","_","_","kiṃ","PRQ","","_","_"
2,"āga","_","_","āgas","NC","","_","_"
3,"āsa","_","_","as","V","as","_","_"
4,"varuṇa","_","_","varuṇa","NC","","_","_"
5,"jyeṣṭhaṃ","_","_","jyeṣṭha","JJ","","_","_"
6,"yat","_","_","yat","CSB","","_","_"
7,"stotāraṃ","_","_","stotṛ","JJ","","_","_"
8,"jighāṃsasi","_","_","han","V","han","_","_"
9,"sakhāyam","_","_","sakhi","NC","","_","_"
1,"pra","_","_","pra","CADP","","_","_"
2,"tan","_","_","tad","PRD","","_","_"
3,"me","_","_","mat","PPR","","_","_"
4,"voco","_","_","vak","V","vac","_","_"
5,"dūﾱabha","_","_","dūḍabha","JJ","","_","_"
6,"svadhāvo","_","_","svadhāvat","JJ","","_","_"
7,"'va","_","_","ava","CX","","_","_"
8,"_","_","_","tvat","PPR","","_","_"
9,"_","_","_","anenas","JJ","","_","_"
10,"namasā","_","_","namas","NC","","_","_"
11,"tura","_","_","tura","JJ","","_","_"
12,"iyām","_","_","e","V","i","_","_"
1,"ava","_","_","ava","CX","","_","_"
2,"drugdhāni","_","_","drugdha","NC","","_","_"
3,"pitryā","_","_","pitrya","JJ","","_","_"
4,"sṛjā","_","_","sṛj","V","sṛj","_","_"
5,"no","_","_","mat","PPR","","_","_"
6,"'va","_","_","ava","CX","","_","_"
7,"yā","_","_","yad","PRL","","_","_"
8,"vayaṃ","_","_","mat","PPR","","_","_"
9,"cakṛmā","_","_","kar","V","kṛ","_","_"
10,"tanūbhiḥ","_","_","tanū","NC","","_","_"
1,"ava","_","_","ava","CX","","_","_"
2,"rājan","_","_","rājan","NC","","_","_"
3,"paśutṛpaṃ","_","_","paśutṛp","JJ","","_","_"
4,"na","_","_","na","CNG","","_","_"
5,"tāyuṃ","_","_","tāyu","NC","","_","_"
6,"sṛjā","_","_","sṛj","V","sṛj","_","_"
7,"vatsaṃ","_","_","vatsa","NC","","_","_"
8,"na","_","_","na","CNG","","_","_"
9,"dāmno","_","_","dāman","NC","","_","_"
10,"vasiṣṭham","_","_","vasiṣṭha","NC","","_","_"
1,"na","_","_","na","CNG","","_","_"
2,"sa","_","_","tad","PRD","","_","_"
3,"svo","_","_","sva","JJ","","_","_"
4,"dakṣo","_","_","dakṣa","NC","","_","_"
5,"varuṇa","_","_","varuṇa","NC","","_","_"
6,"dhrutiḥ","_","_","dhruti","NC","","_","_"
7,"sā","_","_","tad","PRD","","_","_"
8,"surā","_","_","surā","NC","","_","_"
9,"manyur","_","_","manyu","NC","","_","_"
10,"vibhīdako","_","_","vibhīdaka","NC","","_","_"
11,"acittiḥ","_","_","acitti","NC","","_","_"
1,"asti","_","_","as","V","as","_","_"
2,"jyāyān","_","_","jyāyas","JJ","","_","_"
3,"kanīyasa","_","_","kanīyas","JJ","","_","_"
4,"upāre","_","_","upāra","NC","","_","_"
5,"svapnaś","_","_","svapna","NC","","_","_"
6,"_","_","_","cana","CX","","_","_"
7,"_","_","_","id","CEM","","_","_"
8,"anṛtasya","_","_","anṛta","NC","","_","_"
9,"prayotā","_","_","prayotṛ","NC","","_","_"
1,"araṃ","_","_","ara","CX","","_","_"
2,"dāso","_","_","dāsa","NC","","_","_"
3,"na","_","_","na","CNG","","_","_"
4,"mīﾱhuṣe","_","_","mīḍhvas","JJ","","_","_"
5,"karāṇy","_","_","kar","V","kṛ","_","_"
6,"ahaṃ","_","_","mat","PPR","","_","_"
7,"devāya","_","_","deva","NC","","_","_"
8,"bhūrṇaye","_","_","bhūrṇi","JJ","","_","_"
9,"'nāgāḥ","_","_","anāgas","JJ","","_","_"
1,"acetayad","_","_","cetay","V","cetay","_","_"
2,"acito","_","_","acit","JJ","","_","_"
3,"devo","_","_","deva","NC","","_","_"
4,"aryo","_","_","ari","JJ","","_","_"
5,"gṛtsaṃ","_","_","gṛtsa","JJ","","_","_"
6,"rāye","_","_","rai","NC","","_","_"
7,"kavitaro","_","_","kavitara","JJ","","_","_"
8,"junāti","_","_","jū","V","jū","_","_"
1,"ayaṃ","_","_","ida","PRD","","_","_"
2,"su","_","_","su","CAD","","_","_"
3,"tubhyaṃ","_","_","tvat","PPR","","_","_"
4,"varuṇa","_","_","varuṇa","NC","","_","_"
5,"svadhāvo","_","_","svadhāvat","JJ","","_","_"
6,"hṛdi","_","_","hṛd","NC","","_","_"
7,"stoma","_","_","stoma","NC","","_","_"
8,"upaśritaś","_","_","upaśri","PPP","","_","_"
9,"cid","_","_","cit","CEM","","_","_"
10,"astu","_","_","as","V","as","_","_"
1,"śaṃ","_","_","śa","CX","","_","_"
2,"naḥ","_","_","mat","PPR","","_","_"
3,"kṣeme","_","_","kṣema","NC","","_","_"
4,"śam","_","_","śa","CX","","_","_"
5,"u","_","_","u","CEM","","_","_"
6,"yoge","_","_","yoga","NC","","_","_"
7,"no","_","_","mat","PPR","","_","_"
8,"astu","_","_","as","V","as","_","_"
9,"yūyam","_","_","tvat","PPR","","_","_"
10,"pāta","_","_","pib","V","pā","_","_"
11,"svastibhiḥ","_","_","svasti","NC","","_","_"
12,"sadā","_","_","sadā","CAD","","_","_"
13,"naḥ","_","_","mat","PPR","","_","_"
