"WordID","word","NormSTEM","suffix","lemma","PoS","Root","NormSuffix","NormWord"
1,"yeṣāṃ","_","_","yad","PRL","","_","_"
2,"rāmā","_","_","rāmā","NC","","_","_"
3,"_","_","_","ramaṇa","NC","","_","_"
4,"_","_","_","kuśala","JJ","","_","_"
5,"_","_","_","rāga","NC","","_","_"
6,"_","_","_","sañj","PPP","","_","_"
7,"pragalbhāḥ","_","_","pragalbha","JJ","","_","_"
8,"_","_","_","kāma","NC","","_","_"
9,"_","_","_","āsañj","PPP","","_","_"
10,"_","_","_","hariṇanayanā","NC","","_","_"
11,"_","_","_","candra","NC","","_","_"
12,"_","_","_","bimba","NC","","_","_"
13,"_","_","_","ānana","NC","","_","_"
14,"_","_","_","ca","CCD","","_","_"
1,"teṣāṃ","_","_","tad","PRD","","_","_"
2,"vakṣye","_","_","vak","V","vac","_","_"
3,"_","_","_","madana","NC","","_","_"
4,"_","_","_","sukha","NC","","_","_"
5,"_","_","_","da","JJ","","_","_"
6,"_","_","_","vīrya","NC","","_","_"
7,"_","_","_","vṛddhi","NC","","_","_"
8,"prabhūtāṃ","_","_","prabhū","PPP","","_","_"
9,"mattāḥ","_","_","mat","PPP","","_","_"
10,"siddhāḥ","_","_","siddha","NC","","_","_"
11,"_","_","_","śata","NUM","","_","_"
12,"_","_","_","api","CX","","_","_"
13,"_","_","_","dṛḍha","JJ","","_","_"
14,"_","_","_","tādṛśa","JJ","","_","_"
15,"_","_","_","toṣay","V","toṣay","_","_"
1,"_","_","_","vajra","NC","","_","_"
2,"_","_","_","heman","NC","","_","_"
3,"_","_","_","arka","NC","","_","_"
4,"_","_","_","sūta","NC","","_","_"
5,"_","_","_","abhra","NC","","_","_"
6,"_","_","_","loha","NC","","_","_"
7,"_","_","_","bhasman","NC","","_","_"
8,"_","_","_","krama","NC","","_","_"
9,"_","_","_","uttara","JJ","","_","_"
1,"sarvaṃ","_","_","sarva","JQ","","_","_"
2,"_","_","_","kanyā","NC","","_","_"
3,"_","_","_","drava","NC","","_","_"
4,"_","_","_","mṛd","KDG","","_","_"
5,"_","_","_","śālmali","NC","","_","_"
6,"_","_","_","ca","CCD","","_","_"
7,"_","_","_","drava","NC","","_","_"
8,"_","_","_","tri","NUM","","_","_"
9,"_","_","_","aha","NC","","_","_"
1,"_","_","_","tad","PRD","","_","_"
2,"_","_","_","rudh","CGDA","","_","_"
3,"_","_","_","kācakūpī","NC","","_","_"
4,"_","_","_","antar","CAD","","_","_"
5,"_","_","_","vālukā","NC","","_","_"
6,"_","_","_","tri","NUM","","_","_"
7,"_","_","_","aha","NC","","_","_"
8,"pacet","_","_","pac","V","pac","_","_"
1,"_","_","_","tad","PRD","","_","_"
2,"_","_","_","kalka","NC","","_","_"
3,"_","_","_","musalī","NC","","_","_"
4,"_","_","_","kvātha","NC","","_","_"
5,"_","_","_","vajra","NC","","_","_"
6,"_","_","_","arka","NC","","_","_"
7,"_","_","_","kṣīra","NC","","_","_"
8,"_","_","_","saṃyuta","JJ","","_","_"
1,"_","_","_","dina","NC","","_","_"
2,"_","_","_","eka","PPX","","_","_"
3,"_","_","_","marday","V","marday","_","_"
4,"_","_","_","khalva","NC","","_","_"
5,"_","_","_","rudh","CGDA","","_","_"
6,"_","_","_","antar","CAD","","_","_"
7,"_","_","_","bhūdhara","NC","","_","_"
8,"puṭet","_","_","puṭ","V","puṭ","_","_"
1,"_","_","_","yāma","NC","","_","_"
2,"_","_","_","uddhṛ","CGDA","","_","_"
3,"saṃcūrṇyaṃ","_","_","saṃcūrṇay","KDG","","_","_"
4,"_","_","_","sitā","NC","","_","_"
5,"_","_","_","kṛṣṇā","NC","","_","_"
6,"_","_","_","tri","NUM","","_","_"
7,"_","_","_","jātaka","NC","","_","_"
1,"samaiḥ","_","_","sama","PPX","","_","_"
2,"samaṃ","_","_","sama","PPX","","_","_"
3,"_","_","_","vimiśray","CGDA","","_","_"
4,"_","_","_","atha","CAD","","_","_"
5,"_","_","_","māṣa","NC","","_","_"
6,"_","_","_","eka","PPX","","_","_"
7,"_","_","_","bhakṣay","V","bhakṣay","_","_"
8,"_","_","_","sadā","CAD","","_","_"
1,"māgadhī","_","_","māgadhī","NC","","_","_"
2,"musalī","_","_","musalī","NC","","_","_"
3,"yaṣṭī","_","_","yaṣṭī","NC","","_","_"
4,"_","_","_","vānarī","NC","","_","_"
5,"_","_","_","bījaka","NC","","_","_"
6,"samam","_","_","sama","PPX","","_","_"
1,"cūrṇaṃ","_","_","cūrṇa","NC","","_","_"
2,"_","_","_","sitā","NC","","_","_"
3,"_","_","_","ājya","NC","","_","_"
4,"_","_","_","gokṣīra","NC","","_","_"
5,"_","_","_","pala","NC","","_","_"
6,"_","_","_","ardha","NC","","_","_"
7,"_","_","_","pāyay","V","pāyay","_","_"
8,"_","_","_","anu","CADP","","_","_"
1,"kāminīnāṃ","_","_","kāminī","NC","","_","_"
2,"sahasraikaṃ","_","_","sahasraika","JJ","","_","_"
3,"ramamāṇo","_","_","ra","KDP","","_","_"
4,"na","_","_","na","CNG","","_","_"
5,"muhyati","_","_","muh","V","muh","_","_"
1,"_","_","_","sevana","NC","","_","_"
2,"_","_","_","dṛḍha","JJ","","_","_"
3,"_","_","_","kāya","NC","","_","_"
4,"_","_","_","as","V","as","_","_"
5,"_","_","_","rasa","NC","","_","_"
6,"_","_","_","ida","PRD","","_","_"
7,"makaradhvajaḥ","_","_","makaradhvaja","NC","","_","_"
1,"śuddhasūtaṃ","_","_","śuddhasūta","NC","","_","_"
2,"samaṃ","_","_","sama","PPX","","_","_"
3,"gandhaṃ","_","_","gandha","NC","","_","_"
4,"_","_","_","raktotpala","NC","","_","_"
5,"_","_","_","dala","NC","","_","_"
6,"_","_","_","drava","NC","","_","_"
1,"yāmaṃ","_","_","yāma","NC","","_","_"
2,"mardyaṃ","_","_","mṛd","KDG","","_","_"
3,"_","_","_","punar","CAD","","_","_"
4,"_","_","_","gandha","NC","","_","_"
5,"sārdhaṃ","_","_","sārdha","CX","","_","_"
6,"tatra","_","_","tatra","CAD","","_","_"
7,"vinikṣipet","_","_","vinikṣip","V","vinikṣip","_","_"
1,"_","_","_","pūrva","PPX","","_","_"
2,"_","_","_","drāva","NC","","_","_"
3,"_","_","_","dina","NC","","_","_"
4,"mardyaṃ","_","_","mṛd","KDG","","_","_"
5,"_","_","_","rasa","NC","","_","_"
6,"_","_","_","ardha","NC","","_","_"
7,"gandhakaṃ","_","_","gandhaka","NC","","_","_"
8,"punaḥ","_","_","punar","CAD","","_","_"
1,"dattvā","_","_","dā","CGDA","","_","_"
2,"_","_","_","tadvat","CX","","_","_"
3,"_","_","_","dina","NC","","_","_"
4,"mardyaṃ","_","_","mṛd","KDG","","_","_"
5,"kācakūpyāṃ","_","_","kācakūpī","NC","","_","_"
6,"nirodhayet","_","_","nirrudh","V","nirrudh","_","_"
1,"_","_","_","dina","NC","","_","_"
2,"_","_","_","eka","PPX","","_","_"
3,"vālukāyantre","_","_","vālukāyantra","NC","","_","_"
4,"_","_","_","pakva","JJ","","_","_"
5,"_","_","_","uddhṛ","CGDA","","_","_"
6,"cūrṇayet","_","_","cūrṇay","V","cūrṇay","_","_"
1,"_","_","_","bhūkuṣmāṇḍī","NC","","_","_"
2,"_","_","_","kaṣāya","NC","","_","_"
3,"_","_","_","bhāvay","V","bhāvay","_","_"
4,"_","_","_","dina","NC","","_","_"
5,"_","_","_","saptaka","NC","","_","_"
1,"chāyāyāṃ","_","_","chāyā","NC","","_","_"
2,"_","_","_","tad","PRD","","_","_"
3,"_","_","_","sitā","NC","","_","_"
4,"_","_","_","tulya","JJ","","_","_"
5,"_","_","_","niṣka","NC","","_","_"
6,"_","_","_","eka","PPX","","_","_"
7,"_","_","_","bhakṣay","V","bhakṣay","_","_"
8,"_","_","_","sadā","CAD","","_","_"
1,"_","_","_","śaṇa","NC","","_","_"
2,"_","_","_","mūla","NC","","_","_"
3,"sabījaṃ","_","_","sabīja","JJ","","_","_"
4,"ca","_","_","ca","CCD","","_","_"
5,"musalī","_","_","musalī","NC","","_","_"
6,"śarkarā","_","_","śarkarā","NC","","_","_"
7,"samam","_","_","sama","PPX","","_","_"
1,"gavāṃ","_","_","go","NC","","_","_"
2,"kṣīraiḥ","_","_","kṣīra","NC","","_","_"
3,"_","_","_","pala","NC","","_","_"
4,"_","_","_","ardha","NC","","_","_"
5,"tu","_","_","tu","CCD","","_","_"
6,"anu","_","_","anu","CADP","","_","_"
7,"rātrau","_","_","rātri","NC","","_","_"
8,"sadā","_","_","sadā","CAD","","_","_"
9,"pibet","_","_","pib","V","pā","_","_"
1,"anantaṃ","_","_","ananta","JJ","","_","_"
2,"vardhate","_","_","vṛdh","V","vṛdh","_","_"
3,"vīryaṃ","_","_","vīrya","NC","","_","_"
4,"_","_","_","rasa","NC","","_","_"
5,"_","_","_","ida","PRD","","_","_"
6,"madanodayaḥ","_","_","madanodaya","NC","","_","_"
1,"_","_","_","śuddhasūta","NC","","_","_"
2,"_","_","_","sama","PPX","","_","_"
3,"gandhaṃ","_","_","gandha","NC","","_","_"
4,"_","_","_","badarī","NC","","_","_"
5,"_","_","_","citraka","NC","","_","_"
6,"_","_","_","drava","NC","","_","_"
1,"mardyaṃ","_","_","mṛd","KDG","","_","_"
2,"_","_","_","ca","CCD","","_","_"
3,"_","_","_","aṅkolla","NC","","_","_"
4,"_","_","_","ja","JJ","","_","_"
5,"_","_","_","drāva","NC","","_","_"
6,"_","_","_","tap","PPP","","_","_"
7,"_","_","_","khalva","NC","","_","_"
8,"_","_","_","dina","NC","","_","_"
9,"_","_","_","traya","NC","","_","_"
1,"sadyo","_","_","sadyas","CAD","","_","_"
2,"_","_","_","han","PPP","","_","_"
3,"_","_","_","aja","NC","","_","_"
4,"_","_","_","māṃsa","NC","","_","_"
5,"piṇḍe","_","_","piṇḍa","NC","","_","_"
6,"nyastaṃ","_","_","nyas","PPP","","_","_"
7,"ca","_","_","ca","CCD","","_","_"
8,"sīvayet","_","_","sīvay","V","sīvay","_","_"
1,"_","_","_","tad","PRD","","_","_"
2,"_","_","_","piṇḍa","NC","","_","_"
3,"_","_","_","tila","NC","","_","_"
4,"_","_","_","taila","NC","","_","_"
5,"_","_","_","loha","NC","","_","_"
6,"_","_","_","pātra","NC","","_","_"
7,"śanaiḥ","_","_","śanais","CX","","_","_"
8,"pacet","_","_","pac","V","pac","_","_"
1,"_","_","_","yāvat","CX","","_","_"
2,"_","_","_","māṃsa","NC","","_","_"
3,"_","_","_","rakta","JJ","","_","_"
4,"_","_","_","varṇa","NC","","_","_"
5,"tataḥ","_","_","tatas","CX","","_","_"
6,"sūtaṃ","_","_","sūta","NC","","_","_"
7,"samuddharet","_","_","samuddhar","V","samuddhṛ","_","_"
1,"_","_","_","tri","NUM","","_","_"
2,"_","_","_","dina","NC","","_","_"
3,"_","_","_","musalī","NC","","_","_"
4,"_","_","_","kvātha","NC","","_","_"
5,"_","_","_","bhāvay","PPP","","_","_"
6,"sitayā","_","_","sitā","NC","","_","_"
7,"yutam","_","_","yuta","JJ","","_","_"
1,"_","_","_","niṣka","NC","","_","_"
2,"_","_","_","eka","PPX","","_","_"
3,"_","_","_","bhakṣay","V","bhakṣay","_","_"
4,"_","_","_","nitya","CX","","_","_"
5,"_","_","_","rasa","NC","","_","_"
6,"_","_","_","ida","PRD","","_","_"
7,"madaneśvaraḥ","_","_","madaneśvara","NC","","_","_"
1,"_","_","_","vidārī","NC","","_","_"
2,"_","_","_","kanda","NC","","_","_"
3,"_","_","_","cūrṇa","NC","","_","_"
4,"tu","_","_","tu","CCD","","_","_"
5,"_","_","_","kṣīra","NC","","_","_"
6,"_","_","_","ājya","NC","","_","_"
7,"palaṃ","_","_","pala","NC","","_","_"
8,"pibet","_","_","pib","V","pā","_","_"
1,"_","_","_","ramay","V","ramay","_","_"
2,"_","_","_","strī","NC","","_","_"
3,"_","_","_","śata","NUM","","_","_"
4,"nityaṃ","_","_","nitya","CX","","_","_"
5,"_","_","_","tad","PRD","","_","_"
6,"_","_","_","tyāga","NC","","_","_"
7,"_","_","_","andhatā","NC","","_","_"
8,"vrajet","_","_","vraj","V","vraj","_","_"
1,"_","_","_","mṛ","PPP","","_","_"
2,"_","_","_","abhra","NC","","_","_"
3,"pāradaṃ","_","_","pārada","NC","","_","_"
4,"svarṇaṃ","_","_","svarṇa","NC","","_","_"
5,"tulyaṃ","_","_","tulya","JJ","","_","_"
6,"mardyaṃ","_","_","mṛd","KDG","","_","_"
7,"_","_","_","dina","NC","","_","_"
8,"_","_","_","traya","NC","","_","_"
1,"_","_","_","musalī","NC","","_","_"
2,"_","_","_","triphalā","NC","","_","_"
3,"_","_","_","kvātha","NC","","_","_"
4,"_","_","_","vājigandhā","NC","","_","_"
5,"_","_","_","kaṣāyaka","NC","","_","_"
1,"_","_","_","kadala","NC","","_","_"
2,"_","_","_","kanda","NC","","_","_"
3,"_","_","_","ja","JJ","","_","_"
4,"_","_","_","drāva","NC","","_","_"
5,"_","_","_","tad","PRD","","_","_"
6,"_","_","_","gola","NC","","_","_"
7,"_","_","_","ca","CCD","","_","_"
8,"_","_","_","andhay","PPP","","_","_"
9,"puṭet","_","_","puṭ","V","puṭ","_","_"
1,"bhūdhare","_","_","bhūdhara","NC","","_","_"
2,"_","_","_","dina","NC","","_","_"
3,"_","_","_","mātra","NC","","_","_"
4,"tu","_","_","tu","CCD","","_","_"
5,"_","_","_","samuddhṛ","CGDA","","_","_"
6,"_","_","_","atha","CAD","","_","_"
7,"mardayet","_","_","marday","V","marday","_","_"
1,"_","_","_","dina","NC","","_","_"
2,"_","_","_","eka","PPX","","_","_"
3,"_","_","_","pūrva","PPX","","_","_"
4,"_","_","_","ja","JJ","","_","_"
5,"_","_","_","drāva","NC","","_","_"
6,"_","_","_","tadvat","CX","","_","_"
7,"_","_","_","rudh","CGDA","","_","_"
8,"puṭe","_","_","puṭa","NC","","_","_"
9,"pacet","_","_","pac","V","pac","_","_"
1,"_","_","_","punar","CAD","","_","_"
2,"_","_","_","mṛd","KDG","","_","_"
3,"punaḥ","_","_","punar","CAD","","_","_"
4,"_","_","_","pācay","KDG","","_","_"
5,"_","_","_","eva","CX","","_","_"
6,"_","_","_","aṣṭan","NUM","","_","_"
7,"_","_","_","puṭa","NC","","_","_"
8,"pacet","_","_","pac","V","pac","_","_"
1,"_","_","_","śālmalī","NC","","_","_"
2,"_","_","_","jan","PPP","","_","_"
3,"_","_","_","niryāsa","NC","","_","_"
4,"_","_","_","tulya","JJ","","_","_"
5,"śarkarayā","_","_","śarkarā","NC","","_","_"
6,"saha","_","_","saha","CX","","_","_"
1,"_","_","_","khād","V","khād","_","_"
2,"_","_","_","niṣka","NC","","_","_"
3,"_","_","_","dvaya","NC","","_","_"
4,"nityaṃ","_","_","nitya","CX","","_","_"
5,"_","_","_","drāvay","V","drāvay","_","_"
6,"_","_","_","vanitā","NC","","_","_"
7,"_","_","_","śata","NUM","","_","_"
1,"_","_","_","gokṣīra","NC","","_","_"
2,"_","_","_","markaṭī","NC","","_","_"
3,"_","_","_","bīja","NC","","_","_"
4,"_","_","_","pala","NC","","_","_"
5,"_","_","_","ardha","NC","","_","_"
6,"_","_","_","pāyay","V","pāyay","_","_"
7,"_","_","_","anu","CADP","","_","_"
1,"_","_","_","sarva","JQ","","_","_"
2,"_","_","_","aṅga","NC","","_","_"
3,"_","_","_","udvartana","NC","","_","_"
4,"kuryāt","_","_","kar","V","kṛ","_","_"
5,"_","_","_","sa_saha","CX","","_","_"
6,"_","_","_","yava","NC","","_","_"
7,"_","_","_","śālmalī","NC","","_","_"
8,"_","_","_","drava","NC","","_","_"
1,"rasaḥ","_","_","rasa","NC","","_","_"
2,"_","_","_","kāmakalā","NC","","_","_"
3,"_","_","_","ākhyā","NC","","_","_"
4,"_","_","_","ida","PRD","","_","_"
5,"_","_","_","mahat","JJ","","_","_"
6,"_","_","_","vīrya","NC","","_","_"
7,"_","_","_","kara","JJ","","_","_"
8,"nṛṇām","_","_","nṛ","NC","","_","_"
1,"mṛtasūtaṃ","_","_","mṛtasūta","NC","","_","_"
2,"trayo","_","_","tri","NUM","","_","_"
3,"bhāgā","_","_","bhāga","NC","","_","_"
4,"_","_","_","bhāga","NC","","_","_"
5,"_","_","_","eka","PPX","","_","_"
6,"hāṭakaṃ","_","_","hāṭaka","NC","","_","_"
7,"mṛtam","_","_","mṛ","PPP","","_","_"
1,"_","_","_","kadala","NC","","_","_"
2,"_","_","_","kanda","NC","","_","_"
3,"_","_","_","ja","JJ","","_","_"
4,"_","_","_","drāva","NC","","_","_"
5,"_","_","_","śālmalī","NC","","_","_"
6,"_","_","_","ja","JJ","","_","_"
7,"_","_","_","drava","NC","","_","_"
8,"_","_","_","dina","NC","","_","_"
1,"_","_","_","gokṣīra","NC","","_","_"
2,"_","_","_","ca","CCD","","_","_"
3,"dinaṃ","_","_","dina","NC","","_","_"
4,"mardyaṃ","_","_","mṛd","KDG","","_","_"
5,"_","_","_","kṣaṇa","NC","","_","_"
6,"_","_","_","eka","PPX","","_","_"
7,"_","_","_","pācay","V","pācay","_","_"
8,"_","_","_","ghṛta","NC","","_","_"
1,"_","_","_","tad","PRD","","_","_"
2,"_","_","_","madhya","NC","","_","_"
3,"śarkarāṃ","_","_","śarkarā","NC","","_","_"
4,"drākṣāṃ","_","_","drākṣā","NC","","_","_"
5,"dhātrīṃ","_","_","dhātrī","NC","","_","_"
6,"_","_","_","rambhā","NC","","_","_"
7,"_","_","_","phala","NC","","_","_"
8,"madhu","_","_","madhu","NC","","_","_"
1,"gokṣīraṃ","_","_","gokṣīra","NC","","_","_"
2,"musalīṃ","_","_","musalī","NC","","_","_"
3,"māṣān","_","_","māṣa","NC","","_","_"
4,"kokilākṣasya","_","_","kokilākṣa","NC","","_","_"
5,"bījakam","_","_","bījaka","NC","","_","_"
1,"_","_","_","sūta","NC","","_","_"
2,"_","_","_","caturguṇa","JJ","","_","_"
3,"kṣiptvā","_","_","kṣip","CGDA","","_","_"
4,"mardyaṃ","_","_","mṛd","KDG","","_","_"
5,"_","_","_","śālmali","NC","","_","_"
6,"_","_","_","ja","JJ","","_","_"
7,"_","_","_","drava","NC","","_","_"
1,"_","_","_","tad","PRD","","_","_"
2,"_","_","_","sarva","JQ","","_","_"
3,"_","_","_","dina","NC","","_","_"
4,"_","_","_","eka","PPX","","_","_"
5,"tu","_","_","tu","CCD","","_","_"
6,"kāmadevo","_","_","kāmadeva","NC","","_","_"
7,"raso","_","_","rasa","NC","","_","_"
8,"bhavet","_","_","bhav","V","bhū","_","_"
1,"_","_","_","niṣka","NC","","_","_"
2,"_","_","_","mātra","NC","","_","_"
3,"sadā","_","_","sadā","CAD","","_","_"
4,"bhakṣyaṃ","_","_","bhakṣ","KDG","","_","_"
5,"gavāṃ","_","_","go","NC","","_","_"
6,"kṣīraṃ","_","_","kṣīra","NC","","_","_"
7,"_","_","_","pib","V","pā","_","_"
8,"_","_","_","anu","CADP","","_","_"
1,"maithune","_","_","maithuna","NC","","_","_"
2,"_","_","_","dṛḍha","JJ","","_","_"
3,"_","_","_","liṅga","NC","","_","_"
4,"_","_","_","as","V","as","_","_"
5,"_","_","_","drāvay","V","drāvay","_","_"
6,"_","_","_","vanitā","NC","","_","_"
7,"_","_","_","kula","NC","","_","_"
1,"_","_","_","prārambha","NC","","_","_"
2,"_","_","_","rajas","NC","","_","_"
3,"strīṇāṃ","_","_","strī","NC","","_","_"
4,"mardayed","_","_","marday","V","marday","_","_"
5,"bhasmasūtakam","_","_","bhasmasūtaka","NC","","_","_"
1,"mṛtaṃ","_","_","mṛ","PPP","","_","_"
2,"tāmraṃ","_","_","tāmra","NC","","_","_"
3,"ca","_","_","ca","CCD","","_","_"
4,"tāraṃ","_","_","tāra","NC","","_","_"
5,"ca","_","_","ca","CCD","","_","_"
6,"gandhakaṃ","_","_","gandhaka","NC","","_","_"
7,"ca","_","_","ca","CCD","","_","_"
8,"samaṃ","_","_","sama","PPX","","_","_"
9,"dinam","_","_","dina","NC","","_","_"
1,"_","_","_","sitā","NC","","_","_"
2,"_","_","_","madhu","NC","","_","_"
3,"_","_","_","ājya","NC","","_","_"
4,"_","_","_","saṃyuj","PPP","","_","_"
5,"niṣkaṃ","_","_","niṣka","NC","","_","_"
6,"bhuktvā","_","_","bhuj","CGDA","","_","_"
7,"_","_","_","pib","V","pā","_","_"
8,"_","_","_","payas","NC","","_","_"
1,"_","_","_","ratikāma","NC","","_","_"
2,"_","_","_","rasa","NC","","_","_"
3,"nāma","_","_","nāma","CX","","_","_"
4,"_","_","_","kāminī","NC","","_","_"
5,"_","_","_","ramaṇa","NC","","_","_"
6,"hitaḥ","_","_","hita","JJ","","_","_"
1,"_","_","_","vānarī","NC","","_","_"
2,"_","_","_","mūla","NC","","_","_"
3,"_","_","_","godhūma","NC","","_","_"
4,"kokilākṣasya","_","_","kokilākṣa","NC","","_","_"
5,"bījakam","_","_","bījaka","NC","","_","_"
1,"_","_","_","māṣa","NC","","_","_"
2,"_","_","_","ca","CCD","","_","_"
3,"_","_","_","ikṣurasa","NC","","_","_"
4,"sarvaṃ","_","_","sarva","JQ","","_","_"
5,"loḍitaṃ","_","_","loḍay","PPP","","_","_"
6,"_","_","_","pācay","V","pācay","_","_"
7,"_","_","_","ghṛta","NC","","_","_"
1,"_","_","_","tad","PRD","","_","_"
2,"_","_","_","eva","CEM","","_","_"
3,"vaṭakāḥ","_","_","vaṭaka","NC","","_","_"
4,"kāryā","_","_","kṛ","KDG","","_","_"
5,"nityaṃ","_","_","nitya","CX","","_","_"
6,"_","_","_","khād","V","khād","_","_"
7,"_","_","_","dvaya","NC","","_","_"
8,"dvayam","_","_","dvaya","NC","","_","_"
1,"_","_","_","anupāna","NC","","_","_"
2,"_","_","_","ida","PRD","","_","_"
3,"siddhaṃ","_","_","sidh","PPP","","_","_"
4,"_","_","_","sevana","NC","","_","_"
5,"_","_","_","ramay","V","ramay","_","_"
6,"_","_","_","śata","NUM","","_","_"
1,"_","_","_","śuddhasūta","NC","","_","_"
2,"_","_","_","sama","PPX","","_","_"
3,"gandhaṃ","_","_","gandha","NC","","_","_"
4,"_","_","_","tri","NUM","","_","_"
5,"_","_","_","aha","NC","","_","_"
6,"_","_","_","kahlāra","NC","","_","_"
7,"_","_","_","ja","JJ","","_","_"
8,"_","_","_","drava","NC","","_","_"
1,"marditaṃ","_","_","marday","PPP","","_","_"
2,"_","_","_","ca","CCD","","_","_"
3,"_","_","_","andhay","PPP","","_","_"
4,"_","_","_","pac","V","pac","_","_"
5,"_","_","_","yāma","NC","","_","_"
6,"vālukayantrake","_","_","vālukayantraka","NC","","_","_"
1,"_","_","_","rakta","JJ","","_","_"
2,"_","_","_","agastya","NC","","_","_"
3,"_","_","_","drava","NC","","_","_"
4,"_","_","_","bhāvay","KDG","","_","_"
5,"_","_","_","dina","NC","","_","_"
6,"_","_","_","eka","PPX","","_","_"
7,"tu","_","_","tu","CCD","","_","_"
8,"_","_","_","sitā","NC","","_","_"
9,"_","_","_","yuta","JJ","","_","_"
1,"_","_","_","niṣka","NC","","_","_"
2,"_","_","_","mātra","NC","","_","_"
3,"sadā","_","_","sadā","CAD","","_","_"
4,"_","_","_","khād","V","khād","_","_"
5,"_","_","_","rasa","NC","","_","_"
6,"_","_","_","ida","PRD","","_","_"
7,"_","_","_","mada","NC","","_","_"
8,"_","_","_","vardhana","JJ","","_","_"
1,"ajasya","_","_","aja","NC","","_","_"
2,"vṛṣaṇaṃ","_","_","vṛṣaṇa","NC","","_","_"
3,"kṣīre","_","_","kṣīra","NC","","_","_"
4,"pakvaṃ","_","_","pakva","JJ","","_","_"
5,"_","_","_","tila","NC","","_","_"
6,"_","_","_","sitā","NC","","_","_"
7,"_","_","_","yuta","JJ","","_","_"
1,"yatheṣṭaṃ","_","_","yatheṣṭa","JJ","","_","_"
2,"_","_","_","bhakṣay","V","bhakṣay","_","_"
3,"_","_","_","ca","CCD","","_","_"
4,"_","_","_","anu","CADP","","_","_"
5,"_","_","_","ramay","V","ramay","_","_"
6,"_","_","_","kāminī","NC","","_","_"
7,"_","_","_","śata","NUM","","_","_"
1,"_","_","_","pala","NC","","_","_"
2,"_","_","_","dvaya","NC","","_","_"
3,"dvayaṃ","_","_","dvaya","NC","","_","_"
4,"śuddhaṃ","_","_","śuddha","JJ","","_","_"
5,"pāradaṃ","_","_","pārada","NC","","_","_"
6,"gandhakaṃ","_","_","gandhaka","NC","","_","_"
7,"śubham","_","_","śubha","JJ","","_","_"
1,"_","_","_","karṣa","NC","","_","_"
2,"_","_","_","eka","PPX","","_","_"
3,"māritaṃ","_","_","māray","PPP","","_","_"
4,"svarṇaṃ","_","_","svarṇa","NC","","_","_"
5,"_","_","_","pala","NC","","_","_"
6,"_","_","_","eka","PPX","","_","_"
7,"_","_","_","mṛ","PPP","","_","_"
8,"_","_","_","tāmraka","NC","","_","_"
1,"_","_","_","raupya","NC","","_","_"
2,"_","_","_","bhasman","NC","","_","_"
3,"_","_","_","catur","NUM","","_","_"
4,"_","_","_","niṣka","NC","","_","_"
5,"sarvaṃ","_","_","sarva","JQ","","_","_"
6,"_","_","_","pañcāmṛta","NC","","_","_"
7,"_","_","_","dina","NC","","_","_"
1,"mardyaṃ","_","_","mṛd","KDG","","_","_"
2,"ruddhvā","_","_","rudh","CGDA","","_","_"
3,"dinaṃ","_","_","dina","NC","","_","_"
4,"_","_","_","pac","V","pac","_","_"
5,"_","_","_","bhūdhara","NC","","_","_"
6,"taṃ","_","_","tad","PRD","","_","_"
7,"samuddharet","_","_","samuddhar","V","samuddhṛ","_","_"
1,"piṣṭvā","_","_","piṣ","CGDA","","_","_"
2,"pañcāmṛtaiḥ","_","_","pañcāmṛta","NC","","_","_"
3,"_","_","_","khād","V","khād","_","_"
4,"_","_","_","vaṭikā","NC","","_","_"
5,"_","_","_","badara","NC","","_","_"
6,"_","_","_","ākṛti","NC","","_","_"
1,"anaṅgasundarī","_","_","anaṅgasundarī","NC","","_","_"
2,"khyātā","_","_","khyā","PPP","","_","_"
3,"rāmāṇāṃ","_","_","rāmā","NC","","_","_"
4,"ramate","_","_","ram","V","ram","_","_"
5,"śatam","_","_","śata","NUM","","_","_"
1,"_","_","_","śālmalī","NC","","_","_"
2,"_","_","_","mūla","NC","","_","_"
3,"_","_","_","cūrṇa","NC","","_","_"
4,"tu","_","_","tu","CCD","","_","_"
5,"_","_","_","madhu","NC","","_","_"
6,"_","_","_","śarkarā","NC","","_","_"
7,"_","_","_","anvita","JJ","","_","_"
1,"_","_","_","pala","NC","","_","_"
2,"_","_","_","eka","PPX","","_","_"
3,"_","_","_","bhakṣay","V","bhakṣay","_","_"
4,"_","_","_","ca","CCD","","_","_"
5,"_","_","_","anu","CADP","","_","_"
6,"_","_","_","sitā","NC","","_","_"
7,"_","_","_","kṣīra","NC","","_","_"
8,"tu","_","_","tu","CCD","","_","_"
9,"pāyayet","_","_","pib","V","pā","_","_"
1,"_","_","_","śālmalī","NC","","_","_"
2,"_","_","_","uttha","JJ","","_","_"
3,"_","_","_","drava","NC","","_","_"
4,"_","_","_","mṛd","KDG","","_","_"
5,"_","_","_","pakṣa","NC","","_","_"
6,"_","_","_","eka","PPX","","_","_"
7,"_","_","_","śuddha","JJ","","_","_"
8,"_","_","_","pārada","NC","","_","_"
1,"_","_","_","śuddha","JJ","","_","_"
2,"_","_","_","gandha","NC","","_","_"
3,"_","_","_","tri","NUM","","_","_"
4,"_","_","_","saptāha","NC","","_","_"
5,"_","_","_","tad","PRD","","_","_"
6,"_","_","_","drava","NC","","_","_"
7,"_","_","_","marday","V","marday","_","_"
8,"_","_","_","pṛthak","CX","","_","_"
1,"samāv","_","_","sama","PPX","","_","_"
2,"etau","_","_","tad","PRD","","_","_"
3,"_","_","_","punar","CAD","","_","_"
4,"_","_","_","mṛd","KDG","","_","_"
5,"_","_","_","ghṛta","NC","","_","_"
6,"_","_","_","yāma","NC","","_","_"
7,"_","_","_","catuṣṭaya","NC","","_","_"
1,"_","_","_","tad","PRD","","_","_"
2,"_","_","_","gola","NC","","_","_"
3,"_","_","_","bandhay","V","bandhay","_","_"
4,"_","_","_","vastra","NC","","_","_"
5,"_","_","_","ghṛta","NC","","_","_"
6,"_","_","_","yāma","NC","","_","_"
7,"_","_","_","dvaya","NC","","_","_"
8,"pacet","_","_","pac","V","pac","_","_"
1,"_","_","_","tatas","CX","","_","_"
2,"_","_","_","tad","PRD","","_","_"
3,"_","_","_","śālmalī","NC","","_","_"
4,"_","_","_","drāva","NC","","_","_"
5,"_","_","_","marday","V","marday","_","_"
6,"_","_","_","divasa","NC","","_","_"
7,"_","_","_","traya","NC","","_","_"
1,"_","_","_","nikṣip","V","nikṣip","_","_"
2,"_","_","_","kācakūpī","NC","","_","_"
3,"_","_","_","antar","CAD","","_","_"
4,"_","_","_","vālukāyantra","NC","","_","_"
5,"_","_","_","ga","JJ","","_","_"
6,"pacet","_","_","pac","V","pac","_","_"
1,"_","_","_","kṣip","V","kṣip","_","_"
2,"_","_","_","śālmali","NC","","_","_"
3,"_","_","_","ja","JJ","","_","_"
4,"drāvaṃ","_","_","drāva","NC","","_","_"
5,"kūpyā","_","_","kūpī","NC","","_","_"
6,"garbhe","_","_","garbha","NC","","_","_"
7,"_","_","_","dina","NC","","_","_"
8,"_","_","_","avadhi","CX","","_","_"
1,"_","_","_","sārdra","JJ","","_","_"
2,"_","_","_","eva","CEM","","_","_"
3,"samuddhṛtya","_","_","samuddhṛ","CGDA","","_","_"
4,"miśryaṃ","_","_","miśray","KDG","","_","_"
5,"_","_","_","tad","PRD","","_","_"
6,"_","_","_","sitā","NC","","_","_"
7,"samam","_","_","sama","PPX","","_","_"
1,"_","_","_","niṣka","NC","","_","_"
2,"_","_","_","mātra","NC","","_","_"
3,"sadā","_","_","sadā","CAD","","_","_"
4,"_","_","_","khād","V","khād","_","_"
5,"_","_","_","rasa","NC","","_","_"
6,"_","_","_","ida","PRD","","_","_"
7,"kāmanāyakaḥ","_","_","kāmanāyaka","NC","","_","_"
1,"musalīṃ","_","_","musalī","NC","","_","_"
2,"sasitāṃ","_","_","sasita","JJ","","_","_"
3,"kṣīraiḥ","_","_","kṣīra","NC","","_","_"
4,"_","_","_","pala","NC","","_","_"
5,"_","_","_","eka","PPX","","_","_"
6,"_","_","_","pāyay","V","pāyay","_","_"
7,"_","_","_","anu","CADP","","_","_"
1,"kāminīnāṃ","_","_","kāminī","NC","","_","_"
2,"sahasraṃ","_","_","sahasra","NUM","","_","_"
3,"tu","_","_","tu","CCD","","_","_"
4,"_","_","_","kṣobhay","V","kṣobhay","_","_"
5,"_","_","_","nimiṣa","NC","","_","_"
6,"_","_","_","antara","NC","","_","_"
1,"_","_","_","śuddhasūta","NC","","_","_"
2,"_","_","_","tri","NUM","","_","_"
3,"bhāgā","_","_","bhāga","NC","","_","_"
4,"_","_","_","bhāga","NC","","_","_"
5,"_","_","_","eka","PPX","","_","_"
6,"_","_","_","tāmra","NC","","_","_"
7,"_","_","_","cūrṇaka","NC","","_","_"
1,"kṛtvā","_","_","kṛ","CGDA","","_","_"
2,"piṣṭīṃ","_","_","piṣṭī","NC","","_","_"
3,"_","_","_","nirudh","CGDA","","_","_"
4,"_","_","_","atha","CAD","","_","_"
5,"_","_","_","rambhā","NC","","_","_"
6,"_","_","_","kanda","NC","","_","_"
7,"_","_","_","udara","NC","","_","_"
8,"punaḥ","_","_","punar","CAD","","_","_"
1,"_","_","_","mṛd","NC","","_","_"
2,"_","_","_","lip","PPP","","_","_"
3,"śoṣitaṃ","_","_","śoṣay","PPP","","_","_"
4,"_","_","_","pac","V","pac","_","_"
5,"_","_","_","dina","NC","","_","_"
6,"_","_","_","eka","PPX","","_","_"
7,"karīṣāgninā","_","_","karīṣāgni","NC","","_","_"
1,"evaṃ","_","_","eva","CX","","_","_"
2,"saptadinaṃ","_","_","saptadina","NC","","_","_"
3,"_","_","_","pac","V","pac","_","_"
4,"_","_","_","kanda","NC","","_","_"
5,"kande","_","_","kanda","NC","","_","_"
6,"dinaṃ","_","_","dina","NC","","_","_"
7,"dinam","_","_","dina","NC","","_","_"
1,"uddhṛtya","_","_","uddhṛ","CGDA","","_","_"
2,"_","_","_","bandhay","V","bandhay","_","_"
3,"_","_","_","vastra","NC","","_","_"
4,"dṛḍhe","_","_","dṛḍha","JJ","","_","_"
5,"_","_","_","ca","CCD","","_","_"
6,"_","_","_","eva","CEM","","_","_"
7,"caturguṇe","_","_","caturguṇa","JJ","","_","_"
1,"_","_","_","kṣudra","JJ","","_","_"
2,"_","_","_","śambūka","NC","","_","_"
3,"_","_","_","māṃsa","NC","","_","_"
4,"_","_","_","añj","PPP","","_","_"
5,"_","_","_","chāgā","NC","","_","_"
6,"_","_","_","rakta","NC","","_","_"
7,"_","_","_","ga","PPP","","_","_"
8,"pacet","_","_","pac","V","pac","_","_"
1,"dolāyantre","_","_","dolāyantra","NC","","_","_"
2,"_","_","_","tri","NUM","","_","_"
3,"_","_","_","aha","NC","","_","_"
4,"_","_","_","yāvat","CX","","_","_"
5,"_","_","_","dā","KDG","","_","_"
6,"raktaṃ","_","_","rakta","NC","","_","_"
7,"punaḥ","_","_","punar","CAD","","_","_"
8,"punaḥ","_","_","punar","CAD","","_","_"
1,"guḍūcyā","_","_","guḍūcī","NC","","_","_"
2,"gajapippalyā","_","_","gajapippalī","NC","","_","_"
3,"kadalyā","_","_","kadala","NC","","_","_"
4,"kokilākṣakaiḥ","_","_","kokilākṣaka","NC","","_","_"
1,"_","_","_","gokṣurī","NC","","_","_"
2,"_","_","_","vānarī","NC","","_","_"
3,"_","_","_","mūla","NC","","_","_"
4,"_","_","_","jātī","NC","","_","_"
5,"_","_","_","mūla","NC","","_","_"
6,"ca","_","_","ca","CCD","","_","_"
7,"dravaiḥ","_","_","drava","NC","","_","_"
1,"_","_","_","pācay","V","pācay","_","_"
2,"_","_","_","tad","PRD","","_","_"
3,"_","_","_","kaṣāya","NC","","_","_"
4,"_","_","_","vā","CCD","","_","_"
5,"dolāyantre","_","_","dolāyantra","NC","","_","_"
6,"_","_","_","dina","NC","","_","_"
7,"_","_","_","traya","NC","","_","_"
1,"tataḥ","_","_","tatas","CX","","_","_"
2,"kṣīre","_","_","kṣīra","NC","","_","_"
3,"_","_","_","sitā","NC","","_","_"
4,"_","_","_","yuj","PPP","","_","_"
5,"_","_","_","tadvat","CX","","_","_"
6,"_","_","_","pac","V","pac","_","_"
7,"_","_","_","dina","NC","","_","_"
8,"_","_","_","avadhi","CX","","_","_"
1,"uddhṛtya","_","_","uddhṛ","CGDA","","_","_"
2,"_","_","_","musalī","NC","","_","_"
3,"_","_","_","kvātha","NC","","_","_"
4,"_","_","_","mṛd","KDG","","_","_"
5,"_","_","_","yāma","NC","","_","_"
6,"_","_","_","catuṣṭaya","NC","","_","_"
1,"rasaḥ","_","_","rasa","NC","","_","_"
2,"_","_","_","pūrṇendu","NC","","_","_"
3,"_","_","_","nāman","NC","","_","_"
4,"_","_","_","ida","PRD","","_","_"
5,"_","_","_","khād","V","khād","_","_"
6,"_","_","_","māṃsa","NC","","_","_"
7,"_","_","_","sitā","NC","","_","_"
8,"_","_","_","yuta","JJ","","_","_"
1,"gokṣuro","_","_","gokṣura","NC","","_","_"
2,"_","_","_","vānarī","NC","","_","_"
3,"_","_","_","bīja","NC","","_","_"
4,"guḍūcī","_","_","guḍūcī","NC","","_","_"
5,"gajapippalī","_","_","gajapippalī","NC","","_","_"
1,"kokilākṣasya","_","_","kokilākṣa","NC","","_","_"
2,"bījāni","_","_","bīja","NC","","_","_"
3,"majjā","_","_","majjan","NC","","_","_"
4,"_","_","_","kārpāsa","NC","","_","_"
5,"_","_","_","bīja","NC","","_","_"
6,"_","_","_","ja","JJ","","_","_"
1,"śatāvarī","_","_","śatāvarī","NC","","_","_"
2,"ca","_","_","ca","CCD","","_","_"
3,"rambhāyāḥ","_","_","rambhā","NC","","_","_"
4,"phalaṃ","_","_","phala","NC","","_","_"
5,"sarvaṃ","_","_","sarva","JQ","","_","_"
6,"samaṃ","_","_","sama","PPX","","_","_"
7,"bhavet","_","_","bhav","V","bhū","_","_"
1,"_","_","_","sarva","JQ","","_","_"
2,"_","_","_","tulya","JJ","","_","_"
3,"sitā","_","_","sitā","NC","","_","_"
4,"yojyā","_","_","yuj","KDG","","_","_"
5,"madhunā","_","_","madhu","NC","","_","_"
6,"loḍitaṃ","_","_","loḍay","PPP","","_","_"
7,"lihet","_","_","liha","V","lih","_","_"
1,"_","_","_","palārdha","NC","","_","_"
2,"_","_","_","anupāna","NC","","_","_"
3,"_","_","_","as","V","as","_","_"
4,"_","_","_","tatas","CX","","_","_"
5,"peyaṃ","_","_","pā","KDG","","_","_"
6,"gavāṃ","_","_","go","NC","","_","_"
7,"payaḥ","_","_","payas","NC","","_","_"
1,"kāminīnāṃ","_","_","kāminī","NC","","_","_"
2,"sahasraikaṃ","_","_","sahasraika","JJ","","_","_"
3,"ramate","_","_","ram","V","ram","_","_"
4,"_","_","_","kāmadeva","NC","","_","_"
5,"_","_","_","vat","CX","","_","_"
1,"_","_","_","padma","NC","","_","_"
2,"_","_","_","bīja","NC","","_","_"
3,"kaseruṃ","_","_","kaseru","NC","","_","_"
4,"ca","_","_","ca","CCD","","_","_"
5,"kandaṃ","_","_","kanda","NC","","_","_"
6,"nālaṃ","_","_","nāla","NC","","_","_"
7,"ca","_","_","ca","CCD","","_","_"
8,"karṇikām","_","_","karṇikā","NC","","_","_"
1,"musalī","_","_","musalī","NC","","_","_"
2,"bhṛṅgarāṭ","_","_","bhṛṅgarāj","NC","","_","_"
3,"drākṣā","_","_","drākṣā","NC","","_","_"
4,"pakvaṃ","_","_","pakva","JJ","","_","_"
5,"śleṣmātakaṃ","_","_","śleṣmātaka","NC","","_","_"
6,"phalam","_","_","phala","NC","","_","_"
1,"vijayā","_","_","vijayā","NC","","_","_"
2,"markaṭī","_","_","markaṭī","NC","","_","_"
3,"māṣāḥ","_","_","māṣa","NC","","_","_"
4,"_","_","_","śaṇa","NC","","_","_"
5,"_","_","_","bīja","NC","","_","_"
6,"vai","_","_","vai","CX","","_","_"
7,"tilāḥ","_","_","tila","NC","","_","_"
1,"kokilākṣasya","_","_","kokilākṣa","NC","","_","_"
2,"bījāni","_","_","bīja","NC","","_","_"
3,"bhūkuṣmāṇḍī","_","_","bhūkuṣmāṇḍī","NC","","_","_"
4,"śatāvarī","_","_","śatāvarī","NC","","_","_"
1,"śṛṅgāṭaṃ","_","_","śṛṅgāṭa","NC","","_","_"
2,"cirbhiṭaṃ","_","_","cirbhiṭa","NC","","_","_"
3,"_","_","_","phañjī","NC","","_","_"
4,"_","_","_","bīja","NC","","_","_"
5,"_","_","_","ca","CCD","","_","_"
6,"_","_","_","aśvagandhikā","NC","","_","_"
1,"_","_","_","tad","PRD","","_","_"
2,"_","_","_","sarva","JQ","","_","_"
3,"samaṃ","_","_","sama","PPX","","_","_"
4,"cūrṇya","_","_","cūrṇay","CGDA","","_","_"
5,"_","_","_","pāda","NC","","_","_"
6,"_","_","_","aṃśa","NC","","_","_"
7,"_","_","_","ca","CCD","","_","_"
8,"_","_","_","āhar","V","āhṛ","_","_"
9,"_","_","_","pṛthak","CX","","_","_"
1,"_","_","_","pāda","NC","","_","_"
2,"_","_","_","aṃśa","NC","","_","_"
3,"_","_","_","aṣṭama","JJ","","_","_"
4,"_","_","_","aṃśa","NC","","_","_"
5,"śuddhaṃ","_","_","śuddha","JJ","","_","_"
6,"sūtaṃ","_","_","sūta","NC","","_","_"
7,"vimiśrayet","_","_","vimiśray","V","vimiśray","_","_"
1,"_","_","_","pārada","NC","","_","_"
2,"_","_","_","aṣṭama","JJ","","_","_"
3,"_","_","_","aṃśa","NC","","_","_"
4,"ca","_","_","ca","CCD","","_","_"
5,"karpūraṃ","_","_","karpūra","NC","","_","_"
6,"tatra","_","_","tatra","CAD","","_","_"
7,"nikṣipet","_","_","nikṣip","V","nikṣip","_","_"
1,"_","_","_","cāturjātaka","NC","","_","_"
2,"_","_","_","ekaika","PRC","","_","_"
3,"_","_","_","karpūra","NC","","_","_"
4,"_","_","_","dviguṇa","JJ","","_","_"
5,"bhavet","_","_","bhav","V","bhū","_","_"
1,"_","_","_","sūta","NC","","_","_"
2,"_","_","_","tulya","JJ","","_","_"
3,"sitā","_","_","sitā","NC","","_","_"
4,"yojyā","_","_","yuj","KDG","","_","_"
5,"mardyaṃ","_","_","mṛd","KDG","","_","_"
6,"_","_","_","rambhā","NC","","_","_"
7,"_","_","_","drava","NC","","_","_"
8,"_","_","_","dina","NC","","_","_"
1,"_","_","_","tad","PRD","","_","_"
2,"_","_","_","gola","NC","","_","_"
3,"ḍāmare","_","_","ḍāmara","NC","","_","_"
4,"yantre","_","_","yantra","NC","","_","_"
5,"_","_","_","krama","NC","","_","_"
6,"_","_","_","vṛdh","PPP","","_","_"
7,"_","_","_","agni","NC","","_","_"
8,"pacet","_","_","pac","V","pac","_","_"
1,"_","_","_","dina","NC","","_","_"
2,"_","_","_","tad","PRD","","_","_"
3,"_","_","_","ca","CCD","","_","_"
4,"_","_","_","ūrdhva","JJ","","_","_"
5,"_","_","_","lag","PPP","","_","_"
6,"_","_","_","tad","PRD","","_","_"
7,"_","_","_","grah","KDG","","_","_"
8,"_","_","_","rambhā","NC","","_","_"
9,"_","_","_","drava","NC","","_","_"
10,"_","_","_","dṛḍha","JJ","","_","_"
1,"marditaṃ","_","_","marday","PPP","","_","_"
2,"sitayā","_","_","sita","JJ","","_","_"
3,"tulyaṃ","_","_","tulya","JJ","","_","_"
4,"_","_","_","māṣa","NC","","_","_"
5,"_","_","_","eka","PPX","","_","_"
6,"_","_","_","bhakṣay","V","bhakṣay","_","_"
7,"_","_","_","sadā","CAD","","_","_"
1,"raso","_","_","rasa","NC","","_","_"
2,"_","_","_","madanakāma","NC","","_","_"
3,"_","_","_","ida","PRD","","_","_"
4,"_","_","_","bala","NC","","_","_"
5,"_","_","_","vīrya","NC","","_","_"
6,"_","_","_","vivardhana","JJ","","_","_"
1,"_","_","_","divya","JJ","","_","_"
2,"_","_","_","rūpa","NC","","_","_"
3,"_","_","_","bhaj","V","bhaj","_","_"
4,"_","_","_","rāmā","NC","","_","_"
5,"_","_","_","kāma","NC","","_","_"
6,"_","_","_","ākula","JJ","","_","_"
7,"_","_","_","kalā","NC","","_","_"
8,"_","_","_","anvita","JJ","","_","_"
1,"_","_","_","bhāga","NC","","_","_"
2,"_","_","_","traya","NC","","_","_"
3,"tu","_","_","tu","CCD","","_","_"
4,"_","_","_","yad","PRL","","_","_"
5,"_","_","_","pūrva","CX","","_","_"
6,"_","_","_","pṛthak","CX","","_","_"
7,"_","_","_","cūrṇa","NC","","_","_"
8,"_","_","_","su","CAD","","_","_"
9,"_","_","_","rakṣ","PPP","","_","_"
1,"_","_","_","kulīra","NC","","_","_"
2,"_","_","_","māṃsa","NC","","_","_"
3,"_","_","_","chāga","NC","","_","_"
4,"_","_","_","aṇḍa","NC","","_","_"
5,"_","_","_","caṭakā","NC","","_","_"
6,"_","_","_","aṇḍa","NC","","_","_"
7,"vai","_","_","vai","CX","","_","_"
8,"pṛthak","_","_","pṛthak","CX","","_","_"
1,"pratyekaṃ","_","_","pratyeka","JJ","","_","_"
2,"_","_","_","cūrṇay","V","cūrṇay","_","_"
3,"_","_","_","tulya","JJ","","_","_"
4,"_","_","_","sarva","JQ","","_","_"
5,"_","_","_","tulya","JJ","","_","_"
6,"gavāṃ","_","_","go","NC","","_","_"
7,"payaḥ","_","_","payas","NC","","_","_"
1,"_","_","_","tad","PRD","","_","_"
2,"_","_","_","sarva","JQ","","_","_"
3,"cālayan","_","_","cālay","KDP","","_","_"
4,"pacyād","_","_","pac","V","pac","_","_"
5,"_","_","_","yāvat","CX","","_","_"
6,"_","_","_","piṇḍatva","NC","","_","_"
7,"_","_","_","āga","PPP","","_","_"
1,"prasārya","_","_","prasāray","CGDA","","_","_"
2,"_","_","_","kāṣṭha","NC","","_","_"
3,"_","_","_","pātra","NC","","_","_"
4,"_","_","_","antar","CAD","","_","_"
5,"_","_","_","chāyāśuṣka","JJ","","_","_"
6,"vicūrṇayet","_","_","vicūrṇay","V","vicūrṇay","_","_"
1,"asya","_","_","ida","PRD","","_","_"
2,"cūrṇasya","_","_","cūrṇa","NC","","_","_"
3,"karpūraṃ","_","_","karpūra","NC","","_","_"
4,"_","_","_","catuḥṣaṣṭi","NC","","_","_"
5,"_","_","_","aṃśaka","NC","","_","_"
6,"kṣipet","_","_","kṣip","V","kṣip","_","_"
1,"_","_","_","cāturjātaka","NC","","_","_"
2,"_","_","_","cūrṇa","NC","","_","_"
3,"tu","_","_","tu","CCD","","_","_"
4,"_","_","_","kṣip","V","kṣip","_","_"
5,"_","_","_","dvātriṃśat","NC","","_","_"
6,"_","_","_","aṃśa","NC","","_","_"
1,"_","_","_","sarva","JQ","","_","_"
2,"_","_","_","tulya","JJ","","_","_"
3,"sitā","_","_","sitā","NC","","_","_"
4,"yojyā","_","_","yuj","KDG","","_","_"
5,"_","_","_","rakṣay","V","rakṣay","_","_"
6,"_","_","_","nūtana","JJ","","_","_"
7,"ghaṭe","_","_","ghaṭa","NC","","_","_"
1,"_","_","_","karṣa","NC","","_","_"
2,"_","_","_","dvaya","NC","","_","_"
3,"gavāṃ","_","_","go","NC","","_","_"
4,"_","_","_","kṣīra","NC","","_","_"
5,"_","_","_","anupāna","NC","","_","_"
6,"sadā","_","_","sadā","CAD","","_","_"
7,"pibet","_","_","pib","V","pā","_","_"
1,"niṣekaṃ","_","_","niṣeka","NC","","_","_"
2,"māritaṃ","_","_","māray","PPP","","_","_"
3,"_","_","_","ca","CCD","","_","_"
4,"_","_","_","abhra","NC","","_","_"
5,"_","_","_","khād","V","khād","_","_"
6,"_","_","_","śarkarā","NC","","_","_"
7,"samam","_","_","sama","PPX","","_","_"
1,"_","_","_","śālmalī","NC","","_","_"
2,"_","_","_","mūla","NC","","_","_"
3,"_","_","_","cūrṇa","NC","","_","_"
4,"tu","_","_","tu","CCD","","_","_"
5,"bhṛṅgarājasya","_","_","bhṛṅgarāja","NC","","_","_"
6,"mūlakam","_","_","mūlaka","NC","","_","_"
1,"_","_","_","pala","NC","","_","_"
2,"_","_","_","eka","PPX","","_","_"
3,"sitayā","_","_","sitā","NC","","_","_"
4,"_","_","_","ca","CCD","","_","_"
5,"_","_","_","anu","CADP","","_","_"
6,"seveta","_","_","sev","V","sev","_","_"
7,"_","_","_","kāminī","NC","","_","_"
8,"_","_","_","śata","NUM","","_","_"
1,"_","_","_","vānarī","NC","","_","_"
2,"_","_","_","kokilākṣa","NC","","_","_"
3,"bījāni","_","_","bīja","NC","","_","_"
4,"_","_","_","tila","NC","","_","_"
5,"_","_","_","māṣaka","NC","","_","_"
1,"_","_","_","vāsā","NC","","_","_"
2,"_","_","_","gokṣura","NC","","_","_"
3,"_","_","_","mūla","NC","","_","_"
4,"sarvaṃ","_","_","sarva","JQ","","_","_"
5,"cūrṇaṃ","_","_","cūrṇa","NC","","_","_"
6,"samaṃ","_","_","sama","PPX","","_","_"
7,"bhavet","_","_","bhav","V","bhū","_","_"
1,"_","_","_","cūrṇa","NC","","_","_"
2,"_","_","_","tulya","JJ","","_","_"
3,"mṛtaṃ","_","_","mṛ","PPP","","_","_"
4,"_","_","_","ca","CCD","","_","_"
5,"_","_","_","abhra","NC","","_","_"
6,"_","_","_","sarva","JQ","","_","_"
7,"_","_","_","tulya","JJ","","_","_"
8,"tu","_","_","tu","CCD","","_","_"
9,"śarkarā","_","_","śarkarā","NC","","_","_"
1,"_","_","_","tad","PRD","","_","_"
2,"_","_","_","karṣa","NC","","_","_"
3,"gavāṃ","_","_","go","NC","","_","_"
4,"kṣīraiḥ","_","_","kṣīra","NC","","_","_"
5,"pibet","_","_","pib","V","pā","_","_"
6,"_","_","_","kāma","NC","","_","_"
7,"_","_","_","aṅga","NC","","_","_"
8,"_","_","_","nāyaka","NC","","_","_"
1,"tailena","_","_","taila","NC","","_","_"
2,"pakvaṃ","_","_","pakva","JJ","","_","_"
3,"caṭakaṃ","_","_","caṭaka","NC","","_","_"
4,"_","_","_","khād","V","khād","_","_"
5,"_","_","_","pūrva","CX","","_","_"
6,"tu","_","_","tu","CCD","","_","_"
7,"bhojanāt","_","_","bhojana","NC","","_","_"
1,"_","_","_","bhojana","NC","","_","_"
2,"_","_","_","anta","NC","","_","_"
3,"_","_","_","pib","V","pā","_","_"
4,"_","_","_","kṣīra","NC","","_","_"
5,"rāmāṇāṃ","_","_","rāmā","NC","","_","_"
6,"_","_","_","ramay","V","ramay","_","_"
7,"_","_","_","śata","NUM","","_","_"
1,"_","_","_","aśvagandhā","NC","","_","_"
2,"_","_","_","śatāvarī","NC","","_","_"
3,"_","_","_","śālmalī","NC","","_","_"
4,"_","_","_","citraka","NC","","_","_"
5,"ca","_","_","ca","CCD","","_","_"
1,"mūlaṃ","_","_","mūla","NC","","_","_"
2,"_","_","_","musalī","NC","","_","_"
3,"_","_","_","ja","JJ","","_","_"
4,"kandaṃ","_","_","kanda","NC","","_","_"
5,"kokilākṣasya","_","_","kokilākṣa","NC","","_","_"
6,"bījakam","_","_","bījaka","NC","","_","_"
1,"_","_","_","vidārī","NC","","_","_"
2,"_","_","_","padminī","NC","","_","_"
3,"_","_","_","kanda","NC","","_","_"
4,"_","_","_","vānarī","NC","","_","_"
5,"_","_","_","bījaka","NC","","_","_"
6,"samam","_","_","sama","PPX","","_","_"
1,"_","_","_","tad","PRD","","_","_"
2,"_","_","_","cūrṇa","NC","","_","_"
3,"_","_","_","mṛ","PPP","","_","_"
4,"_","_","_","abhra","NC","","_","_"
5,"tu","_","_","tu","CCD","","_","_"
6,"tulyaṃ","_","_","tulya","JJ","","_","_"
7,"śarkarayā","_","_","śarkarā","NC","","_","_"
8,"samam","_","_","sama","PPX","","_","_"
1,"_","_","_","pala","NC","","_","_"
2,"_","_","_","ardha","NC","","_","_"
3,"_","_","_","pāyay","V","pāyay","_","_"
4,"_","_","_","kṣīra","NC","","_","_"
5,"_","_","_","khād","V","khād","_","_"
6,"_","_","_","kukkuṭa","NC","","_","_"
7,"_","_","_","māṃsaka","NC","","_","_"
1,"_","_","_","kṣīra","NC","","_","_"
2,"_","_","_","pāna","NC","","_","_"
3,"tataḥ","_","_","tatas","CX","","_","_"
4,"kṛtvā","_","_","kṛ","CGDA","","_","_"
5,"_","_","_","ramay","V","ramay","_","_"
6,"_","_","_","kāminī","NC","","_","_"
7,"_","_","_","śata","NUM","","_","_"
1,"_","_","_","dhātrī","NC","","_","_"
2,"_","_","_","phala","NC","","_","_"
3,"cūrṇaṃ","_","_","cūrṇa","NC","","_","_"
4,"tu","_","_","tu","CCD","","_","_"
5,"_","_","_","bhāvay","V","bhāvay","_","_"
6,"_","_","_","tad","PRD","","_","_"
7,"_","_","_","phala","NC","","_","_"
8,"_","_","_","drava","NC","","_","_"
1,"_","_","_","ekaviṃśati","NC","","_","_"
2,"_","_","_","vāra","NC","","_","_"
3,"vai","_","_","vai","CX","","_","_"
4,"śoṣyaṃ","_","_","śuṣ","KDG","","_","_"
5,"peṣyaṃ","_","_","piṣ","KDG","","_","_"
6,"punaḥ","_","_","punar","CAD","","_","_"
7,"punaḥ","_","_","punar","CAD","","_","_"
1,"_","_","_","tad","PRD","","_","_"
2,"_","_","_","pāda","NC","","_","_"
3,"_","_","_","aṃśa","NC","","_","_"
4,"mṛtaṃ","_","_","mṛ","PPP","","_","_"
5,"lohaṃ","_","_","loha","NC","","_","_"
6,"_","_","_","madhu","NC","","_","_"
7,"_","_","_","ājya","NC","","_","_"
8,"_","_","_","śarkarā","NC","","_","_"
9,"_","_","_","anvita","JJ","","_","_"
1,"_","_","_","pala","NC","","_","_"
2,"_","_","_","eka","PPX","","_","_"
3,"_","_","_","bhakṣay","V","bhakṣay","_","_"
4,"_","_","_","nitya","CX","","_","_"
5,"_","_","_","sitā","NC","","_","_"
6,"_","_","_","kṣīra","NC","","_","_"
7,"_","_","_","pib","V","pā","_","_"
8,"_","_","_","anu","CADP","","_","_"
1,"_","_","_","dhātrī","NC","","_","_"
2,"_","_","_","loha","NC","","_","_"
3,"_","_","_","prabhāva","NC","","_","_"
4,"ramayet","_","_","ramay","V","ramay","_","_"
5,"_","_","_","kāminī","NC","","_","_"
6,"_","_","_","śata","NUM","","_","_"
1,"punarnavā","_","_","punarnavā","NC","","_","_"
2,"nāgabalā","_","_","nāgabalā","NC","","_","_"
3,"vājigandhā","_","_","vājigandhā","NC","","_","_"
4,"śatāvarī","_","_","śatāvarī","NC","","_","_"
1,"gokṣuraṃ","_","_","gokṣura","NC","","_","_"
2,"_","_","_","musalī","NC","","_","_"
3,"_","_","_","kanda","NC","","_","_"
4,"mṛtaṃ","_","_","mṛ","PPP","","_","_"
5,"sūtaṃ","_","_","sūta","NC","","_","_"
6,"samaṃ","_","_","sama","PPX","","_","_"
7,"samam","_","_","sama","PPX","","_","_"
1,"cūrṇaṃ","_","_","cūrṇa","NC","","_","_"
2,"_","_","_","madhu","NC","","_","_"
3,"_","_","_","ājya","NC","","_","_"
4,"_","_","_","saṃyuj","PPP","","_","_"
5,"niṣkaṃ","_","_","niṣka","NC","","_","_"
6,"bhuktvā","_","_","bhuj","CGDA","","_","_"
7,"_","_","_","pib","V","pā","_","_"
8,"_","_","_","payas","NC","","_","_"
1,"taṇḍulaṃ","_","_","taṇḍula","NC","","_","_"
2,"_","_","_","vānarī","NC","","_","_"
3,"_","_","_","bīja","NC","","_","_"
4,"_","_","_","cūrṇay","V","cūrṇay","_","_"
5,"_","_","_","sitā","NC","","_","_"
6,"samam","_","_","sama","PPX","","_","_"
1,"_","_","_","āloḍay","V","āloḍay","_","_"
2,"_","_","_","go","NC","","_","_"
3,"_","_","_","kṣīra","NC","","_","_"
4,"_","_","_","tad","PRD","","_","_"
5,"_","_","_","pac","V","pac","_","_"
6,"_","_","_","apūpikā","NC","","_","_"
1,"tāṃ","_","_","tad","PRD","","_","_"
2,"_","_","_","ghṛta","NC","","_","_"
3,"_","_","_","bhakṣay","V","bhakṣay","_","_"
4,"_","_","_","ca","CCD","","_","_"
5,"_","_","_","anu","CADP","","_","_"
6,"_","_","_","ramay","V","ramay","_","_"
7,"_","_","_","kāminī","NC","","_","_"
8,"_","_","_","kula","NC","","_","_"
1,"_","_","_","vānarī","NC","","_","_"
2,"_","_","_","bīja","NC","","_","_"
3,"_","_","_","cūrṇa","NC","","_","_"
4,"tu","_","_","tu","CCD","","_","_"
5,"_","_","_","tvac","NC","","_","_"
6,"_","_","_","varjay","KDG","","_","_"
7,"_","_","_","māṣa","NC","","_","_"
8,"_","_","_","cūrṇaka","NC","","_","_"
1,"_","_","_","nālikera","NC","","_","_"
2,"_","_","_","udaka","NC","","_","_"
3,"bhāvyaṃ","_","_","bhāvay","KDG","","_","_"
4,"_","_","_","yāma","NC","","_","_"
5,"_","_","_","anta","NC","","_","_"
6,"_","_","_","peṣay","V","peṣay","_","_"
7,"_","_","_","tatas","CX","","_","_"
1,"_","_","_","viṃśati","NC","","_","_"
2,"_","_","_","aṃśa","NC","","_","_"
3,"piṣṭasya","_","_","piṣ","PPP","","_","_"
4,"_","_","_","mṛ","PPP","","_","_"
5,"_","_","_","abhra","NC","","_","_"
6,"vimiśrayet","_","_","vimiśray","V","vimiśray","_","_"
1,"_","_","_","ghṛta","NC","","_","_"
2,"_","_","_","tad","PRD","","_","_"
3,"_","_","_","vaṭaka","NC","","_","_"
4,"paktvā","_","_","pac","CGDA","","_","_"
5,"_","_","_","madhu","NC","","_","_"
6,"_","_","_","ājya","NC","","_","_"
7,"tu","_","_","tu","CCD","","_","_"
8,"bhakṣayet","_","_","bhakṣay","V","bhakṣay","_","_"
1,"kṣīraṃ","_","_","kṣīra","NC","","_","_"
2,"sitāṃ","_","_","sitā","NC","","_","_"
3,"_","_","_","ca","CCD","","_","_"
4,"_","_","_","anupib","V","anupā","_","_"
5,"_","_","_","rāmā","NC","","_","_"
6,"ramate","_","_","ram","V","ram","_","_"
7,"śatam","_","_","śata","NUM","","_","_"
1,"_","_","_","vālukā","NC","","_","_"
2,"_","_","_","sambhava","NC","","_","_"
3,"matsyaṃ","_","_","matsya","NC","","_","_"
4,"supakvaṃ","_","_","supakva","JJ","","_","_"
5,"_","_","_","bhakṣay","V","bhakṣay","_","_"
6,"_","_","_","ghṛta","NC","","_","_"
1,"_","_","_","ṣaṇḍha","NC","","_","_"
2,"_","_","_","api","CX","","_","_"
3,"jāyate","_","_","jan","V","jan","_","_"
4,"kāmī","_","_","kāmin","JJ","","_","_"
5,"_","_","_","vīrya","NC","","_","_"
6,"_","_","_","stambha","NC","","_","_"
7,"prajāyate","_","_","prajan","V","prajan","_","_"
1,"ūrṇanābhiṃ","_","_","ūrṇanābhi","NC","","_","_"
2,"samaṃ","_","_","sama","PPX","","_","_"
3,"kṣaudraiḥ","_","_","kṣaudra","NC","","_","_"
4,"piṣṭvā","_","_","piṣ","CGDA","","_","_"
5,"nābhiṃ","_","_","nābhi","NC","","_","_"
6,"pralepayet","_","_","pralepay","V","pralepay","_","_"
1,"mucyate","_","_","muñc","V","muc","_","_"
2,"_","_","_","bandh","PPP","","_","_"
3,"_","_","_","ṣaṇḍha","NC","","_","_"
4,"_","_","_","api","CX","","_","_"
5,"_","_","_","kṣīra","NC","","_","_"
6,"_","_","_","vahni","NC","","_","_"
7,"_","_","_","pib","V","pā","_","_"
8,"_","_","_","anu","CADP","","_","_"
1,"_","_","_","svaya","CX","","_","_"
2,"_","_","_","agnirasa","NC","","_","_"
3,"_","_","_","ca","CCD","","_","_"
4,"_","_","_","atra","CAD","","_","_"
5,"_","_","_","tri","NUM","","_","_"
6,"_","_","_","niṣka","NC","","_","_"
7,"_","_","_","bhakṣay","V","bhakṣay","_","_"
8,"_","_","_","sadā","CAD","","_","_"
1,"_","_","_","ghṛta","NC","","_","_"
2,"_","_","_","añj","PPP","","_","_"
3,"dalitā","_","_","dal","PPP","","_","_"
4,"māṣāḥ","_","_","māṣa","NC","","_","_"
5,"kṣīreṇa","_","_","kṣīra","NC","","_","_"
6,"saha","_","_","saha","CX","","_","_"
7,"pācitāḥ","_","_","pācay","PPP","","_","_"
1,"_","_","_","sitā","NC","","_","_"
2,"_","_","_","ājya","NC","","_","_"
3,"_","_","_","saṃyuta","JJ","","_","_"
4,"bhakṣyā","_","_","bhakṣ","KDG","","_","_"
5,"_","_","_","vīrya","NC","","_","_"
6,"_","_","_","vṛddhi","NC","","_","_"
7,"_","_","_","kara","JJ","","_","_"
8,"hy","_","_","hi","CX","","_","_"
9,"alam","_","_","ala","CX","","_","_"
1,"kṣaṇe","_","_","kṣaṇa","NC","","_","_"
2,"kṣaṇe","_","_","kṣaṇa","NC","","_","_"
3,"_","_","_","bhaj","V","bhaj","_","_"
4,"_","_","_","rāmā","NC","","_","_"
5,"yathā","_","_","yathā","CCM","","_","_"
6,"pārāvato","_","_","pārāvata","NC","","_","_"
7,"dhruvam","_","_","dhruva","CX","","_","_"
1,"_","_","_","samyak","CX","","_","_"
2,"_","_","_","māray","PPP","","_","_"
3,"_","_","_","abhraka","NC","","_","_"
4,"kaṭuphalaṃ","_","_","kaṭuphala","NC","","_","_"
5,"_","_","_","kuṣṭha","NC","","_","_"
6,"_","_","_","aśvagandhā","NC","","_","_"
7,"_","_","_","amṛtā","NC","","_","_"
8,"methī","_","_","methī","NC","","_","_"
9,"mocaraso","_","_","mocarasa","NC","","_","_"
10,"_","_","_","vidāri","NC","","_","_"
11,"_","_","_","musalī","NC","","_","_"
12,"_","_","_","gokaṇṭaka","NC","","_","_"
13,"_","_","_","ikṣuraka","NC","","_","_"
1,"_","_","_","rambhā","NC","","_","_"
2,"_","_","_","kanda","NC","","_","_"
3,"_","_","_","śatāvarī","NC","","_","_"
4,"hy","_","_","hi","CX","","_","_"
5,"ajamodā","_","_","ajamodā","NC","","_","_"
6,"_","_","_","māṣa","NC","","_","_"
7,"_","_","_","tila","NC","","_","_"
8,"dhānyakaṃ","_","_","dhānyaka","NC","","_","_"
9,"yaṣṭī","_","_","yaṣṭī","NC","","_","_"
10,"nāgabalā","_","_","nāgabalā","NC","","_","_"
11,"_","_","_","kacora","NC","","_","_"
12,"_","_","_","madana","NC","","_","_"
13,"jātīphalaṃ","_","_","jātīphala","NC","","_","_"
14,"saindhavam","_","_","saindhava","NC","","_","_"
1,"_","_","_","bhārgī","NC","","_","_"
2,"_","_","_","karkaṭa","NC","","_","_"
3,"_","_","_","śuṅgin","NC","","_","_"
4,"_","_","_","bhṛṅga","NC","","_","_"
5,"_","_","_","trikaṭu","NC","","_","_"
6,"dvau","_","_","dvi","NUM","","_","_"
7,"jīrakau","_","_","jīraka","NC","","_","_"
8,"citrakaṃ","_","_","citraka","NC","","_","_"
9,"_","_","_","cāturjāta","NC","","_","_"
10,"_","_","_","punarnavā","NC","","_","_"
11,"_","_","_","gajakaṇā","NC","","_","_"
12,"_","_","_","drākṣā","NC","","_","_"
13,"_","_","_","śaṇa","NC","","_","_"
14,"vāsakaḥ","_","_","vāsaka","NC","","_","_"
1,"_","_","_","śālmalī","NC","","_","_"
2,"_","_","_","aṅghri","NC","","_","_"
3,"phalatrikaṃ","_","_","phalatrika","NC","","_","_"
4,"_","_","_","kapi","NC","","_","_"
5,"_","_","_","bhava","NC","","_","_"
6,"bījaṃ","_","_","bīja","NC","","_","_"
7,"samaṃ","_","_","sama","PPX","","_","_"
8,"cūrṇayec","_","_","cūrṇay","V","cūrṇay","_","_"
9,"_","_","_","cūrṇa","NC","","_","_"
10,"_","_","_","aṃśa","NC","","_","_"
11,"_","_","_","vijayā","NC","","_","_"
12,"_","_","_","sitā","NC","","_","_"
13,"_","_","_","dvi","NUM","","_","_"
14,"_","_","_","guṇita","JJ","","_","_"
15,"_","_","_","madhu","NC","","_","_"
16,"_","_","_","ājya","NC","","_","_"
17,"_","_","_","miśra","JJ","","_","_"
18,"_","_","_","tu","CCD","","_","_"
19,"tat","_","_","tad","PRD","","_","_"
1,"_","_","_","karṣa","NC","","_","_"
2,"_","_","_","ardha","NC","","_","_"
3,"gulikāṃ","_","_","gulikā","NC","","_","_"
4,"_","_","_","vilih","KDG","","_","_"
5,"_","_","_","athavā","CX","","_","_"
6,"kṛtvā","_","_","kṛ","CGDA","","_","_"
7,"sadā","_","_","sadā","CAD","","_","_"
8,"sevayet","_","_","sevay","V","sevay","_","_"
9,"peyā","_","_","pā","KDG","","_","_"
10,"_","_","_","kṣīra","NC","","_","_"
11,"_","_","_","sitā","NC","","_","_"
12,"_","_","_","anu","CADP","","_","_"
13,"_","_","_","vīrya","NC","","_","_"
14,"_","_","_","karaṇa","NC","","_","_"
15,"_","_","_","stambha","NC","","_","_"
16,"_","_","_","api","CX","","_","_"
17,"_","_","_","ala","CX","","_","_"
18,"kāminām","_","_","kāmin","NC","","_","_"
1,"_","_","_","śyāmā","NC","","_","_"
2,"_","_","_","vaśyā","NC","","_","_"
3,"_","_","_","kara","JJ","","_","_"
4,"_","_","_","samādhi","NC","","_","_"
5,"_","_","_","sukha","NC","","_","_"
6,"_","_","_","da","JJ","","_","_"
7,"_","_","_","saṅga","NC","","_","_"
8,"_","_","_","aṅganā","NC","","_","_"
9,"_","_","_","drāvaka","JJ","","_","_"
10,"kṣīṇe","_","_","kṣi","PPP","","_","_"
11,"_","_","_","puṣṭi","NC","","_","_"
12,"_","_","_","kara","JJ","","_","_"
13,"_","_","_","kṣaya","NC","","_","_"
14,"_","_","_","kṣaya","NC","","_","_"
15,"_","_","_","kara","JJ","","_","_"
16,"_","_","_","nānā","CX","","_","_"
17,"_","_","_","āmaya","NC","","_","_"
18,"_","_","_","dhvaṃsaka","JJ","","_","_"
1,"_","_","_","mandāgni","NC","","_","_"
2,"_","_","_","saṃdīpana","NC","","_","_"
3,"hy","_","_","hi","CX","","_","_"
4,"arśāṃsi","_","_","arśas","NC","","_","_"
5,"_","_","_","grahaṇī","NC","","_","_"
6,"_","_","_","prameha","NC","","_","_"
7,"_","_","_","nicaya","NC","","_","_"
8,"_","_","_","śleṣman","NC","","_","_"
9,"_","_","_","atisāra","NC","","_","_"
10,"_","_","_","praṇud","JJ","","_","_"
1,"_","_","_","nityānanda","NC","","_","_"
2,"_","_","_","kavi","NC","","_","_"
3,"_","_","_","viśeṣa","NC","","_","_"
4,"_","_","_","kavitā","NC","","_","_"
5,"_","_","_","vācā","NC","","_","_"
6,"_","_","_","vilāsa","NC","","_","_"
7,"_","_","_","udbhava","JJ","","_","_"
8,"datte","_","_","dad","V","dā","_","_"
9,"sarvaṃ","_","_","sarva","JQ","","_","_"
10,"_","_","_","mahat","JJ","","_","_"
11,"_","_","_","sthira","JJ","","_","_"
12,"_","_","_","daśā","NC","","_","_"
13,"_","_","_","dhyāna","NC","","_","_"
14,"_","_","_","avasāna","NC","","_","_"
15,"bhṛśam","_","_","bhṛśa","CX","","_","_"
1,"abhyāsena","_","_","abhyāsa","NC","","_","_"
2,"nihanti","_","_","nihan","V","nihan","_","_"
3,"_","_","_","mṛtyu","NC","","_","_"
4,"_","_","_","palita","NC","","_","_"
5,"kāmeśvaro","_","_","kāmeśvara","NC","","_","_"
6,"vatsarāt","_","_","vatsara","NC","","_","_"
7,"sarveṣāṃ","_","_","sarva","JQ","","_","_"
8,"_","_","_","hita","NC","","_","_"
9,"_","_","_","kāraka","JJ","","_","_"
10,"nigaditaḥ","_","_","nigad","PPP","","_","_"
11,"_","_","_","śrī","NC","","_","_"
12,"_","_","_","nityanātha","NC","","_","_"
13,"vai","_","_","vai","CX","","_","_"
14,"_","_","_","vṛddha","NC","","_","_"
15,"_","_","_","api","CX","","_","_"
16,"_","_","_","kāma","NC","","_","_"
17,"_","_","_","vardhana","JJ","","_","_"
18,"_","_","_","kara","JJ","","_","_"
19,"_","_","_","prauḍhā","NC","","_","_"
20,"_","_","_","aṅganā","NC","","_","_"
21,"_","_","_","saṃgama","NC","","_","_"
22,"_","_","_","siddha","NC","","_","_"
23,"_","_","_","ida","PRD","","_","_"
24,"_","_","_","dhana","NC","","_","_"
25,"_","_","_","vastu","NC","","_","_"
26,"_","_","_","amogha","JJ","","_","_"
27,"_","_","_","sukha","NC","","_","_"
28,"_","_","_","da","JJ","","_","_"
29,"bhūpaiḥ","_","_","bhūpa","NC","","_","_"
30,"sadā","_","_","sadā","CAD","","_","_"
31,"sevyatām","_","_","sev","V","sev","_","_"
1,"_","_","_","iti","CQT","","_","_"
2,"_","_","_","tad","PRD","","_","_"
3,"_","_","_","vac","PPP","","_","_"
4,"_","_","_","bahu","JJ","","_","_"
5,"_","_","_","vīrya","NC","","_","_"
6,"_","_","_","vardhana","JJ","","_","_"
7,"rātrau","_","_","rātri","NC","","_","_"
8,"sadā","_","_","sadā","CAD","","_","_"
9,"_","_","_","kṣīra","NC","","_","_"
10,"_","_","_","sitā","NC","","_","_"
11,"_","_","_","samanvita","JJ","","_","_"
1,"_","_","_","bhuj","PPP","","_","_"
2,"_","_","_","uttara","JJ","","_","_"
3,"_","_","_","sev","PPP","","_","_"
4,"_","_","_","āśu","JJ","","_","_"
5,"kāmināṃ","_","_","kāmin","NC","","_","_"
