"WordID","word","NormSTEM","suffix","lemma","PoS","Root","NormSuffix","NormWord"
1,"pra","_","_","pra","CADP","","_","_"
2,"śantamā","_","_","śaṃtama","JJ","","_","_"
3,"varuṇaṃ","_","_","varuṇa","NC","","_","_"
4,"dīdhitī","_","_","dīdhiti","NC","","_","_"
5,"gīr","_","_","gir","NC","","_","_"
6,"mitram","_","_","mitra","NC","","_","_"
7,"bhagam","_","_","bhaga","NC","","_","_"
8,"aditiṃ","_","_","aditi","NC","","_","_"
9,"nūnam","_","_","nūna","CX","","_","_"
10,"aśyāḥ","_","_","aś","V","aś","_","_"
1,"_","_","_","pṛṣat","JJ","","_","_"
2,"_","_","_","yoni","NC","","_","_"
3,"_","_","_","pañcan","NUM","","_","_"
4,"_","_","_","hotṛ","NC","","_","_"
5,"śṛṇotv","_","_","śṛṇ","V","śru","_","_"
6,"_","_","_","a","CNG","","_","_"
7,"_","_","_","tṛ","PPP","","_","_"
8,"_","_","_","pathin","NC","","_","_"
9,"asuro","_","_","asura","NC","","_","_"
10,"mayobhuḥ","_","_","mayobhu","JJ","","_","_"
1,"prati","_","_","prati","CADP","","_","_"
2,"me","_","_","mat","PPR","","_","_"
3,"stomam","_","_","stoma","NC","","_","_"
4,"aditir","_","_","aditi","NC","","_","_"
5,"jagṛbhyāt","_","_","grah","V","grah","_","_"
6,"sūnuṃ","_","_","sūnu","NC","","_","_"
7,"na","_","_","na","CNG","","_","_"
8,"mātā","_","_","mātṛ","NC","","_","_"
9,"hṛdyaṃ","_","_","hṛdya","JJ","","_","_"
10,"_","_","_","su","CAD","","_","_"
11,"_","_","_","śeva","JJ","","_","_"
1,"brahma","_","_","brahman","NC","","_","_"
2,"priyaṃ","_","_","priya","JJ","","_","_"
3,"_","_","_","deva","NC","","_","_"
4,"_","_","_","dhā","PPP","","_","_"
5,"yad","_","_","yad","PRL","","_","_"
6,"asty","_","_","as","V","as","_","_"
7,"aham","_","_","mat","PPR","","_","_"
8,"mitre","_","_","mitra","NC","","_","_"
9,"varuṇe","_","_","varuṇa","NC","","_","_"
10,"yan","_","_","yad","PRL","","_","_"
11,"mayobhu","_","_","mayobhu","JJ","","_","_"
1,"ud","_","_","ud","CADP","","_","_"
2,"īraya","_","_","īray","V","īray","_","_"
3,"kavitamaṃ","_","_","kavitama","JJ","","_","_"
4,"kavīnām","_","_","kavi","JJ","","_","_"
5,"_","_","_","und","V","und","_","_"
6,"_","_","_","a","PRD","","_","_"
7,"abhi","_","_","abhi","CADP","","_","_"
8,"madhvā","_","_","madhu","NC","","_","_"
9,"ghṛtena","_","_","ghṛta","NC","","_","_"
1,"sa","_","_","tad","PRD","","_","_"
2,"no","_","_","mat","PPR","","_","_"
3,"vasūni","_","_","vasu","NC","","_","_"
4,"prayatā","_","_","praya","PPP","","_","_"
5,"hitāni","_","_","dhā","PPP","","_","_"
6,"candrāṇi","_","_","candra","JJ","","_","_"
7,"devaḥ","_","_","deva","NC","","_","_"
8,"savitā","_","_","savitṛ","NC","","_","_"
9,"suvāti","_","_","suv","V","sū","_","_"
1,"sam","_","_","sa","CADP","","_","_"
2,"indra","_","_","indra","NC","","_","_"
3,"ṇo","_","_","mat","PPR","","_","_"
4,"manasā","_","_","manas","NC","","_","_"
5,"neṣi","_","_","nay","V","nī","_","_"
6,"gobhiḥ","_","_","go","NC","","_","_"
7,"saṃ","_","_","sa","CADP","","_","_"
8,"sūribhir","_","_","sūri","NC","","_","_"
9,"harivaḥ","_","_","harivat","JJ","","_","_"
10,"saṃ","_","_","sa","CADP","","_","_"
11,"svasti","_","_","svasti","NC","","_","_"
1,"sam","_","_","sa","CADP","","_","_"
2,"brahmaṇā","_","_","brahman","NC","","_","_"
3,"_","_","_","deva","NC","","_","_"
4,"_","_","_","dhā","PPP","","_","_"
5,"yad","_","_","yad","PRL","","_","_"
6,"asti","_","_","as","V","as","_","_"
7,"saṃ","_","_","sa","CADP","","_","_"
8,"devānāṃ","_","_","deva","NC","","_","_"
9,"sumatyā","_","_","sumati","NC","","_","_"
10,"yajñiyānām","_","_","yajñiya","JJ","","_","_"
1,"devo","_","_","deva","NC","","_","_"
2,"bhagaḥ","_","_","bhaga","NC","","_","_"
3,"savitā","_","_","savitṛ","NC","","_","_"
4,"rāyo","_","_","rai","NC","","_","_"
5,"aṃśa","_","_","aṃśa","NC","","_","_"
6,"indro","_","_","indra","NC","","_","_"
7,"vṛtrasya","_","_","vṛtra","NC","","_","_"
8,"saṃjito","_","_","saṃji","PPP","","_","_"
9,"dhanānām","_","_","dhana","NC","","_","_"
1,"ṛbhukṣā","_","_","ṛbhukṣan","NC","","_","_"
2,"vāja","_","_","vāja","NC","","_","_"
3,"uta","_","_","uta","CCD","","_","_"
4,"vā","_","_","vā","CCD","","_","_"
5,"purandhir","_","_","purandhi","NC","","_","_"
6,"avantu","_","_","avantu","V","av","_","_"
7,"no","_","_","mat","PPR","","_","_"
8,"amṛtāsas","_","_","amṛta","JJ","","_","_"
9,"turāsaḥ","_","_","tura","JJ","","_","_"
1,"marutvato","_","_","marutvat","JJ","","_","_"
2,"apratītasya","_","_","apratīta","JJ","","_","_"
3,"jiṣṇor","_","_","jiṣṇu","JJ","","_","_"
4,"_","_","_","a","CNG","","_","_"
5,"_","_","_","jṛ","KDP","","_","_"
6,"pra","_","_","pra","CADP","","_","_"
7,"bravāmā","_","_","abravīta","V","brū","_","_"
8,"kṛtāni","_","_","kṛta","NC","","_","_"
1,"na","_","_","na","CNG","","_","_"
2,"te","_","_","tvat","PPR","","_","_"
3,"pūrve","_","_","pūrva","PPX","","_","_"
4,"maghavan","_","_","maghavan","NC","","_","_"
5,"_","_","_","na","CNG","","_","_"
6,"_","_","_","apara","PPX","","_","_"
7,"na","_","_","na","CNG","","_","_"
8,"vīryaṃ","_","_","vīrya","NC","","_","_"
9,"nūtanaḥ","_","_","nūtana","JJ","","_","_"
10,"kaś","_","_","kiṃ","PRQ","","_","_"
11,"_","_","_","cana","CX","","_","_"
12,"_","_","_","āpn","V","āp","_","_"
1,"upa","_","_","upa","CADP","","_","_"
2,"stuhi","_","_","stu","V","stu","_","_"
3,"prathamaṃ","_","_","prathama","JJ","","_","_"
4,"_","_","_","ratna","NC","","_","_"
5,"_","_","_","dheya","NC","","_","_"
6,"bṛhaspatiṃ","_","_","bṛhaspati","NC","","_","_"
7,"sanitāraṃ","_","_","sanitṛ","JJ","","_","_"
8,"dhanānām","_","_","dhana","NC","","_","_"
1,"yaḥ","_","_","yad","PRL","","_","_"
2,"śaṃsate","_","_","śaṃs","KDP","","_","_"
3,"stuvate","_","_","stu","KDP","","_","_"
4,"śambhaviṣṭhaḥ","_","_","śambhaviṣṭha","JJ","","_","_"
5,"purūvasur","_","_","purūvasu","JJ","","_","_"
6,"āgamaj","_","_","āga","V","āga","_","_"
7,"johuvānam","_","_","johav","KDP","","_","_"
1,"_","_","_","tvat","PPR","","_","_"
2,"_","_","_","ūti","NC","","_","_"
3,"sacamānā","_","_","sac","KDP","","_","_"
4,"a","_","_","alpha_privativum","JJ","","_","_"
4,"ariṣṭā","_","_","riṣṭa","JJ","","_","_"
5,"bṛhaspate","_","_","bṛhaspati","NC","","_","_"
6,"maghavānaḥ","_","_","maghavan","JJ","","_","_"
7,"_","_","_","su","CAD","","_","_"
8,"_","_","_","vīra","NC","","_","_"
1,"ye","_","_","yad","PRL","","_","_"
2,"_","_","_","aśva","NC","","_","_"
3,"_","_","_","dā","JJ","","_","_"
4,"uta","_","_","uta","CCD","","_","_"
5,"vā","_","_","vā","CCD","","_","_"
6,"santi","_","_","as","V","as","_","_"
7,"_","_","_","go","NC","","_","_"
8,"_","_","_","dā","JJ","","_","_"
9,"ye","_","_","yad","PRL","","_","_"
10,"_","_","_","vastra","NC","","_","_"
11,"_","_","_","dā","JJ","","_","_"
12,"subhagās","_","_","subhaga","JJ","","_","_"
13,"teṣu","_","_","tad","PRD","","_","_"
14,"rāyaḥ","_","_","rai","NC","","_","_"
1,"visarmāṇaṃ","_","_","visarman","JJ","","_","_"
2,"kṛṇuhi","_","_","kar","V","kṛ","_","_"
3,"vittam","_","_","vitta","NC","","_","_"
4,"eṣāṃ","_","_","ida","PRD","","_","_"
5,"ye","_","_","yad","PRL","","_","_"
6,"bhuñjate","_","_","bhuj","V","bhuj","_","_"
7,"apṛṇanto","_","_","apṛṇat","JJ","","_","_"
8,"na","_","_","mat","PPR","","_","_"
9,"ukthaiḥ","_","_","uktha","NC","","_","_"
1,"apavratān","_","_","apavrata","JJ","","_","_"
2,"prasave","_","_","prasava","NC","","_","_"
3,"vāvṛdhānān","_","_","vṛdh","KDP","","_","_"
4,"_","_","_","brahman","NC","","_","_"
5,"_","_","_","dviṣ","JJ","","_","_"
6,"sūryād","_","_","sūrya","NC","","_","_"
7,"yāvayasva","_","_","yāvay","V","yāvay","_","_"
1,"ya","_","_","yad","PRL","","_","_"
2,"ohate","_","_","ūh","V","ūh","_","_"
3,"rakṣaso","_","_","rakṣas","NC","","_","_"
4,"_","_","_","deva","NC","","_","_"
5,"_","_","_","vīti","NC","","_","_"
6,"acakrebhis","_","_","acakra","JJ","","_","_"
7,"tam","_","_","tad","PRD","","_","_"
8,"maruto","_","_","marut","NC","","_","_"
9,"ni","_","_","ni","CADP","","_","_"
10,"yāta","_","_","yā","V","yā","_","_"
1,"yo","_","_","yad","PRL","","_","_"
2,"vaḥ","_","_","tvat","PPR","","_","_"
3,"śamīṃ","_","_","śamī","NC","","_","_"
4,"śaśamānasya","_","_","śa","KDP","","_","_"
5,"nindāt","_","_","nind","V","nind","_","_"
6,"tucchyān","_","_","tucchya","JJ","","_","_"
7,"kāmān","_","_","kāma","NC","","_","_"
8,"karate","_","_","kar","V","kṛ","_","_"
9,"siṣvidānaḥ","_","_","svid","KDP","","_","_"
1,"tam","_","_","tad","PRD","","_","_"
2,"u","_","_","u","CEM","","_","_"
3,"ṣṭuhi","_","_","stu","V","stu","_","_"
4,"yaḥ","_","_","yad","PRL","","_","_"
5,"_","_","_","su","CAD","","_","_"
6,"_","_","_","iṣu","NC","","_","_"
7,"_","_","_","su","CAD","","_","_"
8,"_","_","_","dhanvan","NC","","_","_"
9,"yo","_","_","yad","PRL","","_","_"
10,"viśvasya","_","_","viśva","JQ","","_","_"
11,"kṣayati","_","_","kṣi","V","kṣi","_","_"
12,"bheṣajasya","_","_","bheṣaja","NC","","_","_"
1,"yakṣvā","_","_","yaj","V","yaj","_","_"
2,"mahe","_","_","mah","JJ","","_","_"
3,"saumanasāya","_","_","saumanasa","NC","","_","_"
4,"rudraṃ","_","_","rudra","NC","","_","_"
5,"namobhir","_","_","namas","NC","","_","_"
6,"devam","_","_","deva","NC","","_","_"
7,"asuraṃ","_","_","asura","NC","","_","_"
8,"duvasya","_","_","duvasy","V","duvasy","_","_"
1,"damūnaso","_","_","damūnas","NC","","_","_"
2,"apaso","_","_","apas","JJ","","_","_"
3,"ye","_","_","yad","PRL","","_","_"
4,"_","_","_","su","CAD","","_","_"
5,"_","_","_","hasta","NC","","_","_"
6,"vṛṣṇaḥ","_","_","vṛṣan","NC","","_","_"
7,"patnīr","_","_","patnī","NC","","_","_"
8,"nadyo","_","_","nadī","NC","","_","_"
9,"_","_","_","vibhvan","NC","","_","_"
10,"_","_","_","takṣ","PPP","","_","_"
1,"sarasvatī","_","_","sarasvatī","NC","","_","_"
2,"_","_","_","bṛhat","JJ","","_","_"
3,"_","_","_","diva","NC","","_","_"
4,"_","_","_","uta","CCD","","_","_"
5,"rākā","_","_","rākā","NC","","_","_"
6,"daśasyantīr","_","_","daśasy","KDP","","_","_"
7,"varivasyantu","_","_","varivasy","V","varivasy","_","_"
8,"śubhrāḥ","_","_","śubhra","JJ","","_","_"
1,"pra","_","_","pra","CADP","","_","_"
2,"sū","_","_","su","CAD","","_","_"
3,"mahe","_","_","mah","JJ","","_","_"
4,"_","_","_","su","CAD","","_","_"
5,"_","_","_","śaraṇa","NC","","_","_"
6,"medhāṃ","_","_","medhā","NC","","_","_"
7,"giram","_","_","gir","NC","","_","_"
8,"bhare","_","_","bhṛ","V","bhṛ","_","_"
9,"navyasīṃ","_","_","navyas","JJ","","_","_"
10,"jāyamānām","_","_","jan","KDP","","_","_"
1,"ya","_","_","yad","PRL","","_","_"
2,"āhanā","_","_","āhanas","JJ","","_","_"
3,"duhitur","_","_","duhitṛ","NC","","_","_"
4,"vakṣaṇāsu","_","_","vakṣaṇā","NC","","_","_"
5,"rūpā","_","_","rūpa","NC","","_","_"
6,"mināno","_","_","mī","KDP","","_","_"
7,"akṛṇod","_","_","kar","V","kṛ","_","_"
8,"idaṃ","_","_","ida","PRD","","_","_"
9,"naḥ","_","_","mat","PPR","","_","_"
1,"pra","_","_","pra","CADP","","_","_"
2,"suṣṭuti","_","_","suṣṭuti","NC","","_","_"
3,"stanayantaṃ","_","_","stanay","KDP","","_","_"
4,"ruvantam","_","_","ru","KDP","","_","_"
5,"iﾱas","_","_","iḍ","NC","","_","_"
6,"patiṃ","_","_","pati","NC","","_","_"
7,"jaritar","_","_","jaritṛ","NC","","_","_"
8,"nūnam","_","_","nūna","CX","","_","_"
9,"aśyāḥ","_","_","aś","V","aś","_","_"
1,"yo","_","_","yad","PRL","","_","_"
2,"abdimāṁ","_","_","abdimat","JJ","","_","_"
3,"udanimāṁ","_","_","udanimat","JJ","","_","_"
4,"iyarti","_","_","ṛch","V","ṛch","_","_"
5,"pra","_","_","pra","CADP","","_","_"
6,"vidyutā","_","_","vidyut","NC","","_","_"
7,"rodasī","_","_","rodas","NC","","_","_"
8,"ukṣamāṇaḥ","_","_","ukṣ","KDP","","_","_"
1,"eṣa","_","_","tad","PRD","","_","_"
2,"stomo","_","_","stoma","NC","","_","_"
3,"mārutaṃ","_","_","māruta","JJ","","_","_"
4,"śardho","_","_","śardhas","NC","","_","_"
5,"acchā","_","_","acchā","CADP","","_","_"
6,"rudrasya","_","_","rudra","NC","","_","_"
7,"sūnūṃr","_","_","sūnu","NC","","_","_"
8,"yuvanyūṃr","_","_","yuvanyu","JJ","","_","_"
9,"ud","_","_","ud","CADP","","_","_"
10,"aśyāḥ","_","_","aś","V","aś","_","_"
1,"kāmo","_","_","kāma","NC","","_","_"
2,"rāye","_","_","rai","NC","","_","_"
3,"havate","_","_","hvā","V","hvā","_","_"
4,"mā","_","_","mat","PPR","","_","_"
5,"svasty","_","_","svasti","NC","","_","_"
6,"upa","_","_","upa","CADP","","_","_"
7,"stuhi","_","_","stu","V","stu","_","_"
8,"_","_","_","pṛṣat","JJ","","_","_"
9,"_","_","_","aśva","NC","","_","_"
10,"ayāsaḥ","_","_","ayās","JJ","","_","_"
1,"_","_","_","pra","CADP","","_","_"
2,"_","_","_","tad","PRD","","_","_"
3,"stomaḥ","_","_","stoma","NC","","_","_"
4,"pṛthivīm","_","_","pṛthivī","NC","","_","_"
5,"antarikṣaṃ","_","_","antarikṣa","NC","","_","_"
6,"vanaspatīṃr","_","_","vanaspati","NC","","_","_"
7,"oṣadhī","_","_","oṣadhī","NC","","_","_"
8,"rāye","_","_","rai","NC","","_","_"
9,"aśyāḥ","_","_","aś","V","aś","_","_"
1,"devo","_","_","deva","NC","","_","_"
2,"devaḥ","_","_","deva","NC","","_","_"
3,"_","_","_","su","CAD","","_","_"
4,"_","_","_","hava","NC","","_","_"
5,"bhūtu","_","_","bhav","V","bhū","_","_"
6,"mahyam","_","_","mat","PPR","","_","_"
7,"mā","_","_","mā","CNG","","_","_"
8,"no","_","_","mat","PPR","","_","_"
9,"mātā","_","_","mātṛ","NC","","_","_"
10,"pṛthivī","_","_","pṛthivī","NC","","_","_"
11,"durmatau","_","_","durmati","NC","","_","_"
12,"dhāt","_","_","dadh","V","dhā","_","_"
1,"urau","_","_","uru","JJ","","_","_"
2,"devā","_","_","deva","NC","","_","_"
3,"anibādhe","_","_","anibādha","JJ","","_","_"
4,"syāma","_","_","as","V","as","_","_"
1,"sam","_","_","sa","CADP","","_","_"
2,"aśvinor","_","_","aśvin","NC","","_","_"
3,"avasā","_","_","avas","NC","","_","_"
4,"nūtanena","_","_","nūtana","JJ","","_","_"
5,"mayobhuvā","_","_","mayobhu","JJ","","_","_"
6,"_","_","_","su","CAD","","_","_"
7,"_","_","_","praṇīti","NC","","_","_"
8,"gamema","_","_","gam","V","gam","_","_"
1,"ā","_","_","ā","CADP","","_","_"
2,"no","_","_","mat","PPR","","_","_"
3,"rayiṃ","_","_","rayi","NC","","_","_"
4,"vahatam","_","_","vah","V","vah","_","_"
5,"_","_","_","ā","CADP","","_","_"
6,"_","_","_","uta","CCD","","_","_"
7,"vīrān","_","_","vīra","NC","","_","_"
8,"ā","_","_","ā","CADP","","_","_"
9,"viśvāny","_","_","viśva","JQ","","_","_"
10,"amṛtā","_","_","amṛta","JJ","","_","_"
11,"saubhagāni","_","_","saubhaga","NC","","_","_"
