"WordID","word","NormSTEM","suffix","lemma","PoS","Root","NormSuffix","NormWord"
1,"mārkaṇḍeya","_","_","mārkaṇḍeya","NC","","_","_"
2,"uvāca","_","_","vak","V","vac","_","_"
1,"āpasya","_","_","āpa","NC","","_","_"
2,"muditā","_","_","muditā","NC","","_","_"
3,"bhāryā","_","_","bhāryā","NC","","_","_"
4,"sahasya","_","_","saha","NC","","_","_"
5,"paramā","_","_","parama","JJ","","_","_"
6,"priyā","_","_","priya","JJ","","_","_"
1,"bhūpatir","_","_","bhūpati","NC","","_","_"
2,"_","_","_","bhuva","NC","","_","_"
3,"_","_","_","bhartṛ","NC","","_","_"
4,"ca","_","_","ca","CCD","","_","_"
5,"janayat","_","_","jan","V","jan","_","_"
6,"pāvakaṃ","_","_","pāvaka","NC","","_","_"
7,"param","_","_","para","PPX","","_","_"
1,"bhūtānāṃ","_","_","bhūta","NC","","_","_"
2,"_","_","_","ca","CCD","","_","_"
3,"_","_","_","api","CX","","_","_"
4,"sarveṣāṃ","_","_","sarva","JQ","","_","_"
5,"yaṃ","_","_","yad","PRL","","_","_"
6,"prāhuḥ","_","_","prāh","V","prāh","_","_"
7,"pāvakaṃ","_","_","pāvaka","NC","","_","_"
8,"patim","_","_","pati","NC","","_","_"
1,"ātmā","_","_","ātman","NC","","_","_"
2,"_","_","_","bhuvana","NC","","_","_"
3,"_","_","_","bhartṛ","NC","","_","_"
4,"_","_","_","iti","CQT","","_","_"
5,"_","_","_","sa_saha","CX","","_","_"
6,"_","_","_","anvaya","NC","","_","_"
7,"dvijātiṣu","_","_","dvijāti","NC","","_","_"
1,"mahatāṃ","_","_","mahat","JJ","","_","_"
2,"_","_","_","ca","CCD","","_","_"
3,"_","_","_","eva","CEM","","_","_"
4,"bhūtānāṃ","_","_","bhūta","NC","","_","_"
5,"sarveṣām","_","_","sarva","JQ","","_","_"
6,"iha","_","_","iha","CAD","","_","_"
7,"yaḥ","_","_","yad","PRL","","_","_"
8,"patiḥ","_","_","pati","NC","","_","_"
1,"bhagavān","_","_","bhagavat","JJ","","_","_"
2,"sa","_","_","tad","PRD","","_","_"
3,"_","_","_","mahat","JJ","","_","_"
4,"_","_","_","tejas","NC","","_","_"
5,"nityaṃ","_","_","nitya","CX","","_","_"
6,"carati","_","_","car","V","car","_","_"
7,"pāvakaḥ","_","_","pāvaka","NC","","_","_"
1,"agnir","_","_","agni","NC","","_","_"
2,"gṛhapatir","_","_","gṛhapati","NC","","_","_"
3,"nāma","_","_","nāma","CX","","_","_"
4,"nityaṃ","_","_","nitya","CX","","_","_"
5,"yajñeṣu","_","_","yajña","NC","","_","_"
6,"pūjyate","_","_","pūj","V","pūj","_","_"
1,"hutaṃ","_","_","hu","PPP","","_","_"
2,"vahati","_","_","vah","V","vah","_","_"
3,"yo","_","_","yad","PRL","","_","_"
4,"havyam","_","_","havya","NC","","_","_"
5,"asya","_","_","ida","PRD","","_","_"
6,"lokasya","_","_","loka","NC","","_","_"
7,"pāvakaḥ","_","_","pāvaka","NC","","_","_"
1,"apāṃ","_","_","ap","NC","","_","_"
2,"garbho","_","_","garbha","NC","","_","_"
3,"mahābhāgaḥ","_","_","mahābhāga","JJ","","_","_"
4,"sahaputro","_","_","sahaputra","JJ","","_","_"
5,"_","_","_","mahat","JJ","","_","_"
6,"_","_","_","adbhuta","JJ","","_","_"
1,"bhūpatir","_","_","bhūpati","NC","","_","_"
2,"_","_","_","bhuva","NC","","_","_"
3,"_","_","_","bhartṛ","NC","","_","_"
4,"ca","_","_","ca","CCD","","_","_"
5,"mahataḥ","_","_","mahat","JJ","","_","_"
6,"patir","_","_","pati","NC","","_","_"
7,"ucyate","_","_","vak","V","vac","_","_"
1,"dahan","_","_","dah","KDP","","_","_"
2,"mṛtāni","_","_","mṛ","PPP","","_","_"
3,"bhūtāni","_","_","bhūta","NC","","_","_"
4,"_","_","_","tad","PRD","","_","_"
5,"_","_","_","agni","NC","","_","_"
6,"bharato","_","_","bharata","NC","","_","_"
7,"'bhavat","_","_","bhav","V","bhū","_","_"
1,"agniṣṭome","_","_","agniṣṭoma","NC","","_","_"
2,"ca","_","_","ca","CCD","","_","_"
3,"niyataḥ","_","_","niya","PPP","","_","_"
4,"_","_","_","kratu","NC","","_","_"
5,"_","_","_","śreṣṭha","JJ","","_","_"
6,"bharasya","_","_","bhara","NC","","_","_"
7,"tu","_","_","tu","CCD","","_","_"
1,"āyāntaṃ","_","_","āyā","KDP","","_","_"
2,"niyataṃ","_","_","niya","PPP","","_","_"
3,"dṛṣṭvā","_","_","dṛś","CGDA","","_","_"
4,"_","_","_","praviś","V","praviś","_","_"
5,"_","_","_","arṇava","NC","","_","_"
6,"bhayāt","_","_","bhaya","NC","","_","_"
1,"devās","_","_","deva","NC","","_","_"
2,"taṃ","_","_","tad","PRD","","_","_"
3,"_","_","_","na","CNG","","_","_"
4,"_","_","_","adhiga","V","adhiga","_","_"
5,"mārgamāṇā","_","_","mārg","KDP","","_","_"
6,"yathādiśam","_","_","yathādiśa","CX","","_","_"
1,"dṛṣṭvā","_","_","dṛś","CGDA","","_","_"
2,"_","_","_","tu","CCD","","_","_"
3,"_","_","_","agni","NC","","_","_"
4,"atharvāṇaṃ","_","_","atharvan","NC","","_","_"
5,"tato","_","_","tatas","CX","","_","_"
6,"vacanam","_","_","vacana","NC","","_","_"
7,"abravīt","_","_","abravīta","V","brū","_","_"
1,"devānāṃ","_","_","deva","NC","","_","_"
2,"vaha","_","_","vah","V","vah","_","_"
3,"havyaṃ","_","_","havya","NC","","_","_"
4,"tvam","_","_","tvat","PPR","","_","_"
5,"ahaṃ","_","_","mat","PPR","","_","_"
6,"vīra","_","_","vīra","NC","","_","_"
7,"_","_","_","su","CAD","","_","_"
8,"_","_","_","durbala","JJ","","_","_"
1,"atharvan","_","_","atharvan","NC","","_","_"
2,"gaccha","_","_","ga","V","ga","_","_"
3,"_","_","_","madhu","NC","","_","_"
4,"_","_","_","akṣa","NC","","_","_"
5,"priyam","_","_","priya","JJ","","_","_"
6,"etat","_","_","tad","PRD","","_","_"
7,"kuruṣva","_","_","kar","V","kṛ","_","_"
8,"me","_","_","mat","PPR","","_","_"
1,"preṣya","_","_","preṣ","CGDA","","_","_"
2,"_","_","_","ca","CCD","","_","_"
3,"_","_","_","agni","NC","","_","_"
4,"atharvāṇam","_","_","atharvan","NC","","_","_"
5,"anyaṃ","_","_","anya","PPX","","_","_"
6,"deśaṃ","_","_","deśa","NC","","_","_"
7,"tato","_","_","tatas","CX","","_","_"
8,"'gamat","_","_","ga","V","ga","_","_"
1,"matsyās","_","_","matsya","NC","","_","_"
2,"tasya","_","_","tad","PRD","","_","_"
3,"samācakhyuḥ","_","_","samākhyā","V","samākhyā","_","_"
4,"kruddhas","_","_","krudh","PPP","","_","_"
5,"tān","_","_","tad","PRD","","_","_"
6,"agnir","_","_","agni","NC","","_","_"
7,"abravīt","_","_","abravīta","V","brū","_","_"
1,"bhakṣyā","_","_","bhakṣ","KDG","","_","_"
2,"vai","_","_","vai","CX","","_","_"
3,"vividhair","_","_","vividha","JJ","","_","_"
4,"bhāvair","_","_","bhāva","NC","","_","_"
5,"bhaviṣyatha","_","_","bhav","V","bhū","_","_"
6,"śarīriṇām","_","_","śarīrin","NC","","_","_"
1,"atharvāṇaṃ","_","_","atharvan","NC","","_","_"
2,"tathā","_","_","tathā","CX","","_","_"
3,"_","_","_","ca","CCD","","_","_"
4,"_","_","_","api","CX","","_","_"
5,"havyavāho","_","_","havyavāha","NC","","_","_"
6,"'bravīd","_","_","abravīta","V","brū","_","_"
7,"vacaḥ","_","_","vacas","NC","","_","_"
1,"anunīyamāno","_","_","anunī","KDP","","_","_"
2,"'pi","_","_","api","CX","","_","_"
3,"bhṛśaṃ","_","_","bhṛśa","CX","","_","_"
4,"_","_","_","deva","NC","","_","_"
5,"_","_","_","vākya","NC","","_","_"
6,"_","_","_","hi","CX","","_","_"
7,"tena","_","_","tad","PRD","","_","_"
8,"saḥ","_","_","tad","PRD","","_","_"
1,"_","_","_","na","CNG","","_","_"
2,"_","_","_","iṣ","V","iṣ","_","_"
3,"voḍhuṃ","_","_","vah","CGDI","","_","_"
4,"haviḥ","_","_","havis","NC","","_","_"
5,"sarvaṃ","_","_","sarva","JQ","","_","_"
6,"śarīraṃ","_","_","śarīra","NC","","_","_"
7,"ca","_","_","ca","CCD","","_","_"
8,"samatyajat","_","_","saṃtyaj","V","saṃtyaj","_","_"
1,"sa","_","_","tad","PRD","","_","_"
2,"_","_","_","tad","PRD","","_","_"
3,"_","_","_","śarīra","NC","","_","_"
4,"saṃtyajya","_","_","saṃtyaj","CGDA","","_","_"
5,"praviveśa","_","_","praviś","V","praviś","_","_"
6,"dharāṃ","_","_","dharā","NC","","_","_"
7,"tadā","_","_","tadā","CAD","","_","_"
1,"bhūmiṃ","_","_","bhūmi","NC","","_","_"
2,"_","_","_","spṛś","CGDA","","_","_"
3,"_","_","_","sṛj","V","sṛj","_","_"
4,"dhātūn","_","_","dhātu","NC","","_","_"
5,"pṛthak","_","_","pṛthak","CX","","_","_"
6,"pṛthag","_","_","pṛthak","CX","","_","_"
7,"atīva","_","_","atīva","CX","","_","_"
8,"hi","_","_","hi","CX","","_","_"
1,"āsyāt","_","_","āsya","NC","","_","_"
2,"sugandhi","_","_","sugandhi","JJ","","_","_"
3,"tejaś","_","_","tejas","NC","","_","_"
4,"ca","_","_","ca","CCD","","_","_"
5,"asthibhyo","_","_","asthi","NC","","_","_"
6,"devadāru","_","_","devadāru","NC","","_","_"
7,"ca","_","_","ca","CCD","","_","_"
1,"śleṣmaṇaḥ","_","_","śleṣman","NC","","_","_"
2,"sphaṭikaṃ","_","_","sphaṭika","NC","","_","_"
3,"tasya","_","_","tad","PRD","","_","_"
4,"pittān","_","_","pitta","NC","","_","_"
5,"marakataṃ","_","_","marakata","NC","","_","_"
6,"tathā","_","_","tathā","CX","","_","_"
1,"kṛṣṇāyasaṃ","_","_","kṛṣṇāyasa","NC","","_","_"
2,"tasya","_","_","tad","PRD","","_","_"
3,"tribhir","_","_","tri","NUM","","_","_"
4,"eva","_","_","eva","CEM","","_","_"
5,"babhuḥ","_","_","bhā","V","bhā","_","_"
6,"prajāḥ","_","_","prajā","NC","","_","_"
1,"nakhās","_","_","nakha","NC","","_","_"
2,"_","_","_","tad","PRD","","_","_"
3,"_","_","_","abhra","NC","","_","_"
4,"_","_","_","paṭala","NC","","_","_"
5,"_","_","_","sirā","NC","","_","_"
6,"_","_","_","jāla","NC","","_","_"
7,"vidrumam","_","_","vidruma","NC","","_","_"
1,"śarīrād","_","_","śarīra","NC","","_","_"
2,"vividhāś","_","_","vividha","JJ","","_","_"
3,"_","_","_","ca","CCD","","_","_"
4,"_","_","_","anya","PPX","","_","_"
5,"dhātavo","_","_","dhātu","NC","","_","_"
6,"_","_","_","ida","PRD","","_","_"
7,"_","_","_","bhav","V","bhū","_","_"
8,"nṛpa","_","_","nṛpa","NC","","_","_"
1,"evaṃ","_","_","eva","CX","","_","_"
2,"tyaktvā","_","_","tyaj","CGDA","","_","_"
3,"śarīraṃ","_","_","śarīra","NC","","_","_"
4,"tu","_","_","tu","CCD","","_","_"
5,"parame","_","_","parama","JJ","","_","_"
6,"tapasi","_","_","tapas","NC","","_","_"
7,"sthitaḥ","_","_","sthā","PPP","","_","_"
1,"_","_","_","bhṛgu","NC","","_","_"
2,"_","_","_","aṅgiras","NC","","_","_"
3,"_","_","_","ādi","NC","","_","_"
4,"bhūyas","_","_","bhūyas","CX","","_","_"
5,"_","_","_","tapas","NC","","_","_"
6,"_","_","_","utthāpay","PPP","","_","_"
7,"tadā","_","_","tadā","CAD","","_","_"
1,"bhṛśaṃ","_","_","bhṛśa","CX","","_","_"
2,"jajvāla","_","_","jval","V","jval","_","_"
3,"tejasvī","_","_","tejasvin","JJ","","_","_"
4,"_","_","_","tapas","NC","","_","_"
5,"_","_","_","āpyāyay","PPP","","_","_"
6,"śikhī","_","_","śikhin","NC","","_","_"
1,"dṛṣṭvā","_","_","dṛś","CGDA","","_","_"
2,"ṛṣīn","_","_","ṛṣi","NC","","_","_"
3,"_","_","_","bhaya","NC","","_","_"
4,"_","_","_","ca","CCD","","_","_"
5,"_","_","_","api","CX","","_","_"
6,"praviveśa","_","_","praviś","V","praviś","_","_"
7,"_","_","_","mahat","JJ","","_","_"
8,"_","_","_","arṇava","NC","","_","_"
1,"tasmin","_","_","tad","PRD","","_","_"
2,"naṣṭe","_","_","naś","PPP","","_","_"
3,"jagad","_","_","jagat","NC","","_","_"
4,"bhītam","_","_","bhī","PPP","","_","_"
5,"atharvāṇam","_","_","atharvan","NC","","_","_"
6,"_","_","_","atha","CAD","","_","_"
7,"_","_","_","āśri","PPP","","_","_"
1,"arcayāmāsur","_","_","arcay","V","arcay","_","_"
2,"_","_","_","eva","CEM","","_","_"
3,"_","_","_","a","PRD","","_","_"
4,"atharvāṇaṃ","_","_","atharvan","NC","","_","_"
5,"_","_","_","sura","NC","","_","_"
6,"_","_","_","ṛṣi","NC","","_","_"
1,"atharvā","_","_","atharvan","NC","","_","_"
2,"tv","_","_","tu","CCD","","_","_"
3,"_","_","_","sṛj","V","sṛj","_","_"
4,"_","_","_","loka","NC","","_","_"
5,"_","_","_","ātman","NC","","_","_"
6,"_","_","_","ālokay","CGDA","","_","_"
7,"pāvakam","_","_","pāvaka","NC","","_","_"
1,"miṣatāṃ","_","_","miṣ","KDP","","_","_"
2,"_","_","_","sarva","JQ","","_","_"
3,"_","_","_","bhūta","NC","","_","_"
4,"unmamātha","_","_","unmath","V","unmath","_","_"
5,"_","_","_","mahat","JJ","","_","_"
6,"_","_","_","arṇava","NC","","_","_"
1,"evam","_","_","eva","CX","","_","_"
2,"agnir","_","_","agni","NC","","_","_"
3,"bhagavatā","_","_","bhagavat","JJ","","_","_"
4,"naṣṭaḥ","_","_","naś","PPP","","_","_"
5,"pūrvam","_","_","pūrva","CX","","_","_"
6,"atharvaṇā","_","_","atharvan","NC","","_","_"
1,"āhūtaḥ","_","_","āhvā","PPP","","_","_"
2,"_","_","_","sarva","JQ","","_","_"
3,"_","_","_","bhūta","NC","","_","_"
4,"havyaṃ","_","_","havya","NC","","_","_"
5,"vahati","_","_","vah","V","vah","_","_"
6,"sarvadā","_","_","sarvadā","CX","","_","_"
1,"evaṃ","_","_","eva","CX","","_","_"
2,"_","_","_","tu","CCD","","_","_"
3,"_","_","_","janay","V","janay","_","_"
4,"dhiṣṇyān","_","_","dhiṣṇya","JJ","","_","_"
5,"_","_","_","veda","NC","","_","_"
6,"_","_","_","vac","PPP","","_","_"
7,"vibudhān","_","_","vibudha","NC","","_","_"
8,"bahūn","_","_","bahu","JJ","","_","_"
1,"vicaran","_","_","vicar","KDP","","_","_"
2,"vividhān","_","_","vividha","JJ","","_","_"
3,"deśān","_","_","deśa","NC","","_","_"
4,"bhramamāṇas","_","_","bhra","KDP","","_","_"
5,"tu","_","_","tu","CCD","","_","_"
6,"tatra","_","_","tatra","CAD","","_","_"
7,"vai","_","_","vai","CX","","_","_"
1,"_","_","_","sindhu","NC","","_","_"
2,"_","_","_","varja","JJ","","_","_"
3,"pañca","_","_","pañcan","NUM","","_","_"
4,"nadyo","_","_","nadī","NC","","_","_"
5,"_","_","_","devikā","NC","","_","_"
6,"_","_","_","atha","CAD","","_","_"
7,"sarasvatī","_","_","sarasvatī","NC","","_","_"
1,"gaṅgā","_","_","gaṅgā","NC","","_","_"
2,"ca","_","_","ca","CCD","","_","_"
3,"śatakumbhā","_","_","śatakumbhā","NC","","_","_"
4,"ca","_","_","ca","CCD","","_","_"
5,"sarayūr","_","_","sarayū","NC","","_","_"
6,"gaṇḍasāhvayā","_","_","gaṇḍasāhvayā","NC","","_","_"
1,"carmaṇvatī","_","_","carmaṇvatī","NC","","_","_"
2,"mahī","_","_","mahī","NC","","_","_"
3,"_","_","_","ca","CCD","","_","_"
4,"_","_","_","eva","CEM","","_","_"
5,"medhyā","_","_","medhyā","NC","","_","_"
6,"medhātithis","_","_","medhātithi","NC","","_","_"
7,"tathā","_","_","tathā","CX","","_","_"
1,"tāmrāvatī","_","_","tāmrāvatī","NC","","_","_"
2,"vetravatī","_","_","vetravatī","NC","","_","_"
3,"nadyas","_","_","nadī","NC","","_","_"
4,"tisro","_","_","tri","NUM","","_","_"
5,"'tha","_","_","atha","CAD","","_","_"
6,"kauśikī","_","_","kauśikī","NC","","_","_"
1,"tamasā","_","_","tamasā","NC","","_","_"
2,"narmadā","_","_","narmadā","NC","","_","_"
3,"_","_","_","ca","CCD","","_","_"
4,"_","_","_","eva","CEM","","_","_"
5,"nadī","_","_","nadī","NC","","_","_"
6,"godāvarī","_","_","godāvarī","NC","","_","_"
7,"tathā","_","_","tathā","CX","","_","_"
1,"veṇṇā","_","_","veṇṇā","NC","","_","_"
2,"praveṇī","_","_","praveṇī","NC","","_","_"
3,"bhīmā","_","_","bhīmā","NC","","_","_"
4,"ca","_","_","ca","CCD","","_","_"
5,"_","_","_","ca","CCD","","_","_"
6,"_","_","_","eva","CEM","","_","_"
7,"caiva","_","_","bhārata","NC","","_","_"
1,"bhāratī","_","_","bhāratī","NC","","_","_"
2,"suprayogā","_","_","suprayogā","NC","","_","_"
3,"ca","_","_","ca","CCD","","_","_"
4,"kāverī","_","_","kāverī","NC","","_","_"
5,"murmurā","_","_","murmurā","NC","","_","_"
6,"tathā","_","_","tathā","CX","","_","_"
1,"kṛṣṇā","_","_","kṛṣṇā","NC","","_","_"
2,"ca","_","_","ca","CCD","","_","_"
3,"kṛṣṇaveṇṇā","_","_","kṛṣṇaveṇṇā","NC","","_","_"
4,"ca","_","_","ca","CCD","","_","_"
5,"kapilā","_","_","kapilā","NC","","_","_"
6,"śoṇa","_","_","śoṇa","NC","","_","_"
7,"eva","_","_","eva","CEM","","_","_"
8,"ca","_","_","ca","CCD","","_","_"
1,"etā","_","_","tad","PRD","","_","_"
2,"_","_","_","nadī","NC","","_","_"
3,"_","_","_","tu","CCD","","_","_"
4,"dhiṣṇyānāṃ","_","_","dhiṣṇya","JJ","","_","_"
5,"mātaro","_","_","mātṛ","NC","","_","_"
6,"yāḥ","_","_","yad","PRL","","_","_"
7,"prakīrtitāḥ","_","_","prakīrtay","PPP","","_","_"
1,"adbhutasya","_","_","adbhuta","JJ","","_","_"
2,"priyā","_","_","priya","JJ","","_","_"
3,"bhāryā","_","_","bhāryā","NC","","_","_"
4,"tasyāḥ","_","_","tad","PRD","","_","_"
5,"putro","_","_","putra","NC","","_","_"
1,"yāvantaḥ","_","_","yāvat","JJ","","_","_"
2,"pāvakāḥ","_","_","pāvaka","NC","","_","_"
3,"proktāḥ","_","_","pravac","PPP","","_","_"
4,"somās","_","_","soma","NC","","_","_"
5,"tāvanta","_","_","tāvat","JJ","","_","_"
6,"eva","_","_","eva","CEM","","_","_"
7,"ca","_","_","ca","CCD","","_","_"
1,"atreś","_","_","atri","NC","","_","_"
2,"_","_","_","ca","CCD","","_","_"
3,"_","_","_","api","CX","","_","_"
4,"_","_","_","anvaya","NC","","_","_"
5,"jātā","_","_","jan","PPP","","_","_"
6,"brahmaṇo","_","_","brahman","NC","","_","_"
7,"mānasāḥ","_","_","mānasa","JJ","","_","_"
8,"prajāḥ","_","_","prajā","NC","","_","_"
1,"atriḥ","_","_","atri","NC","","_","_"
2,"putrān","_","_","putra","NC","","_","_"
3,"_","_","_","sraṣṭu","NC","","_","_"
4,"_","_","_","kāma","NC","","_","_"
5,"tān","_","_","tad","PRD","","_","_"
6,"_","_","_","eva","CEM","","_","_"
7,"_","_","_","ātman","NC","","_","_"
8,"_","_","_","dhāray","V","dhāray","_","_"
1,"tasya","_","_","tad","PRD","","_","_"
2,"tad","_","_","tad","PRD","","_","_"
3,"brahmaṇaḥ","_","_","brahman","NC","","_","_"
4,"kāyān","_","_","kāya","NC","","_","_"
5,"nirharanti","_","_","nirhar","V","nirhṛ","_","_"
6,"hutāśanāḥ","_","_","hutāśana","NC","","_","_"
1,"evam","_","_","eva","CX","","_","_"
2,"ete","_","_","tad","PRD","","_","_"
3,"mahātmānaḥ","_","_","mahātman","JJ","","_","_"
4,"kīrtitās","_","_","kīrtay","PPP","","_","_"
5,"te","_","_","tad","PRD","","_","_"
6,"'gnayo","_","_","agni","NC","","_","_"
7,"mayā","_","_","mat","PPR","","_","_"
1,"aprameyā","_","_","aprameya","JJ","","_","_"
2,"_","_","_","yathā","CCM","","_","_"
3,"_","_","_","utpad","PPP","","_","_"
4,"śrīmantas","_","_","śrīmat","JJ","","_","_"
5,"_","_","_","timira","NC","","_","_"
6,"_","_","_","apaha","JJ","","_","_"
1,"adbhutasya","_","_","adbhuta","JJ","","_","_"
2,"tu","_","_","tu","CCD","","_","_"
3,"māhātmyaṃ","_","_","māhātmya","NC","","_","_"
4,"yathā","_","_","yathā","CCM","","_","_"
5,"vedeṣu","_","_","veda","NC","","_","_"
6,"kīrtitam","_","_","kīrtay","PPP","","_","_"
1,"tādṛśaṃ","_","_","tādṛśa","JJ","","_","_"
2,"viddhi","_","_","vid","V","vid","_","_"
3,"sarveṣām","_","_","sarva","JQ","","_","_"
4,"eko","_","_","eka","PPX","","_","_"
5,"_","_","_","hi","CX","","_","_"
6,"_","_","_","tad","PRD","","_","_"
7,"hutāśanaḥ","_","_","hutāśana","NC","","_","_"
1,"eka","_","_","eka","PPX","","_","_"
2,"_","_","_","eva","CEM","","_","_"
3,"_","_","_","tad","PRD","","_","_"
4,"bhagavān","_","_","bhagavat","JJ","","_","_"
5,"vijñeyaḥ","_","_","vijñā","KDG","","_","_"
6,"prathamo","_","_","prathama","JJ","","_","_"
7,"'ṅgirāḥ","_","_","aṅgiras","NC","","_","_"
1,"bahudhā","_","_","bahudhā","CX","","_","_"
2,"niḥsṛtaḥ","_","_","niḥsṛ","PPP","","_","_"
3,"_","_","_","kāya","NC","","_","_"
4,"_","_","_","jyotiṣṭoma","NC","","_","_"
5,"kratur","_","_","kratu","NC","","_","_"
6,"yathā","_","_","yathā","CCM","","_","_"
1,"_","_","_","iti","CQT","","_","_"
2,"_","_","_","tad","PRD","","_","_"
3,"vaṃśaḥ","_","_","vaṃśa","NC","","_","_"
4,"_","_","_","su","CAD","","_","_"
5,"_","_","_","mahat","JJ","","_","_"
6,"agnīnāṃ","_","_","agni","NC","","_","_"
7,"kīrtito","_","_","kīrtay","PPP","","_","_"
8,"mayā","_","_","mat","PPR","","_","_"
1,"pāvito","_","_","pāvay","PPP","","_","_"
2,"vividhair","_","_","vividha","JJ","","_","_"
3,"mantrair","_","_","mantra","NC","","_","_"
4,"havyaṃ","_","_","havya","NC","","_","_"
5,"vahati","_","_","vah","V","vah","_","_"
6,"dehinām","_","_","dehin","NC","","_","_"
