"WordID","word","NormSTEM","suffix","lemma","PoS","Root","NormSuffix","NormWord"
1,"dhṛtarāṣṭra","_","_","dhṛtarāṣṭra","NC","","_","_"
2,"uvāca","_","_","vak","V","vac","_","_"
1,"evaṃ","_","_","eva","CX","","_","_"
2,"bahuguṇaṃ","_","_","bahuguṇa","JJ","","_","_"
3,"sainyam","_","_","sainya","NC","","_","_"
4,"evaṃ","_","_","eva","CX","","_","_"
5,"bahuvidhaṃ","_","_","bahuvidha","JJ","","_","_"
6,"param","_","_","para","CX","","_","_"
1,"vyūḍham","_","_","vyūh","PPP","","_","_"
2,"evaṃ","_","_","eva","CX","","_","_"
3,"yathāśāstram","_","_","yathāśāstra","CX","","_","_"
4,"amoghaṃ","_","_","amogha","JJ","","_","_"
5,"_","_","_","ca","CCD","","_","_"
6,"_","_","_","eva","CEM","","_","_"
7,"saṃjaya","_","_","saṃjaya","NC","","_","_"
1,"puṣṭam","_","_","puṣ","PPP","","_","_"
2,"asmākam","_","_","mat","PPR","","_","_"
3,"atyantam","_","_","atyanta","CX","","_","_"
4,"abhikāmaṃ","_","_","abhikāma","JJ","","_","_"
5,"ca","_","_","ca","CCD","","_","_"
6,"naḥ","_","_","mat","PPR","","_","_"
7,"sadā","_","_","sadā","CAD","","_","_"
1,"prahvam","_","_","prahva","JJ","","_","_"
2,"_","_","_","avyasana","NC","","_","_"
3,"_","_","_","upe","PPP","","_","_"
4,"purastād","_","_","purastāt","CX","","_","_"
5,"_","_","_","dṛś","PPP","","_","_"
6,"_","_","_","vikrama","NC","","_","_"
1,"_","_","_","na","CNG","","_","_"
2,"_","_","_","ati","CADP","","_","_"
3,"_","_","_","vṛdh","PPP","","_","_"
4,"abālaṃ","_","_","abāla","JJ","","_","_"
5,"ca","_","_","ca","CCD","","_","_"
6,"na","_","_","na","CNG","","_","_"
7,"kṛśaṃ","_","_","kṛśa","JJ","","_","_"
8,"na","_","_","na","CNG","","_","_"
9,"ca","_","_","ca","CCD","","_","_"
10,"pīvaram","_","_","pīvara","JJ","","_","_"
1,"_","_","_","laghu","JJ","","_","_"
2,"_","_","_","vṛtta","NC","","_","_"
3,"_","_","_","āya","PPP","","_","_"
4,"_","_","_","prāya","NC","","_","_"
5,"_","_","_","sāra","NC","","_","_"
6,"_","_","_","gātra","NC","","_","_"
7,"anāmayam","_","_","anāmaya","JJ","","_","_"
1,"_","_","_","ādā","PPP","","_","_"
2,"_","_","_","saṃnāha","NC","","_","_"
3,"_","_","_","śastra","NC","","_","_"
4,"ca","_","_","ca","CCD","","_","_"
5,"_","_","_","bahu","JJ","","_","_"
6,"_","_","_","śastra","NC","","_","_"
7,"_","_","_","parigraha","NC","","_","_"
1,"_","_","_","asi","NC","","_","_"
2,"_","_","_","yuddha","NC","","_","_"
3,"niyuddhe","_","_","niyuddha","NC","","_","_"
4,"ca","_","_","ca","CCD","","_","_"
5,"_","_","_","gadā","NC","","_","_"
6,"_","_","_","yuddha","NC","","_","_"
7,"ca","_","_","ca","CCD","","_","_"
8,"kovidam","_","_","kovida","JJ","","_","_"
1,"_","_","_","prāsa","NC","","_","_"
2,"_","_","_","ṛṣṭi","NC","","_","_"
3,"_","_","_","tomara","NC","","_","_"
4,"_","_","_","āji","NC","","_","_"
5,"_","_","_","parigha","NC","","_","_"
6,"_","_","_","āyasa","JJ","","_","_"
7,"ca","_","_","ca","CCD","","_","_"
1,"bhiṇḍipāleṣu","_","_","bhindipāla","NC","","_","_"
2,"śaktīṣu","_","_","musala","NC","","_","_"
3,"musaleṣu","_","_","ca","CCD","","_","_"
4,"ca","_","_","sarvaśas","CX","","_","_"
1,"kampaneṣu","_","_","kampana","NC","","_","_"
2,"ca","_","_","ca","CCD","","_","_"
3,"cāpeṣu","_","_","cāpa","NC","","_","_"
4,"kaṇapeṣu","_","_","kaṇapa","NC","","_","_"
5,"ca","_","_","ca","CCD","","_","_"
6,"sarvaśaḥ","_","_","sarvaśas","CX","","_","_"
1,"kṣepaṇīṣu","_","_","kṣepaṇī","NC","","_","_"
2,"ca","_","_","ca","CCD","","_","_"
3,"citrāsu","_","_","citra","JJ","","_","_"
4,"_","_","_","muṣṭi","NC","","_","_"
5,"_","_","_","yuddha","NC","","_","_"
6,"kovidam","_","_","kovida","JJ","","_","_"
1,"aparokṣaṃ","_","_","aparokṣa","JJ","","_","_"
2,"ca","_","_","ca","CCD","","_","_"
3,"vidyāsu","_","_","vidyā","NC","","_","_"
4,"vyāyāmeṣu","_","_","vyāyāma","NC","","_","_"
5,"_","_","_","kṛ","PPP","","_","_"
6,"_","_","_","śrama","NC","","_","_"
1,"_","_","_","śastra","NC","","_","_"
2,"_","_","_","grahaṇa","NC","","_","_"
3,"_","_","_","vidyā","NC","","_","_"
4,"sarvāsu","_","_","sarva","JQ","","_","_"
5,"pariniṣṭhitam","_","_","pariniṣṭhā","PPP","","_","_"
1,"ārohe","_","_","āroha","NC","","_","_"
2,"paryavaskande","_","_","paryavaskanda","NC","","_","_"
3,"saraṇe","_","_","saraṇa","NC","","_","_"
4,"sāntaraplute","_","_","sāntarapluta","NC","","_","_"
1,"_","_","_","samyak","CX","","_","_"
2,"_","_","_","praharaṇa","NC","","_","_"
3,"yāne","_","_","yāna","NC","","_","_"
4,"vyapayāne","_","_","vyapayāna","NC","","_","_"
5,"ca","_","_","ca","CCD","","_","_"
6,"kovidam","_","_","kovida","JJ","","_","_"
1,"_","_","_","nāga","NC","","_","_"
2,"_","_","_","aśva","NC","","_","_"
3,"_","_","_","ratha","NC","","_","_"
4,"_","_","_","yāna","NC","","_","_"
5,"bahuśaḥ","_","_","bahuśas","CX","","_","_"
6,"_","_","_","su","CAD","","_","_"
7,"_","_","_","parīkṣ","PPP","","_","_"
1,"parīkṣya","_","_","parīkṣ","CGDA","","_","_"
2,"ca","_","_","ca","CCD","","_","_"
3,"yathānyāyaṃ","_","_","yathānyāya","CX","","_","_"
4,"_","_","_","vetana","NC","","_","_"
5,"_","_","_","upapāday","PPP","","_","_"
1,"na","_","_","na","CNG","","_","_"
2,"goṣṭhyā","_","_","goṣṭhī","NC","","_","_"
3,"_","_","_","na","CNG","","_","_"
4,"_","_","_","upacāra","NC","","_","_"
5,"na","_","_","na","CNG","","_","_"
6,"ca","_","_","ca","CCD","","_","_"
7,"_","_","_","bandhu","NC","","_","_"
8,"_","_","_","nimitta","NC","","_","_"
1,"na","_","_","na","CNG","","_","_"
2,"_","_","_","sauhṛda","NC","","_","_"
3,"_","_","_","bala","NC","","_","_"
4,"_","_","_","ca","CCD","","_","_"
5,"_","_","_","api","CX","","_","_"
6,"_","_","_","na","CNG","","_","_"
7,"_","_","_","akulīna","JJ","","_","_"
8,"_","_","_","parigraha","NC","","_","_"
1,"_","_","_","samṛdh","PPP","","_","_"
2,"_","_","_","jana","NC","","_","_"
3,"āryaṃ","_","_","ārya","JJ","","_","_"
4,"ca","_","_","ca","CCD","","_","_"
5,"_","_","_","tuṣ","PPP","","_","_"
6,"_","_","_","satkṛ","PPP","","_","_"
7,"_","_","_","bāndhava","NC","","_","_"
1,"_","_","_","kṛ","PPP","","_","_"
2,"_","_","_","upakāra","NC","","_","_"
3,"_","_","_","bhūyiṣṭha","JJ","","_","_"
4,"yaśasvi","_","_","yaśasvin","JJ","","_","_"
5,"ca","_","_","ca","CCD","","_","_"
6,"manasvi","_","_","manasvin","JJ","","_","_"
7,"ca","_","_","ca","CCD","","_","_"
1,"_","_","_","sa_saha","CX","","_","_"
2,"_","_","_","jaya","NC","","_","_"
3,"_","_","_","ca","CCD","","_","_"
4,"narair","_","_","nara","NC","","_","_"
5,"mukhyair","_","_","mukhya","JJ","","_","_"
6,"bahuśo","_","_","bahuśas","CX","","_","_"
7,"_","_","_","mukhya","JJ","","_","_"
8,"_","_","_","karman","NC","","_","_"
1,"_","_","_","lokapāla","NC","","_","_"
2,"_","_","_","upama","JJ","","_","_"
3,"_","_","_","tāta","NC","","_","_"
4,"pālitaṃ","_","_","pālay","PPP","","_","_"
5,"_","_","_","loka","NC","","_","_"
6,"_","_","_","viśru","PPP","","_","_"
1,"bahubhiḥ","_","_","bahu","JJ","","_","_"
2,"kṣatriyair","_","_","kṣatriya","NC","","_","_"
3,"guptaṃ","_","_","gup","PPP","","_","_"
4,"pṛthivyāṃ","_","_","pṛthivī","NC","","_","_"
5,"_","_","_","loka","NC","","_","_"
6,"_","_","_","samman","PPP","","_","_"
1,"asmān","_","_","mat","PPR","","_","_"
2,"abhigataiḥ","_","_","abhiga","PPP","","_","_"
3,"kāmāt","_","_","kāma","NC","","_","_"
4,"_","_","_","sa_saha","CX","","_","_"
5,"_","_","_","bala","NC","","_","_"
6,"_","_","_","sa_saha","CX","","_","_"
7,"_","_","_","padānuga","JJ","","_","_"
1,"mahodadhim","_","_","mahodadhi","NC","","_","_"
2,"_","_","_","iva","CCM","","_","_"
3,"_","_","_","āp￞","PPP","","_","_"
4,"āpagābhiḥ","_","_","āpagā","NC","","_","_"
5,"samantataḥ","_","_","samantataḥ","CX","","_","_"
1,"apakṣaiḥ","_","_","apakṣa","JJ","","_","_"
2,"_","_","_","pakṣa","NC","","_","_"
3,"_","_","_","saṃkāśa","NC","","_","_"
4,"rathair","_","_","ratha","NC","","_","_"
5,"_","_","_","nāga","NC","","_","_"
6,"_","_","_","ca","CCD","","_","_"
7,"saṃvṛtam","_","_","saṃvṛ","PPP","","_","_"
1,"_","_","_","nānā","CX","","_","_"
2,"_","_","_","yodha","NC","","_","_"
3,"_","_","_","jala","NC","","_","_"
4,"bhīmaṃ","_","_","bhīma","JJ","","_","_"
5,"_","_","_","vāhana","NC","","_","_"
6,"_","_","_","ūrmi","NC","","_","_"
7,"_","_","_","taraṃgin","JJ","","_","_"
1,"_","_","_","kṣepaṇī","NC","","_","_"
2,"_","_","_","asi","NC","","_","_"
3,"_","_","_","gadā","NC","","_","_"
4,"_","_","_","śakti","NC","","_","_"
5,"_","_","_","śara","NC","","_","_"
6,"_","_","_","prāsa","NC","","_","_"
7,"_","_","_","samākula","JJ","","_","_"
1,"_","_","_","dhvaja","NC","","_","_"
2,"_","_","_","bhūṣaṇa","NC","","_","_"
3,"_","_","_","sambādha","NC","","_","_"
4,"_","_","_","ratna","NC","","_","_"
5,"_","_","_","paṭṭa","NC","","_","_"
6,"saṃcitam","_","_","saṃci","PPP","","_","_"
1,"vāhanaiḥ","_","_","vāhana","NC","","_","_"
2,"parisarpadbhir","_","_","parisṛp","KDP","","_","_"
3,"_","_","_","vāyu","NC","","_","_"
4,"_","_","_","vega","NC","","_","_"
5,"_","_","_","vikampay","PPP","","_","_"
1,"apāram","_","_","apāra","JJ","","_","_"
2,"iva","_","_","iva","CCM","","_","_"
3,"garjantaṃ","_","_","garj","KDP","","_","_"
4,"_","_","_","sāgara","NC","","_","_"
5,"_","_","_","pratimā","NC","","_","_"
6,"mahat","_","_","mahat","JJ","","_","_"
1,"_","_","_","droṇa","NC","","_","_"
2,"_","_","_","bhīṣma","NC","","_","_"
3,"_","_","_","abhisaṃgup","PPP","","_","_"
4,"guptaṃ","_","_","gup","PPP","","_","_"
5,"ca","_","_","ca","CCD","","_","_"
6,"kṛtavarmaṇā","_","_","kṛtavarman","NC","","_","_"
1,"_","_","_","kṛpa","NC","","_","_"
2,"_","_","_","duḥśāsana","NC","","_","_"
3,"ca","_","_","ca","CCD","","_","_"
4,"_","_","_","jayadratha","NC","","_","_"
5,"_","_","_","mukha","NC","","_","_"
6,"_","_","_","tathā","CX","","_","_"
1,"_","_","_","bhagadatta","NC","","_","_"
2,"_","_","_","vikarṇa","NC","","_","_"
3,"_","_","_","drauṇi","NC","","_","_"
4,"_","_","_","saubala","NC","","_","_"
5,"_","_","_","bāhlika","NC","","_","_"
1,"guptaṃ","_","_","gup","PPP","","_","_"
2,"pravīrair","_","_","pravīra","NC","","_","_"
3,"lokasya","_","_","loka","NC","","_","_"
4,"sāravadbhir","_","_","sāravat","JJ","","_","_"
5,"mahātmabhiḥ","_","_","mahātman","JJ","","_","_"
1,"yad","_","_","yat","CSB","","_","_"
2,"ahanyata","_","_","han","V","han","_","_"
3,"saṃgrāme","_","_","saṃgrāma","NC","","_","_"
4,"diṣṭam","_","_","diṣṭa","NC","","_","_"
5,"etat","_","_","tad","PRD","","_","_"
6,"purātanam","_","_","purātana","JJ","","_","_"
1,"_","_","_","na","CNG","","_","_"
2,"_","_","_","etādṛśa","JJ","","_","_"
3,"samudyogaṃ","_","_","samudyoga","NC","","_","_"
4,"dṛṣṭavanto","_","_","dṛś","KDP","","_","_"
5,"'tha","_","_","atha","CAD","","_","_"
6,"mānuṣāḥ","_","_","mānuṣa","NC","","_","_"
1,"ṛṣayo","_","_","ṛṣi","NC","","_","_"
2,"vā","_","_","vā","CCD","","_","_"
3,"mahābhāgāḥ","_","_","mahābhāga","JJ","","_","_"
4,"purāṇā","_","_","purāṇa","JJ","","_","_"
5,"bhuvi","_","_","bhū","NC","","_","_"
6,"saṃjaya","_","_","saṃjaya","NC","","_","_"
1,"īdṛśo","_","_","īdṛśa","JJ","","_","_"
2,"hi","_","_","hi","CX","","_","_"
3,"_","_","_","bala","NC","","_","_"
4,"_","_","_","ogha","NC","","_","_"
5,"_","_","_","tu","CCD","","_","_"
6,"yuktaḥ","_","_","yuj","PPP","","_","_"
7,"_","_","_","śastra","NC","","_","_"
8,"_","_","_","astra","NC","","_","_"
9,"_","_","_","sampad","NC","","_","_"
1,"vadhyate","_","_","vadh","V","vadh","_","_"
2,"yatra","_","_","yatra","CX","","_","_"
3,"saṃgrāme","_","_","saṃgrāma","NC","","_","_"
4,"kim","_","_","kiṃ","PRQ","","_","_"
5,"anyad","_","_","anya","PPX","","_","_"
6,"bhāgadheyataḥ","_","_","bhāgadheya","NC","","_","_"
1,"viparītam","_","_","viparīta","JJ","","_","_"
2,"idaṃ","_","_","ida","PRD","","_","_"
3,"sarvaṃ","_","_","sarva","JQ","","_","_"
4,"pratibhāti","_","_","pratibhā","V","pratibhā","_","_"
5,"sma","_","_","sma","CX","","_","_"
6,"saṃjaya","_","_","saṃjaya","NC","","_","_"
1,"_","_","_","yatra","CX","","_","_"
2,"_","_","_","īdṛśa","JJ","","_","_"
3,"balaṃ","_","_","bala","NC","","_","_"
4,"ghoraṃ","_","_","ghora","JJ","","_","_"
5,"_","_","_","na","CNG","","_","_"
6,"_","_","_","tar","V","tṛ","_","_"
7,"yudhi","_","_","yudh","NC","","_","_"
8,"pāṇḍavān","_","_","pāṇḍava","NC","","_","_"
1,"athavā","_","_","athavā","CX","","_","_"
2,"_","_","_","pāṇḍava","NC","","_","_"
3,"_","_","_","artha","NC","","_","_"
4,"_","_","_","deva","NC","","_","_"
5,"_","_","_","tatra","CAD","","_","_"
6,"samāgatāḥ","_","_","samāga","PPP","","_","_"
1,"yudhyante","_","_","yudh","V","yudh","_","_"
2,"māmakaṃ","_","_","māmaka","JJ","","_","_"
3,"sainyaṃ","_","_","sainya","NC","","_","_"
4,"yad","_","_","yat","CSB","","_","_"
5,"avadhyanta","_","_","vadh","V","vadh","_","_"
6,"saṃjaya","_","_","saṃjaya","NC","","_","_"
1,"ukto","_","_","vac","PPP","","_","_"
2,"hi","_","_","hi","CX","","_","_"
3,"_","_","_","vidura","NC","","_","_"
4,"_","_","_","iha","CAD","","_","_"
5,"hitaṃ","_","_","hita","JJ","","_","_"
6,"pathyaṃ","_","_","pathya","JJ","","_","_"
7,"ca","_","_","ca","CCD","","_","_"
8,"saṃjaya","_","_","saṃjaya","NC","","_","_"
1,"na","_","_","na","CNG","","_","_"
2,"ca","_","_","ca","CCD","","_","_"
3,"gṛhṇāti","_","_","grah","V","grah","_","_"
4,"_","_","_","tad","PRD","","_","_"
5,"_","_","_","manda","JJ","","_","_"
6,"putro","_","_","putra","NC","","_","_"
7,"duryodhano","_","_","duryodhana","NC","","_","_"
8,"mama","_","_","mat","PPR","","_","_"
1,"tasya","_","_","tad","PRD","","_","_"
2,"manye","_","_","man","V","man","_","_"
3,"matiḥ","_","_","mati","NC","","_","_"
4,"pūrvaṃ","_","_","pūrva","CX","","_","_"
5,"_","_","_","sarva","JQ","","_","_"
6,"_","_","_","jña","JJ","","_","_"
7,"mahātmanaḥ","_","_","mahātman","JJ","","_","_"
1,"āsīd","_","_","as","V","as","_","_"
2,"yathāgataṃ","_","_","yathāgata","JJ","","_","_"
3,"tāta","_","_","tāta","NC","","_","_"
4,"yena","_","_","yad","PRL","","_","_"
5,"dṛṣṭam","_","_","dṛś","PPP","","_","_"
6,"idaṃ","_","_","ida","PRD","","_","_"
7,"purā","_","_","purā","CX","","_","_"
1,"athavā","_","_","athavā","CX","","_","_"
2,"bhāvyam","_","_","bhū","KDG","","_","_"
3,"evaṃ","_","_","eva","CX","","_","_"
4,"hi","_","_","hi","CX","","_","_"
5,"_","_","_","saṃjaya","NC","","_","_"
6,"_","_","_","tad","PRD","","_","_"
7,"sarvathā","_","_","sarvathā","CX","","_","_"
1,"purā","_","_","purā","CX","","_","_"
2,"dhātrā","_","_","dhātṛ","NC","","_","_"
3,"yathā","_","_","yathā","CCM","","_","_"
4,"sṛṣṭaṃ","_","_","sṛj","PPP","","_","_"
5,"tat","_","_","tad","PRD","","_","_"
6,"tathā","_","_","tathā","CX","","_","_"
7,"na","_","_","na","CNG","","_","_"
8,"tad","_","_","tad","PRD","","_","_"
9,"anyathā","_","_","anyathā","CX","","_","_"
