"WordID","word","NormSTEM","suffix","lemma","PoS","Root","NormSuffix","NormWord"
1,"apaśyaṃ","_","_","paś","V","paś","_","_"
2,"tvā","_","_","tvat","PPR","","_","_"
3,"manasā","_","_","manas","NC","","_","_"
4,"cekitānaṃ","_","_","cekit","KDP","","_","_"
5,"tapaso","_","_","tapas","NC","","_","_"
6,"jātaṃ","_","_","jan","PPP","","_","_"
7,"tapaso","_","_","tapas","NC","","_","_"
8,"vibhūtam","_","_","vibhū","PPP","","_","_"
1,"iha","_","_","iha","CAD","","_","_"
2,"prajām","_","_","prajā","NC","","_","_"
3,"iha","_","_","iha","CAD","","_","_"
4,"rayiṃ","_","_","rayi","NC","","_","_"
5,"rarāṇaḥ","_","_","rā","KDP","","_","_"
6,"pra","_","_","pra","CADP","","_","_"
7,"jāyasva","_","_","jan","V","jan","_","_"
8,"prajayā","_","_","prajā","NC","","_","_"
9,"_","_","_","putra","NC","","_","_"
10,"_","_","_","kāma","NC","","_","_"
1,"apaśyaṃ","_","_","paś","V","paś","_","_"
2,"tvā","_","_","tvat","PPR","","_","_"
3,"manasā","_","_","manas","NC","","_","_"
4,"dīdhyānāṃ","_","_","dhī","KDP","","_","_"
5,"svāyāṃ","_","_","sva","JJ","","_","_"
6,"tanū","_","_","tanū","NC","","_","_"
7,"ṛtvye","_","_","ṛtvya","JJ","","_","_"
8,"nādhamānām","_","_","nādh","KDP","","_","_"
1,"upa","_","_","upa","CADP","","_","_"
2,"mām","_","_","mat","PPR","","_","_"
3,"uccā","_","_","uccā","CX","","_","_"
4,"yuvatir","_","_","yuvati","NC","","_","_"
5,"babhūyāḥ","_","_","bhav","V","bhū","_","_"
6,"pra","_","_","pra","CADP","","_","_"
7,"jāyasva","_","_","jan","V","jan","_","_"
8,"prajayā","_","_","prajā","NC","","_","_"
9,"_","_","_","putra","NC","","_","_"
10,"_","_","_","kāma","NC","","_","_"
1,"ahaṃ","_","_","mat","PPR","","_","_"
2,"garbham","_","_","garbha","NC","","_","_"
3,"adadhām","_","_","dadh","V","dhā","_","_"
4,"oṣadhīṣv","_","_","oṣadhī","NC","","_","_"
5,"ahaṃ","_","_","mat","PPR","","_","_"
6,"viśveṣu","_","_","viśva","JQ","","_","_"
7,"bhuvaneṣv","_","_","bhuvana","NC","","_","_"
8,"antaḥ","_","_","antar","CAD","","_","_"
1,"aham","_","_","mat","PPR","","_","_"
2,"prajā","_","_","prajā","NC","","_","_"
3,"ajanayam","_","_","janay","V","janay","_","_"
4,"pṛthivyām","_","_","pṛthivī","NC","","_","_"
5,"ahaṃ","_","_","mat","PPR","","_","_"
6,"janibhyo","_","_","jani","NC","","_","_"
7,"aparīṣu","_","_","aparī","NC","","_","_"
8,"putrān","_","_","putra","NC","","_","_"
