"WordID","word","NormSTEM","suffix","lemma","PoS","Root","NormSuffix","NormWord"
1,"etaṃ","_","_","tad","PRD","","_","_"
2,"bhāgaṃ","_","_","bhāga","NC","","_","_"
3,"pari","_","_","pari","CADP","","_","_"
4,"dadāmi","_","_","dad","V","dā","_","_"
5,"vidvān","_","_","vid","KDP","","_","_"
6,"viśvakarman","_","_","viśvakarman","NC","","_","_"
7,"_","_","_","prathama","JJ","","_","_"
8,"_","_","_","jā","JJ","","_","_"
9,"ṛtasya","_","_","ṛta","NC","","_","_"
1,"asmābhir","_","_","mat","PPR","","_","_"
2,"dattaṃ","_","_","dā","PPP","","_","_"
3,"jarasaḥ","_","_","jaras","NC","","_","_"
4,"parastād","_","_","parastāt","CX","","_","_"
5,"_","_","_","a","CNG","","_","_"
6,"_","_","_","chid","PPP","","_","_"
7,"tantum","_","_","tantu","NC","","_","_"
8,"anu","_","_","anu","CADP","","_","_"
9,"saṃ","_","_","sa","CADP","","_","_"
10,"tarema","_","_","tar","V","tṛ","_","_"
1,"tataṃ","_","_","tan","PPP","","_","_"
2,"tantum","_","_","tantu","NC","","_","_"
3,"anv","_","_","anu","CADP","","_","_"
4,"eke","_","_","eka","PPX","","_","_"
5,"taranti","_","_","tar","V","tṛ","_","_"
6,"yeṣāṃ","_","_","yad","PRL","","_","_"
7,"dattaṃ","_","_","dā","PPP","","_","_"
8,"pitryam","_","_","pitrya","JJ","","_","_"
9,"āyanena","_","_","āyana","NC","","_","_"
1,"_","_","_","a","CNG","","_","_"
2,"_","_","_","bandhu","NC","","_","_"
3,"eke","_","_","eka","PPX","","_","_"
4,"dadataḥ","_","_","dā","KDP","","_","_"
5,"prayacchanto","_","_","praya","KDP","","_","_"
6,"dātuṃ","_","_","dā","CGDI","","_","_"
7,"_","_","_","ced","CX","","_","_"
8,"_","_","_","śikṣ","V","śikṣ","_","_"
9,"_","_","_","tad","PRD","","_","_"
10,"svarga","_","_","svarga","NC","","_","_"
11,"eva","_","_","eva","CEM","","_","_"
1,"anvārabhethām","_","_","anvārabh","V","anvārabh","_","_"
2,"anusaṃrabhethām","_","_","anusaṃrabh","V","anusaṃrabh","_","_"
3,"etaṃ","_","_","tad","PRD","","_","_"
4,"lokaṃ","_","_","loka","NC","","_","_"
5,"śraddadhānāḥ","_","_","śraddhā","KDP","","_","_"
6,"sacante","_","_","sac","V","sac","_","_"
1,"yad","_","_","yad","PRL","","_","_"
2,"vāṃ","_","_","tvat","PPR","","_","_"
3,"pakvaṃ","_","_","pakva","JJ","","_","_"
4,"pariviṣṭam","_","_","pariviṣ","PPP","","_","_"
5,"agnau","_","_","agni","NC","","_","_"
6,"tasya","_","_","tad","PRD","","_","_"
7,"guptaye","_","_","gupti","NC","","_","_"
8,"dampatī","_","_","dampati","NC","","_","_"
9,"saṃ","_","_","sa","CADP","","_","_"
10,"śrayethām","_","_","śray","V","śri","_","_"
1,"yajñam","_","_","yajña","NC","","_","_"
2,"yantaṃ","_","_","i","KDP","","_","_"
3,"manasā","_","_","manas","NC","","_","_"
4,"bṛhantam","_","_","bṛhat","JJ","","_","_"
5,"anvārohāmi","_","_","anvāruh","V","anvāruh","_","_"
6,"tapasā","_","_","tapas","NC","","_","_"
7,"_","_","_","sa_saha","CX","","_","_"
8,"_","_","_","yoni","NC","","_","_"
1,"upahūtā","_","_","upahvā","PPP","","_","_"
2,"agne","_","_","agni","NC","","_","_"
3,"jarasaḥ","_","_","jaras","NC","","_","_"
4,"parastāt","_","_","parastāt","CX","","_","_"
5,"tṛtīye","_","_","tṛtīya","JJ","","_","_"
6,"nāke","_","_","nāka","NC","","_","_"
7,"sadhamādaṃ","_","_","sadhamāda","NC","","_","_"
8,"madema","_","_","mand","V","mand","_","_"
1,"śuddhāḥ","_","_","śudh","PPP","","_","_"
2,"pūtā","_","_","pū","PPP","","_","_"
3,"yoṣito","_","_","yoṣit","NC","","_","_"
4,"yajñiyā","_","_","yajñiya","JJ","","_","_"
5,"imā","_","_","ida","PRD","","_","_"
6,"brahmaṇāṃ","_","_","brahman","NC","","_","_"
7,"hasteṣu","_","_","hasta","NC","","_","_"
8,"prapṛthak","_","_","prapṛthak","CX","","_","_"
9,"sādayāmi","_","_","sīd","V","sad","_","_"
1,"_","_","_","yad","PRL","","_","_"
2,"_","_","_","kāma","NC","","_","_"
3,"idaṃ","_","_","ida","PRD","","_","_"
4,"abhiṣiñcāmi","_","_","abhiṣic","V","abhiṣic","_","_"
5,"vo","_","_","tvat","PPR","","_","_"
6,"'haṃ","_","_","mat","PPR","","_","_"
7,"indro","_","_","indra","NC","","_","_"
8,"_","_","_","marutvat","JJ","","_","_"
9,"_","_","_","tad","PRD","","_","_"
10,"dadātu","_","_","dad","V","dā","_","_"
11,"tan","_","_","tad","PRD","","_","_"
12,"me","_","_","mat","PPR","","_","_"
