"WordID","word","NormSTEM","suffix","lemma","PoS","Root","NormSuffix","NormWord"
1,"ā","_","_","ā","CADP","","_","_"
2,"rohata","_","_","roh","V","ruh","_","_"
3,"janitrīṃ","_","_","janitrī","NC","","_","_"
4,"jātavedasaḥ","_","_","jātavedas","NC","","_","_"
5,"_","_","_","pitṛ","NC","","_","_"
6,"_","_","_","yāna","JJ","","_","_"
7,"saṃ","_","_","sa","CADP","","_","_"
8,"va","_","_","tvat","PPR","","_","_"
9,"ā","_","_","ā","CADP","","_","_"
10,"rohayāmi","_","_","rohay","V","rohay","_","_"
1,"_","_","_","vah","V","vah","_","_"
2,"_","_","_","havya","NC","","_","_"
3,"_","_","_","iṣ","PPP","","_","_"
4,"havyavāha","_","_","havyavāha","NC","","_","_"
5,"ījānaṃ","_","_","yaj","KDP","","_","_"
6,"yuktāḥ","_","_","yuj","PPP","","_","_"
7,"_","_","_","su","CAD","","_","_"
8,"_","_","_","kṛt","JJ","","_","_"
9,"dhatta","_","_","dadh","V","dhā","_","_"
10,"loke","_","_","loka","NC","","_","_"
1,"devā","_","_","deva","NC","","_","_"
2,"yajñam","_","_","yajña","NC","","_","_"
3,"ṛtavaḥ","_","_","ṛtu","NC","","_","_"
4,"kalpayanti","_","_","kalp","V","kḷp","_","_"
5,"haviḥ","_","_","havis","NC","","_","_"
6,"puroḍāśaṃ","_","_","puroḍāśa","NC","","_","_"
7,"sruco","_","_","sruc","NC","","_","_"
8,"yajñāyudhāni","_","_","yajñāyudha","NC","","_","_"
1,"tebhir","_","_","tad","PRD","","_","_"
2,"yāhi","_","_","yā","V","yā","_","_"
3,"pathibhir","_","_","pathin","NC","","_","_"
4,"_","_","_","deva","NC","","_","_"
5,"_","_","_","yāna","JJ","","_","_"
6,"yair","_","_","yad","PRL","","_","_"
7,"ījānāḥ","_","_","yaj","KDP","","_","_"
8,"svargaṃ","_","_","svarga","NC","","_","_"
9,"yanti","_","_","e","V","i","_","_"
10,"lokam","_","_","loka","NC","","_","_"
1,"ṛtasya","_","_","ṛta","NC","","_","_"
2,"panthām","_","_","pathin","NC","","_","_"
3,"anu","_","_","anu","CADP","","_","_"
4,"paśya","_","_","paś","V","paś","_","_"
5,"sādhv","_","_","sādhu","JJ","","_","_"
6,"aṅgirasaḥ","_","_","aṅgiras","NC","","_","_"
7,"_","_","_","su","CAD","","_","_"
8,"_","_","_","kṛt","JJ","","_","_"
9,"yena","_","_","yad","PRL","","_","_"
10,"yanti","_","_","e","V","i","_","_"
1,"tebhir","_","_","tad","PRD","","_","_"
2,"yāhi","_","_","yā","V","yā","_","_"
3,"pathibhiḥ","_","_","pathin","NC","","_","_"
4,"svargaṃ","_","_","svarga","NC","","_","_"
5,"_","_","_","yatra","CX","","_","_"
6,"_","_","_","āditya","NC","","_","_"
7,"madhu","_","_","madhu","NC","","_","_"
8,"bhakṣayanti","_","_","bhakṣay","V","bhakṣay","_","_"
9,"tṛtīye","_","_","tṛtīya","JJ","","_","_"
10,"nāke","_","_","nāka","NC","","_","_"
11,"adhi","_","_","adhi","CADP","","_","_"
12,"vi","_","_","vi","CADP","","_","_"
13,"śrayasva","_","_","śray","V","śri","_","_"
1,"trayaḥ","_","_","tri","NUM","","_","_"
2,"suparṇā","_","_","suparṇa","NC","","_","_"
3,"uparasya","_","_","upara","JJ","","_","_"
4,"māyū","_","_","māyu","NC","","_","_"
5,"nākasya","_","_","nāka","NC","","_","_"
6,"pṛṣṭhe","_","_","pṛṣṭha","NC","","_","_"
7,"adhi","_","_","adhi","CADP","","_","_"
8,"viṣṭapi","_","_","viṣṭap","NC","","_","_"
9,"śritāḥ","_","_","śri","PPP","","_","_"
1,"svargā","_","_","svarga","NC","","_","_"
2,"lokā","_","_","loka","NC","","_","_"
3,"amṛtena","_","_","amṛta","NC","","_","_"
4,"viṣṭhā","_","_","viṣṭhā","NC","","_","_"
5,"iṣam","_","_","iṣ","NC","","_","_"
6,"ūrjaṃ","_","_","ūrj","NC","","_","_"
7,"yajamānāya","_","_","yaj","KDP","","_","_"
8,"duhrām","_","_","duh","V","duh","_","_"
1,"juhūr","_","_","juhū","NC","","_","_"
2,"dādhāra","_","_","dhar","V","dhṛ","_","_"
3,"dyām","_","_","div","NC","","_","_"
4,"upabhṛd","_","_","upabhṛt","NC","","_","_"
5,"antarikṣaṃ","_","_","antarikṣa","NC","","_","_"
6,"dhruvā","_","_","dhruvā","NC","","_","_"
7,"dādhāra","_","_","dhar","V","dhṛ","_","_"
8,"pṛthivīṃ","_","_","pṛthivī","NC","","_","_"
9,"pratiṣṭhām","_","_","pratiṣṭhā","NC","","_","_"
1,"_","_","_","prati","CADP","","_","_"
2,"_","_","_","ida","PRD","","_","_"
3,"lokā","_","_","loka","NC","","_","_"
4,"_","_","_","ghṛta","NC","","_","_"
5,"_","_","_","pṛṣṭha","NC","","_","_"
6,"svargāḥ","_","_","svarga","NC","","_","_"
7,"kāmaṃ","_","_","kāma","NC","","_","_"
8,"kāmaṃ","_","_","kāma","NC","","_","_"
9,"yajamānāya","_","_","yaj","KDP","","_","_"
10,"duhrām","_","_","duh","V","duh","_","_"
1,"dhruva","_","_","dhruvā","NC","","_","_"
2,"ā","_","_","ā","CADP","","_","_"
3,"roha","_","_","roh","V","ruh","_","_"
4,"pṛthivīṃ","_","_","pṛthivī","NC","","_","_"
5,"_","_","_","viśva","JQ","","_","_"
6,"_","_","_","bhojas","NC","","_","_"
7,"antarikṣam","_","_","antarikṣa","NC","","_","_"
8,"upabhṛd","_","_","upabhṛt","NC","","_","_"
9,"ā","_","_","ā","CADP","","_","_"
10,"kramasva","_","_","kram","V","kram","_","_"
1,"juhu","_","_","juhū","NC","","_","_"
2,"dyāṃ","_","_","div","NC","","_","_"
3,"gaccha","_","_","ga","V","ga","_","_"
4,"yajamānena","_","_","yaj","KDP","","_","_"
5,"sākaṃ","_","_","sāka","CX","","_","_"
6,"sruveṇa","_","_","sruva","NC","","_","_"
7,"vatsena","_","_","vatsa","NC","","_","_"
8,"diśaḥ","_","_","diś","NC","","_","_"
9,"prapīnāḥ","_","_","prapyā","PPP","","_","_"
10,"sarvā","_","_","sarva","JQ","","_","_"
11,"_","_","_","duh","V","duh","_","_"
12,"_","_","_","a","CNG","","_","_"
13,"_","_","_","hṛṇīy","KDP","","_","_"
1,"tīrthais","_","_","tīrtha","NC","","_","_"
2,"taranti","_","_","tar","V","tṛ","_","_"
3,"pravato","_","_","pravat","NC","","_","_"
4,"mahīr","_","_","mahi","JJ","","_","_"
5,"iti","_","_","iti","CQT","","_","_"
6,"_","_","_","yajña","NC","","_","_"
7,"_","_","_","kṛt","JJ","","_","_"
8,"_","_","_","su","CAD","","_","_"
9,"_","_","_","kṛt","JJ","","_","_"
10,"yena","_","_","yad","PRL","","_","_"
11,"yanti","_","_","e","V","i","_","_"
1,"_","_","_","atra","CAD","","_","_"
2,"_","_","_","dadh","V","dhā","_","_"
3,"yajamānāya","_","_","yaj","KDP","","_","_"
4,"lokaṃ","_","_","loka","NC","","_","_"
5,"diśo","_","_","diś","NC","","_","_"
6,"bhūtāni","_","_","bhūta","NC","","_","_"
7,"yad","_","_","yat","CSB","","_","_"
8,"akalpayanta","_","_","kalpay","V","kalpay","_","_"
1,"aṅgirasām","_","_","aṅgiras","NC","","_","_"
2,"ayanaṃ","_","_","ayana","NC","","_","_"
3,"pūrvo","_","_","pūrva","PPX","","_","_"
4,"agnir","_","_","agni","NC","","_","_"
5,"ādityānām","_","_","āditya","NC","","_","_"
6,"ayanaṃ","_","_","ayana","NC","","_","_"
7,"gārhapatyo","_","_","gārhapatya","NC","","_","_"
8,"dakṣiṇānām","_","_","dakṣiṇā","NC","","_","_"
9,"ayanaṃ","_","_","ayana","NC","","_","_"
10,"dakṣiṇāgniḥ","_","_","dakṣiṇāgni","NC","","_","_"
1,"mahimānam","_","_","mahiman","NC","","_","_"
2,"agner","_","_","agni","NC","","_","_"
3,"vihitasya","_","_","vidhā","PPP","","_","_"
4,"brahmaṇā","_","_","brahman","NC","","_","_"
5,"samaṅgaḥ","_","_","samaṅga","JJ","","_","_"
6,"sarva","_","_","sarva","JQ","","_","_"
7,"upa","_","_","upa","CADP","","_","_"
8,"yāhi","_","_","yā","V","yā","_","_"
9,"śagmaḥ","_","_","śagma","JJ","","_","_"
1,"pūrvo","_","_","pūrva","PPX","","_","_"
2,"agniṣ","_","_","agni","NC","","_","_"
3,"ṭvā","_","_","tvat","PPR","","_","_"
4,"tapatu","_","_","tap","V","tap","_","_"
5,"śaṃ","_","_","śa","NC","","_","_"
6,"purastāc","_","_","purastāt","CX","","_","_"
7,"chaṃ","_","_","śa","NC","","_","_"
8,"paścāt","_","_","paścāt","CAD","","_","_"
9,"tapatu","_","_","tap","V","tap","_","_"
10,"gārhapatyaḥ","_","_","gārhapatya","NC","","_","_"
1,"dakṣiṇāgniṣ","_","_","dakṣiṇāgni","NC","","_","_"
2,"ṭe","_","_","tvat","PPR","","_","_"
3,"tapatu","_","_","tap","V","tap","_","_"
4,"śarma","_","_","śarman","NC","","_","_"
5,"_","_","_","varman","NC","","_","_"
6,"_","_","_","uttaratas","CX","","_","_"
7,"madhyato","_","_","madhya","NC","","_","_"
8,"antarikṣād","_","_","antarikṣa","NC","","_","_"
9,"_","_","_","diś","NC","","_","_"
10,"_","_","_","diś","NC","","_","_"
11,"agne","_","_","agni","NC","","_","_"
12,"pari","_","_","pari","CADP","","_","_"
13,"pāhi","_","_","pib","V","pā","_","_"
14,"ghorāt","_","_","ghora","JJ","","_","_"
1,"yūyam","_","_","tvat","PPR","","_","_"
2,"agne","_","_","agni","NC","","_","_"
3,"śaṃtamābhis","_","_","śaṃtama","JJ","","_","_"
4,"tanūbhir","_","_","tanū","NC","","_","_"
5,"ījānam","_","_","yaj","KDP","","_","_"
6,"abhi","_","_","abhi","CADP","","_","_"
7,"lokaṃ","_","_","loka","NC","","_","_"
8,"svargam","_","_","svarga","NC","","_","_"
1,"aśvā","_","_","aśva","NC","","_","_"
2,"bhūtvā","_","_","bhū","CGDA","","_","_"
3,"_","_","_","pṛṣṭi","NC","","_","_"
4,"_","_","_","vāh","NC","","_","_"
5,"vahātha","_","_","vah","V","vah","_","_"
6,"yatra","_","_","yatra","CX","","_","_"
7,"devaiḥ","_","_","deva","NC","","_","_"
8,"sadhamādaṃ","_","_","sadhamāda","NC","","_","_"
9,"madanti","_","_","mat","V","mat","_","_"
1,"śam","_","_","śa","NC","","_","_"
2,"agne","_","_","agni","NC","","_","_"
3,"paścāt","_","_","paścāt","CAD","","_","_"
4,"tapa","_","_","tap","V","tap","_","_"
5,"śaṃ","_","_","śa","NC","","_","_"
6,"purastāc","_","_","purastāt","CX","","_","_"
7,"cham","_","_","śa","NC","","_","_"
8,"uttarāc","_","_","uttarāt","CX","","_","_"
9,"cham","_","_","śa","NC","","_","_"
10,"adharāt","_","_","adharāt","CX","","_","_"
11,"_","_","_","tap","V","tap","_","_"
12,"_","_","_","a","PRD","","_","_"
1,"ekas","_","_","eka","PPX","","_","_"
2,"tredhā","_","_","tredhā","CX","","_","_"
3,"vihito","_","_","vidhā","PPP","","_","_"
4,"jātavedaḥ","_","_","jātavedas","NC","","_","_"
5,"samyag","_","_","samyak","CX","","_","_"
6,"enaṃ","_","_","a","PRD","","_","_"
7,"dhehi","_","_","dadh","V","dhā","_","_"
8,"_","_","_","su","CAD","","_","_"
9,"_","_","_","kṛt","JJ","","_","_"
10,"u","_","_","u","CEM","","_","_"
11,"loke","_","_","loka","NC","","_","_"
1,"śam","_","_","śa","NC","","_","_"
2,"agnayaḥ","_","_","agni","NC","","_","_"
3,"samiddhā","_","_","samindh","PPP","","_","_"
4,"ā","_","_","ā","CADP","","_","_"
5,"rabhantāṃ","_","_","rabh","V","rabh","_","_"
6,"prājāpatyaṃ","_","_","prājāpatya","JJ","","_","_"
7,"medhyaṃ","_","_","medhya","JJ","","_","_"
8,"jātavedasaḥ","_","_","jātavedas","NC","","_","_"
1,"śṛtaṃ","_","_","śrī","PPP","","_","_"
2,"kṛṇvanta","_","_","kṛ","KDP","","_","_"
3,"iha","_","_","iha","CAD","","_","_"
4,"_","_","_","mā","CNG","","_","_"
5,"_","_","_","ava","CX","","_","_"
6,"cikṣipan","_","_","kṣip","V","kṣip","_","_"
1,"yajña","_","_","yajña","NC","","_","_"
2,"eti","_","_","e","V","i","_","_"
3,"vitataḥ","_","_","vitan","PPP","","_","_"
4,"kalpamāna","_","_","kﾱp","KDP","","_","_"
5,"ījānam","_","_","yaj","KDP","","_","_"
6,"abhi","_","_","abhi","CADP","","_","_"
7,"lokaṃ","_","_","loka","NC","","_","_"
8,"svargam","_","_","svarga","NC","","_","_"
1,"tam","_","_","tad","PRD","","_","_"
2,"agnayaḥ","_","_","agni","NC","","_","_"
3,"_","_","_","sarva","JQ","","_","_"
4,"_","_","_","hu","PPP","","_","_"
5,"juṣantāṃ","_","_","juṣ","V","juṣ","_","_"
6,"prājāpatyaṃ","_","_","prājāpatya","JJ","","_","_"
7,"medhyaṃ","_","_","medhya","JJ","","_","_"
8,"jātavedasaḥ","_","_","jātavedas","NC","","_","_"
1,"ījānaś","_","_","yaj","KDP","","_","_"
2,"citam","_","_","cit","NC","","_","_"
3,"ārukṣad","_","_","āroh","V","āruh","_","_"
4,"agniṃ","_","_","agni","NC","","_","_"
5,"nākasya","_","_","nāka","NC","","_","_"
6,"pṛṣṭhād","_","_","pṛṣṭha","NC","","_","_"
7,"divam","_","_","div","NC","","_","_"
8,"utpatiṣyan","_","_","utpat","KDP","","_","_"
1,"tasmai","_","_","tad","PRD","","_","_"
2,"pra","_","_","pra","CADP","","_","_"
3,"bhāti","_","_","bhā","V","bhā","_","_"
4,"nabhaso","_","_","nabhas","NC","","_","_"
5,"jyotiṣīmānt","_","_","jyotiṣīmat","JJ","","_","_"
6,"svargaḥ","_","_","svarga","NC","","_","_"
7,"panthāḥ","_","_","pathin","NC","","_","_"
8,"_","_","_","su","CAD","","_","_"
9,"_","_","_","kṛt","JJ","","_","_"
10,"_","_","_","deva","NC","","_","_"
11,"_","_","_","yāna","JJ","","_","_"
1,"agnir","_","_","agni","NC","","_","_"
2,"_","_","_","hotṛ","NC","","_","_"
3,"_","_","_","adhvaryu","NC","","_","_"
4,"ṭe","_","_","tvat","PPR","","_","_"
5,"bṛhaspatir","_","_","bṛhaspati","NC","","_","_"
6,"indro","_","_","indra","NC","","_","_"
7,"brahmā","_","_","brahman","NC","","_","_"
8,"dakṣiṇatas","_","_","dakṣiṇatas","CX","","_","_"
9,"te","_","_","tvat","PPR","","_","_"
10,"astu","_","_","as","V","as","_","_"
1,"huto","_","_","hu","PPP","","_","_"
2,"'yaṃ","_","_","ida","PRD","","_","_"
3,"saṃsthito","_","_","saṃsthā","PPP","","_","_"
4,"yajña","_","_","yajña","NC","","_","_"
5,"eti","_","_","e","V","i","_","_"
6,"yatra","_","_","yatra","CX","","_","_"
7,"pūrvam","_","_","pūrva","PPX","","_","_"
8,"ayanaṃ","_","_","ayana","NC","","_","_"
9,"hutānām","_","_","hu","PPP","","_","_"
1,"apūpavān","_","_","apūpavat","JJ","","_","_"
2,"kṣīravāṃś","_","_","kṣīravat","JJ","","_","_"
3,"carur","_","_","caru","NC","","_","_"
4,"_","_","_","ā","CADP","","_","_"
5,"_","_","_","iha","CAD","","_","_"
6,"sīdatu","_","_","sīd","V","sad","_","_"
1,"_","_","_","loka","NC","","_","_"
2,"_","_","_","kṛt","JJ","","_","_"
3,"pathikṛto","_","_","pathikṛt","JJ","","_","_"
4,"yajāmahe","_","_","yaj","V","yaj","_","_"
5,"ye","_","_","yad","PRL","","_","_"
6,"devānāṃ","_","_","deva","NC","","_","_"
7,"_","_","_","hu","PPP","","_","_"
8,"_","_","_","bhāga","NC","","_","_"
9,"iha","_","_","iha","CAD","","_","_"
10,"stha","_","_","as","V","as","_","_"
1,"apūpavān","_","_","apūpavat","JJ","","_","_"
2,"dadhivāṃś","_","_","dadhivat","JJ","","_","_"
3,"carur","_","_","caru","NC","","_","_"
4,"_","_","_","ā","CADP","","_","_"
5,"_","_","_","iha","CAD","","_","_"
6,"sīdatu","_","_","sīd","V","sad","_","_"
1,"_","_","_","loka","NC","","_","_"
2,"_","_","_","kṛt","JJ","","_","_"
3,"pathikṛto","_","_","pathikṛt","JJ","","_","_"
4,"yajāmahe","_","_","yaj","V","yaj","_","_"
5,"ye","_","_","yad","PRL","","_","_"
6,"devānāṃ","_","_","deva","NC","","_","_"
7,"_","_","_","hu","PPP","","_","_"
8,"_","_","_","bhāga","NC","","_","_"
9,"iha","_","_","iha","CAD","","_","_"
10,"stha","_","_","as","V","as","_","_"
1,"apūpavān","_","_","apūpavat","JJ","","_","_"
2,"drapsavāṃś","_","_","drapsavat","JJ","","_","_"
3,"carur","_","_","caru","NC","","_","_"
4,"_","_","_","ā","CADP","","_","_"
5,"_","_","_","iha","CAD","","_","_"
6,"sīdatu","_","_","sīd","V","sad","_","_"
1,"_","_","_","loka","NC","","_","_"
2,"_","_","_","kṛt","JJ","","_","_"
3,"pathikṛto","_","_","pathikṛt","JJ","","_","_"
4,"yajāmahe","_","_","yaj","V","yaj","_","_"
5,"ye","_","_","yad","PRL","","_","_"
6,"devānāṃ","_","_","deva","NC","","_","_"
7,"_","_","_","hu","PPP","","_","_"
8,"_","_","_","bhāga","NC","","_","_"
9,"iha","_","_","iha","CAD","","_","_"
10,"stha","_","_","as","V","as","_","_"
1,"apūpavān","_","_","apūpavat","JJ","","_","_"
2,"ghṛtavāṃś","_","_","ghṛtavat","JJ","","_","_"
3,"carur","_","_","caru","NC","","_","_"
4,"_","_","_","ā","CADP","","_","_"
5,"_","_","_","iha","CAD","","_","_"
6,"sīdatu","_","_","sīd","V","sad","_","_"
1,"_","_","_","loka","NC","","_","_"
2,"_","_","_","kṛt","JJ","","_","_"
3,"pathikṛto","_","_","pathikṛt","JJ","","_","_"
4,"yajāmahe","_","_","yaj","V","yaj","_","_"
5,"ye","_","_","yad","PRL","","_","_"
6,"devānāṃ","_","_","deva","NC","","_","_"
7,"_","_","_","hu","PPP","","_","_"
8,"_","_","_","bhāga","NC","","_","_"
9,"iha","_","_","iha","CAD","","_","_"
10,"stha","_","_","as","V","as","_","_"
1,"apūpavān","_","_","apūpavat","JJ","","_","_"
2,"māṃsavāṃś","_","_","māṃsavat","JJ","","_","_"
3,"carur","_","_","caru","NC","","_","_"
4,"_","_","_","ā","CADP","","_","_"
5,"_","_","_","iha","CAD","","_","_"
6,"sīdatu","_","_","sīd","V","sad","_","_"
1,"_","_","_","loka","NC","","_","_"
2,"_","_","_","kṛt","JJ","","_","_"
3,"pathikṛto","_","_","pathikṛt","JJ","","_","_"
4,"yajāmahe","_","_","yaj","V","yaj","_","_"
5,"ye","_","_","yad","PRL","","_","_"
6,"devānāṃ","_","_","deva","NC","","_","_"
7,"_","_","_","hu","PPP","","_","_"
8,"_","_","_","bhāga","NC","","_","_"
9,"iha","_","_","iha","CAD","","_","_"
10,"stha","_","_","as","V","as","_","_"
1,"apūpavān","_","_","apūpavat","JJ","","_","_"
2,"annavāṃś","_","_","annavat","JJ","","_","_"
3,"carur","_","_","caru","NC","","_","_"
4,"_","_","_","ā","CADP","","_","_"
5,"_","_","_","iha","CAD","","_","_"
6,"sīdatu","_","_","sīd","V","sad","_","_"
1,"_","_","_","loka","NC","","_","_"
2,"_","_","_","kṛt","JJ","","_","_"
3,"pathikṛto","_","_","pathikṛt","JJ","","_","_"
4,"yajāmahe","_","_","yaj","V","yaj","_","_"
5,"ye","_","_","yad","PRL","","_","_"
6,"devānāṃ","_","_","deva","NC","","_","_"
7,"_","_","_","hu","PPP","","_","_"
8,"_","_","_","bhāga","NC","","_","_"
9,"iha","_","_","iha","CAD","","_","_"
10,"stha","_","_","as","V","as","_","_"
1,"apūpavān","_","_","apūpavat","JJ","","_","_"
2,"madhumāṃś","_","_","madhumat","JJ","","_","_"
3,"carur","_","_","caru","NC","","_","_"
4,"_","_","_","ā","CADP","","_","_"
5,"_","_","_","iha","CAD","","_","_"
6,"sīdatu","_","_","sīd","V","sad","_","_"
1,"_","_","_","loka","NC","","_","_"
2,"_","_","_","kṛt","JJ","","_","_"
3,"pathikṛto","_","_","pathikṛt","JJ","","_","_"
4,"yajāmahe","_","_","yaj","V","yaj","_","_"
5,"ye","_","_","yad","PRL","","_","_"
6,"devānāṃ","_","_","deva","NC","","_","_"
7,"_","_","_","hu","PPP","","_","_"
8,"_","_","_","bhāga","NC","","_","_"
9,"iha","_","_","iha","CAD","","_","_"
10,"stha","_","_","as","V","as","_","_"
1,"apūpavān","_","_","apūpavat","JJ","","_","_"
2,"rasavāṃś","_","_","rasavat","JJ","","_","_"
3,"carur","_","_","caru","NC","","_","_"
4,"_","_","_","ā","CADP","","_","_"
5,"_","_","_","iha","CAD","","_","_"
6,"sīdatu","_","_","sīd","V","sad","_","_"
1,"_","_","_","loka","NC","","_","_"
2,"_","_","_","kṛt","JJ","","_","_"
3,"pathikṛto","_","_","pathikṛt","JJ","","_","_"
4,"yajāmahe","_","_","yaj","V","yaj","_","_"
5,"ye","_","_","yad","PRL","","_","_"
6,"devānāṃ","_","_","deva","NC","","_","_"
7,"_","_","_","hu","PPP","","_","_"
8,"_","_","_","bhāga","NC","","_","_"
9,"iha","_","_","iha","CAD","","_","_"
10,"stha","_","_","as","V","as","_","_"
1,"apūpavān","_","_","apūpavat","JJ","","_","_"
2,"apavāṃś","_","_","apavat","JJ","","_","_"
3,"carur","_","_","caru","NC","","_","_"
4,"_","_","_","ā","CADP","","_","_"
5,"_","_","_","iha","CAD","","_","_"
6,"sīdatu","_","_","sīd","V","sad","_","_"
1,"_","_","_","loka","NC","","_","_"
2,"_","_","_","kṛt","JJ","","_","_"
3,"pathikṛto","_","_","pathikṛt","JJ","","_","_"
4,"yajāmahe","_","_","yaj","V","yaj","_","_"
5,"ye","_","_","yad","PRL","","_","_"
6,"devānāṃ","_","_","deva","NC","","_","_"
7,"_","_","_","hu","PPP","","_","_"
8,"_","_","_","bhāga","NC","","_","_"
9,"iha","_","_","iha","CAD","","_","_"
10,"stha","_","_","as","V","as","_","_"
1,"_","_","_","apūpa","NC","","_","_"
2,"a","_","_","alpha_privativum","PPP","","_","_"
2,"_","_","_","pidhā","PPP","","_","_"
3,"kumbhān","_","_","kumbha","NC","","_","_"
4,"yāṃs","_","_","yad","PRL","","_","_"
5,"te","_","_","tvat","PPR","","_","_"
6,"devā","_","_","deva","NC","","_","_"
7,"adhārayan","_","_","dhāray","V","dhāray","_","_"
1,"te","_","_","tad","PRD","","_","_"
2,"te","_","_","tvat","PPR","","_","_"
3,"santu","_","_","as","V","as","_","_"
4,"svadhāvanto","_","_","svadhāvat","JJ","","_","_"
5,"madhumanto","_","_","madhumat","JJ","","_","_"
6,"ghṛtaścutaḥ","_","_","ghṛtaścut","JJ","","_","_"
1,"yās","_","_","yad","PRL","","_","_"
2,"te","_","_","tvat","PPR","","_","_"
3,"dhānā","_","_","dhānā","NC","","_","_"
4,"anukirāmi","_","_","anukar","V","anukṛ","_","_"
5,"_","_","_","tila","NC","","_","_"
6,"_","_","_","miśra","JJ","","_","_"
7,"svadhāvatīḥ","_","_","svadhāvat","JJ","","_","_"
1,"tās","_","_","tad","PRD","","_","_"
2,"te","_","_","tvat","PPR","","_","_"
3,"_","_","_","as","V","as","_","_"
4,"_","_","_","udbhū","JJ","","_","_"
5,"prabhvīs","_","_","prabhu","JJ","","_","_"
6,"tās","_","_","tad","PRD","","_","_"
7,"te","_","_","tvat","PPR","","_","_"
8,"yamo","_","_","yama","NC","","_","_"
9,"_","_","_","rājan","NC","","_","_"
10,"_","_","_","anu","CADP","","_","_"
11,"manyatām","_","_","man","V","man","_","_"
1,"akṣitiṃ","_","_","akṣiti","NC","","_","_"
2,"bhūyasīm","_","_","bhūyas","JJ","","_","_"
1,"drapsaś","_","_","drapsa","NC","","_","_"
2,"caskanda","_","_","skand","V","skand","_","_"
3,"pṛthivīm","_","_","pṛthivī","NC","","_","_"
4,"anu","_","_","anu","CADP","","_","_"
5,"dyām","_","_","div","NC","","_","_"
6,"imaṃ","_","_","ida","PRD","","_","_"
7,"ca","_","_","ca","CCD","","_","_"
8,"yonim","_","_","yoni","NC","","_","_"
9,"anu","_","_","anu","CADP","","_","_"
10,"yaś","_","_","yad","PRL","","_","_"
11,"ca","_","_","ca","CCD","","_","_"
12,"pūrvaḥ","_","_","pūrva","PPX","","_","_"
1,"samānaṃ","_","_","samāna","JJ","","_","_"
2,"yonim","_","_","yoni","NC","","_","_"
3,"anu","_","_","anu","CADP","","_","_"
4,"saṃcarantaṃ","_","_","saṃcar","KDP","","_","_"
5,"drapsam","_","_","drapsa","NC","","_","_"
6,"juhomy","_","_","hu","V","hu","_","_"
7,"anu","_","_","anu","CADP","","_","_"
8,"sapta","_","_","saptan","NUM","","_","_"
9,"hotrāḥ","_","_","hotrā","NC","","_","_"
1,"_","_","_","śata","NUM","","_","_"
2,"_","_","_","dhārā","NC","","_","_"
3,"vāyum","_","_","vāyu","NC","","_","_"
4,"arkaṃ","_","_","arka","NC","","_","_"
5,"_","_","_","svar","NC","","_","_"
6,"_","_","_","vid","JJ","","_","_"
7,"_","_","_","nṛ","NC","","_","_"
8,"_","_","_","cakṣas","NC","","_","_"
9,"te","_","_","tad","PRD","","_","_"
10,"abhi","_","_","abhi","CADP","","_","_"
11,"cakṣate","_","_","cakṣ","V","cakṣ","_","_"
12,"rayim","_","_","rayi","NC","","_","_"
1,"ye","_","_","yad","PRL","","_","_"
2,"pṛṇanti","_","_","pṛ","V","pṛ","_","_"
3,"pra","_","_","pra","CADP","","_","_"
4,"ca","_","_","ca","CCD","","_","_"
5,"yacchanti","_","_","ya","V","ya","_","_"
6,"sarvadā","_","_","sarvadā","CX","","_","_"
7,"te","_","_","tad","PRD","","_","_"
8,"duhrate","_","_","duh","V","duh","_","_"
9,"dakṣiṇāṃ","_","_","dakṣiṇā","NC","","_","_"
10,"_","_","_","saptan","NUM","","_","_"
11,"_","_","_","mātṛ","NC","","_","_"
1,"kośaṃ","_","_","kośa","NC","","_","_"
2,"duhanti","_","_","duh","V","duh","_","_"
3,"kalaśaṃ","_","_","kalaśa","NC","","_","_"
4,"_","_","_","catur","NUM","","_","_"
5,"_","_","_","bila","NC","","_","_"
6,"iḍāṃ","_","_","iḍā","NC","","_","_"
7,"dhenuṃ","_","_","dhenu","NC","","_","_"
8,"madhumatīṃ","_","_","madhumat","JJ","","_","_"
9,"svastaye","_","_","svasti","NC","","_","_"
1,"ūrjaṃ","_","_","ūrj","NC","","_","_"
2,"madantīm","_","_","mat","KDP","","_","_"
3,"aditiṃ","_","_","aditi","NC","","_","_"
4,"janeṣv","_","_","jana","NC","","_","_"
5,"agne","_","_","agni","NC","","_","_"
6,"mā","_","_","mat","PPR","","_","_"
7,"hiṃsīḥ","_","_","hiṃs","V","hiṃs","_","_"
8,"parame","_","_","parama","JJ","","_","_"
9,"vyoman","_","_","vyoman","NC","","_","_"
1,"etat","_","_","tad","PRD","","_","_"
2,"te","_","_","tvat","PPR","","_","_"
3,"devaḥ","_","_","deva","NC","","_","_"
4,"savitā","_","_","savitṛ","NC","","_","_"
5,"vāso","_","_","vāsas","NC","","_","_"
6,"dadāti","_","_","dad","V","dā","_","_"
7,"bhartave","_","_","bhṛ","CGDI","","_","_"
1,"tat","_","_","tad","PRD","","_","_"
2,"tvaṃ","_","_","tvat","PPR","","_","_"
3,"yamasya","_","_","yama","NC","","_","_"
4,"rājye","_","_","rājya","NC","","_","_"
5,"vasānas","_","_","vas","KDP","","_","_"
6,"tārpyaṃ","_","_","tārpya","NC","","_","_"
7,"cara","_","_","car","V","car","_","_"
1,"dhānā","_","_","dhānā","NC","","_","_"
2,"dhenur","_","_","dhenu","NC","","_","_"
3,"abhavad","_","_","bhav","V","bhū","_","_"
4,"vatso","_","_","vatsa","NC","","_","_"
5,"asyās","_","_","ida","PRD","","_","_"
6,"tilo","_","_","tila","NC","","_","_"
7,"'bhavat","_","_","bhav","V","bhū","_","_"
1,"tāṃ","_","_","tad","PRD","","_","_"
2,"vai","_","_","vai","CX","","_","_"
3,"yamasya","_","_","yama","NC","","_","_"
4,"rājye","_","_","rājya","NC","","_","_"
5,"_","_","_","a","CNG","","_","_"
6,"_","_","_","kṣi","PPP","","_","_"
7,"upa","_","_","upa","CADP","","_","_"
8,"jīvati","_","_","jīv","V","jīv","_","_"
1,"etās","_","_","tad","PRD","","_","_"
2,"te","_","_","tvat","PPR","","_","_"
3,"asau","_","_","adas","PRD","","_","_"
4,"dhenavaḥ","_","_","dhenu","NC","","_","_"
5,"kāmadughā","_","_","kāmadughā","NC","","_","_"
6,"bhavantu","_","_","bhav","V","bhū","_","_"
1,"enīḥ","_","_","a","JJ","","_","_"
2,"śyenīḥ","_","_","śyenī","NC","","_","_"
3,"sarūpā","_","_","sarūpa","JJ","","_","_"
4,"virūpās","_","_","virūpa","JJ","","_","_"
5,"_","_","_","tila","NC","","_","_"
6,"_","_","_","vatsa","NC","","_","_"
7,"upa","_","_","upa","CADP","","_","_"
8,"tiṣṭhantu","_","_","tiṣṭh","V","sthā","_","_"
9,"_","_","_","tvat","PPR","","_","_"
10,"_","_","_","atra","CAD","","_","_"
1,"enīr","_","_","a","JJ","","_","_"
2,"dhānā","_","_","dhānā","NC","","_","_"
3,"hariṇīḥ","_","_","hariṇī","NC","","_","_"
4,"śyenīr","_","_","śyenī","NC","","_","_"
5,"asya","_","_","ida","PRD","","_","_"
6,"kṛṣṇā","_","_","kṛṣṇa","JJ","","_","_"
7,"dhānā","_","_","dhānā","NC","","_","_"
8,"rohiṇīr","_","_","rohita","JJ","","_","_"
9,"dhenavas","_","_","dhenu","NC","","_","_"
10,"te","_","_","tvat","PPR","","_","_"
1,"_","_","_","tila","NC","","_","_"
2,"_","_","_","vatsa","NC","","_","_"
3,"ūrjam","_","_","ūrj","NC","","_","_"
4,"asmai","_","_","ida","PRD","","_","_"
5,"duhānā","_","_","duh","KDP","","_","_"
6,"viśvāhā","_","_","viśvāhā","CX","","_","_"
7,"santv","_","_","as","V","as","_","_"
8,"_","_","_","an","CX","","_","_"
9,"_","_","_","apasphur","KDP","","_","_"
1,"vaiśvānare","_","_","vaiśvānara","NC","","_","_"
2,"havir","_","_","havis","NC","","_","_"
3,"idaṃ","_","_","ida","PRD","","_","_"
4,"juhomi","_","_","hu","V","hu","_","_"
5,"sāhasraṃ","_","_","sāhasra","JJ","","_","_"
6,"_","_","_","śata","NUM","","_","_"
7,"_","_","_","dhārā","NC","","_","_"
8,"utsam","_","_","utsa","NC","","_","_"
1,"sa","_","_","tad","PRD","","_","_"
2,"bibharti","_","_","bhṛ","V","bhṛ","_","_"
3,"pitaraṃ","_","_","pitṛ","NC","","_","_"
4,"pitāmahān","_","_","pitāmaha","NC","","_","_"
5,"prapitāmahān","_","_","prapitāmaha","NC","","_","_"
6,"bibharti","_","_","bhṛ","V","bhṛ","_","_"
7,"pinvamānaḥ","_","_","pinv","KDP","","_","_"
1,"_","_","_","sahasra","NUM","","_","_"
2,"_","_","_","dhārā","NC","","_","_"
3,"_","_","_","śata","NUM","","_","_"
4,"_","_","_","dhārā","NC","","_","_"
5,"utsam","_","_","utsa","NC","","_","_"
6,"akṣitaṃ","_","_","akṣita","JJ","","_","_"
7,"vyacyamānaṃ","_","_","vyañc","KDP","","_","_"
8,"salilasya","_","_","salila","NC","","_","_"
9,"pṛṣṭhe","_","_","pṛṣṭha","NC","","_","_"
1,"ūrjaṃ","_","_","ūrj","NC","","_","_"
2,"duhānam","_","_","duh","KDP","","_","_"
3,"_","_","_","an","CX","","_","_"
4,"_","_","_","apasphur","KDP","","_","_"
5,"upāsate","_","_","ās","V","ās","_","_"
6,"pitaraḥ","_","_","pitṛ","NC","","_","_"
7,"svadhābhiḥ","_","_","svadhā","NC","","_","_"
1,"idaṃ","_","_","ida","PRD","","_","_"
2,"kasāmbu","_","_","kasāmbu","NC","","_","_"
3,"cayanena","_","_","cayana","NC","","_","_"
4,"citaṃ","_","_","ci","PPP","","_","_"
5,"tat","_","_","tad","PRD","","_","_"
6,"sajātā","_","_","sajāta","NC","","_","_"
7,"ava","_","_","ava","CX","","_","_"
8,"_","_","_","paś","V","paś","_","_"
9,"_","_","_","e","V","i","_","_"
1,"martyo","_","_","martya","NC","","_","_"
2,"'yam","_","_","ida","PRD","","_","_"
3,"_","_","_","amṛta","JJ","","_","_"
5,"eti","_","_","e","V","i","_","_"
6,"tasmai","_","_","tad","PRD","","_","_"
7,"gṛhān","_","_","gṛha","NC","","_","_"
8,"kṛṇuta","_","_","kar","V","kṛ","_","_"
9,"yāvatsabandhu","_","_","yāvatsabandhu","CX","","_","_"
1,"_","_","_","iha","CAD","","_","_"
2,"_","_","_","eva","CEM","","_","_"
3,"_","_","_","as","V","as","_","_"
4,"_","_","_","dhana","NC","","_","_"
5,"_","_","_","sani","JJ","","_","_"
6,"ihacitta","_","_","ihacitta","JJ","","_","_"
7,"ihakratuḥ","_","_","ihakratu","JJ","","_","_"
1,"_","_","_","iha","CAD","","_","_"
2,"_","_","_","as","V","as","_","_"
3,"vīryavattaro","_","_","vīryavattara","JJ","","_","_"
4,"vayodhā","_","_","vayodhas","JJ","","_","_"
5,"_","_","_","a","CNG","","_","_"
6,"_","_","_","parāhan","PPP","","_","_"
1,"putraṃ","_","_","putra","NC","","_","_"
2,"pautram","_","_","pautra","NC","","_","_"
3,"abhitarpayantīr","_","_","abhitarpay","KDP","","_","_"
4,"āpo","_","_","ap","NC","","_","_"
5,"madhumatīr","_","_","madhumat","JJ","","_","_"
6,"imāḥ","_","_","ida","PRD","","_","_"
1,"svadhāṃ","_","_","svadhā","NC","","_","_"
2,"pitṛbhyo","_","_","pitṛ","NC","","_","_"
3,"amṛtaṃ","_","_","amṛta","NC","","_","_"
4,"duhānā","_","_","duh","KDP","","_","_"
5,"āpo","_","_","ap","NC","","_","_"
6,"devīr","_","_","deva","JJ","","_","_"
7,"ubhayāṃs","_","_","ubhaya","JJ","","_","_"
8,"tarpayantu","_","_","tṛp","V","tṛp","_","_"
1,"āpo","_","_","ap","NC","","_","_"
2,"agniṃ","_","_","agni","NC","","_","_"
3,"pra","_","_","pra","CADP","","_","_"
4,"hiṇuta","_","_","hi","V","hi","_","_"
5,"pitṝṃr","_","_","pitṛ","NC","","_","_"
6,"_","_","_","upa","CADP","","_","_"
7,"_","_","_","ida","PRD","","_","_"
8,"yajñaṃ","_","_","yajña","NC","","_","_"
9,"pitaro","_","_","pitṛ","NC","","_","_"
10,"me","_","_","mat","PPR","","_","_"
11,"juṣantām","_","_","juṣ","V","juṣ","_","_"
1,"āsīnām","_","_","ās","PPP","","_","_"
2,"ūrjam","_","_","ūrj","NC","","_","_"
3,"upa","_","_","upa","CADP","","_","_"
4,"ye","_","_","yad","PRL","","_","_"
5,"sacante","_","_","sac","V","sac","_","_"
6,"te","_","_","tad","PRD","","_","_"
7,"no","_","_","mat","PPR","","_","_"
8,"rayiṃ","_","_","rayi","NC","","_","_"
9,"_","_","_","sarva","JQ","","_","_"
10,"_","_","_","vīra","NC","","_","_"
11,"ni","_","_","ni","CADP","","_","_"
12,"yacchān","_","_","ya","V","ya","_","_"
1,"sam","_","_","sa","CADP","","_","_"
2,"indhate","_","_","indh","V","indh","_","_"
3,"amartyaṃ","_","_","amartya","JJ","","_","_"
4,"havyavāhaṃ","_","_","havyavāha","NC","","_","_"
5,"_","_","_","ghṛta","NC","","_","_"
6,"_","_","_","priya","JJ","","_","_"
1,"sa","_","_","tad","PRD","","_","_"
2,"veda","_","_","vid","V","vid","_","_"
3,"nihitān","_","_","nidhā","PPP","","_","_"
4,"nidhīn","_","_","nidhi","NC","","_","_"
5,"pitṝn","_","_","pitṛ","NC","","_","_"
6,"parāvato","_","_","parāvat","NC","","_","_"
7,"gatān","_","_","ga","PPP","","_","_"
1,"yaṃ","_","_","yad","PRL","","_","_"
2,"te","_","_","tvat","PPR","","_","_"
3,"manthaṃ","_","_","mantha","NC","","_","_"
4,"yam","_","_","yad","PRL","","_","_"
5,"odanaṃ","_","_","odana","NC","","_","_"
6,"yan","_","_","yad","PRL","","_","_"
7,"māṃsaṃ","_","_","māṃsa","NC","","_","_"
8,"nipṛṇāmi","_","_","nipṛ","V","nipṛ","_","_"
9,"te","_","_","tvat","PPR","","_","_"
1,"te","_","_","tad","PRD","","_","_"
2,"te","_","_","tvat","PPR","","_","_"
3,"santu","_","_","as","V","as","_","_"
4,"svadhāvanto","_","_","svadhāvat","JJ","","_","_"
5,"madhumanto","_","_","madhumat","JJ","","_","_"
6,"ghṛtaścutaḥ","_","_","ghṛtaścut","JJ","","_","_"
1,"yās","_","_","yad","PRL","","_","_"
2,"te","_","_","tvat","PPR","","_","_"
3,"dhānā","_","_","dhānā","NC","","_","_"
4,"anukirāmi","_","_","anukar","V","anukṛ","_","_"
5,"_","_","_","tila","NC","","_","_"
6,"_","_","_","miśra","JJ","","_","_"
7,"svadhāvatīḥ","_","_","svadhāvat","JJ","","_","_"
1,"tās","_","_","tad","PRD","","_","_"
2,"te","_","_","tvat","PPR","","_","_"
3,"_","_","_","as","V","as","_","_"
4,"_","_","_","udbhū","JJ","","_","_"
5,"prabhvīs","_","_","prabhū","JJ","","_","_"
6,"tās","_","_","tad","PRD","","_","_"
7,"te","_","_","tvat","PPR","","_","_"
8,"yamo","_","_","yama","NC","","_","_"
9,"_","_","_","rājan","NC","","_","_"
10,"_","_","_","anu","CADP","","_","_"
11,"manyatām","_","_","man","V","man","_","_"
1,"idaṃ","_","_","ida","PRD","","_","_"
2,"pūrvam","_","_","pūrva","PPX","","_","_"
3,"aparaṃ","_","_","apara","PPX","","_","_"
4,"niyānaṃ","_","_","niyāna","NC","","_","_"
5,"yenā","_","_","yad","PRL","","_","_"
6,"te","_","_","tvat","PPR","","_","_"
7,"pūrve","_","_","pūrva","PPX","","_","_"
8,"pitaraḥ","_","_","pitṛ","NC","","_","_"
9,"paretāḥ","_","_","pare","PPP","","_","_"
1,"purogavā","_","_","purogava","NC","","_","_"
2,"ye","_","_","yad","PRL","","_","_"
3,"abhiṣāco","_","_","abhiṣāc","JJ","","_","_"
4,"asya","_","_","ida","PRD","","_","_"
5,"te","_","_","tad","PRD","","_","_"
6,"tvā","_","_","tvat","PPR","","_","_"
7,"vahanti","_","_","vahan","V","vah","_","_"
8,"_","_","_","su","CAD","","_","_"
9,"_","_","_","kṛt","JJ","","_","_"
10,"u","_","_","u","CEM","","_","_"
11,"lokam","_","_","loka","NC","","_","_"
1,"sarasvatīṃ","_","_","sarasvatī","NC","","_","_"
2,"devayanto","_","_","devay","KDP","","_","_"
3,"havante","_","_","hve","V","hve","_","_"
4,"sarasvatīm","_","_","sarasvatī","NC","","_","_"
5,"adhvare","_","_","adhvara","NC","","_","_"
6,"tāyamāne","_","_","tan","KDP","","_","_"
1,"sarasvatīṃ","_","_","sarasvatī","NC","","_","_"
2,"_","_","_","su","CAD","","_","_"
3,"_","_","_","kṛt","JJ","","_","_"
4,"havante","_","_","hve","V","hve","_","_"
5,"sarasvatī","_","_","sarasvatī","NC","","_","_"
6,"dāśuṣe","_","_","dāś","KDP","","_","_"
7,"vāryaṃ","_","_","vārya","NC","","_","_"
8,"dāt","_","_","dad","V","dā","_","_"
1,"sarasvatīṃ","_","_","sarasvatī","NC","","_","_"
2,"pitaro","_","_","pitṛ","NC","","_","_"
3,"havante","_","_","hve","V","hve","_","_"
4,"dakṣiṇā","_","_","dakṣiṇā","CX","","_","_"
5,"yajñam","_","_","yajña","NC","","_","_"
6,"abhinakṣamāṇāḥ","_","_","abhinakṣ","KDP","","_","_"
1,"_","_","_","āsad","CGDA","","_","_"
2,"_","_","_","ida","PRD","","_","_"
3,"barhiṣi","_","_","barhis","NC","","_","_"
4,"mādayadhvam","_","_","māday","V","māday","_","_"
5,"anamīvā","_","_","anamīva","JJ","","_","_"
6,"iṣa","_","_","iṣ","NC","","_","_"
7,"ā","_","_","ā","CADP","","_","_"
8,"dhehy","_","_","dadh","V","dhā","_","_"
9,"asme","_","_","mat","PPR","","_","_"
1,"sarasvati","_","_","sarasvatī","NC","","_","_"
2,"yā","_","_","yad","PRL","","_","_"
3,"_","_","_","sa_saha","CX","","_","_"
4,"_","_","_","ratha","NC","","_","_"
5,"_","_","_","yā","V","yā","_","_"
6,"_","_","_","uktha","NC","","_","_"
7,"svadhābhir","_","_","svadhā","NC","","_","_"
8,"devi","_","_","devī","NC","","_","_"
9,"pitṛbhir","_","_","pitṛ","NC","","_","_"
10,"madantī","_","_","mat","KDP","","_","_"
1,"_","_","_","sahasra","NUM","","_","_"
2,"_","_","_","argha","NC","","_","_"
3,"iḍo","_","_","iḍ","NC","","_","_"
4,"atra","_","_","atra","CAD","","_","_"
5,"bhāgaṃ","_","_","bhāga","NC","","_","_"
6,"rāyaspoṣaṃ","_","_","rāyaspoṣa","NC","","_","_"
7,"yajamānāya","_","_","yaj","KDP","","_","_"
8,"dhehi","_","_","dadh","V","dhā","_","_"
1,"pṛthivīṃ","_","_","pṛthivī","NC","","_","_"
2,"tvā","_","_","tvat","PPR","","_","_"
3,"pṛthivyām","_","_","pṛthivī","NC","","_","_"
4,"ā","_","_","ā","CADP","","_","_"
5,"veśayāmi","_","_","veśay","V","veśay","_","_"
6,"devo","_","_","deva","NC","","_","_"
7,"no","_","_","mat","PPR","","_","_"
8,"dhātā","_","_","dhātṛ","NC","","_","_"
9,"pra","_","_","pra","CADP","","_","_"
10,"tirāty","_","_","tar","V","tṛ","_","_"
11,"āyuḥ","_","_","āyus","NC","","_","_"
1,"parā","_","_","parā","CADP","","_","_"
2,"paraitā","_","_","pare","PPP","","_","_"
3,"_","_","_","vasu","NC","","_","_"
4,"_","_","_","vid","JJ","","_","_"
5,"vo","_","_","tvat","PPR","","_","_"
6,"astv","_","_","as","V","as","_","_"
7,"adhā","_","_","adha","CX","","_","_"
8,"mṛtāḥ","_","_","mṛ","PPP","","_","_"
9,"pitṛṣu","_","_","pitṛ","NC","","_","_"
10,"saṃ","_","_","sa","CADP","","_","_"
11,"bhavantu","_","_","bhav","V","bhū","_","_"
1,"ā","_","_","ā","CADP","","_","_"
2,"pra","_","_","pra","CADP","","_","_"
3,"cyavethām","_","_","cyu","V","cyu","_","_"
4,"apa","_","_","apa","CX","","_","_"
5,"tan","_","_","tad","PRD","","_","_"
6,"mṛjethāṃ","_","_","mṛj","V","mṛj","_","_"
7,"yad","_","_","yad","PRL","","_","_"
8,"vām","_","_","tvat","PPR","","_","_"
9,"abhibhā","_","_","abhibhā","NC","","_","_"
10,"_","_","_","atra","CAD","","_","_"
11,"_","_","_","vak","V","vac","_","_"
1,"asmād","_","_","ida","PRD","","_","_"
2,"etam","_","_","e","V","e","_","_"
3,"aghnyau","_","_","aghnya","NC","","_","_"
4,"tad","_","_","tad","PRD","","_","_"
5,"vaśīyo","_","_","vaśīyas","JJ","","_","_"
6,"dātuḥ","_","_","dātṛ","JJ","","_","_"
7,"pitṛṣv","_","_","pitṛ","NC","","_","_"
8,"ihabhojanau","_","_","ihabhojana","JJ","","_","_"
9,"mama","_","_","mat","PPR","","_","_"
1,"_","_","_","ā","CADP","","_","_"
2,"_","_","_","ida","PRD","","_","_"
3,"agan","_","_","ga","V","ga","_","_"
4,"dakṣiṇā","_","_","dakṣiṇā","NC","","_","_"
5,"bhadrato","_","_","bhadratas","CX","","_","_"
6,"no","_","_","mat","PPR","","_","_"
7,"anena","_","_","ida","PRD","","_","_"
8,"dattā","_","_","dā","PPP","","_","_"
9,"_","_","_","su","CAD","","_","_"
10,"_","_","_","dugha","JJ","","_","_"
11,"vayodhāḥ","_","_","vayodhas","JJ","","_","_"
1,"yauvane","_","_","yauvana","NC","","_","_"
2,"jīvān","_","_","jīva","JJ","","_","_"
3,"upapṛñcatī","_","_","upapṛc","KDP","","_","_"
4,"jarā","_","_","jarā","NC","","_","_"
5,"pitṛbhya","_","_","pitṛ","NC","","_","_"
6,"upasaṃparāṇayād","_","_","upasaṃparāṇī","V","upasaṃparāṇī","_","_"
7,"imān","_","_","ida","PRD","","_","_"
1,"idaṃ","_","_","ida","PRD","","_","_"
2,"pitṛbhyaḥ","_","_","pitṛ","NC","","_","_"
3,"pra","_","_","pra","CADP","","_","_"
4,"bharāmi","_","_","bhṛ","V","bhṛ","_","_"
5,"barhir","_","_","barhis","NC","","_","_"
6,"jīvaṃ","_","_","jīva","JJ","","_","_"
7,"devebhya","_","_","deva","NC","","_","_"
8,"uttaraṃ","_","_","uttara","JJ","","_","_"
9,"stṛṇāmi","_","_","stṛ","V","stṛ","_","_"
1,"tad","_","_","tad","PRD","","_","_"
2,"ā","_","_","ā","CADP","","_","_"
3,"roha","_","_","roh","V","ruh","_","_"
4,"puruṣa","_","_","puruṣa","NC","","_","_"
5,"medhyo","_","_","medhya","JJ","","_","_"
6,"bhavan","_","_","bhū","KDP","","_","_"
7,"prati","_","_","prati","CADP","","_","_"
8,"tvā","_","_","tvat","PPR","","_","_"
9,"jānantu","_","_","jān","V","jñā","_","_"
10,"pitaraḥ","_","_","pitṛ","NC","","_","_"
11,"paretam","_","_","pare","PPP","","_","_"
1,"_","_","_","ā","CADP","","_","_"
2,"_","_","_","ida","PRD","","_","_"
3,"barhir","_","_","barhis","NC","","_","_"
4,"asado","_","_","sīd","V","sad","_","_"
5,"medhyo","_","_","medhya","JJ","","_","_"
6,"'bhūḥ","_","_","bhav","V","bhū","_","_"
7,"prati","_","_","prati","CADP","","_","_"
8,"tvā","_","_","tvat","PPR","","_","_"
9,"jānantu","_","_","jān","V","jñā","_","_"
10,"pitaraḥ","_","_","pitṛ","NC","","_","_"
11,"paretam","_","_","pare","PPP","","_","_"
1,"yathāparu","_","_","yathāparu","CX","","_","_"
2,"tanvaṃ","_","_","tanū","NC","","_","_"
3,"saṃ","_","_","sa","CADP","","_","_"
4,"bharasva","_","_","bhṛ","V","bhṛ","_","_"
5,"gātrāṇi","_","_","gātra","NC","","_","_"
6,"te","_","_","tvat","PPR","","_","_"
7,"brahmaṇā","_","_","brahman","NC","","_","_"
8,"kalpayāmi","_","_","kalp","V","kḷp","_","_"
1,"parṇo","_","_","parṇa","NC","","_","_"
2,"_","_","_","rājan","NC","","_","_"
3,"_","_","_","apidhāna","NC","","_","_"
4,"carūṇām","_","_","caru","NC","","_","_"
5,"ūrjo","_","_","ūrj","NC","","_","_"
6,"balaṃ","_","_","bala","NC","","_","_"
7,"saha","_","_","sahas","NC","","_","_"
8,"ojo","_","_","ojas","NC","","_","_"
9,"na","_","_","mat","PPR","","_","_"
10,"āgan","_","_","āga","V","āga","_","_"
1,"āyur","_","_","āyus","NC","","_","_"
2,"jīvebhyo","_","_","jīva","JJ","","_","_"
3,"vidadhad","_","_","vidhā","KDP","","_","_"
4,"_","_","_","dīrgha","JJ","","_","_"
5,"_","_","_","āyu","NC","","_","_"
7,"_","_","_","śata","NUM","","_","_"
8,"_","_","_","śārada","JJ","","_","_"
1,"ūrjo","_","_","ūrj","NC","","_","_"
2,"bhāgo","_","_","bhāga","NC","","_","_"
3,"ya","_","_","yad","PRL","","_","_"
4,"imaṃ","_","_","ida","PRD","","_","_"
5,"_","_","_","jan","V","jan","_","_"
6,"_","_","_","aśman","NC","","_","_"
7,"_","_","_","anna","NC","","_","_"
8,"ādhipatyaṃ","_","_","ādhipatya","NC","","_","_"
9,"jagāma","_","_","ga","V","ga","_","_"
1,"tam","_","_","tad","PRD","","_","_"
2,"arcata","_","_","arc","V","arc","_","_"
3,"_","_","_","viśva","JQ","","_","_"
4,"_","_","_","mitra","NC","","_","_"
5,"havirbhiḥ","_","_","havis","NC","","_","_"
6,"sa","_","_","tad","PRD","","_","_"
7,"no","_","_","mat","PPR","","_","_"
8,"yamaḥ","_","_","yama","NC","","_","_"
9,"prataraṃ","_","_","pratara","NC","","_","_"
10,"jīvase","_","_","jīv","CGDI","","_","_"
11,"dhāt","_","_","dadh","V","dhā","_","_"
1,"yathā","_","_","yathā","CCM","","_","_"
2,"yamāya","_","_","yama","NC","","_","_"
3,"harmyam","_","_","harmya","NC","","_","_"
4,"avapan","_","_","vap","V","vap","_","_"
5,"pañca","_","_","pañcan","NUM","","_","_"
6,"mānavāḥ","_","_","mānava","NC","","_","_"
1,"evā","_","_","eva","CEM","","_","_"
2,"vapāmi","_","_","vap","V","vap","_","_"
3,"harmyaṃ","_","_","harmya","NC","","_","_"
4,"yathā","_","_","yathā","CCM","","_","_"
5,"me","_","_","mat","PPR","","_","_"
6,"bhūrayo","_","_","bhūri","JQ","","_","_"
1,"idaṃ","_","_","ida","PRD","","_","_"
2,"hiraṇyaṃ","_","_","hiraṇya","NC","","_","_"
3,"bibhṛhi","_","_","bhṛ","V","bhṛ","_","_"
4,"yat","_","_","yad","PRL","","_","_"
5,"te","_","_","tvat","PPR","","_","_"
6,"_","_","_","pitṛ","NC","","_","_"
7,"_","_","_","bhṛ","V","bhṛ","_","_"
8,"purā","_","_","purā","CX","","_","_"
1,"svargaṃ","_","_","svarga","NC","","_","_"
2,"yataḥ","_","_","i","KDP","","_","_"
3,"pitur","_","_","pitṛ","NC","","_","_"
4,"hastaṃ","_","_","hasta","NC","","_","_"
5,"nir","_","_","niḥ","CADP","","_","_"
6,"mṛḍḍhi","_","_","mṛj","V","mṛj","_","_"
7,"dakṣiṇam","_","_","dakṣiṇa","JJ","","_","_"
1,"ye","_","_","yad","PRL","","_","_"
2,"ca","_","_","ca","CCD","","_","_"
3,"jīvā","_","_","jīva","JJ","","_","_"
4,"ye","_","_","yad","PRL","","_","_"
5,"ca","_","_","ca","CCD","","_","_"
6,"mṛtā","_","_","mṛ","PPP","","_","_"
7,"ye","_","_","yad","PRL","","_","_"
8,"jātā","_","_","jan","PPP","","_","_"
9,"ye","_","_","yad","PRL","","_","_"
10,"ca","_","_","ca","CCD","","_","_"
11,"yajñiyāḥ","_","_","yajñiya","JJ","","_","_"
1,"tebhyo","_","_","tad","PRD","","_","_"
2,"ghṛtasya","_","_","ghṛta","NC","","_","_"
3,"_","_","_","kulyā","NC","","_","_"
4,"_","_","_","e","V","e","_","_"
5,"_","_","_","madhu","NC","","_","_"
6,"_","_","_","dhārā","NC","","_","_"
7,"vyundatī","_","_","vyund","KDP","","_","_"
1,"vṛṣā","_","_","vṛṣan","NC","","_","_"
2,"matīnāṃ","_","_","mati","NC","","_","_"
3,"pavate","_","_","pū","V","pū","_","_"
4,"vicakṣaṇaḥ","_","_","vicakṣaṇa","JJ","","_","_"
5,"sūro","_","_","sūra","NC","","_","_"
6,"ahnāṃ","_","_","ahar","NC","","_","_"
7,"_","_","_","pratarītṛ","NC","","_","_"
8,"_","_","_","uṣas","NC","","_","_"
9,"divaḥ","_","_","div","NC","","_","_"
1,"prāṇaḥ","_","_","prāṇa","NC","","_","_"
2,"sindhūnāṃ","_","_","sindhu","NC","","_","_"
3,"kalaśāṁ","_","_","kalaśa","NC","","_","_"
4,"acikradad","_","_","krand","V","krand","_","_"
5,"indrasya","_","_","indra","NC","","_","_"
6,"hārdim","_","_","hārdi","NC","","_","_"
7,"āviśan","_","_","āviś","KDP","","_","_"
8,"manīṣayā","_","_","manīṣā","NC","","_","_"
1,"tveṣas","_","_","tveṣa","JJ","","_","_"
2,"te","_","_","tvat","PPR","","_","_"
3,"dhūma","_","_","dhūma","NC","","_","_"
4,"ūrṇotu","_","_","vṛ","V","vṛ","_","_"
5,"divi","_","_","div","NC","","_","_"
6,"ṣaṃ","_","_","sa","CADP","","_","_"
7,"chukra","_","_","śukra","JJ","","_","_"
8,"ātataḥ","_","_","ātan","PPP","","_","_"
1,"sūro","_","_","sūra","NC","","_","_"
2,"na","_","_","na","CNG","","_","_"
3,"hi","_","_","hi","CX","","_","_"
4,"dyutā","_","_","dyut","NC","","_","_"
5,"tvaṃ","_","_","tvat","PPR","","_","_"
6,"kṛpā","_","_","kṛp","NC","","_","_"
7,"pāvaka","_","_","pāvaka","NC","","_","_"
8,"rocase","_","_","roc","V","ruc","_","_"
1,"pra","_","_","pra","CADP","","_","_"
2,"vā","_","_","vai","CX","","_","_"
3,"_","_","_","e","V","i","_","_"
4,"_","_","_","indu","NC","","_","_"
5,"indrasya","_","_","indra","NC","","_","_"
6,"niṣkṛtiṃ","_","_","niṣkṛti","NC","","_","_"
7,"sakhā","_","_","sakhi","NC","","_","_"
8,"sakhyur","_","_","sakhi","NC","","_","_"
9,"na","_","_","na","CNG","","_","_"
10,"pra","_","_","pra","CADP","","_","_"
11,"mināti","_","_","mī","V","mī","_","_"
12,"saṃgiraḥ","_","_","saṃgir","NC","","_","_"
1,"marya","_","_","marya","NC","","_","_"
2,"iva","_","_","iva","CCM","","_","_"
3,"yoṣāḥ","_","_","yoṣā","NC","","_","_"
4,"sam","_","_","sa","CADP","","_","_"
5,"arṣase","_","_","ṛṣ","V","ṛṣ","_","_"
6,"somaḥ","_","_","soma","NC","","_","_"
7,"kalaśe","_","_","kalaśa","NC","","_","_"
8,"_","_","_","śata","NUM","","_","_"
9,"_","_","_","yāman","NC","","_","_"
10,"pathā","_","_","pathin","NC","","_","_"
1,"akṣann","_","_","ghas","V","ghas","_","_"
2,"amīmadanta","_","_","mat","V","mat","_","_"
3,"hy","_","_","hi","CX","","_","_"
4,"ava","_","_","ava","CX","","_","_"
5,"priyāṁ","_","_","priya","JJ","","_","_"
6,"adhūṣata","_","_","dhū","V","dhū","_","_"
1,"astoṣata","_","_","stu","V","stu","_","_"
2,"_","_","_","sva","JJ","","_","_"
3,"_","_","_","bhānu","NC","","_","_"
4,"viprā","_","_","vipra","JJ","","_","_"
5,"yaviṣṭhā","_","_","yaviṣṭha","JJ","","_","_"
6,"īmahe","_","_","ī","V","ī","_","_"
1,"ā","_","_","ā","CADP","","_","_"
2,"yāta","_","_","yā","V","yā","_","_"
3,"pitaraḥ","_","_","pitṛ","NC","","_","_"
4,"somyāso","_","_","somya","JJ","","_","_"
5,"gambhīraiḥ","_","_","gambhīra","JJ","","_","_"
6,"pathibhiḥ","_","_","pathin","NC","","_","_"
7,"pitṛyāṇaiḥ","_","_","pitṛyāṇa","JJ","","_","_"
1,"āyur","_","_","āyus","NC","","_","_"
2,"asmabhyaṃ","_","_","mat","PPR","","_","_"
3,"dadhataḥ","_","_","dhā","KDP","","_","_"
4,"prajāṃ","_","_","prajā","NC","","_","_"
5,"ca","_","_","ca","CCD","","_","_"
6,"rāyaś","_","_","rai","NC","","_","_"
7,"ca","_","_","ca","CCD","","_","_"
8,"poṣair","_","_","poṣa","NC","","_","_"
9,"abhi","_","_","abhi","CADP","","_","_"
10,"naḥ","_","_","mat","PPR","","_","_"
11,"sacadhvam","_","_","sac","V","sac","_","_"
1,"parā","_","_","parā","CADP","","_","_"
2,"yāta","_","_","yā","V","yā","_","_"
3,"pitaraḥ","_","_","pitṛ","NC","","_","_"
4,"somyāso","_","_","somya","JJ","","_","_"
5,"gambhīraiḥ","_","_","gambhīra","JJ","","_","_"
6,"pathibhiḥ","_","_","pathin","NC","","_","_"
7,"pūryāṇaiḥ","_","_","pūryāṇa","JJ","","_","_"
1,"adhā","_","_","adha","CX","","_","_"
2,"māsi","_","_","mās","NC","","_","_"
3,"punar","_","_","punar","CAD","","_","_"
4,"ā","_","_","ā","CADP","","_","_"
5,"yāta","_","_","yā","V","yā","_","_"
6,"no","_","_","mat","PPR","","_","_"
7,"gṛhān","_","_","gṛha","NC","","_","_"
8,"havir","_","_","havis","NC","","_","_"
9,"attuṃ","_","_","ad","CGDI","","_","_"
10,"suprajasaḥ","_","_","suprajas","JJ","","_","_"
11,"_","_","_","su","CAD","","_","_"
12,"_","_","_","vīra","NC","","_","_"
1,"yad","_","_","yad","PRL","","_","_"
2,"vo","_","_","tvat","PPR","","_","_"
3,"agnir","_","_","agni","NC","","_","_"
4,"ajahād","_","_","jah","V","hā","_","_"
5,"ekam","_","_","eka","PPX","","_","_"
6,"aṅgaṃ","_","_","aṅga","NC","","_","_"
7,"_","_","_","pitṛ","NC","","_","_"
8,"_","_","_","loka","NC","","_","_"
9,"gamayaṃ","_","_","gamay","KDP","","_","_"
10,"jātavedāḥ","_","_","jātavedas","NC","","_","_"
1,"tad","_","_","tad","PRD","","_","_"
2,"va","_","_","tvat","PPR","","_","_"
3,"etat","_","_","tad","PRD","","_","_"
4,"punar","_","_","punar","CAD","","_","_"
5,"ā","_","_","ā","CADP","","_","_"
6,"pyāyayāmi","_","_","pyāyay","V","pyāyay","_","_"
7,"_","_","_","sa_saha","CX","","_","_"
8,"_","_","_","aṅga","NC","","_","_"
9,"svarge","_","_","svarga","NC","","_","_"
10,"pitaro","_","_","pitṛ","NC","","_","_"
11,"mādayadhvam","_","_","māday","V","māday","_","_"
1,"abhūd","_","_","bhav","V","bhū","_","_"
2,"dūtaḥ","_","_","dūta","NC","","_","_"
3,"prahito","_","_","prahi","PPP","","_","_"
4,"jātavedāḥ","_","_","jātavedas","NC","","_","_"
5,"sāyaṃ","_","_","sāya","CX","","_","_"
6,"nyahna","_","_","nyahna","NC","","_","_"
7,"upavandyo","_","_","upavand","KDG","","_","_"
8,"nṛbhiḥ","_","_","nṛ","NC","","_","_"
1,"prādāḥ","_","_","pradad","V","pradā","_","_"
2,"pitṛbhyaḥ","_","_","pitṛ","NC","","_","_"
3,"svadhayā","_","_","svadhā","NC","","_","_"
4,"te","_","_","tad","PRD","","_","_"
5,"akṣann","_","_","ghas","V","ghas","_","_"
6,"addhi","_","_","ad","V","ad","_","_"
7,"tvaṃ","_","_","tvat","PPR","","_","_"
8,"deva","_","_","deva","NC","","_","_"
9,"prayatā","_","_","praya","PPP","","_","_"
10,"havīṃṣi","_","_","havis","NC","","_","_"
1,"asau","_","_","adas","PRD","","_","_"
2,"hā","_","_","hai","CX","","_","_"
3,"iha","_","_","iha","CAD","","_","_"
4,"te","_","_","tvat","PPR","","_","_"
5,"manaḥ","_","_","manas","NC","","_","_"
6,"kakutsalam","_","_","kakutsala","NC","","_","_"
7,"iva","_","_","iva","CCM","","_","_"
8,"jāmayaḥ","_","_","jāmi","NC","","_","_"
1,"abhy","_","_","abhi","CADP","","_","_"
2,"enaṃ","_","_","a","PRD","","_","_"
3,"bhūma","_","_","bhūmi","NC","","_","_"
4,"ūrṇuhi","_","_","vṛ","V","vṛ","_","_"
1,"śumbhantāṃ","_","_","śubh","V","śubh","_","_"
2,"lokāḥ","_","_","loka","NC","","_","_"
3,"pitṛṣadanāḥ","_","_","pitṛṣadana","JJ","","_","_"
4,"pitṛṣadane","_","_","pitṛṣadana","JJ","","_","_"
5,"tvā","_","_","tvat","PPR","","_","_"
6,"loka","_","_","loka","NC","","_","_"
7,"ā","_","_","ā","CADP","","_","_"
8,"sādayāmi","_","_","sīd","V","sad","_","_"
1,"ye","_","_","yad","PRL","","_","_"
2,"asmākaṃ","_","_","mat","PPR","","_","_"
3,"pitaras","_","_","pitṛ","NC","","_","_"
4,"teṣāṃ","_","_","tad","PRD","","_","_"
5,"barhir","_","_","barhis","NC","","_","_"
6,"asi","_","_","as","V","as","_","_"
1,"ud","_","_","ud","CADP","","_","_"
2,"uttamaṃ","_","_","uttama","JJ","","_","_"
3,"varuṇa","_","_","varuṇa","NC","","_","_"
4,"pāśam","_","_","pāśa","NC","","_","_"
5,"asmad","_","_","mat","PPR","","_","_"
6,"_","_","_","ava","CX","","_","_"
7,"_","_","_","adhama","JJ","","_","_"
8,"śrathāya","_","_","śrathāy","V","śrathāy","_","_"
1,"adhā","_","_","adha","CX","","_","_"
2,"vayam","_","_","mat","PPR","","_","_"
3,"āditya","_","_","āditya","NC","","_","_"
4,"vrate","_","_","vrata","NC","","_","_"
5,"_","_","_","tvat","PPR","","_","_"
6,"_","_","_","anāgas","JJ","","_","_"
7,"aditaye","_","_","aditi","NC","","_","_"
8,"syāma","_","_","as","V","as","_","_"
1,"_","_","_","pra","CADP","","_","_"
2,"_","_","_","mat","PPR","","_","_"
3,"pāśān","_","_","pāśa","NC","","_","_"
4,"varuṇa","_","_","varuṇa","NC","","_","_"
5,"muñca","_","_","muñc","V","muc","_","_"
6,"sarvān","_","_","sarva","JQ","","_","_"
7,"yaiḥ","_","_","yad","PRL","","_","_"
8,"samāme","_","_","samāma","NC","","_","_"
9,"badhyate","_","_","bandh","V","bandh","_","_"
10,"yair","_","_","yad","PRL","","_","_"
11,"vyāme","_","_","vyāma","NC","","_","_"
1,"adhā","_","_","adha","CX","","_","_"
2,"jīvema","_","_","jīv","V","jīv","_","_"
3,"śaradaṃ","_","_","śarad","NC","","_","_"
4,"śatāni","_","_","śata","NUM","","_","_"
5,"tvayā","_","_","tvat","PPR","","_","_"
6,"rājan","_","_","rājan","NC","","_","_"
7,"gupitā","_","_","gup","PPP","","_","_"
8,"rakṣamāṇāḥ","_","_","rakṣ","KDP","","_","_"
1,"agnaye","_","_","agni","NC","","_","_"
2,"kavyavāhanāya","_","_","kavyavāhana","NC","","_","_"
3,"svadhā","_","_","svadhā","NC","","_","_"
4,"namaḥ","_","_","namas","NC","","_","_"
1,"somāya","_","_","soma","NC","","_","_"
2,"pitṛmate","_","_","pitṛmat","JJ","","_","_"
3,"svadhā","_","_","svadhā","NC","","_","_"
4,"namaḥ","_","_","namas","NC","","_","_"
1,"pitṛbhyaḥ","_","_","pitṛ","NC","","_","_"
2,"somavadbhyaḥ","_","_","somavat","JJ","","_","_"
3,"svadhā","_","_","svadhā","NC","","_","_"
4,"namaḥ","_","_","namas","NC","","_","_"
1,"yamāya","_","_","yama","NC","","_","_"
2,"pitṛmate","_","_","pitṛmat","JJ","","_","_"
3,"svadhā","_","_","svadhā","NC","","_","_"
4,"namaḥ","_","_","namas","NC","","_","_"
1,"etat","_","_","tad","PRD","","_","_"
2,"te","_","_","tvat","PPR","","_","_"
3,"pratatāmaha","_","_","pratatāmaha","NC","","_","_"
4,"svadhā","_","_","svadhā","NC","","_","_"
5,"ye","_","_","yad","PRL","","_","_"
6,"ca","_","_","ca","CCD","","_","_"
7,"tvām","_","_","tvat","PPR","","_","_"
8,"anu","_","_","anu","CADP","","_","_"
1,"etat","_","_","tad","PRD","","_","_"
2,"te","_","_","tvat","PPR","","_","_"
3,"tatāmaha","_","_","tatāmaha","NC","","_","_"
4,"svadhā","_","_","svadhā","NC","","_","_"
5,"ye","_","_","yad","PRL","","_","_"
6,"ca","_","_","ca","CCD","","_","_"
7,"tvām","_","_","tvat","PPR","","_","_"
8,"anu","_","_","anu","CADP","","_","_"
1,"etat","_","_","tad","PRD","","_","_"
2,"te","_","_","tvat","PPR","","_","_"
3,"tata","_","_","tata","NC","","_","_"
4,"svadhā","_","_","svadhā","NC","","_","_"
1,"svadhā","_","_","svadhā","NC","","_","_"
2,"pitṛbhyaḥ","_","_","pitṛ","NC","","_","_"
3,"pṛthiviṣadbhyaḥ","_","_","pṛthiviṣad","JJ","","_","_"
1,"svadhā","_","_","svadhā","NC","","_","_"
2,"pitṛbhyo","_","_","pitṛ","NC","","_","_"
3,"_","_","_","antarikṣa","NC","","_","_"
4,"_","_","_","sad","JJ","","_","_"
1,"svadhā","_","_","svadhā","NC","","_","_"
2,"pitṛbhyo","_","_","pitṛ","NC","","_","_"
3,"diviṣadbhyaḥ","_","_","diviṣad","JJ","","_","_"
1,"namo","_","_","namas","NC","","_","_"
2,"vaḥ","_","_","tvat","PPR","","_","_"
3,"pitara","_","_","pitṛ","NC","","_","_"
4,"ūrje","_","_","ūrj","NC","","_","_"
5,"namo","_","_","namas","NC","","_","_"
6,"vaḥ","_","_","tvat","PPR","","_","_"
7,"pitaro","_","_","pitṛ","NC","","_","_"
8,"rasāya","_","_","rasa","NC","","_","_"
1,"namo","_","_","namas","NC","","_","_"
2,"vaḥ","_","_","tvat","PPR","","_","_"
3,"pitaro","_","_","pitṛ","NC","","_","_"
4,"bhāmāya","_","_","bhāma","NC","","_","_"
5,"namo","_","_","namas","NC","","_","_"
6,"vaḥ","_","_","tvat","PPR","","_","_"
7,"pitaro","_","_","pitṛ","NC","","_","_"
8,"manyave","_","_","manyu","NC","","_","_"
1,"namo","_","_","namas","NC","","_","_"
2,"vaḥ","_","_","tvat","PPR","","_","_"
3,"pitaro","_","_","pitṛ","NC","","_","_"
4,"yad","_","_","yad","PRL","","_","_"
5,"ghoraṃ","_","_","ghora","JJ","","_","_"
6,"tasmai","_","_","tad","PRD","","_","_"
7,"namo","_","_","namas","NC","","_","_"
8,"vaḥ","_","_","tvat","PPR","","_","_"
9,"pitaro","_","_","pitṛ","NC","","_","_"
10,"yat","_","_","yad","PRL","","_","_"
11,"krūraṃ","_","_","krūra","JJ","","_","_"
12,"tasmai","_","_","tad","PRD","","_","_"
1,"namo","_","_","namas","NC","","_","_"
2,"vaḥ","_","_","tvat","PPR","","_","_"
3,"pitaro","_","_","pitṛ","NC","","_","_"
4,"yac","_","_","yad","PRL","","_","_"
5,"chivaṃ","_","_","śiva","JJ","","_","_"
6,"tasmai","_","_","tad","PRD","","_","_"
7,"namo","_","_","namas","NC","","_","_"
8,"vaḥ","_","_","tvat","PPR","","_","_"
9,"pitaro","_","_","pitṛ","NC","","_","_"
10,"yat","_","_","yad","PRL","","_","_"
11,"syonaṃ","_","_","syona","JJ","","_","_"
12,"tasmai","_","_","tad","PRD","","_","_"
1,"namo","_","_","namas","NC","","_","_"
2,"vaḥ","_","_","tvat","PPR","","_","_"
3,"pitaraḥ","_","_","pitṛ","NC","","_","_"
4,"svadhā","_","_","svadhā","NC","","_","_"
5,"vaḥ","_","_","tvat","PPR","","_","_"
6,"pitaraḥ","_","_","pitṛ","NC","","_","_"
1,"ye","_","_","yad","PRL","","_","_"
2,"'tra","_","_","atra","CAD","","_","_"
3,"pitaraḥ","_","_","pitṛ","NC","","_","_"
4,"pitaro","_","_","pitṛ","NC","","_","_"
5,"ye","_","_","yad","PRL","","_","_"
6,"'tra","_","_","atra","CAD","","_","_"
7,"yūyaṃ","_","_","tvat","PPR","","_","_"
8,"stha","_","_","as","V","as","_","_"
9,"yuṣmāṃs","_","_","tvat","PPR","","_","_"
10,"te","_","_","tad","PRD","","_","_"
11,"'nu","_","_","anu","CADP","","_","_"
12,"yūyaṃ","_","_","tvat","PPR","","_","_"
13,"teṣāṃ","_","_","tad","PRD","","_","_"
14,"śreṣṭhā","_","_","śreṣṭha","JJ","","_","_"
15,"bhūyāstha","_","_","bhav","V","bhū","_","_"
1,"ya","_","_","yad","PRL","","_","_"
2,"iha","_","_","iha","CAD","","_","_"
3,"pitaro","_","_","pitṛ","NC","","_","_"
4,"jīvā","_","_","jīva","JJ","","_","_"
5,"iha","_","_","iha","CAD","","_","_"
6,"vayaṃ","_","_","mat","PPR","","_","_"
7,"smaḥ","_","_","as","V","as","_","_"
1,"asmāṃs","_","_","mat","PPR","","_","_"
2,"te","_","_","tad","PRD","","_","_"
3,"'nu","_","_","anu","CADP","","_","_"
4,"vayaṃ","_","_","mat","PPR","","_","_"
5,"teṣāṃ","_","_","tad","PRD","","_","_"
6,"śreṣṭhā","_","_","śreṣṭha","JJ","","_","_"
7,"bhūyāsma","_","_","bhav","V","bhū","_","_"
1,"ā","_","_","ā","CADP","","_","_"
2,"_","_","_","tvat","PPR","","_","_"
3,"_","_","_","agni","NC","","_","_"
4,"idhīmahi","_","_","indh","V","indh","_","_"
5,"dyumantaṃ","_","_","dyumat","JJ","","_","_"
6,"_","_","_","deva","NC","","_","_"
7,"_","_","_","ajara","JJ","","_","_"
1,"yad","_","_","yat","CSB","","_","_"
2,"gha","_","_","gha","CX","","_","_"
3,"sā","_","_","tad","PRD","","_","_"
4,"te","_","_","tvat","PPR","","_","_"
5,"panīyasī","_","_","panīyas","JJ","","_","_"
6,"samid","_","_","samidh","NC","","_","_"
7,"dīdayati","_","_","dīdī","V","dīdī","_","_"
8,"dyavi","_","_","div","NC","","_","_"
1,"iṣaṃ","_","_","iṣ","NC","","_","_"
2,"stotṛbhya","_","_","stotṛ","JJ","","_","_"
3,"ā","_","_","ā","CADP","","_","_"
4,"bhara","_","_","bhṛ","V","bhṛ","_","_"
1,"candramā","_","_","candramas","NC","","_","_"
2,"apsv","_","_","ap","NC","","_","_"
3,"antar","_","_","antar","CAD","","_","_"
4,"ā","_","_","ā","CADP","","_","_"
5,"suparṇo","_","_","suparṇa","NC","","_","_"
6,"dhāvate","_","_","dhāv","V","dhāv","_","_"
7,"divi","_","_","div","NC","","_","_"
1,"na","_","_","na","CNG","","_","_"
2,"vo","_","_","tvat","PPR","","_","_"
3,"_","_","_","hiraṇya","NC","","_","_"
4,"_","_","_","nemi","NC","","_","_"
5,"padaṃ","_","_","pada","NC","","_","_"
6,"vindanti","_","_","vid","V","vid","_","_"
7,"vidyuto","_","_","vidyut","NC","","_","_"
8,"vittaṃ","_","_","vid","V","vid","_","_"
9,"me","_","_","mat","PPR","","_","_"
10,"asya","_","_","ida","PRD","","_","_"
11,"rodasī","_","_","rodasī","NC","","_","_"
