"WordID","word","NormSTEM","suffix","lemma","PoS","Root","NormSuffix","NormWord"
1,"vajreṇa","_","_","vajra","NC","","_","_"
2,"_","_","_","heman","NC","","_","_"
3,"_","_","_","mil","PPP","","_","_"
4,"tu","_","_","tu","CCD","","_","_"
5,"rañjitena","_","_","rañjay","PPP","","_","_"
6,"sūtena","_","_","sūta","NC","","_","_"
7,"_","_","_","heman","NC","","_","_"
8,"_","_","_","mil","PPP","","_","_"
9,"_","_","_","su","CAD","","_","_"
10,"_","_","_","rañjay","PPP","","_","_"
1,"yogaiḥ","_","_","yoga","NC","","_","_"
2,"_","_","_","su","CAD","","_","_"
3,"_","_","_","sundaratara","JJ","","_","_"
4,"_","_","_","kanakādri","NC","","_","_"
5,"_","_","_","kūṭa","NC","","_","_"
6,"_","_","_","kṛ","CGDA","","_","_"
7,"_","_","_","atha","CAD","","_","_"
8,"_","_","_","śakra","NC","","_","_"
9,"_","_","_","pada","NC","","_","_"
10,"_","_","_","hetu","NC","","_","_"
11,"_","_","_","makha","NC","","_","_"
12,"_","_","_","ca","CCD","","_","_"
13,"kuryāt","_","_","kar","V","kṛ","_","_"
1,"_","_","_","ayaskānta","NC","","_","_"
2,"_","_","_","mukha","NC","","_","_"
3,"guṃjāṃ","_","_","guñjā","NC","","_","_"
4,"_","_","_","tad","PRD","","_","_"
5,"_","_","_","dviguṇa","JJ","","_","_"
6,"_","_","_","gandhaka","NC","","_","_"
1,"_","_","_","strī","NC","","_","_"
2,"_","_","_","stanya","NC","","_","_"
3,"peṣitaṃ","_","_","peṣay","PPP","","_","_"
4,"lepyaṃ","_","_","lepay","KDG","","_","_"
5,"mūṣāyāṃ","_","_","mūṣā","NC","","_","_"
6,"_","_","_","dvaṃdva","NC","","_","_"
7,"_","_","_","melaka","NC","","_","_"
1,"_","_","_","gandha","NC","","_","_"
2,"_","_","_","śaśa","NC","","_","_"
3,"_","_","_","danta","NC","","_","_"
4,"_","_","_","ca","CCD","","_","_"
5,"bhrāmakasya","_","_","bhrāmaka","NC","","_","_"
6,"mukhaṃ","_","_","mukha","NC","","_","_"
7,"tathā","_","_","tathā","CX","","_","_"
1,"amlavetasaḥ","_","_","amlavetasa","NC","","_","_"
2,"śilādhātuḥ","_","_","śilādhātu","NC","","_","_"
3,"sarvaṃ","_","_","sarva","JQ","","_","_"
4,"tulyaṃ","_","_","tulya","JJ","","_","_"
5,"prapeṣayet","_","_","prapiṣ","V","prapiṣ","_","_"
1,"_","_","_","mūṣā","NC","","_","_"
2,"_","_","_","lepa","NC","","_","_"
3,"_","_","_","tad","PRD","","_","_"
4,"_","_","_","eva","CEM","","_","_"
5,"_","_","_","vajra","NC","","_","_"
6,"_","_","_","dvaṃdva","NC","","_","_"
7,"_","_","_","mil","V","mil","_","_"
8,"_","_","_","ala","CX","","_","_"
1,"_","_","_","mahiṣī","NC","","_","_"
2,"_","_","_","karṇa","NC","","_","_"
3,"_","_","_","netra","NC","","_","_"
4,"_","_","_","uttha","JJ","","_","_"
5,"_","_","_","mala","NC","","_","_"
6,"cūrṇaṃ","_","_","carv","PPP","","_","_"
7,"ca","_","_","ca","CCD","","_","_"
8,"ṭaṃkaṇam","_","_","ṭaṅkaṇa","NC","","_","_"
1,"_","_","_","strī","NC","","_","_"
2,"_","_","_","stanya","NC","","_","_"
3,"_","_","_","karkaṭa","NC","","_","_"
4,"_","_","_","asthi","NC","","_","_"
5,"śilājatu","_","_","śilājatu","NC","","_","_"
6,"samaṃ","_","_","sama","PPX","","_","_"
7,"samam","_","_","sama","PPX","","_","_"
1,"piṣṭvā","_","_","piṣ","CGDA","","_","_"
2,"mūṣāṃ","_","_","mūṣā","NC","","_","_"
3,"pralepena","_","_","pralepa","NC","","_","_"
4,"_","_","_","vajra","NC","","_","_"
5,"_","_","_","dvaṃdva","NC","","_","_"
6,"melakam","_","_","melaka","NC","","_","_"
1,"_","_","_","bhramara","NC","","_","_"
2,"_","_","_","asthi","NC","","_","_"
3,"_","_","_","nṛ","NC","","_","_"
4,"_","_","_","keśa","NC","","_","_"
5,"_","_","_","ca","CCD","","_","_"
6,"ṭaṃkaṇaṃ","_","_","ṭaṅkaṇa","NC","","_","_"
7,"_","_","_","kānta","NC","","_","_"
8,"_","_","_","ja","JJ","","_","_"
9,"mukham","_","_","mukha","NC","","_","_"
1,"_","_","_","bāla","JJ","","_","_"
2,"_","_","_","vatsa","NC","","_","_"
3,"_","_","_","purīṣa","NC","","_","_"
4,"ca","_","_","ca","CCD","","_","_"
5,"_","_","_","strī","NC","","_","_"
6,"_","_","_","stanya","NC","","_","_"
7,"tu","_","_","tu","CCD","","_","_"
8,"peṣayet","_","_","piṣ","V","piṣ","_","_"
1,"_","_","_","tad","PRD","","_","_"
2,"_","_","_","kalka","NC","","_","_"
3,"_","_","_","lip","PPP","","_","_"
4,"_","_","_","mūṣā","NC","","_","_"
5,"_","_","_","vajra","NC","","_","_"
6,"_","_","_","dvaṃdva","NC","","_","_"
7,"_","_","_","mil","V","mil","_","_"
8,"_","_","_","ala","CX","","_","_"
1,"bhūnāgaṃ","_","_","bhūnāga","NC","","_","_"
2,"_","_","_","kānta","NC","","_","_"
3,"_","_","_","pāṣāṇa","NC","","_","_"
4,"mākṣikaṃ","_","_","mākṣika","NC","","_","_"
5,"ṭaṃkaṇaṃ","_","_","ṭaṅkaṇa","NC","","_","_"
6,"madhu","_","_","madhu","NC","","_","_"
1,"_","_","_","snuh","NC","","_","_"
2,"_","_","_","payas","NC","","_","_"
3,"_","_","_","karkaṭa","NC","","_","_"
4,"_","_","_","asthi","NC","","_","_"
5,"_","_","_","kāca","NC","","_","_"
6,"_","_","_","arka","NC","","_","_"
7,"_","_","_","payas","NC","","_","_"
8,"samam","_","_","sama","PPX","","_","_"
1,"_","_","_","strī","NC","","_","_"
2,"_","_","_","stanya","NC","","_","_"
3,"peṣitaṃ","_","_","peṣay","PPP","","_","_"
4,"sarvaṃ","_","_","sarva","JQ","","_","_"
5,"_","_","_","mūṣā","NC","","_","_"
6,"_","_","_","lepa","NC","","_","_"
7,"tu","_","_","tu","CCD","","_","_"
8,"kārayet","_","_","kar","V","kṛ","_","_"
1,"_","_","_","tad","PRD","","_","_"
2,"_","_","_","madhya","NC","","_","_"
3,"_","_","_","stha","JJ","","_","_"
4,"_","_","_","vajra","NC","","_","_"
5,"_","_","_","sūta","NC","","_","_"
6,"_","_","_","haṭha","NC","","_","_"
7,"_","_","_","dha","PPP","","_","_"
8,"_","_","_","mil","V","mil","_","_"
9,"_","_","_","ala","CX","","_","_"
1,"_","_","_","mṛ","PPP","","_","_"
2,"_","_","_","vajra","NC","","_","_"
3,"catvāro","_","_","catur","NUM","","_","_"
4,"bhāgā","_","_","bhāga","NC","","_","_"
5,"_","_","_","dvādaśan","NUM","","_","_"
6,"_","_","_","hāṭaka","NC","","_","_"
1,"nāgasya","_","_","nāga","NC","","_","_"
2,"ca","_","_","ca","CCD","","_","_"
3,"trayo","_","_","tri","NUM","","_","_"
4,"bhāgāḥ","_","_","bhāga","NC","","_","_"
5,"ṣaṭ","_","_","ṣaṣ","NUM","","_","_"
6,"śuddhasya","_","_","śudh","PPP","","_","_"
7,"ca","_","_","ca","CCD","","_","_"
8,"pāradāt","_","_","pārada","NC","","_","_"
1,"ekīkṛtya","_","_","ekīkṛ","CGDA","","_","_"
2,"tu","_","_","tu","CCD","","_","_"
3,"_","_","_","tad","PRD","","_","_"
4,"_","_","_","mṛd","KDG","","_","_"
5,"_","_","_","dina","NC","","_","_"
6,"_","_","_","amla","NC","","_","_"
7,"kenacit","_","_","kiṃcit","PRI","","_","_"
1,"taptakhalve","_","_","taptakhalva","NC","","_","_"
2,"tu","_","_","tu","CCD","","_","_"
3,"_","_","_","tad","PRD","","_","_"
4,"_","_","_","kalka","NC","","_","_"
5,"samuddhṛtya","_","_","samuddhṛ","CGDA","","_","_"
6,"nirodhayet","_","_","nirrudh","V","nirrudh","_","_"
1,"mūṣāyāṃ","_","_","mūṣā","NC","","_","_"
2,"_","_","_","dvaṃdva","NC","","_","_"
3,"_","_","_","lip","PPP","","_","_"
4,"_","_","_","haṭha","NC","","_","_"
5,"_","_","_","dha","PPP","","_","_"
6,"_","_","_","mil","V","mil","_","_"
7,"_","_","_","ala","CX","","_","_"
1,"_","_","_","kṣāra","NC","","_","_"
2,"_","_","_","utpalasāriṇī","NC","","_","_"
3,"mṛtaṃ","_","_","mṛ","PPP","","_","_"
4,"vajraṃ","_","_","vajra","NC","","_","_"
5,"vibhāvayet","_","_","vibhav","V","vibhū","_","_"
1,"_","_","_","dina","NC","","_","_"
2,"_","_","_","eka","PPX","","_","_"
3,"śodhitaṃ","_","_","śodhay","PPP","","_","_"
4,"piṣṭam","_","_","piṣ","PPP","","_","_"
5,"ekaikāṃ","_","_","ekaika","PRC","","_","_"
6,"_","_","_","kāray","V","kāray","_","_"
7,"_","_","_","vaṭī","NC","","_","_"
1,"_","_","_","tri","NUM","","_","_"
2,"_","_","_","bhāga","NC","","_","_"
3,"pāradaṃ","_","_","pārada","NC","","_","_"
4,"_","_","_","ca","CCD","","_","_"
5,"_","_","_","eva","CEM","","_","_"
6,"_","_","_","bhāga","NC","","_","_"
7,"_","_","_","catur","NUM","","_","_"
8,"hāṭakam","_","_","hāṭaka","NC","","_","_"
1,"amlena","_","_","amla","NC","","_","_"
2,"_","_","_","kāray","V","kāray","_","_"
3,"_","_","_","piṣṭī","NC","","_","_"
4,"_","_","_","tad","PRD","","_","_"
5,"_","_","_","garbha","NC","","_","_"
6,"tāṃ","_","_","tad","PRD","","_","_"
7,"_","_","_","kṣip","V","kṣip","_","_"
8,"_","_","_","vaṭī","NC","","_","_"
1,"_","_","_","bhūrja","NC","","_","_"
2,"_","_","_","pattra","NC","","_","_"
3,"_","_","_","tad","PRD","","_","_"
4,"_","_","_","bandh","CGDA","","_","_"
5,"_","_","_","dhānya","NC","","_","_"
6,"_","_","_","rāśi","NC","","_","_"
7,"vinikṣipet","_","_","vinikṣip","V","vinikṣip","_","_"
1,"_","_","_","pakṣa","NC","","_","_"
2,"_","_","_","mātra","NC","","_","_"
3,"_","_","_","samuddhṛ","CGDA","","_","_"
4,"_","_","_","pūrva","PPX","","_","_"
5,"_","_","_","mūṣā","NC","","_","_"
6,"_","_","_","ga","PPP","","_","_"
7,"dhamet","_","_","dham","V","dha","_","_"
1,"_","_","_","mil","V","mil","_","_"
2,"_","_","_","eva","CEM","","_","_"
3,"na","_","_","na","CNG","","_","_"
4,"saṃdeho","_","_","saṃdeha","NC","","_","_"
5,"dhāmyamānaṃ","_","_","dhāmay","KDP","","_","_"
6,"punaḥ","_","_","punar","CAD","","_","_"
7,"punaḥ","_","_","punar","CAD","","_","_"
1,"_","_","_","mṛ","PPP","","_","_"
2,"_","_","_","vajra","NC","","_","_"
3,"_","_","_","bhāga","NC","","_","_"
4,"_","_","_","eka","PPX","","_","_"
5,"_","_","_","svarṇa","NC","","_","_"
6,"_","_","_","pattra","NC","","_","_"
7,"veṣṭayet","_","_","veṣṭay","V","veṣṭay","_","_"
1,"samyak","_","_","samyak","CX","","_","_"
2,"_","_","_","ṣoḍaśa","JJ","","_","_"
3,"_","_","_","bhāga","NC","","_","_"
4,"mūṣāyāṃ","_","_","mūṣā","NC","","_","_"
5,"_","_","_","pūrvavat","CX","","_","_"
6,"_","_","_","kṣip","V","kṣip","_","_"
1,"_","_","_","svarṇa","NC","","_","_"
2,"_","_","_","tulya","JJ","","_","_"
3,"sitaṃ","_","_","sita","NC","","_","_"
4,"kācam","_","_","kāca","NC","","_","_"
5,"athavā","_","_","athavā","CX","","_","_"
6,"_","_","_","nṛ","NC","","_","_"
7,"_","_","_","kapālaka","NC","","_","_"
1,"cūrṇayitvā","_","_","cūrṇay","CGDA","","_","_"
2,"_","_","_","kṣip","V","kṣip","_","_"
3,"_","_","_","tad","PRD","","_","_"
4,"ruddhvā","_","_","rudh","CGDA","","_","_"
5,"_","_","_","tīvra","JJ","","_","_"
6,"_","_","_","agni","NC","","_","_"
7,"dhamet","_","_","dham","V","dha","_","_"
1,"samuddhṛtya","_","_","samuddhṛ","CGDA","","_","_"
2,"_","_","_","punar","CAD","","_","_"
3,"_","_","_","dā","KDG","","_","_"
4,"kācaṃ","_","_","kāca","NC","","_","_"
5,"vā","_","_","vā","CCD","","_","_"
6,"_","_","_","nṛ","NC","","_","_"
7,"_","_","_","kapālaka","NC","","_","_"
1,"liptvā","_","_","lip","CGDA","","_","_"
2,"mūṣāṃ","_","_","mūṣā","NC","","_","_"
3,"_","_","_","dha","V","dha","_","_"
4,"_","_","_","tad","PRD","","_","_"
5,"_","_","_","eva","CX","","_","_"
6,"mūṣāsu","_","_","mūṣā","NC","","_","_"
7,"saptasu","_","_","saptan","NUM","","_","_"
1,"hemnā","_","_","heman","NC","","_","_"
2,"milati","_","_","mil","V","mil","_","_"
3,"_","_","_","tad","PRD","","_","_"
4,"_","_","_","vajra","NC","","_","_"
5,"_","_","_","iti","CQT","","_","_"
6,"_","_","_","eva","CX","","_","_"
7,"_","_","_","melay","V","melay","_","_"
8,"_","_","_","punar","CAD","","_","_"
1,"_","_","_","yāvat","CX","","_","_"
2,"_","_","_","mil","V","mil","_","_"
3,"_","_","_","pāda","NC","","_","_"
4,"_","_","_","aṃśa","NC","","_","_"
5,"suvarṇe","_","_","suvarṇa","NC","","_","_"
6,"_","_","_","mṛ","PPP","","_","_"
7,"_","_","_","vajraka","NC","","_","_"
1,"_","_","_","dvi","NUM","","_","_"
2,"_","_","_","bhāga","NC","","_","_"
3,"_","_","_","dvaṃdva","NC","","_","_"
4,"_","_","_","khoṭa","NC","","_","_"
5,"_","_","_","tri","NUM","","_","_"
6,"_","_","_","bhāga","NC","","_","_"
7,"drutasūtakam","_","_","drutasūtaka","NC","","_","_"
1,"_","_","_","marday","V","marday","_","_"
2,"_","_","_","amla","NC","","_","_"
3,"_","_","_","yoga","NC","","_","_"
4,"_","_","_","dina","NC","","_","_"
5,"_","_","_","anta","NC","","_","_"
6,"taṃ","_","_","tad","PRD","","_","_"
7,"ca","_","_","ca","CCD","","_","_"
8,"golakam","_","_","golaka","NC","","_","_"
1,"_","_","_","meṣaśṛṅgī","NC","","_","_"
2,"_","_","_","tu","CCD","","_","_"
3,"pañcāṅgaṃ","_","_","pañcāṅga","NC","","_","_"
4,"_","_","_","strī","NC","","_","_"
5,"_","_","_","stanya","NC","","_","_"
6,"tu","_","_","tu","CCD","","_","_"
7,"peṣayet","_","_","piṣ","V","piṣ","_","_"
1,"anena","_","_","ida","PRD","","_","_"
2,"vedhayed","_","_","vedhay","V","vedhay","_","_"
3,"golaṃ","_","_","gola","NC","","_","_"
4,"_","_","_","tad","PRD","","_","_"
5,"_","_","_","bahis","CX","","_","_"
6,"_","_","_","nigala","NC","","_","_"
7,"ca","_","_","ca","CCD","","_","_"
1,"_","_","_","sveda","NC","","_","_"
2,"_","_","_","ādi","NC","","_","_"
3,"_","_","_","melana","NC","","_","_"
4,"_","_","_","anta","NC","","_","_"
5,"ca","_","_","ca","CCD","","_","_"
6,"_","_","_","kāray","V","kāray","_","_"
7,"_","_","_","heman","NC","","_","_"
8,"_","_","_","piṣṭi","NC","","_","_"
9,"_","_","_","vat","CX","","_","_"
1,"_","_","_","meṣaśṛṅgī","NC","","_","_"
2,"_","_","_","bhava","NC","","_","_"
3,"_","_","_","kṣāra","NC","","_","_"
4,"_","_","_","tad","PRD","","_","_"
5,"_","_","_","khoṭa","NC","","_","_"
6,"_","_","_","marday","V","marday","_","_"
7,"_","_","_","kṣaṇa","NC","","_","_"
1,"_","_","_","mūṣā","NC","","_","_"
2,"_","_","_","antar","CAD","","_","_"
3,"_","_","_","lepay","V","lepay","_","_"
4,"_","_","_","tad","PRD","","_","_"
5,"_","_","_","tad","PRD","","_","_"
6,"_","_","_","tulya","JJ","","_","_"
7,"hāṭakaṃ","_","_","hāṭaka","NC","","_","_"
8,"kṣipet","_","_","kṣip","V","kṣip","_","_"
1,"_","_","_","yāvat","CX","","_","_"
2,"_","_","_","jṛ","PPP","","_","_"
3,"_","_","_","dha","V","dha","_","_"
4,"_","_","_","tāvat","CX","","_","_"
5,"_","_","_","punar","CAD","","_","_"
6,"svarṇaṃ","_","_","svarṇa","NC","","_","_"
7,"ca","_","_","ca","CCD","","_","_"
8,"dāpayet","_","_","dad","V","dā","_","_"
1,"_","_","_","jāray","V","jāray","_","_"
2,"_","_","_","dhamana","NC","","_","_"
3,"_","_","_","eva","CEM","","_","_"
4,"dattvā","_","_","dā","CGDA","","_","_"
5,"viḍavaṭīṃ","_","_","viḍavaṭī","NC","","_","_"
6,"kramāt","_","_","kramāt","CX","","_","_"
1,"evaṃ","_","_","eva","CX","","_","_"
2,"_","_","_","viṃśa","JJ","","_","_"
3,"_","_","_","guṇa","NC","","_","_"
4,"_","_","_","yāvat","CX","","_","_"
5,"_","_","_","tāvat","CX","","_","_"
6,"_","_","_","svarṇa","NC","","_","_"
7,"ca","_","_","ca","CCD","","_","_"
8,"jārayet","_","_","jar","V","jṛ","_","_"
1,"svarṇena","_","_","svarṇa","NC","","_","_"
2,"tu","_","_","tu","CCD","","_","_"
3,"samāvartya","_","_","samāvartay","CGDA","","_","_"
4,"_","_","_","sāraṇā","NC","","_","_"
5,"_","_","_","traya","NC","","_","_"
6,"_","_","_","yoga","NC","","_","_"
1,"_","_","_","tad","PRD","","_","_"
2,"_","_","_","eva","CEM","","_","_"
3,"_","_","_","vedhay","V","vedhay","_","_"
4,"_","_","_","śulba","NC","","_","_"
5,"_","_","_","sahasra","NUM","","_","_"
6,"_","_","_","aṃśa","NC","","_","_"
7,"kāṃcanam","_","_","kāñcana","NC","","_","_"
1,"jāyate","_","_","jan","V","jan","_","_"
2,"_","_","_","divya","JJ","","_","_"
3,"_","_","_","rūpa","NC","","_","_"
4,"_","_","_","āḍhya","JJ","","_","_"
5,"_","_","_","jāmbūnada","NC","","_","_"
6,"_","_","_","sama","PPX","","_","_"
7,"_","_","_","prabhā","NC","","_","_"
1,"_","_","_","vajramūṣā","NC","","_","_"
2,"_","_","_","ga","PPP","","_","_"
3,"dhmātaṃ","_","_","dha","PPP","","_","_"
4,"_","_","_","dvaṃdva","NC","","_","_"
5,"_","_","_","khoṭa","NC","","_","_"
6,"_","_","_","haṭha","NC","","_","_"
7,"_","_","_","agni","NC","","_","_"
1,"_","_","_","mākṣika","NC","","_","_"
2,"_","_","_","dhautasattva","NC","","_","_"
3,"vā","_","_","vā","CCD","","_","_"
4,"sattvaṃ","_","_","sattva","NC","","_","_"
5,"vā","_","_","vā","CCD","","_","_"
6,"_","_","_","mākṣika","NC","","_","_"
7,"_","_","_","udbhava","JJ","","_","_"
1,"stokaṃ","_","_","stoka","NC","","_","_"
2,"stokaṃ","_","_","stoka","NC","","_","_"
3,"_","_","_","kṣip","V","kṣip","_","_"
4,"_","_","_","tad","PRD","","_","_"
5,"_","_","_","dha","PPP","","_","_"
6,"jīrṇe","_","_","jṛ","PPP","","_","_"
7,"punaḥ","_","_","punar","CAD","","_","_"
8,"punaḥ","_","_","punar","CAD","","_","_"
1,"_","_","_","yāvat","CX","","_","_"
2,"_","_","_","tad","PRD","","_","_"
3,"_","_","_","kuṅkuma","NC","","_","_"
4,"_","_","_","ābha","JJ","","_","_"
5,"_","_","_","as","V","as","_","_"
6,"_","_","_","tāvat","CX","","_","_"
7,"_","_","_","vajra","NC","","_","_"
8,"samuddharet","_","_","samuddhar","V","samuddhṛ","_","_"
1,"_","_","_","lakṣa","NC","","_","_"
2,"_","_","_","aṃśa","NC","","_","_"
3,"tu","_","_","tu","CCD","","_","_"
4,"_","_","_","tad","PRD","","_","_"
5,"_","_","_","eva","CEM","","_","_"
6,"sitahemaṃ","_","_","sitahema","NC","","_","_"
7,"tu","_","_","tu","CCD","","_","_"
8,"vedhayet","_","_","vedhay","V","vedhay","_","_"
1,"jāyate","_","_","jan","V","jan","_","_"
2,"kanakaṃ","_","_","kanaka","NC","","_","_"
3,"divyaṃ","_","_","divya","JJ","","_","_"
4,"_","_","_","deva","NC","","_","_"
5,"_","_","_","ābharaṇa","NC","","_","_"
6,"_","_","_","uttama","JJ","","_","_"
1,"vaikrāṃtaṃ","_","_","vaikrānta","NC","","_","_"
2,"mākṣikaṃ","_","_","mākṣika","NC","","_","_"
3,"tutthaṃ","_","_","tuttha","NC","","_","_"
4,"_","_","_","rasaka","NC","","_","_"
5,"_","_","_","añjana","NC","","_","_"
6,"_","_","_","gairika","NC","","_","_"
1,"vimalā","_","_","vimalā","NC","","_","_"
2,"_","_","_","ca","CCD","","_","_"
3,"_","_","_","eva","CEM","","_","_"
4,"vaiḍūryam","_","_","vaiḍūrya","NC","","_","_"
5,"_","_","_","tad","PRD","","_","_"
6,"_","_","_","eka","PPX","","_","_"
7,"_","_","_","pala","NC","","_","_"
8,"_","_","_","ardhaka","JJ","","_","_"
1,"_","_","_","nāga","NC","","_","_"
2,"_","_","_","vaṅga","NC","","_","_"
3,"_","_","_","arkaka","NC","","_","_"
4,"_","_","_","eka","PPX","","_","_"
5,"yathālābhaṃ","_","_","yathālābha","CX","","_","_"
6,"_","_","_","pala","NC","","_","_"
7,"_","_","_","ardhaka","JJ","","_","_"
1,"_","_","_","dvaṃdva","NC","","_","_"
2,"_","_","_","cūrṇa","NC","","_","_"
3,"tato","_","_","tatas","CX","","_","_"
4,"ruddhvā","_","_","rudh","CGDA","","_","_"
5,"_","_","_","vajramūṣā","NC","","_","_"
6,"_","_","_","ga","PPP","","_","_"
7,"dhamet","_","_","dham","V","dha","_","_"
1,"pūrvavad","_","_","pūrvavat","CX","","_","_"
2,"_","_","_","gandhaka","NC","","_","_"
3,"_","_","_","amla","NC","","_","_"
4,"mardyaṃ","_","_","mṛd","KDG","","_","_"
5,"ruddhvā","_","_","rudh","CGDA","","_","_"
6,"puṭe","_","_","puṭa","NC","","_","_"
7,"pacet","_","_","pac","V","pac","_","_"
1,"_","_","_","caturdaśan","JJ","","_","_"
2,"_","_","_","puṭa","NC","","_","_"
3,"_","_","_","eva","CX","","_","_"
4,"_","_","_","bāla","JJ","","_","_"
5,"_","_","_","arka","NC","","_","_"
6,"_","_","_","sadṛśa","JJ","","_","_"
7,"bhavet","_","_","bhav","V","bhū","_","_"
1,"anena","_","_","ida","PRD","","_","_"
2,"_","_","_","vajra","NC","","_","_"
3,"_","_","_","khoṭa","NC","","_","_"
4,"tu","_","_","tu","CCD","","_","_"
5,"_","_","_","yathā","CCM","","_","_"
6,"_","_","_","pūrva","CX","","_","_"
7,"tu","_","_","tu","CCD","","_","_"
8,"rañjayet","_","_","raj","V","raj","_","_"
1,"_","_","_","tadvat","CX","","_","_"
2,"_","_","_","vadh","KDG","","_","_"
3,"sitaṃ","_","_","sita","JJ","","_","_"
4,"hema","_","_","heman","NC","","_","_"
5,"_","_","_","lakṣa","NC","","_","_"
6,"_","_","_","aṃśa","NC","","_","_"
7,"_","_","_","kāñcana","NC","","_","_"
8,"bhavet","_","_","bhav","V","bhū","_","_"
1,"athavā","_","_","athavā","CX","","_","_"
2,"_","_","_","dvaṃdva","NC","","_","_"
3,"_","_","_","khoṭa","NC","","_","_"
4,"tu","_","_","tu","CCD","","_","_"
5,"_","_","_","sūkṣma","JJ","","_","_"
6,"_","_","_","carv","PPP","","_","_"
7,"tu","_","_","tu","CCD","","_","_"
8,"kārayet","_","_","kar","V","kṛ","_","_"
1,"_","_","_","tad","PRD","","_","_"
2,"_","_","_","khoṭa","NC","","_","_"
3,"_","_","_","śudh","PPP","","_","_"
4,"_","_","_","cūrṇa","NC","","_","_"
5,"_","_","_","andhamūṣā","NC","","_","_"
6,"_","_","_","ga","PPP","","_","_"
7,"dhamet","_","_","dham","V","dha","_","_"
1,"_","_","_","āroṭa","NC","","_","_"
2,"_","_","_","rasa","NC","","_","_"
3,"_","_","_","tulya","JJ","","_","_"
4,"_","_","_","jambīra","NC","","_","_"
5,"_","_","_","marday","V","marday","_","_"
6,"dinam","_","_","dina","NC","","_","_"
1,"vastre","_","_","vastra","NC","","_","_"
2,"baddhvā","_","_","bandh","CGDA","","_","_"
3,"dinaṃ","_","_","dina","NC","","_","_"
4,"svedyaṃ","_","_","svid","KDG","","_","_"
5,"dolāyaṃtre","_","_","dolāyantra","NC","","_","_"
6,"_","_","_","sa_saha","CX","","_","_"
7,"_","_","_","kāñjika","NC","","_","_"
1,"_","_","_","sa_saha","CX","","_","_"
2,"_","_","_","vastra","NC","","_","_"
3,"_","_","_","pācay","V","pācay","_","_"
4,"_","_","_","paścāt","CAD","","_","_"
5,"gandhataile","_","_","gandhataila","NC","","_","_"
6,"_","_","_","dina","NC","","_","_"
7,"_","_","_","avadhi","CX","","_","_"
1,"tato","_","_","tatas","CX","","_","_"
2,"_","_","_","vastra","NC","","_","_"
3,"_","_","_","samuddhṛ","CGDA","","_","_"
4,"nigaḍena","_","_","nigaḍa","NC","","_","_"
5,"tule","_","_","tula","NC","","_","_"
6,"pacet","_","_","pac","V","pac","_","_"
1,"_","_","_","sveda","NC","","_","_"
2,"_","_","_","ādi","NC","","_","_"
3,"_","_","_","dhamana","NC","","_","_"
4,"_","_","_","anta","NC","","_","_"
5,"ca","_","_","ca","CCD","","_","_"
6,"_","_","_","kāray","V","kāray","_","_"
7,"_","_","_","heman","NC","","_","_"
8,"_","_","_","piṣṭi","NC","","_","_"
9,"_","_","_","vat","CX","","_","_"
1,"_","_","_","tad","PRD","","_","_"
2,"_","_","_","khoṭa","NC","","_","_"
3,"tu","_","_","tu","CCD","","_","_"
4,"samuddhṛtya","_","_","samuddhṛ","CGDA","","_","_"
5,"_","_","_","rañjay","V","rañjay","_","_"
6,"_","_","_","tad","PRD","","_","_"
7,"nigadyate","_","_","nigad","V","nigad","_","_"
1,"tīkṣṇaṃ","_","_","tīkṣṇa","NC","","_","_"
2,"śulbaṃ","_","_","śulba","NC","","_","_"
3,"samaṃ","_","_","sama","PPX","","_","_"
4,"cūrṇya","_","_","cūrṇay","CGDA","","_","_"
5,"_","_","_","andhamūṣā","NC","","_","_"
6,"_","_","_","ga","PPP","","_","_"
7,"dhamet","_","_","dham","V","dha","_","_"
1,"_","_","_","tad","PRD","","_","_"
2,"_","_","_","khoṭa","NC","","_","_"
3,"_","_","_","pala","NC","","_","_"
4,"_","_","_","eka","PPX","","_","_"
5,"tu","_","_","tu","CCD","","_","_"
6,"siddhacūrṇena","_","_","siddhacūrṇa","NC","","_","_"
7,"saṃyutam","_","_","saṃyuta","JJ","","_","_"
1,"cūrṇaṃ","_","_","cūrṇa","NC","","_","_"
2,"ruddhvā","_","_","rudh","CGDA","","_","_"
3,"dhamed","_","_","dham","V","dha","_","_"
4,"gāḍhaṃ","_","_","gāḍha","CX","","_","_"
5,"_","_","_","tad","PRD","","_","_"
6,"_","_","_","khoṭa","NC","","_","_"
7,"_","_","_","marday","V","marday","_","_"
8,"_","_","_","punar","CAD","","_","_"
1,"_","_","_","pūrvavat","CX","","_","_"
2,"_","_","_","gandhaka","NC","","_","_"
3,"_","_","_","amla","NC","","_","_"
4,"_","_","_","puṭa","NC","","_","_"
5,"_","_","_","dad","V","dā","_","_"
6,"_","_","_","caturdaśan","JJ","","_","_"
1,"anena","_","_","ida","PRD","","_","_"
2,"_","_","_","pūrva","PPX","","_","_"
3,"_","_","_","khoṭa","NC","","_","_"
4,"tu","_","_","tu","CCD","","_","_"
5,"_","_","_","mūṣā","NC","","_","_"
6,"_","_","_","madhye","CX","","_","_"
7,"ca","_","_","ca","CCD","","_","_"
8,"pūrvavat","_","_","pūrvavat","CX","","_","_"
1,"_","_","_","yāvat","CX","","_","_"
2,"_","_","_","kuṅkuma","NC","","_","_"
3,"_","_","_","varṇa","NC","","_","_"
4,"_","_","_","as","V","as","_","_"
5,"_","_","_","tāvat","CX","","_","_"
6,"_","_","_","vāra","NC","","_","_"
7,"śanaiḥ","_","_","śanais","CX","","_","_"
8,"śanaiḥ","_","_","śanais","CX","","_","_"
1,"svarṇena","_","_","svarṇa","NC","","_","_"
2,"ca","_","_","ca","CCD","","_","_"
3,"samāvartya","_","_","samāvartay","CGDA","","_","_"
4,"_","_","_","sāraṇā","NC","","_","_"
5,"_","_","_","traya","NC","","_","_"
6,"_","_","_","sāray","PPP","","_","_"
1,"anena","_","_","ida","PRD","","_","_"
2,"_","_","_","lakṣa","NC","","_","_"
3,"_","_","_","bhāga","NC","","_","_"
4,"drutaṃ","_","_","dru","PPP","","_","_"
5,"śulvaṃ","_","_","śulva","NC","","_","_"
6,"tu","_","_","tu","CCD","","_","_"
7,"vedhayet","_","_","vedhay","V","vedhay","_","_"
1,"jāyate","_","_","jan","V","jan","_","_"
2,"kanakaṃ","_","_","kanaka","NC","","_","_"
3,"divyaṃ","_","_","divya","JJ","","_","_"
4,"satyaṃ","_","_","satya","NC","","_","_"
5,"_","_","_","śaṃkara","NC","","_","_"
6,"_","_","_","bhāṣ","PPP","","_","_"
1,"_","_","_","karṣa","NC","","_","_"
2,"_","_","_","eka","PPX","","_","_"
3,"drutasūtasya","_","_","drutasūta","NC","","_","_"
4,"_","_","_","hi","CX","","_","_"
5,"_","_","_","aṣṭan","NUM","","_","_"
6,"_","_","_","guñjā","NC","","_","_"
7,"tu","_","_","tu","CCD","","_","_"
8,"hāṭakam","_","_","hāṭaka","NC","","_","_"
1,"_","_","_","catur","NUM","","_","_"
2,"_","_","_","guñjā","NC","","_","_"
3,"mṛtaṃ","_","_","mṛ","PPP","","_","_"
4,"vajraṃ","_","_","vajra","NC","","_","_"
5,"haṃsapādyā","_","_","haṃsapādī","NC","","_","_"
6,"_","_","_","drava","NC","","_","_"
7,"_","_","_","dina","NC","","_","_"
1,"_","_","_","marday","V","marday","_","_"
2,"_","_","_","taptakhalva","NC","","_","_"
3,"tu","_","_","tu","CCD","","_","_"
4,"_","_","_","vajramūṣā","NC","","_","_"
5,"_","_","_","andhay","PPP","","_","_"
6,"pacet","_","_","pac","V","pac","_","_"
1,"_","_","_","bhūdhara","NC","","_","_"
2,"_","_","_","ākhya","JJ","","_","_"
3,"_","_","_","puṭa","NC","","_","_"
4,"_","_","_","eka","PPX","","_","_"
5,"_","_","_","samuddhṛ","CGDA","","_","_"
6,"_","_","_","atha","CAD","","_","_"
7,"mardayet","_","_","marday","V","marday","_","_"
1,"haṃsapādyā","_","_","haṃsapādī","NC","","_","_"
2,"_","_","_","drava","NC","","_","_"
3,"_","_","_","eva","CX","","_","_"
4,"taptakhalve","_","_","taptakhalva","NC","","_","_"
5,"_","_","_","dina","NC","","_","_"
6,"_","_","_","avadhi","CX","","_","_"
1,"_","_","_","pūrvavat","CX","","_","_"
2,"_","_","_","bhūdhara","NC","","_","_"
3,"_","_","_","pac","V","pac","_","_"
4,"_","_","_","eva","CX","","_","_"
5,"_","_","_","śata","NUM","","_","_"
6,"_","_","_","puṭa","NC","","_","_"
7,"pacet","_","_","pac","V","pac","_","_"
1,"_","_","_","rakta","JJ","","_","_"
2,"_","_","_","varṇa","NC","","_","_"
3,"bhaved","_","_","bhav","V","bhū","_","_"
4,"bhasma","_","_","bhasman","NC","","_","_"
5,"_","_","_","sarva","JQ","","_","_"
6,"_","_","_","yoga","NC","","_","_"
7,"yojayet","_","_","yuj","V","yuj","_","_"
1,"_","_","_","drava","NC","","_","_"
2,"_","_","_","vartula","JJ","","_","_"
3,"_","_","_","pattra","NC","","_","_"
4,"somavallyā","_","_","somavallī","NC","","_","_"
5,"_","_","_","drava","NC","","_","_"
6,"_","_","_","ca","CCD","","_","_"
7,"vā","_","_","vā","CCD","","_","_"
1,"dhānyābhraṃ","_","_","dhānyābhra","NC","","_","_"
2,"saptadhā","_","_","saptadhā","CX","","_","_"
3,"bhāvyaṃ","_","_","bhāvay","KDG","","_","_"
4,"tato","_","_","tatas","CX","","_","_"
5,"_","_","_","jāraṇa","NC","","_","_"
6,"_","_","_","ārabh","V","ārabh","_","_"
1,"_","_","_","gostana","NC","","_","_"
2,"_","_","_","ākāra","NC","","_","_"
3,"_","_","_","mūṣā","NC","","_","_"
4,"sūtaṃ","_","_","sūta","NC","","_","_"
5,"śuddhaṃ","_","_","śudh","PPP","","_","_"
6,"vinikṣipet","_","_","vinikṣip","V","vinikṣip","_","_"
1,"_","_","_","pūrva","PPX","","_","_"
2,"_","_","_","abhra","NC","","_","_"
3,"_","_","_","ṣoḍaśa","JJ","","_","_"
4,"_","_","_","aṃśa","NC","","_","_"
5,"ca","_","_","ca","CCD","","_","_"
6,"mūṣāyāṃ","_","_","mūṣā","NC","","_","_"
7,"_","_","_","caṇaka","NC","","_","_"
8,"_","_","_","drava","NC","","_","_"
1,"_","_","_","vālukā","NC","","_","_"
2,"_","_","_","bhāṇḍa","NC","","_","_"
3,"_","_","_","madhye","CX","","_","_"
4,"tu","_","_","tu","CCD","","_","_"
5,"cullyāṃ","_","_","cullī","NC","","_","_"
6,"_","_","_","mṛdu","JJ","","_","_"
7,"_","_","_","agni","NC","","_","_"
8,"pacet","_","_","pac","V","pac","_","_"
1,"abhrake","_","_","abhraka","NC","","_","_"
2,"_","_","_","caṇaka","NC","","_","_"
3,"_","_","_","drāva","NC","","_","_"
4,"jīrṇe","_","_","jṛ","PPP","","_","_"
5,"jīrṇe","_","_","jṛ","PPP","","_","_"
6,"_","_","_","kṣip","V","kṣip","_","_"
7,"_","_","_","punar","CAD","","_","_"
1,"_","_","_","iti","CQT","","_","_"
2,"_","_","_","eva","CX","","_","_"
3,"_","_","_","jāray","V","jāray","_","_"
4,"_","_","_","tulya","JJ","","_","_"
5,"pārade","_","_","pārada","NC","","_","_"
6,"gaganaṃ","_","_","gagana","NC","","_","_"
7,"kramāt","_","_","kramāt","CX","","_","_"
1,"_","_","_","somavallī","NC","","_","_"
2,"_","_","_","rasa","NC","","_","_"
3,"_","_","_","yāma","NC","","_","_"
4,"mardyaṃ","_","_","mṛd","KDG","","_","_"
5,"dhānyābhrakaṃ","_","_","dhānyābhraka","NC","","_","_"
6,"tataḥ","_","_","tatas","CX","","_","_"
1,"ruddhvā","_","_","rudh","CGDA","","_","_"
2,"vanotpalair","_","_","vanotpala","NC","","_","_"
3,"dadyāt","_","_","dad","V","dā","_","_"
4,"kramād","_","_","kramāt","CX","","_","_"
5,"evaṃ","_","_","eva","CX","","_","_"
6,"_","_","_","puṭa","NC","","_","_"
7,"_","_","_","traya","NC","","_","_"
1,"saptadhā","_","_","saptadhā","CX","","_","_"
2,"bhāvayed","_","_","bhav","V","bhū","_","_"
3,"gharme","_","_","gharma","NC","","_","_"
4,"somavallyā","_","_","somavallī","NC","","_","_"
5,"_","_","_","drava","NC","","_","_"
6,"_","_","_","dina","NC","","_","_"
1,"śvetāyāḥ","_","_","śveta","JJ","","_","_"
2,"śarapuṅkhāyā","_","_","śarapuṅkha","NC","","_","_"
3,"_","_","_","mūla","NC","","_","_"
4,"_","_","_","go","CX","","_","_"
5,"_","_","_","kṣīra","NC","","_","_"
6,"_","_","_","gharṣay","PPP","","_","_"
1,"_","_","_","kalkay","PPP","","_","_"
2,"_","_","_","mṛṇmaya","JJ","","_","_"
3,"pātraṃ","_","_","pātra","NC","","_","_"
4,"liptvā","_","_","lip","CGDA","","_","_"
5,"_","_","_","tatra","CAD","","_","_"
6,"_","_","_","abhraka","NC","","_","_"
7,"kṣipet","_","_","kṣip","V","kṣip","_","_"
1,"_","_","_","tad","PRD","","_","_"
2,"_","_","_","madhye","CX","","_","_"
3,"_","_","_","nikṣip","V","nikṣip","_","_"
4,"_","_","_","sūta","NC","","_","_"
5,"_","_","_","tad","PRD","","_","_"
6,"_","_","_","pṛṣṭha","NC","","_","_"
7,"_","_","_","ca","CCD","","_","_"
8,"_","_","_","abhraka","NC","","_","_"
9,"punaḥ","_","_","punar","CAD","","_","_"
1,"_","_","_","somavallī","NC","","_","_"
2,"_","_","_","drava","NC","","_","_"
3,"pūrvaṃ","_","_","pūrva","CX","","_","_"
4,"_","_","_","tad","PRD","","_","_"
5,"_","_","_","pātra","NC","","_","_"
6,"_","_","_","ca","CCD","","_","_"
7,"_","_","_","ātapa","NC","","_","_"
8,"khare","_","_","khara","JJ","","_","_"
1,"_","_","_","dhāray","V","dhāray","_","_"
2,"_","_","_","car","V","car","_","_"
3,"dīrghaṃ","_","_","dīrgha","JJ","","_","_"
4,"jāyate","_","_","jan","V","jan","_","_"
5,"_","_","_","vyoman","NC","","_","_"
6,"_","_","_","piṣṭikā","NC","","_","_"
1,"_","_","_","pūrva","PPX","","_","_"
2,"_","_","_","vac","PPP","","_","_"
3,"_","_","_","gandha","NC","","_","_"
4,"_","_","_","piṣṭī","NC","","_","_"
5,"yā","_","_","yad","PRL","","_","_"
6,"stambhitā","_","_","stambhay","PPP","","_","_"
7,"jāraṇaṃ","_","_","jāraṇa","NC","","_","_"
8,"vinā","_","_","vinā","CX","","_","_"
1,"tathā","_","_","tathā","CX","","_","_"
2,"_","_","_","hi","CX","","_","_"
3,"_","_","_","abhraka","NC","","_","_"
4,"_","_","_","piṣṭī","NC","","_","_"
5,"ca","_","_","ca","CCD","","_","_"
6,"_","_","_","abhra","NC","","_","_"
7,"_","_","_","sattva","NC","","_","_"
8,"tṛtīyakam","_","_","tṛtīyaka","JJ","","_","_"
1,"caturthaṃ","_","_","caturtha","JJ","","_","_"
2,"_","_","_","rakta","JJ","","_","_"
3,"_","_","_","bhasman","NC","","_","_"
4,"_","_","_","api","CX","","_","_"
5,"pūrvaṃ","_","_","pūrva","CX","","_","_"
6,"vajreṇa","_","_","vajra","NC","","_","_"
7,"_","_","_","yad","PRL","","_","_"
8,"_","_","_","kṛ","PPP","","_","_"
1,"catvāraḥ","_","_","catur","NUM","","_","_"
2,"_","_","_","prati","CADP","","_","_"
3,"_","_","_","karṣa","NC","","_","_"
4,"_","_","_","aṃśa","NC","","_","_"
5,"jāritaṃ","_","_","jāray","PPP","","_","_"
6,"pāradaṃ","_","_","pārada","NC","","_","_"
7,"palam","_","_","pala","NC","","_","_"
1,"_","_","_","sarva","JQ","","_","_"
2,"_","_","_","tad","PRD","","_","_"
3,"_","_","_","taptakhalva","NC","","_","_"
4,"haṃsapādyā","_","_","haṃsapādī","NC","","_","_"
5,"_","_","_","drava","NC","","_","_"
6,"_","_","_","dina","NC","","_","_"
1,"marditaṃ","_","_","marday","PPP","","_","_"
2,"_","_","_","tad","PRD","","_","_"
3,"_","_","_","samuddhṛ","CGDA","","_","_"
4,"_","_","_","pac","V","pac","_","_"
5,"_","_","_","kacchapayantraka","NC","","_","_"
1,"_","_","_","yāvat","CX","","_","_"
2,"_","_","_","sūta","NC","","_","_"
3,"_","_","_","avaśeṣa","NC","","_","_"
4,"tu","_","_","tu","CCD","","_","_"
5,"_","_","_","tāvat","CX","","_","_"
6,"_","_","_","jāray","KDG","","_","_"
7,"puṭena","_","_","puṭa","NC","","_","_"
8,"vai","_","_","vai","CX","","_","_"
1,"asya","_","_","ida","PRD","","_","_"
2,"sūtasya","_","_","sūta","NC","","_","_"
3,"_","_","_","tulya","JJ","","_","_"
4,"_","_","_","aṃśa","NC","","_","_"
5,"_","_","_","vajra","NC","","_","_"
6,"_","_","_","dvaṃdva","NC","","_","_"
7,"niyojayet","_","_","niyuj","V","niyuj","_","_"
1,"_","_","_","dolā","NC","","_","_"
2,"_","_","_","sveda","NC","","_","_"
3,"paktavyaṃ","_","_","pac","KDG","","_","_"
4,"yāvad","_","_","yāvat","CX","","_","_"
5,"bhavati","_","_","bhav","V","bhū","_","_"
6,"golakam","_","_","golaka","NC","","_","_"
1,"_","_","_","jāray","V","jāray","_","_"
2,"_","_","_","kacchapa","NC","","_","_"
3,"yaṃtre","_","_","yantra","NC","","_","_"
4,"_","_","_","yāvat","CX","","_","_"
5,"_","_","_","sūta","NC","","_","_"
6,"_","_","_","avaśeṣay","PPP","","_","_"
1,"_","_","_","iti","CQT","","_","_"
2,"_","_","_","eva","CX","","_","_"
3,"ṣaḍguṇaṃ","_","_","ṣaḍguṇa","JJ","","_","_"
4,"jāryaṃ","_","_","jāray","KDG","","_","_"
5,"_","_","_","vajra","NC","","_","_"
6,"_","_","_","dvaṃdva","NC","","_","_"
7,"prayatnataḥ","_","_","prayatna","NC","","_","_"
1,"_","_","_","tad","PRD","","_","_"
2,"_","_","_","eva","CEM","","_","_"
3,"_","_","_","vajra","NC","","_","_"
4,"_","_","_","dvaṃdva","NC","","_","_"
5,"_","_","_","sāray","V","sāray","_","_"
6,"_","_","_","sāraṇā","NC","","_","_"
7,"_","_","_","traya","NC","","_","_"
1,"anena","_","_","ida","PRD","","_","_"
2,"_","_","_","koṭi","NC","","_","_"
3,"_","_","_","bhāga","NC","","_","_"
4,"drutaṃ","_","_","dru","PPP","","_","_"
5,"śulbaṃ","_","_","śulba","NC","","_","_"
6,"tu","_","_","tu","CCD","","_","_"
7,"vedhayet","_","_","vedhay","V","vedhay","_","_"
1,"jāyate","_","_","jan","V","jan","_","_"
2,"kanakaṃ","_","_","kanaka","NC","","_","_"
3,"divyaṃ","_","_","divya","JJ","","_","_"
4,"_","_","_","deva","NC","","_","_"
5,"_","_","_","ābharaṇa","NC","","_","_"
6,"_","_","_","bhūṣaṇa","NC","","_","_"
1,"_","_","_","bhāga","NC","","_","_"
2,"_","_","_","eka","PPX","","_","_"
3,"_","_","_","mṛ","PPP","","_","_"
4,"_","_","_","vajra","NC","","_","_"
5,"_","_","_","śudh","PPP","","_","_"
6,"_","_","_","sūta","NC","","_","_"
7,"ṣoḍaśa","_","_","ṣoḍaśan","JJ","","_","_"
1,"_","_","_","marday","V","marday","_","_"
2,"_","_","_","amlavarga","NC","","_","_"
3,"taptakhalve","_","_","taptakhalva","NC","","_","_"
4,"_","_","_","dina","NC","","_","_"
5,"_","_","_","avadhi","CX","","_","_"
1,"_","_","_","pakva","JJ","","_","_"
2,"_","_","_","bīja","NC","","_","_"
3,"patrāṇi","_","_","pattra","NC","","_","_"
4,"_","_","_","tulya","JJ","","_","_"
5,"_","_","_","tad","PRD","","_","_"
6,"lepayet","_","_","lepay","V","lepay","_","_"
1,"_","_","_","su","CAD","","_","_"
2,"_","_","_","pakva","JJ","","_","_"
3,"_","_","_","bhānu","NC","","_","_"
4,"_","_","_","pattra","NC","","_","_"
5,"_","_","_","tu","CCD","","_","_"
6,"_","_","_","lip","PPP","","_","_"
7,"_","_","_","pattra","NC","","_","_"
8,"veṣṭayet","_","_","veṣṭay","V","veṣṭay","_","_"
1,"_","_","_","śarāva","NC","","_","_"
2,"_","_","_","sampuṭa","NC","","_","_"
3,"ruddhvā","_","_","rudh","CGDA","","_","_"
4,"_","_","_","nikhan","V","nikhan","_","_"
5,"_","_","_","cullī","NC","","_","_"
6,"_","_","_","madhyatas","CX","","_","_"
1,"_","_","_","tri","NUM","","_","_"
2,"_","_","_","dina","NC","","_","_"
3,"_","_","_","jvālay","V","jvālay","_","_"
4,"_","_","_","tatra","CAD","","_","_"
5,"_","_","_","vahni","NC","","_","_"
6,"_","_","_","alpa","JJ","","_","_"
7,"_","_","_","alpaśas","CX","","_","_"
8,"kramāt","_","_","kramāt","CX","","_","_"
1,"tato","_","_","tatas","CX","","_","_"
2,"_","_","_","nigaḍa","NC","","_","_"
3,"_","_","_","lip","PPP","","_","_"
4,"mūṣāyāṃ","_","_","mūṣā","NC","","_","_"
5,"tena","_","_","tad","PRD","","_","_"
6,"rodhayet","_","_","rudh","V","rudh","_","_"
1,"_","_","_","kārīṣa","NC","","_","_"
2,"_","_","_","vahni","NC","","_","_"
3,"pacyāt","_","_","pac","V","pac","_","_"
4,"_","_","_","ahorātra","NC","","_","_"
5,"_","_","_","samuddhar","V","samuddhṛ","_","_"
1,"madhunā","_","_","madhu","NC","","_","_"
2,"_","_","_","marday","V","marday","_","_"
3,"_","_","_","kiṃcit","PRI","","_","_"
4,"_","_","_","tatas","CX","","_","_"
5,"_","_","_","tad","PRD","","_","_"
6,"_","_","_","śata","NUM","","_","_"
7,"_","_","_","aṃśa","NC","","_","_"
1,"liptvā","_","_","lip","CGDA","","_","_"
2,"_","_","_","candrārka","NC","","_","_"
3,"_","_","_","pattra","NC","","_","_"
4,"_","_","_","hi","CX","","_","_"
5,"_","_","_","andhamūṣā","NC","","_","_"
6,"_","_","_","ga","PPP","","_","_"
7,"dhamet","_","_","dham","V","dha","_","_"
1,"svarṇaṃ","_","_","svarṇa","NC","","_","_"
2,"bhavati","_","_","bhav","V","bhū","_","_"
3,"_","_","_","rūpa","NC","","_","_"
4,"_","_","_","āḍhya","JJ","","_","_"
5,"satyaṃ","_","_","satya","NC","","_","_"
6,"_","_","_","śaṃkara","NC","","_","_"
7,"_","_","_","bhāṣ","PPP","","_","_"
1,"_","_","_","mṛ","PPP","","_","_"
2,"_","_","_","vajra","NC","","_","_"
3,"_","_","_","bhāga","NC","","_","_"
4,"_","_","_","eka","PPX","","_","_"
5,"_","_","_","bhāga","NC","","_","_"
6,"_","_","_","eka","PPX","","_","_"
7,"hāṭakasya","_","_","hāṭaka","NC","","_","_"
8,"ca","_","_","ca","CCD","","_","_"
1,"_","_","_","tri","NUM","","_","_"
2,"_","_","_","bhāga","NC","","_","_"
3,"drutasūtasya","_","_","drutasūta","NC","","_","_"
4,"sarvaṃ","_","_","sarva","JQ","","_","_"
5,"stanyena","_","_","stanya","NC","","_","_"
6,"mardayet","_","_","marday","V","marday","_","_"
1,"_","_","_","tad","PRD","","_","_"
2,"_","_","_","gola","NC","","_","_"
3,"_","_","_","bandhay","V","bandhay","_","_"
4,"_","_","_","vastra","NC","","_","_"
5,"gandhataile","_","_","gandhataila","NC","","_","_"
6,"_","_","_","tri","NUM","","_","_"
7,"_","_","_","aha","NC","","_","_"
8,"pacet","_","_","pac","V","pac","_","_"
1,"_","_","_","tatas","CX","","_","_"
2,"_","_","_","tulya","JJ","","_","_"
3,"svarṇena","_","_","svarṇa","NC","","_","_"
4,"samāvartaṃ","_","_","samāvarta","NC","","_","_"
5,"tu","_","_","tu","CCD","","_","_"
6,"kārayet","_","_","kar","V","kṛ","_","_"
1,"dattvā","_","_","dā","CGDA","","_","_"
2,"viḍavaṭīṃ","_","_","viḍavaṭī","NC","","_","_"
3,"_","_","_","ca","CCD","","_","_"
4,"_","_","_","eva","CEM","","_","_"
5,"_","_","_","ekaviṃśati","NC","","_","_"
6,"_","_","_","vāraka","NC","","_","_"
1,"_","_","_","ekaviṃśa","JJ","","_","_"
2,"_","_","_","guṇa","NC","","_","_"
3,"jīrṇe","_","_","jṛ","PPP","","_","_"
4,"_","_","_","sāray","V","sāray","_","_"
5,"_","_","_","sāraṇā","NC","","_","_"
6,"_","_","_","traya","NC","","_","_"
1,"_","_","_","sahasra","NUM","","_","_"
2,"_","_","_","aṃśa","NC","","_","_"
3,"_","_","_","tad","PRD","","_","_"
4,"_","_","_","eva","CEM","","_","_"
5,"śulbe","_","_","śulba","NC","","_","_"
6,"vedhaṃ","_","_","vedha","NC","","_","_"
7,"pradāpayet","_","_","pradad","V","pradā","_","_"
1,"jāyate","_","_","jan","V","jan","_","_"
2,"kanakaṃ","_","_","kanaka","NC","","_","_"
3,"divyaṃ","_","_","divya","JJ","","_","_"
4,"_","_","_","deva","NC","","_","_"
5,"_","_","_","ābharaṇa","NC","","_","_"
6,"_","_","_","bhūṣaṇa","NC","","_","_"
1,"_","_","_","śudh","PPP","","_","_"
2,"_","_","_","sūta","NC","","_","_"
3,"mṛtaṃ","_","_","mṛ","PPP","","_","_"
4,"vajraṃ","_","_","vajra","NC","","_","_"
5,"haṃsapādyā","_","_","haṃsapādī","NC","","_","_"
6,"dravaiḥ","_","_","drava","NC","","_","_"
7,"samam","_","_","sama","PPX","","_","_"
1,"_","_","_","marday","V","marday","_","_"
2,"_","_","_","taptakhalva","NC","","_","_"
3,"tu","_","_","tu","CCD","","_","_"
4,"_","_","_","tri","NUM","","_","_"
5,"_","_","_","dina","NC","","_","_"
6,"_","_","_","anta","NC","","_","_"
7,"samuddharet","_","_","samuddhar","V","samuddhṛ","_","_"
1,"bījair","_","_","bīja","NC","","_","_"
2,"divyauṣadhānāṃ","_","_","divyauṣadha","NC","","_","_"
3,"ca","_","_","ca","CCD","","_","_"
4,"piṣṭvā","_","_","piṣ","CGDA","","_","_"
5,"mūṣāṃ","_","_","mūṣā","NC","","_","_"
6,"pralepayet","_","_","pralepay","V","pralepay","_","_"
1,"tatra","_","_","tatra","CAD","","_","_"
2,"_","_","_","pūrva","PPX","","_","_"
3,"_","_","_","rasa","NC","","_","_"
4,"kṣiptvā","_","_","kṣip","CGDA","","_","_"
5,"ruddhvā","_","_","rudh","CGDA","","_","_"
6,"tat","_","_","tad","PRD","","_","_"
7,"_","_","_","karīṣa","NC","","_","_"
8,"_","_","_","agni","NC","","_","_"
1,"samuddhṛtya","_","_","samuddhṛ","CGDA","","_","_"
2,"_","_","_","punar","CAD","","_","_"
3,"_","_","_","tad","PRD","","_","_"
4,"_","_","_","śudh","PPP","","_","_"
5,"_","_","_","sūta","NC","","_","_"
6,"samaṃ","_","_","sama","PPX","","_","_"
7,"kṣipet","_","_","kṣip","V","kṣip","_","_"
1,"haṃsapādyā","_","_","haṃsapādī","NC","","_","_"
2,"_","_","_","drava","NC","","_","_"
3,"_","_","_","mṛd","KDG","","_","_"
4,"pūrvavad","_","_","pūrvavat","CX","","_","_"
5,"_","_","_","divasa","NC","","_","_"
6,"_","_","_","traya","NC","","_","_"
1,"_","_","_","tad","PRD","","_","_"
2,"_","_","_","gola","NC","","_","_"
3,"_","_","_","pūrva","PPX","","_","_"
4,"_","_","_","mūṣā","NC","","_","_"
5,"ruddhvā","_","_","rudh","CGDA","","_","_"
6,"gajapuṭe","_","_","gajapuṭa","NC","","_","_"
7,"pacet","_","_","pac","V","pac","_","_"
1,"jāyate","_","_","jan","V","jan","_","_"
2,"bhasma","_","_","bhasman","NC","","_","_"
3,"_","_","_","sūta","NC","","_","_"
4,"_","_","_","ida","PRD","","_","_"
5,"_","_","_","sarva","JQ","","_","_"
6,"_","_","_","karman","NC","","_","_"
7,"yojayet","_","_","yuj","V","yuj","_","_"
1,"asya","_","_","ida","PRD","","_","_"
2,"tulyaṃ","_","_","tulya","JJ","","_","_"
3,"_","_","_","śudh","PPP","","_","_"
4,"_","_","_","sūta","NC","","_","_"
5,"_","_","_","sūta","NC","","_","_"
6,"_","_","_","pāda","NC","","_","_"
7,"ca","_","_","ca","CCD","","_","_"
8,"ṭaṃkaṇam","_","_","ṭaṅkaṇa","NC","","_","_"
1,"_","_","_","sarva","JQ","","_","_"
2,"_","_","_","amla","NC","","_","_"
3,"_","_","_","dina","NC","","_","_"
4,"mardyaṃ","_","_","mṛd","KDG","","_","_"
5,"kṛtvā","_","_","kṛ","CGDA","","_","_"
6,"golaṃ","_","_","gola","NC","","_","_"
7,"samuddharet","_","_","samuddhar","V","samuddhṛ","_","_"
1,"_","_","_","rakta","JJ","","_","_"
2,"_","_","_","kārpāsa","NC","","_","_"
3,"_","_","_","bīja","NC","","_","_"
4,"rājikā","_","_","rājikā","NC","","_","_"
5,"yavaciñcikā","_","_","yavaciñcikā","NC","","_","_"
1,"vandhyākarkoṭakī","_","_","vandhyākarkoṭakī","NC","","_","_"
2,"_","_","_","ca","CCD","","_","_"
3,"_","_","_","eva","CEM","","_","_"
4,"piṣṭvā","_","_","piṣ","CGDA","","_","_"
5,"golaṃ","_","_","gola","NC","","_","_"
6,"pralepayet","_","_","pralepay","V","pralepay","_","_"
1,"_","_","_","ūrdhva","JJ","","_","_"
2,"_","_","_","adhas","CX","","_","_"
3,"lavaṇaṃ","_","_","lavaṇa","NC","","_","_"
4,"dattvā","_","_","dā","CGDA","","_","_"
5,"ruddhvā","_","_","rudh","CGDA","","_","_"
6,"mūṣāṃ","_","_","mūṣā","NC","","_","_"
7,"viśoṣayet","_","_","viśuṣ","V","viśuṣ","_","_"
1,"_","_","_","kārīṣa","NC","","_","_"
2,"_","_","_","agni","NC","","_","_"
3,"divārātrau","_","_","divārātra","NC","","_","_"
4,"pācayitvā","_","_","pācay","CGDA","","_","_"
5,"samuddharet","_","_","samuddhar","V","samuddhṛ","_","_"
1,"_","_","_","pūrva","PPX","","_","_"
2,"_","_","_","kalka","NC","","_","_"
3,"_","_","_","tad","PRD","","_","_"
4,"_","_","_","gola","NC","","_","_"
5,"kṣiptvā","_","_","kṣip","CGDA","","_","_"
6,"_","_","_","rudh","CGDA","","_","_"
7,"_","_","_","atha","CAD","","_","_"
8,"pūrvavat","_","_","pūrvavat","CX","","_","_"
1,"puṭe","_","_","puṭa","NC","","_","_"
2,"_","_","_","pac","V","pac","_","_"
3,"_","_","_","divārātra","NC","","_","_"
4,"evaṃ","_","_","eva","CX","","_","_"
5,"_","_","_","kar","V","kṛ","_","_"
6,"_","_","_","ca","CCD","","_","_"
7,"saptadhā","_","_","saptadhā","CX","","_","_"
1,"_","_","_","tatas","CX","","_","_"
2,"_","_","_","tad","PRD","","_","_"
3,"_","_","_","eva","CEM","","_","_"
4,"kalkena","_","_","kalka","NC","","_","_"
5,"liptvā","_","_","lip","CGDA","","_","_"
6,"_","_","_","rudh","CGDA","","_","_"
7,"_","_","_","atha","CAD","","_","_"
8,"śoṣayet","_","_","śuṣ","V","śuṣ","_","_"
1,"_","_","_","samyak","CX","","_","_"
2,"_","_","_","gajapuṭa","NC","","_","_"
3,"_","_","_","pac","V","pac","_","_"
4,"_","_","_","tatas","CX","","_","_"
5,"_","_","_","mūṣā","NC","","_","_"
6,"_","_","_","ga","PPP","","_","_"
7,"dhamet","_","_","dham","V","dha","_","_"
1,"_","_","_","śatama","JJ","","_","_"
2,"_","_","_","aṃśa","NC","","_","_"
3,"_","_","_","tad","PRD","","_","_"
4,"_","_","_","eva","CEM","","_","_"
5,"_","_","_","candra","NC","","_","_"
6,"_","_","_","arka","NC","","_","_"
7,"vedhayed","_","_","vedhay","V","vedhay","_","_"
8,"drutam","_","_","dru","PPP","","_","_"
1,"jāyate","_","_","jan","V","jan","_","_"
2,"kanakaṃ","_","_","kanaka","NC","","_","_"
3,"divyaṃ","_","_","divya","JJ","","_","_"
4,"_","_","_","deva","NC","","_","_"
5,"_","_","_","ābharaṇa","NC","","_","_"
6,"_","_","_","bhūṣaṇa","NC","","_","_"
1,"athavā","_","_","athavā","CX","","_","_"
2,"_","_","_","bhasman","NC","","_","_"
3,"_","_","_","sūta","NC","","_","_"
4,"_","_","_","tad","PRD","","_","_"
5,"_","_","_","kṛ","KDG","","_","_"
6,"_","_","_","ṭaṅkaṇa","NC","","_","_"
7,"_","_","_","saṃyuta","JJ","","_","_"
1,"_","_","_","andhamūṣā","NC","","_","_"
2,"_","_","_","ga","PPP","","_","_"
3,"dhmātaṃ","_","_","dha","PPP","","_","_"
4,"khoṭaṃ","_","_","khoṭa","NC","","_","_"
5,"bhavati","_","_","bhav","V","bhū","_","_"
6,"śobhanam","_","_","śobhana","JJ","","_","_"
1,"_","_","_","khoṭa","NC","","_","_"
2,"_","_","_","tulya","JJ","","_","_"
3,"_","_","_","śudh","PPP","","_","_"
4,"_","_","_","heman","NC","","_","_"
5,"_","_","_","sarva","JQ","","_","_"
6,"_","_","_","ekatra","CX","","_","_"
7,"drāvayet","_","_","dru","V","dru","_","_"
1,"candrārkaṃ","_","_","candrārka","NC","","_","_"
2,"_","_","_","vedhay","V","vedhay","_","_"
3,"_","_","_","tad","PRD","","_","_"
4,"_","_","_","pūrvavat","CX","","_","_"
5,"_","_","_","kāñcana","NC","","_","_"
6,"bhavet","_","_","bhav","V","bhū","_","_"
1,"_","_","_","vajra","NC","","_","_"
2,"_","_","_","bhasman","NC","","_","_"
3,"_","_","_","snuhī","NC","","_","_"
4,"_","_","_","kṣīra","NC","","_","_"
5,"_","_","_","dina","NC","","_","_"
6,"ekaṃ","_","_","eka","PPX","","_","_"
7,"vimardayet","_","_","vimarday","V","vimarday","_","_"
1,"ruddhvā","_","_","rudh","CGDA","","_","_"
2,"gajapuṭe","_","_","gajapuṭa","NC","","_","_"
3,"pacyāt","_","_","pac","V","pac","_","_"
4,"evaṃ","_","_","eva","CX","","_","_"
5,"_","_","_","śata","NUM","","_","_"
6,"_","_","_","puṭa","NC","","_","_"
7,"pacet","_","_","pac","V","pac","_","_"
1,"_","_","_","tad","PRD","","_","_"
2,"_","_","_","tulya","JJ","","_","_"
3,"pāradaṃ","_","_","pārada","NC","","_","_"
4,"śuddhaṃ","_","_","śudh","PPP","","_","_"
5,"kṣiptvā","_","_","kṣip","CGDA","","_","_"
6,"mardyaṃ","_","_","mṛd","KDG","","_","_"
7,"_","_","_","dina","NC","","_","_"
8,"_","_","_","traya","NC","","_","_"
1,"devadālyā","_","_","devadālī","NC","","_","_"
2,"_","_","_","drava","NC","","_","_"
3,"_","_","_","eva","CX","","_","_"
4,"_","_","_","tad","PRD","","_","_"
5,"_","_","_","gola","NC","","_","_"
6,"_","_","_","ca","CCD","","_","_"
7,"_","_","_","andhay","PPP","","_","_"
8,"puṭet","_","_","puṭ","V","puṭ","_","_"
1,"_","_","_","kārīṣa","NC","","_","_"
2,"_","_","_","agni","NC","","_","_"
3,"divārātrau","_","_","divārātra","NC","","_","_"
4,"_","_","_","samuddhṛ","CGDA","","_","_"
5,"_","_","_","atha","CAD","","_","_"
6,"mardayet","_","_","marday","V","marday","_","_"
1,"devadālyā","_","_","devadālī","NC","","_","_"
2,"dravais","_","_","drava","NC","","_","_"
3,"_","_","_","tri","NUM","","_","_"
4,"_","_","_","aha","NC","","_","_"
5,"_","_","_","tadvat","CX","","_","_"
6,"_","_","_","rudh","CGDA","","_","_"
7,"puṭe","_","_","puṭa","NC","","_","_"
8,"pacet","_","_","pac","V","pac","_","_"
1,"evaṃ","_","_","eva","CX","","_","_"
2,"_","_","_","daśan","NUM","","_","_"
3,"_","_","_","puṭa","NC","","_","_"
4,"pācyaṃ","_","_","pac","KDG","","_","_"
5,"_","_","_","vajra","NC","","_","_"
6,"_","_","_","tulya","JJ","","_","_"
7,"ca","_","_","ca","CCD","","_","_"
8,"hāṭakam","_","_","hāṭaka","NC","","_","_"
1,"kṣiptvā","_","_","kṣip","CGDA","","_","_"
2,"_","_","_","kāñcanaka","NC","","_","_"
3,"_","_","_","drāva","NC","","_","_"
4,"_","_","_","marday","V","marday","_","_"
5,"_","_","_","divasa","NC","","_","_"
6,"_","_","_","traya","NC","","_","_"
1,"_","_","_","pūrvavat","CX","","_","_"
2,"_","_","_","puṭapāka","NC","","_","_"
3,"evaṃ","_","_","eva","CX","","_","_"
4,"_","_","_","daśan","NUM","","_","_"
5,"_","_","_","puṭa","NC","","_","_"
6,"pacet","_","_","pac","V","pac","_","_"
1,"_","_","_","svarṇa","NC","","_","_"
2,"_","_","_","tulya","JJ","","_","_"
3,"_","_","_","tatas","CX","","_","_"
4,"_","_","_","tīkṣṇa","NC","","_","_"
5,"cūrṇaṃ","_","_","cūrṇa","NC","","_","_"
6,"kṛtvā","_","_","kṛ","CGDA","","_","_"
7,"niyojayet","_","_","niyuj","V","niyuj","_","_"
1,"_","_","_","marday","V","marday","_","_"
2,"_","_","_","triphalā","NC","","_","_"
3,"_","_","_","drāva","NC","","_","_"
4,"_","_","_","tad","PRD","","_","_"
5,"_","_","_","sarva","JQ","","_","_"
6,"_","_","_","divasa","NC","","_","_"
7,"_","_","_","traya","NC","","_","_"
1,"_","_","_","puṭay","V","puṭay","_","_"
2,"_","_","_","pūrva","PPX","","_","_"
3,"_","_","_","yoga","NC","","_","_"
4,"evaṃ","_","_","eva","CX","","_","_"
5,"_","_","_","daśan","NUM","","_","_"
6,"_","_","_","puṭa","NC","","_","_"
7,"pacet","_","_","pac","V","pac","_","_"
1,"_","_","_","tīkṣṇa","NC","","_","_"
2,"_","_","_","tulya","JJ","","_","_"
3,"mṛtaṃ","_","_","mṛ","PPP","","_","_"
4,"nāgaṃ","_","_","nāga","NC","","_","_"
5,"dattvā","_","_","dā","CGDA","","_","_"
6,"sarvaṃ","_","_","sarva","JQ","","_","_"
7,"vimardayet","_","_","vimarday","V","vimarday","_","_"
1,"_","_","_","vāsā","NC","","_","_"
2,"_","_","_","rakta","JJ","","_","_"
3,"_","_","_","aśvamāra","NC","","_","_"
4,"_","_","_","uttha","JJ","","_","_"
5,"_","_","_","drāva","NC","","_","_"
6,"khalve","_","_","khalva","NC","","_","_"
7,"_","_","_","dina","NC","","_","_"
8,"_","_","_","traya","NC","","_","_"
1,"ruddhvā","_","_","rudh","CGDA","","_","_"
2,"gajapuṭe","_","_","gajapuṭa","NC","","_","_"
3,"pacyāt","_","_","pac","V","pac","_","_"
4,"_","_","_","punar","CAD","","_","_"
5,"_","_","_","mṛd","KDG","","_","_"
6,"ca","_","_","ca","CCD","","_","_"
7,"pācayet","_","_","pāc","V","pācay","_","_"
1,"evaṃ","_","_","eva","CX","","_","_"
2,"_","_","_","daśan","NUM","","_","_"
3,"_","_","_","puṭa","NC","","_","_"
4,"pakvaṃ","_","_","pakva","JJ","","_","_"
5,"_","_","_","samuddhṛ","CGDA","","_","_"
6,"_","_","_","atha","CAD","","_","_"
7,"mardayet","_","_","marday","V","marday","_","_"
1,"amlavargeṇa","_","_","amlavarga","NC","","_","_"
2,"_","_","_","tad","PRD","","_","_"
3,"_","_","_","sarva","JQ","","_","_"
4,"mardyaṃ","_","_","mṛd","KDG","","_","_"
5,"_","_","_","yāma","NC","","_","_"
6,"_","_","_","catuṣṭaya","NC","","_","_"
1,"ruddhvā","_","_","rudh","CGDA","","_","_"
2,"gajapuṭe","_","_","gajapuṭa","NC","","_","_"
3,"pacyāt","_","_","pac","V","pac","_","_"
4,"_","_","_","punar","CAD","","_","_"
5,"_","_","_","mṛd","KDG","","_","_"
6,"ca","_","_","ca","CCD","","_","_"
7,"pācayet","_","_","pāc","V","pācay","_","_"
1,"evaṃ","_","_","eva","CX","","_","_"
2,"_","_","_","daśan","NUM","","_","_"
3,"_","_","_","puṭa","NC","","_","_"
4,"pācyaṃ","_","_","pac","KDG","","_","_"
5,"_","_","_","sindūra","NC","","_","_"
6,"_","_","_","sadṛśa","JJ","","_","_"
7,"bhavet","_","_","bhav","V","bhū","_","_"
1,"anena","_","_","ida","PRD","","_","_"
2,"_","_","_","śatama","JJ","","_","_"
3,"_","_","_","aṃśa","NC","","_","_"
4,"candrārkaṃ","_","_","candrārka","NC","","_","_"
5,"vedhayed","_","_","vedhay","V","vedhay","_","_"
6,"drutam","_","_","dru","PPP","","_","_"
1,"athavā","_","_","athavā","CX","","_","_"
2,"_","_","_","madhu","NC","","_","_"
3,"_","_","_","añj","PPP","","_","_"
4,"_","_","_","candra","NC","","_","_"
5,"_","_","_","arka","NC","","_","_"
6,"_","_","_","lepay","V","lepay","_","_"
7,"_","_","_","tatas","CX","","_","_"
1,"jāyate","_","_","jan","V","jan","_","_"
2,"kanakaṃ","_","_","kanaka","NC","","_","_"
3,"divyaṃ","_","_","divya","JJ","","_","_"
4,"puṭe","_","_","puṭa","NC","","_","_"
5,"datte","_","_","dā","PPP","","_","_"
6,"na","_","_","na","CNG","","_","_"
7,"hīyate","_","_","jah","V","hā","_","_"
1,"athavā","_","_","athavā","CX","","_","_"
2,"_","_","_","tāra","NC","","_","_"
3,"_","_","_","pattra","NC","","_","_"
4,"_","_","_","madhu","NC","","_","_"
5,"_","_","_","añj","PPP","","_","_"
6,"lepayet","_","_","lepay","V","lepay","_","_"
1,"_","_","_","catuḥṣaṣṭitama","JJ","","_","_"
2,"_","_","_","aṃśa","NC","","_","_"
3,"divyaṃ","_","_","divya","JJ","","_","_"
4,"bhavati","_","_","bhav","V","bhū","_","_"
5,"kāṃcanam","_","_","kāñcana","NC","","_","_"
1,"catuḥṣaṣṭiguṇaṃ","_","_","catuḥṣaṣṭiguṇa","JJ","","_","_"
2,"sūtaṃ","_","_","sūta","NC","","_","_"
3,"_","_","_","bhāga","NC","","_","_"
4,"_","_","_","eka","PPX","","_","_"
5,"_","_","_","mṛ","PPP","","_","_"
6,"_","_","_","vajraka","NC","","_","_"
1,"_","_","_","marday","V","marday","_","_"
2,"_","_","_","amlavarga","NC","","_","_"
3,"taptakhalve","_","_","taptakhalva","NC","","_","_"
4,"_","_","_","dina","NC","","_","_"
5,"_","_","_","traya","NC","","_","_"
1,"_","_","_","bhāga","NC","","_","_"
2,"_","_","_","traya","NC","","_","_"
3,"_","_","_","heman","NC","","_","_"
4,"_","_","_","pattra","NC","","_","_"
5,"_","_","_","ida","PRD","","_","_"
6,"_","_","_","eva","CEM","","_","_"
7,"pralepayet","_","_","pralepay","V","pralepay","_","_"
1,"_","_","_","rudh","CGDA","","_","_"
2,"_","_","_","atha","CAD","","_","_"
3,"bhūdhare","_","_","bhūdhara","NC","","_","_"
4,"_","_","_","pac","V","pac","_","_"
5,"_","_","_","samuddhṛ","CGDA","","_","_"
6,"_","_","_","atha","CAD","","_","_"
7,"mardayet","_","_","marday","V","marday","_","_"
1,"śuddhena","_","_","śudh","PPP","","_","_"
2,"sūtarājena","_","_","sūtarāja","NC","","_","_"
3,"triguṇena","_","_","triguṇa","JJ","","_","_"
4,"ca","_","_","ca","CCD","","_","_"
5,"saṃyutam","_","_","saṃyuta","JJ","","_","_"
1,"_","_","_","amlavarga","NC","","_","_"
2,"_","_","_","tri","NUM","","_","_"
3,"_","_","_","aha","NC","","_","_"
4,"mardyaṃ","_","_","mṛd","KDG","","_","_"
5,"_","_","_","rudh","CGDA","","_","_"
6,"_","_","_","atha","CAD","","_","_"
7,"bhūdhare","_","_","bhūdhara","NC","","_","_"
8,"puṭet","_","_","puṭ","V","puṭ","_","_"
1,"_","_","_","punar","CAD","","_","_"
2,"_","_","_","mṛd","KDG","","_","_"
3,"punaḥ","_","_","punar","CAD","","_","_"
4,"pācyam","_","_","pac","KDG","","_","_"
5,"_","_","_","ekaviṃśati","NC","","_","_"
6,"_","_","_","vāraka","NC","","_","_"
1,"anena","_","_","ida","PRD","","_","_"
2,"_","_","_","śatama","JJ","","_","_"
3,"_","_","_","aṃśa","NC","","_","_"
4,"caṃdrārkaṃ","_","_","candrārka","NC","","_","_"
5,"madhunā","_","_","madhu","NC","","_","_"
6,"saha","_","_","saha","CX","","_","_"
1,"liptvā","_","_","lip","CGDA","","_","_"
2,"ruddhvā","_","_","rudh","CGDA","","_","_"
3,"dhamed","_","_","dham","V","dha","_","_"
4,"gāḍhaṃ","_","_","gāḍha","CX","","_","_"
5,"divyaṃ","_","_","divya","JJ","","_","_"
6,"bhavati","_","_","bhav","V","bhū","_","_"
7,"kāñcanam","_","_","kāñcana","NC","","_","_"
1,"_","_","_","pūrvokta","JJ","","_","_"
2,"_","_","_","bhasman","NC","","_","_"
3,"_","_","_","sūta","NC","","_","_"
4,"_","_","_","amla","NC","","_","_"
5,"_","_","_","piṣ","PPP","","_","_"
6,"lepayet","_","_","lepay","V","lepay","_","_"
1,"caturguṇaṃ","_","_","caturguṇa","JJ","","_","_"
2,"_","_","_","svarṇa","NC","","_","_"
3,"_","_","_","pattra","NC","","_","_"
4,"ruddhvā","_","_","rudh","CGDA","","_","_"
5,"gajapuṭe","_","_","gajapuṭa","NC","","_","_"
6,"pacet","_","_","pac","V","pac","_","_"
1,"_","_","_","pāda","NC","","_","_"
2,"_","_","_","aṃśa","NC","","_","_"
3,"_","_","_","punar","CAD","","_","_"
4,"_","_","_","tad","PRD","","_","_"
5,"_","_","_","bhasman","NC","","_","_"
6,"_","_","_","sūta","NC","","_","_"
7,"niyojayet","_","_","niyuj","V","niyuj","_","_"
1,"_","_","_","marday","V","marday","_","_"
2,"_","_","_","amlavarga","NC","","_","_"
3,"_","_","_","tadvat","CX","","_","_"
4,"_","_","_","rudh","CGDA","","_","_"
5,"puṭe","_","_","puṭa","NC","","_","_"
6,"pacet","_","_","pac","V","pac","_","_"
1,"evaṃ","_","_","eva","CX","","_","_"
2,"_","_","_","catur","NUM","","_","_"
3,"_","_","_","puṭa","NC","","_","_"
4,"pakvaṃ","_","_","pakva","JJ","","_","_"
5,"mriyate","_","_","mar","V","mṛ","_","_"
6,"hāṭakaṃ","_","_","hāṭaka","NC","","_","_"
7,"śubham","_","_","śubha","JJ","","_","_"
1,"_","_","_","tad","PRD","","_","_"
2,"_","_","_","eva","CEM","","_","_"
3,"_","_","_","ṣoḍaśa","JJ","","_","_"
4,"_","_","_","aṃśa","NC","","_","_"
5,"drutaṃ","_","_","dru","PPP","","_","_"
6,"tāraṃ","_","_","tāra","NC","","_","_"
7,"tu","_","_","tu","CCD","","_","_"
8,"vedhayet","_","_","vedhay","V","vedhay","_","_"
1,"athavā","_","_","athavā","CX","","_","_"
2,"_","_","_","pattra","NC","","_","_"
3,"_","_","_","lepa","NC","","_","_"
4,"divyaṃ","_","_","divya","JJ","","_","_"
5,"bhavati","_","_","bhav","V","bhū","_","_"
6,"kāṃcanam","_","_","kāñcana","NC","","_","_"
1,"_","_","_","mṛ","PPP","","_","_"
2,"_","_","_","vajra","NC","","_","_"
3,"_","_","_","bhāga","NC","","_","_"
4,"_","_","_","eka","PPX","","_","_"
5,"_","_","_","śudh","PPP","","_","_"
6,"_","_","_","sūta","NC","","_","_"
7,"ṣoḍaśa","_","_","ṣoḍaśan","JJ","","_","_"
1,"_","_","_","devadālī","NC","","_","_"
2,"_","_","_","śaṅkhapuṣpī","NC","","_","_"
3,"_","_","_","rasa","NC","","_","_"
4,"mardyaṃ","_","_","mṛd","KDG","","_","_"
5,"_","_","_","dina","NC","","_","_"
6,"_","_","_","traya","NC","","_","_"
1,"_","_","_","vajramūṣā","NC","","_","_"
2,"_","_","_","ga","PPP","","_","_"
3,"ruddhvā","_","_","rudh","CGDA","","_","_"
4,"_","_","_","dina","NC","","_","_"
5,"_","_","_","eka","PPX","","_","_"
6,"bhūdhare","_","_","bhūdhara","NC","","_","_"
7,"pacet","_","_","pac","V","pac","_","_"
1,"_","_","_","samuddhṛ","CGDA","","_","_"
2,"_","_","_","atha","CAD","","_","_"
3,"_","_","_","tad","PRD","","_","_"
4,"_","_","_","drāva","NC","","_","_"
5,"_","_","_","dina","NC","","_","_"
6,"mardyaṃ","_","_","mṛd","KDG","","_","_"
7,"nirudhya","_","_","nirudh","CGDA","","_","_"
8,"ca","_","_","ca","CCD","","_","_"
1,"_","_","_","dina","NC","","_","_"
2,"_","_","_","eka","PPX","","_","_"
3,"bhūdhare","_","_","bhūdhara","NC","","_","_"
4,"pacyāt","_","_","pac","V","pac","_","_"
5,"_","_","_","tadvat","CX","","_","_"
6,"_","_","_","mṛd","KDG","","_","_"
7,"ca","_","_","ca","CCD","","_","_"
8,"pācayet","_","_","pāc","V","pācay","_","_"
1,"_","_","_","iti","CQT","","_","_"
2,"_","_","_","eva","CX","","_","_"
3,"saptadhā","_","_","saptadhā","CX","","_","_"
4,"_","_","_","kar","V","kṛ","_","_"
5,"_","_","_","jan","V","jan","_","_"
6,"_","_","_","bhasman","NC","","_","_"
7,"_","_","_","sūtaka","NC","","_","_"
1,"_","_","_","tad","PRD","","_","_"
2,"_","_","_","bhasman","NC","","_","_"
3,"_","_","_","sūtaka","NC","","_","_"
4,"tulyaṃ","_","_","tulya","JJ","","_","_"
5,"_","_","_","vajramūṣā","NC","","_","_"
6,"_","_","_","andhay","PPP","","_","_"
7,"dhamet","_","_","dham","V","dha","_","_"
1,"tat","_","_","tad","PRD","","_","_"
2,"khoṭaṃ","_","_","khoṭa","NC","","_","_"
3,"jāyate","_","_","jan","V","jan","_","_"
4,"divyaṃ","_","_","divya","JJ","","_","_"
5,"_","_","_","rañjay","V","rañjay","_","_"
6,"_","_","_","tad","PRD","","_","_"
7,"_","_","_","nigad","V","nigad","_","_"
1,"tīkṣṇaṃ","_","_","tīkṣṇa","NC","","_","_"
2,"śulbaṃ","_","_","śulba","NC","","_","_"
3,"samaṃ","_","_","sama","PPX","","_","_"
4,"cūrṇya","_","_","cūrṇay","CGDA","","_","_"
5,"_","_","_","andhamūṣā","NC","","_","_"
6,"_","_","_","ga","PPP","","_","_"
7,"dhamet","_","_","dham","V","dha","_","_"
1,"tat","_","_","tad","PRD","","_","_"
2,"khoṭaṃ","_","_","khoṭa","NC","","_","_"
3,"siddhacūrṇaṃ","_","_","siddhacūrṇa","NC","","_","_"
4,"tu","_","_","tu","CCD","","_","_"
5,"_","_","_","gandhaka","NC","","_","_"
6,"_","_","_","amla","NC","","_","_"
7,"mardayet","_","_","marday","V","marday","_","_"
1,"_","_","_","pūrvavat","CX","","_","_"
2,"_","_","_","krama","NC","","_","_"
3,"_","_","_","yoga","NC","","_","_"
4,"_","_","_","puṭa","NC","","_","_"
5,"_","_","_","dad","V","dā","_","_"
6,"_","_","_","caturdaśan","JJ","","_","_"
1,"anena","_","_","ida","PRD","","_","_"
2,"_","_","_","pūrva","PPX","","_","_"
3,"_","_","_","khoṭa","NC","","_","_"
4,"tu","_","_","tu","CCD","","_","_"
5,"drutaṃ","_","_","dru","PPP","","_","_"
6,"vāpyaṃ","_","_","vāpay","KDG","","_","_"
7,"punaḥ","_","_","punar","CAD","","_","_"
8,"punaḥ","_","_","punar","CAD","","_","_"
1,"_","_","_","tad","PRD","","_","_"
2,"_","_","_","bhasman","NC","","_","_"
3,"gaṃdhakaṃ","_","_","gandhaka","NC","","_","_"
4,"tulyaṃ","_","_","tulya","JJ","","_","_"
5,"_","_","_","vajramūṣā","NC","","_","_"
6,"_","_","_","andhay","PPP","","_","_"
7,"dhamet","_","_","dham","V","dha","_","_"
1,"_","_","_","daśan","NUM","","_","_"
2,"_","_","_","vāra","NC","","_","_"
3,"tat","_","_","tad","PRD","","_","_"
4,"khoṭaṃ","_","_","khoṭa","NC","","_","_"
5,"jāyate","_","_","jan","V","jan","_","_"
6,"_","_","_","kuṅkuma","NC","","_","_"
7,"_","_","_","prabhā","NC","","_","_"
1,"svarṇena","_","_","svarṇa","NC","","_","_"
2,"ca","_","_","ca","CCD","","_","_"
3,"tridhā","_","_","tridhā","CX","","_","_"
4,"sāryaṃ","_","_","sāray","KDG","","_","_"
5,"_","_","_","śata","NUM","","_","_"
6,"_","_","_","vedhin","JJ","","_","_"
7,"_","_","_","bhav","V","bhū","_","_"
8,"_","_","_","ca","CCD","","_","_"
9,"tat","_","_","tad","PRD","","_","_"
1,"_","_","_","dru","PPP","","_","_"
2,"_","_","_","śulba","NC","","_","_"
3,"pradātavyaṃ","_","_","pradā","KDG","","_","_"
4,"divyaṃ","_","_","divya","JJ","","_","_"
5,"bhavati","_","_","bhav","V","bhū","_","_"
6,"kāṃcanam","_","_","kāñcana","NC","","_","_"
1,"_","_","_","pūrva","PPX","","_","_"
2,"_","_","_","vac","PPP","","_","_"
3,"_","_","_","bhasman","NC","","_","_"
4,"_","_","_","sūta","NC","","_","_"
5,"tu","_","_","tu","CCD","","_","_"
6,"_","_","_","pala","NC","","_","_"
7,"_","_","_","eka","PPX","","_","_"
8,"_","_","_","sama","PPX","","_","_"
9,"_","_","_","pannaga","NC","","_","_"
1,"_","_","_","kānta","NC","","_","_"
2,"_","_","_","pātra","NC","","_","_"
3,"_","_","_","ga","PPP","","_","_"
4,"mardyaṃ","_","_","mṛd","KDG","","_","_"
5,"_","_","_","dina","NC","","_","_"
6,"_","_","_","eka","PPX","","_","_"
7,"_","_","_","loha","NC","","_","_"
8,"_","_","_","muṣṭi","NC","","_","_"
1,"_","_","_","mṛdu","JJ","","_","_"
2,"_","_","_","agni","NC","","_","_"
3,"tu","_","_","tu","CCD","","_","_"
4,"_","_","_","tad","PRD","","_","_"
5,"_","_","_","pātra","NC","","_","_"
6,"_","_","_","marday","V","marday","_","_"
7,"_","_","_","pācay","V","pācay","_","_"
8,"_","_","_","śanais","CX","","_","_"
1,"_","_","_","yāvat","CX","","_","_"
2,"_","_","_","miśra","JJ","","_","_"
3,"samuddhṛtya","_","_","samuddhṛ","CGDA","","_","_"
4,"ruddhvā","_","_","rudh","CGDA","","_","_"
5,"gajapuṭe","_","_","gajapuṭa","NC","","_","_"
6,"pacet","_","_","pac","V","pac","_","_"
1,"mardyaṃ","_","_","mṛd","KDG","","_","_"
2,"_","_","_","vāsā","NC","","_","_"
3,"_","_","_","rasa","NC","","_","_"
4,"_","_","_","pac","V","pac","_","_"
5,"_","_","_","eva","CX","","_","_"
6,"_","_","_","vāra","NC","","_","_"
7,"_","_","_","caturdaśan","JJ","","_","_"
1,"_","_","_","go","CX","","_","_"
2,"_","_","_","pitta","NC","","_","_"
3,"_","_","_","punar","CAD","","_","_"
4,"_","_","_","mṛd","KDG","","_","_"
5,"deyaṃ","_","_","dā","KDG","","_","_"
6,"_","_","_","puṭa","NC","","_","_"
7,"_","_","_","caturdaśan","JJ","","_","_"
1,"_","_","_","tad","PRD","","_","_"
2,"_","_","_","tulya","JJ","","_","_"
3,"_","_","_","svarṇa","NC","","_","_"
4,"_","_","_","cūrṇa","NC","","_","_"
5,"ca","_","_","ca","CCD","","_","_"
6,"dattvā","_","_","dā","CGDA","","_","_"
7,"pittena","_","_","pitta","NC","","_","_"
8,"mardayet","_","_","marday","V","marday","_","_"
1,"_","_","_","dina","NC","","_","_"
2,"_","_","_","anta","NC","","_","_"
3,"_","_","_","tad","PRD","","_","_"
4,"_","_","_","samuddhṛ","CGDA","","_","_"
5,"krāmaṇena","_","_","krāmaṇa","NC","","_","_"
6,"samāyutam","_","_","samāyuta","JJ","","_","_"
1,"_","_","_","sahasra","NUM","","_","_"
2,"_","_","_","aṃśa","NC","","_","_"
3,"_","_","_","tad","PRD","","_","_"
4,"_","_","_","eva","CX","","_","_"
5,"tārāriṣṭaṃ","_","_","tārāriṣṭa","NC","","_","_"
6,"tu","_","_","tu","CCD","","_","_"
7,"vedhayet","_","_","vedhay","V","vedhay","_","_"
1,"jāyate","_","_","jan","V","jan","_","_"
2,"kanakaṃ","_","_","kanaka","NC","","_","_"
3,"divyaṃ","_","_","divya","JJ","","_","_"
4,"_","_","_","deva","NC","","_","_"
5,"_","_","_","ābharaṇa","NC","","_","_"
6,"_","_","_","uttama","JJ","","_","_"
1,"_","_","_","nāga","NC","","_","_"
2,"_","_","_","sthāne","CX","","_","_"
3,"yadā","_","_","yadā","CSB","","_","_"
4,"baṃgaṃ","_","_","vaṅga","NC","","_","_"
5,"_","_","_","pūrvavat","CX","","_","_"
6,"_","_","_","krama","NC","","_","_"
7,"_","_","_","yoga","NC","","_","_"
1,"_","_","_","tāra","NC","","_","_"
2,"_","_","_","cūrṇa","NC","","_","_"
3,"saṃyuktaṃ","_","_","saṃyuj","PPP","","_","_"
4,"śulbe","_","_","śulba","NC","","_","_"
5,"vedhaṃ","_","_","vedha","NC","","_","_"
6,"pradāpayet","_","_","pradad","V","pradā","_","_"
1,"_","_","_","sahasra","NUM","","_","_"
2,"_","_","_","aṃśa","NC","","_","_"
3,"_","_","_","tad","PRD","","_","_"
4,"_","_","_","tāra","NC","","_","_"
5,"_","_","_","bhav","V","bhū","_","_"
6,"_","_","_","kunda","NC","","_","_"
7,"_","_","_","indu","NC","","_","_"
8,"_","_","_","saṃnibha","JJ","","_","_"
1,"drutasūtena","_","_","drutasūta","NC","","_","_"
2,"vajreṇa","_","_","vajra","NC","","_","_"
3,"vajraiḥ","_","_","vajra","NC","","_","_"
4,"_","_","_","śudh","PPP","","_","_"
5,"_","_","_","rasa","NC","","_","_"
6,"vā","_","_","vā","CCD","","_","_"
1,"_","_","_","mṛ","PPP","","_","_"
2,"_","_","_","sūta","NC","","_","_"
3,"vajreṇa","_","_","vajra","NC","","_","_"
4,"vajraiḥ","_","_","vajra","NC","","_","_"
5,"_","_","_","śudh","PPP","","_","_"
6,"_","_","_","rasa","NC","","_","_"
7,"vā","_","_","vā","CCD","","_","_"
1,"_","_","_","divya","JJ","","_","_"
2,"_","_","_","yoga","NC","","_","_"
3,"_","_","_","vara","JJ","","_","_"
4,"khoṭaṃ","_","_","khoṭa","NC","","_","_"
5,"pūrvaṃ","_","_","pūrva","PPX","","_","_"
6,"nānāvidhaṃ","_","_","nānāvidha","JJ","","_","_"
7,"tu","_","_","tu","CCD","","_","_"
8,"yat","_","_","yad","PRL","","_","_"
1,"proktaṃ","_","_","pravac","PPP","","_","_"
2,"_","_","_","tad","PRD","","_","_"
3,"_","_","_","khoṭa","NC","","_","_"
4,"_","_","_","eka","PPX","","_","_"
5,"tu","_","_","tu","CCD","","_","_"
6,"_","_","_","drāvay","V","drāvay","_","_"
7,"_","_","_","piṣṭi","NC","","_","_"
8,"_","_","_","khoṭa","NC","","_","_"
9,"_","_","_","vat","CX","","_","_"
1,"drutaṃ","_","_","dru","PPP","","_","_"
2,"tu","_","_","tu","CCD","","_","_"
3,"pāradaṃ","_","_","pārada","NC","","_","_"
4,"divyaṃ","_","_","divya","JJ","","_","_"
5,"_","_","_","mṛtyu","NC","","_","_"
6,"_","_","_","dāridrya","NC","","_","_"
7,"_","_","_","nāśana","JJ","","_","_"
1,"_","_","_","atha","CAD","","_","_"
2,"_","_","_","ida","PRD","","_","_"
3,"drutasūtasya","_","_","drutasūta","NC","","_","_"
4,"_","_","_","jāray","V","jāray","_","_"
5,"_","_","_","pakva","JJ","","_","_"
6,"_","_","_","bījaka","NC","","_","_"
1,"krameṇa","_","_","krameṇa","CX","","_","_"
2,"ṣaḍguṇaṃ","_","_","ṣaḍguṇa","JJ","","_","_"
3,"_","_","_","yāvat","CX","","_","_"
4,"_","_","_","kacchapa","NC","","_","_"
5,"_","_","_","ākhyā","NC","","_","_"
6,"_","_","_","viḍa","NC","","_","_"
7,"_","_","_","anvita","JJ","","_","_"
1,"_","_","_","vac","KDP","","_","_"
2,"_","_","_","prakāra","NC","","_","_"
3,"_","_","_","vyoman","NC","","_","_"
4,"_","_","_","sattva","NC","","_","_"
5,"yathā","_","_","yathā","CCM","","_","_"
6,"jaret","_","_","jar","V","jṛ","_","_"
1,"jāritaṃ","_","_","jāray","PPP","","_","_"
2,"_","_","_","tad","PRD","","_","_"
3,"_","_","_","tridhā","CX","","_","_"
4,"sāryaṃ","_","_","sāray","KDG","","_","_"
5,"_","_","_","pakva","JJ","","_","_"
6,"_","_","_","bīja","NC","","_","_"
7,"vai","_","_","vai","CX","","_","_"
8,"kramāt","_","_","kramāt","CX","","_","_"
1,"anena","_","_","ida","PRD","","_","_"
2,"_","_","_","koṭima","JJ","","_","_"
3,"_","_","_","aṃśa","NC","","_","_"
4,"_","_","_","dru","PPP","","_","_"
5,"_","_","_","śulba","NC","","_","_"
6,"tu","_","_","tu","CCD","","_","_"
7,"vedhayet","_","_","vedhay","V","vedhay","_","_"
1,"jāyate","_","_","jan","V","jan","_","_"
2,"kanakaṃ","_","_","kanaka","NC","","_","_"
3,"divyaṃ","_","_","divya","JJ","","_","_"
4,"_","_","_","deva","NC","","_","_"
5,"_","_","_","ābharaṇa","NC","","_","_"
6,"_","_","_","bhūṣaṇa","NC","","_","_"
1,"_","_","_","atha","CAD","","_","_"
2,"_","_","_","ida","PRD","","_","_"
3,"_","_","_","koṭi","NC","","_","_"
4,"_","_","_","vedha","NC","","_","_"
5,"_","_","_","rasendra","NC","","_","_"
6,"_","_","_","apara","PPX","","_","_"
7,"vidhiḥ","_","_","vidhi","NC","","_","_"
1,"viṣṇukrāntā","_","_","viṣṇukrāntā","NC","","_","_"
2,"ca","_","_","ca","CCD","","_","_"
3,"cakrāṅkā","_","_","cakrāṅkā","NC","","_","_"
4,"kaṇṭārī","_","_","kaṇṭārī","NC","","_","_"
5,"_","_","_","ca","CCD","","_","_"
6,"_","_","_","eva","CEM","","_","_"
7,"ciñcikā","_","_","ciñcikā","NC","","_","_"
1,"etāsāṃ","_","_","tad","PRD","","_","_"
2,"_","_","_","drava","NC","","_","_"
3,"_","_","_","ādā","CGDA","","_","_"
4,"_","_","_","mūṣā","NC","","_","_"
5,"_","_","_","lepa","NC","","_","_"
6,"tu","_","_","tu","CCD","","_","_"
7,"kārayet","_","_","kar","V","kṛ","_","_"
1,"tasyāṃ","_","_","tad","PRD","","_","_"
2,"_","_","_","pūrva","PPX","","_","_"
3,"_","_","_","rasa","NC","","_","_"
4,"kṣiptvā","_","_","kṣip","CGDA","","_","_"
5,"dhamed","_","_","dham","V","dha","_","_"
6,"drāvaṃ","_","_","drāva","NC","","_","_"
7,"kṣipan","_","_","kṣip","KDP","","_","_"
8,"kṣipan","_","_","kṣip","KDP","","_","_"
1,"vajraṃ","_","_","vajra","NC","","_","_"
2,"_","_","_","tatra","CAD","","_","_"
3,"_","_","_","eva","CEM","","_","_"
4,"dātavyaṃ","_","_","dā","KDG","","_","_"
5,"_","_","_","dru","V","dru","_","_"
6,"_","_","_","eva","CEM","","_","_"
7,"na","_","_","na","CNG","","_","_"
8,"saṃśayaḥ","_","_","saṃśaya","NC","","_","_"
1,"_","_","_","tatas","CX","","_","_"
2,"_","_","_","tad","PRD","","_","_"
3,"_","_","_","samuddhṛ","CGDA","","_","_"
4,"dolāyaṃtre","_","_","dolāyantra","NC","","_","_"
5,"_","_","_","tri","NUM","","_","_"
6,"_","_","_","aha","NC","","_","_"
7,"pacet","_","_","pac","V","pac","_","_"
1,"uddhṛtya","_","_","uddhṛ","CGDA","","_","_"
2,"_","_","_","viḍa","NC","","_","_"
3,"_","_","_","lip","PPP","","_","_"
4,"mūṣāyāṃ","_","_","mūṣā","NC","","_","_"
5,"prakaṭaṃ","_","_","prakaṭa","JJ","","_","_"
6,"dhamet","_","_","dham","V","dha","_","_"
1,"_","_","_","gras","V","gras","_","_"
2,"_","_","_","eva","CEM","","_","_"
3,"na","_","_","na","CNG","","_","_"
4,"saṃdehas","_","_","saṃdeha","NC","","_","_"
5,"_","_","_","tīvra","JJ","","_","_"
6,"_","_","_","dha","PPP","","_","_"
7,"_","_","_","anala","NC","","_","_"
8,"ca","_","_","ca","CCD","","_","_"
1,"vajraṃ","_","_","vajra","NC","","_","_"
2,"vā","_","_","vā","CCD","","_","_"
3,"padmarāgaṃ","_","_","padmarāga","NC","","_","_"
4,"vā","_","_","vā","CCD","","_","_"
5,"jāryaṃ","_","_","jāray","KDG","","_","_"
6,"daśaguṇe","_","_","daśaguṇa","JJ","","_","_"
7,"rase","_","_","rasa","NC","","_","_"
1,"_","_","_","kāray","V","kāray","_","_"
2,"_","_","_","vajra","NC","","_","_"
3,"_","_","_","bīja","NC","","_","_"
4,"śabdavedhī","_","_","śabdavedhin","JJ","","_","_"
5,"_","_","_","bhav","V","bhū","_","_"
6,"_","_","_","rasa","NC","","_","_"
1,"athavā","_","_","athavā","CX","","_","_"
2,"mārite","_","_","māray","PPP","","_","_"
3,"tasmin","_","_","tad","PRD","","_","_"
4,"jāraṇaṃ","_","_","jāraṇa","NC","","_","_"
5,"_","_","_","sāray","V","sāray","_","_"
6,"_","_","_","punar","CAD","","_","_"
1,"uccaṭā","_","_","uccaṭā","NC","","_","_"
2,"mīnanayanā","_","_","mīnanayanā","NC","","_","_"
3,"sarpākṣī","_","_","sarpākṣī","NC","","_","_"
4,"_","_","_","rakta","JJ","","_","_"
5,"_","_","_","citraka","NC","","_","_"
1,"etāsāṃ","_","_","tad","PRD","","_","_"
2,"nikṣiped","_","_","nikṣip","V","nikṣip","_","_"
3,"drāvaṃ","_","_","drāva","NC","","_","_"
4,"drute","_","_","dru","PPP","","_","_"
5,"_","_","_","mūṣā","NC","","_","_"
6,"_","_","_","ga","PPP","","_","_"
7,"rase","_","_","rasa","NC","","_","_"
1,"indranīlaṃ","_","_","indranīla","NC","","_","_"
2,"_","_","_","kṣip","V","kṣip","_","_"
3,"_","_","_","tatra","CAD","","_","_"
4,"_","_","_","dru","V","dru","_","_"
5,"_","_","_","eva","CEM","","_","_"
6,"na","_","_","na","CNG","","_","_"
7,"saṃśayaḥ","_","_","saṃśaya","NC","","_","_"
1,"_","_","_","pūrvavat","CX","","_","_"
2,"_","_","_","svedana","NC","","_","_"
3,"_","_","_","eva","CEM","","_","_"
4,"_","_","_","viḍa","NC","","_","_"
5,"_","_","_","yoga","NC","","_","_"
6,"jārayet","_","_","jar","V","jṛ","_","_"
1,"_","_","_","iti","CQT","","_","_"
2,"_","_","_","eva","CX","","_","_"
3,"triguṇaṃ","_","_","triguṇa","JJ","","_","_"
4,"jāryam","_","_","jāray","KDG","","_","_"
5,"indranīlaṃ","_","_","indranīla","NC","","_","_"
6,"krameṇa","_","_","krameṇa","CX","","_","_"
7,"tu","_","_","tu","CCD","","_","_"
1,"_","_","_","tad","PRD","","_","_"
2,"_","_","_","rasa","NC","","_","_"
3,"_","_","_","vaktra","NC","","_","_"
4,"_","_","_","madhye","CX","","_","_"
5,"tu","_","_","tu","CCD","","_","_"
6,"yaḥ","_","_","yad","PRL","","_","_"
7,"karoti","_","_","kar","V","kṛ","_","_"
8,"_","_","_","nara","NC","","_","_"
9,"_","_","_","uttama","JJ","","_","_"
1,"sa","_","_","tad","PRD","","_","_"
2,"pūjyo","_","_","pūjay","KDG","","_","_"
3,"_","_","_","deva","NC","","_","_"
4,"_","_","_","deva","NC","","_","_"
5,"khecaratvena","_","_","khecaratva","NC","","_","_"
6,"modate","_","_","mod","V","mud","_","_"
1,"tasya","_","_","tad","PRD","","_","_"
2,"_","_","_","mūtra","NC","","_","_"
3,"_","_","_","purīṣa","NC","","_","_"
4,"_","_","_","sarva","JQ","","_","_"
5,"_","_","_","loha","NC","","_","_"
6,"kāṃcanam","_","_","kāñcana","NC","","_","_"
1,"jāyate","_","_","jan","V","jan","_","_"
2,"_","_","_","divya","JJ","","_","_"
3,"_","_","_","rūpa","NC","","_","_"
4,"_","_","_","āḍhya","JJ","","_","_"
5,"satyaṃ","_","_","satya","NC","","_","_"
6,"_","_","_","śaṃkara","NC","","_","_"
7,"_","_","_","bhāṣ","PPP","","_","_"
1,"_","_","_","iti","CQT","","_","_"
2,"_","_","_","eva","CX","","_","_"
3,"viṣṭikhoṭaṃ","_","_","viṣṭikhoṭa","NC","","_","_"
4,"parirasam","_","_","parirasa","JJ","","_","_"
5,"aparaṃ","_","_","apara","PPX","","_","_"
6,"saṃkaraiḥ","_","_","saṃkara","NC","","_","_"
7,"_","_","_","khoṭa","NC","","_","_"
8,"_","_","_","bandh","PPP","","_","_"
9,"jātaṃ","_","_","jan","PPP","","_","_"
10,"_","_","_","tad","PRD","","_","_"
11,"_","_","_","drāvay","PPP","","_","_"
12,"vai","_","_","vai","CX","","_","_"
13,"_","_","_","mṛ","PPP","","_","_"
14,"_","_","_","atha","CAD","","_","_"
15,"vimalaṃ","_","_","vimala","JJ","","_","_"
16,"_","_","_","svarṇa","NC","","_","_"
17,"_","_","_","rāśi","NC","","_","_"
18,"karoti","_","_","kar","V","kṛ","_","_"
1,"kiṃvā","_","_","kiṃvā","CX","","_","_"
2,"sā","_","_","tad","PRD","","_","_"
3,"_","_","_","pakva","JJ","","_","_"
4,"_","_","_","bīja","NC","","_","_"
5,"grasati","_","_","gras","V","gras","_","_"
6,"yadi","_","_","yadi","CSB","","_","_"
7,"druto","_","_","dru","PPP","","_","_"
8,"jāyate","_","_","jan","V","jan","_","_"
9,"_","_","_","koṭi","NC","","_","_"
10,"_","_","_","vedhin","JJ","","_","_"
11,"_","_","_","vajra","NC","","_","_"
12,"_","_","_","abhra","NC","","_","_"
13,"_","_","_","ratna","NC","","_","_"
14,"_","_","_","jāta","NC","","_","_"
15,"carati","_","_","car","V","car","_","_"
16,"yadi","_","_","yadi","CSB","","_","_"
17,"rasaḥ","_","_","rasa","NC","","_","_"
18,"khecaratvaṃ","_","_","khecaratva","NC","","_","_"
19,"pradatte","_","_","pradad","V","pradā","_","_"
