"WordID","word","NormSTEM","suffix","lemma","PoS","Root","NormSuffix","NormWord"
1,"vaiśampāyana","_","_","vaiśampāyana","NC","","_","_"
2,"uvāca","_","_","vak","V","vac","_","_"
1,"_","_","_","sa_saha","CX","","_","_"
2,"_","_","_","roṣa","NC","","_","_"
3,"_","_","_","rāga","NC","","_","_"
4,"_","_","_","upahan","PPP","","_","_"
5,"valgunā","_","_","valgu","JJ","","_","_"
6,"_","_","_","sa_saha","CX","","_","_"
7,"_","_","_","rāga","NC","","_","_"
8,"_","_","_","netra","NC","","_","_"
9,"_","_","_","na","PPP","","_","_"
10,"_","_","_","unna","PPP","","_","_"
11,"_","_","_","bhrū","NC","","_","_"
1,"mukhena","_","_","mukha","NC","","_","_"
2,"visphūrya","_","_","visphur","CGDA","","_","_"
3,"_","_","_","suvīra","NC","","_","_"
4,"_","_","_","rāṣṭrapa","NC","","_","_"
5,"tato","_","_","tatas","CX","","_","_"
6,"'bravīt","_","_","abravīta","V","brū","_","_"
7,"taṃ","_","_","tad","PRD","","_","_"
8,"_","_","_","drupada","NC","","_","_"
9,"_","_","_","ātmajā","NC","","_","_"
10,"punaḥ","_","_","punar","CAD","","_","_"
1,"yaśasvinas","_","_","yaśasvin","JJ","","_","_"
2,"_","_","_","tīkṣṇa","JJ","","_","_"
3,"_","_","_","viṣa","NC","","_","_"
4,"_","_","_","mahat","JJ","","_","_"
5,"_","_","_","ratha","NC","","_","_"
6,"adhikṣipan","_","_","adhikṣip","KDP","","_","_"
7,"mūḍha","_","_","muh","PPP","","_","_"
8,"na","_","_","na","CNG","","_","_"
9,"lajjase","_","_","lajj","V","lajj","_","_"
10,"katham","_","_","katha","CX","","_","_"
1,"_","_","_","mahat","JJ","","_","_"
2,"_","_","_","indra","NC","","_","_"
3,"_","_","_","kalpa","JJ","","_","_"
4,"niratān","_","_","nira","PPP","","_","_"
5,"_","_","_","sva","JJ","","_","_"
6,"_","_","_","karman","NC","","_","_"
7,"sthitān","_","_","sthā","PPP","","_","_"
8,"_","_","_","samūha","NC","","_","_"
9,"_","_","_","api","CX","","_","_"
10,"_","_","_","yakṣa","NC","","_","_"
11,"_","_","_","rakṣas","NC","","_","_"
1,"na","_","_","na","CNG","","_","_"
2,"kiṃcid","_","_","kiṃcit","PRI","","_","_"
3,"īḍyaṃ","_","_","īḍ","KDG","","_","_"
4,"pravadanti","_","_","pravad","V","pravad","_","_"
5,"pāpaṃ","_","_","pāpa","NC","","_","_"
6,"vanecaraṃ","_","_","vanecara","JJ","","_","_"
7,"vā","_","_","vā","CCD","","_","_"
8,"gṛhamedhinaṃ","_","_","gṛhamedhin","NC","","_","_"
9,"vā","_","_","vā","CCD","","_","_"
1,"tapasvinaṃ","_","_","tapasvin","NC","","_","_"
2,"_","_","_","saṃparipṛ","PPP","","_","_"
3,"_","_","_","vidyā","NC","","_","_"
4,"bhaṣanti","_","_","bhaṣ","V","bhaṣ","_","_"
5,"_","_","_","ha","CEM","","_","_"
6,"_","_","_","eva","CX","","_","_"
7,"śvanarāḥ","_","_","śvanara","NC","","_","_"
8,"suvīra","_","_","suvīra","NC","","_","_"
1,"ahaṃ","_","_","mat","PPR","","_","_"
2,"tu","_","_","tu","CCD","","_","_"
3,"manye","_","_","man","V","man","_","_"
4,"tava","_","_","tvat","PPR","","_","_"
5,"_","_","_","na","CNG","","_","_"
6,"_","_","_","as","V","as","_","_"
7,"kaścid","_","_","kiṃcit","PRI","","_","_"
8,"etādṛśe","_","_","etādṛśa","JJ","","_","_"
9,"_","_","_","kṣatriya","NC","","_","_"
10,"_","_","_","saṃniveśa","NC","","_","_"
1,"_","_","_","yad","PRL","","_","_"
2,"_","_","_","tvat","PPR","","_","_"
3,"_","_","_","adya","CX","","_","_"
4,"_","_","_","pātāla","NC","","_","_"
5,"_","_","_","mukha","NC","","_","_"
6,"patantaṃ","_","_","pat","KDP","","_","_"
7,"pāṇau","_","_","pāṇi","NC","","_","_"
8,"gṛhītvā","_","_","grah","CGDA","","_","_"
9,"pratisaṃhareta","_","_","pratisaṃhar","V","pratisaṃhṛ","_","_"
1,"nāgaṃ","_","_","nāga","NC","","_","_"
2,"prabhinnaṃ","_","_","prabhid","PPP","","_","_"
3,"_","_","_","giri","NC","","_","_"
4,"_","_","_","kūṭa","NC","","_","_"
5,"_","_","_","kalpa","JJ","","_","_"
6,"upatyakāṃ","_","_","upatyakā","NC","","_","_"
7,"haimavatīṃ","_","_","haimavata","JJ","","_","_"
8,"carantam","_","_","car","KDP","","_","_"
1,"_","_","_","daṇḍin","NC","","_","_"
2,"_","_","_","iva","CCM","","_","_"
3,"yūthād","_","_","yūtha","NC","","_","_"
4,"apasedhase","_","_","apasidh","V","apasidh","_","_"
5,"tvaṃ","_","_","tvat","PPR","","_","_"
6,"yo","_","_","yad","PRL","","_","_"
7,"jetum","_","_","ji","CGDI","","_","_"
8,"āśaṃsasi","_","_","āśaṃs","V","āśaṃs","_","_"
9,"dharmarājam","_","_","dharmarāja","NC","","_","_"
1,"bālyāt","_","_","bālya","NC","","_","_"
2,"prasuptasya","_","_","prasvap","PPP","","_","_"
3,"_","_","_","mahat","JJ","","_","_"
4,"_","_","_","bala","NC","","_","_"
5,"siṃhasya","_","_","siṃha","NC","","_","_"
6,"pakṣmāṇi","_","_","pakṣman","NC","","_","_"
7,"_","_","_","mukha","NC","","_","_"
8,"_","_","_","lun","V","lū","_","_"
1,"padā","_","_","pad","NC","","_","_"
2,"samāhatya","_","_","samāhan","CGDA","","_","_"
3,"palāyamānaḥ","_","_","palāy","KDP","","_","_"
4,"kruddhaṃ","_","_","krudh","PPP","","_","_"
5,"yadā","_","_","yadā","CSB","","_","_"
6,"drakṣyasi","_","_","darś","V","dṛś","_","_"
7,"bhīmasenam","_","_","bhīmasa","NC","","_","_"
1,"_","_","_","mahat","JJ","","_","_"
2,"_","_","_","bala","NC","","_","_"
3,"ghorataraṃ","_","_","ghoratara","JJ","","_","_"
4,"pravṛddhaṃ","_","_","pravṛdh","PPP","","_","_"
5,"jātaṃ","_","_","jan","PPP","","_","_"
6,"hariṃ","_","_","hari","NC","","_","_"
7,"_","_","_","parvata","NC","","_","_"
8,"_","_","_","kandara","NC","","_","_"
1,"prasuptam","_","_","prasvap","PPP","","_","_"
2,"ugraṃ","_","_","ugra","JJ","","_","_"
3,"prapadena","_","_","prapada","NC","","_","_"
4,"haṃsi","_","_","han","V","han","_","_"
5,"yaḥ","_","_","yad","PRL","","_","_"
6,"kruddham","_","_","krudh","PPP","","_","_"
7,"āsetsyasi","_","_","jiṣṇu","NC","","_","_"
8,"jiṣṇum","_","_","ugra","JJ","","_","_"
1,"_","_","_","kṛṣṇa","JJ","","_","_"
2,"_","_","_","uraga","NC","","_","_"
3,"_","_","_","tīkṣṇa","JJ","","_","_"
4,"_","_","_","viṣa","NC","","_","_"
5,"_","_","_","dvi","NUM","","_","_"
6,"_","_","_","jihvā","NC","","_","_"
7,"mattaḥ","_","_","mat","PPP","","_","_"
8,"_","_","_","pada","NC","","_","_"
9,"_","_","_","ākra","V","ākra","_","_"
10,"_","_","_","puccha","NC","","_","_"
11,"_","_","_","deśa","NC","","_","_"
1,"yaḥ","_","_","yad","PRL","","_","_"
2,"pāṇḍavābhyāṃ","_","_","pāṇḍava","NC","","_","_"
3,"_","_","_","puruṣa","NC","","_","_"
4,"_","_","_","uttama","JJ","","_","_"
5,"_","_","_","jaghanya","JJ","","_","_"
6,"_","_","_","ja","JJ","","_","_"
7,"prayuyutsase","_","_","prayuyuts","V","prayuyuts","_","_"
8,"tvam","_","_","tvat","PPR","","_","_"
1,"yathā","_","_","yathā","CCM","","_","_"
2,"ca","_","_","ca","CCD","","_","_"
3,"veṇuḥ","_","_","veṇu","NC","","_","_"
4,"kadalī","_","_","kadala","NC","","_","_"
5,"nalo","_","_","nala","NC","","_","_"
6,"vā","_","_","vā","CCD","","_","_"
7,"_","_","_","phal","V","phal","_","_"
8,"_","_","_","abhāva","NC","","_","_"
9,"na","_","_","na","CNG","","_","_"
10,"bhūtaye","_","_","bhūti","NC","","_","_"
1,"_","_","_","tathā","CX","","_","_"
2,"_","_","_","eva","CEM","","_","_"
3,"māṃ","_","_","mat","PPR","","_","_"
4,"taiḥ","_","_","tad","PRD","","_","_"
5,"parirakṣyamāṇām","_","_","parirakṣ","KDP","","_","_"
6,"ādāsyase","_","_","ādad","V","ādā","_","_"
7,"_","_","_","karkaṭakī","NC","","_","_"
8,"_","_","_","iva","CCM","","_","_"
9,"garbham","_","_","garbha","NC","","_","_"
1,"jayadratha","_","_","jayadratha","NC","","_","_"
2,"uvāca","_","_","vak","V","vac","_","_"
1,"jānāmi","_","_","jān","V","jñā","_","_"
2,"kṛṣṇe","_","_","kṛṣṇā","NC","","_","_"
3,"viditaṃ","_","_","vid","PPP","","_","_"
4,"_","_","_","mat","PPR","","_","_"
5,"_","_","_","tad","PRD","","_","_"
6,"yathāvidhās","_","_","yathāvidha","JJ","","_","_"
7,"te","_","_","tad","PRD","","_","_"
8,"_","_","_","naradeva","NC","","_","_"
9,"_","_","_","putra","NC","","_","_"
1,"na","_","_","na","CNG","","_","_"
2,"_","_","_","tu","CCD","","_","_"
3,"_","_","_","eva","CX","","_","_"
4,"etena","_","_","tad","PRD","","_","_"
5,"vibhīṣaṇena","_","_","vibhīṣaṇa","NC","","_","_"
6,"śakyā","_","_","śakya","JJ","","_","_"
7,"vayaṃ","_","_","mat","PPR","","_","_"
8,"trāsayituṃ","_","_","trāsay","CGDI","","_","_"
9,"_","_","_","tvat","PPR","","_","_"
10,"_","_","_","adya","CX","","_","_"
1,"vayaṃ","_","_","mat","PPR","","_","_"
2,"punaḥ","_","_","punar","CAD","","_","_"
3,"saptadaśeṣu","_","_","saptadaśa","NC","","_","_"
4,"kṛṣṇe","_","_","kṛṣṇā","NC","","_","_"
5,"kuleṣu","_","_","kula","NC","","_","_"
6,"sarve","_","_","sarva","JQ","","_","_"
7,"'navameṣu","_","_","anavama","JJ","","_","_"
8,"jātāḥ","_","_","jan","PPP","","_","_"
1,"ṣaḍbhyo","_","_","ṣaṣ","NUM","","_","_"
2,"guṇebhyo","_","_","guṇa","NC","","_","_"
3,"'bhyadhikā","_","_","abhyadhika","JJ","","_","_"
4,"vihīnān","_","_","vihā","PPP","","_","_"
5,"manyāmahe","_","_","man","V","man","_","_"
6,"draupadi","_","_","draupadī","NC","","_","_"
7,"_","_","_","pāṇḍu","NC","","_","_"
8,"_","_","_","putra","NC","","_","_"
1,"sā","_","_","tad","PRD","","_","_"
2,"kṣipram","_","_","kṣipra","CX","","_","_"
3,"ātiṣṭha","_","_","ātiṣṭh","V","āsthā","_","_"
4,"gajaṃ","_","_","gaja","NC","","_","_"
5,"rathaṃ","_","_","ratha","NC","","_","_"
6,"vā","_","_","vā","CCD","","_","_"
7,"na","_","_","na","CNG","","_","_"
8,"_","_","_","vākya","NC","","_","_"
9,"_","_","_","mātra","NC","","_","_"
10,"vayaṃ","_","_","mat","PPR","","_","_"
11,"hi","_","_","hi","CX","","_","_"
12,"śakyāḥ","_","_","śakya","JJ","","_","_"
1,"āśaṃsa","_","_","āśaṃs","V","āśaṃs","_","_"
2,"vā","_","_","vā","CCD","","_","_"
3,"tvaṃ","_","_","tvat","PPR","","_","_"
4,"kṛpaṇaṃ","_","_","kṛpaṇa","JJ","","_","_"
5,"vadantī","_","_","vad","KDP","","_","_"
6,"_","_","_","sauvīra","NC","","_","_"
7,"_","_","_","rāja","NC","","_","_"
8,"punaḥ","_","_","punar","CAD","","_","_"
9,"prasādam","_","_","prasāda","NC","","_","_"
1,"_","_","_","draupadī","NC","","_","_"
2,"_","_","_","vak","V","vac","_","_"
1,"_","_","_","mahat","JJ","","_","_"
2,"_","_","_","bala","NC","","_","_"
3,"kiṃ","_","_","kiṃ","PRQ","","_","_"
4,"_","_","_","tu","CCD","","_","_"
5,"_","_","_","iha","CAD","","_","_"
6,"_","_","_","durbala","JJ","","_","_"
7,"_","_","_","iva","CCM","","_","_"
8,"_","_","_","sauvīra","NC","","_","_"
9,"_","_","_","rāja","NC","","_","_"
10,"_","_","_","man","PPP","","_","_"
11,"_","_","_","mat","PPR","","_","_"
12,"asmi","_","_","as","V","as","_","_"
1,"_","_","_","yad","PRL","","_","_"
2,"_","_","_","mat","PPR","","_","_"
3,"pramāthād","_","_","pramātha","NC","","_","_"
4,"iha","_","_","iha","CAD","","_","_"
5,"sampratītā","_","_","sampratī","PPP","","_","_"
6,"_","_","_","sauvīra","NC","","_","_"
7,"_","_","_","rāja","NC","","_","_"
8,"kṛpaṇaṃ","_","_","kṛpaṇa","JJ","","_","_"
9,"vadeyam","_","_","vad","V","vad","_","_"
1,"yasyā","_","_","yad","PRL","","_","_"
2,"hi","_","_","hi","CX","","_","_"
3,"kṛṣṇau","_","_","kṛṣṇa","NC","","_","_"
4,"padavīṃ","_","_","padavī","NC","","_","_"
5,"caretāṃ","_","_","car","V","car","_","_"
6,"_","_","_","samāsthā","PPP","","_","_"
7,"_","_","_","eka","PPX","","_","_"
8,"_","_","_","ratha","NC","","_","_"
9,"sahāyau","_","_","sahāya","NC","","_","_"
1,"indro","_","_","indra","NC","","_","_"
2,"'pi","_","_","api","CX","","_","_"
3,"tāṃ","_","_","tad","PRD","","_","_"
4,"_","_","_","na","CNG","","_","_"
5,"_","_","_","apahar","V","apahṛ","_","_"
6,"_","_","_","kathaṃcid","CX","","_","_"
7,"_","_","_","manuṣya","NC","","_","_"
8,"_","_","_","mātra","NC","","_","_"
9,"kṛpaṇaḥ","_","_","kṛpaṇa","JJ","","_","_"
10,"kuto","_","_","kutas","CX","","_","_"
11,"'nyaḥ","_","_","anya","PPX","","_","_"
1,"yadā","_","_","yadā","CSB","","_","_"
2,"kirīṭī","_","_","kirīṭin","NC","","_","_"
3,"_","_","_","para","PPX","","_","_"
4,"_","_","_","vīra","NC","","_","_"
5,"_","_","_","ghātin","JJ","","_","_"
6,"nighnan","_","_","nihan","KDP","","_","_"
7,"_","_","_","ratha","NC","","_","_"
8,"_","_","_","stha","JJ","","_","_"
9,"dviṣatāṃ","_","_","dviṣ","KDP","","_","_"
10,"manāṃsi","_","_","manas","NC","","_","_"
1,"_","_","_","mat","PPR","","_","_"
2,"_","_","_","antara","NC","","_","_"
3,"_","_","_","tvat","PPR","","_","_"
4,"_","_","_","dhvajinī","NC","","_","_"
5,"praveṣṭā","_","_","praviś","V","praviś","_","_"
6,"kakṣaṃ","_","_","kakṣa","NC","","_","_"
7,"dahann","_","_","dah","KDP","","_","_"
8,"agnir","_","_","agni","NC","","_","_"
9,"_","_","_","iva","CCM","","_","_"
10,"_","_","_","uṣṇaga","NC","","_","_"
1,"_","_","_","janārdana","NC","","_","_"
2,"_","_","_","anuga","JJ","","_","_"
3,"_","_","_","vṛṣṇi","NC","","_","_"
4,"_","_","_","vīra","NC","","_","_"
5,"_","_","_","mahat","JJ","","_","_"
6,"_","_","_","iṣvāsa","NC","","_","_"
7,"_","_","_","kekaya","NC","","_","_"
8,"_","_","_","ca","CCD","","_","_"
9,"_","_","_","api","CX","","_","_"
10,"sarve","_","_","sarva","JQ","","_","_"
1,"ete","_","_","tad","PRD","","_","_"
2,"hi","_","_","hi","CX","","_","_"
3,"sarve","_","_","sarva","JQ","","_","_"
4,"mama","_","_","mat","PPR","","_","_"
5,"_","_","_","rājan","NC","","_","_"
6,"_","_","_","putra","NC","","_","_"
7,"_","_","_","prahṛṣ","PPP","","_","_"
8,"_","_","_","rūpa","NC","","_","_"
9,"padavīṃ","_","_","padavī","NC","","_","_"
10,"careyuḥ","_","_","car","V","car","_","_"
1,"_","_","_","maurvī","NC","","_","_"
2,"_","_","_","visṛj","PPP","","_","_"
3,"_","_","_","stanayitnu","NC","","_","_"
4,"_","_","_","ghoṣa","NC","","_","_"
5,"_","_","_","gāṇḍīva","NC","","_","_"
6,"_","_","_","muc","PPP","","_","_"
7,"_","_","_","tu","CCD","","_","_"
8,"_","_","_","ativegavat","JJ","","_","_"
1,"hastaṃ","_","_","hasta","NC","","_","_"
2,"samāhatya","_","_","samāhan","CGDA","","_","_"
3,"dhanaṃjayasya","_","_","dhanaṃjaya","NC","","_","_"
4,"bhīmāḥ","_","_","bhīma","JJ","","_","_"
5,"śabdaṃ","_","_","śabda","NC","","_","_"
6,"ghorataraṃ","_","_","ghoratara","JJ","","_","_"
7,"nadanti","_","_","nadan","V","nad","_","_"
1,"_","_","_","gāṇḍīva","NC","","_","_"
2,"_","_","_","muc","PPP","","_","_"
3,"_","_","_","ca","CCD","","_","_"
4,"_","_","_","mahat","JJ","","_","_"
5,"_","_","_","śara","NC","","_","_"
6,"_","_","_","ogha","NC","","_","_"
7,"_","_","_","pataṃga","NC","","_","_"
8,"_","_","_","saṃgha","NC","","_","_"
9,"iva","_","_","iva","CCM","","_","_"
10,"_","_","_","śīghra","JJ","","_","_"
11,"_","_","_","vega","NC","","_","_"
1,"_","_","_","sa_saha","CX","","_","_"
2,"_","_","_","śaṅkha","NC","","_","_"
3,"_","_","_","ghoṣa","NC","","_","_"
4,"_","_","_","sa_saha","CX","","_","_"
5,"_","_","_","talatra","NC","","_","_"
6,"_","_","_","ghoṣa","NC","","_","_"
7,"gāṇḍīvadhanvā","_","_","gāṇḍīvadhanvan","NC","","_","_"
8,"muhur","_","_","muhur","CX","","_","_"
9,"udvamaṃś","_","_","udva","KDP","","_","_"
10,"ca","_","_","ca","CCD","","_","_"
1,"yadā","_","_","yadā","CSB","","_","_"
2,"śarān","_","_","śara","NC","","_","_"
3,"arpayitā","_","_","arpay","V","arpay","_","_"
4,"_","_","_","tvat","PPR","","_","_"
5,"_","_","_","uras","NC","","_","_"
6,"tadā","_","_","tadā","CAD","","_","_"
7,"manas","_","_","manas","NC","","_","_"
8,"te","_","_","tvat","PPR","","_","_"
9,"kim","_","_","kiṃ","PRQ","","_","_"
10,"_","_","_","iva","CCM","","_","_"
11,"_","_","_","bhav","V","bhū","_","_"
1,"_","_","_","gadā","NC","","_","_"
2,"_","_","_","hasta","NC","","_","_"
3,"bhīmam","_","_","bhīma","NC","","_","_"
4,"abhidravantaṃ","_","_","abhidru","KDP","","_","_"
5,"_","_","_","mādrī","NC","","_","_"
6,"_","_","_","putra","NC","","_","_"
7,"saṃpatantau","_","_","sampat","KDP","","_","_"
8,"diśaś","_","_","diś","NC","","_","_"
9,"ca","_","_","ca","CCD","","_","_"
1,"_","_","_","amarṣa","NC","","_","_"
2,"_","_","_","ja","JJ","","_","_"
3,"_","_","_","krodha","NC","","_","_"
4,"_","_","_","viṣa","NC","","_","_"
5,"vamantau","_","_","va","KDP","","_","_"
6,"dṛṣṭvā","_","_","dṛś","CGDA","","_","_"
7,"ciraṃ","_","_","cira","JJ","","_","_"
8,"tāpam","_","_","tāpa","NC","","_","_"
9,"upaiṣyase","_","_","upai","V","upe","_","_"
10,"'dhama","_","_","adhama","JJ","","_","_"
1,"yathā","_","_","yathā","CCM","","_","_"
2,"_","_","_","ca","CCD","","_","_"
3,"_","_","_","mat","PPR","","_","_"
4,"_","_","_","na","CNG","","_","_"
5,"_","_","_","aticar","V","aticar","_","_"
6,"kathaṃcit","_","_","kathaṃcid","CX","","_","_"
7,"patīn","_","_","pati","NC","","_","_"
8,"mahārhān","_","_","mahārha","JJ","","_","_"
9,"_","_","_","manas","NC","","_","_"
10,"_","_","_","api","CX","","_","_"
11,"jātu","_","_","jātu","CX","","_","_"
1,"_","_","_","tad","PRD","","_","_"
2,"_","_","_","adya","CX","","_","_"
3,"satyena","_","_","satya","NC","","_","_"
4,"vaśīkṛtaṃ","_","_","vaśīkṛ","PPP","","_","_"
5,"tvāṃ","_","_","tvat","PPR","","_","_"
6,"draṣṭāsmi","_","_","darś","V","dṛś","_","_"
7,"pārthaiḥ","_","_","pārtha","NC","","_","_"
8,"parikṛṣyamāṇam","_","_","parikṛṣ","KDP","","_","_"
1,"na","_","_","na","CNG","","_","_"
2,"sambhramaṃ","_","_","sambhrama","NC","","_","_"
3,"gantum","_","_","ga","CGDI","","_","_"
4,"ahaṃ","_","_","mat","PPR","","_","_"
5,"hi","_","_","hi","CX","","_","_"
6,"śakṣye","_","_","śakn","V","śak","_","_"
7,"tvayā","_","_","tvat","PPR","","_","_"
8,"nṛśaṃsena","_","_","nṛśaṃsa","JJ","","_","_"
9,"vikṛṣyamāṇā","_","_","vikṛṣ","KDP","","_","_"
1,"_","_","_","samāga","PPP","","_","_"
2,"_","_","_","mat","PPR","","_","_"
3,"hi","_","_","hi","CX","","_","_"
4,"_","_","_","kuru","NC","","_","_"
5,"_","_","_","pravīra","NC","","_","_"
6,"punar","_","_","punar","CAD","","_","_"
7,"vanaṃ","_","_","vana","NC","","_","_"
8,"kāmyakam","_","_","kāmyaka","NC","","_","_"
9,"āgatā","_","_","āga","PPP","","_","_"
10,"ca","_","_","ca","CCD","","_","_"
1,"vaiśampāyana","_","_","vaiśampāyana","NC","","_","_"
2,"uvāca","_","_","vak","V","vac","_","_"
1,"sā","_","_","tad","PRD","","_","_"
2,"tān","_","_","tad","PRD","","_","_"
3,"anuprekṣya","_","_","anuprekṣ","CGDA","","_","_"
4,"_","_","_","viśāla","JJ","","_","_"
5,"_","_","_","netra","NC","","_","_"
6,"jighṛkṣamāṇān","_","_","avabhartsay","KDP","","_","_"
1,"provāca","_","_","pravak","V","pravac","_","_"
2,"mā","_","_","mā","CNG","","_","_"
3,"mā","_","_","mat","PPR","","_","_"
4,"_","_","_","spṛś","V","spṛś","_","_"
5,"_","_","_","iti","CQT","","_","_"
6,"bhītā","_","_","bhī","PPP","","_","_"
7,"dhaumyaṃ","_","_","dhaumya","NC","","_","_"
8,"pracukrośa","_","_","prakroś","V","prakruś","_","_"
9,"purohitaṃ","_","_","purohita","NC","","_","_"
10,"sā","_","_","tad","PRD","","_","_"
1,"jagrāha","_","_","grah","V","grah","_","_"
2,"tām","_","_","tad","PRD","","_","_"
3,"_","_","_","uttara","JJ","","_","_"
4,"_","_","_","vastra","NC","","_","_"
5,"_","_","_","deśa","NC","","_","_"
6,"jayadrathas","_","_","jayadratha","NC","","_","_"
7,"taṃ","_","_","tad","PRD","","_","_"
8,"samavākṣipat","_","_","samavakṣip","V","samavakṣip","_","_"
9,"sā","_","_","tad","PRD","","_","_"
1,"tayā","_","_","tad","PRD","","_","_"
2,"_","_","_","samākṣip","PPP","","_","_"
3,"_","_","_","tanu","NC","","_","_"
4,"sa","_","_","tad","PRD","","_","_"
5,"pāpaḥ","_","_","pāpa","JJ","","_","_"
6,"papāta","_","_","pat","V","pat","_","_"
7,"_","_","_","śākhin","NC","","_","_"
8,"_","_","_","iva","CCM","","_","_"
9,"_","_","_","nikṛt","PPP","","_","_"
10,"_","_","_","mūla","NC","","_","_"
1,"pragṛhyamāṇā","_","_","pragrah","KDP","","_","_"
2,"tu","_","_","tu","CCD","","_","_"
3,"_","_","_","mahat","JJ","","_","_"
4,"_","_","_","java","NC","","_","_"
5,"muhur","_","_","muhur","CX","","_","_"
6,"viniḥśvasya","_","_","viniḥśvas","CGDA","","_","_"
7,"ca","_","_","ca","CCD","","_","_"
8,"_","_","_","rājan","NC","","_","_"
9,"_","_","_","putrī","NC","","_","_"
1,"sā","_","_","tad","PRD","","_","_"
2,"kṛṣyamāṇā","_","_","kṛṣ","KDP","","_","_"
3,"ratham","_","_","ratha","NC","","_","_"
4,"āruroha","_","_","āroh","V","āruh","_","_"
5,"dhaumyasya","_","_","dhaumya","NC","","_","_"
6,"_","_","_","pāda","NC","","_","_"
7,"_","_","_","abhivāday","CGDA","","_","_"
8,"kṛṣṇā","_","_","kṛṣṇā","NC","","_","_"
1,"dhaumya","_","_","dhaumya","NC","","_","_"
2,"uvāca","_","_","vak","V","vac","_","_"
1,"_","_","_","na","CNG","","_","_"
2,"_","_","_","ida","PRD","","_","_"
3,"śakyā","_","_","śakya","JJ","","_","_"
4,"tvayā","_","_","tvat","PPR","","_","_"
5,"netum","_","_","nī","CGDI","","_","_"
6,"avijitya","_","_","avijitya","CX","","_","_"
7,"_","_","_","mahat","JJ","","_","_"
8,"_","_","_","ratha","NC","","_","_"
1,"dharmaṃ","_","_","dharma","NC","","_","_"
2,"kṣatrasya","_","_","kṣatra","NC","","_","_"
3,"paurāṇam","_","_","paurāṇa","JJ","","_","_"
4,"avekṣasva","_","_","avekṣ","V","avekṣ","_","_"
5,"jayadratha","_","_","jayadratha","NC","","_","_"
1,"kṣudraṃ","_","_","kṣudra","JJ","","_","_"
2,"kṛtvā","_","_","kṛ","CGDA","","_","_"
3,"phalaṃ","_","_","phala","NC","","_","_"
4,"pāpaṃ","_","_","pāpa","JJ","","_","_"
5,"prāpsyasi","_","_","prāpn","V","prāp","_","_"
6,"tvam","_","_","tvat","PPR","","_","_"
7,"asaṃśayam","_","_","asaṃśaya","NC","","_","_"
1,"āsādya","_","_","āsāday","CGDA","","_","_"
2,"pāṇḍavān","_","_","pāṇḍava","NC","","_","_"
3,"vīrān","_","_","vīra","NC","","_","_"
4,"_","_","_","dharmarāja","NC","","_","_"
5,"_","_","_","purogama","JJ","","_","_"
1,"vaiśampāyana","_","_","vaiśampāyana","NC","","_","_"
2,"uvāca","_","_","vak","V","vac","_","_"
1,"_","_","_","iti","CQT","","_","_"
2,"_","_","_","vac","CGDA","","_","_"
3,"hriyamāṇāṃ","_","_","hṛ","KDP","","_","_"
4,"tāṃ","_","_","tad","PRD","","_","_"
5,"_","_","_","rājan","NC","","_","_"
6,"_","_","_","putrī","NC","","_","_"
7,"yaśasvinīm","_","_","yaśasvin","JJ","","_","_"
1,"anvagacchat","_","_","anuga","V","anuga","_","_"
2,"tadā","_","_","tadā","CAD","","_","_"
3,"dhaumyaḥ","_","_","dhaumya","NC","","_","_"
4,"_","_","_","padāti","NC","","_","_"
5,"_","_","_","gaṇa","NC","","_","_"
6,"_","_","_","madhya","NC","","_","_"
7,"_","_","_","ga","JJ","","_","_"
