"WordID","word","NormSTEM","suffix","lemma","PoS","Root","NormSuffix","NormWord"
1,"_","_","_","satya","NC","","_","_"
2,"_","_","_","uttambh","PPP","","_","_"
3,"bhūmiḥ","_","_","bhūmi","NC","","_","_"
4,"_","_","_","sūrya","NC","","_","_"
5,"_","_","_","uttambh","PPP","","_","_"
6,"dyauḥ","_","_","div","NC","","_","_"
1,"_","_","_","ṛta","NC","","_","_"
2,"_","_","_","āditya","NC","","_","_"
3,"tiṣṭhanti","_","_","tiṣṭh","V","sthā","_","_"
4,"divi","_","_","div","NC","","_","_"
5,"somo","_","_","soma","NC","","_","_"
6,"adhi","_","_","adhi","CADP","","_","_"
7,"śritaḥ","_","_","śri","PPP","","_","_"
1,"_","_","_","soma","NC","","_","_"
2,"_","_","_","āditya","NC","","_","_"
3,"balinaḥ","_","_","balin","JJ","","_","_"
4,"somena","_","_","soma","NC","","_","_"
5,"pṛthivī","_","_","pṛthivī","NC","","_","_"
6,"mahī","_","_","mah","JJ","","_","_"
1,"atho","_","_","atho","CX","","_","_"
2,"nakṣatrāṇām","_","_","nakṣatra","NC","","_","_"
3,"eṣām","_","_","ida","PRD","","_","_"
4,"upasthe","_","_","upastha","NC","","_","_"
5,"soma","_","_","soma","NC","","_","_"
6,"āhitaḥ","_","_","ādhā","PPP","","_","_"
1,"somam","_","_","soma","NC","","_","_"
2,"manyate","_","_","man","V","man","_","_"
3,"papivān","_","_","pā","KDP","","_","_"
4,"yat","_","_","yat","CSB","","_","_"
5,"sampiṃṣanty","_","_","sampiṣ","V","sampiṣ","_","_"
6,"oṣadhim","_","_","oṣadhi","NC","","_","_"
1,"somaṃ","_","_","soma","NC","","_","_"
2,"yam","_","_","yad","PRL","","_","_"
3,"brahmāṇo","_","_","brahman","NC","","_","_"
4,"vidur","_","_","vid","V","vid","_","_"
5,"na","_","_","na","CNG","","_","_"
6,"_","_","_","tad","PRD","","_","_"
7,"_","_","_","aś","V","aś","_","_"
8,"kaścana","_","_","kaścana","PRI","","_","_"
1,"_","_","_","ācchad","NC","","_","_"
2,"_","_","_","vidhāna","NC","","_","_"
3,"gupito","_","_","gup","PPP","","_","_"
4,"bārhataiḥ","_","_","bārhata","JJ","","_","_"
5,"soma","_","_","soma","NC","","_","_"
6,"rakṣitaḥ","_","_","rakṣ","PPP","","_","_"
1,"grāvṇām","_","_","grāvan","NC","","_","_"
2,"_","_","_","id","CEM","","_","_"
3,"_","_","_","śru","KDP","","_","_"
4,"tiṣṭhasi","_","_","tiṣṭh","V","sthā","_","_"
5,"na","_","_","na","CNG","","_","_"
6,"te","_","_","tvat","PPR","","_","_"
7,"aśnāti","_","_","aśn","V","aś","_","_"
8,"pārthivaḥ","_","_","pārthiva","JJ","","_","_"
1,"yat","_","_","yat","CSB","","_","_"
2,"tvā","_","_","tvat","PPR","","_","_"
3,"deva","_","_","deva","NC","","_","_"
4,"prapibanti","_","_","prapib","V","prapā","_","_"
5,"tata","_","_","tatas","CX","","_","_"
6,"ā","_","_","ā","CADP","","_","_"
7,"pyāyase","_","_","pyā","V","pyā","_","_"
8,"punaḥ","_","_","punar","CAD","","_","_"
1,"vāyuḥ","_","_","vāyu","NC","","_","_"
2,"somasya","_","_","soma","NC","","_","_"
3,"rakṣitā","_","_","rakṣitṛ","JJ","","_","_"
4,"samānām","_","_","samā","NC","","_","_"
5,"māsa","_","_","māsa","NC","","_","_"
6,"ākṛtiḥ","_","_","ākṛti","NC","","_","_"
1,"raibhy","_","_","raibhī","NC","","_","_"
2,"āsīd","_","_","as","V","as","_","_"
3,"anudeyī","_","_","anudeyī","NC","","_","_"
4,"nārāśaṃsī","_","_","nārāśaṃsī","NC","","_","_"
5,"nyocanī","_","_","nyocanī","NC","","_","_"
1,"sūryāyā","_","_","sūryā","NC","","_","_"
2,"bhadram","_","_","bhadra","JJ","","_","_"
3,"id","_","_","id","CEM","","_","_"
4,"vāso","_","_","vāsas","NC","","_","_"
5,"_","_","_","gāthā","NC","","_","_"
6,"_","_","_","e","V","i","_","_"
7,"pariṣkṛtam","_","_","pariṣkṛ","PPP","","_","_"
1,"cittir","_","_","citti","NC","","_","_"
2,"ā","_","_","as","V","as","_","_"
3,"upabarhaṇaṃ","_","_","upabarhaṇa","NC","","_","_"
4,"cakṣur","_","_","cakṣus","NC","","_","_"
5,"ā","_","_","as","V","as","_","_"
6,"abhyañjanam","_","_","abhyañjana","NC","","_","_"
1,"dyaur","_","_","div","NC","","_","_"
2,"bhūmiḥ","_","_","bhūmi","NC","","_","_"
3,"kośa","_","_","kośa","NC","","_","_"
4,"āsīd","_","_","as","V","as","_","_"
5,"yad","_","_","yat","CSB","","_","_"
6,"ayāt","_","_","yā","V","yā","_","_"
7,"sūryā","_","_","sūryā","NC","","_","_"
8,"patim","_","_","pati","NC","","_","_"
1,"stomā","_","_","stoma","NC","","_","_"
2,"āsan","_","_","as","V","as","_","_"
3,"pratidhayaḥ","_","_","pratidhi","NC","","_","_"
4,"kurīraṃ","_","_","kurīra","NC","","_","_"
5,"chanda","_","_","chandas","NC","","_","_"
6,"opaśaḥ","_","_","opaśa","NC","","_","_"
1,"sūryāyā","_","_","sūryā","NC","","_","_"
2,"aśvinā","_","_","aśvin","NC","","_","_"
3,"_","_","_","vara","NC","","_","_"
4,"_","_","_","agni","NC","","_","_"
5,"āsīt","_","_","as","V","as","_","_"
6,"purogavaḥ","_","_","purogava","NC","","_","_"
1,"somo","_","_","soma","NC","","_","_"
2,"vadhūyur","_","_","vadhūyu","JJ","","_","_"
3,"abhavad","_","_","bhav","V","bhū","_","_"
4,"_","_","_","aśvin","NC","","_","_"
5,"_","_","_","as","V","as","_","_"
6,"ubhā","_","_","ubh","PPX","","_","_"
7,"varā","_","_","vara","NC","","_","_"
1,"sūryāṃ","_","_","sūryā","NC","","_","_"
2,"yat","_","_","yat","CSB","","_","_"
3,"patye","_","_","pati","NC","","_","_"
4,"śaṃsantīm","_","_","śaṃs","KDP","","_","_"
5,"manasā","_","_","manas","NC","","_","_"
6,"_","_","_","savitṛ","NC","","_","_"
7,"_","_","_","dad","V","dā","_","_"
1,"mano","_","_","manas","NC","","_","_"
2,"asyā","_","_","ida","PRD","","_","_"
3,"ana","_","_","anas","NC","","_","_"
4,"āsīd","_","_","as","V","as","_","_"
5,"dyaur","_","_","div","NC","","_","_"
6,"āsīd","_","_","as","V","as","_","_"
7,"uta","_","_","uta","CCD","","_","_"
8,"cchadiḥ","_","_","chadis","NC","","_","_"
1,"śukrāv","_","_","śukra","NC","","_","_"
2,"anaḍvāhāv","_","_","anaḍuh","NC","","_","_"
3,"āstāṃ","_","_","as","V","as","_","_"
4,"yad","_","_","yat","CSB","","_","_"
5,"ayāt","_","_","yā","V","yā","_","_"
6,"sūryā","_","_","sūryā","NC","","_","_"
7,"gṛham","_","_","gṛha","NC","","_","_"
1,"_","_","_","ṛc","NC","","_","_"
2,"_","_","_","sāman","NC","","_","_"
3,"abhihitau","_","_","abhidhā","PPP","","_","_"
4,"gāvau","_","_","go","NC","","_","_"
5,"te","_","_","tvat","PPR","","_","_"
6,"sāmanāv","_","_","sāmana","JJ","","_","_"
7,"itaḥ","_","_","e","V","i","_","_"
1,"śrotraṃ","_","_","śrotra","NC","","_","_"
2,"te","_","_","tvat","PPR","","_","_"
3,"cakre","_","_","cakra","NC","","_","_"
4,"āstāṃ","_","_","as","V","as","_","_"
5,"divi","_","_","div","NC","","_","_"
6,"panthāś","_","_","pathin","NC","","_","_"
7,"_","_","_","cara","JJ","","_","_"
8,"_","_","_","ācāra","NC","","_","_"
1,"śucī","_","_","śuci","JJ","","_","_"
2,"te","_","_","tvat","PPR","","_","_"
3,"cakre","_","_","cakra","NC","","_","_"
4,"yātyā","_","_","yā","KDP","","_","_"
5,"vyāno","_","_","vyāna","NC","","_","_"
6,"akṣa","_","_","akṣa","NC","","_","_"
7,"āhataḥ","_","_","āhan","PPP","","_","_"
1,"ano","_","_","anas","NC","","_","_"
2,"manasmayaṃ","_","_","manasmaya","JJ","","_","_"
3,"_","_","_","sūryā","NC","","_","_"
4,"_","_","_","āroh","V","āruh","_","_"
5,"prayatī","_","_","pre","KDP","","_","_"
6,"patim","_","_","pati","NC","","_","_"
1,"sūryāyā","_","_","sūryā","NC","","_","_"
2,"vahatuḥ","_","_","vahatu","NC","","_","_"
3,"prāgāt","_","_","pragā","V","pragā","_","_"
4,"savitā","_","_","savitṛ","NC","","_","_"
5,"yam","_","_","yad","PRL","","_","_"
6,"avāsṛjat","_","_","avasṛj","V","avasṛj","_","_"
1,"aghāsu","_","_","aghā","NC","","_","_"
2,"hanyante","_","_","han","V","han","_","_"
3,"gāvo","_","_","go","NC","","_","_"
4,"'rjunyoḥ","_","_","arjunī","NC","","_","_"
5,"pary","_","_","pari","CADP","","_","_"
6,"uhyate","_","_","vah","V","vah","_","_"
1,"yad","_","_","yat","CSB","","_","_"
2,"aśvinā","_","_","aśvin","NC","","_","_"
3,"pṛcchamānāv","_","_","pracch","KDP","","_","_"
4,"ayātaṃ","_","_","yā","V","yā","_","_"
5,"_","_","_","tri","NUM","","_","_"
6,"_","_","_","cakra","NC","","_","_"
7,"vahatuṃ","_","_","vahatu","NC","","_","_"
8,"sūryāyāḥ","_","_","sūryā","NC","","_","_"
1,"viśve","_","_","viśva","JQ","","_","_"
2,"devā","_","_","deva","NC","","_","_"
3,"anu","_","_","anu","CADP","","_","_"
4,"tad","_","_","tad","PRD","","_","_"
5,"vām","_","_","tvat","PPR","","_","_"
6,"ajānan","_","_","jān","V","jñā","_","_"
7,"putraḥ","_","_","putra","NC","","_","_"
8,"pitarāv","_","_","pitṛ","NC","","_","_"
9,"avṛṇīta","_","_","vṛ","V","vṛ","_","_"
10,"pūṣā","_","_","pūṣan","NC","","_","_"
1,"yad","_","_","yat","CSB","","_","_"
2,"ayātaṃ","_","_","yā","V","yā","_","_"
3,"śubhas","_","_","śubh","NC","","_","_"
4,"patī","_","_","pati","NC","","_","_"
5,"vareyaṃ","_","_","varey","CGDI","","_","_"
6,"sūryām","_","_","sūryā","NC","","_","_"
7,"upa","_","_","upa","CADP","","_","_"
1,"_","_","_","kva","CX","","_","_"
2,"_","_","_","eka","PPX","","_","_"
3,"cakraṃ","_","_","cakra","NC","","_","_"
4,"vām","_","_","tvat","PPR","","_","_"
5,"āsīt","_","_","as","V","as","_","_"
6,"kva","_","_","kva","CX","","_","_"
7,"deṣṭrāya","_","_","deṣṭra","NC","","_","_"
8,"tasthathuḥ","_","_","tiṣṭh","V","sthā","_","_"
1,"dve","_","_","dvi","NUM","","_","_"
2,"te","_","_","tvat","PPR","","_","_"
3,"cakre","_","_","cakra","NC","","_","_"
4,"sūrye","_","_","sūryā","NC","","_","_"
5,"brahmāṇa","_","_","brahman","NC","","_","_"
6,"ṛtuthā","_","_","ṛtuthā","CX","","_","_"
7,"viduḥ","_","_","vid","V","vid","_","_"
1,"_","_","_","atha","CAD","","_","_"
2,"_","_","_","eka","PPX","","_","_"
3,"cakraṃ","_","_","cakra","NC","","_","_"
4,"yad","_","_","yad","PRL","","_","_"
5,"guhā","_","_","guhā","CX","","_","_"
6,"tad","_","_","tad","PRD","","_","_"
7,"addhātaya","_","_","addhāti","NC","","_","_"
8,"id","_","_","id","CEM","","_","_"
9,"viduḥ","_","_","vid","V","vid","_","_"
1,"sūryāyai","_","_","sūryā","NC","","_","_"
2,"devebhyo","_","_","deva","NC","","_","_"
3,"mitrāya","_","_","mitra","NC","","_","_"
4,"varuṇāya","_","_","varuṇa","NC","","_","_"
5,"ca","_","_","ca","CCD","","_","_"
1,"ye","_","_","yad","PRL","","_","_"
2,"bhūtasya","_","_","bhū","PPP","","_","_"
3,"pracetasa","_","_","pracetas","JJ","","_","_"
4,"idaṃ","_","_","ida","PRD","","_","_"
5,"tebhyo","_","_","tad","PRD","","_","_"
6,"'karaṃ","_","_","kar","V","kṛ","_","_"
7,"namaḥ","_","_","namas","NC","","_","_"
1,"_","_","_","pūrva","PPX","","_","_"
2,"_","_","_","apara","PPX","","_","_"
3,"carato","_","_","car","V","car","_","_"
4,"_","_","_","māyā","NC","","_","_"
5,"_","_","_","tad","PRD","","_","_"
6,"śiśū","_","_","śiśu","NC","","_","_"
7,"krīḍantau","_","_","krīḍ","KDP","","_","_"
8,"pari","_","_","pari","CADP","","_","_"
9,"yāto","_","_","yā","V","yā","_","_"
10,"adhvaram","_","_","adhvara","NC","","_","_"
1,"viśvāny","_","_","viśva","JQ","","_","_"
2,"anyo","_","_","anya","PPX","","_","_"
3,"_","_","_","bhuvana","NC","","_","_"
4,"_","_","_","abhicakṣ","V","abhicakṣ","_","_"
5,"ṛtūṃr","_","_","ṛtu","NC","","_","_"
6,"anyo","_","_","anya","PPX","","_","_"
7,"vidadhaj","_","_","vidhā","KDP","","_","_"
8,"jāyate","_","_","jan","V","jan","_","_"
9,"punaḥ","_","_","punar","CAD","","_","_"
1,"navo","_","_","nava","JJ","","_","_"
2,"navo","_","_","nava","JJ","","_","_"
3,"bhavati","_","_","bhav","V","bhū","_","_"
4,"jāyamāno","_","_","jan","KDP","","_","_"
5,"'hnāṃ","_","_","ahar","NC","","_","_"
6,"ketur","_","_","ketu","NC","","_","_"
7,"uṣasām","_","_","uṣas","NC","","_","_"
8,"ety","_","_","e","V","i","_","_"
9,"agram","_","_","agra","NC","","_","_"
1,"bhāgaṃ","_","_","bhāga","NC","","_","_"
2,"devebhyo","_","_","deva","NC","","_","_"
3,"vi","_","_","vi","CADP","","_","_"
4,"dadhāty","_","_","dadh","V","dhā","_","_"
5,"āyan","_","_","e","KDP","","_","_"
6,"pra","_","_","pra","CADP","","_","_"
7,"candramās","_","_","candramas","NC","","_","_"
8,"tirate","_","_","tar","V","tṛ","_","_"
9,"dīrgham","_","_","dīrgha","JJ","","_","_"
10,"āyuḥ","_","_","āyus","NC","","_","_"
1,"_","_","_","su","CAD","","_","_"
2,"_","_","_","kiṃśuka","NC","","_","_"
3,"śalmaliṃ","_","_","śalmali","NC","","_","_"
4,"_","_","_","viśva","JQ","","_","_"
5,"_","_","_","rūpa","NC","","_","_"
6,"_","_","_","hiraṇya","NC","","_","_"
7,"_","_","_","varṇa","NC","","_","_"
8,"suvṛtaṃ","_","_","suvṛt","JJ","","_","_"
9,"_","_","_","su","CAD","","_","_"
10,"_","_","_","cakra","NC","","_","_"
1,"ā","_","_","ā","CADP","","_","_"
2,"roha","_","_","roh","V","ruh","_","_"
3,"sūrye","_","_","sūryā","NC","","_","_"
4,"amṛtasya","_","_","amṛta","NC","","_","_"
5,"lokaṃ","_","_","loka","NC","","_","_"
6,"syonam","_","_","syona","JJ","","_","_"
7,"patye","_","_","pati","NC","","_","_"
8,"vahatuṃ","_","_","vahatu","NC","","_","_"
9,"kṛṇuṣva","_","_","kar","V","kṛ","_","_"
1,"ud","_","_","ud","CADP","","_","_"
2,"_","_","_","īr","V","īr","_","_"
3,"_","_","_","atas","CX","","_","_"
4,"pativatī","_","_","pativat","JJ","","_","_"
5,"hy","_","_","hi","CX","","_","_"
6,"eṣā","_","_","tad","PRD","","_","_"
7,"viśvāvasuṃ","_","_","viśvāvasu","NC","","_","_"
8,"namasā","_","_","namas","NC","","_","_"
9,"gīrbhir","_","_","gir","NC","","_","_"
10,"īḍe","_","_","īḍ","V","īḍ","_","_"
1,"anyām","_","_","anya","PPX","","_","_"
2,"iccha","_","_","iṣ","V","iṣ","_","_"
3,"pitṛṣadaṃ","_","_","pitṛṣad","JJ","","_","_"
4,"vyaktāṃ","_","_","vyakta","JJ","","_","_"
5,"sa","_","_","tad","PRD","","_","_"
6,"te","_","_","tvat","PPR","","_","_"
7,"bhāgo","_","_","bhāga","NC","","_","_"
8,"januṣā","_","_","janus","NC","","_","_"
9,"tasya","_","_","tad","PRD","","_","_"
10,"viddhi","_","_","vid","V","vid","_","_"
1,"ud","_","_","ud","CADP","","_","_"
2,"_","_","_","īr","V","īr","_","_"
3,"_","_","_","atas","CX","","_","_"
4,"viśvāvaso","_","_","viśvāvasu","NC","","_","_"
5,"_","_","_","namas","NC","","_","_"
6,"_","_","_","iḍā","NC","","_","_"
7,"mahe","_","_","mah","V","mah","_","_"
8,"tvā","_","_","tvat","PPR","","_","_"
1,"anyām","_","_","anya","PPX","","_","_"
2,"iccha","_","_","iṣ","V","iṣ","_","_"
3,"prapharvyaṃ","_","_","prapharvī","NC","","_","_"
4,"saṃ","_","_","sa","CADP","","_","_"
5,"jāyām","_","_","jāyā","NC","","_","_"
6,"patyā","_","_","pati","NC","","_","_"
7,"sṛja","_","_","sṛja","V","sṛj","_","_"
1,"anṛkṣarā","_","_","anṛkṣara","JJ","","_","_"
2,"ṛjavaḥ","_","_","ṛju","JJ","","_","_"
3,"santu","_","_","as","V","as","_","_"
4,"panthā","_","_","pathin","NC","","_","_"
5,"yebhiḥ","_","_","yad","PRL","","_","_"
6,"sakhāyo","_","_","sakhi","NC","","_","_"
7,"yanti","_","_","e","V","i","_","_"
8,"no","_","_","mat","PPR","","_","_"
9,"vareyam","_","_","varey","CGDI","","_","_"
1,"sam","_","_","sa","CADP","","_","_"
2,"aryamā","_","_","aryaman","NC","","_","_"
3,"sam","_","_","sa","CADP","","_","_"
4,"bhago","_","_","bhaga","NC","","_","_"
5,"no","_","_","mat","PPR","","_","_"
6,"ninīyāt","_","_","nay","V","nī","_","_"
7,"saṃ","_","_","sa","CADP","","_","_"
8,"jāspatyaṃ","_","_","jāspatya","NC","","_","_"
9,"suyamam","_","_","suyama","JJ","","_","_"
10,"astu","_","_","as","V","as","_","_"
11,"devāḥ","_","_","deva","NC","","_","_"
1,"pra","_","_","pra","CADP","","_","_"
2,"tvā","_","_","tvat","PPR","","_","_"
3,"muñcāmi","_","_","muñc","V","muc","_","_"
4,"varuṇasya","_","_","varuṇa","NC","","_","_"
5,"pāśād","_","_","pāśa","NC","","_","_"
6,"yena","_","_","yad","PRL","","_","_"
7,"_","_","_","tvat","PPR","","_","_"
8,"_","_","_","bandh","V","bandh","_","_"
9,"savitā","_","_","savitṛ","NC","","_","_"
10,"_","_","_","su","CAD","","_","_"
11,"_","_","_","śeva","JJ","","_","_"
1,"ṛtasya","_","_","ṛta","NC","","_","_"
2,"yonau","_","_","yoni","NC","","_","_"
3,"sukṛtasya","_","_","sukṛta","NC","","_","_"
4,"loke","_","_","loka","NC","","_","_"
5,"a","_","_","alpha_privativum","JJ","","_","_"
5,"'riṣṭāṃ","_","_","riṣṭa","JJ","","_","_"
6,"tvā","_","_","tvat","PPR","","_","_"
7,"saha","_","_","saha","CX","","_","_"
8,"patyā","_","_","pati","NC","","_","_"
9,"dadhāmi","_","_","dadh","V","dhā","_","_"
1,"preto","_","_","pre","PPP","","_","_"
2,"muñcāmi","_","_","muñc","V","muc","_","_"
3,"_","_","_","na","CNG","","_","_"
4,"_","_","_","amutas","CX","","_","_"
5,"_","_","_","su","CAD","","_","_"
6,"_","_","_","bandh","PPP","","_","_"
7,"amutas","_","_","amutas","CX","","_","_"
8,"karam","_","_","kar","V","kṛ","_","_"
1,"_","_","_","yathā","CCM","","_","_"
2,"_","_","_","ida","PRD","","_","_"
3,"indra","_","_","indra","NC","","_","_"
4,"mīḍhvaḥ","_","_","mīḍhvas","JJ","","_","_"
5,"_","_","_","su","CAD","","_","_"
6,"_","_","_","putra","NC","","_","_"
7,"_","_","_","subhaga","JJ","","_","_"
8,"_","_","_","as","V","as","_","_"
1,"pūṣā","_","_","pūṣan","NC","","_","_"
2,"_","_","_","tvat","PPR","","_","_"
3,"_","_","_","itas","CX","","_","_"
4,"nayatu","_","_","nay","V","nī","_","_"
5,"_","_","_","hasta","NC","","_","_"
6,"_","_","_","grah","CGDA","","_","_"
7,"_","_","_","aśvin","NC","","_","_"
8,"tvā","_","_","tvat","PPR","","_","_"
9,"pra","_","_","pra","CADP","","_","_"
10,"vahatāṃ","_","_","vah","V","vah","_","_"
11,"rathena","_","_","ratha","NC","","_","_"
1,"gṛhān","_","_","gṛha","NC","","_","_"
2,"gaccha","_","_","ga","V","ga","_","_"
3,"_","_","_","gṛha","NC","","_","_"
4,"_","_","_","patnī","NC","","_","_"
5,"_","_","_","yathā","CCM","","_","_"
6,"_","_","_","as","V","as","_","_"
7,"vaśinī","_","_","vaśin","JJ","","_","_"
8,"tvaṃ","_","_","tvat","PPR","","_","_"
9,"vidatham","_","_","vidatha","NC","","_","_"
10,"ā","_","_","ā","CADP","","_","_"
11,"vadāsi","_","_","vad","V","vad","_","_"
1,"iha","_","_","iha","CAD","","_","_"
2,"priyam","_","_","priya","JJ","","_","_"
3,"prajayā","_","_","prajā","NC","","_","_"
4,"te","_","_","tvat","PPR","","_","_"
5,"sam","_","_","sa","CADP","","_","_"
6,"ṛdhyatām","_","_","ṛdh","V","ṛdh","_","_"
7,"asmin","_","_","ida","PRD","","_","_"
8,"gṛhe","_","_","gṛha","NC","","_","_"
9,"gārhapatyāya","_","_","gārhapatya","NC","","_","_"
10,"jāgṛhi","_","_","jāgṛ","V","jāgṛ","_","_"
1,"enā","_","_","ida","PRD","","_","_"
2,"patyā","_","_","pati","NC","","_","_"
3,"tanvaṃ","_","_","tanū","NC","","_","_"
4,"saṃ","_","_","sa","CADP","","_","_"
5,"_","_","_","sṛj","V","sṛj","_","_"
6,"_","_","_","adha","CX","","_","_"
7,"jivrī","_","_","jivri","JJ","","_","_"
8,"vidatham","_","_","vidatha","NC","","_","_"
9,"ā","_","_","ā","CADP","","_","_"
10,"vadāthaḥ","_","_","vad","V","vad","_","_"
1,"_","_","_","nīla","JJ","","_","_"
2,"_","_","_","lohita","JJ","","_","_"
3,"bhavati","_","_","bhav","V","bhū","_","_"
4,"_","_","_","kṛtyā","NC","","_","_"
5,"_","_","_","āsakti","NC","","_","_"
6,"vy","_","_","vi","CADP","","_","_"
7,"ajyate","_","_","añj","V","añj","_","_"
1,"edhante","_","_","edh","V","edh","_","_"
2,"asyā","_","_","ida","PRD","","_","_"
3,"jñātayaḥ","_","_","jñāti","NC","","_","_"
4,"patir","_","_","pati","NC","","_","_"
5,"bandheṣu","_","_","bandha","NC","","_","_"
6,"badhyate","_","_","bandh","V","bandh","_","_"
1,"parā","_","_","parā","CADP","","_","_"
2,"dehi","_","_","dad","V","dā","_","_"
3,"śāmulyam","_","_","śāmulya","NC","","_","_"
4,"brahmabhyo","_","_","brahman","NC","","_","_"
5,"vi","_","_","vi","CADP","","_","_"
6,"bhajā","_","_","bhaj","V","bhaj","_","_"
7,"vasu","_","_","vasu","NC","","_","_"
1,"_","_","_","kṛtyā","NC","","_","_"
2,"_","_","_","tad","PRD","","_","_"
3,"padvatī","_","_","padvat","JJ","","_","_"
4,"bhūtvy","_","_","bhū","CGDA","","_","_"
5,"ā","_","_","ā","CADP","","_","_"
6,"jāyā","_","_","jāyā","NC","","_","_"
7,"viśate","_","_","viś","V","viś","_","_"
8,"patim","_","_","pati","NC","","_","_"
1,"aśrīrā","_","_","aśrīra","JJ","","_","_"
2,"tanūr","_","_","tanū","NC","","_","_"
3,"bhavati","_","_","bhav","V","bhū","_","_"
4,"ruśatī","_","_","ruśat","JJ","","_","_"
5,"_","_","_","pāpā","NC","","_","_"
6,"_","_","_","adas","PRD","","_","_"
1,"patir","_","_","pati","NC","","_","_"
2,"yad","_","_","yat","CSB","","_","_"
3,"vadhvo","_","_","vadhū","NC","","_","_"
4,"vāsasā","_","_","vāsas","NC","","_","_"
5,"svam","_","_","sva","JJ","","_","_"
6,"aṅgam","_","_","aṅga","NC","","_","_"
7,"abhidhitsate","_","_","abhidhits","V","abhidhits","_","_"
1,"ye","_","_","yad","PRL","","_","_"
2,"vadhvaś","_","_","vadhū","NC","","_","_"
3,"candraṃ","_","_","candra","JJ","","_","_"
4,"vahatuṃ","_","_","vahatu","NC","","_","_"
5,"yakṣmā","_","_","yakṣma","NC","","_","_"
6,"yanti","_","_","e","V","i","_","_"
7,"janād","_","_","jana","NC","","_","_"
8,"anu","_","_","anu","CADP","","_","_"
1,"punas","_","_","punar","CAD","","_","_"
2,"tān","_","_","tad","PRD","","_","_"
3,"yajñiyā","_","_","yajñiya","JJ","","_","_"
4,"devā","_","_","deva","NC","","_","_"
5,"nayantu","_","_","nay","V","nī","_","_"
6,"yata","_","_","yatas","CX","","_","_"
7,"āgatāḥ","_","_","āga","PPP","","_","_"
1,"mā","_","_","mā","CNG","","_","_"
2,"vidan","_","_","vid","V","vid","_","_"
3,"paripanthino","_","_","paripanthin","JJ","","_","_"
4,"ya","_","_","yad","PRL","","_","_"
5,"āsīdanti","_","_","āsīd","V","āsad","_","_"
6,"dampatī","_","_","dampati","NC","","_","_"
1,"sugebhir","_","_","suga","JJ","","_","_"
2,"durgam","_","_","durga","NC","","_","_"
3,"atītām","_","_","atye","V","atī","_","_"
4,"apa","_","_","apa","CX","","_","_"
5,"drāntv","_","_","drā","V","drā","_","_"
6,"arātayaḥ","_","_","arāti","NC","","_","_"
1,"_","_","_","su","CAD","","_","_"
2,"_","_","_","maṅgala","JJ","","_","_"
3,"iyaṃ","_","_","ida","PRD","","_","_"
4,"vadhūr","_","_","vadhū","NC","","_","_"
5,"imāṃ","_","_","ida","PRD","","_","_"
6,"sameta","_","_","same","V","same","_","_"
7,"paśyata","_","_","paś","V","paś","_","_"
1,"saubhāgyam","_","_","saubhāgya","NC","","_","_"
2,"asyai","_","_","ida","PRD","","_","_"
3,"_","_","_","dā","CGDA","","_","_"
4,"_","_","_","atha","CAD","","_","_"
5,"_","_","_","asta","NC","","_","_"
6,"vi","_","_","vi","CADP","","_","_"
7,"_","_","_","parā","CADP","","_","_"
8,"_","_","_","e","V","i","_","_"
1,"tṛṣṭam","_","_","tṛṣ","PPP","","_","_"
2,"etat","_","_","tad","PRD","","_","_"
3,"kaṭukam","_","_","kaṭuka","JJ","","_","_"
4,"etad","_","_","tad","PRD","","_","_"
5,"apāṣṭhavad","_","_","apāṣṭhavat","JJ","","_","_"
6,"viṣavan","_","_","viṣavat","JJ","","_","_"
7,"_","_","_","na","CNG","","_","_"
8,"_","_","_","tad","PRD","","_","_"
9,"attave","_","_","ad","CGDI","","_","_"
1,"sūryāṃ","_","_","sūryā","NC","","_","_"
2,"yo","_","_","yad","PRL","","_","_"
3,"brahmā","_","_","brahman","NC","","_","_"
4,"vidyāt","_","_","vid","V","vid","_","_"
5,"sa","_","_","tad","PRD","","_","_"
6,"id","_","_","id","CEM","","_","_"
7,"vādhūyam","_","_","vādhūya","NC","","_","_"
8,"arhati","_","_","arh","V","arh","_","_"
1,"āśasanaṃ","_","_","āśasana","NC","","_","_"
2,"viśasanam","_","_","viśasana","NC","","_","_"
3,"atho","_","_","atho","CX","","_","_"
4,"adhivikartanam","_","_","adhivikartana","NC","","_","_"
1,"sūryāyāḥ","_","_","sūryā","NC","","_","_"
2,"paśya","_","_","paś","V","paś","_","_"
3,"rūpāṇi","_","_","rūpa","NC","","_","_"
4,"tāni","_","_","tad","PRD","","_","_"
5,"brahmā","_","_","brahman","NC","","_","_"
6,"tu","_","_","tu","CCD","","_","_"
7,"śundhati","_","_","śudh","V","śudh","_","_"
1,"gṛbhṇāmi","_","_","grah","V","grah","_","_"
2,"te","_","_","tvat","PPR","","_","_"
3,"_","_","_","saubhaga","JJ","","_","_"
5,"hastam","_","_","hasta","NC","","_","_"
6,"mayā","_","_","mat","PPR","","_","_"
7,"patyā","_","_","pati","NC","","_","_"
8,"jaradaṣṭir","_","_","jaradaṣṭi","JJ","","_","_"
9,"_","_","_","yathā","CCM","","_","_"
10,"_","_","_","as","V","as","_","_"
1,"bhago","_","_","bhaga","NC","","_","_"
2,"aryamā","_","_","aryaman","NC","","_","_"
3,"savitā","_","_","savitṛ","NC","","_","_"
4,"purandhir","_","_","purandhi","NC","","_","_"
5,"mahyaṃ","_","_","mat","PPR","","_","_"
6,"_","_","_","tvat","PPR","","_","_"
7,"_","_","_","dad","V","dā","_","_"
8,"gārhapatyāya","_","_","gārhapatya","NC","","_","_"
9,"devāḥ","_","_","deva","NC","","_","_"
1,"tām","_","_","tad","PRD","","_","_"
2,"_","_","_","pūṣan","NC","","_","_"
3,"_","_","_","śivatama","JJ","","_","_"
4,"erayasva","_","_","eray","V","eray","_","_"
5,"yasyām","_","_","yad","PRL","","_","_"
6,"bījam","_","_","bīja","NC","","_","_"
7,"manuṣyā","_","_","manuṣya","NC","","_","_"
8,"vapanti","_","_","vap","V","vap","_","_"
1,"yā","_","_","yad","PRL","","_","_"
2,"na","_","_","mat","PPR","","_","_"
3,"ūrū","_","_","ūru","NC","","_","_"
4,"uśatī","_","_","vaś","KDP","","_","_"
5,"viśrayāte","_","_","viśri","V","viśri","_","_"
6,"yasyām","_","_","yad","PRL","","_","_"
7,"uśantaḥ","_","_","vaś","KDP","","_","_"
8,"praharāma","_","_","prahar","V","prahṛ","_","_"
9,"śepam","_","_","śepa","NC","","_","_"
1,"tubhyam","_","_","tvat","PPR","","_","_"
2,"agre","_","_","agra","NC","","_","_"
3,"pary","_","_","pari","CADP","","_","_"
4,"avahan","_","_","vah","V","vah","_","_"
5,"sūryāṃ","_","_","sūryā","NC","","_","_"
6,"vahatunā","_","_","vahatu","NC","","_","_"
7,"saha","_","_","saha","CX","","_","_"
1,"punaḥ","_","_","punar","CAD","","_","_"
2,"patibhyo","_","_","pati","NC","","_","_"
3,"jāyāṃ","_","_","jāyā","NC","","_","_"
4,"dā","_","_","dad","V","dā","_","_"
5,"agne","_","_","agni","NC","","_","_"
6,"prajayā","_","_","prajā","NC","","_","_"
7,"saha","_","_","saha","CX","","_","_"
1,"punaḥ","_","_","punar","CAD","","_","_"
2,"patnīm","_","_","patnī","NC","","_","_"
3,"agnir","_","_","agni","NC","","_","_"
4,"adād","_","_","dad","V","dā","_","_"
5,"āyuṣā","_","_","āyus","NC","","_","_"
6,"saha","_","_","saha","CX","","_","_"
7,"varcasā","_","_","varcas","NC","","_","_"
1,"_","_","_","dīrgha","JJ","","_","_"
2,"_","_","_","āyus","NC","","_","_"
3,"asyā","_","_","ida","PRD","","_","_"
4,"yaḥ","_","_","yad","PRL","","_","_"
5,"patir","_","_","pati","NC","","_","_"
6,"jīvāti","_","_","jīv","V","jīv","_","_"
7,"śaradaḥ","_","_","śarad","NC","","_","_"
8,"śatam","_","_","śata","NUM","","_","_"
1,"somaḥ","_","_","soma","NC","","_","_"
2,"prathamo","_","_","prathama","JJ","","_","_"
3,"vivide","_","_","vid","V","vid","_","_"
4,"gandharvo","_","_","gandharva","NC","","_","_"
5,"vivida","_","_","vid","V","vid","_","_"
6,"uttaraḥ","_","_","uttara","JJ","","_","_"
1,"tṛtīyo","_","_","tṛtīya","JJ","","_","_"
2,"agniṣ","_","_","agni","NC","","_","_"
3,"ṭe","_","_","tvat","PPR","","_","_"
4,"patis","_","_","pati","NC","","_","_"
5,"turīyas","_","_","turīya","JJ","","_","_"
6,"te","_","_","tvat","PPR","","_","_"
7,"_","_","_","manuṣya","NC","","_","_"
8,"_","_","_","jā","JJ","","_","_"
1,"somo","_","_","soma","NC","","_","_"
2,"dadad","_","_","dad","V","dā","_","_"
3,"gandharvāya","_","_","gandharva","NC","","_","_"
4,"gandharvo","_","_","gandharva","NC","","_","_"
5,"dadad","_","_","dad","V","dā","_","_"
6,"agnaye","_","_","agni","NC","","_","_"
1,"rayiṃ","_","_","rayi","NC","","_","_"
2,"ca","_","_","ca","CCD","","_","_"
3,"putrāṃś","_","_","putra","NC","","_","_"
4,"_","_","_","ca","CCD","","_","_"
5,"_","_","_","dad","V","dā","_","_"
6,"agnir","_","_","agni","NC","","_","_"
7,"mahyam","_","_","mat","PPR","","_","_"
8,"atho","_","_","atho","CX","","_","_"
9,"imām","_","_","ida","PRD","","_","_"
1,"_","_","_","iha","CAD","","_","_"
2,"_","_","_","eva","CEM","","_","_"
3,"stam","_","_","as","V","as","_","_"
4,"mā","_","_","mā","CNG","","_","_"
5,"vi","_","_","vi","CADP","","_","_"
6,"yauṣṭaṃ","_","_","viśva","JQ","","_","_"
7,"viśvam","_","_","āyus","NC","","_","_"
8,"āyur","_","_","vi","CADP","","_","_"
9,"vy","_","_","aś","V","aś","_","_"
1,"krīḍantau","_","_","krīḍ","KDP","","_","_"
2,"putrair","_","_","putra","NC","","_","_"
3,"naptṛbhir","_","_","naptṛ","NC","","_","_"
4,"modamānau","_","_","mud","KDP","","_","_"
5,"sve","_","_","sva","JJ","","_","_"
6,"gṛhe","_","_","gṛha","NC","","_","_"
1,"ā","_","_","ā","CADP","","_","_"
2,"naḥ","_","_","mat","PPR","","_","_"
3,"prajāṃ","_","_","prajā","NC","","_","_"
4,"janayatu","_","_","jan","V","jan","_","_"
5,"prajāpatir","_","_","prajāpati","NC","","_","_"
6,"ājarasāya","_","_","ājarasāya","CX","","_","_"
7,"sam","_","_","sa","CADP","","_","_"
8,"anaktv","_","_","añj","V","añj","_","_"
9,"aryamā","_","_","aryaman","NC","","_","_"
1,"adurmaṅgalīḥ","_","_","adurmaṅgala","JJ","","_","_"
2,"_","_","_","pati","NC","","_","_"
3,"_","_","_","loka","NC","","_","_"
4,"ā","_","_","ā","CADP","","_","_"
5,"viśa","_","_","viś","V","viś","_","_"
6,"śaṃ","_","_","śa","NC","","_","_"
7,"no","_","_","mat","PPR","","_","_"
8,"bhava","_","_","bhav","V","bhū","_","_"
9,"dvipade","_","_","dvipad","NC","","_","_"
10,"śaṃ","_","_","śa","NC","","_","_"
11,"catuṣpade","_","_","catuṣpada","JJ","","_","_"
1,"_","_","_","aghora","JJ","","_","_"
2,"_","_","_","cakṣus","NC","","_","_"
3,"_","_","_","a","CNG","","_","_"
4,"_","_","_","pati","NC","","_","_"
5,"_","_","_","ghna","JJ","","_","_"
6,"edhi","_","_","as","V","as","_","_"
7,"śivā","_","_","śiva","JJ","","_","_"
8,"paśubhyaḥ","_","_","paśu","NC","","_","_"
9,"_","_","_","su","CAD","","_","_"
10,"_","_","_","manas","NC","","_","_"
11,"_","_","_","su","CAD","","_","_"
12,"_","_","_","varcas","NC","","_","_"
1,"vīrasūr","_","_","vīrasū","NC","","_","_"
2,"_","_","_","deva","NC","","_","_"
3,"_","_","_","kāma","NC","","_","_"
4,"syonā","_","_","syona","JJ","","_","_"
5,"śaṃ","_","_","śa","NC","","_","_"
6,"no","_","_","mat","PPR","","_","_"
7,"bhava","_","_","bhav","V","bhū","_","_"
8,"dvipade","_","_","dvipad","NC","","_","_"
9,"śaṃ","_","_","śa","NC","","_","_"
10,"catuṣpade","_","_","catuṣpada","JJ","","_","_"
1,"imāṃ","_","_","ida","PRD","","_","_"
2,"tvam","_","_","tvat","PPR","","_","_"
3,"indra","_","_","indra","NC","","_","_"
4,"_","_","_","su","CAD","","_","_"
5,"_","_","_","putra","NC","","_","_"
6,"suputrāṃ","_","_","subhaga","JJ","","_","_"
7,"subhagāṃ","_","_","kar","V","kṛ","_","_"
1,"_","_","_","daśan","NUM","","_","_"
2,"_","_","_","ida","PRD","","_","_"
3,"putrān","_","_","putra","NC","","_","_"
4,"ā","_","_","ā","CADP","","_","_"
5,"dhehi","_","_","dadh","V","dhā","_","_"
6,"patim","_","_","pati","NC","","_","_"
7,"ekādaśaṃ","_","_","ekādaśa","JJ","","_","_"
8,"kṛdhi","_","_","kar","V","kṛ","_","_"
1,"samrājñī","_","_","samrājñī","NC","","_","_"
2,"śvaśure","_","_","śvaśura","NC","","_","_"
3,"bhava","_","_","bhav","V","bhū","_","_"
4,"samrājñī","_","_","samrājñī","NC","","_","_"
5,"śvaśrvām","_","_","śvaśrū","NC","","_","_"
6,"bhava","_","_","bhav","V","bhū","_","_"
1,"nanāndari","_","_","nanāndṛ","NC","","_","_"
2,"samrājñī","_","_","samrājñī","NC","","_","_"
3,"bhava","_","_","bhav","V","bhū","_","_"
4,"samrājñī","_","_","samrājñī","NC","","_","_"
5,"adhi","_","_","adhi","CADP","","_","_"
6,"devṛṣu","_","_","devṛ","NC","","_","_"
1,"sam","_","_","sa","CADP","","_","_"
2,"añjantu","_","_","añj","V","añj","_","_"
3,"viśve","_","_","viśva","JQ","","_","_"
4,"devāḥ","_","_","deva","NC","","_","_"
5,"sam","_","_","sa","CADP","","_","_"
6,"āpo","_","_","ap","NC","","_","_"
7,"hṛdayāni","_","_","hṛdaya","NC","","_","_"
8,"nau","_","_","mat","PPR","","_","_"
1,"sam","_","_","sa","CADP","","_","_"
2,"mātariśvā","_","_","mātariśvan","NC","","_","_"
3,"saṃ","_","_","sa","CADP","","_","_"
4,"dhātā","_","_","dhātṛ","NC","","_","_"
5,"sam","_","_","sa","CADP","","_","_"
6,"u","_","_","u","CEM","","_","_"
7,"deṣṭrī","_","_","deṣṭrī","NC","","_","_"
8,"dadhātu","_","_","dadh","V","dhā","_","_"
9,"nau","_","_","mat","PPR","","_","_"
