"WordID","word","NormSTEM","suffix","lemma","PoS","Root","NormSuffix","NormWord"
1,"yudhiṣṭhira","_","_","yudhiṣṭhira","NC","","_","_"
2,"uvāca","_","_","vak","V","vac","_","_"
1,"_","_","_","na","CNG","","_","_"
2,"_","_","_","abhāgadheya","JJ","","_","_"
3,"prāpnoti","_","_","prāpn","V","prāp","_","_"
4,"dhanaṃ","_","_","dhana","NC","","_","_"
5,"_","_","_","su","CAD","","_","_"
6,"_","_","_","balavat","JJ","","_","_"
7,"api","_","_","api","CX","","_","_"
1,"_","_","_","bhāgadheya","NC","","_","_"
2,"_","_","_","anvita","JJ","","_","_"
3,"_","_","_","tu","CCD","","_","_"
4,"_","_","_","artha","NC","","_","_"
5,"kṛśo","_","_","kṛśa","JJ","","_","_"
6,"_","_","_","bāla","JJ","","_","_"
7,"_","_","_","ca","CCD","","_","_"
8,"vindati","_","_","vid","V","vid","_","_"
1,"_","_","_","na","CNG","","_","_"
2,"_","_","_","alābha","NC","","_","_"
3,"_","_","_","kāla","NC","","_","_"
4,"labhate","_","_","labh","V","labh","_","_"
5,"prayatne","_","_","prayatna","NC","","_","_"
6,"'pi","_","_","api","CX","","_","_"
7,"kṛte","_","_","kṛ","PPP","","_","_"
8,"sati","_","_","as","KDP","","_","_"
1,"_","_","_","lābha","NC","","_","_"
2,"_","_","_","kāla","NC","","_","_"
3,"'prayatnena","_","_","aprayatna","NC","","_","_"
4,"labhate","_","_","labh","V","labh","_","_"
5,"vipulaṃ","_","_","vipula","JJ","","_","_"
6,"dhanam","_","_","dhana","NC","","_","_"
1,"_","_","_","kṛ","PPP","","_","_"
2,"_","_","_","yatna","NC","","_","_"
3,"_","_","_","aphala","JJ","","_","_"
4,"_","_","_","ca","CCD","","_","_"
5,"_","_","_","eva","CEM","","_","_"
6,"dṛśyante","_","_","darś","V","dṛś","_","_"
7,"śataśo","_","_","śataśas","CX","","_","_"
8,"narāḥ","_","_","nara","NC","","_","_"
1,"yadi","_","_","yadi","CSB","","_","_"
2,"yatno","_","_","yatna","NC","","_","_"
3,"_","_","_","bhav","V","bhū","_","_"
4,"_","_","_","martya","NC","","_","_"
5,"sa","_","_","tad","PRD","","_","_"
6,"sarvaṃ","_","_","sarva","JQ","","_","_"
7,"phalam","_","_","phala","NC","","_","_"
8,"āpnuyāt","_","_","āpn","V","āp","_","_"
1,"_","_","_","na","CNG","","_","_"
2,"_","_","_","a","CNG","","_","_"
3,"_","_","_","labh","KDG","","_","_"
4,"_","_","_","ca","CCD","","_","_"
5,"_","_","_","upalabh","V","upalabh","_","_"
6,"nṛṇāṃ","_","_","nṛ","NC","","_","_"
7,"_","_","_","bharata","NC","","_","_"
8,"_","_","_","sattama","JJ","","_","_"
1,"yadā","_","_","yadā","CSB","","_","_"
2,"prayatnaṃ","_","_","prayatna","NC","","_","_"
3,"kṛtavān","_","_","kṛ","KDP","","_","_"
4,"dṛśyate","_","_","darś","V","dṛś","_","_"
5,"_","_","_","hi","CX","","_","_"
6,"_","_","_","aphala","JJ","","_","_"
7,"naraḥ","_","_","nara","NC","","_","_"
1,"_","_","_","mārg","KDP","","_","_"
2,"_","_","_","naya","NC","","_","_"
3,"_","_","_","śata","NUM","","_","_"
4,"arthān","_","_","artha","NC","","_","_"
5,"_","_","_","a","CNG","","_","_"
6,"_","_","_","mārg","KDP","","_","_"
7,"_","_","_","ca","CCD","","_","_"
8,"_","_","_","apara","PPX","","_","_"
9,"sukhī","_","_","sukhin","JJ","","_","_"
1,"akāryam","_","_","akārya","NC","","_","_"
2,"a","_","_","alpha_privativum","CX","","_","_"
2,"asakṛt","_","_","sakṛt","CX","","_","_"
3,"kṛtvā","_","_","kṛ","CGDA","","_","_"
4,"dṛśyante","_","_","darś","V","dṛś","_","_"
5,"_","_","_","hi","CX","","_","_"
6,"_","_","_","adhana","JJ","","_","_"
7,"narāḥ","_","_","nara","NC","","_","_"
1,"_","_","_","dhana","NC","","_","_"
2,"_","_","_","yuj","PPP","","_","_"
3,"_","_","_","tu","CCD","","_","_"
4,"_","_","_","adharma","NC","","_","_"
5,"_","_","_","stha","JJ","","_","_"
6,"dṛśyante","_","_","darś","V","dṛś","_","_"
7,"_","_","_","ca","CCD","","_","_"
8,"_","_","_","apara","PPX","","_","_"
9,"janāḥ","_","_","jana","NC","","_","_"
1,"a","_","_","alpha_privativum","CGDA","","_","_"
1,"adhītya","_","_","dhī","CGDA","","_","_"
2,"nītiṃ","_","_","nīti","NC","","_","_"
3,"_","_","_","yasmāt","CX","","_","_"
4,"_","_","_","ca","CCD","","_","_"
5,"_","_","_","nīti","NC","","_","_"
6,"_","_","_","yuj","PPP","","_","_"
7,"na","_","_","na","CNG","","_","_"
8,"dṛśyate","_","_","darś","V","dṛś","_","_"
1,"_","_","_","anabhijña","JJ","","_","_"
2,"_","_","_","ca","CCD","","_","_"
3,"sācivyaṃ","_","_","sācivya","NC","","_","_"
4,"gamitaḥ","_","_","gamay","PPP","","_","_"
5,"kena","_","_","kiṃ","PRQ","","_","_"
6,"hetunā","_","_","hetu","NC","","_","_"
1,"_","_","_","vidyā","NC","","_","_"
2,"_","_","_","yuj","PPP","","_","_"
3,"_","_","_","hi","CX","","_","_"
4,"_","_","_","avidya","JJ","","_","_"
5,"_","_","_","ca","CCD","","_","_"
6,"dhanavān","_","_","dhanavat","JJ","","_","_"
7,"_","_","_","durgata","JJ","","_","_"
8,"_","_","_","tathā","CX","","_","_"
1,"yadi","_","_","yadi","CSB","","_","_"
2,"vidyām","_","_","vidyā","NC","","_","_"
3,"upāśritya","_","_","upāśri","CGDA","","_","_"
4,"naraḥ","_","_","nara","NC","","_","_"
5,"sukham","_","_","sukha","NC","","_","_"
6,"avāpnuyāt","_","_","avāpn","V","avāp","_","_"
1,"na","_","_","na","CNG","","_","_"
2,"vidvān","_","_","vidvas","JJ","","_","_"
3,"vidyayā","_","_","vidyā","NC","","_","_"
4,"hīnaṃ","_","_","hā","PPP","","_","_"
5,"_","_","_","vṛtti","NC","","_","_"
6,"_","_","_","artha","NC","","_","_"
7,"upasaṃśrayet","_","_","upasaṃśri","V","upasaṃśri","_","_"
1,"yathā","_","_","yathā","CCM","","_","_"
2,"pipāsāṃ","_","_","pipāsā","NC","","_","_"
3,"jayati","_","_","jay","V","ji","_","_"
4,"puruṣaḥ","_","_","puruṣa","NC","","_","_"
5,"prāpya","_","_","prāp","CGDA","","_","_"
6,"vai","_","_","vai","CX","","_","_"
7,"jalam","_","_","jala","NC","","_","_"
1,"_","_","_","dṛś","PPP","","_","_"
2,"_","_","_","artha","NC","","_","_"
3,"_","_","_","vidyā","NC","","_","_"
4,"_","_","_","api","CX","","_","_"
5,"_","_","_","eva","CX","","_","_"
6,"avidyāṃ","_","_","avidyā","NC","","_","_"
7,"_","_","_","prajah","V","prahā","_","_"
8,"_","_","_","nara","NC","","_","_"
1,"_","_","_","na","CNG","","_","_"
2,"_","_","_","aprāpta","JJ","","_","_"
3,"_","_","_","kāla","NC","","_","_"
4,"mriyate","_","_","mar","V","mṛ","_","_"
5,"viddhaḥ","_","_","vyadh","PPP","","_","_"
6,"_","_","_","śara","NC","","_","_"
7,"_","_","_","śata","NUM","","_","_"
8,"api","_","_","api","CX","","_","_"
1,"_","_","_","tṛṇa","NC","","_","_"
2,"_","_","_","agra","NC","","_","_"
3,"_","_","_","api","CX","","_","_"
4,"saṃspṛṣṭaḥ","_","_","saṃspṛś","PPP","","_","_"
5,"_","_","_","prāp","PPP","","_","_"
6,"_","_","_","kāla","NC","","_","_"
7,"na","_","_","na","CNG","","_","_"
8,"jīvati","_","_","jīv","V","jīv","_","_"
1,"bhīṣma","_","_","bhīṣma","NC","","_","_"
2,"uvāca","_","_","vak","V","vac","_","_"
1,"īhamānaḥ","_","_","īh","KDP","","_","_"
2,"samārambhān","_","_","samārambha","NC","","_","_"
3,"yadi","_","_","yadi","CSB","","_","_"
4,"_","_","_","na","CNG","","_","_"
5,"_","_","_","āsāday","V","āsāday","_","_"
6,"dhanam","_","_","dhana","NC","","_","_"
1,"ugraṃ","_","_","ugra","JJ","","_","_"
2,"tapaḥ","_","_","tapas","NC","","_","_"
3,"_","_","_","samāroh","V","samāruh","_","_"
4,"_","_","_","na","CNG","","_","_"
5,"_","_","_","hi","CX","","_","_"
6,"_","_","_","anupta","JJ","","_","_"
7,"prarohati","_","_","praroh","V","praruh","_","_"
1,"dānena","_","_","dāna","NC","","_","_"
2,"bhogī","_","_","bhogin","JJ","","_","_"
3,"bhavati","_","_","bhav","V","bhū","_","_"
4,"medhāvī","_","_","medhāvin","JJ","","_","_"
5,"_","_","_","vṛddha","JJ","","_","_"
6,"_","_","_","sevā","NC","","_","_"
1,"ahiṃsayā","_","_","ahiṃsā","NC","","_","_"
2,"ca","_","_","ca","CCD","","_","_"
3,"_","_","_","dīrgha","JJ","","_","_"
4,"_","_","_","āyus","NC","","_","_"
5,"iti","_","_","iti","CQT","","_","_"
6,"prāhur","_","_","prāh","V","prāh","_","_"
7,"manīṣiṇaḥ","_","_","manīṣin","JJ","","_","_"
1,"tasmād","_","_","tasmāt","CX","","_","_"
2,"_","_","_","dad","V","dā","_","_"
3,"_","_","_","na","CNG","","_","_"
4,"yāceta","_","_","yāc","V","yāc","_","_"
5,"pūjayed","_","_","pūj","V","pūj","_","_"
6,"dhārmikān","_","_","dhārmika","JJ","","_","_"
7,"api","_","_","api","CX","","_","_"
1,"_","_","_","su","CAD","","_","_"
2,"_","_","_","ābhāṣin","JJ","","_","_"
3,"_","_","_","priya","JJ","","_","_"
4,"_","_","_","kṛt","JJ","","_","_"
5,"_","_","_","śudh","PPP","","_","_"
6,"_","_","_","sarva","JQ","","_","_"
7,"_","_","_","sattva","NC","","_","_"
8,"_","_","_","avihiṃsaka","JJ","","_","_"
1,"yadā","_","_","yadā","CSB","","_","_"
2,"_","_","_","pramāṇa","NC","","_","_"
3,"_","_","_","prabhava","NC","","_","_"
4,"_","_","_","svabhāva","NC","","_","_"
5,"_","_","_","ca","CCD","","_","_"
6,"_","_","_","sukha","NC","","_","_"
7,"_","_","_","asukha","NC","","_","_"
1,"_","_","_","maśa","NC","","_","_"
2,"_","_","_","kīṭa","NC","","_","_"
3,"_","_","_","pipīla","NC","","_","_"
4,"sthiro","_","_","sthira","JJ","","_","_"
5,"bhava","_","_","bhav","V","bhū","_","_"
6,"yudhiṣṭhira","_","_","yudhiṣṭhira","NC","","_","_"
