"WordID","word","NormSTEM","suffix","lemma","PoS","Root","NormSuffix","NormWord"
1,"te","_","_","tad","PRD","","_","_"
2,"hi","_","_","hi","CX","","_","_"
3,"dyāvāpṛthivī","_","_","dyāvāpṛthivī","NC","","_","_"
4,"_","_","_","viśva","JQ","","_","_"
5,"_","_","_","śambhu","JJ","","_","_"
6,"ṛtāvarī","_","_","ṛtāvan","JJ","","_","_"
7,"rajaso","_","_","rajas","NC","","_","_"
8,"_","_","_","dhāray","KDP","","_","_"
9,"_","_","_","kavi","NC","","_","_"
1,"_","_","_","su","CAD","","_","_"
2,"_","_","_","janman","NC","","_","_"
3,"dhiṣaṇe","_","_","dhiṣaṇā","NC","","_","_"
4,"antar","_","_","antar","CAD","","_","_"
5,"īyate","_","_","e","V","i","_","_"
6,"devo","_","_","deva","NC","","_","_"
7,"devī","_","_","devī","NC","","_","_"
8,"dharmaṇā","_","_","dharman","NC","","_","_"
9,"sūryaḥ","_","_","sūrya","NC","","_","_"
10,"śuciḥ","_","_","śuci","JJ","","_","_"
1,"_","_","_","uru","JJ","","_","_"
2,"_","_","_","vyacas","NC","","_","_"
3,"mahinī","_","_","mahin","JJ","","_","_"
4,"asaścatā","_","_","asaścat","JJ","","_","_"
5,"pitā","_","_","pitṛ","NC","","_","_"
6,"mātā","_","_","mātṛ","NC","","_","_"
7,"ca","_","_","ca","CCD","","_","_"
8,"bhuvanāni","_","_","bhuvana","NC","","_","_"
9,"rakṣataḥ","_","_","rakṣ","V","rakṣ","_","_"
1,"sudhṛṣṭame","_","_","sudhṛṣṭama","JJ","","_","_"
2,"vapuṣye","_","_","vapuṣya","JJ","","_","_"
3,"na","_","_","na","CNG","","_","_"
4,"rodasī","_","_","rodasī","NC","","_","_"
5,"pitā","_","_","pitṛ","NC","","_","_"
6,"yat","_","_","yat","CSB","","_","_"
7,"sīm","_","_","sīm","CX","","_","_"
8,"abhi","_","_","abhi","CADP","","_","_"
9,"rūpair","_","_","rūpa","NC","","_","_"
10,"avāsayat","_","_","vāsay","V","vāsay","_","_"
1,"sa","_","_","tad","PRD","","_","_"
2,"vahniḥ","_","_","vahni","NC","","_","_"
3,"putraḥ","_","_","putra","NC","","_","_"
4,"pitroḥ","_","_","pitṛ","NC","","_","_"
5,"pavitravān","_","_","pavitravat","JJ","","_","_"
6,"punāti","_","_","pū","V","pū","_","_"
7,"dhīro","_","_","dhīra","JJ","","_","_"
8,"bhuvanāni","_","_","bhuvana","NC","","_","_"
9,"māyayā","_","_","māyā","NC","","_","_"
1,"dhenuṃ","_","_","dhenu","NC","","_","_"
2,"ca","_","_","ca","CCD","","_","_"
3,"pṛśniṃ","_","_","pṛśni","JJ","","_","_"
4,"vṛṣabhaṃ","_","_","vṛṣabha","NC","","_","_"
5,"_","_","_","su","CAD","","_","_"
6,"_","_","_","retas","NC","","_","_"
7,"viśvāhā","_","_","viśvāhā","CX","","_","_"
8,"śukram","_","_","śukra","NC","","_","_"
9,"payo","_","_","payas","NC","","_","_"
10,"asya","_","_","ida","PRD","","_","_"
11,"dukṣata","_","_","duh","V","duh","_","_"
1,"ayaṃ","_","_","ida","PRD","","_","_"
2,"devānām","_","_","deva","NC","","_","_"
3,"apasām","_","_","apas","JJ","","_","_"
4,"apastamo","_","_","apastama","JJ","","_","_"
5,"yo","_","_","yad","PRL","","_","_"
6,"jajāna","_","_","jan","V","jan","_","_"
7,"rodasī","_","_","rodasī","NC","","_","_"
8,"_","_","_","viśva","JQ","","_","_"
9,"_","_","_","śambhu","JJ","","_","_"
1,"vi","_","_","vi","CADP","","_","_"
2,"yo","_","_","yad","PRL","","_","_"
3,"mame","_","_","mā","V","mā","_","_"
4,"rajasī","_","_","rajas","NC","","_","_"
5,"_","_","_","sukratūyā","NC","","_","_"
6,"_","_","_","ajara","JJ","","_","_"
7,"skambhanebhiḥ","_","_","skambhana","NC","","_","_"
8,"sam","_","_","sa","CADP","","_","_"
9,"ānṛce","_","_","arc","V","arc","_","_"
1,"te","_","_","tad","PRD","","_","_"
2,"no","_","_","mat","PPR","","_","_"
3,"gṛṇāne","_","_","gṛ","KDP","","_","_"
4,"mahinī","_","_","mahin","JJ","","_","_"
5,"mahi","_","_","mahi","JJ","","_","_"
6,"śravaḥ","_","_","śravas","NC","","_","_"
7,"kṣatraṃ","_","_","kṣatra","NC","","_","_"
8,"dyāvāpṛthivī","_","_","dyāvāpṛthivī","NC","","_","_"
9,"dhāsatho","_","_","dadh","V","dhā","_","_"
10,"bṛhat","_","_","bṛhat","JJ","","_","_"
1,"_","_","_","yad","PRL","","_","_"
2,"_","_","_","abhi","CADP","","_","_"
3,"kṛṣṭīs","_","_","kṛṣṭi","NC","","_","_"
4,"tatanāma","_","_","tan","V","tan","_","_"
5,"viśvahā","_","_","viśvahā","CX","","_","_"
6,"panāyyam","_","_","panāyya","JJ","","_","_"
7,"ojo","_","_","ojas","NC","","_","_"
8,"asme","_","_","mat","PPR","","_","_"
9,"sam","_","_","sa","CADP","","_","_"
10,"invatam","_","_","inv","V","inv","_","_"
