"WordID","word","NormSTEM","suffix","lemma","PoS","Root","NormSuffix","NormWord"
1,"dhṛtarāṣṭra","_","_","dhṛtarāṣṭra","NC","","_","_"
2,"uvāca","_","_","vak","V","vac","_","_"
1,"sindhurāje","_","_","sindhurāja","NC","","_","_"
2,"hate","_","_","han","PPP","","_","_"
3,"tāta","_","_","tāta","NC","","_","_"
4,"samare","_","_","samara","NC","","_","_"
5,"savyasācinā","_","_","savyasācin","NC","","_","_"
1,"_","_","_","tathā","CX","","_","_"
2,"_","_","_","eva","CEM","","_","_"
3,"bhūriśravasi","_","_","bhūriśravas","NC","","_","_"
4,"kim","_","_","kiṃ","PRQ","","_","_"
5,"āsīd","_","_","as","V","as","_","_"
6,"vo","_","_","tvat","PPR","","_","_"
7,"_","_","_","manas","NC","","_","_"
8,"_","_","_","tadā","CAD","","_","_"
1,"duryodhanena","_","_","duryodhana","NC","","_","_"
2,"ca","_","_","ca","CCD","","_","_"
3,"_","_","_","droṇa","NC","","_","_"
4,"_","_","_","tathā","CX","","_","_"
5,"_","_","_","vac","PPP","","_","_"
6,"_","_","_","kuru","NC","","_","_"
7,"_","_","_","saṃsad","NC","","_","_"
1,"kim","_","_","kiṃ","PRQ","","_","_"
2,"uktavān","_","_","vac","KDP","","_","_"
3,"paraṃ","_","_","para","CX","","_","_"
4,"tasmāt","_","_","tasmāt","CX","","_","_"
5,"_","_","_","tad","PRD","","_","_"
6,"_","_","_","mat","PPR","","_","_"
7,"_","_","_","ācakṣ","V","ācakṣ","_","_"
8,"saṃjaya","_","_","saṃjaya","NC","","_","_"
1,"saṃjaya","_","_","saṃjaya","NC","","_","_"
2,"uvāca","_","_","vak","V","vac","_","_"
1,"niṣṭānako","_","_","niṣṭānaka","NC","","_","_"
2,"mahān","_","_","mahat","JJ","","_","_"
3,"āsīt","_","_","as","V","as","_","_"
4,"sainyānāṃ","_","_","sainya","NC","","_","_"
5,"tava","_","_","tvat","PPR","","_","_"
6,"bhārata","_","_","bhārata","NC","","_","_"
1,"saindhavaṃ","_","_","saindhava","NC","","_","_"
2,"nihataṃ","_","_","nihan","PPP","","_","_"
3,"dṛṣṭvā","_","_","dṛś","CGDA","","_","_"
4,"bhūriśravasam","_","_","bhūriśravas","NC","","_","_"
5,"eva","_","_","eva","CEM","","_","_"
6,"ca","_","_","ca","CCD","","_","_"
1,"mantritaṃ","_","_","mantrita","NC","","_","_"
2,"tava","_","_","tvat","PPR","","_","_"
3,"putrasya","_","_","putra","NC","","_","_"
4,"te","_","_","tad","PRD","","_","_"
5,"sarvam","_","_","sarva","JQ","","_","_"
6,"avamenire","_","_","avaman","V","avaman","_","_"
1,"yena","_","_","yad","PRL","","_","_"
2,"mantreṇa","_","_","mantra","NC","","_","_"
3,"nihatāḥ","_","_","nihan","PPP","","_","_"
4,"śataśaḥ","_","_","śataśas","CX","","_","_"
5,"_","_","_","kṣatriya","NC","","_","_"
6,"_","_","_","ṛṣabha","NC","","_","_"
1,"_","_","_","droṇa","NC","","_","_"
2,"_","_","_","tu","CCD","","_","_"
3,"tad","_","_","tad","PRD","","_","_"
4,"vacaḥ","_","_","vacas","NC","","_","_"
5,"śrutvā","_","_","śru","CGDA","","_","_"
6,"putrasya","_","_","putra","NC","","_","_"
7,"tava","_","_","tvat","PPR","","_","_"
8,"durmanāḥ","_","_","durmanas","JJ","","_","_"
1,"muhūrtam","_","_","muhūrta","NC","","_","_"
2,"iva","_","_","iva","CCM","","_","_"
3,"tu","_","_","tu","CCD","","_","_"
4,"dhyātvā","_","_","dhyā","CGDA","","_","_"
5,"bhṛśam","_","_","bhṛśa","CX","","_","_"
6,"ārto","_","_","ārta","JJ","","_","_"
7,"'bhyabhāṣata","_","_","abhibhāṣ","V","abhibhāṣ","_","_"
1,"duryodhana","_","_","duryodhana","NC","","_","_"
2,"kim","_","_","kim","CX","","_","_"
3,"evaṃ","_","_","eva","CX","","_","_"
4,"māṃ","_","_","mat","PPR","","_","_"
5,"_","_","_","vāc","NC","","_","_"
6,"_","_","_","śara","NC","","_","_"
7,"abhikṛntasi","_","_","abhikṛt","V","abhikṛt","_","_"
1,"ajayyaṃ","_","_","ajayya","JJ","","_","_"
2,"samare","_","_","samara","NC","","_","_"
3,"nityaṃ","_","_","nitya","CX","","_","_"
4,"bruvāṇaṃ","_","_","brū","KDP","","_","_"
5,"savyasācinam","_","_","savyasācin","NC","","_","_"
1,"_","_","_","tad","PRD","","_","_"
2,"_","_","_","eva","CEM","","_","_"
3,"_","_","_","arjuna","NC","","_","_"
4,"jñātum","_","_","jñā","CGDI","","_","_"
5,"alaṃ","_","_","ala","CX","","_","_"
6,"kaurava","_","_","kaurava","NC","","_","_"
7,"saṃyuge","_","_","saṃyuga","NC","","_","_"
1,"_","_","_","yat","CSB","","_","_"
2,"_","_","_","śikhaṇḍin","NC","","_","_"
3,"_","_","_","vadh","V","vadh","_","_"
4,"bhīṣmaṃ","_","_","bhīṣma","NC","","_","_"
5,"pālyamānaḥ","_","_","pālay","KDP","","_","_"
6,"kirīṭinā","_","_","kirīṭin","NC","","_","_"
1,"avadhyaṃ","_","_","avadhya","JJ","","_","_"
2,"nihataṃ","_","_","nihan","PPP","","_","_"
3,"dṛṣṭvā","_","_","dṛś","CGDA","","_","_"
4,"saṃyuge","_","_","saṃyuga","NC","","_","_"
5,"_","_","_","deva","NC","","_","_"
6,"_","_","_","mānuṣa","NC","","_","_"
1,"ahaṃ","_","_","mat","PPR","","_","_"
2,"_","_","_","na","CNG","","_","_"
3,"_","_","_","ida","PRD","","_","_"
4,"_","_","_","as","V","as","_","_"
5,"_","_","_","iti","CQT","","_","_"
6,"bhāratī","_","_","bhāratī","NC","","_","_"
1,"yaṃ","_","_","yad","PRL","","_","_"
2,"puṃsāṃ","_","_","puṃs","NC","","_","_"
3,"triṣu","_","_","tri","NUM","","_","_"
4,"lokeṣu","_","_","loka","NC","","_","_"
5,"_","_","_","sarva","JQ","","_","_"
6,"_","_","_","śūra","NC","","_","_"
7,"amaṃsmahi","_","_","man","V","man","_","_"
1,"tasmin","_","_","tad","PRD","","_","_"
2,"vinihate","_","_","vinihan","PPP","","_","_"
3,"śūre","_","_","śūra","NC","","_","_"
4,"kiṃ","_","_","kiṃ","PRQ","","_","_"
5,"śeṣaṃ","_","_","śeṣa","NC","","_","_"
6,"paryupāsmahe","_","_","paryupās","V","paryupās","_","_"
1,"yān","_","_","yad","PRL","","_","_"
2,"sma","_","_","sma","CX","","_","_"
3,"tān","_","_","tad","PRD","","_","_"
4,"glahate","_","_","glah","V","glah","_","_"
5,"tātaḥ","_","_","tāta","NC","","_","_"
6,"śakuniḥ","_","_","śakuni","NC","","_","_"
7,"_","_","_","kuru","NC","","_","_"
8,"_","_","_","saṃsad","NC","","_","_"
1,"_","_","_","akṣa","NC","","_","_"
2,"_","_","_","na","CNG","","_","_"
3,"te","_","_","tad","PRD","","_","_"
4,"'kṣā","_","_","akṣa","NC","","_","_"
5,"niśitā","_","_","niśā","PPP","","_","_"
6,"_","_","_","bāṇa","NC","","_","_"
7,"_","_","_","tad","PRD","","_","_"
8,"_","_","_","śatru","NC","","_","_"
9,"_","_","_","tāpana","JJ","","_","_"
1,"ta","_","_","tad","PRD","","_","_"
2,"ete","_","_","tad","PRD","","_","_"
3,"ghnanti","_","_","han","V","han","_","_"
4,"_","_","_","mat","PPR","","_","_"
5,"_","_","_","tāta","NC","","_","_"
6,"viśikhā","_","_","viśikha","NC","","_","_"
7,"_","_","_","jaya","NC","","_","_"
8,"_","_","_","coday","PPP","","_","_"
1,"_","_","_","yad","PRL","","_","_"
2,"_","_","_","tadā","CAD","","_","_"
3,"_","_","_","khyāpay","KDP","","_","_"
4,"_","_","_","tvat","PPR","","_","_"
5,"vidureṇa","_","_","vidura","NC","","_","_"
6,"na","_","_","na","CNG","","_","_"
7,"budhyase","_","_","bodh","V","budh","_","_"
1,"_","_","_","tad","PRD","","_","_"
2,"_","_","_","tad","PRD","","_","_"
3,"_","_","_","vilap","KDP","","_","_"
4,"_","_","_","ca","CCD","","_","_"
5,"_","_","_","api","CX","","_","_"
6,"vidurasya","_","_","vidura","NC","","_","_"
7,"mahātmanaḥ","_","_","mahātman","JJ","","_","_"
1,"dhīrasya","_","_","dhīra","JJ","","_","_"
2,"vāco","_","_","vāc","NC","","_","_"
3,"_","_","_","na","CNG","","_","_"
4,"_","_","_","śṛṇ","V","śru","_","_"
5,"kṣemāya","_","_","kṣema","NC","","_","_"
6,"vadataḥ","_","_","vad","KDP","","_","_"
7,"śivāḥ","_","_","śiva","JJ","","_","_"
1,"tad","_","_","tad","PRD","","_","_"
2,"idaṃ","_","_","ida","PRD","","_","_"
3,"vartate","_","_","vart","V","vṛt","_","_"
4,"ghoram","_","_","ghora","JJ","","_","_"
5,"āgataṃ","_","_","āga","PPP","","_","_"
6,"vaiśasaṃ","_","_","vaiśasa","NC","","_","_"
7,"mahat","_","_","mahat","JJ","","_","_"
1,"_","_","_","tad","PRD","","_","_"
2,"_","_","_","avamāna","NC","","_","_"
3,"vākyasya","_","_","vākya","NC","","_","_"
4,"duryodhana","_","_","duryodhana","NC","","_","_"
5,"kṛte","_","_","kṛta","NC","","_","_"
6,"tava","_","_","tvat","PPR","","_","_"
1,"_","_","_","yat","CSB","","_","_"
2,"_","_","_","ca","CCD","","_","_"
3,"naḥ","_","_","mat","PPR","","_","_"
4,"prekṣamāṇānāṃ","_","_","prekṣ","KDP","","_","_"
5,"kṛṣṇām","_","_","kṛṣṇā","NC","","_","_"
6,"ānāyayaḥ","_","_","ānāyay","V","ānāyay","_","_"
7,"sabhām","_","_","sabhā","NC","","_","_"
1,"anarhatīṃ","_","_","anarhat","JJ","","_","_"
2,"kule","_","_","kula","NC","","_","_"
3,"jātāṃ","_","_","jan","PPP","","_","_"
4,"_","_","_","sarva","JQ","","_","_"
5,"_","_","_","dharma","NC","","_","_"
6,"_","_","_","anucārin","JJ","","_","_"
1,"_","_","_","tad","PRD","","_","_"
2,"_","_","_","adharma","NC","","_","_"
3,"gāndhāre","_","_","gāndhāri","NC","","_","_"
4,"phalaṃ","_","_","phala","NC","","_","_"
5,"prāptam","_","_","prāp","PPP","","_","_"
6,"idaṃ","_","_","ida","PRD","","_","_"
7,"tvayā","_","_","tvat","PPR","","_","_"
1,"no","_","_","no","CX","","_","_"
2,"cet","_","_","ced","CX","","_","_"
3,"pāpaṃ","_","_","pāpa","NC","","_","_"
4,"pare","_","_","para","PPX","","_","_"
5,"loke","_","_","loka","NC","","_","_"
6,"tvam","_","_","tvat","PPR","","_","_"
7,"_","_","_","ṛch","V","ṛch","_","_"
8,"_","_","_","tatas","CX","","_","_"
9,"'dhikam","_","_","adhika","JJ","","_","_"
1,"_","_","_","yat","CSB","","_","_"
2,"_","_","_","ca","CCD","","_","_"
3,"tān","_","_","tad","PRD","","_","_"
4,"pāṇḍavān","_","_","pāṇḍava","NC","","_","_"
5,"dyūte","_","_","dyūta","NC","","_","_"
6,"viṣameṇa","_","_","viṣama","NC","","_","_"
7,"vijitya","_","_","viji","CGDA","","_","_"
8,"ha","_","_","ha","CEM","","_","_"
1,"_","_","_","pravrājay","V","pravrājay","_","_"
2,"_","_","_","tadā","CAD","","_","_"
3,"_","_","_","araṇya","NC","","_","_"
4,"_","_","_","raurava","JJ","","_","_"
5,"_","_","_","ajina","NC","","_","_"
6,"_","_","_","vāsas","NC","","_","_"
1,"putrāṇām","_","_","putra","NC","","_","_"
2,"iva","_","_","iva","CCM","","_","_"
3,"_","_","_","ca","CCD","","_","_"
4,"_","_","_","tad","PRD","","_","_"
5,"dharmam","_","_","dharma","NC","","_","_"
6,"ācaratāṃ","_","_","ācar","KDP","","_","_"
7,"sadā","_","_","sadā","CAD","","_","_"
1,"druhyet","_","_","druh","V","druh","_","_"
2,"ko","_","_","kiṃ","PRQ","","_","_"
3,"nu","_","_","nu","CX","","_","_"
4,"naro","_","_","nara","NC","","_","_"
5,"loke","_","_","loka","NC","","_","_"
6,"mad","_","_","mat","PPR","","_","_"
7,"anyo","_","_","anya","PPX","","_","_"
8,"_","_","_","brāhmaṇa","NC","","_","_"
9,"_","_","_","bruva","JJ","","_","_"
1,"pāṇḍavānām","_","_","pāṇḍava","NC","","_","_"
2,"ayaṃ","_","_","ida","PRD","","_","_"
3,"_","_","_","kopa","NC","","_","_"
4,"_","_","_","tvat","PPR","","_","_"
5,"śakuninā","_","_","śakuni","NC","","_","_"
6,"saha","_","_","saha","CX","","_","_"
1,"āhṛto","_","_","āhṛ","PPP","","_","_"
2,"dhṛtarāṣṭrasya","_","_","dhṛtarāṣṭra","NC","","_","_"
3,"saṃmate","_","_","samman","PPP","","_","_"
4,"_","_","_","kuru","NC","","_","_"
5,"_","_","_","saṃsad","NC","","_","_"
1,"duḥśāsanena","_","_","duḥśāsana","NC","","_","_"
2,"saṃyuktaḥ","_","_","saṃyuj","PPP","","_","_"
3,"karṇena","_","_","karṇa","NC","","_","_"
4,"parivardhitaḥ","_","_","parivardhay","PPP","","_","_"
1,"kṣattur","_","_","kṣattṛ","NC","","_","_"
2,"vākyam","_","_","vākya","NC","","_","_"
3,"anādṛtya","_","_","anādṛtya","CX","","_","_"
4,"_","_","_","tvat","PPR","","_","_"
5,"_","_","_","abhyas","PPP","","_","_"
6,"punaḥ","_","_","punar","CAD","","_","_"
7,"punaḥ","_","_","punar","CAD","","_","_"
1,"yat","_","_","yat","CSB","","_","_"
2,"tat","_","_","tad","PRD","","_","_"
3,"sarve","_","_","sarva","JQ","","_","_"
4,"parābhūya","_","_","parābhū","CGDA","","_","_"
5,"_","_","_","parivāray","V","parivāray","_","_"
6,"_","_","_","ārjuni","NC","","_","_"
1,"_","_","_","sindhu","NC","","_","_"
2,"_","_","_","rājan","NC","","_","_"
3,"āśritya","_","_","āśri","CGDA","","_","_"
4,"sa","_","_","tad","PRD","","_","_"
5,"vo","_","_","tvat","PPR","","_","_"
6,"madhye","_","_","madhya","NC","","_","_"
7,"kathaṃ","_","_","katha","CX","","_","_"
8,"hataḥ","_","_","han","PPP","","_","_"
1,"kathaṃ","_","_","katha","CX","","_","_"
2,"tvayi","_","_","tvat","PPR","","_","_"
3,"ca","_","_","ca","CCD","","_","_"
4,"karṇe","_","_","karṇa","NC","","_","_"
5,"ca","_","_","ca","CCD","","_","_"
6,"kṛpe","_","_","kṛpa","NC","","_","_"
7,"śalye","_","_","śalya","NC","","_","_"
8,"ca","_","_","ca","CCD","","_","_"
9,"jīvati","_","_","jīv","KDP","","_","_"
1,"aśvatthāmni","_","_","aśvatthāman","NC","","_","_"
2,"ca","_","_","ca","CCD","","_","_"
3,"kauravya","_","_","kauravya","NC","","_","_"
4,"nidhanaṃ","_","_","nidhana","NC","","_","_"
5,"saindhavo","_","_","saindhava","NC","","_","_"
6,"'gamat","_","_","ga","V","ga","_","_"
1,"yad","_","_","yat","CSB","","_","_"
2,"_","_","_","tvat","PPR","","_","_"
3,"_","_","_","tad","PRD","","_","_"
4,"_","_","_","sarva","JQ","","_","_"
5,"_","_","_","rājan","NC","","_","_"
6,"_","_","_","tejas","NC","","_","_"
7,"_","_","_","tigma","JJ","","_","_"
8,"upāsate","_","_","ās","V","ās","_","_"
1,"sindhurājaṃ","_","_","sindhurāja","NC","","_","_"
2,"paritrātuṃ","_","_","paritrā","CGDI","","_","_"
3,"sa","_","_","tad","PRD","","_","_"
4,"vo","_","_","tvat","PPR","","_","_"
5,"madhye","_","_","madhya","NC","","_","_"
6,"kathaṃ","_","_","katha","CX","","_","_"
7,"hataḥ","_","_","han","PPP","","_","_"
1,"_","_","_","mat","PPR","","_","_"
2,"_","_","_","eva","CEM","","_","_"
3,"hi","_","_","hi","CX","","_","_"
4,"viśeṣeṇa","_","_","viśeṣeṇa","CX","","_","_"
5,"tathā","_","_","tathā","CX","","_","_"
6,"duryodhana","_","_","duryodhana","NC","","_","_"
7,"tvayi","_","_","tvat","PPR","","_","_"
1,"āśaṃsata","_","_","āśaṃs","V","āśaṃs","_","_"
2,"paritrāṇam","_","_","paritrāṇa","NC","","_","_"
3,"arjunāt","_","_","arjuna","NC","","_","_"
4,"sa","_","_","tad","PRD","","_","_"
5,"mahīpatiḥ","_","_","mahīpati","NC","","_","_"
1,"_","_","_","tatas","CX","","_","_"
2,"_","_","_","tad","PRD","","_","_"
3,"paritrāṇam","_","_","paritrāṇa","NC","","_","_"
4,"a","_","_","alpha_privativum","JJ","","_","_"
4,"alabdhavati","_","_","labdhavat","JJ","","_","_"
5,"phalgunāt","_","_","phalguna","NC","","_","_"
1,"na","_","_","na","CNG","","_","_"
2,"kiṃcid","_","_","kiṃcit","PRI","","_","_"
3,"anupaśyāmi","_","_","anupaś","V","anupaś","_","_"
4,"_","_","_","jīvita","NC","","_","_"
5,"_","_","_","trāṇa","NC","","_","_"
6,"ātmanaḥ","_","_","ātman","NC","","_","_"
1,"majjantam","_","_","majj","KDP","","_","_"
2,"iva","_","_","iva","CCM","","_","_"
3,"_","_","_","ca","CCD","","_","_"
4,"_","_","_","ātman","NC","","_","_"
5,"dhṛṣṭadyumnasya","_","_","dhṛṣṭadyumna","NC","","_","_"
6,"kilbiṣe","_","_","kilbiṣa","NC","","_","_"
1,"_","_","_","darś","V","dṛś","_","_"
2,"a","_","_","alpha_privativum","CX","","_","_"
2,"_","_","_","hatvā","CX","","_","_"
3,"pāñcālān","_","_","pāñcāla","NC","","_","_"
4,"saha","_","_","saha","CX","","_","_"
5,"tena","_","_","tad","PRD","","_","_"
6,"śikhaṇḍinā","_","_","śikhaṇḍin","NC","","_","_"
1,"_","_","_","tad","PRD","","_","_"
2,"_","_","_","mat","PPR","","_","_"
3,"kim","_","_","kim","CX","","_","_"
4,"abhitapyantaṃ","_","_","abhitap","KDP","","_","_"
5,"_","_","_","vāc","NC","","_","_"
6,"_","_","_","śara","NC","","_","_"
7,"abhikṛntasi","_","_","abhikṛt","V","abhikṛt","_","_"
1,"aśaktaḥ","_","_","aśakta","JJ","","_","_"
2,"sindhurājasya","_","_","sindhurāja","NC","","_","_"
3,"bhūtvā","_","_","bhū","CGDA","","_","_"
4,"trāṇāya","_","_","trāṇa","NC","","_","_"
5,"bhārata","_","_","bhārata","NC","","_","_"
1,"sauvarṇaṃ","_","_","sauvarṇa","JJ","","_","_"
2,"satyasaṃdhasya","_","_","satyasaṃdha","NC","","_","_"
3,"dhvajam","_","_","dhvaja","NC","","_","_"
4,"a","_","_","alpha_privativum","JJ","","_","_"
4,"_","_","_","kliṣṭa","JJ","","_","_"
5,"_","_","_","karman","NC","","_","_"
1,"apaśyan","_","_","apaśyat","JJ","","_","_"
2,"yudhi","_","_","yudh","NC","","_","_"
3,"bhīṣmasya","_","_","bhīṣma","NC","","_","_"
4,"katham","_","_","katha","CX","","_","_"
5,"āśaṃsase","_","_","āśaṃs","V","āśaṃs","_","_"
6,"jayam","_","_","jaya","NC","","_","_"
1,"madhye","_","_","madhya","NC","","_","_"
2,"_","_","_","mahat","JJ","","_","_"
3,"_","_","_","ratha","NC","","_","_"
4,"ca","_","_","ca","CCD","","_","_"
5,"_","_","_","yatra","CX","","_","_"
6,"_","_","_","han","V","han","_","_"
7,"saindhavaḥ","_","_","saindhava","NC","","_","_"
1,"hato","_","_","han","PPP","","_","_"
2,"_","_","_","bhūriśravas","NC","","_","_"
3,"_","_","_","ca","CCD","","_","_"
4,"_","_","_","eva","CEM","","_","_"
5,"kiṃ","_","_","kiṃ","PRQ","","_","_"
6,"śeṣaṃ","_","_","śeṣa","NC","","_","_"
7,"tatra","_","_","tatra","CAD","","_","_"
8,"manyase","_","_","man","V","man","_","_"
1,"kṛpa","_","_","kṛpa","NC","","_","_"
2,"eva","_","_","eva","CEM","","_","_"
3,"ca","_","_","ca","CCD","","_","_"
4,"durdharṣo","_","_","durdharṣa","JJ","","_","_"
5,"yadi","_","_","yadi","CSB","","_","_"
6,"jīvati","_","_","jīv","V","jīv","_","_"
7,"pārthiva","_","_","pārthiva","NC","","_","_"
1,"yo","_","_","yad","PRL","","_","_"
2,"nāgāt","_","_","nāga","NC","","_","_"
3,"sindhurājasya","_","_","sindhurāja","NC","","_","_"
4,"vartma","_","_","vartman","NC","","_","_"
5,"taṃ","_","_","tad","PRD","","_","_"
6,"_","_","_","pūjay","V","pūjay","_","_"
7,"_","_","_","mat","PPR","","_","_"
1,"_","_","_","yat","CSB","","_","_"
2,"_","_","_","ca","CCD","","_","_"
3,"_","_","_","paś","V","paś","_","_"
4,"hataṃ","_","_","han","PPP","","_","_"
5,"bhīṣmaṃ","_","_","bhīṣma","NC","","_","_"
6,"_","_","_","dṛś","KDP","","_","_"
7,"_","_","_","tvat","PPR","","_","_"
8,"'nujasya","_","_","anuja","NC","","_","_"
9,"vai","_","_","vai","CX","","_","_"
1,"duḥśāsanasya","_","_","duḥśāsana","NC","","_","_"
2,"kauravya","_","_","kauravya","NC","","_","_"
3,"kurvāṇaṃ","_","_","kṛ","KDP","","_","_"
4,"karma","_","_","karman","NC","","_","_"
5,"duṣkaram","_","_","duṣkara","JJ","","_","_"
1,"_","_","_","avadhya","JJ","","_","_"
2,"_","_","_","kalpa","JJ","","_","_"
3,"saṃgrāme","_","_","saṃgrāma","NC","","_","_"
4,"devair","_","_","deva","NC","","_","_"
5,"api","_","_","api","CX","","_","_"
6,"_","_","_","sa_saha","CX","","_","_"
7,"_","_","_","vāsava","NC","","_","_"
1,"na","_","_","na","CNG","","_","_"
2,"te","_","_","tvat","PPR","","_","_"
3,"_","_","_","vasuṃdharā","NC","","_","_"
4,"_","_","_","as","V","as","_","_"
5,"_","_","_","iti","CQT","","_","_"
6,"tad","_","_","tad","PRD","","_","_"
7,"ahaṃ","_","_","mat","PPR","","_","_"
8,"cintaye","_","_","cintay","V","cintay","_","_"
9,"nṛpa","_","_","nṛpa","NC","","_","_"
1,"imāni","_","_","ida","PRD","","_","_"
2,"pāṇḍavānāṃ","_","_","pāṇḍava","NC","","_","_"
3,"ca","_","_","ca","CCD","","_","_"
4,"sṛñjayānāṃ","_","_","sṛñjaya","NC","","_","_"
5,"ca","_","_","ca","CCD","","_","_"
6,"bhārata","_","_","bhārata","NC","","_","_"
1,"_","_","_","anīka","NC","","_","_"
2,"_","_","_","ādru","V","ādru","_","_"
3,"māṃ","_","_","mat","PPR","","_","_"
4,"_","_","_","sahita","JJ","","_","_"
5,"_","_","_","adya","CX","","_","_"
6,"māriṣa","_","_","māriṣa","NC","","_","_"
1,"_","_","_","na","CNG","","_","_"
2,"a","_","_","alpha_privativum","CX","","_","_"
2,"_","_","_","hatvā","CX","","_","_"
3,"_","_","_","sarva","JQ","","_","_"
4,"_","_","_","pāñcāla","NC","","_","_"
5,"kavacasya","_","_","kavaca","NC","","_","_"
6,"vimokṣaṇam","_","_","vimokṣaṇa","NC","","_","_"
1,"kartāsmi","_","_","kar","V","kṛ","_","_"
2,"samare","_","_","samara","NC","","_","_"
3,"karma","_","_","karman","NC","","_","_"
4,"dhārtarāṣṭra","_","_","dhārtarāṣṭra","NC","","_","_"
5,"hitaṃ","_","_","hita","JJ","","_","_"
6,"tava","_","_","tvat","PPR","","_","_"
1,"rājan","_","_","rājan","NC","","_","_"
2,"brūyāḥ","_","_","abravīta","V","brū","_","_"
3,"sutaṃ","_","_","suta","NC","","_","_"
4,"me","_","_","mat","PPR","","_","_"
5,"tvam","_","_","tvat","PPR","","_","_"
6,"aśvatthāmānam","_","_","aśvatthāman","NC","","_","_"
7,"āhave","_","_","āhava","NC","","_","_"
1,"na","_","_","na","CNG","","_","_"
2,"somakāḥ","_","_","somaka","NC","","_","_"
3,"pramoktavyā","_","_","pramuc","KDG","","_","_"
4,"jīvitaṃ","_","_","jīvita","NC","","_","_"
5,"parirakṣatā","_","_","parirakṣ","KDP","","_","_"
1,"_","_","_","yad","PRL","","_","_"
2,"_","_","_","ca","CCD","","_","_"
3,"_","_","_","pitṛ","NC","","_","_"
4,"_","_","_","anuśās","PPP","","_","_"
5,"'si","_","_","as","V","as","_","_"
6,"tad","_","_","tad","PRD","","_","_"
7,"vacaḥ","_","_","vacas","NC","","_","_"
8,"paripālaya","_","_","paripālay","V","paripālay","_","_"
1,"ānṛśaṃsye","_","_","ānṛśaṃsya","NC","","_","_"
2,"dame","_","_","dama","NC","","_","_"
3,"satye","_","_","satya","NC","","_","_"
4,"ārjave","_","_","ārjava","NC","","_","_"
5,"ca","_","_","ca","CCD","","_","_"
6,"sthiro","_","_","sthira","JJ","","_","_"
7,"bhava","_","_","bhav","V","bhū","_","_"
1,"_","_","_","dharma","NC","","_","_"
2,"_","_","_","artha","NC","","_","_"
3,"_","_","_","kāma","NC","","_","_"
4,"_","_","_","kuśala","JJ","","_","_"
5,"_","_","_","dharma","NC","","_","_"
6,"_","_","_","artha","NC","","_","_"
7,"_","_","_","api","CX","","_","_"
8,"_","_","_","apīḍayat","JJ","","_","_"
1,"_","_","_","dharma","NC","","_","_"
2,"_","_","_","pradhāna","NC","","_","_"
3,"kāryāṇi","_","_","kārya","NC","","_","_"
4,"_","_","_","kar","V","kṛ","_","_"
5,"_","_","_","ca","CCD","","_","_"
6,"_","_","_","iti","CQT","","_","_"
7,"punaḥ","_","_","punar","CAD","","_","_"
8,"punaḥ","_","_","punar","CAD","","_","_"
1,"_","_","_","cakṣus","NC","","_","_"
2,"_","_","_","manas","NC","","_","_"
3,"saṃtoṣyā","_","_","saṃtoṣay","KDG","","_","_"
4,"viprāḥ","_","_","vipra","NC","","_","_"
5,"_","_","_","sev","KDG","","_","_"
6,"_","_","_","ca","CCD","","_","_"
7,"śaktitaḥ","_","_","śaktitas","CX","","_","_"
1,"na","_","_","na","CNG","","_","_"
2,"_","_","_","ca","CCD","","_","_"
3,"_","_","_","ida","PRD","","_","_"
4,"vipriyaṃ","_","_","vipriya","NC","","_","_"
5,"kāryaṃ","_","_","kṛ","KDG","","_","_"
6,"te","_","_","tad","PRD","","_","_"
7,"hi","_","_","hi","CX","","_","_"
8,"_","_","_","vahni","NC","","_","_"
9,"_","_","_","śikhā","NC","","_","_"
10,"_","_","_","upama","JJ","","_","_"
1,"eṣa","_","_","tad","PRD","","_","_"
2,"_","_","_","tu","CCD","","_","_"
3,"_","_","_","mat","PPR","","_","_"
4,"anīkāni","_","_","anīka","NC","","_","_"
5,"_","_","_","praviś","V","praviś","_","_"
6,"_","_","_","ari","NC","","_","_"
7,"_","_","_","sūdana","JJ","","_","_"
1,"raṇāya","_","_","raṇa","NC","","_","_"
2,"mahate","_","_","mahat","JJ","","_","_"
3,"_","_","_","rājan","NC","","_","_"
4,"_","_","_","tvat","PPR","","_","_"
5,"_","_","_","vāc","NC","","_","_"
6,"_","_","_","śalya","NC","","_","_"
7,"_","_","_","pīḍay","PPP","","_","_"
1,"tvaṃ","_","_","tvat","PPR","","_","_"
2,"ca","_","_","ca","CCD","","_","_"
3,"duryodhana","_","_","duryodhana","NC","","_","_"
4,"balaṃ","_","_","bala","NC","","_","_"
5,"yadi","_","_","yadi","CSB","","_","_"
6,"śaknoṣi","_","_","śakn","V","śak","_","_"
7,"dhāraya","_","_","dhāray","V","dhāray","_","_"
1,"_","_","_","rātri","NC","","_","_"
2,"_","_","_","api","CX","","_","_"
3,"hi","_","_","hi","CX","","_","_"
4,"yotsyante","_","_","yudh","V","yudh","_","_"
5,"saṃrabdhāḥ","_","_","saṃrabh","PPP","","_","_"
6,"_","_","_","kuru","NC","","_","_"
7,"_","_","_","sṛñjaya","NC","","_","_"
1,"evam","_","_","eva","CX","","_","_"
2,"uktvā","_","_","vac","CGDA","","_","_"
3,"tataḥ","_","_","tatas","CX","","_","_"
4,"prāyād","_","_","prayā","V","prayā","_","_"
5,"droṇaḥ","_","_","droṇa","NC","","_","_"
6,"_","_","_","pāṇḍava","NC","","_","_"
7,"_","_","_","sṛñjaya","NC","","_","_"
1,"muṣṇan","_","_","muṣ","KDP","","_","_"
2,"_","_","_","kṣatriya","NC","","_","_"
3,"_","_","_","tejas","NC","","_","_"
4,"nakṣatrāṇām","_","_","nakṣatra","NC","","_","_"
5,"_","_","_","iva","CCM","","_","_"
6,"_","_","_","aṃśumat","NC","","_","_"
