"WordID","word","NormSTEM","suffix","lemma","PoS","Root","NormSuffix","NormWord"
1,"śaṃ","_","_","śa","NC","","_","_"
2,"na","_","_","mat","PPR","","_","_"
3,"_","_","_","indra","NC","","_","_"
4,"_","_","_","agni","NC","","_","_"
5,"bhavatām","_","_","bhav","V","bhū","_","_"
6,"avobhiḥ","_","_","avas","NC","","_","_"
7,"śaṃ","_","_","śa","NC","","_","_"
8,"na","_","_","mat","PPR","","_","_"
9,"indrāvaruṇā","_","_","indrāvaruṇa","NC","","_","_"
10,"_","_","_","rā","PPP","","_","_"
11,"_","_","_","havya","NC","","_","_"
1,"śam","_","_","śa","NC","","_","_"
2,"indrāsomā","_","_","indrāsoma","NC","","_","_"
3,"suvitāya","_","_","suvita","NC","","_","_"
4,"śaṃ","_","_","śa","NC","","_","_"
5,"yoḥ","_","_","yos","NC","","_","_"
6,"śaṃ","_","_","śa","NC","","_","_"
7,"na","_","_","mat","PPR","","_","_"
8,"indrāpūṣaṇā","_","_","indrāpūṣan","NC","","_","_"
9,"vājasātau","_","_","vājasāti","NC","","_","_"
1,"śaṃ","_","_","śa","NC","","_","_"
2,"no","_","_","mat","PPR","","_","_"
3,"bhagaḥ","_","_","bhaga","NC","","_","_"
4,"śam","_","_","śa","NC","","_","_"
5,"u","_","_","u","CEM","","_","_"
6,"naḥ","_","_","mat","PPR","","_","_"
7,"śaṃso","_","_","śaṃsa","NC","","_","_"
8,"astu","_","_","as","V","as","_","_"
9,"śaṃ","_","_","śa","NC","","_","_"
10,"naḥ","_","_","mat","PPR","","_","_"
11,"purandhiḥ","_","_","puraṃdhi","NC","","_","_"
12,"śam","_","_","śa","NC","","_","_"
13,"u","_","_","u","CEM","","_","_"
14,"santu","_","_","as","V","as","_","_"
15,"rāyaḥ","_","_","rai","NC","","_","_"
1,"śaṃ","_","_","śa","NC","","_","_"
2,"naḥ","_","_","mat","PPR","","_","_"
3,"satyasya","_","_","satya","NC","","_","_"
4,"_","_","_","su","CAD","","_","_"
5,"_","_","_","yama","NC","","_","_"
6,"śaṃsaḥ","_","_","śaṃsa","NC","","_","_"
7,"śaṃ","_","_","śa","NC","","_","_"
8,"no","_","_","mat","PPR","","_","_"
9,"aryamā","_","_","aryaman","NC","","_","_"
10,"_","_","_","puru","JJ","","_","_"
11,"_","_","_","jan","PPP","","_","_"
12,"astu","_","_","as","V","as","_","_"
1,"śaṃ","_","_","śa","NC","","_","_"
2,"no","_","_","mat","PPR","","_","_"
3,"dhātā","_","_","dhātṛ","NC","","_","_"
4,"śam","_","_","śa","NC","","_","_"
5,"u","_","_","u","CEM","","_","_"
6,"dhartā","_","_","dhartṛ","NC","","_","_"
7,"no","_","_","mat","PPR","","_","_"
8,"astu","_","_","as","V","as","_","_"
9,"śaṃ","_","_","śa","NC","","_","_"
10,"na","_","_","mat","PPR","","_","_"
11,"urūcī","_","_","uruvyañc","JJ","","_","_"
12,"bhavatu","_","_","bhav","V","bhū","_","_"
13,"svadhābhiḥ","_","_","svadhā","NC","","_","_"
1,"śaṃ","_","_","śa","NC","","_","_"
2,"rodasī","_","_","rodas","NC","","_","_"
3,"bṛhatī","_","_","bṛhat","JJ","","_","_"
4,"śaṃ","_","_","śa","NC","","_","_"
5,"no","_","_","mat","PPR","","_","_"
6,"adriḥ","_","_","adri","NC","","_","_"
7,"śaṃ","_","_","śa","NC","","_","_"
8,"no","_","_","mat","PPR","","_","_"
9,"devānāṃ","_","_","deva","NC","","_","_"
10,"_","_","_","su","CAD","","_","_"
11,"_","_","_","hava","NC","","_","_"
12,"santu","_","_","as","V","as","_","_"
1,"śaṃ","_","_","śa","NC","","_","_"
2,"no","_","_","mat","PPR","","_","_"
3,"agnir","_","_","agni","NC","","_","_"
4,"_","_","_","jyotis","NC","","_","_"
5,"_","_","_","anīka","NC","","_","_"
6,"astu","_","_","as","V","as","_","_"
7,"śaṃ","_","_","śa","NC","","_","_"
8,"no","_","_","mat","PPR","","_","_"
9,"mitrāvaruṇāv","_","_","mitrāvaruṇa","NC","","_","_"
10,"aśvinā","_","_","aśvin","NC","","_","_"
11,"śam","_","_","śa","NC","","_","_"
1,"śaṃ","_","_","śa","NC","","_","_"
2,"naḥ","_","_","mat","PPR","","_","_"
3,"_","_","_","su","CAD","","_","_"
4,"_","_","_","kṛt","JJ","","_","_"
5,"sukṛtāni","_","_","sukṛta","NC","","_","_"
6,"santu","_","_","as","V","as","_","_"
7,"śaṃ","_","_","śa","NC","","_","_"
8,"na","_","_","mat","PPR","","_","_"
9,"iṣiro","_","_","iṣira","JJ","","_","_"
10,"abhi","_","_","abhi","CADP","","_","_"
11,"vātu","_","_","ve","V","ve","_","_"
12,"vātaḥ","_","_","vāta","NC","","_","_"
1,"śaṃ","_","_","śa","NC","","_","_"
2,"no","_","_","mat","PPR","","_","_"
3,"dyāvāpṛthivī","_","_","dyāvāpṛthivī","NC","","_","_"
4,"_","_","_","pūrva","PPX","","_","_"
5,"_","_","_","hūti","NC","","_","_"
6,"śam","_","_","śa","NC","","_","_"
7,"antarikṣaṃ","_","_","antarikṣa","NC","","_","_"
8,"dṛśaye","_","_","dṛś","CGDI","","_","_"
9,"no","_","_","mat","PPR","","_","_"
10,"astu","_","_","as","V","as","_","_"
1,"śaṃ","_","_","śa","NC","","_","_"
2,"na","_","_","mat","PPR","","_","_"
3,"oṣadhīr","_","_","oṣadhī","NC","","_","_"
4,"vanino","_","_","vanin","NC","","_","_"
5,"bhavantu","_","_","bhav","V","bhū","_","_"
6,"śaṃ","_","_","śa","NC","","_","_"
7,"no","_","_","mat","PPR","","_","_"
8,"rajasas","_","_","rajas","NC","","_","_"
9,"patir","_","_","pati","NC","","_","_"
10,"astu","_","_","as","V","as","_","_"
11,"jiṣṇuḥ","_","_","jiṣṇu","JJ","","_","_"
1,"śaṃ","_","_","śa","NC","","_","_"
2,"na","_","_","mat","PPR","","_","_"
3,"indro","_","_","indra","NC","","_","_"
4,"vasubhir","_","_","vasu","NC","","_","_"
5,"devo","_","_","deva","NC","","_","_"
6,"astu","_","_","as","V","as","_","_"
7,"śam","_","_","śa","NC","","_","_"
8,"ādityebhir","_","_","āditya","NC","","_","_"
9,"varuṇaḥ","_","_","varuṇa","NC","","_","_"
10,"_","_","_","su","CAD","","_","_"
11,"_","_","_","śaṃsa","NC","","_","_"
1,"śaṃ","_","_","śa","NC","","_","_"
2,"no","_","_","mat","PPR","","_","_"
3,"rudro","_","_","rudra","NC","","_","_"
4,"rudrebhir","_","_","rudra","NC","","_","_"
5,"jalāṣaḥ","_","_","jalāṣa","JJ","","_","_"
6,"śaṃ","_","_","śa","NC","","_","_"
7,"nas","_","_","mat","PPR","","_","_"
8,"tvaṣṭā","_","_","tvaṣṭṛ","NC","","_","_"
9,"gnābhir","_","_","gnā","NC","","_","_"
10,"iha","_","_","iha","CAD","","_","_"
11,"śṛṇotu","_","_","śṛṇ","V","śru","_","_"
1,"śaṃ","_","_","śa","NC","","_","_"
2,"naḥ","_","_","mat","PPR","","_","_"
3,"somo","_","_","soma","NC","","_","_"
4,"bhavatu","_","_","bhav","V","bhū","_","_"
5,"brahma","_","_","brahman","NC","","_","_"
6,"śaṃ","_","_","śa","NC","","_","_"
7,"naḥ","_","_","mat","PPR","","_","_"
8,"śaṃ","_","_","śa","NC","","_","_"
9,"no","_","_","mat","PPR","","_","_"
10,"grāvāṇaḥ","_","_","grāvan","NC","","_","_"
11,"śam","_","_","śa","NC","","_","_"
12,"u","_","_","u","CEM","","_","_"
13,"santu","_","_","as","V","as","_","_"
14,"yajñāḥ","_","_","yajña","NC","","_","_"
1,"śaṃ","_","_","śa","NC","","_","_"
2,"naḥ","_","_","mat","PPR","","_","_"
3,"svarūṇām","_","_","svaru","NC","","_","_"
4,"mitayo","_","_","miti","NC","","_","_"
5,"bhavantu","_","_","bhav","V","bhū","_","_"
6,"śaṃ","_","_","śa","NC","","_","_"
7,"naḥ","_","_","mat","PPR","","_","_"
8,"prasvaḥ","_","_","prasū","NC","","_","_"
9,"śam","_","_","śa","NC","","_","_"
10,"v","_","_","u","CEM","","_","_"
11,"astu","_","_","as","V","as","_","_"
12,"vediḥ","_","_","vedi","NC","","_","_"
1,"śaṃ","_","_","śa","NC","","_","_"
2,"naḥ","_","_","mat","PPR","","_","_"
3,"sūrya","_","_","sūrya","NC","","_","_"
4,"_","_","_","uru","JJ","","_","_"
5,"_","_","_","cakṣas","NC","","_","_"
6,"ud","_","_","ud","CADP","","_","_"
7,"etu","_","_","e","V","i","_","_"
8,"śaṃ","_","_","śa","NC","","_","_"
9,"naś","_","_","mat","PPR","","_","_"
10,"catasraḥ","_","_","catur","NUM","","_","_"
11,"pradiśo","_","_","pradiś","NC","","_","_"
12,"bhavantu","_","_","bhav","V","bhū","_","_"
1,"śaṃ","_","_","śa","NC","","_","_"
2,"naḥ","_","_","mat","PPR","","_","_"
3,"parvatā","_","_","parvata","NC","","_","_"
4,"dhruvayo","_","_","dhruvi","JJ","","_","_"
5,"bhavantu","_","_","bhav","V","bhū","_","_"
6,"śaṃ","_","_","śa","NC","","_","_"
7,"naḥ","_","_","mat","PPR","","_","_"
8,"sindhavaḥ","_","_","sindhu","NC","","_","_"
9,"śam","_","_","śa","NC","","_","_"
10,"u","_","_","u","CEM","","_","_"
11,"santv","_","_","as","V","as","_","_"
12,"āpaḥ","_","_","ap","NC","","_","_"
1,"śaṃ","_","_","śa","NC","","_","_"
2,"no","_","_","mat","PPR","","_","_"
3,"aditir","_","_","aditi","NC","","_","_"
4,"bhavatu","_","_","bhav","V","bhū","_","_"
5,"vratebhiḥ","_","_","vrata","NC","","_","_"
6,"śaṃ","_","_","śa","NC","","_","_"
7,"no","_","_","mat","PPR","","_","_"
8,"bhavantu","_","_","bhav","V","bhū","_","_"
9,"marutaḥ","_","_","marut","NC","","_","_"
10,"_","_","_","su","CAD","","_","_"
11,"_","_","_","arka","NC","","_","_"
1,"śaṃ","_","_","śa","NC","","_","_"
2,"no","_","_","mat","PPR","","_","_"
3,"viṣṇuḥ","_","_","viṣṇu","NC","","_","_"
4,"śam","_","_","śa","NC","","_","_"
5,"u","_","_","u","CEM","","_","_"
6,"pūṣā","_","_","pūṣan","NC","","_","_"
7,"no","_","_","mat","PPR","","_","_"
8,"astu","_","_","as","V","as","_","_"
9,"śaṃ","_","_","śa","NC","","_","_"
10,"no","_","_","mat","PPR","","_","_"
11,"bhavitraṃ","_","_","bhavitra","NC","","_","_"
12,"śam","_","_","śa","NC","","_","_"
13,"v","_","_","u","CEM","","_","_"
14,"astu","_","_","as","V","as","_","_"
15,"vāyuḥ","_","_","vāyu","NC","","_","_"
1,"śaṃ","_","_","śa","NC","","_","_"
2,"no","_","_","mat","PPR","","_","_"
3,"devaḥ","_","_","deva","NC","","_","_"
4,"savitā","_","_","savitṛ","NC","","_","_"
5,"trāyamāṇaḥ","_","_","trā","KDP","","_","_"
6,"śaṃ","_","_","śa","NC","","_","_"
7,"no","_","_","mat","PPR","","_","_"
8,"_","_","_","bhav","V","bhū","_","_"
9,"_","_","_","uṣas","NC","","_","_"
10,"vibhātīḥ","_","_","vibhā","KDP","","_","_"
1,"śaṃ","_","_","śa","NC","","_","_"
2,"naḥ","_","_","mat","PPR","","_","_"
3,"parjanyo","_","_","parjanya","NC","","_","_"
4,"bhavatu","_","_","bhav","V","bhū","_","_"
5,"prajābhyaḥ","_","_","prajā","NC","","_","_"
6,"śaṃ","_","_","śa","NC","","_","_"
7,"naḥ","_","_","mat","PPR","","_","_"
8,"kṣetrasya","_","_","kṣetra","NC","","_","_"
9,"patir","_","_","pati","NC","","_","_"
10,"astu","_","_","as","V","as","_","_"
11,"śambhuḥ","_","_","śambhu","JJ","","_","_"
1,"śaṃ","_","_","śa","NC","","_","_"
2,"no","_","_","mat","PPR","","_","_"
3,"devā","_","_","deva","NC","","_","_"
4,"_","_","_","viśva","JQ","","_","_"
5,"_","_","_","deva","NC","","_","_"
6,"bhavantu","_","_","bhav","V","bhū","_","_"
7,"śaṃ","_","_","śa","NC","","_","_"
8,"sarasvatī","_","_","sarasvatī","NC","","_","_"
9,"saha","_","_","saha","CX","","_","_"
10,"dhībhir","_","_","dhī","NC","","_","_"
11,"astu","_","_","as","V","as","_","_"
1,"śam","_","_","śa","NC","","_","_"
2,"abhiṣācaḥ","_","_","abhiṣāc","JJ","","_","_"
3,"śam","_","_","śa","NC","","_","_"
4,"u","_","_","u","CEM","","_","_"
5,"rātiṣācaḥ","_","_","rātiṣāc","JJ","","_","_"
6,"śaṃ","_","_","śa","NC","","_","_"
7,"no","_","_","mat","PPR","","_","_"
8,"divyāḥ","_","_","divya","JJ","","_","_"
9,"pārthivāḥ","_","_","pārthiva","JJ","","_","_"
10,"śaṃ","_","_","śa","NC","","_","_"
11,"no","_","_","mat","PPR","","_","_"
12,"apyāḥ","_","_","apya","JJ","","_","_"
1,"śaṃ","_","_","śa","NC","","_","_"
2,"naḥ","_","_","mat","PPR","","_","_"
3,"satyasya","_","_","satya","NC","","_","_"
4,"patayo","_","_","pati","NC","","_","_"
5,"bhavantu","_","_","bhav","V","bhū","_","_"
6,"śaṃ","_","_","śa","NC","","_","_"
7,"no","_","_","mat","PPR","","_","_"
8,"arvantaḥ","_","_","arvat","NC","","_","_"
9,"śam","_","_","śa","NC","","_","_"
10,"u","_","_","u","CEM","","_","_"
11,"santu","_","_","as","V","as","_","_"
12,"gāvaḥ","_","_","go","NC","","_","_"
1,"śaṃ","_","_","śa","NC","","_","_"
2,"na","_","_","mat","PPR","","_","_"
3,"ṛbhavaḥ","_","_","ṛbhu","NC","","_","_"
4,"_","_","_","su","CAD","","_","_"
5,"_","_","_","kṛt","JJ","","_","_"
6,"_","_","_","su","CAD","","_","_"
7,"_","_","_","hasta","NC","","_","_"
8,"śaṃ","_","_","śa","NC","","_","_"
9,"no","_","_","mat","PPR","","_","_"
10,"bhavantu","_","_","bhav","V","bhū","_","_"
11,"pitaro","_","_","pitṛ","NC","","_","_"
12,"haveṣu","_","_","hava","NC","","_","_"
1,"śaṃ","_","_","śa","NC","","_","_"
2,"no","_","_","mat","PPR","","_","_"
3,"aja","_","_","aja","JJ","","_","_"
4,"_","_","_","eka","PPX","","_","_"
5,"_","_","_","pād","NC","","_","_"
6,"devo","_","_","deva","NC","","_","_"
7,"astu","_","_","as","V","as","_","_"
8,"śaṃ","_","_","śa","NC","","_","_"
9,"no","_","_","mat","PPR","","_","_"
10,"'hir","_","_","ahi","NC","","_","_"
11,"budhnyaḥ","_","_","budhnya","JJ","","_","_"
12,"śaṃ","_","_","śa","NC","","_","_"
13,"samudraḥ","_","_","samudra","NC","","_","_"
1,"śaṃ","_","_","śa","NC","","_","_"
2,"no","_","_","mat","PPR","","_","_"
3,"apāṃ","_","_","ap","NC","","_","_"
4,"napāt","_","_","napāt","NC","","_","_"
5,"perur","_","_","peru","NC","","_","_"
6,"astu","_","_","as","V","as","_","_"
7,"śaṃ","_","_","śa","NC","","_","_"
8,"naḥ","_","_","mat","PPR","","_","_"
9,"pṛśnir","_","_","pṛśni","NC","","_","_"
10,"bhavatu","_","_","bhav","V","bhū","_","_"
11,"_","_","_","deva","NC","","_","_"
12,"_","_","_","gopa","NC","","_","_"
1,"ādityā","_","_","āditya","NC","","_","_"
2,"rudrā","_","_","rudra","NC","","_","_"
3,"vasavo","_","_","vasu","NC","","_","_"
4,"_","_","_","juṣ","V","juṣ","_","_"
5,"_","_","_","ida","PRD","","_","_"
6,"brahma","_","_","brahman","NC","","_","_"
7,"kriyamāṇaṃ","_","_","kṛ","KDP","","_","_"
8,"navīyaḥ","_","_","navīyas","JJ","","_","_"
1,"śṛṇvantu","_","_","śṛṇ","V","śru","_","_"
2,"no","_","_","mat","PPR","","_","_"
3,"divyāḥ","_","_","divya","JJ","","_","_"
4,"pārthivāso","_","_","pārthiva","JJ","","_","_"
5,"_","_","_","go","NC","","_","_"
6,"_","_","_","jan","PPP","","_","_"
7,"uta","_","_","uta","CCD","","_","_"
8,"ye","_","_","yad","PRL","","_","_"
9,"yajñiyāsaḥ","_","_","yajñiya","JJ","","_","_"
1,"ye","_","_","yad","PRL","","_","_"
2,"devānāṃ","_","_","deva","NC","","_","_"
3,"yajñiyā","_","_","yajñiya","JJ","","_","_"
4,"yajñiyānām","_","_","yajñiya","JJ","","_","_"
5,"manor","_","_","manu","NC","","_","_"
6,"yajatrā","_","_","yajatra","JJ","","_","_"
7,"amṛtā","_","_","amṛta","JJ","","_","_"
8,"_","_","_","ṛta","NC","","_","_"
9,"_","_","_","jña","JJ","","_","_"
1,"te","_","_","tad","PRD","","_","_"
2,"no","_","_","mat","PPR","","_","_"
3,"rāsantām","_","_","rā","V","rā","_","_"
4,"urugāyam","_","_","urugāya","NC","","_","_"
5,"adya","_","_","adya","CX","","_","_"
6,"yūyam","_","_","tvat","PPR","","_","_"
7,"pāta","_","_","pib","V","pā","_","_"
8,"svastibhiḥ","_","_","svasti","NC","","_","_"
9,"sadā","_","_","sadā","CAD","","_","_"
10,"naḥ","_","_","mat","PPR","","_","_"
