"WordID","word","NormSTEM","suffix","lemma","PoS","Root","NormSuffix","NormWord"
1,"taṃ","_","_","tad","PRD","","_","_"
2,"vo","_","_","tvat","PPR","","_","_"
3,"dasmam","_","_","dasma","NC","","_","_"
4,"ṛtīṣahaṃ","_","_","ṛtīṣah","JJ","","_","_"
5,"vasor","_","_","vasu","JJ","","_","_"
6,"mandānam","_","_","mat","KDP","","_","_"
7,"andhasaḥ","_","_","andhas","NC","","_","_"
1,"abhi","_","_","abhi","CADP","","_","_"
2,"vatsaṃ","_","_","vatsa","NC","","_","_"
3,"na","_","_","na","CNG","","_","_"
4,"svasareṣu","_","_","svasara","NC","","_","_"
5,"dhenava","_","_","dhenu","NC","","_","_"
6,"indraṃ","_","_","indra","NC","","_","_"
7,"gīrbhir","_","_","gir","NC","","_","_"
8,"navāmahe","_","_","nū","V","nū","_","_"
1,"dyukṣaṃ","_","_","dyukṣa","JJ","","_","_"
2,"sudānuṃ","_","_","sudānu","JJ","","_","_"
3,"taviṣībhir","_","_","taviṣī","NC","","_","_"
4,"āvṛtaṃ","_","_","āvṛ","PPP","","_","_"
5,"giriṃ","_","_","giri","NC","","_","_"
6,"na","_","_","na","CNG","","_","_"
7,"_","_","_","puru","JJ","","_","_"
8,"_","_","_","bhojas","NC","","_","_"
1,"kṣumantaṃ","_","_","kṣumat","JJ","","_","_"
2,"vājaṃ","_","_","vāja","NC","","_","_"
3,"śatinaṃ","_","_","śatin","JJ","","_","_"
4,"sahasriṇam","_","_","sahasrin","JJ","","_","_"
5,"makṣū","_","_","makṣū","CX","","_","_"
6,"gomantam","_","_","gomat","JJ","","_","_"
7,"īmahe","_","_","ī","V","ī","_","_"
1,"na","_","_","na","CNG","","_","_"
2,"tvā","_","_","tvat","PPR","","_","_"
3,"bṛhanto","_","_","bṛhat","JJ","","_","_"
4,"adrayo","_","_","adri","NC","","_","_"
5,"varanta","_","_","vṛ","V","vṛ","_","_"
6,"indra","_","_","indra","NC","","_","_"
7,"vīﾱavaḥ","_","_","vīḍu","JJ","","_","_"
1,"yad","_","_","yat","CSB","","_","_"
2,"ditsasi","_","_","dad","V","dā","_","_"
3,"stuvate","_","_","stu","KDP","","_","_"
4,"māvate","_","_","māvat","JJ","","_","_"
5,"vasu","_","_","vasu","NC","","_","_"
6,"nakiṣ","_","_","nakir","CX","","_","_"
7,"ṭad","_","_","tad","PRD","","_","_"
8,"ā","_","_","ā","CADP","","_","_"
9,"mināti","_","_","mī","V","mī","_","_"
10,"te","_","_","tvat","PPR","","_","_"
1,"_","_","_","yoddhṛ","NC","","_","_"
2,"_","_","_","as","V","as","_","_"
3,"kratvā","_","_","kratu","NC","","_","_"
4,"_","_","_","śavas","NC","","_","_"
5,"_","_","_","uta","CCD","","_","_"
6,"daṃsanā","_","_","daṃsanā","NC","","_","_"
7,"viśvā","_","_","viśva","JQ","","_","_"
8,"_","_","_","jāta","NC","","_","_"
9,"_","_","_","abhi","CADP","","_","_"
10,"majmanā","_","_","majman","NC","","_","_"
1,"ā","_","_","ā","CADP","","_","_"
2,"_","_","_","tvat","PPR","","_","_"
3,"_","_","_","ida","PRD","","_","_"
4,"arka","_","_","arka","NC","","_","_"
5,"ūtaye","_","_","ūti","NC","","_","_"
6,"vavartati","_","_","vart","V","vṛt","_","_"
7,"yaṃ","_","_","yad","PRL","","_","_"
8,"gotamā","_","_","gotama","NC","","_","_"
9,"ajījanan","_","_","jan","V","jan","_","_"
1,"pra","_","_","pra","CADP","","_","_"
2,"hi","_","_","hi","CX","","_","_"
3,"ririkṣa","_","_","ric","V","ric","_","_"
4,"ojasā","_","_","ojas","NC","","_","_"
5,"divo","_","_","div","NC","","_","_"
6,"antebhyas","_","_","anta","NC","","_","_"
7,"pari","_","_","pari","CADP","","_","_"
1,"na","_","_","na","CNG","","_","_"
2,"tvā","_","_","tvat","PPR","","_","_"
3,"vivyāca","_","_","vyac","V","vyac","_","_"
4,"raja","_","_","rajas","NC","","_","_"
5,"indra","_","_","indra","NC","","_","_"
6,"pārthivam","_","_","pārthiva","JJ","","_","_"
7,"anu","_","_","anu","CADP","","_","_"
8,"svadhāṃ","_","_","svadhā","NC","","_","_"
9,"vavakṣitha","_","_","vakṣ","V","vakṣ","_","_"
1,"nakiḥ","_","_","nakir","CX","","_","_"
2,"pariṣṭir","_","_","pariṣṭi","NC","","_","_"
3,"maghavan","_","_","maghavan","NC","","_","_"
4,"maghasya","_","_","magha","NC","","_","_"
5,"te","_","_","tvat","PPR","","_","_"
6,"yad","_","_","yat","CSB","","_","_"
7,"dāśuṣe","_","_","dāś","KDP","","_","_"
8,"daśasyasi","_","_","daśasy","V","daśasy","_","_"
1,"asmākam","_","_","mat","PPR","","_","_"
2,"bodhy","_","_","bhav","V","bhū","_","_"
3,"ucathasya","_","_","ucatha","NC","","_","_"
4,"coditā","_","_","coditṛ","JJ","","_","_"
5,"maṃhiṣṭho","_","_","maṃhiṣṭha","JJ","","_","_"
6,"_","_","_","vāja","NC","","_","_"
7,"_","_","_","sāti","NC","","_","_"
