"WordID","word","NormSTEM","suffix","lemma","PoS","Root","NormSuffix","NormWord"
1,"aśvāvati","_","_","aśvāvat","JJ","","_","_"
2,"prathamo","_","_","prathama","JJ","","_","_"
3,"goṣu","_","_","go","NC","","_","_"
4,"gacchati","_","_","gacch","V","gam","_","_"
5,"_","_","_","su","CAD","","_","_"
6,"_","_","_","prāvī","JJ","","_","_"
7,"indra","_","_","indra","NC","","_","_"
8,"martyas","_","_","martya","NC","","_","_"
9,"_","_","_","tvat","PPR","","_","_"
10,"_","_","_","ūti","NC","","_","_"
1,"tam","_","_","tad","PRD","","_","_"
2,"it","_","_","id","CEM","","_","_"
3,"pṛṇakṣi","_","_","pṛc","V","pṛc","_","_"
4,"vasunā","_","_","vasu","NC","","_","_"
5,"bhavīyasā","_","_","bhavīyas","JJ","","_","_"
6,"sindhum","_","_","sindhu","NC","","_","_"
7,"āpo","_","_","ap","NC","","_","_"
8,"_","_","_","yathā","CCM","","_","_"
9,"_","_","_","abhitas","CX","","_","_"
10,"vicetasaḥ","_","_","vicetas","JJ","","_","_"
1,"āpo","_","_","ap","NC","","_","_"
2,"na","_","_","na","CNG","","_","_"
3,"devīr","_","_","deva","JJ","","_","_"
4,"upa","_","_","upa","CADP","","_","_"
5,"yanti","_","_","e","V","i","_","_"
6,"hotriyam","_","_","hotriya","NC","","_","_"
7,"avaḥ","_","_","avas","CX","","_","_"
8,"paśyanti","_","_","paś","V","paś","_","_"
9,"vitataṃ","_","_","vitan","PPP","","_","_"
10,"yathā","_","_","yathā","CCM","","_","_"
11,"rajaḥ","_","_","rajas","NC","","_","_"
1,"prācair","_","_","prācais","CX","","_","_"
2,"devāsaḥ","_","_","deva","NC","","_","_"
3,"pra","_","_","pra","CADP","","_","_"
4,"ṇayanti","_","_","nay","V","nī","_","_"
5,"devayum","_","_","devayu","JJ","","_","_"
6,"_","_","_","brahman","NC","","_","_"
7,"_","_","_","priya","JJ","","_","_"
8,"joṣayante","_","_","joṣay","V","joṣay","_","_"
9,"varā","_","_","vara","NC","","_","_"
10,"iva","_","_","iva","CCM","","_","_"
1,"adhi","_","_","adhi","CADP","","_","_"
2,"dvayor","_","_","dvi","NUM","","_","_"
3,"adadhā","_","_","dadh","V","dhā","_","_"
4,"ukthyaṃ","_","_","ukthya","JJ","","_","_"
5,"vaco","_","_","vacas","NC","","_","_"
6,"_","_","_","ya","PPP","","_","_"
7,"_","_","_","sruc","NC","","_","_"
8,"mithunā","_","_","mithuna","NC","","_","_"
9,"yā","_","_","yad","PRL","","_","_"
10,"saparyataḥ","_","_","sapary","V","sapary","_","_"
1,"_","_","_","a","CNG","","_","_"
2,"_","_","_","saṃyat","PPP","","_","_"
3,"vrate","_","_","vrata","NC","","_","_"
4,"te","_","_","tvat","PPR","","_","_"
5,"kṣeti","_","_","kṣi","V","kṣi","_","_"
6,"puṣyati","_","_","puṣ","V","puṣ","_","_"
7,"bhadrā","_","_","bhadra","JJ","","_","_"
8,"śaktir","_","_","śakti","NC","","_","_"
9,"yajamānāya","_","_","yaj","KDP","","_","_"
10,"sunvate","_","_","su","KDP","","_","_"
1,"ād","_","_","āt","CX","","_","_"
2,"aṅgirāḥ","_","_","aṅgiras","NC","","_","_"
3,"prathamaṃ","_","_","prathama","JJ","","_","_"
4,"dadhire","_","_","dadh","V","dhā","_","_"
5,"vaya","_","_","vayas","NC","","_","_"
6,"_","_","_","indh","PPP","","_","_"
7,"_","_","_","agni","NC","","_","_"
8,"śamyā","_","_","śamī","NC","","_","_"
9,"ye","_","_","yad","PRL","","_","_"
10,"_","_","_","su","CAD","","_","_"
11,"_","_","_","kṛtyā","NC","","_","_"
1,"sarvam","_","_","sarva","JQ","","_","_"
2,"paṇeḥ","_","_","paṇi","NC","","_","_"
3,"sam","_","_","sa","CADP","","_","_"
4,"avindanta","_","_","vid","V","vid","_","_"
5,"bhojanam","_","_","bhojana","NC","","_","_"
6,"aśvāvantaṃ","_","_","aśvāvat","JJ","","_","_"
7,"gomantam","_","_","gomat","JJ","","_","_"
8,"ā","_","_","ā","CADP","","_","_"
9,"paśuṃ","_","_","paśu","NC","","_","_"
10,"naraḥ","_","_","nṛ","NC","","_","_"
1,"yajñair","_","_","yajña","NC","","_","_"
2,"atharvā","_","_","atharvan","NC","","_","_"
3,"prathamaḥ","_","_","prathama","JJ","","_","_"
4,"pathas","_","_","pathin","NC","","_","_"
5,"tate","_","_","tan","V","tan","_","_"
6,"tataḥ","_","_","tatas","CX","","_","_"
7,"sūryo","_","_","sūrya","NC","","_","_"
8,"_","_","_","vrata","NC","","_","_"
9,"_","_","_","pā","JJ","","_","_"
10,"vena","_","_","va","JJ","","_","_"
11,"ājani","_","_","ājan","V","ājan","_","_"
1,"ā","_","_","ā","CADP","","_","_"
2,"gā","_","_","go","NC","","_","_"
3,"ājad","_","_","aj","V","aj","_","_"
4,"uśanā","_","_","uśanas","NC","","_","_"
5,"kāvyaḥ","_","_","kāvya","NC","","_","_"
6,"sacā","_","_","sacā","CX","","_","_"
7,"yamasya","_","_","yama","NC","","_","_"
8,"jātam","_","_","jāta","NC","","_","_"
9,"amṛtaṃ","_","_","amṛta","JJ","","_","_"
10,"yajāmahe","_","_","yaj","V","yaj","_","_"
1,"barhir","_","_","barhis","NC","","_","_"
2,"vā","_","_","vā","CCD","","_","_"
3,"yat","_","_","yat","CSB","","_","_"
4,"_","_","_","su","CAD","","_","_"
5,"_","_","_","apatya","NC","","_","_"
6,"vṛjyate","_","_","vṛj","V","vṛj","_","_"
7,"'rko","_","_","arka","NC","","_","_"
8,"vā","_","_","vā","CCD","","_","_"
9,"ślokam","_","_","śloka","NC","","_","_"
10,"āghoṣate","_","_","āghuṣ","V","āghuṣ","_","_"
11,"divi","_","_","div","NC","","_","_"
1,"grāvā","_","_","grāvan","NC","","_","_"
2,"yatra","_","_","yatra","CX","","_","_"
3,"vadati","_","_","vad","V","vad","_","_"
4,"kārur","_","_","kāru","NC","","_","_"
5,"ukthyas","_","_","ukthya","JJ","","_","_"
6,"_","_","_","tad","PRD","","_","_"
7,"_","_","_","id","CEM","","_","_"
8,"indro","_","_","indra","NC","","_","_"
9,"abhipitveṣu","_","_","abhipitva","NC","","_","_"
10,"raṇyati","_","_","raṇ","V","raṇ","_","_"
