"WordID","word","NormSTEM","suffix","lemma","PoS","Root","NormSuffix","NormWord"
1,"agniṃ","_","_","agni","NC","","_","_"
2,"stomena","_","_","stoma","NC","","_","_"
3,"bodhaya","_","_","bodhay","V","bodhay","_","_"
4,"samidhāno","_","_","samindh","KDP","","_","_"
5,"amartyam","_","_","amartya","JJ","","_","_"
1,"havyā","_","_","havya","NC","","_","_"
2,"deveṣu","_","_","deva","NC","","_","_"
3,"no","_","_","mat","PPR","","_","_"
4,"dadhat","_","_","dadh","V","dhā","_","_"
1,"tam","_","_","tad","PRD","","_","_"
2,"adhvareṣv","_","_","adhvara","NC","","_","_"
3,"īﾱate","_","_","īḍ","V","īḍ","_","_"
4,"devam","_","_","deva","NC","","_","_"
5,"martā","_","_","marta","NC","","_","_"
6,"amartyam","_","_","amartya","JJ","","_","_"
1,"yajiṣṭham","_","_","yajiṣṭha","JJ","","_","_"
2,"mānuṣe","_","_","mānuṣa","JJ","","_","_"
3,"jane","_","_","jana","NC","","_","_"
1,"taṃ","_","_","tad","PRD","","_","_"
2,"hi","_","_","hi","CX","","_","_"
3,"śaśvanta","_","_","śaśvat","JJ","","_","_"
4,"īﾱate","_","_","īḍ","V","īḍ","_","_"
5,"srucā","_","_","sruc","NC","","_","_"
6,"devaṃ","_","_","deva","NC","","_","_"
7,"ghṛtaścutā","_","_","ghṛtaścut","JJ","","_","_"
1,"agniṃ","_","_","agni","NC","","_","_"
2,"havyāya","_","_","havya","NC","","_","_"
3,"voﾱhave","_","_","vah","CGDI","","_","_"
1,"agnir","_","_","agni","NC","","_","_"
2,"jāto","_","_","jan","PPP","","_","_"
3,"arocata","_","_","roc","V","ruc","_","_"
4,"ghnan","_","_","han","KDP","","_","_"
5,"dasyūñ","_","_","dasyu","NC","","_","_"
6,"jyotiṣā","_","_","jyotis","NC","","_","_"
7,"tamaḥ","_","_","tamas","NC","","_","_"
1,"avindad","_","_","vid","V","vid","_","_"
2,"gā","_","_","go","NC","","_","_"
3,"apaḥ","_","_","ap","NC","","_","_"
4,"svaḥ","_","_","svar","NC","","_","_"
1,"agnim","_","_","agni","NC","","_","_"
2,"īﾱenyaṃ","_","_","īḍ","KDG","","_","_"
3,"kaviṃ","_","_","kavi","NC","","_","_"
4,"_","_","_","ghṛta","NC","","_","_"
5,"_","_","_","pṛṣṭha","NC","","_","_"
6,"saparyata","_","_","sapary","V","sapary","_","_"
1,"vetu","_","_","vye","V","vī","_","_"
2,"me","_","_","mat","PPR","","_","_"
3,"_","_","_","śṛṇ","V","śru","_","_"
4,"_","_","_","hava","NC","","_","_"
1,"agniṃ","_","_","agni","NC","","_","_"
2,"ghṛtena","_","_","ghṛta","NC","","_","_"
3,"vāvṛdhu","_","_","vṛdh","V","vṛdh","_","_"
4,"stomebhir","_","_","stoma","NC","","_","_"
5,"viśvacarṣaṇim","_","_","viśvacarṣaṇi","JJ","","_","_"
1,"_","_","_","su","CAD","","_","_"
2,"_","_","_","ādhī","NC","","_","_"
3,"vacasyubhiḥ","_","_","vacasyu","JJ","","_","_"
