"WordID","word","NormSTEM","suffix","lemma","PoS","Root","NormSuffix","NormWord"
1,"indhe","_","_","indh","V","indh","_","_"
2,"rājā","_","_","rājan","NC","","_","_"
3,"sam","_","_","sa","CADP","","_","_"
4,"aryo","_","_","arya","JJ","","_","_"
5,"namobhir","_","_","namas","NC","","_","_"
6,"yasya","_","_","yad","PRL","","_","_"
7,"pratīkam","_","_","pratīka","NC","","_","_"
8,"āhutaṃ","_","_","āhu","PPP","","_","_"
9,"ghṛtena","_","_","ghṛta","NC","","_","_"
1,"naro","_","_","nṛ","NC","","_","_"
2,"havyebhir","_","_","havya","NC","","_","_"
3,"īﾱate","_","_","īḍ","V","īḍ","_","_"
4,"sabādha","_","_","sabādh","JJ","","_","_"
5,"āgnir","_","_","agni","NC","","_","_"
6,"agra","_","_","agra","NC","","_","_"
7,"uṣasām","_","_","uṣas","NC","","_","_"
8,"aśoci","_","_","śuc","V","śuc","_","_"
1,"ayam","_","_","ida","PRD","","_","_"
2,"u","_","_","u","CEM","","_","_"
3,"ṣya","_","_","tya","PRD","","_","_"
4,"_","_","_","su","CAD","","_","_"
5,"_","_","_","mahat","JJ","","_","_"
6,"avedi","_","_","vid","V","vid","_","_"
7,"hotā","_","_","hotṛ","NC","","_","_"
8,"mandro","_","_","mandra","JJ","","_","_"
9,"manuṣo","_","_","manus","NC","","_","_"
10,"yahvo","_","_","yahva","JJ","","_","_"
11,"agniḥ","_","_","agni","NC","","_","_"
1,"vi","_","_","vi","CADP","","_","_"
2,"bhā","_","_","bhās","NC","","_","_"
3,"akaḥ","_","_","kar","V","kṛ","_","_"
4,"sasṛjānaḥ","_","_","sṛj","KDP","","_","_"
5,"pṛthivyāṃ","_","_","pṛthivī","NC","","_","_"
6,"_","_","_","kṛṣṇa","JJ","","_","_"
7,"_","_","_","pavi","NC","","_","_"
8,"oṣadhībhir","_","_","oṣadhī","NC","","_","_"
9,"vavakṣe","_","_","vakṣ","V","vakṣ","_","_"
1,"kayā","_","_","kiṃ","PRQ","","_","_"
2,"no","_","_","mat","PPR","","_","_"
3,"agne","_","_","agni","NC","","_","_"
4,"vi","_","_","vi","CADP","","_","_"
5,"vasaḥ","_","_","vas","V","vas","_","_"
6,"suvṛktiṃ","_","_","suvṛkti","NC","","_","_"
7,"kām","_","_","kiṃ","PRQ","","_","_"
8,"u","_","_","u","CEM","","_","_"
9,"svadhām","_","_","svadhā","NC","","_","_"
10,"ṛṇavaḥ","_","_","ṛch","V","ṛch","_","_"
11,"śasyamānaḥ","_","_","śaṃs","KDP","","_","_"
1,"kadā","_","_","kadā","CX","","_","_"
2,"bhavema","_","_","bhav","V","bhū","_","_"
3,"patayaḥ","_","_","pati","NC","","_","_"
4,"_","_","_","su","CAD","","_","_"
5,"_","_","_","dattra","NC","","_","_"
6,"rāyo","_","_","rai","NC","","_","_"
7,"vantāro","_","_","vantṛ","NC","","_","_"
8,"duṣṭarasya","_","_","duṣṭara","JJ","","_","_"
9,"sādhoḥ","_","_","sādhu","JJ","","_","_"
1,"pra","_","_","pra","CADP","","_","_"
2,"_","_","_","pra","CADP","","_","_"
3,"_","_","_","ida","PRD","","_","_"
4,"agnir","_","_","agni","NC","","_","_"
5,"bharatasya","_","_","bharata","NC","","_","_"
6,"śṛṇve","_","_","śṛṇ","V","śru","_","_"
7,"vi","_","_","vi","CADP","","_","_"
8,"yat","_","_","yat","CSB","","_","_"
9,"sūryo","_","_","sūrya","NC","","_","_"
10,"na","_","_","na","CNG","","_","_"
11,"rocate","_","_","roc","V","ruc","_","_"
12,"bṛhad","_","_","bṛhat","JJ","","_","_"
13,"bhāḥ","_","_","bhās","NC","","_","_"
1,"abhi","_","_","abhi","CADP","","_","_"
2,"yaḥ","_","_","yad","PRL","","_","_"
3,"pūrum","_","_","pūru","NC","","_","_"
4,"pṛtanāsu","_","_","pṛtanā","NC","","_","_"
5,"tasthau","_","_","tiṣṭh","V","sthā","_","_"
6,"dyutāno","_","_","dyut","KDP","","_","_"
7,"daivyo","_","_","daivya","JJ","","_","_"
8,"atithiḥ","_","_","atithi","NC","","_","_"
9,"śuśoca","_","_","śuc","V","śuc","_","_"
1,"asann","_","_","as","V","as","_","_"
2,"it","_","_","id","CEM","","_","_"
3,"tve","_","_","tvat","PPR","","_","_"
4,"āhavanāni","_","_","āhavana","NC","","_","_"
5,"bhūri","_","_","bhūri","JQ","","_","_"
6,"bhuvo","_","_","bhav","V","bhū","_","_"
7,"viśvebhiḥ","_","_","viśva","JQ","","_","_"
8,"sumanā","_","_","sumanas","JJ","","_","_"
9,"anīkaiḥ","_","_","anīka","NC","","_","_"
1,"stutaś","_","_","stu","PPP","","_","_"
2,"cid","_","_","cit","CEM","","_","_"
3,"agne","_","_","agni","NC","","_","_"
4,"śṛṇviṣe","_","_","śṛṇ","V","śru","_","_"
5,"gṛṇānaḥ","_","_","gṛ","KDP","","_","_"
6,"svayaṃ","_","_","svaya","CX","","_","_"
7,"vardhasva","_","_","vṛdh","V","vṛdh","_","_"
8,"tanvaṃ","_","_","tanū","NC","","_","_"
9,"_","_","_","su","CAD","","_","_"
10,"_","_","_","jan","PPP","","_","_"
1,"idaṃ","_","_","ida","PRD","","_","_"
2,"vacaḥ","_","_","vacas","NC","","_","_"
3,"_","_","_","śata","NUM","","_","_"
4,"_","_","_","sā","JJ","","_","_"
5,"saṃsahasram","_","_","saṃsahasra","JJ","","_","_"
6,"ud","_","_","ud","CADP","","_","_"
7,"agnaye","_","_","agni","NC","","_","_"
8,"janiṣīṣṭa","_","_","jan","V","jan","_","_"
9,"dvibarhāḥ","_","_","dvibarhas","JJ","","_","_"
1,"śaṃ","_","_","śa","CX","","_","_"
2,"yat","_","_","yat","CSB","","_","_"
3,"stotṛbhya","_","_","stotṛ","JJ","","_","_"
4,"āpaye","_","_","āpi","NC","","_","_"
5,"bhavāti","_","_","bhav","V","bhū","_","_"
6,"dyumad","_","_","dyumat","JJ","","_","_"
7,"_","_","_","amīva","NC","","_","_"
8,"_","_","_","cātana","JJ","","_","_"
9,"_","_","_","rakṣas","NC","","_","_"
10,"_","_","_","han","JJ","","_","_"
1,"nū","_","_","nu","CX","","_","_"
2,"tvām","_","_","tvat","PPR","","_","_"
3,"agna","_","_","agni","NC","","_","_"
4,"īmahe","_","_","ī","V","ī","_","_"
5,"vasiṣṭhā","_","_","vasiṣṭha","NC","","_","_"
6,"īśānaṃ","_","_","īś","KDP","","_","_"
7,"sūno","_","_","sūnu","NC","","_","_"
8,"sahaso","_","_","sahas","NC","","_","_"
9,"vasūnām","_","_","vasu","NC","","_","_"
1,"iṣaṃ","_","_","iṣ","NC","","_","_"
2,"stotṛbhyo","_","_","stotṛ","JJ","","_","_"
3,"maghavadbhya","_","_","maghavan","JJ","","_","_"
4,"ānaḍ","_","_","naś","V","naś","_","_"
5,"yūyam","_","_","tvat","PPR","","_","_"
6,"pāta","_","_","pib","V","pā","_","_"
7,"svastibhiḥ","_","_","svasti","NC","","_","_"
8,"sadā","_","_","sadā","CAD","","_","_"
9,"naḥ","_","_","mat","PPR","","_","_"
