"WordID","word","NormSTEM","suffix","lemma","PoS","Root","NormSuffix","NormWord"
1,"vaiśaṃpāyana","_","_","vaiśampāyana","NC","","_","_"
2,"uvāca","_","_","vak","V","vac","_","_"
1,"evam","_","_","eva","CX","","_","_"
2,"_","_","_","vac","PPP","","_","_"
3,"_","_","_","tu","CCD","","_","_"
4,"kṛṣṇena","_","_","kṛṣṇa","NC","","_","_"
5,"dharmaputro","_","_","dharmaputra","NC","","_","_"
6,"yudhiṣṭhiraḥ","_","_","yudhiṣṭhira","NC","","_","_"
1,"vyāsam","_","_","vyāsa","NC","","_","_"
2,"āmantrya","_","_","āmantray","CGDA","","_","_"
3,"medhāvī","_","_","medhāvin","JJ","","_","_"
4,"tato","_","_","tatas","CX","","_","_"
5,"vacanam","_","_","vacana","NC","","_","_"
6,"abravīt","_","_","abravīta","V","brū","_","_"
1,"yathā","_","_","yathā","CCM","","_","_"
2,"kālaṃ","_","_","kāla","NC","","_","_"
3,"bhavān","_","_","bhavat","JJ","","_","_"
4,"vetti","_","_","vid","V","vid","_","_"
5,"hayamedhasya","_","_","hayamedha","NC","","_","_"
6,"tattvataḥ","_","_","tattva","NC","","_","_"
1,"dīkṣayasva","_","_","dīkṣay","V","dīkṣay","_","_"
2,"tadā","_","_","tadā","CAD","","_","_"
3,"mā","_","_","mat","PPR","","_","_"
4,"tvaṃ","_","_","tvat","PPR","","_","_"
5,"_","_","_","tvat","PPR","","_","_"
6,"_","_","_","āyat","PPP","","_","_"
7,"hi","_","_","hi","CX","","_","_"
8,"me","_","_","mat","PPR","","_","_"
9,"kratuḥ","_","_","kratu","NC","","_","_"
1,"vyāsa","_","_","vyāsa","NC","","_","_"
2,"uvāca","_","_","vak","V","vac","_","_"
1,"ahaṃ","_","_","mat","PPR","","_","_"
2,"pailo","_","_","paila","NC","","_","_"
3,"'tha","_","_","atha","CAD","","_","_"
4,"kaunteya","_","_","kaunteya","NC","","_","_"
5,"_","_","_","yājñavalkya","NC","","_","_"
6,"_","_","_","tathā","CX","","_","_"
7,"_","_","_","eva","CEM","","_","_"
8,"ca","_","_","ca","CCD","","_","_"
1,"vidhānaṃ","_","_","vidhāna","NC","","_","_"
2,"yad","_","_","yad","PRL","","_","_"
3,"yathākālaṃ","_","_","yathākāla","CX","","_","_"
4,"tat","_","_","tad","PRD","","_","_"
5,"kartāro","_","_","kar","V","kṛ","_","_"
6,"na","_","_","na","CNG","","_","_"
7,"saṃśayaḥ","_","_","saṃśaya","NC","","_","_"
1,"caitryāṃ","_","_","caitrī","NC","","_","_"
2,"hi","_","_","hi","CX","","_","_"
3,"paurṇamāsyāṃ","_","_","paurṇamāsī","NC","","_","_"
4,"ca","_","_","ca","CCD","","_","_"
5,"tava","_","_","tvat","PPR","","_","_"
6,"dīkṣā","_","_","dīkṣā","NC","","_","_"
7,"bhaviṣyati","_","_","bhav","V","bhū","_","_"
1,"saṃbhārāḥ","_","_","sambhāra","NC","","_","_"
2,"saṃbhriyantāṃ","_","_","sambhṛ","V","sambhṛ","_","_"
3,"te","_","_","tvat","PPR","","_","_"
4,"_","_","_","yajña","NC","","_","_"
5,"_","_","_","artha","NC","","_","_"
6,"_","_","_","puruṣa","NC","","_","_"
7,"_","_","_","ṛṣabha","NC","","_","_"
1,"_","_","_","aśva","NC","","_","_"
2,"_","_","_","vidyā","NC","","_","_"
3,"_","_","_","vid","JJ","","_","_"
4,"_","_","_","ca","CCD","","_","_"
5,"_","_","_","eva","CEM","","_","_"
6,"sūtā","_","_","sūta","NC","","_","_"
7,"_","_","_","vipra","NC","","_","_"
8,"_","_","_","ca","CCD","","_","_"
9,"_","_","_","tad","PRD","","_","_"
10,"_","_","_","vid","JJ","","_","_"
1,"medhyam","_","_","medhya","JJ","","_","_"
2,"aśvaṃ","_","_","aśva","NC","","_","_"
3,"parīkṣantāṃ","_","_","parīkṣ","V","parīkṣ","_","_"
4,"tava","_","_","tvat","PPR","","_","_"
5,"_","_","_","yajña","NC","","_","_"
6,"_","_","_","artha","NC","","_","_"
7,"_","_","_","siddhi","NC","","_","_"
1,"tam","_","_","tad","PRD","","_","_"
2,"utsṛjya","_","_","utsṛj","CGDA","","_","_"
3,"yathāśāstraṃ","_","_","yathāśāstra","CX","","_","_"
4,"pṛthivīṃ","_","_","pṛthivī","NC","","_","_"
5,"sāgarāmbarām","_","_","sāgarāmbarā","NC","","_","_"
1,"sa","_","_","tad","PRD","","_","_"
2,"paryetu","_","_","parye","V","parī","_","_"
3,"yaśo","_","_","yaśas","NC","","_","_"
4,"nāmnā","_","_","nāman","NC","","_","_"
5,"tava","_","_","tvat","PPR","","_","_"
6,"pārthiva","_","_","pārthiva","NC","","_","_"
7,"vardhayan","_","_","vardhay","KDP","","_","_"
1,"vaiśaṃpāyana","_","_","vaiśampāyana","NC","","_","_"
2,"uvāca","_","_","vak","V","vac","_","_"
1,"_","_","_","iti","CQT","","_","_"
2,"_","_","_","vac","PPP","","_","_"
3,"sa","_","_","tad","PRD","","_","_"
4,"_","_","_","tathā","CX","","_","_"
5,"_","_","_","iti","CQT","","_","_"
6,"_","_","_","vac","CGDA","","_","_"
7,"pāṇḍavaḥ","_","_","pāṇḍu","NC","","_","_"
8,"pṛthivīpatiḥ","_","_","pṛthivīpati","NC","","_","_"
1,"cakāra","_","_","kar","V","kṛ","_","_"
2,"sarvaṃ","_","_","sarva","JQ","","_","_"
3,"_","_","_","rājan","NC","","_","_"
4,"_","_","_","indra","NC","","_","_"
5,"yathoktaṃ","_","_","yathokta","CX","","_","_"
6,"_","_","_","brahman","NC","","_","_"
7,"_","_","_","vādin","JJ","","_","_"
1,"_","_","_","sambhāra","NC","","_","_"
2,"_","_","_","ca","CCD","","_","_"
3,"_","_","_","eva","CEM","","_","_"
4,"_","_","_","rājan","NC","","_","_"
5,"_","_","_","indra","NC","","_","_"
6,"sarve","_","_","sarva","JQ","","_","_"
7,"_","_","_","saṃkalpay","PPP","","_","_"
8,"_","_","_","bhav","V","bhū","_","_"
1,"sa","_","_","tad","PRD","","_","_"
2,"saṃbhārān","_","_","sambhāra","NC","","_","_"
3,"samāhṛtya","_","_","samāhṛ","CGDA","","_","_"
4,"nṛpo","_","_","nṛpa","NC","","_","_"
5,"_","_","_","dharmātmaja","NC","","_","_"
6,"_","_","_","tadā","CAD","","_","_"
1,"nyavedayad","_","_","nyaveda","V","niveday","_","_"
2,"_","_","_","ameya","JJ","","_","_"
3,"_","_","_","ātman","NC","","_","_"
4,"kṛṣṇadvaipāyanāya","_","_","kṛṣṇadvaipāyana","NC","","_","_"
5,"vai","_","_","vai","CX","","_","_"
1,"tato","_","_","tatas","CX","","_","_"
2,"_","_","_","abravīta","V","brū","_","_"
3,"_","_","_","mahat","JJ","","_","_"
4,"_","_","_","tejas","NC","","_","_"
5,"vyāso","_","_","vyāsa","NC","","_","_"
6,"dharmātmajaṃ","_","_","dharmātmaja","NC","","_","_"
7,"nṛpam","_","_","nṛpa","NC","","_","_"
1,"yathākālaṃ","_","_","yathākāla","CX","","_","_"
2,"yathāyogaṃ","_","_","yathāyoga","CX","","_","_"
3,"sajjāḥ","_","_","sajja","JJ","","_","_"
4,"sma","_","_","sma","CX","","_","_"
5,"tava","_","_","tvat","PPR","","_","_"
6,"dīkṣaṇe","_","_","dīkṣaṇa","NC","","_","_"
1,"_","_","_","sphya","NC","","_","_"
2,"_","_","_","ca","CCD","","_","_"
3,"_","_","_","kūrca","NC","","_","_"
4,"_","_","_","ca","CCD","","_","_"
5,"sauvarṇo","_","_","sauvarṇa","JJ","","_","_"
6,"_","_","_","yad","PRL","","_","_"
7,"_","_","_","ca","CCD","","_","_"
8,"_","_","_","anya","PPX","","_","_"
9,"api","_","_","api","CX","","_","_"
10,"kaurava","_","_","kaurava","NC","","_","_"
1,"tatra","_","_","tatra","CAD","","_","_"
2,"yogyaṃ","_","_","yogya","JJ","","_","_"
3,"bhavet","_","_","bhav","V","bhū","_","_"
4,"kiṃcit","_","_","kiṃcit","PRI","","_","_"
5,"tad","_","_","tad","PRD","","_","_"
6,"raukmaṃ","_","_","raukma","JJ","","_","_"
7,"kriyatām","_","_","kar","V","kṛ","_","_"
8,"iti","_","_","iti","CQT","","_","_"
1,"_","_","_","aśva","NC","","_","_"
2,"_","_","_","ca","CCD","","_","_"
3,"_","_","_","utsṛj","V","utsṛj","_","_"
4,"adya","_","_","adya","CX","","_","_"
5,"pṛthvyām","_","_","pṛthvī","NC","","_","_"
6,"atha","_","_","atha","CAD","","_","_"
7,"yathākramam","_","_","yathākrama","CX","","_","_"
1,"_","_","_","su","CAD","","_","_"
2,"_","_","_","gup","PPP","","_","_"
3,"_","_","_","ca","CCD","","_","_"
4,"_","_","_","car","V","car","_","_"
5,"_","_","_","tad","PRD","","_","_"
6,"yathāśāstraṃ","_","_","yathāśāstra","CX","","_","_"
7,"yudhiṣṭhira","_","_","yudhiṣṭhira","NC","","_","_"
1,"yudhiṣṭhira","_","_","yudhiṣṭhira","NC","","_","_"
2,"uvāca","_","_","vak","V","vac","_","_"
1,"ayam","_","_","ida","PRD","","_","_"
2,"aśvo","_","_","aśva","NC","","_","_"
3,"mayā","_","_","mat","PPR","","_","_"
4,"brahmann","_","_","brahman","NC","","_","_"
5,"utsṛṣṭaḥ","_","_","utsṛj","PPP","","_","_"
6,"pṛthivīm","_","_","pṛthivī","NC","","_","_"
7,"imām","_","_","ida","PRD","","_","_"
1,"cariṣyati","_","_","car","V","car","_","_"
2,"yathākāmaṃ","_","_","yathākāma","JJ","","_","_"
3,"tatra","_","_","tatra","CAD","","_","_"
4,"vai","_","_","vai","CX","","_","_"
5,"saṃvidhīyatām","_","_","saṃvidhā","V","saṃvidhā","_","_"
1,"pṛthivīṃ","_","_","pṛthivī","NC","","_","_"
2,"paryaṭantaṃ","_","_","paryaṭ","KDP","","_","_"
3,"hi","_","_","hi","CX","","_","_"
4,"turagaṃ","_","_","turaga","NC","","_","_"
5,"_","_","_","kāma","NC","","_","_"
6,"_","_","_","cārin","JJ","","_","_"
1,"kaḥ","_","_","kiṃ","PRQ","","_","_"
2,"pālayed","_","_","pib","V","pā","_","_"
3,"iti","_","_","iti","CQT","","_","_"
4,"mune","_","_","muni","NC","","_","_"
5,"tad","_","_","tad","PRD","","_","_"
6,"bhavān","_","_","bhavat","JJ","","_","_"
7,"vaktum","_","_","vac","CGDI","","_","_"
8,"arhati","_","_","arh","V","arh","_","_"
1,"vaiśaṃpāyana","_","_","vaiśampāyana","NC","","_","_"
2,"uvāca","_","_","vak","V","vac","_","_"
1,"_","_","_","iti","CQT","","_","_"
2,"_","_","_","vac","PPP","","_","_"
3,"sa","_","_","tad","PRD","","_","_"
4,"tu","_","_","tu","CCD","","_","_"
5,"_","_","_","rājan","NC","","_","_"
6,"_","_","_","indra","NC","","_","_"
7,"kṛṣṇadvaipāyano","_","_","kṛṣṇadvaipāyana","NC","","_","_"
8,"'bravīt","_","_","abravīta","V","brū","_","_"
1,"bhīmasenād","_","_","bhīmasa","NC","","_","_"
2,"avarajaḥ","_","_","avaraja","NC","","_","_"
3,"śreṣṭhaḥ","_","_","śreṣṭha","JJ","","_","_"
4,"_","_","_","sarva","JQ","","_","_"
5,"_","_","_","dhanuṣmat","JJ","","_","_"
1,"jiṣṇuḥ","_","_","jiṣṇu","NC","","_","_"
2,"sahiṣṇur","_","_","sahiṣṇu","JJ","","_","_"
3,"_","_","_","dhṛṣṇu","JJ","","_","_"
4,"_","_","_","ca","CCD","","_","_"
5,"sa","_","_","tad","PRD","","_","_"
6,"enaṃ","_","_","a","PRD","","_","_"
7,"pālayiṣyati","_","_","pib","V","pā","_","_"
1,"śaktaḥ","_","_","śak","PPP","","_","_"
2,"sa","_","_","tad","PRD","","_","_"
3,"hi","_","_","hi","CX","","_","_"
4,"mahīṃ","_","_","mahī","NC","","_","_"
5,"jetuṃ","_","_","ji","CGDI","","_","_"
6,"_","_","_","nivāta","JJ","","_","_"
7,"_","_","_","kavaca","NC","","_","_"
8,"_","_","_","antaka","JJ","","_","_"
1,"tasmin","_","_","tad","PRD","","_","_"
2,"_","_","_","hi","CX","","_","_"
3,"_","_","_","astra","NC","","_","_"
4,"divyāni","_","_","divya","JJ","","_","_"
5,"divyaṃ","_","_","divya","JJ","","_","_"
6,"saṃhananaṃ","_","_","saṃhanana","NC","","_","_"
7,"tathā","_","_","tathā","CX","","_","_"
1,"divyaṃ","_","_","divya","JJ","","_","_"
2,"_","_","_","dhanus","NC","","_","_"
3,"_","_","_","ca","CCD","","_","_"
4,"_","_","_","iṣudhi","NC","","_","_"
5,"ca","_","_","ca","CCD","","_","_"
6,"sa","_","_","tad","PRD","","_","_"
7,"enam","_","_","a","PRD","","_","_"
8,"anuyāsyati","_","_","anuyā","V","anuyā","_","_"
1,"sa","_","_","tad","PRD","","_","_"
2,"hi","_","_","hi","CX","","_","_"
3,"_","_","_","dharma","NC","","_","_"
4,"_","_","_","artha","NC","","_","_"
5,"_","_","_","kuśala","JJ","","_","_"
6,"_","_","_","sarva","JQ","","_","_"
7,"_","_","_","vidyā","NC","","_","_"
8,"_","_","_","viśārada","JJ","","_","_"
1,"yathāśāstraṃ","_","_","yathāśāstra","CX","","_","_"
2,"_","_","_","nṛpa","NC","","_","_"
3,"_","_","_","śreṣṭha","JJ","","_","_"
4,"cārayiṣyati","_","_","cāray","V","cāray","_","_"
5,"te","_","_","tvat","PPR","","_","_"
6,"hayam","_","_","haya","NC","","_","_"
1,"_","_","_","rājan","NC","","_","_"
2,"_","_","_","putra","NC","","_","_"
3,"_","_","_","mahat","JJ","","_","_"
4,"_","_","_","bāhu","NC","","_","_"
5,"śyāmo","_","_","śyāma","JJ","","_","_"
6,"_","_","_","rājīva","NC","","_","_"
7,"_","_","_","locana","NC","","_","_"
1,"abhimanyoḥ","_","_","abhimanyu","NC","","_","_"
2,"pitā","_","_","pitṛ","NC","","_","_"
3,"vīraḥ","_","_","vīra","NC","","_","_"
4,"sa","_","_","tad","PRD","","_","_"
5,"enam","_","_","a","PRD","","_","_"
6,"anuyāsyati","_","_","anuyā","V","anuyā","_","_"
1,"bhīmaseno","_","_","bhīmasa","NC","","_","_"
2,"'pi","_","_","api","CX","","_","_"
3,"tejasvī","_","_","tejasvin","JJ","","_","_"
4,"kaunteyo","_","_","kaunteya","NC","","_","_"
5,"_","_","_","amita","JJ","","_","_"
6,"_","_","_","vikrama","NC","","_","_"
1,"samartho","_","_","samartha","JJ","","_","_"
2,"rakṣituṃ","_","_","rakṣ","CGDI","","_","_"
3,"rāṣṭraṃ","_","_","rāṣṭra","NC","","_","_"
4,"_","_","_","nakula","NC","","_","_"
5,"_","_","_","ca","CCD","","_","_"
6,"viśāṃ","_","_","viś","NC","","_","_"
7,"pate","_","_","pati","NC","","_","_"
1,"_","_","_","sahadeva","NC","","_","_"
2,"_","_","_","tu","CCD","","_","_"
3,"kauravya","_","_","kauravya","NC","","_","_"
4,"samādhāsyati","_","_","samādadh","V","samādhā","_","_"
5,"buddhimān","_","_","buddhimat","JJ","","_","_"
1,"_","_","_","kuṭumba","NC","","_","_"
2,"_","_","_","tantra","NC","","_","_"
3,"vidhivat","_","_","vidhivat","CX","","_","_"
4,"sarvam","_","_","sarva","JQ","","_","_"
5,"eva","_","_","eva","CEM","","_","_"
6,"_","_","_","mahat","JJ","","_","_"
7,"_","_","_","yaśas","NC","","_","_"
1,"tat","_","_","tad","PRD","","_","_"
2,"tu","_","_","tu","CCD","","_","_"
3,"sarvaṃ","_","_","sarva","JQ","","_","_"
4,"yathānyāyam","_","_","yathānyāya","CX","","_","_"
5,"uktaṃ","_","_","vac","PPP","","_","_"
6,"_","_","_","kuru","NC","","_","_"
7,"_","_","_","kula","NC","","_","_"
8,"_","_","_","udvaha","JJ","","_","_"
1,"cakāra","_","_","kar","V","kṛ","_","_"
2,"phalgunaṃ","_","_","phalguna","NC","","_","_"
3,"_","_","_","ca","CCD","","_","_"
4,"_","_","_","api","CX","","_","_"
5,"saṃdideśa","_","_","saṃdiś","V","saṃdiś","_","_"
6,"hayaṃ","_","_","haya","NC","","_","_"
7,"prati","_","_","prati","CADP","","_","_"
1,"yudhiṣṭhira","_","_","yudhiṣṭhira","NC","","_","_"
2,"uvāca","_","_","vak","V","vac","_","_"
1,"_","_","_","e","V","e","_","_"
2,"_","_","_","arjuna","NC","","_","_"
3,"tvayā","_","_","tvat","PPR","","_","_"
4,"vīra","_","_","vīra","NC","","_","_"
5,"hayo","_","_","haya","NC","","_","_"
6,"'yaṃ","_","_","ida","PRD","","_","_"
7,"paripālyatām","_","_","paripālay","V","paripālay","_","_"
1,"tvam","_","_","tvat","PPR","","_","_"
2,"arho","_","_","arha","JJ","","_","_"
3,"rakṣituṃ","_","_","rakṣ","CGDI","","_","_"
4,"_","_","_","hi","CX","","_","_"
5,"_","_","_","a","PRD","","_","_"
6,"_","_","_","na","CNG","","_","_"
7,"_","_","_","anya","PPX","","_","_"
8,"kaścana","_","_","kaścana","PRI","","_","_"
9,"mānavaḥ","_","_","mānava","NC","","_","_"
1,"ye","_","_","yad","PRL","","_","_"
2,"_","_","_","ca","CCD","","_","_"
3,"_","_","_","api","CX","","_","_"
4,"tvāṃ","_","_","tvat","PPR","","_","_"
5,"_","_","_","mahat","JJ","","_","_"
6,"_","_","_","bāhu","NC","","_","_"
7,"pratyudīyur","_","_","pratyudi","V","pratyudi","_","_"
8,"narādhipāḥ","_","_","narādhipa","NC","","_","_"
1,"tair","_","_","tad","PRD","","_","_"
2,"vigraho","_","_","vigraha","NC","","_","_"
3,"yathā","_","_","yathā","CCM","","_","_"
4,"na","_","_","na","CNG","","_","_"
5,"syāt","_","_","as","V","as","_","_"
6,"tathā","_","_","tathā","CX","","_","_"
7,"kāryaṃ","_","_","kṛ","KDG","","_","_"
8,"_","_","_","tvat","PPR","","_","_"
9,"_","_","_","anagha","JJ","","_","_"
1,"_","_","_","ākhyā","KDG","","_","_"
2,"_","_","_","ca","CCD","","_","_"
3,"bhavatā","_","_","bhavat","JJ","","_","_"
4,"yajño","_","_","yajña","NC","","_","_"
5,"'yaṃ","_","_","ida","PRD","","_","_"
6,"mama","_","_","mat","PPR","","_","_"
7,"sarvaśaḥ","_","_","sarvaśas","CX","","_","_"
1,"pārthivebhyo","_","_","pārthiva","NC","","_","_"
2,"_","_","_","mahat","JJ","","_","_"
3,"_","_","_","bāhu","NC","","_","_"
4,"samaye","_","_","samaya","NC","","_","_"
5,"gamyatām","_","_","ga","V","ga","_","_"
6,"iti","_","_","iti","CQT","","_","_"
1,"evam","_","_","eva","CX","","_","_"
2,"uktvā","_","_","vac","CGDA","","_","_"
3,"sa","_","_","tad","PRD","","_","_"
4,"_","_","_","dharma","NC","","_","_"
5,"_","_","_","ātman","NC","","_","_"
6,"bhrātaraṃ","_","_","bhrātṛ","NC","","_","_"
7,"savyasācinam","_","_","savyasācin","NC","","_","_"
1,"bhīmaṃ","_","_","bhīma","NC","","_","_"
2,"ca","_","_","ca","CCD","","_","_"
3,"nakulaṃ","_","_","nakula","NC","","_","_"
4,"_","_","_","ca","CCD","","_","_"
5,"_","_","_","eva","CEM","","_","_"
6,"_","_","_","pura","NC","","_","_"
7,"_","_","_","gupti","NC","","_","_"
8,"samādadhat","_","_","samādadh","V","samādhā","_","_"
1,"_","_","_","kuṭumba","NC","","_","_"
2,"_","_","_","tantra","NC","","_","_"
3,"ca","_","_","ca","CCD","","_","_"
4,"tathā","_","_","tathā","CX","","_","_"
5,"sahadevaṃ","_","_","sahadeva","NC","","_","_"
6,"yudhāṃ","_","_","yudh","NC","","_","_"
7,"patim","_","_","pati","NC","","_","_"
1,"anumānya","_","_","anumānay","CGDA","","_","_"
2,"mahīpālaṃ","_","_","mahīpāla","NC","","_","_"
3,"dhṛtarāṣṭraṃ","_","_","dhṛtarāṣṭra","NC","","_","_"
4,"yudhiṣṭhiraḥ","_","_","yudhiṣṭhira","NC","","_","_"
