"WordID","word","NormSTEM","suffix","lemma","PoS","Root","NormSuffix","NormWord"
1,"dhṛtarāṣṭra","_","_","dhṛtarāṣṭra","NC","","_","_"
2,"uvāca","_","_","vak","V","vac","_","_"
1,"_","_","_","kṣatra","NC","","_","_"
2,"_","_","_","tejas","NC","","_","_"
3,"brahmacārī","_","_","brahmacārin","NC","","_","_"
4,"kaumārād","_","_","kaumāra","NC","","_","_"
5,"api","_","_","api","CX","","_","_"
6,"pāṇḍavaḥ","_","_","pāṇḍava","NC","","_","_"
1,"tena","_","_","tad","PRD","","_","_"
2,"saṃyugam","_","_","saṃyuga","NC","","_","_"
3,"eṣyanti","_","_","e","V","i","_","_"
4,"mandā","_","_","manda","JJ","","_","_"
5,"vilapato","_","_","vilap","KDP","","_","_"
6,"mama","_","_","mat","PPR","","_","_"
1,"duryodhana","_","_","duryodhana","NC","","_","_"
2,"nivartasva","_","_","nivart","V","nivṛt","_","_"
3,"yuddhād","_","_","yuddha","NC","","_","_"
4,"_","_","_","bharata","NC","","_","_"
5,"_","_","_","sattama","JJ","","_","_"
1,"na","_","_","na","CNG","","_","_"
2,"hi","_","_","hi","CX","","_","_"
3,"yuddhaṃ","_","_","yuddha","NC","","_","_"
4,"praśaṃsanti","_","_","praśaṃs","V","praśaṃs","_","_"
5,"_","_","_","sarva","JQ","","_","_"
6,"_","_","_","avasthā","NC","","_","_"
7,"ariṃdama","_","_","ariṃdama","JJ","","_","_"
1,"alam","_","_","ala","CX","","_","_"
2,"ardhaṃ","_","_","ardha","NC","","_","_"
3,"_","_","_","pṛthivī","NC","","_","_"
4,"_","_","_","tvat","PPR","","_","_"
5,"_","_","_","saha","CX","","_","_"
6,"_","_","_","amātya","NC","","_","_"
7,"jīvitum","_","_","jīv","CGDI","","_","_"
1,"prayaccha","_","_","prayaccha","V","praya","_","_"
2,"_","_","_","pāṇḍu","NC","","_","_"
3,"_","_","_","putra","NC","","_","_"
4,"yathocitam","_","_","yathocita","JJ","","_","_"
5,"ariṃdama","_","_","ariṃdama","JJ","","_","_"
1,"_","_","_","tad","PRD","","_","_"
2,"_","_","_","hi","CX","","_","_"
3,"kuravaḥ","_","_","kuru","NC","","_","_"
4,"sarve","_","_","sarva","JQ","","_","_"
5,"manyante","_","_","man","V","man","_","_"
6,"_","_","_","dharma","NC","","_","_"
7,"_","_","_","saṃdhā","PPP","","_","_"
1,"yat","_","_","yat","CSB","","_","_"
2,"tvaṃ","_","_","tvat","PPR","","_","_"
3,"praśāntim","_","_","praśānti","NC","","_","_"
4,"icchethāḥ","_","_","iṣ","V","iṣ","_","_"
5,"_","_","_","pāṇḍu","NC","","_","_"
6,"_","_","_","putra","NC","","_","_"
7,"mahātmabhiḥ","_","_","mahātman","JJ","","_","_"
1,"_","_","_","aṅga","CEM","","_","_"
2,"_","_","_","ida","PRD","","_","_"
3,"samavekṣasva","_","_","samavekṣ","V","samavekṣ","_","_"
4,"putra","_","_","putra","NC","","_","_"
5,"svām","_","_","sva","JJ","","_","_"
6,"eva","_","_","eva","CEM","","_","_"
7,"vāhinīm","_","_","vāhinī","NC","","_","_"
1,"jāta","_","_","jan","PPP","","_","_"
2,"eva","_","_","eva","CEM","","_","_"
3,"tava","_","_","tvat","PPR","","_","_"
4,"_","_","_","srāva","NC","","_","_"
5,"_","_","_","tvat","PPR","","_","_"
6,"tu","_","_","tu","CCD","","_","_"
7,"_","_","_","moha","NC","","_","_"
8,"_","_","_","na","CNG","","_","_"
9,"budhyase","_","_","bodh","V","budh","_","_"
1,"na","_","_","na","CNG","","_","_"
2,"_","_","_","hi","CX","","_","_"
3,"_","_","_","mat","PPR","","_","_"
4,"yuddham","_","_","yuddha","NC","","_","_"
5,"icchāmi","_","_","iṣ","V","iṣ","_","_"
6,"_","_","_","na","CNG","","_","_"
7,"_","_","_","tad","PRD","","_","_"
8,"icchati","_","_","iṣ","V","iṣ","_","_"
9,"bāhlikaḥ","_","_","bāhlika","NC","","_","_"
1,"na","_","_","na","CNG","","_","_"
2,"ca","_","_","ca","CCD","","_","_"
3,"bhīṣmo","_","_","bhīṣma","NC","","_","_"
4,"na","_","_","na","CNG","","_","_"
5,"ca","_","_","ca","CCD","","_","_"
6,"droṇo","_","_","droṇa","NC","","_","_"
7,"_","_","_","na","CNG","","_","_"
8,"_","_","_","aśvatthāman","NC","","_","_"
9,"na","_","_","na","CNG","","_","_"
10,"saṃjayaḥ","_","_","saṃjaya","NC","","_","_"
1,"na","_","_","na","CNG","","_","_"
2,"somadatto","_","_","somadatta","NC","","_","_"
3,"na","_","_","na","CNG","","_","_"
4,"śalyo","_","_","śalya","NC","","_","_"
5,"na","_","_","na","CNG","","_","_"
6,"kṛpo","_","_","kṛpa","NC","","_","_"
7,"yuddham","_","_","yuddha","NC","","_","_"
8,"icchati","_","_","iṣ","V","iṣ","_","_"
1,"satyavrataḥ","_","_","satyavrata","NC","","_","_"
2,"purumitro","_","_","purumitra","NC","","_","_"
3,"jayo","_","_","jaya","NC","","_","_"
4,"_","_","_","bhūriśravas","NC","","_","_"
5,"_","_","_","tathā","CX","","_","_"
1,"yeṣu","_","_","yad","PRL","","_","_"
2,"sampratitiṣṭheyuḥ","_","_","sampratiṣṭhā","V","sampratiṣṭhā","_","_"
3,"kuravaḥ","_","_","kuru","NC","","_","_"
4,"pīḍitāḥ","_","_","pīḍay","PPP","","_","_"
5,"paraiḥ","_","_","para","PPX","","_","_"
1,"te","_","_","tvat","PPR","","_","_"
2,"yuddhaṃ","_","_","yuddha","NC","","_","_"
3,"_","_","_","na","CNG","","_","_"
4,"_","_","_","abhinand","V","abhinand","_","_"
5,"tat","_","_","tad","PRD","","_","_"
6,"tubhyaṃ","_","_","tvat","PPR","","_","_"
7,"tāta","_","_","tāta","NC","","_","_"
8,"rocatām","_","_","roc","V","ruc","_","_"
1,"na","_","_","na","CNG","","_","_"
2,"tvaṃ","_","_","tvat","PPR","","_","_"
3,"karoṣi","_","_","kar","V","kṛ","_","_"
4,"kāmena","_","_","kāma","NC","","_","_"
5,"karṇaḥ","_","_","karṇa","NC","","_","_"
6,"kārayitā","_","_","kārayitṛ","JJ","","_","_"
7,"tava","_","_","tvat","PPR","","_","_"
1,"_","_","_","duḥśāsana","NC","","_","_"
2,"_","_","_","ca","CCD","","_","_"
3,"_","_","_","pāpa","JJ","","_","_"
4,"_","_","_","ātman","NC","","_","_"
5,"_","_","_","śakuni","NC","","_","_"
6,"_","_","_","ca","CCD","","_","_"
7,"_","_","_","api","CX","","_","_"
8,"saubalaḥ","_","_","saubala","NC","","_","_"
1,"duryodhana","_","_","duryodhana","NC","","_","_"
2,"uvāca","_","_","vak","V","vac","_","_"
1,"_","_","_","na","CNG","","_","_"
2,"_","_","_","mat","PPR","","_","_"
3,"bhavati","_","_","bhavat","JJ","","_","_"
4,"na","_","_","na","CNG","","_","_"
5,"droṇe","_","_","droṇa","NC","","_","_"
6,"_","_","_","na","CNG","","_","_"
7,"_","_","_","aśvatthāman","NC","","_","_"
8,"na","_","_","na","CNG","","_","_"
9,"saṃjaye","_","_","saṃjaya","NC","","_","_"
1,"na","_","_","na","CNG","","_","_"
2,"vikarṇe","_","_","vikarṇa","NC","","_","_"
3,"na","_","_","na","CNG","","_","_"
4,"kāmboje","_","_","kāmboja","NC","","_","_"
5,"na","_","_","na","CNG","","_","_"
6,"kṛpe","_","_","kṛpa","NC","","_","_"
7,"na","_","_","na","CNG","","_","_"
8,"ca","_","_","ca","CCD","","_","_"
9,"bāhlike","_","_","bāhlika","NC","","_","_"
1,"satyavrate","_","_","satyavrata","NC","","_","_"
2,"purumitre","_","_","purumitra","NC","","_","_"
3,"bhūriśravasi","_","_","bhūriśravas","NC","","_","_"
4,"vā","_","_","vā","CCD","","_","_"
5,"punaḥ","_","_","punar","CAD","","_","_"
1,"anyeṣu","_","_","anya","PPX","","_","_"
2,"vā","_","_","vā","CCD","","_","_"
3,"tāvakeṣu","_","_","tāvaka","JJ","","_","_"
4,"bhāraṃ","_","_","bhāra","NC","","_","_"
5,"kṛtvā","_","_","kṛ","CGDA","","_","_"
6,"samāhvaye","_","_","samāhvā","V","samāhvā","_","_"
1,"ahaṃ","_","_","mat","PPR","","_","_"
2,"ca","_","_","ca","CCD","","_","_"
3,"tāta","_","_","tāta","NC","","_","_"
4,"_","_","_","karṇa","NC","","_","_"
5,"_","_","_","ca","CCD","","_","_"
6,"_","_","_","raṇa","NC","","_","_"
7,"_","_","_","yajña","NC","","_","_"
8,"vitatya","_","_","vitan","CGDA","","_","_"
9,"vai","_","_","vai","CX","","_","_"
1,"yudhiṣṭhiraṃ","_","_","yudhiṣṭhira","NC","","_","_"
2,"paśuṃ","_","_","paśu","NC","","_","_"
3,"kṛtvā","_","_","kṛ","CGDA","","_","_"
4,"dīkṣitau","_","_","dīkṣ","PPP","","_","_"
5,"_","_","_","bharata","NC","","_","_"
6,"_","_","_","ṛṣabha","NC","","_","_"
1,"ratho","_","_","ratha","NC","","_","_"
2,"vedī","_","_","vedi","NC","","_","_"
3,"sruvaḥ","_","_","sruva","NC","","_","_"
4,"khaḍgo","_","_","khaḍga","NC","","_","_"
5,"gadā","_","_","gadā","NC","","_","_"
6,"sruk","_","_","sruc","NC","","_","_"
7,"kavacaṃ","_","_","kavaca","NC","","_","_"
8,"sadaḥ","_","_","sadas","NC","","_","_"
1,"cāturhotraṃ","_","_","cāturhotra","NC","","_","_"
2,"ca","_","_","ca","CCD","","_","_"
3,"dhuryā","_","_","dhurya","NC","","_","_"
4,"me","_","_","mat","PPR","","_","_"
5,"śarā","_","_","śara","NC","","_","_"
6,"darbhā","_","_","darbha","NC","","_","_"
7,"havir","_","_","havis","NC","","_","_"
8,"yaśaḥ","_","_","yaśas","NC","","_","_"
1,"_","_","_","ātman","NC","","_","_"
2,"_","_","_","yajña","NC","","_","_"
3,"nṛpate","_","_","nṛpati","NC","","_","_"
4,"iṣṭvā","_","_","yaj","CGDA","","_","_"
5,"vaivasvataṃ","_","_","vaivasvata","NC","","_","_"
6,"raṇe","_","_","raṇa","NC","","_","_"
1,"vijitya","_","_","viji","CGDA","","_","_"
2,"svayam","_","_","svaya","CX","","_","_"
3,"eṣyāvo","_","_","e","V","i","_","_"
4,"_","_","_","han","PPP","","_","_"
5,"_","_","_","amitra","NC","","_","_"
6,"śriyā","_","_","śrī","NC","","_","_"
7,"vṛtau","_","_","vṛ","PPP","","_","_"
1,"ahaṃ","_","_","mat","PPR","","_","_"
2,"ca","_","_","ca","CCD","","_","_"
3,"tāta","_","_","tāta","NC","","_","_"
4,"_","_","_","karṇa","NC","","_","_"
5,"_","_","_","ca","CCD","","_","_"
6,"bhrātā","_","_","bhrātṛ","NC","","_","_"
7,"_","_","_","duḥśāsana","NC","","_","_"
8,"_","_","_","ca","CCD","","_","_"
9,"me","_","_","mat","PPR","","_","_"
1,"ete","_","_","tad","PRD","","_","_"
2,"vayaṃ","_","_","mat","PPR","","_","_"
3,"haniṣyāmaḥ","_","_","han","V","han","_","_"
4,"pāṇḍavān","_","_","pāṇḍava","NC","","_","_"
5,"samare","_","_","samara","NC","","_","_"
6,"trayaḥ","_","_","tri","NUM","","_","_"
1,"ahaṃ","_","_","mat","PPR","","_","_"
2,"hi","_","_","hi","CX","","_","_"
3,"pāṇḍavān","_","_","pāṇḍava","NC","","_","_"
4,"hatvā","_","_","han","CGDA","","_","_"
5,"praśāstā","_","_","praśās","V","praśās","_","_"
6,"pṛthivīm","_","_","pṛthivī","NC","","_","_"
7,"imām","_","_","ida","PRD","","_","_"
1,"māṃ","_","_","mat","PPR","","_","_"
2,"vā","_","_","vā","CCD","","_","_"
3,"hatvā","_","_","han","CGDA","","_","_"
4,"_","_","_","pāṇḍu","NC","","_","_"
5,"_","_","_","putra","NC","","_","_"
6,"bhoktāraḥ","_","_","bhuj","V","bhuj","_","_"
7,"pṛthivīm","_","_","pṛthivī","NC","","_","_"
8,"imām","_","_","ida","PRD","","_","_"
1,"tyaktaṃ","_","_","tyaj","PPP","","_","_"
2,"me","_","_","mat","PPR","","_","_"
3,"jīvitaṃ","_","_","jīvita","NC","","_","_"
4,"rājan","_","_","rājan","NC","","_","_"
5,"dhanaṃ","_","_","dhana","NC","","_","_"
6,"rājyaṃ","_","_","rājya","NC","","_","_"
7,"ca","_","_","ca","CCD","","_","_"
8,"pārthiva","_","_","pārthiva","NC","","_","_"
1,"na","_","_","na","CNG","","_","_"
2,"jātu","_","_","jātu","CX","","_","_"
3,"pāṇḍavaiḥ","_","_","pāṇḍava","NC","","_","_"
4,"sārdhaṃ","_","_","sārdha","CX","","_","_"
5,"vaseyam","_","_","vas","V","vas","_","_"
6,"aham","_","_","mat","PPR","","_","_"
7,"acyuta","_","_","acyuta","JJ","","_","_"
1,"_","_","_","yāvat","CX","","_","_"
2,"_","_","_","hi","CX","","_","_"
3,"_","_","_","sūci","NC","","_","_"
4,"_","_","_","tīkṣṇa","JJ","","_","_"
5,"vidhyed","_","_","vyadh","V","vyadh","_","_"
6,"agreṇa","_","_","agra","NC","","_","_"
7,"māriṣa","_","_","māriṣa","NC","","_","_"
1,"tāvad","_","_","tāvat","CX","","_","_"
2,"_","_","_","api","CX","","_","_"
3,"a","_","_","alpha_privativum","JJ","","_","_"
3,"_","_","_","parityājya","JJ","","_","_"
4,"bhūmer","_","_","bhūmi","NC","","_","_"
5,"naḥ","_","_","mat","PPR","","_","_"
6,"pāṇḍavān","_","_","pāṇḍava","NC","","_","_"
7,"prati","_","_","prati","CADP","","_","_"
1,"dhṛtarāṣṭra","_","_","dhṛtarāṣṭra","NC","","_","_"
2,"uvāca","_","_","vak","V","vac","_","_"
1,"sarvān","_","_","sarva","JQ","","_","_"
2,"_","_","_","tvat","PPR","","_","_"
3,"_","_","_","tāta","NC","","_","_"
4,"śocāmi","_","_","śuc","V","śuc","_","_"
5,"tyakto","_","_","tyaj","PPP","","_","_"
6,"duryodhano","_","_","duryodhana","NC","","_","_"
7,"mayā","_","_","mat","PPR","","_","_"
1,"ye","_","_","yad","PRL","","_","_"
2,"mandam","_","_","manda","JJ","","_","_"
3,"anuyāsyadhvaṃ","_","_","anuyā","V","anuyā","_","_"
4,"yāntaṃ","_","_","yā","KDP","","_","_"
5,"_","_","_","vaivasvata","NC","","_","_"
6,"_","_","_","kṣaya","NC","","_","_"
1,"rurūṇām","_","_","ruru","NC","","_","_"
2,"iva","_","_","iva","CCM","","_","_"
3,"yūtheṣu","_","_","yūtha","NC","","_","_"
4,"vyāghrāḥ","_","_","vyāghra","NC","","_","_"
5,"praharatāṃ","_","_","prahṛ","KDP","","_","_"
6,"varāḥ","_","_","vara","JJ","","_","_"
1,"varān","_","_","vara","JJ","","_","_"
2,"varān","_","_","vara","JJ","","_","_"
3,"haniṣyanti","_","_","han","V","han","_","_"
4,"sametā","_","_","same","PPP","","_","_"
5,"yudhi","_","_","yudh","NC","","_","_"
6,"pāṇḍavāḥ","_","_","pāṇḍava","NC","","_","_"
1,"pratīpam","_","_","pratīpa","JJ","","_","_"
2,"iva","_","_","iva","CCM","","_","_"
3,"me","_","_","mat","PPR","","_","_"
4,"bhāti","_","_","bhā","V","bhā","_","_"
5,"yuyudhānena","_","_","yuyudhāna","NC","","_","_"
6,"bhāratī","_","_","bhāratī","NC","","_","_"
1,"vyastā","_","_","vyasta","JJ","","_","_"
2,"sīmantinī","_","_","sīmantinī","NC","","_","_"
3,"trastā","_","_","tras","PPP","","_","_"
4,"pramṛṣṭā","_","_","pramṛj","PPP","","_","_"
5,"_","_","_","dīrgha","JJ","","_","_"
6,"_","_","_","bāhu","NC","","_","_"
1,"sampūrṇaṃ","_","_","sampṛ","PPP","","_","_"
2,"pūrayan","_","_","pūray","KDP","","_","_"
3,"bhūyo","_","_","bhūyas","CX","","_","_"
4,"balaṃ","_","_","bala","NC","","_","_"
5,"pārthasya","_","_","pārtha","NC","","_","_"
6,"mādhavaḥ","_","_","mādhava","NC","","_","_"
1,"śaineyaḥ","_","_","śaineya","NC","","_","_"
2,"samare","_","_","samara","NC","","_","_"
3,"sthātā","_","_","tiṣṭh","V","sthā","_","_"
4,"_","_","_","bīja","NC","","_","_"
5,"_","_","_","vat","CX","","_","_"
6,"pravapañ","_","_","pravap","KDP","","_","_"
7,"śarān","_","_","śara","NC","","_","_"
1,"_","_","_","senā","NC","","_","_"
2,"_","_","_","mukha","NC","","_","_"
3,"prayuddhānāṃ","_","_","prayudh","PPP","","_","_"
4,"bhīmaseno","_","_","bhīmasa","NC","","_","_"
5,"bhaviṣyati","_","_","bhav","V","bhū","_","_"
1,"taṃ","_","_","tad","PRD","","_","_"
2,"sarve","_","_","sarva","JQ","","_","_"
3,"saṃśrayiṣyanti","_","_","saṃśray","V","saṃśri","_","_"
4,"prākāram","_","_","prākāra","NC","","_","_"
5,"akutobhayam","_","_","akutobhaya","JJ","","_","_"
1,"yadā","_","_","yadā","CSB","","_","_"
2,"drakṣyasi","_","_","darś","V","dṛś","_","_"
3,"bhīmena","_","_","bhīma","NC","","_","_"
4,"kuñjarān","_","_","kuñjara","NC","","_","_"
5,"vinipātitān","_","_","vinipātay","PPP","","_","_"
1,"_","_","_","viśṛ","PPP","","_","_"
2,"_","_","_","danta","NC","","_","_"
3,"_","_","_","giri","NC","","_","_"
4,"_","_","_","ābha","JJ","","_","_"
5,"_","_","_","bhid","PPP","","_","_"
6,"_","_","_","kumbha","NC","","_","_"
7,"_","_","_","sa_saha","CX","","_","_"
8,"_","_","_","śoṇita","NC","","_","_"
1,"tān","_","_","tad","PRD","","_","_"
2,"abhiprekṣya","_","_","abhiprekṣ","CGDA","","_","_"
3,"saṃgrāme","_","_","saṃgrāma","NC","","_","_"
4,"viśīrṇān","_","_","viśṛ","PPP","","_","_"
5,"iva","_","_","iva","CCM","","_","_"
6,"parvatān","_","_","parvata","NC","","_","_"
1,"bhīto","_","_","bhī","PPP","","_","_"
2,"bhīmasya","_","_","bhīma","NC","","_","_"
3,"saṃsparśāt","_","_","saṃsparśa","NC","","_","_"
4,"smartāsi","_","_","smar","V","smṛ","_","_"
5,"vacanasya","_","_","vacana","NC","","_","_"
6,"me","_","_","mat","PPR","","_","_"
1,"nirdagdhaṃ","_","_","nirdah","PPP","","_","_"
2,"bhīmasenena","_","_","bhīmasa","NC","","_","_"
3,"sainyaṃ","_","_","sainya","NC","","_","_"
4,"_","_","_","han","PPP","","_","_"
5,"_","_","_","ratha","NC","","_","_"
6,"_","_","_","dvipa","NC","","_","_"
1,"gatim","_","_","gati","NC","","_","_"
2,"agner","_","_","agni","NC","","_","_"
3,"iva","_","_","iva","CCM","","_","_"
4,"prekṣya","_","_","prekṣ","CGDA","","_","_"
5,"smartāsi","_","_","smar","V","smṛ","_","_"
6,"vacanasya","_","_","vacana","NC","","_","_"
7,"me","_","_","mat","PPR","","_","_"
1,"mahad","_","_","mahat","JJ","","_","_"
2,"vo","_","_","tvat","PPR","","_","_"
3,"bhayam","_","_","bhaya","NC","","_","_"
4,"āgāmi","_","_","āgāmin","JJ","","_","_"
5,"na","_","_","na","CNG","","_","_"
6,"_","_","_","ca","CCD","","_","_"
7,"_","_","_","iṣ","V","iṣ","_","_"
8,"_","_","_","atha","CAD","","_","_"
9,"pāṇḍavaiḥ","_","_","pāṇḍava","NC","","_","_"
1,"gadayā","_","_","gadā","NC","","_","_"
2,"bhīmasenena","_","_","bhīmasa","NC","","_","_"
3,"hatāḥ","_","_","han","PPP","","_","_"
4,"śamam","_","_","śama","NC","","_","_"
5,"upaiṣyatha","_","_","upai","V","upe","_","_"
1,"_","_","_","mahat","JJ","","_","_"
2,"_","_","_","vana","NC","","_","_"
3,"iva","_","_","iva","CCM","","_","_"
4,"chinnaṃ","_","_","chid","PPP","","_","_"
5,"yadā","_","_","yadā","CSB","","_","_"
6,"drakṣyasi","_","_","darś","V","dṛś","_","_"
7,"pātitam","_","_","pātay","PPP","","_","_"
1,"balaṃ","_","_","bala","NC","","_","_"
2,"kurūṇāṃ","_","_","kuru","NC","","_","_"
3,"saṃgrāme","_","_","saṃgrāma","NC","","_","_"
4,"tadā","_","_","tadā","CAD","","_","_"
5,"smartāsi","_","_","smar","V","smṛ","_","_"
6,"me","_","_","mat","PPR","","_","_"
7,"vacaḥ","_","_","vacas","NC","","_","_"
1,"vaiśaṃpāyana","_","_","vaiśampāyana","NC","","_","_"
2,"uvāca","_","_","vak","V","vac","_","_"
1,"etāvad","_","_","etāvat","JJ","","_","_"
2,"uktvā","_","_","vac","CGDA","","_","_"
3,"rājā","_","_","rājan","NC","","_","_"
4,"tu","_","_","tu","CCD","","_","_"
5,"sa","_","_","tad","PRD","","_","_"
6,"sarvān","_","_","sarva","JQ","","_","_"
7,"pṛthivīpatīn","_","_","pṛthivīpati","NC","","_","_"
1,"anubhāṣya","_","_","anubhāṣ","CGDA","","_","_"
2,"_","_","_","mahat","JJ","","_","_"
3,"_","_","_","rāja","NC","","_","_"
4,"punaḥ","_","_","punar","CAD","","_","_"
5,"papraccha","_","_","pṛcch","V","prach","_","_"
6,"saṃjayam","_","_","saṃjaya","NC","","_","_"
