"WordID","word","NormSTEM","suffix","lemma","PoS","Root","NormSuffix","NormWord"
1,"_","_","_","dīkṣ","KDG","","_","_"
2,"_","_","_","iṣṭi","NC","","_","_"
3,"tāyate","_","_","tan","V","tan","_","_"
4,"tām","_","_","tad","PRD","","_","_"
5,"_","_","_","eva","CEM","","_","_"
6,"_","_","_","anu","CADP","","_","_"
7,"yāḥ","_","_","yad","PRL","","_","_"
8,"_","_","_","kiṃ","PRQ","","_","_"
9,"_","_","_","ca","CCD","","_","_"
10,"_","_","_","iṣṭi","NC","","_","_"
11,"tāḥ","_","_","tad","PRD","","_","_"
12,"sarvā","_","_","sarva","JQ","","_","_"
13,"agniṣṭomam","_","_","agniṣṭoma","NC","","_","_"
14,"apiyanti","_","_","apī","V","apī","_","_"
1,"iﾱām","_","_","iḍā","NC","","_","_"
2,"upahvayata","_","_","upahvā","V","upahvā","_","_"
3,"_","_","_","iḍā","NC","","_","_"
4,"_","_","_","vidhā","NC","","_","_"
5,"vai","_","_","vai","CX","","_","_"
6,"pākayajñā","_","_","pākayajña","NC","","_","_"
7,"iﾱām","_","_","iḍā","NC","","_","_"
8,"_","_","_","eva","CEM","","_","_"
9,"_","_","_","anu","CADP","","_","_"
10,"ye","_","_","yad","PRL","","_","_"
11,"_","_","_","kiṃ","PRQ","","_","_"
12,"_","_","_","ca","CCD","","_","_"
13,"pākayajñās","_","_","pākayajña","NC","","_","_"
14,"te","_","_","tad","PRD","","_","_"
15,"sarve","_","_","sarva","JQ","","_","_"
16,"'gniṣṭomam","_","_","agniṣṭoma","NC","","_","_"
17,"apiyanti","_","_","apī","V","apī","_","_"
1,"_","_","_","sāya","CX","","_","_"
2,"_","_","_","prātar","CX","","_","_"
3,"agnihotraṃ","_","_","agnihotra","NC","","_","_"
4,"juhvati","_","_","hu","V","hu","_","_"
5,"_","_","_","sāya","CX","","_","_"
6,"_","_","_","prātar","CX","","_","_"
7,"vratam","_","_","vrata","NC","","_","_"
8,"prayacchanti","_","_","praya","V","praya","_","_"
9,"_","_","_","svāhākāra","NC","","_","_"
10,"_","_","_","agnihotra","NC","","_","_"
11,"juhvati","_","_","hu","V","hu","_","_"
12,"svāhākāreṇa","_","_","svāhākāra","NC","","_","_"
13,"vratam","_","_","vrata","NC","","_","_"
14,"prayacchanti","_","_","praya","V","praya","_","_"
15,"svāhākāram","_","_","svāhākāra","NC","","_","_"
16,"_","_","_","eva","CEM","","_","_"
17,"_","_","_","anu","CADP","","_","_"
18,"agnihotram","_","_","agnihotra","NC","","_","_"
19,"agniṣṭomam","_","_","agniṣṭoma","NC","","_","_"
20,"apyeti","_","_","apī","V","apī","_","_"
1,"pañcadaśa","_","_","pañcadaśan","JJ","","_","_"
2,"prāyaṇīye","_","_","prāyaṇīya","NC","","_","_"
3,"sāmidhenīr","_","_","sāmidhenī","NC","","_","_"
4,"anvāha","_","_","anvah","V","anvah","_","_"
5,"pañcadaśa","_","_","pañcadaśan","JJ","","_","_"
6,"_","_","_","darśa","NC","","_","_"
7,"_","_","_","pūrṇamāsa","NC","","_","_"
8,"prāyaṇīyam","_","_","prāyaṇīya","NC","","_","_"
9,"_","_","_","eva","CEM","","_","_"
10,"_","_","_","anu","CADP","","_","_"
11,"_","_","_","darśa","NC","","_","_"
12,"_","_","_","pūrṇamāsa","NC","","_","_"
13,"agniṣṭomam","_","_","agniṣṭoma","NC","","_","_"
14,"apītaḥ","_","_","apī","V","apī","_","_"
1,"somaṃ","_","_","soma","NC","","_","_"
2,"rājānaṃ","_","_","rājan","NC","","_","_"
3,"krīṇanty","_","_","krī","V","krī","_","_"
4,"auṣadho","_","_","auṣadha","JJ","","_","_"
5,"vai","_","_","vai","CX","","_","_"
6,"somo","_","_","soma","NC","","_","_"
7,"_","_","_","rājan","NC","","_","_"
8,"_","_","_","oṣadhi","NC","","_","_"
9,"tam","_","_","tad","PRD","","_","_"
10,"bhiṣajyanti","_","_","bhiṣajy","V","bhiṣajy","_","_"
11,"yam","_","_","yad","PRL","","_","_"
12,"bhiṣajyanti","_","_","bhiṣajy","V","bhiṣajy","_","_"
13,"somam","_","_","soma","NC","","_","_"
14,"eva","_","_","eva","CEM","","_","_"
15,"rājānaṃ","_","_","rājan","NC","","_","_"
16,"krīyamāṇam","_","_","krī","KDP","","_","_"
17,"anu","_","_","anu","CADP","","_","_"
18,"yāni","_","_","yad","PRL","","_","_"
19,"_","_","_","kiṃ","PRQ","","_","_"
20,"_","_","_","ca","CCD","","_","_"
21,"bheṣajāni","_","_","bheṣaja","NC","","_","_"
22,"tāni","_","_","tad","PRD","","_","_"
23,"sarvāṇy","_","_","sarva","JQ","","_","_"
24,"agniṣṭomam","_","_","agniṣṭoma","NC","","_","_"
25,"apiyanti","_","_","apī","V","apī","_","_"
1,"agnim","_","_","agni","NC","","_","_"
2,"ātithye","_","_","ātithya","NC","","_","_"
3,"manthanty","_","_","math","V","math","_","_"
4,"agniṃ","_","_","agni","NC","","_","_"
5,"cāturmāsyeṣv","_","_","cāturmāsya","NC","","_","_"
6,"ātithyam","_","_","ātithya","NC","","_","_"
7,"_","_","_","eva","CEM","","_","_"
8,"_","_","_","anu","CADP","","_","_"
9,"cāturmāsyāny","_","_","cāturmāsya","NC","","_","_"
10,"agniṣṭomam","_","_","agniṣṭoma","NC","","_","_"
11,"apiyanti","_","_","apī","V","apī","_","_"
1,"payasā","_","_","payas","NC","","_","_"
2,"pravargye","_","_","pravargya","NC","","_","_"
3,"caranti","_","_","car","V","car","_","_"
4,"payasā","_","_","payas","NC","","_","_"
5,"dākṣāyaṇayajñe","_","_","dākṣāyaṇayajña","NC","","_","_"
6,"pravargyam","_","_","pravargya","NC","","_","_"
7,"_","_","_","eva","CEM","","_","_"
8,"_","_","_","anu","CADP","","_","_"
9,"dākṣāyaṇayajño","_","_","dākṣāyaṇayajña","NC","","_","_"
10,"'gniṣṭomam","_","_","agniṣṭoma","NC","","_","_"
11,"apyeti","_","_","apī","V","apī","_","_"
1,"paśur","_","_","paśu","NC","","_","_"
2,"upavasathe","_","_","upavasatha","NC","","_","_"
3,"bhavati","_","_","bhav","V","bhū","_","_"
4,"tam","_","_","tad","PRD","","_","_"
5,"_","_","_","eva","CEM","","_","_"
6,"_","_","_","anu","CADP","","_","_"
7,"ye","_","_","yad","PRL","","_","_"
8,"_","_","_","kiṃ","PRQ","","_","_"
9,"_","_","_","ca","CCD","","_","_"
10,"paśubandhās","_","_","paśubandha","NC","","_","_"
11,"te","_","_","tad","PRD","","_","_"
12,"sarve","_","_","sarva","JQ","","_","_"
13,"_","_","_","agniṣṭoma","NC","","_","_"
14,"_","_","_","apī","V","apī","_","_"
1,"iﾱādadho","_","_","iḍādadha","NC","","_","_"
2,"nāma","_","_","nāma","CX","","_","_"
3,"_","_","_","yajña","NC","","_","_"
4,"_","_","_","kratu","NC","","_","_"
5,"taṃ","_","_","tad","PRD","","_","_"
6,"dadhnā","_","_","dadhi","NC","","_","_"
7,"caranti","_","_","car","V","car","_","_"
8,"dadhnā","_","_","dadhi","NC","","_","_"
9,"_","_","_","dadhi","NC","","_","_"
10,"_","_","_","gharma","NC","","_","_"
11,"_","_","_","dadhi","NC","","_","_"
12,"_","_","_","gharma","NC","","_","_"
13,"_","_","_","eva","CEM","","_","_"
14,"_","_","_","anu","CADP","","_","_"
15,"iﾱādadho","_","_","iḍādadha","NC","","_","_"
16,"'gniṣṭomam","_","_","agniṣṭoma","NC","","_","_"
17,"apyeti","_","_","apī","V","apī","_","_"
