"WordID","word","NormSTEM","suffix","lemma","PoS","Root","NormSuffix","NormWord"
1,"rātrī","_","_","rātri","NC","","_","_"
2,"vy","_","_","vi","CADP","","_","_"
3,"akhyad","_","_","khyā","V","khyā","_","_"
4,"āyatī","_","_","e","KDP","","_","_"
5,"purutrā","_","_","purutrā","CX","","_","_"
6,"devy","_","_","devī","NC","","_","_"
7,"akṣabhiḥ","_","_","akṣa","NC","","_","_"
1,"viśvā","_","_","viśva","JQ","","_","_"
2,"adhi","_","_","adhi","CADP","","_","_"
3,"śriyo","_","_","śrī","NC","","_","_"
4,"'dhita","_","_","dadh","V","dhā","_","_"
1,"_","_","_","ā","CADP","","_","_"
2,"_","_","_","uru","JJ","","_","_"
3,"aprā","_","_","prā","V","prā","_","_"
4,"amartyā","_","_","amartya","JJ","","_","_"
5,"nivato","_","_","nivat","NC","","_","_"
6,"devy","_","_","devī","NC","","_","_"
7,"udvataḥ","_","_","udvat","NC","","_","_"
1,"jyotiṣā","_","_","jyotis","NC","","_","_"
2,"bādhate","_","_","bādh","V","bādh","_","_"
3,"tamaḥ","_","_","tamas","NC","","_","_"
1,"nir","_","_","niḥ","CADP","","_","_"
2,"u","_","_","u","CEM","","_","_"
3,"svasāram","_","_","svasṛ","NC","","_","_"
4,"_","_","_","kar","V","kṛ","_","_"
5,"_","_","_","uṣas","NC","","_","_"
6,"devy","_","_","devī","NC","","_","_"
7,"āyatī","_","_","e","KDP","","_","_"
1,"_","_","_","apa","CX","","_","_"
2,"_","_","_","id","CEM","","_","_"
3,"u","_","_","u","CEM","","_","_"
4,"hāsate","_","_","jah","V","hā","_","_"
5,"tamaḥ","_","_","tamas","NC","","_","_"
1,"sā","_","_","tad","PRD","","_","_"
2,"no","_","_","mat","PPR","","_","_"
3,"adya","_","_","adya","CX","","_","_"
4,"yasyā","_","_","yad","PRL","","_","_"
5,"vayaṃ","_","_","mat","PPR","","_","_"
6,"ni","_","_","ni","CADP","","_","_"
7,"te","_","_","tvat","PPR","","_","_"
8,"yāmann","_","_","yāman","NC","","_","_"
9,"avikṣmahi","_","_","viś","V","viś","_","_"
1,"vṛkṣe","_","_","vṛkṣa","NC","","_","_"
2,"na","_","_","na","CNG","","_","_"
3,"vasatiṃ","_","_","vasati","NC","","_","_"
4,"vayaḥ","_","_","vi","NC","","_","_"
1,"ni","_","_","ni","CADP","","_","_"
2,"grāmāso","_","_","grāma","NC","","_","_"
3,"avikṣata","_","_","viś","V","viś","_","_"
4,"ni","_","_","ni","CADP","","_","_"
5,"padvanto","_","_","padvat","JJ","","_","_"
6,"ni","_","_","ni","CADP","","_","_"
7,"pakṣiṇaḥ","_","_","pakṣin","JJ","","_","_"
1,"ni","_","_","ni","CADP","","_","_"
2,"śyenāsaś","_","_","śya","NC","","_","_"
3,"cid","_","_","cit","CEM","","_","_"
4,"arthinaḥ","_","_","arthin","JJ","","_","_"
1,"yāvayā","_","_","yāvay","V","yāvay","_","_"
2,"vṛkyaṃ","_","_","vṛkī","NC","","_","_"
3,"vṛkaṃ","_","_","vṛka","NC","","_","_"
4,"yavaya","_","_","yavay","V","yavay","_","_"
5,"stenam","_","_","sta","NC","","_","_"
6,"ūrmye","_","_","ūrmyā","NC","","_","_"
1,"athā","_","_","atha","CAD","","_","_"
2,"naḥ","_","_","mat","PPR","","_","_"
3,"sutarā","_","_","sutara","JJ","","_","_"
4,"bhava","_","_","bhav","V","bhū","_","_"
1,"upa","_","_","upa","CADP","","_","_"
2,"mā","_","_","mat","PPR","","_","_"
3,"pepiśat","_","_","pepiś","KDP","","_","_"
4,"tamaḥ","_","_","tamas","NC","","_","_"
5,"kṛṣṇaṃ","_","_","kṛṣṇa","JJ","","_","_"
6,"vyaktam","_","_","vyañj","PPP","","_","_"
7,"asthita","_","_","tiṣṭh","V","sthā","_","_"
1,"uṣa","_","_","uṣas","NC","","_","_"
2,"_","_","_","ṛṇa","NC","","_","_"
3,"_","_","_","iva","CCM","","_","_"
4,"yātaya","_","_","yātay","V","yātay","_","_"
1,"upa","_","_","upa","CADP","","_","_"
2,"te","_","_","tvat","PPR","","_","_"
3,"gā","_","_","go","NC","","_","_"
4,"_","_","_","iva","CCM","","_","_"
5,"_","_","_","kar","V","kṛ","_","_"
6,"vṛṇīṣva","_","_","vṛ","V","vṛ","_","_"
7,"duhitar","_","_","duhitṛ","NC","","_","_"
8,"divaḥ","_","_","div","NC","","_","_"
1,"rātri","_","_","rātri","NC","","_","_"
2,"stomaṃ","_","_","stoma","NC","","_","_"
3,"na","_","_","na","CNG","","_","_"
4,"jigyuṣe","_","_","ji","KDP","","_","_"
