"WordID","word","NormSTEM","suffix","lemma","PoS","Root","NormSuffix","NormWord"
1,"_","_","_","śrī","NC","","_","_"
2,"_","_","_","bhagavat","NC","","_","_"
3,"uvāca","_","_","vak","V","vac","_","_"
1,"sūryācandramasau","_","_","sūryācandramas","NC","","_","_"
2,"śaśvat","_","_","śaśvat","CX","","_","_"
3,"keśair","_","_","keśa","NC","","_","_"
4,"me","_","_","mat","PPR","","_","_"
5,"_","_","_","aṃśu","NC","","_","_"
6,"_","_","_","saṃjñita","JJ","","_","_"
1,"_","_","_","bodhay","KDP","","_","_"
2,"_","_","_","tāpay","KDP","","_","_"
3,"_","_","_","ca","CCD","","_","_"
4,"_","_","_","eva","CEM","","_","_"
5,"jagad","_","_","jagat","NC","","_","_"
6,"uttiṣṭhataḥ","_","_","utthā","V","utthā","_","_"
7,"pṛthak","_","_","pṛthak","CX","","_","_"
1,"bodhanāt","_","_","bodhana","NC","","_","_"
2,"_","_","_","tāpana","NC","","_","_"
3,"_","_","_","ca","CCD","","_","_"
4,"_","_","_","eva","CEM","","_","_"
5,"jagato","_","_","jagat","NC","","_","_"
6,"harṣaṇaṃ","_","_","harṣaṇa","NC","","_","_"
7,"bhavet","_","_","bhav","V","bhū","_","_"
1,"_","_","_","agnīṣoma","NC","","_","_"
2,"_","_","_","kṛ","PPP","","_","_"
3,"ebhiḥ","_","_","ida","PRD","","_","_"
4,"karmabhiḥ","_","_","karman","NC","","_","_"
5,"_","_","_","pāṇḍu","NC","","_","_"
6,"_","_","_","nandana","NC","","_","_"
1,"hṛṣīkeśo","_","_","hṛṣīkeśa","NC","","_","_"
2,"'ham","_","_","mat","PPR","","_","_"
3,"īśāno","_","_","īśāna","NC","","_","_"
4,"_","_","_","vara","NC","","_","_"
5,"_","_","_","da","JJ","","_","_"
6,"_","_","_","loka","NC","","_","_"
7,"_","_","_","bhāvana","JJ","","_","_"
1,"_","_","_","iḍā","NC","","_","_"
2,"_","_","_","upahvā","PPP","","_","_"
3,"_","_","_","yoga","NC","","_","_"
4,"hare","_","_","har","V","hṛ","_","_"
5,"bhāgaṃ","_","_","bhāga","NC","","_","_"
6,"_","_","_","kratu","NC","","_","_"
7,"_","_","_","mat","PPR","","_","_"
1,"_","_","_","varṇa","NC","","_","_"
2,"_","_","_","ca","CCD","","_","_"
3,"me","_","_","mat","PPR","","_","_"
4,"_","_","_","hari","JJ","","_","_"
5,"_","_","_","śreṣṭha","JJ","","_","_"
6,"_","_","_","tasmāt","CX","","_","_"
7,"_","_","_","hari","NC","","_","_"
8,"ahaṃ","_","_","mat","PPR","","_","_"
9,"smṛtaḥ","_","_","smṛ","PPP","","_","_"
1,"dhāma","_","_","dhāman","NC","","_","_"
2,"sāro","_","_","sāra","NC","","_","_"
3,"hi","_","_","hi","CX","","_","_"
4,"lokānām","_","_","loka","NC","","_","_"
5,"ṛtaṃ","_","_","ṛta","NC","","_","_"
6,"_","_","_","ca","CCD","","_","_"
7,"_","_","_","eva","CEM","","_","_"
8,"vicāritam","_","_","vicāray","PPP","","_","_"
1,"ṛtadhāmā","_","_","ṛtadhāman","NC","","_","_"
2,"tato","_","_","tatas","CX","","_","_"
3,"vipraiḥ","_","_","vipra","NC","","_","_"
4,"_","_","_","satya","JJ","","_","_"
5,"_","_","_","ca","CCD","","_","_"
6,"_","_","_","mat","PPR","","_","_"
7,"prakīrtitaḥ","_","_","prakīrtay","PPP","","_","_"
1,"naṣṭāṃ","_","_","naś","PPP","","_","_"
2,"ca","_","_","ca","CCD","","_","_"
3,"dharaṇīṃ","_","_","dharaṇī","NC","","_","_"
4,"pūrvam","_","_","pūrva","CX","","_","_"
5,"avindaṃ","_","_","vid","V","vid","_","_"
6,"vai","_","_","vai","CX","","_","_"
7,"_","_","_","guhā","NC","","_","_"
8,"_","_","_","ga","PPP","","_","_"
1,"govinda","_","_","govinda","NC","","_","_"
2,"iti","_","_","iti","CQT","","_","_"
3,"māṃ","_","_","mat","PPR","","_","_"
4,"devā","_","_","deva","NC","","_","_"
5,"vāgbhiḥ","_","_","vāc","NC","","_","_"
6,"samabhituṣṭuvuḥ","_","_","samabhiṣṭu","V","samabhiṣṭu","_","_"
1,"_","_","_","śipi","NC","","_","_"
2,"_","_","_","viś","PPP","","_","_"
3,"_","_","_","iti","CQT","","_","_"
4,"_","_","_","ca","CCD","","_","_"
5,"_","_","_","ākhyā","NC","","_","_"
6,"_","_","_","hā","PPP","","_","_"
7,"_","_","_","roman","NC","","_","_"
8,"ca","_","_","ca","CCD","","_","_"
9,"yo","_","_","yad","PRL","","_","_"
10,"bhavet","_","_","bhav","V","bhū","_","_"
1,"_","_","_","tad","PRD","","_","_"
2,"_","_","_","āviś","PPP","","_","_"
3,"hi","_","_","hi","CX","","_","_"
4,"yat","_","_","yad","PRL","","_","_"
5,"_","_","_","kiṃcit","PRI","","_","_"
6,"_","_","_","śipiviṣṭa","JJ","","_","_"
7,"hi","_","_","hi","CX","","_","_"
8,"tat","_","_","tad","PRD","","_","_"
9,"smṛtam","_","_","smṛ","PPP","","_","_"
1,"yāsko","_","_","yāska","NC","","_","_"
2,"mām","_","_","mat","PPR","","_","_"
3,"ṛṣir","_","_","ṛṣi","NC","","_","_"
4,"avyagro","_","_","avyagra","JJ","","_","_"
5,"_","_","_","na","CNG","","_","_"
6,"_","_","_","eka","PPX","","_","_"
7,"_","_","_","yajña","NC","","_","_"
8,"gītavān","_","_","gā","KDP","","_","_"
1,"śipiviṣṭa","_","_","śipiviṣṭa","JJ","","_","_"
2,"iti","_","_","iti","CQT","","_","_"
3,"_","_","_","hi","CX","","_","_"
4,"_","_","_","ida","PRD","","_","_"
5,"_","_","_","guhya","JJ","","_","_"
6,"_","_","_","nāman","NC","","_","_"
7,"_","_","_","dhara","JJ","","_","_"
8,"_","_","_","hi","CX","","_","_"
9,"_","_","_","mat","PPR","","_","_"
1,"stutvā","_","_","stu","CGDA","","_","_"
2,"māṃ","_","_","mat","PPR","","_","_"
3,"_","_","_","śipiviṣṭa","JJ","","_","_"
4,"_","_","_","iti","CQT","","_","_"
5,"yāska","_","_","yāska","NC","","_","_"
6,"ṛṣir","_","_","ṛṣi","NC","","_","_"
7,"_","_","_","udāra","JJ","","_","_"
8,"_","_","_","dhī","NC","","_","_"
1,"_","_","_","mat","PPR","","_","_"
2,"_","_","_","prasāda","NC","","_","_"
3,"adho","_","_","adhas","CX","","_","_"
4,"naṣṭaṃ","_","_","naś","PPP","","_","_"
5,"niruktam","_","_","nirukta","NC","","_","_"
6,"abhijagmivān","_","_","abhiga","KDP","","_","_"
1,"na","_","_","na","CNG","","_","_"
2,"hi","_","_","hi","CX","","_","_"
3,"jāto","_","_","jan","PPP","","_","_"
4,"na","_","_","na","CNG","","_","_"
5,"jāye","_","_","jan","V","jan","_","_"
6,"'haṃ","_","_","mat","PPR","","_","_"
7,"na","_","_","na","CNG","","_","_"
8,"janiṣye","_","_","jan","V","jan","_","_"
9,"kadācana","_","_","kadācana","CX","","_","_"
1,"kṣetrajñaḥ","_","_","kṣetrajña","NC","","_","_"
2,"_","_","_","sarva","JQ","","_","_"
3,"_","_","_","bhūta","NC","","_","_"
4,"tasmād","_","_","tasmāt","CX","","_","_"
5,"aham","_","_","mat","PPR","","_","_"
6,"ajaḥ","_","_","aja","NC","","_","_"
7,"smṛtaḥ","_","_","smṛ","PPP","","_","_"
1,"_","_","_","na","CNG","","_","_"
2,"_","_","_","vac","PPP","","_","_"
3,"_","_","_","pūrva","PPX","","_","_"
4,"mayā","_","_","mat","PPR","","_","_"
5,"kṣudram","_","_","kṣudra","JJ","","_","_"
6,"aślīlaṃ","_","_","aślīla","JJ","","_","_"
7,"vā","_","_","vā","CCD","","_","_"
8,"kadācana","_","_","kadācana","CX","","_","_"
1,"ṛtā","_","_","ṛta","JJ","","_","_"
2,"_","_","_","brahman","NC","","_","_"
3,"_","_","_","sutā","NC","","_","_"
4,"sā","_","_","tad","PRD","","_","_"
5,"me","_","_","mat","PPR","","_","_"
6,"satyā","_","_","satya","JJ","","_","_"
7,"devī","_","_","devī","NC","","_","_"
8,"sarasvatī","_","_","sarasvatī","NC","","_","_"
1,"_","_","_","as","KDP","","_","_"
2,"_","_","_","ca","CCD","","_","_"
3,"_","_","_","asat","JJ","","_","_"
4,"_","_","_","ca","CCD","","_","_"
5,"_","_","_","eva","CEM","","_","_"
6,"kaunteya","_","_","kaunteya","NC","","_","_"
7,"_","_","_","mat","PPR","","_","_"
8,"_","_","_","āveśay","PPP","","_","_"
9,"ātmani","_","_","ātman","NC","","_","_"
1,"pauṣkare","_","_","pauṣkara","JJ","","_","_"
2,"_","_","_","brahman","NC","","_","_"
3,"_","_","_","sadana","NC","","_","_"
4,"satyaṃ","_","_","satya","JJ","","_","_"
5,"mām","_","_","mat","PPR","","_","_"
6,"ṛṣayo","_","_","ṛṣi","NC","","_","_"
7,"viduḥ","_","_","vid","V","vid","_","_"
1,"_","_","_","sattva","NC","","_","_"
2,"_","_","_","na","CNG","","_","_"
3,"_","_","_","cyu","PPP","","_","_"
4,"_","_","_","pūrva","PPX","","_","_"
5,"'haṃ","_","_","mat","PPR","","_","_"
6,"sattvaṃ","_","_","sattva","NC","","_","_"
7,"vai","_","_","vai","CX","","_","_"
8,"viddhi","_","_","vid","V","vid","_","_"
9,"_","_","_","mat","PPR","","_","_"
10,"_","_","_","kṛ","PPP","","_","_"
1,"_","_","_","janman","NC","","_","_"
2,"_","_","_","iha","CAD","","_","_"
3,"_","_","_","bhav","V","bhū","_","_"
4,"sattvaṃ","_","_","sattva","NC","","_","_"
5,"paurvikaṃ","_","_","paurvika","JJ","","_","_"
6,"me","_","_","mat","PPR","","_","_"
7,"dhanaṃjaya","_","_","dhanaṃjaya","NC","","_","_"
1,"_","_","_","nirāśī","JJ","","_","_"
2,"_","_","_","karman","NC","","_","_"
3,"_","_","_","saṃyuj","PPP","","_","_"
4,"sātvataṃ","_","_","sātvata","NC","","_","_"
5,"māṃ","_","_","mat","PPR","","_","_"
6,"prakalpaya","_","_","prakalpay","V","prakalpay","_","_"
1,"_","_","_","sātvata","NC","","_","_"
2,"_","_","_","jñāna","NC","","_","_"
3,"_","_","_","dṛś","PPP","","_","_"
4,"'haṃ","_","_","mat","PPR","","_","_"
5,"sātvataḥ","_","_","sātvata","NC","","_","_"
6,"sātvatāṃ","_","_","sātvat","NC","","_","_"
7,"patiḥ","_","_","pati","NC","","_","_"
1,"kṛṣāmi","_","_","kṛṣ","V","kṛṣ","_","_"
2,"medinīṃ","_","_","medinī","NC","","_","_"
3,"pārtha","_","_","pārtha","NC","","_","_"
4,"bhūtvā","_","_","bhū","CGDA","","_","_"
5,"kārṣṇāyaso","_","_","kārṣṇāyasa","JJ","","_","_"
6,"mahān","_","_","mahat","JJ","","_","_"
1,"kṛṣṇo","_","_","kṛṣṇa","JJ","","_","_"
2,"_","_","_","varṇa","NC","","_","_"
3,"_","_","_","ca","CCD","","_","_"
4,"me","_","_","mat","PPR","","_","_"
5,"yasmāt","_","_","yasmāt","CX","","_","_"
6,"tasmāt","_","_","tasmāt","CX","","_","_"
7,"kṛṣṇo","_","_","kṛṣṇa","NC","","_","_"
8,"'ham","_","_","mat","PPR","","_","_"
9,"arjuna","_","_","arjuna","NC","","_","_"
1,"mayā","_","_","mat","PPR","","_","_"
2,"saṃśleṣitā","_","_","saṃśleṣay","PPP","","_","_"
3,"bhūmir","_","_","bhūmi","NC","","_","_"
4,"adbhir","_","_","ap","NC","","_","_"
5,"vyoma","_","_","vyoman","NC","","_","_"
6,"ca","_","_","ca","CCD","","_","_"
7,"vāyunā","_","_","vāyu","NC","","_","_"
1,"_","_","_","vāyu","NC","","_","_"
2,"_","_","_","ca","CCD","","_","_"
3,"tejasā","_","_","tejas","NC","","_","_"
4,"sārdhaṃ","_","_","sārdha","CX","","_","_"
5,"_","_","_","vaikuṇṭha","NC","","_","_"
7,"tato","_","_","tatas","CX","","_","_"
8,"mama","_","_","mat","PPR","","_","_"
1,"nirvāṇaṃ","_","_","nirvāṇa","NC","","_","_"
2,"paramaṃ","_","_","parama","JJ","","_","_"
3,"saukhyaṃ","_","_","saukhya","NC","","_","_"
4,"dharmo","_","_","dharma","NC","","_","_"
5,"'sau","_","_","adas","PRD","","_","_"
6,"para","_","_","para","PPX","","_","_"
7,"ucyate","_","_","vak","V","vac","_","_"
1,"_","_","_","tad","PRD","","_","_"
2,"_","_","_","na","CNG","","_","_"
3,"_","_","_","cyu","PPP","","_","_"
4,"_","_","_","pūrva","PPX","","_","_"
5,"'ham","_","_","mat","PPR","","_","_"
6,"_","_","_","acyuta","NC","","_","_"
7,"_","_","_","tad","PRD","","_","_"
8,"karmaṇā","_","_","karman","NC","","_","_"
1,"_","_","_","pṛthivī","NC","","_","_"
2,"_","_","_","nabhas","NC","","_","_"
3,"_","_","_","ca","CCD","","_","_"
4,"_","_","_","ubh","PPX","","_","_"
5,"viśrute","_","_","viśru","PPP","","_","_"
6,"_","_","_","viśva","JQ","","_","_"
7,"_","_","_","laukika","JJ","","_","_"
1,"tayoḥ","_","_","tad","PRD","","_","_"
2,"_","_","_","saṃdhāraṇa","NC","","_","_"
3,"_","_","_","artha","NC","","_","_"
4,"hi","_","_","hi","CX","","_","_"
5,"mām","_","_","mat","PPR","","_","_"
6,"adhokṣajam","_","_","adhokṣaja","NC","","_","_"
7,"añjasā","_","_","añjasā","CX","","_","_"
1,"niruktaṃ","_","_","nirvac","PPP","","_","_"
2,"_","_","_","veda","NC","","_","_"
3,"_","_","_","vidvas","JJ","","_","_"
4,"ye","_","_","yad","PRL","","_","_"
5,"ca","_","_","ca","CCD","","_","_"
6,"_","_","_","śabda","NC","","_","_"
7,"_","_","_","artha","NC","","_","_"
8,"_","_","_","cintaka","JJ","","_","_"
1,"te","_","_","tad","PRD","","_","_"
2,"māṃ","_","_","mat","PPR","","_","_"
3,"gāyanti","_","_","gāy","V","gai","_","_"
4,"_","_","_","prāñc","JJ","","_","_"
5,"_","_","_","vaṃśa","NC","","_","_"
6,"adhokṣaja","_","_","adhokṣaja","NC","","_","_"
7,"iti","_","_","iti","CQT","","_","_"
8,"sthitiḥ","_","_","sthiti","NC","","_","_"
1,"śabda","_","_","śabda","NC","","_","_"
2,"_","_","_","eka","PPX","","_","_"
3,"_","_","_","mata","NC","","_","_"
4,"eṣa","_","_","tad","PRD","","_","_"
5,"vyāhṛtaḥ","_","_","vyāhṛ","PPP","","_","_"
6,"_","_","_","parama","JJ","","_","_"
7,"_","_","_","ṛṣi","NC","","_","_"
1,"_","_","_","na","CNG","","_","_"
2,"_","_","_","anya","PPX","","_","_"
3,"_","_","_","hi","CX","","_","_"
4,"_","_","_","adhokṣaja","NC","","_","_"
5,"loke","_","_","loka","NC","","_","_"
6,"ṛte","_","_","ṛte","CX","","_","_"
7,"nārāyaṇaṃ","_","_","nārāyaṇa","NC","","_","_"
8,"prabhum","_","_","prabhu","NC","","_","_"
1,"ghṛtaṃ","_","_","ghṛta","NC","","_","_"
2,"_","_","_","mat","PPR","","_","_"
3,"_","_","_","arcis","NC","","_","_"
4,"loke","_","_","loka","NC","","_","_"
5,"jantūnāṃ","_","_","jantu","NC","","_","_"
6,"_","_","_","prāṇa","NC","","_","_"
7,"_","_","_","dhāraṇa","NC","","_","_"
1,"ghṛtārcir","_","_","ghṛtārcis","NC","","_","_"
2,"aham","_","_","mat","PPR","","_","_"
3,"avyagrair","_","_","avyagra","JJ","","_","_"
4,"_","_","_","veda","NC","","_","_"
5,"_","_","_","jña","JJ","","_","_"
6,"parikīrtitaḥ","_","_","parikīrtay","PPP","","_","_"
1,"trayo","_","_","tri","NUM","","_","_"
2,"hi","_","_","hi","CX","","_","_"
3,"dhātavaḥ","_","_","dhātu","NC","","_","_"
4,"khyātāḥ","_","_","khyā","PPP","","_","_"
5,"_","_","_","karman","NC","","_","_"
6,"_","_","_","ja","JJ","","_","_"
7,"iti","_","_","iti","CQT","","_","_"
8,"ca","_","_","ca","CCD","","_","_"
9,"smṛtāḥ","_","_","smṛ","PPP","","_","_"
1,"pittaṃ","_","_","pitta","NC","","_","_"
2,"śleṣmā","_","_","śleṣman","NC","","_","_"
3,"ca","_","_","ca","CCD","","_","_"
4,"_","_","_","vāyu","NC","","_","_"
5,"_","_","_","ca","CCD","","_","_"
6,"eṣa","_","_","tad","PRD","","_","_"
7,"saṃghāta","_","_","saṃghāta","NC","","_","_"
8,"ucyate","_","_","vak","V","vac","_","_"
1,"_","_","_","tad","PRD","","_","_"
2,"_","_","_","ca","CCD","","_","_"
3,"dhāryate","_","_","dhar","V","dhṛ","_","_"
4,"jantur","_","_","jantu","NC","","_","_"
5,"etaiḥ","_","_","tad","PRD","","_","_"
6,"_","_","_","kṣi","PPP","","_","_"
7,"_","_","_","ca","CCD","","_","_"
8,"kṣīyate","_","_","kṣi","V","kṣi","_","_"
1,"_","_","_","āyurveda","NC","","_","_"
2,"_","_","_","vid","JJ","","_","_"
3,"_","_","_","tasmāt","CX","","_","_"
4,"tridhātuṃ","_","_","tridhātu","NC","","_","_"
5,"māṃ","_","_","mat","PPR","","_","_"
6,"pracakṣate","_","_","pracakṣ","V","pracakṣ","_","_"
1,"vṛṣo","_","_","vṛṣa","NC","","_","_"
2,"hi","_","_","hi","CX","","_","_"
3,"bhagavān","_","_","bhagavat","JJ","","_","_"
4,"dharmaḥ","_","_","dharma","NC","","_","_"
5,"khyāto","_","_","khyā","PPP","","_","_"
6,"lokeṣu","_","_","loka","NC","","_","_"
7,"bhārata","_","_","bhārata","NC","","_","_"
1,"_","_","_","naighaṇṭuka","JJ","","_","_"
2,"_","_","_","pada","NC","","_","_"
3,"_","_","_","khyā","PPP","","_","_"
4,"viddhi","_","_","vid","V","vid","_","_"
5,"māṃ","_","_","mat","PPR","","_","_"
6,"vṛṣam","_","_","vṛṣa","NC","","_","_"
7,"uttamam","_","_","uttama","JJ","","_","_"
1,"kapir","_","_","kapi","NC","","_","_"
2,"varāhaḥ","_","_","varāha","NC","","_","_"
3,"_","_","_","śreṣṭha","JJ","","_","_"
4,"_","_","_","ca","CCD","","_","_"
5,"_","_","_","dharma","NC","","_","_"
6,"_","_","_","ca","CCD","","_","_"
7,"vṛṣa","_","_","vṛṣa","NC","","_","_"
8,"ucyate","_","_","vak","V","vac","_","_"
1,"tasmād","_","_","tasmāt","CX","","_","_"
2,"vṛṣākapiṃ","_","_","vṛṣākapi","NC","","_","_"
3,"prāha","_","_","prāh","V","prāh","_","_"
4,"kaśyapo","_","_","kaśyapa","NC","","_","_"
5,"māṃ","_","_","mat","PPR","","_","_"
6,"prajāpatiḥ","_","_","prajāpati","NC","","_","_"
1,"na","_","_","na","CNG","","_","_"
2,"_","_","_","ca","CCD","","_","_"
3,"_","_","_","ādi","NC","","_","_"
4,"na","_","_","na","CNG","","_","_"
5,"madhyaṃ","_","_","madhya","NC","","_","_"
6,"tathā","_","_","tathā","CX","","_","_"
7,"_","_","_","na","CNG","","_","_"
8,"_","_","_","eva","CEM","","_","_"
9,"_","_","_","ca","CCD","","_","_"
10,"_","_","_","anta","NC","","_","_"
11,"kadācid","_","_","kadācid","CX","","_","_"
12,"_","_","_","sura","NC","","_","_"
13,"_","_","_","ca","CCD","","_","_"
14,"_","_","_","asura","NC","","_","_"
15,"_","_","_","ca","CCD","","_","_"
1,"anādyo","_","_","anādya","JJ","","_","_"
2,"_","_","_","hi","CX","","_","_"
3,"a","_","_","alpha_privativum","JJ","","_","_"
3,"_","_","_","madhya","JJ","","_","_"
4,"tathā","_","_","tathā","CX","","_","_"
5,"_","_","_","ca","CCD","","_","_"
6,"_","_","_","api","CX","","_","_"
7,"_","_","_","ananta","JJ","","_","_"
8,"pragīto","_","_","pragā","PPP","","_","_"
9,"'ham","_","_","mat","PPR","","_","_"
10,"īśo","_","_","īśa","NC","","_","_"
11,"vibhur","_","_","vibhu","JJ","","_","_"
12,"lokasākṣī","_","_","lokasākṣin","NC","","_","_"
1,"śucīni","_","_","śuci","JJ","","_","_"
2,"śravaṇīyāni","_","_","śru","KDG","","_","_"
3,"_","_","_","śṛṇ","V","śru","_","_"
4,"_","_","_","iha","CAD","","_","_"
5,"dhanaṃjaya","_","_","dhanaṃjaya","NC","","_","_"
1,"na","_","_","na","CNG","","_","_"
2,"ca","_","_","ca","CCD","","_","_"
3,"pāpāni","_","_","pāpa","JJ","","_","_"
4,"gṛhṇāmi","_","_","grah","V","grah","_","_"
5,"tato","_","_","tatas","CX","","_","_"
6,"'haṃ","_","_","mat","PPR","","_","_"
7,"vai","_","_","vai","CX","","_","_"
8,"śuciśravāḥ","_","_","śuciśravas","NC","","_","_"
1,"_","_","_","eka","PPX","","_","_"
2,"_","_","_","śṛṅga","NC","","_","_"
3,"purā","_","_","purā","CX","","_","_"
4,"bhūtvā","_","_","bhū","CGDA","","_","_"
5,"varāho","_","_","varāha","NC","","_","_"
6,"_","_","_","divya","JJ","","_","_"
7,"_","_","_","darśana","NC","","_","_"
1,"imām","_","_","ida","PRD","","_","_"
2,"uddhṛtavān","_","_","uddhṛ","KDP","","_","_"
3,"bhūmim","_","_","bhūmi","NC","","_","_"
4,"_","_","_","ekaśṛṅga","NC","","_","_"
5,"_","_","_","tatas","CX","","_","_"
6,"_","_","_","hi","CX","","_","_"
7,"_","_","_","mat","PPR","","_","_"
1,"_","_","_","tathā","CX","","_","_"
2,"_","_","_","eva","CEM","","_","_"
3,"_","_","_","as","V","as","_","_"
4,"_","_","_","tri","NUM","","_","_"
5,"_","_","_","kakuda","NC","","_","_"
6,"vārāhaṃ","_","_","vārāha","JJ","","_","_"
7,"rūpam","_","_","rūpa","NC","","_","_"
8,"āsthitaḥ","_","_","āsthā","PPP","","_","_"
1,"trikakut","_","_","trikakud","NC","","_","_"
2,"tena","_","_","ta","CX","","_","_"
3,"vikhyātaḥ","_","_","vikhyā","PPP","","_","_"
4,"śarīrasya","_","_","śarīra","NC","","_","_"
5,"tu","_","_","tu","CCD","","_","_"
6,"māpanāt","_","_","māpana","NC","","_","_"
1,"viriñca","_","_","viriñca","NC","","_","_"
2,"iti","_","_","iti","CQT","","_","_"
3,"yaḥ","_","_","yad","PRL","","_","_"
4,"proktaḥ","_","_","pravac","PPP","","_","_"
5,"_","_","_","kapila","NC","","_","_"
6,"_","_","_","jñāna","NC","","_","_"
7,"_","_","_","cintaka","JJ","","_","_"
1,"sa","_","_","tad","PRD","","_","_"
2,"prajāpatir","_","_","prajāpati","NC","","_","_"
3,"_","_","_","eva","CEM","","_","_"
4,"_","_","_","mat","PPR","","_","_"
5,"cetanāt","_","_","cetana","NC","","_","_"
6,"_","_","_","sarva","JQ","","_","_"
7,"_","_","_","loka","NC","","_","_"
8,"_","_","_","kṛt","JJ","","_","_"
1,"_","_","_","vidyā","NC","","_","_"
2,"_","_","_","sahāyavat","JJ","","_","_"
3,"mām","_","_","mat","PPR","","_","_"
4,"_","_","_","āditya","NC","","_","_"
5,"_","_","_","stha","JJ","","_","_"
6,"sanātanam","_","_","sanātana","JJ","","_","_"
1,"kapilaṃ","_","_","kapila","NC","","_","_"
2,"prāhur","_","_","prāh","V","prāh","_","_"
3,"ācāryāḥ","_","_","ācārya","NC","","_","_"
4,"sāṃkhyā","_","_","sāṃkhya","NC","","_","_"
5,"_","_","_","niści","PPP","","_","_"
6,"_","_","_","niścaya","NC","","_","_"
1,"hiraṇyagarbho","_","_","hiraṇyagarbha","NC","","_","_"
2,"dyutimān","_","_","dyutimat","JJ","","_","_"
3,"eṣa","_","_","tad","PRD","","_","_"
4,"_","_","_","yad","PRL","","_","_"
5,"_","_","_","chandas","NC","","_","_"
6,"stutaḥ","_","_","stu","PPP","","_","_"
1,"yogaiḥ","_","_","yoga","NC","","_","_"
2,"sampūjyate","_","_","sampūj","V","saṃpūj","_","_"
3,"nityaṃ","_","_","nitya","CX","","_","_"
4,"sa","_","_","tad","PRD","","_","_"
5,"_","_","_","eva","CEM","","_","_"
6,"_","_","_","mat","PPR","","_","_"
7,"vibhuḥ","_","_","vibhu","JJ","","_","_"
8,"smṛtaḥ","_","_","smṛ","PPP","","_","_"
1,"_","_","_","ekaviṃśati","NC","","_","_"
2,"_","_","_","śākhā","NC","","_","_"
3,"ca","_","_","ca","CCD","","_","_"
4,"ṛgvedaṃ","_","_","ṛgveda","NC","","_","_"
5,"māṃ","_","_","mat","PPR","","_","_"
6,"pracakṣate","_","_","pracakṣ","V","pracakṣ","_","_"
1,"_","_","_","sahasra","NUM","","_","_"
2,"_","_","_","śākhā","NC","","_","_"
3,"yat","_","_","yad","PRL","","_","_"
4,"sāma","_","_","sāman","NC","","_","_"
5,"ye","_","_","yad","PRL","","_","_"
6,"vai","_","_","vai","CX","","_","_"
7,"_","_","_","veda","NC","","_","_"
8,"_","_","_","vid","JJ","","_","_"
9,"janāḥ","_","_","jana","NC","","_","_"
1,"_","_","_","gā","V","gā","_","_"
2,"_","_","_","āraṇyaka","NC","","_","_"
3,"viprā","_","_","vipra","NC","","_","_"
4,"_","_","_","mat","PPR","","_","_"
5,"_","_","_","bhakta","NC","","_","_"
6,"_","_","_","tad","PRD","","_","_"
7,"'pi","_","_","api","CX","","_","_"
8,"durlabhāḥ","_","_","durlabha","JJ","","_","_"
1,"ṣaṭpañcāśatam","_","_","ṣaṭpañcāśat","NC","","_","_"
2,"aṣṭau","_","_","aṣṭan","NUM","","_","_"
3,"ca","_","_","ca","CCD","","_","_"
4,"saptatriṃśatam","_","_","saptatriṃśat","NC","","_","_"
5,"_","_","_","iti","CQT","","_","_"
6,"_","_","_","uta","CCD","","_","_"
1,"_","_","_","yad","PRL","","_","_"
2,"_","_","_","śākhā","NC","","_","_"
3,"yajurvede","_","_","yajurveda","NC","","_","_"
4,"so","_","_","tad","PRD","","_","_"
5,"'ham","_","_","mat","PPR","","_","_"
6,"ādhvaryave","_","_","ādhvaryava","NC","","_","_"
7,"smṛtaḥ","_","_","smṛ","PPP","","_","_"
1,"_","_","_","pañcan","NUM","","_","_"
2,"_","_","_","kalpa","NC","","_","_"
3,"atharvāṇaṃ","_","_","atharvan","NC","","_","_"
4,"kṛtyābhiḥ","_","_","kṛtyā","NC","","_","_"
5,"paribṛṃhitam","_","_","paribṛṃhay","PPP","","_","_"
1,"kalpayanti","_","_","kalp","V","kḷp","_","_"
2,"hi","_","_","hi","CX","","_","_"
3,"māṃ","_","_","mat","PPR","","_","_"
4,"viprā","_","_","vipra","NC","","_","_"
5,"_","_","_","atharvāṇa","NC","","_","_"
6,"_","_","_","vid","JJ","","_","_"
7,"_","_","_","tathā","CX","","_","_"
1,"_","_","_","śākhā","NC","","_","_"
2,"_","_","_","bheda","NC","","_","_"
3,"_","_","_","ca","CCD","","_","_"
4,"ye","_","_","yad","PRL","","_","_"
5,"kecid","_","_","kiṃcit","PRI","","_","_"
6,"_","_","_","yad","PRL","","_","_"
7,"_","_","_","ca","CCD","","_","_"
8,"śākhāsu","_","_","śākhā","NC","","_","_"
9,"gītayaḥ","_","_","gīti","NC","","_","_"
1,"_","_","_","svara","NC","","_","_"
2,"_","_","_","varṇa","NC","","_","_"
3,"_","_","_","samuccāra","NC","","_","_"
4,"_","_","_","sarva","JQ","","_","_"
5,"_","_","_","tad","PRD","","_","_"
6,"viddhi","_","_","vid","V","vid","_","_"
7,"_","_","_","mat","PPR","","_","_"
8,"_","_","_","kṛ","PPP","","_","_"
1,"yat","_","_","yad","PRL","","_","_"
2,"_","_","_","tad","PRD","","_","_"
3,"_","_","_","hayaśiras","NC","","_","_"
4,"pārtha","_","_","pārtha","NC","","_","_"
5,"samudeti","_","_","samude","V","samudi","_","_"
6,"_","_","_","vara","NC","","_","_"
7,"_","_","_","prada","JJ","","_","_"
1,"so","_","_","tad","PRD","","_","_"
2,"'ham","_","_","mat","PPR","","_","_"
3,"_","_","_","eva","CEM","","_","_"
4,"_","_","_","uttara","JJ","","_","_"
5,"bhāge","_","_","bhāga","NC","","_","_"
6,"_","_","_","krama","NC","","_","_"
7,"_","_","_","akṣara","NC","","_","_"
8,"_","_","_","vibhāga","NC","","_","_"
9,"_","_","_","vid","JJ","","_","_"
1,"_","_","_","rāma","NC","","_","_"
2,"_","_","_","ādeśay","PPP","","_","_"
3,"_","_","_","mārga","NC","","_","_"
4,"_","_","_","mat","PPR","","_","_"
5,"_","_","_","prasāda","NC","","_","_"
6,"_","_","_","mahātman","JJ","","_","_"
1,"pāñcālena","_","_","pāñcāla","NC","","_","_"
2,"kramaḥ","_","_","krama","NC","","_","_"
3,"_","_","_","prāp","PPP","","_","_"
4,"_","_","_","tad","PRD","","_","_"
5,"bhūtāt","_","_","bhūta","NC","","_","_"
6,"sanātanāt","_","_","sanātana","JJ","","_","_"
1,"_","_","_","bābhravya","NC","","_","_"
2,"_","_","_","gotra","NC","","_","_"
3,"sa","_","_","tad","PRD","","_","_"
4,"babhau","_","_","bhā","V","bhā","_","_"
5,"prathamaḥ","_","_","prathama","JJ","","_","_"
6,"_","_","_","krama","NC","","_","_"
7,"_","_","_","pāraga","JJ","","_","_"
1,"nārāyaṇād","_","_","nārāyaṇa","NC","","_","_"
2,"varaṃ","_","_","vara","NC","","_","_"
3,"labdhvā","_","_","labh","CGDA","","_","_"
4,"prāpya","_","_","prāp","CGDA","","_","_"
5,"yogam","_","_","yoga","NC","","_","_"
6,"anuttamam","_","_","anuttama","JJ","","_","_"
1,"kramaṃ","_","_","krama","NC","","_","_"
2,"praṇīya","_","_","praṇī","CGDA","","_","_"
3,"śikṣāṃ","_","_","śikṣā","NC","","_","_"
4,"ca","_","_","ca","CCD","","_","_"
5,"praṇayitvā","_","_","praṇī","CGDA","","_","_"
6,"sa","_","_","tad","PRD","","_","_"
7,"gālavaḥ","_","_","gālava","NC","","_","_"
1,"kaṇḍarīko","_","_","kaṇḍarīka","NC","","_","_"
2,"'tha","_","_","atha","CAD","","_","_"
3,"rājā","_","_","rājan","NC","","_","_"
4,"ca","_","_","ca","CCD","","_","_"
5,"brahmadattaḥ","_","_","brahmadatta","NC","","_","_"
6,"pratāpavān","_","_","pratāpavat","JJ","","_","_"
1,"_","_","_","jātī","NC","","_","_"
2,"_","_","_","maraṇa","NC","","_","_"
3,"_","_","_","ja","JJ","","_","_"
4,"duḥkhaṃ","_","_","duḥkha","NC","","_","_"
5,"smṛtvā","_","_","smṛ","CGDA","","_","_"
6,"smṛtvā","_","_","smṛ","CGDA","","_","_"
7,"punaḥ","_","_","punar","CAD","","_","_"
8,"punaḥ","_","_","punar","CAD","","_","_"
1,"_","_","_","saptan","NUM","","_","_"
2,"_","_","_","jāti","NC","","_","_"
3,"_","_","_","mukhya","JJ","","_","_"
5,"yogānāṃ","_","_","yoga","NC","","_","_"
6,"saṃpadaṃ","_","_","sampad","NC","","_","_"
7,"gataḥ","_","_","ga","PPP","","_","_"
1,"_","_","_","purā","CX","","_","_"
2,"_","_","_","mat","PPR","","_","_"
3,"ātmajaḥ","_","_","ātmaja","NC","","_","_"
4,"pārtha","_","_","pārtha","NC","","_","_"
5,"prathitaḥ","_","_","prath","PPP","","_","_"
6,"_","_","_","kāraṇa","NC","","_","_"
7,"_","_","_","antara","JJ","","_","_"
1,"dharmasya","_","_","dharma","NC","","_","_"
2,"_","_","_","kuru","NC","","_","_"
3,"_","_","_","śārdūla","NC","","_","_"
4,"tato","_","_","tatas","CX","","_","_"
5,"'haṃ","_","_","mat","PPR","","_","_"
6,"dharmajaḥ","_","_","dharmaja","NC","","_","_"
7,"smṛtaḥ","_","_","smṛ","PPP","","_","_"
1,"_","_","_","nara","NC","","_","_"
2,"_","_","_","nārāyaṇa","NC","","_","_"
3,"pūrvaṃ","_","_","pūrva","CX","","_","_"
4,"_","_","_","tapas","NC","","_","_"
5,"_","_","_","tap","V","tap","_","_"
6,"avyayam","_","_","avyaya","JJ","","_","_"
1,"_","_","_","dharma","NC","","_","_"
2,"_","_","_","yāna","NC","","_","_"
3,"samārūḍhau","_","_","samāruh","PPP","","_","_"
4,"parvate","_","_","parvata","NC","","_","_"
5,"gandhamādane","_","_","gandhamādana","NC","","_","_"
1,"_","_","_","tad","PRD","","_","_"
2,"_","_","_","kāla","NC","","_","_"
3,"_","_","_","samaya","NC","","_","_"
4,"_","_","_","ca","CCD","","_","_"
5,"_","_","_","eva","CEM","","_","_"
6,"_","_","_","dakṣa","NC","","_","_"
7,"_","_","_","yajña","NC","","_","_"
8,"babhūva","_","_","bhav","V","bhū","_","_"
9,"ha","_","_","ha","CEM","","_","_"
1,"na","_","_","na","CNG","","_","_"
2,"_","_","_","ca","CCD","","_","_"
3,"_","_","_","eva","CEM","","_","_"
4,"_","_","_","kalpay","V","kalpay","_","_"
5,"bhāgaṃ","_","_","bhāga","NC","","_","_"
6,"dakṣo","_","_","dakṣa","NC","","_","_"
7,"rudrasya","_","_","rudra","NC","","_","_"
8,"bhārata","_","_","bhārata","NC","","_","_"
1,"tato","_","_","tatas","CX","","_","_"
2,"_","_","_","dadhīci","NC","","_","_"
3,"_","_","_","vacana","NC","","_","_"
4,"_","_","_","dakṣa","NC","","_","_"
5,"_","_","_","yajña","NC","","_","_"
6,"apāharat","_","_","apahar","V","apahṛ","_","_"
1,"sasarja","_","_","sṛj","V","sṛj","_","_"
2,"śūlaṃ","_","_","śūla","NC","","_","_"
3,"krodhena","_","_","krodha","NC","","_","_"
4,"prajvalantaṃ","_","_","prajval","KDP","","_","_"
5,"muhur","_","_","muhur","CX","","_","_"
6,"muhuḥ","_","_","muhur","CX","","_","_"
1,"_","_","_","tad","PRD","","_","_"
2,"_","_","_","śūla","NC","","_","_"
3,"bhasmasātkṛtvā","_","_","bhasmasātkṛ","CGDA","","_","_"
4,"_","_","_","dakṣa","NC","","_","_"
5,"_","_","_","yajña","NC","","_","_"
6,"_","_","_","sa_saha","CX","","_","_"
7,"_","_","_","vistara","NC","","_","_"
1,"āvayoḥ","_","_","mat","PPR","","_","_"
2,"_","_","_","sahasā","CX","","_","_"
3,"_","_","_","ga","V","ga","_","_"
4,"badaryāśramam","_","_","badaryāśrama","NC","","_","_"
5,"antikāt","_","_","antika","NC","","_","_"
1,"vegena","_","_","vega","NC","","_","_"
2,"mahatā","_","_","mahat","JJ","","_","_"
3,"pārtha","_","_","pārtha","NC","","_","_"
4,"_","_","_","pat","KDP","","_","_"
5,"_","_","_","nārāyaṇa","NC","","_","_"
6,"_","_","_","uras","NC","","_","_"
1,"tataḥ","_","_","tatas","CX","","_","_"
2,"_","_","_","sva","JJ","","_","_"
3,"_","_","_","tejas","NC","","_","_"
4,"_","_","_","āviś","PPP","","_","_"
5,"keśā","_","_","keśa","NC","","_","_"
6,"nārāyaṇasya","_","_","nārāyaṇa","NC","","_","_"
7,"ha","_","_","ha","CEM","","_","_"
1,"babhūvur","_","_","bhav","V","bhū","_","_"
2,"_","_","_","muñja","NC","","_","_"
3,"_","_","_","varṇa","NC","","_","_"
4,"_","_","_","tu","CCD","","_","_"
5,"tato","_","_","tatas","CX","","_","_"
6,"'haṃ","_","_","mat","PPR","","_","_"
7,"_","_","_","muñja","NC","","_","_"
8,"_","_","_","keśavat","JJ","","_","_"
1,"_","_","_","tad","PRD","","_","_"
2,"_","_","_","ca","CCD","","_","_"
3,"śūlaṃ","_","_","śūla","NC","","_","_"
4,"vinirdhūtaṃ","_","_","vinirdhū","PPP","","_","_"
5,"huṃkāreṇa","_","_","huṃkāra","NC","","_","_"
6,"mahātmanā","_","_","mahātman","JJ","","_","_"
1,"jagāma","_","_","ga","V","ga","_","_"
2,"_","_","_","śaṃkara","NC","","_","_"
3,"_","_","_","kara","NC","","_","_"
4,"_","_","_","nārāyaṇa","NC","","_","_"
5,"_","_","_","samāhan","PPP","","_","_"
1,"atha","_","_","atha","CAD","","_","_"
2,"rudra","_","_","rudra","NC","","_","_"
3,"upādhāvat","_","_","upadhāv","V","upadhāv","_","_"
4,"_","_","_","tad","PRD","","_","_"
5,"_","_","_","ṛṣi","NC","","_","_"
6,"_","_","_","tapas","NC","","_","_"
7,"_","_","_","anvita","JJ","","_","_"
1,"tata","_","_","tatas","CX","","_","_"
2,"enaṃ","_","_","a","PRD","","_","_"
3,"samuddhūtaṃ","_","_","samuddhū","PPP","","_","_"
4,"kaṇṭhe","_","_","kaṇṭha","NC","","_","_"
5,"jagrāha","_","_","grah","V","grah","_","_"
6,"pāṇinā","_","_","pāṇi","NC","","_","_"
1,"nārāyaṇaḥ","_","_","nārāyaṇa","NC","","_","_"
2,"sa","_","_","tad","PRD","","_","_"
3,"viśvātmā","_","_","viśvātman","NC","","_","_"
4,"_","_","_","ta","CX","","_","_"
5,"_","_","_","ida","PRD","","_","_"
6,"_","_","_","śitikaṇṭha","NC","","_","_"
1,"atha","_","_","atha","CAD","","_","_"
2,"_","_","_","rudra","NC","","_","_"
3,"_","_","_","vighāta","NC","","_","_"
4,"_","_","_","artha","NC","","_","_"
5,"iṣīkāṃ","_","_","iṣīkā","NC","","_","_"
6,"jagṛhe","_","_","grah","V","grah","_","_"
7,"naraḥ","_","_","nara","NC","","_","_"
1,"_","_","_","mantra","NC","","_","_"
2,"_","_","_","ca","CCD","","_","_"
3,"_","_","_","saṃyuj","V","saṃyuj","_","_"
4,"_","_","_","āśu","CX","","_","_"
5,"so","_","_","tad","PRD","","_","_"
6,"'bhavat","_","_","bhav","V","bhū","_","_"
7,"paraśur","_","_","paraśu","NC","","_","_"
8,"mahān","_","_","mahat","JJ","","_","_"
1,"_","_","_","kṣip","PPP","","_","_"
2,"_","_","_","ca","CCD","","_","_"
3,"sahasā","_","_","sahasā","CX","","_","_"
4,"rudre","_","_","rudra","NC","","_","_"
5,"khaṇḍanaṃ","_","_","khaṇḍana","NC","","_","_"
6,"_","_","_","prāp","KDP","","_","_"
7,"_","_","_","tadā","CAD","","_","_"
1,"tato","_","_","tatas","CX","","_","_"
2,"'haṃ","_","_","mat","PPR","","_","_"
3,"khaṇḍaparaśuḥ","_","_","khaṇḍaparaśu","NC","","_","_"
4,"smṛtaḥ","_","_","smṛ","PPP","","_","_"
5,"_","_","_","paraśu","NC","","_","_"
6,"_","_","_","khaṇḍana","NC","","_","_"
1,"arjuna","_","_","arjuna","NC","","_","_"
2,"uvāca","_","_","vak","V","vac","_","_"
1,"asmin","_","_","ida","PRD","","_","_"
2,"yuddhe","_","_","yuddha","NC","","_","_"
3,"tu","_","_","tu","CCD","","_","_"
4,"vārṣṇeya","_","_","vārṣṇeya","NC","","_","_"
5,"_","_","_","trailokya","NC","","_","_"
6,"_","_","_","mathana","NC","","_","_"
7,"tadā","_","_","tadā","CAD","","_","_"
1,"jayaṃ","_","_","jaya","NC","","_","_"
2,"kaḥ","_","_","kiṃ","PRQ","","_","_"
3,"_","_","_","prāp","KDP","","_","_"
4,"_","_","_","tatra","CAD","","_","_"
5,"_","_","_","śaṃs","V","śaṃs","_","_"
6,"_","_","_","tad","PRD","","_","_"
7,"_","_","_","mat","PPR","","_","_"
8,"janārdana","_","_","janārdana","NC","","_","_"
1,"_","_","_","śrī","NC","","_","_"
2,"_","_","_","bhagavat","NC","","_","_"
3,"uvāca","_","_","vak","V","vac","_","_"
1,"tayoḥ","_","_","tad","PRD","","_","_"
2,"saṃlagnayor","_","_","saṃlag","PPP","","_","_"
3,"yuddhe","_","_","yuddha","NC","","_","_"
4,"_","_","_","rudra","NC","","_","_"
5,"_","_","_","nārāyaṇa","NC","","_","_"
6,"_","_","_","ātman","NC","","_","_"
1,"udvignāḥ","_","_","udvij","PPP","","_","_"
2,"sahasā","_","_","sahasā","CX","","_","_"
3,"kṛtsnā","_","_","kṛtsna","JJ","","_","_"
4,"lokāḥ","_","_","loka","NC","","_","_"
5,"sarve","_","_","sarva","JQ","","_","_"
6,"_","_","_","bhav","V","bhū","_","_"
7,"_","_","_","tadā","CAD","","_","_"
1,"_","_","_","na","CNG","","_","_"
2,"_","_","_","grah","V","grah","_","_"
3,"pāvakaḥ","_","_","pāvaka","NC","","_","_"
4,"śubhraṃ","_","_","śubhra","JJ","","_","_"
5,"makheṣu","_","_","makha","NC","","_","_"
6,"_","_","_","su","CAD","","_","_"
7,"_","_","_","hu","PPP","","_","_"
8,"haviḥ","_","_","havis","NC","","_","_"
1,"vedā","_","_","veda","NC","","_","_"
2,"na","_","_","na","CNG","","_","_"
3,"pratibhānti","_","_","pratibhān","V","pratibhā","_","_"
4,"sma","_","_","sma","CX","","_","_"
5,"ṛṣīṇāṃ","_","_","ṛṣi","NC","","_","_"
6,"bhāvitātmanām","_","_","bhāvitātman","JJ","","_","_"
1,"devān","_","_","deva","NC","","_","_"
2,"_","_","_","rajas","NC","","_","_"
3,"_","_","_","tamas","NC","","_","_"
4,"_","_","_","ca","CCD","","_","_"
5,"_","_","_","eva","CEM","","_","_"
6,"_","_","_","samāviś","V","samāviś","_","_"
7,"_","_","_","tadā","CAD","","_","_"
1,"vasudhā","_","_","vasudhā","NC","","_","_"
2,"saṃcakampe","_","_","saṃkamp","V","saṃkamp","_","_"
3,"'tha","_","_","atha","CAD","","_","_"
4,"_","_","_","nabhas","NC","","_","_"
5,"_","_","_","ca","CCD","","_","_"
6,"vipaphāla","_","_","viphal","V","viphal","_","_"
7,"ha","_","_","ha","CEM","","_","_"
1,"niṣprabhāṇi","_","_","niṣprabha","JJ","","_","_"
2,"ca","_","_","ca","CCD","","_","_"
3,"tejāṃsi","_","_","tejas","NC","","_","_"
4,"brahmā","_","_","brahman","NC","","_","_"
5,"_","_","_","ca","CCD","","_","_"
6,"_","_","_","eva","CEM","","_","_"
7,"_","_","_","āsana","NC","","_","_"
8,"_","_","_","cyu","PPP","","_","_"
1,"_","_","_","gā","V","gā","_","_"
2,"_","_","_","śoṣa","NC","","_","_"
3,"_","_","_","samudra","NC","","_","_"
4,"_","_","_","ca","CCD","","_","_"
5,"_","_","_","himavat","NC","","_","_"
6,"_","_","_","ca","CCD","","_","_"
7,"vyaśīryata","_","_","viśṛ","V","viśṛ","_","_"
1,"tasminn","_","_","tad","PRD","","_","_"
2,"evaṃ","_","_","eva","CX","","_","_"
3,"samutpanne","_","_","samutpad","PPP","","_","_"
4,"nimitte","_","_","nimitta","NC","","_","_"
5,"_","_","_","pāṇḍu","NC","","_","_"
6,"_","_","_","nandana","NC","","_","_"
1,"brahmā","_","_","brahman","NC","","_","_"
2,"vṛto","_","_","vṛ","PPP","","_","_"
3,"_","_","_","deva","NC","","_","_"
4,"_","_","_","gaṇa","NC","","_","_"
5,"_","_","_","ṛṣi","NC","","_","_"
6,"_","_","_","ca","CCD","","_","_"
7,"mahātmabhiḥ","_","_","mahātman","JJ","","_","_"
1,"_","_","_","āga","V","āga","_","_"
2,"_","_","_","āśu","CX","","_","_"
3,"taṃ","_","_","tad","PRD","","_","_"
4,"deśaṃ","_","_","deśa","NC","","_","_"
5,"yatra","_","_","yatra","CX","","_","_"
6,"yuddham","_","_","yuddha","NC","","_","_"
7,"avartata","_","_","vart","V","vṛt","_","_"
1,"_","_","_","sa_saha","CX","","_","_"
2,"_","_","_","añjali","NC","","_","_"
3,"_","_","_","pragraha","NC","","_","_"
4,"bhūtvā","_","_","bhū","CGDA","","_","_"
5,"caturvaktro","_","_","caturvaktra","NC","","_","_"
6,"niruktagaḥ","_","_","niruktaga","NC","","_","_"
1,"uvāca","_","_","vak","V","vac","_","_"
2,"vacanaṃ","_","_","vacana","NC","","_","_"
3,"rudraṃ","_","_","rudra","NC","","_","_"
4,"lokānām","_","_","loka","NC","","_","_"
5,"astu","_","_","as","V","as","_","_"
6,"vai","_","_","vai","CX","","_","_"
7,"śivam","_","_","śiva","NC","","_","_"
1,"_","_","_","nyas","V","nyas","_","_"
2,"_","_","_","āyudha","NC","","_","_"
3,"viśveśa","_","_","viśveśa","NC","","_","_"
4,"jagato","_","_","jagat","NC","","_","_"
5,"_","_","_","hita","NC","","_","_"
6,"_","_","_","kāmyā","NC","","_","_"
1,"yad","_","_","yad","PRL","","_","_"
2,"akṣaram","_","_","akṣara","JJ","","_","_"
3,"_","_","_","atha","CAD","","_","_"
4,"_","_","_","avyakta","NC","","_","_"
5,"īśaṃ","_","_","īśa","NC","","_","_"
6,"lokasya","_","_","loka","NC","","_","_"
7,"bhāvanam","_","_","bhāvana","JJ","","_","_"
1,"kūṭasthaṃ","_","_","kūṭastha","JJ","","_","_"
2,"_","_","_","kartṛ","NC","","_","_"
3,"_","_","_","nirdvaṃdva","JJ","","_","_"
4,"a","_","_","alpha_privativum","NC","","_","_"
4,"_","_","_","kartṛ","NC","","_","_"
5,"_","_","_","iti","CQT","","_","_"
6,"ca","_","_","ca","CCD","","_","_"
7,"yaṃ","_","_","yad","PRL","","_","_"
8,"viduḥ","_","_","vid","V","vid","_","_"
1,"_","_","_","vyakti","NC","","_","_"
2,"_","_","_","bhāva","NC","","_","_"
3,"_","_","_","ga","PPP","","_","_"
4,"_","_","_","ida","PRD","","_","_"
5,"ekā","_","_","eka","PPX","","_","_"
6,"mūrtir","_","_","mūrti","NC","","_","_"
7,"iyaṃ","_","_","ida","PRD","","_","_"
8,"śivā","_","_","śiva","JJ","","_","_"
1,"naro","_","_","nara","NC","","_","_"
2,"_","_","_","nārāyaṇa","NC","","_","_"
3,"_","_","_","ca","CCD","","_","_"
4,"_","_","_","eva","CEM","","_","_"
5,"jātau","_","_","jan","PPP","","_","_"
6,"_","_","_","dharma","NC","","_","_"
7,"_","_","_","kula","NC","","_","_"
8,"_","_","_","udvaha","JJ","","_","_"
1,"tapasā","_","_","tapas","NC","","_","_"
2,"mahatā","_","_","mahat","JJ","","_","_"
3,"yuktau","_","_","yuj","PPP","","_","_"
4,"_","_","_","deva","NC","","_","_"
5,"_","_","_","śreṣṭha","JJ","","_","_"
6,"_","_","_","mahat","JJ","","_","_"
7,"_","_","_","vrata","NC","","_","_"
1,"ahaṃ","_","_","mat","PPR","","_","_"
2,"_","_","_","prasāda","NC","","_","_"
3,"_","_","_","ja","JJ","","_","_"
4,"_","_","_","tad","PRD","","_","_"
5,"kasmiṃścit","_","_","kiṃcit","PRI","","_","_"
6,"_","_","_","kāraṇa","NC","","_","_"
7,"_","_","_","antara","JJ","","_","_"
1,"tvaṃ","_","_","tvat","PPR","","_","_"
2,"_","_","_","ca","CCD","","_","_"
3,"_","_","_","eva","CEM","","_","_"
4,"_","_","_","krodha","NC","","_","_"
5,"_","_","_","ja","JJ","","_","_"
6,"_","_","_","tāta","NC","","_","_"
7,"_","_","_","pūrva","PPX","","_","_"
8,"_","_","_","sarga","NC","","_","_"
9,"sanātanaḥ","_","_","sanātana","JJ","","_","_"
1,"mayā","_","_","mat","PPR","","_","_"
2,"ca","_","_","ca","CCD","","_","_"
3,"sārdhaṃ","_","_","sārdha","CX","","_","_"
4,"_","_","_","vara","NC","","_","_"
5,"_","_","_","da","JJ","","_","_"
6,"_","_","_","vibudha","NC","","_","_"
7,"_","_","_","ca","CCD","","_","_"
8,"_","_","_","mahat","JJ","","_","_"
9,"_","_","_","ṛṣi","NC","","_","_"
1,"_","_","_","prasāday","V","prasāday","_","_"
2,"_","_","_","āśu","CX","","_","_"
3,"lokānāṃ","_","_","loka","NC","","_","_"
4,"śāntir","_","_","śānti","NC","","_","_"
5,"bhavatu","_","_","bhav","V","bhū","_","_"
6,"māciram","_","_","mācira","CX","","_","_"
1,"brahmaṇā","_","_","brahman","NC","","_","_"
2,"_","_","_","tu","CCD","","_","_"
3,"_","_","_","eva","CX","","_","_"
4,"_","_","_","vac","PPP","","_","_"
5,"_","_","_","tu","CCD","","_","_"
6,"rudraḥ","_","_","rudra","NC","","_","_"
7,"_","_","_","krodha","NC","","_","_"
8,"_","_","_","agni","NC","","_","_"
9,"utsṛjan","_","_","utsṛj","KDP","","_","_"
1,"prasādayāmāsa","_","_","prasāday","V","prasāday","_","_"
2,"tato","_","_","tatas","CX","","_","_"
3,"devaṃ","_","_","deva","NC","","_","_"
4,"nārāyaṇaṃ","_","_","nārāyaṇa","NC","","_","_"
5,"prabhum","_","_","prabhu","JJ","","_","_"
1,"śaraṇaṃ","_","_","śaraṇa","NC","","_","_"
2,"ca","_","_","ca","CCD","","_","_"
3,"_","_","_","ga","V","ga","_","_"
4,"_","_","_","ādya","JJ","","_","_"
5,"vareṇyaṃ","_","_","vareṇya","JJ","","_","_"
6,"_","_","_","vara","NC","","_","_"
7,"_","_","_","da","JJ","","_","_"
8,"harim","_","_","hari","NC","","_","_"
1,"tato","_","_","tatas","CX","","_","_"
2,"'tha","_","_","atha","CAD","","_","_"
3,"_","_","_","vara","NC","","_","_"
4,"_","_","_","da","JJ","","_","_"
5,"devo","_","_","deva","NC","","_","_"
6,"_","_","_","ji","PPP","","_","_"
7,"_","_","_","krodha","NC","","_","_"
8,"_","_","_","ji","PPP","","_","_"
9,"_","_","_","indriya","NC","","_","_"
1,"prītimān","_","_","prītimat","JJ","","_","_"
2,"abhavat","_","_","bhav","V","bhū","_","_"
3,"tatra","_","_","tatra","CAD","","_","_"
4,"rudreṇa","_","_","rudra","NC","","_","_"
5,"saha","_","_","saha","CX","","_","_"
6,"saṃgataḥ","_","_","saṃga","PPP","","_","_"
1,"ṛṣibhir","_","_","ṛṣi","NC","","_","_"
2,"brahmaṇā","_","_","brahman","NC","","_","_"
3,"_","_","_","ca","CCD","","_","_"
4,"_","_","_","eva","CEM","","_","_"
5,"_","_","_","vibudha","NC","","_","_"
6,"_","_","_","ca","CCD","","_","_"
7,"_","_","_","su","CAD","","_","_"
8,"_","_","_","pūjay","PPP","","_","_"
1,"uvāca","_","_","vak","V","vac","_","_"
2,"devam","_","_","deva","NC","","_","_"
3,"īśānam","_","_","īśāna","NC","","_","_"
4,"īśaḥ","_","_","īśa","NC","","_","_"
5,"sa","_","_","tad","PRD","","_","_"
6,"jagato","_","_","jagat","NC","","_","_"
7,"hariḥ","_","_","hari","NC","","_","_"
1,"_","_","_","yad","PRL","","_","_"
2,"_","_","_","tvat","PPR","","_","_"
3,"vetti","_","_","vid","V","vid","_","_"
4,"sa","_","_","tad","PRD","","_","_"
5,"māṃ","_","_","mat","PPR","","_","_"
6,"vetti","_","_","vid","V","vid","_","_"
7,"_","_","_","yad","PRL","","_","_"
8,"_","_","_","tvat","PPR","","_","_"
9,"anu","_","_","anu","CADP","","_","_"
10,"sa","_","_","tad","PRD","","_","_"
11,"mām","_","_","mat","PPR","","_","_"
12,"anu","_","_","anu","CADP","","_","_"
1,"_","_","_","na","CNG","","_","_"
2,"_","_","_","mat","PPR","","_","_"
3,"antaraṃ","_","_","antara","NC","","_","_"
4,"kiṃcin","_","_","kiṃcit","PRI","","_","_"
5,"mā","_","_","mā","CNG","","_","_"
6,"te","_","_","tvat","PPR","","_","_"
7,"bhūd","_","_","bhav","V","bhū","_","_"
8,"buddhir","_","_","buddhi","NC","","_","_"
9,"anyathā","_","_","anyathā","CX","","_","_"
1,"adya","_","_","adya","CX","","_","_"
2,"prabhṛti","_","_","prabhṛti","CX","","_","_"
3,"śrīvatsaḥ","_","_","śrīvatsa","NC","","_","_"
4,"_","_","_","śūla","NC","","_","_"
5,"_","_","_","aṅka","NC","","_","_"
6,"'yaṃ","_","_","ida","PRD","","_","_"
7,"_","_","_","bhav","V","bhū","_","_"
8,"_","_","_","ida","PRD","","_","_"
1,"mama","_","_","mat","PPR","","_","_"
2,"_","_","_","pāṇi","NC","","_","_"
3,"_","_","_","aṅkay","PPP","","_","_"
4,"_","_","_","ca","CCD","","_","_"
5,"_","_","_","api","CX","","_","_"
6,"_","_","_","śrīkaṇṭha","NC","","_","_"
7,"_","_","_","tvat","PPR","","_","_"
8,"bhaviṣyasi","_","_","bhav","V","bhū","_","_"
1,"evaṃ","_","_","eva","CX","","_","_"
2,"lakṣaṇam","_","_","lakṣaṇa","NC","","_","_"
3,"utpādya","_","_","utpāday","CGDA","","_","_"
4,"_","_","_","paraspara","PRC","","_","_"
5,"_","_","_","kṛ","PPP","","_","_"
6,"tadā","_","_","tadā","CAD","","_","_"
1,"sakhyaṃ","_","_","sakhya","NC","","_","_"
2,"_","_","_","ca","CCD","","_","_"
3,"_","_","_","eva","CEM","","_","_"
4,"_","_","_","atula","JJ","","_","_"
5,"kṛtvā","_","_","kṛ","CGDA","","_","_"
6,"rudreṇa","_","_","rudra","NC","","_","_"
7,"_","_","_","sahita","JJ","","_","_"
8,"_","_","_","ṛṣi","NC","","_","_"
1,"_","_","_","tapas","NC","","_","_"
2,"_","_","_","tap","V","tap","_","_"
3,"avyagrau","_","_","avyagra","JJ","","_","_"
4,"visṛjya","_","_","visṛj","CGDA","","_","_"
5,"tridivaukasaḥ","_","_","tridivaukas","NC","","_","_"
1,"eṣa","_","_","tad","PRD","","_","_"
2,"te","_","_","tvat","PPR","","_","_"
3,"kathitaḥ","_","_","kathay","PPP","","_","_"
4,"pārtha","_","_","pārtha","NC","","_","_"
5,"_","_","_","nārāyaṇa","NC","","_","_"
6,"_","_","_","jaya","NC","","_","_"
7,"mṛdhe","_","_","mṛdha","NC","","_","_"
1,"nāmāni","_","_","nāman","NC","","_","_"
2,"_","_","_","ca","CCD","","_","_"
3,"_","_","_","eva","CEM","","_","_"
4,"guhyāni","_","_","guhya","JJ","","_","_"
5,"niruktāni","_","_","nirukta","NC","","_","_"
6,"ca","_","_","ca","CCD","","_","_"
7,"bhārata","_","_","bhārata","NC","","_","_"
1,"ṛṣibhiḥ","_","_","ṛṣi","NC","","_","_"
2,"_","_","_","kathay","PPP","","_","_"
3,"_","_","_","iha","CAD","","_","_"
4,"yāni","_","_","yad","PRL","","_","_"
5,"saṃkīrtitāni","_","_","saṃkīrtay","PPP","","_","_"
6,"te","_","_","tvat","PPR","","_","_"
1,"evaṃ","_","_","eva","CX","","_","_"
2,"bahuvidhai","_","_","bahuvidha","JJ","","_","_"
3,"_","_","_","rūpa","NC","","_","_"
4,"_","_","_","car","V","car","_","_"
5,"_","_","_","iha","CAD","","_","_"
6,"vasuṃdharām","_","_","vasuṃdharā","NC","","_","_"
1,"_","_","_","brahman","NC","","_","_"
2,"_","_","_","loka","NC","","_","_"
3,"ca","_","_","ca","CCD","","_","_"
4,"kaunteya","_","_","kaunteya","NC","","_","_"
5,"golokaṃ","_","_","goloka","NC","","_","_"
6,"ca","_","_","ca","CCD","","_","_"
7,"sanātanam","_","_","sanātana","JJ","","_","_"
1,"mayā","_","_","mat","PPR","","_","_"
2,"tvaṃ","_","_","tvat","PPR","","_","_"
3,"rakṣito","_","_","rakṣ","PPP","","_","_"
4,"yuddhe","_","_","yuddha","NC","","_","_"
5,"mahāntaṃ","_","_","mahat","JJ","","_","_"
6,"_","_","_","prāp","KDP","","_","_"
7,"_","_","_","jaya","NC","","_","_"
1,"_","_","_","yad","PRL","","_","_"
2,"_","_","_","tu","CCD","","_","_"
3,"te","_","_","tvat","PPR","","_","_"
4,"so","_","_","tad","PRD","","_","_"
5,"'grato","_","_","agratas","CX","","_","_"
6,"yāti","_","_","yā","V","yā","_","_"
7,"yuddhe","_","_","yuddha","NC","","_","_"
8,"saṃpratyupasthite","_","_","saṃpratyupasthā","PPP","","_","_"
1,"taṃ","_","_","tad","PRD","","_","_"
2,"viddhi","_","_","vid","V","vid","_","_"
3,"rudraṃ","_","_","rudra","NC","","_","_"
4,"kaunteya","_","_","kaunteya","NC","","_","_"
5,"devadevaṃ","_","_","devadeva","NC","","_","_"
6,"kapardinam","_","_","kapardin","NC","","_","_"
1,"kālaḥ","_","_","kāla","NC","","_","_"
2,"sa","_","_","tad","PRD","","_","_"
3,"eva","_","_","eva","CEM","","_","_"
4,"kathitaḥ","_","_","kathay","PPP","","_","_"
5,"_","_","_","krodha","NC","","_","_"
6,"_","_","_","ja","JJ","","_","_"
7,"_","_","_","iti","CQT","","_","_"
8,"mayā","_","_","mat","PPR","","_","_"
9,"tava","_","_","tvat","PPR","","_","_"
1,"_","_","_","nihan","PPP","","_","_"
2,"_","_","_","tad","PRD","","_","_"
3,"vai","_","_","vai","CX","","_","_"
4,"pūrvaṃ","_","_","pūrva","CX","","_","_"
5,"hatavān","_","_","han","KDP","","_","_"
6,"asi","_","_","as","V","as","_","_"
7,"vai","_","_","vai","CX","","_","_"
8,"ripūn","_","_","ripu","NC","","_","_"
1,"_","_","_","aprameya","JJ","","_","_"
2,"_","_","_","prabhāva","NC","","_","_"
3,"taṃ","_","_","tad","PRD","","_","_"
4,"devadevam","_","_","devadeva","NC","","_","_"
5,"umāpatim","_","_","umāpati","NC","","_","_"
1,"namasva","_","_","na","V","na","_","_"
2,"devaṃ","_","_","deva","NC","","_","_"
3,"prayato","_","_","praya","PPP","","_","_"
4,"viśveśaṃ","_","_","viśveśa","NC","","_","_"
5,"haram","_","_","hara","NC","","_","_"
6,"avyayam","_","_","avyaya","JJ","","_","_"
