"WordID","word","NormSTEM","suffix","lemma","PoS","Root","NormSuffix","NormWord"
1,"lomaśa","_","_","lomaśa","NC","","_","_"
2,"uvāca","_","_","vak","V","vac","_","_"
1,"tān","_","_","tad","PRD","","_","_"
2,"uvāca","_","_","vak","V","vac","_","_"
3,"_","_","_","same","PPP","","_","_"
4,"_","_","_","tu","CCD","","_","_"
5,"brahmā","_","_","brahman","NC","","_","_"
6,"_","_","_","loka","NC","","_","_"
7,"_","_","_","pitāmaha","NC","","_","_"
1,"gacchadhvaṃ","_","_","gacch","V","gam","_","_"
2,"vibudhāḥ","_","_","vibudha","NC","","_","_"
3,"sarve","_","_","sarva","JQ","","_","_"
4,"yathākāmaṃ","_","_","yathākāma","JJ","","_","_"
5,"_","_","_","yathā","CCM","","_","_"
6,"_","_","_","īpsay","PPP","","_","_"
1,"mahatā","_","_","mahat","JJ","","_","_"
2,"_","_","_","kāla","NC","","_","_"
3,"_","_","_","yoga","NC","","_","_"
4,"prakṛtiṃ","_","_","prakṛti","NC","","_","_"
5,"yāsyate","_","_","yā","V","yā","_","_"
6,"'rṇavaḥ","_","_","arṇava","NC","","_","_"
1,"jñātīn","_","_","jñāti","NC","","_","_"
2,"vai","_","_","vai","CX","","_","_"
3,"kāraṇaṃ","_","_","kāraṇa","NC","","_","_"
4,"kṛtvā","_","_","kṛ","CGDA","","_","_"
5,"_","_","_","mahat","JJ","","_","_"
6,"_","_","_","rājan","NC","","_","_"
7,"bhagīrathāt","_","_","bhagīratha","NC","","_","_"
1,"yudhiṣṭhira","_","_","yudhiṣṭhira","NC","","_","_"
2,"uvāca","_","_","vak","V","vac","_","_"
1,"kathaṃ","_","_","katha","CX","","_","_"
2,"vai","_","_","vai","CX","","_","_"
3,"jñātayo","_","_","jñāti","NC","","_","_"
4,"brahman","_","_","brahman","NC","","_","_"
5,"kāraṇaṃ","_","_","kāraṇa","NC","","_","_"
6,"_","_","_","ca","CCD","","_","_"
7,"_","_","_","atra","CAD","","_","_"
8,"kiṃ","_","_","kiṃ","PRQ","","_","_"
9,"mune","_","_","muni","NC","","_","_"
1,"kathaṃ","_","_","katha","CX","","_","_"
2,"samudraḥ","_","_","samudra","NC","","_","_"
3,"_","_","_","pṛ","PPP","","_","_"
4,"_","_","_","ca","CCD","","_","_"
5,"_","_","_","bhagīratha","NC","","_","_"
6,"_","_","_","pariśrama","NC","","_","_"
1,"etad","_","_","tad","PRD","","_","_"
2,"_","_","_","iṣ","V","iṣ","_","_"
3,"_","_","_","mat","PPR","","_","_"
4,"śrotuṃ","_","_","śru","CGDI","","_","_"
5,"vistareṇa","_","_","vistara","NC","","_","_"
6,"tapodhana","_","_","tapodhana","JJ","","_","_"
1,"kathyamānaṃ","_","_","kathay","KDP","","_","_"
2,"tvayā","_","_","tvat","PPR","","_","_"
3,"vipra","_","_","vipra","NC","","_","_"
4,"rājñāṃ","_","_","rājan","NC","","_","_"
5,"caritam","_","_","carita","NC","","_","_"
6,"uttamam","_","_","uttama","JJ","","_","_"
1,"vaiśampāyana","_","_","vaiśampāyana","NC","","_","_"
2,"uvāca","_","_","vak","V","vac","_","_"
1,"evam","_","_","eva","CX","","_","_"
2,"uktas","_","_","vac","PPP","","_","_"
3,"tu","_","_","tu","CCD","","_","_"
4,"_","_","_","vipra","NC","","_","_"
5,"_","_","_","indra","NC","","_","_"
6,"_","_","_","dharma","NC","","_","_"
7,"_","_","_","rājan","NC","","_","_"
8,"mahātmanā","_","_","mahātman","JJ","","_","_"
1,"kathayāmāsa","_","_","kathay","V","kathay","_","_"
2,"māhātmyaṃ","_","_","māhātmya","NC","","_","_"
3,"sagarasya","_","_","sagara","NC","","_","_"
4,"mahātmanaḥ","_","_","mahātman","JJ","","_","_"
1,"lomaśa","_","_","lomaśa","NC","","_","_"
2,"uvāca","_","_","vak","V","vac","_","_"
1,"ikṣvākūṇāṃ","_","_","ikṣvāku","NC","","_","_"
2,"kule","_","_","kula","NC","","_","_"
3,"jātaḥ","_","_","jan","PPP","","_","_"
4,"sagaro","_","_","sagara","NC","","_","_"
5,"nāma","_","_","nāma","CX","","_","_"
6,"pārthivaḥ","_","_","pārthiva","NC","","_","_"
1,"_","_","_","rūpa","NC","","_","_"
2,"_","_","_","sattva","NC","","_","_"
3,"_","_","_","bala","NC","","_","_"
4,"_","_","_","upe","PPP","","_","_"
5,"sa","_","_","tad","PRD","","_","_"
6,"_","_","_","ca","CCD","","_","_"
7,"_","_","_","aputra","JJ","","_","_"
8,"pratāpavān","_","_","pratāpavat","JJ","","_","_"
1,"sa","_","_","tad","PRD","","_","_"
2,"haihayān","_","_","haihaya","NC","","_","_"
3,"samutsādya","_","_","samutsāday","CGDA","","_","_"
4,"tālajaṅghāṃś","_","_","tālajaṅgha","NC","","_","_"
5,"ca","_","_","ca","CCD","","_","_"
6,"bhārata","_","_","bhārata","JJ","","_","_"
1,"vaśe","_","_","vaśa","NC","","_","_"
2,"ca","_","_","ca","CCD","","_","_"
3,"kṛtvā","_","_","kṛ","CGDA","","_","_"
4,"rājño","_","_","rājan","NC","","_","_"
5,"'nyān","_","_","anya","PPX","","_","_"
6,"_","_","_","sva","JJ","","_","_"
7,"_","_","_","rājya","NC","","_","_"
8,"anvaśāsata","_","_","anuśās","V","anuśās","_","_"
1,"tasya","_","_","tad","PRD","","_","_"
2,"bhārye","_","_","bhāryā","NC","","_","_"
3,"_","_","_","tu","CCD","","_","_"
4,"_","_","_","bhav","V","bhū","_","_"
5,"_","_","_","rūpa","NC","","_","_"
6,"_","_","_","yauvana","NC","","_","_"
7,"_","_","_","darpay","PPP","","_","_"
1,"vaidarbhī","_","_","vaidarbhī","NC","","_","_"
2,"_","_","_","bharata","NC","","_","_"
3,"_","_","_","śreṣṭha","JJ","","_","_"
4,"śaibyā","_","_","śaibyā","NC","","_","_"
5,"ca","_","_","ca","CCD","","_","_"
6,"_","_","_","bharata","NC","","_","_"
7,"_","_","_","ṛṣabha","NC","","_","_"
1,"sa","_","_","tad","PRD","","_","_"
2,"_","_","_","putra","NC","","_","_"
3,"_","_","_","kāma","NC","","_","_"
4,"nṛpatis","_","_","nṛpati","NC","","_","_"
5,"tatāpa","_","_","tap","V","tap","_","_"
6,"_","_","_","su","CAD","","_","_"
7,"_","_","_","mahat","JJ","","_","_"
8,"tapaḥ","_","_","tapas","NC","","_","_"
1,"patnībhyāṃ","_","_","patnī","NC","","_","_"
2,"saha","_","_","saha","CX","","_","_"
3,"_","_","_","rājan","NC","","_","_"
4,"_","_","_","indra","NC","","_","_"
5,"kailāsaṃ","_","_","kailāsa","NC","","_","_"
6,"girim","_","_","giri","NC","","_","_"
7,"āśritaḥ","_","_","āśri","PPP","","_","_"
1,"sa","_","_","tad","PRD","","_","_"
2,"tapyamānaḥ","_","_","tap","KDP","","_","_"
3,"_","_","_","su","CAD","","_","_"
4,"_","_","_","mahat","JJ","","_","_"
5,"tapo","_","_","tapas","NC","","_","_"
6,"_","_","_","yoga","NC","","_","_"
7,"_","_","_","samanvita","JJ","","_","_"
1,"āsasāda","_","_","āsīd","V","āsad","_","_"
2,"mahātmānaṃ","_","_","mahātman","JJ","","_","_"
3,"tryakṣaṃ","_","_","tryakṣa","NC","","_","_"
4,"_","_","_","tripura","NC","","_","_"
5,"_","_","_","mardana","JJ","","_","_"
1,"śaṃkaraṃ","_","_","śaṃkara","NC","","_","_"
2,"bhavam","_","_","bhava","NC","","_","_"
3,"īśānaṃ","_","_","īśāna","NC","","_","_"
4,"śūlapāṇiṃ","_","_","śūlapāṇi","NC","","_","_"
5,"pinākinam","_","_","pinākin","NC","","_","_"
1,"tryambakaṃ","_","_","tryambaka","NC","","_","_"
2,"śivam","_","_","śiva","NC","","_","_"
3,"ugreśaṃ","_","_","ugreśa","NC","","_","_"
4,"_","_","_","bahu","JJ","","_","_"
5,"_","_","_","rūpa","NC","","_","_"
6,"umāpatim","_","_","umāpati","NC","","_","_"
1,"sa","_","_","tad","PRD","","_","_"
2,"taṃ","_","_","tad","PRD","","_","_"
3,"_","_","_","dṛś","CGDA","","_","_"
4,"_","_","_","eva","CEM","","_","_"
5,"_","_","_","vara","NC","","_","_"
6,"_","_","_","da","JJ","","_","_"
7,"patnībhyāṃ","_","_","patnī","NC","","_","_"
8,"sahito","_","_","sahita","JJ","","_","_"
9,"nṛpaḥ","_","_","nṛpa","NC","","_","_"
1,"praṇipatya","_","_","praṇipat","CGDA","","_","_"
2,"_","_","_","mahat","JJ","","_","_"
3,"_","_","_","bāhu","NC","","_","_"
4,"_","_","_","putra","NC","","_","_"
5,"_","_","_","artha","NC","","_","_"
6,"samayācata","_","_","saṃyāc","V","saṃyāc","_","_"
1,"taṃ","_","_","tad","PRD","","_","_"
2,"prītimān","_","_","prītimat","JJ","","_","_"
3,"haraḥ","_","_","hara","NC","","_","_"
4,"prāha","_","_","prāh","V","prāh","_","_"
5,"_","_","_","sa_saha","CX","","_","_"
6,"_","_","_","bhāryā","NC","","_","_"
7,"_","_","_","nṛpa","NC","","_","_"
8,"_","_","_","sattama","JJ","","_","_"
1,"yasmin","_","_","yad","PRL","","_","_"
2,"vṛto","_","_","vṛ","PPP","","_","_"
3,"muhūrte","_","_","muhūrta","NC","","_","_"
4,"'haṃ","_","_","mat","PPR","","_","_"
5,"_","_","_","tvat","PPR","","_","_"
6,"_","_","_","iha","CAD","","_","_"
7,"nṛpate","_","_","nṛpati","NC","","_","_"
8,"varam","_","_","vara","NC","","_","_"
1,"ṣaṣṭiḥ","_","_","ṣaṣṭi","NC","","_","_"
2,"_","_","_","putra","NC","","_","_"
3,"_","_","_","sahasra","NUM","","_","_"
4,"śūrāḥ","_","_","śūra","NC","","_","_"
5,"_","_","_","samara","NC","","_","_"
6,"_","_","_","darpay","PPP","","_","_"
1,"ekasyāṃ","_","_","eka","PPX","","_","_"
2,"sambhaviṣyanti","_","_","sambhav","V","sambhū","_","_"
3,"patnyāṃ","_","_","patnī","NC","","_","_"
4,"tava","_","_","tvat","PPR","","_","_"
5,"_","_","_","nara","NC","","_","_"
6,"_","_","_","uttama","JJ","","_","_"
1,"te","_","_","tad","PRD","","_","_"
2,"_","_","_","ca","CCD","","_","_"
3,"_","_","_","eva","CEM","","_","_"
4,"sarve","_","_","sarva","JQ","","_","_"
5,"sahitāḥ","_","_","sahita","JJ","","_","_"
6,"kṣayaṃ","_","_","kṣaya","NC","","_","_"
7,"yāsyanti","_","_","yā","V","yā","_","_"
8,"pārthiva","_","_","pārthiva","NC","","_","_"
1,"eko","_","_","eka","PPX","","_","_"
2,"_","_","_","vaṃśa","NC","","_","_"
3,"_","_","_","dhara","JJ","","_","_"
4,"śūra","_","_","śūra","NC","","_","_"
5,"ekasyāṃ","_","_","eka","PPX","","_","_"
6,"sambhaviṣyati","_","_","sambhav","V","sambhū","_","_"
1,"evam","_","_","eva","CX","","_","_"
2,"uktvā","_","_","vac","CGDA","","_","_"
3,"tu","_","_","tu","CCD","","_","_"
4,"taṃ","_","_","tad","PRD","","_","_"
5,"rudras","_","_","rudra","NC","","_","_"
6,"_","_","_","tatra","CAD","","_","_"
7,"_","_","_","eva","CEM","","_","_"
8,"_","_","_","antardhā","V","antardhā","_","_"
1,"sa","_","_","tad","PRD","","_","_"
2,"_","_","_","ca","CCD","","_","_"
3,"_","_","_","api","CX","","_","_"
4,"sagaro","_","_","sagara","NC","","_","_"
5,"rājā","_","_","rājan","NC","","_","_"
6,"jagāma","_","_","ga","V","ga","_","_"
7,"svaṃ","_","_","sva","JJ","","_","_"
8,"niveśanam","_","_","niveśana","NC","","_","_"
1,"patnībhyāṃ","_","_","patnī","NC","","_","_"
2,"sahitas","_","_","sahita","JJ","","_","_"
3,"tāta","_","_","tāta","NC","","_","_"
4,"so","_","_","tad","PRD","","_","_"
5,"_","_","_","ati","CADP","","_","_"
6,"_","_","_","hṛṣ","PPP","","_","_"
7,"_","_","_","manas","NC","","_","_"
8,"tadā","_","_","tadā","CAD","","_","_"
1,"_","_","_","tad","PRD","","_","_"
2,"_","_","_","atha","CAD","","_","_"
3,"_","_","_","manuja","NC","","_","_"
4,"_","_","_","śreṣṭha","JJ","","_","_"
5,"te","_","_","tad","PRD","","_","_"
6,"bhārye","_","_","bhāryā","NC","","_","_"
7,"_","_","_","kamala","NC","","_","_"
8,"_","_","_","īkṣaṇa","NC","","_","_"
1,"vaidarbhī","_","_","vaidarbhī","NC","","_","_"
2,"_","_","_","ca","CCD","","_","_"
3,"_","_","_","eva","CEM","","_","_"
4,"śaibyā","_","_","śaibyā","NC","","_","_"
5,"ca","_","_","ca","CCD","","_","_"
6,"garbhiṇyau","_","_","garbhiṇī","NC","","_","_"
7,"saṃbabhūvatuḥ","_","_","sambhav","V","sambhū","_","_"
1,"tataḥ","_","_","tatas","CX","","_","_"
2,"kālena","_","_","kāla","NC","","_","_"
3,"vaidarbhī","_","_","vaidarbhī","NC","","_","_"
4,"_","_","_","garbha","NC","","_","_"
5,"_","_","_","alābu","NC","","_","_"
6,"vyajāyata","_","_","vijan","V","vijan","_","_"
1,"śaibyā","_","_","śaibyā","NC","","_","_"
2,"ca","_","_","ca","CCD","","_","_"
3,"suṣuve","_","_","suv","V","sū","_","_"
4,"putraṃ","_","_","putra","NC","","_","_"
5,"kumāraṃ","_","_","kumāra","NC","","_","_"
6,"_","_","_","deva","NC","","_","_"
7,"_","_","_","rūpin","JJ","","_","_"
1,"_","_","_","tadā","CAD","","_","_"
2,"_","_","_","alābu","NC","","_","_"
3,"samutsraṣṭuṃ","_","_","samutsṛj","CGDI","","_","_"
4,"_","_","_","manas","NC","","_","_"
5,"_","_","_","kar","V","kṛ","_","_"
6,"sa","_","_","tad","PRD","","_","_"
7,"pārthivaḥ","_","_","pārthiva","NC","","_","_"
1,"_","_","_","atha","CAD","","_","_"
2,"_","_","_","antarikṣa","NC","","_","_"
3,"_","_","_","śṛṇ","V","śru","_","_"
4,"vācaṃ","_","_","vāc","NC","","_","_"
5,"_","_","_","gambhīra","JJ","","_","_"
6,"_","_","_","nisvana","NC","","_","_"
1,"rājan","_","_","rājan","NC","","_","_"
2,"mā","_","_","mā","CNG","","_","_"
3,"sāhasaṃ","_","_","sāhasa","NC","","_","_"
4,"kārṣīḥ","_","_","kar","V","kṛ","_","_"
5,"putrān","_","_","putra","NC","","_","_"
6,"na","_","_","na","CNG","","_","_"
7,"tyaktum","_","_","tyaj","CGDI","","_","_"
8,"arhasi","_","_","arh","V","arh","_","_"
1,"_","_","_","alābu","NC","","_","_"
2,"_","_","_","madhya","NC","","_","_"
3,"niṣkṛṣya","_","_","niṣkṛṣ","CGDA","","_","_"
4,"bījaṃ","_","_","bīja","NC","","_","_"
5,"yatnena","_","_","yatna","NC","","_","_"
6,"gopyatām","_","_","gopay","V","gopay","_","_"
1,"_","_","_","sa_saha","CX","","_","_"
2,"_","_","_","upasveda","NC","","_","_"
3,"pātreṣu","_","_","pātra","NC","","_","_"
4,"_","_","_","ghṛta","NC","","_","_"
5,"_","_","_","pṛ","PPP","","_","_"
6,"bhāgaśaḥ","_","_","bhāgaśas","CX","","_","_"
1,"tataḥ","_","_","tatas","CX","","_","_"
2,"_","_","_","putra","NC","","_","_"
3,"_","_","_","sahasra","NUM","","_","_"
4,"ṣaṣṭiṃ","_","_","ṣaṣṭi","NC","","_","_"
5,"prāpsyasi","_","_","prāpn","V","prāp","_","_"
6,"pārthiva","_","_","pārthiva","NC","","_","_"
1,"mahādevena","_","_","mahādeva","NC","","_","_"
2,"diṣṭaṃ","_","_","diś","PPP","","_","_"
3,"te","_","_","tvat","PPR","","_","_"
4,"_","_","_","putra","NC","","_","_"
5,"_","_","_","janman","NC","","_","_"
6,"narādhipa","_","_","narādhipa","NC","","_","_"
1,"anena","_","_","ida","PRD","","_","_"
2,"_","_","_","krama","NC","","_","_"
3,"_","_","_","yoga","NC","","_","_"
4,"mā","_","_","mat","PPR","","_","_"
5,"te","_","_","tad","PRD","","_","_"
6,"buddhir","_","_","buddhi","NC","","_","_"
7,"ato","_","_","atas","CX","","_","_"
8,"'nyathā","_","_","anyathā","CX","","_","_"
