"WordID","word","NormSTEM","suffix","lemma","PoS","Root","NormSuffix","NormWord"
1,"saṃjaya","_","_","saṃjaya","NC","","_","_"
2,"uvāca","_","_","vak","V","vac","_","_"
1,"duryodhano","_","_","duryodhana","NC","","_","_"
2,"_","_","_","mahat","JJ","","_","_"
3,"_","_","_","rāja","NC","","_","_"
4,"_","_","_","dhṛṣṭadyumna","NC","","_","_"
5,"_","_","_","ca","CCD","","_","_"
6,"pārṣataḥ","_","_","pārṣata","NC","","_","_"
1,"cakratuḥ","_","_","kar","V","kṛ","_","_"
2,"_","_","_","su","CAD","","_","_"
3,"_","_","_","mahat","JJ","","_","_"
4,"yuddhaṃ","_","_","yuddha","NC","","_","_"
5,"_","_","_","śara","NC","","_","_"
6,"_","_","_","śakti","NC","","_","_"
7,"_","_","_","samākula","JJ","","_","_"
1,"tayor","_","_","tad","PRD","","_","_"
2,"_","_","_","as","V","as","_","_"
3,"_","_","_","mahat","JJ","","_","_"
4,"_","_","_","rāja","NC","","_","_"
5,"_","_","_","śara","NC","","_","_"
6,"_","_","_","dhārā","NC","","_","_"
7,"sahasraśaḥ","_","_","sahasraśas","CX","","_","_"
1,"ambudānāṃ","_","_","ambuda","NC","","_","_"
2,"yathā","_","_","yathā","CCM","","_","_"
3,"kāle","_","_","kāla","NC","","_","_"
4,"_","_","_","jala","NC","","_","_"
5,"_","_","_","dhārā","NC","","_","_"
6,"samantataḥ","_","_","samantataḥ","CX","","_","_"
1,"rājā","_","_","rājan","NC","","_","_"
2,"tu","_","_","tu","CCD","","_","_"
3,"pārṣataṃ","_","_","pārṣata","NC","","_","_"
4,"viddhvā","_","_","vyadh","CGDA","","_","_"
5,"śaraiḥ","_","_","śara","NC","","_","_"
6,"pañcabhir","_","_","pañcan","NUM","","_","_"
7,"āyasaiḥ","_","_","āyasa","JJ","","_","_"
1,"_","_","_","droṇa","NC","","_","_"
2,"_","_","_","hantṛ","JJ","","_","_"
3,"_","_","_","ugra","JJ","","_","_"
4,"_","_","_","iṣu","NC","","_","_"
5,"punar","_","_","punar","CAD","","_","_"
6,"vivyādha","_","_","vyadh","V","vyadh","_","_"
7,"saptabhiḥ","_","_","saptan","NUM","","_","_"
1,"_","_","_","dhṛṣṭadyumna","NC","","_","_"
2,"_","_","_","tu","CCD","","_","_"
3,"samare","_","_","samara","NC","","_","_"
4,"balavān","_","_","balavat","JJ","","_","_"
5,"_","_","_","dṛḍha","JJ","","_","_"
6,"_","_","_","vikrama","NC","","_","_"
1,"saptatyā","_","_","saptati","NC","","_","_"
2,"viśikhānāṃ","_","_","viśikha","NC","","_","_"
3,"vai","_","_","vai","CX","","_","_"
4,"duryodhanam","_","_","duryodhana","NC","","_","_"
5,"apīḍayat","_","_","pīḍay","V","pīḍay","_","_"
1,"pīḍitaṃ","_","_","pīḍay","PPP","","_","_"
2,"prekṣya","_","_","prekṣ","CGDA","","_","_"
3,"rājānaṃ","_","_","rājan","NC","","_","_"
4,"sodaryā","_","_","sodarya","JJ","","_","_"
5,"_","_","_","bharata","NC","","_","_"
6,"_","_","_","ṛṣabha","NC","","_","_"
1,"mahatyā","_","_","mahat","JJ","","_","_"
2,"senayā","_","_","senā","NC","","_","_"
3,"sārdhaṃ","_","_","sārdha","CX","","_","_"
4,"parivavruḥ","_","_","parivṛ","V","parivṛ","_","_"
5,"sma","_","_","sma","CX","","_","_"
6,"pārṣatam","_","_","pārṣata","NC","","_","_"
1,"sa","_","_","tad","PRD","","_","_"
2,"taiḥ","_","_","tad","PRD","","_","_"
3,"parivṛtaḥ","_","_","parivṛ","PPP","","_","_"
4,"śūraiḥ","_","_","śūra","NC","","_","_"
5,"sarvato","_","_","sarvatas","CX","","_","_"
6,"'tirathair","_","_","atiratha","NC","","_","_"
7,"bhṛśam","_","_","bhṛśa","CX","","_","_"
1,"vyacarat","_","_","vicar","V","vicar","_","_"
2,"samare","_","_","samara","NC","","_","_"
3,"rājan","_","_","rājan","NC","","_","_"
4,"darśayan","_","_","darśay","KDP","","_","_"
5,"_","_","_","hasta","NC","","_","_"
6,"_","_","_","lāghava","NC","","_","_"
1,"śikhaṇḍī","_","_","śikhaṇḍin","NC","","_","_"
2,"kṛtavarmāṇaṃ","_","_","kṛtavarman","NC","","_","_"
3,"gautamaṃ","_","_","gautama","NC","","_","_"
4,"ca","_","_","ca","CCD","","_","_"
5,"_","_","_","mahat","JJ","","_","_"
6,"_","_","_","ratha","NC","","_","_"
1,"prabhadrakaiḥ","_","_","prabhadraka","NC","","_","_"
2,"samāyukto","_","_","samāyuj","PPP","","_","_"
3,"yodhayāmāsa","_","_","yodhay","V","yodhay","_","_"
4,"dhanvinau","_","_","dhanvin","JJ","","_","_"
1,"_","_","_","tatra","CAD","","_","_"
2,"_","_","_","api","CX","","_","_"
3,"_","_","_","su","CAD","","_","_"
4,"_","_","_","mahat","JJ","","_","_"
5,"yuddhaṃ","_","_","yuddha","NC","","_","_"
6,"_","_","_","ghora","JJ","","_","_"
7,"_","_","_","rūpa","NC","","_","_"
8,"viśāṃ","_","_","viś","NC","","_","_"
9,"pate","_","_","pati","NC","","_","_"
1,"prāṇān","_","_","prāṇa","NC","","_","_"
2,"saṃtyajatāṃ","_","_","saṃtyaj","KDP","","_","_"
3,"yuddhe","_","_","yuddha","NC","","_","_"
4,"_","_","_","prāṇa","NC","","_","_"
5,"_","_","_","dyūta","NC","","_","_"
6,"_","_","_","abhidevana","NC","","_","_"
1,"_","_","_","śalya","NC","","_","_"
2,"_","_","_","tu","CCD","","_","_"
3,"_","_","_","śara","NC","","_","_"
4,"_","_","_","varṣa","NC","","_","_"
5,"vimuñcan","_","_","vimuc","KDP","","_","_"
6,"sarvatodiśam","_","_","sarvatodiśa","CX","","_","_"
1,"pāṇḍavān","_","_","pāṇḍava","NC","","_","_"
2,"pīḍayāmāsa","_","_","pīḍay","V","pīḍay","_","_"
3,"_","_","_","sa_saha","CX","","_","_"
4,"_","_","_","sātyaki","NC","","_","_"
5,"_","_","_","vṛkodara","NC","","_","_"
1,"_","_","_","tathā","CX","","_","_"
2,"_","_","_","ubh","PPX","","_","_"
3,"ca","_","_","ca","CCD","","_","_"
4,"yamau","_","_","yama","NC","","_","_"
5,"yuddhe","_","_","yuddha","NC","","_","_"
6,"_","_","_","yama","NC","","_","_"
7,"_","_","_","tulya","JJ","","_","_"
8,"_","_","_","parākrama","NC","","_","_"
1,"yodhayāmāsa","_","_","yodhay","V","yodhay","_","_"
2,"_","_","_","rājan","NC","","_","_"
3,"_","_","_","indra","NC","","_","_"
4,"vīryeṇa","_","_","vīrya","NC","","_","_"
5,"ca","_","_","ca","CCD","","_","_"
6,"balena","_","_","bala","NC","","_","_"
7,"ca","_","_","ca","CCD","","_","_"
1,"_","_","_","śalya","NC","","_","_"
2,"_","_","_","sāyaka","NC","","_","_"
3,"_","_","_","nud","PPP","","_","_"
4,"pāṇḍavānāṃ","_","_","pāṇḍava","NC","","_","_"
5,"_","_","_","mahat","JJ","","_","_"
6,"_","_","_","mṛdha","NC","","_","_"
1,"trātāraṃ","_","_","trātṛ","NC","","_","_"
2,"_","_","_","na","CNG","","_","_"
3,"_","_","_","adhiga","V","adhiga","_","_"
4,"kecit","_","_","kiṃcit","PRI","","_","_"
5,"tatra","_","_","tatra","CAD","","_","_"
6,"_","_","_","mahat","JJ","","_","_"
7,"_","_","_","ratha","NC","","_","_"
1,"_","_","_","tatas","CX","","_","_"
2,"_","_","_","tu","CCD","","_","_"
3,"nakulaḥ","_","_","nakula","NC","","_","_"
4,"śūro","_","_","śūra","NC","","_","_"
5,"dharmarāje","_","_","dharmarāja","NC","","_","_"
6,"prapīḍite","_","_","prapīḍay","PPP","","_","_"
1,"abhidudrāva","_","_","abhidru","V","abhidru","_","_"
2,"vegena","_","_","vega","NC","","_","_"
3,"mātulaṃ","_","_","mātula","NC","","_","_"
4,"mādrinandanaḥ","_","_","mādrinandana","NC","","_","_"
1,"saṃchādya","_","_","saṃchāday","CGDA","","_","_"
2,"samare","_","_","samara","NC","","_","_"
3,"śalyaṃ","_","_","śalya","NC","","_","_"
4,"nakulaḥ","_","_","nakula","NC","","_","_"
5,"_","_","_","para","PPX","","_","_"
6,"_","_","_","vīra","NC","","_","_"
7,"_","_","_","han","JJ","","_","_"
1,"vivyādha","_","_","vyadh","V","vyadh","_","_"
2,"_","_","_","ca","CCD","","_","_"
3,"_","_","_","a","PRD","","_","_"
4,"daśabhiḥ","_","_","daśan","NUM","","_","_"
5,"smayamānaḥ","_","_","smi","KDP","","_","_"
6,"stanāntare","_","_","stanāntara","NC","","_","_"
1,"_","_","_","sarva","JQ","","_","_"
2,"_","_","_","pāraśava","JJ","","_","_"
3,"bāṇaiḥ","_","_","bāṇa","NC","","_","_"
4,"_","_","_","karmāra","NC","","_","_"
5,"_","_","_","parimārjay","PPP","","_","_"
1,"_","_","_","svarṇa","NC","","_","_"
2,"_","_","_","puṅkha","NC","","_","_"
3,"_","_","_","śilā","NC","","_","_"
4,"_","_","_","dhāv","PPP","","_","_"
5,"_","_","_","dhanus","NC","","_","_"
6,"_","_","_","yantra","NC","","_","_"
7,"_","_","_","pracoday","PPP","","_","_"
1,"_","_","_","śalya","NC","","_","_"
2,"_","_","_","tu","CCD","","_","_"
3,"_","_","_","pīḍay","PPP","","_","_"
4,"_","_","_","tad","PRD","","_","_"
5,"svasrīyeṇa","_","_","svasrīya","NC","","_","_"
6,"mahātmanā","_","_","mahātman","JJ","","_","_"
1,"nakulaṃ","_","_","nakula","NC","","_","_"
2,"pīḍayāmāsa","_","_","pīḍay","V","pīḍay","_","_"
3,"patribhir","_","_","pattrin","NC","","_","_"
4,"_","_","_","na","PPP","","_","_"
5,"_","_","_","parvan","NC","","_","_"
1,"tato","_","_","tatas","CX","","_","_"
2,"yudhiṣṭhiro","_","_","yudhiṣṭhira","NC","","_","_"
3,"rājā","_","_","rājan","NC","","_","_"
4,"bhīmaseno","_","_","bhīmasa","NC","","_","_"
5,"'tha","_","_","atha","CAD","","_","_"
6,"sātyakiḥ","_","_","sātyaki","NC","","_","_"
1,"_","_","_","sahadeva","NC","","_","_"
2,"_","_","_","ca","CCD","","_","_"
3,"mādreyo","_","_","mādreya","NC","","_","_"
4,"_","_","_","madra","NC","","_","_"
5,"_","_","_","rāja","NC","","_","_"
6,"upādravan","_","_","upadru","V","upadru","_","_"
1,"tān","_","_","tad","PRD","","_","_"
2,"āpatata","_","_","āpat","KDP","","_","_"
3,"_","_","_","eva","CEM","","_","_"
4,"_","_","_","āśu","CX","","_","_"
5,"pūrayānān","_","_","pūray","KDP","","_","_"
6,"_","_","_","ratha","NC","","_","_"
7,"_","_","_","svana","NC","","_","_"
1,"_","_","_","diś","NC","","_","_"
2,"_","_","_","ca","CCD","","_","_"
3,"_","_","_","pradiś","NC","","_","_"
4,"_","_","_","ca","CCD","","_","_"
5,"_","_","_","eva","CEM","","_","_"
6,"_","_","_","kampay","KDP","","_","_"
7,"_","_","_","ca","CCD","","_","_"
8,"medinīm","_","_","medinī","NC","","_","_"
1,"pratijagrāha","_","_","pratigrah","V","pratigrah","_","_"
2,"samare","_","_","samara","NC","","_","_"
3,"senāpatir","_","_","senāpati","NC","","_","_"
4,"_","_","_","amitra","NC","","_","_"
5,"_","_","_","jit","JJ","","_","_"
1,"yudhiṣṭhiraṃ","_","_","yudhiṣṭhira","NC","","_","_"
2,"tribhir","_","_","tri","NUM","","_","_"
3,"viddhvā","_","_","vyadh","CGDA","","_","_"
4,"bhīmasenaṃ","_","_","bhīmasa","NC","","_","_"
5,"ca","_","_","ca","CCD","","_","_"
6,"saptabhiḥ","_","_","saptan","NUM","","_","_"
1,"sātyakiṃ","_","_","sātyaki","NC","","_","_"
2,"ca","_","_","ca","CCD","","_","_"
3,"_","_","_","śata","NUM","","_","_"
4,"_","_","_","āji","NC","","_","_"
5,"sahadevaṃ","_","_","sahadeva","NC","","_","_"
6,"tribhiḥ","_","_","tri","NUM","","_","_"
7,"śaraiḥ","_","_","śara","NC","","_","_"
1,"_","_","_","tatas","CX","","_","_"
2,"_","_","_","tu","CCD","","_","_"
3,"_","_","_","sa_saha","CX","","_","_"
4,"_","_","_","śara","NC","","_","_"
5,"cāpaṃ","_","_","cāpa","NC","","_","_"
6,"nakulasya","_","_","nakula","NC","","_","_"
7,"mahātmanaḥ","_","_","mahātman","JJ","","_","_"
1,"_","_","_","madra","NC","","_","_"
2,"_","_","_","īśvara","NC","","_","_"
3,"kṣurapreṇa","_","_","kṣurapra","NC","","_","_"
4,"tadā","_","_","tadā","CAD","","_","_"
5,"cicheda","_","_","chid","V","chid","_","_"
6,"māriṣa","_","_","māriṣa","NC","","_","_"
1,"tad","_","_","tad","PRD","","_","_"
2,"aśīryata","_","_","śṛ","V","śṛ","_","_"
3,"vicchinnaṃ","_","_","vicchid","PPP","","_","_"
4,"dhanuḥ","_","_","dhanus","NC","","_","_"
5,"śalyasya","_","_","śalya","NC","","_","_"
6,"sāyakaiḥ","_","_","sāyaka","NC","","_","_"
1,"_","_","_","atha","CAD","","_","_"
2,"_","_","_","anya","PPX","","_","_"
3,"dhanur","_","_","dhanus","NC","","_","_"
4,"ādāya","_","_","ādā","CGDA","","_","_"
5,"_","_","_","mādrī","NC","","_","_"
6,"_","_","_","putra","NC","","_","_"
7,"_","_","_","mahat","JJ","","_","_"
8,"_","_","_","ratha","NC","","_","_"
1,"_","_","_","madra","NC","","_","_"
2,"_","_","_","rājan","NC","","_","_"
3,"_","_","_","ratha","NC","","_","_"
4,"tūrṇaṃ","_","_","tūrṇa","CX","","_","_"
5,"pūrayāmāsa","_","_","pūray","V","pūray","_","_"
6,"patribhiḥ","_","_","pattrin","NC","","_","_"
1,"_","_","_","yudhiṣṭhira","NC","","_","_"
2,"_","_","_","tu","CCD","","_","_"
3,"_","_","_","madra","NC","","_","_"
4,"_","_","_","īśa","NC","","_","_"
5,"_","_","_","sahadeva","NC","","_","_"
6,"_","_","_","ca","CCD","","_","_"
7,"māriṣa","_","_","māriṣa","NC","","_","_"
1,"daśabhir","_","_","daśan","NUM","","_","_"
2,"daśabhir","_","_","daśan","NUM","","_","_"
3,"bāṇair","_","_","bāṇa","NC","","_","_"
4,"_","_","_","uras","NC","","_","_"
5,"_","_","_","a","PRD","","_","_"
6,"avidhyatām","_","_","vyadh","V","vyadh","_","_"
1,"_","_","_","bhīmasa","NC","","_","_"
2,"_","_","_","tatas","CX","","_","_"
3,"ṣaṣṭyā","_","_","ṣaṣṭi","NC","","_","_"
4,"sātyakir","_","_","sātyaki","NC","","_","_"
5,"navabhiḥ","_","_","navan","NUM","","_","_"
6,"śaraiḥ","_","_","śara","NC","","_","_"
1,"_","_","_","madra","NC","","_","_"
2,"_","_","_","rāja","NC","","_","_"
3,"abhidrutya","_","_","abhidru","CGDA","","_","_"
4,"jaghnatuḥ","_","_","han","V","han","_","_"
5,"_","_","_","kaṅka","NC","","_","_"
6,"_","_","_","pattrin","JJ","","_","_"
1,"_","_","_","madra","NC","","_","_"
2,"_","_","_","rāja","NC","","_","_"
3,"_","_","_","tatas","CX","","_","_"
4,"kruddhaḥ","_","_","krudh","PPP","","_","_"
5,"sātyakiṃ","_","_","sātyaki","NC","","_","_"
6,"navabhiḥ","_","_","navan","NUM","","_","_"
7,"śaraiḥ","_","_","śara","NC","","_","_"
1,"vivyādha","_","_","vyadh","V","vyadh","_","_"
2,"bhūyaḥ","_","_","bhūyas","CX","","_","_"
3,"saptatyā","_","_","saptati","NC","","_","_"
4,"śarāṇāṃ","_","_","śara","NC","","_","_"
5,"_","_","_","na","PPP","","_","_"
6,"_","_","_","parvan","NC","","_","_"
1,"_","_","_","atha","CAD","","_","_"
2,"_","_","_","ida","PRD","","_","_"
3,"_","_","_","sa_saha","CX","","_","_"
4,"_","_","_","śara","NC","","_","_"
5,"cāpaṃ","_","_","cāpa","NC","","_","_"
6,"muṣṭau","_","_","muṣṭi","NC","","_","_"
7,"cicheda","_","_","chid","V","chid","_","_"
8,"māriṣa","_","_","māriṣa","NC","","_","_"
1,"_","_","_","haya","NC","","_","_"
2,"_","_","_","ca","CCD","","_","_"
3,"caturaḥ","_","_","catur","NUM","","_","_"
4,"saṃkhye","_","_","saṃkhya","NC","","_","_"
5,"preṣayāmāsa","_","_","preṣay","V","preṣay","_","_"
6,"mṛtyave","_","_","mṛtyu","NC","","_","_"
1,"virathaṃ","_","_","viratha","JJ","","_","_"
2,"sātyakiṃ","_","_","sātyaki","NC","","_","_"
3,"kṛtvā","_","_","kṛ","CGDA","","_","_"
4,"_","_","_","madra","NC","","_","_"
5,"_","_","_","rāja","NC","","_","_"
6,"_","_","_","mahat","JJ","","_","_"
7,"_","_","_","bala","NC","","_","_"
1,"viśikhānāṃ","_","_","viśikha","NC","","_","_"
2,"_","_","_","śata","NUM","","_","_"
3,"_","_","_","a","PRD","","_","_"
4,"ājaghāna","_","_","āhan","V","āhan","_","_"
5,"samantataḥ","_","_","samantataḥ","CX","","_","_"
1,"_","_","_","mādrī","NC","","_","_"
2,"_","_","_","putra","NC","","_","_"
3,"tu","_","_","tu","CCD","","_","_"
4,"saṃrabdhau","_","_","saṃrabh","PPP","","_","_"
5,"bhīmasenaṃ","_","_","bhīmasa","NC","","_","_"
6,"ca","_","_","ca","CCD","","_","_"
7,"pāṇḍavam","_","_","pāṇḍava","NC","","_","_"
1,"yudhiṣṭhiraṃ","_","_","yudhiṣṭhira","NC","","_","_"
2,"ca","_","_","ca","CCD","","_","_"
3,"kauravya","_","_","kauravya","NC","","_","_"
4,"vivyādha","_","_","vyadh","V","vyadh","_","_"
5,"daśabhiḥ","_","_","daśan","NUM","","_","_"
6,"śaraiḥ","_","_","śara","NC","","_","_"
1,"_","_","_","tatra","CAD","","_","_"
2,"_","_","_","adbhuta","JJ","","_","_"
3,"apaśyāma","_","_","paś","V","paś","_","_"
4,"_","_","_","madra","NC","","_","_"
5,"_","_","_","rāja","NC","","_","_"
6,"pauruṣam","_","_","pauruṣa","NC","","_","_"
1,"yad","_","_","yat","CSB","","_","_"
2,"enaṃ","_","_","a","PRD","","_","_"
3,"sahitāḥ","_","_","sahita","JJ","","_","_"
4,"pārthā","_","_","pārtha","NC","","_","_"
5,"_","_","_","na","CNG","","_","_"
6,"_","_","_","abhivart","V","abhivṛt","_","_"
7,"saṃyuge","_","_","saṃyuga","NC","","_","_"
1,"_","_","_","atha","CAD","","_","_"
2,"_","_","_","anya","PPX","","_","_"
3,"ratham","_","_","ratha","NC","","_","_"
4,"āsthāya","_","_","āsthā","CGDA","","_","_"
5,"sātyakiḥ","_","_","sātyaki","NC","","_","_"
6,"_","_","_","satya","JJ","","_","_"
7,"_","_","_","vikrama","NC","","_","_"
1,"pīḍitān","_","_","pīḍay","PPP","","_","_"
2,"pāṇḍavān","_","_","pāṇḍava","NC","","_","_"
3,"dṛṣṭvā","_","_","dṛś","CGDA","","_","_"
4,"_","_","_","madra","NC","","_","_"
5,"_","_","_","rājan","NC","","_","_"
6,"_","_","_","vaśa","NC","","_","_"
7,"gatān","_","_","ga","PPP","","_","_"
1,"abhidudrāva","_","_","abhidru","V","abhidru","_","_"
2,"vegena","_","_","vega","NC","","_","_"
3,"madrāṇām","_","_","madra","NC","","_","_"
4,"adhipaṃ","_","_","adhipa","NC","","_","_"
5,"balī","_","_","balin","JJ","","_","_"
1,"āpatantaṃ","_","_","āpat","KDP","","_","_"
2,"rathaṃ","_","_","ratha","NC","","_","_"
3,"tasya","_","_","tad","PRD","","_","_"
4,"śalyaḥ","_","_","śalya","NC","","_","_"
5,"_","_","_","samiti","NC","","_","_"
6,"_","_","_","śobhana","JJ","","_","_"
1,"pratyudyayau","_","_","pratyudyā","V","pratyudyā","_","_"
2,"_","_","_","ratha","NC","","_","_"
3,"_","_","_","eva","CEM","","_","_"
4,"matto","_","_","mat","PPP","","_","_"
5,"mattam","_","_","mat","PPP","","_","_"
6,"iva","_","_","iva","CCM","","_","_"
7,"dvipam","_","_","dvipa","NC","","_","_"
1,"sa","_","_","tad","PRD","","_","_"
2,"_","_","_","saṃnipāta","NC","","_","_"
3,"_","_","_","tumula","JJ","","_","_"
4,"_","_","_","bhav","V","bhū","_","_"
5,"_","_","_","adbhuta","JJ","","_","_"
6,"_","_","_","darśana","NC","","_","_"
1,"_","_","_","sātyaki","NC","","_","_"
2,"_","_","_","ca","CCD","","_","_"
3,"_","_","_","eva","CEM","","_","_"
4,"śūrasya","_","_","śūra","NC","","_","_"
5,"madrāṇām","_","_","madra","NC","","_","_"
6,"adhipasya","_","_","adhipa","NC","","_","_"
7,"ca","_","_","ca","CCD","","_","_"
1,"yādṛśo","_","_","yādṛśa","JJ","","_","_"
2,"vai","_","_","vai","CX","","_","_"
3,"purā","_","_","purā","CX","","_","_"
4,"vṛttaḥ","_","_","vṛt","PPP","","_","_"
5,"_","_","_","śambara","NC","","_","_"
6,"_","_","_","amararāja","NC","","_","_"
1,"sātyakiḥ","_","_","sātyaki","NC","","_","_"
2,"prekṣya","_","_","prekṣ","CGDA","","_","_"
3,"samare","_","_","samara","NC","","_","_"
4,"_","_","_","madra","NC","","_","_"
5,"_","_","_","rāja","NC","","_","_"
6,"vyavasthitam","_","_","vyavasthā","PPP","","_","_"
1,"vivyādha","_","_","vyadh","V","vyadh","_","_"
2,"daśabhir","_","_","daśan","NUM","","_","_"
3,"bāṇais","_","_","bāṇa","NC","","_","_"
4,"tiṣṭha","_","_","tiṣṭh","V","sthā","_","_"
5,"_","_","_","tiṣṭh","V","sthā","_","_"
6,"_","_","_","iti","CQT","","_","_"
7,"_","_","_","ca","CCD","","_","_"
8,"_","_","_","abravīta","V","brū","_","_"
1,"_","_","_","madra","NC","","_","_"
2,"_","_","_","rāja","NC","","_","_"
3,"_","_","_","tu","CCD","","_","_"
4,"_","_","_","su","CAD","","_","_"
5,"_","_","_","bhṛśa","CX","","_","_"
6,"_","_","_","vyadh","PPP","","_","_"
7,"_","_","_","tad","PRD","","_","_"
8,"mahātmanā","_","_","mahātman","JJ","","_","_"
1,"sātyakiṃ","_","_","sātyaki","NC","","_","_"
2,"prativivyādha","_","_","prativyadh","V","prativyadh","_","_"
3,"_","_","_","citra","JJ","","_","_"
4,"_","_","_","puṅkha","NC","","_","_"
5,"śitaiḥ","_","_","śā","PPP","","_","_"
6,"śaraiḥ","_","_","śara","NC","","_","_"
1,"tataḥ","_","_","tatas","CX","","_","_"
2,"pārthā","_","_","pārtha","NC","","_","_"
3,"_","_","_","mahat","JJ","","_","_"
4,"_","_","_","iṣvāsa","NC","","_","_"
5,"_","_","_","sātvata","NC","","_","_"
6,"_","_","_","abhisṛ","PPP","","_","_"
7,"nṛpam","_","_","nṛpa","NC","","_","_"
1,"abhyadravan","_","_","abhidru","V","abhidru","_","_"
2,"_","_","_","ratha","NC","","_","_"
3,"_","_","_","tūrṇa","CX","","_","_"
4,"mātulaṃ","_","_","mātula","NC","","_","_"
5,"_","_","_","vadha","NC","","_","_"
6,"_","_","_","kāmyā","NC","","_","_"
1,"tata","_","_","tatas","CX","","_","_"
2,"āsīt","_","_","as","V","as","_","_"
3,"_","_","_","parāmarda","NC","","_","_"
4,"_","_","_","tumula","JJ","","_","_"
5,"_","_","_","śoṇita","NC","","_","_"
6,"_","_","_","udaka","NC","","_","_"
1,"śūrāṇāṃ","_","_","śūra","NC","","_","_"
2,"yudhyamānānāṃ","_","_","yudh","KDP","","_","_"
3,"siṃhānām","_","_","siṃha","NC","","_","_"
4,"iva","_","_","iva","CCM","","_","_"
5,"nardatām","_","_","nard","KDP","","_","_"
1,"teṣām","_","_","tad","PRD","","_","_"
2,"_","_","_","as","V","as","_","_"
3,"_","_","_","mahat","JJ","","_","_"
4,"_","_","_","rāja","NC","","_","_"
5,"vyatikṣepaḥ","_","_","vyatikṣepa","NC","","_","_"
6,"parasparam","_","_","paraspara","PRC","","_","_"
1,"siṃhānām","_","_","siṃha","NC","","_","_"
2,"_","_","_","āmiṣa","NC","","_","_"
3,"_","_","_","īpsu","JJ","","_","_"
4,"kūjatām","_","_","kūj","KDP","","_","_"
5,"iva","_","_","iva","CCM","","_","_"
6,"saṃyuge","_","_","saṃyuga","NC","","_","_"
1,"teṣāṃ","_","_","tad","PRD","","_","_"
2,"_","_","_","bāṇa","NC","","_","_"
3,"_","_","_","sahasra","NUM","","_","_"
4,"_","_","_","ogha","NC","","_","_"
5,"ākīrṇā","_","_","ākṛ","PPP","","_","_"
6,"_","_","_","vasudhā","NC","","_","_"
7,"_","_","_","bhav","V","bhū","_","_"
1,"antarikṣaṃ","_","_","antarikṣa","NC","","_","_"
2,"ca","_","_","ca","CCD","","_","_"
3,"sahasā","_","_","sahasā","CX","","_","_"
4,"_","_","_","bāṇa","NC","","_","_"
5,"_","_","_","bhū","PPP","","_","_"
6,"abhūt","_","_","bhav","V","bhū","_","_"
7,"tadā","_","_","tadā","CAD","","_","_"
1,"_","_","_","śara","NC","","_","_"
2,"_","_","_","andhakāra","NC","","_","_"
3,"bahudhā","_","_","bahudhā","CX","","_","_"
4,"kṛtaṃ","_","_","kṛ","PPP","","_","_"
5,"tatra","_","_","tatra","CAD","","_","_"
6,"samantataḥ","_","_","samantataḥ","CX","","_","_"
1,"_","_","_","abhra","NC","","_","_"
2,"_","_","_","chāyā","NC","","_","_"
3,"_","_","_","iva","CCM","","_","_"
4,"saṃjajñe","_","_","saṃjan","V","saṃjan","_","_"
5,"śarair","_","_","śara","NC","","_","_"
6,"muktair","_","_","muc","PPP","","_","_"
7,"mahātmabhiḥ","_","_","mahātman","JJ","","_","_"
1,"tatra","_","_","tatra","CAD","","_","_"
2,"rājañ","_","_","rājan","NC","","_","_"
3,"śarair","_","_","śara","NC","","_","_"
4,"muktair","_","_","muc","PPP","","_","_"
5,"nirmuktair","_","_","nirmuc","PPP","","_","_"
6,"iva","_","_","iva","CCM","","_","_"
7,"pannagaiḥ","_","_","pannaga","NC","","_","_"
1,"_","_","_","svarṇa","NC","","_","_"
2,"_","_","_","puṅkha","NC","","_","_"
3,"prakāśadbhir","_","_","prakāś","KDP","","_","_"
4,"vyarocanta","_","_","viroc","V","viruc","_","_"
5,"_","_","_","diś","NC","","_","_"
6,"_","_","_","tathā","CX","","_","_"
1,"_","_","_","tatra","CAD","","_","_"
2,"_","_","_","adbhuta","NC","","_","_"
3,"paraṃ","_","_","para","PPX","","_","_"
4,"cakre","_","_","kar","V","kṛ","_","_"
5,"śalyaḥ","_","_","śalya","NC","","_","_"
6,"_","_","_","śatru","NC","","_","_"
7,"_","_","_","nibarhaṇa","JJ","","_","_"
1,"yad","_","_","yat","CSB","","_","_"
2,"ekaḥ","_","_","eka","PPX","","_","_"
3,"samare","_","_","samara","NC","","_","_"
4,"śūro","_","_","śūra","NC","","_","_"
5,"yodhayāmāsa","_","_","yodhay","V","yodhay","_","_"
6,"vai","_","_","vai","CX","","_","_"
7,"bahūn","_","_","bahu","JJ","","_","_"
1,"_","_","_","madra","NC","","_","_"
2,"_","_","_","rājan","NC","","_","_"
3,"_","_","_","bhuja","NC","","_","_"
4,"_","_","_","utsṛj","PPP","","_","_"
5,"_","_","_","kaṅka","NC","","_","_"
6,"_","_","_","barhiṇa","NC","","_","_"
7,"_","_","_","vājita","JJ","","_","_"
1,"saṃpatadbhiḥ","_","_","sampat","KDP","","_","_"
2,"śarair","_","_","śara","NC","","_","_"
3,"ghorair","_","_","ghora","JJ","","_","_"
4,"avākīryata","_","_","avakṛ","V","avakṛ","_","_"
5,"medinī","_","_","medinī","NC","","_","_"
1,"tatra","_","_","tatra","CAD","","_","_"
2,"_","_","_","śalya","NC","","_","_"
3,"_","_","_","ratha","NC","","_","_"
4,"rājan","_","_","rājan","NC","","_","_"
5,"vicarantaṃ","_","_","vicar","KDP","","_","_"
6,"_","_","_","mahat","JJ","","_","_"
7,"_","_","_","āhava","NC","","_","_"
1,"apaśyāma","_","_","paś","V","paś","_","_"
2,"yathā","_","_","yathā","CCM","","_","_"
3,"pūrvaṃ","_","_","pūrva","CX","","_","_"
4,"_","_","_","śakra","NC","","_","_"
5,"_","_","_","asura","NC","","_","_"
6,"_","_","_","saṃkṣaya","NC","","_","_"
