"WordID","word","NormSTEM","suffix","lemma","PoS","Root","NormSuffix","NormWord"
1,"śrat","_","_","śrath","NC","","_","_"
2,"te","_","_","tvat","PPR","","_","_"
3,"dadhāmi","_","_","dadh","V","dhā","_","_"
4,"prathamāya","_","_","prathama","JJ","","_","_"
5,"manyave","_","_","manyu","NC","","_","_"
6,"'han","_","_","han","V","han","_","_"
7,"yad","_","_","yat","CSB","","_","_"
8,"vṛtraṃ","_","_","vṛtra","NC","","_","_"
9,"naryaṃ","_","_","narya","JJ","","_","_"
10,"viver","_","_","viṣ","V","viṣ","_","_"
11,"apaḥ","_","_","apas","NC","","_","_"
1,"ubhe","_","_","ubh","PPX","","_","_"
2,"yat","_","_","yat","CSB","","_","_"
3,"tvā","_","_","tvat","PPR","","_","_"
4,"bhavato","_","_","bhav","V","bhū","_","_"
5,"rodasī","_","_","rodas","NC","","_","_"
6,"anu","_","_","anu","CADP","","_","_"
7,"rejate","_","_","rej","V","rej","_","_"
8,"śuṣmāt","_","_","śuṣma","NC","","_","_"
9,"pṛthivī","_","_","pṛthivī","NC","","_","_"
10,"cid","_","_","cit","CEM","","_","_"
11,"adrivaḥ","_","_","adrivat","JJ","","_","_"
1,"tvam","_","_","tvat","PPR","","_","_"
2,"māyābhir","_","_","māyā","NC","","_","_"
3,"anavadya","_","_","anavadya","JJ","","_","_"
4,"māyinaṃ","_","_","māyin","JJ","","_","_"
5,"śravasyatā","_","_","śravasy","KDP","","_","_"
6,"manasā","_","_","manas","NC","","_","_"
7,"vṛtram","_","_","vṛtra","NC","","_","_"
8,"ardayaḥ","_","_","arday","V","arday","_","_"
1,"tvām","_","_","tvat","PPR","","_","_"
2,"in","_","_","id","CEM","","_","_"
3,"naro","_","_","nṛ","NC","","_","_"
4,"vṛṇate","_","_","vṛ","V","vṛ","_","_"
5,"gaviṣṭiṣu","_","_","gaviṣṭi","NC","","_","_"
6,"tvāṃ","_","_","tvat","PPR","","_","_"
7,"viśvāsu","_","_","viśva","JQ","","_","_"
8,"havyāsv","_","_","hu","KDG","","_","_"
9,"iṣṭiṣu","_","_","iṣṭi","NC","","_","_"
1,"_","_","_","ā","CADP","","_","_"
2,"_","_","_","ida","PRD","","_","_"
3,"cākandhi","_","_","kan","V","kan","_","_"
4,"puruhūta","_","_","puruhūta","NC","","_","_"
5,"sūriṣu","_","_","sūri","NC","","_","_"
6,"vṛdhāso","_","_","vṛdha","JJ","","_","_"
7,"ye","_","_","yad","PRL","","_","_"
8,"maghavann","_","_","maghavan","NC","","_","_"
9,"ānaśur","_","_","aś","V","aś","_","_"
10,"magham","_","_","magha","NC","","_","_"
1,"arcanti","_","_","ṛc","V","ṛc","_","_"
2,"toke","_","_","toka","NC","","_","_"
3,"tanaye","_","_","tanaya","JJ","","_","_"
4,"pariṣṭiṣu","_","_","pariṣṭi","NC","","_","_"
5,"medhasātā","_","_","medhasāti","NC","","_","_"
6,"vājinam","_","_","vājin","NC","","_","_"
7,"ahraye","_","_","ahraya","JJ","","_","_"
8,"dhane","_","_","dhana","NC","","_","_"
1,"sa","_","_","tad","PRD","","_","_"
2,"in","_","_","id","CEM","","_","_"
3,"nu","_","_","nu","CX","","_","_"
4,"rāyaḥ","_","_","rai","NC","","_","_"
5,"_","_","_","su","CAD","","_","_"
6,"_","_","_","bhṛ","PPP","","_","_"
7,"cākanan","_","_","kan","V","kan","_","_"
8,"madaṃ","_","_","mada","NC","","_","_"
9,"yo","_","_","yad","PRL","","_","_"
10,"asya","_","_","ida","PRD","","_","_"
11,"raṃhyaṃ","_","_","raṃh","KDG","","_","_"
12,"ciketati","_","_","cit","V","cit","_","_"
1,"tvāvṛdho","_","_","tvāvṛdha","JJ","","_","_"
2,"maghavan","_","_","maghavan","NC","","_","_"
3,"_","_","_","dāśu","JJ","","_","_"
4,"_","_","_","adhvara","NC","","_","_"
5,"makṣū","_","_","makṣū","CX","","_","_"
6,"sa","_","_","tad","PRD","","_","_"
7,"vājam","_","_","vāja","NC","","_","_"
8,"bharate","_","_","bhṛ","V","bhṛ","_","_"
9,"dhanā","_","_","dhana","NC","","_","_"
10,"nṛbhiḥ","_","_","nṛ","NC","","_","_"
1,"tvaṃ","_","_","tvat","PPR","","_","_"
2,"śardhāya","_","_","śardha","NC","","_","_"
3,"mahinā","_","_","mahina","NC","","_","_"
4,"gṛṇāna","_","_","gṛ","KDP","","_","_"
5,"uru","_","_","uru","JJ","","_","_"
6,"kṛdhi","_","_","kar","V","kṛ","_","_"
7,"_","_","_","maghavan","NC","","_","_"
8,"_","_","_","śakn","V","śak","_","_"
9,"rāyaḥ","_","_","rai","NC","","_","_"
1,"tvaṃ","_","_","tvat","PPR","","_","_"
2,"no","_","_","mat","PPR","","_","_"
3,"mitro","_","_","mitra","NC","","_","_"
4,"varuṇo","_","_","varuṇa","NC","","_","_"
5,"na","_","_","na","CNG","","_","_"
6,"māyī","_","_","māyin","JJ","","_","_"
7,"pitvo","_","_","pitu","NC","","_","_"
8,"na","_","_","na","CNG","","_","_"
9,"dasma","_","_","dasma","NC","","_","_"
10,"dayase","_","_","day","V","day","_","_"
11,"vibhaktā","_","_","vibhaktṛ","JJ","","_","_"
