"WordID","word","NormSTEM","suffix","lemma","PoS","Root","NormSuffix","NormWord"
1,"vaiśaṃpāyana","_","_","vaiśampāyana","NC","","_","_"
2,"uvāca","_","_","vak","V","vac","_","_"
1,"evaṃ","_","_","eva","CX","","_","_"
2,"te","_","_","tad","PRD","","_","_"
3,"samayaṃ","_","_","samaya","NC","","_","_"
4,"kṛtvā","_","_","kṛ","CGDA","","_","_"
5,"_","_","_","nivas","V","nivas","_","_"
6,"_","_","_","tatra","CAD","","_","_"
7,"pāṇḍavāḥ","_","_","pāṇḍava","NC","","_","_"
1,"vaśe","_","_","vaśa","NC","","_","_"
2,"_","_","_","śastra","NC","","_","_"
3,"_","_","_","pratāpa","NC","","_","_"
4,"kurvanto","_","_","kṛ","KDP","","_","_"
5,"'nyān","_","_","anya","PPX","","_","_"
6,"mahīkṣitaḥ","_","_","mahīkṣit","NC","","_","_"
1,"teṣāṃ","_","_","tad","PRD","","_","_"
2,"_","_","_","manuja","NC","","_","_"
3,"_","_","_","siṃha","NC","","_","_"
4,"pañcānām","_","_","pañcan","NUM","","_","_"
5,"_","_","_","amita","JJ","","_","_"
6,"_","_","_","ojas","NC","","_","_"
1,"babhūva","_","_","bhav","V","bhū","_","_"
2,"kṛṣṇā","_","_","kṛṣṇā","NC","","_","_"
3,"sarveṣāṃ","_","_","sarva","JQ","","_","_"
4,"pārthānāṃ","_","_","pārtha","NC","","_","_"
5,"_","_","_","vaśa","NC","","_","_"
6,"_","_","_","vartin","JJ","","_","_"
1,"te","_","_","tad","PRD","","_","_"
2,"tayā","_","_","tad","PRD","","_","_"
3,"_","_","_","tad","PRD","","_","_"
4,"_","_","_","ca","CCD","","_","_"
5,"sā","_","_","tad","PRD","","_","_"
6,"vīraiḥ","_","_","vīra","NC","","_","_"
7,"patibhiḥ","_","_","pati","NC","","_","_"
8,"saha","_","_","saha","CX","","_","_"
9,"pañcabhiḥ","_","_","pañcan","NUM","","_","_"
1,"babhūva","_","_","bhav","V","bhū","_","_"
2,"_","_","_","parama","JJ","","_","_"
3,"_","_","_","prī","PPP","","_","_"
4,"nāgair","_","_","nāga","NC","","_","_"
5,"iva","_","_","iva","CCM","","_","_"
6,"sarasvatī","_","_","sarasvatī","NC","","_","_"
1,"vartamāneṣu","_","_","vṛt","KDP","","_","_"
2,"dharmeṇa","_","_","dharma","NC","","_","_"
3,"pāṇḍaveṣu","_","_","pāṇḍava","NC","","_","_"
4,"mahātmasu","_","_","mahātman","JJ","","_","_"
1,"vyavardhan","_","_","vivṛdh","V","vivṛdh","_","_"
2,"kuravaḥ","_","_","kuru","NC","","_","_"
3,"sarve","_","_","sarva","JQ","","_","_"
4,"_","_","_","hā","PPP","","_","_"
5,"_","_","_","doṣa","NC","","_","_"
6,"_","_","_","sukha","NC","","_","_"
7,"_","_","_","anvita","JJ","","_","_"
1,"atha","_","_","atha","CAD","","_","_"
2,"dīrgheṇa","_","_","dīrgha","JJ","","_","_"
3,"kālena","_","_","kāla","NC","","_","_"
4,"brāhmaṇasya","_","_","brāhmaṇa","NC","","_","_"
5,"viśāṃ","_","_","viś","NC","","_","_"
6,"pate","_","_","pati","NC","","_","_"
1,"kasyacit","_","_","kiṃcit","PRI","","_","_"
2,"taskarāḥ","_","_","taskara","NC","","_","_"
3,"kecij","_","_","kiṃcit","PRI","","_","_"
4,"jahrur","_","_","har","V","hṛ","_","_"
5,"gā","_","_","go","NC","","_","_"
6,"_","_","_","nṛpa","NC","","_","_"
7,"_","_","_","sattama","JJ","","_","_"
1,"hriyamāṇe","_","_","hṛ","KDP","","_","_"
2,"dhane","_","_","dhana","NC","","_","_"
3,"tasmin","_","_","tad","PRD","","_","_"
4,"brāhmaṇaḥ","_","_","brāhmaṇa","NC","","_","_"
5,"_","_","_","krodha","NC","","_","_"
6,"_","_","_","mūrchay","PPP","","_","_"
1,"āgamya","_","_","āga","CGDA","","_","_"
2,"khāṇḍavaprastham","_","_","khāṇḍavaprastha","NC","","_","_"
3,"udakrośata","_","_","utkroś","V","utkruś","_","_"
4,"pāṇḍavān","_","_","pāṇḍava","NC","","_","_"
1,"hriyate","_","_","har","V","hṛ","_","_"
2,"_","_","_","go","CX","","_","_"
3,"_","_","_","dhana","NC","","_","_"
4,"kṣudrair","_","_","kṣudra","JJ","","_","_"
5,"nṛśaṃsair","_","_","nṛśaṃsa","JJ","","_","_"
6,"akṛtātmabhiḥ","_","_","akṛtātman","JJ","","_","_"
1,"prasahya","_","_","prasah","CGDA","","_","_"
2,"vo","_","_","tvat","PPR","","_","_"
3,"'smād","_","_","ida","PRD","","_","_"
4,"viṣayād","_","_","viṣaya","NC","","_","_"
5,"abhidhāvata","_","_","abhidhāv","V","abhidhāv","_","_"
6,"pāṇḍavāḥ","_","_","pāṇḍava","NC","","_","_"
1,"brāhmaṇasya","_","_","brāhmaṇa","NC","","_","_"
2,"pramattasya","_","_","pramad","PPP","","_","_"
3,"havir","_","_","havis","NC","","_","_"
4,"dhvāṅkṣair","_","_","dhvāṅkṣa","NC","","_","_"
5,"vilupyate","_","_","vilup","V","vilup","_","_"
1,"śārdūlasya","_","_","śārdūla","NC","","_","_"
2,"guhāṃ","_","_","guhā","NC","","_","_"
3,"śūnyāṃ","_","_","śūnya","JJ","","_","_"
4,"nīcaḥ","_","_","nīca","JJ","","_","_"
5,"_","_","_","kroṣṭṛ","NC","","_","_"
6,"_","_","_","abhimṛś","V","abhimṛś","_","_"
1,"a","_","_","alpha_privativum","JJ","","_","_"
1,"arakṣitāraṃ","_","_","rakṣitṛ","JJ","","_","_"
2,"rājānaṃ","_","_","rājan","NC","","_","_"
3,"_","_","_","bali","NC","","_","_"
4,"_","_","_","ṣaḍbhāga","NC","","_","_"
5,"_","_","_","hārin","JJ","","_","_"
1,"tam","_","_","tad","PRD","","_","_"
2,"āhuḥ","_","_","ah","V","ah","_","_"
3,"_","_","_","sarva","JQ","","_","_"
4,"_","_","_","loka","NC","","_","_"
5,"samagraṃ","_","_","samagra","JJ","","_","_"
6,"_","_","_","pāpa","NC","","_","_"
7,"_","_","_","cārin","JJ","","_","_"
1,"_","_","_","brāhmaṇa","NC","","_","_"
2,"_","_","_","sva","NC","","_","_"
3,"hṛte","_","_","hṛ","PPP","","_","_"
4,"corair","_","_","cora","NC","","_","_"
5,"_","_","_","dharma","NC","","_","_"
6,"_","_","_","artha","NC","","_","_"
7,"ca","_","_","ca","CCD","","_","_"
8,"vilopite","_","_","vilopay","PPP","","_","_"
1,"rorūyamāṇe","_","_","rorūy","KDP","","_","_"
2,"ca","_","_","ca","CCD","","_","_"
3,"mayi","_","_","mat","PPR","","_","_"
4,"kriyatām","_","_","kar","V","kṛ","_","_"
5,"_","_","_","astra","NC","","_","_"
6,"_","_","_","dhāraṇa","NC","","_","_"
1,"_","_","_","rorūy","KDP","","_","_"
2,"_","_","_","abhyāśa","NC","","_","_"
3,"tasya","_","_","tad","PRD","","_","_"
4,"viprasya","_","_","vipra","NC","","_","_"
5,"pāṇḍavaḥ","_","_","pāṇḍava","NC","","_","_"
1,"tāni","_","_","tad","PRD","","_","_"
2,"vākyāni","_","_","vākya","NC","","_","_"
3,"śuśrāva","_","_","śṛṇ","V","śru","_","_"
4,"_","_","_","kuntī","NC","","_","_"
5,"_","_","_","putra","NC","","_","_"
6,"dhanaṃjayaḥ","_","_","dhanaṃjaya","NC","","_","_"
1,"śrutvā","_","_","śru","CGDA","","_","_"
2,"_","_","_","ca","CCD","","_","_"
3,"_","_","_","eva","CEM","","_","_"
4,"_","_","_","mahat","JJ","","_","_"
5,"_","_","_","bāhu","NC","","_","_"
6,"mā","_","_","mā","CNG","","_","_"
7,"bhair","_","_","bhī","V","bhī","_","_"
8,"_","_","_","iti","CQT","","_","_"
9,"_","_","_","ah","V","ah","_","_"
10,"taṃ","_","_","tad","PRD","","_","_"
11,"dvijam","_","_","dvija","NC","","_","_"
1,"āyudhāni","_","_","āyudha","NC","","_","_"
2,"ca","_","_","ca","CCD","","_","_"
3,"_","_","_","yatra","CX","","_","_"
4,"_","_","_","as","V","as","_","_"
5,"pāṇḍavānāṃ","_","_","pāṇḍava","NC","","_","_"
6,"mahātmanām","_","_","mahātman","JJ","","_","_"
1,"kṛṣṇayā","_","_","kṛṣṇā","NC","","_","_"
2,"saha","_","_","saha","CX","","_","_"
3,"_","_","_","tatra","CAD","","_","_"
4,"_","_","_","as","V","as","_","_"
5,"dharmarājo","_","_","dharmarāja","NC","","_","_"
6,"yudhiṣṭhiraḥ","_","_","yudhiṣṭhira","NC","","_","_"
1,"sa","_","_","tad","PRD","","_","_"
2,"praveśāya","_","_","praveśa","NC","","_","_"
3,"_","_","_","ca","CCD","","_","_"
4,"_","_","_","a","CNG","","_","_"
5,"_","_","_","śak","PPP","","_","_"
6,"gamanāya","_","_","gamana","NC","","_","_"
7,"ca","_","_","ca","CCD","","_","_"
8,"pāṇḍavaḥ","_","_","pāṇḍava","NC","","_","_"
1,"tasya","_","_","tad","PRD","","_","_"
2,"_","_","_","ca","CCD","","_","_"
3,"_","_","_","ārta","JJ","","_","_"
4,"tair","_","_","tad","PRD","","_","_"
5,"_","_","_","vākya","NC","","_","_"
6,"_","_","_","coday","KDP","","_","_"
7,"punaḥ","_","_","punar","CAD","","_","_"
8,"punaḥ","_","_","punar","CAD","","_","_"
1,"ākrande","_","_","ākranda","NC","","_","_"
2,"tatra","_","_","tatra","CAD","","_","_"
3,"_","_","_","kaunteya","NC","","_","_"
4,"_","_","_","cintay","V","cintay","_","_"
5,"duḥkhitaḥ","_","_","duḥkhita","JJ","","_","_"
1,"hriyamāṇe","_","_","hṛ","KDP","","_","_"
2,"dhane","_","_","dhana","NC","","_","_"
3,"tasmin","_","_","tad","PRD","","_","_"
4,"brāhmaṇasya","_","_","brāhmaṇa","NC","","_","_"
5,"tapasvinaḥ","_","_","tapasvin","NC","","_","_"
1,"_","_","_","aśru","NC","","_","_"
2,"_","_","_","pramārjana","NC","","_","_"
3,"tasya","_","_","tad","PRD","","_","_"
4,"kartavyam","_","_","kṛ","KDG","","_","_"
5,"iti","_","_","iti","CQT","","_","_"
6,"niścitaḥ","_","_","niści","PPP","","_","_"
1,"_","_","_","upaprekṣaṇa","NC","","_","_"
2,"_","_","_","ja","JJ","","_","_"
3,"'dharmaḥ","_","_","adharma","NC","","_","_"
4,"_","_","_","su","CAD","","_","_"
5,"_","_","_","mahat","JJ","","_","_"
6,"syān","_","_","as","V","as","_","_"
7,"mahīpateḥ","_","_","mahīpati","NC","","_","_"
1,"_","_","_","yadi","CSB","","_","_"
2,"_","_","_","ida","PRD","","_","_"
3,"rudato","_","_","rud","KDP","","_","_"
4,"dvāri","_","_","dvār","NC","","_","_"
5,"na","_","_","na","CNG","","_","_"
6,"_","_","_","kar","V","kṛ","_","_"
7,"_","_","_","adya","CX","","_","_"
8,"rakṣaṇam","_","_","rakṣaṇa","NC","","_","_"
1,"anāstikyaṃ","_","_","anāstikya","NC","","_","_"
2,"ca","_","_","ca","CCD","","_","_"
3,"sarveṣām","_","_","sarva","JQ","","_","_"
4,"asmākam","_","_","mat","PPR","","_","_"
5,"api","_","_","api","CX","","_","_"
6,"rakṣaṇe","_","_","rakṣaṇa","NC","","_","_"
1,"pratitiṣṭheta","_","_","prastha","V","pratiṣṭhā","_","_"
2,"loke","_","_","loka","NC","","_","_"
3,"'sminn","_","_","ida","PRD","","_","_"
4,"_","_","_","adharma","NC","","_","_"
5,"_","_","_","ca","CCD","","_","_"
6,"_","_","_","eva","CEM","","_","_"
7,"no","_","_","mat","PPR","","_","_"
8,"bhavet","_","_","bhav","V","bhū","_","_"
1,"ca","_","_","ca","CCD","","_","_"
2,"rājānaṃ","_","_","rājan","NC","","_","_"
3,"gate","_","_","ga","PPP","","_","_"
4,"mayi","_","_","mat","PPR","","_","_"
5,"na","_","_","na","CNG","","_","_"
6,"saṃśayaḥ","_","_","saṃśaya","NC","","_","_"
1,"_","_","_","ajāta","JJ","","_","_"
2,"_","_","_","śatru","NC","","_","_"
3,"nṛpater","_","_","nṛpati","NC","","_","_"
4,"mama","_","_","mat","PPR","","_","_"
5,"_","_","_","ca","CCD","","_","_"
6,"_","_","_","eva","CEM","","_","_"
7,"_","_","_","apriya","JJ","","_","_"
8,"bhavet","_","_","bhav","V","bhū","_","_"
1,"anupraveśe","_","_","anupraveśa","NC","","_","_"
2,"_","_","_","rājan","NC","","_","_"
3,"_","_","_","tu","CCD","","_","_"
4,"_","_","_","vana","NC","","_","_"
5,"_","_","_","vāsa","NC","","_","_"
6,"bhaven","_","_","bhav","V","bhū","_","_"
7,"mama","_","_","mat","PPR","","_","_"
1,"sarvam","_","_","sarva","JQ","","_","_"
2,"anyat","_","_","anya","PPX","","_","_"
3,"parihṛtaṃ","_","_","parihṛ","PPP","","_","_"
4,"dharṣaṇāt","_","_","dharṣaṇa","NC","","_","_"
5,"tu","_","_","tu","CCD","","_","_"
6,"mahīpateḥ","_","_","mahīpati","NC","","_","_"
1,"adharmo","_","_","adharma","NC","","_","_"
2,"vā","_","_","vā","CCD","","_","_"
3,"mahān","_","_","mahat","JJ","","_","_"
4,"astu","_","_","as","V","as","_","_"
5,"vane","_","_","vana","NC","","_","_"
6,"vā","_","_","vā","CCD","","_","_"
7,"maraṇaṃ","_","_","maraṇa","NC","","_","_"
8,"mama","_","_","mat","PPR","","_","_"
1,"_","_","_","śarīra","NC","","_","_"
2,"_","_","_","api","CX","","_","_"
3,"nāśena","_","_","nāśa","NC","","_","_"
4,"dharma","_","_","dharma","NC","","_","_"
5,"eva","_","_","eva","CEM","","_","_"
6,"viśiṣyate","_","_","viśās","V","viśās","_","_"
1,"evaṃ","_","_","eva","CX","","_","_"
2,"viniścitya","_","_","viniści","CGDA","","_","_"
3,"tataḥ","_","_","tatas","CX","","_","_"
4,"_","_","_","kuntī","NC","","_","_"
5,"_","_","_","putra","NC","","_","_"
6,"dhanaṃjayaḥ","_","_","dhanaṃjaya","NC","","_","_"
1,"mukham","_","_","mukha","NC","","_","_"
2,"ācchādya","_","_","ācchāday","CGDA","","_","_"
3,"nibiḍam","_","_","nibiḍa","JJ","","_","_"
4,"uttarīyeṇa","_","_","uttarīya","NC","","_","_"
5,"vāsasā","_","_","vāsas","NC","","_","_"
1,"anupraviśya","_","_","anupraviś","CGDA","","_","_"
2,"rājānam","_","_","rājan","NC","","_","_"
3,"āpṛcchya","_","_","āpracch","CGDA","","_","_"
4,"ca","_","_","ca","CCD","","_","_"
5,"viśāṃ","_","_","viś","NC","","_","_"
6,"pate","_","_","pati","NC","","_","_"
1,"dhanur","_","_","dhanus","NC","","_","_"
2,"ādāya","_","_","ādā","CGDA","","_","_"
3,"saṃhṛṣṭo","_","_","saṃhṛṣ","PPP","","_","_"
4,"brāhmaṇaṃ","_","_","brāhmaṇa","NC","","_","_"
5,"pratyabhāṣata","_","_","pratibhāṣ","V","pratibhāṣ","_","_"
1,"_","_","_","brāhmaṇa","NC","","_","_"
2,"_","_","_","āga","V","āga","_","_"
3,"śīghraṃ","_","_","śīghra","CX","","_","_"
4,"yāvat","_","_","yāvat","CX","","_","_"
5,"_","_","_","para","PPX","","_","_"
6,"_","_","_","dhana","NC","","_","_"
7,"_","_","_","eṣin","JJ","","_","_"
1,"na","_","_","na","CNG","","_","_"
2,"dūre","_","_","dūra","JJ","","_","_"
3,"te","_","_","tad","PRD","","_","_"
4,"gatāḥ","_","_","ga","PPP","","_","_"
5,"kṣudrās","_","_","kṣudra","JJ","","_","_"
6,"tāvad","_","_","tāvat","CX","","_","_"
7,"gacchāmahe","_","_","ga","V","ga","_","_"
8,"saha","_","_","saha","CX","","_","_"
1,"yāvad","_","_","yāvat","CX","","_","_"
2,"_","_","_","āvartay","V","āvartay","_","_"
3,"_","_","_","adya","CX","","_","_"
4,"_","_","_","cora","NC","","_","_"
5,"_","_","_","hasta","NC","","_","_"
6,"dhanaṃ","_","_","dhana","NC","","_","_"
7,"tava","_","_","tvat","PPR","","_","_"
1,"so","_","_","tad","PRD","","_","_"
2,"'nusṛtya","_","_","anusṛ","CGDA","","_","_"
3,"_","_","_","mahat","JJ","","_","_"
4,"_","_","_","bāhu","NC","","_","_"
5,"dhanvī","_","_","dhanvin","JJ","","_","_"
6,"varmī","_","_","varmin","JJ","","_","_"
7,"rathī","_","_","rathin","JJ","","_","_"
8,"dhvajī","_","_","dhvajin","JJ","","_","_"
1,"śarair","_","_","śara","NC","","_","_"
2,"_","_","_","vidhvaṃsay","PPP","","_","_"
3,"_","_","_","cora","NC","","_","_"
4,"avajitya","_","_","avaji","CGDA","","_","_"
5,"ca","_","_","ca","CCD","","_","_"
6,"tad","_","_","tad","PRD","","_","_"
7,"dhanam","_","_","dhana","NC","","_","_"
1,"brāhmaṇasya","_","_","brāhmaṇa","NC","","_","_"
2,"upāhṛtya","_","_","upāhṛ","CGDA","","_","_"
3,"yaśaḥ","_","_","yaśas","NC","","_","_"
4,"pītvā","_","_","pā","CGDA","","_","_"
5,"ca","_","_","ca","CCD","","_","_"
6,"pāṇḍavaḥ","_","_","pāṇḍava","NC","","_","_"
1,"_","_","_","tatas","CX","","_","_"
2,"_","_","_","tad","PRD","","_","_"
3,"_","_","_","go","CX","","_","_"
4,"_","_","_","dhana","NC","","_","_"
5,"pārtho","_","_","pārtha","NC","","_","_"
6,"dattvā","_","_","dā","CGDA","","_","_"
7,"tasmai","_","_","tad","PRD","","_","_"
8,"dvijātaye","_","_","dvijāti","NC","","_","_"
1,"ājagāma","_","_","āgacch","V","āgam","_","_"
2,"puraṃ","_","_","pura","NC","","_","_"
3,"vīraḥ","_","_","vīra","NC","","_","_"
4,"savyasācī","_","_","savyasācin","NC","","_","_"
5,"paraṃtapaḥ","_","_","paraṃtapa","JJ","","_","_"
1,"so","_","_","tad","PRD","","_","_"
2,"'bhivādya","_","_","abhivāday","CGDA","","_","_"
3,"gurūn","_","_","guru","NC","","_","_"
4,"_","_","_","sarva","JQ","","_","_"
5,"_","_","_","tad","PRD","","_","_"
6,"_","_","_","ca","CCD","","_","_"
7,"_","_","_","api","CX","","_","_"
8,"pratinanditaḥ","_","_","pratinand","PPP","","_","_"
1,"dharmarājam","_","_","dharmarāja","NC","","_","_"
2,"_","_","_","vak","V","vac","_","_"
3,"_","_","_","ida","PRD","","_","_"
4,"vratam","_","_","vrata","NC","","_","_"
5,"ādiśyatāṃ","_","_","ādiś","V","ādiś","_","_"
6,"mama","_","_","mat","PPR","","_","_"
1,"samayaḥ","_","_","samaya","NC","","_","_"
2,"samatikrānto","_","_","samatikra","PPP","","_","_"
3,"_","_","_","bhavat","JJ","","_","_"
4,"_","_","_","saṃdarśana","NC","","_","_"
5,"mayā","_","_","mat","PPR","","_","_"
1,"_","_","_","vana","NC","","_","_"
2,"_","_","_","vāsa","NC","","_","_"
3,"gamiṣyāmi","_","_","gacch","V","gam","_","_"
4,"samayo","_","_","samaya","NC","","_","_"
5,"_","_","_","hi","CX","","_","_"
6,"_","_","_","tad","PRD","","_","_"
7,"naḥ","_","_","mat","PPR","","_","_"
8,"kṛtaḥ","_","_","kṛ","PPP","","_","_"
1,"_","_","_","iti","CQT","","_","_"
2,"_","_","_","vac","PPP","","_","_"
3,"_","_","_","dharmarāja","NC","","_","_"
4,"_","_","_","tu","CCD","","_","_"
5,"sahasā","_","_","sahasā","CX","","_","_"
6,"vākyam","_","_","vākya","NC","","_","_"
7,"apriyam","_","_","apriya","JJ","","_","_"
1,"katham","_","_","katha","CX","","_","_"
2,"_","_","_","iti","CQT","","_","_"
3,"_","_","_","abravīta","V","brū","_","_"
4,"vācā","_","_","vāc","NC","","_","_"
5,"_","_","_","śoka","NC","","_","_"
6,"_","_","_","ārta","JJ","","_","_"
7,"sajjamānayā","_","_","sañj","KDP","","_","_"
1,"yudhiṣṭhiro","_","_","yudhiṣṭhira","NC","","_","_"
2,"guḍākeśaṃ","_","_","guḍākeśa","NC","","_","_"
3,"bhrātā","_","_","bhrātṛ","NC","","_","_"
4,"bhrātaram","_","_","bhrātṛ","NC","","_","_"
5,"acyutam","_","_","acyuta","JJ","","_","_"
1,"uvāca","_","_","vak","V","vac","_","_"
2,"dīno","_","_","dīna","JJ","","_","_"
3,"rājā","_","_","rājan","NC","","_","_"
4,"ca","_","_","ca","CCD","","_","_"
5,"dhanaṃjayam","_","_","dhanaṃjaya","NC","","_","_"
6,"idaṃ","_","_","ida","PRD","","_","_"
7,"vacaḥ","_","_","vacas","NC","","_","_"
1,"pramāṇam","_","_","pramāṇa","NC","","_","_"
2,"asmi","_","_","as","V","as","_","_"
3,"yadi","_","_","yadi","CSB","","_","_"
4,"te","_","_","tvat","PPR","","_","_"
5,"mattaḥ","_","_","mat","PPR","","_","_"
6,"śṛṇu","_","_","śṛṇ","V","śru","_","_"
7,"vaco","_","_","vacas","NC","","_","_"
8,"'nagha","_","_","anagha","JJ","","_","_"
1,"anupraveśe","_","_","anupraveśa","NC","","_","_"
2,"yad","_","_","yad","PRL","","_","_"
3,"vīra","_","_","vīra","NC","","_","_"
4,"_","_","_","kṛ","KDP","","_","_"
5,"_","_","_","tvat","PPR","","_","_"
6,"_","_","_","mat","PPR","","_","_"
7,"_","_","_","apriya","JJ","","_","_"
1,"sarvaṃ","_","_","sarva","JQ","","_","_"
2,"tad","_","_","tad","PRD","","_","_"
3,"anujānāmi","_","_","anujān","V","anujñā","_","_"
4,"vyalīkaṃ","_","_","vyalīka","NC","","_","_"
5,"na","_","_","na","CNG","","_","_"
6,"ca","_","_","ca","CCD","","_","_"
7,"me","_","_","mat","PPR","","_","_"
8,"hṛdi","_","_","hṛd","NC","","_","_"
1,"guror","_","_","guru","NC","","_","_"
2,"anupraveśo","_","_","anupraveśa","NC","","_","_"
3,"hi","_","_","hi","CX","","_","_"
4,"_","_","_","na","CNG","","_","_"
5,"_","_","_","upaghāta","NC","","_","_"
6,"yavīyasaḥ","_","_","yavīyas","JJ","","_","_"
1,"yavīyaso","_","_","yavīyas","JJ","","_","_"
2,"'nupraveśo","_","_","anupraveśa","NC","","_","_"
3,"jyeṣṭhasya","_","_","jyeṣṭha","JJ","","_","_"
4,"_","_","_","vidhi","NC","","_","_"
5,"_","_","_","lopaka","JJ","","_","_"
1,"nivartasva","_","_","nivart","V","nivṛt","_","_"
2,"_","_","_","mahat","JJ","","_","_"
3,"_","_","_","bāhu","NC","","_","_"
4,"kuruṣva","_","_","kar","V","kṛ","_","_"
5,"vacanaṃ","_","_","vacana","NC","","_","_"
6,"mama","_","_","mat","PPR","","_","_"
1,"na","_","_","na","CNG","","_","_"
2,"hi","_","_","hi","CX","","_","_"
3,"te","_","_","tvat","PPR","","_","_"
4,"_","_","_","dharma","NC","","_","_"
5,"_","_","_","lopa","NC","","_","_"
6,"'sti","_","_","as","V","as","_","_"
7,"na","_","_","na","CNG","","_","_"
8,"ca","_","_","ca","CCD","","_","_"
9,"me","_","_","mat","PPR","","_","_"
10,"dharṣaṇā","_","_","dharṣaṇa","NC","","_","_"
11,"kṛtā","_","_","kṛ","PPP","","_","_"
1,"arjuna","_","_","arjuna","NC","","_","_"
2,"uvāca","_","_","vak","V","vac","_","_"
1,"na","_","_","na","CNG","","_","_"
2,"vyājena","_","_","vyāja","NC","","_","_"
3,"cared","_","_","car","V","car","_","_"
4,"dharmam","_","_","dharma","NC","","_","_"
5,"iti","_","_","iti","CQT","","_","_"
6,"me","_","_","mat","PPR","","_","_"
7,"bhavataḥ","_","_","bhavat","JJ","","_","_"
8,"śrutam","_","_","śru","PPP","","_","_"
1,"na","_","_","na","CNG","","_","_"
2,"satyād","_","_","satya","NC","","_","_"
3,"vicaliṣyāmi","_","_","vical","V","vical","_","_"
4,"_","_","_","satya","NC","","_","_"
5,"_","_","_","āyudha","NC","","_","_"
6,"ālabhe","_","_","ālabh","V","ālabh","_","_"
1,"kriyate","_","_","kar","V","kṛ","_","_"
2,"svīkṛte","_","_","svīkṛ","PPP","","_","_"
3,"rājan","_","_","rājan","NC","","_","_"
4,"na","_","_","na","CNG","","_","_"
5,"hi","_","_","hi","CX","","_","_"
6,"ced","_","_","ced","CX","","_","_"
7,"ātmanā","_","_","ātman","NC","","_","_"
8,"vratam","_","_","vrata","NC","","_","_"
1,"bhidyeta","_","_","bhid","V","bhid","_","_"
2,"_","_","_","setu","NC","","_","_"
3,"_","_","_","ca","CCD","","_","_"
4,"_","_","_","adharma","NC","","_","_"
5,"_","_","_","api","CX","","_","_"
6,"_","_","_","ayaśas","NC","","_","_"
7,"prāpnuyāṃ","_","_","prāpn","V","prāp","_","_"
8,"mahat","_","_","mahat","JJ","","_","_"
1,"ājñā","_","_","ājñā","NC","","_","_"
2,"tu","_","_","tu","CCD","","_","_"
3,"mama","_","_","mat","PPR","","_","_"
4,"dātavyā","_","_","dā","KDG","","_","_"
5,"bhavatā","_","_","bhavat","JJ","","_","_"
6,"_","_","_","kīrti","NC","","_","_"
7,"_","_","_","vardhana","JJ","","_","_"
1,"_","_","_","bhavat","JJ","","_","_"
2,"_","_","_","ājñā","NC","","_","_"
3,"ṛte","_","_","ṛte","CX","","_","_"
4,"kiṃcin","_","_","kiṃcit","PRI","","_","_"
5,"na","_","_","na","CNG","","_","_"
6,"kāryam","_","_","kṛ","KDG","","_","_"
7,"iti","_","_","iti","CQT","","_","_"
8,"niścayaḥ","_","_","niścaya","NC","","_","_"
1,"vaiśaṃpāyana","_","_","vaiśampāyana","NC","","_","_"
2,"uvāca","_","_","vak","V","vac","_","_"
1,"so","_","_","tad","PRD","","_","_"
2,"'bhyanujñāpya","_","_","abhyanujñāpay","CGDA","","_","_"
3,"rājānaṃ","_","_","rājan","NC","","_","_"
4,"brahmacaryāya","_","_","brahmacarya","NC","","_","_"
5,"dīkṣitaḥ","_","_","dīkṣ","PPP","","_","_"
1,"vane","_","_","vana","NC","","_","_"
2,"dvādaśa","_","_","dvādaśan","NUM","","_","_"
3,"varṣāṇi","_","_","varṣa","NC","","_","_"
4,"_","_","_","vāsa","NC","","_","_"
5,"_","_","_","upaga","V","upaga","_","_"
6,"ha","_","_","ha","CEM","","_","_"
