"WordID","word","NormSTEM","suffix","lemma","PoS","Root","NormSuffix","NormWord"
1,"diteḥ","_","_","diti","NC","","_","_"
2,"putrāṇām","_","_","putra","NC","","_","_"
3,"aditer","_","_","aditi","NC","","_","_"
4,"akāriṣam","_","_","kar","V","kṛ","_","_"
5,"ava","_","_","ava","CX","","_","_"
6,"devānāṃ","_","_","deva","NC","","_","_"
7,"bṛhatām","_","_","bṛhat","JJ","","_","_"
8,"_","_","_","a","CNG","","_","_"
9,"_","_","_","narman","NC","","_","_"
1,"teṣāṃ","_","_","tad","PRD","","_","_"
2,"hi","_","_","hi","CX","","_","_"
3,"dhāma","_","_","dhāman","NC","","_","_"
4,"gabhiṣak","_","_","gabhiṣak","CX","","_","_"
5,"samudriyaṃ","_","_","samudriya","JJ","","_","_"
6,"_","_","_","na","CNG","","_","_"
7,"_","_","_","a","PRD","","_","_"
8,"namasā","_","_","namas","NC","","_","_"
9,"paro","_","_","para","PPX","","_","_"
10,"asti","_","_","as","V","as","_","_"
11,"kaścana","_","_","kaścana","PRI","","_","_"
