"WordID","word","NormSTEM","suffix","lemma","PoS","Root","NormSuffix","NormWord"
1,"vṛṣā","_","_","vṛṣan","NC","","_","_"
2,"soma","_","_","soma","NC","","_","_"
3,"dyumāṁ","_","_","dyumat","JJ","","_","_"
4,"asi","_","_","as","V","as","_","_"
5,"vṛṣā","_","_","vṛṣan","NC","","_","_"
6,"deva","_","_","deva","NC","","_","_"
7,"_","_","_","vṛṣan","NC","","_","_"
8,"_","_","_","vrata","NC","","_","_"
1,"vṛṣā","_","_","vṛṣan","NC","","_","_"
2,"dharmāṇi","_","_","dharma","NC","","_","_"
3,"dadhiṣe","_","_","dadh","V","dhā","_","_"
1,"vṛṣṇas","_","_","vṛṣan","NC","","_","_"
2,"te","_","_","tvat","PPR","","_","_"
3,"vṛṣṇyaṃ","_","_","vṛṣṇya","JJ","","_","_"
4,"śavo","_","_","śavas","NC","","_","_"
5,"vṛṣā","_","_","vṛṣan","NC","","_","_"
6,"vanaṃ","_","_","vana","NC","","_","_"
7,"vṛṣā","_","_","vṛṣan","NC","","_","_"
8,"madaḥ","_","_","mada","NC","","_","_"
1,"satyaṃ","_","_","satya","NC","","_","_"
2,"vṛṣan","_","_","vṛṣan","NC","","_","_"
3,"_","_","_","vṛṣan","NC","","_","_"
4,"_","_","_","id","CEM","","_","_"
5,"asi","_","_","as","V","as","_","_"
1,"aśvo","_","_","aśva","NC","","_","_"
2,"na","_","_","na","CNG","","_","_"
3,"cakrado","_","_","krand","V","krand","_","_"
4,"vṛṣā","_","_","vṛṣan","NC","","_","_"
5,"saṃ","_","_","sa","CADP","","_","_"
6,"gā","_","_","go","NC","","_","_"
7,"indo","_","_","indu","NC","","_","_"
8,"sam","_","_","sa","CADP","","_","_"
9,"arvataḥ","_","_","arvat","NC","","_","_"
1,"vi","_","_","vi","CADP","","_","_"
2,"no","_","_","mat","PPR","","_","_"
3,"rāye","_","_","rai","NC","","_","_"
4,"duro","_","_","dvār","NC","","_","_"
5,"vṛdhi","_","_","vṛ","V","vṛ","_","_"
1,"asṛkṣata","_","_","sṛj","V","sṛj","_","_"
2,"pra","_","_","pra","CADP","","_","_"
3,"vājino","_","_","vājin","NC","","_","_"
4,"gavyā","_","_","gavyā","NC","","_","_"
5,"somāso","_","_","soma","NC","","_","_"
6,"aśvayā","_","_","aśvayā","NC","","_","_"
1,"śukrāso","_","_","śukra","JJ","","_","_"
2,"_","_","_","vīrayā","NC","","_","_"
3,"_","_","_","āśu","JJ","","_","_"
1,"śumbhamānā","_","_","śubh","KDP","","_","_"
2,"ṛtāyubhir","_","_","ṛtāyu","JJ","","_","_"
3,"mṛjyamānā","_","_","mṛj","KDP","","_","_"
4,"gabhastyoḥ","_","_","gabhasti","NC","","_","_"
1,"pavante","_","_","pū","V","pū","_","_"
2,"vāre","_","_","vāra","NC","","_","_"
3,"avyaye","_","_","avyaya","JJ","","_","_"
1,"te","_","_","tad","PRD","","_","_"
2,"viśvā","_","_","viśva","JQ","","_","_"
3,"dāśuṣe","_","_","dāś","KDP","","_","_"
4,"vasu","_","_","vasu","NC","","_","_"
5,"somā","_","_","soma","NC","","_","_"
6,"divyāni","_","_","divya","JJ","","_","_"
7,"pārthivā","_","_","pārthiva","JJ","","_","_"
1,"pavantām","_","_","pū","V","pū","_","_"
2,"āntarikṣyā","_","_","āntarikṣa","JJ","","_","_"
1,"pavamānasya","_","_","pū","KDP","","_","_"
2,"_","_","_","viśva","JQ","","_","_"
3,"_","_","_","vid","JJ","","_","_"
4,"pra","_","_","pra","CADP","","_","_"
5,"te","_","_","tvat","PPR","","_","_"
6,"sargā","_","_","sarga","NC","","_","_"
7,"asṛkṣata","_","_","sṛj","V","sṛj","_","_"
1,"_","_","_","sūrya","NC","","_","_"
2,"_","_","_","iva","CCM","","_","_"
3,"na","_","_","na","CNG","","_","_"
4,"raśmayaḥ","_","_","raśmi","NC","","_","_"
1,"ketuṃ","_","_","ketu","NC","","_","_"
2,"kṛṇvan","_","_","kṛ","KDP","","_","_"
3,"divas","_","_","div","NC","","_","_"
4,"pari","_","_","pari","CADP","","_","_"
5,"viśvā","_","_","viśva","JQ","","_","_"
6,"_","_","_","rūpa","NC","","_","_"
7,"_","_","_","abhi","CADP","","_","_"
8,"arṣasi","_","_","ṛṣ","V","ṛṣ","_","_"
1,"samudraḥ","_","_","samudra","NC","","_","_"
2,"soma","_","_","soma","NC","","_","_"
3,"pinvase","_","_","pinv","V","pinv","_","_"
1,"hinvāno","_","_","hi","KDP","","_","_"
2,"vācam","_","_","vāc","NC","","_","_"
3,"iṣyasi","_","_","iṣ","V","iṣ","_","_"
4,"pavamāna","_","_","pū","KDP","","_","_"
5,"vidharmaṇi","_","_","vidharman","NC","","_","_"
1,"akrān","_","_","krand","V","krand","_","_"
2,"devo","_","_","deva","NC","","_","_"
3,"na","_","_","na","CNG","","_","_"
4,"sūryaḥ","_","_","sūrya","NC","","_","_"
1,"induḥ","_","_","indu","NC","","_","_"
2,"paviṣṭa","_","_","pū","V","pū","_","_"
3,"cetanaḥ","_","_","cetana","JJ","","_","_"
4,"priyaḥ","_","_","priya","JJ","","_","_"
5,"kavīnām","_","_","kavi","NC","","_","_"
6,"matī","_","_","mati","NC","","_","_"
1,"sṛjad","_","_","sṛj","V","sṛj","_","_"
2,"aśvaṃ","_","_","aśva","NC","","_","_"
3,"rathīr","_","_","rathī","JJ","","_","_"
4,"iva","_","_","iva","CCM","","_","_"
1,"ūrmir","_","_","ūrmi","NC","","_","_"
2,"yas","_","_","yad","PRL","","_","_"
3,"te","_","_","tvat","PPR","","_","_"
4,"pavitra","_","_","pavitra","NC","","_","_"
5,"ā","_","_","ā","CADP","","_","_"
6,"devāvīḥ","_","_","devāvī","JJ","","_","_"
7,"paryakṣarat","_","_","parikṣar","V","parikṣar","_","_"
1,"sīdann","_","_","sad","KDP","","_","_"
2,"ṛtasya","_","_","ṛta","NC","","_","_"
3,"yonim","_","_","yoni","NC","","_","_"
4,"ā","_","_","ā","CADP","","_","_"
1,"sa","_","_","tad","PRD","","_","_"
2,"no","_","_","mat","PPR","","_","_"
3,"arṣa","_","_","ṛṣ","V","ṛṣ","_","_"
4,"pavitra","_","_","pavitra","NC","","_","_"
5,"ā","_","_","ā","CADP","","_","_"
6,"mado","_","_","mada","NC","","_","_"
7,"yo","_","_","yad","PRL","","_","_"
8,"_","_","_","deva","NC","","_","_"
9,"_","_","_","vītama","JJ","","_","_"
1,"indav","_","_","indu","NC","","_","_"
2,"indrāya","_","_","indra","NC","","_","_"
3,"pītaye","_","_","pā","CGDI","","_","_"
1,"iṣe","_","_","iṣ","NC","","_","_"
2,"pavasva","_","_","pū","V","pū","_","_"
3,"dhārayā","_","_","dhārā","NC","","_","_"
4,"mṛjyamāno","_","_","mṛj","KDP","","_","_"
5,"manīṣibhiḥ","_","_","manīṣin","JJ","","_","_"
1,"indo","_","_","indu","NC","","_","_"
2,"_","_","_","ruci","NC","","_","_"
3,"_","_","_","abhi","CADP","","_","_"
4,"gā","_","_","go","NC","","_","_"
5,"ihi","_","_","e","V","i","_","_"
1,"punāno","_","_","pū","KDP","","_","_"
2,"varivas","_","_","varivas","NC","","_","_"
3,"kṛdhy","_","_","kar","V","kṛ","_","_"
4,"ūrjaṃ","_","_","ūrj","NC","","_","_"
5,"janāya","_","_","jana","NC","","_","_"
6,"girvaṇaḥ","_","_","girvaṇas","JJ","","_","_"
1,"hare","_","_","hari","JJ","","_","_"
2,"sṛjāna","_","_","sṛj","KDP","","_","_"
3,"āśiram","_","_","āśir","NC","","_","_"
1,"punāno","_","_","pū","KDP","","_","_"
2,"_","_","_","deva","NC","","_","_"
3,"_","_","_","vīti","NC","","_","_"
4,"indrasya","_","_","indra","NC","","_","_"
5,"yāhi","_","_","yā","V","yā","_","_"
6,"niṣkṛtam","_","_","niṣkṛta","NC","","_","_"
1,"dyutāno","_","_","dyut","KDP","","_","_"
2,"vājibhir","_","_","vājin","NC","","_","_"
3,"yataḥ","_","_","ya","PPP","","_","_"
1,"pra","_","_","pra","CADP","","_","_"
2,"hinvānāsa","_","_","hi","KDP","","_","_"
3,"indavo","_","_","indu","NC","","_","_"
4,"'cchā","_","_","acchā","CADP","","_","_"
5,"samudram","_","_","samudra","NC","","_","_"
6,"āśavaḥ","_","_","āśu","JJ","","_","_"
1,"dhiyā","_","_","dhī","NC","","_","_"
2,"jūtā","_","_","jū","PPP","","_","_"
3,"asṛkṣata","_","_","sṛj","V","sṛj","_","_"
1,"marmṛjānāsa","_","_","marmṛj","KDP","","_","_"
2,"āyavo","_","_","āyu","JJ","","_","_"
3,"vṛthā","_","_","vṛthā","CX","","_","_"
4,"samudram","_","_","samudra","NC","","_","_"
5,"indavaḥ","_","_","indu","NC","","_","_"
1,"agmann","_","_","ga","V","ga","_","_"
2,"ṛtasya","_","_","ṛta","NC","","_","_"
3,"yonim","_","_","yoni","NC","","_","_"
4,"ā","_","_","ā","CADP","","_","_"
1,"pari","_","_","pari","CADP","","_","_"
2,"ṇo","_","_","mat","PPR","","_","_"
3,"yāhy","_","_","yā","V","yā","_","_"
4,"asmayur","_","_","asmayu","JJ","","_","_"
5,"viśvā","_","_","viśva","JQ","","_","_"
6,"vasūny","_","_","vasu","NC","","_","_"
7,"ojasā","_","_","ojas","NC","","_","_"
1,"pāhi","_","_","pib","V","pā","_","_"
2,"naḥ","_","_","mat","PPR","","_","_"
3,"śarma","_","_","śarman","NC","","_","_"
4,"vīravat","_","_","vīravat","JJ","","_","_"
1,"mimāti","_","_","mā","V","mā","_","_"
2,"vahnir","_","_","vahni","NC","","_","_"
3,"etaśaḥ","_","_","etaśa","NC","","_","_"
4,"padaṃ","_","_","pada","NC","","_","_"
5,"yujāna","_","_","yuj","KDP","","_","_"
6,"ṛkvabhiḥ","_","_","ṛkvan","JJ","","_","_"
1,"pra","_","_","pra","CADP","","_","_"
2,"yat","_","_","yat","CSB","","_","_"
3,"samudra","_","_","samudra","NC","","_","_"
4,"āhitaḥ","_","_","ādhā","PPP","","_","_"
1,"ā","_","_","ā","CADP","","_","_"
2,"yad","_","_","yat","CSB","","_","_"
3,"yoniṃ","_","_","yoni","NC","","_","_"
4,"hiraṇyayam","_","_","hiraṇyaya","JJ","","_","_"
5,"āśur","_","_","āśu","JJ","","_","_"
6,"ṛtasya","_","_","ṛta","NC","","_","_"
7,"sīdati","_","_","sīd","V","sad","_","_"
1,"jahāty","_","_","jah","V","hā","_","_"
2,"apracetasaḥ","_","_","apracetas","JJ","","_","_"
1,"abhi","_","_","abhi","CADP","","_","_"
2,"venā","_","_","va","JJ","","_","_"
3,"_","_","_","nū","V","nū","_","_"
4,"_","_","_","iyakṣ","V","iyakṣ","_","_"
5,"pracetasaḥ","_","_","pracetas","JJ","","_","_"
1,"majjanty","_","_","majj","V","majj","_","_"
2,"avicetasaḥ","_","_","avicetas","JJ","","_","_"
1,"_","_","_","indra","NC","","_","_"
2,"_","_","_","indu","NC","","_","_"
3,"marutvate","_","_","marutvat","JJ","","_","_"
4,"pavasva","_","_","pū","V","pū","_","_"
5,"madhumattamaḥ","_","_","madhumattama","JJ","","_","_"
1,"ṛtasya","_","_","ṛta","NC","","_","_"
2,"yonim","_","_","yoni","NC","","_","_"
3,"āsadam","_","_","āsad","CGDI","","_","_"
1,"taṃ","_","_","tad","PRD","","_","_"
2,"tvā","_","_","tvat","PPR","","_","_"
3,"viprā","_","_","vipra","JJ","","_","_"
4,"_","_","_","vacas","NC","","_","_"
5,"_","_","_","vid","JJ","","_","_"
6,"pariṣkṛṇvanti","_","_","pariṣkar","V","pariṣkṛ","_","_"
7,"vedhasaḥ","_","_","vedhas","NC","","_","_"
1,"saṃ","_","_","sa","CADP","","_","_"
2,"tvā","_","_","tvat","PPR","","_","_"
3,"mṛjanty","_","_","mṛj","V","mṛj","_","_"
4,"āyavaḥ","_","_","āyu","NC","","_","_"
1,"rasaṃ","_","_","rasa","NC","","_","_"
2,"te","_","_","tvat","PPR","","_","_"
3,"mitro","_","_","mitra","NC","","_","_"
4,"aryamā","_","_","aryaman","NC","","_","_"
5,"pibanti","_","_","pib","V","pā","_","_"
6,"varuṇaḥ","_","_","varuṇa","NC","","_","_"
7,"kave","_","_","kavi","NC","","_","_"
1,"pavamānasya","_","_","pū","KDP","","_","_"
2,"marutaḥ","_","_","marut","NC","","_","_"
1,"tvaṃ","_","_","tvat","PPR","","_","_"
2,"soma","_","_","soma","NC","","_","_"
3,"vipaścitam","_","_","vipaścit","JJ","","_","_"
4,"punāno","_","_","pū","KDP","","_","_"
5,"vācam","_","_","vāc","NC","","_","_"
6,"iṣyasi","_","_","iṣ","V","iṣ","_","_"
1,"indo","_","_","indu","NC","","_","_"
2,"sahasrabharṇasam","_","_","sahasrabharṇas","JJ","","_","_"
1,"_","_","_","uta","CCD","","_","_"
2,"_","_","_","u","CEM","","_","_"
3,"sahasrabharṇasaṃ","_","_","sahasrabharṇas","JJ","","_","_"
4,"vācaṃ","_","_","vāc","NC","","_","_"
5,"soma","_","_","soma","NC","","_","_"
6,"makhasyuvam","_","_","makhasyu","JJ","","_","_"
1,"punāna","_","_","pū","KDP","","_","_"
2,"indav","_","_","indu","NC","","_","_"
3,"ā","_","_","ā","CADP","","_","_"
4,"bhara","_","_","bhṛ","V","bhṛ","_","_"
1,"punāna","_","_","pū","KDP","","_","_"
2,"indav","_","_","indu","NC","","_","_"
3,"eṣām","_","_","ida","PRD","","_","_"
4,"_","_","_","puru","JJ","","_","_"
5,"_","_","_","hvā","PPP","","_","_"
6,"janānām","_","_","jana","NC","","_","_"
1,"priyaḥ","_","_","priya","JJ","","_","_"
2,"samudram","_","_","samudra","NC","","_","_"
3,"ā","_","_","ā","CADP","","_","_"
4,"viśa","_","_","viś","V","viś","_","_"
1,"davidyutatyā","_","_","davidyut","KDP","","_","_"
2,"rucā","_","_","ruc","NC","","_","_"
3,"pariṣṭobhantyā","_","_","pariṣṭubh","KDP","","_","_"
4,"kṛpā","_","_","kṛp","NC","","_","_"
1,"somāḥ","_","_","soma","NC","","_","_"
2,"śukrā","_","_","śukra","JJ","","_","_"
3,"gavāśiraḥ","_","_","gavāśir","JJ","","_","_"
1,"hinvāno","_","_","hi","KDP","","_","_"
2,"hetṛbhir","_","_","hetṛ","JJ","","_","_"
3,"yata","_","_","ya","PPP","","_","_"
4,"ā","_","_","ā","CADP","","_","_"
5,"vājaṃ","_","_","vāja","NC","","_","_"
6,"vājy","_","_","vājin","JJ","","_","_"
7,"akramīt","_","_","kra","V","kra","_","_"
1,"sīdanto","_","_","sad","KDP","","_","_"
2,"vanuṣo","_","_","vanus","JJ","","_","_"
3,"yathā","_","_","yathā","CCM","","_","_"
1,"ṛdhak","_","_","ṛdhak","CX","","_","_"
2,"soma","_","_","soma","NC","","_","_"
3,"svastaye","_","_","svasti","NC","","_","_"
4,"saṃjagmāno","_","_","saṃga","KDP","","_","_"
5,"divaḥ","_","_","div","NC","","_","_"
6,"kaviḥ","_","_","kavi","NC","","_","_"
1,"pavasva","_","_","pū","V","pū","_","_"
2,"sūryo","_","_","sūrya","NC","","_","_"
3,"dṛśe","_","_","dṛś","CGDI","","_","_"
