"WordID","word","NormSTEM","suffix","lemma","PoS","Root","NormSuffix","NormWord"
1,"brāhmaṇa","_","_","brāhmaṇa","NC","","_","_"
2,"uvāca","_","_","vak","V","vac","_","_"
1,"_","_","_","saṃkalpa","NC","","_","_"
2,"_","_","_","daṃśa","NC","","_","_"
3,"_","_","_","maśaka","NC","","_","_"
4,"_","_","_","śoka","NC","","_","_"
5,"_","_","_","harṣa","NC","","_","_"
6,"_","_","_","hima","JJ","","_","_"
7,"_","_","_","ātapa","NC","","_","_"
1,"_","_","_","moha","NC","","_","_"
2,"_","_","_","andhakāra","NC","","_","_"
3,"_","_","_","timira","JJ","","_","_"
4,"_","_","_","lobha","NC","","_","_"
5,"_","_","_","vyāla","NC","","_","_"
6,"_","_","_","sarīsṛpa","NC","","_","_"
1,"_","_","_","viṣaya","NC","","_","_"
2,"_","_","_","eka","PPX","","_","_"
3,"_","_","_","atyaya","NC","","_","_"
4,"_","_","_","adhvan","NC","","_","_"
5,"_","_","_","kāma","NC","","_","_"
6,"_","_","_","krodha","NC","","_","_"
7,"_","_","_","virodhaka","JJ","","_","_"
1,"tad","_","_","tad","PRD","","_","_"
2,"atītya","_","_","atī","CGDA","","_","_"
3,"_","_","_","mahat","JJ","","_","_"
4,"_","_","_","durga","NC","","_","_"
5,"praviṣṭo","_","_","praviś","PPP","","_","_"
6,"'smi","_","_","as","V","as","_","_"
7,"mahad","_","_","mahat","JJ","","_","_"
8,"vanam","_","_","vana","NC","","_","_"
1,"_","_","_","brāhmaṇī","NC","","_","_"
2,"_","_","_","vak","V","vac","_","_"
1,"kva","_","_","kva","CX","","_","_"
2,"tad","_","_","tad","PRD","","_","_"
3,"vanaṃ","_","_","vana","NC","","_","_"
4,"_","_","_","mahat","JJ","","_","_"
5,"_","_","_","prājña","JJ","","_","_"
6,"ke","_","_","kiṃ","PRQ","","_","_"
7,"vṛkṣāḥ","_","_","vṛkṣa","NC","","_","_"
8,"_","_","_","sarit","NC","","_","_"
9,"_","_","_","ca","CCD","","_","_"
10,"kāḥ","_","_","kiṃ","PRQ","","_","_"
1,"girayaḥ","_","_","giri","NC","","_","_"
2,"_","_","_","parvata","NC","","_","_"
3,"_","_","_","ca","CCD","","_","_"
4,"_","_","_","eva","CEM","","_","_"
5,"_","_","_","kiyat","JJ","","_","_"
6,"_","_","_","adhvan","NC","","_","_"
7,"tad","_","_","tad","PRD","","_","_"
8,"vanam","_","_","vana","NC","","_","_"
1,"brāhmaṇa","_","_","brāhmaṇa","NC","","_","_"
2,"uvāca","_","_","vak","V","vac","_","_"
1,"na","_","_","na","CNG","","_","_"
2,"tad","_","_","tad","PRD","","_","_"
3,"asti","_","_","as","V","as","_","_"
4,"pṛthagbhāve","_","_","pṛthagbhāva","NC","","_","_"
5,"kiṃcid","_","_","kiṃcit","PRI","","_","_"
6,"anyat","_","_","anya","PPX","","_","_"
7,"tataḥ","_","_","tatas","CX","","_","_"
8,"samam","_","_","sama","PPX","","_","_"
1,"na","_","_","na","CNG","","_","_"
2,"tad","_","_","tad","PRD","","_","_"
3,"_","_","_","as","V","as","_","_"
4,"a","_","_","alpha_privativum","NC","","_","_"
4,"_","_","_","pṛthagbhāva","NC","","_","_"
5,"kiṃcid","_","_","kiṃcit","PRI","","_","_"
6,"dūrataraṃ","_","_","dūratara","JJ","","_","_"
7,"tataḥ","_","_","tatas","CX","","_","_"
1,"_","_","_","tad","PRD","","_","_"
2,"_","_","_","hrasvatara","JJ","","_","_"
3,"_","_","_","na","CNG","","_","_"
4,"_","_","_","as","V","as","_","_"
5,"na","_","_","na","CNG","","_","_"
6,"tato","_","_","tatas","CX","","_","_"
7,"'sti","_","_","as","V","as","_","_"
8,"bṛhattaram","_","_","bṛhattara","JJ","","_","_"
1,"_","_","_","na","CNG","","_","_"
2,"_","_","_","as","V","as","_","_"
3,"tasmād","_","_","tad","PRD","","_","_"
4,"duḥkhataraṃ","_","_","duḥkhatara","JJ","","_","_"
5,"_","_","_","na","CNG","","_","_"
6,"_","_","_","as","V","as","_","_"
7,"_","_","_","anya","PPX","","_","_"
8,"_","_","_","tad","PRD","","_","_"
9,"_","_","_","sama","PPX","","_","_"
10,"sukham","_","_","sukha","NC","","_","_"
1,"na","_","_","na","CNG","","_","_"
2,"tat","_","_","tad","PRD","","_","_"
3,"praviśya","_","_","praviś","CGDA","","_","_"
4,"śocanti","_","_","śuc","V","śuc","_","_"
5,"na","_","_","na","CNG","","_","_"
6,"prahṛṣyanti","_","_","prahṛṣ","V","prahṛṣ","_","_"
7,"ca","_","_","ca","CCD","","_","_"
8,"dvijāḥ","_","_","dvija","NC","","_","_"
1,"na","_","_","na","CNG","","_","_"
2,"ca","_","_","ca","CCD","","_","_"
3,"bibhyati","_","_","bibh","V","bhī","_","_"
4,"keṣāṃcit","_","_","kiṃcit","PRI","","_","_"
5,"tebhyo","_","_","tad","PRD","","_","_"
6,"bibhyati","_","_","bibh","V","bhī","_","_"
7,"kecana","_","_","kaścana","PRI","","_","_"
1,"tasmin","_","_","tad","PRD","","_","_"
2,"vane","_","_","vana","NC","","_","_"
3,"sapta","_","_","saptan","NUM","","_","_"
4,"_","_","_","mahat","JJ","","_","_"
5,"_","_","_","druma","NC","","_","_"
6,"_","_","_","ca","CCD","","_","_"
7,"phalāni","_","_","phala","NC","","_","_"
8,"_","_","_","saptan","NUM","","_","_"
9,"_","_","_","atithi","NC","","_","_"
10,"_","_","_","ca","CCD","","_","_"
11,"sapta","_","_","saptan","NUM","","_","_"
1,"_","_","_","saptan","NUM","","_","_"
2,"_","_","_","āśrama","NC","","_","_"
3,"sapta","_","_","saptan","NUM","","_","_"
4,"_","_","_","samādhi","NC","","_","_"
5,"_","_","_","ca","CCD","","_","_"
6,"_","_","_","dīkṣā","NC","","_","_"
7,"_","_","_","ca","CCD","","_","_"
8,"_","_","_","saptan","NUM","","_","_"
9,"_","_","_","tad","PRD","","_","_"
10,"_","_","_","araṇya","NC","","_","_"
11,"_","_","_","rūpa","NC","","_","_"
1,"_","_","_","pañcan","NUM","","_","_"
2,"_","_","_","varṇa","NC","","_","_"
3,"divyāni","_","_","divya","JJ","","_","_"
4,"puṣpāṇi","_","_","puṣpa","NC","","_","_"
5,"ca","_","_","ca","CCD","","_","_"
6,"phalāni","_","_","phala","NC","","_","_"
7,"ca","_","_","ca","CCD","","_","_"
1,"sṛjantaḥ","_","_","sṛj","KDP","","_","_"
2,"_","_","_","pādapa","NC","","_","_"
3,"_","_","_","tatra","CAD","","_","_"
4,"vyāpya","_","_","vyāp","CGDA","","_","_"
5,"tiṣṭhanti","_","_","tiṣṭh","V","sthā","_","_"
6,"tad","_","_","tad","PRD","","_","_"
7,"vanam","_","_","vana","NC","","_","_"
1,"suvarṇāni","_","_","suvarṇa","JJ","","_","_"
2,"_","_","_","dvi","NUM","","_","_"
3,"_","_","_","varṇa","NC","","_","_"
4,"puṣpāṇi","_","_","puṣpa","NC","","_","_"
5,"ca","_","_","ca","CCD","","_","_"
6,"phalāni","_","_","phala","NC","","_","_"
7,"ca","_","_","ca","CCD","","_","_"
1,"sṛjantaḥ","_","_","sṛj","KDP","","_","_"
2,"_","_","_","pādapa","NC","","_","_"
3,"_","_","_","tatra","CAD","","_","_"
4,"vyāpya","_","_","vyāp","CGDA","","_","_"
5,"tiṣṭhanti","_","_","tiṣṭh","V","sthā","_","_"
6,"tad","_","_","tad","PRD","","_","_"
7,"vanam","_","_","vana","NC","","_","_"
1,"_","_","_","catur","NUM","","_","_"
2,"_","_","_","varṇa","NC","","_","_"
3,"divyāni","_","_","divya","JJ","","_","_"
4,"puṣpāṇi","_","_","puṣpa","NC","","_","_"
5,"ca","_","_","ca","CCD","","_","_"
6,"phalāni","_","_","phala","NC","","_","_"
7,"ca","_","_","ca","CCD","","_","_"
1,"sṛjantaḥ","_","_","sṛj","KDP","","_","_"
2,"_","_","_","pādapa","NC","","_","_"
3,"_","_","_","tatra","CAD","","_","_"
4,"vyāpya","_","_","vyāp","CGDA","","_","_"
5,"tiṣṭhanti","_","_","tiṣṭh","V","sthā","_","_"
6,"tad","_","_","tad","PRD","","_","_"
7,"vanam","_","_","vana","NC","","_","_"
1,"śaṃkarāṇi","_","_","śaṃkara","JJ","","_","_"
2,"_","_","_","tri","NUM","","_","_"
3,"_","_","_","varṇa","NC","","_","_"
4,"puṣpāṇi","_","_","puṣpa","NC","","_","_"
5,"ca","_","_","ca","CCD","","_","_"
6,"phalāni","_","_","phala","NC","","_","_"
7,"ca","_","_","ca","CCD","","_","_"
1,"sṛjantaḥ","_","_","sṛj","KDP","","_","_"
2,"_","_","_","pādapa","NC","","_","_"
3,"_","_","_","tatra","CAD","","_","_"
4,"vyāpya","_","_","vyāp","CGDA","","_","_"
5,"tiṣṭhanti","_","_","tiṣṭh","V","sthā","_","_"
6,"tad","_","_","tad","PRD","","_","_"
7,"vanam","_","_","vana","NC","","_","_"
1,"_","_","_","surabhi","JJ","","_","_"
2,"_","_","_","eka","PPX","","_","_"
3,"_","_","_","varṇa","NC","","_","_"
4,"puṣpāṇi","_","_","puṣpa","NC","","_","_"
5,"ca","_","_","ca","CCD","","_","_"
6,"phalāni","_","_","phala","NC","","_","_"
7,"ca","_","_","ca","CCD","","_","_"
1,"sṛjantaḥ","_","_","sṛj","KDP","","_","_"
2,"_","_","_","pādapa","NC","","_","_"
3,"_","_","_","tatra","CAD","","_","_"
4,"vyāpya","_","_","vyāp","CGDA","","_","_"
5,"tiṣṭhanti","_","_","tiṣṭh","V","sthā","_","_"
6,"tad","_","_","tad","PRD","","_","_"
7,"vanam","_","_","vana","NC","","_","_"
1,"_","_","_","bahu","JJ","","_","_"
2,"_","_","_","avyakta","JJ","","_","_"
3,"_","_","_","varṇa","NC","","_","_"
4,"puṣpāṇi","_","_","puṣpa","NC","","_","_"
5,"ca","_","_","ca","CCD","","_","_"
6,"phalāni","_","_","phala","NC","","_","_"
7,"ca","_","_","ca","CCD","","_","_"
1,"visṛjantau","_","_","visṛj","KDP","","_","_"
2,"_","_","_","mahat","JJ","","_","_"
3,"_","_","_","vṛkṣa","NC","","_","_"
4,"tad","_","_","tad","PRD","","_","_"
5,"vanaṃ","_","_","vana","NC","","_","_"
6,"vyāpya","_","_","vyāp","CGDA","","_","_"
7,"tiṣṭhataḥ","_","_","tiṣṭh","V","sthā","_","_"
1,"eko","_","_","eka","PPX","","_","_"
2,"_","_","_","hi","CX","","_","_"
3,"_","_","_","agni","NC","","_","_"
4,"_","_","_","su","CAD","","_","_"
5,"_","_","_","manas","NC","","_","_"
6,"brāhmaṇo","_","_","brāhmaṇa","NC","","_","_"
7,"'tra","_","_","atra","CAD","","_","_"
8,"_","_","_","pañcan","NUM","","_","_"
9,"_","_","_","indriya","NC","","_","_"
10,"_","_","_","samidh","NC","","_","_"
11,"_","_","_","ca","CCD","","_","_"
12,"_","_","_","atra","CAD","","_","_"
13,"santi","_","_","as","V","as","_","_"
1,"tebhyo","_","_","tad","PRD","","_","_"
2,"mokṣāḥ","_","_","mokṣa","NC","","_","_"
3,"sapta","_","_","saptan","NUM","","_","_"
4,"bhavanti","_","_","bhav","V","bhū","_","_"
5,"dīkṣā","_","_","dīkṣā","NC","","_","_"
6,"guṇāḥ","_","_","guṇa","NC","","_","_"
7,"_","_","_","phala","NC","","_","_"
8,"_","_","_","atithi","NC","","_","_"
9,"_","_","_","phala","NC","","_","_"
10,"_","_","_","āśā","NC","","_","_"
1,"ātithyaṃ","_","_","ātithya","NC","","_","_"
2,"pratigṛhṇanti","_","_","pratigrah","V","pratigrah","_","_"
3,"tatra","_","_","tatra","CAD","","_","_"
4,"sapta","_","_","saptan","NUM","","_","_"
5,"_","_","_","mahat","JJ","","_","_"
6,"_","_","_","ṛṣi","NC","","_","_"
1,"arciteṣu","_","_","arcay","PPP","","_","_"
2,"pralīneṣu","_","_","pralī","PPP","","_","_"
3,"_","_","_","tad","PRD","","_","_"
4,"_","_","_","anya","PPX","","_","_"
5,"rocate","_","_","roc","V","ruc","_","_"
6,"vanam","_","_","vana","NC","","_","_"
1,"_","_","_","pratijñā","NC","","_","_"
2,"_","_","_","vṛkṣa","NC","","_","_"
3,"aphalaṃ","_","_","aphala","JJ","","_","_"
4,"_","_","_","śānti","NC","","_","_"
5,"_","_","_","chāyā","NC","","_","_"
6,"_","_","_","samanvita","JJ","","_","_"
1,"_","_","_","jñāna","NC","","_","_"
2,"_","_","_","āśraya","NC","","_","_"
3,"_","_","_","tṛpti","NC","","_","_"
4,"_","_","_","toya","NC","","_","_"
5,"_","_","_","antar","CAD","","_","_"
6,"_","_","_","kṣetrajña","NC","","_","_"
7,"_","_","_","bhāskara","JJ","","_","_"
1,"ye","_","_","yad","PRL","","_","_"
2,"'dhigacchanti","_","_","adhiga","V","adhiga","_","_"
3,"tat","_","_","tad","PRD","","_","_"
4,"_","_","_","sat","JJ","","_","_"
5,"_","_","_","tad","PRD","","_","_"
6,"_","_","_","na","CNG","","_","_"
7,"_","_","_","as","V","as","_","_"
8,"bhayaṃ","_","_","bhaya","NC","","_","_"
9,"punaḥ","_","_","punar","CAD","","_","_"
1,"ūrdhvaṃ","_","_","ūrdhva","CX","","_","_"
2,"_","_","_","ca","CCD","","_","_"
3,"_","_","_","avāk","CX","","_","_"
4,"ca","_","_","ca","CCD","","_","_"
5,"tiryak","_","_","tiryañc","JJ","","_","_"
6,"ca","_","_","ca","CCD","","_","_"
7,"tasya","_","_","tad","PRD","","_","_"
8,"_","_","_","na","CNG","","_","_"
9,"_","_","_","anta","NC","","_","_"
10,"'dhigamyate","_","_","adhiga","V","adhiga","_","_"
1,"sapta","_","_","saptan","NUM","","_","_"
2,"_","_","_","strī","NC","","_","_"
3,"_","_","_","tatra","CAD","","_","_"
4,"vasanti","_","_","vas","V","vas","_","_"
5,"sadyo","_","_","sadyas","CAD","","_","_"
6,"'vāṅmukhā","_","_","avāṅmukha","JJ","","_","_"
7,"bhānumatyo","_","_","bhānumat","JJ","","_","_"
8,"janitryaḥ","_","_","janitrī","NC","","_","_"
1,"ūrdhvaṃ","_","_","ūrdhva","CX","","_","_"
2,"rasānāṃ","_","_","rasa","NC","","_","_"
3,"dadate","_","_","dad","V","dā","_","_"
4,"prajābhyaḥ","_","_","prajā","NC","","_","_"
5,"sarvān","_","_","sarva","JQ","","_","_"
6,"yathā","_","_","yathā","CCM","","_","_"
7,"sarvam","_","_","sarva","JQ","","_","_"
8,"_","_","_","anitya","JJ","","_","_"
10,"ca","_","_","ca","CCD","","_","_"
1,"_","_","_","tatra","CAD","","_","_"
2,"_","_","_","eva","CEM","","_","_"
3,"pratitiṣṭhanti","_","_","prastha","V","pratiṣṭhā","_","_"
4,"_","_","_","punar","CAD","","_","_"
5,"_","_","_","tatra","CAD","","_","_"
6,"_","_","_","ude","V","udi","_","_"
7,"ca","_","_","ca","CCD","","_","_"
1,"sapta","_","_","saptan","NUM","","_","_"
2,"_","_","_","saptan","NUM","","_","_"
3,"_","_","_","ṛṣi","NC","","_","_"
4,"siddhā","_","_","siddha","NC","","_","_"
5,"_","_","_","vasiṣṭha","NC","","_","_"
6,"_","_","_","pramukha","JJ","","_","_"
7,"saha","_","_","saha","CX","","_","_"
1,"yaśo","_","_","yaśas","NC","","_","_"
2,"varco","_","_","varcas","NC","","_","_"
3,"_","_","_","bhaga","NC","","_","_"
4,"_","_","_","ca","CCD","","_","_"
5,"_","_","_","eva","CEM","","_","_"
6,"vijayaḥ","_","_","vijaya","NC","","_","_"
7,"_","_","_","siddhi","NC","","_","_"
8,"_","_","_","tejas","NC","","_","_"
1,"evam","_","_","eva","CX","","_","_"
2,"_","_","_","eva","CEM","","_","_"
3,"_","_","_","anuvart","V","anuvṛt","_","_"
4,"sapta","_","_","saptan","NUM","","_","_"
5,"jyotīṃṣi","_","_","jyotis","NC","","_","_"
6,"bhāskaram","_","_","bhāskara","NC","","_","_"
1,"girayaḥ","_","_","giri","NC","","_","_"
2,"_","_","_","parvata","NC","","_","_"
3,"_","_","_","ca","CCD","","_","_"
4,"_","_","_","eva","CEM","","_","_"
5,"santi","_","_","as","V","as","_","_"
6,"tatra","_","_","tatra","CAD","","_","_"
7,"samāsataḥ","_","_","samāsatas","CX","","_","_"
1,"_","_","_","nadī","NC","","_","_"
2,"_","_","_","ca","CCD","","_","_"
3,"sarito","_","_","sarit","NC","","_","_"
4,"vāri","_","_","vāri","NC","","_","_"
5,"vahantyo","_","_","vah","KDP","","_","_"
6,"_","_","_","brahman","NC","","_","_"
7,"_","_","_","sambhava","NC","","_","_"
1,"nadīnāṃ","_","_","nadī","NC","","_","_"
2,"_","_","_","saṃgama","NC","","_","_"
3,"_","_","_","tatra","CAD","","_","_"
4,"vaitānaḥ","_","_","vaitāna","JJ","","_","_"
5,"samupahvare","_","_","samupahvara","NC","","_","_"
1,"_","_","_","sva","JJ","","_","_"
2,"_","_","_","ātman","NC","","_","_"
3,"_","_","_","tṛp","PPP","","_","_"
4,"yato","_","_","yatas","CX","","_","_"
5,"yānti","_","_","yā","V","yā","_","_"
6,"sākṣād","_","_","sākṣāt","CX","","_","_"
7,"dāntāḥ","_","_","da","PPP","","_","_"
8,"pitāmaham","_","_","pitāmaha","NC","","_","_"
1,"_","_","_","kṛśa","JJ","","_","_"
2,"_","_","_","āśā","NC","","_","_"
3,"_","_","_","su","CAD","","_","_"
4,"_","_","_","vrata","NC","","_","_"
5,"_","_","_","āśā","NC","","_","_"
6,"_","_","_","ca","CCD","","_","_"
7,"tapasā","_","_","tapas","NC","","_","_"
8,"_","_","_","dah","PPP","","_","_"
9,"_","_","_","kilbiṣa","NC","","_","_"
1,"_","_","_","ātman","NC","","_","_"
2,"_","_","_","ātman","NC","","_","_"
3,"āveśya","_","_","āveśay","CGDA","","_","_"
4,"brahmāṇaṃ","_","_","brahman","NC","","_","_"
5,"samupāsate","_","_","samupās","V","samupās","_","_"
1,"ṛcam","_","_","ṛc","NC","","_","_"
2,"_","_","_","api","CX","","_","_"
3,"_","_","_","atra","CAD","","_","_"
4,"śaṃsanti","_","_","śaṃs","V","śaṃs","_","_"
5,"_","_","_","vidyā","NC","","_","_"
6,"_","_","_","araṇya","NC","","_","_"
7,"_","_","_","vid","JJ","","_","_"
8,"janāḥ","_","_","jana","NC","","_","_"
1,"tad","_","_","tad","PRD","","_","_"
2,"araṇyam","_","_","araṇya","NC","","_","_"
3,"abhipretya","_","_","abhipre","CGDA","","_","_"
4,"_","_","_","yathā","CCM","","_","_"
5,"_","_","_","dhīra","JJ","","_","_"
6,"ajāyata","_","_","jan","V","jan","_","_"
1,"etad","_","_","tad","PRD","","_","_"
2,"etādṛśaṃ","_","_","etādṛśa","JJ","","_","_"
3,"divyam","_","_","divya","JJ","","_","_"
4,"araṇyaṃ","_","_","araṇya","NC","","_","_"
5,"brāhmaṇā","_","_","brāhmaṇa","NC","","_","_"
6,"viduḥ","_","_","vid","V","vid","_","_"
1,"viditvā","_","_","vid","CGDA","","_","_"
2,"_","_","_","ca","CCD","","_","_"
3,"_","_","_","anuṣṭhā","V","anuṣṭhā","_","_"
4,"_","_","_","kṣetrajña","NC","","_","_"
5,"_","_","_","anudarśay","PPP","","_","_"
