"WordID","word","NormSTEM","suffix","lemma","PoS","Root","NormSuffix","NormWord"
1,"saṃjaya","_","_","saṃjaya","NC","","_","_"
2,"uvāca","_","_","vak","V","vac","_","_"
1,"prabhātāyāṃ","_","_","prabhā","PPP","","_","_"
2,"tu","_","_","tu","CCD","","_","_"
3,"śarvaryāṃ","_","_","śarvarī","NC","","_","_"
4,"bhīṣmaḥ","_","_","bhīṣma","NC","","_","_"
5,"_","_","_","śāṃtanava","NC","","_","_"
6,"_","_","_","tatas","CX","","_","_"
1,"_","_","_","anīka","NC","","_","_"
2,"_","_","_","anusaṃyāna","NC","","_","_"
3,"_","_","_","vyādiś","V","vyādiś","_","_"
4,"_","_","_","atha","CAD","","_","_"
5,"bhārata","_","_","bhārata","NC","","_","_"
1,"gāruḍaṃ","_","_","gāruḍa","JJ","","_","_"
2,"ca","_","_","ca","CCD","","_","_"
3,"_","_","_","mahat","JJ","","_","_"
4,"_","_","_","vyūha","NC","","_","_"
5,"cakre","_","_","kar","V","kṛ","_","_"
6,"_","_","_","śāṃtanava","NC","","_","_"
7,"_","_","_","tadā","CAD","","_","_"
1,"putrāṇāṃ","_","_","putra","NC","","_","_"
2,"te","_","_","tvat","PPR","","_","_"
3,"_","_","_","jaya","NC","","_","_"
4,"_","_","_","ākāṅkṣin","JJ","","_","_"
5,"bhīṣmaḥ","_","_","bhīṣma","NC","","_","_"
6,"_","_","_","kuru","NC","","_","_"
7,"_","_","_","pitāmaha","NC","","_","_"
1,"garuḍasya","_","_","garuḍa","NC","","_","_"
2,"svayaṃ","_","_","svaya","CX","","_","_"
3,"tuṇḍe","_","_","tuṇḍa","NC","","_","_"
4,"pitā","_","_","pitṛ","NC","","_","_"
5,"_","_","_","devavrata","NC","","_","_"
6,"_","_","_","tvat","PPR","","_","_"
1,"cakṣuṣī","_","_","cakṣus","NC","","_","_"
2,"ca","_","_","ca","CCD","","_","_"
3,"bharadvājaḥ","_","_","bharadvāja","NC","","_","_"
4,"kṛtavarmā","_","_","kṛtavarman","NC","","_","_"
5,"ca","_","_","ca","CCD","","_","_"
6,"sātvataḥ","_","_","sātvata","NC","","_","_"
1,"aśvatthāmā","_","_","aśvatthāman","NC","","_","_"
2,"_","_","_","kṛpa","NC","","_","_"
3,"_","_","_","ca","CCD","","_","_"
4,"_","_","_","eva","CEM","","_","_"
5,"śīrṣam","_","_","śīrṣa","NC","","_","_"
6,"āstāṃ","_","_","as","V","as","_","_"
7,"yaśasvinau","_","_","yaśasvin","JJ","","_","_"
1,"trigartair","_","_","trigarta","NC","","_","_"
2,"_","_","_","matsya","NC","","_","_"
3,"_","_","_","kaikeya","NC","","_","_"
4,"_","_","_","vāṭadhāna","NC","","_","_"
5,"_","_","_","ca","CCD","","_","_"
6,"saṃyutau","_","_","saṃyuta","JJ","","_","_"
1,"bhūriśravāḥ","_","_","bhūriśravas","NC","","_","_"
2,"śalaḥ","_","_","śala","NC","","_","_"
3,"śalyo","_","_","śalya","NC","","_","_"
4,"_","_","_","bhagadatta","NC","","_","_"
5,"_","_","_","ca","CCD","","_","_"
6,"māriṣa","_","_","māriṣa","NC","","_","_"
1,"madrakāḥ","_","_","madraka","NC","","_","_"
2,"_","_","_","sindhusauvīra","NC","","_","_"
3,"_","_","_","tathā","CX","","_","_"
4,"_","_","_","pañcanada","NC","","_","_"
5,"_","_","_","ca","CCD","","_","_"
6,"ye","_","_","yad","PRL","","_","_"
1,"jayadrathena","_","_","jayadratha","NC","","_","_"
2,"sahitā","_","_","sahita","JJ","","_","_"
3,"grīvāyāṃ","_","_","grīvā","NC","","_","_"
4,"saṃniveśitāḥ","_","_","saṃniveśay","PPP","","_","_"
1,"pṛṣṭhe","_","_","pṛṣṭha","NC","","_","_"
2,"duryodhano","_","_","duryodhana","NC","","_","_"
3,"rājā","_","_","rājan","NC","","_","_"
4,"sodaraiḥ","_","_","sodara","NC","","_","_"
5,"_","_","_","sa_saha","CX","","_","_"
6,"_","_","_","anuga","JJ","","_","_"
7,"vṛtaḥ","_","_","vṛ","PPP","","_","_"
1,"_","_","_","vinda","NC","","_","_"
2,"_","_","_","anuvinda","NC","","_","_"
3,"_","_","_","āvantya","NC","","_","_"
4,"_","_","_","kāmboja","NC","","_","_"
5,"_","_","_","ca","CCD","","_","_"
6,"śakaiḥ","_","_","śaka","NC","","_","_"
7,"saha","_","_","saha","CX","","_","_"
1,"puccham","_","_","puccha","NC","","_","_"
2,"_","_","_","as","V","as","_","_"
3,"_","_","_","mahat","JJ","","_","_"
4,"_","_","_","rāja","NC","","_","_"
5,"_","_","_","śūrasa","NC","","_","_"
6,"_","_","_","ca","CCD","","_","_"
7,"sarvaśaḥ","_","_","sarvaśas","CX","","_","_"
1,"_","_","_","māgadha","NC","","_","_"
2,"_","_","_","ca","CCD","","_","_"
3,"_","_","_","kaliṅga","NC","","_","_"
4,"_","_","_","ca","CCD","","_","_"
5,"_","_","_","dāśeraka","NC","","_","_"
6,"_","_","_","gaṇa","NC","","_","_"
7,"saha","_","_","saha","CX","","_","_"
1,"dakṣiṇaṃ","_","_","dakṣiṇa","JJ","","_","_"
2,"pakṣam","_","_","pakṣa","NC","","_","_"
3,"āsādya","_","_","āsāday","CGDA","","_","_"
4,"sthitā","_","_","sthā","PPP","","_","_"
5,"vyūhasya","_","_","vyūha","NC","","_","_"
6,"daṃśitāḥ","_","_","daṃśay","PPP","","_","_"
1,"_","_","_","kānana","NC","","_","_"
2,"_","_","_","ca","CCD","","_","_"
3,"_","_","_","vikuñja","NC","","_","_"
4,"_","_","_","ca","CCD","","_","_"
5,"muktāḥ","_","_","mukta","NC","","_","_"
6,"puṇḍrāviṣas","_","_","tathā","CX","","_","_"
1,"_","_","_","bṛhat","JJ","","_","_"
2,"_","_","_","bala","NC","","_","_"
3,"sahitā","_","_","sahita","JJ","","_","_"
4,"vāmaṃ","_","_","vāma","JJ","","_","_"
5,"pakṣam","_","_","pakṣa","NC","","_","_"
6,"upāśritāḥ","_","_","upāśri","PPP","","_","_"
1,"vyūḍhaṃ","_","_","vyūh","PPP","","_","_"
2,"dṛṣṭvā","_","_","dṛś","CGDA","","_","_"
3,"tu","_","_","tu","CCD","","_","_"
4,"tat","_","_","tad","PRD","","_","_"
5,"sainyaṃ","_","_","sainya","NC","","_","_"
6,"savyasācī","_","_","savyasācin","NC","","_","_"
7,"paraṃtapaḥ","_","_","paraṃtapa","JJ","","_","_"
1,"dhṛṣṭadyumnena","_","_","dhṛṣṭadyumna","NC","","_","_"
2,"sahitaḥ","_","_","sahita","JJ","","_","_"
3,"pratyavyūhata","_","_","prativyūh","V","prativyūh","_","_"
4,"saṃyuge","_","_","saṃyuga","NC","","_","_"
1,"ardhacandreṇa","_","_","ardhacandra","NC","","_","_"
2,"vyūhena","_","_","vyūha","NC","","_","_"
3,"vyūhaṃ","_","_","vyūha","NC","","_","_"
4,"tam","_","_","tad","PRD","","_","_"
5,"_","_","_","ati","CADP","","_","_"
6,"_","_","_","dāruṇa","JJ","","_","_"
1,"dakṣiṇaṃ","_","_","dakṣiṇa","JJ","","_","_"
2,"śṛṅgam","_","_","śṛṅga","NC","","_","_"
3,"āsthāya","_","_","āsthā","CGDA","","_","_"
4,"bhīmaseno","_","_","bhīmasa","NC","","_","_"
5,"vyarocata","_","_","viroc","V","viruc","_","_"
1,"_","_","_","nānā","CX","","_","_"
2,"_","_","_","śastra","NC","","_","_"
3,"_","_","_","ogha","NC","","_","_"
4,"_","_","_","sampad","PPP","","_","_"
5,"nānādeśyair","_","_","nānādeśya","JJ","","_","_"
6,"nṛpair","_","_","nṛpa","NC","","_","_"
7,"vṛtaḥ","_","_","vṛ","PPP","","_","_"
1,"tad","_","_","tad","PRD","","_","_"
2,"_","_","_","anu","CADP","","_","_"
3,"_","_","_","eva","CEM","","_","_"
4,"_","_","_","virāṭa","NC","","_","_"
5,"_","_","_","ca","CCD","","_","_"
6,"_","_","_","drupada","NC","","_","_"
7,"_","_","_","ca","CCD","","_","_"
8,"_","_","_","mahat","JJ","","_","_"
9,"_","_","_","ratha","NC","","_","_"
1,"_","_","_","tad","PRD","","_","_"
2,"_","_","_","anantara","CX","","_","_"
3,"_","_","_","eva","CEM","","_","_"
4,"_","_","_","as","V","as","_","_"
5,"_","_","_","nīla","NC","","_","_"
6,"nīlāyudhaiḥ","_","_","nīlāyudha","NC","","_","_"
7,"saha","_","_","saha","CX","","_","_"
1,"nīlād","_","_","nīla","NC","","_","_"
2,"anantaraṃ","_","_","anantara","CX","","_","_"
3,"_","_","_","ca","CCD","","_","_"
4,"_","_","_","eva","CEM","","_","_"
5,"dhṛṣṭaketur","_","_","dhṛṣṭaketu","NC","","_","_"
6,"_","_","_","mahat","JJ","","_","_"
7,"_","_","_","ratha","NC","","_","_"
1,"_","_","_","cedi","NC","","_","_"
2,"_","_","_","kāśi","NC","","_","_"
3,"_","_","_","karūṣa","NC","","_","_"
4,"_","_","_","ca","CCD","","_","_"
5,"_","_","_","paurava","NC","","_","_"
6,"_","_","_","ca","CCD","","_","_"
7,"_","_","_","abhisaṃvṛ","PPP","","_","_"
1,"dhṛṣṭadyumnaḥ","_","_","dhṛṣṭadyumna","NC","","_","_"
2,"śikhaṇḍī","_","_","śikhaṇḍin","NC","","_","_"
3,"ca","_","_","ca","CCD","","_","_"
4,"_","_","_","pāñcāla","NC","","_","_"
5,"_","_","_","ca","CCD","","_","_"
6,"prabhadrakāḥ","_","_","prabhadraka","NC","","_","_"
1,"madhye","_","_","madhya","NC","","_","_"
2,"sainyasya","_","_","sainya","NC","","_","_"
3,"mahataḥ","_","_","mahat","JJ","","_","_"
4,"sthitā","_","_","sthā","PPP","","_","_"
5,"yuddhāya","_","_","yuddha","NC","","_","_"
6,"bhārata","_","_","bhārata","NC","","_","_"
1,"_","_","_","tathā","CX","","_","_"
2,"_","_","_","eva","CEM","","_","_"
3,"dharmarājo","_","_","dharmarāja","NC","","_","_"
4,"'pi","_","_","api","CX","","_","_"
5,"_","_","_","gaja","NC","","_","_"
6,"_","_","_","anīka","NC","","_","_"
7,"saṃvṛtaḥ","_","_","saṃvṛ","PPP","","_","_"
1,"_","_","_","tatas","CX","","_","_"
2,"_","_","_","tu","CCD","","_","_"
3,"sātyakī","_","_","sātyaki","NC","","_","_"
4,"rājan","_","_","rājan","NC","","_","_"
5,"draupadyāḥ","_","_","draupadī","NC","","_","_"
6,"pañca","_","_","pañcan","NUM","","_","_"
7,"_","_","_","ca","CCD","","_","_"
8,"_","_","_","ātmaja","NC","","_","_"
1,"_","_","_","abhimanyu","NC","","_","_"
2,"_","_","_","tatas","CX","","_","_"
3,"_","_","_","tūrṇa","CX","","_","_"
4,"_","_","_","irāvat","NC","","_","_"
5,"_","_","_","ca","CCD","","_","_"
6,"tataḥ","_","_","tatas","CX","","_","_"
7,"param","_","_","para","CX","","_","_"
1,"_","_","_","bhaimaseni","NC","","_","_"
2,"_","_","_","tatas","CX","","_","_"
3,"rājan","_","_","rājan","NC","","_","_"
4,"_","_","_","kekaya","NC","","_","_"
5,"_","_","_","ca","CCD","","_","_"
6,"_","_","_","mahat","JJ","","_","_"
7,"_","_","_","ratha","NC","","_","_"
1,"tato","_","_","tatas","CX","","_","_"
2,"'bhūd","_","_","bhav","V","bhū","_","_"
3,"dvipadāṃ","_","_","dvipad","NC","","_","_"
4,"śreṣṭho","_","_","śreṣṭha","JJ","","_","_"
5,"vāmaṃ","_","_","vāma","JJ","","_","_"
6,"pārśvam","_","_","pārśva","NC","","_","_"
7,"upāśritaḥ","_","_","upāśri","PPP","","_","_"
1,"sarvasya","_","_","sarva","JQ","","_","_"
2,"jagato","_","_","jagat","NC","","_","_"
3,"goptā","_","_","goptṛ","JJ","","_","_"
4,"goptā","_","_","goptṛ","JJ","","_","_"
5,"yasya","_","_","yad","PRL","","_","_"
6,"janārdanaḥ","_","_","janārdana","NC","","_","_"
1,"evam","_","_","eva","CX","","_","_"
2,"_","_","_","tad","PRD","","_","_"
3,"_","_","_","mahat","JJ","","_","_"
4,"_","_","_","vyūha","NC","","_","_"
5,"pratyavyūhanta","_","_","prativyūh","V","prativyūh","_","_"
6,"pāṇḍavāḥ","_","_","pāṇḍava","NC","","_","_"
1,"_","_","_","vadha","NC","","_","_"
2,"_","_","_","artha","NC","","_","_"
3,"tava","_","_","tvat","PPR","","_","_"
4,"putrāṇāṃ","_","_","putra","NC","","_","_"
5,"_","_","_","tad","PRD","","_","_"
6,"_","_","_","pakṣa","NC","","_","_"
7,"ye","_","_","yad","PRL","","_","_"
8,"ca","_","_","ca","CCD","","_","_"
9,"saṃgatāḥ","_","_","saṃga","PPP","","_","_"
1,"tataḥ","_","_","tatas","CX","","_","_"
2,"pravavṛte","_","_","pravart","V","pravṛt","_","_"
3,"yuddhaṃ","_","_","yuddha","NC","","_","_"
4,"_","_","_","vyatiṣañj","PPP","","_","_"
5,"_","_","_","ratha","NC","","_","_"
6,"_","_","_","dvipa","NC","","_","_"
1,"tāvakānāṃ","_","_","tāvaka","JJ","","_","_"
2,"pareṣāṃ","_","_","para","PPX","","_","_"
3,"ca","_","_","ca","CCD","","_","_"
4,"nighnatām","_","_","nihan","KDP","","_","_"
5,"itaretaram","_","_","itaretara","PRC","","_","_"
1,"_","_","_","haya","NC","","_","_"
2,"_","_","_","ogha","NC","","_","_"
3,"_","_","_","ca","CCD","","_","_"
4,"_","_","_","ratha","NC","","_","_"
5,"_","_","_","ogha","NC","","_","_"
6,"_","_","_","ca","CCD","","_","_"
7,"tatra","_","_","tatra","CAD","","_","_"
8,"tatra","_","_","tatra","CAD","","_","_"
9,"viśāṃ","_","_","viś","NC","","_","_"
10,"pate","_","_","pati","NC","","_","_"
1,"saṃpatantaḥ","_","_","sampat","KDP","","_","_"
2,"sma","_","_","sma","CX","","_","_"
3,"dṛśyante","_","_","darś","V","dṛś","_","_"
4,"nighnamānāḥ","_","_","nihan","KDP","","_","_"
5,"parasparam","_","_","paraspara","PRC","","_","_"
1,"dhāvatāṃ","_","_","dhāv","KDP","","_","_"
2,"ca","_","_","ca","CCD","","_","_"
3,"_","_","_","ratha","NC","","_","_"
4,"_","_","_","ogha","NC","","_","_"
5,"nighnatāṃ","_","_","nihan","KDP","","_","_"
6,"ca","_","_","ca","CCD","","_","_"
7,"pṛthak","_","_","pṛthak","CX","","_","_"
8,"pṛthak","_","_","pṛthak","CX","","_","_"
1,"babhūva","_","_","bhav","V","bhū","_","_"
2,"tumulaḥ","_","_","tumula","JJ","","_","_"
3,"śabdo","_","_","śabda","NC","","_","_"
4,"vimiśro","_","_","vimiśra","JJ","","_","_"
5,"_","_","_","dundubhi","NC","","_","_"
6,"_","_","_","svana","NC","","_","_"
1,"_","_","_","diva","NC","","_","_"
2,"_","_","_","spṛś","JJ","","_","_"
3,"_","_","_","nara","NC","","_","_"
4,"_","_","_","vīra","NC","","_","_"
5,"nighnatām","_","_","nihan","KDP","","_","_"
6,"itaretaram","_","_","itaretara","PRC","","_","_"
1,"saṃprahāre","_","_","samprahāra","NC","","_","_"
2,"_","_","_","su","CAD","","_","_"
3,"_","_","_","tumula","JJ","","_","_"
4,"tava","_","_","tvat","PPR","","_","_"
5,"teṣāṃ","_","_","tad","PRD","","_","_"
6,"ca","_","_","ca","CCD","","_","_"
7,"bhārata","_","_","bhārata","NC","","_","_"
