"WordID","word","NormSTEM","suffix","lemma","PoS","Root","NormSuffix","NormWord"
1,"puru","_","_","puru","JJ","","_","_"
2,"tvā","_","_","tvat","PPR","","_","_"
3,"dāśvān","_","_","dāś","KDP","","_","_"
4,"voce","_","_","vak","V","vac","_","_"
5,"'rir","_","_","ari","NC","","_","_"
6,"agne","_","_","agni","NC","","_","_"
7,"tava","_","_","tvat","PPR","","_","_"
8,"svid","_","_","svid","CX","","_","_"
9,"ā","_","_","ā","CADP","","_","_"
1,"_","_","_","toda","NC","","_","_"
2,"_","_","_","iva","CCM","","_","_"
3,"śaraṇa","_","_","śaraṇa","NC","","_","_"
4,"ā","_","_","ā","CADP","","_","_"
5,"mahasya","_","_","maha","JJ","","_","_"
1,"vy","_","_","vi","CADP","","_","_"
2,"aninasya","_","_","anina","JJ","","_","_"
3,"dhaninaḥ","_","_","dhanin","JJ","","_","_"
4,"prahoṣe","_","_","prahoṣa","NC","","_","_"
5,"cid","_","_","cit","CEM","","_","_"
6,"_","_","_","a","CNG","","_","_"
7,"_","_","_","rā","KDP","","_","_"
1,"kadā","_","_","kadā","CX","","_","_"
2,"cana","_","_","cana","CX","","_","_"
3,"prajigato","_","_","pragā","KDP","","_","_"
4,"_","_","_","a","CNG","","_","_"
5,"_","_","_","devayu","JJ","","_","_"
1,"sa","_","_","sa_saha","CX","","_","_"
2,"candro","_","_","candra","JJ","","_","_"
3,"vipra","_","_","vipra","JJ","","_","_"
4,"martyo","_","_","martya","NC","","_","_"
5,"maho","_","_","maha","JJ","","_","_"
6,"vrādhantamo","_","_","vrādhantama","JJ","","_","_"
7,"divi","_","_","div","NC","","_","_"
1,"pra","_","_","pra","CADP","","_","_"
2,"_","_","_","pra","CADP","","_","_"
3,"_","_","_","id","CEM","","_","_"
4,"te","_","_","tvat","PPR","","_","_"
5,"agne","_","_","agni","NC","","_","_"
6,"vanuṣaḥ","_","_","vanus","JJ","","_","_"
7,"syāma","_","_","as","V","as","_","_"
