"WordID","word","NormSTEM","suffix","lemma","PoS","Root","NormSuffix","NormWord"
1,"vaiśaṃpāyana","_","_","vaiśampāyana","NC","","_","_"
2,"uvāca","_","_","vak","V","vac","_","_"
1,"saindhavair","_","_","saindhava","NC","","_","_"
2,"abhavad","_","_","bhav","V","bhū","_","_"
3,"yuddhaṃ","_","_","yuddha","NC","","_","_"
4,"_","_","_","tatas","CX","","_","_"
5,"_","_","_","tad","PRD","","_","_"
6,"kirīṭinaḥ","_","_","kirīṭin","NC","","_","_"
1,"_","_","_","han","PPP","","_","_"
2,"_","_","_","śeṣa","NC","","_","_"
3,"_","_","_","mahat","JJ","","_","_"
4,"_","_","_","rāja","NC","","_","_"
5,"hatānāṃ","_","_","han","PPP","","_","_"
6,"ca","_","_","ca","CCD","","_","_"
7,"sutair","_","_","suta","NC","","_","_"
8,"api","_","_","api","CX","","_","_"
1,"te","_","_","tad","PRD","","_","_"
2,"'vatīrṇam","_","_","avatṛ","PPP","","_","_"
3,"upaśrutya","_","_","upaśru","CGDA","","_","_"
4,"viṣayaṃ","_","_","viṣaya","NC","","_","_"
5,"śvetavāhanam","_","_","śvetavāhana","NC","","_","_"
1,"pratyudyayur","_","_","pratyudyā","V","pratyudyā","_","_"
2,"amṛṣyanto","_","_","amṛṣyat","JJ","","_","_"
3,"rājānaḥ","_","_","rājan","NC","","_","_"
4,"_","_","_","pāṇḍava","NC","","_","_"
5,"_","_","_","ṛṣabha","NC","","_","_"
1,"aśvaṃ","_","_","aśva","NC","","_","_"
2,"ca","_","_","ca","CCD","","_","_"
3,"taṃ","_","_","tad","PRD","","_","_"
4,"parāmṛśya","_","_","parāmṛś","CGDA","","_","_"
5,"_","_","_","viṣaya","NC","","_","_"
6,"_","_","_","anta","NC","","_","_"
7,"_","_","_","viṣa","NC","","_","_"
8,"_","_","_","upama","JJ","","_","_"
1,"na","_","_","na","CNG","","_","_"
2,"bhayaṃ","_","_","bhaya","NC","","_","_"
3,"cakrire","_","_","kar","V","kṛ","_","_"
4,"pārthād","_","_","pārtha","NC","","_","_"
5,"bhīmasenād","_","_","bhīmasa","NC","","_","_"
6,"anantarāt","_","_","anantara","JJ","","_","_"
1,"te","_","_","tad","PRD","","_","_"
2,"'vidūrād","_","_","avidūra","NC","","_","_"
3,"dhanuṣpāṇiṃ","_","_","dhanuṣpāṇi","JJ","","_","_"
4,"yajñiyasya","_","_","yajñiya","JJ","","_","_"
5,"hayasya","_","_","haya","NC","","_","_"
6,"ca","_","_","ca","CCD","","_","_"
1,"bībhatsuṃ","_","_","bībhatsu","NC","","_","_"
2,"pratyapadyanta","_","_","pratipad","V","pratipad","_","_"
3,"padātinam","_","_","padātin","NC","","_","_"
4,"avasthitam","_","_","avasthā","PPP","","_","_"
1,"_","_","_","tatas","CX","","_","_"
2,"_","_","_","tad","PRD","","_","_"
3,"tu","_","_","tu","CCD","","_","_"
4,"_","_","_","mahat","JJ","","_","_"
5,"_","_","_","vīrya","NC","","_","_"
6,"rājānaḥ","_","_","rājan","NC","","_","_"
7,"paryavārayan","_","_","parivāray","V","parivāray","_","_"
1,"jigīṣanto","_","_","jigīṣ","KDP","","_","_"
2,"_","_","_","nara","NC","","_","_"
3,"_","_","_","vyāghra","NC","","_","_"
4,"pūrvaṃ","_","_","pūrva","CX","","_","_"
5,"vinikṛtā","_","_","vinikṛ","PPP","","_","_"
6,"yudhi","_","_","yudh","NC","","_","_"
1,"te","_","_","tad","PRD","","_","_"
2,"_","_","_","nāman","NC","","_","_"
3,"_","_","_","atha","CAD","","_","_"
4,"gotrāṇi","_","_","gotra","NC","","_","_"
5,"karmāṇi","_","_","karman","NC","","_","_"
6,"vividhāni","_","_","vividha","JJ","","_","_"
7,"ca","_","_","ca","CCD","","_","_"
1,"_","_","_","kīrtay","KDP","","_","_"
2,"_","_","_","tadā","CAD","","_","_"
3,"pārthaṃ","_","_","pārtha","NC","","_","_"
4,"_","_","_","śara","NC","","_","_"
5,"_","_","_","varṣa","NC","","_","_"
6,"avākiran","_","_","avakṛ","V","avakṛ","_","_"
1,"te","_","_","tad","PRD","","_","_"
2,"kirantaḥ","_","_","kṛ","KDP","","_","_"
3,"_","_","_","śara","NC","","_","_"
4,"_","_","_","tīkṣṇa","JJ","","_","_"
5,"_","_","_","vāraṇa","NC","","_","_"
6,"_","_","_","indra","NC","","_","_"
7,"_","_","_","nivāraṇa","JJ","","_","_"
1,"raṇe","_","_","raṇa","NC","","_","_"
2,"jayam","_","_","jaya","NC","","_","_"
3,"abhīpsantaḥ","_","_","abhīps","KDP","","_","_"
4,"kaunteyaṃ","_","_","kaunteya","NC","","_","_"
5,"paryavārayan","_","_","parivāray","V","parivāray","_","_"
1,"te","_","_","tad","PRD","","_","_"
2,"_","_","_","asamīkṣya","CX","","_","_"
3,"_","_","_","eva","CEM","","_","_"
4,"taṃ","_","_","tad","PRD","","_","_"
5,"vīram","_","_","vīra","NC","","_","_"
6,"_","_","_","ugra","JJ","","_","_"
7,"_","_","_","karman","NC","","_","_"
8,"āhave","_","_","āhava","NC","","_","_"
1,"sarve","_","_","sarva","JQ","","_","_"
2,"yuyudhire","_","_","yudh","V","yudh","_","_"
3,"vīrā","_","_","vīra","NC","","_","_"
4,"_","_","_","ratha","NC","","_","_"
5,"_","_","_","stha","JJ","","_","_"
6,"_","_","_","tad","PRD","","_","_"
7,"padātinam","_","_","padātin","NC","","_","_"
1,"te","_","_","tad","PRD","","_","_"
2,"tam","_","_","tad","PRD","","_","_"
3,"ājaghnire","_","_","āhan","V","āhan","_","_"
4,"vīraṃ","_","_","vīra","NC","","_","_"
5,"_","_","_","nivāta","JJ","","_","_"
6,"_","_","_","kavaca","NC","","_","_"
7,"_","_","_","antaka","NC","","_","_"
1,"_","_","_","saṃśaptaka","NC","","_","_"
2,"_","_","_","nihantṛ","JJ","","_","_"
3,"hantāraṃ","_","_","hantṛ","JJ","","_","_"
4,"saindhavasya","_","_","saindhava","NC","","_","_"
5,"ca","_","_","ca","CCD","","_","_"
1,"tato","_","_","tatas","CX","","_","_"
2,"_","_","_","ratha","NC","","_","_"
3,"_","_","_","sahasra","NUM","","_","_"
4,"hayānām","_","_","haya","NC","","_","_"
5,"ayutena","_","_","ayuta","NC","","_","_"
6,"ca","_","_","ca","CCD","","_","_"
1,"koṣṭhakīkṛtya","_","_","koṣṭhakīkṛ","CGDA","","_","_"
2,"kaunteyaṃ","_","_","kaunteya","NC","","_","_"
3,"samprahṛṣṭam","_","_","samprahṛṣ","PPP","","_","_"
4,"ayodhayan","_","_","yodhay","V","yodhay","_","_"
1,"saṃsmaranto","_","_","saṃsmṛ","KDP","","_","_"
2,"vadhaṃ","_","_","vadha","NC","","_","_"
3,"vīrāḥ","_","_","vīra","NC","","_","_"
4,"_","_","_","sindhu","NC","","_","_"
5,"_","_","_","rāja","NC","","_","_"
6,"dhīmataḥ","_","_","dhīmat","JJ","","_","_"
1,"jayadrathasya","_","_","jayadratha","NC","","_","_"
2,"kauravya","_","_","kauravya","NC","","_","_"
3,"samare","_","_","samara","NC","","_","_"
4,"savyasācinā","_","_","savyasācin","NC","","_","_"
1,"tataḥ","_","_","tatas","CX","","_","_"
2,"_","_","_","parjanya","NC","","_","_"
3,"_","_","_","vat","CX","","_","_"
4,"sarve","_","_","sarva","JQ","","_","_"
5,"_","_","_","śara","NC","","_","_"
6,"_","_","_","vṛṣṭi","NC","","_","_"
7,"avāsṛjan","_","_","avasṛj","V","avasṛj","_","_"
1,"taiḥ","_","_","tad","PRD","","_","_"
2,"kīrṇaḥ","_","_","kṛ","PPP","","_","_"
3,"śuśubhe","_","_","śubh","V","śubh","_","_"
4,"pārtho","_","_","pārtha","NC","","_","_"
5,"ravir","_","_","ravi","NC","","_","_"
6,"_","_","_","megha","NC","","_","_"
7,"_","_","_","antara","NC","","_","_"
8,"yathā","_","_","yathā","CCM","","_","_"
1,"sa","_","_","tad","PRD","","_","_"
2,"śaraiḥ","_","_","śara","NC","","_","_"
3,"samavacchanno","_","_","samavacchad","PPP","","_","_"
4,"dadṛśe","_","_","darś","V","dṛś","_","_"
5,"_","_","_","pāṇḍava","NC","","_","_"
6,"_","_","_","ṛṣabha","NC","","_","_"
1,"_","_","_","pañjara","NC","","_","_"
2,"_","_","_","antara","NC","","_","_"
3,"_","_","_","saṃcārin","JJ","","_","_"
4,"śakunta","_","_","śakunta","NC","","_","_"
5,"iva","_","_","iva","CCM","","_","_"
6,"bhārata","_","_","bhārata","NC","","_","_"
1,"tato","_","_","tatas","CX","","_","_"
2,"hāhākṛtaṃ","_","_","hāhākṛta","JJ","","_","_"
3,"sarvaṃ","_","_","sarva","JQ","","_","_"
4,"kaunteye","_","_","kaunteya","NC","","_","_"
5,"_","_","_","śara","NC","","_","_"
6,"_","_","_","pīḍay","PPP","","_","_"
1,"trailokyam","_","_","trailokya","NC","","_","_"
2,"abhavad","_","_","bhav","V","bhū","_","_"
3,"rājan","_","_","rājan","NC","","_","_"
4,"_","_","_","ravi","NC","","_","_"
5,"_","_","_","ca","CCD","","_","_"
6,"_","_","_","as","V","as","_","_"
7,"_","_","_","rajas","NC","","_","_"
8,"_","_","_","aruṇa","JJ","","_","_"
1,"tato","_","_","tatas","CX","","_","_"
2,"vavau","_","_","vā","V","vā","_","_"
3,"_","_","_","mahat","JJ","","_","_"
4,"_","_","_","rāja","NC","","_","_"
5,"māruto","_","_","māruta","NC","","_","_"
6,"_","_","_","roman","NC","","_","_"
7,"_","_","_","harṣaṇa","JJ","","_","_"
1,"rāhur","_","_","rāhu","NC","","_","_"
2,"agrasad","_","_","gras","V","gras","_","_"
3,"ādityaṃ","_","_","āditya","NC","","_","_"
4,"yugapat","_","_","yugapad","CX","","_","_"
5,"somam","_","_","soma","NC","","_","_"
6,"eva","_","_","eva","CEM","","_","_"
7,"ca","_","_","ca","CCD","","_","_"
1,"_","_","_","ulkā","NC","","_","_"
2,"_","_","_","ca","CCD","","_","_"
3,"jaghnire","_","_","han","V","han","_","_"
4,"sūryaṃ","_","_","sūrya","NC","","_","_"
5,"vikīryantyaḥ","_","_","vikṛ","KDP","","_","_"
6,"samantataḥ","_","_","samantataḥ","CX","","_","_"
1,"_","_","_","vepathu","NC","","_","_"
2,"_","_","_","ca","CCD","","_","_"
3,"_","_","_","bhav","V","bhū","_","_"
4,"rājan","_","_","rājan","NC","","_","_"
5,"kailāsasya","_","_","kailāsa","NC","","_","_"
6,"_","_","_","mahat","JJ","","_","_"
7,"_","_","_","giri","NC","","_","_"
1,"_","_","_","muñc","V","muc","_","_"
2,"_","_","_","ca","CCD","","_","_"
3,"_","_","_","asra","NC","","_","_"
4,"_","_","_","ati","CADP","","_","_"
5,"_","_","_","uṣṇa","JJ","","_","_"
6,"_","_","_","duḥkha","NC","","_","_"
7,"_","_","_","śoka","NC","","_","_"
8,"_","_","_","samanvita","JJ","","_","_"
1,"saptarṣayo","_","_","saptarṣi","NC","","_","_"
2,"_","_","_","jan","PPP","","_","_"
3,"_","_","_","bhaya","NC","","_","_"
4,"_","_","_","tathā","CX","","_","_"
5,"devarṣayo","_","_","devarṣi","NC","","_","_"
6,"'pi","_","_","api","CX","","_","_"
7,"ca","_","_","ca","CCD","","_","_"
1,"_","_","_","śaśa","NC","","_","_"
2,"_","_","_","ca","CCD","","_","_"
3,"_","_","_","āśu","CX","","_","_"
4,"vinirbhidya","_","_","vinirbhid","CGDA","","_","_"
5,"maṇḍalaṃ","_","_","maṇḍala","NC","","_","_"
6,"śaśino","_","_","śaśin","NC","","_","_"
7,"'patat","_","_","pat","V","pat","_","_"
1,"_","_","_","viparīta","JJ","","_","_"
2,"_","_","_","tadā","CAD","","_","_"
3,"_","_","_","rājan","NC","","_","_"
4,"_","_","_","tad","PRD","","_","_"
5,"_","_","_","utpāta","NC","","_","_"
6,"_","_","_","lakṣaṇa","NC","","_","_"
1,"_","_","_","rāsabha","NC","","_","_"
2,"_","_","_","aruṇa","JJ","","_","_"
3,"_","_","_","saṃkāśa","NC","","_","_"
4,"dhanuṣmantaḥ","_","_","dhanuṣmat","JJ","","_","_"
5,"_","_","_","sa_saha","CX","","_","_"
6,"_","_","_","vidyut","NC","","_","_"
1,"āvṛtya","_","_","āvṛ","CGDA","","_","_"
2,"gaganaṃ","_","_","gagana","NC","","_","_"
3,"meghā","_","_","megha","NC","","_","_"
4,"mumucur","_","_","muñc","V","muc","_","_"
5,"_","_","_","māṃsa","NC","","_","_"
6,"_","_","_","śoṇita","NC","","_","_"
1,"evam","_","_","eva","CX","","_","_"
2,"āsīt","_","_","as","V","as","_","_"
3,"tadā","_","_","tadā","CAD","","_","_"
4,"vīre","_","_","vīra","NC","","_","_"
5,"_","_","_","śara","NC","","_","_"
6,"_","_","_","varṣa","NC","","_","_"
7,"_","_","_","abhisaṃvṛ","PPP","","_","_"
1,"loke","_","_","loka","NC","","_","_"
2,"'smin","_","_","ida","PRD","","_","_"
3,"_","_","_","bharata","NC","","_","_"
4,"_","_","_","śreṣṭha","JJ","","_","_"
5,"tad","_","_","tad","PRD","","_","_"
6,"adbhutam","_","_","adbhuta","NC","","_","_"
7,"_","_","_","iva","CCM","","_","_"
8,"_","_","_","bhav","V","bhū","_","_"
1,"tasya","_","_","tad","PRD","","_","_"
2,"_","_","_","tad","PRD","","_","_"
3,"_","_","_","avakṛ","PPP","","_","_"
4,"_","_","_","śara","NC","","_","_"
5,"_","_","_","jāla","NC","","_","_"
6,"sarvaśaḥ","_","_","sarvaśas","CX","","_","_"
1,"mohāt","_","_","moha","NC","","_","_"
2,"papāta","_","_","pat","V","pat","_","_"
3,"gāṇḍīvam","_","_","gāṇḍīva","NC","","_","_"
4,"_","_","_","āvāpa","NC","","_","_"
5,"_","_","_","ca","CCD","","_","_"
6,"karād","_","_","kara","NC","","_","_"
7,"api","_","_","api","CX","","_","_"
1,"_","_","_","tad","PRD","","_","_"
2,"_","_","_","moha","NC","","_","_"
3,"anuprāpte","_","_","anuprāp","PPP","","_","_"
4,"_","_","_","śara","NC","","_","_"
5,"_","_","_","jāla","NC","","_","_"
6,"mahattaram","_","_","mahattara","JJ","","_","_"
1,"saindhavā","_","_","saindhava","NC","","_","_"
2,"_","_","_","muñc","V","muc","_","_"
3,"_","_","_","tūrṇa","CX","","_","_"
4,"_","_","_","ga","PPP","","_","_"
5,"_","_","_","sattva","NC","","_","_"
6,"_","_","_","mahat","JJ","","_","_"
7,"_","_","_","ratha","NC","","_","_"
1,"tato","_","_","tatas","CX","","_","_"
2,"_","_","_","moha","NC","","_","_"
3,"_","_","_","samāpad","PPP","","_","_"
4,"jñātvā","_","_","jñā","CGDA","","_","_"
5,"pārthaṃ","_","_","pārtha","NC","","_","_"
6,"divaukasaḥ","_","_","divaukas","NC","","_","_"
1,"sarve","_","_","sarva","JQ","","_","_"
2,"_","_","_","vitras","PPP","","_","_"
3,"_","_","_","manas","NC","","_","_"
4,"_","_","_","tad","PRD","","_","_"
5,"_","_","_","śānti","NC","","_","_"
6,"_","_","_","parābhav","V","parābhū","_","_"
1,"tato","_","_","tatas","CX","","_","_"
2,"devarṣayaḥ","_","_","devarṣi","NC","","_","_"
3,"sarve","_","_","sarva","JQ","","_","_"
4,"tathā","_","_","tathā","CX","","_","_"
5,"saptarṣayo","_","_","saptarṣi","NC","","_","_"
6,"'pi","_","_","api","CX","","_","_"
7,"ca","_","_","ca","CCD","","_","_"
1,"_","_","_","brahmarṣi","NC","","_","_"
2,"_","_","_","ca","CCD","","_","_"
3,"vijayaṃ","_","_","vijaya","NC","","_","_"
4,"jepuḥ","_","_","jap","V","jap","_","_"
5,"pārthasya","_","_","pārtha","NC","","_","_"
6,"dhīmataḥ","_","_","dhīmat","JJ","","_","_"
1,"tataḥ","_","_","tatas","CX","","_","_"
2,"pradīpite","_","_","pradīpay","PPP","","_","_"
3,"devaiḥ","_","_","deva","NC","","_","_"
4,"_","_","_","pārtha","NC","","_","_"
5,"_","_","_","tejas","NC","","_","_"
6,"pārthiva","_","_","pārthiva","NC","","_","_"
1,"_","_","_","tiṣṭh","V","sthā","_","_"
2,"_","_","_","acala","NC","","_","_"
3,"_","_","_","vat","CX","","_","_"
4,"dhīmān","_","_","dhīmat","JJ","","_","_"
5,"saṃgrāme","_","_","saṃgrāma","NC","","_","_"
6,"_","_","_","parama","JJ","","_","_"
7,"_","_","_","astra","NC","","_","_"
8,"_","_","_","vid","JJ","","_","_"
1,"vicakarṣa","_","_","vikṛṣ","V","vikṛṣ","_","_"
2,"dhanur","_","_","dhanus","NC","","_","_"
3,"divyaṃ","_","_","divya","JJ","","_","_"
4,"tataḥ","_","_","tatas","CX","","_","_"
5,"_","_","_","kaurava","NC","","_","_"
6,"_","_","_","nandana","NC","","_","_"
1,"_","_","_","yantra","NC","","_","_"
2,"_","_","_","iva","CCM","","_","_"
3,"_","_","_","iha","CAD","","_","_"
4,"śabdo","_","_","śabda","NC","","_","_"
5,"_","_","_","bhav","V","bhū","_","_"
6,"_","_","_","mahat","JJ","","_","_"
7,"_","_","_","tad","PRD","","_","_"
8,"punaḥ","_","_","punar","CAD","","_","_"
9,"punaḥ","_","_","punar","CAD","","_","_"
1,"tataḥ","_","_","tatas","CX","","_","_"
2,"sa","_","_","tad","PRD","","_","_"
3,"_","_","_","śara","NC","","_","_"
4,"_","_","_","varṣa","NC","","_","_"
5,"pratyamitrān","_","_","pratyamitra","NC","","_","_"
6,"prati","_","_","prati","CADP","","_","_"
7,"prabhuḥ","_","_","prabhu","JJ","","_","_"
1,"vavarṣa","_","_","vṛṣ","V","vṛṣ","_","_"
2,"dhanuṣā","_","_","dhanus","NC","","_","_"
3,"pārtho","_","_","pārtha","NC","","_","_"
4,"_","_","_","varṣa","NC","","_","_"
5,"_","_","_","iva","CCM","","_","_"
6,"sureśvaraḥ","_","_","sureśvara","NC","","_","_"
1,"_","_","_","tatas","CX","","_","_"
2,"_","_","_","tad","PRD","","_","_"
3,"saindhavā","_","_","saindhava","JJ","","_","_"
4,"yodhāḥ","_","_","yodha","NC","","_","_"
5,"sarva","_","_","sarva","JQ","","_","_"
6,"eva","_","_","eva","CEM","","_","_"
7,"_","_","_","sa_saha","CX","","_","_"
8,"_","_","_","rājaka","NC","","_","_"
1,"_","_","_","na","CNG","","_","_"
2,"_","_","_","darś","V","dṛś","_","_"
3,"śaraiḥ","_","_","śara","NC","","_","_"
4,"kīrṇāḥ","_","_","kṛ","PPP","","_","_"
5,"śalabhair","_","_","śalabha","NC","","_","_"
6,"iva","_","_","iva","CCM","","_","_"
7,"pāvakāḥ","_","_","pāvaka","NC","","_","_"
1,"tasya","_","_","tad","PRD","","_","_"
2,"śabdena","_","_","śabda","NC","","_","_"
3,"vitresur","_","_","vitras","V","vitras","_","_"
4,"_","_","_","bhaya","NC","","_","_"
5,"_","_","_","ārta","JJ","","_","_"
6,"_","_","_","ca","CCD","","_","_"
7,"vidudruvuḥ","_","_","vidru","V","vidru","_","_"
1,"_","_","_","muñc","V","muc","_","_"
2,"_","_","_","ca","CCD","","_","_"
3,"_","_","_","aśru","NC","","_","_"
4,"_","_","_","śoka","NC","","_","_"
5,"_","_","_","ārta","JJ","","_","_"
6,"_","_","_","svap","V","svap","_","_"
7,"_","_","_","ca","CCD","","_","_"
8,"_","_","_","api","CX","","_","_"
9,"saindhavāḥ","_","_","saindhava","NC","","_","_"
1,"_","_","_","tad","PRD","","_","_"
2,"_","_","_","tu","CCD","","_","_"
3,"_","_","_","sarva","JQ","","_","_"
4,"_","_","_","nara","NC","","_","_"
5,"_","_","_","śreṣṭha","JJ","","_","_"
6,"sarvato","_","_","sarvatas","CX","","_","_"
7,"vicaran","_","_","vicar","KDP","","_","_"
8,"balī","_","_","balin","JJ","","_","_"
1,"_","_","_","alāta","NC","","_","_"
2,"_","_","_","cakra","NC","","_","_"
3,"_","_","_","vat","CX","","_","_"
4,"rājañ","_","_","rājan","NC","","_","_"
5,"_","_","_","śara","NC","","_","_"
6,"_","_","_","jāla","NC","","_","_"
7,"samarpayat","_","_","saṃarp","V","saṃṛ","_","_"
1,"tad","_","_","tad","PRD","","_","_"
2,"_","_","_","indrajāla","NC","","_","_"
3,"_","_","_","pratima","JJ","","_","_"
4,"_","_","_","bāṇa","NC","","_","_"
5,"_","_","_","jāla","NC","","_","_"
6,"_","_","_","amitra","NC","","_","_"
7,"_","_","_","han","JJ","","_","_"
1,"vyasṛjad","_","_","visṛj","V","visṛj","_","_"
2,"dikṣu","_","_","diś","NC","","_","_"
3,"sarvāsu","_","_","sarva","JQ","","_","_"
4,"_","_","_","mahat","JJ","","_","_"
5,"_","_","_","indra","NC","","_","_"
6,"iva","_","_","iva","CCM","","_","_"
7,"vajrabhṛt","_","_","vajrabhṛt","NC","","_","_"
1,"_","_","_","megha","NC","","_","_"
2,"_","_","_","jāla","NC","","_","_"
3,"_","_","_","nibha","JJ","","_","_"
4,"sainyaṃ","_","_","sainya","NC","","_","_"
5,"vidārya","_","_","vidāray","CGDA","","_","_"
6,"sa","_","_","tad","PRD","","_","_"
7,"_","_","_","ravi","NC","","_","_"
8,"_","_","_","prabhā","NC","","_","_"
1,"vibabhau","_","_","vibabha","V","vibhā","_","_"
2,"_","_","_","kaurava","NC","","_","_"
3,"_","_","_","śreṣṭha","JJ","","_","_"
4,"_","_","_","śarad","NC","","_","_"
5,"_","_","_","iva","CCM","","_","_"
6,"divākaraḥ","_","_","divākara","NC","","_","_"
