"WordID","word","NormSTEM","suffix","lemma","PoS","Root","NormSuffix","NormWord"
1,"yudhiṣṭhira","_","_","yudhiṣṭhira","NC","","_","_"
2,"uvāca","_","_","vak","V","vac","_","_"
1,"mattaḥ","_","_","mat","PPP","","_","_"
2,"_","_","_","kaitavaka","NC","","_","_"
3,"_","_","_","eva","CEM","","_","_"
4,"_","_","_","yat","CSB","","_","_"
5,"_","_","_","ji","PPP","","_","_"
6,"'smi","_","_","as","V","as","_","_"
7,"durodaram","_","_","durodara","NC","","_","_"
1,"śakune","_","_","śakuni","NC","","_","_"
2,"hanta","_","_","hanta","CX","","_","_"
3,"dīvyāmo","_","_","dīv","V","dīv","_","_"
4,"glahamānāḥ","_","_","glah","KDP","","_","_"
5,"sahasraśaḥ","_","_","sahasraśas","CX","","_","_"
1,"ime","_","_","ida","PRD","","_","_"
2,"_","_","_","niṣka","NC","","_","_"
3,"_","_","_","sahasra","NUM","","_","_"
4,"kuṇḍino","_","_","kuṇḍin","JJ","","_","_"
5,"bharitāḥ","_","_","bharita","JJ","","_","_"
6,"śatam","_","_","śata","NUM","","_","_"
1,"kośo","_","_","kośa","NC","","_","_"
2,"hiraṇyam","_","_","hiraṇya","NC","","_","_"
3,"akṣayyaṃ","_","_","akṣayya","JJ","","_","_"
4,"jātarūpam","_","_","jātarūpa","NC","","_","_"
5,"anekaśaḥ","_","_","anekaśas","CX","","_","_"
1,"etad","_","_","tad","PRD","","_","_"
2,"rājan","_","_","rājan","NC","","_","_"
3,"dhanaṃ","_","_","dhana","NC","","_","_"
4,"mahyaṃ","_","_","mat","PPR","","_","_"
5,"tena","_","_","tad","PRD","","_","_"
6,"_","_","_","dīv","V","dīv","_","_"
7,"_","_","_","mat","PPR","","_","_"
8,"tvayā","_","_","tvat","PPR","","_","_"
1,"vaiśaṃpāyana","_","_","vaiśampāyana","NC","","_","_"
2,"uvāca","_","_","vak","V","vac","_","_"
1,"_","_","_","iti","CQT","","_","_"
2,"_","_","_","vac","PPP","","_","_"
3,"śakuniḥ","_","_","śakuni","NC","","_","_"
4,"prāha","_","_","prāh","V","prāh","_","_"
5,"jitam","_","_","ji","PPP","","_","_"
6,"_","_","_","iti","CQT","","_","_"
7,"_","_","_","eva","CEM","","_","_"
8,"taṃ","_","_","tad","PRD","","_","_"
9,"nṛpam","_","_","nṛpa","NC","","_","_"
1,"yudhiṣṭhira","_","_","yudhiṣṭhira","NC","","_","_"
2,"uvāca","_","_","vak","V","vac","_","_"
1,"ayaṃ","_","_","ida","PRD","","_","_"
2,"_","_","_","sahasra","NUM","","_","_"
3,"_","_","_","samita","JJ","","_","_"
4,"vaiyāghraḥ","_","_","vaiyāghra","JJ","","_","_"
5,"_","_","_","su","CAD","","_","_"
6,"_","_","_","pravartay","PPP","","_","_"
1,"_","_","_","su","CAD","","_","_"
2,"_","_","_","cakra","NC","","_","_"
3,"_","_","_","upaskara","NC","","_","_"
4,"śrīmān","_","_","śrīmat","JJ","","_","_"
5,"_","_","_","kiṅkiṇī","NC","","_","_"
6,"_","_","_","jāla","NC","","_","_"
7,"_","_","_","maṇḍay","PPP","","_","_"
1,"saṃhrādano","_","_","saṃhrādana","JJ","","_","_"
2,"_","_","_","rājan","NC","","_","_"
3,"_","_","_","ratha","NC","","_","_"
4,"ya","_","_","yad","PRL","","_","_"
5,"_","_","_","iha","CAD","","_","_"
6,"_","_","_","mat","PPR","","_","_"
7,"upāvahat","_","_","upavah","V","upavah","_","_"
1,"jaitro","_","_","jaitra","JJ","","_","_"
2,"_","_","_","ratha","NC","","_","_"
3,"_","_","_","vara","JJ","","_","_"
4,"puṇyo","_","_","puṇya","JJ","","_","_"
5,"_","_","_","megha","NC","","_","_"
6,"_","_","_","sāgara","NC","","_","_"
7,"_","_","_","niḥsvana","NC","","_","_"
1,"aṣṭau","_","_","aṣṭan","NUM","","_","_"
2,"yaṃ","_","_","yad","PRL","","_","_"
3,"_","_","_","kurara","NC","","_","_"
4,"_","_","_","chāyā","NC","","_","_"
5,"_","_","_","sat","JJ","","_","_"
6,"_","_","_","aśva","NC","","_","_"
7,"_","_","_","rāṣṭra","NC","","_","_"
8,"_","_","_","samman","PPP","","_","_"
1,"vahanti","_","_","vahan","V","vah","_","_"
2,"_","_","_","na","CNG","","_","_"
3,"_","_","_","ida","PRD","","_","_"
4,"ucyeta","_","_","vak","V","vac","_","_"
5,"padā","_","_","pad","NC","","_","_"
6,"bhūmim","_","_","bhūmi","NC","","_","_"
7,"upaspṛśan","_","_","upaspṛś","KDP","","_","_"
1,"etad","_","_","tad","PRD","","_","_"
2,"rājan","_","_","rājan","NC","","_","_"
3,"dhanaṃ","_","_","dhana","NC","","_","_"
4,"mahyaṃ","_","_","mat","PPR","","_","_"
5,"tena","_","_","tad","PRD","","_","_"
6,"_","_","_","dīv","V","dīv","_","_"
7,"_","_","_","mat","PPR","","_","_"
8,"tvayā","_","_","tvat","PPR","","_","_"
1,"vaiśaṃpāyana","_","_","vaiśampāyana","NC","","_","_"
2,"uvāca","_","_","vak","V","vac","_","_"
1,"_","_","_","tad","PRD","","_","_"
2,"_","_","_","śru","CGDA","","_","_"
3,"vyavasito","_","_","vyavasā","PPP","","_","_"
4,"nikṛtiṃ","_","_","nikṛti","NC","","_","_"
5,"samupāśritaḥ","_","_","samupāśri","PPP","","_","_"
1,"jitam","_","_","ji","PPP","","_","_"
2,"_","_","_","iti","CQT","","_","_"
3,"_","_","_","eva","CEM","","_","_"
4,"śakunir","_","_","śakuni","NC","","_","_"
5,"yudhiṣṭhiram","_","_","yudhiṣṭhira","NC","","_","_"
6,"abhāṣata","_","_","bhāṣ","V","bhāṣ","_","_"
1,"yudhiṣṭhira","_","_","yudhiṣṭhira","NC","","_","_"
2,"uvāca","_","_","vak","V","vac","_","_"
1,"_","_","_","sahasra","NUM","","_","_"
2,"_","_","_","saṃkhyā","NC","","_","_"
3,"nāgā","_","_","nāga","NC","","_","_"
4,"me","_","_","mat","PPR","","_","_"
5,"_","_","_","mat","PPP","","_","_"
6,"_","_","_","tiṣṭh","V","sthā","_","_"
7,"saubala","_","_","saubala","NC","","_","_"
1,"_","_","_","heman","NC","","_","_"
2,"_","_","_","kakṣa","NC","","_","_"
3,"_","_","_","kṛ","PPP","","_","_"
4,"_","_","_","āpīḍa","NC","","_","_"
5,"padmino","_","_","padmin","JJ","","_","_"
6,"_","_","_","heman","NC","","_","_"
7,"_","_","_","mālin","JJ","","_","_"
1,"_","_","_","su","CAD","","_","_"
2,"_","_","_","da","PPP","","_","_"
3,"_","_","_","rājan","NC","","_","_"
4,"_","_","_","vahana","JJ","","_","_"
5,"_","_","_","sarva","JQ","","_","_"
6,"_","_","_","śabda","NC","","_","_"
7,"_","_","_","kṣama","JJ","","_","_"
8,"yudhi","_","_","yudh","NC","","_","_"
1,"_","_","_","īṣā","NC","","_","_"
2,"_","_","_","danta","NC","","_","_"
3,"_","_","_","mahat","JJ","","_","_"
4,"_","_","_","kāya","NC","","_","_"
5,"sarve","_","_","sarva","JQ","","_","_"
6,"_","_","_","ca","CCD","","_","_"
7,"_","_","_","aṣṭan","NUM","","_","_"
8,"_","_","_","kareṇu","NC","","_","_"
1,"sarve","_","_","sarva","JQ","","_","_"
2,"ca","_","_","ca","CCD","","_","_"
3,"_","_","_","pura","NC","","_","_"
4,"_","_","_","bhettṛ","JJ","","_","_"
5,"_","_","_","naga","NC","","_","_"
6,"_","_","_","megha","NC","","_","_"
7,"_","_","_","nibha","JJ","","_","_"
8,"gajāḥ","_","_","gaja","NC","","_","_"
1,"etad","_","_","tad","PRD","","_","_"
2,"rājan","_","_","rājan","NC","","_","_"
3,"dhanaṃ","_","_","dhana","NC","","_","_"
4,"mahyaṃ","_","_","mat","PPR","","_","_"
5,"tena","_","_","tad","PRD","","_","_"
6,"_","_","_","dīv","V","dīv","_","_"
7,"_","_","_","mat","PPR","","_","_"
8,"tvayā","_","_","tvat","PPR","","_","_"
1,"vaiśaṃpāyana","_","_","vaiśampāyana","NC","","_","_"
2,"uvāca","_","_","vak","V","vac","_","_"
1,"tam","_","_","tad","PRD","","_","_"
2,"evaṃvādinaṃ","_","_","evaṃvādin","JJ","","_","_"
3,"pārthaṃ","_","_","pārtha","NC","","_","_"
4,"prahasann","_","_","prahas","KDP","","_","_"
5,"iva","_","_","iva","CCM","","_","_"
6,"saubalaḥ","_","_","saubala","NC","","_","_"
1,"jitam","_","_","ji","PPP","","_","_"
2,"_","_","_","iti","CQT","","_","_"
3,"_","_","_","eva","CEM","","_","_"
4,"śakunir","_","_","śakuni","NC","","_","_"
5,"yudhiṣṭhiram","_","_","yudhiṣṭhira","NC","","_","_"
6,"abhāṣata","_","_","bhāṣ","V","bhāṣ","_","_"
1,"yudhiṣṭhira","_","_","yudhiṣṭhira","NC","","_","_"
2,"uvāca","_","_","vak","V","vac","_","_"
1,"śataṃ","_","_","śata","NUM","","_","_"
2,"_","_","_","dāsī","NC","","_","_"
3,"_","_","_","sahasra","NUM","","_","_"
4,"taruṇyo","_","_","taruṇa","JJ","","_","_"
5,"me","_","_","mat","PPR","","_","_"
6,"prabhadrikāḥ","_","_","prabhadraka","JJ","","_","_"
1,"_","_","_","kambu","NC","","_","_"
2,"_","_","_","keyūra","NC","","_","_"
3,"_","_","_","dhārin","JJ","","_","_"
4,"_","_","_","niṣka","NC","","_","_"
5,"_","_","_","kaṇṭhī","NC","","_","_"
6,"_","_","_","su","CAD","","_","_"
7,"_","_","_","alaṃkṛ","PPP","","_","_"
1,"_","_","_","mahārha","JJ","","_","_"
2,"_","_","_","mālya","NC","","_","_"
3,"_","_","_","ābharaṇa","NC","","_","_"
4,"_","_","_","su","CAD","","_","_"
5,"_","_","_","vastra","NC","","_","_"
6,"_","_","_","candana","NC","","_","_"
7,"_","_","_","ukṣ","PPP","","_","_"
1,"maṇīn","_","_","maṇi","NC","","_","_"
2,"hema","_","_","heman","NC","","_","_"
3,"ca","_","_","ca","CCD","","_","_"
4,"bibhratyaḥ","_","_","bhṛ","KDP","","_","_"
5,"sarvā","_","_","sarva","JQ","","_","_"
6,"vai","_","_","vai","CX","","_","_"
7,"_","_","_","sūkṣma","JJ","","_","_"
8,"_","_","_","vāsas","NC","","_","_"
1,"anusevāṃ","_","_","anusevā","NC","","_","_"
2,"_","_","_","car","V","car","_","_"
3,"_","_","_","ida","PRD","","_","_"
4,"kuśalā","_","_","kuśala","JJ","","_","_"
5,"_","_","_","nṛtya","NC","","_","_"
6,"_","_","_","sāman","NC","","_","_"
1,"snātakānām","_","_","snātaka","NC","","_","_"
2,"amātyānāṃ","_","_","amātya","NC","","_","_"
3,"rājñāṃ","_","_","rājan","NC","","_","_"
4,"ca","_","_","ca","CCD","","_","_"
5,"mama","_","_","mat","PPR","","_","_"
6,"śāsanāt","_","_","śāsana","NC","","_","_"
1,"etad","_","_","tad","PRD","","_","_"
2,"rājan","_","_","rājan","NC","","_","_"
3,"dhanaṃ","_","_","dhana","NC","","_","_"
4,"mahyaṃ","_","_","mat","PPR","","_","_"
5,"tena","_","_","tad","PRD","","_","_"
6,"_","_","_","dīv","V","dīv","_","_"
7,"_","_","_","mat","PPR","","_","_"
8,"tvayā","_","_","tvat","PPR","","_","_"
1,"vaiśaṃpāyana","_","_","vaiśampāyana","NC","","_","_"
2,"uvāca","_","_","vak","V","vac","_","_"
1,"_","_","_","tad","PRD","","_","_"
2,"_","_","_","śru","CGDA","","_","_"
3,"vyavasito","_","_","vyavasā","PPP","","_","_"
4,"nikṛtiṃ","_","_","nikṛti","NC","","_","_"
5,"samupāśritaḥ","_","_","samupāśri","PPP","","_","_"
1,"jitam","_","_","ji","PPP","","_","_"
2,"_","_","_","iti","CQT","","_","_"
3,"_","_","_","eva","CEM","","_","_"
4,"śakunir","_","_","śakuni","NC","","_","_"
5,"yudhiṣṭhiram","_","_","yudhiṣṭhira","NC","","_","_"
6,"abhāṣata","_","_","bhāṣ","V","bhāṣ","_","_"
1,"yudhiṣṭhira","_","_","yudhiṣṭhira","NC","","_","_"
2,"uvāca","_","_","vak","V","vac","_","_"
1,"_","_","_","etāvat","JJ","","_","_"
2,"_","_","_","eva","CEM","","_","_"
3,"dāsānāṃ","_","_","dāsa","NC","","_","_"
4,"_","_","_","sahasra","NUM","","_","_"
5,"_","_","_","uta","CCD","","_","_"
6,"santi","_","_","as","V","as","_","_"
7,"me","_","_","mat","PPR","","_","_"
1,"_","_","_","pradakṣiṇa","JJ","","_","_"
2,"_","_","_","anuloma","JJ","","_","_"
3,"_","_","_","ca","CCD","","_","_"
4,"_","_","_","prāvāra","JJ","","_","_"
5,"_","_","_","vasana","NC","","_","_"
6,"sadā","_","_","sadā","CAD","","_","_"
1,"prājñā","_","_","prājña","JJ","","_","_"
2,"medhāvino","_","_","medhāvin","JJ","","_","_"
3,"dakṣā","_","_","dakṣa","JJ","","_","_"
4,"yuvāno","_","_","yuvan","NC","","_","_"
5,"_","_","_","mṛj","PPP","","_","_"
6,"_","_","_","kuṇḍala","NC","","_","_"
1,"_","_","_","pātrī","NC","","_","_"
2,"_","_","_","hasta","NC","","_","_"
3,"divārātram","_","_","divārātra","NC","","_","_"
4,"atithīn","_","_","atithi","NC","","_","_"
5,"_","_","_","bhojay","V","bhojay","_","_"
6,"_","_","_","uta","CCD","","_","_"
1,"etad","_","_","tad","PRD","","_","_"
2,"rājan","_","_","rājan","NC","","_","_"
3,"dhanaṃ","_","_","dhana","NC","","_","_"
4,"mahyaṃ","_","_","mat","PPR","","_","_"
5,"tena","_","_","tad","PRD","","_","_"
6,"_","_","_","dīv","V","dīv","_","_"
7,"_","_","_","mat","PPR","","_","_"
8,"tvayā","_","_","tvat","PPR","","_","_"
1,"vaiśaṃpāyana","_","_","vaiśampāyana","NC","","_","_"
2,"uvāca","_","_","vak","V","vac","_","_"
1,"_","_","_","tad","PRD","","_","_"
2,"_","_","_","śru","CGDA","","_","_"
3,"vyavasito","_","_","vyavasā","PPP","","_","_"
4,"nikṛtiṃ","_","_","nikṛti","NC","","_","_"
5,"samupāśritaḥ","_","_","samupāśri","PPP","","_","_"
1,"jitam","_","_","ji","PPP","","_","_"
2,"_","_","_","iti","CQT","","_","_"
3,"_","_","_","eva","CEM","","_","_"
4,"śakunir","_","_","śakuni","NC","","_","_"
5,"yudhiṣṭhiram","_","_","yudhiṣṭhira","NC","","_","_"
6,"abhāṣata","_","_","bhāṣ","V","bhāṣ","_","_"
1,"yudhiṣṭhira","_","_","yudhiṣṭhira","NC","","_","_"
2,"uvāca","_","_","vak","V","vac","_","_"
1,"_","_","_","ratha","NC","","_","_"
2,"_","_","_","tāvat","JJ","","_","_"
3,"_","_","_","eva","CEM","","_","_"
4,"_","_","_","ida","PRD","","_","_"
5,"_","_","_","heman","NC","","_","_"
6,"_","_","_","bhāṇḍa","NC","","_","_"
7,"patākinaḥ","_","_","patākin","JJ","","_","_"
1,"hayair","_","_","haya","NC","","_","_"
2,"vinītaiḥ","_","_","vinī","PPP","","_","_"
3,"sampannā","_","_","sampad","PPP","","_","_"
4,"_","_","_","rathin","NC","","_","_"
5,"_","_","_","citra","JJ","","_","_"
6,"_","_","_","yodhin","JJ","","_","_"
1,"ekaiko","_","_","ekaika","PRC","","_","_"
2,"yatra","_","_","yatra","CX","","_","_"
3,"labhate","_","_","labh","V","labh","_","_"
4,"_","_","_","sahasra","NUM","","_","_"
5,"_","_","_","parama","JJ","","_","_"
6,"bhṛtim","_","_","bhṛti","NC","","_","_"
1,"yudhyato","_","_","yudh","KDP","","_","_"
2,"_","_","_","a","CNG","","_","_"
3,"_","_","_","yudh","KDP","","_","_"
4,"_","_","_","vā","CCD","","_","_"
5,"_","_","_","api","CX","","_","_"
6,"vetanaṃ","_","_","vetana","NC","","_","_"
7,"_","_","_","māsa","NC","","_","_"
8,"_","_","_","kālika","JJ","","_","_"
1,"etad","_","_","tad","PRD","","_","_"
2,"rājan","_","_","rājan","NC","","_","_"
3,"dhanaṃ","_","_","dhana","NC","","_","_"
4,"mahyaṃ","_","_","mat","PPR","","_","_"
5,"tena","_","_","tad","PRD","","_","_"
6,"_","_","_","dīv","V","dīv","_","_"
7,"_","_","_","mat","PPR","","_","_"
8,"tvayā","_","_","tvat","PPR","","_","_"
1,"vaiśaṃpāyana","_","_","vaiśampāyana","NC","","_","_"
2,"uvāca","_","_","vak","V","vac","_","_"
1,"_","_","_","iti","CQT","","_","_"
2,"_","_","_","eva","CX","","_","_"
3,"ukte","_","_","vac","PPP","","_","_"
4,"pārthena","_","_","pārtha","NC","","_","_"
5,"_","_","_","kṛ","PPP","","_","_"
6,"_","_","_","vaira","NC","","_","_"
7,"durātmavān","_","_","durātmavat","JJ","","_","_"
1,"jitam","_","_","ji","PPP","","_","_"
2,"_","_","_","iti","CQT","","_","_"
3,"_","_","_","eva","CEM","","_","_"
4,"śakunir","_","_","śakuni","NC","","_","_"
5,"yudhiṣṭhiram","_","_","yudhiṣṭhira","NC","","_","_"
6,"abhāṣata","_","_","bhāṣ","V","bhāṣ","_","_"
1,"yudhiṣṭhira","_","_","yudhiṣṭhira","NC","","_","_"
2,"uvāca","_","_","vak","V","vac","_","_"
1,"_","_","_","aśva","NC","","_","_"
2,"_","_","_","tittiri","NC","","_","_"
3,"_","_","_","kalmāṣa","JJ","","_","_"
4,"gāndharvān","_","_","gāndharva","JJ","","_","_"
5,"_","_","_","heman","NC","","_","_"
6,"_","_","_","mālin","JJ","","_","_"
1,"dadau","_","_","dad","V","dā","_","_"
2,"_","_","_","citraratha","NC","","_","_"
3,"_","_","_","tuṣ","PPP","","_","_"
4,"_","_","_","yad","PRL","","_","_"
5,"_","_","_","tad","PRD","","_","_"
6,"gāṇḍīvadhanvane","_","_","gāṇḍīvadhanvan","NC","","_","_"
1,"etad","_","_","tad","PRD","","_","_"
2,"rājan","_","_","rājan","NC","","_","_"
3,"dhanaṃ","_","_","dhana","NC","","_","_"
4,"mahyaṃ","_","_","mat","PPR","","_","_"
5,"tena","_","_","tad","PRD","","_","_"
6,"_","_","_","dīv","V","dīv","_","_"
7,"_","_","_","mat","PPR","","_","_"
8,"tvayā","_","_","tvat","PPR","","_","_"
1,"vaiśaṃpāyana","_","_","vaiśampāyana","NC","","_","_"
2,"uvāca","_","_","vak","V","vac","_","_"
1,"_","_","_","tad","PRD","","_","_"
2,"_","_","_","śru","CGDA","","_","_"
3,"vyavasito","_","_","vyavasā","PPP","","_","_"
4,"nikṛtiṃ","_","_","nikṛti","NC","","_","_"
5,"samupāśritaḥ","_","_","samupāśri","PPP","","_","_"
1,"jitam","_","_","ji","PPP","","_","_"
2,"_","_","_","iti","CQT","","_","_"
3,"_","_","_","eva","CEM","","_","_"
4,"śakunir","_","_","śakuni","NC","","_","_"
5,"yudhiṣṭhiram","_","_","yudhiṣṭhira","NC","","_","_"
6,"abhāṣata","_","_","bhāṣ","V","bhāṣ","_","_"
1,"yudhiṣṭhira","_","_","yudhiṣṭhira","NC","","_","_"
2,"uvāca","_","_","vak","V","vac","_","_"
1,"rathānāṃ","_","_","ratha","NC","","_","_"
2,"śakaṭānāṃ","_","_","śakaṭa","NC","","_","_"
3,"ca","_","_","ca","CCD","","_","_"
4,"hayānāṃ","_","_","haya","NC","","_","_"
5,"_","_","_","ca","CCD","","_","_"
6,"_","_","_","ayuta","NC","","_","_"
7,"me","_","_","mat","PPR","","_","_"
1,"yuktānām","_","_","yuj","PPP","","_","_"
2,"eva","_","_","eva","CEM","","_","_"
3,"tiṣṭhanti","_","_","tiṣṭh","V","sthā","_","_"
4,"vāhair","_","_","vāha","NC","","_","_"
5,"uccāvacair","_","_","uccāvaca","JJ","","_","_"
6,"vṛtāḥ","_","_","vṛ","PPP","","_","_"
1,"evaṃ","_","_","eva","CX","","_","_"
2,"varṇasya","_","_","varṇa","NC","","_","_"
3,"varṇasya","_","_","varṇa","NC","","_","_"
4,"samuccīya","_","_","samucci","CGDA","","_","_"
5,"sahasraśaḥ","_","_","sahasraśas","CX","","_","_"
1,"kṣīraṃ","_","_","kṣīra","NC","","_","_"
2,"_","_","_","pā","KDP","","_","_"
3,"_","_","_","tiṣṭh","V","sthā","_","_"
4,"bhuñjānāḥ","_","_","bhuj","KDP","","_","_"
5,"_","_","_","śāli","NC","","_","_"
6,"_","_","_","taṇḍula","NC","","_","_"
1,"_","_","_","ṣaṣṭi","NC","","_","_"
2,"_","_","_","tad","PRD","","_","_"
3,"sahasrāṇi","_","_","sahasra","NUM","","_","_"
4,"sarve","_","_","sarva","JQ","","_","_"
5,"_","_","_","pṛthula","JJ","","_","_"
6,"_","_","_","vakṣas","NC","","_","_"
1,"etad","_","_","tad","PRD","","_","_"
2,"rājan","_","_","rājan","NC","","_","_"
3,"dhanaṃ","_","_","dhana","NC","","_","_"
4,"mahyaṃ","_","_","mat","PPR","","_","_"
5,"tena","_","_","tad","PRD","","_","_"
6,"_","_","_","dīv","V","dīv","_","_"
7,"_","_","_","mat","PPR","","_","_"
8,"tvayā","_","_","tvat","PPR","","_","_"
1,"vaiśaṃpāyana","_","_","vaiśampāyana","NC","","_","_"
2,"uvāca","_","_","vak","V","vac","_","_"
1,"_","_","_","tad","PRD","","_","_"
2,"_","_","_","śru","CGDA","","_","_"
3,"vyavasito","_","_","vyavasā","PPP","","_","_"
4,"nikṛtiṃ","_","_","nikṛti","NC","","_","_"
5,"samupāśritaḥ","_","_","samupāśri","PPP","","_","_"
1,"jitam","_","_","ji","PPP","","_","_"
2,"_","_","_","iti","CQT","","_","_"
3,"_","_","_","eva","CEM","","_","_"
4,"śakunir","_","_","śakuni","NC","","_","_"
5,"yudhiṣṭhiram","_","_","yudhiṣṭhira","NC","","_","_"
6,"abhāṣata","_","_","bhāṣ","V","bhāṣ","_","_"
1,"yudhiṣṭhira","_","_","yudhiṣṭhira","NC","","_","_"
2,"uvāca","_","_","vak","V","vac","_","_"
1,"_","_","_","tāmra","NC","","_","_"
2,"_","_","_","loha","NC","","_","_"
3,"parivṛtā","_","_","parivṛ","PPP","","_","_"
4,"nidhayo","_","_","nidhi","NC","","_","_"
5,"me","_","_","mat","PPR","","_","_"
6,"_","_","_","catur","NUM","","_","_"
7,"_","_","_","śata","NUM","","_","_"
1,"_","_","_","pañcan","NUM","","_","_"
2,"_","_","_","drauṇika","JJ","","_","_"
3,"ekaikaḥ","_","_","ekaika","PRC","","_","_"
4,"_","_","_","suvarṇa","NC","","_","_"
5,"_","_","_","ahata","JJ","","_","_"
6,"vai","_","_","vai","CX","","_","_"
1,"etad","_","_","tad","PRD","","_","_"
2,"rājan","_","_","rājan","NC","","_","_"
3,"dhanaṃ","_","_","dhana","NC","","_","_"
4,"mahyaṃ","_","_","mat","PPR","","_","_"
5,"tena","_","_","tad","PRD","","_","_"
6,"_","_","_","dīv","V","dīv","_","_"
7,"_","_","_","mat","PPR","","_","_"
8,"tvayā","_","_","tvat","PPR","","_","_"
1,"vaiśaṃpāyana","_","_","vaiśampāyana","NC","","_","_"
2,"uvāca","_","_","vak","V","vac","_","_"
1,"_","_","_","tad","PRD","","_","_"
2,"_","_","_","śru","CGDA","","_","_"
3,"vyavasito","_","_","vyavasā","PPP","","_","_"
4,"nikṛtiṃ","_","_","nikṛti","NC","","_","_"
5,"samupāśritaḥ","_","_","samupāśri","PPP","","_","_"
1,"jitam","_","_","ji","PPP","","_","_"
2,"_","_","_","iti","CQT","","_","_"
3,"_","_","_","eva","CEM","","_","_"
4,"śakunir","_","_","śakuni","NC","","_","_"
5,"yudhiṣṭhiram","_","_","yudhiṣṭhira","NC","","_","_"
6,"abhāṣata","_","_","bhāṣ","V","bhāṣ","_","_"
