"WordID","word","NormSTEM","suffix","lemma","PoS","Root","NormSuffix","NormWord"
1,"vaiśaṃpāyana","_","_","vaiśampāyana","NC","","_","_"
2,"uvāca","_","_","vak","V","vac","_","_"
1,"tāṃ","_","_","tad","PRD","","_","_"
2,"śamīm","_","_","śamī","NC","","_","_"
3,"upasaṃgamya","_","_","upasaṃga","CGDA","","_","_"
4,"pārtho","_","_","pārtha","NC","","_","_"
5,"vairāṭim","_","_","vairāṭi","NC","","_","_"
6,"abravīt","_","_","abravīta","V","brū","_","_"
1,"sukumāraṃ","_","_","sukumāra","JJ","","_","_"
2,"samājñātaṃ","_","_","samājñā","PPP","","_","_"
3,"saṃgrāme","_","_","saṃgrāma","NC","","_","_"
4,"_","_","_","na","CNG","","_","_"
5,"_","_","_","ati","CADP","","_","_"
6,"_","_","_","kovida","JJ","","_","_"
1,"samādiṣṭo","_","_","samādis","PPP","","_","_"
2,"mayā","_","_","mat","PPR","","_","_"
3,"kṣipraṃ","_","_","kṣipra","CX","","_","_"
4,"_","_","_","dhanus","NC","","_","_"
5,"_","_","_","avahar","V","avahṛ","_","_"
6,"_","_","_","uttara","NC","","_","_"
1,"_","_","_","na","CNG","","_","_"
2,"_","_","_","ida","PRD","","_","_"
3,"hi","_","_","hi","CX","","_","_"
4,"tvadīyāni","_","_","tvadīya","JJ","","_","_"
5,"soḍhuṃ","_","_","sah","CGDI","","_","_"
6,"śakṣyanti","_","_","śakn","V","śak","_","_"
7,"me","_","_","mat","PPR","","_","_"
8,"balam","_","_","bala","NC","","_","_"
1,"bhāraṃ","_","_","bhāra","NC","","_","_"
2,"_","_","_","vā","CCD","","_","_"
3,"_","_","_","api","CX","","_","_"
4,"guruṃ","_","_","guru","JJ","","_","_"
5,"hartuṃ","_","_","hṛ","CGDI","","_","_"
6,"kuñjaraṃ","_","_","kuñjara","NC","","_","_"
7,"vā","_","_","vā","CCD","","_","_"
8,"pramarditum","_","_","pramṛd","CGDI","","_","_"
1,"mama","_","_","mat","PPR","","_","_"
2,"vā","_","_","vā","CCD","","_","_"
3,"_","_","_","bāhu","NC","","_","_"
4,"_","_","_","vikṣepa","NC","","_","_"
5,"śatrūn","_","_","śatru","NC","","_","_"
6,"iha","_","_","iha","CAD","","_","_"
7,"vijeṣyataḥ","_","_","viji","KDP","","_","_"
1,"tasmād","_","_","tasmāt","CX","","_","_"
2,"_","_","_","bhūmiṃjaya","NC","","_","_"
3,"_","_","_","āroh","V","āruh","_","_"
4,"śamīm","_","_","śamī","NC","","_","_"
5,"etāṃ","_","_","tad","PRD","","_","_"
6,"palāśinīm","_","_","palāśin","JJ","","_","_"
1,"asyāṃ","_","_","ida","PRD","","_","_"
2,"hi","_","_","hi","CX","","_","_"
3,"_","_","_","pāṇḍu","NC","","_","_"
4,"_","_","_","putra","NC","","_","_"
5,"dhanūṃṣi","_","_","dhanus","NC","","_","_"
6,"_","_","_","nidhā","PPP","","_","_"
7,"_","_","_","uta","CCD","","_","_"
1,"yudhiṣṭhirasya","_","_","yudhiṣṭhira","NC","","_","_"
2,"bhīmasya","_","_","bhīma","NC","","_","_"
3,"bībhatsor","_","_","bībhatsu","JJ","","_","_"
4,"_","_","_","yama","NC","","_","_"
5,"_","_","_","tathā","CX","","_","_"
1,"dhvajāḥ","_","_","dhvaja","NC","","_","_"
2,"_","_","_","śara","NC","","_","_"
3,"_","_","_","ca","CCD","","_","_"
4,"śūrāṇāṃ","_","_","śūra","NC","","_","_"
5,"divyāni","_","_","divya","JJ","","_","_"
6,"kavacāni","_","_","kavaca","NC","","_","_"
7,"ca","_","_","ca","CCD","","_","_"
1,"atra","_","_","atra","CAD","","_","_"
2,"_","_","_","ca","CCD","","_","_"
3,"_","_","_","tad","PRD","","_","_"
4,"_","_","_","mahat","JJ","","_","_"
5,"_","_","_","vīrya","NC","","_","_"
6,"dhanuḥ","_","_","dhanus","NC","","_","_"
7,"pārthasya","_","_","pārtha","NC","","_","_"
8,"gāṇḍivam","_","_","gāṇḍiva","NC","","_","_"
1,"ekaṃ","_","_","eka","PPX","","_","_"
2,"_","_","_","śata","NUM","","_","_"
3,"_","_","_","sahasra","NUM","","_","_"
4,"saṃmitaṃ","_","_","saṃmā","PPP","","_","_"
5,"_","_","_","rāṣṭra","NC","","_","_"
6,"_","_","_","vardhana","JJ","","_","_"
1,"_","_","_","vyāyāma","NC","","_","_"
2,"_","_","_","saha","JJ","","_","_"
3,"atyarthaṃ","_","_","atyartha","CX","","_","_"
4,"_","_","_","tṛṇarāja","NC","","_","_"
5,"_","_","_","sama","PPX","","_","_"
6,"mahat","_","_","mahat","JJ","","_","_"
1,"_","_","_","sarva","JQ","","_","_"
2,"_","_","_","āyudha","NC","","_","_"
3,"_","_","_","mahāmātra","NC","","_","_"
4,"_","_","_","śatru","NC","","_","_"
5,"_","_","_","sambādha","NC","","_","_"
6,"_","_","_","kāraka","JJ","","_","_"
1,"_","_","_","suvarṇa","NC","","_","_"
2,"_","_","_","vikṛ","PPP","","_","_"
3,"divyaṃ","_","_","divya","JJ","","_","_"
4,"ślakṣṇam","_","_","ślakṣṇa","JJ","","_","_"
5,"āyatam","_","_","āya","PPP","","_","_"
6,"avraṇam","_","_","avraṇa","JJ","","_","_"
1,"alaṃ","_","_","ala","CX","","_","_"
2,"bhāraṃ","_","_","bhāra","NC","","_","_"
3,"guruṃ","_","_","guru","JJ","","_","_"
4,"voḍhuṃ","_","_","vah","CGDI","","_","_"
5,"dāruṇaṃ","_","_","dāruṇa","JJ","","_","_"
6,"_","_","_","cāru","JJ","","_","_"
7,"_","_","_","darśana","NC","","_","_"
1,"_","_","_","tādṛśa","JJ","","_","_"
2,"_","_","_","eva","CEM","","_","_"
3,"sarvāṇi","_","_","sarva","JQ","","_","_"
4,"balavanti","_","_","balavat","JJ","","_","_"
5,"dṛḍhāni","_","_","dṛḍha","JJ","","_","_"
6,"ca","_","_","ca","CCD","","_","_"
1,"uttara","_","_","uttara","NC","","_","_"
2,"uvāca","_","_","vak","V","vac","_","_"
1,"asmin","_","_","ida","PRD","","_","_"
2,"vṛkṣe","_","_","vṛkṣa","NC","","_","_"
3,"_","_","_","kila","CX","","_","_"
4,"_","_","_","udbandh","PPP","","_","_"
5,"śarīram","_","_","śarīra","NC","","_","_"
6,"iti","_","_","iti","CQT","","_","_"
7,"naḥ","_","_","mat","PPR","","_","_"
8,"śrutam","_","_","śru","PPP","","_","_"
1,"tad","_","_","tad","PRD","","_","_"
2,"ahaṃ","_","_","mat","PPR","","_","_"
3,"_","_","_","rājan","NC","","_","_"
4,"_","_","_","putra","NC","","_","_"
5,"san","_","_","as","KDP","","_","_"
6,"spṛśeyaṃ","_","_","spṛś","V","spṛś","_","_"
7,"pāṇinā","_","_","pāṇi","NC","","_","_"
8,"katham","_","_","katha","CX","","_","_"
1,"_","_","_","na","CNG","","_","_"
2,"_","_","_","evaṃvidha","JJ","","_","_"
3,"mayā","_","_","mat","PPR","","_","_"
4,"yuktam","_","_","yukta","JJ","","_","_"
5,"ālabdhuṃ","_","_","ālabh","CGDI","","_","_"
6,"_","_","_","kṣatra","NC","","_","_"
7,"_","_","_","yoni","NC","","_","_"
1,"mahatā","_","_","mahat","JJ","","_","_"
2,"_","_","_","rājan","NC","","_","_"
3,"_","_","_","putra","NC","","_","_"
4,"_","_","_","mantra","NC","","_","_"
5,"_","_","_","yajña","NC","","_","_"
6,"_","_","_","vid","JJ","","_","_"
7,"satā","_","_","sat","JJ","","_","_"
1,"spṛṣṭavantaṃ","_","_","spṛś","KDP","","_","_"
2,"śarīraṃ","_","_","śarīra","NC","","_","_"
3,"māṃ","_","_","mat","PPR","","_","_"
4,"śavavāham","_","_","śavavāha","NC","","_","_"
5,"_","_","_","iva","CCM","","_","_"
6,"_","_","_","aśuci","JJ","","_","_"
1,"kathaṃ","_","_","katha","CX","","_","_"
2,"vā","_","_","vā","CCD","","_","_"
3,"vyavahāryaṃ","_","_","vyavahṛ","KDG","","_","_"
4,"vai","_","_","vai","CX","","_","_"
5,"_","_","_","kar","V","kṛ","_","_"
6,"_","_","_","tvat","PPR","","_","_"
7,"bṛhannaḍe","_","_","bṛhannaḍa","NC","","_","_"
1,"_","_","_","bṛhannaḍa","NC","","_","_"
2,"_","_","_","vak","V","vac","_","_"
1,"_","_","_","vyavahṛ","KDG","","_","_"
2,"_","_","_","ca","CCD","","_","_"
3,"_","_","_","rājan","NC","","_","_"
4,"_","_","_","indra","NC","","_","_"
5,"_","_","_","śuci","JJ","","_","_"
6,"_","_","_","ca","CCD","","_","_"
7,"_","_","_","eva","CEM","","_","_"
8,"bhaviṣyasi","_","_","bhav","V","bhū","_","_"
1,"_","_","_","dhanus","NC","","_","_"
2,"_","_","_","tad","PRD","","_","_"
3,"mā","_","_","mā","CNG","","_","_"
4,"_","_","_","bhī","V","bhī","_","_"
5,"_","_","_","tvat","PPR","","_","_"
6,"śarīraṃ","_","_","śarīra","NC","","_","_"
7,"_","_","_","na","CNG","","_","_"
8,"_","_","_","atra","CAD","","_","_"
9,"vidyate","_","_","vid","V","vid","_","_"
1,"dāyādaṃ","_","_","dāyāda","NC","","_","_"
2,"_","_","_","matsya","NC","","_","_"
3,"_","_","_","rāja","NC","","_","_"
4,"kule","_","_","kula","NC","","_","_"
5,"jātaṃ","_","_","jan","PPP","","_","_"
6,"manasvinam","_","_","manasvin","JJ","","_","_"
1,"kathaṃ","_","_","katha","CX","","_","_"
2,"tvā","_","_","tvat","PPR","","_","_"
3,"ninditaṃ","_","_","nind","PPP","","_","_"
4,"karma","_","_","karman","NC","","_","_"
5,"kārayeyaṃ","_","_","kāray","V","kāray","_","_"
6,"_","_","_","nṛpa","NC","","_","_"
7,"_","_","_","ātmaja","NC","","_","_"
1,"vaiśaṃpāyana","_","_","vaiśampāyana","NC","","_","_"
2,"uvāca","_","_","vak","V","vac","_","_"
1,"evam","_","_","eva","CX","","_","_"
2,"uktaḥ","_","_","vac","PPP","","_","_"
3,"sa","_","_","tad","PRD","","_","_"
4,"pārthena","_","_","pārtha","NC","","_","_"
5,"rathāt","_","_","ratha","NC","","_","_"
6,"praskandya","_","_","praskand","CGDA","","_","_"
7,"kuṇḍalī","_","_","kuṇḍalin","JJ","","_","_"
1,"āruroha","_","_","āroh","V","āruh","_","_"
2,"_","_","_","śamī","NC","","_","_"
3,"_","_","_","vṛkṣa","NC","","_","_"
4,"vairāṭir","_","_","vairāṭi","NC","","_","_"
5,"_","_","_","avaśa","JJ","","_","_"
6,"_","_","_","tadā","CAD","","_","_"
1,"tam","_","_","tad","PRD","","_","_"
2,"_","_","_","anuśās","V","anuśās","_","_"
3,"_","_","_","śatru","NC","","_","_"
4,"_","_","_","ghna","JJ","","_","_"
5,"rathe","_","_","ratha","NC","","_","_"
6,"tiṣṭhan","_","_","sthā","KDP","","_","_"
7,"dhanaṃjayaḥ","_","_","dhanaṃjaya","NC","","_","_"
1,"pariveṣṭanam","_","_","pariveṣṭana","NC","","_","_"
2,"eteṣāṃ","_","_","tad","PRD","","_","_"
3,"kṣipraṃ","_","_","kṣipra","CX","","_","_"
4,"_","_","_","ca","CCD","","_","_"
5,"_","_","_","eva","CEM","","_","_"
6,"vyapānuda","_","_","vyapānud","V","vyapānud","_","_"
1,"tathā","_","_","tathā","CX","","_","_"
2,"_","_","_","saṃnahana","NC","","_","_"
3,"_","_","_","ida","PRD","","_","_"
4,"parimucya","_","_","parimuc","CGDA","","_","_"
5,"samantataḥ","_","_","samantataḥ","CX","","_","_"
1,"apaśyad","_","_","paś","V","paś","_","_"
2,"gāṇḍivaṃ","_","_","gāṇḍiva","NC","","_","_"
3,"tatra","_","_","tatra","CAD","","_","_"
4,"caturbhir","_","_","catur","NUM","","_","_"
5,"aparaiḥ","_","_","apara","PPX","","_","_"
6,"saha","_","_","saha","CX","","_","_"
1,"teṣāṃ","_","_","tad","PRD","","_","_"
2,"vimucyamānānāṃ","_","_","vimuc","KDP","","_","_"
3,"dhanuṣām","_","_","dhanus","NC","","_","_"
4,"_","_","_","arka","NC","","_","_"
5,"_","_","_","varcas","NC","","_","_"
1,"viniśceruḥ","_","_","viniścar","V","viniścar","_","_"
2,"prabhā","_","_","prabhā","NC","","_","_"
3,"divyā","_","_","divya","JJ","","_","_"
4,"grahāṇām","_","_","graha","NC","","_","_"
5,"_","_","_","udaya","NC","","_","_"
6,"_","_","_","iva","CCM","","_","_"
1,"sa","_","_","tad","PRD","","_","_"
2,"teṣāṃ","_","_","tad","PRD","","_","_"
3,"rūpam","_","_","rūpa","NC","","_","_"
4,"ālokya","_","_","ālokay","CGDA","","_","_"
5,"bhoginām","_","_","bhogin","NC","","_","_"
6,"iva","_","_","iva","CCM","","_","_"
7,"jṛmbhatām","_","_","jṛmbh","KDP","","_","_"
1,"_","_","_","hṛṣ","PPP","","_","_"
2,"_","_","_","roman","NC","","_","_"
3,"_","_","_","bhaya","NC","","_","_"
4,"_","_","_","udvij","PPP","","_","_"
5,"kṣaṇena","_","_","kṣaṇa","NC","","_","_"
6,"samapadyata","_","_","saṃpad","V","saṃpad","_","_"
1,"saṃspṛśya","_","_","saṃspṛś","CGDA","","_","_"
2,"tāni","_","_","tad","PRD","","_","_"
3,"cāpāni","_","_","cāpa","NC","","_","_"
4,"bhānumanti","_","_","bhānumat","JJ","","_","_"
5,"bṛhanti","_","_","bṛhat","JJ","","_","_"
6,"ca","_","_","ca","CCD","","_","_"
1,"vairāṭir","_","_","vairāṭi","NC","","_","_"
2,"arjunaṃ","_","_","arjuna","NC","","_","_"
3,"rājann","_","_","rājan","NC","","_","_"
4,"idaṃ","_","_","ida","PRD","","_","_"
5,"vacanam","_","_","vacana","NC","","_","_"
6,"abravīt","_","_","abravīta","V","brū","_","_"
1,"uttara","_","_","uttara","NC","","_","_"
2,"uvāca","_","_","vak","V","vac","_","_"
1,"bindavo","_","_","bindu","NC","","_","_"
2,"jātarūpasya","_","_","jātarūpa","NC","","_","_"
3,"śataṃ","_","_","śata","NUM","","_","_"
4,"_","_","_","yad","PRL","","_","_"
5,"_","_","_","nipātay","PPP","","_","_"
1,"sauvarṇāḥ","_","_","sauvarṇa","JJ","","_","_"
2,"_","_","_","kiṃ","PRQ","","_","_"
3,"_","_","_","tad","PRD","","_","_"
4,"dhanur","_","_","dhanus","NC","","_","_"
5,"uttamam","_","_","uttama","JJ","","_","_"
1,"vāraṇā","_","_","vāraṇa","NC","","_","_"
2,"yasya","_","_","yad","PRL","","_","_"
3,"sauvarṇāḥ","_","_","sauvarṇa","JJ","","_","_"
4,"pṛṣṭhe","_","_","pṛṣṭha","NC","","_","_"
5,"bhāsanti","_","_","bhās","V","bhās","_","_"
6,"daṃśitāḥ","_","_","daṃśay","PPP","","_","_"
1,"_","_","_","su","CAD","","_","_"
2,"_","_","_","pārśva","NC","","_","_"
3,"_","_","_","su","CAD","","_","_"
4,"_","_","_","graha","NC","","_","_"
5,"_","_","_","ca","CCD","","_","_"
6,"_","_","_","eva","CEM","","_","_"
7,"_","_","_","kiṃ","PRQ","","_","_"
8,"_","_","_","tad","PRD","","_","_"
9,"_","_","_","dhanus","NC","","_","_"
10,"_","_","_","uttama","JJ","","_","_"
1,"tapanīyasya","_","_","tapanīya","NC","","_","_"
2,"śuddhasya","_","_","śudh","PPP","","_","_"
3,"ṣaṣṭir","_","_","ṣaṣṭi","NC","","_","_"
4,"_","_","_","yad","PRL","","_","_"
5,"_","_","_","indragopaka","NC","","_","_"
1,"pṛṣṭhe","_","_","pṛṣṭha","NC","","_","_"
2,"vibhaktāḥ","_","_","vibhaj","PPP","","_","_"
3,"śobhante","_","_","śubh","V","śubh","_","_"
4,"_","_","_","kiṃ","PRQ","","_","_"
5,"_","_","_","tad","PRD","","_","_"
6,"dhanur","_","_","dhanus","NC","","_","_"
7,"uttamam","_","_","uttama","JJ","","_","_"
1,"sūryā","_","_","sūrya","NC","","_","_"
2,"yatra","_","_","yatra","CX","","_","_"
3,"ca","_","_","ca","CCD","","_","_"
4,"_","_","_","sauvarṇa","JJ","","_","_"
5,"_","_","_","tri","NUM","","_","_"
6,"bhāsanti","_","_","bhās","V","bhās","_","_"
7,"daṃśitāḥ","_","_","daṃśay","PPP","","_","_"
1,"tejasā","_","_","tejas","NC","","_","_"
2,"prajvalanto","_","_","prajval","KDP","","_","_"
3,"hi","_","_","hi","CX","","_","_"
4,"_","_","_","kiṃ","PRQ","","_","_"
5,"_","_","_","tad","PRD","","_","_"
6,"dhanur","_","_","dhanus","NC","","_","_"
7,"uttamam","_","_","uttama","JJ","","_","_"
1,"śālabhā","_","_","śālabha","NC","","_","_"
2,"yatra","_","_","yatra","CX","","_","_"
3,"_","_","_","sauvarṇa","JJ","","_","_"
4,"_","_","_","tapanīya","NC","","_","_"
5,"_","_","_","vicitrita","JJ","","_","_"
1,"_","_","_","suvarṇa","NC","","_","_"
2,"_","_","_","maṇi","NC","","_","_"
3,"_","_","_","citra","JJ","","_","_"
4,"ca","_","_","ca","CCD","","_","_"
5,"_","_","_","kiṃ","PRQ","","_","_"
6,"_","_","_","tad","PRD","","_","_"
7,"dhanur","_","_","dhanus","NC","","_","_"
8,"uttamam","_","_","uttama","JJ","","_","_"
1,"ime","_","_","ida","PRD","","_","_"
2,"ca","_","_","ca","CCD","","_","_"
3,"kasya","_","_","kiṃ","PRQ","","_","_"
4,"nārācāḥ","_","_","nārāca","NC","","_","_"
5,"sahasrā","_","_","sahasra","NUM","","_","_"
6,"_","_","_","loman","NC","","_","_"
7,"_","_","_","vāhin","JJ","","_","_"
1,"samantāt","_","_","samantāt","CX","","_","_"
2,"_","_","_","kaladhauta","NC","","_","_"
3,"_","_","_","agra","NC","","_","_"
4,"upāsaṅge","_","_","upāsaṅga","NC","","_","_"
5,"hiraṇmaye","_","_","hiraṇmaya","JJ","","_","_"
1,"vipāṭhāḥ","_","_","vipāṭha","NC","","_","_"
2,"pṛthavaḥ","_","_","pṛthu","JJ","","_","_"
3,"kasya","_","_","kiṃ","PRQ","","_","_"
4,"_","_","_","gārdhra","JJ","","_","_"
5,"_","_","_","pattra","NC","","_","_"
6,"_","_","_","śilā","NC","","_","_"
7,"_","_","_","śā","PPP","","_","_"
1,"_","_","_","hāridra","JJ","","_","_"
2,"_","_","_","varṇa","NC","","_","_"
3,"_","_","_","su","CAD","","_","_"
4,"_","_","_","nasā","NC","","_","_"
5,"pītāḥ","_","_","pīta","JJ","","_","_"
6,"_","_","_","sarva","JQ","","_","_"
7,"_","_","_","āyasa","JJ","","_","_"
8,"śarāḥ","_","_","śara","NC","","_","_"
1,"_","_","_","kiṃ","PRQ","","_","_"
2,"_","_","_","ida","PRD","","_","_"
3,"_","_","_","asita","JJ","","_","_"
4,"_","_","_","āvāpa","NC","","_","_"
5,"_","_","_","pañcan","NUM","","_","_"
6,"_","_","_","śārdūla","NC","","_","_"
7,"_","_","_","lakṣaṇa","NC","","_","_"
1,"_","_","_","varāhakarṇa","NC","","_","_"
2,"_","_","_","vyāmiśra","JJ","","_","_"
3,"śarān","_","_","śara","NC","","_","_"
4,"dhārayate","_","_","dhar","V","dhṛ","_","_"
5,"daśa","_","_","daśan","NUM","","_","_"
1,"_","_","_","kiṃ","PRQ","","_","_"
2,"_","_","_","ida","PRD","","_","_"
3,"pṛthavo","_","_","pṛthu","JJ","","_","_"
4,"dīrghāḥ","_","_","dīrgha","JJ","","_","_"
5,"_","_","_","sarva","JQ","","_","_"
6,"_","_","_","pāraśava","JJ","","_","_"
7,"śarāḥ","_","_","śara","NC","","_","_"
1,"śatāni","_","_","śata","NUM","","_","_"
2,"sapta","_","_","saptan","NUM","","_","_"
3,"tiṣṭhanti","_","_","tiṣṭh","V","sthā","_","_"
4,"nārācā","_","_","nārāca","NC","","_","_"
5,"_","_","_","rudhira","NC","","_","_"
6,"_","_","_","aśana","NC","","_","_"
1,"_","_","_","kiṃ","PRQ","","_","_"
2,"_","_","_","ida","PRD","","_","_"
3,"_","_","_","śuka","NC","","_","_"
4,"_","_","_","pattra","NC","","_","_"
5,"_","_","_","ābha","JJ","","_","_"
6,"pūrvair","_","_","pūrva","PPX","","_","_"
7,"ardhaiḥ","_","_","ardha","JJ","","_","_"
8,"_","_","_","su","CAD","","_","_"
9,"_","_","_","vāsas","NC","","_","_"
1,"uttarair","_","_","uttara","JJ","","_","_"
2,"āyasaiḥ","_","_","āyasa","JJ","","_","_"
3,"pītair","_","_","pīta","JJ","","_","_"
4,"_","_","_","heman","NC","","_","_"
5,"_","_","_","puṅkha","NC","","_","_"
6,"_","_","_","śilā","NC","","_","_"
7,"_","_","_","śā","PPP","","_","_"
1,"_","_","_","kiṃ","PRQ","","_","_"
2,"_","_","_","ida","PRD","","_","_"
3,"sāyako","_","_","sāyaka","NC","","_","_"
4,"dīrghaḥ","_","_","dīrgha","JJ","","_","_"
5,"_","_","_","śilī","NC","","_","_"
6,"_","_","_","pṛṣṭha","NC","","_","_"
7,"_","_","_","śilī","NC","","_","_"
8,"_","_","_","mukha","NC","","_","_"
1,"_","_","_","vaiyāghra","JJ","","_","_"
2,"_","_","_","kośa","NC","","_","_"
3,"nihito","_","_","nidhā","PPP","","_","_"
4,"_","_","_","heman","NC","","_","_"
5,"_","_","_","citra","JJ","","_","_"
6,"_","_","_","tsaru","NC","","_","_"
7,"mahān","_","_","mahat","JJ","","_","_"
1,"_","_","_","su","CAD","","_","_"
2,"_","_","_","phala","NC","","_","_"
3,"_","_","_","citra","JJ","","_","_"
4,"_","_","_","kośa","NC","","_","_"
5,"_","_","_","ca","CCD","","_","_"
6,"_","_","_","kiṅkiṇī","NC","","_","_"
7,"_","_","_","sāyaka","NC","","_","_"
8,"mahān","_","_","mahat","JJ","","_","_"
1,"kasya","_","_","kiṃ","PRQ","","_","_"
2,"_","_","_","heman","NC","","_","_"
3,"_","_","_","tsaru","NC","","_","_"
4,"divyaḥ","_","_","divya","JJ","","_","_"
5,"khaḍgaḥ","_","_","khaḍga","NC","","_","_"
6,"_","_","_","parama","JJ","","_","_"
7,"_","_","_","nirvraṇa","JJ","","_","_"
1,"_","_","_","kiṃ","PRQ","","_","_"
2,"_","_","_","ida","PRD","","_","_"
3,"vimalaḥ","_","_","vimala","JJ","","_","_"
4,"khaḍgo","_","_","khaḍga","NC","","_","_"
5,"gavye","_","_","gavya","JJ","","_","_"
6,"kośe","_","_","kośa","NC","","_","_"
7,"samarpitaḥ","_","_","samarpay","PPP","","_","_"
1,"_","_","_","heman","NC","","_","_"
2,"_","_","_","tsaru","NC","","_","_"
3,"anādhṛṣyo","_","_","anādhṛṣya","JJ","","_","_"
4,"naiṣadhyo","_","_","naiṣadhya","JJ","","_","_"
5,"_","_","_","bhāra","NC","","_","_"
6,"_","_","_","sādhana","JJ","","_","_"
1,"kasya","_","_","kiṃ","PRQ","","_","_"
2,"pāñcanakhe","_","_","pāñcanakha","JJ","","_","_"
3,"kośe","_","_","kośa","NC","","_","_"
4,"sāyako","_","_","sāyaka","NC","","_","_"
5,"_","_","_","heman","NC","","_","_"
6,"_","_","_","vigraha","NC","","_","_"
1,"_","_","_","pramāṇa","NC","","_","_"
2,"_","_","_","rūpa","NC","","_","_"
3,"_","_","_","sampad","PPP","","_","_"
4,"pīta","_","_","pīta","JJ","","_","_"
5,"_","_","_","ākāśa","NC","","_","_"
6,"_","_","_","saṃnibha","JJ","","_","_"
1,"kasya","_","_","kiṃ","PRQ","","_","_"
2,"_","_","_","heman","NC","","_","_"
3,"_","_","_","maya","JJ","","_","_"
4,"kośe","_","_","kośa","NC","","_","_"
5,"_","_","_","su","CAD","","_","_"
6,"_","_","_","tap","PPP","","_","_"
7,"_","_","_","pāvaka","NC","","_","_"
8,"_","_","_","prabhā","NC","","_","_"
1,"nistriṃśo","_","_","nistriṃśa","NC","","_","_"
2,"'yaṃ","_","_","ida","PRD","","_","_"
3,"guruḥ","_","_","guru","JJ","","_","_"
4,"pītaḥ","_","_","pīta","JJ","","_","_"
5,"saikyaḥ","_","_","saikya","JJ","","_","_"
6,"_","_","_","parama","JJ","","_","_"
7,"_","_","_","nirvraṇa","JJ","","_","_"
1,"nirdiśasva","_","_","nirdiś","V","nirdiś","_","_"
2,"yathātattvaṃ","_","_","yathātattva","CX","","_","_"
3,"mayā","_","_","mat","PPR","","_","_"
4,"pṛṣṭā","_","_","pracch","PPP","","_","_"
5,"bṛhannaḍe","_","_","bṛhannaḍa","NC","","_","_"
1,"vismayo","_","_","vismaya","NC","","_","_"
2,"me","_","_","mat","PPR","","_","_"
3,"paro","_","_","para","PPX","","_","_"
4,"jāto","_","_","jan","PPP","","_","_"
5,"dṛṣṭvā","_","_","dṛś","CGDA","","_","_"
6,"sarvam","_","_","sarva","JQ","","_","_"
7,"idaṃ","_","_","ida","PRD","","_","_"
8,"mahat","_","_","mahat","JJ","","_","_"
1,"_","_","_","bṛhannaḍa","NC","","_","_"
2,"_","_","_","vak","V","vac","_","_"
1,"_","_","_","yat","CSB","","_","_"
2,"_","_","_","mat","PPR","","_","_"
3,"pūrvam","_","_","pūrva","CX","","_","_"
4,"_","_","_","iha","CAD","","_","_"
5,"_","_","_","pracch","V","pracch","_","_"
6,"_","_","_","śatru","NC","","_","_"
7,"_","_","_","senā","NC","","_","_"
8,"_","_","_","nibarhaṇa","JJ","","_","_"
1,"gāṇḍīvam","_","_","gāṇḍīva","NC","","_","_"
2,"etat","_","_","tad","PRD","","_","_"
3,"pārthasya","_","_","pārtha","NC","","_","_"
4,"lokeṣu","_","_","loka","NC","","_","_"
5,"viditaṃ","_","_","vid","PPP","","_","_"
6,"dhanuḥ","_","_","dhanus","NC","","_","_"
1,"_","_","_","sarva","JQ","","_","_"
2,"_","_","_","āyudha","NC","","_","_"
3,"_","_","_","mahāmātra","NC","","_","_"
4,"_","_","_","śātakumbha","NC","","_","_"
5,"_","_","_","pariṣkṛ","PPP","","_","_"
1,"etat","_","_","tad","PRD","","_","_"
2,"tad","_","_","tad","PRD","","_","_"
3,"_","_","_","arjuna","NC","","_","_"
4,"_","_","_","as","V","as","_","_"
5,"gāṇḍīvaṃ","_","_","gāṇḍīva","NC","","_","_"
6,"_","_","_","parama","JJ","","_","_"
7,"_","_","_","āyudha","NC","","_","_"
1,"yat","_","_","yad","PRL","","_","_"
2,"_","_","_","tad","PRD","","_","_"
3,"_","_","_","śata","NUM","","_","_"
4,"_","_","_","sahasra","NUM","","_","_"
5,"saṃmitaṃ","_","_","saṃmā","PPP","","_","_"
6,"_","_","_","rāṣṭra","NC","","_","_"
7,"_","_","_","vardhana","JJ","","_","_"
1,"yena","_","_","yad","PRL","","_","_"
2,"_","_","_","deva","NC","","_","_"
3,"_","_","_","manuṣya","NC","","_","_"
4,"_","_","_","ca","CCD","","_","_"
5,"pārtho","_","_","pārtha","NC","","_","_"
6,"viṣahate","_","_","viṣah","V","viṣah","_","_"
7,"mṛdhe","_","_","mṛdha","NC","","_","_"
1,"_","_","_","deva","NC","","_","_"
2,"_","_","_","dānava","NC","","_","_"
3,"_","_","_","gandharva","NC","","_","_"
4,"pūjitaṃ","_","_","pūjay","PPP","","_","_"
5,"śāśvatīḥ","_","_","śāśvata","JJ","","_","_"
6,"samāḥ","_","_","samā","NC","","_","_"
1,"etad","_","_","tad","PRD","","_","_"
2,"_","_","_","varṣa","NC","","_","_"
3,"_","_","_","sahasra","NUM","","_","_"
4,"tu","_","_","tu","CCD","","_","_"
5,"brahmā","_","_","brahman","NC","","_","_"
6,"pūrvam","_","_","pūrva","CX","","_","_"
7,"adhārayat","_","_","dhāray","V","dhāray","_","_"
1,"tato","_","_","tatas","CX","","_","_"
2,"'nantaram","_","_","anantara","CX","","_","_"
3,"_","_","_","eva","CEM","","_","_"
4,"_","_","_","atha","CAD","","_","_"
5,"prajāpatir","_","_","prajāpati","NC","","_","_"
6,"adhārayat","_","_","dhāray","V","dhāray","_","_"
1,"trīṇi","_","_","tri","NUM","","_","_"
2,"_","_","_","pañcan","NUM","","_","_"
3,"_","_","_","śata","NUM","","_","_"
4,"_","_","_","ca","CCD","","_","_"
5,"_","_","_","eva","CEM","","_","_"
6,"śakro","_","_","śakra","NC","","_","_"
7,"'śīti","_","_","ca","CCD","","_","_"
8,"ca","_","_","pañcan","NUM","","_","_"
9,"pañca","_","_","ca","CCD","","_","_"
1,"somaḥ","_","_","soma","NC","","_","_"
2,"pañcaśataṃ","_","_","pañcaśata","JJ","","_","_"
3,"rājā","_","_","rājan","NC","","_","_"
4,"_","_","_","tathā","CX","","_","_"
5,"_","_","_","eva","CEM","","_","_"
6,"varuṇaḥ","_","_","varuṇa","NC","","_","_"
7,"śatam","_","_","śata","NUM","","_","_"
1,"pārthaḥ","_","_","pārtha","NC","","_","_"
2,"pañca","_","_","pañcan","NUM","","_","_"
3,"ca","_","_","ca","CCD","","_","_"
4,"ṣaṣṭiṃ","_","_","ṣaṣṭi","NC","","_","_"
5,"ca","_","_","ca","CCD","","_","_"
6,"varṣāṇi","_","_","varṣa","NC","","_","_"
7,"śvetavāhanaḥ","_","_","śvetavāhana","NC","","_","_"
1,"_","_","_","mahat","JJ","","_","_"
2,"_","_","_","vīrya","NC","","_","_"
3,"mahad","_","_","mahat","JJ","","_","_"
4,"divyam","_","_","divya","JJ","","_","_"
5,"etat","_","_","tad","PRD","","_","_"
6,"tad","_","_","tad","PRD","","_","_"
7,"dhanur","_","_","dhanus","NC","","_","_"
8,"uttamam","_","_","uttama","JJ","","_","_"
1,"pūjitaṃ","_","_","pūjay","PPP","","_","_"
2,"_","_","_","sura","NC","","_","_"
3,"_","_","_","martya","NC","","_","_"
4,"bibharti","_","_","bhṛ","V","bhṛ","_","_"
5,"paramaṃ","_","_","parama","JJ","","_","_"
6,"vapuḥ","_","_","vapus","NC","","_","_"
1,"_","_","_","su","CAD","","_","_"
2,"_","_","_","pārśva","NC","","_","_"
3,"bhīmasenasya","_","_","bhīmasa","NC","","_","_"
4,"_","_","_","jātarūpa","NC","","_","_"
5,"_","_","_","graha","NC","","_","_"
6,"dhanuḥ","_","_","dhanus","NC","","_","_"
1,"yena","_","_","yad","PRL","","_","_"
2,"pārtho","_","_","pārtha","NC","","_","_"
3,"'jayat","_","_","jay","V","ji","_","_"
4,"kṛtsnāṃ","_","_","kṛtsna","JJ","","_","_"
5,"diśaṃ","_","_","diś","NC","","_","_"
6,"prācīṃ","_","_","prāñc","JJ","","_","_"
7,"paraṃtapaḥ","_","_","paraṃtapa","JJ","","_","_"
1,"_","_","_","indragopaka","NC","","_","_"
2,"_","_","_","citra","JJ","","_","_"
3,"ca","_","_","ca","CCD","","_","_"
4,"yad","_","_","yad","PRL","","_","_"
5,"_","_","_","tad","PRD","","_","_"
6,"_","_","_","cāru","JJ","","_","_"
7,"_","_","_","vigraha","NC","","_","_"
1,"rājño","_","_","rājan","NC","","_","_"
2,"_","_","_","yudhiṣṭhira","NC","","_","_"
3,"_","_","_","tad","PRD","","_","_"
4,"vairāṭe","_","_","vairāṭi","NC","","_","_"
5,"dhanur","_","_","dhanus","NC","","_","_"
6,"uttamam","_","_","uttama","JJ","","_","_"
1,"sūryā","_","_","sūrya","NC","","_","_"
2,"_","_","_","yad","PRL","","_","_"
3,"_","_","_","tu","CCD","","_","_"
4,"sauvarṇāḥ","_","_","sauvarṇa","JJ","","_","_"
5,"prabhāsante","_","_","prabhās","V","prabhās","_","_"
6,"prabhāsinaḥ","_","_","prabhāsin","JJ","","_","_"
1,"tejasā","_","_","tejas","NC","","_","_"
2,"prajvalanto","_","_","prajval","KDP","","_","_"
3,"vai","_","_","vai","CX","","_","_"
4,"_","_","_","nakula","NC","","_","_"
5,"_","_","_","tad","PRD","","_","_"
6,"āyudham","_","_","āyudha","NC","","_","_"
1,"śalabhā","_","_","śalabha","NC","","_","_"
2,"yatra","_","_","yatra","CX","","_","_"
3,"_","_","_","sauvarṇa","JJ","","_","_"
4,"_","_","_","tapanīya","NC","","_","_"
5,"_","_","_","vicitrita","JJ","","_","_"
1,"_","_","_","tad","PRD","","_","_"
2,"_","_","_","mādrī","NC","","_","_"
3,"_","_","_","suta","NC","","_","_"
4,"_","_","_","api","CX","","_","_"
5,"sahadevasya","_","_","sahadeva","NC","","_","_"
6,"kārmukam","_","_","kārmuka","NC","","_","_"
1,"ye","_","_","yad","PRL","","_","_"
2,"_","_","_","tu","CCD","","_","_"
3,"_","_","_","ida","PRD","","_","_"
4,"_","_","_","kṣura","NC","","_","_"
5,"_","_","_","saṃkāśa","NC","","_","_"
6,"sahasrā","_","_","sahasra","NUM","","_","_"
7,"_","_","_","loman","NC","","_","_"
8,"_","_","_","vāhin","JJ","","_","_"
1,"ete","_","_","tad","PRD","","_","_"
2,"'rjunasya","_","_","arjuna","NC","","_","_"
3,"vairāṭe","_","_","vairāṭi","NC","","_","_"
4,"śarāḥ","_","_","śara","NC","","_","_"
5,"_","_","_","sarpa","NC","","_","_"
6,"_","_","_","viṣa","NC","","_","_"
7,"_","_","_","upama","JJ","","_","_"
1,"ete","_","_","tad","PRD","","_","_"
2,"jvalantaḥ","_","_","jval","KDP","","_","_"
3,"saṃgrāme","_","_","saṃgrāma","NC","","_","_"
4,"tejasā","_","_","tejas","NC","","_","_"
5,"_","_","_","śīghra","JJ","","_","_"
6,"_","_","_","gāmin","JJ","","_","_"
1,"bhavanti","_","_","bhav","V","bhū","_","_"
2,"_","_","_","vīra","NC","","_","_"
3,"_","_","_","akṣayya","JJ","","_","_"
4,"vyūhataḥ","_","_","vyūh","KDP","","_","_"
5,"samare","_","_","samara","NC","","_","_"
6,"ripūn","_","_","ripu","NC","","_","_"
1,"ye","_","_","yad","PRL","","_","_"
2,"_","_","_","ca","CCD","","_","_"
3,"_","_","_","ida","PRD","","_","_"
4,"pṛthavo","_","_","pṛthu","JJ","","_","_"
5,"_","_","_","dīrgha","JJ","","_","_"
6,"_","_","_","candra","NC","","_","_"
7,"_","_","_","bimba","NC","","_","_"
8,"_","_","_","ardha","NC","","_","_"
9,"_","_","_","darśana","NC","","_","_"
1,"ete","_","_","tad","PRD","","_","_"
2,"bhīmasya","_","_","bhīma","NC","","_","_"
3,"niśitā","_","_","niśā","PPP","","_","_"
4,"_","_","_","ripu","NC","","_","_"
5,"_","_","_","kṣaya","NC","","_","_"
6,"_","_","_","kara","JJ","","_","_"
7,"śarāḥ","_","_","śara","NC","","_","_"
1,"_","_","_","hāridra","JJ","","_","_"
2,"_","_","_","varṇa","NC","","_","_"
3,"ye","_","_","yad","PRL","","_","_"
4,"_","_","_","tu","CCD","","_","_"
5,"_","_","_","tad","PRD","","_","_"
6,"_","_","_","hema","NC","","_","_"
7,"_","_","_","puṅkha","NC","","_","_"
8,"_","_","_","śilā","NC","","_","_"
9,"_","_","_","śā","PPP","","_","_"
1,"nakulasya","_","_","nakula","NC","","_","_"
2,"kalāpo","_","_","kalāpa","NC","","_","_"
3,"'yaṃ","_","_","ida","PRD","","_","_"
4,"_","_","_","pañcan","NUM","","_","_"
5,"_","_","_","śārdūla","NC","","_","_"
6,"_","_","_","lakṣaṇa","NC","","_","_"
1,"_","_","_","yad","PRL","","_","_"
2,"_","_","_","adas","PRD","","_","_"
3,"vyajayat","_","_","vijay","V","viji","_","_"
4,"kṛtsnāṃ","_","_","kṛtsna","JJ","","_","_"
5,"pratīcīṃ","_","_","pratyañc","JJ","","_","_"
6,"diśam","_","_","diś","NC","","_","_"
7,"āhave","_","_","āhava","NC","","_","_"
1,"kalāpo","_","_","kalāpa","NC","","_","_"
2,"_","_","_","hi","CX","","_","_"
3,"_","_","_","tad","PRD","","_","_"
4,"_","_","_","tad","PRD","","_","_"
5,"_","_","_","as","V","as","_","_"
6,"_","_","_","mādrī","NC","","_","_"
7,"_","_","_","putra","NC","","_","_"
8,"dhīmataḥ","_","_","dhīmat","JJ","","_","_"
1,"ye","_","_","yad","PRL","","_","_"
2,"_","_","_","tu","CCD","","_","_"
3,"_","_","_","ida","PRD","","_","_"
4,"_","_","_","bhāskara","NC","","_","_"
5,"_","_","_","ākāra","NC","","_","_"
6,"_","_","_","sarva","JQ","","_","_"
7,"_","_","_","pāraśava","JJ","","_","_"
8,"śarāḥ","_","_","śara","NC","","_","_"
1,"ete","_","_","tad","PRD","","_","_"
2,"citrāḥ","_","_","citra","JJ","","_","_"
3,"_","_","_","kriyā","NC","","_","_"
4,"_","_","_","upe","PPP","","_","_"
5,"sahadevasya","_","_","sahadeva","NC","","_","_"
6,"dhīmataḥ","_","_","dhīmat","JJ","","_","_"
1,"ye","_","_","yad","PRL","","_","_"
2,"_","_","_","tu","CCD","","_","_"
3,"_","_","_","ida","PRD","","_","_"
4,"niśitāḥ","_","_","niśā","PPP","","_","_"
5,"pītāḥ","_","_","pīta","JJ","","_","_"
6,"pṛthavo","_","_","pṛthu","JJ","","_","_"
7,"_","_","_","dīrgha","JJ","","_","_"
8,"_","_","_","vāsas","NC","","_","_"
1,"_","_","_","heman","NC","","_","_"
2,"_","_","_","puṅkha","NC","","_","_"
3,"_","_","_","tri","NUM","","_","_"
4,"_","_","_","parvan","NC","","_","_"
5,"rājña","_","_","rājan","NC","","_","_"
6,"ete","_","_","tad","PRD","","_","_"
7,"_","_","_","mahat","JJ","","_","_"
8,"_","_","_","śara","NC","","_","_"
1,"_","_","_","yad","PRL","","_","_"
2,"_","_","_","tu","CCD","","_","_"
3,"_","_","_","ida","PRD","","_","_"
4,"sāyako","_","_","sāyaka","NC","","_","_"
5,"dīrghaḥ","_","_","dīrgha","JJ","","_","_"
6,"_","_","_","śilī","NC","","_","_"
7,"_","_","_","pṛṣṭha","NC","","_","_"
8,"_","_","_","śilī","NC","","_","_"
9,"_","_","_","mukha","NC","","_","_"
1,"_","_","_","arjuna","NC","","_","_"
2,"_","_","_","tad","PRD","","_","_"
3,"saṃgrāme","_","_","saṃgrāma","NC","","_","_"
4,"_","_","_","guru","JJ","","_","_"
5,"_","_","_","bhāra","NC","","_","_"
6,"_","_","_","saha","JJ","","_","_"
7,"dṛḍhaḥ","_","_","dṛḍha","JJ","","_","_"
1,"_","_","_","vaiyāghra","JJ","","_","_"
2,"_","_","_","kośa","NC","","_","_"
3,"_","_","_","tu","CCD","","_","_"
4,"mahān","_","_","mahat","JJ","","_","_"
5,"bhīmasenasya","_","_","bhīmasa","NC","","_","_"
6,"sāyakaḥ","_","_","sāyaka","NC","","_","_"
1,"_","_","_","guru","JJ","","_","_"
2,"_","_","_","bhāra","NC","","_","_"
3,"_","_","_","saha","JJ","","_","_"
4,"divyaḥ","_","_","divya","JJ","","_","_"
5,"śātravāṇāṃ","_","_","śātrava","NC","","_","_"
6,"bhayaṃkaraḥ","_","_","bhayaṃkara","JJ","","_","_"
1,"_","_","_","su","CAD","","_","_"
2,"_","_","_","phala","NC","","_","_"
3,"_","_","_","citra","JJ","","_","_"
4,"_","_","_","kośa","NC","","_","_"
5,"_","_","_","ca","CCD","","_","_"
6,"_","_","_","heman","NC","","_","_"
7,"_","_","_","tsaru","NC","","_","_"
8,"anuttamaḥ","_","_","anuttama","JJ","","_","_"
1,"nistriṃśaḥ","_","_","nistriṃśa","NC","","_","_"
2,"_","_","_","kaurava","NC","","_","_"
3,"_","_","_","tad","PRD","","_","_"
4,"dharmarājasya","_","_","dharmarāja","NC","","_","_"
5,"dhīmataḥ","_","_","dhīmat","JJ","","_","_"
1,"_","_","_","yad","PRL","","_","_"
2,"_","_","_","tu","CCD","","_","_"
3,"pāñcanakhe","_","_","pāñcanakha","JJ","","_","_"
4,"kośe","_","_","kośa","NC","","_","_"
5,"_","_","_","nidhā","PPP","","_","_"
6,"_","_","_","citra","JJ","","_","_"
7,"_","_","_","sevana","NC","","_","_"
1,"_","_","_","nakula","NC","","_","_"
2,"_","_","_","tad","PRD","","_","_"
3,"nistriṃśo","_","_","nistriṃśa","NC","","_","_"
4,"_","_","_","guru","JJ","","_","_"
5,"_","_","_","bhāra","NC","","_","_"
6,"_","_","_","saha","JJ","","_","_"
7,"dṛḍhaḥ","_","_","dṛḍha","JJ","","_","_"
1,"_","_","_","yad","PRL","","_","_"
2,"_","_","_","tu","CCD","","_","_"
3,"_","_","_","ida","PRD","","_","_"
4,"vimalaḥ","_","_","vimala","JJ","","_","_"
5,"khaḍgo","_","_","khaḍga","NC","","_","_"
6,"gavye","_","_","gavya","JJ","","_","_"
7,"kośe","_","_","kośa","NC","","_","_"
8,"samarpitaḥ","_","_","samarpay","PPP","","_","_"
1,"sahadevasya","_","_","sahadeva","NC","","_","_"
2,"_","_","_","vid","V","vid","_","_"
3,"_","_","_","a","PRD","","_","_"
4,"_","_","_","sarva","JQ","","_","_"
5,"_","_","_","bhāra","NC","","_","_"
6,"_","_","_","saha","JJ","","_","_"
7,"dṛḍham","_","_","dṛḍha","JJ","","_","_"
