"WordID","word","NormSTEM","suffix","lemma","PoS","Root","NormSuffix","NormWord"
1,"pra","_","_","pra","CADP","","_","_"
2,"su","_","_","su","CAD","","_","_"
3,"śrutaṃ","_","_","śru","PPP","","_","_"
4,"_","_","_","su","CAD","","_","_"
5,"_","_","_","rādhas","NC","","_","_"
6,"arcā","_","_","arc","V","arc","_","_"
7,"śakram","_","_","śakra","NC","","_","_"
8,"abhiṣṭaye","_","_","abhiṣṭi","NC","","_","_"
1,"yaḥ","_","_","yad","PRL","","_","_"
2,"sunvate","_","_","su","KDP","","_","_"
3,"stuvate","_","_","stu","KDP","","_","_"
4,"kāmyaṃ","_","_","kāmya","JJ","","_","_"
5,"vasu","_","_","vasu","NC","","_","_"
6,"_","_","_","sahasra","NUM","","_","_"
7,"_","_","_","iva","CCM","","_","_"
8,"maṃhate","_","_","mah","V","mah","_","_"
1,"_","_","_","śata","NUM","","_","_"
2,"_","_","_","anīka","NC","","_","_"
3,"hetayo","_","_","heti","NC","","_","_"
4,"asya","_","_","ida","PRD","","_","_"
5,"duṣṭarā","_","_","duṣṭara","JJ","","_","_"
6,"indrasya","_","_","indra","NC","","_","_"
7,"samiṣo","_","_","samiṣ","NC","","_","_"
8,"mahīḥ","_","_","mahi","JJ","","_","_"
1,"girir","_","_","giri","NC","","_","_"
2,"na","_","_","na","CNG","","_","_"
3,"bhujmā","_","_","bhujman","JJ","","_","_"
4,"maghavatsu","_","_","maghavan","JJ","","_","_"
5,"pinvate","_","_","pinv","V","pinv","_","_"
6,"yad","_","_","yat","CSB","","_","_"
7,"īṃ","_","_","īṃ","CX","","_","_"
8,"sutā","_","_","su","PPP","","_","_"
9,"amandiṣuḥ","_","_","mat","V","mat","_","_"
1,"yad","_","_","yat","CSB","","_","_"
2,"īṃ","_","_","īṃ","CX","","_","_"
3,"sutāsa","_","_","su","PPP","","_","_"
4,"indavo","_","_","indu","NC","","_","_"
5,"'bhi","_","_","abhi","CADP","","_","_"
6,"priyam","_","_","priya","JJ","","_","_"
7,"amandiṣuḥ","_","_","mat","V","mat","_","_"
1,"āpo","_","_","ap","NC","","_","_"
2,"na","_","_","na","CNG","","_","_"
3,"dhāyi","_","_","dadh","V","dhā","_","_"
4,"savanam","_","_","savana","NC","","_","_"
5,"ma","_","_","mat","PPR","","_","_"
6,"ā","_","_","ā","CADP","","_","_"
7,"vaso","_","_","vasu","JJ","","_","_"
8,"dughā","_","_","dughā","NC","","_","_"
9,"_","_","_","iva","CCM","","_","_"
10,"_","_","_","upa","CADP","","_","_"
11,"dāśuṣe","_","_","dāś","KDP","","_","_"
1,"anehasaṃ","_","_","anehas","JJ","","_","_"
2,"vo","_","_","tvat","PPR","","_","_"
3,"havamānam","_","_","hvā","KDP","","_","_"
4,"ūtaye","_","_","ūti","NC","","_","_"
5,"madhvaḥ","_","_","madhu","JJ","","_","_"
6,"kṣaranti","_","_","kṣar","V","kṣar","_","_"
7,"dhītayaḥ","_","_","dhīti","NC","","_","_"
1,"ā","_","_","ā","CADP","","_","_"
2,"tvā","_","_","tvat","PPR","","_","_"
3,"vaso","_","_","vasu","JJ","","_","_"
4,"havamānāsa","_","_","hvā","KDP","","_","_"
5,"indava","_","_","indu","NC","","_","_"
6,"upa","_","_","upa","CADP","","_","_"
7,"stotreṣu","_","_","stotra","NC","","_","_"
8,"dadhire","_","_","dadh","V","dhā","_","_"
1,"ā","_","_","ā","CADP","","_","_"
2,"naḥ","_","_","mat","PPR","","_","_"
3,"some","_","_","soma","NC","","_","_"
4,"_","_","_","su","CAD","","_","_"
5,"_","_","_","adhvara","NC","","_","_"
6,"iyāno","_","_","ī","KDP","","_","_"
7,"atyo","_","_","atya","NC","","_","_"
8,"na","_","_","na","CNG","","_","_"
9,"tośate","_","_","tuś","V","tuś","_","_"
1,"yaṃ","_","_","yad","PRL","","_","_"
2,"te","_","_","tvat","PPR","","_","_"
3,"svadāvan","_","_","svadāvan","JJ","","_","_"
4,"svadanti","_","_","svad","V","svad","_","_"
5,"gūrtayaḥ","_","_","gūrti","NC","","_","_"
6,"paure","_","_","paura","NC","","_","_"
7,"chandayase","_","_","chanday","V","chanday","_","_"
8,"havam","_","_","hava","NC","","_","_"
1,"pra","_","_","pra","CADP","","_","_"
2,"vīram","_","_","vīra","NC","","_","_"
3,"ugraṃ","_","_","ugra","JJ","","_","_"
4,"viviciṃ","_","_","vivici","JJ","","_","_"
5,"_","_","_","dhana","NC","","_","_"
6,"_","_","_","spṛt","JJ","","_","_"
7,"vibhūtiṃ","_","_","vibhūti","JJ","","_","_"
8,"rādhaso","_","_","rādhas","NC","","_","_"
9,"mahaḥ","_","_","mah","JJ","","_","_"
1,"_","_","_","udrin","JJ","","_","_"
2,"_","_","_","iva","CCM","","_","_"
3,"vajrinn","_","_","vajrin","NC","","_","_"
4,"a","_","_","alpha_privativum","NC","","_","_"
4,"avato","_","_","vata","NC","","_","_"
5,"vasutvanā","_","_","vasutvana","NC","","_","_"
6,"sadā","_","_","sadā","CAD","","_","_"
7,"pīpetha","_","_","pyā","V","pyā","_","_"
8,"dāśuṣe","_","_","dāś","KDP","","_","_"
1,"_","_","_","yat","CSB","","_","_"
2,"_","_","_","ha","CEM","","_","_"
3,"nūnam","_","_","nūna","CX","","_","_"
4,"parāvati","_","_","parāvat","NC","","_","_"
5,"yad","_","_","yat","CSB","","_","_"
6,"vā","_","_","vā","CCD","","_","_"
7,"pṛthivyāṃ","_","_","pṛthivī","NC","","_","_"
8,"divi","_","_","div","NC","","_","_"
1,"yujāna","_","_","yuj","KDP","","_","_"
2,"indra","_","_","indra","NC","","_","_"
3,"haribhir","_","_","hari","NC","","_","_"
4,"mahemata","_","_","mahemati","JJ","","_","_"
5,"ṛṣva","_","_","ṛṣva","JJ","","_","_"
6,"ṛṣvebhir","_","_","ṛṣva","JJ","","_","_"
7,"ā","_","_","ā","CADP","","_","_"
8,"gahi","_","_","ga","V","ga","_","_"
1,"rathirāso","_","_","rathira","JJ","","_","_"
2,"harayo","_","_","hari","NC","","_","_"
3,"ye","_","_","yad","PRL","","_","_"
4,"te","_","_","tvat","PPR","","_","_"
5,"a","_","_","alpha_privativum","JJ","","_","_"
5,"asridha","_","_","sridh","JJ","","_","_"
6,"ojo","_","_","ojas","NC","","_","_"
7,"vātasya","_","_","vāta","NC","","_","_"
8,"piprati","_","_","pṛ","V","pṛ","_","_"
1,"yebhir","_","_","yad","PRL","","_","_"
2,"ni","_","_","ni","CADP","","_","_"
3,"dasyum","_","_","dasyu","NC","","_","_"
4,"manuṣo","_","_","manus","NC","","_","_"
5,"nighoṣayo","_","_","nighoṣay","V","nighoṣay","_","_"
6,"yebhiḥ","_","_","yad","PRL","","_","_"
7,"svaḥ","_","_","svar","NC","","_","_"
8,"parīyase","_","_","parye","V","parī","_","_"
1,"etāvatas","_","_","etāvat","JJ","","_","_"
2,"te","_","_","tvat","PPR","","_","_"
3,"vaso","_","_","vasu","JJ","","_","_"
4,"vidyāma","_","_","vid","V","vid","_","_"
5,"śūra","_","_","śūra","NC","","_","_"
6,"navyasaḥ","_","_","navyas","JJ","","_","_"
1,"yathā","_","_","yathā","CCM","","_","_"
2,"prāva","_","_","prāva","V","prāv","_","_"
3,"etaśaṃ","_","_","etaśa","NC","","_","_"
4,"kṛtvye","_","_","kṛtvya","JJ","","_","_"
5,"dhane","_","_","dhana","NC","","_","_"
6,"yathā","_","_","yathā","CCM","","_","_"
7,"vaśaṃ","_","_","vaśa","NC","","_","_"
8,"daśavraje","_","_","daśavraja","NC","","_","_"
1,"yathā","_","_","yathā","CCM","","_","_"
2,"kaṇve","_","_","kaṇva","NC","","_","_"
3,"maghavan","_","_","maghavan","NC","","_","_"
4,"medhe","_","_","medha","NC","","_","_"
5,"adhvare","_","_","adhvara","NC","","_","_"
6,"dīrghanīthe","_","_","dīrghanītha","NC","","_","_"
7,"damūnasi","_","_","damūnas","NC","","_","_"
1,"yathā","_","_","yathā","CCM","","_","_"
2,"gośarye","_","_","gośarya","NC","","_","_"
3,"asiṣāso","_","_","siṣās","V","siṣās","_","_"
4,"adrivo","_","_","adrivat","JJ","","_","_"
5,"mayi","_","_","mat","PPR","","_","_"
6,"gotraṃ","_","_","gotra","NC","","_","_"
7,"_","_","_","hari","NC","","_","_"
8,"_","_","_","śrī","NC","","_","_"
