"WordID","word","NormSTEM","suffix","lemma","PoS","Root","NormSuffix","NormWord"
1,"dhṛtarāṣṭra","_","_","dhṛtarāṣṭra","NC","","_","_"
2,"uvāca","_","_","vak","V","vac","_","_"
1,"duryodhana","_","_","duryodhana","NC","","_","_"
2,"vijānīhi","_","_","vijān","V","vijñā","_","_"
3,"yat","_","_","yad","PRL","","_","_"
4,"tvāṃ","_","_","tvat","PPR","","_","_"
5,"vakṣyāmi","_","_","vak","V","vac","_","_"
6,"putraka","_","_","putraka","NC","","_","_"
1,"utpathaṃ","_","_","utpatha","NC","","_","_"
2,"manyase","_","_","man","V","man","_","_"
3,"mārgam","_","_","mārga","NC","","_","_"
4,"anabhijña","_","_","anabhijña","JJ","","_","_"
5,"_","_","_","iva","CCM","","_","_"
6,"_","_","_","adhvaga","NC","","_","_"
1,"pañcānāṃ","_","_","pañcan","NUM","","_","_"
2,"_","_","_","pāṇḍu","NC","","_","_"
3,"_","_","_","putra","NC","","_","_"
4,"yat","_","_","yad","PRL","","_","_"
5,"tejaḥ","_","_","tejas","NC","","_","_"
1,"pañcānām","_","_","pañcan","NUM","","_","_"
2,"iva","_","_","iva","CCM","","_","_"
3,"bhūtānāṃ","_","_","bhūta","NC","","_","_"
4,"mahatāṃ","_","_","mahat","JJ","","_","_"
5,"_","_","_","su","CAD","","_","_"
6,"_","_","_","mahātman","JJ","","_","_"
1,"yudhiṣṭhiraṃ","_","_","yudhiṣṭhira","NC","","_","_"
2,"hi","_","_","hi","CX","","_","_"
3,"kaunteyaṃ","_","_","kaunteya","NC","","_","_"
4,"paraṃ","_","_","para","PPX","","_","_"
5,"dharmam","_","_","dharma","NC","","_","_"
6,"_","_","_","iha","CAD","","_","_"
7,"_","_","_","āsthā","PPP","","_","_"
1,"parāṃ","_","_","para","PPX","","_","_"
2,"gatim","_","_","gati","NC","","_","_"
3,"a","_","_","alpha_privativum","CX","","_","_"
3,"asaṃprekṣya","_","_","saṃprekṣya","CX","","_","_"
4,"na","_","_","na","CNG","","_","_"
5,"tvaṃ","_","_","tvat","PPR","","_","_"
6,"vettum","_","_","vid","CGDI","","_","_"
7,"_","_","_","iha","CAD","","_","_"
8,"_","_","_","arh","V","arh","_","_"
1,"bhīmasenaṃ","_","_","bhīmasa","NC","","_","_"
2,"ca","_","_","ca","CCD","","_","_"
3,"kaunteyaṃ","_","_","kaunteya","NC","","_","_"
4,"yasya","_","_","yad","PRL","","_","_"
5,"_","_","_","na","CNG","","_","_"
6,"_","_","_","as","V","as","_","_"
7,"samo","_","_","sama","PPX","","_","_"
8,"bale","_","_","bala","NC","","_","_"
1,"_","_","_","raṇa","NC","","_","_"
2,"_","_","_","antaka","NC","","_","_"
3,"tarkayase","_","_","tarkay","V","tarkay","_","_"
4,"_","_","_","mahat","JJ","","_","_"
5,"_","_","_","vāta","NC","","_","_"
6,"iva","_","_","iva","CCM","","_","_"
7,"drumaḥ","_","_","druma","NC","","_","_"
1,"_","_","_","sarva","JQ","","_","_"
2,"_","_","_","śastrabhṛt","NC","","_","_"
3,"śreṣṭhaṃ","_","_","śreṣṭha","JJ","","_","_"
4,"meruṃ","_","_","meru","NC","","_","_"
5,"śikhariṇām","_","_","śikharin","NC","","_","_"
6,"iva","_","_","iva","CCM","","_","_"
1,"yudhi","_","_","yudh","NC","","_","_"
2,"gāṇḍīvadhanvānaṃ","_","_","gāṇḍīvadhanvan","NC","","_","_"
3,"ko","_","_","kiṃ","PRQ","","_","_"
4,"nu","_","_","nu","CX","","_","_"
5,"yudhyeta","_","_","yudh","V","yudh","_","_"
6,"buddhimān","_","_","buddhimat","JJ","","_","_"
1,"_","_","_","dhṛṣṭadyumna","NC","","_","_"
2,"_","_","_","ca","CCD","","_","_"
3,"pāñcālyaḥ","_","_","pāñcālya","JJ","","_","_"
4,"kam","_","_","kiṃ","PRQ","","_","_"
5,"_","_","_","iva","CCM","","_","_"
6,"_","_","_","adya","CX","","_","_"
7,"na","_","_","na","CNG","","_","_"
8,"śātayet","_","_","śātay","V","śātay","_","_"
1,"_","_","_","śatru","NC","","_","_"
2,"_","_","_","madhya","NC","","_","_"
3,"_","_","_","śara","NC","","_","_"
4,"_","_","_","muc","KDP","","_","_"
5,"devarāḍ","_","_","devarāj","NC","","_","_"
6,"aśanīm","_","_","aśani","NC","","_","_"
7,"iva","_","_","iva","CCM","","_","_"
1,"_","_","_","sātyaki","NC","","_","_"
2,"_","_","_","ca","CCD","","_","_"
3,"_","_","_","api","CX","","_","_"
4,"durdharṣaḥ","_","_","durdharṣa","JJ","","_","_"
5,"saṃmato","_","_","samman","PPP","","_","_"
6,"_","_","_","andhaka","NC","","_","_"
7,"_","_","_","vṛṣṇi","NC","","_","_"
1,"dhvaṃsayiṣyati","_","_","dhvaṃsay","V","dhvaṃsay","_","_"
2,"te","_","_","tvat","PPR","","_","_"
3,"senāṃ","_","_","senā","NC","","_","_"
4,"_","_","_","pāṇḍaveya","NC","","_","_"
5,"_","_","_","hita","JJ","","_","_"
6,"rataḥ","_","_","ra","PPP","","_","_"
1,"yaḥ","_","_","yad","PRL","","_","_"
2,"punaḥ","_","_","punar","CAD","","_","_"
3,"pratimānena","_","_","pratimāna","NC","","_","_"
4,"trīṃl","_","_","tri","NUM","","_","_"
5,"lokān","_","_","loka","NC","","_","_"
6,"atiricyate","_","_","atiric","V","atiric","_","_"
1,"taṃ","_","_","tad","PRD","","_","_"
2,"kṛṣṇaṃ","_","_","kṛṣṇa","NC","","_","_"
3,"puṇḍarīkākṣaṃ","_","_","puṇḍarīkākṣa","NC","","_","_"
4,"ko","_","_","kiṃ","PRQ","","_","_"
5,"nu","_","_","nu","CX","","_","_"
6,"yudhyeta","_","_","yudh","V","yudh","_","_"
7,"buddhimān","_","_","buddhimat","JJ","","_","_"
1,"ekato","_","_","ekatas","CX","","_","_"
2,"_","_","_","hi","CX","","_","_"
3,"_","_","_","ida","PRD","","_","_"
4,"_","_","_","dāra","NC","","_","_"
5,"_","_","_","ca","CCD","","_","_"
6,"_","_","_","jñāti","NC","","_","_"
7,"_","_","_","ca","CCD","","_","_"
8,"_","_","_","sa_saha","CX","","_","_"
9,"_","_","_","bāndhava","NC","","_","_"
1,"ātmā","_","_","ātman","NC","","_","_"
2,"ca","_","_","ca","CCD","","_","_"
3,"pṛthivī","_","_","pṛthivī","NC","","_","_"
4,"_","_","_","ca","CCD","","_","_"
5,"_","_","_","ida","PRD","","_","_"
6,"_","_","_","ekatas","CX","","_","_"
7,"_","_","_","ca","CCD","","_","_"
8,"dhanaṃjayaḥ","_","_","dhanaṃjaya","NC","","_","_"
1,"vāsudevo","_","_","vāsudeva","NC","","_","_"
2,"'pi","_","_","api","CX","","_","_"
3,"durdharṣo","_","_","durdharṣa","JJ","","_","_"
4,"_","_","_","ya","PPP","","_","_"
5,"_","_","_","ātman","NC","","_","_"
6,"yatra","_","_","yatra","CX","","_","_"
7,"pāṇḍavaḥ","_","_","pāṇḍava","NC","","_","_"
1,"aviṣahyaṃ","_","_","aviṣahya","JJ","","_","_"
2,"_","_","_","pṛthivī","NC","","_","_"
3,"_","_","_","api","CX","","_","_"
4,"tad","_","_","tad","PRD","","_","_"
5,"balaṃ","_","_","bala","NC","","_","_"
6,"yatra","_","_","yatra","CX","","_","_"
7,"keśavaḥ","_","_","keśava","NC","","_","_"
1,"tiṣṭha","_","_","tiṣṭh","V","sthā","_","_"
2,"tāta","_","_","tāta","NC","","_","_"
3,"satāṃ","_","_","sat","JJ","","_","_"
4,"vākye","_","_","vākya","NC","","_","_"
5,"suhṛdām","_","_","suhṛd","NC","","_","_"
6,"_","_","_","artha","NC","","_","_"
7,"_","_","_","vādin","JJ","","_","_"
1,"vṛddhaṃ","_","_","vṛddha","JJ","","_","_"
2,"śāṃtanavaṃ","_","_","śāṃtanava","NC","","_","_"
3,"bhīṣmaṃ","_","_","bhīṣma","NC","","_","_"
4,"titikṣasva","_","_","titikṣ","V","titikṣ","_","_"
5,"pitāmaham","_","_","pitāmaha","NC","","_","_"
1,"māṃ","_","_","mat","PPR","","_","_"
2,"ca","_","_","ca","CCD","","_","_"
3,"bruvāṇaṃ","_","_","brū","KDP","","_","_"
4,"śuśrūṣa","_","_","śuśrūṣ","V","śuśrūṣ","_","_"
5,"kurūṇām","_","_","kuru","NC","","_","_"
6,"_","_","_","artha","NC","","_","_"
7,"_","_","_","vādin","JJ","","_","_"
1,"droṇaṃ","_","_","droṇa","NC","","_","_"
2,"kṛpaṃ","_","_","kṛpa","NC","","_","_"
3,"vikarṇaṃ","_","_","vikarṇa","NC","","_","_"
4,"ca","_","_","ca","CCD","","_","_"
5,"_","_","_","mahat","JJ","","_","_"
6,"_","_","_","rāja","NC","","_","_"
7,"ca","_","_","ca","CCD","","_","_"
8,"bāhlikam","_","_","bāhlika","NC","","_","_"
1,"ete","_","_","tad","PRD","","_","_"
2,"_","_","_","hi","CX","","_","_"
3,"_","_","_","api","CX","","_","_"
4,"_","_","_","yathā","CCM","","_","_"
5,"_","_","_","eva","CEM","","_","_"
6,"_","_","_","mat","PPR","","_","_"
7,"mantum","_","_","man","CGDI","","_","_"
8,"arhasi","_","_","arh","V","arh","_","_"
9,"_","_","_","tad","PRD","","_","_"
10,"_","_","_","tathā","CX","","_","_"
1,"sarve","_","_","sarva","JQ","","_","_"
2,"_","_","_","dharma","NC","","_","_"
3,"_","_","_","vid","JJ","","_","_"
4,"_","_","_","hi","CX","","_","_"
5,"_","_","_","tad","PRD","","_","_"
6,"_","_","_","tulya","JJ","","_","_"
7,"_","_","_","sneha","NC","","_","_"
8,"_","_","_","ca","CCD","","_","_"
9,"bhārata","_","_","bhārata","NC","","_","_"
1,"yat","_","_","yat","CSB","","_","_"
2,"tad","_","_","tad","PRD","","_","_"
3,"_","_","_","virāṭa","NC","","_","_"
4,"_","_","_","nagara","NC","","_","_"
5,"saha","_","_","saha","CX","","_","_"
6,"bhrātṛbhir","_","_","bhrātṛ","NC","","_","_"
7,"agrataḥ","_","_","agratas","CX","","_","_"
1,"utsṛjya","_","_","utsṛj","CGDA","","_","_"
2,"gāḥ","_","_","go","NC","","_","_"
3,"_","_","_","su","CAD","","_","_"
4,"_","_","_","saṃtras","PPP","","_","_"
5,"balaṃ","_","_","bala","NC","","_","_"
6,"te","_","_","tvat","PPR","","_","_"
7,"samaśīryata","_","_","saṃśṛ","V","saṃśṛ","_","_"
1,"_","_","_","yat","CSB","","_","_"
2,"_","_","_","ca","CCD","","_","_"
3,"_","_","_","eva","CEM","","_","_"
4,"_","_","_","tad","PRD","","_","_"
5,"_","_","_","nagara","NC","","_","_"
6,"śrūyate","_","_","śṛṇ","V","śru","_","_"
7,"mahad","_","_","mahat","JJ","","_","_"
8,"adbhutam","_","_","adbhuta","NC","","_","_"
1,"ekasya","_","_","eka","PPX","","_","_"
2,"ca","_","_","ca","CCD","","_","_"
3,"bahūnāṃ","_","_","bahu","JJ","","_","_"
4,"ca","_","_","ca","CCD","","_","_"
5,"paryāptaṃ","_","_","paryāp","PPP","","_","_"
6,"_","_","_","tad","PRD","","_","_"
7,"_","_","_","nidarśana","NC","","_","_"
1,"_","_","_","arjuna","NC","","_","_"
2,"_","_","_","tad","PRD","","_","_"
3,"_","_","_","tathā","CX","","_","_"
4,"_","_","_","kar","V","kṛ","_","_"
5,"kiṃ","_","_","kiṃ","PRQ","","_","_"
6,"punaḥ","_","_","punar","CAD","","_","_"
7,"sarva","_","_","sarva","JQ","","_","_"
8,"eva","_","_","eva","CEM","","_","_"
9,"te","_","_","tad","PRD","","_","_"
1,"_","_","_","sa_saha","CX","","_","_"
2,"_","_","_","bhrātṛ","NC","","_","_"
3,"abhijānīhi","_","_","abhijān","V","abhijñā","_","_"
4,"vṛttyā","_","_","vṛtti","NC","","_","_"
5,"ca","_","_","ca","CCD","","_","_"
6,"pratipādaya","_","_","pratipāday","V","pratipāday","_","_"
