"WordID","word","NormSTEM","suffix","lemma","PoS","Root","NormSuffix","NormWord"
1,"oṃ","_","_","oṃ","CX","","_","_"
2,"śāstrāṇy","_","_","śāstra","NC","","_","_"
3,"a","_","_","alpha_privativum","CGDA","","_","_"
3,"adhītya","_","_","dhī","CGDA","","_","_"
4,"medhāvī","_","_","medhāvin","NC","","_","_"
5,"abhyasya","_","_","abhyas","CGDA","","_","_"
6,"ca","_","_","ca","CCD","","_","_"
7,"punaḥ","_","_","punar","CAD","","_","_"
8,"punaḥ","_","_","punar","CAD","","_","_"
1,"paramaṃ","_","_","parama","JJ","","_","_"
2,"brahma","_","_","brahman","NC","","_","_"
3,"vidyāyā","_","_","vidyā","NC","","_","_"
1,"oṃkāraṃ","_","_","oṃkāra","NC","","_","_"
2,"ratham","_","_","ratha","NC","","_","_"
3,"āruhya","_","_","āruh","CGDA","","_","_"
4,"viṣṇuṃ","_","_","viṣṇu","NC","","_","_"
5,"kṛtvā","_","_","kṛ","CGDA","","_","_"
6,"tu","_","_","tu","CCD","","_","_"
7,"sārathim","_","_","sārathi","NC","","_","_"
1,"_","_","_","brahman","NC","","_","_"
2,"_","_","_","loka","NC","","_","_"
3,"_","_","_","pada","NC","","_","_"
4,"_","_","_","anveṣin","JJ","","_","_"
5,"_","_","_","rudra","NC","","_","_"
6,"_","_","_","ārādhana","NC","","_","_"
7,"_","_","_","tatpara","JJ","","_","_"
1,"tāvad","_","_","tāvat","CX","","_","_"
2,"rathena","_","_","ratha","NC","","_","_"
3,"gantavyaṃ","_","_","ga","KDG","","_","_"
4,"yāvad","_","_","yāvat","CX","","_","_"
5,"_","_","_","ratha","NC","","_","_"
6,"_","_","_","pathin","NC","","_","_"
7,"sthitaḥ","_","_","sthā","PPP","","_","_"
1,"chittvā","_","_","chid","CGDA","","_","_"
2,"_","_","_","ratha","NC","","_","_"
3,"_","_","_","pathin","NC","","_","_"
4,"ratham","_","_","ratha","NC","","_","_"
5,"utsṛjya","_","_","utsṛj","CGDA","","_","_"
6,"gacchati","_","_","gacch","V","gam","_","_"
1,"mātrā","_","_","mātrā","NC","","_","_"
2,"_","_","_","liṅga","NC","","_","_"
3,"_","_","_","pada","NC","","_","_"
4,"tyaktvā","_","_","tyaj","CGDA","","_","_"
5,"_","_","_","śabda","NC","","_","_"
6,"_","_","_","vyañjana","NC","","_","_"
7,"_","_","_","varjay","PPP","","_","_"
1,"asvareṇa","_","_","asvara","JJ","","_","_"
2,"makāreṇa","_","_","makāra","NC","","_","_"
3,"padaṃ","_","_","pada","NC","","_","_"
4,"sūkṣmaṃ","_","_","sūkṣma","JJ","","_","_"
5,"ca","_","_","ca","CCD","","_","_"
6,"gacchati","_","_","gacch","V","gam","_","_"
1,"_","_","_","śabda","NC","","_","_"
2,"_","_","_","ādi","NC","","_","_"
3,"_","_","_","viṣaya","NC","","_","_"
4,"pañca","_","_","pañcan","NUM","","_","_"
5,"manaś","_","_","manas","NC","","_","_"
6,"_","_","_","ca","CCD","","_","_"
7,"_","_","_","eva","CEM","","_","_"
8,"_","_","_","ati","CADP","","_","_"
9,"_","_","_","cañcala","JJ","","_","_"
1,"cintayed","_","_","cint","V","cint","_","_"
2,"ātmano","_","_","ātman","NC","","_","_"
3,"raśmīn","_","_","raśmi","NC","","_","_"
4,"pratyāhāraḥ","_","_","pratyāhāra","NC","","_","_"
5,"sa","_","_","tad","PRD","","_","_"
6,"ucyate","_","_","vak","V","vac","_","_"
1,"pratyāhāras","_","_","pratyāhāra","NC","","_","_"
2,"tathā","_","_","tathā","CX","","_","_"
3,"dhyānaṃ","_","_","dhyāna","NC","","_","_"
4,"prāṇāyāmo","_","_","prāṇāyāma","NC","","_","_"
5,"'tha","_","_","atha","CAD","","_","_"
6,"dhāraṇā","_","_","dhāraṇā","NC","","_","_"
1,"tarkaś","_","_","tarka","NC","","_","_"
2,"_","_","_","ca","CCD","","_","_"
3,"_","_","_","eva","CEM","","_","_"
4,"samādhiś","_","_","samādhi","NC","","_","_"
5,"ca","_","_","ca","CCD","","_","_"
6,"ṣaḍaṅgo","_","_","ṣaḍaṅga","JJ","","_","_"
7,"yoga","_","_","yoga","NC","","_","_"
8,"ucyate","_","_","vak","V","vac","_","_"
1,"yathā","_","_","yathā","CCM","","_","_"
2,"parvatadhātūnāṃ","_","_","parvatadhātu","NC","","_","_"
3,"dahyante","_","_","dah","V","dah","_","_"
4,"dhamanān","_","_","dhamana","NC","","_","_"
5,"malāḥ","_","_","mala","NC","","_","_"
1,"_","_","_","tathā","CX","","_","_"
2,"_","_","_","indriya","NC","","_","_"
3,"_","_","_","kṛ","PPP","","_","_"
4,"doṣā","_","_","doṣa","NC","","_","_"
5,"dahyante","_","_","dah","V","dah","_","_"
6,"prāṇanigrahāt","_","_","prāṇanigraha","NC","","_","_"
1,"prāṇāyāmair","_","_","prāṇāyāma","NC","","_","_"
2,"dahed","_","_","dah","V","dah","_","_"
3,"doṣān","_","_","doṣa","NC","","_","_"
4,"dhāraṇābhiś","_","_","dhāraṇā","NC","","_","_"
5,"ca","_","_","ca","CCD","","_","_"
6,"kilbiṣam","_","_","kilbiṣa","NC","","_","_"
