"WordID","word","NormSTEM","suffix","lemma","PoS","Root","NormSuffix","NormWord"
1,"yaṃ","_","_","yad","PRL","","_","_"
2,"tvaṃ","_","_","tvat","PPR","","_","_"
3,"ratham","_","_","ratha","NC","","_","_"
4,"indra","_","_","indra","NC","","_","_"
5,"_","_","_","medha","NC","","_","_"
6,"_","_","_","sāti","NC","","_","_"
7,"'pākā","_","_","apākā","CX","","_","_"
8,"santam","_","_","as","KDP","","_","_"
9,"iṣira","_","_","iṣira","JJ","","_","_"
10,"praṇayasi","_","_","praṇī","V","praṇī","_","_"
11,"_","_","_","pra","CADP","","_","_"
12,"_","_","_","anavadya","JJ","","_","_"
13,"nayasi","_","_","nay","V","nī","_","_"
1,"sadyaś","_","_","sadyas","CAD","","_","_"
2,"cit","_","_","cit","CEM","","_","_"
3,"tam","_","_","tad","PRD","","_","_"
4,"abhiṣṭaye","_","_","abhiṣṭi","NC","","_","_"
5,"karo","_","_","kar","V","kṛ","_","_"
6,"vaśaś","_","_","vaś","V","vaś","_","_"
7,"ca","_","_","ca","CCD","","_","_"
8,"vājinam","_","_","vājin","JJ","","_","_"
1,"_","_","_","tad","PRD","","_","_"
2,"_","_","_","mat","PPR","","_","_"
3,"anavadya","_","_","anavadya","JJ","","_","_"
4,"tūtujāna","_","_","tuj","KDP","","_","_"
5,"vedhasām","_","_","vedhas","NC","","_","_"
6,"imāṃ","_","_","ida","PRD","","_","_"
7,"vācaṃ","_","_","vāc","NC","","_","_"
8,"na","_","_","na","CNG","","_","_"
9,"vedhasām","_","_","vedhas","NC","","_","_"
1,"sa","_","_","tad","PRD","","_","_"
2,"śrudhi","_","_","śṛṇ","V","śru","_","_"
3,"yaḥ","_","_","yad","PRL","","_","_"
4,"smā","_","_","sma","CX","","_","_"
5,"pṛtanāsu","_","_","pṛtanā","NC","","_","_"
6,"kāsu","_","_","kiṃ","PRQ","","_","_"
7,"cid","_","_","cit","CEM","","_","_"
8,"dakṣāyya","_","_","dakṣāyya","JJ","","_","_"
9,"indra","_","_","indra","NC","","_","_"
10,"_","_","_","bhara","NC","","_","_"
11,"_","_","_","hūti","NC","","_","_"
12,"nṛbhir","_","_","nṛ","NC","","_","_"
13,"asi","_","_","as","V","as","_","_"
14,"pratūrtaye","_","_","pratūrti","NC","","_","_"
15,"nṛbhiḥ","_","_","nṛ","NC","","_","_"
1,"yaḥ","_","_","yad","PRL","","_","_"
2,"śūraiḥ","_","_","śūra","NC","","_","_"
3,"svaḥ","_","_","svar","NC","","_","_"
4,"sanitā","_","_","san","V","san","_","_"
5,"yo","_","_","yad","PRL","","_","_"
6,"viprair","_","_","vipra","NC","","_","_"
7,"vājaṃ","_","_","vāja","NC","","_","_"
8,"tarutā","_","_","tarutṛ","JJ","","_","_"
1,"tam","_","_","tad","PRD","","_","_"
2,"īśānāsa","_","_","īś","KDP","","_","_"
3,"iradhanta","_","_","iradh","V","iradh","_","_"
4,"vājinam","_","_","vājin","JJ","","_","_"
5,"pṛkṣam","_","_","pṛkṣa","JJ","","_","_"
6,"atyaṃ","_","_","atya","NC","","_","_"
7,"na","_","_","na","CNG","","_","_"
8,"vājinam","_","_","vājin","NC","","_","_"
1,"dasmo","_","_","dasma","NC","","_","_"
2,"hi","_","_","hi","CX","","_","_"
3,"ṣmā","_","_","sma","CX","","_","_"
4,"vṛṣaṇam","_","_","vṛṣan","JJ","","_","_"
5,"pinvasi","_","_","pinv","V","pinv","_","_"
6,"tvacaṃ","_","_","tvac","NC","","_","_"
7,"kaṃ","_","_","kiṃ","PRQ","","_","_"
8,"cid","_","_","cit","CEM","","_","_"
9,"yāvīr","_","_","yu","V","yu","_","_"
10,"araruṃ","_","_","araru","JJ","","_","_"
11,"śūra","_","_","śūra","NC","","_","_"
12,"martyam","_","_","martya","NC","","_","_"
13,"parivṛṇakṣi","_","_","parivṛj","V","parivṛj","_","_"
14,"martyam","_","_","martya","NC","","_","_"
1,"_","_","_","indra","NC","","_","_"
2,"_","_","_","uta","CCD","","_","_"
3,"tubhyaṃ","_","_","tvat","PPR","","_","_"
4,"tad","_","_","tad","PRD","","_","_"
5,"dive","_","_","div","NC","","_","_"
6,"tad","_","_","tad","PRD","","_","_"
7,"rudrāya","_","_","rudra","NC","","_","_"
8,"_","_","_","sva","JJ","","_","_"
9,"_","_","_","yaśas","NC","","_","_"
1,"mitrāya","_","_","mitra","NC","","_","_"
2,"vocaṃ","_","_","vak","V","vac","_","_"
3,"varuṇāya","_","_","varuṇa","NC","","_","_"
4,"saprathaḥ","_","_","saprathas","JJ","","_","_"
5,"_","_","_","su","CAD","","_","_"
6,"_","_","_","mṛḍīka","NC","","_","_"
7,"saprathaḥ","_","_","saprathas","JJ","","_","_"
1,"asmākaṃ","_","_","mat","PPR","","_","_"
2,"va","_","_","tvat","PPR","","_","_"
3,"indram","_","_","indra","NC","","_","_"
4,"_","_","_","vaś","V","vaś","_","_"
5,"_","_","_","iṣṭi","NC","","_","_"
6,"sakhāyaṃ","_","_","sakhi","NC","","_","_"
7,"viśvāyum","_","_","viśvāyu","JJ","","_","_"
8,"prāsahaṃ","_","_","prāsah","JJ","","_","_"
9,"yujaṃ","_","_","yuj","NC","","_","_"
10,"vājeṣu","_","_","vāja","NC","","_","_"
11,"prāsahaṃ","_","_","prāsah","JJ","","_","_"
12,"yujam","_","_","yuj","NC","","_","_"
1,"asmākam","_","_","mat","PPR","","_","_"
2,"_","_","_","brahman","NC","","_","_"
3,"_","_","_","ūti","NC","","_","_"
4,"'vā","_","_","av","V","av","_","_"
5,"pṛtsuṣu","_","_","pṛt","NC","","_","_"
6,"kāsu","_","_","kiṃ","PRQ","","_","_"
7,"cit","_","_","cit","CEM","","_","_"
1,"_","_","_","na","CNG","","_","_"
2,"_","_","_","hi","CX","","_","_"
3,"tvā","_","_","tvat","PPR","","_","_"
4,"śatru","_","_","śatru","NC","","_","_"
5,"starate","_","_","stṛ","V","stṛ","_","_"
6,"stṛṇoṣi","_","_","stṛ","V","stṛ","_","_"
7,"yaṃ","_","_","yad","PRL","","_","_"
8,"viśvaṃ","_","_","viśva","JQ","","_","_"
9,"śatruṃ","_","_","śatru","NC","","_","_"
10,"stṛṇoṣi","_","_","stṛ","V","stṛ","_","_"
11,"yam","_","_","yad","PRL","","_","_"
1,"ni","_","_","ni","CADP","","_","_"
2,"ṣū","_","_","su","CAD","","_","_"
3,"_","_","_","na","V","na","_","_"
4,"_","_","_","atimati","NC","","_","_"
5,"kayasya","_","_","kaya","PPX","","_","_"
6,"cit","_","_","cit","CEM","","_","_"
7,"tejiṣṭhābhir","_","_","tejiṣṭha","JJ","","_","_"
8,"araṇibhir","_","_","araṇi","NC","","_","_"
9,"_","_","_","na","CNG","","_","_"
10,"_","_","_","ūti","NC","","_","_"
11,"ugrābhir","_","_","ugra","JJ","","_","_"
12,"_","_","_","ugra","JJ","","_","_"
13,"_","_","_","ūti","NC","","_","_"
1,"neṣi","_","_","nay","V","nī","_","_"
2,"ṇo","_","_","mat","PPR","","_","_"
3,"yathā","_","_","yathā","CCM","","_","_"
4,"_","_","_","purā","CX","","_","_"
5,"_","_","_","anenas","JJ","","_","_"
6,"śūra","_","_","śūra","NC","","_","_"
7,"manyase","_","_","man","V","man","_","_"
1,"viśvāni","_","_","viśva","JQ","","_","_"
2,"pūror","_","_","pūru","NC","","_","_"
3,"apa","_","_","apa","CX","","_","_"
4,"parṣi","_","_","pṛ","V","pṛ","_","_"
5,"vahnir","_","_","vahni","NC","","_","_"
6,"āsā","_","_","ās","NC","","_","_"
7,"vahnir","_","_","vahni","NC","","_","_"
8,"no","_","_","mat","PPR","","_","_"
9,"accha","_","_","acchā","CADP","","_","_"
1,"pra","_","_","pra","CADP","","_","_"
2,"tad","_","_","tad","PRD","","_","_"
3,"voceyam","_","_","vak","V","vac","_","_"
4,"_","_","_","bhū","KDG","","_","_"
5,"_","_","_","indu","NC","","_","_"
6,"havyo","_","_","hvā","KDG","","_","_"
7,"na","_","_","na","CNG","","_","_"
8,"ya","_","_","yad","PRL","","_","_"
9,"iṣavān","_","_","iṣavat","JJ","","_","_"
10,"manma","_","_","manman","NC","","_","_"
11,"rejati","_","_","rej","V","rej","_","_"
12,"_","_","_","rakṣas","NC","","_","_"
13,"_","_","_","han","JJ","","_","_"
14,"manma","_","_","manman","NC","","_","_"
15,"rejati","_","_","rej","V","rej","_","_"
1,"svayaṃ","_","_","svaya","CX","","_","_"
2,"so","_","_","tad","PRD","","_","_"
3,"asmad","_","_","mat","PPR","","_","_"
4,"ā","_","_","ā","CADP","","_","_"
5,"nido","_","_","nid","NC","","_","_"
6,"vadhair","_","_","vadha","NC","","_","_"
7,"ajeta","_","_","aj","V","aj","_","_"
8,"durmatim","_","_","durmati","NC","","_","_"
1,"ava","_","_","ava","CX","","_","_"
2,"sraved","_","_","srav","V","sru","_","_"
3,"_","_","_","agha","JJ","","_","_"
4,"_","_","_","śaṃsa","JJ","","_","_"
5,"'vataram","_","_","avatara","CX","","_","_"
6,"ava","_","_","ava","CX","","_","_"
7,"kṣudram","_","_","kṣudra","JJ","","_","_"
8,"iva","_","_","iva","CCM","","_","_"
9,"sravet","_","_","srav","V","sru","_","_"
1,"vanema","_","_","van","V","van","_","_"
2,"_","_","_","tad","PRD","","_","_"
3,"_","_","_","hotrā","NC","","_","_"
4,"citantyā","_","_","van","V","van","_","_"
5,"vanema","_","_","rayi","NC","","_","_"
6,"rayiṃ","_","_","rayivat","JJ","","_","_"
7,"_","_","_","su","CAD","","_","_"
8,"_","_","_","vīrya","NC","","_","_"
9,"suvīryaṃ","_","_","raṇva","JJ","","_","_"
10,"raṇvaṃ","_","_","as","KDP","","_","_"
11,"_","_","_","su","CAD","","_","_"
12,"_","_","_","vīrya","NC","","_","_"
1,"durmanmānaṃ","_","_","durmanman","JJ","","_","_"
2,"_","_","_","su","CAD","","_","_"
3,"_","_","_","mantu","NC","","_","_"
4,"_","_","_","ā","CADP","","_","_"
5,"_","_","_","īṃ","CX","","_","_"
6,"iṣā","_","_","iṣ","NC","","_","_"
7,"pṛcīmahi","_","_","pṛc","V","pṛc","_","_"
1,"ā","_","_","ā","CADP","","_","_"
2,"satyābhir","_","_","satya","JJ","","_","_"
3,"indraṃ","_","_","indra","NC","","_","_"
4,"_","_","_","dyumna","NC","","_","_"
5,"_","_","_","hūti","NC","","_","_"
6,"yajatraṃ","_","_","yajatra","JJ","","_","_"
7,"_","_","_","dyumna","NC","","_","_"
8,"_","_","_","hūti","NC","","_","_"
1,"pra","_","_","pra","CADP","","_","_"
2,"prā","_","_","pra","CADP","","_","_"
3,"vo","_","_","tvat","PPR","","_","_"
4,"asme","_","_","mat","PPR","","_","_"
5,"_","_","_","sva","JJ","","_","_"
6,"_","_","_","yaśas","NC","","_","_"
7,"ūtī","_","_","ūti","NC","","_","_"
8,"parivarga","_","_","parivarga","NC","","_","_"
9,"indro","_","_","indra","NC","","_","_"
10,"durmatīnāṃ","_","_","durmati","JJ","","_","_"
11,"darīman","_","_","darīman","NC","","_","_"
12,"durmatīnām","_","_","durmati","JJ","","_","_"
1,"svayaṃ","_","_","svaya","CX","","_","_"
2,"sā","_","_","tad","PRD","","_","_"
3,"riṣayadhyai","_","_","reṣay","CGDI","","_","_"
4,"yā","_","_","yad","PRL","","_","_"
5,"na","_","_","mat","PPR","","_","_"
6,"upeṣe","_","_","upeṣ","V","upeṣ","_","_"
7,"atraiḥ","_","_","atra","NC","","_","_"
1,"_","_","_","han","PPP","","_","_"
2,"_","_","_","īṃ","CX","","_","_"
3,"asan","_","_","as","V","as","_","_"
4,"na","_","_","na","CNG","","_","_"
5,"vakṣati","_","_","vah","V","vah","_","_"
6,"kṣiptā","_","_","kṣip","PPP","","_","_"
7,"jūrṇir","_","_","jūrṇi","NC","","_","_"
8,"na","_","_","na","CNG","","_","_"
9,"vakṣati","_","_","vah","V","vah","_","_"
1,"tvaṃ","_","_","tvat","PPR","","_","_"
2,"na","_","_","mat","PPR","","_","_"
3,"indra","_","_","indra","NC","","_","_"
4,"rāyā","_","_","rai","NC","","_","_"
5,"parīṇasā","_","_","parīṇas","NC","","_","_"
6,"yāhi","_","_","yā","V","yā","_","_"
7,"pathāṃ","_","_","pathin","NC","","_","_"
8,"anehasā","_","_","anehas","JJ","","_","_"
9,"puro","_","_","puras","CX","","_","_"
10,"yāhy","_","_","yā","V","yā","_","_"
11,"arakṣasā","_","_","arakṣas","JJ","","_","_"
1,"sacasva","_","_","sac","V","sac","_","_"
2,"naḥ","_","_","mat","PPR","","_","_"
3,"parāka","_","_","parāka","NC","","_","_"
4,"ā","_","_","ā","CADP","","_","_"
5,"_","_","_","sac","V","sac","_","_"
6,"_","_","_","astamīke","CX","","_","_"
7,"ā","_","_","ā","CADP","","_","_"
1,"pāhi","_","_","pib","V","pā","_","_"
2,"no","_","_","mat","PPR","","_","_"
3,"dūrād","_","_","dūrāt","CX","","_","_"
4,"ārād","_","_","ārāt","CX","","_","_"
5,"abhiṣṭibhiḥ","_","_","abhiṣṭi","NC","","_","_"
6,"sadā","_","_","sadā","CAD","","_","_"
7,"pāhy","_","_","pib","V","pā","_","_"
8,"abhiṣṭibhiḥ","_","_","abhiṣṭi","NC","","_","_"
1,"tvaṃ","_","_","tvat","PPR","","_","_"
2,"na","_","_","mat","PPR","","_","_"
3,"indra","_","_","indra","NC","","_","_"
4,"rāyā","_","_","rai","NC","","_","_"
5,"_","_","_","tarūṣas","JJ","","_","_"
6,"_","_","_","ugra","JJ","","_","_"
7,"cit","_","_","cit","CEM","","_","_"
8,"tvā","_","_","tvat","PPR","","_","_"
9,"mahimā","_","_","mahiman","NC","","_","_"
10,"sakṣad","_","_","sac","V","sac","_","_"
11,"avase","_","_","av","CGDI","","_","_"
12,"mahe","_","_","mah","JJ","","_","_"
13,"mitraṃ","_","_","mitra","NC","","_","_"
14,"_","_","_","na","CNG","","_","_"
15,"_","_","_","av","CGDI","","_","_"
1,"ojiṣṭha","_","_","ojiṣṭha","JJ","","_","_"
2,"trātar","_","_","trātṛ","NC","","_","_"
3,"avitā","_","_","av","V","av","_","_"
4,"rathaṃ","_","_","ratha","NC","","_","_"
5,"kaṃ","_","_","kiṃ","PRQ","","_","_"
6,"cid","_","_","cit","CEM","","_","_"
7,"amartya","_","_","amartya","JJ","","_","_"
1,"anyam","_","_","anya","PPX","","_","_"
2,"asmad","_","_","mat","PPR","","_","_"
3,"ririṣeḥ","_","_","riṣ","V","riṣ","_","_"
4,"kaṃ","_","_","kiṃ","PRQ","","_","_"
5,"cid","_","_","cit","CEM","","_","_"
6,"adrivo","_","_","adrivat","JJ","","_","_"
7,"ririkṣantaṃ","_","_","cit","CEM","","_","_"
8,"cid","_","_","adrivat","JJ","","_","_"
1,"pāhi","_","_","pib","V","pā","_","_"
2,"na","_","_","mat","PPR","","_","_"
3,"indra","_","_","indra","NC","","_","_"
4,"suṣṭuta","_","_","suṣṭuta","JJ","","_","_"
5,"sridho","_","_","sridh","NC","","_","_"
6,"'vayātā","_","_","avayātṛ","JJ","","_","_"
7,"sadam","_","_","sada","CAD","","_","_"
8,"id","_","_","id","CEM","","_","_"
9,"durmatīnāṃ","_","_","durmati","JJ","","_","_"
10,"devaḥ","_","_","deva","NC","","_","_"
11,"san","_","_","as","KDP","","_","_"
12,"durmatīnām","_","_","durmati","JJ","","_","_"
1,"hantā","_","_","han","V","han","_","_"
2,"pāpasya","_","_","pāpa","JJ","","_","_"
3,"rakṣasas","_","_","rakṣas","NC","","_","_"
4,"trātā","_","_","trā","V","trā","_","_"
5,"viprasya","_","_","vipra","NC","","_","_"
6,"māvataḥ","_","_","māvat","JJ","","_","_"
1,"adhā","_","_","adha","CX","","_","_"
2,"hi","_","_","hi","CX","","_","_"
3,"tvā","_","_","tvat","PPR","","_","_"
4,"janitā","_","_","janitṛ","NC","","_","_"
5,"jījanad","_","_","jan","V","jan","_","_"
6,"vaso","_","_","vasu","JJ","","_","_"
7,"_","_","_","rakṣas","NC","","_","_"
8,"_","_","_","han","JJ","","_","_"
9,"tvā","_","_","tvat","PPR","","_","_"
10,"jījanad","_","_","jan","V","jan","_","_"
11,"vaso","_","_","vasu","JJ","","_","_"
