"WordID","word","NormSTEM","suffix","lemma","PoS","Root","NormSuffix","NormWord"
1,"nārada","_","_","nārada","NC","","_","_"
2,"uvāca","_","_","vak","V","vac","_","_"
1,"evam","_","_","eva","CX","","_","_"
2,"uktaḥ","_","_","vac","PPP","","_","_"
3,"suparṇena","_","_","suparṇa","NC","","_","_"
4,"tathyaṃ","_","_","tathya","JJ","","_","_"
5,"vacanam","_","_","vacana","NC","","_","_"
6,"uttamam","_","_","uttama","JJ","","_","_"
1,"_","_","_","vimṛś","CGDA","","_","_"
2,"_","_","_","avahita","JJ","","_","_"
3,"rājā","_","_","rājan","NC","","_","_"
4,"niścitya","_","_","niści","CGDA","","_","_"
5,"ca","_","_","ca","CCD","","_","_"
6,"punaḥ","_","_","punar","CAD","","_","_"
7,"punaḥ","_","_","punar","CAD","","_","_"
1,"yaṣṭā","_","_","yaṣṭṛ","JJ","","_","_"
2,"_","_","_","kratu","NC","","_","_"
3,"_","_","_","sahasra","NUM","","_","_"
4,"dātā","_","_","dātṛ","JJ","","_","_"
5,"_","_","_","dāna","NC","","_","_"
6,"_","_","_","pati","NC","","_","_"
7,"prabhuḥ","_","_","prabhu","JJ","","_","_"
1,"yayātir","_","_","yayāti","NC","","_","_"
2,"_","_","_","vatsa","NC","","_","_"
3,"_","_","_","kāsīsa","NC","","_","_"
4,"idaṃ","_","_","ida","PRD","","_","_"
5,"vacanam","_","_","vacana","NC","","_","_"
6,"abravīt","_","_","abravīta","V","brū","_","_"
1,"dṛṣṭvā","_","_","dṛś","CGDA","","_","_"
2,"_","_","_","priya","JJ","","_","_"
3,"_","_","_","sakha","NC","","_","_"
4,"tārkṣyaṃ","_","_","tārkṣya","NC","","_","_"
5,"gālavaṃ","_","_","gālava","NC","","_","_"
6,"ca","_","_","ca","CCD","","_","_"
7,"dvijarṣabham","_","_","dvijarṣabha","NC","","_","_"
1,"nidarśanaṃ","_","_","nidarśana","NC","","_","_"
2,"ca","_","_","ca","CCD","","_","_"
3,"tapaso","_","_","tapas","NC","","_","_"
4,"bhikṣāṃ","_","_","bhikṣā","NC","","_","_"
5,"ślāghyāṃ","_","_","ślāgh","KDG","","_","_"
6,"ca","_","_","ca","CCD","","_","_"
7,"kīrtitām","_","_","kīrtay","PPP","","_","_"
1,"atītya","_","_","atī","CGDA","","_","_"
2,"ca","_","_","ca","CCD","","_","_"
3,"nṛpān","_","_","nṛpa","NC","","_","_"
4,"anyān","_","_","anya","PPX","","_","_"
5,"_","_","_","āditya","NC","","_","_"
6,"_","_","_","kula","NC","","_","_"
7,"_","_","_","sambhava","NC","","_","_"
1,"_","_","_","mat","PPR","","_","_"
2,"_","_","_","sakāśa","NC","","_","_"
3,"_","_","_","anuprāp","PPP","","_","_"
4,"_","_","_","tad","PRD","","_","_"
5,"buddhim","_","_","buddhi","NC","","_","_"
6,"avekṣya","_","_","avekṣ","CGDA","","_","_"
7,"ca","_","_","ca","CCD","","_","_"
1,"adya","_","_","adya","CX","","_","_"
2,"me","_","_","mat","PPR","","_","_"
3,"_","_","_","sa_saha","CX","","_","_"
4,"_","_","_","phala","NC","","_","_"
5,"janma","_","_","janman","NC","","_","_"
6,"tāritaṃ","_","_","tāray","PPP","","_","_"
7,"_","_","_","ca","CCD","","_","_"
8,"_","_","_","adya","CX","","_","_"
9,"me","_","_","mat","PPR","","_","_"
10,"kulam","_","_","kula","NC","","_","_"
1,"_","_","_","adya","CX","","_","_"
2,"_","_","_","ida","PRD","","_","_"
3,"tārito","_","_","tāray","PPP","","_","_"
4,"deśo","_","_","deśa","NC","","_","_"
5,"mama","_","_","mat","PPR","","_","_"
6,"tārkṣya","_","_","tārkṣya","NC","","_","_"
7,"_","_","_","tvat","PPR","","_","_"
8,"_","_","_","anagha","JJ","","_","_"
1,"vaktum","_","_","vac","CGDI","","_","_"
2,"icchāmi","_","_","iṣ","V","iṣ","_","_"
3,"tu","_","_","tu","CCD","","_","_"
4,"sakhe","_","_","sakhi","NC","","_","_"
5,"yathā","_","_","yathā","CCM","","_","_"
6,"jānāsi","_","_","jān","V","jñā","_","_"
7,"māṃ","_","_","mat","PPR","","_","_"
8,"purā","_","_","purā","CX","","_","_"
1,"na","_","_","na","CNG","","_","_"
2,"tathā","_","_","tathā","CX","","_","_"
3,"vittavān","_","_","vittavat","JJ","","_","_"
4,"asmi","_","_","as","V","as","_","_"
5,"kṣīṇaṃ","_","_","kṣi","PPP","","_","_"
6,"vittaṃ","_","_","vitta","NC","","_","_"
7,"hi","_","_","hi","CX","","_","_"
8,"me","_","_","mat","PPR","","_","_"
9,"sakhe","_","_","sakhi","NC","","_","_"
1,"na","_","_","na","CNG","","_","_"
2,"ca","_","_","ca","CCD","","_","_"
3,"śakto","_","_","śak","PPP","","_","_"
4,"'smi","_","_","as","V","as","_","_"
5,"te","_","_","tvat","PPR","","_","_"
6,"kartuṃ","_","_","kṛ","CGDI","","_","_"
7,"mogham","_","_","mogha","JJ","","_","_"
8,"āgamanaṃ","_","_","āgamana","NC","","_","_"
9,"khaga","_","_","khaga","NC","","_","_"
1,"na","_","_","na","CNG","","_","_"
2,"_","_","_","ca","CCD","","_","_"
3,"_","_","_","āśā","NC","","_","_"
4,"asya","_","_","ida","PRD","","_","_"
5,"viprarṣer","_","_","viprarṣi","NC","","_","_"
6,"vitathāṃ","_","_","vitatha","JJ","","_","_"
7,"kartum","_","_","kṛ","CGDI","","_","_"
8,"utsahe","_","_","utsaha","V","utsah","_","_"
1,"tat","_","_","tad","PRD","","_","_"
2,"tu","_","_","tu","CCD","","_","_"
3,"dāsyāmi","_","_","dad","V","dā","_","_"
4,"yat","_","_","yad","PRL","","_","_"
5,"kāryam","_","_","kārya","NC","","_","_"
6,"idaṃ","_","_","ida","PRD","","_","_"
7,"saṃpādayiṣyati","_","_","sampāday","V","sampāday","_","_"
1,"abhigamya","_","_","abhiga","CGDA","","_","_"
2,"_","_","_","han","PPP","","_","_"
3,"_","_","_","āśā","NC","","_","_"
4,"hi","_","_","hi","CX","","_","_"
5,"nivṛtto","_","_","nivṛt","PPP","","_","_"
6,"dahate","_","_","dah","V","dah","_","_"
7,"kulam","_","_","kula","NC","","_","_"
1,"_","_","_","na","CNG","","_","_"
2,"_","_","_","atas","CX","","_","_"
3,"paraṃ","_","_","para","CX","","_","_"
4,"vainateya","_","_","vainateya","NC","","_","_"
5,"kiṃcit","_","_","kiṃcit","PRI","","_","_"
6,"pāpiṣṭham","_","_","pāpiṣṭha","JJ","","_","_"
7,"ucyate","_","_","vak","V","vac","_","_"
1,"_","_","_","yathā","CCM","","_","_"
2,"_","_","_","āśā","NC","","_","_"
3,"_","_","_","nāśana","JJ","","_","_"
4,"loke","_","_","loka","NC","","_","_"
5,"dehi","_","_","dad","V","dā","_","_"
6,"_","_","_","na","CNG","","_","_"
7,"_","_","_","as","V","as","_","_"
8,"_","_","_","iti","CQT","","_","_"
9,"vā","_","_","vā","CCD","","_","_"
10,"vacaḥ","_","_","vacas","NC","","_","_"
1,"_","_","_","han","PPP","","_","_"
2,"_","_","_","āśā","NC","","_","_"
3,"_","_","_","hi","CX","","_","_"
4,"_","_","_","akṛtārtha","JJ","","_","_"
5,"san","_","_","as","KDP","","_","_"
6,"hataḥ","_","_","han","PPP","","_","_"
7,"saṃbhāvito","_","_","sambhāvay","PPP","","_","_"
8,"naraḥ","_","_","nara","NC","","_","_"
1,"hinasti","_","_","hiṃs","V","hiṃs","_","_"
2,"tasya","_","_","tad","PRD","","_","_"
3,"_","_","_","putra","NC","","_","_"
4,"_","_","_","ca","CCD","","_","_"
5,"_","_","_","pautra","NC","","_","_"
6,"_","_","_","ca","CCD","","_","_"
7,"a","_","_","alpha_privativum","JJ","","_","_"
7,"_","_","_","kurvat","JJ","","_","_"
8,"'rthinām","_","_","arthin","JJ","","_","_"
1,"_","_","_","tasmāt","CX","","_","_"
2,"_","_","_","catur","NUM","","_","_"
3,"vaṃśānāṃ","_","_","vaṃśa","NC","","_","_"
4,"sthāpayitrī","_","_","sthāpayitṛ","JJ","","_","_"
5,"sutā","_","_","sutā","NC","","_","_"
6,"mama","_","_","mat","PPR","","_","_"
1,"iyaṃ","_","_","ida","PRD","","_","_"
2,"_","_","_","sura","NC","","_","_"
3,"_","_","_","suta","NC","","_","_"
4,"_","_","_","prakhyā","NC","","_","_"
5,"_","_","_","sarva","JQ","","_","_"
6,"_","_","_","dharma","NC","","_","_"
7,"_","_","_","upacāyin","JJ","","_","_"
1,"sadā","_","_","sadā","CAD","","_","_"
2,"_","_","_","deva","NC","","_","_"
3,"_","_","_","manuṣya","NC","","_","_"
4,"asurāṇāṃ","_","_","asura","NC","","_","_"
5,"ca","_","_","ca","CCD","","_","_"
6,"gālava","_","_","gālava","NC","","_","_"
1,"kāṅkṣitā","_","_","kāṅkṣ","PPP","","_","_"
2,"rūpato","_","_","rūpa","NC","","_","_"
3,"bālā","_","_","bālā","NC","","_","_"
4,"sutā","_","_","sutā","NC","","_","_"
5,"me","_","_","mat","PPR","","_","_"
6,"pratigṛhyatām","_","_","pratigrah","V","pratigrah","_","_"
1,"asyāḥ","_","_","ida","PRD","","_","_"
2,"śulkaṃ","_","_","śulka","NC","","_","_"
3,"pradāsyanti","_","_","pradad","V","pradā","_","_"
4,"nṛpā","_","_","nṛpa","NC","","_","_"
5,"rājyam","_","_","rājya","NC","","_","_"
6,"api","_","_","api","CX","","_","_"
7,"dhruvam","_","_","dhruva","CX","","_","_"
1,"kiṃ","_","_","kim","CX","","_","_"
2,"punaḥ","_","_","punar","CAD","","_","_"
3,"_","_","_","śyāma","JJ","","_","_"
4,"_","_","_","karṇa","NC","","_","_"
5,"hayānāṃ","_","_","haya","NC","","_","_"
6,"dve","_","_","dvi","NUM","","_","_"
7,"catuḥśate","_","_","catuḥśata","NC","","_","_"
1,"sa","_","_","tad","PRD","","_","_"
2,"bhavān","_","_","bhavat","JJ","","_","_"
3,"pratigṛhṇātu","_","_","pratigrah","V","pratigrah","_","_"
4,"_","_","_","mat","PPR","","_","_"
5,"_","_","_","ida","PRD","","_","_"
6,"mādhavīṃ","_","_","mādhavī","NC","","_","_"
7,"sutām","_","_","sutā","NC","","_","_"
1,"ahaṃ","_","_","mat","PPR","","_","_"
2,"dauhitravān","_","_","dauhitravat","JJ","","_","_"
3,"syāṃ","_","_","as","V","as","_","_"
4,"vai","_","_","vai","CX","","_","_"
5,"vara","_","_","vara","NC","","_","_"
6,"eṣa","_","_","tad","PRD","","_","_"
7,"mama","_","_","mat","PPR","","_","_"
8,"prabho","_","_","prabhu","JJ","","_","_"
1,"pratigṛhya","_","_","pratigrah","CGDA","","_","_"
2,"ca","_","_","ca","CCD","","_","_"
3,"tāṃ","_","_","tad","PRD","","_","_"
4,"kanyāṃ","_","_","kanyā","NC","","_","_"
5,"gālavaḥ","_","_","gālava","NC","","_","_"
6,"saha","_","_","saha","CX","","_","_"
7,"pakṣiṇā","_","_","pakṣin","NC","","_","_"
1,"punar","_","_","punar","CAD","","_","_"
2,"drakṣyāva","_","_","darś","V","dṛś","_","_"
3,"_","_","_","iti","CQT","","_","_"
4,"_","_","_","vac","CGDA","","_","_"
5,"pratasthe","_","_","pratiṣṭh","V","prasthā","_","_"
6,"saha","_","_","saha","CX","","_","_"
7,"kanyayā","_","_","kanyā","NC","","_","_"
1,"upalabdham","_","_","upalabh","PPP","","_","_"
2,"idaṃ","_","_","ida","PRD","","_","_"
3,"dvāram","_","_","dvāra","NC","","_","_"
4,"aśvānām","_","_","aśva","NC","","_","_"
5,"iti","_","_","iti","CQT","","_","_"
6,"_","_","_","ca","CCD","","_","_"
7,"_","_","_","aṇḍaja","NC","","_","_"
1,"uktvā","_","_","vac","CGDA","","_","_"
2,"gālavam","_","_","gālava","NC","","_","_"
3,"āpṛcchya","_","_","āpracch","CGDA","","_","_"
4,"jagāma","_","_","ga","V","ga","_","_"
5,"bhavanaṃ","_","_","bhavana","NC","","_","_"
6,"svakam","_","_","svaka","JJ","","_","_"
1,"gate","_","_","ga","PPP","","_","_"
2,"_","_","_","pataga","NC","","_","_"
3,"_","_","_","rāja","NC","","_","_"
4,"tu","_","_","tu","CCD","","_","_"
5,"gālavaḥ","_","_","gālava","NC","","_","_"
6,"saha","_","_","saha","CX","","_","_"
7,"kanyayā","_","_","kanyā","NC","","_","_"
1,"cintayānaḥ","_","_","cintay","KDP","","_","_"
2,"kṣamaṃ","_","_","kṣama","JJ","","_","_"
3,"dāne","_","_","dāna","NC","","_","_"
4,"rājñāṃ","_","_","rājan","NC","","_","_"
5,"vai","_","_","vai","CX","","_","_"
6,"śulkato","_","_","śulka","NC","","_","_"
7,"'gamat","_","_","ga","V","ga","_","_"
1,"so","_","_","tad","PRD","","_","_"
2,"_","_","_","ga","V","ga","_","_"
3,"_","_","_","manas","NC","","_","_"
4,"_","_","_","ikṣvāku","NC","","_","_"
5,"haryaśvaṃ","_","_","haryaśva","NC","","_","_"
6,"_","_","_","rājan","NC","","_","_"
7,"_","_","_","sattama","JJ","","_","_"
1,"ayodhyāyāṃ","_","_","ayodhyā","NC","","_","_"
2,"_","_","_","mahat","JJ","","_","_"
3,"_","_","_","vīrya","NC","","_","_"
4,"_","_","_","caturaṅga","JJ","","_","_"
5,"_","_","_","bala","NC","","_","_"
6,"_","_","_","anvita","JJ","","_","_"
1,"_","_","_","kośa","NC","","_","_"
2,"_","_","_","dhānya","NC","","_","_"
3,"_","_","_","bala","NC","","_","_"
4,"_","_","_","upe","PPP","","_","_"
5,"_","_","_","priya","JJ","","_","_"
6,"_","_","_","paura","NC","","_","_"
7,"_","_","_","dvija","NC","","_","_"
8,"_","_","_","priya","JJ","","_","_"
1,"_","_","_","prajā","NC","","_","_"
2,"_","_","_","abhikāma","JJ","","_","_"
3,"śāmyantaṃ","_","_","śa","KDP","","_","_"
4,"kurvāṇaṃ","_","_","kṛ","KDP","","_","_"
5,"tapa","_","_","tapas","NC","","_","_"
6,"uttamam","_","_","uttama","JJ","","_","_"
1,"tam","_","_","tad","PRD","","_","_"
2,"upāgamya","_","_","upāga","CGDA","","_","_"
3,"vipraḥ","_","_","vipra","NC","","_","_"
4,"sa","_","_","tad","PRD","","_","_"
5,"haryaśvaṃ","_","_","haryaśva","NC","","_","_"
6,"gālavo","_","_","gālava","NC","","_","_"
7,"'bravīt","_","_","abravīta","V","brū","_","_"
1,"_","_","_","kanyā","NC","","_","_"
2,"_","_","_","ida","PRD","","_","_"
3,"mama","_","_","mat","PPR","","_","_"
4,"_","_","_","rājan","NC","","_","_"
5,"_","_","_","indra","NC","","_","_"
6,"prasavaiḥ","_","_","prasava","NC","","_","_"
7,"_","_","_","kula","NC","","_","_"
8,"_","_","_","vardhin","JJ","","_","_"
1,"iyaṃ","_","_","ida","PRD","","_","_"
2,"śulkena","_","_","śulka","NC","","_","_"
3,"_","_","_","bhāryā","NC","","_","_"
4,"_","_","_","artha","NC","","_","_"
5,"haryaśva","_","_","haryaśva","NC","","_","_"
6,"pratigṛhyatām","_","_","pratigrah","V","pratigrah","_","_"
1,"śulkaṃ","_","_","śulka","NC","","_","_"
2,"te","_","_","tvat","PPR","","_","_"
3,"kīrtayiṣyāmi","_","_","kīrtay","V","kīrtay","_","_"
4,"_","_","_","tad","PRD","","_","_"
5,"_","_","_","śru","CGDA","","_","_"
6,"sampradhāryatām","_","_","sampradhāray","V","sampradhāray","_","_"
