"WordID","word","NormSTEM","suffix","lemma","PoS","Root","NormSuffix","NormWord"
1,"vaiśaṃpāyana","_","_","vaiśampāyana","NC","","_","_"
2,"uvāca","_","_","vak","V","vac","_","_"
1,"arjunasya","_","_","arjuna","NC","","_","_"
2,"vacaḥ","_","_","vacas","NC","","_","_"
3,"śrutvā","_","_","śru","CGDA","","_","_"
4,"bhīmaseno","_","_","bhīmasa","NC","","_","_"
5,"_","_","_","ati","CADP","","_","_"
6,"_","_","_","amarṣaṇa","JJ","","_","_"
1,"dhairyam","_","_","dhairya","NC","","_","_"
2,"āsthāya","_","_","āsthā","CGDA","","_","_"
3,"tejasvī","_","_","tejasvin","JJ","","_","_"
4,"jyeṣṭhaṃ","_","_","jyeṣṭha","JJ","","_","_"
5,"bhrātaram","_","_","bhrātṛ","NC","","_","_"
6,"abravīt","_","_","abravīta","V","brū","_","_"
1,"rājan","_","_","rājan","NC","","_","_"
2,"_","_","_","vid","PPP","","_","_"
3,"_","_","_","dharma","NC","","_","_"
4,"'si","_","_","as","V","as","_","_"
5,"na","_","_","na","CNG","","_","_"
6,"te","_","_","tvat","PPR","","_","_"
7,"_","_","_","as","V","as","_","_"
8,"_","_","_","avidita","JJ","","_","_"
9,"bhuvi","_","_","bhū","NC","","_","_"
1,"upaśikṣāma","_","_","upaśikṣ","V","upaśikṣ","_","_"
2,"te","_","_","tvat","PPR","","_","_"
3,"vṛttaṃ","_","_","vṛtta","NC","","_","_"
4,"_","_","_","sadā","CAD","","_","_"
5,"_","_","_","eva","CEM","","_","_"
6,"na","_","_","na","CNG","","_","_"
7,"ca","_","_","ca","CCD","","_","_"
8,"śaknumaḥ","_","_","śakn","V","śak","_","_"
1,"na","_","_","na","CNG","","_","_"
2,"vakṣyāmi","_","_","vak","V","vac","_","_"
3,"na","_","_","na","CNG","","_","_"
4,"_","_","_","vak","V","vac","_","_"
5,"_","_","_","iti","CQT","","_","_"
6,"_","_","_","eva","CX","","_","_"
7,"me","_","_","mat","PPR","","_","_"
8,"manasi","_","_","manas","NC","","_","_"
9,"sthitam","_","_","sthā","PPP","","_","_"
1,"_","_","_","ati","CADP","","_","_"
2,"_","_","_","duḥkha","NC","","_","_"
3,"tu","_","_","tu","CCD","","_","_"
4,"vakṣyāmi","_","_","vak","V","vac","_","_"
5,"_","_","_","tad","PRD","","_","_"
6,"_","_","_","nibodh","V","nibudh","_","_"
7,"janādhipa","_","_","janādhipa","NC","","_","_"
1,"_","_","_","bhavat","JJ","","_","_"
2,"_","_","_","tu","CCD","","_","_"
3,"pramohena","_","_","pramoha","NC","","_","_"
4,"sarvaṃ","_","_","sarva","JQ","","_","_"
5,"saṃśayitaṃ","_","_","saṃśī","PPP","","_","_"
6,"kṛtam","_","_","kṛ","PPP","","_","_"
1,"_","_","_","viklava","JJ","","_","_"
3,"ca","_","_","ca","CCD","","_","_"
4,"naḥ","_","_","mat","PPR","","_","_"
5,"prāptam","_","_","prāp","PPP","","_","_"
6,"_","_","_","abala","JJ","","_","_"
8,"_","_","_","tathā","CX","","_","_"
9,"_","_","_","eva","CEM","","_","_"
10,"ca","_","_","ca","CCD","","_","_"
1,"kathaṃ","_","_","katha","CX","","_","_"
2,"hi","_","_","hi","CX","","_","_"
3,"rājā","_","_","rājan","NC","","_","_"
4,"lokasya","_","_","loka","NC","","_","_"
5,"_","_","_","sarva","JQ","","_","_"
6,"_","_","_","śāstra","NC","","_","_"
7,"_","_","_","viśārada","JJ","","_","_"
1,"moham","_","_","moha","NC","","_","_"
2,"āpadyate","_","_","āpady","V","āpad","_","_"
3,"dainyād","_","_","dainya","NC","","_","_"
4,"yathā","_","_","yathā","CCM","","_","_"
5,"_","_","_","kupuruṣa","NC","","_","_"
6,"_","_","_","tathā","CX","","_","_"
1,"_","_","_","āgati","NC","","_","_"
2,"_","_","_","ca","CCD","","_","_"
3,"_","_","_","gati","NC","","_","_"
4,"_","_","_","ca","CCD","","_","_"
5,"_","_","_","eva","CEM","","_","_"
6,"lokasya","_","_","loka","NC","","_","_"
7,"viditā","_","_","vid","PPP","","_","_"
8,"tava","_","_","tvat","PPR","","_","_"
1,"āyatyāṃ","_","_","āyati","NC","","_","_"
2,"ca","_","_","ca","CCD","","_","_"
3,"tadātve","_","_","tadātva","NC","","_","_"
4,"ca","_","_","ca","CCD","","_","_"
5,"na","_","_","na","CNG","","_","_"
6,"te","_","_","tvat","PPR","","_","_"
7,"_","_","_","as","V","as","_","_"
8,"_","_","_","avidita","JJ","","_","_"
9,"prabho","_","_","prabhu","NC","","_","_"
1,"evaṃ","_","_","eva","CX","","_","_"
2,"gate","_","_","ga","PPP","","_","_"
3,"_","_","_","mahat","JJ","","_","_"
4,"_","_","_","rāja","NC","","_","_"
5,"rājyaṃ","_","_","rājya","NC","","_","_"
6,"prati","_","_","prati","CADP","","_","_"
7,"janādhipa","_","_","janādhipa","NC","","_","_"
1,"hetum","_","_","hetu","NC","","_","_"
2,"atra","_","_","atra","CAD","","_","_"
3,"pravakṣyāmi","_","_","pravak","V","pravac","_","_"
4,"tad","_","_","tad","PRD","","_","_"
5,"_","_","_","iha","CAD","","_","_"
6,"_","_","_","ekamanas","JJ","","_","_"
7,"śṛṇu","_","_","śṛṇ","V","śru","_","_"
1,"dvividho","_","_","dvividha","JJ","","_","_"
2,"jāyate","_","_","jan","V","jan","_","_"
3,"vyādhiḥ","_","_","vyādhi","NC","","_","_"
4,"śārīro","_","_","śārīra","JJ","","_","_"
5,"_","_","_","mānasa","JJ","","_","_"
6,"_","_","_","tathā","CX","","_","_"
1,"parasparaṃ","_","_","paraspara","PRC","","_","_"
2,"tayor","_","_","tad","PRD","","_","_"
3,"janma","_","_","janman","NC","","_","_"
4,"nirdvaṃdvaṃ","_","_","nirdvaṃdva","JJ","","_","_"
5,"_","_","_","na","CNG","","_","_"
6,"_","_","_","upalabh","V","upalabh","_","_"
1,"_","_","_","śārīra","JJ","","_","_"
2,"_","_","_","jan","V","jan","_","_"
3,"vyādhir","_","_","vyādhi","NC","","_","_"
4,"mānaso","_","_","mānasa","JJ","","_","_"
5,"_","_","_","na","CNG","","_","_"
6,"_","_","_","atra","CAD","","_","_"
7,"saṃśayaḥ","_","_","saṃśaya","NC","","_","_"
1,"_","_","_","mānasa","JJ","","_","_"
2,"_","_","_","jan","V","jan","_","_"
3,"vyādhiḥ","_","_","vyādhi","NC","","_","_"
4,"śārīra","_","_","śārīra","JJ","","_","_"
5,"iti","_","_","iti","CQT","","_","_"
6,"niścayaḥ","_","_","niścaya","NC","","_","_"
1,"_","_","_","śārīra","JJ","","_","_"
2,"_","_","_","mānasa","JJ","","_","_"
3,"duḥkhe","_","_","duḥkha","NC","","_","_"
4,"yo","_","_","yad","PRL","","_","_"
5,"'tīte","_","_","atī","PPP","","_","_"
6,"anuśocati","_","_","anuśuc","V","anuśuc","_","_"
1,"duḥkhena","_","_","duḥkha","NC","","_","_"
2,"labhate","_","_","labh","V","labh","_","_"
3,"duḥkhaṃ","_","_","duḥkha","NC","","_","_"
4,"_","_","_","dvi","NUM","","_","_"
5,"_","_","_","anartha","NC","","_","_"
6,"prapadyate","_","_","prapad","V","prapad","_","_"
1,"_","_","_","śīta","JJ","","_","_"
2,"_","_","_","uṣṇa","JJ","","_","_"
3,"_","_","_","ca","CCD","","_","_"
4,"_","_","_","eva","CEM","","_","_"
5,"_","_","_","vāyu","NC","","_","_"
6,"_","_","_","ca","CCD","","_","_"
7,"trayaḥ","_","_","tri","NUM","","_","_"
8,"_","_","_","śārīra","JJ","","_","_"
9,"_","_","_","ja","JJ","","_","_"
10,"guṇāḥ","_","_","guṇa","NC","","_","_"
1,"teṣāṃ","_","_","tad","PRD","","_","_"
2,"guṇānāṃ","_","_","guṇa","NC","","_","_"
3,"sāmyaṃ","_","_","sāmya","NC","","_","_"
4,"ca","_","_","ca","CCD","","_","_"
5,"tad","_","_","tad","PRD","","_","_"
6,"āhuḥ","_","_","ah","V","ah","_","_"
7,"_","_","_","svastha","JJ","","_","_"
8,"_","_","_","lakṣaṇa","NC","","_","_"
1,"teṣām","_","_","tad","PRD","","_","_"
2,"_","_","_","anyatama","JJ","","_","_"
3,"_","_","_","utseka","NC","","_","_"
4,"vidhānam","_","_","vidhāna","NC","","_","_"
5,"upadiśyate","_","_","upadiś","V","upadiś","_","_"
1,"uṣṇena","_","_","uṣṇa","JJ","","_","_"
2,"bādhyate","_","_","bādh","V","bādh","_","_"
3,"śītaṃ","_","_","śīta","JJ","","_","_"
4,"_","_","_","śīta","JJ","","_","_"
5,"_","_","_","uṣṇa","JJ","","_","_"
6,"prabādhyate","_","_","prabādh","V","prabādh","_","_"
1,"sattvaṃ","_","_","sattva","NC","","_","_"
2,"_","_","_","rajas","NC","","_","_"
3,"_","_","_","tamas","NC","","_","_"
4,"_","_","_","ca","CCD","","_","_"
5,"_","_","_","eva","CEM","","_","_"
6,"mānasāḥ","_","_","mānasa","JJ","","_","_"
7,"_","_","_","as","V","as","_","_"
8,"_","_","_","tri","NUM","","_","_"
9,"guṇāḥ","_","_","guṇa","NC","","_","_"
1,"harṣeṇa","_","_","harṣa","NC","","_","_"
2,"bādhyate","_","_","bādh","V","bādh","_","_"
3,"śoko","_","_","śoka","NC","","_","_"
4,"harṣaḥ","_","_","harṣa","NC","","_","_"
5,"śokena","_","_","śoka","NC","","_","_"
6,"bādhyate","_","_","bādh","V","bādh","_","_"
1,"kaścit","_","_","kiṃcit","PRI","","_","_"
2,"sukhe","_","_","sukha","NC","","_","_"
3,"vartamāno","_","_","vartamāna","JJ","","_","_"
4,"duḥkhasya","_","_","duḥkha","NC","","_","_"
5,"smartum","_","_","smṛ","CGDI","","_","_"
6,"icchati","_","_","iṣ","V","iṣ","_","_"
1,"kaścid","_","_","kiṃcit","PRI","","_","_"
2,"duḥkhe","_","_","duḥkha","NC","","_","_"
3,"vartamānaḥ","_","_","vṛt","KDP","","_","_"
4,"sukhasya","_","_","sukha","NC","","_","_"
5,"smartum","_","_","smṛ","CGDI","","_","_"
6,"icchati","_","_","iṣ","V","iṣ","_","_"
1,"sa","_","_","tad","PRD","","_","_"
2,"tvaṃ","_","_","tvat","PPR","","_","_"
3,"na","_","_","na","CNG","","_","_"
4,"duḥkhī","_","_","duḥkhin","JJ","","_","_"
5,"duḥkhasya","_","_","duḥkha","NC","","_","_"
6,"na","_","_","na","CNG","","_","_"
7,"sukhī","_","_","sukhin","JJ","","_","_"
8,"ca","_","_","ca","CCD","","_","_"
9,"sukhasya","_","_","sukha","NC","","_","_"
10,"ca","_","_","ca","CCD","","_","_"
1,"na","_","_","na","CNG","","_","_"
2,"duḥkhī","_","_","duḥkhin","JJ","","_","_"
3,"_","_","_","sukha","NC","","_","_"
4,"_","_","_","jan","PPP","","_","_"
5,"na","_","_","na","CNG","","_","_"
6,"sukhī","_","_","sukhin","JJ","","_","_"
7,"_","_","_","duḥkha","NC","","_","_"
8,"_","_","_","ja","JJ","","_","_"
9,"vā","_","_","vā","CCD","","_","_"
1,"smartum","_","_","smṛ","CGDI","","_","_"
2,"arhasi","_","_","arh","V","arh","_","_"
3,"kauravya","_","_","kauravya","NC","","_","_"
4,"diṣṭaṃ","_","_","diṣṭa","NC","","_","_"
5,"tu","_","_","tu","CCD","","_","_"
6,"balavattaram","_","_","balavattara","JJ","","_","_"
1,"athavā","_","_","athavā","CX","","_","_"
2,"te","_","_","tvat","PPR","","_","_"
3,"svabhāvo","_","_","svabhāva","NC","","_","_"
4,"'yaṃ","_","_","ida","PRD","","_","_"
5,"yena","_","_","yad","PRL","","_","_"
6,"pārthiva","_","_","pārthiva","NC","","_","_"
7,"kṛṣyase","_","_","kṛṣ","V","kṛṣ","_","_"
1,"dṛṣṭvā","_","_","dṛś","CGDA","","_","_"
2,"_","_","_","sabhā","NC","","_","_"
3,"_","_","_","ga","PPP","","_","_"
4,"kṛṣṇām","_","_","kṛṣṇā","NC","","_","_"
5,"_","_","_","eka","PPX","","_","_"
6,"_","_","_","vastra","NC","","_","_"
7,"rajasvalām","_","_","rajasvalā","NC","","_","_"
1,"miṣatāṃ","_","_","miṣ","KDP","","_","_"
2,"_","_","_","pāṇḍu","NC","","_","_"
3,"_","_","_","putra","NC","","_","_"
4,"na","_","_","na","CNG","","_","_"
5,"tasya","_","_","tad","PRD","","_","_"
6,"smartum","_","_","smṛ","CGDI","","_","_"
7,"arhasi","_","_","arh","V","arh","_","_"
1,"pravrājanaṃ","_","_","pravrājana","NC","","_","_"
2,"ca","_","_","ca","CCD","","_","_"
3,"nagarād","_","_","nagara","NC","","_","_"
4,"_","_","_","ajina","NC","","_","_"
5,"_","_","_","ca","CCD","","_","_"
6,"nivāsanam","_","_","nivāsana","NC","","_","_"
1,"_","_","_","mahat","JJ","","_","_"
2,"_","_","_","araṇya","NC","","_","_"
3,"_","_","_","nivāsa","NC","","_","_"
4,"_","_","_","ca","CCD","","_","_"
5,"na","_","_","na","CNG","","_","_"
6,"tasya","_","_","tad","PRD","","_","_"
7,"smartum","_","_","smṛ","CGDI","","_","_"
8,"arhasi","_","_","arh","V","arh","_","_"
1,"jaṭāsurāt","_","_","jaṭāsura","NC","","_","_"
2,"parikleśaṃ","_","_","parikleśa","NC","","_","_"
3,"citrasenena","_","_","citrasa","NC","","_","_"
4,"_","_","_","ca","CCD","","_","_"
5,"_","_","_","āhava","NC","","_","_"
1,"_","_","_","saindhava","NC","","_","_"
2,"_","_","_","ca","CCD","","_","_"
3,"parikleśaṃ","_","_","parikleśa","NC","","_","_"
4,"kathaṃ","_","_","katha","CX","","_","_"
5,"vismṛtavān","_","_","vismṛ","KDP","","_","_"
6,"asi","_","_","as","V","as","_","_"
1,"punar","_","_","punar","CAD","","_","_"
2,"_","_","_","ajñāta","JJ","","_","_"
3,"_","_","_","caryā","NC","","_","_"
4,"kīcakena","_","_","kīcaka","NC","","_","_"
5,"padā","_","_","pad","NC","","_","_"
6,"vadham","_","_","vadha","NC","","_","_"
1,"_","_","_","yad","PRL","","_","_"
2,"_","_","_","ca","CCD","","_","_"
3,"te","_","_","tvat","PPR","","_","_"
4,"_","_","_","droṇa","NC","","_","_"
5,"_","_","_","bhīṣma","NC","","_","_"
6,"yuddham","_","_","yuddha","NC","","_","_"
7,"āsīd","_","_","as","V","as","_","_"
8,"ariṃdama","_","_","ariṃdama","JJ","","_","_"
1,"_","_","_","manas","NC","","_","_"
2,"_","_","_","eka","PPX","","_","_"
3,"te","_","_","tvat","PPR","","_","_"
4,"yuddham","_","_","yuddha","NC","","_","_"
5,"idaṃ","_","_","ida","PRD","","_","_"
6,"ghoram","_","_","ghora","JJ","","_","_"
7,"upasthitam","_","_","upasthā","PPP","","_","_"
1,"yatra","_","_","yatra","CX","","_","_"
2,"_","_","_","na","CNG","","_","_"
3,"_","_","_","as","V","as","_","_"
4,"śaraiḥ","_","_","śara","NC","","_","_"
5,"kāryaṃ","_","_","kārya","NC","","_","_"
6,"na","_","_","na","CNG","","_","_"
7,"mitrair","_","_","mitra","NC","","_","_"
8,"na","_","_","na","CNG","","_","_"
9,"ca","_","_","ca","CCD","","_","_"
10,"bandhubhiḥ","_","_","bandhu","NC","","_","_"
1,"_","_","_","ātman","NC","","_","_"
2,"_","_","_","eka","PPX","","_","_"
3,"yoddhavyaṃ","_","_","yudh","KDG","","_","_"
4,"tat","_","_","tad","PRD","","_","_"
5,"te","_","_","tvat","PPR","","_","_"
6,"yuddham","_","_","yuddha","NC","","_","_"
7,"upasthitam","_","_","upasthā","PPP","","_","_"
1,"tasminn","_","_","tad","PRD","","_","_"
2,"anirjite","_","_","anirjita","JJ","","_","_"
3,"yuddhe","_","_","yuddha","NC","","_","_"
4,"prāṇān","_","_","prāṇa","NC","","_","_"
5,"yadi","_","_","yadi","CSB","","_","_"
6,"ha","_","_","ha","CEM","","_","_"
7,"mokṣyase","_","_","muñc","V","muc","_","_"
1,"anyaṃ","_","_","anya","PPX","","_","_"
2,"dehaṃ","_","_","deha","NC","","_","_"
3,"samāsthāya","_","_","samāsthā","CGDA","","_","_"
4,"_","_","_","punar","CAD","","_","_"
5,"_","_","_","tad","PRD","","_","_"
6,"_","_","_","eva","CEM","","_","_"
7,"yotsyase","_","_","yudh","V","yudh","_","_"
1,"tasmād","_","_","tasmāt","CX","","_","_"
2,"_","_","_","adya","CX","","_","_"
3,"_","_","_","eva","CEM","","_","_"
4,"gantavyaṃ","_","_","ga","KDG","","_","_"
5,"yuddhasya","_","_","yuddha","NC","","_","_"
6,"_","_","_","bharata","NC","","_","_"
7,"_","_","_","ṛṣabha","NC","","_","_"
1,"_","_","_","tad","PRD","","_","_"
2,"_","_","_","ji","CGDA","","_","_"
3,"_","_","_","mahat","JJ","","_","_"
4,"_","_","_","rāja","NC","","_","_"
5,"kṛtakṛtyo","_","_","kṛtakṛtya","JJ","","_","_"
6,"bhaviṣyasi","_","_","bhav","V","bhū","_","_"
1,"etāṃ","_","_","tad","PRD","","_","_"
2,"buddhiṃ","_","_","buddhi","NC","","_","_"
3,"viniścitya","_","_","viniści","CGDA","","_","_"
4,"bhūtānām","_","_","bhūta","NC","","_","_"
5,"āgatiṃ","_","_","āgati","NC","","_","_"
6,"gatim","_","_","gati","NC","","_","_"
1,"pitṛpaitāmahe","_","_","pitṛpaitāmaha","JJ","","_","_"
2,"vṛtte","_","_","vṛtta","NC","","_","_"
3,"śādhi","_","_","śās","V","śās","_","_"
4,"rājyaṃ","_","_","rājya","NC","","_","_"
5,"yathocitam","_","_","yathocita","JJ","","_","_"
1,"diṣṭyā","_","_","diṣṭi","NC","","_","_"
2,"duryodhanaḥ","_","_","duryodhana","NC","","_","_"
3,"pāpo","_","_","pāpa","JJ","","_","_"
4,"nihataḥ","_","_","nihan","PPP","","_","_"
5,"_","_","_","sa_saha","CX","","_","_"
6,"_","_","_","anuga","JJ","","_","_"
7,"yudhi","_","_","yudh","NC","","_","_"
1,"draupadyāḥ","_","_","draupadī","NC","","_","_"
2,"_","_","_","keśa","NC","","_","_"
3,"_","_","_","pakṣa","NC","","_","_"
4,"diṣṭyā","_","_","diṣṭi","NC","","_","_"
5,"tvaṃ","_","_","tvat","PPR","","_","_"
6,"padavīṃ","_","_","padavī","NC","","_","_"
7,"gataḥ","_","_","ga","PPP","","_","_"
1,"yajasva","_","_","yaj","V","yaj","_","_"
2,"vājimedhena","_","_","vājimedha","NC","","_","_"
3,"vidhivad","_","_","vidhivat","CX","","_","_"
4,"dakṣiṇāvatā","_","_","dakṣiṇāvat","JJ","","_","_"
1,"vayaṃ","_","_","mat","PPR","","_","_"
2,"te","_","_","tvat","PPR","","_","_"
3,"kiṃkarāḥ","_","_","kiṃkara","NC","","_","_"
4,"pārtha","_","_","pārtha","NC","","_","_"
5,"_","_","_","vāsudeva","NC","","_","_"
6,"_","_","_","ca","CCD","","_","_"
7,"vīryavān","_","_","vīryavat","JJ","","_","_"
