"WordID","word","NormSTEM","suffix","lemma","PoS","Root","NormSuffix","NormWord"
1,"pūrvīr","_","_","puru","JJ","","_","_"
2,"ahaṃ","_","_","mat","PPR","","_","_"
3,"śaradaḥ","_","_","śarad","NC","","_","_"
4,"śaśramāṇā","_","_","śra","KDP","","_","_"
5,"doṣā","_","_","doṣā","CX","","_","_"
6,"vastor","_","_","vastu","NC","","_","_"
7,"uṣaso","_","_","uṣas","NC","","_","_"
8,"jarayantīḥ","_","_","jaray","KDP","","_","_"
1,"mināti","_","_","mī","V","mī","_","_"
2,"śriyaṃ","_","_","śrī","NC","","_","_"
3,"jarimā","_","_","jariman","NC","","_","_"
4,"tanūnām","_","_","tanū","NC","","_","_"
5,"apy","_","_","api","CX","","_","_"
6,"ū","_","_","u","CEM","","_","_"
7,"nu","_","_","nu","CX","","_","_"
8,"patnīr","_","_","patnī","NC","","_","_"
9,"vṛṣaṇo","_","_","vṛṣan","NC","","_","_"
10,"jagamyuḥ","_","_","ga","V","ga","_","_"
1,"ye","_","_","yad","PRL","","_","_"
2,"_","_","_","cit","CEM","","_","_"
3,"_","_","_","hi","CX","","_","_"
4,"pūrva","_","_","pūrva","PPX","","_","_"
5,"ṛtasāpa","_","_","ṛtasāp","JJ","","_","_"
6,"āsan","_","_","as","V","as","_","_"
7,"sākaṃ","_","_","sāka","CX","","_","_"
8,"devebhir","_","_","deva","NC","","_","_"
9,"avadann","_","_","vad","V","vad","_","_"
10,"ṛtāni","_","_","ṛta","NC","","_","_"
1,"te","_","_","tad","PRD","","_","_"
2,"cid","_","_","cit","CEM","","_","_"
3,"_","_","_","ava","CX","","_","_"
4,"_","_","_","as","V","as","_","_"
5,"nahy","_","_","nahi","CX","","_","_"
6,"antam","_","_","anta","NC","","_","_"
7,"āpuḥ","_","_","āpn","V","āp","_","_"
8,"sam","_","_","sa","CADP","","_","_"
9,"ū","_","_","u","CEM","","_","_"
10,"nu","_","_","nu","CX","","_","_"
11,"patnīr","_","_","patnī","NC","","_","_"
12,"vṛṣabhir","_","_","vṛṣan","NC","","_","_"
13,"jagamyuḥ","_","_","ga","V","ga","_","_"
1,"na","_","_","na","CNG","","_","_"
2,"mṛṣā","_","_","mṛṣā","CX","","_","_"
3,"śrāntaṃ","_","_","śrānta","NC","","_","_"
4,"yad","_","_","yad","PRL","","_","_"
5,"avanti","_","_","av","V","av","_","_"
6,"devā","_","_","deva","NC","","_","_"
7,"viśvā","_","_","viśva","JQ","","_","_"
8,"it","_","_","id","CEM","","_","_"
9,"spṛdho","_","_","spṛdh","NC","","_","_"
10,"abhy","_","_","abhi","CADP","","_","_"
11,"aśnavāva","_","_","aś","V","aś","_","_"
1,"_","_","_","jay","V","ji","_","_"
2,"_","_","_","id","CEM","","_","_"
3,"atra","_","_","atra","CAD","","_","_"
4,"_","_","_","śata","NUM","","_","_"
5,"_","_","_","nīthā","NC","","_","_"
6,"ājiṃ","_","_","āji","NC","","_","_"
7,"yat","_","_","yat","CSB","","_","_"
8,"samyañcā","_","_","samyañc","JJ","","_","_"
9,"mithunāv","_","_","mithuna","NC","","_","_"
10,"abhy","_","_","abhi","CADP","","_","_"
11,"ajāva","_","_","aj","V","aj","_","_"
1,"nadasya","_","_","nada","NC","","_","_"
2,"mā","_","_","mat","PPR","","_","_"
3,"rudhataḥ","_","_","rudh","KDP","","_","_"
4,"kāma","_","_","kāma","NC","","_","_"
5,"āgann","_","_","āga","V","āga","_","_"
6,"ita","_","_","itas","CX","","_","_"
7,"ājāto","_","_","ājan","PPP","","_","_"
8,"amutaḥ","_","_","amutas","CX","","_","_"
9,"kutaścit","_","_","kutaścid","CX","","_","_"
1,"lopāmudrā","_","_","lopāmudrā","NC","","_","_"
2,"vṛṣaṇaṃ","_","_","vṛṣan","NC","","_","_"
3,"nī","_","_","niḥ","CADP","","_","_"
4,"riṇāti","_","_","ri","V","ri","_","_"
5,"dhīram","_","_","dhīra","JJ","","_","_"
6,"adhīrā","_","_","adhīra","JJ","","_","_"
7,"dhayati","_","_","dadh","V","dhā","_","_"
8,"śvasantam","_","_","śvas","KDP","","_","_"
1,"imaṃ","_","_","ida","PRD","","_","_"
2,"nu","_","_","nu","CX","","_","_"
3,"somam","_","_","soma","NC","","_","_"
4,"antito","_","_","antitas","CX","","_","_"
5,"hṛtsu","_","_","hṛd","NC","","_","_"
6,"pītam","_","_","pā","PPP","","_","_"
7,"upa","_","_","upa","CADP","","_","_"
8,"bruve","_","_","abravīta","V","brū","_","_"
1,"yat","_","_","yat","CSB","","_","_"
2,"sīm","_","_","sīm","CX","","_","_"
3,"āgaś","_","_","āgas","NC","","_","_"
4,"cakṛmā","_","_","kar","V","kṛ","_","_"
5,"tat","_","_","tad","PRD","","_","_"
6,"su","_","_","su","CAD","","_","_"
7,"mṛﾱatu","_","_","mṛḍ","V","mṛḍ","_","_"
8,"_","_","_","pulu","JJ","","_","_"
9,"_","_","_","kāma","NC","","_","_"
10,"hi","_","_","hi","CX","","_","_"
11,"martyaḥ","_","_","martya","NC","","_","_"
1,"agastyaḥ","_","_","agastya","NC","","_","_"
2,"khanamānaḥ","_","_","khan","KDP","","_","_"
3,"khanitraiḥ","_","_","khanitra","NC","","_","_"
4,"prajām","_","_","prajā","NC","","_","_"
5,"apatyam","_","_","apatya","NC","","_","_"
6,"balam","_","_","bala","NC","","_","_"
7,"icchamānaḥ","_","_","iṣ","KDP","","_","_"
1,"ubhau","_","_","ubh","PPX","","_","_"
2,"varṇāv","_","_","varṇa","NC","","_","_"
3,"ṛṣir","_","_","ṛṣi","NC","","_","_"
4,"ugraḥ","_","_","ugra","JJ","","_","_"
5,"pupoṣa","_","_","puṣ","V","puṣ","_","_"
6,"satyā","_","_","satya","JJ","","_","_"
7,"deveṣv","_","_","deva","NC","","_","_"
8,"āśiṣo","_","_","āśis","NC","","_","_"
9,"jagāma","_","_","ga","V","ga","_","_"
