"WordID","word","NormSTEM","suffix","lemma","PoS","Root","NormSuffix","NormWord"
1,"vaiśampāyana","_","_","vaiśampāyana","NC","","_","_"
2,"uvāca","_","_","vak","V","vac","_","_"
1,"śrutvā","_","_","śru","CGDA","","_","_"
2,"ca","_","_","ca","CCD","","_","_"
3,"viduraṃ","_","_","vidura","NC","","_","_"
4,"prāptaṃ","_","_","prāp","PPP","","_","_"
5,"rājñā","_","_","rājan","NC","","_","_"
6,"ca","_","_","ca","CCD","","_","_"
7,"parisāntvitam","_","_","parisāntvay","PPP","","_","_"
1,"_","_","_","dhṛtarāṣṭra","NC","","_","_"
2,"_","_","_","ātmaja","NC","","_","_"
3,"rājā","_","_","rājan","NC","","_","_"
4,"paryatapyata","_","_","paritap","V","paritap","_","_"
5,"durmatiḥ","_","_","durmati","JJ","","_","_"
1,"sa","_","_","tad","PRD","","_","_"
2,"saubalaṃ","_","_","saubala","NC","","_","_"
3,"samānāyya","_","_","samānāyay","CGDA","","_","_"
4,"_","_","_","karṇa","NC","","_","_"
5,"_","_","_","duḥśāsana","NC","","_","_"
6,"_","_","_","api","CX","","_","_"
1,"abravīd","_","_","abravīta","V","brū","_","_"
2,"vacanaṃ","_","_","vacana","NC","","_","_"
3,"rājā","_","_","rājan","NC","","_","_"
4,"_","_","_","praviś","CGDA","","_","_"
5,"_","_","_","abuddhi","JJ","","_","_"
6,"_","_","_","ja","JJ","","_","_"
7,"tamaḥ","_","_","tamas","NC","","_","_"
1,"eṣa","_","_","tad","PRD","","_","_"
2,"pratyāgato","_","_","pratyāga","PPP","","_","_"
3,"mantrī","_","_","mantrin","NC","","_","_"
4,"dhṛtarāṣṭrasya","_","_","dhṛtarāṣṭra","NC","","_","_"
5,"saṃmataḥ","_","_","samman","PPP","","_","_"
1,"viduraḥ","_","_","vidura","NC","","_","_"
2,"_","_","_","pāṇḍu","NC","","_","_"
3,"_","_","_","putra","NC","","_","_"
4,"suhṛd","_","_","suhṛd","NC","","_","_"
5,"vidvān","_","_","vidvas","JJ","","_","_"
6,"hite","_","_","hita","NC","","_","_"
7,"rataḥ","_","_","ra","PPP","","_","_"
1,"yāvad","_","_","yāvat","CX","","_","_"
2,"asya","_","_","ida","PRD","","_","_"
3,"punar","_","_","punar","CAD","","_","_"
4,"buddhiṃ","_","_","buddhi","NC","","_","_"
5,"viduro","_","_","vidura","NC","","_","_"
6,"_","_","_","na","CNG","","_","_"
7,"_","_","_","apakṛṣ","V","apakṛṣ","_","_"
1,"_","_","_","pāṇḍava","NC","","_","_"
2,"_","_","_","ānayana","NC","","_","_"
3,"tāvan","_","_","tāvat","CX","","_","_"
4,"mantrayadhvaṃ","_","_","mantray","V","mantray","_","_"
5,"hitaṃ","_","_","hita","NC","","_","_"
6,"mama","_","_","mat","PPR","","_","_"
1,"atha","_","_","atha","CAD","","_","_"
2,"paśyāmy","_","_","paś","V","paś","_","_"
3,"ahaṃ","_","_","mat","PPR","","_","_"
4,"pārthān","_","_","pārtha","NC","","_","_"
5,"prāptān","_","_","prāp","PPP","","_","_"
6,"iha","_","_","iha","CAD","","_","_"
7,"kathaṃcana","_","_","kathaṃcana","CX","","_","_"
1,"punaḥ","_","_","punar","CAD","","_","_"
2,"śoṣaṃ","_","_","śoṣa","NC","","_","_"
3,"gamiṣyāmi","_","_","gacch","V","gam","_","_"
4,"nirāsur","_","_","nirāsu","JJ","","_","_"
5,"niravagrahaḥ","_","_","niravagraha","JJ","","_","_"
1,"viṣam","_","_","viṣa","NC","","_","_"
2,"udbandhanaṃ","_","_","udbandhana","NC","","_","_"
3,"_","_","_","vā","CCD","","_","_"
4,"_","_","_","api","CX","","_","_"
5,"śastram","_","_","śastra","NC","","_","_"
6,"agnipraveśanam","_","_","agnipraveśana","NC","","_","_"
1,"kariṣye","_","_","kar","V","kṛ","_","_"
2,"na","_","_","na","CNG","","_","_"
3,"hi","_","_","hi","CX","","_","_"
4,"tān","_","_","tad","PRD","","_","_"
5,"ṛddhān","_","_","ṛdh","PPP","","_","_"
6,"punar","_","_","punar","CAD","","_","_"
7,"draṣṭum","_","_","dṛś","CGDI","","_","_"
8,"_","_","_","iha","CAD","","_","_"
9,"_","_","_","utsah","V","utsah","_","_"
1,"śakunir","_","_","śakuni","NC","","_","_"
2,"uvāca","_","_","vak","V","vac","_","_"
1,"kiṃ","_","_","kiṃ","PRQ","","_","_"
2,"bāliśāṃ","_","_","bāliśa","JJ","","_","_"
3,"matiṃ","_","_","mati","NC","","_","_"
4,"rājann","_","_","rājan","NC","","_","_"
5,"āsthito","_","_","āsthā","PPP","","_","_"
6,"'si","_","_","as","V","as","_","_"
7,"viśāṃ","_","_","viś","NC","","_","_"
8,"pate","_","_","pati","NC","","_","_"
1,"gatās","_","_","ga","PPP","","_","_"
2,"te","_","_","tad","PRD","","_","_"
3,"samayaṃ","_","_","samaya","NC","","_","_"
4,"kṛtvā","_","_","kṛ","CGDA","","_","_"
5,"_","_","_","na","CNG","","_","_"
6,"_","_","_","tad","PRD","","_","_"
7,"evaṃ","_","_","eva","CX","","_","_"
8,"bhaviṣyati","_","_","bhav","V","bhū","_","_"
1,"_","_","_","satya","JJ","","_","_"
2,"_","_","_","vākya","NC","","_","_"
3,"sthitāḥ","_","_","sthā","PPP","","_","_"
4,"sarve","_","_","sarva","JQ","","_","_"
5,"pāṇḍavā","_","_","pāṇḍava","NC","","_","_"
6,"_","_","_","bharata","NC","","_","_"
7,"_","_","_","ṛṣabha","NC","","_","_"
1,"pitus","_","_","pitṛ","NC","","_","_"
2,"te","_","_","tvat","PPR","","_","_"
3,"vacanaṃ","_","_","vacana","NC","","_","_"
4,"tāta","_","_","tāta","NC","","_","_"
5,"na","_","_","na","CNG","","_","_"
6,"grahīṣyanti","_","_","grah","V","grah","_","_"
7,"karhicit","_","_","karhicit","CX","","_","_"
1,"atha","_","_","atha","CAD","","_","_"
2,"vā","_","_","vā","CCD","","_","_"
3,"te","_","_","tad","PRD","","_","_"
4,"grahīṣyanti","_","_","grah","V","grah","_","_"
5,"punar","_","_","punar","CAD","","_","_"
6,"eṣyanti","_","_","e","V","i","_","_"
7,"vā","_","_","vā","CCD","","_","_"
8,"puram","_","_","pura","NC","","_","_"
1,"nirasya","_","_","niras","CGDA","","_","_"
2,"samayaṃ","_","_","samaya","NC","","_","_"
3,"bhūyaḥ","_","_","bhūyas","CX","","_","_"
4,"paṇo","_","_","paṇa","NC","","_","_"
5,"'smākaṃ","_","_","mat","PPR","","_","_"
6,"bhaviṣyati","_","_","bhav","V","bhū","_","_"
1,"sarve","_","_","sarva","JQ","","_","_"
2,"bhavāmo","_","_","bhav","V","bhū","_","_"
3,"madhyasthā","_","_","madhyastha","JJ","","_","_"
4,"rājñaś","_","_","rājan","NC","","_","_"
5,"_","_","_","chanda","NC","","_","_"
6,"_","_","_","anuvartin","JJ","","_","_"
1,"chidraṃ","_","_","chidra","NC","","_","_"
2,"bahu","_","_","bahu","JJ","","_","_"
3,"prapaśyantaḥ","_","_","prapaś","KDP","","_","_"
4,"pāṇḍavānāṃ","_","_","pāṇḍava","NC","","_","_"
5,"_","_","_","su","CAD","","_","_"
6,"_","_","_","saṃvṛ","PPP","","_","_"
1,"duḥśāsana","_","_","duḥśāsana","NC","","_","_"
2,"uvāca","_","_","vak","V","vac","_","_"
1,"evam","_","_","eva","CX","","_","_"
2,"etan","_","_","tad","PRD","","_","_"
3,"_","_","_","mahat","JJ","","_","_"
4,"_","_","_","prājña","JJ","","_","_"
5,"yathā","_","_","yathā","CCM","","_","_"
6,"vadasi","_","_","vad","V","vad","_","_"
7,"mātula","_","_","mātula","NC","","_","_"
1,"nityaṃ","_","_","nitya","CX","","_","_"
2,"hi","_","_","hi","CX","","_","_"
3,"me","_","_","mat","PPR","","_","_"
4,"kathayatas","_","_","kathay","KDP","","_","_"
5,"tava","_","_","tvat","PPR","","_","_"
6,"buddhir","_","_","buddhi","NC","","_","_"
7,"hi","_","_","hi","CX","","_","_"
8,"rocate","_","_","roc","V","ruc","_","_"
1,"karṇa","_","_","karṇa","NC","","_","_"
2,"uvāca","_","_","vak","V","vac","_","_"
1,"kāmam","_","_","kāma","NC","","_","_"
2,"īkṣāmahe","_","_","īkṣ","V","īkṣ","_","_"
3,"sarve","_","_","sarva","JQ","","_","_"
4,"duryodhana","_","_","duryodhana","NC","","_","_"
5,"_","_","_","tvat","PPR","","_","_"
6,"_","_","_","īpsita","NC","","_","_"
1,"aikamatyaṃ","_","_","aikamatya","NC","","_","_"
2,"hi","_","_","hi","CX","","_","_"
3,"no","_","_","mat","PPR","","_","_"
4,"rājan","_","_","rājan","NC","","_","_"
5,"sarveṣām","_","_","sarva","JQ","","_","_"
6,"eva","_","_","eva","CEM","","_","_"
7,"lakṣyate","_","_","lakṣ","V","lakṣ","_","_"
1,"vaiśampāyana","_","_","vaiśampāyana","NC","","_","_"
2,"uvāca","_","_","vak","V","vac","_","_"
1,"evam","_","_","eva","CX","","_","_"
2,"uktas","_","_","vac","PPP","","_","_"
3,"tu","_","_","tu","CCD","","_","_"
4,"karṇena","_","_","karṇa","NC","","_","_"
5,"rājā","_","_","rājan","NC","","_","_"
6,"duryodhanas","_","_","duryodhana","NC","","_","_"
7,"tadā","_","_","tadā","CAD","","_","_"
1,"_","_","_","na","CNG","","_","_"
2,"_","_","_","ati","CADP","","_","_"
3,"_","_","_","hṛṣ","PPP","","_","_"
4,"_","_","_","manas","NC","","_","_"
5,"kṣipram","_","_","kṣipra","CX","","_","_"
6,"abhavat","_","_","bhav","V","bhū","_","_"
7,"sa","_","_","tad","PRD","","_","_"
8,"parāṅmukhaḥ","_","_","parāṅmukha","JJ","","_","_"
1,"upalabhya","_","_","upalabh","CGDA","","_","_"
2,"tataḥ","_","_","tatas","CX","","_","_"
3,"karṇo","_","_","karṇa","NC","","_","_"
4,"vivṛtya","_","_","vivṛ","CGDA","","_","_"
5,"nayane","_","_","nayana","NC","","_","_"
6,"śubhe","_","_","śubha","JJ","","_","_"
1,"roṣād","_","_","roṣa","NC","","_","_"
2,"duḥśāsanaṃ","_","_","duḥśāsana","NC","","_","_"
3,"_","_","_","ca","CCD","","_","_"
4,"_","_","_","eva","CEM","","_","_"
5,"saubaleyaṃ","_","_","saubaleya","NC","","_","_"
6,"ca","_","_","ca","CCD","","_","_"
7,"_","_","_","tad","PRD","","_","_"
8,"_","_","_","ubh","PPX","","_","_"
1,"uvāca","_","_","vak","V","vac","_","_"
2,"_","_","_","parama","JJ","","_","_"
3,"_","_","_","krudh","PPP","","_","_"
4,"_","_","_","udya","CGDA","","_","_"
5,"_","_","_","ātman","NC","","_","_"
6,"ātmanā","_","_","ātman","NC","","_","_"
1,"aho","_","_","aho","CX","","_","_"
2,"mama","_","_","mat","PPR","","_","_"
3,"mataṃ","_","_","man","PPP","","_","_"
4,"yat","_","_","yad","PRL","","_","_"
5,"tan","_","_","tad","PRD","","_","_"
6,"nibodhata","_","_","nibodh","V","nibudh","_","_"
7,"_","_","_","nara","NC","","_","_"
8,"_","_","_","adhipa","NC","","_","_"
1,"priyaṃ","_","_","priya","NC","","_","_"
2,"sarve","_","_","sarva","JQ","","_","_"
3,"cikīrṣāmo","_","_","cikīrṣ","V","cikīrṣ","_","_"
4,"rājñaḥ","_","_","rājan","NC","","_","_"
5,"_","_","_","kiṃkara","NC","","_","_"
6,"_","_","_","pāṇi","NC","","_","_"
1,"na","_","_","na","CNG","","_","_"
2,"_","_","_","ca","CCD","","_","_"
3,"_","_","_","ida","PRD","","_","_"
4,"śaknumaḥ","_","_","śakn","V","śak","_","_"
5,"sarve","_","_","sarva","JQ","","_","_"
6,"priye","_","_","priya","NC","","_","_"
7,"sthātum","_","_","sthā","CGDI","","_","_"
8,"atandritāḥ","_","_","atandrita","JJ","","_","_"
1,"vayaṃ","_","_","mat","PPR","","_","_"
2,"tu","_","_","tu","CCD","","_","_"
3,"śastrāṇy","_","_","śastra","NC","","_","_"
4,"ādāya","_","_","ādā","CGDA","","_","_"
5,"rathān","_","_","ratha","NC","","_","_"
6,"āsthāya","_","_","āsthā","CGDA","","_","_"
7,"daṃśitāḥ","_","_","daṃśay","PPP","","_","_"
1,"gacchāmaḥ","_","_","gacch","V","gam","_","_"
2,"sahitā","_","_","sahita","JJ","","_","_"
3,"hantuṃ","_","_","han","CGDI","","_","_"
4,"pāṇḍavān","_","_","pāṇḍava","NC","","_","_"
5,"_","_","_","vana","NC","","_","_"
6,"_","_","_","gocara","JJ","","_","_"
1,"teṣu","_","_","tad","PRD","","_","_"
2,"sarveṣu","_","_","sarva","JQ","","_","_"
3,"śānteṣu","_","_","śa","PPP","","_","_"
4,"_","_","_","ga","PPP","","_","_"
5,"_","_","_","avidita","JJ","","_","_"
6,"gatim","_","_","gati","NC","","_","_"
1,"nirvivādā","_","_","nirvivāda","JJ","","_","_"
2,"bhaviṣyanti","_","_","bhav","V","bhū","_","_"
3,"dhārtarāṣṭrās","_","_","dhārtarāṣṭra","NC","","_","_"
4,"tathā","_","_","tathā","CX","","_","_"
5,"vayam","_","_","mat","PPR","","_","_"
1,"yāvad","_","_","yāvat","CX","","_","_"
2,"eva","_","_","eva","CEM","","_","_"
3,"paridyūnā","_","_","paridīv","PPP","","_","_"
4,"_","_","_","yāvat","CX","","_","_"
5,"_","_","_","śoka","NC","","_","_"
6,"_","_","_","parāyaṇa","NC","","_","_"
1,"yāvan","_","_","yāvat","CX","","_","_"
2,"_","_","_","mitra","NC","","_","_"
3,"_","_","_","vihā","PPP","","_","_"
4,"ca","_","_","ca","CCD","","_","_"
5,"_","_","_","tāvat","CX","","_","_"
6,"_","_","_","śakya","JJ","","_","_"
7,"mataṃ","_","_","man","PPP","","_","_"
8,"mama","_","_","mat","PPR","","_","_"
1,"tasya","_","_","tad","PRD","","_","_"
2,"tad","_","_","tad","PRD","","_","_"
3,"vacanaṃ","_","_","vacana","NC","","_","_"
4,"śrutvā","_","_","śru","CGDA","","_","_"
5,"pūjayantaḥ","_","_","pūjay","KDP","","_","_"
6,"punaḥ","_","_","punar","CAD","","_","_"
7,"punaḥ","_","_","punar","CAD","","_","_"
1,"bāḍham","_","_","bāḍha","JJ","","_","_"
2,"ity","_","_","iti","CQT","","_","_"
3,"eva","_","_","eva","CEM","","_","_"
4,"te","_","_","tad","PRD","","_","_"
5,"sarve","_","_","sarva","JQ","","_","_"
6,"pratyūcuḥ","_","_","prativak","V","prativac","_","_"
7,"sūtajaṃ","_","_","sūtaja","NC","","_","_"
8,"tadā","_","_","tadā","CAD","","_","_"
1,"evam","_","_","eva","CX","","_","_"
2,"uktvā","_","_","vac","CGDA","","_","_"
3,"tu","_","_","tu","CCD","","_","_"
4,"saṃkruddhā","_","_","saṃkrudh","PPP","","_","_"
5,"rathaiḥ","_","_","ratha","NC","","_","_"
6,"sarve","_","_","sarva","JQ","","_","_"
7,"pṛthak","_","_","pṛthak","CX","","_","_"
8,"pṛthak","_","_","pṛthak","CX","","_","_"
1,"niryayuḥ","_","_","niryā","V","niryā","_","_"
2,"pāṇḍavān","_","_","pāṇḍava","NC","","_","_"
3,"hantuṃ","_","_","han","CGDI","","_","_"
4,"saṃghaśaḥ","_","_","saṃghaśas","CX","","_","_"
5,"_","_","_","kṛ","PPP","","_","_"
6,"_","_","_","niścaya","NC","","_","_"
1,"tān","_","_","tad","PRD","","_","_"
2,"prasthitān","_","_","prasthā","PPP","","_","_"
3,"parijñāya","_","_","parijñā","CGDA","","_","_"
4,"kṛṣṇadvaipāyanas","_","_","kṛṣṇadvaipāyana","NC","","_","_"
5,"tadā","_","_","tadā","CAD","","_","_"
1,"ājagāma","_","_","āgacch","V","āgam","_","_"
2,"_","_","_","viśudh","PPP","","_","_"
3,"_","_","_","ātman","NC","","_","_"
4,"dṛṣṭvā","_","_","dṛś","CGDA","","_","_"
5,"divyena","_","_","divya","JJ","","_","_"
6,"cakṣuṣā","_","_","cakṣus","NC","","_","_"
1,"_","_","_","pratiṣidh","CGDA","","_","_"
2,"_","_","_","atha","CAD","","_","_"
3,"tān","_","_","tad","PRD","","_","_"
4,"sarvān","_","_","sarva","JQ","","_","_"
5,"_","_","_","bhagavat","JJ","","_","_"
6,"_","_","_","loka","NC","","_","_"
7,"_","_","_","pūjay","PPP","","_","_"
1,"āsīnam","_","_","ās","PPP","","_","_"
2,"_","_","_","vak","V","vac","_","_"
3,"_","_","_","abhye","CGDA","","_","_"
4,"satvaraḥ","_","_","satvara","JJ","","_","_"
