"WordID","word","NormSTEM","suffix","lemma","PoS","Root","NormSuffix","NormWord"
NA,"<doc textid = ""vasudharadharani_2"" genre = ""dhāraṇī"" title = ""vasudhārādhāraṇī_2"" author = "" n/ a"" discourse = ""tantra"" tradition = ""buddh"" period = ""unknown"" source = ""pdf"" date_range = """" notes = ""edition from cambridge add. 1680.8 manuscript 12th-13th centuries . there is already one vasudhārādhāraṇī in the buddhcorpus; but both files have different texts. “the classication of dhāraṇī scriptures as sūtra or tantra is much varied and sometimes controversial within tibetan and chinese textual systems; showing that the positioning of these scriptures was problematic in earlier times as well.” brill "" religion = ""buddh"" edition = ""based on the ed. by gergely hidas. powers of protection. the buddhist tradition of spells in the dhāraṇīsaṃgraha collections"" digitization = ""ocr by tilak balavijayan & buddhist translators worbench team"" segmentation_lemmatization = ""ligeia lugli & buddhist translators workbench team"" metadata_enrichment = ""buddhist translators workbench team"" proofreader = """" permission = """" reconstructions = ""none"">","","","","","","",""
NA,"<page number=""26"">","","","","","","",""
NA,"<s number=""1"">","","","","","","",""
1,"oṃ","","","oṃ","ind","","","oṃ"
2,"namo","NAM","o","namas","noun-adj","","aḥ","namaḥ"
3,"amṛtāya","AMṚT","āya","amṛta","noun-adj","","āya","amṛtāya"
4,"amṛtodbhavāya","AMṚTODBHAV","āya","amṛtodbhava","noun-adj","","āya","amṛtodbhavāya"
5,"amṛtaṃ","AMṚT","aṃ","amṛta","noun-adj","","am","amṛtam"
6,"me","","","mat","pron","","","mat"
7,"kuru","KUR","u","kar","verb","kṛ","u","kuru"
8,"amṛtāya","AMṚT","āya","amṛta","noun-adj","","āya","amṛtāya"
9,"namo","NAM","o","namas","noun-adj","","aḥ","namaḥ"
10,"namaḥ","NAM","aḥ","namas","noun-adj","","aḥ","namaḥ"
11,"svāhā","SVĀH","ā","svāhā","noun-adj","","ā","svāhā"
12,"//","","","","punct","","","//"
NA,"</s>","","","","","","",""
NA,"<s number=""2"">","","","","","","",""
1,"oṃ","","","oṃ","ind","","","oṃ"
2,"amṛtakuṇḍali","AMṚTAKUṆḌAL","i","amṛtakuṇḍalī","noun-adj","","i","amṛtakuṇḍali"
3,"kha","","","kha","ind","","","kha"
4,"k","","","kim","pron","","","kim"
5,"hāhi","HĀH","i","hāhi","noun-adj","","i","hāhi"
6,"tiṣṭha","TIṢṬH","a","tiṣṭha","noun-adj","","a","tiṣṭha"
7,"bandha","BANDH","a","bandha","noun-adj","","a","bandha"
8,"hana","HAN","a","hana","noun-adj","","a","hana"
9,"daha","","","","ind","","",""
10,"garja","GARJ","a","garja","noun-adj","","a","garja"
11,"kamya","KAM","ya","","verb","","ya","kamya"
12,"visphoṭāya","VISPHOṬ","āya","visphoṭa","noun-adj","","āya","visphoṭāya"
13,"sarva","SARV","a","sarva","noun-adj","","a","sarva"
14,"vighnavināyakān","VIGHNAVINĀYAK","ān","vighnavināyaka","noun-adj","","ān","vighnavināyakān"
15,"mahāvajra","MAHĀVAJR","a","mahāvajra","noun-adj","","a","mahāvajra"
16,"krodha","KRODH","a","krodha","noun-adj","","a","krodha"
17,"mahā","MAH","ā","mahat","noun-adj","","ā","mahā"
18,"daṃṣṭr","DAṂṢṬR","a","daṃṣṭra","noun-adj","","a","daṃṣṭra"
19,"^otkaṭa","UTKAṬ","a","utkaṭa","noun-adj","","a","utkaṭa"
20,"bhairavāya","BHAIRAV","āya","bhairava","noun-adj","","āya","bhairavāya"
21,"asimus","ASIM","us","asimat","noun-adj","","us","asimus"
22,"alapaśu","ALAP","aśu","alapat","noun-adj","","aśu","alapaśu"
23,"mahāgaṇa","MAHĀGAṆ","a","mahāgaṇa","noun-adj","","a","mahāgaṇa"
24,"pati","PAT","i","pati","noun-adj","","i","pati"
25,"jīvit","JĪVIT","a","jīvita","noun-adj","","a","jīvita"
26,"^āntarāya","ANTARĀY","a","antarāya","noun-adj","","a","antarāya"
27,"svāhā","SVĀH","ā","svāhā","noun-adj","","ā","svāhā"
28,"//","","","","punct","","","//"
NA,"</s>","","","","","","",""
NA,"<s number=""3"">","","","","","","",""
1,"//","","","","punct","","","//"
NA,"</s>","","","","","","",""
NA,"</page>","","","","","","",""
NA,"</doc>","","","","","","",""
