"WordID","word","NormSTEM","suffix","lemma","PoS","Root","NormSuffix","NormWord"
1,"yudhiṣṭhira","_","_","yudhiṣṭhira","NC","","_","_"
2,"uvāca","_","_","vak","V","vac","_","_"
1,"kīdṛśo","_","_","kīdṛśa","JJ","","_","_"
2,"jāpako","_","_","jāpaka","JJ","","_","_"
3,"yāti","_","_","yā","V","yā","_","_"
4,"nirayaṃ","_","_","niraya","NC","","_","_"
5,"varṇayasva","_","_","varṇay","V","varṇay","_","_"
6,"me","_","_","mat","PPR","","_","_"
1,"kautūhalaṃ","_","_","kautūhala","NC","","_","_"
2,"hi","_","_","hi","CX","","_","_"
3,"me","_","_","mat","PPR","","_","_"
4,"jātaṃ","_","_","jan","PPP","","_","_"
5,"tad","_","_","tad","PRD","","_","_"
6,"bhavān","_","_","bhavat","JJ","","_","_"
7,"vaktum","_","_","vac","CGDI","","_","_"
8,"arhati","_","_","arh","V","arh","_","_"
1,"bhīṣma","_","_","bhīṣma","NC","","_","_"
2,"uvāca","_","_","vak","V","vac","_","_"
1,"_","_","_","dharma","NC","","_","_"
2,"_","_","_","aṃśa","NC","","_","_"
3,"prasūto","_","_","prasū","PPP","","_","_"
4,"'si","_","_","as","V","as","_","_"
5,"dharmiṣṭho","_","_","dharmiṣṭha","JJ","","_","_"
6,"'si","_","_","as","V","as","_","_"
7,"svabhāvataḥ","_","_","svabhāva","NC","","_","_"
1,"_","_","_","dharma","NC","","_","_"
2,"_","_","_","mūla","NC","","_","_"
3,"_","_","_","āśraya","NC","","_","_"
4,"vākyaṃ","_","_","vākya","NC","","_","_"
5,"_","_","_","śṛṇ","V","śru","_","_"
6,"_","_","_","avahita","JJ","","_","_"
7,"'nagha","_","_","anagha","JJ","","_","_"
1,"amūni","_","_","adas","PRD","","_","_"
2,"yāni","_","_","yad","PRL","","_","_"
3,"sthānāni","_","_","sthāna","NC","","_","_"
4,"devānāṃ","_","_","deva","NC","","_","_"
5,"_","_","_","parama","JJ","","_","_"
6,"_","_","_","ātman","NC","","_","_"
1,"_","_","_","nānā","CX","","_","_"
2,"_","_","_","saṃsthāna","NC","","_","_"
3,"_","_","_","varṇa","NC","","_","_"
4,"_","_","_","nānā","CX","","_","_"
5,"_","_","_","rūpa","NC","","_","_"
6,"_","_","_","phala","NC","","_","_"
7,"ca","_","_","ca","CCD","","_","_"
1,"divyāni","_","_","divya","JJ","","_","_"
2,"_","_","_","kāma","NC","","_","_"
3,"_","_","_","cārin","JJ","","_","_"
4,"vimānāni","_","_","vimāna","NC","","_","_"
5,"_","_","_","sabhā","NC","","_","_"
6,"_","_","_","tathā","CX","","_","_"
1,"ākrīḍā","_","_","ākrīḍa","NC","","_","_"
2,"vividhā","_","_","vividha","JJ","","_","_"
3,"rājan","_","_","rājan","NC","","_","_"
4,"_","_","_","padminī","NC","","_","_"
5,"_","_","_","ca","CCD","","_","_"
6,"_","_","_","amala","JJ","","_","_"
7,"_","_","_","udaka","NC","","_","_"
1,"caturṇāṃ","_","_","catur","NUM","","_","_"
2,"lokapālānāṃ","_","_","lokapāla","NC","","_","_"
3,"_","_","_","śukra","NC","","_","_"
4,"_","_","_","atha","CAD","","_","_"
5,"bṛhaspateḥ","_","_","bṛhaspati","NC","","_","_"
1,"marutāṃ","_","_","marut","NC","","_","_"
2,"viśvadevānāṃ","_","_","viśvadeva","NC","","_","_"
3,"sādhyānām","_","_","sādhya","NC","","_","_"
4,"aśvinor","_","_","aśvin","NC","","_","_"
5,"api","_","_","api","CX","","_","_"
1,"_","_","_","rudra","NC","","_","_"
2,"_","_","_","āditya","NC","","_","_"
3,"_","_","_","vasu","NC","","_","_"
4,"ca","_","_","ca","CCD","","_","_"
5,"_","_","_","tathā","CX","","_","_"
6,"_","_","_","anya","PPX","","_","_"
7,"divaukasām","_","_","divaukas","NC","","_","_"
1,"ete","_","_","tad","PRD","","_","_"
2,"vai","_","_","vai","CX","","_","_"
3,"_","_","_","niraya","NC","","_","_"
4,"_","_","_","tāta","NC","","_","_"
5,"sthānasya","_","_","sthāna","NC","","_","_"
6,"paramātmanaḥ","_","_","paramātman","NC","","_","_"
1,"abhayaṃ","_","_","abhaya","NC","","_","_"
2,"_","_","_","ca","CCD","","_","_"
3,"_","_","_","animitta","JJ","","_","_"
4,"ca","_","_","ca","CCD","","_","_"
5,"na","_","_","na","CNG","","_","_"
6,"ca","_","_","ca","CCD","","_","_"
7,"_","_","_","kleśa","NC","","_","_"
8,"_","_","_","bhaya","NC","","_","_"
9,"_","_","_","āvṛ","PPP","","_","_"
1,"dvābhyāṃ","_","_","dvi","NUM","","_","_"
2,"muktaṃ","_","_","muc","PPP","","_","_"
3,"tribhir","_","_","tri","NUM","","_","_"
4,"muktam","_","_","muc","PPP","","_","_"
5,"_","_","_","aṣṭan","NUM","","_","_"
6,"_","_","_","tri","NUM","","_","_"
7,"eva","_","_","eva","CEM","","_","_"
8,"ca","_","_","ca","CCD","","_","_"
1,"_","_","_","catur","NUM","","_","_"
2,"_","_","_","lakṣaṇa","NC","","_","_"
3,"_","_","_","varja","JJ","","_","_"
4,"tu","_","_","tu","CCD","","_","_"
1,"a","_","_","alpha_privativum","JJ","","_","_"
2,"a","_","_","alpha_privativum","JJ","","_","_"
2,"anānandam","_","_","nānanda","JJ","","_","_"
3,"aśokaṃ","_","_","aśoka","JJ","","_","_"
4,"_","_","_","viga","PPP","","_","_"
5,"_","_","_","klama","NC","","_","_"
1,"kālaḥ","_","_","kāla","NC","","_","_"
2,"saṃpacyate","_","_","saṃpac","V","saṃpac","_","_"
3,"tatra","_","_","tatra","CAD","","_","_"
4,"na","_","_","na","CNG","","_","_"
5,"_","_","_","kāla","NC","","_","_"
6,"_","_","_","tatra","CAD","","_","_"
7,"vai","_","_","vai","CX","","_","_"
8,"prabhuḥ","_","_","prabhu","NC","","_","_"
1,"sa","_","_","tad","PRD","","_","_"
2,"kālasya","_","_","kāla","NC","","_","_"
3,"prabhū","_","_","prabhu","NC","","_","_"
4,"rājan","_","_","rājan","NC","","_","_"
5,"_","_","_","svarga","NC","","_","_"
6,"_","_","_","api","CX","","_","_"
7,"_","_","_","tathā","CX","","_","_"
8,"_","_","_","īśvara","NC","","_","_"
1,"_","_","_","ātman","NC","","_","_"
2,"_","_","_","kevala","JJ","","_","_"
4,"_","_","_","prāp","PPP","","_","_"
5,"_","_","_","tatra","CAD","","_","_"
6,"gatvā","_","_","ga","CGDA","","_","_"
7,"na","_","_","na","CNG","","_","_"
8,"śocati","_","_","śuc","V","śuc","_","_"
1,"īdṛśaṃ","_","_","īdṛśa","JJ","","_","_"
2,"paramaṃ","_","_","parama","JJ","","_","_"
3,"sthānaṃ","_","_","sthāna","NC","","_","_"
4,"_","_","_","niraya","NC","","_","_"
5,"_","_","_","tad","PRD","","_","_"
6,"ca","_","_","ca","CCD","","_","_"
7,"tādṛśāḥ","_","_","tādṛśa","JJ","","_","_"
1,"ete","_","_","tad","PRD","","_","_"
2,"te","_","_","tvat","PPR","","_","_"
3,"nirayāḥ","_","_","niraya","NC","","_","_"
4,"proktāḥ","_","_","pravac","PPP","","_","_"
5,"sarva","_","_","sarva","JQ","","_","_"
6,"eva","_","_","eva","CEM","","_","_"
7,"yathātatham","_","_","yathātatha","JJ","","_","_"
1,"tasya","_","_","tad","PRD","","_","_"
2,"_","_","_","sthāna","NC","","_","_"
3,"_","_","_","vara","JJ","","_","_"
4,"_","_","_","iha","CAD","","_","_"
5,"sarve","_","_","sarva","JQ","","_","_"
6,"_","_","_","niraya","NC","","_","_"
7,"_","_","_","saṃjñita","JJ","","_","_"
