"WordID","word","NormSTEM","suffix","lemma","PoS","Root","NormSuffix","NormWord"
1,"saṃjaya","_","_","saṃjaya","NC","","_","_"
2,"uvāca","_","_","vak","V","vac","_","_"
1,"_","_","_","tad","PRD","","_","_"
2,"_","_","_","tathā","CX","","_","_"
3,"vartamāne","_","_","vṛt","KDP","","_","_"
4,"_","_","_","nara","NC","","_","_"
5,"_","_","_","aśva","NC","","_","_"
6,"_","_","_","gaja","NC","","_","_"
7,"_","_","_","saṃkṣaya","NC","","_","_"
1,"duḥśāsano","_","_","duḥśāsana","NC","","_","_"
2,"_","_","_","mahat","JJ","","_","_"
3,"_","_","_","rāja","NC","","_","_"
4,"dhṛṣṭadyumnam","_","_","dhṛṣṭadyumna","NC","","_","_"
5,"ayodhayat","_","_","yodhay","V","yodhay","_","_"
1,"sa","_","_","tad","PRD","","_","_"
2,"tu","_","_","tu","CCD","","_","_"
3,"_","_","_","rukmaratha","NC","","_","_"
4,"_","_","_","āsañj","PPP","","_","_"
5,"_","_","_","duḥśāsana","NC","","_","_"
6,"_","_","_","śara","NC","","_","_"
7,"_","_","_","arday","PPP","","_","_"
1,"amarṣāt","_","_","amarṣa","NC","","_","_"
2,"tava","_","_","tvat","PPR","","_","_"
3,"putrasya","_","_","putra","NC","","_","_"
4,"śarair","_","_","śara","NC","","_","_"
5,"vāhān","_","_","vāha","NC","","_","_"
6,"avākirat","_","_","avakṛ","V","avakṛ","_","_"
1,"kṣaṇena","_","_","kṣaṇa","NC","","_","_"
2,"sa","_","_","tad","PRD","","_","_"
3,"_","_","_","ratha","NC","","_","_"
4,"_","_","_","tad","PRD","","_","_"
5,"_","_","_","sa_saha","CX","","_","_"
6,"_","_","_","dhvaja","NC","","_","_"
7,"_","_","_","saha","CX","","_","_"
8,"_","_","_","sārathi","NC","","_","_"
1,"_","_","_","na","CNG","","_","_"
2,"_","_","_","darś","V","dṛś","_","_"
3,"_","_","_","mahat","JJ","","_","_"
4,"_","_","_","rāja","NC","","_","_"
5,"pārṣatasya","_","_","pārṣata","NC","","_","_"
6,"_","_","_","śara","NC","","_","_"
7,"_","_","_","ci","PPP","","_","_"
1,"_","_","_","duḥśāsana","NC","","_","_"
2,"_","_","_","tu","CCD","","_","_"
3,"_","_","_","rājan","NC","","_","_"
4,"_","_","_","indra","NC","","_","_"
5,"pāñcālyasya","_","_","pāñcālya","JJ","","_","_"
6,"mahātmanaḥ","_","_","mahātman","JJ","","_","_"
1,"_","_","_","na","CNG","","_","_"
2,"_","_","_","śakn","V","śak","_","_"
3,"pramukhe","_","_","pramukha","NC","","_","_"
4,"sthātuṃ","_","_","sthā","CGDI","","_","_"
5,"_","_","_","śara","NC","","_","_"
6,"_","_","_","jāla","NC","","_","_"
7,"_","_","_","prapīḍay","PPP","","_","_"
1,"sa","_","_","tad","PRD","","_","_"
2,"tu","_","_","tu","CCD","","_","_"
3,"duḥśāsanaṃ","_","_","duḥśāsana","NC","","_","_"
4,"bāṇair","_","_","bāṇa","NC","","_","_"
5,"vimukhīkṛtya","_","_","vimukhīkṛ","CGDA","","_","_"
6,"pārṣataḥ","_","_","pārṣata","NC","","_","_"
1,"kirañ","_","_","kṛ","KDP","","_","_"
2,"_","_","_","śara","NC","","_","_"
3,"_","_","_","sahasra","NUM","","_","_"
4,"droṇam","_","_","droṇa","NC","","_","_"
5,"_","_","_","eva","CEM","","_","_"
6,"_","_","_","abhiyā","V","abhiyā","_","_"
7,"raṇe","_","_","raṇa","NC","","_","_"
1,"pratyapadyata","_","_","pratipad","V","pratipad","_","_"
2,"hārdikyaḥ","_","_","hārdikya","NC","","_","_"
3,"kṛtavarmā","_","_","kṛtavarman","NC","","_","_"
4,"_","_","_","tad","PRD","","_","_"
5,"_","_","_","antara","NC","","_","_"
1,"sodaryāṇāṃ","_","_","sodarya","JJ","","_","_"
2,"_","_","_","tri","NUM","","_","_"
3,"_","_","_","ca","CCD","","_","_"
4,"_","_","_","eva","CEM","","_","_"
5,"ta","_","_","tad","PRD","","_","_"
6,"enaṃ","_","_","a","PRD","","_","_"
7,"paryavārayan","_","_","parivāray","V","parivāray","_","_"
1,"taṃ","_","_","tad","PRD","","_","_"
2,"yamau","_","_","yama","NC","","_","_"
3,"pṛṣṭhato","_","_","pṛṣṭhatas","CX","","_","_"
4,"'nvaitāṃ","_","_","anvi","V","anvi","_","_"
5,"rakṣantau","_","_","rakṣ","KDP","","_","_"
6,"_","_","_","puruṣa","NC","","_","_"
7,"_","_","_","ṛṣabha","NC","","_","_"
1,"_","_","_","droṇa","NC","","_","_"
2,"_","_","_","abhimukha","JJ","","_","_"
3,"yāntaṃ","_","_","yā","KDP","","_","_"
4,"dīpyamānam","_","_","dīp","KDP","","_","_"
5,"_","_","_","iva","CCM","","_","_"
6,"_","_","_","anala","NC","","_","_"
1,"saṃprahāram","_","_","samprahāra","NC","","_","_"
2,"_","_","_","kar","V","kṛ","_","_"
3,"_","_","_","tad","PRD","","_","_"
4,"sarve","_","_","sarva","JQ","","_","_"
5,"sapta","_","_","saptan","NUM","","_","_"
6,"_","_","_","mahat","JJ","","_","_"
7,"_","_","_","ratha","NC","","_","_"
1,"amarṣitāḥ","_","_","amarṣita","JJ","","_","_"
2,"sattvavantaḥ","_","_","sattvavat","JJ","","_","_"
3,"kṛtvā","_","_","kṛ","CGDA","","_","_"
4,"maraṇam","_","_","maraṇa","NC","","_","_"
5,"agrataḥ","_","_","agratas","CX","","_","_"
1,"_","_","_","śudh","PPP","","_","_"
2,"_","_","_","ātman","NC","","_","_"
3,"_","_","_","śudh","PPP","","_","_"
4,"_","_","_","vṛtta","NC","","_","_"
5,"rājan","_","_","rājan","NC","","_","_"
6,"_","_","_","svarga","NC","","_","_"
7,"_","_","_","puraskṛ","PPP","","_","_"
1,"āryaṃ","_","_","ārya","JJ","","_","_"
2,"yuddham","_","_","yuddha","NC","","_","_"
3,"akurvanta","_","_","kar","V","kṛ","_","_"
4,"_","_","_","paraspara","PRC","","_","_"
5,"_","_","_","jigīṣu","JJ","","_","_"
1,"_","_","_","śukla","JJ","","_","_"
2,"_","_","_","abhijana","NC","","_","_"
3,"_","_","_","karman","NC","","_","_"
4,"matimanto","_","_","matimat","JJ","","_","_"
5,"janādhipāḥ","_","_","janādhipa","NC","","_","_"
1,"_","_","_","dharma","NC","","_","_"
2,"_","_","_","yuddha","NC","","_","_"
3,"ayudhyanta","_","_","yudh","V","yudh","_","_"
4,"prekṣanto","_","_","prekṣ","KDP","","_","_"
5,"gatim","_","_","gati","NC","","_","_"
6,"uttamām","_","_","uttama","JJ","","_","_"
1,"na","_","_","na","CNG","","_","_"
2,"_","_","_","tatra","CAD","","_","_"
3,"_","_","_","as","V","as","_","_"
4,"adharmiṣṭham","_","_","adharmiṣṭha","JJ","","_","_"
5,"aśastraṃ","_","_","aśastra","JJ","","_","_"
6,"yuddham","_","_","yuddha","NC","","_","_"
7,"eva","_","_","eva","CEM","","_","_"
8,"ca","_","_","ca","CCD","","_","_"
1,"_","_","_","na","CNG","","_","_"
2,"_","_","_","atra","CAD","","_","_"
3,"karṇī","_","_","karṇin","NC","","_","_"
4,"na","_","_","na","CNG","","_","_"
5,"nālīko","_","_","nālīka","NC","","_","_"
6,"na","_","_","na","CNG","","_","_"
7,"lipto","_","_","lip","PPP","","_","_"
8,"na","_","_","na","CNG","","_","_"
9,"ca","_","_","ca","CCD","","_","_"
10,"vastakaḥ","_","_","vastaka","NC","","_","_"
1,"na","_","_","na","CNG","","_","_"
2,"sūcī","_","_","sūci","NC","","_","_"
3,"kapiśo","_","_","kapiśa","NC","","_","_"
4,"_","_","_","na","CNG","","_","_"
5,"_","_","_","atra","CAD","","_","_"
6,"na","_","_","na","CNG","","_","_"
7,"gavāsthir","_","_","gavāsthi","NC","","_","_"
8,"gajāsthikaḥ","_","_","gajāsthika","NC","","_","_"
1,"iṣur","_","_","iṣu","NC","","_","_"
2,"_","_","_","as","V","as","_","_"
3,"_","_","_","na","CNG","","_","_"
4,"saṃśliṣṭo","_","_","saṃśliṣ","PPP","","_","_"
5,"na","_","_","na","CNG","","_","_"
6,"pūtir","_","_","pūti","JJ","","_","_"
7,"na","_","_","na","CNG","","_","_"
8,"ca","_","_","ca","CCD","","_","_"
9,"_","_","_","jihma","JJ","","_","_"
10,"_","_","_","ga","JJ","","_","_"
1,"_","_","_","ṛju","JJ","","_","_"
2,"_","_","_","eva","CEM","","_","_"
3,"viśuddhāni","_","_","viśudh","PPP","","_","_"
4,"sarve","_","_","sarva","JQ","","_","_"
5,"_","_","_","śastra","NC","","_","_"
6,"_","_","_","dhāray","V","dhāray","_","_"
1,"_","_","_","su","CAD","","_","_"
2,"_","_","_","yuddha","NC","","_","_"
3,"parāṃl","_","_","para","PPX","","_","_"
4,"lokān","_","_","loka","NC","","_","_"
5,"īpsantaḥ","_","_","īps","KDP","","_","_"
6,"kīrtim","_","_","kīrti","NC","","_","_"
7,"eva","_","_","eva","CEM","","_","_"
8,"ca","_","_","ca","CCD","","_","_"
1,"_","_","_","tadā","CAD","","_","_"
2,"_","_","_","as","V","as","_","_"
3,"tumulaṃ","_","_","tumula","JJ","","_","_"
4,"yuddhaṃ","_","_","yuddha","NC","","_","_"
5,"_","_","_","sarva","JQ","","_","_"
6,"_","_","_","doṣa","NC","","_","_"
7,"_","_","_","vivarjay","PPP","","_","_"
1,"caturṇāṃ","_","_","catur","NUM","","_","_"
2,"tava","_","_","tvat","PPR","","_","_"
3,"yodhānāṃ","_","_","yodha","NC","","_","_"
4,"_","_","_","tad","PRD","","_","_"
5,"_","_","_","tri","NUM","","_","_"
6,"pāṇḍavaiḥ","_","_","pāṇḍava","NC","","_","_"
7,"saha","_","_","saha","CX","","_","_"
1,"_","_","_","dhṛṣṭadyumna","NC","","_","_"
2,"_","_","_","tu","CCD","","_","_"
3,"tān","_","_","tad","PRD","","_","_"
4,"hitvā","_","_","hā","CGDA","","_","_"
5,"tava","_","_","tvat","PPR","","_","_"
6,"rājan","_","_","rājan","NC","","_","_"
7,"_","_","_","ratha","NC","","_","_"
8,"_","_","_","ṛṣabha","NC","","_","_"
1,"yamābhyāṃ","_","_","yama","NC","","_","_"
2,"vāritān","_","_","vāray","PPP","","_","_"
3,"dṛṣṭvā","_","_","dṛś","CGDA","","_","_"
4,"_","_","_","śīghra","JJ","","_","_"
5,"_","_","_","astra","NC","","_","_"
6,"droṇam","_","_","droṇa","NC","","_","_"
7,"abhyayāt","_","_","abhiyā","V","abhiyā","_","_"
1,"_","_","_","nivāray","PPP","","_","_"
2,"_","_","_","tu","CCD","","_","_"
3,"te","_","_","tad","PRD","","_","_"
4,"_","_","_","vīra","NC","","_","_"
5,"_","_","_","tad","PRD","","_","_"
6,"_","_","_","puruṣa","NC","","_","_"
7,"_","_","_","siṃha","NC","","_","_"
1,"samasajjanta","_","_","saṃsañj","V","saṃsañj","_","_"
2,"catvāro","_","_","catur","NUM","","_","_"
3,"vātāḥ","_","_","vāta","NC","","_","_"
4,"parvatayor","_","_","parvata","NC","","_","_"
5,"iva","_","_","iva","CCM","","_","_"
1,"dvābhyāṃ","_","_","dvi","NUM","","_","_"
2,"dvābhyāṃ","_","_","dvi","NUM","","_","_"
3,"yamau","_","_","yama","NC","","_","_"
4,"sārdhaṃ","_","_","sārdha","CX","","_","_"
5,"rathābhyāṃ","_","_","ratha","NC","","_","_"
6,"_","_","_","ratha","NC","","_","_"
7,"_","_","_","puṃgava","NC","","_","_"
1,"samāsaktau","_","_","samāsañj","PPP","","_","_"
2,"tato","_","_","tatas","CX","","_","_"
3,"droṇaṃ","_","_","droṇa","NC","","_","_"
4,"dhṛṣṭadyumno","_","_","dhṛṣṭadyumna","NC","","_","_"
5,"'bhyavartata","_","_","abhivart","V","abhivṛt","_","_"
1,"dṛṣṭvā","_","_","dṛś","CGDA","","_","_"
2,"droṇāya","_","_","droṇa","NC","","_","_"
3,"pāñcālyaṃ","_","_","pāñcālya","JJ","","_","_"
4,"vrajantaṃ","_","_","vraj","KDP","","_","_"
5,"_","_","_","yuddha","NC","","_","_"
6,"_","_","_","durmada","JJ","","_","_"
1,"yamābhyāṃ","_","_","yama","NC","","_","_"
2,"_","_","_","tad","PRD","","_","_"
3,"_","_","_","ca","CCD","","_","_"
4,"_","_","_","saṃsañj","PPP","","_","_"
5,"_","_","_","tad","PRD","","_","_"
6,"_","_","_","antara","NC","","_","_"
7,"upādravat","_","_","upadru","V","upadru","_","_"
1,"duryodhano","_","_","duryodhana","NC","","_","_"
2,"_","_","_","mahat","JJ","","_","_"
3,"_","_","_","rāja","NC","","_","_"
4,"kirañ","_","_","kṛ","KDP","","_","_"
5,"_","_","_","śoṇita","NC","","_","_"
6,"_","_","_","bhojana","NC","","_","_"
1,"taṃ","_","_","tad","PRD","","_","_"
2,"sātyakiḥ","_","_","sātyaki","NC","","_","_"
3,"śīghrataraṃ","_","_","śīghratara","JJ","","_","_"
4,"punar","_","_","punar","CAD","","_","_"
5,"_","_","_","eva","CEM","","_","_"
6,"_","_","_","abhivart","V","abhivṛt","_","_"
1,"tau","_","_","tad","PRD","","_","_"
2,"parasparam","_","_","paraspara","PRC","","_","_"
3,"āsādya","_","_","āsāday","CGDA","","_","_"
4,"samīpe","_","_","samīpa","NC","","_","_"
5,"_","_","_","kuru","NC","","_","_"
6,"_","_","_","mādhava","NC","","_","_"
1,"hasamānau","_","_","has","KDP","","_","_"
2,"_","_","_","nṛ","NC","","_","_"
3,"_","_","_","śārdūla","NC","","_","_"
4,"_","_","_","abhīta","JJ","","_","_"
5,"samagacchatām","_","_","saṃga","V","saṃga","_","_"
1,"bālye","_","_","bālya","NC","","_","_"
2,"vṛttāni","_","_","vṛtta","NC","","_","_"
3,"sarvāṇi","_","_","sarva","JQ","","_","_"
4,"prīyamāṇau","_","_","prī","KDP","","_","_"
5,"vicintya","_","_","vicintay","CGDA","","_","_"
6,"tau","_","_","tad","PRD","","_","_"
1,"anyonyaṃ","_","_","anyonya","PRC","","_","_"
2,"prekṣamāṇau","_","_","prekṣ","KDP","","_","_"
3,"ca","_","_","ca","CCD","","_","_"
4,"hasamānau","_","_","has","KDP","","_","_"
5,"punaḥ","_","_","punar","CAD","","_","_"
6,"punaḥ","_","_","punar","CAD","","_","_"
1,"atha","_","_","atha","CAD","","_","_"
2,"duryodhano","_","_","duryodhana","NC","","_","_"
3,"rājā","_","_","rājan","NC","","_","_"
4,"sātyakiṃ","_","_","sātyaki","NC","","_","_"
5,"pratyabhāṣata","_","_","pratibhāṣ","V","pratibhāṣ","_","_"
1,"priyaṃ","_","_","priya","JJ","","_","_"
2,"sakhāyaṃ","_","_","sakhi","NC","","_","_"
3,"satataṃ","_","_","satata","CX","","_","_"
4,"garhayan","_","_","garhay","KDP","","_","_"
5,"vṛttam","_","_","vṛtta","NC","","_","_"
6,"ātmanaḥ","_","_","ātman","NC","","_","_"
1,"dhik","_","_","dhik","CX","","_","_"
2,"krodhaṃ","_","_","krodha","NC","","_","_"
3,"dhik","_","_","dhik","CX","","_","_"
4,"sakhe","_","_","sakhi","NC","","_","_"
5,"lobhaṃ","_","_","lobha","NC","","_","_"
6,"dhiṅ","_","_","dhik","CX","","_","_"
7,"mohaṃ","_","_","moha","NC","","_","_"
8,"dhig","_","_","dhik","CX","","_","_"
9,"amarṣitam","_","_","amarṣita","JJ","","_","_"
1,"dhig","_","_","dhik","CX","","_","_"
2,"astu","_","_","as","V","as","_","_"
3,"kṣātram","_","_","kṣātra","JJ","","_","_"
4,"ācāraṃ","_","_","ācāra","NC","","_","_"
5,"dhig","_","_","dhik","CX","","_","_"
6,"astu","_","_","as","V","as","_","_"
7,"balam","_","_","bala","NC","","_","_"
8,"aurasam","_","_","aurasa","JJ","","_","_"
1,"yat","_","_","yat","CSB","","_","_"
2,"tvaṃ","_","_","tvat","PPR","","_","_"
3,"mām","_","_","mat","PPR","","_","_"
4,"abhisaṃdhatse","_","_","abhisaṃdhā","V","abhisaṃdhā","_","_"
5,"tvāṃ","_","_","tvat","PPR","","_","_"
6,"_","_","_","ca","CCD","","_","_"
7,"_","_","_","mat","PPR","","_","_"
8,"_","_","_","śini","NC","","_","_"
9,"_","_","_","puṃgava","NC","","_","_"
1,"tvaṃ","_","_","tvat","PPR","","_","_"
2,"hi","_","_","hi","CX","","_","_"
3,"prāṇaiḥ","_","_","prāṇa","NC","","_","_"
4,"priyataro","_","_","priyatara","JJ","","_","_"
5,"_","_","_","mat","PPR","","_","_"
6,"_","_","_","mat","PPR","","_","_"
7,"ca","_","_","ca","CCD","","_","_"
8,"sadā","_","_","sadā","CAD","","_","_"
9,"tava","_","_","tvat","PPR","","_","_"
1,"smarāmi","_","_","smar","V","smṛ","_","_"
2,"tāni","_","_","tad","PRD","","_","_"
3,"sarvāṇi","_","_","sarva","JQ","","_","_"
4,"bālye","_","_","bālya","NC","","_","_"
5,"vṛttāni","_","_","vṛtta","NC","","_","_"
6,"yāni","_","_","yad","PRL","","_","_"
7,"nau","_","_","mat","PPR","","_","_"
1,"tāni","_","_","tad","PRD","","_","_"
2,"sarvāṇi","_","_","sarva","JQ","","_","_"
3,"jīrṇāni","_","_","jṛ","PPP","","_","_"
4,"sāṃprataṃ","_","_","sāṃprata","CX","","_","_"
5,"nau","_","_","mat","PPR","","_","_"
6,"_","_","_","raṇa","NC","","_","_"
7,"_","_","_","ajira","NC","","_","_"
1,"kim","_","_","kiṃ","PRQ","","_","_"
2,"anyat","_","_","anya","PPX","","_","_"
3,"_","_","_","krodha","NC","","_","_"
4,"_","_","_","lobha","NC","","_","_"
5,"yudhyāmi","_","_","yudh","V","yudh","_","_"
6,"_","_","_","tvat","PPR","","_","_"
7,"_","_","_","adya","CX","","_","_"
8,"sātvata","_","_","sātvata","NC","","_","_"
1,"taṃ","_","_","tad","PRD","","_","_"
2,"tathāvādinaṃ","_","_","tathāvādin","JJ","","_","_"
3,"rājan","_","_","rājan","NC","","_","_"
4,"sātyakiḥ","_","_","sātyaki","NC","","_","_"
5,"pratyabhāṣata","_","_","pratibhāṣ","V","pratibhāṣ","_","_"
1,"prahasan","_","_","prahas","KDP","","_","_"
2,"_","_","_","viśikha","NC","","_","_"
3,"_","_","_","tīkṣṇa","JJ","","_","_"
4,"udyamya","_","_","udya","CGDA","","_","_"
5,"_","_","_","parama","JJ","","_","_"
6,"_","_","_","astra","NC","","_","_"
7,"_","_","_","vid","JJ","","_","_"
1,"_","_","_","na","CNG","","_","_"
2,"_","_","_","ida","PRD","","_","_"
3,"sabhā","_","_","sabhā","NC","","_","_"
4,"_","_","_","rājan","NC","","_","_"
5,"_","_","_","putra","NC","","_","_"
6,"na","_","_","na","CNG","","_","_"
7,"_","_","_","ca","CCD","","_","_"
8,"_","_","_","ācārya","NC","","_","_"
9,"_","_","_","niveśana","NC","","_","_"
1,"yatra","_","_","yatra","CX","","_","_"
2,"krīḍitam","_","_","krīḍ","PPP","","_","_"
3,"_","_","_","mat","PPR","","_","_"
4,"_","_","_","tadā","CAD","","_","_"
5,"rājan","_","_","rājan","NC","","_","_"
6,"samāgataiḥ","_","_","samāga","PPP","","_","_"
1,"duryodhana","_","_","duryodhana","NC","","_","_"
2,"uvāca","_","_","vak","V","vac","_","_"
1,"kva","_","_","kva","CX","","_","_"
2,"sā","_","_","tad","PRD","","_","_"
3,"krīḍā","_","_","krīḍā","NC","","_","_"
4,"_","_","_","ga","PPP","","_","_"
5,"_","_","_","mat","PPR","","_","_"
6,"bālye","_","_","bālya","NC","","_","_"
7,"vai","_","_","vai","CX","","_","_"
8,"_","_","_","śini","NC","","_","_"
9,"_","_","_","puṃgava","NC","","_","_"
1,"kva","_","_","kva","CX","","_","_"
2,"ca","_","_","ca","CCD","","_","_"
3,"yuddham","_","_","yuddha","NC","","_","_"
4,"idaṃ","_","_","ida","PRD","","_","_"
5,"bhūyaḥ","_","_","bhūyas","CX","","_","_"
6,"kālo","_","_","kāla","NC","","_","_"
7,"hi","_","_","hi","CX","","_","_"
8,"duratikramaḥ","_","_","duratikrama","JJ","","_","_"
1,"kiṃ","_","_","kiṃ","PRQ","","_","_"
2,"nu","_","_","nu","CX","","_","_"
3,"no","_","_","mat","PPR","","_","_"
4,"vidyate","_","_","vid","V","vid","_","_"
5,"kṛtyaṃ","_","_","kṛtya","NC","","_","_"
6,"dhanena","_","_","dhana","NC","","_","_"
7,"_","_","_","dhana","NC","","_","_"
8,"_","_","_","lipsā","NC","","_","_"
1,"yatra","_","_","yatra","CX","","_","_"
2,"yudhyāmahe","_","_","yudh","V","yudh","_","_"
3,"sarve","_","_","sarva","JQ","","_","_"
4,"_","_","_","dhana","NC","","_","_"
5,"_","_","_","lobha","NC","","_","_"
6,"samāgatāḥ","_","_","samāga","PPP","","_","_"
1,"saṃjaya","_","_","saṃjaya","NC","","_","_"
2,"uvāca","_","_","vak","V","vac","_","_"
1,"taṃ","_","_","tad","PRD","","_","_"
2,"tathāvādinaṃ","_","_","tathāvādin","JJ","","_","_"
3,"tatra","_","_","tatra","CAD","","_","_"
4,"rājānaṃ","_","_","rājan","NC","","_","_"
5,"mādhavo","_","_","mādhava","NC","","_","_"
6,"'bravīt","_","_","abravīta","V","brū","_","_"
1,"evaṃvṛttaṃ","_","_","evaṃvṛtta","JJ","","_","_"
2,"sadā","_","_","sadā","CAD","","_","_"
3,"kṣatraṃ","_","_","kṣatra","NC","","_","_"
4,"_","_","_","yat","CSB","","_","_"
5,"_","_","_","han","V","han","_","_"
6,"_","_","_","iha","CAD","","_","_"
7,"gurūn","_","_","guru","NC","","_","_"
8,"api","_","_","api","CX","","_","_"
1,"yadi","_","_","yadi","CSB","","_","_"
2,"te","_","_","tvat","PPR","","_","_"
3,"'haṃ","_","_","mat","PPR","","_","_"
4,"priyo","_","_","priya","JJ","","_","_"
5,"rājañ","_","_","rājan","NC","","_","_"
6,"jahi","_","_","jah","V","hā","_","_"
7,"māṃ","_","_","mat","PPR","","_","_"
8,"māciraṃ","_","_","mācira","CX","","_","_"
9,"kṛthāḥ","_","_","kar","V","kṛ","_","_"
1,"_","_","_","tvat","PPR","","_","_"
2,"_","_","_","kṛte","CX","","_","_"
3,"_","_","_","su","CAD","","_","_"
4,"_","_","_","kṛ","PPP","","_","_"
5,"lokān","_","_","loka","NC","","_","_"
6,"gaccheyaṃ","_","_","gacch","V","gam","_","_"
7,"_","_","_","bharata","NC","","_","_"
8,"_","_","_","ṛṣabha","NC","","_","_"
1,"yā","_","_","yad","PRL","","_","_"
2,"te","_","_","tvat","PPR","","_","_"
3,"śaktir","_","_","śakti","NC","","_","_"
4,"balaṃ","_","_","bala","NC","","_","_"
5,"_","_","_","ca","CCD","","_","_"
6,"_","_","_","eva","CEM","","_","_"
7,"tat","_","_","tad","PRD","","_","_"
8,"kṣipraṃ","_","_","kṣipra","CX","","_","_"
9,"mayi","_","_","mat","PPR","","_","_"
10,"darśaya","_","_","darśaya","V","darśay","_","_"
1,"_","_","_","na","CNG","","_","_"
2,"_","_","_","iṣ","V","iṣ","_","_"
3,"_","_","_","tad","PRD","","_","_"
4,"ahaṃ","_","_","mat","PPR","","_","_"
5,"draṣṭuṃ","_","_","dṛś","CGDI","","_","_"
6,"mitrāṇāṃ","_","_","mitra","NC","","_","_"
7,"vyasanaṃ","_","_","vyasana","NC","","_","_"
8,"mahat","_","_","mahat","JJ","","_","_"
1,"_","_","_","iti","CQT","","_","_"
2,"_","_","_","eva","CX","","_","_"
3,"vyaktam","_","_","vyakta","JJ","","_","_"
4,"ābhāṣya","_","_","ābhāṣ","CGDA","","_","_"
5,"pratibhāṣya","_","_","pratibhāṣ","CGDA","","_","_"
6,"ca","_","_","ca","CCD","","_","_"
7,"sātyakiḥ","_","_","sātyaki","NC","","_","_"
1,"abhyayāt","_","_","abhiyā","V","abhiyā","_","_"
2,"tūrṇam","_","_","tūrṇa","CX","","_","_"
3,"avyagro","_","_","avyagra","JJ","","_","_"
4,"nirapekṣo","_","_","nirapekṣa","JJ","","_","_"
5,"viśāṃ","_","_","viś","NC","","_","_"
6,"pate","_","_","pati","NC","","_","_"
1,"tam","_","_","tad","PRD","","_","_"
2,"āyāntam","_","_","āyā","KDP","","_","_"
3,"abhiprekṣya","_","_","abhiprekṣ","CGDA","","_","_"
4,"pratyagṛhṇāt","_","_","pratigrah","V","pratigrah","_","_"
5,"_","_","_","tvat","PPR","","_","_"
6,"_","_","_","ātmaja","NC","","_","_"
1,"_","_","_","śara","NC","","_","_"
2,"_","_","_","ca","CCD","","_","_"
3,"_","_","_","avakṛ","V","avakṛ","_","_"
4,"rājañ","_","_","rājan","NC","","_","_"
5,"śaineyaṃ","_","_","śaineya","NC","","_","_"
6,"_","_","_","tanaya","NC","","_","_"
7,"_","_","_","tvat","PPR","","_","_"
1,"tataḥ","_","_","tatas","CX","","_","_"
2,"pravavṛte","_","_","pravart","V","pravṛt","_","_"
3,"yuddhaṃ","_","_","yuddha","NC","","_","_"
4,"_","_","_","kuru","NC","","_","_"
5,"_","_","_","mādhava","NC","","_","_"
6,"_","_","_","siṃha","NC","","_","_"
1,"anyonyaṃ","_","_","anyonya","PRC","","_","_"
2,"kruddhayor","_","_","krudh","PPP","","_","_"
3,"ghoraṃ","_","_","ghora","JJ","","_","_"
4,"yathā","_","_","yathā","CCM","","_","_"
5,"_","_","_","dvirada","NC","","_","_"
6,"_","_","_","siṃha","NC","","_","_"
1,"tataḥ","_","_","tatas","CX","","_","_"
2,"_","_","_","pṛ","PPP","","_","_"
3,"_","_","_","āya","PPP","","_","_"
4,"_","_","_","utsṛj","PPP","","_","_"
5,"sātvataṃ","_","_","sātvata","NC","","_","_"
6,"_","_","_","yuddha","NC","","_","_"
7,"_","_","_","durmada","JJ","","_","_"
1,"duryodhanaḥ","_","_","duryodhana","NC","","_","_"
2,"pratyavidhyad","_","_","prativyadh","V","prativyadh","_","_"
3,"daśabhir","_","_","daśan","NUM","","_","_"
4,"niśitaiḥ","_","_","niśā","PPP","","_","_"
5,"śaraiḥ","_","_","śara","NC","","_","_"
1,"taṃ","_","_","tad","PRD","","_","_"
2,"sātyakiḥ","_","_","sātyaki","NC","","_","_"
3,"pratyavidhyat","_","_","prativyadh","V","prativyadh","_","_"
4,"_","_","_","tathā","CX","","_","_"
5,"_","_","_","eva","CEM","","_","_"
6,"daśabhiḥ","_","_","daśan","NUM","","_","_"
7,"śaraiḥ","_","_","śara","NC","","_","_"
1,"pañcāśatā","_","_","pañcāśat","NC","","_","_"
2,"_","_","_","punar","CAD","","_","_"
3,"_","_","_","ca","CCD","","_","_"
4,"_","_","_","āji","NC","","_","_"
5,"triṃśatā","_","_","triṃśat","NC","","_","_"
6,"_","_","_","daśan","NUM","","_","_"
7,"_","_","_","ca","CCD","","_","_"
8,"ha","_","_","ha","CEM","","_","_"
1,"tasya","_","_","tad","PRD","","_","_"
2,"_","_","_","saṃdhā","KDP","","_","_"
3,"_","_","_","ca","CCD","","_","_"
4,"_","_","_","iṣu","NC","","_","_"
5,"_","_","_","saṃhitā","NC","","_","_"
6,"_","_","_","iṣu","NC","","_","_"
7,"ca","_","_","ca","CCD","","_","_"
8,"kārmukam","_","_","kārmuka","NC","","_","_"
1,"achinat","_","_","chid","V","chid","_","_"
2,"_","_","_","sātyaki","NC","","_","_"
3,"_","_","_","tūrṇa","CX","","_","_"
4,"_","_","_","śara","NC","","_","_"
5,"_","_","_","ca","CCD","","_","_"
6,"_","_","_","eva","CEM","","_","_"
7,"_","_","_","abhivṛṣ","V","abhivṛṣ","_","_"
1,"sa","_","_","tad","PRD","","_","_"
2,"_","_","_","gāḍha","JJ","","_","_"
3,"_","_","_","vyadh","PPP","","_","_"
4,"vyathitaḥ","_","_","vyath","PPP","","_","_"
5,"pratyapāyād","_","_","pratyapayā","V","pratyapayā","_","_"
6,"_","_","_","ratha","NC","","_","_"
7,"_","_","_","antara","JJ","","_","_"
1,"duryodhano","_","_","duryodhana","NC","","_","_"
2,"_","_","_","mahat","JJ","","_","_"
3,"_","_","_","rāja","NC","","_","_"
4,"_","_","_","dāśārha","NC","","_","_"
5,"_","_","_","śara","NC","","_","_"
6,"_","_","_","pīḍay","PPP","","_","_"
1,"samāśvasya","_","_","samāśvas","CGDA","","_","_"
2,"tu","_","_","tu","CCD","","_","_"
3,"_","_","_","putra","NC","","_","_"
4,"_","_","_","tvat","PPR","","_","_"
5,"sātyakiṃ","_","_","sātyaki","NC","","_","_"
6,"punar","_","_","punar","CAD","","_","_"
7,"abhyayāt","_","_","abhiyā","V","abhiyā","_","_"
1,"visṛjann","_","_","visṛj","KDP","","_","_"
2,"_","_","_","iṣu","NC","","_","_"
3,"_","_","_","jāla","NC","","_","_"
4,"_","_","_","yuyudhāna","NC","","_","_"
5,"_","_","_","ratha","NC","","_","_"
6,"prati","_","_","prati","CADP","","_","_"
1,"_","_","_","tathā","CX","","_","_"
2,"_","_","_","eva","CEM","","_","_"
3,"sātyakir","_","_","sātyaki","NC","","_","_"
4,"bāṇān","_","_","bāṇa","NC","","_","_"
5,"_","_","_","duryodhana","NC","","_","_"
6,"_","_","_","ratha","NC","","_","_"
7,"prati","_","_","prati","CADP","","_","_"
1,"pratataṃ","_","_","pratata","CX","","_","_"
2,"vyasṛjad","_","_","visṛj","V","visṛj","_","_"
3,"_","_","_","rājan","NC","","_","_"
4,"_","_","_","tad","PRD","","_","_"
5,"saṃkulam","_","_","saṃkula","NC","","_","_"
6,"avartata","_","_","vart","V","vṛt","_","_"
1,"_","_","_","tatra","CAD","","_","_"
2,"_","_","_","iṣu","NC","","_","_"
3,"kṣipyamāṇaiḥ","_","_","kṣip","KDP","","_","_"
4,"_","_","_","pat","KDP","","_","_"
5,"_","_","_","ca","CCD","","_","_"
6,"samantataḥ","_","_","samantataḥ","CX","","_","_"
1,"agner","_","_","agni","NC","","_","_"
2,"iva","_","_","iva","CCM","","_","_"
3,"_","_","_","mahat","JJ","","_","_"
4,"_","_","_","kakṣa","NC","","_","_"
5,"śabdaḥ","_","_","śabda","NC","","_","_"
6,"_","_","_","sambhav","V","sambhū","_","_"
7,"_","_","_","mahat","JJ","","_","_"
1,"_","_","_","tatra","CAD","","_","_"
2,"_","_","_","abhyadhika","JJ","","_","_"
3,"ālakṣya","_","_","ālakṣay","CGDA","","_","_"
4,"mādhavaṃ","_","_","mādhava","NC","","_","_"
5,"_","_","_","ratha","NC","","_","_"
6,"_","_","_","sattama","JJ","","_","_"
1,"kṣipram","_","_","kṣipra","CX","","_","_"
2,"abhyapatat","_","_","abhipat","V","abhipat","_","_"
3,"karṇaḥ","_","_","karṇa","NC","","_","_"
4,"_","_","_","parīps","KDP","","_","_"
5,"_","_","_","tanaya","NC","","_","_"
6,"tava","_","_","tvat","PPR","","_","_"
1,"na","_","_","na","CNG","","_","_"
2,"tu","_","_","tu","CCD","","_","_"
3,"taṃ","_","_","tad","PRD","","_","_"
4,"marṣayāmāsa","_","_","marṣay","V","marṣay","_","_"
5,"bhīmaseno","_","_","bhīmasa","NC","","_","_"
6,"_","_","_","mahat","JJ","","_","_"
7,"_","_","_","bala","NC","","_","_"
1,"abhyayāt","_","_","abhiyā","V","abhiyā","_","_"
2,"tvaritaḥ","_","_","tvar","PPP","","_","_"
3,"karṇaṃ","_","_","karṇa","NC","","_","_"
4,"visṛjan","_","_","visṛj","KDP","","_","_"
5,"sāyakān","_","_","sāyaka","NC","","_","_"
6,"bahūn","_","_","bahu","JJ","","_","_"
1,"tasya","_","_","tad","PRD","","_","_"
2,"karṇaḥ","_","_","karṇa","NC","","_","_"
3,"śitān","_","_","śā","PPP","","_","_"
4,"bāṇān","_","_","bāṇa","NC","","_","_"
5,"pratihanya","_","_","pratihan","CGDA","","_","_"
6,"hasann","_","_","has","KDP","","_","_"
7,"iva","_","_","iva","CCM","","_","_"
1,"dhanuḥ","_","_","dhanus","NC","","_","_"
2,"_","_","_","śara","NC","","_","_"
3,"_","_","_","ca","CCD","","_","_"
4,"cicheda","_","_","chid","V","chid","_","_"
5,"sūtaṃ","_","_","sūta","NC","","_","_"
6,"_","_","_","ca","CCD","","_","_"
7,"_","_","_","abhihan","V","abhihan","_","_"
8,"_","_","_","śara","NC","","_","_"
1,"_","_","_","bhīmasa","NC","","_","_"
2,"_","_","_","tu","CCD","","_","_"
3,"saṃkruddho","_","_","saṃkrudh","PPP","","_","_"
4,"gadām","_","_","gadā","NC","","_","_"
5,"ādāya","_","_","ādā","CGDA","","_","_"
6,"pāṇḍavaḥ","_","_","pāṇḍava","NC","","_","_"
1,"dhvajaṃ","_","_","dhvaja","NC","","_","_"
2,"_","_","_","dhanus","NC","","_","_"
3,"_","_","_","ca","CCD","","_","_"
4,"sūtaṃ","_","_","sūta","NC","","_","_"
5,"ca","_","_","ca","CCD","","_","_"
6,"_","_","_","sammṛd","V","sammṛd","_","_"
7,"_","_","_","āhava","NC","","_","_"
8,"ripoḥ","_","_","ripu","NC","","_","_"
1,"amṛṣyamāṇaḥ","_","_","amṛṣyamāṇa","JJ","","_","_"
2,"_","_","_","karṇa","NC","","_","_"
3,"_","_","_","tu","CCD","","_","_"
4,"bhīmasenam","_","_","bhīmasa","NC","","_","_"
5,"ayudhyata","_","_","yudh","V","yudh","_","_"
1,"vividhair","_","_","vividha","JJ","","_","_"
2,"_","_","_","iṣu","NC","","_","_"
3,"_","_","_","jāla","NC","","_","_"
4,"_","_","_","ca","CCD","","_","_"
5,"_","_","_","nānā","CX","","_","_"
6,"_","_","_","śastra","NC","","_","_"
7,"_","_","_","ca","CCD","","_","_"
8,"saṃyuge","_","_","saṃyuga","NC","","_","_"
1,"saṃkule","_","_","saṃkula","NC","","_","_"
2,"vartamāne","_","_","vṛt","KDP","","_","_"
3,"tu","_","_","tu","CCD","","_","_"
4,"rājā","_","_","rājan","NC","","_","_"
5,"dharmasuto","_","_","dharmasuta","NC","","_","_"
6,"'bravīt","_","_","abravīta","V","brū","_","_"
1,"pāñcālānāṃ","_","_","pāñcāla","NC","","_","_"
2,"_","_","_","nara","NC","","_","_"
3,"_","_","_","vyāghra","NC","","_","_"
4,"_","_","_","matsya","NC","","_","_"
5,"ca","_","_","ca","CCD","","_","_"
6,"_","_","_","nara","NC","","_","_"
7,"_","_","_","ṛṣabha","NC","","_","_"
1,"ye","_","_","yad","PRL","","_","_"
2,"naḥ","_","_","mat","PPR","","_","_"
3,"prāṇāḥ","_","_","prāṇa","NC","","_","_"
4,"śiro","_","_","śiras","NC","","_","_"
5,"ye","_","_","yad","PRL","","_","_"
6,"no","_","_","mat","PPR","","_","_"
7,"ye","_","_","yad","PRL","","_","_"
8,"no","_","_","mat","PPR","","_","_"
9,"yodhā","_","_","yodha","NC","","_","_"
10,"_","_","_","mahat","JJ","","_","_"
11,"_","_","_","bala","NC","","_","_"
1,"ta","_","_","tad","PRD","","_","_"
2,"ete","_","_","tad","PRD","","_","_"
3,"dhārtarāṣṭreṣu","_","_","dhārtarāṣṭra","NC","","_","_"
4,"viṣaktāḥ","_","_","viṣañj","PPP","","_","_"
5,"_","_","_","puruṣa","NC","","_","_"
6,"_","_","_","ṛṣabha","NC","","_","_"
1,"kiṃ","_","_","kim","CX","","_","_"
2,"tiṣṭhata","_","_","tiṣṭh","V","sthā","_","_"
3,"yathā","_","_","yathā","CCM","","_","_"
4,"mūḍhāḥ","_","_","muh","PPP","","_","_"
5,"sarve","_","_","sarva","JQ","","_","_"
6,"_","_","_","viga","PPP","","_","_"
7,"_","_","_","cetas","NC","","_","_"
1,"tatra","_","_","tatra","CAD","","_","_"
2,"gacchata","_","_","gacch","V","gam","_","_"
3,"_","_","_","yatra","CX","","_","_"
4,"_","_","_","tad","PRD","","_","_"
5,"yudhyante","_","_","yudh","V","yudh","_","_"
6,"māmakā","_","_","māmaka","JJ","","_","_"
7,"rathāḥ","_","_","ratha","NC","","_","_"
1,"_","_","_","kṣatra","NC","","_","_"
2,"_","_","_","dharma","NC","","_","_"
3,"puraskṛtya","_","_","puraskṛ","CGDA","","_","_"
4,"sarva","_","_","sarva","JQ","","_","_"
5,"eva","_","_","eva","CEM","","_","_"
6,"_","_","_","ga","PPP","","_","_"
7,"_","_","_","jvara","NC","","_","_"
1,"jayanto","_","_","ji","KDP","","_","_"
2,"vadhyamānā","_","_","vadh","KDP","","_","_"
3,"vā","_","_","vā","CCD","","_","_"
4,"gatim","_","_","gati","NC","","_","_"
5,"iṣṭāṃ","_","_","iṣ","PPP","","_","_"
6,"gamiṣyatha","_","_","ga","V","ga","_","_"
1,"jitvā","_","_","ji","CGDA","","_","_"
2,"ca","_","_","ca","CCD","","_","_"
3,"bahubhir","_","_","bahu","JJ","","_","_"
4,"yajñair","_","_","yajña","NC","","_","_"
5,"yakṣyadhvaṃ","_","_","yaj","V","yaj","_","_"
6,"_","_","_","bhūri","JQ","","_","_"
7,"_","_","_","dakṣiṇā","NC","","_","_"
1,"hatā","_","_","han","PPP","","_","_"
2,"vā","_","_","vā","CCD","","_","_"
3,"devasādbhūtvā","_","_","loka","NC","","_","_"
4,"lokān","_","_","prāpn","V","prāp","_","_"
5,"prāpsyatha","_","_","puṣkala","JJ","","_","_"
1,"te","_","_","tad","PRD","","_","_"
2,"rājñā","_","_","rājan","NC","","_","_"
3,"coditā","_","_","coday","PPP","","_","_"
4,"vīrā","_","_","vīra","NC","","_","_"
5,"yotsyamānā","_","_","yudh","KDP","","_","_"
6,"_","_","_","mahat","JJ","","_","_"
7,"_","_","_","ratha","NC","","_","_"
1,"caturdhā","_","_","caturdhā","CX","","_","_"
2,"vāhinīṃ","_","_","vāhinī","NC","","_","_"
3,"kṛtvā","_","_","kṛ","CGDA","","_","_"
4,"tvaritā","_","_","tvar","PPP","","_","_"
5,"droṇam","_","_","droṇa","NC","","_","_"
6,"abhyayuḥ","_","_","abhiyā","V","abhiyā","_","_"
1,"_","_","_","pāñcāla","NC","","_","_"
2,"_","_","_","tu","CCD","","_","_"
3,"_","_","_","ekatas","CX","","_","_"
4,"droṇam","_","_","droṇa","NC","","_","_"
5,"abhyaghnan","_","_","abhihan","V","abhihan","_","_"
6,"bahubhiḥ","_","_","bahu","JJ","","_","_"
7,"śaraiḥ","_","_","śara","NC","","_","_"
1,"_","_","_","bhīmasa","NC","","_","_"
2,"_","_","_","puroga","JJ","","_","_"
3,"_","_","_","ca","CCD","","_","_"
4,"ekataḥ","_","_","ekatas","CX","","_","_"
5,"paryavārayan","_","_","parivāray","V","parivāray","_","_"
1,"_","_","_","as","V","as","_","_"
2,"_","_","_","tu","CCD","","_","_"
3,"_","_","_","pāṇḍu","NC","","_","_"
4,"_","_","_","putra","NC","","_","_"
5,"trayo","_","_","tri","NUM","","_","_"
6,"'jihmā","_","_","ajihma","JJ","","_","_"
7,"_","_","_","mahat","JJ","","_","_"
8,"_","_","_","ratha","NC","","_","_"
1,"yamau","_","_","yama","NC","","_","_"
2,"ca","_","_","ca","CCD","","_","_"
3,"_","_","_","bhīmasa","NC","","_","_"
4,"_","_","_","ca","CCD","","_","_"
5,"prākrośanta","_","_","prākruś","V","prākruś","_","_"
6,"dhanaṃjayam","_","_","dhanaṃjaya","NC","","_","_"
1,"_","_","_","abhidru","V","abhidru","_","_"
2,"_","_","_","arjuna","NC","","_","_"
3,"kṣipraṃ","_","_","kṣipra","CX","","_","_"
4,"kurūn","_","_","kuru","NC","","_","_"
5,"droṇād","_","_","droṇa","NC","","_","_"
6,"apānuda","_","_","apānud","V","apānud","_","_"
1,"tata","_","_","tatas","CX","","_","_"
2,"enaṃ","_","_","a","PRD","","_","_"
3,"haniṣyanti","_","_","han","V","han","_","_"
4,"pāñcālā","_","_","pāñcāla","NC","","_","_"
5,"_","_","_","han","PPP","","_","_"
6,"_","_","_","rakṣin","JJ","","_","_"
1,"_","_","_","kauraveya","NC","","_","_"
2,"_","_","_","tatas","CX","","_","_"
3,"pārthaḥ","_","_","pārtha","NC","","_","_"
4,"sahasā","_","_","sahas","NC","","_","_"
5,"samupādravat","_","_","samupadru","V","samupadru","_","_"
1,"pāñcālān","_","_","pāñcāla","NC","","_","_"
2,"eva","_","_","eva","CEM","","_","_"
3,"tu","_","_","tu","CCD","","_","_"
4,"droṇo","_","_","droṇa","NC","","_","_"
5,"_","_","_","dhṛṣṭadyumna","NC","","_","_"
6,"_","_","_","purogama","JJ","","_","_"
1,"pāñcālānāṃ","_","_","pāñcāla","NC","","_","_"
2,"tato","_","_","tatas","CX","","_","_"
3,"droṇo","_","_","droṇa","NC","","_","_"
4,"_","_","_","api","CX","","_","_"
5,"_","_","_","kar","V","kṛ","_","_"
6,"kadanaṃ","_","_","kadana","NC","","_","_"
7,"mahat","_","_","mahat","JJ","","_","_"
1,"yathā","_","_","yathā","CCM","","_","_"
2,"kruddho","_","_","krudh","PPP","","_","_"
3,"raṇe","_","_","raṇa","NC","","_","_"
4,"śakro","_","_","śakra","NC","","_","_"
5,"dānavānāṃ","_","_","dānava","NC","","_","_"
6,"kṣayaṃ","_","_","kṣaya","NC","","_","_"
7,"purā","_","_","purā","CX","","_","_"
1,"_","_","_","droṇa","NC","","_","_"
2,"_","_","_","astra","NC","","_","_"
3,"_","_","_","mahat","JJ","","_","_"
4,"_","_","_","rāja","NC","","_","_"
5,"vadhyamānāḥ","_","_","vadh","KDP","","_","_"
6,"pare","_","_","para","PPX","","_","_"
7,"yudhi","_","_","yudh","NC","","_","_"
1,"_","_","_","na","CNG","","_","_"
2,"_","_","_","tras","V","tras","_","_"
3,"raṇe","_","_","raṇa","NC","","_","_"
4,"droṇāt","_","_","droṇa","NC","","_","_"
5,"sattvavanto","_","_","sattvavat","JJ","","_","_"
6,"_","_","_","mahat","JJ","","_","_"
7,"_","_","_","ratha","NC","","_","_"
1,"vadhyamānā","_","_","vadh","KDP","","_","_"
2,"_","_","_","mahat","JJ","","_","_"
3,"_","_","_","rāja","NC","","_","_"
4,"pāñcālāḥ","_","_","pāñcāla","NC","","_","_"
5,"_","_","_","sṛñjaya","NC","","_","_"
6,"_","_","_","tathā","CX","","_","_"
1,"droṇam","_","_","droṇa","NC","","_","_"
2,"_","_","_","eva","CEM","","_","_"
3,"_","_","_","abhiyā","V","abhiyā","_","_"
4,"yuddhe","_","_","yuddha","NC","","_","_"
5,"mohayanto","_","_","mohay","KDP","","_","_"
6,"_","_","_","mahat","JJ","","_","_"
7,"_","_","_","ratha","NC","","_","_"
1,"teṣāṃ","_","_","tad","PRD","","_","_"
2,"_","_","_","tu","CCD","","_","_"
3,"_","_","_","utsāday","KDP","","_","_"
4,"pāñcālānāṃ","_","_","pāñcāla","NC","","_","_"
5,"samantataḥ","_","_","samantataḥ","CX","","_","_"
1,"abhavad","_","_","bhav","V","bhū","_","_"
2,"bhairavo","_","_","bhairava","JJ","","_","_"
3,"nādo","_","_","nāda","NC","","_","_"
4,"vadhyatāṃ","_","_","vadh","KDP","","_","_"
5,"_","_","_","śara","NC","","_","_"
6,"_","_","_","śakti","NC","","_","_"
1,"vadhyamāneṣu","_","_","vadh","KDP","","_","_"
2,"saṃgrāme","_","_","saṃgrāma","NC","","_","_"
3,"pāñcāleṣu","_","_","pāñcāla","NC","","_","_"
4,"mahātmanā","_","_","mahātman","JJ","","_","_"
1,"udīryamāṇe","_","_","udīray","KDP","","_","_"
2,"_","_","_","droṇa","NC","","_","_"
3,"_","_","_","astra","NC","","_","_"
4,"pāṇḍavān","_","_","pāṇḍava","NC","","_","_"
5,"bhayam","_","_","bhaya","NC","","_","_"
6,"āviśat","_","_","viś","V","viś","_","_"
1,"_","_","_","dṛś","CGDA","","_","_"
2,"_","_","_","aśva","NC","","_","_"
3,"_","_","_","nara","NC","","_","_"
4,"_","_","_","saṃgha","NC","","_","_"
5,"vipulaṃ","_","_","vipula","JJ","","_","_"
6,"ca","_","_","ca","CCD","","_","_"
7,"kṣayaṃ","_","_","kṣaya","NC","","_","_"
8,"yudhi","_","_","yudh","NC","","_","_"
1,"pāṇḍaveyā","_","_","pāṇḍaveya","NC","","_","_"
2,"_","_","_","mahat","JJ","","_","_"
3,"_","_","_","rāja","NC","","_","_"
4,"_","_","_","na","CNG","","_","_"
5,"_","_","_","śaṃs","V","śaṃs","_","_"
6,"vijayaṃ","_","_","vijaya","NC","","_","_"
7,"tadā","_","_","tadā","CAD","","_","_"
1,"kaccid","_","_","kaccit","CX","","_","_"
2,"droṇo","_","_","droṇa","NC","","_","_"
3,"na","_","_","na","CNG","","_","_"
4,"naḥ","_","_","mat","PPR","","_","_"
5,"sarvān","_","_","sarva","JQ","","_","_"
6,"kṣapayet","_","_","kṣapay","V","kṣapay","_","_"
7,"_","_","_","parama","JJ","","_","_"
8,"_","_","_","astra","NC","","_","_"
9,"_","_","_","vid","JJ","","_","_"
1,"samiddhaḥ","_","_","samindh","PPP","","_","_"
2,"_","_","_","śiśira","NC","","_","_"
3,"_","_","_","apāya","NC","","_","_"
4,"dahan","_","_","dah","KDP","","_","_"
5,"kakṣam","_","_","kakṣa","NC","","_","_"
6,"_","_","_","iva","CCM","","_","_"
7,"_","_","_","anala","NC","","_","_"
1,"na","_","_","na","CNG","","_","_"
2,"_","_","_","ca","CCD","","_","_"
3,"_","_","_","a","PRD","","_","_"
4,"saṃyuge","_","_","saṃyuga","NC","","_","_"
5,"kaścit","_","_","kiṃcit","PRI","","_","_"
6,"samarthaḥ","_","_","samartha","JJ","","_","_"
7,"prativīkṣitum","_","_","prativīkṣ","CGDI","","_","_"
1,"na","_","_","na","CNG","","_","_"
2,"_","_","_","ca","CCD","","_","_"
3,"_","_","_","a","PRD","","_","_"
4,"arjuno","_","_","arjuna","NC","","_","_"
5,"jātu","_","_","jātu","CX","","_","_"
6,"pratiyudhyeta","_","_","pratiyudh","V","pratiyudh","_","_"
7,"_","_","_","dharma","NC","","_","_"
8,"_","_","_","vid","JJ","","_","_"
1,"trastān","_","_","tras","PPP","","_","_"
2,"_","_","_","kuntī","NC","","_","_"
3,"_","_","_","suta","NC","","_","_"
4,"dṛṣṭvā","_","_","dṛś","CGDA","","_","_"
5,"_","_","_","droṇa","NC","","_","_"
6,"_","_","_","sāyaka","NC","","_","_"
7,"_","_","_","pīḍay","PPP","","_","_"
1,"matimāñ","_","_","matimat","JJ","","_","_"
2,"śreyase","_","_","śreyas","NC","","_","_"
3,"yuktaḥ","_","_","yuj","PPP","","_","_"
4,"keśavo","_","_","keśava","NC","","_","_"
5,"'rjunam","_","_","arjuna","NC","","_","_"
6,"abravīt","_","_","abravīta","V","brū","_","_"
1,"_","_","_","na","CNG","","_","_"
2,"_","_","_","tad","PRD","","_","_"
3,"yuddhena","_","_","yuddha","NC","","_","_"
4,"saṃgrāme","_","_","saṃgrāma","NC","","_","_"
5,"jetuṃ","_","_","ji","CGDI","","_","_"
6,"śakyaḥ","_","_","śakya","JJ","","_","_"
7,"kathaṃcana","_","_","kathaṃcana","CX","","_","_"
1,"api","_","_","api","CX","","_","_"
2,"vṛtrahaṇā","_","_","vṛtrahan","NC","","_","_"
3,"yuddhe","_","_","yuddha","NC","","_","_"
4,"_","_","_","ratha","NC","","_","_"
5,"_","_","_","yūthapa","NC","","_","_"
6,"_","_","_","yūthapa","NC","","_","_"
1,"āsthīyatāṃ","_","_","ātiṣṭh","V","āsthā","_","_"
2,"jaye","_","_","jaya","NC","","_","_"
3,"yogo","_","_","yoga","NC","","_","_"
4,"dharmam","_","_","dharma","NC","","_","_"
5,"utsṛjya","_","_","utsṛj","CGDA","","_","_"
6,"pāṇḍava","_","_","pāṇḍava","NC","","_","_"
1,"yathā","_","_","yathā","CCM","","_","_"
2,"vaḥ","_","_","tvat","PPR","","_","_"
3,"saṃyuge","_","_","saṃyuga","NC","","_","_"
4,"_","_","_","sarva","JQ","","_","_"
5,"_","_","_","na","CNG","","_","_"
6,"hanyād","_","_","han","V","han","_","_"
7,"rukmavāhanaḥ","_","_","rukmavāhana","NC","","_","_"
1,"aśvatthāmni","_","_","aśvatthāman","NC","","_","_"
2,"hate","_","_","han","PPP","","_","_"
3,"_","_","_","na","CNG","","_","_"
4,"_","_","_","tad","PRD","","_","_"
5,"yudhyed","_","_","yudh","V","yudh","_","_"
6,"iti","_","_","iti","CQT","","_","_"
7,"matir","_","_","mati","NC","","_","_"
8,"mama","_","_","mat","PPR","","_","_"
1,"taṃ","_","_","tad","PRD","","_","_"
2,"hataṃ","_","_","han","PPP","","_","_"
3,"saṃyuge","_","_","saṃyuga","NC","","_","_"
4,"kaścid","_","_","kiṃcit","PRI","","_","_"
5,"asmai","_","_","ida","PRD","","_","_"
6,"śaṃsatu","_","_","śaṃs","V","śaṃs","_","_"
7,"mānavaḥ","_","_","mānava","NC","","_","_"
1,"_","_","_","tad","PRD","","_","_"
2,"_","_","_","na","CNG","","_","_"
3,"_","_","_","rocay","V","rocay","_","_"
4,"rājan","_","_","rājan","NC","","_","_"
5,"_","_","_","kuntī","NC","","_","_"
6,"_","_","_","putra","NC","","_","_"
7,"dhanaṃjayaḥ","_","_","dhanaṃjaya","NC","","_","_"
1,"anye","_","_","anya","PPX","","_","_"
2,"_","_","_","tu","CCD","","_","_"
3,"_","_","_","rocay","V","rocay","_","_"
4,"sarve","_","_","sarva","JQ","","_","_"
5,"kṛcchreṇa","_","_","kṛcchra","NC","","_","_"
6,"tu","_","_","tu","CCD","","_","_"
7,"yudhiṣṭhiraḥ","_","_","yudhiṣṭhira","NC","","_","_"
1,"tato","_","_","tatas","CX","","_","_"
2,"bhīmo","_","_","bhīma","NC","","_","_"
3,"_","_","_","mahat","JJ","","_","_"
4,"_","_","_","bāhu","NC","","_","_"
5,"anīke","_","_","anīka","NC","","_","_"
6,"sve","_","_","sva","JJ","","_","_"
7,"_","_","_","mahat","JJ","","_","_"
8,"_","_","_","gaja","NC","","_","_"
1,"jaghāna","_","_","han","V","han","_","_"
2,"gadayā","_","_","gadā","NC","","_","_"
3,"rājann","_","_","rājan","NC","","_","_"
4,"aśvatthāmānam","_","_","aśvatthāman","NC","","_","_"
5,"_","_","_","iti","CQT","","_","_"
6,"_","_","_","uta","CCD","","_","_"
1,"_","_","_","bhīmasa","NC","","_","_"
2,"_","_","_","tu","CCD","","_","_"
3,"_","_","_","sa_saha","CX","","_","_"
4,"_","_","_","vrīḍā","NC","","_","_"
5,"upetya","_","_","upe","CGDA","","_","_"
6,"droṇam","_","_","droṇa","NC","","_","_"
7,"āhave","_","_","āhava","NC","","_","_"
1,"aśvatthāmā","_","_","aśvatthāman","NC","","_","_"
2,"hata","_","_","han","PPP","","_","_"
3,"iti","_","_","iti","CQT","","_","_"
4,"śabdam","_","_","śabda","NC","","_","_"
5,"_","_","_","uccais","CX","","_","_"
6,"_","_","_","kar","V","kṛ","_","_"
7,"ha","_","_","ha","CEM","","_","_"
1,"_","_","_","aśvatthāman","NC","","_","_"
2,"_","_","_","iti","CQT","","_","_"
3,"hi","_","_","hi","CX","","_","_"
4,"gajaḥ","_","_","gaja","NC","","_","_"
5,"khyāto","_","_","khyā","PPP","","_","_"
6,"nāmnā","_","_","nāman","NC","","_","_"
7,"hato","_","_","han","PPP","","_","_"
8,"'bhavat","_","_","bhav","V","bhū","_","_"
1,"kṛtvā","_","_","kṛ","CGDA","","_","_"
2,"manasi","_","_","manas","NC","","_","_"
3,"taṃ","_","_","tad","PRD","","_","_"
4,"bhīmo","_","_","bhīma","NC","","_","_"
5,"mithyā","_","_","mithyā","CX","","_","_"
6,"_","_","_","vyāhṛ","KDP","","_","_"
7,"_","_","_","tadā","CAD","","_","_"
1,"_","_","_","bhīmasa","NC","","_","_"
2,"_","_","_","vacas","NC","","_","_"
3,"śrutvā","_","_","śru","CGDA","","_","_"
4,"_","_","_","droṇa","NC","","_","_"
5,"_","_","_","tad","PRD","","_","_"
6,"param","_","_","para","CX","","_","_"
7,"apriyam","_","_","apriya","JJ","","_","_"
1,"manasā","_","_","manas","NC","","_","_"
2,"_","_","_","sad","PPP","","_","_"
3,"_","_","_","gātra","NC","","_","_"
4,"'bhūd","_","_","bhav","V","bhū","_","_"
5,"yathā","_","_","yathā","CCM","","_","_"
6,"saikatam","_","_","saikata","NC","","_","_"
7,"ambhasi","_","_","ambhas","NC","","_","_"
1,"śaṅkamānaḥ","_","_","śaṅk","KDP","","_","_"
2,"sa","_","_","tad","PRD","","_","_"
3,"_","_","_","tad","PRD","","_","_"
4,"_","_","_","mithyā","CX","","_","_"
5,"_","_","_","vīrya","NC","","_","_"
6,"_","_","_","jña","JJ","","_","_"
7,"_","_","_","sva","JJ","","_","_"
8,"_","_","_","suta","NC","","_","_"
9,"vai","_","_","vai","CX","","_","_"
1,"hataḥ","_","_","han","PPP","","_","_"
2,"sa","_","_","tad","PRD","","_","_"
3,"iti","_","_","iti","CQT","","_","_"
4,"ca","_","_","ca","CCD","","_","_"
5,"śrutvā","_","_","śru","CGDA","","_","_"
6,"_","_","_","na","CNG","","_","_"
7,"_","_","_","eva","CEM","","_","_"
8,"dhairyād","_","_","dhairya","NC","","_","_"
9,"akampata","_","_","kamp","V","kamp","_","_"
1,"sa","_","_","tad","PRD","","_","_"
2,"labdhvā","_","_","labh","CGDA","","_","_"
3,"cetanāṃ","_","_","cetanā","NC","","_","_"
4,"droṇaḥ","_","_","droṇa","NC","","_","_"
5,"_","_","_","kṣaṇa","NC","","_","_"
6,"_","_","_","eva","CEM","","_","_"
7,"samāśvasat","_","_","samāśvas","V","samāśvas","_","_"
1,"_","_","_","anucintay","CGDA","","_","_"
2,"_","_","_","ātman","NC","","_","_"
3,"putram","_","_","putra","NC","","_","_"
4,"aviṣahyam","_","_","aviṣahya","JJ","","_","_"
5,"arātibhiḥ","_","_","arāti","NC","","_","_"
1,"sa","_","_","tad","PRD","","_","_"
2,"pārṣatam","_","_","pārṣata","NC","","_","_"
3,"abhidrutya","_","_","abhidru","CGDA","","_","_"
4,"jighāṃsur","_","_","jighāṃsu","JJ","","_","_"
5,"mṛtyum","_","_","mṛtyu","NC","","_","_"
6,"ātmanaḥ","_","_","ātman","NC","","_","_"
1,"avākirat","_","_","avakṛ","V","avakṛ","_","_"
2,"sahasreṇa","_","_","sahasra","NUM","","_","_"
3,"tīkṣṇānāṃ","_","_","tīkṣṇa","JJ","","_","_"
4,"_","_","_","kaṅka","NC","","_","_"
5,"_","_","_","pattrin","JJ","","_","_"
1,"taṃ","_","_","tad","PRD","","_","_"
2,"vai","_","_","vai","CX","","_","_"
3,"_","_","_","viṃśati","NC","","_","_"
4,"_","_","_","sāhasra","JJ","","_","_"
5,"pāñcālānāṃ","_","_","pāñcāla","NC","","_","_"
6,"_","_","_","nara","NC","","_","_"
7,"_","_","_","ṛṣabha","NC","","_","_"
1,"tathā","_","_","tathā","CX","","_","_"
2,"carantaṃ","_","_","car","KDP","","_","_"
3,"saṃgrāme","_","_","saṃgrāma","NC","","_","_"
4,"sarvato","_","_","sarvatas","CX","","_","_"
5,"vyakirañ","_","_","vikar","V","vikṛ","_","_"
6,"śaraiḥ","_","_","śara","NC","","_","_"
1,"tataḥ","_","_","tatas","CX","","_","_"
2,"prāduṣkarod","_","_","prāduṣkṛ","V","prāduṣkṛ","_","_"
3,"droṇo","_","_","droṇa","NC","","_","_"
4,"brāhmam","_","_","brāhma","JJ","","_","_"
5,"astraṃ","_","_","astra","NC","","_","_"
6,"paraṃtapaḥ","_","_","paraṃtapa","JJ","","_","_"
1,"vadhāya","_","_","vadha","NC","","_","_"
2,"teṣāṃ","_","_","tad","PRD","","_","_"
3,"śūrāṇāṃ","_","_","śūra","NC","","_","_"
4,"pāñcālānām","_","_","pāñcāla","NC","","_","_"
5,"amarṣitaḥ","_","_","amarṣita","JJ","","_","_"
1,"tato","_","_","tatas","CX","","_","_"
2,"vyarocata","_","_","viroc","V","viruc","_","_"
3,"droṇo","_","_","droṇa","NC","","_","_"
4,"vinighnan","_","_","vinihan","KDP","","_","_"
5,"_","_","_","sarva","JQ","","_","_"
6,"_","_","_","somaka","NC","","_","_"
1,"_","_","_","śiras","NC","","_","_"
2,"_","_","_","pātay","V","pātay","_","_"
3,"_","_","_","ca","CCD","","_","_"
4,"_","_","_","api","CX","","_","_"
5,"pāñcālānāṃ","_","_","pāñcāla","NC","","_","_"
6,"_","_","_","mahat","JJ","","_","_"
7,"_","_","_","mṛdha","NC","","_","_"
1,"_","_","_","tathā","CX","","_","_"
2,"_","_","_","eva","CEM","","_","_"
3,"_","_","_","parigha","NC","","_","_"
4,"_","_","_","ākāra","NC","","_","_"
5,"bāhūn","_","_","bāhu","NC","","_","_"
6,"_","_","_","kanaka","NC","","_","_"
7,"_","_","_","bhūṣaṇa","NC","","_","_"
1,"te","_","_","tad","PRD","","_","_"
2,"vadhyamānāḥ","_","_","vadh","KDP","","_","_"
3,"samare","_","_","samara","NC","","_","_"
4,"bhāradvājena","_","_","bhāradvāja","NC","","_","_"
5,"pārthivāḥ","_","_","pārthiva","NC","","_","_"
1,"medinyām","_","_","medinī","NC","","_","_"
2,"anvakīryanta","_","_","anukar","V","anukṛ","_","_"
3,"_","_","_","vāta","NC","","_","_"
4,"_","_","_","nud","PPP","","_","_"
5,"iva","_","_","iva","CCM","","_","_"
6,"drumāḥ","_","_","druma","NC","","_","_"
1,"kuñjarāṇāṃ","_","_","kuñjara","NC","","_","_"
2,"ca","_","_","ca","CCD","","_","_"
3,"patatāṃ","_","_","pat","KDP","","_","_"
4,"_","_","_","haya","NC","","_","_"
5,"_","_","_","ogha","NC","","_","_"
6,"ca","_","_","ca","CCD","","_","_"
7,"bhārata","_","_","bhārata","NC","","_","_"
1,"_","_","_","agamya","JJ","","_","_"
2,"_","_","_","rūpa","NC","","_","_"
3,"pṛthivī","_","_","pṛthivī","NC","","_","_"
4,"_","_","_","māṃsa","NC","","_","_"
5,"_","_","_","śoṇita","NC","","_","_"
6,"_","_","_","kardama","NC","","_","_"
1,"hatvā","_","_","han","CGDA","","_","_"
2,"_","_","_","viṃśati","NC","","_","_"
3,"_","_","_","sāhasra","JJ","","_","_"
4,"pāñcālānāṃ","_","_","pāñcāla","NC","","_","_"
5,"_","_","_","ratha","NC","","_","_"
6,"_","_","_","vraja","NC","","_","_"
1,"atiṣṭhad","_","_","tiṣṭh","V","sthā","_","_"
2,"āhave","_","_","āhava","NC","","_","_"
3,"droṇo","_","_","droṇa","NC","","_","_"
4,"vidhūmo","_","_","vidhūma","JJ","","_","_"
5,"'gnir","_","_","agni","NC","","_","_"
6,"iva","_","_","iva","CCM","","_","_"
7,"jvalan","_","_","jval","KDP","","_","_"
1,"_","_","_","tathā","CX","","_","_"
2,"_","_","_","eva","CEM","","_","_"
3,"ca","_","_","ca","CCD","","_","_"
4,"punaḥ","_","_","punar","CAD","","_","_"
5,"kruddho","_","_","krudh","PPP","","_","_"
6,"bhāradvājaḥ","_","_","bhāradvāja","NC","","_","_"
7,"pratāpavān","_","_","pratāpavat","JJ","","_","_"
1,"vasudānasya","_","_","vasudāna","NC","","_","_"
2,"bhallena","_","_","bhalla","NC","","_","_"
3,"śiraḥ","_","_","śiras","NC","","_","_"
4,"kāyād","_","_","kāya","NC","","_","_"
5,"apāharat","_","_","apahar","V","apahṛ","_","_"
1,"punaḥ","_","_","punar","CAD","","_","_"
2,"_","_","_","pañcaśata","JJ","","_","_"
3,"_","_","_","matsya","NC","","_","_"
4,"_","_","_","ṣaṣ","NUM","","_","_"
5,"_","_","_","sahasra","NUM","","_","_"
6,"_","_","_","ca","CCD","","_","_"
7,"sṛñjayān","_","_","sṛñjaya","NC","","_","_"
1,"hastinām","_","_","hastin","NC","","_","_"
2,"ayutaṃ","_","_","ayuta","NC","","_","_"
3,"hatvā","_","_","han","CGDA","","_","_"
4,"_","_","_","han","V","han","_","_"
5,"_","_","_","aśva","NC","","_","_"
6,"_","_","_","ayuta","NC","","_","_"
7,"punaḥ","_","_","punar","CAD","","_","_"
1,"kṣatriyāṇām","_","_","kṣatriya","NC","","_","_"
2,"abhāvāya","_","_","abhāva","NC","","_","_"
3,"dṛṣṭvā","_","_","dṛś","CGDA","","_","_"
4,"droṇam","_","_","droṇa","NC","","_","_"
5,"avasthitam","_","_","avasthā","PPP","","_","_"
1,"ṛṣayo","_","_","ṛṣi","NC","","_","_"
2,"_","_","_","abhyāga","V","abhyāga","_","_"
3,"_","_","_","tūrṇa","CX","","_","_"
4,"_","_","_","havyavāha","NC","","_","_"
5,"_","_","_","purogama","JJ","","_","_"
1,"viśvāmitro","_","_","viśvāmitra","NC","","_","_"
2,"jamadagnir","_","_","jamadagni","NC","","_","_"
3,"bhāradvājo","_","_","bhāradvāja","NC","","_","_"
4,"'tha","_","_","atha","CAD","","_","_"
5,"gautamaḥ","_","_","gautama","NC","","_","_"
1,"vasiṣṭhaḥ","_","_","vasiṣṭha","NC","","_","_"
2,"kaśyapo","_","_","kaśyapa","NC","","_","_"
3,"_","_","_","atri","NC","","_","_"
4,"_","_","_","ca","CCD","","_","_"
5,"_","_","_","brahman","NC","","_","_"
6,"_","_","_","loka","NC","","_","_"
7,"ninīṣavaḥ","_","_","ninīṣu","JJ","","_","_"
1,"sikatāḥ","_","_","sikatā","NC","","_","_"
2,"pṛśnayo","_","_","pṛśni","NC","","_","_"
3,"gargā","_","_","garga","NC","","_","_"
4,"vālakhilyā","_","_","vālakhilya","NC","","_","_"
5,"marīcipāḥ","_","_","marīcipa","NC","","_","_"
1,"bhṛgavo","_","_","bhṛgu","NC","","_","_"
2,"_","_","_","aṅgiras","NC","","_","_"
3,"_","_","_","ca","CCD","","_","_"
4,"_","_","_","eva","CEM","","_","_"
5,"_","_","_","sūkṣma","JJ","","_","_"
6,"_","_","_","ca","CCD","","_","_"
7,"_","_","_","anya","PPX","","_","_"
8,"_","_","_","mahat","JJ","","_","_"
9,"_","_","_","ṛṣi","NC","","_","_"
1,"ta","_","_","tad","PRD","","_","_"
2,"enam","_","_","a","PRD","","_","_"
3,"abruvan","_","_","abravīta","V","brū","_","_"
4,"sarve","_","_","sarva","JQ","","_","_"
5,"droṇam","_","_","droṇa","NC","","_","_"
6,"_","_","_","āhava","NC","","_","_"
7,"_","_","_","śobhin","JJ","","_","_"
1,"adharmataḥ","_","_","adharma","NC","","_","_"
2,"kṛtaṃ","_","_","kṛ","PPP","","_","_"
3,"yuddhaṃ","_","_","yuddha","NC","","_","_"
4,"samayo","_","_","samaya","NC","","_","_"
5,"nidhanasya","_","_","nidhana","NC","","_","_"
6,"te","_","_","tvat","PPR","","_","_"
1,"_","_","_","nyas","CGDA","","_","_"
2,"_","_","_","āyudha","NC","","_","_"
3,"raṇe","_","_","raṇa","NC","","_","_"
4,"droṇa","_","_","droṇa","NC","","_","_"
5,"_","_","_","same","CGDA","","_","_"
6,"_","_","_","mat","PPR","","_","_"
7,"avasthitān","_","_","avasthā","PPP","","_","_"
1,"_","_","_","na","CNG","","_","_"
2,"_","_","_","atas","CX","","_","_"
3,"krūrataraṃ","_","_","krūratara","JJ","","_","_"
4,"karma","_","_","karman","NC","","_","_"
5,"punaḥ","_","_","punar","CAD","","_","_"
6,"kartuṃ","_","_","kṛ","CGDI","","_","_"
7,"tvam","_","_","tvat","PPR","","_","_"
8,"arhasi","_","_","arh","V","arh","_","_"
1,"_","_","_","veda","NC","","_","_"
2,"_","_","_","vedāṅga","NC","","_","_"
3,"_","_","_","vidvas","JJ","","_","_"
4,"_","_","_","satya","NC","","_","_"
5,"_","_","_","dharma","NC","","_","_"
6,"_","_","_","para","PPX","","_","_"
7,"ca","_","_","ca","CCD","","_","_"
1,"brāhmaṇasya","_","_","brāhmaṇa","NC","","_","_"
2,"viśeṣeṇa","_","_","viśeṣeṇa","CX","","_","_"
3,"_","_","_","tvat","PPR","","_","_"
4,"_","_","_","tad","PRD","","_","_"
5,"_","_","_","na","CNG","","_","_"
6,"_","_","_","upapad","V","upapad","_","_"
1,"_","_","_","nyas","CGDA","","_","_"
2,"_","_","_","āyudha","NC","","_","_"
3,"_","_","_","amogha","JJ","","_","_"
4,"_","_","_","iṣu","NC","","_","_"
5,"tiṣṭha","_","_","tiṣṭh","V","sthā","_","_"
6,"vartmani","_","_","vartman","NC","","_","_"
7,"śāśvate","_","_","śāśvata","JJ","","_","_"
1,"_","_","_","paripṛ","PPP","","_","_"
2,"_","_","_","ca","CCD","","_","_"
3,"_","_","_","kāla","NC","","_","_"
4,"_","_","_","tvat","PPR","","_","_"
5,"vastuṃ","_","_","vas","CGDI","","_","_"
6,"loke","_","_","loka","NC","","_","_"
7,"'dya","_","_","adya","CX","","_","_"
8,"mānuṣe","_","_","mānuṣa","JJ","","_","_"
1,"iti","_","_","iti","CQT","","_","_"
2,"teṣāṃ","_","_","tad","PRD","","_","_"
3,"vacaḥ","_","_","vacas","NC","","_","_"
4,"śrutvā","_","_","śru","CGDA","","_","_"
5,"_","_","_","bhīmasa","NC","","_","_"
6,"_","_","_","vacas","NC","","_","_"
7,"_","_","_","ca","CCD","","_","_"
8,"tat","_","_","tad","PRD","","_","_"
1,"dhṛṣṭadyumnaṃ","_","_","dhṛṣṭadyumna","NC","","_","_"
2,"ca","_","_","ca","CCD","","_","_"
3,"samprekṣya","_","_","samprekṣ","CGDA","","_","_"
4,"raṇe","_","_","raṇa","NC","","_","_"
5,"sa","_","_","tad","PRD","","_","_"
6,"_","_","_","vimanas","JJ","","_","_"
7,"_","_","_","bhav","V","bhū","_","_"
1,"sa","_","_","tad","PRD","","_","_"
2,"dahyamāno","_","_","dah","KDP","","_","_"
3,"vyathitaḥ","_","_","vyath","PPP","","_","_"
4,"_","_","_","kuntī","NC","","_","_"
5,"_","_","_","putra","NC","","_","_"
6,"yudhiṣṭhiram","_","_","yudhiṣṭhira","NC","","_","_"
1,"ahataṃ","_","_","ahata","JJ","","_","_"
2,"vā","_","_","vā","CCD","","_","_"
3,"hataṃ","_","_","han","PPP","","_","_"
4,"_","_","_","vā","CCD","","_","_"
5,"_","_","_","iti","CQT","","_","_"
6,"papraccha","_","_","pṛcch","V","prach","_","_"
7,"sutam","_","_","suta","NC","","_","_"
8,"ātmanaḥ","_","_","ātman","NC","","_","_"
1,"sthirā","_","_","sthira","JJ","","_","_"
2,"buddhir","_","_","buddhi","NC","","_","_"
3,"hi","_","_","hi","CX","","_","_"
4,"droṇasya","_","_","droṇa","NC","","_","_"
5,"na","_","_","na","CNG","","_","_"
6,"pārtho","_","_","pārtha","NC","","_","_"
7,"vakṣyate","_","_","vak","V","vac","_","_"
8,"'nṛtam","_","_","anṛta","NC","","_","_"
1,"trayāṇām","_","_","tri","NUM","","_","_"
2,"api","_","_","api","CX","","_","_"
3,"lokānām","_","_","loka","NC","","_","_"
4,"_","_","_","aiśvarya","NC","","_","_"
5,"_","_","_","artha","NC","","_","_"
6,"kathaṃcana","_","_","kathaṃcana","CX","","_","_"
1,"tasmāt","_","_","tasmāt","CX","","_","_"
2,"taṃ","_","_","tad","PRD","","_","_"
3,"paripapraccha","_","_","paripracch","V","paripracch","_","_"
4,"_","_","_","na","CNG","","_","_"
5,"_","_","_","anya","PPX","","_","_"
6,"kaṃcid","_","_","kiṃcit","PRI","","_","_"
7,"viśeṣataḥ","_","_","viśeṣataḥ","CX","","_","_"
1,"_","_","_","tad","PRD","","_","_"
2,"_","_","_","tad","PRD","","_","_"
3,"hi","_","_","hi","CX","","_","_"
4,"_","_","_","satya","NC","","_","_"
5,"_","_","_","āśā","NC","","_","_"
6,"bālyāt","_","_","bālya","NC","","_","_"
7,"prabhṛti","_","_","prabhṛti","CX","","_","_"
8,"pāṇḍave","_","_","pāṇḍava","NC","","_","_"
1,"tato","_","_","tatas","CX","","_","_"
2,"niṣpāṇḍavām","_","_","niṣpāṇḍava","JJ","","_","_"
3,"urvīṃ","_","_","urvī","NC","","_","_"
4,"kariṣyantaṃ","_","_","kṛ","KDP","","_","_"
5,"yudhāṃ","_","_","yudh","NC","","_","_"
6,"patim","_","_","pati","NC","","_","_"
1,"droṇaṃ","_","_","droṇa","NC","","_","_"
2,"jñātvā","_","_","jñā","CGDA","","_","_"
3,"_","_","_","dharma","NC","","_","_"
4,"_","_","_","rāja","NC","","_","_"
5,"govindo","_","_","govinda","NC","","_","_"
6,"vyathito","_","_","vyath","PPP","","_","_"
7,"'bravīt","_","_","abravīta","V","brū","_","_"
1,"_","_","_","yadi","CSB","","_","_"
2,"_","_","_","ardha","JJ","","_","_"
3,"_","_","_","divasa","NC","","_","_"
4,"droṇo","_","_","droṇa","NC","","_","_"
5,"yudhyate","_","_","yudh","V","yudh","_","_"
6,"manyum","_","_","manyu","NC","","_","_"
7,"āsthitaḥ","_","_","āsthā","PPP","","_","_"
1,"satyaṃ","_","_","satya","NC","","_","_"
2,"bravīmi","_","_","abravīta","V","brū","_","_"
3,"te","_","_","tvat","PPR","","_","_"
4,"senā","_","_","senā","NC","","_","_"
5,"vināśaṃ","_","_","vināśa","NC","","_","_"
6,"samupaiṣyati","_","_","samupai","V","samupe","_","_"
1,"sa","_","_","tad","PRD","","_","_"
2,"_","_","_","bhavat","JJ","","_","_"
3,"_","_","_","trā","V","trā","_","_"
4,"no","_","_","mat","PPR","","_","_"
5,"droṇāt","_","_","droṇa","NC","","_","_"
6,"_","_","_","satya","NC","","_","_"
7,"_","_","_","jyāyas","JJ","","_","_"
8,"'nṛtaṃ","_","_","anṛta","NC","","_","_"
9,"bhavet","_","_","bhav","V","bhū","_","_"
1,"anṛtaṃ","_","_","anṛta","NC","","_","_"
2,"_","_","_","jīvita","NC","","_","_"
3,"_","_","_","artha","NC","","_","_"
4,"_","_","_","vad","KDP","","_","_"
5,"_","_","_","na","CNG","","_","_"
6,"spṛśyate","_","_","spṛś","V","spṛś","_","_"
7,"'nṛtaiḥ","_","_","anṛta","JJ","","_","_"
1,"tayoḥ","_","_","tad","PRD","","_","_"
2,"saṃvadator","_","_","saṃvad","KDP","","_","_"
3,"evaṃ","_","_","eva","CX","","_","_"
4,"bhīmaseno","_","_","bhīmasa","NC","","_","_"
5,"'bravīd","_","_","abravīta","V","brū","_","_"
6,"idam","_","_","ida","PRD","","_","_"
1,"_","_","_","śru","CGDA","","_","_"
2,"_","_","_","eva","CEM","","_","_"
3,"taṃ","_","_","tad","PRD","","_","_"
4,"_","_","_","mahat","JJ","","_","_"
5,"_","_","_","rāja","NC","","_","_"
6,"_","_","_","vadha","NC","","_","_"
7,"_","_","_","upāya","NC","","_","_"
8,"mahātmanaḥ","_","_","mahātman","JJ","","_","_"
1,"gāhamānasya","_","_","gāh","KDP","","_","_"
2,"te","_","_","tvat","PPR","","_","_"
3,"senāṃ","_","_","senā","NC","","_","_"
4,"_","_","_","mālava","NC","","_","_"
5,"_","_","_","indravarman","NC","","_","_"
1,"_","_","_","aśvatthāman","NC","","_","_"
2,"_","_","_","iti","CQT","","_","_"
3,"vikhyāto","_","_","vikhyā","PPP","","_","_"
4,"gajaḥ","_","_","gaja","NC","","_","_"
5,"_","_","_","śakra","NC","","_","_"
6,"_","_","_","gaja","NC","","_","_"
7,"_","_","_","upama","JJ","","_","_"
1,"nihato","_","_","nihan","PPP","","_","_"
2,"yudhi","_","_","yudh","NC","","_","_"
3,"vikramya","_","_","vikra","CGDA","","_","_"
4,"tato","_","_","tatas","CX","","_","_"
5,"'haṃ","_","_","mat","PPR","","_","_"
6,"droṇam","_","_","droṇa","NC","","_","_"
7,"abruvam","_","_","abravīta","V","brū","_","_"
1,"aśvatthāmā","_","_","aśvatthāman","NC","","_","_"
2,"hato","_","_","han","PPP","","_","_"
3,"_","_","_","brahman","NC","","_","_"
4,"_","_","_","nivart","V","nivṛt","_","_"
5,"_","_","_","āhava","NC","","_","_"
6,"iti","_","_","iti","CQT","","_","_"
1,"nūnaṃ","_","_","nūna","CX","","_","_"
2,"nāśraddadhad","_","_","vākya","NC","","_","_"
3,"vākyam","_","_","tad","PRD","","_","_"
4,"eṣa","_","_","mat","PPR","","_","_"
5,"_","_","_","puruṣa","NC","","_","_"
6,"_","_","_","ṛṣabha","NC","","_","_"
1,"sa","_","_","tad","PRD","","_","_"
2,"tvaṃ","_","_","tvat","PPR","","_","_"
3,"_","_","_","govinda","NC","","_","_"
4,"_","_","_","vākya","NC","","_","_"
5,"mānayasva","_","_","mānay","V","mānay","_","_"
6,"_","_","_","jaya","NC","","_","_"
7,"_","_","_","eṣin","JJ","","_","_"
1,"droṇāya","_","_","droṇa","NC","","_","_"
2,"nihataṃ","_","_","nihan","PPP","","_","_"
3,"śaṃsa","_","_","śaṃs","V","śaṃs","_","_"
4,"rājañ","_","_","rājan","NC","","_","_"
5,"_","_","_","śāradvatī","NC","","_","_"
6,"_","_","_","suta","NC","","_","_"
1,"_","_","_","tvat","PPR","","_","_"
2,"_","_","_","vac","PPP","","_","_"
3,"_","_","_","na","CNG","","_","_"
4,"_","_","_","tad","PRD","","_","_"
5,"yudhyeta","_","_","yudh","V","yudh","_","_"
6,"jātu","_","_","jātu","CX","","_","_"
7,"rājan","_","_","rājan","NC","","_","_"
8,"dvijarṣabhaḥ","_","_","dvijarṣabha","NC","","_","_"
1,"satyavān","_","_","satyavat","JJ","","_","_"
2,"hi","_","_","hi","CX","","_","_"
3,"_","_","_","nṛ","NC","","_","_"
4,"_","_","_","loka","NC","","_","_"
5,"'smin","_","_","ida","PRD","","_","_"
6,"bhavān","_","_","bhavat","JJ","","_","_"
7,"khyāto","_","_","khyā","PPP","","_","_"
8,"janādhipa","_","_","janādhipa","NC","","_","_"
1,"tasya","_","_","tad","PRD","","_","_"
2,"tad","_","_","tad","PRD","","_","_"
3,"vacanaṃ","_","_","vacana","NC","","_","_"
4,"śrutvā","_","_","śru","CGDA","","_","_"
5,"_","_","_","kṛṣṇa","NC","","_","_"
6,"_","_","_","vākya","NC","","_","_"
7,"_","_","_","pracoday","PPP","","_","_"
1,"_","_","_","bhāvin","JJ","","_","_"
3,"_","_","_","ca","CCD","","_","_"
4,"_","_","_","mahat","JJ","","_","_"
5,"_","_","_","rāja","NC","","_","_"
6,"vaktuṃ","_","_","vac","CGDI","","_","_"
7,"samupacakrame","_","_","samupakra","V","samupakra","_","_"
1,"tam","_","_","tad","PRD","","_","_"
2,"_","_","_","atathya","JJ","","_","_"
3,"_","_","_","bhaya","NC","","_","_"
4,"magno","_","_","majj","PPP","","_","_"
5,"jaye","_","_","jaya","NC","","_","_"
6,"sakto","_","_","sañj","PPP","","_","_"
7,"yudhiṣṭhiraḥ","_","_","yudhiṣṭhira","NC","","_","_"
1,"avyaktam","_","_","avyakta","JJ","","_","_"
2,"abravīd","_","_","abravīta","V","brū","_","_"
3,"rājan","_","_","rājan","NC","","_","_"
4,"hataḥ","_","_","han","PPP","","_","_"
5,"kuñjara","_","_","kuñjara","NC","","_","_"
6,"_","_","_","iti","CQT","","_","_"
7,"_","_","_","uta","CCD","","_","_"
1,"tasya","_","_","tad","PRD","","_","_"
2,"pūrvaṃ","_","_","pūrva","CX","","_","_"
3,"rathaḥ","_","_","ratha","NC","","_","_"
4,"_","_","_","pṛthvī","NC","","_","_"
5,"_","_","_","catur","NUM","","_","_"
6,"_","_","_","aṅgula","NC","","_","_"
7,"uttaraḥ","_","_","uttara","JJ","","_","_"
1,"_","_","_","bhav","V","bhū","_","_"
2,"_","_","_","eva","CX","","_","_"
3,"tu","_","_","tu","CCD","","_","_"
4,"_","_","_","tad","PRD","","_","_"
5,"_","_","_","vac","PPP","","_","_"
6,"tasya","_","_","tad","PRD","","_","_"
7,"_","_","_","vāha","NC","","_","_"
8,"_","_","_","spṛś","V","spṛś","_","_"
9,"_","_","_","mahī","NC","","_","_"
1,"yudhiṣṭhirāt","_","_","yudhiṣṭhira","NC","","_","_"
2,"tu","_","_","tu","CCD","","_","_"
3,"tad","_","_","tad","PRD","","_","_"
4,"vākyaṃ","_","_","vākya","NC","","_","_"
5,"śrutvā","_","_","śru","CGDA","","_","_"
6,"droṇo","_","_","droṇa","NC","","_","_"
7,"_","_","_","mahat","JJ","","_","_"
8,"_","_","_","ratha","NC","","_","_"
1,"_","_","_","putra","NC","","_","_"
2,"_","_","_","vyasana","NC","","_","_"
3,"_","_","_","saṃtap","PPP","","_","_"
4,"nirāśo","_","_","nirāśa","JJ","","_","_"
5,"jīvite","_","_","jīvita","NC","","_","_"
6,"'bhavat","_","_","bhav","V","bhū","_","_"
1,"āgaskṛtam","_","_","āgaskṛt","JJ","","_","_"
2,"_","_","_","iva","CCM","","_","_"
3,"_","_","_","ātman","NC","","_","_"
4,"pāṇḍavānāṃ","_","_","pāṇḍava","NC","","_","_"
5,"mahātmanām","_","_","mahātman","JJ","","_","_"
1,"_","_","_","ṛṣi","NC","","_","_"
2,"_","_","_","vākya","NC","","_","_"
3,"ca","_","_","ca","CCD","","_","_"
4,"manvānaḥ","_","_","man","KDP","","_","_"
5,"śrutvā","_","_","śru","CGDA","","_","_"
6,"ca","_","_","ca","CCD","","_","_"
7,"nihataṃ","_","_","nihan","PPP","","_","_"
8,"sutam","_","_","suta","NC","","_","_"
1,"vicetāḥ","_","_","vicetas","JJ","","_","_"
2,"_","_","_","parama","JJ","","_","_"
3,"_","_","_","udvij","PPP","","_","_"
4,"dhṛṣṭadyumnam","_","_","dhṛṣṭadyumna","NC","","_","_"
5,"avekṣya","_","_","avekṣ","CGDA","","_","_"
6,"ca","_","_","ca","CCD","","_","_"
1,"yoddhuṃ","_","_","yudh","CGDI","","_","_"
2,"_","_","_","na","CNG","","_","_"
3,"_","_","_","aśaknuvat","JJ","","_","_"
4,"rājan","_","_","rājan","NC","","_","_"
5,"_","_","_","yathā","CCM","","_","_"
6,"_","_","_","pūrva","CX","","_","_"
7,"ariṃdama","_","_","ariṃdama","JJ","","_","_"
1,"taṃ","_","_","tad","PRD","","_","_"
2,"dṛṣṭvā","_","_","dṛś","CGDA","","_","_"
3,"_","_","_","parama","JJ","","_","_"
4,"_","_","_","udvij","PPP","","_","_"
5,"_","_","_","śoka","NC","","_","_"
6,"_","_","_","upahan","PPP","","_","_"
7,"_","_","_","cetas","NC","","_","_"
1,"_","_","_","pāñcāla","NC","","_","_"
2,"_","_","_","rāja","NC","","_","_"
3,"suto","_","_","suta","NC","","_","_"
4,"dhṛṣṭadyumnaḥ","_","_","dhṛṣṭadyumna","NC","","_","_"
5,"samādravat","_","_","samādru","V","samādru","_","_"
1,"ya","_","_","yad","PRL","","_","_"
2,"iṣṭvā","_","_","yaj","CGDA","","_","_"
3,"_","_","_","manuja","NC","","_","_"
4,"_","_","_","indra","NC","","_","_"
5,"drupadena","_","_","drupada","NC","","_","_"
6,"_","_","_","mahat","JJ","","_","_"
7,"_","_","_","makha","NC","","_","_"
1,"labdho","_","_","labh","PPP","","_","_"
2,"_","_","_","droṇa","NC","","_","_"
3,"_","_","_","vināśa","NC","","_","_"
4,"_","_","_","samindh","PPP","","_","_"
5,"_","_","_","havyavāhana","NC","","_","_"
1,"sa","_","_","tad","PRD","","_","_"
2,"dhanur","_","_","dhanus","NC","","_","_"
3,"jaitram","_","_","jaitra","JJ","","_","_"
4,"ādāya","_","_","ādā","CGDA","","_","_"
5,"ghoraṃ","_","_","ghora","JJ","","_","_"
6,"_","_","_","jalada","NC","","_","_"
7,"_","_","_","nisvana","NC","","_","_"
1,"_","_","_","dṛḍha","JJ","","_","_"
2,"_","_","_","jyā","NC","","_","_"
3,"ajaraṃ","_","_","ajara","JJ","","_","_"
4,"divyaṃ","_","_","divya","JJ","","_","_"
5,"_","_","_","śara","NC","","_","_"
6,"_","_","_","ca","CCD","","_","_"
7,"_","_","_","āśīviṣa","NC","","_","_"
8,"_","_","_","upama","JJ","","_","_"
1,"saṃdadhe","_","_","saṃdadh","V","saṃdhā","_","_"
2,"kārmuke","_","_","kārmuka","NC","","_","_"
3,"tasmiñ","_","_","tad","PRD","","_","_"
4,"śaram","_","_","śara","NC","","_","_"
5,"_","_","_","āśīviṣa","NC","","_","_"
6,"_","_","_","upama","JJ","","_","_"
1,"droṇaṃ","_","_","droṇa","NC","","_","_"
2,"jighāṃsuḥ","_","_","jighāṃsu","JJ","","_","_"
3,"pāñcālyo","_","_","pāñcālya","JJ","","_","_"
4,"_","_","_","mahat","JJ","","_","_"
5,"_","_","_","jvālā","NC","","_","_"
6,"_","_","_","iva","CCM","","_","_"
7,"_","_","_","anala","NC","","_","_"
1,"tasya","_","_","tad","PRD","","_","_"
2,"rūpaṃ","_","_","rūpa","NC","","_","_"
3,"_","_","_","śara","NC","","_","_"
4,"_","_","_","as","V","as","_","_"
5,"_","_","_","dhanus","NC","","_","_"
6,"_","_","_","jyā","NC","","_","_"
7,"_","_","_","maṇḍala","NC","","_","_"
8,"_","_","_","antara","NC","","_","_"
1,"dyotato","_","_","dyut","KDP","","_","_"
2,"_","_","_","bhāskara","NC","","_","_"
3,"_","_","_","iva","CCM","","_","_"
4,"_","_","_","ghana","NC","","_","_"
5,"_","_","_","anta","NC","","_","_"
1,"pārṣatena","_","_","pārṣata","NC","","_","_"
2,"parāmṛṣṭaṃ","_","_","parāmṛś","PPP","","_","_"
3,"jvalantam","_","_","jval","KDP","","_","_"
4,"iva","_","_","iva","CCM","","_","_"
5,"tad","_","_","tad","PRD","","_","_"
6,"dhanuḥ","_","_","dhanus","NC","","_","_"
1,"_","_","_","anta","NC","","_","_"
2,"_","_","_","kāla","NC","","_","_"
3,"iva","_","_","iva","CCM","","_","_"
4,"prāptaṃ","_","_","prāp","PPP","","_","_"
5,"menire","_","_","man","V","man","_","_"
6,"vīkṣya","_","_","vīkṣ","CGDA","","_","_"
7,"sainikāḥ","_","_","sainika","NC","","_","_"
1,"tam","_","_","tad","PRD","","_","_"
2,"iṣuṃ","_","_","iṣu","NC","","_","_"
3,"saṃhitaṃ","_","_","saṃdhā","PPP","","_","_"
4,"tena","_","_","tad","PRD","","_","_"
5,"bhāradvājaḥ","_","_","bhāradvāja","NC","","_","_"
6,"pratāpavān","_","_","pratāpavat","JJ","","_","_"
1,"_","_","_","dṛś","CGDA","","_","_"
2,"_","_","_","man","V","man","_","_"
3,"dehasya","_","_","deha","NC","","_","_"
4,"_","_","_","kāla","NC","","_","_"
5,"_","_","_","paryāya","NC","","_","_"
6,"āgatam","_","_","āga","PPP","","_","_"
1,"tataḥ","_","_","tatas","CX","","_","_"
2,"sa","_","_","tad","PRD","","_","_"
3,"yatnam","_","_","yatna","NC","","_","_"
4,"ātiṣṭhad","_","_","ātiṣṭh","V","āsthā","_","_"
5,"_","_","_","ācārya","NC","","_","_"
6,"_","_","_","tad","PRD","","_","_"
7,"vāraṇe","_","_","vāraṇa","NC","","_","_"
1,"na","_","_","na","CNG","","_","_"
2,"_","_","_","ca","CCD","","_","_"
3,"_","_","_","ida","PRD","","_","_"
4,"_","_","_","astra","NC","","_","_"
5,"_","_","_","rājan","NC","","_","_"
6,"_","_","_","indra","NC","","_","_"
7,"_","_","_","prāduras","V","prāduras","_","_"
8,"_","_","_","mahātman","JJ","","_","_"
1,"tasya","_","_","tad","PRD","","_","_"
2,"_","_","_","tu","CCD","","_","_"
3,"_","_","_","ahar","NC","","_","_"
4,"catvāri","_","_","catur","NUM","","_","_"
5,"kṣapā","_","_","kṣapā","NC","","_","_"
6,"_","_","_","ca","CCD","","_","_"
7,"_","_","_","eka","PPX","","_","_"
8,"_","_","_","as","KDP","","_","_"
9,"gatā","_","_","ga","PPP","","_","_"
1,"tasya","_","_","tad","PRD","","_","_"
2,"_","_","_","ca","CCD","","_","_"
3,"_","_","_","ahar","NC","","_","_"
4,"_","_","_","tri","NUM","","_","_"
5,"_","_","_","bhāga","NC","","_","_"
6,"kṣayaṃ","_","_","kṣaya","NC","","_","_"
7,"jagmuḥ","_","_","ga","V","ga","_","_"
8,"patatriṇaḥ","_","_","patatrin","NC","","_","_"
1,"sa","_","_","tad","PRD","","_","_"
2,"_","_","_","śara","NC","","_","_"
3,"_","_","_","kṣaya","NC","","_","_"
4,"āsādya","_","_","āsāday","CGDA","","_","_"
5,"_","_","_","putra","NC","","_","_"
6,"_","_","_","śoka","NC","","_","_"
7,"_","_","_","ca","CCD","","_","_"
8,"_","_","_","arday","PPP","","_","_"
1,"vividhānāṃ","_","_","vividha","JJ","","_","_"
2,"ca","_","_","ca","CCD","","_","_"
3,"divyānām","_","_","divya","JJ","","_","_"
4,"astrāṇām","_","_","astra","NC","","_","_"
5,"_","_","_","aprasanna","JJ","","_","_"
1,"_","_","_","utsraṣṭu","NC","","_","_"
2,"_","_","_","kāma","NC","","_","_"
3,"śastrāṇi","_","_","śastra","NC","","_","_"
4,"_","_","_","vipra","NC","","_","_"
5,"_","_","_","vākya","NC","","_","_"
6,"_","_","_","abhicoday","PPP","","_","_"
1,"tejasā","_","_","tejas","NC","","_","_"
2,"_","_","_","preray","KDP","","_","_"
3,"_","_","_","ca","CCD","","_","_"
4,"yuyudhe","_","_","yudh","V","yudh","_","_"
5,"so","_","_","tad","PRD","","_","_"
6,"_","_","_","ati","CADP","","_","_"
7,"_","_","_","mānuṣa","JJ","","_","_"
1,"_","_","_","atha","CAD","","_","_"
2,"_","_","_","anya","PPX","","_","_"
3,"sa","_","_","tad","PRD","","_","_"
4,"samādāya","_","_","samādā","CGDA","","_","_"
5,"divyam","_","_","divya","JJ","","_","_"
6,"āṅgirasaṃ","_","_","āṅgirasa","JJ","","_","_"
7,"dhanuḥ","_","_","dhanus","NC","","_","_"
1,"_","_","_","śara","NC","","_","_"
2,"_","_","_","ca","CCD","","_","_"
3,"_","_","_","brahmadaṇḍa","NC","","_","_"
4,"_","_","_","ābha","JJ","","_","_"
5,"dhṛṣṭadyumnam","_","_","dhṛṣṭadyumna","NC","","_","_"
6,"ayodhayat","_","_","yodhay","V","yodhay","_","_"
1,"_","_","_","tatas","CX","","_","_"
2,"_","_","_","tad","PRD","","_","_"
3,"_","_","_","śara","NC","","_","_"
4,"_","_","_","varṣa","NC","","_","_"
5,"mahatā","_","_","mahat","JJ","","_","_"
6,"samavākirat","_","_","samavakṛ","V","samavakṛ","_","_"
1,"_","_","_","viśātay","V","viśātay","_","_"
2,"_","_","_","ca","CCD","","_","_"
3,"saṃkruddho","_","_","saṃkrudh","PPP","","_","_"
4,"dhṛṣṭadyumnam","_","_","dhṛṣṭadyumna","NC","","_","_"
5,"amarṣaṇaḥ","_","_","amarṣaṇa","JJ","","_","_"
1,"taṃ","_","_","tad","PRD","","_","_"
2,"śaraṃ","_","_","śara","NC","","_","_"
3,"śatadhā","_","_","śatadhā","CX","","_","_"
4,"_","_","_","ca","CCD","","_","_"
5,"_","_","_","ida","PRD","","_","_"
6,"_","_","_","droṇa","NC","","_","_"
7,"_","_","_","chid","V","chid","_","_"
8,"sāyakaiḥ","_","_","sāyaka","NC","","_","_"
1,"dhvajaṃ","_","_","dhvaja","NC","","_","_"
2,"_","_","_","dhanus","NC","","_","_"
3,"_","_","_","ca","CCD","","_","_"
4,"niśitaiḥ","_","_","niśā","PPP","","_","_"
5,"sārathiṃ","_","_","sārathi","NC","","_","_"
6,"_","_","_","ca","CCD","","_","_"
7,"_","_","_","api","CX","","_","_"
8,"_","_","_","pātay","V","pātay","_","_"
1,"dhṛṣṭadyumnaḥ","_","_","dhṛṣṭadyumna","NC","","_","_"
2,"_","_","_","prahas","CGDA","","_","_"
3,"_","_","_","anya","PPX","","_","_"
4,"punar","_","_","punar","CAD","","_","_"
5,"ādāya","_","_","ādā","CGDA","","_","_"
6,"kārmukam","_","_","kārmuka","NC","","_","_"
1,"śitena","_","_","śā","PPP","","_","_"
2,"_","_","_","ca","CCD","","_","_"
3,"_","_","_","a","PRD","","_","_"
4,"bāṇena","_","_","bāṇa","NC","","_","_"
5,"pratyavidhyat","_","_","prativyadh","V","prativyadh","_","_"
6,"stanāntare","_","_","stanāntara","NC","","_","_"
1,"so","_","_","tad","PRD","","_","_"
2,"'tividdho","_","_","ativyadh","PPP","","_","_"
3,"_","_","_","mahat","JJ","","_","_"
4,"_","_","_","iṣvāsa","NC","","_","_"
5,"saṃbhrānta","_","_","sambhra","PPP","","_","_"
6,"iva","_","_","iva","CCM","","_","_"
7,"saṃyuge","_","_","saṃyuga","NC","","_","_"
1,"bhallena","_","_","bhalla","NC","","_","_"
2,"_","_","_","śā","PPP","","_","_"
3,"_","_","_","dhārā","NC","","_","_"
4,"_","_","_","chid","V","chid","_","_"
5,"_","_","_","ida","PRD","","_","_"
6,"mahad","_","_","mahat","JJ","","_","_"
7,"dhanuḥ","_","_","dhanus","NC","","_","_"
1,"_","_","_","yat","CSB","","_","_"
2,"_","_","_","ca","CCD","","_","_"
3,"_","_","_","ida","PRD","","_","_"
4,"bāṇaṃ","_","_","bāṇa","NC","","_","_"
5,"vikṛtaṃ","_","_","vikṛ","PPP","","_","_"
6,"dhanūṃṣi","_","_","dhanus","NC","","_","_"
7,"ca","_","_","ca","CCD","","_","_"
8,"viśāṃ","_","_","viś","NC","","_","_"
9,"pate","_","_","pati","NC","","_","_"
1,"sarvaṃ","_","_","sarva","JQ","","_","_"
2,"saṃchidya","_","_","saṃchid","CGDA","","_","_"
3,"durdharṣo","_","_","durdharṣa","JJ","","_","_"
4,"gadāṃ","_","_","gadā","NC","","_","_"
5,"khaḍgam","_","_","khaḍga","NC","","_","_"
6,"_","_","_","atha","CAD","","_","_"
7,"_","_","_","api","CX","","_","_"
8,"ca","_","_","ca","CCD","","_","_"
1,"dhṛṣṭadyumnaṃ","_","_","dhṛṣṭadyumna","NC","","_","_"
2,"tato","_","_","tatas","CX","","_","_"
3,"_","_","_","vyadh","V","vyadh","_","_"
4,"_","_","_","navan","NUM","","_","_"
5,"niśitaiḥ","_","_","niśā","PPP","","_","_"
6,"śaraiḥ","_","_","śara","NC","","_","_"
1,"_","_","_","jīvitānta","NC","","_","_"
2,"_","_","_","kara","JJ","","_","_"
3,"kruddhaḥ","_","_","krudh","PPP","","_","_"
4,"_","_","_","krudh","PPP","","_","_"
5,"_","_","_","rūpa","NC","","_","_"
6,"paraṃtapaḥ","_","_","paraṃtapa","JJ","","_","_"
1,"_","_","_","dhṛṣṭadyumna","NC","","_","_"
2,"_","_","_","ratha","NC","","_","_"
3,"_","_","_","aśva","NC","","_","_"
4,"_","_","_","sva","JJ","","_","_"
5,"_","_","_","ratha","NC","","_","_"
6,"_","_","_","aśva","NC","","_","_"
7,"_","_","_","mahat","JJ","","_","_"
8,"_","_","_","ratha","NC","","_","_"
1,"amiśrayad","_","_","miśray","V","miśray","_","_"
2,"_","_","_","ameya","JJ","","_","_"
3,"_","_","_","ātman","NC","","_","_"
4,"brāhmam","_","_","brāhma","JJ","","_","_"
5,"astram","_","_","astra","NC","","_","_"
6,"udīrayan","_","_","udīray","KDP","","_","_"
1,"te","_","_","tad","PRD","","_","_"
2,"miśrā","_","_","miśra","JJ","","_","_"
3,"_","_","_","bahu","JJ","","_","_"
4,"_","_","_","śubh","V","śubh","_","_"
5,"javanā","_","_","javana","NC","","_","_"
6,"_","_","_","vāta","NC","","_","_"
7,"_","_","_","raṃhas","NC","","_","_"
1,"_","_","_","pārāvata","NC","","_","_"
2,"_","_","_","savarṇa","JJ","","_","_"
3,"_","_","_","ca","CCD","","_","_"
4,"_","_","_","śoṇa","JJ","","_","_"
5,"_","_","_","ca","CCD","","_","_"
6,"_","_","_","bharata","NC","","_","_"
7,"_","_","_","ṛṣabha","NC","","_","_"
1,"yathā","_","_","yathā","CCM","","_","_"
2,"_","_","_","sa_saha","CX","","_","_"
3,"_","_","_","vidyut","NC","","_","_"
4,"meghā","_","_","megha","NC","","_","_"
5,"nadanto","_","_","nad","KDP","","_","_"
6,"jaladāgame","_","_","jaladāgama","NC","","_","_"
1,"tathā","_","_","tathā","CX","","_","_"
2,"rejur","_","_","reju","V","rāj","_","_"
3,"_","_","_","mahat","JJ","","_","_"
4,"_","_","_","rāja","NC","","_","_"
5,"miśritā","_","_","miśray","PPP","","_","_"
6,"_","_","_","raṇa","NC","","_","_"
7,"_","_","_","mūrdhan","NC","","_","_"
1,"_","_","_","īṣā","NC","","_","_"
2,"_","_","_","bandha","NC","","_","_"
3,"_","_","_","cakra","NC","","_","_"
4,"_","_","_","bandha","NC","","_","_"
5,"_","_","_","ratha","NC","","_","_"
6,"_","_","_","bandha","NC","","_","_"
7,"_","_","_","tathā","CX","","_","_"
8,"_","_","_","eva","CEM","","_","_"
9,"ca","_","_","ca","CCD","","_","_"
1,"praṇāśayad","_","_","praṇāśay","V","praṇāśay","_","_"
2,"_","_","_","ameya","JJ","","_","_"
3,"_","_","_","ātman","NC","","_","_"
4,"dhṛṣṭadyumnasya","_","_","dhṛṣṭadyumna","NC","","_","_"
5,"sa","_","_","tad","PRD","","_","_"
6,"dvijaḥ","_","_","dvija","NC","","_","_"
1,"sa","_","_","tad","PRD","","_","_"
2,"_","_","_","chid","PPP","","_","_"
3,"_","_","_","dhanvan","NC","","_","_"
4,"viratho","_","_","viratha","JJ","","_","_"
5,"_","_","_","han","PPP","","_","_"
6,"_","_","_","aśva","NC","","_","_"
7,"_","_","_","han","PPP","","_","_"
8,"_","_","_","sārathi","NC","","_","_"
1,"uttamām","_","_","uttama","JJ","","_","_"
2,"āpadaṃ","_","_","āpad","NC","","_","_"
3,"prāpya","_","_","prāp","CGDA","","_","_"
4,"gadāṃ","_","_","gadā","NC","","_","_"
5,"vīraḥ","_","_","vīra","NC","","_","_"
6,"parāmṛśat","_","_","parāmṛś","V","parāmṛś","_","_"
1,"tām","_","_","tad","PRD","","_","_"
2,"asya","_","_","ida","PRD","","_","_"
3,"_","_","_","viśikha","NC","","_","_"
4,"_","_","_","tīkṣṇa","JJ","","_","_"
5,"kṣipyamāṇāṃ","_","_","kṣip","KDP","","_","_"
6,"_","_","_","mahat","JJ","","_","_"
7,"_","_","_","ratha","NC","","_","_"
1,"nijaghāna","_","_","nihan","V","nihan","_","_"
2,"śarair","_","_","śara","NC","","_","_"
3,"droṇaḥ","_","_","droṇa","NC","","_","_"
4,"kruddhaḥ","_","_","krudh","PPP","","_","_"
5,"_","_","_","satya","JJ","","_","_"
6,"_","_","_","parākrama","NC","","_","_"
1,"tāṃ","_","_","tad","PRD","","_","_"
2,"dṛṣṭvā","_","_","dṛś","CGDA","","_","_"
3,"tu","_","_","tu","CCD","","_","_"
4,"_","_","_","nara","NC","","_","_"
5,"_","_","_","vyāghra","NC","","_","_"
6,"droṇena","_","_","droṇa","NC","","_","_"
7,"nihatāṃ","_","_","nihan","PPP","","_","_"
8,"śaraiḥ","_","_","śara","NC","","_","_"
1,"vimalaṃ","_","_","vimala","JJ","","_","_"
2,"khaḍgam","_","_","khaḍga","NC","","_","_"
3,"ādatta","_","_","ādad","V","ādā","_","_"
4,"_","_","_","śata","NUM","","_","_"
5,"_","_","_","candra","NC","","_","_"
6,"ca","_","_","ca","CCD","","_","_"
7,"bhānumat","_","_","bhānumat","JJ","","_","_"
1,"asaṃśayaṃ","_","_","asaṃśaya","CX","","_","_"
2,"tathābhūte","_","_","tathābhūta","JJ","","_","_"
3,"pāñcālyaḥ","_","_","pāñcālya","JJ","","_","_"
4,"_","_","_","sādhu","JJ","","_","_"
5,"_","_","_","man","V","man","_","_"
1,"vadham","_","_","vadha","NC","","_","_"
2,"_","_","_","ācārya","NC","","_","_"
3,"_","_","_","mukhya","JJ","","_","_"
4,"_","_","_","prāp","PPP","","_","_"
5,"_","_","_","kāla","NC","","_","_"
6,"mahātmanaḥ","_","_","mahātman","JJ","","_","_"
1,"tataḥ","_","_","tatas","CX","","_","_"
2,"_","_","_","sva","JJ","","_","_"
3,"_","_","_","rathanīḍa","NC","","_","_"
4,"_","_","_","stha","JJ","","_","_"
5,"_","_","_","sva","JJ","","_","_"
6,"_","_","_","ratha","NC","","_","_"
7,"_","_","_","ratha","NC","","_","_"
8,"_","_","_","īṣā","NC","","_","_"
1,"agacchad","_","_","ga","V","ga","_","_"
2,"asim","_","_","asi","NC","","_","_"
3,"udyamya","_","_","udya","CGDA","","_","_"
4,"_","_","_","śata","NUM","","_","_"
5,"_","_","_","candra","NC","","_","_"
6,"ca","_","_","ca","CCD","","_","_"
7,"bhānumat","_","_","bhānumat","JJ","","_","_"
1,"cikīrṣur","_","_","cikīrṣu","JJ","","_","_"
2,"duṣkaraṃ","_","_","duṣkara","JJ","","_","_"
3,"karma","_","_","karman","NC","","_","_"
4,"dhṛṣṭadyumno","_","_","dhṛṣṭadyumna","NC","","_","_"
5,"_","_","_","mahat","JJ","","_","_"
6,"_","_","_","ratha","NC","","_","_"
1,"iyeṣa","_","_","iṣ","V","iṣ","_","_"
2,"vakṣo","_","_","vakṣas","NC","","_","_"
3,"bhettuṃ","_","_","bhid","CGDI","","_","_"
4,"ca","_","_","ca","CCD","","_","_"
5,"bhāradvājasya","_","_","bhāradvāja","NC","","_","_"
6,"saṃyuge","_","_","saṃyuga","NC","","_","_"
1,"so","_","_","tad","PRD","","_","_"
2,"'tiṣṭhad","_","_","tiṣṭh","V","sthā","_","_"
3,"_","_","_","yuga","NC","","_","_"
4,"_","_","_","madhya","NC","","_","_"
5,"vai","_","_","vai","CX","","_","_"
6,"_","_","_","yuga","NC","","_","_"
7,"_","_","_","saṃnahana","NC","","_","_"
8,"ca","_","_","ca","CCD","","_","_"
1,"śoṇānāṃ","_","_","śoṇa","JJ","","_","_"
2,"_","_","_","jaghana","NC","","_","_"
3,"_","_","_","ardha","NC","","_","_"
4,"tat","_","_","tad","PRD","","_","_"
5,"sainyāḥ","_","_","sainya","NC","","_","_"
6,"samapūjayan","_","_","sampūjay","V","sampūjay","_","_"
1,"tiṣṭhato","_","_","sthā","KDP","","_","_"
2,"_","_","_","yuga","NC","","_","_"
3,"_","_","_","pāli","NC","","_","_"
4,"śoṇān","_","_","śoṇa","JJ","","_","_"
5,"_","_","_","api","CX","","_","_"
6,"_","_","_","adhiṣṭhā","KDP","","_","_"
1,"_","_","_","na","CNG","","_","_"
2,"_","_","_","paś","V","paś","_","_"
3,"antaraṃ","_","_","antara","NC","","_","_"
4,"_","_","_","droṇa","NC","","_","_"
5,"_","_","_","tad","PRD","","_","_"
6,"adbhutam","_","_","adbhuta","NC","","_","_"
7,"_","_","_","iva","CCM","","_","_"
8,"_","_","_","bhav","V","bhū","_","_"
1,"kṣipraṃ","_","_","kṣipra","CX","","_","_"
2,"śyenasya","_","_","śya","NC","","_","_"
3,"carato","_","_","car","KDP","","_","_"
4,"_","_","_","yathā","CCM","","_","_"
5,"_","_","_","eva","CEM","","_","_"
6,"_","_","_","āmiṣa","NC","","_","_"
7,"_","_","_","gṛddhin","JJ","","_","_"
1,"tadvad","_","_","tadvat","CX","","_","_"
2,"āsīd","_","_","as","V","as","_","_"
3,"abhīsāro","_","_","abhīsāra","NC","","_","_"
4,"droṇaṃ","_","_","droṇa","NC","","_","_"
5,"prārthayato","_","_","prārthay","KDP","","_","_"
6,"raṇe","_","_","raṇa","NC","","_","_"
1,"_","_","_","tad","PRD","","_","_"
2,"_","_","_","aśva","NC","","_","_"
3,"_","_","_","ratha","NC","","_","_"
4,"_","_","_","śakti","NC","","_","_"
5,"_","_","_","adas","PRD","","_","_"
6,"tadā","_","_","tadā","CAD","","_","_"
7,"kruddhaḥ","_","_","krudh","PPP","","_","_"
8,"parākramī","_","_","parākramin","JJ","","_","_"
1,"sarvān","_","_","sarva","JQ","","_","_"
2,"ekaikaśo","_","_","ekaikaśas","CX","","_","_"
3,"droṇaḥ","_","_","droṇa","NC","","_","_"
4,"_","_","_","kapota","NC","","_","_"
5,"_","_","_","ābha","JJ","","_","_"
6,"ajīghanat","_","_","han","V","han","_","_"
1,"te","_","_","tad","PRD","","_","_"
2,"hatā","_","_","han","PPP","","_","_"
3,"nyapatan","_","_","nipat","V","nipat","_","_"
4,"bhūmau","_","_","bhūmi","NC","","_","_"
5,"dhṛṣṭadyumnasya","_","_","dhṛṣṭadyumna","NC","","_","_"
6,"vājinaḥ","_","_","vājin","NC","","_","_"
1,"_","_","_","śoṇa","JJ","","_","_"
2,"_","_","_","ca","CCD","","_","_"
3,"paryamucyanta","_","_","parimuñc","V","parimuc","_","_"
4,"_","_","_","ratha","NC","","_","_"
5,"_","_","_","bandha","NC","","_","_"
6,"viśāṃ","_","_","viś","NC","","_","_"
7,"pate","_","_","pati","NC","","_","_"
1,"tān","_","_","tad","PRD","","_","_"
2,"_","_","_","haya","NC","","_","_"
3,"_","_","_","nihan","PPP","","_","_"
4,"dṛṣṭvā","_","_","dṛś","CGDA","","_","_"
5,"dvijāgryeṇa","_","_","dvijāgrya","NC","","_","_"
6,"sa","_","_","tad","PRD","","_","_"
7,"pārṣataḥ","_","_","pārṣata","NC","","_","_"
1,"_","_","_","na","CNG","","_","_"
2,"_","_","_","mṛṣ","V","mṛṣ","_","_"
3,"yudhāṃ","_","_","yudh","NC","","_","_"
4,"śreṣṭho","_","_","śreṣṭha","JJ","","_","_"
5,"yājñasenir","_","_","yājñaseni","NC","","_","_"
6,"_","_","_","mahat","JJ","","_","_"
7,"_","_","_","ratha","NC","","_","_"
1,"virathaḥ","_","_","viratha","JJ","","_","_"
2,"sa","_","_","tad","PRD","","_","_"
3,"gṛhītvā","_","_","grah","CGDA","","_","_"
4,"tu","_","_","tu","CCD","","_","_"
5,"khaḍgaṃ","_","_","khaḍga","NC","","_","_"
6,"_","_","_","khaḍga","NC","","_","_"
7,"_","_","_","bhṛt","JJ","","_","_"
8,"varaḥ","_","_","vara","JJ","","_","_"
1,"droṇam","_","_","droṇa","NC","","_","_"
2,"abhyapatad","_","_","abhipat","V","abhipat","_","_"
3,"rājan","_","_","rājan","NC","","_","_"
4,"vainateya","_","_","vainateya","NC","","_","_"
5,"_","_","_","iva","CCM","","_","_"
6,"_","_","_","uraga","NC","","_","_"
1,"tasya","_","_","tad","PRD","","_","_"
2,"rūpaṃ","_","_","rūpa","NC","","_","_"
3,"babhau","_","_","bhā","V","bhā","_","_"
4,"rājan","_","_","rājan","NC","","_","_"
5,"bhāradvājaṃ","_","_","bhāradvāja","NC","","_","_"
6,"jighāṃsataḥ","_","_","jighāṃs","KDP","","_","_"
1,"yathā","_","_","yathā","CCM","","_","_"
2,"rūpaṃ","_","_","rūpa","NC","","_","_"
3,"paraṃ","_","_","para","PPX","","_","_"
4,"viṣṇor","_","_","viṣṇu","NC","","_","_"
5,"hiraṇyakaśipor","_","_","hiraṇyakaśipu","NC","","_","_"
6,"vadhe","_","_","vadha","NC","","_","_"
1,"so","_","_","tad","PRD","","_","_"
2,"'carad","_","_","car","V","car","_","_"
3,"_","_","_","vividha","JJ","","_","_"
4,"_","_","_","mārga","NC","","_","_"
5,"prakārān","_","_","prakāra","NC","","_","_"
6,"ekaviṃśatim","_","_","ekaviṃśati","NC","","_","_"
1,"bhrāntam","_","_","bhrānta","NC","","_","_"
2,"udbhrāntam","_","_","udbhrānta","NC","","_","_"
3,"āviddham","_","_","āviddha","NC","","_","_"
4,"āplutaṃ","_","_","āpluta","NC","","_","_"
5,"prasṛtaṃ","_","_","prasṛta","NC","","_","_"
6,"sṛtam","_","_","sṛta","NC","","_","_"
1,"parivṛttaṃ","_","_","parivṛtta","NC","","_","_"
2,"nivṛttaṃ","_","_","nivṛtta","NC","","_","_"
3,"ca","_","_","ca","CCD","","_","_"
4,"khaḍgaṃ","_","_","khaḍga","NC","","_","_"
5,"carma","_","_","carman","NC","","_","_"
6,"ca","_","_","ca","CCD","","_","_"
7,"dhārayan","_","_","dhāray","KDP","","_","_"
1,"saṃpātaṃ","_","_","sampāta","NC","","_","_"
2,"samudīrṇaṃ","_","_","samudīr","PPP","","_","_"
3,"ca","_","_","ca","CCD","","_","_"
4,"darśayāmāsa","_","_","darśay","V","darśay","_","_"
5,"pārṣataḥ","_","_","pārṣata","NC","","_","_"
1,"tataḥ","_","_","tatas","CX","","_","_"
2,"_","_","_","śara","NC","","_","_"
3,"_","_","_","sahasra","NUM","","_","_"
4,"_","_","_","śata","NUM","","_","_"
5,"_","_","_","candra","NC","","_","_"
6,"apātayat","_","_","pātay","V","pātay","_","_"
1,"khaḍgaṃ","_","_","khaḍga","NC","","_","_"
2,"carma","_","_","carman","NC","","_","_"
3,"ca","_","_","ca","CCD","","_","_"
4,"saṃbādhe","_","_","sambādha","NC","","_","_"
5,"dhṛṣṭadyumnasya","_","_","dhṛṣṭadyumna","NC","","_","_"
6,"sa","_","_","tad","PRD","","_","_"
7,"dvijaḥ","_","_","dvija","NC","","_","_"
1,"te","_","_","tad","PRD","","_","_"
2,"tu","_","_","tu","CCD","","_","_"
3,"vaitastikā","_","_","vaitastika","JJ","","_","_"
4,"nāma","_","_","nāma","CX","","_","_"
5,"śarā","_","_","śara","NC","","_","_"
6,"_","_","_","hi","CX","","_","_"
7,"_","_","_","āsad","PPP","","_","_"
8,"_","_","_","ghātin","JJ","","_","_"
1,"_","_","_","nikṛṣṭa","JJ","","_","_"
2,"_","_","_","yuddha","NC","","_","_"
3,"droṇasya","_","_","droṇa","NC","","_","_"
4,"_","_","_","na","CNG","","_","_"
5,"_","_","_","anya","PPX","","_","_"
6,"santi","_","_","as","V","as","_","_"
7,"te","_","_","tad","PRD","","_","_"
8,"śarāḥ","_","_","śara","NC","","_","_"
1,"śāradvatasya","_","_","śāradvata","NC","","_","_"
2,"pārthasya","_","_","pārtha","NC","","_","_"
3,"drauṇer","_","_","drauṇi","NC","","_","_"
4,"vaikartanasya","_","_","vaikartana","NC","","_","_"
5,"ca","_","_","ca","CCD","","_","_"
1,"_","_","_","pradyumna","NC","","_","_"
2,"_","_","_","yuyudhāna","NC","","_","_"
3,"_","_","_","abhimanyu","NC","","_","_"
4,"_","_","_","ca","CCD","","_","_"
5,"te","_","_","tad","PRD","","_","_"
6,"śarāḥ","_","_","śara","NC","","_","_"
1,"_","_","_","atha","CAD","","_","_"
2,"_","_","_","ida","PRD","","_","_"
3,"_","_","_","iṣu","NC","","_","_"
4,"samādhatta","_","_","samādadh","V","samādhā","_","_"
5,"dṛḍhaṃ","_","_","dṛḍha","JJ","","_","_"
6,"_","_","_","parama","JJ","","_","_"
7,"_","_","_","saṃśā","PPP","","_","_"
1,"antevāsinam","_","_","antevāsin","NC","","_","_"
2,"ācāryo","_","_","ācārya","NC","","_","_"
3,"jighāṃsuḥ","_","_","jighāṃsu","JJ","","_","_"
4,"_","_","_","putra","NC","","_","_"
5,"_","_","_","saṃmā","PPP","","_","_"
1,"taṃ","_","_","tad","PRD","","_","_"
2,"śarair","_","_","śara","NC","","_","_"
3,"_","_","_","daśan","NUM","","_","_"
4,"_","_","_","tīkṣṇa","JJ","","_","_"
5,"_","_","_","chid","V","chid","_","_"
6,"_","_","_","śini","NC","","_","_"
7,"_","_","_","puṃgava","NC","","_","_"
1,"_","_","_","dṛś","KDP","","_","_"
2,"_","_","_","tvat","PPR","","_","_"
3,"putrasya","_","_","putra","NC","","_","_"
4,"karṇasya","_","_","karṇa","NC","","_","_"
5,"ca","_","_","ca","CCD","","_","_"
6,"mahātmanaḥ","_","_","mahātman","JJ","","_","_"
1,"grastam","_","_","gras","PPP","","_","_"
2,"_","_","_","ācārya","NC","","_","_"
3,"_","_","_","mukhya","JJ","","_","_"
4,"dhṛṣṭadyumnam","_","_","dhṛṣṭadyumna","NC","","_","_"
5,"amocayat","_","_","mocay","V","mocay","_","_"
1,"carantaṃ","_","_","car","KDP","","_","_"
2,"_","_","_","ratha","NC","","_","_"
3,"_","_","_","mārga","NC","","_","_"
4,"sātyakiṃ","_","_","sātyaki","NC","","_","_"
5,"_","_","_","satya","JJ","","_","_"
6,"_","_","_","vikrama","NC","","_","_"
1,"_","_","_","droṇa","NC","","_","_"
2,"_","_","_","karṇa","NC","","_","_"
3,"_","_","_","antara","NC","","_","_"
4,"_","_","_","ga","PPP","","_","_"
5,"_","_","_","kṛpa","NC","","_","_"
6,"_","_","_","api","CX","","_","_"
7,"ca","_","_","ca","CCD","","_","_"
8,"bhārata","_","_","bhārata","NC","","_","_"
1,"apaśyetāṃ","_","_","paś","V","paś","_","_"
2,"mahātmānau","_","_","mahātman","JJ","","_","_"
3,"_","_","_","viṣvaksa","NC","","_","_"
4,"_","_","_","dhanaṃjaya","NC","","_","_"
1,"apūjayetāṃ","_","_","pūjay","V","pūjay","_","_"
2,"vārṣṇeyaṃ","_","_","vārṣṇeya","NC","","_","_"
3,"bruvāṇau","_","_","brū","KDP","","_","_"
4,"sādhu","_","_","sādhu","JJ","","_","_"
5,"_","_","_","sādhu","JJ","","_","_"
6,"_","_","_","iti","CQT","","_","_"
1,"_","_","_","divya","JJ","","_","_"
2,"_","_","_","astra","NC","","_","_"
3,"sarveṣāṃ","_","_","sarva","JQ","","_","_"
4,"yudhi","_","_","yudh","NC","","_","_"
5,"nighnantam","_","_","nihan","KDP","","_","_"
6,"acyutam","_","_","acyuta","JJ","","_","_"
1,"abhipatya","_","_","abhipat","CGDA","","_","_"
2,"tataḥ","_","_","tatas","CX","","_","_"
3,"senāṃ","_","_","senā","NC","","_","_"
4,"_","_","_","viṣvaksa","NC","","_","_"
5,"_","_","_","dhanaṃjaya","NC","","_","_"
1,"_","_","_","dhanaṃjaya","NC","","_","_"
2,"_","_","_","tatas","CX","","_","_"
3,"kṛṣṇam","_","_","kṛṣṇa","NC","","_","_"
4,"abravīt","_","_","abravīta","V","brū","_","_"
5,"paśya","_","_","paś","V","paś","_","_"
6,"keśava","_","_","keśava","NC","","_","_"
1,"_","_","_","ācārya","NC","","_","_"
2,"_","_","_","vara","JJ","","_","_"
3,"_","_","_","mukhya","JJ","","_","_"
4,"madhye","_","_","madhya","NC","","_","_"
5,"_","_","_","krīḍ","KDP","","_","_"
6,"_","_","_","madhu","NC","","_","_"
7,"_","_","_","udvaha","NC","","_","_"
1,"ānandayati","_","_","ānand","V","ānand","_","_"
2,"māṃ","_","_","mat","PPR","","_","_"
3,"bhūyaḥ","_","_","bhūyas","CX","","_","_"
4,"sātyakiḥ","_","_","sātyaki","NC","","_","_"
5,"_","_","_","satya","JJ","","_","_"
6,"_","_","_","vikrama","NC","","_","_"
1,"_","_","_","mādrī","NC","","_","_"
2,"_","_","_","putra","NC","","_","_"
3,"ca","_","_","ca","CCD","","_","_"
4,"bhīmaṃ","_","_","bhīma","NC","","_","_"
5,"ca","_","_","ca","CCD","","_","_"
6,"rājānaṃ","_","_","rājan","NC","","_","_"
7,"ca","_","_","ca","CCD","","_","_"
8,"yudhiṣṭhiram","_","_","yudhiṣṭhira","NC","","_","_"
1,"_","_","_","yat","CSB","","_","_"
2,"_","_","_","śikṣā","NC","","_","_"
3,"_","_","_","anuddhata","JJ","","_","_"
4,"san","_","_","as","KDP","","_","_"
5,"raṇe","_","_","raṇa","NC","","_","_"
6,"carati","_","_","car","V","car","_","_"
7,"sātyakiḥ","_","_","sātyaki","NC","","_","_"
1,"_","_","_","mahat","JJ","","_","_"
2,"_","_","_","ratha","NC","","_","_"
3,"upakrīḍan","_","_","upakrīḍ","KDP","","_","_"
4,"vṛṣṇīnāṃ","_","_","vṛṣṇi","NC","","_","_"
5,"_","_","_","kīrti","NC","","_","_"
6,"_","_","_","vardhana","JJ","","_","_"
1,"tam","_","_","tad","PRD","","_","_"
2,"ete","_","_","tad","PRD","","_","_"
3,"pratinandanti","_","_","pratinand","V","pratinand","_","_"
4,"siddhāḥ","_","_","siddha","NC","","_","_"
5,"_","_","_","sainya","NC","","_","_"
6,"_","_","_","ca","CCD","","_","_"
7,"vismitāḥ","_","_","vismi","PPP","","_","_"
1,"ajayyaṃ","_","_","ajayya","JJ","","_","_"
2,"samare","_","_","samara","NC","","_","_"
3,"dṛṣṭvā","_","_","dṛś","CGDA","","_","_"
4,"sādhu","_","_","sādhu","JJ","","_","_"
5,"_","_","_","sādhu","JJ","","_","_"
6,"_","_","_","iti","CQT","","_","_"
7,"sātvatam","_","_","sātvata","NC","","_","_"
1,"_","_","_","yodha","NC","","_","_"
2,"_","_","_","ca","CCD","","_","_"
3,"_","_","_","ubhayatas","CX","","_","_"
4,"sarve","_","_","sarva","JQ","","_","_"
5,"karmabhiḥ","_","_","karman","NC","","_","_"
6,"samapūjayan","_","_","sampūjay","V","sampūjay","_","_"
