"WordID","word","NormSTEM","suffix","lemma","PoS","Root","NormSuffix","NormWord"
1,"arjuna","_","_","arjuna","NC","","_","_"
2,"uvāca","_","_","vak","V","vac","_","_"
1,"brahma","_","_","brahman","NC","","_","_"
2,"yat","_","_","yad","PRL","","_","_"
3,"paramaṃ","_","_","parama","JJ","","_","_"
4,"vedyaṃ","_","_","vid","KDG","","_","_"
5,"_","_","_","tad","PRD","","_","_"
6,"_","_","_","mat","PPR","","_","_"
7,"vyākhyātum","_","_","vyākhyā","CGDI","","_","_"
8,"arhasi","_","_","arh","V","arh","_","_"
1,"bhavato","_","_","bhavat","JJ","","_","_"
2,"hi","_","_","hi","CX","","_","_"
3,"prasādena","_","_","prasāda","NC","","_","_"
4,"sūkṣme","_","_","sūkṣma","JJ","","_","_"
5,"me","_","_","mat","PPR","","_","_"
6,"ramate","_","_","ram","V","ram","_","_"
7,"matiḥ","_","_","mati","NC","","_","_"
1,"vāsudeva","_","_","vāsudeva","NC","","_","_"
2,"uvāca","_","_","vak","V","vac","_","_"
1,"_","_","_","atra","CAD","","_","_"
2,"_","_","_","api","CX","","_","_"
3,"_","_","_","udāhṛ","V","udāhṛ","_","_"
4,"_","_","_","ida","PRD","","_","_"
5,"itihāsaṃ","_","_","itihāsa","NC","","_","_"
6,"purātanam","_","_","purātana","JJ","","_","_"
1,"saṃvādaṃ","_","_","saṃvāda","NC","","_","_"
2,"_","_","_","mokṣa","NC","","_","_"
3,"_","_","_","saṃyuj","PPP","","_","_"
4,"śiṣyasya","_","_","śiṣya","NC","","_","_"
5,"guruṇā","_","_","guru","NC","","_","_"
6,"saha","_","_","saha","CX","","_","_"
1,"kaścid","_","_","kiṃcit","PRI","","_","_"
2,"brāhmaṇam","_","_","brāhmaṇa","NC","","_","_"
3,"āsīnam","_","_","ās","PPP","","_","_"
4,"ācāryaṃ","_","_","ācārya","NC","","_","_"
5,"_","_","_","saṃśita","JJ","","_","_"
6,"_","_","_","vrata","NC","","_","_"
1,"śiṣyaḥ","_","_","śiṣya","NC","","_","_"
2,"papraccha","_","_","pṛcch","V","prach","_","_"
3,"medhāvī","_","_","medhāvin","JJ","","_","_"
4,"kiṃ","_","_","kiṃ","PRQ","","_","_"
5,"_","_","_","svid","CX","","_","_"
6,"_","_","_","śreyas","JJ","","_","_"
7,"paraṃtapa","_","_","paraṃtapa","JJ","","_","_"
1,"bhagavantaṃ","_","_","bhagavat","JJ","","_","_"
2,"prapanno","_","_","prapad","PPP","","_","_"
3,"'haṃ","_","_","mat","PPR","","_","_"
4,"_","_","_","niḥśreyasa","NC","","_","_"
5,"_","_","_","parāyaṇa","NC","","_","_"
1,"yāce","_","_","yāc","V","yāc","_","_"
2,"tvāṃ","_","_","tvat","PPR","","_","_"
3,"śirasā","_","_","śiras","NC","","_","_"
4,"vipra","_","_","vipra","NC","","_","_"
5,"yad","_","_","yad","PRL","","_","_"
6,"brūyāṃ","_","_","abravīta","V","brū","_","_"
7,"tad","_","_","tad","PRD","","_","_"
8,"vicakṣva","_","_","vicakṣ","V","vicakṣ","_","_"
9,"me","_","_","mat","PPR","","_","_"
1,"tam","_","_","tad","PRD","","_","_"
2,"evaṃvādinaṃ","_","_","evaṃvādin","JJ","","_","_"
3,"pārtha","_","_","pārtha","NC","","_","_"
4,"śiṣyaṃ","_","_","śiṣya","NC","","_","_"
5,"gurur","_","_","guru","NC","","_","_"
6,"uvāca","_","_","vak","V","vac","_","_"
7,"ha","_","_","ha","CEM","","_","_"
1,"kathayasva","_","_","kathay","V","kathay","_","_"
2,"pravakṣyāmi","_","_","pravak","V","pravac","_","_"
3,"yatra","_","_","yatra","CX","","_","_"
4,"te","_","_","tvat","PPR","","_","_"
5,"saṃśayo","_","_","saṃśaya","NC","","_","_"
6,"dvija","_","_","dvija","NC","","_","_"
1,"_","_","_","iti","CQT","","_","_"
2,"_","_","_","vac","PPP","","_","_"
3,"sa","_","_","tad","PRD","","_","_"
4,"_","_","_","kuru","NC","","_","_"
5,"_","_","_","śreṣṭha","JJ","","_","_"
6,"guruṇā","_","_","guru","NC","","_","_"
7,"_","_","_","guru","NC","","_","_"
8,"_","_","_","vatsala","JJ","","_","_"
1,"prāñjaliḥ","_","_","prāñjali","JJ","","_","_"
2,"paripapraccha","_","_","paripracch","V","paripracch","_","_"
3,"yat","_","_","yad","PRL","","_","_"
4,"_","_","_","tad","PRD","","_","_"
5,"_","_","_","śṛṇ","V","śru","_","_"
6,"mahāmate","_","_","mahāmati","JJ","","_","_"
1,"śiṣya","_","_","śiṣya","NC","","_","_"
2,"uvāca","_","_","vak","V","vac","_","_"
1,"_","_","_","kutas","CX","","_","_"
2,"_","_","_","ca","CCD","","_","_"
3,"_","_","_","mat","PPR","","_","_"
4,"_","_","_","kutas","CX","","_","_"
5,"_","_","_","ca","CCD","","_","_"
6,"tvaṃ","_","_","tvat","PPR","","_","_"
7,"tat","_","_","tad","PRD","","_","_"
8,"satyaṃ","_","_","satya","NC","","_","_"
9,"brūhi","_","_","abravīta","V","brū","_","_"
10,"yat","_","_","yad","PRL","","_","_"
11,"param","_","_","para","PPX","","_","_"
1,"kuto","_","_","kutas","CX","","_","_"
2,"jātāni","_","_","jan","PPP","","_","_"
3,"bhūtāni","_","_","bhūta","NC","","_","_"
4,"sthāvarāṇi","_","_","sthāvara","JJ","","_","_"
5,"carāṇi","_","_","cara","JJ","","_","_"
6,"ca","_","_","ca","CCD","","_","_"
1,"kena","_","_","kiṃ","PRQ","","_","_"
2,"jīvanti","_","_","jīv","V","jīv","_","_"
3,"bhūtāni","_","_","bhūta","NC","","_","_"
4,"teṣām","_","_","tad","PRD","","_","_"
5,"āyuḥ","_","_","āyus","NC","","_","_"
6,"kimātmakam","_","_","kimātmaka","JJ","","_","_"
1,"kiṃ","_","_","kiṃ","PRQ","","_","_"
2,"satyaṃ","_","_","satya","NC","","_","_"
3,"kiṃ","_","_","kiṃ","PRQ","","_","_"
4,"tapo","_","_","tapas","NC","","_","_"
5,"vipra","_","_","vipra","NC","","_","_"
6,"ke","_","_","kiṃ","PRQ","","_","_"
7,"guṇāḥ","_","_","guṇa","NC","","_","_"
8,"sadbhir","_","_","sat","JJ","","_","_"
9,"īritāḥ","_","_","īray","PPP","","_","_"
1,"ke","_","_","kiṃ","PRQ","","_","_"
2,"panthānaḥ","_","_","pathin","NC","","_","_"
3,"śivāḥ","_","_","śiva","JJ","","_","_"
4,"santi","_","_","as","V","as","_","_"
5,"kiṃ","_","_","kiṃ","PRQ","","_","_"
6,"sukhaṃ","_","_","sukha","NC","","_","_"
7,"kiṃ","_","_","kiṃ","PRQ","","_","_"
8,"ca","_","_","ca","CCD","","_","_"
9,"duṣkṛtam","_","_","duṣkṛta","NC","","_","_"
1,"_","_","_","tad","PRD","","_","_"
2,"_","_","_","mat","PPR","","_","_"
3,"bhagavan","_","_","bhagavat","JJ","","_","_"
4,"praśnān","_","_","praśna","NC","","_","_"
5,"yāthātathyena","_","_","yāthātathya","NC","","_","_"
6,"sattama","_","_","sattama","JJ","","_","_"
1,"vaktum","_","_","vac","CGDI","","_","_"
2,"arhasi","_","_","arh","V","arh","_","_"
3,"viprarṣe","_","_","viprarṣi","NC","","_","_"
4,"yathāvad","_","_","yathāvat","CX","","_","_"
5,"iha","_","_","iha","CAD","","_","_"
6,"tattvataḥ","_","_","tattva","NC","","_","_"
1,"vāsudeva","_","_","vāsudeva","NC","","_","_"
2,"uvāca","_","_","vak","V","vac","_","_"
1,"tasmai","_","_","tad","PRD","","_","_"
2,"sampratipannāya","_","_","sampratipad","PPP","","_","_"
3,"yathāvat","_","_","yathāvat","CX","","_","_"
4,"paripṛcchate","_","_","paripracch","KDP","","_","_"
1,"śiṣyāya","_","_","śiṣya","NC","","_","_"
2,"_","_","_","guṇa","NC","","_","_"
3,"_","_","_","yuj","PPP","","_","_"
4,"śāntāya","_","_","śa","PPP","","_","_"
5,"_","_","_","guru","NC","","_","_"
6,"_","_","_","vartin","JJ","","_","_"
1,"_","_","_","chāyā","NC","","_","_"
2,"_","_","_","bhū","PPP","","_","_"
3,"dāntāya","_","_","da","PPP","","_","_"
4,"yataye","_","_","yati","NC","","_","_"
5,"brahmacāriṇe","_","_","brahmacārin","NC","","_","_"
1,"tān","_","_","tad","PRD","","_","_"
2,"praśnān","_","_","praśna","NC","","_","_"
3,"abravīt","_","_","abravīta","V","brū","_","_"
4,"pārtha","_","_","pārtha","NC","","_","_"
5,"medhāvī","_","_","medhāvin","JJ","","_","_"
6,"sa","_","_","tad","PRD","","_","_"
7,"_","_","_","dhṛ","PPP","","_","_"
8,"_","_","_","vrata","NC","","_","_"
1,"guruḥ","_","_","guru","NC","","_","_"
2,"_","_","_","kuru","NC","","_","_"
3,"_","_","_","kula","NC","","_","_"
4,"_","_","_","śreṣṭha","JJ","","_","_"
5,"samyak","_","_","samyak","CX","","_","_"
6,"sarvān","_","_","sarva","JQ","","_","_"
7,"ariṃdama","_","_","ariṃdama","JJ","","_","_"
1,"_","_","_","brahman","NC","","_","_"
2,"_","_","_","pravac","PPP","","_","_"
3,"idaṃ","_","_","ida","PRD","","_","_"
4,"dharmam","_","_","dharma","NC","","_","_"
5,"_","_","_","ṛṣi","NC","","_","_"
6,"_","_","_","pravara","JJ","","_","_"
7,"_","_","_","sev","PPP","","_","_"
1,"_","_","_","veda","NC","","_","_"
2,"_","_","_","vidyā","NC","","_","_"
3,"_","_","_","sama","PPX","","_","_"
4,"_","_","_","avāp","KDG","","_","_"
5,"_","_","_","tattva","NC","","_","_"
6,"_","_","_","bhūta","NC","","_","_"
7,"_","_","_","artha","NC","","_","_"
8,"_","_","_","bhāvana","JJ","","_","_"
1,"_","_","_","bhūta","NC","","_","_"
2,"_","_","_","bhavya","NC","","_","_"
3,"_","_","_","bhaviṣya","NC","","_","_"
4,"_","_","_","ādi","NC","","_","_"
5,"_","_","_","dharma","NC","","_","_"
6,"_","_","_","kāma","NC","","_","_"
7,"_","_","_","artha","NC","","_","_"
8,"_","_","_","niścaya","NC","","_","_"
1,"_","_","_","siddha","NC","","_","_"
2,"_","_","_","saṃgha","NC","","_","_"
3,"_","_","_","parijñā","PPP","","_","_"
4,"purākalpaṃ","_","_","purākalpa","NC","","_","_"
5,"sanātanam","_","_","sanātana","JJ","","_","_"
1,"pravakṣye","_","_","pravak","V","pravac","_","_"
2,"'haṃ","_","_","mat","PPR","","_","_"
3,"_","_","_","mahat","JJ","","_","_"
4,"_","_","_","prājña","JJ","","_","_"
5,"padam","_","_","pada","NC","","_","_"
6,"uttamam","_","_","uttama","JJ","","_","_"
7,"adya","_","_","adya","CX","","_","_"
8,"te","_","_","tvat","PPR","","_","_"
1,"buddhvā","_","_","budh","CGDA","","_","_"
2,"yad","_","_","yad","PRL","","_","_"
3,"iha","_","_","iha","CAD","","_","_"
4,"saṃsiddhā","_","_","saṃsidh","PPP","","_","_"
5,"_","_","_","bhav","V","bhū","_","_"
6,"_","_","_","iha","CAD","","_","_"
7,"manīṣiṇaḥ","_","_","manīṣin","JJ","","_","_"
1,"_","_","_","upaga","CGDA","","_","_"
2,"_","_","_","ṛṣi","NC","","_","_"
3,"pūrvaṃ","_","_","pūrva","CX","","_","_"
4,"jijñāsantaḥ","_","_","jijñās","KDP","","_","_"
5,"parasparam","_","_","paraspara","PRC","","_","_"
1,"_","_","_","bṛhaspati","NC","","_","_"
2,"_","_","_","bharadvāja","NC","","_","_"
3,"gautamo","_","_","gautama","NC","","_","_"
4,"_","_","_","bhārgava","NC","","_","_"
5,"_","_","_","tathā","CX","","_","_"
1,"vasiṣṭhaḥ","_","_","vasiṣṭha","NC","","_","_"
2,"_","_","_","kāśyapa","NC","","_","_"
3,"_","_","_","ca","CCD","","_","_"
4,"_","_","_","eva","CEM","","_","_"
5,"viśvāmitro","_","_","viśvāmitra","NC","","_","_"
6,"'trir","_","_","atri","NC","","_","_"
7,"eva","_","_","eva","CEM","","_","_"
8,"ca","_","_","ca","CCD","","_","_"
1,"mārgān","_","_","mārga","NC","","_","_"
2,"sarvān","_","_","sarva","JQ","","_","_"
3,"parikramya","_","_","parikra","CGDA","","_","_"
4,"pariśrāntāḥ","_","_","pariśra","PPP","","_","_"
5,"_","_","_","sva","JJ","","_","_"
6,"_","_","_","karman","NC","","_","_"
1,"ṛṣim","_","_","ṛṣi","NC","","_","_"
2,"āṅgirasaṃ","_","_","āṅgirasa","NC","","_","_"
3,"vṛddhaṃ","_","_","vṛddha","JJ","","_","_"
4,"puraskṛtya","_","_","puraskṛ","CGDA","","_","_"
5,"tu","_","_","tu","CCD","","_","_"
6,"te","_","_","tad","PRD","","_","_"
7,"dvijāḥ","_","_","dvija","NC","","_","_"
1,"dadṛśur","_","_","darś","V","dṛś","_","_"
2,"_","_","_","brahman","NC","","_","_"
3,"_","_","_","bhavana","NC","","_","_"
4,"brahmāṇaṃ","_","_","brahman","NC","","_","_"
5,"_","_","_","vī","PPP","","_","_"
6,"_","_","_","kalmaṣa","NC","","_","_"
1,"taṃ","_","_","tad","PRD","","_","_"
2,"praṇamya","_","_","praṇa","CGDA","","_","_"
3,"mahātmānaṃ","_","_","mahātman","JJ","","_","_"
4,"_","_","_","sukha","NC","","_","_"
5,"_","_","_","ās","PPP","","_","_"
6,"_","_","_","mahat","JJ","","_","_"
7,"_","_","_","ṛṣi","NC","","_","_"
1,"papracchur","_","_","pṛcch","V","prach","_","_"
2,"_","_","_","vinaya","NC","","_","_"
3,"_","_","_","upe","PPP","","_","_"
4,"niḥśreyasam","_","_","niḥśreyasa","NC","","_","_"
5,"idaṃ","_","_","ida","PRD","","_","_"
6,"param","_","_","para","PPX","","_","_"
1,"kathaṃ","_","_","katha","CX","","_","_"
2,"karma","_","_","karman","NC","","_","_"
3,"kriyāt","_","_","kar","V","kṛ","_","_"
4,"sādhu","_","_","sādhu","JJ","","_","_"
5,"kathaṃ","_","_","katha","CX","","_","_"
6,"mucyeta","_","_","muñc","V","muc","_","_"
7,"kilbiṣāt","_","_","kilbiṣa","NC","","_","_"
1,"ke","_","_","kiṃ","PRQ","","_","_"
2,"no","_","_","mat","PPR","","_","_"
3,"mārgāḥ","_","_","mārga","NC","","_","_"
4,"_","_","_","śiva","JJ","","_","_"
5,"_","_","_","ca","CCD","","_","_"
6,"syuḥ","_","_","as","V","as","_","_"
7,"kiṃ","_","_","kiṃ","PRQ","","_","_"
8,"satyaṃ","_","_","satya","NC","","_","_"
9,"kiṃ","_","_","kiṃ","PRQ","","_","_"
10,"ca","_","_","ca","CCD","","_","_"
11,"duṣkṛtam","_","_","duṣkṛta","NC","","_","_"
1,"_","_","_","kiṃ","PRQ","","_","_"
2,"_","_","_","ubh","PPX","","_","_"
3,"_","_","_","karman","NC","","_","_"
4,"_","_","_","pathin","NC","","_","_"
5,"_","_","_","mahat","JJ","","_","_"
7,"kena","_","_","kiṃ","PRQ","","_","_"
8,"vindati","_","_","vid","V","vid","_","_"
1,"pralayaṃ","_","_","pralaya","NC","","_","_"
2,"_","_","_","ca","CCD","","_","_"
3,"_","_","_","apavarga","NC","","_","_"
4,"ca","_","_","ca","CCD","","_","_"
5,"bhūtānāṃ","_","_","bhūta","NC","","_","_"
6,"_","_","_","prabhava","NC","","_","_"
7,"_","_","_","apyaya","NC","","_","_"
1,"_","_","_","iti","CQT","","_","_"
2,"_","_","_","vac","PPP","","_","_"
3,"sa","_","_","tad","PRD","","_","_"
4,"_","_","_","muni","NC","","_","_"
5,"_","_","_","śreṣṭha","JJ","","_","_"
6,"yad","_","_","yad","PRL","","_","_"
7,"āha","_","_","ah","V","ah","_","_"
8,"prapitāmahaḥ","_","_","prapitāmaha","NC","","_","_"
1,"tat","_","_","tad","PRD","","_","_"
2,"te","_","_","tvat","PPR","","_","_"
3,"'haṃ","_","_","mat","PPR","","_","_"
4,"sampravakṣyāmi","_","_","saṃpravak","V","saṃpravac","_","_"
5,"śṛṇu","_","_","śṛṇ","V","śru","_","_"
6,"śiṣya","_","_","śiṣya","NC","","_","_"
7,"yathāgamam","_","_","yathāgama","JJ","","_","_"
1,"_","_","_","brahman","NC","","_","_"
2,"_","_","_","vak","V","vac","_","_"
1,"satyād","_","_","satya","NC","","_","_"
2,"bhūtāni","_","_","bhūta","NC","","_","_"
3,"jātāni","_","_","jan","PPP","","_","_"
4,"sthāvarāṇi","_","_","sthāvara","JJ","","_","_"
5,"carāṇi","_","_","cara","JJ","","_","_"
6,"ca","_","_","ca","CCD","","_","_"
1,"tapasā","_","_","tapas","NC","","_","_"
2,"tāni","_","_","tad","PRD","","_","_"
3,"jīvanti","_","_","jīv","V","jīv","_","_"
4,"iti","_","_","iti","CQT","","_","_"
5,"tad","_","_","tad","PRD","","_","_"
6,"vitta","_","_","vid","V","vid","_","_"
7,"suvratāḥ","_","_","suvrata","JJ","","_","_"
1,"svāṃ","_","_","sva","JJ","","_","_"
2,"yoniṃ","_","_","yoni","NC","","_","_"
3,"punar","_","_","punar","CAD","","_","_"
4,"āgamya","_","_","āga","CGDA","","_","_"
5,"vartante","_","_","vart","V","vṛt","_","_"
6,"svena","_","_","sva","JJ","","_","_"
7,"karmaṇā","_","_","karman","NC","","_","_"
1,"satyaṃ","_","_","satya","NC","","_","_"
2,"hi","_","_","hi","CX","","_","_"
3,"_","_","_","guṇa","NC","","_","_"
4,"_","_","_","saṃyuj","PPP","","_","_"
5,"niyataṃ","_","_","niya","PPP","","_","_"
6,"_","_","_","pañcan","NUM","","_","_"
7,"_","_","_","lakṣaṇa","NC","","_","_"
1,"brahma","_","_","brahman","NC","","_","_"
2,"satyaṃ","_","_","satya","NC","","_","_"
3,"tapaḥ","_","_","tapas","NC","","_","_"
4,"satyaṃ","_","_","satya","NC","","_","_"
5,"satyaṃ","_","_","satya","NC","","_","_"
6,"_","_","_","ca","CCD","","_","_"
7,"_","_","_","eva","CEM","","_","_"
8,"prajāpatiḥ","_","_","prajāpati","NC","","_","_"
1,"satyād","_","_","satya","NC","","_","_"
2,"bhūtāni","_","_","bhūta","NC","","_","_"
3,"jātāni","_","_","jan","PPP","","_","_"
4,"bhūtaṃ","_","_","bhū","PPP","","_","_"
5,"_","_","_","satya","NC","","_","_"
6,"_","_","_","maya","JJ","","_","_"
7,"mahat","_","_","mahat","JJ","","_","_"
1,"tasmāt","_","_","tasmāt","CX","","_","_"
2,"_","_","_","satya","NC","","_","_"
3,"_","_","_","āśraya","NC","","_","_"
4,"viprā","_","_","vipra","NC","","_","_"
5,"nityaṃ","_","_","nitya","CX","","_","_"
6,"_","_","_","yoga","NC","","_","_"
7,"_","_","_","parāyaṇa","NC","","_","_"
1,"_","_","_","atī","PPP","","_","_"
2,"_","_","_","krodha","NC","","_","_"
3,"_","_","_","saṃtāpa","NC","","_","_"
4,"niyatā","_","_","niya","PPP","","_","_"
5,"_","_","_","dharma","NC","","_","_"
6,"_","_","_","setu","NC","","_","_"
1,"_","_","_","anyonya","PRC","","_","_"
2,"_","_","_","niya","PPP","","_","_"
3,"vaidyān","_","_","vaidya","NC","","_","_"
4,"_","_","_","dharma","NC","","_","_"
5,"_","_","_","setu","NC","","_","_"
6,"_","_","_","pravartaka","JJ","","_","_"
1,"tān","_","_","tad","PRD","","_","_"
2,"ahaṃ","_","_","mat","PPR","","_","_"
3,"sampravakṣyāmi","_","_","saṃpravak","V","saṃpravac","_","_"
4,"śāśvatān","_","_","śāśvata","JJ","","_","_"
5,"_","_","_","loka","NC","","_","_"
6,"_","_","_","bhāvana","JJ","","_","_"
1,"cāturvidyaṃ","_","_","cāturvidya","NC","","_","_"
2,"tathā","_","_","tathā","CX","","_","_"
3,"_","_","_","varṇa","NC","","_","_"
4,"_","_","_","catur","NUM","","_","_"
5,"_","_","_","ca","CCD","","_","_"
6,"_","_","_","āśrama","NC","","_","_"
7,"pṛthak","_","_","pṛthak","CX","","_","_"
1,"dharmam","_","_","dharma","NC","","_","_"
2,"ekaṃ","_","_","eka","PPX","","_","_"
3,"catuṣpādaṃ","_","_","catuṣpāda","JJ","","_","_"
4,"nityam","_","_","nitya","JJ","","_","_"
5,"āhur","_","_","ah","V","ah","_","_"
6,"manīṣiṇaḥ","_","_","manīṣin","JJ","","_","_"
1,"panthānaṃ","_","_","pathin","NC","","_","_"
2,"vaḥ","_","_","tvat","PPR","","_","_"
3,"pravakṣyāmi","_","_","pravak","V","pravac","_","_"
4,"śivaṃ","_","_","śiva","JJ","","_","_"
5,"_","_","_","kṣema","NC","","_","_"
6,"_","_","_","kara","JJ","","_","_"
7,"dvijāḥ","_","_","dvija","NC","","_","_"
1,"niyataṃ","_","_","niya","PPP","","_","_"
2,"_","_","_","brahman","NC","","_","_"
3,"_","_","_","bhāva","NC","","_","_"
4,"yātaṃ","_","_","yā","PPP","","_","_"
5,"pūrvaṃ","_","_","pūrva","CX","","_","_"
6,"manīṣibhiḥ","_","_","manīṣin","JJ","","_","_"
1,"_","_","_","gad","KDP","","_","_"
2,"_","_","_","tad","PRD","","_","_"
3,"_","_","_","mat","PPR","","_","_"
4,"_","_","_","adya","CX","","_","_"
5,"_","_","_","iha","CAD","","_","_"
6,"panthānaṃ","_","_","pathin","NC","","_","_"
7,"durvidaṃ","_","_","durvida","JJ","","_","_"
8,"param","_","_","para","PPX","","_","_"
1,"nibodhata","_","_","nibodh","V","nibudh","_","_"
2,"mahābhāgā","_","_","mahābhāga","JJ","","_","_"
3,"nikhilena","_","_","nikhila","CX","","_","_"
4,"paraṃ","_","_","para","PPX","","_","_"
5,"padam","_","_","pada","NC","","_","_"
1,"brahmacārikam","_","_","brahmacārika","NC","","_","_"
2,"_","_","_","eva","CEM","","_","_"
3,"_","_","_","ah","V","ah","_","_"
4,"āśramaṃ","_","_","āśrama","NC","","_","_"
5,"prathamaṃ","_","_","prathama","JJ","","_","_"
6,"padam","_","_","pada","NC","","_","_"
1,"gārhasthyaṃ","_","_","gārhasthya","NC","","_","_"
2,"tu","_","_","tu","CCD","","_","_"
3,"dvitīyaṃ","_","_","dvitīya","JJ","","_","_"
4,"syād","_","_","as","V","as","_","_"
5,"vānaprastham","_","_","vānaprastha","NC","","_","_"
6,"ataḥ","_","_","atas","CX","","_","_"
7,"param","_","_","para","PPX","","_","_"
1,"tataḥ","_","_","tatas","CX","","_","_"
2,"paraṃ","_","_","para","PPX","","_","_"
3,"tu","_","_","tu","CCD","","_","_"
4,"vijñeyam","_","_","vijñā","KDG","","_","_"
5,"adhyātmaṃ","_","_","adhyātma","NC","","_","_"
6,"paramaṃ","_","_","parama","JJ","","_","_"
7,"padam","_","_","pada","NC","","_","_"
1,"jyotir","_","_","jyotis","NC","","_","_"
2,"ākāśam","_","_","ākāśa","NC","","_","_"
3,"ādityo","_","_","āditya","NC","","_","_"
4,"vāyur","_","_","vāyu","NC","","_","_"
5,"indraḥ","_","_","indra","NC","","_","_"
6,"prajāpatiḥ","_","_","prajāpati","NC","","_","_"
1,"_","_","_","na","CNG","","_","_"
2,"_","_","_","upai","V","upe","_","_"
3,"yāvad","_","_","yāvat","CX","","_","_"
4,"adhyātmaṃ","_","_","adhyātma","NC","","_","_"
5,"tāvad","_","_","tāvat","CX","","_","_"
6,"_","_","_","tad","PRD","","_","_"
7,"_","_","_","na","CNG","","_","_"
8,"paśyati","_","_","paś","V","paś","_","_"
1,"_","_","_","tad","PRD","","_","_"
2,"_","_","_","upāya","NC","","_","_"
3,"pravakṣyāmi","_","_","pravak","V","pravac","_","_"
4,"purastāt","_","_","purastāt","CX","","_","_"
5,"taṃ","_","_","tad","PRD","","_","_"
6,"nibodhata","_","_","nibodh","V","nibudh","_","_"
1,"_","_","_","phala","NC","","_","_"
2,"_","_","_","mūla","NC","","_","_"
3,"_","_","_","anila","NC","","_","_"
4,"_","_","_","bhuj","JJ","","_","_"
5,"munīnāṃ","_","_","muni","NC","","_","_"
6,"vasatāṃ","_","_","vas","KDP","","_","_"
7,"vane","_","_","vana","NC","","_","_"
1,"vānaprasthaṃ","_","_","vānaprastha","NC","","_","_"
2,"dvijātīnāṃ","_","_","dvijāti","NC","","_","_"
3,"trayāṇām","_","_","tri","NUM","","_","_"
4,"upadiśyate","_","_","upadiś","V","upadiś","_","_"
1,"sarveṣām","_","_","sarva","JQ","","_","_"
2,"eva","_","_","eva","CEM","","_","_"
3,"varṇānāṃ","_","_","varṇa","NC","","_","_"
4,"gārhasthyaṃ","_","_","gārhasthya","NC","","_","_"
5,"tad","_","_","tad","PRD","","_","_"
6,"vidhīyate","_","_","vidadh","V","vidhā","_","_"
1,"_","_","_","śraddhā","NC","","_","_"
2,"_","_","_","lakṣaṇa","NC","","_","_"
3,"_","_","_","iti","CQT","","_","_"
4,"_","_","_","eva","CX","","_","_"
5,"dharmaṃ","_","_","dharma","NC","","_","_"
6,"dhīrāḥ","_","_","dhīra","JJ","","_","_"
7,"pracakṣate","_","_","pracakṣ","V","pracakṣ","_","_"
1,"_","_","_","iti","CQT","","_","_"
2,"_","_","_","tad","PRD","","_","_"
3,"_","_","_","deva","NC","","_","_"
4,"_","_","_","yāna","NC","","_","_"
5,"vaḥ","_","_","tvat","PPR","","_","_"
6,"panthānaḥ","_","_","pathin","NC","","_","_"
7,"parikīrtitāḥ","_","_","parikīrtay","PPP","","_","_"
1,"sadbhir","_","_","sat","JJ","","_","_"
2,"adhyāsitā","_","_","adhyās","PPP","","_","_"
3,"dhīraiḥ","_","_","dhīra","JJ","","_","_"
4,"karmabhir","_","_","karman","NC","","_","_"
5,"_","_","_","dharma","NC","","_","_"
6,"_","_","_","setu","NC","","_","_"
1,"eteṣāṃ","_","_","tad","PRD","","_","_"
2,"pṛthag","_","_","pṛthak","CX","","_","_"
3,"adhyāste","_","_","ās","V","ās","_","_"
4,"yo","_","_","yad","PRL","","_","_"
5,"dharmaṃ","_","_","dharma","NC","","_","_"
6,"_","_","_","saṃśita","JJ","","_","_"
7,"_","_","_","vrata","NC","","_","_"
1,"kālāt","_","_","kāla","NC","","_","_"
2,"paśyati","_","_","paś","V","paś","_","_"
3,"bhūtānāṃ","_","_","bhūta","NC","","_","_"
4,"_","_","_","sadā","CAD","","_","_"
5,"_","_","_","eva","CEM","","_","_"
6,"_","_","_","prabhava","NC","","_","_"
7,"_","_","_","apyaya","NC","","_","_"
1,"_","_","_","atas","CX","","_","_"
2,"_","_","_","tattva","NC","","_","_"
3,"vakṣyāmi","_","_","vak","V","vac","_","_"
4,"yāthātathyena","_","_","yāthātathya","NC","","_","_"
5,"hetunā","_","_","hetu","NC","","_","_"
1,"_","_","_","viṣaya","NC","","_","_"
2,"_","_","_","stha","JJ","","_","_"
3,"sarvāṇi","_","_","sarva","JQ","","_","_"
4,"vartamānāni","_","_","vṛt","KDP","","_","_"
5,"bhāgaśaḥ","_","_","bhāgaśas","CX","","_","_"
1,"mahān","_","_","mahat","JJ","","_","_"
2,"ātmā","_","_","ātman","NC","","_","_"
3,"_","_","_","tathā","CX","","_","_"
4,"_","_","_","avyakta","NC","","_","_"
5,"_","_","_","ahaṃkāra","NC","","_","_"
6,"_","_","_","tathā","CX","","_","_"
7,"_","_","_","eva","CEM","","_","_"
8,"ca","_","_","ca","CCD","","_","_"
1,"indriyāṇi","_","_","indriya","NC","","_","_"
2,"_","_","_","daśan","NUM","","_","_"
3,"_","_","_","eka","PPX","","_","_"
4,"ca","_","_","ca","CCD","","_","_"
5,"mahābhūtāni","_","_","mahābhūta","NC","","_","_"
6,"pañca","_","_","pañcan","NUM","","_","_"
7,"ca","_","_","ca","CCD","","_","_"
1,"viśeṣāḥ","_","_","viśeṣa","NC","","_","_"
2,"_","_","_","pañcan","NUM","","_","_"
3,"_","_","_","bhūta","NC","","_","_"
4,"_","_","_","iti","CQT","","_","_"
5,"_","_","_","tad","PRD","","_","_"
6,"vaidikī","_","_","vaidika","JJ","","_","_"
7,"śrutiḥ","_","_","śruti","NC","","_","_"
1,"caturviṃśatir","_","_","caturviṃśati","NC","","_","_"
2,"eṣā","_","_","tad","PRD","","_","_"
3,"_","_","_","tvat","PPR","","_","_"
4,"_","_","_","tattva","NC","","_","_"
5,"saṃprakīrtitā","_","_","saṃprakīrtay","PPP","","_","_"
1,"tattvānām","_","_","tattva","NC","","_","_"
2,"atha","_","_","atha","CAD","","_","_"
3,"yo","_","_","yad","PRL","","_","_"
4,"veda","_","_","vid","V","vid","_","_"
5,"sarveṣāṃ","_","_","sarva","JQ","","_","_"
6,"_","_","_","prabhava","NC","","_","_"
7,"_","_","_","apyaya","NC","","_","_"
1,"sa","_","_","tad","PRD","","_","_"
2,"dhīraḥ","_","_","dhīra","JJ","","_","_"
3,"_","_","_","sarva","JQ","","_","_"
4,"_","_","_","bhūta","NC","","_","_"
5,"na","_","_","na","CNG","","_","_"
6,"moham","_","_","moha","NC","","_","_"
7,"adhigacchati","_","_","adhigacch","V","adhigam","_","_"
1,"tattvāni","_","_","tattva","NC","","_","_"
2,"yo","_","_","yad","PRL","","_","_"
3,"vedayate","_","_","vid","V","vid","_","_"
4,"yathātathaṃ","_","_","yathātatha","JJ","","_","_"
5,"_","_","_","guṇa","NC","","_","_"
6,"_","_","_","ca","CCD","","_","_"
7,"sarvān","_","_","sarva","JQ","","_","_"
8,"_","_","_","akhila","JJ","","_","_"
9,"_","_","_","ca","CCD","","_","_"
10,"devatāḥ","_","_","devatā","NC","","_","_"
1,"_","_","_","vidhū","PPP","","_","_"
2,"_","_","_","pāpman","NC","","_","_"
3,"pravimucya","_","_","pravimuc","CGDA","","_","_"
4,"bandhanaṃ","_","_","bandhana","NC","","_","_"
5,"sa","_","_","tad","PRD","","_","_"
6,"_","_","_","sarva","JQ","","_","_"
7,"_","_","_","loka","NC","","_","_"
8,"amalān","_","_","amala","JJ","","_","_"
9,"samaśnute","_","_","samaś","V","samaś","_","_"
