"WordID","word","NormSTEM","suffix","lemma","PoS","Root","NormSuffix","NormWord"
1,"imāṃ","_","_","ida","PRD","","_","_"
2,"khanāmy","_","_","khan","V","khan","_","_"
3,"oṣadhiṃ","_","_","oṣadhi","NC","","_","_"
4,"vīrudham","_","_","vīrudh","NC","","_","_"
5,"balavattamām","_","_","balavattama","JJ","","_","_"
1,"yayā","_","_","yad","PRL","","_","_"
2,"sapatnīm","_","_","sapatnī","NC","","_","_"
3,"bādhate","_","_","bādh","V","bādh","_","_"
4,"yayā","_","_","yad","PRL","","_","_"
5,"saṃvindate","_","_","saṃvid","V","saṃvid","_","_"
6,"patim","_","_","pati","NC","","_","_"
1,"_","_","_","uttāna","JJ","","_","_"
2,"_","_","_","parṇa","NC","","_","_"
3,"subhage","_","_","subhaga","JJ","","_","_"
4,"_","_","_","deva","NC","","_","_"
5,"_","_","_","jū","PPP","","_","_"
6,"sahasvati","_","_","sahasvat","JJ","","_","_"
1,"sapatnīm","_","_","sapatnī","NC","","_","_"
2,"me","_","_","mat","PPR","","_","_"
3,"parā","_","_","parā","CADP","","_","_"
4,"dhama","_","_","dha","V","dha","_","_"
5,"patim","_","_","pati","NC","","_","_"
6,"me","_","_","mat","PPR","","_","_"
7,"kevalaṃ","_","_","kevala","JJ","","_","_"
8,"kuru","_","_","kar","V","kṛ","_","_"
1,"_","_","_","uttara","JJ","","_","_"
2,"_","_","_","mat","PPR","","_","_"
3,"uttara","_","_","uttara","JJ","","_","_"
4,"_","_","_","uttara","JJ","","_","_"
5,"_","_","_","id","CEM","","_","_"
6,"uttarābhyaḥ","_","_","uttara","JJ","","_","_"
1,"athā","_","_","atha","CAD","","_","_"
2,"sapatnī","_","_","sapatnī","NC","","_","_"
3,"yā","_","_","yad","PRL","","_","_"
4,"_","_","_","mat","PPR","","_","_"
5,"_","_","_","adhara","JJ","","_","_"
6,"_","_","_","tad","PRD","","_","_"
7,"_","_","_","adhara","JJ","","_","_"
1,"nahy","_","_","nahi","CX","","_","_"
2,"asyā","_","_","ida","PRD","","_","_"
3,"nāma","_","_","nāman","NC","","_","_"
4,"gṛbhṇāmi","_","_","grah","V","grah","_","_"
5,"_","_","_","na","CNG","","_","_"
6,"_","_","_","u","CEM","","_","_"
7,"asmin","_","_","ida","PRD","","_","_"
8,"ramate","_","_","ram","V","ram","_","_"
9,"jane","_","_","jana","NC","","_","_"
1,"parām","_","_","para","PPX","","_","_"
2,"eva","_","_","eva","CEM","","_","_"
3,"parāvataṃ","_","_","parāvat","NC","","_","_"
4,"sapatnīṃ","_","_","sapatnī","NC","","_","_"
5,"gamayāmasi","_","_","gamay","V","gamay","_","_"
1,"aham","_","_","mat","PPR","","_","_"
2,"asmi","_","_","as","V","as","_","_"
3,"_","_","_","sah","KDP","","_","_"
4,"_","_","_","atha","CAD","","_","_"
5,"tvam","_","_","tvat","PPR","","_","_"
6,"asi","_","_","as","V","as","_","_"
7,"sāsahiḥ","_","_","sāsahi","JJ","","_","_"
1,"ubhe","_","_","ubh","PPX","","_","_"
2,"sahasvatī","_","_","sahasvat","JJ","","_","_"
3,"bhūtvī","_","_","bhū","CGDA","","_","_"
4,"sapatnīm","_","_","sapatnī","NC","","_","_"
5,"me","_","_","mat","PPR","","_","_"
6,"sahāvahai","_","_","sah","V","sah","_","_"
1,"upa","_","_","upa","CADP","","_","_"
2,"te","_","_","tvat","PPR","","_","_"
3,"'dhāṃ","_","_","dadh","V","dhā","_","_"
4,"sahamānām","_","_","sahamānā","NC","","_","_"
5,"abhi","_","_","abhi","CADP","","_","_"
6,"_","_","_","tvat","PPR","","_","_"
7,"_","_","_","dadh","V","dhā","_","_"
8,"sahīyasā","_","_","sahīyas","JJ","","_","_"
1,"mām","_","_","mat","PPR","","_","_"
2,"anu","_","_","anu","CADP","","_","_"
3,"pra","_","_","pra","CADP","","_","_"
4,"te","_","_","tvat","PPR","","_","_"
5,"mano","_","_","manas","NC","","_","_"
6,"vatsaṃ","_","_","vatsa","NC","","_","_"
7,"gaur","_","_","go","NC","","_","_"
8,"iva","_","_","iva","CCM","","_","_"
9,"dhāvatu","_","_","dhāv","V","dhāv","_","_"
10,"pathā","_","_","pathin","NC","","_","_"
11,"vār","_","_","vār","NC","","_","_"
12,"iva","_","_","iva","CCM","","_","_"
13,"dhāvatu","_","_","dhāv","V","dhāv","_","_"
