"WordID","word","NormSTEM","suffix","lemma","PoS","Root","NormSuffix","NormWord"
"","<s number = ""1"">","","","","","","",""
"1","anastamita","ANASTAMIT","a","anastamita","","","a","anastamita"
"2","bhārūpaḥ","BHĀRŪP","aḥ","bhārūpa","","","aḥ","bhārūpaḥ"
"3","tejasām","TEJAS","ām","tejasa","noun-adj","","ām","tejasām"
"4","tamasām","TAMAS","ām","tamas","noun-adj","","ām","tamasām"
"5","api","","","api","ind","","","api"
"6","/","","","","punct","","","/"
"7","yaḥ","","","yad","pron","","","yad"
"8","ekaḥ","EK","aḥ","eka","noun-adj","","aḥ","ekaḥ"
"9","antar","ANTAR","","antara","noun-adj","","","antar"
"10","yat","","","yad","pron","","","yad"
"11","antar","ANTAR","","antara","noun-adj","","","antar"
"12","ca","","","ca","ind","","","ca"
"13","tejāṃsi","TEJ","āṃsi","teja","noun-adj","","āmsi","tejāmsi"
"14","ca","","","ca","ind","","","ca"
"15","tamāṃsi","TAM","āṃsi","tama","","","āmsi","tamāmsi"
"16","ca","","","ca","ind","","","ca"
"17","//","","","","punct","","","//"
"","</s>","","","","","","",""
"","<s number = ""2"">","","","","","","",""
"1","saḥ","","","tad","pron","","","tad"
"2","eva","","","eva","ind","","","eva"
"3","sarva","SARV","a","sarva","noun-adj","","a","sarva"
"4","bhūtānām","BHŪT","ānām","bhūta","noun-adj","","ānām","bhūtānām"
"5","svabhāvaḥ","SVABHĀV","aḥ","svabhāva","noun-adj","","aḥ","svabhāvaḥ"
"6","parameśvaraḥ","PARAMEŚVAR","aḥ","parameśvara","noun-adj","","aḥ","parameśvaraḥ"
"7","/","","","","punct","","","/"
"8","bhāva","BHĀV","a","bhāva","noun-adj","","a","bhāva"
"9","jātam","JĀT","am","jāta","noun-adj","","am","jātam"
"10","hi","","","hi","ind","","","hi"
"11","tasya","","","tad","pron","","","tad"
"12","eva","","","eva","ind","","","eva"
"13","śaktiḥ","ŚAKT","iḥ","śakti","noun-adj","","iḥ","śaktiḥ"
"14","īśvara","ĪŚVAR","a","īśvara","noun-adj","","a","īśvara"
"15","tā","","","tad","pron","","","tad"
"16","mayī","MAY","ī","mayī","noun-adj","","ī","mayī"
"17","//","","","","punct","","","//"
"","</s>","","","","","","",""
"","<s number = ""3"">","","","","","","",""
"1","śaktiḥ","ŚAKT","iḥ","śakti","noun-adj","","iḥ","śaktiḥ"
"2","ca","","","ca","ind","","","ca"
"3","śaktimat","ŚAKTIMAT","","śaktimatī","noun-adj","","","śaktimat"
"4","rūpāt","RŪP","āt","rūpa","noun-adj","","āt","rūpāt"
"5","vyatirekam","VYATIREK","am","vyatireka","noun-adj","","am","vyatirekam"
"6","na","","","na","ind","","","na"
"7","vāñchati","VĀÑCH","ati","vāñch","verb","","ati","vāñchati"
"8","/","","","","punct","","","/"
"9","tādātmyam","TĀDĀTMY","am","tādātmya","noun-adj","","am","tādātmyam"
"10","anayoḥ","","","idam","pron","","","idam"
"11","nityam","NITY","am","nitya","noun-adj","","am","nityam"
"12","vahni","VAHN","i","vahni","noun-adj","","i","vahni"
"13","dāhikayoḥ","DĀH","ikayoḥ","dāhika","","","ikayoḥ","dāhikayoḥ"
"14","iva","","","iva","ind","","","iva"
"15","//","","","","punct","","","//"
"","</s>","","","","","","",""
"","<s number = ""4"">","","","","","","",""
"1","saḥ","","","tad","pron","","","tad"
"2","eva","","","eva","ind","","","eva"
"3","bhairavaḥ","BHAIRAV","aḥ","bhairava","noun-adj","","aḥ","bhairavaḥ"
"4","devaḥ","DEV","aḥ","deva","noun-adj","","aḥ","devaḥ"
"5","jagat","JAGAT","","jagat","noun-adj","","","jagat"
"6","bharaṇa","BHARAṆ","a","bharaṇa","noun-adj","","a","bharaṇa"
"7","lakṣaṇaḥ","LAKṢAṆ","aḥ","lakṣaṇa","noun-adj","","aḥ","lakṣaṇaḥ"
"8","/","","","","punct","","","/"
"9","sva","SV","a","sva","noun-adj","","a","sva"
"10","ātma","ĀTM","a","ātman","noun-adj","","a","ātma"
"11","a","","","alpha_privativum","ind","","","alpha_privativum"
"12","dṛṣe","DṚṢ","e","dṛṣa","","","e","dṛṣe"
"13","samagram","SAMAGR","am","samagra","noun-adj","","am","samagram"
"14","hi","","","hi","ind","","","hi"
"15","yat","","","yad","pron","","","yad"
"16","śaktyā","ŚAKT","yā","śakti","noun-adj","","yāḥ","śaktyāḥ"
"17","pratibimbitam","PRATIBIMBIT","am","pratibimbita","","","am","pratibimbitam"
"18","//","","","","punct","","","//"
"","</s>","","","","","","",""
"","<s number = ""5"">","","","","","","",""
"1","tasya","","","tad","pron","","","tad"
"2","eva","","","eva","ind","","","eva"
"3","eṣā","","","tad","pron","","","tad"
"4","parā","PAR","ā","para","noun-adj","","āḥ","parāḥ"
"5","devī","DEV","ī","devī","noun-adj","","ī","devī"
"6","svarūpa","SVARŪP","a","svarūpa","noun-adj","","a","svarūpa"
"7","āmarśana","ĀMARŚAN","a","āmarśana","","","a","āmarśana"
"8","utsukā","UTSUK","ā","utsuka","noun-adj","","ā","utsukā"
"9","/","","","","punct","","","/"
"10","pūrṇatvam","PŪRṆ","atvam","pūrṇatva","noun-adj","","atvam","pūrṇatvam"
"11","sarva","SARV","a","sarva","noun-adj","","a","sarva"
"12","bhaveṣu","BHAV","eṣu","bhava","noun-adj","","eṣu","bhaveṣu"
"13","yasyāḥ","","","yad","pron","","","yad"
"14","na","","","na","ind","","","na"
"15","alpam","ALP","am","alpa","noun-adj","","am","alpam"
"16","na","","","na","ind","","","na"
"17","ca","","","ca","ind","","","ca"
"18","adhikam","ADHIK","am","adhika","noun-adj","","am","adhikam"
"19","//","","","","punct","","","//"
"","</s>","","","","","","",""
"","<s number = ""6"">","","","","","","",""
"1","eṣa","","","tad","pron","","","tad"
"2","devaḥ","DEV","aḥ","deva","noun-adj","","aḥ","devaḥ"
"3","anayā","","","anaya","ind","","","anaya"
"4","devyāḥ","DEV","yāḥ","devī","noun-adj","","yāḥ","devyāḥ"
"5","nityam","NITY","am","nitya","noun-adj","","am","nityam"
"6","krīḍā","KRĪḌ","ā","krīḍā","noun-adj","","ā","krīḍā"
"7","rasa","RAS","a","rasa","noun-adj","","a","rasa"
"8","utsukaḥ","UTSUK","aḥ","utsuka","noun-adj","","aḥ","utsukaḥ"
"9","/","","","","punct","","","/"
"10","vicitrān","VICITR","ān","vicitra","noun-adj","","ān","vicitrān"
"11","sṛṣṭi","SṚṢṬ","i","sṛṣṭi","noun-adj","","i","sṛṣṭi"
"12","saṃhārān","SAṂHĀR","ān","saṃhāra","","","ān","saṃhārān"
"13","vidhatte","VIDHATT","e","vidhatte","noun-adj","","e","vidhatte"
"14","yugapad","YUGAP","ad","yugapa","noun-adj","","at","yugapat"
"15","vibhuḥ","VIBH","uḥ","vibhu","noun-adj","","uḥ","vibhuḥ"
"16","//","","","","punct","","","//"
"","</s>","","","","","","",""
"","<s number = ""7"">","","","","","","",""
"1","ati","","","ati","ind","","","ati"
"2","durghaṭa","DURGHAṬ","a","durghaṭa","noun-adj","","a","durghaṭa"
"3","kāritvam","KĀR","itvam","kāritva","verb","","itvam","kāritvam"
"4","asya","","","idam","pron","","","idam"
"5","anuttaram","ANUTTAR","am","anuttara","noun-adj","","am","anuttaram"
"6","eva","","","eva","ind","","","eva"
"7","yat","","","yad","pron","","","yad"
"8","/","","","","punct","","","/"
"9","etat","ETAT","","tad","pron","","","etat"
"10","eva","","","eva","ind","","","eva"
"11","svatantratvam","SVATANTR","atvam","svatantratva","","","atvam","svatantratvam"
"12","ai","","","","","","",""
"13","svaryam","SVARY","am","svarya","","","am","svaryam"
"14","bodha","BODH","a","bodha","noun-adj","","a","bodha"
"15","rūpa","RŪP","a","rūpa","noun-adj","","a","rūpa"
"16","tā","","","tad","pron","","","tad"
"17","//","","","","punct","","","//"
"","</s>","","","","","","",""
"","<s number = ""8"">","","","","","","",""
"1","paricchinna","PARICCHINN","a","paricchinna","noun-adj","","a","paricchinna"
"2","prakāśatvam","PRAKĀŚ","atvam","prakāśatva","noun-adj","","atvam","prakāśatvam"
"3","jaḍasya","JAḌ","asya","jaḍa","noun-adj","","asya","jaḍasya"
"4","kila","KIL","a","kila","noun-adj","","a","kila"
"5","lakṣaṇam","LAKṢAṆ","am","lakṣaṇa","noun-adj","","am","lakṣaṇam"
"6","/","","","","punct","","","/"
"7","jaḍāt","JAḌ","āt","jaḍa","","","āt","jaḍāt"
"8","vilakṣaṇaḥ","VILAKṢAṆ","aḥ","vilakṣaṇa","noun-adj","","aḥ","vilakṣaṇaḥ"
"9","bodhaḥ","BODH","aḥ","bodha","noun-adj","","aḥ","bodhaḥ"
"10","yatas","","","yatas","ind","","","yatas"
"11","na","","","na","ind","","","na"
"12","parimīyate","PARIM","īyate","parimā","verb","parimā","yate","parimyate"
"13","//","","","","punct","","","//"
"","</s>","","","","","","",""
"","<s number = ""9"">","","","","","","",""
"1","evam","","","eva","ind","","","eva"
"2","asya","","","idam","pron","","","idam"
"3","svatantrasya","SVATANTR","asya","svatantra","noun-adj","","asya","svatantrasya"
"4","nija","NIJ","a","nija","noun-adj","","a","nija"
"5","śakti","ŚAKT","i","śakti","noun-adj","","i","śakti"
"6","upabhedinaḥ","UPABHED","inaḥ","upabhedin","","","inaḥ","upabhedinaḥ"
"7","/","","","","punct","","","/"
"8","sva","SV","a","sva","noun-adj","","a","sva"
"9","ātma","ĀTM","a","ātman","noun-adj","","a","ātma"
"10","gāḥ","G","āḥ","go","noun-adj","gā","āḥ","gāḥ"
"11","sṛṣṭi","SṚṢṬ","i","sṛṣṭi","noun-adj","","i","sṛṣṭi"
"12","saṃhārāḥ","SAṂHĀR","āḥ","saṃhāra","","","āḥ","saṃhārāḥ"
"13","sva","SV","a","sva","noun-adj","","a","sva"
"14","rūpatvena","RŪP","atvena","rūpatva","noun-adj","","atvena","rūpatvena"
"15","saṃsthitāḥ","SAṂSTHIT","āḥ","saṃsthita","noun-adj","","āḥ","saṃsthitāḥ"
"16","//","","","","punct","","","//"
"","</s>","","","","","","",""
"","<s number = ""10"">","","","","","","",""
"1","teṣu","","","tad","pron","","","tad"
"2","vaicitryam","VAICITRY","am","vaicitrya","noun-adj","","am","vaicitryam"
"3","atyantam","ATYANT","am","atyanta","noun-adj","","am","atyantam"
"4","ūrdhva","ŪRDHV","a","ūrdhva","noun-adj","","a","ūrdhva"
"5","adhas","ADH","as","adha","noun-adj","","aḥ","adhaḥ"
"6","tiryak","TIRYA","k","tiryak","noun-adj","","k","tiryak"
"7","eva","","","eva","ind","","","eva"
"8","yat","","","yad","pron","","","yad"
"9","/","","","","punct","","","/"
"10","bhuvanāni","BHUVAN","āni","bhuvana","noun-adj","","āni","bhuvanāni"
"11","tad","TAD","","tad","pron","","","tad"
"12","aṃśāḥ","AṂŚ","āḥ","aṃśa","noun-adj","","āḥ","aṃśāḥ"
"13","ca","","","ca","ind","","","ca"
"14","sukha","SUKH","a","sukha","noun-adj","","a","sukha"
"15","duḥkha","DUḤKH","a","duḥkha","noun-adj","","a","duḥkha"
"16","matiḥ","MAT","iḥ","mati","noun-adj","","iḥ","matiḥ"
"17","ca","","","ca","ind","","","ca"
"18","yā","","","yad","pron","","","yad"
"19","//","","","","punct","","","//"
"","</s>","","","","","","",""
"","<s number = ""11"">","","","","","","",""
"1","yat","","","yad","pron","","","yad"
"2","etasya","","","tad","pron","","","tad"
"3","a","","","alpha_privativum","ind","","","alpha_privativum"
"4","parijñānam","PARIJÑĀN","am","parijñāna","noun-adj","","am","parijñānam"
"5","tat","TAT","","tad","pron","","","tat"
"6","svātantryam","SVĀTANTRY","am","svātantrya","noun-adj","","am","svātantryam"
"7","hi","","","hi","ind","","","hi"
"8","varṇitam","VARṆIT","am","varṇita","noun-adj","","am","varṇitam"
"9","/","","","","punct","","","/"
"10","saḥ","","","tad","pron","","","tad"
"11","eva","","","eva","ind","","","eva"
"12","khalu","KHAL","u","khalu","noun-adj","","u","khalu"
"13","saṃsāraḥ","SAṂSĀR","aḥ","saṃsāra","noun-adj","","aḥ","saṃsāraḥ"
"14","mūḍānām","","","","","","",""
"15","yaḥ","","","yad","pron","","","yad"
"16","vibhīṣakaḥ","VIBHĪṢAK","aḥ","vibhīṣaka","","","aḥ","vibhīṣakaḥ"
"17","//","","","","punct","","","//"
"","</s>","","","","","","",""
"","<s number = ""12"">","","","","","","",""
"1","tad","TAD","","tad","pron","","","tad"
"2","prasāda","PRASĀD","a","prasāda","noun-adj","","a","prasāda"
"3","rasāt","RAS","āt","rasa","noun-adj","","āt","rasāt"
"4","eva","","","eva","ind","","","eva"
"5","guru","GUR","u","guru","noun-adj","","u","guru"
"6","āgamataḥ","ĀGAM","ataḥ","āgama","noun-adj","","ataḥ","āgamataḥ"
"7","eva","","","eva","ind","","","eva"
"8","vā","","","vā","ind","","","vā"
"9","/","","","","punct","","","/"
"10","śāstrāt","ŚĀSTR","āt","śāstra","noun-adj","","āt","śāstrāt"
"11","vā","","","vā","ind","","","vā"
"12","parameśasya","PARAMEŚ","asya","parameśa","","","asya","parameśasya"
"13","yasmāt","YASMĀT","","yad","pron","","","yasmāt"
"14","kasmāt","","","kim","pron","","","kim"
"15","upāgatam","UPĀGAT","am","upāgata","noun-adj","","am","upāgatam"
"16","//","","","","punct","","","//"
"","</s>","","","","","","",""
"","<s number = ""13"">","","","","","","",""
"1","yat","","","yad","pron","","","yad"
"2","tattvasya","TATTV","asya","tattva","noun-adj","","asya","tattvasya"
"3","parijñānam","PARIJÑĀN","am","parijñāna","noun-adj","","am","parijñānam"
"4","sa","","","tad","pron","","","tad"
"5","mokṣaḥ","MOKṢ","aḥ","mokṣa","noun-adj","","aḥ","mokṣaḥ"
"6","parameśataḥ","PARAMEŚ","ataḥ","parameśa","","","ataḥ","parameśataḥ"
"7","/","","","","punct","","","/"
"8","tat","TAT","","tad","pron","","","tat"
"9","pūrṇatvam","PŪRṆ","atvam","pūrṇatva","noun-adj","","atvam","pūrṇatvam"
"10","prabuddhānām","PRABUDDH","ānām","prabuddha","noun-adj","","ānām","prabuddhānām"
"11","jīvanmuktiḥ","JĪVANMUKT","iḥ","jīvanmukti","","","iḥ","jīvanmuktiḥ"
"12","ca","","","ca","ind","","","ca"
"13","sā","","","tad","pron","","","tad"
"14","smṛtā","SMṚT","ā","smṛta","noun-adj","","ā","smṛtā"
"15","//","","","","punct","","","//"
"","</s>","","","","","","",""
"","<s number = ""14"">","","","","","","",""
"1","etau","","","tad","pron","","","tad"
"2","bandha","BANDH","a","bandha","noun-adj","","a","bandha"
"3","vimokṣau","VIMOKṢ","au","vimokṣa","noun-adj","","au","vimokṣau"
"4","ca","","","ca","ind","","","ca"
"5","parameśa","PARAMEŚ","a","parameśa","","","a","parameśa"
"6","svarūpataḥ","SVARŪP","ataḥ","svarūpa","noun-adj","","ataḥ","svarūpataḥ"
"7","/","","","","punct","","","/"
"8","na","","","na","ind","","","na"
"9","bhidyete","BHID","yete","bhid","verb","bhid","yete","bhidyete"
"10","na","","","na","ind","","","na"
"11","bhedaḥ","BHED","aḥ","bheda","noun-adj","","aḥ","bhedaḥ"
"12","hi","","","hi","ind","","","hi"
"13","tattvataḥ","TATTV","ataḥ","tattva","noun-adj","","ataḥ","tattvataḥ"
"14","parameśvare","PARAMEŚVAR","e","parameśvara","","","e","parameśvare"
"15","//","","","","punct","","","//"
"","</s>","","","","","","",""
"","<s number = ""15"">","","","","","","",""
"1","ittham","ITTH","am","ittha","noun-adj","","am","ittham"
"2","icchā","ICCH","ā","icchā","noun-adj","","ā","icchā"
"3","kalā","KAL","ā","kalā","noun-adj","","ā","kalā"
"4","jñāna","JÑĀN","a","jñāna","noun-adj","","a","jñāna"
"5","śakti","ŚAKT","i","śakti","noun-adj","","i","śakti"
"6","śūla","ŚŪL","a","śūla","noun-adj","","a","śūla"
"7","ambuja","AMBUJA","","ambuja","noun-adj","","","ambuja"
"8","āśritaḥ","ĀŚRIT","aḥ","āśrita","noun-adj","","aḥ","āśritaḥ"
"9","/","","","","punct","","","/"
"10","bhairavaḥ","BHAIRAV","aḥ","bhairava","noun-adj","","aḥ","bhairavaḥ"
"11","sarva","SARV","a","sarva","noun-adj","","a","sarva"
"12","bhāvānām","BHĀV","ānām","bhāva","noun-adj","","ānām","bhāvānām"
"13","svabhāvaḥ","SVABHĀV","aḥ","svabhāva","noun-adj","","aḥ","svabhāvaḥ"
"14","pariśīlyate","PARIŚĪL","yate","pariśīl","verb","","yate","pariśīlyate"
"15","//","","","","punct","","","//"
"","</s>","","","","","","",""
"","<s number = ""16"">","","","","","","",""
"1","sukumāra","SUKUMĀR","a","sukumāra","noun-adj","","a","sukumāra"
"2","matīn","MAT","īn","mati","noun-adj","","īn","matīn"
"3","śiṣyān","ŚIṢY","ān","śiṣya","noun-adj","","ān","śiṣyān"
"4","prabodhayitum","PRABODHAY","itum","prabodh","verb","prabudh","tums","prabodhaytums"
"5","añjasā","AÑJAS","ā","añjasā","noun-adj","","ā","añjasā"
"6","/","","","","punct","","","/"
"7","ime","","","idam","pron","","","idam"
"8","abhinavaguptena","ABHINAVAGUPT","ena","abhinavagupta","","","ena","abhinavaguptena"
"9","ślokāḥ","ŚLOK","āḥ","śloka","noun-adj","","āḥ","ślokāḥ"
"10","pañcadaśa","PAÑCADAŚ","a","pañcadaśa","noun-adj","","a","pañcadaśa"
"11","uditāḥ","UDIT","āḥ","udita","noun-adj","","āḥ","uditāḥ"
"12","//","","","","punct","","","//"
"","</s>","","","","","","",""
