"WordID","word","NormSTEM","suffix","lemma","PoS","Root","NormSuffix","NormWord"
NA,"<doc textid = ""padmini"" genre = ""śāstra"" title = ""padminī"" author = ""ratnarakṣita"" discourse = ""commentary"" tradition = ""tantra"" period = ""commentarial"" source = ""pdf from academia.edu"" date_range = ""9. ce"" notes = """" religion = ""buddy"" edition = ""based on the ed. by ryugen tanemura kazuo kano and kenichi kuranishi. 2017. ratnaraksita's padminī a preliminary edition of the excurses in chapter 13 part 1. journal of the kawasaki institute for buddhist studies 2"" digitization = ""tilak balavijayan & buddhist translators worbench team"" segmentation_lemmatization = ""ligeia lugli & buddhist translators workbench team"" metadata_enrichment = """" proofreader = "" n/ a"" permission = ""awaiting permission"" reconstructions = ""none"">","","","","","","",""
NA,"<page number=""5"">","","","","","","",""
3,"ata","","","atas","ind","","","atas"
4,"eva","","","eva","ind","","","eva"
5,"evam","","","eva","ind","","","eva"
6,"āhuḥ","ĀH","uḥ","ah","verb","ah","uḥ","āhuḥ"
7,"/","","","","punct","","","/"
NA,"</s>","","","","","","",""
NA,"<s number=""1"">","","","","","","",""
1,"utpatti","UTPATT","i","utpatti","noun-adj","","i","utpatti"
2,"krama","KRAM","a","krama","noun-adj","","a","krama"
3,"prapañca","PRAPAÑC","a","prapañca","noun-adj","","a","prapañca"
4,"krama","KRAM","a","krama","noun-adj","","a","krama"
5,"bhāvanayā","BHĀVAN","ayā","bhāvanā","noun-adj","","ayā","bhāvanayā"
6,"samādhi","SAMĀDH","i","samādhi","noun-adj","","i","samādhi"
7,"lābho","LĀBH","o","lābha","noun-adj","","aḥ","lābhaḥ"
8,"api","","","api","ind","","","api"
9,"na","","","na","ind","","","na"
10,"bhavati","BHAV","ati","bhav","verb","bhū","ati","bhavati"
11,"/","","","","punct","","","/"
NA,"</s>","","","","","","",""
NA,"<s number=""2"">","","","","","","",""
1,"kutaḥ","KUT","aḥ","kutas","noun-adj","","aḥ","kutaḥ"
2,"punar","","","punar","ind","","","punar"
3,"buddhatvam","BUDDHATV","am","buddhatva","noun-adj","","am","buddhatvam"
4,"/","","","","punct","","","/"
NA,"</s>","","","","","","",""
NA,"<s number=""3"">","","","","","","",""
1,"yukty","YUKT","y","yukti","noun-adj","","i","yukti"
2,"āgamavirodhāt","ĀGAMAVIRODH","āt","āgamavirodha","noun-adj","","āt","āgamavirodhāt"
3,"/","","","","punct","","","/"
NA,"</s>","","","","","","",""
NA,"<s number=""4"">","","","","","","",""
1,"tathā","","","tathā","ind","","","tathā"
2,"hy","","","hi","ind","","","hi"
3,"āstāṃ","","","ās","verb","ās","",""
4,"tāvat","TĀVAT","","tāvat","ind","","","tāvat"
5,"kramabhāvyamān","KRAMABHĀV","yamān","kramabhāv","verb","kramabhū","amān","kramabhāvamān"
6,"ādhār","ĀDHĀR","","ādhāra","noun-adj","","","ādhār"
7,"ā","","","alpha_privativum","ind","","","alpha_privativum"
8,"dheya","DHEY","a","dheya","noun-adj","","a","dheya"
9,"rūpān","RŪP","ān","rūpa","noun-adj","","ān","rūpān"
10,"eka","EK","a","eka","noun-adj","","a","eka"
11,"devatā","DEVAT","ā","devatā","noun-adj","","ā","devatā"
12,"cakra","CAKR","a","cakra","noun-adj","","a","cakra"
13,"kalpanāyāṃ","KALPAN","āyāṃ","kalpanā","noun-adj","","āyām","kalpanāyām"
14,"citta","CITT","a","citta","noun-adj","","a","citta"
15,"sthairya","STHAIRY","a","sthairya","noun-adj","","a","sthairya"
16,"pratyāśā","PRATYĀŚ","ā","pratyāśā","noun-adj","","ā","pratyāśā"
17,"/","","","","punct","","","/"
NA,"</s>","","","","","","",""
NA,"<s number=""5"">","","","","","","",""
1,"ekas","EK","as","eka","noun-adj","","aḥ","ekaḥ"
2,"yām","YĀM","","yad","pron","","","yām"
3,"api","","","api","ind","","","api"
4,"devatāyāṃ","DEVAT","āyāṃ","devatā","noun-adj","","āyām","devatāyām"
5,"jhaṭiti","JHAṬIT","i","jhaṭiti","noun-adj","","i","jhaṭiti"
6,"niṣpann","NIṢPANN","a","niṣpanna","noun-adj","","a","niṣpanna"
7,"^ādhimokṣeṇa","ADHIMOKṢ","eṇa","adhimokṣa","noun-adj","","ena","adhimokṣena"
8,"bhāvyamānāyāṃ","BHĀV","yamānāyāṃ","bhāv","verb","bhū","yamānāyāṃ","bhāvyamānāyāṃ"
9,"yadā","","","yadā","ind","","","yadā"
10,"mukha","MUKH","a","mukha","noun-adj","","a","mukha"
11,"bhāvanā","BHĀVAN","ā","bhāvanā","noun-adj","","ā","bhāvanā"
12,"na","","","na","ind","","","na"
13,"tadā","","","tadā","ind","","","tadā"
14,"bhuj","BHUJ","a","bhuja","noun-adj","","a","bhuja"
15,"^ādi","ĀD","i","ādi","noun-adj","","i","ādi"
16,"bhāvanā","BHĀVAN","ā","bhāvanā","noun-adj","","ā","bhāvanā"
17,"/","","","","punct","","","/"
NA,"</s>","","","","","","",""
NA,"<s number=""6"">","","","","","","",""
1,"evaṃ","","","eva","ind","","","eva"
2,"yadā","","","yadā","ind","","","yadā"
3,"bhuj","BHUJ","a","bhuja","noun-adj","","a","bhuja"
4,"^ādy","ĀD","y","ādi","noun-adj","","i","ādi"
5,"anyatam","ANYATAM","","anyatama","noun-adj","","","anyatam"
6,"ānyatam","ĀNYATAM","","anyatama","noun-adj","","","ānyatam"
7,"āṅga","ĀṄG","a","aṅga","noun-adj","","a","āṅga"
8,"bhāvanā","BHĀVAN","ā","bhāvanā","noun-adj","","ā","bhāvanā"
9,"na","","","na","ind","","","na"
10,"tadā","","","tadā","ind","","","tadā"
11,"mukh","MUKH","a","mukha","noun-adj","","a","mukha"
12,"^ādi","ĀD","i","ādi","noun-adj","","i","ādi"
13,"bhāvanā","BHĀVAN","ā","bhāvanā","noun-adj","","ā","bhāvanā"
14,"/","","","","punct","","","/"
NA,"</s>","","","","","","",""
NA,"<s number=""7"">","","","","","","",""
1,"na","","","na","ind","","","na"
2,"c","","a","ca","ind","","a","ca"
3,"^ā","","","alpha_privativum","ind","","","alpha_privativum"
4,"bhāvitasy","BHĀVIT","asya","bhāvita","noun-adj","","asya","bhāvitasya"
5,"^āpi","","","api","ind","","","api"
6,"mukh","MUKH","a","mukha","noun-adj","","a","mukha"
7,"^ādeḥ","ĀD","eḥ","ādi","noun-adj","","eḥ","ādeḥ"
8,"prakāśaḥ","PRAKĀŚ","aḥ","prakāśa","noun-adj","","aḥ","prakāśaḥ"
9,"/","","","","punct","","","/"
NA,"</s>","","","","","","",""
NA,"<s number=""8"">","","","","","","",""
1,"na","","","na","ind","","","na"
2,"ca","","","ca","ind","","","ca"
3,"vikalpa","VIKALP","a","vikalpa","noun-adj","","a","vikalpa"
4,"dvayamṃ","DVAY","amṃ","dvaya","noun-adj","","amṃ","dvayamṃ"
5,"sakṛd","SAKṚD","","sakṛt","noun-adj","","","sakṛd"
6,"iti","","","iti","ind","","","iti"
7,"sarva","SARV","a","sarva","noun-adj","","a","sarva"
8,"jana","JAN","a","jana","noun-adj","","a","jana"
9,"sva","SV","a","sva","noun-adj","","a","sva"
10,"saṃvedana","SAṂVEDAN","a","saṃvedana","noun-adj","","a","saṃvedana"
11,"siddham","SIDDH","am","siddha","noun-adj","","am","siddham"
12,"/","","","","punct","","","/"
NA,"</s>","","","","","","",""
NA,"<s number=""9"">","","","","","","",""
1,"tat","","","tad","pron","","","tad"
2,"kutaś","KUT","aś","kutas","noun-adj","","aḥ","kutaḥ"
3,"citt","CITT","a","citta","noun-adj","","a","citta"
4,"^aik","EK","a","eka","noun-adj","","a","eka"
5,"^āgrat","AGRAT","","agratas","noun-adj","","","agrat"
6,"ā","","","alpha_privativum","ind","","","alpha_privativum"
7,"lakṣaṇaḥ","LAKṢAṆ","aḥ","lakṣaṇa","noun-adj","","aḥ","lakṣaṇaḥ"
8,"samādhiḥ","SAMĀDH","iḥ","samādhi","noun-adj","","iḥ","samādhiḥ"
9,"/","","","","punct","","","/"
NA,"</s>","","","","","","",""
NA,"<s number=""10"">","","","","","","",""
1,"aneka","ANEK","a","aneka","noun-adj","","a","aneka"
2,"vikalp","VIKALP","a","vikalpa","noun-adj","","a","vikalpa"
3,"^ākulatvāt","ĀKUL","atvāt","ākulatva","noun-adj","","atvāt","ākulatvāt"
4,"/","","","","punct","","","/"
NA,"</s>","","","","","","",""
NA,"<s number=""11"">","","","","","","",""
1,"kiṃ","","","kim","pron","","","kim"
2,"ca","","","ca","ind","","","ca"
3,"buddhatvaṃ","BUDDHATV","aṃ","buddhatva","noun-adj","","am","buddhatvam"
4,"puṇya","PUṆY","a","puṇya","noun-adj","","a","puṇya"
5,"jñāna","JÑĀN","a","jñāna","noun-adj","","a","jñāna"
6,"saṃbhāra","SAṂBHĀR","a","saṃbhāra","noun-adj","","a","saṃbhāra"
7,"kāryam","KĀRY","am","kārya","noun-adj","","am","kāryam"
8,"/","","","","punct","","","/"
NA,"</s>","","","","","","",""
NA,"<s number=""12"">","","","","","","",""
1,"kathaṃ","","","katham","ind","","","katham"
2,"tad","","","tad","pron","","","tad"
3,"bhāvanā","BHĀVAN","ā","bhāvanā","noun-adj","","ā","bhāvanā"
4,"mātreṇa","MĀTR","eṇa","mātra","noun-adj","","ena","mātrena"
5,"syāt","","","as","verb","as","",""
6,"/","","","","punct","","","/"
NA,"</s>","","","","","","",""
NA,"<s number=""13"">","","","","","","",""
1,"na","","","na","ind","","","na"
2,"hi","","","hi","ind","","","hi"
3,"daridrasya","DARIDR","asya","daridra","noun-adj","","asya","daridrasya"
4,"rājāhaṃ","RĀJĀH","aṃ","rājāhi","noun-adj","","am","rājāham"
5,"cakravart","CAKRAVART","","cakravartin","noun-adj","","","cakravart"
6,"i","","","","ind","","",""
7,"iti","","","iti","ind","","","iti"
8,"bhāvanayā","BHĀVAN","ayā","bhāvanā","noun-adj","","ayā","bhāvanayā"
9,"cakravartitva","CAKRAVART","itva","cakravartitva","noun-adj","","itva","cakravartitva"
10,"lābhaḥ","LĀBH","aḥ","lābha","noun-adj","","aḥ","lābhaḥ"
11,"preta","PRET","a","preta","noun-adj","","a","preta"
12,"bhāvanayā","BHĀVAN","ayā","bhāvanā","noun-adj","","ayā","bhāvanayā"
13,"pretatva","PRET","atva","pretatva","noun-adj","","atva","pretatva"
14,"lābhaḥ","LĀBH","aḥ","lābha","noun-adj","","aḥ","lābhaḥ"
15,"kasyacid","KASYACID","","kimcit","noun-adj","","","kasyacid"
16,"a","","","alpha_privativum","ind","","","alpha_privativum"
17,"kasmāt","KASMĀT","","kim","pron","","","kasmāt"
18,"/","","","","punct","","","/"
NA,"</s>","","","","","","",""
NA,"<s number=""14"">","","","","","","",""
1,"śubhā","ŚUBH","ā","śubhā","noun-adj","","ā","śubhā"
2,"śubha","ŚUBH","a","śubha","noun-adj","","a","śubha"
3,"karma","KARM","a","karman","noun-adj","","a","karma"
4,"vaiphalya","VAIPHALY","a","vaiphalya","noun-adj","","a","vaiphalya"
5,"prasaṅgāt","PRASAṄG","āt","prasaṅga","noun-adj","","āt","prasaṅgāt"
6,"/","","","","punct","","","/"
NA,"</s>","","","","","","",""
NA,"<s number=""15"">","","","","","","",""
1,"bhavatu","BHAVAT","u","bhavatī","noun-adj","","u","bhavatu"
2,"bhāvanā","BHĀVAN","ā","bhāvanā","noun-adj","","ā","bhāvanā"
3,"viṣaya","VIṢAY","a","viṣaya","noun-adj","","a","viṣaya"
4,"vaiśadyataḥ","VAIŚADY","ataḥ","vaiśadya","noun-adj","","ataḥ","vaiśadyataḥ"
5,"/","","","","punct","","","/"
NA,"</s>","","","","","","",""
NA,"<s number=""16"">","","","","","","",""
1,"tath","","a","tathā","ind","","a","tathā"
2,"^āpi","","","api","ind","","","api"
3,"kāmu","KĀM","u","kāma","noun-adj","","u","kāmu"
4,"kasya","KAS","ya","kim","verb","","ya","kasya"
5,"kāminy","KĀMIN","y","kāmini","noun-adj","","i","kāmini"
6,"ākāra","ĀKĀR","a","ākāra","noun-adj","","a","ākāra"
7,"sphuṭī","SPHUṬ","ī","sphuṭi","noun-adj","","ī","sphuṭī"
8,"kāravat","KĀRAV","at","kāravat","noun-adj","","at","kāravat"
9,"//","","","","punct","","","//"
NA,"</s>","","","","","","",""
NA,"<s number=""17"">","","","","","","",""
NA,"</page>","","","","","","",""
NA,"<page number=""6"">","","","","","","",""
3,"kiyat","KIY","at","kiyat","noun-adj","","at","kiyat"
4,"kāla","KĀL","a","kāla","noun-adj","","a","kāla"
5,"mātr","MĀTR","a","mātra","noun-adj","","a","mātra"
6,"^ānubandhaḥ","ANUBANDH","aḥ","anubandha","noun-adj","","aḥ","anubandhaḥ"
7,"syāt","","","as","verb","as","",""
8,"/","","","","punct","","","/"
NA,"</s>","","","","","","",""
NA,"<s number=""18"">","","","","","","",""
1,"kalpitatvena","KALPIT","atvena","kalpitatva","noun-adj","","atvena","kalpitatvena"
2,"mṛṣ","MṚṢ","a","mṛṣa","noun-adj","","a","mṛṣa"
3,"^ātmakatvāt","ĀTM","akatvāt","ātmaka","noun-adj","","akatvāt","ātmakatvāt"
4,"/","","","","punct","","","/"
NA,"</s>","","","","","","",""
NA,"<s number=""19"">","","","","","","",""
1,"a","","","alpha_privativum","ind","","","alpha_privativum"
2,"tattv","TATTV","a","tattva","noun-adj","","a","tattva"
3,"^ābhiniveśa","ABHINIVEŚ","a","abhiniveśa","noun-adj","","a","abhiniveśa"
4,"prabhavatv","PRABHAV","atv","prabhav","verb","prabhū","tvā","prabhavtvā"
5,"enaiva","ENAIV","a","enaiva","noun-adj","","a","enaiva"
6,"hi","","","hi","ind","","","hi"
7,"laukika","LAUKIK","a","laukika","noun-adj","","a","laukika"
8,"dharmāṇām","DHARM","āṇām","dharma","noun-adj","","ānām","dharmānām"
9,"anityatvam","ANITY","atvam","anityatva","noun-adj","","atvam","anityatvam"
10,"/","","","","punct","","","/"
NA,"</s>","","","","","","",""
NA,"<s number=""20"">","","","","","","",""
1,"kalpita","KALPIT","a","kalpita","noun-adj","","a","kalpita"
2,"yogas","YOG","as","yoga","noun-adj","","aḥ","yogaḥ"
3,"tu","","","tu","ind","","","tu"
4,"laukika","LAUKIK","a","laukika","noun-adj","","a","laukika"
5,"dharmebhyo","DHARM","ebhyo","dharma","noun-adj","","ebhyaḥ","dharmebhyaḥ"
6,"apy","","","api","ind","","","api"
7,"atyanta","ATYANT","a","atyanta","noun-adj","","a","atyanta"
8,"mṛṣā","MṚṢ","ā","mṛṣā","noun-adj","","ā","mṛṣā"
9,"/","","","","punct","","","/"
NA,"</s>","","","","","","",""
NA,"<s number=""21"">","","","","","","",""
1,"varṇa","VARṆ","a","varṇa","noun-adj","","a","varṇa"
2,"saṃsthān","SAṂSTHĀN","a","saṃsthāna","noun-adj","","a","saṃsthāna"
3,"^ādi","ĀD","i","ādi","noun-adj","","i","ādi"
4,"rahitānām","RAHIT","ānām","rahita","noun-adj","","ānām","rahitānām"
5,"api","","","api","ind","","","api"
6,"śabd","ŚABD","a","śabda","noun-adj","","a","śabda"
7,"^ādīnāṃ","ĀD","īnāṃ","ādi","noun-adj","","īnām","ādīnām"
8,"tadvat","","","tadvat","ind","","","tadvat"
9,"tayā","","","tad","pron","","","tad"
10,"bhāvya","BHĀVY","a","bhāvya","noun-adj","","a","bhāvya"
11,"mānatvāt","MĀNATV","āt","mānatva","noun-adj","","āt","mānatvāt"
12,"/","","","","punct","","","/"
NA,"</s>","","","","","","",""
NA,"<s number=""22"">","","","","","","",""
1,"kiṃ","","","kim","pron","","","kim"
2,"ca","","","ca","ind","","","ca"
3,"sphuṭī","SPHUṬ","ī","sphuṭi","noun-adj","","ī","sphuṭī"
4,"bhūya","BHŪY","a","bhūya","noun-adj","","a","bhūya"
5,"kiyat","KIY","at","kiyat","noun-adj","","at","kiyat"
6,"kālam","KĀL","am","kāla","noun-adj","","am","kālam"
7,"api","","","api","ind","","","api"
8,"tiṣṭhato","TIṢṬH","ato","tiṣṭha","noun-adj","","ataḥ","tiṣṭhataḥ"
9,"niṣprayojanatvam","NIṢPRAYOJAN","atvam","niṣprayojanatva","noun-adj","","atvam","niṣprayojanatvam"
10,"/","","","","punct","","","/"
NA,"</s>","","","","","","",""
NA,"<s number=""23"">","","","","","","",""
1,"rūpiṇaḥ","RŪP","iṇaḥ","rūpin","noun-adj","","inaḥ","rūpinaḥ"
2,"pratiniyata","PRATINIYAT","a","pratiniyata","noun-adj","","a","pratiniyata"
3,"kāla","KĀL","a","kāla","noun-adj","","a","kāla"
4,"deśa","DEŚ","a","deśa","noun-adj","","a","deśa"
5,"vartitayā","VARTIT","ayā","vartitā","noun-adj","","ayā","vartitayā"
6,"vyāpakatvena","VYĀPAK","atvena","vyāpakatva","noun-adj","","atvena","vyāpakatvena"
7,"jagad","JAGAD","","jagat","noun-adj","","","jagad"
8,"arth","ARTH","a","artha","noun-adj","","a","artha"
9,"^opayogya","UPAYOGY","a","upayogya","noun-adj","","a","upayogya"
10,"bhijñ","BHIJÑ","a","bhijña","noun-adj","","a","bhijña"
11,"^ādi","ĀD","i","ādi","noun-adj","","i","ādi"
12,"guṇā","GUṆ","ā","guṇā","noun-adj","","ā","guṇā"
13,"yogāt","YOG","āt","yoga","noun-adj","","āt","yogāt"
14,"/","","","","punct","","","/"
NA,"</s>","","","","","","",""
NA,"<s number=""24"">","","","","","","",""
1,"vyāpino","VYĀP","ino","vyāpin","noun-adj","","inaḥ","vyāpinaḥ"
2,"hi","","","hi","ind","","","hi"
3,"tathā","","","tathā","ind","","","tathā"
4,"vidha","VIDH","a","vidha","noun-adj","","a","vidha"
5,"guṇa","GUṆ","a","guṇa","noun-adj","","a","guṇa"
6,"yogaḥ","YOG","aḥ","yoga","noun-adj","","aḥ","yogaḥ"
7,"/","","","","punct","","","/"
NA,"</s>","","","","","","",""
NA,"<s number=""25"">","","","","","","",""
1,"na","","","na","ind","","","na"
2,"ca","","","ca","ind","","","ca"
3,"rūpiṇo","RŪP","iṇo","rūpin","noun-adj","","inaḥ","rūpinaḥ"
4,"vyāpitvam","VYĀP","itvam","vyāpitva","verb","","itvam","vyāpitvam"
5,"/","","","","punct","","","/"
NA,"</s>","","","","","","",""
NA,"<s number=""26"">","","","","","","",""
1,"ghaṭasy","GHAṬ","asya","ghaṭa","noun-adj","","asya","ghaṭasya"
2,"^āpi","","","api","ind","","","api"
3,"vyāpitva","VYĀP","itva","vyāpitva","verb","","itva","vyāpitva"
4,"prasaṅgāt","PRASAṄG","āt","prasaṅga","noun-adj","","āt","prasaṅgāt"
5,"/","","","","punct","","","/"
NA,"</s>","","","","","","",""
NA,"<s number=""27"">","","","","","","",""
1,"api","","","api","ind","","","api"
2,"ca","","","ca","ind","","","ca"
3,"yad","","","yad","pron","","","yad"
4,"eva","","","eva","ind","","","eva"
5,"bhāvyate","BHĀV","yate","bhav","verb","bhū","yate","bhāvyate"
6,"tad","","","tad","pron","","","tad"
7,"eva","","","eva","ind","","","eva"
8,"sphuṭī","SPHUṬ","ī","sphuṭi","noun-adj","","ī","sphuṭī"
9,"bhavat","BHAV","at","bhav","verb","bhū","at","bhavat"
10,"i","","","","ind","","",""
11,"iti","","","iti","ind","","","iti"
12,"cen","","","ced","ind","","","ced"
13,"mataṃ","MAT","aṃ","mata","noun-adj","","am","matam"
14,"tat","","","tad","pron","","","tad"
15,"kathaṃ","","","katham","ind","","","katham"
16,"viśvarūpa","VIŚVARŪP","a","viśvarūpa","noun-adj","","a","viśvarūpa"
17,"maṇivad","MAṆ","ivad","maṇivat","noun-adj","","ivad","maṇivad"
18,"bhinna","BHINN","a","bhinna","noun-adj","","a","bhinna"
19,"bhinn","BHINN","a","bhinna","noun-adj","","a","bhinna"
20,"^ādhimokṣān","ADHIMOKṢ","ān","adhimokṣa","noun-adj","","ān","adhimokṣān"
21,"eka","EK","a","eka","noun-adj","","a","eka"
22,"viney","VINEY","a","vineya","noun-adj","","a","vineya"
23,"^ābhimata","ABHIMAT","a","abhimata","noun-adj","","a","abhimata"
24,"yugapa","YUGAP","a","yugapa","noun-adj","","a","yugapa"
25,"dane","DAN","e","danu","noun-adj","","e","dane"
26,"kākāra","KĀKĀR","a","kākāra","noun-adj","","a","kākāra"
27,"prakāś","PRAKĀŚ","a","prakāśa","noun-adj","","a","prakāśa"
28,"^āspadam","ĀSPAD","am","āspada","noun-adj","","am","āspadam"
29,"api","","","api","ind","","","api"
30,"tat","","","tad","pron","","","tad"
31,"syāt","","","as","verb","as","",""
32,"/","","","","punct","","","/"
NA,"</s>","","","","","","",""
NA,"<s number=""28"">","","","","","","",""
1,"ata","","","atas","ind","","","atas"
2,"ev","","","eva","ind","","","eva"
3,"ānanta","ANANT","a","ananta","noun-adj","","a","ananta"
4,"vineyānām","VINEY","ānām","vineya","noun-adj","","ānām","vineyānām"
5,"adhimukti","ADHIMUKT","i","adhimukti","noun-adj","","i","adhimukti"
6,"bhedād","BHED","ād","bheda","noun-adj","","āt","bhedāt"
7,"a","","","alpha_privativum","ind","","","alpha_privativum"
8,"pramey","PRAMEY","a","prameya","noun-adj","","a","prameya"
9,"^ākāra","ĀKĀR","a","ākāra","noun-adj","","a","ākāra"
10,"vaicitrya","VAICITRY","a","vaicitrya","noun-adj","","a","vaicitrya"
11,"vatoḥ","VAT","oḥ","vatu","noun-adj","","oḥ","vatoḥ"
12,"saṃbhoga","SAMBHOG","a","sambhoga","noun-adj","","a","sambhoga"
13,"nirmāṇa","NIRMĀṆ","a","nirmāṇa","noun-adj","","a","nirmāṇa"
14,"kāyayor","KĀY","ayor","kāya","noun-adj","","ayoḥ","kāyayoḥ"
15,"bhāvayītum","BHĀVAY","ītum","bhāv","verb","bhū","tums","bhāvaytums"
16,"a","","","alpha_privativum","ind","","","alpha_privativum"
17,"śakyatvāt","ŚAKY","atvāt","śakyatva","noun-adj","","atvāt","śakyatvāt"
18,"tadd","TAD","","tad","pron","","","tad"
19,"hetāv","HET","āv","heta","noun-adj","","au","hetau"
20,"eva","","","eva","ind","","","eva"
21,"yatitavyam","YAT","itavyam","yat","verb","","itavyam","yatitavyam"
22,"/","","","","punct","","","/"
NA,"</s>","","","","","","",""
NA,"<s number=""29"">","","","","","","",""
1,"na","","","na","ind","","","na"
2,"punas","","","punar","ind","","","punar"
3,"tadbhāvanā","TADBHĀV","anā","tadbhāva","noun-adj","","anā","tadbhāvanā"
4,"mātra","MĀTR","a","mātra","noun-adj","","a","mātra"
5,"eva","","","eva","ind","","","eva"
6,"/","","","","punct","","","/"
NA,"</s>","","","","","","",""
NA,"<s number=""30"">","","","","","","",""
1,"tad","","","tad","pron","","","tad"
2,"evaṃ","","","eva","ind","","","eva"
3,"yuktitas","YUKT","itas","yuktita","noun-adj","","itas","yuktitas"
4,"tāvat","TĀVAT","","tāvat","ind","","","tāvat"
5,"prapañc","PRAPAÑC","a","prapañca","noun-adj","","a","prapañca"
6,"^ākāra","ĀKĀR","a","ākāra","noun-adj","","a","ākāra"
7,"bhāvanayā","BHĀVAN","ayā","bhāvanā","noun-adj","","ayā","bhāvanayā"
8,"na","","","na","ind","","","na"
9,"buddhatvam","BUDDHATV","am","buddhatva","noun-adj","","am","buddhatvam"
10,"/","","","","punct","","","/"
NA,"</s>","","","","","","",""
NA,"<s number=""31"">","","","","","","",""
1,"n","","a","na","ind","","a","na"
2,"^āpy","","","api","ind","","","api"
3,"āgamataḥ","ĀGAM","ataḥ","āgama","noun-adj","","ataḥ","āgamataḥ"
4,"/","","","","punct","","","/"
NA,"</s>","","","","","","",""
NA,"<s number=""32"">","","","","","","",""
1,"tathā","","","tathā","ind","","","tathā"
2,"śrī","ŚRĪ","","śrī","noun-adj","","","śrī"
3,"vajra","VAJR","a","vajra","noun-adj","","a","vajra"
4,"ḍākaḥ","ḌĀK","aḥ","ḍāka","noun-adj","","aḥ","ḍākaḥ"
5,"/","","","","punct","","","/"
NA,"</s>","","","","","","",""
NA,"<s number=""33"">","","","","","","",""
1,"//","","","","punct","","","//"
NA,"</s>","","","","","","",""
NA,"<s number=""34"">","","","","","","",""
NA,"</page>","","","","","","",""
NA,"<page number=""7"">","","","","","","",""
3,"yathā","","","yathā","ind","","","yathā"
4,"tantr","TANTR","a","tantra","noun-adj","","a","tantra"
5,"^ānusāreṇa","ANUSĀR","eṇa","anusāra","noun-adj","","ena","anusārena"
6,"kurvantaḥ","KURV","antaḥ","kurvat","noun-adj","","antaḥ","kurvantaḥ"
7,"prakriyāṃ","PRAKRIY","āṃ","prakriyā","noun-adj","","ām","prakriyām"
8,"narāḥ","NAR","āḥ","nara","noun-adj","","āḥ","narāḥ"
9,"/","","","","punct","","","/"
10,"yatnena","YATN","ena","yatna","noun-adj","","ena","yatnena"
11,"kleśam","KLEŚ","am","kleśa","noun-adj","","am","kleśam"
12,"utthāpya","UTTHĀP","ya","uttiṣṭh","verb","","ya","utthāpya"
13,"svaceto","SVACET","o","svacetas","noun-adj","","aḥ","svacetaḥ"
14,"vidravanti","VIDRAVANT","i","vidrav","noun-adj","","i","vidravanti"
15,"hi","","","hi","ind","","","hi"
16,"//","","","","punct","","","//"
NA,"</s>","","","","","","",""
NA,"<s number=""35"">","","","","","","",""
1,"tasmāt","","","tad","pron","","","tad"
2,"sarvaprayatnena","SARVAPRAYATNEN","a","sarvaprayatnena","noun-adj","","a","sarvaprayatnena"
3,"maṇḍal","MAṆḌAL","a","maṇḍala","noun-adj","","a","maṇḍala"
4,"^ādi","ĀD","i","ādi","noun-adj","","i","ādi"
5,"vidhi","VIDH","i","vidhi","noun-adj","","i","vidhi"
6,"kriyāḥ","KRIY","āḥ","kriya","noun-adj","","āḥ","kriyāḥ"
7,"/","","","","punct","","","/"
8,"vimokṣ","VIMOKṢ","","vimokṣa","noun-adj","","","vimokṣ"
9,"ā","","","alpha_privativum","ind","","","alpha_privativum"
10,"vāhikān","VĀHIK","āna","vāhika","noun-adj","","āna","vāhikāna"
11,"^aiva","","","eva","ind","","","eva"
12,"paraṃ","PAR","aṃ","para","noun-adj","","am","param"
13,"ha","","","ha","ind","","","ha"
14,"vyāsa","VYĀS","a","vyāsa","noun-adj","","a","vyāsa"
15,"kāraṇam","KĀRAṆ","am","kāraṇa","noun-adj","","am","kāraṇam"
16,"//","","","","punct","","","//"
NA,"</s>","","","","","","",""
NA,"<s number=""36"">","","","","","","",""
1,"īti","","","iti","ind","","","iti"
2,"/","","","","punct","","","/"
NA,"</s>","","","","","","",""
NA,"<s number=""37"">","","","","","","",""
1,"śrī","ŚRĪ","","śrī","noun-adj","","","śrī"
2,"dvi","DV","i","dvi","noun-adj","","i","dvi"
3,"kalpa","KALP","a","kalpa","noun-adj","","a","kalpa"
4,"rāje","RĀJ","e","rājan","noun-adj","","e","rāje"
5,"api","","","api","ind","","","api"
6,"/","","","","punct","","","/"
NA,"</s>","","","","","","",""
NA,"<s number=""38"">","","","","","","",""
1,"na","","","na","ind","","","na"
2,"mantra","MANTR","a","mantra","noun-adj","","a","mantra"
3,"jāpo","JĀP","o","jāpa","noun-adj","","aḥ","jāpaḥ"
4,"na","","","na","ind","","","na"
5,"tapo","TAP","o","tapas","noun-adj","","aḥ","tapaḥ"
6,"na","","","na","ind","","","na"
7,"homo","HOM","o","homa","noun-adj","","aḥ","homaḥ"
8,"na","","","na","ind","","","na"
9,"māṇḍaleyaṃ","MĀṆḌALEY","aṃ","māṇḍaleya","noun-adj","","am","māṇḍaleyam"
10,"na","","","na","ind","","","na"
11,"ca","","","ca","ind","","","ca"
12,"maṇḍalaṃ","MAṆḌAL","aṃ","maṇḍala","noun-adj","","am","maṇḍalam"
13,"ca","","","ca","ind","","","ca"
14,"/","","","","punct","","","/"
NA,"</s>","","","","","","",""
NA,"<s number=""39"">","","","","","","",""
1,"sa","","","tad","pron","","","tad"
2,"mantra","MANTR","a","mantra","noun-adj","","a","mantra"
3,"jāpaḥ","JĀP","aḥ","jāpa","noun-adj","","aḥ","jāpaḥ"
4,"sa","","","tad","pron","","","tad"
5,"tapaḥ","TAP","aḥ","tapas","noun-adj","","aḥ","tapaḥ"
6,"sa","","","tad","pron","","","tad"
7,"homas","HOM","as","homa","noun-adj","","aḥ","homaḥ"
8,"tan","","","tad","pron","","","tad"
9,"māṇḍaleyaṃ","MĀṆḌALEY","aṃ","māṇḍaleya","noun-adj","","am","māṇḍaleyam"
10,"tan","","","tad","pron","","","tad"
11,"maṇḍalaṃ","MAṆḌAL","aṃ","maṇḍala","noun-adj","","am","maṇḍalam"
12,"ca","","","ca","ind","","","ca"
13,"/","","","","punct","","","/"
NA,"</s>","","","","","","",""
NA,"<s number=""40"">","","","","","","",""
1,"samā","SAM","ā","samā","noun-adj","","ā","samā"
2,"sataś","SAT","aś","sat","noun-adj","","aḥ","sataḥ"
3,"citta","CITT","a","citta","noun-adj","","a","citta"
4,"samāja","SAMĀJ","a","samāja","noun-adj","","a","samāja"
5,"rūpī","RŪP","ī","rūpin","noun-adj","","ī","rūpī"
6,"//","","","","punct","","","//"
NA,"</s>","","","","","","",""
NA,"<s number=""41"">","","","","","","",""
1,"iti","","","iti","ind","","","iti"
2,"/","","","","punct","","","/"
NA,"</s>","","","","","","",""
NA,"<s number=""42"">","","","","","","",""
1,"śrī","ŚRĪ","","śrī","noun-adj","","","śrī"
2,"saṃpuṭa","SAṂPUṬ","a","saṃpuṭa","noun-adj","","a","saṃpuṭa"
3,"tilakaś","TILAK","aś","tilaka","noun-adj","","aḥ","tilakaḥ"
4,"ca","","","ca","ind","","","ca"
5,"/","","","","punct","","","/"
NA,"</s>","","","","","","",""
NA,"<s number=""43"">","","","","","","",""
1,"na","","","na","ind","","","na"
2,"śūnyabhāvanāṃ","ŚŪNYABHĀV","anāṃ","śūnyabhāva","noun-adj","","anāṃ","śūnyabhāvanāṃ"
3,"kuryān","KUR","yān","kar","verb","kṛ","yām","kuryām"
4,"n","","a","na","ind","","a","na"
5,"^āpi","","","api","ind","","","api"
6,"c","","a","ca","ind","","a","ca"
7,"^ā","","","alpha_privativum","ind","","","alpha_privativum"
8,"śūnyabhāva","ŚŪNYABHĀV","a","śūnyabhāva","noun-adj","","a","śūnyabhāva"
9,"nām","NĀM","","nāman","noun-adj","","","nām"
10,"/","","","","punct","","","/"
11,"aśūnya","AŚŪNY","a","aśūnya","noun-adj","","a","aśūnya"
12,"śūnyayor","ŚŪNY","ayor","śūnya","noun-adj","","ayoḥ","śūnyayoḥ"
13,"grāhe","GRĀH","e","grāha","noun-adj","","e","grāhe"
14,"jāyate","JĀ","yate","jan","verb","jan","yate","jāyate"
15,"an","","","alpha_privativum","ind","","","alpha_privativum"
16,"alpa","ALP","a","alpa","noun-adj","","a","alpa"
17,"kalpanā","KALPAN","ā","kalpanā","noun-adj","","ā","kalpanā"
18,"//","","","","punct","","","//"
NA,"</s>","","","","","","",""
NA,"<s number=""44"">","","","","","","",""
1,"iti","","","iti","ind","","","iti"
2,"/","","","","punct","","","/"
NA,"</s>","","","","","","",""
NA,"<s number=""45"">","","","","","","",""
1,"indr","INDR","","indra","noun-adj","","","indr"
2,"a","","","alpha_privativum","ind","","","alpha_privativum"
3,"bhūti","BHŪT","i","bhūti","noun-adj","","i","bhūti"
4,"pādāś","PĀD","āś","pāda","noun-adj","","āḥ","pādāḥ"
5,"ca","","","ca","ind","","","ca"
6,"/","","","","punct","","","/"
NA,"</s>","","","","","","",""
NA,"<s number=""46"">","","","","","","",""
1,"mudrā","MUDR","ā","mudrā","noun-adj","","ā","mudrā"
2,"maṇḍala","MAṆḌAL","a","maṇḍala","noun-adj","","a","maṇḍala"
3,"mantr","MANTR","a","mantra","noun-adj","","a","mantra"
4,"^ādi","ĀD","i","ādi","noun-adj","","i","ādi"
5,"japa","JAP","a","japa","noun-adj","","a","japa"
6,"bhāvana","BHĀVAN","a","bhāvana","noun-adj","","a","bhāvana"
7,"tat","TAT","","tad","pron","","","tat"
8,"parāḥ","PAR","āḥ","para","noun-adj","","āḥ","parāḥ"
9,"/","","","","punct","","","/"
10,"n","","a","na","ind","","a","na"
11,"^aiva","","","eva","ind","","","eva"
12,"siddhiṃ","SIDDH","iṃ","siddhi","noun-adj","","im","siddhim"
13,"parāṃ","PAR","āṃ","para","noun-adj","","ām","parām"
14,"yānti","YĀ","nti","yā","verb","yā","nti","yānti"
15,"kalp","KALP","","kalpa","noun-adj","","","kalp"
16,"ā","","","alpha_privativum","ind","","","alpha_privativum"
17,"saṃkhyeya","SAṂKHYEY","a","saṃkhyeya","noun-adj","","a","saṃkhyeya"
18,"koṭibhiḥ","KOṬ","ibhiḥ","koṭi","noun-adj","","ibhiḥ","koṭibhiḥ"
19,"//","","","","punct","","","//"
NA,"</s>","","","","","","",""
NA,"<s number=""47"">","","","","","","",""
NA,"</page>","","","","","","",""
NA,"<page number=""8"">","","","","","","",""
3,"iti","","","iti","ind","","","iti"
4,"/","","","","punct","","","/"
NA,"</s>","","","","","","",""
NA,"<s number=""48"">","","","","","","",""
1,"saraha","SARAH","a","saraha","noun-adj","","a","saraha"
2,"pādā","PĀD","ā","pāda","noun-adj","","āḥ","pādāḥ"
3,"api","","","api","ind","","","api"
4,"/","","","","punct","","","/"
NA,"</s>","","","","","","",""
NA,"<s number=""49"">","","","","","","",""
1,"manta","MANT","a","man","verb","man","a","manta"
2,"ṇa","","","ṇa","ind","","","ṇa"
3,"tanta","","","","ind","","",""
4,"ṇa","","","ṇa","ind","","","ṇa"
5,"dheya","DHE","ya","dheya","verb","","ya","dheya"
6,"ṇa","","","ṇa","ind","","","ṇa"
7,"dhāraṇa","DHĀRAṆ","a","dhāraṇa","noun-adj","","a","dhāraṇa"
8,"sabbavi","SAB","avi","saba","noun-adj","","avi","sabavi"
9,"re","","","ra","ind","","","ra"
10,"va","","","vai","ind","","","vai"
11,"ḍha","ḌHA","","ḍha","noun-adj","","","ḍha"
12,"vibb","","","","ind","","",""
13,"hama","HAM","a","hama","noun-adj","","a","hama"
14,"kāraṇa","KĀRAṆ","a","kāraṇa","noun-adj","","a","kāraṇa"
15,"/","","","","punct","","","/"
16,"as","","","asi","ind","","","asi"
17,"amala","AMAL","a","amala","noun-adj","","a","amala"
18,"citta","CITT","a","citta","noun-adj","","a","citta"
19,"ma","","","ma","ind","","","ma"
20,"jjhāṇeṃ","","","","ind","","",""
21,"khara","KHAR","a","khara","noun-adj","","a","khara"
22,"ḍaho","ḌAH","o","ḍaha","noun-adj","","aḥ","ḍahaḥ"
23,"suhe","SUH","e","suha","noun-adj","","e","suhe"
24,"a","","","alpha_privativum","ind","","","alpha_privativum"
25,"chante","ŚANT","e","śanta","noun-adj","","e","śante"
26,"ma","","","ma","ind","","","ma"
27,"ap","","","ap","ind","","","ap"
28,"pāṇa","PĀṆ","a","pāṇa","noun-adj","","a","pāṇa"
29,"jhaga","","","","ind","","",""
30,"ḍaho","ḌAH","o","ḍaha","noun-adj","","aḥ","ḍahaḥ"
31,"//","","","","punct","","","//"
NA,"</s>","","","","","","",""
NA,"<s number=""50"">","","","","","","",""
1,"ityi","","","","ind","","",""
2,"/","","","","punct","","","/"
NA,"</s>","","","","","","",""
NA,"<s number=""51"">","","","","","","",""
1,"kathaṃ","","","katham","ind","","","katham"
2,"tarhi","","","tarhi","ind","","","tarhi"
3,"devatā","DEVAT","ā","devatā","noun-adj","","ā","devatā"
4,"kāra","KĀR","a","kāra","noun-adj","","a","kāra"
5,"bhāva","BHĀV","a","bhāva","noun-adj","","a","bhāva"
6,"nādy","NĀD","y","nādi","noun-adj","","i","nādi"
7,"uppadeśa","UPPADEŚ","a","uppadeśa","noun-adj","","a","uppadeśa"
8,"iti","","","iti","ind","","","iti"
9,"cet","CET","","ced","noun-adj","","","cet"
10,"laukika","LAUK","ika","laukika","noun-adj","","ika","laukika"
11,"siddhy","SIDDH","y","siddhi","noun-adj","","i","siddhi"
12,"artham","ARTH","am","artha","noun-adj","","am","artham"
13,"eva","","","eva","ind","","","eva"
14,"tad","TAD","","tad","pron","","","tad"
15,"arthinām","ARTH","inām","arthin","noun-adj","","inām","arthinām"
16,"iti","","","iti","ind","","","iti"
17,"kecit","","","kimcit","ind","","","kimcit"
18,"/","","","","punct","","","/"
NA,"</s>","","","","","","",""
NA,"<s number=""52"">","","","","","","",""
1,"tad","","","tad","pron","","","tad"
2,"uktam","UKT","am","ukta","noun-adj","","am","uktam"
3,"/","","","","punct","","","/"
NA,"</s>","","","","","","",""
NA,"<s number=""53"">","","","","","","",""
1,"ādikarmika","ĀDIKARMIK","a","ādikarmika","noun-adj","","a","ādikarmika"
2,"sattvānāṃ","SATTV","ānāṃ","sattva","noun-adj","","ānām","sattvānām"
3,"devatā","DEVAT","ā","devatā","noun-adj","","ā","devatā"
4,"mūrti","MŪRT","i","mūrti","noun-adj","","i","mūrti"
5,"bhāvanā","BHĀVAN","ā","bhāvanā","noun-adj","","ā","bhāvanā"
6,"/","","","","punct","","","/"
NA,"</s>","","","","","","",""
NA,"<s number=""54"">","","","","","","",""
1,"nirdiṣṭā","NIRDIṢṬ","ā","nirdiṣṭa","noun-adj","","āḥ","nirdiṣṭāḥ"
2,"prathamamṃ","PRATHAM","amṃ","prathama","noun-adj","","amṃ","prathamamṃ"
3,"tantre","TANTR","e","tantra","noun-adj","","e","tantre"
4,"sarva","SARV","a","sarva","noun-adj","","a","sarva"
5,"karma","KARM","a","karman","noun-adj","","a","karma"
6,"prasiddhaye","PRASIDDH","aye","prasiddhi","noun-adj","","aye","prasiddhaye"
7,"//","","","","punct","","","//"
NA,"</s>","","","","","","",""
NA,"<s number=""55"">","","","","","","",""
1,"īti","","","iti","ind","","","iti"
2,"/","","","","punct","","","/"
NA,"</s>","","","","","","",""
NA,"<s number=""56"">","","","","","","",""
1,"tattva","TATTV","a","tattva","noun-adj","","a","tattva"
2,"jñāna","JÑĀN","a","jñāna","noun-adj","","a","jñāna"
3,"bhavyat","BHAVY","at","bhavyatā","noun-adj","","at","bhavyat"
4,"āpādan","ĀPĀD","an","āpādana","noun-adj","","ān","āpādān"
5,"ārtha","ARTH","a","artha","noun-adj","","a","artha"
6,"mātram","MĀTR","am","mātra","noun-adj","","am","mātram"
7,"ev","","","eva","ind","","","eva"
8,"ety","","","iti","ind","","","iti"
9,"anye","ANY","e","anya","pron","","e","anye"
10,"/","","","","punct","","","/"
NA,"</s>","","","","","","",""
NA,"<s number=""57"">","","","","","","",""
1,"śrī","ŚRĪ","","śrī","noun-adj","","","śrī"
2,"heruk","HERUK","a","heruka","noun-adj","","a","heruka"
3,"^ādi","ĀD","i","ādi","noun-adj","","i","ādi"
4,"rūpa","RŪP","a","rūpa","noun-adj","","a","rūpa"
5,"bhāvanayā","BHĀVAN","ayā","bhāvanā","noun-adj","","ayā","bhāvanayā"
6,"tanmātram","TANMĀTR","am","tanmātra","noun-adj","","am","tanmātram"
7,"eva","","","eva","ind","","","eva"
8,"niṣpadyate","NIṢPAD","yate","niṣpad","verb","niṣpad","yate","niṣpadyate"
9,"/","","","","punct","","","/"
NA,"</s>","","","","","","",""
NA,"<s number=""58"">","","","","","","",""
1,"tathā","","","tathā","ind","","","tathā"
2,"ca","","","ca","ind","","","ca"
3,"/","","","","punct","","","/"
NA,"</s>","","","","","","",""
NA,"<s number=""59"">","","","","","","",""
1,"//","","","","punct","","","//"
NA,"</s>","","","","","","",""
NA,"<s number=""60"">","","","","","","",""
NA,"</page>","","","","","","",""
NA,"<page number=""9"">","","","","","","",""
3,"ity","","","iti","ind","","","iti"
4,"apare","APAR","e","apara","noun-adj","","e","apare"
5,"/","","","","punct","","","/"
NA,"</s>","","","","","","",""
NA,"<s number=""61"">","","","","","","",""
1,"ityi","","","","ind","","",""
2,"/","","","","punct","","","/"
NA,"</s>","","","","","","",""
NA,"<s number=""62"">","","","","","","",""
1,"te","","","tad","pron","","","tad"
2,"sarve","SARV","e","sarva","noun-adj","","e","sarve"
3,"nirastāḥ","NIRAST","āḥ","nirasta","noun-adj","","āḥ","nirastāḥ"
4,"/","","","","punct","","","/"
NA,"</s>","","","","","","",""
NA,"<s number=""63"">","","","","","","",""
1,"sarvākāravaropeta","SARVĀKĀRAVAROPET","a","sarvākāravaropeta","noun-adj","","a","sarvākāravaropeta"
2,"śūnyat","ŚŪNYAT","a","śūnyatā","noun-adj","","a","śūnyatā"
3,"^aika","EK","a","eka","noun-adj","","a","eka"
4,"rasa","RAS","a","rasa","noun-adj","","a","rasa"
5,"mahāsu","MAH","āsu","mahat","noun-adj","","āsu","mahāsu"
6,"khama","KHAM","a","khama","noun-adj","","a","khama"
7,"yasya","YAŚ","ya","yad","pron","","ya","yaśya"
8,"bhagavataḥ","BHAGAV","ataḥ","bhagavat","noun-adj","","ataḥ","bhagavataḥ"
9,"sādhyasya","SĀDHY","asya","sādhya","noun-adj","","asya","sādhyasya"
10,"bhāvya","BHĀVY","a","bhāvya","noun-adj","","a","bhāvya"
11,"mānatvāt","MĀNATV","āt","mānatva","noun-adj","","āt","mānatvāt"
12,"/","","","","punct","","","/"
NA,"</s>","","","","","","",""
NA,"<s number=""64"">","","","","","","",""
1,"na","","","na","ind","","","na"
2,"khalv","","","khalu","ind","","","khalu"
3,"ākāram","ĀKĀRAM","a","ākāramat","noun-adj","","a","ākārama"
4,"^ātraṃ","ĀTR","aṃ","atra","noun-adj","","am","ātram"
5,"bhāvyate","BHĀV","yate","bhav","verb","bhū","yate","bhāvyate"
6,"/","","","","punct","","","/"
NA,"</s>","","","","","","",""
NA,"<s number=""65"">","","","","","","",""
1,"dharmatā","DHARMAT","ā","dharmatā","noun-adj","","ā","dharmatā"
2,"mātraṃ","MĀTR","aṃ","mātra","noun-adj","","am","mātram"
3,"c","","a","ca","ind","","a","ca"
4,"^ākāra","ĀKĀR","a","ākāra","noun-adj","","a","ākāra"
5,"cakram","CAKR","am","cakra","noun-adj","","am","cakram"
6,"apāsya","APĀS","ya","apās","verb","","ya","apāsya"
7,"taṭa","TAṬ","a","taṭa","noun-adj","","a","taṭa"
8,"sthaṃ","STH","aṃ","stha","noun-adj","","am","stham"
9,"na","","","na","ind","","","na"
10,"saṃbhavati","SAṂBHAV","ati","saṃbhav","verb","saṃbhū","ati","saṃbhavati"
11,"/","","","","punct","","","/"
NA,"</s>","","","","","","",""
NA,"<s number=""66"">","","","","","","",""
1,"yat","","","yad","pron","","","yad"
2,"kevalaṃ","KEVAL","aṃ","kevala","noun-adj","","am","kevalam"
3,"bhāvanīyām","BHĀVANĪY","ām","bhāvanīya","noun-adj","","ām","bhāvanīyām"
4,"/","","","","punct","","","/"
NA,"</s>","","","","","","",""
NA,"<s number=""67"">","","","","","","",""
1,"syāt","","","as","verb","as","",""
2,"kevalaṃ","KEVAL","aṃ","kevala","noun-adj","","am","kevalam"
3,"tadbhāvanā","TADBHĀV","anā","tadbhāva","noun-adj","","anā","tadbhāvanā"
4,"/","","","","punct","","","/"
NA,"</s>","","","","","","",""
NA,"<s number=""68"">","","","","","","",""
1,"tattv","TATTV","a","tattva","noun-adj","","a","tattva"
2,"^ārtha","ARTH","a","artha","noun-adj","","a","artha"
3,"bhāvanān","BHĀVAN","āna","bhāvana","noun-adj","","āna","bhāvanāna"
4,"^aiva","","","eva","ind","","","eva"
5,"/","","","","punct","","","/"
NA,"</s>","","","","","","",""
NA,"<s number=""69"">","","","","","","",""
1,"tad","","","tad","pron","","","tad"
2,"uktam","UKT","am","ukta","noun-adj","","am","uktam"
3,"ārya","ĀRY","a","ārya","noun-adj","","a","ārya"
4,"deva","DEV","a","deva","noun-adj","","a","deva"
5,"pādaiḥ","PĀD","aiḥ","pāda","noun-adj","","air","pādair"
6,"/","","","","punct","","","/"
NA,"</s>","","","","","","",""
NA,"<s number=""70"">","","","","","","",""
1,"a","","","alpha_privativum","ind","","","alpha_privativum"
2,"bhāva","BHĀV","a","bhāva","noun-adj","","a","bhāva"
3,"bhāvanāṃ","BHĀVAN","āṃ","bhāvanā","noun-adj","","ām","bhāvanām"
4,"mūḍhāḥ","MŪḌH","āḥ","mūḍha","noun-adj","","āḥ","mūḍhāḥ"
5,"kevalāṃ","KEVAL","āṃ","kevalā","noun-adj","","ām","kevalām"
6,"ya","","","yad","pron","","","yad"
7,"upāsate","UPĀS","ate","ās","verb","ās","ate","upāsate"
8,"/","","","","punct","","","/"
9,"te","","","tad","pron","","","tad"
10,"vyoma","VYOM","a","vyoma","noun-adj","","a","vyoma"
11,"dharmiṇo","DHARM","iṇo","dharmin","noun-adj","","inaḥ","dharminaḥ"
12,"bālāḥ","BĀL","āḥ","bāla","noun-adj","","āḥ","bālāḥ"
13,"prayānti","PRAYĀ","nti","prai","verb","prai","nti","prayānti"
14,"jaḍatāṃ","JAḌ","atāṃ","jaḍatā","noun-adj","","atām","jaḍatām"
15,"pa","","","pa","ind","","","pa"
16,"rām","RĀM","","rāma","noun-adj","","","rām"
17,"//","","","","punct","","","//"
NA,"</s>","","","","","","",""
NA,"<s number=""71"">","","","","","","",""
1,"iti","","","iti","ind","","","iti"
2,"/","","","","punct","","","/"
NA,"</s>","","","","","","",""
NA,"<s number=""72"">","","","","","","",""
1,"ārya","ĀRY","a","ārya","noun-adj","","a","ārya"
2,"pādaiś","PĀD","aiś","pāda","noun-adj","","aiś","pādaiś"
3,"ca","","","ca","ind","","","ca"
4,"/","","","","punct","","","/"
NA,"</s>","","","","","","",""
NA,"<s number=""73"">","","","","","","",""
1,"an","","","alpha_privativum","ind","","","alpha_privativum"
2,"utpādeti","UTPĀD","eti","utpād","verb","utpad","eti","utpādeti"
3,"śūny","ŚŪNY","a","śūnya","noun-adj","","a","śūnya"
4,"^eti","","","iti","ind","","","iti"
5,"nirātm","NIRĀTM","a","nirātman","noun-adj","","a","nirātma"
6,"^eti","","","iti","ind","","","iti"
7,"ca","","","ca","ind","","","ca"
8,"dharmatā","DHARMAT","ā","dharmatā","noun-adj","","ā","dharmatā"
9,"m/","","","","punct","","","m/"
NA,"</s>","","","","","","",""
NA,"<s number=""74"">","","","","","","",""
1,"yo","","","yad","pron","","","yad"
2,"bhāvayati","BHĀV","ayati","bhav","verb","bhū","ayati","bhāvayati"
3,"mand","MAND","a","manda","noun-adj","","a","manda"
4,"^ātmā","ĀTM","ā","ātman","noun-adj","","ā","ātmā"
5,"na","","","na","ind","","","na"
6,"tāṃ","","","tad","pron","","","tad"
7,"bhāvayati","BHĀV","ayati","bhav","verb","bhū","ayati","bhāvayati"
8,"hy","","","hi","ind","","","hi"
9,"asau","","","adas","pron","","","adas"
10,"//","","","","punct","","","//"
NA,"</s>","","","","","","",""
NA,"<s number=""75"">","","","","","","",""
1,"//","","","","punct","","","//"
NA,"</s>","","","","","","",""
NA,"<s number=""76"">","","","","","","",""
NA,"</page>","","","","","","",""
NA,"<page number=""10"">","","","","","","",""
3,"iti","","","iti","ind","","","iti"
4,"/","","","","punct","","","/"
NA,"</s>","","","","","","",""
NA,"<s number=""77"">","","","","","","",""
1,"tato","","","tatas","ind","","","tatas"
2,"devat","DEVAT","a","devatā","noun-adj","","a","devatā"
3,"^ākāra","ĀKĀR","a","ākāra","noun-adj","","a","ākāra"
4,"mātraṃ","MĀTR","aṃ","mātra","noun-adj","","am","mātram"
5,"sthirī","STHIR","ī","sthirī","noun-adj","","ī","sthirī"
6,"kṛtya","KṚTY","a","kṛtya","noun-adj","","a","kṛtya"
7,"yuga","YUG","a","yuga","noun-adj","","a","yuga"
8,"naddha","NADDH","a","naddha","noun-adj","","a","naddha"
9,"rūpatay","RŪPAT","aya","rūpatā","noun-adj","","aya","rūpataya"
10,"^aiva","","","eva","ind","","","eva"
11,"guru","GUR","u","guru","noun-adj","","u","guru"
12,"ūpadeśato","UPADEŚ","ato","upadeśa","noun-adj","","ataḥ","upadeśataḥ"
13,"mahāsukham","MAHĀSUKH","am","mahāsukha","noun-adj","","am","mahāsukham"
14,"ayam","AYAM","","idam","pron","","","ayam"
15,"ṃ","","","","ind","","",""
16,"bhāvyata","BHĀVYAT","a","bhāvyatā","noun-adj","","a","bhāvyatā"
17,"iti","","","iti","ind","","","iti"
18,"kva","","","kva","ind","","","kva"
19,"yath","","a","yathā","ind","","a","yathā"
20,"^okta","UKT","a","ukta","noun-adj","","a","ukta"
21,"doṣ","DOṢ","a","doṣa","noun-adj","","a","doṣa"
22,"^āvakāśaḥ","AVAKĀŚ","aḥ","avakāśa","noun-adj","","aḥ","avakāśaḥ"
23,"kiṃ","","","kim","pron","","","kim"
24,"ca","","","ca","ind","","","ca"
25,"yat","","","yad","pron","","","yad"
26,"tāvad","TĀVAD","","tāvat","ind","","","tāvad"
27,"uktaṃ","UKT","aṃ","ukta","noun-adj","","am","uktam"
28,"“","","","","ind","","",""
29,"samādhi","SAMĀDH","i","samādhi","noun-adj","","i","samādhi"
30,"lābho","LĀBH","o","lābha","noun-adj","","aḥ","lābhaḥ"
31,"api","","","api","ind","","","api"
32,"na","","","na","ind","","","na"
33,"syād-”","","","","ind","","",""
34,"iti","","","iti","ind","","","iti"
35,"tad","","","tad","pron","","","tad"
36,"asat","ASAT","","asatī","noun-adj","","","asat"
37,"/","","","","punct","","","/"
NA,"</s>","","","","","","",""
NA,"<s number=""78"">","","","","","","",""
1,"ā","","","alpha_privativum","ind","","","alpha_privativum"
2,"dar","DAR","a","dara","noun-adj","","a","dara"
3,"^ādi","ĀD","i","ādi","noun-adj","","i","ādi"
4,"viśiṣṭen","VIŚIṢṬ","en","viśiṣṭa","noun-adj","","ena","viśiṣṭena"
5,"ābhyāsena","ABHYĀS","ena","abhyāsa","noun-adj","","ena","abhyāsena"
6,"cittasy","CITT","asy","citta","noun-adj","","asya","cittasya"
7,"ālambyamāne","ĀLAṂB","yamāne","ālamb","verb","ālamb","yamāne","ālaṃbyamāne"
8,"vastuni","VAST","uni","vastu","noun-adj","","uni","vastuni"
9,"sthairya","STHAIRY","a","sthairya","noun-adj","","a","sthairya"
10,"lābhasy","LĀBH","asy","lābha","noun-adj","","asya","lābhasya"
11,"ānubhava","ANUBHAV","a","anubhava","noun-adj","","a","anubhava"
12,"siddhatvāt","SIDDH","atvāt","siddhatva","noun-adj","","atvāt","siddhatvāt"
13,"/","","","","punct","","","/"
NA,"</s>","","","","","","",""
NA,"<s number=""79"">","","","","","","",""
1,"tad","","","tad","pron","","","tad"
2,"uktam","UKT","am","ukta","noun-adj","","am","uktam"
3,"/","","","","punct","","","/"
NA,"</s>","","","","","","",""
NA,"<s number=""80"">","","","","","","",""
1,"tasmād","","","tad","pron","","","tad"
2,"bhūtam","BHŪT","am","bhūta","noun-adj","","am","bhūtam"
3,"a","","","alpha_privativum","ind","","","alpha_privativum"
4,"bhūtaṃ","BHŪT","aṃ","bhūta","noun-adj","","am","bhūtam"
5,"vā","","","vā","ind","","","vā"
6,"yad","","","yad","pron","","","yad"
7,"yad","","","yad","pron","","","yad"
8,"ev","","","eva","ind","","","eva"
9,"ātibhāvyate","ATIBHĀV","yate","atibhav","verb","atibhū","yate","atibhāvyate"
10,"/","","","","punct","","","/"
11,"bhāvanā","BHĀVAN","ā","bhāvanā","noun-adj","","ā","bhāvanā"
12,"bala","BAL","a","bala","noun-adj","","a","bala"
13,"niṣpattau","NIṢPATT","au","niṣpatti","noun-adj","","au","niṣpattau"
14,"tat","","","tad","pron","","","tad"
15,"sphuṭ","SPHUṬ","a","sphuṭa","noun-adj","","a","sphuṭa"
16,"^ākalpa","ĀKALP","a","akalpa","noun-adj","","a","ākalpa"
17,"dhī","DH","ī","dhī","noun-adj","","ī","dhī"
18,"phalam","PHAL","am","phala","noun-adj","","am","phalam"
19,"//","","","","punct","","","//"
NA,"</s>","","","","","","",""
NA,"<s number=""81"">","","","","","","",""
1,"iti","","","iti","ind","","","iti"
2,"/","","","","punct","","","/"
NA,"</s>","","","","","","",""
NA,"<s number=""82"">","","","","","","",""
1,"tantre","TANTR","e","tantra","noun-adj","","e","tantre"
2,"api","","","api","ind","","","api"
3,"/","","","","punct","","","/"
NA,"</s>","","","","","","",""
NA,"<s number=""83"">","","","","","","",""
1,"yena","","","yad","pron","","","yad"
2,"yena","","","yad","pron","","","yad"
3,"hi","","","hi","ind","","","hi"
4,"bhāvena","BHĀV","ena","bhāva","noun-adj","","ena","bhāvena"
5,"manaḥ","MAN","aḥ","manas","noun-adj","","aḥ","manaḥ"
6,"saṃyujyate","SAṂYUJ","yate","saṃyuj","verb","saṃyuj","yate","saṃyujyate"
7,"nṛṇām","ANṚ","ṇām","anṛc","noun-adj","","ṇām","anṛṇām"
8,"/","","","","punct","","","/"
9,"tena","","","tad","pron","","","tad"
10,"tanmayatāṃ","TANMAY","atāṃ","tanmayatā","noun-adj","","atām","tanmayatām"
11,"yāti","","","yā","ind","","","yā"
12,"viśvarūpo","VIŚVARŪP","o","viśvarūpa","noun-adj","","aḥ","viśvarūpaḥ"
13,"maṇir","MAṆ","ir","maṇi","noun-adj","","iḥ","maṇiḥ"
14,"yathā","","","yathā","ind","","","yathā"
15,"//","","","","punct","","","//"
NA,"</s>","","","","","","",""
NA,"<s number=""84"">","","","","","","",""
1,"iti","","","iti","ind","","","iti"
2,"/","","","","punct","","","/"
NA,"</s>","","","","","","",""
NA,"<s number=""85"">","","","","","","",""
1,"aneke","ANEK","e","aneka","noun-adj","","e","aneke"
2,"apy","","","api","ind","","","api"
3,"ākārā","ĀKĀR","ā","ākāra","noun-adj","","āḥ","ākārāḥ"
4,"dṛṣṭāḥ","DṚṢṬ","āḥ","dṛṣṭa","noun-adj","","āḥ","dṛṣṭāḥ"
5,"śrutā","ŚRUT","ā","śruta","noun-adj","","āḥ","śrutāḥ"
6,"vā","","","vā","ind","","","vā"
7,"vikalpyamānā","VIKALP","yamānā","vikalp","verb","vikḷp","yamānā","vikalpyamānā"
8,"yugapat","YUGAP","at","yugapa","noun-adj","","at","yugapat"
9,"tath","","a","tathā","ind","","a","tathā"
10,"^aiva","","","eva","ind","","","eva"
11,"pratibhānt","PRATIBHĀN","t","pratibhāna","noun-adj","","t","pratibhānt"
12,"īty","","","iti","ind","","","iti"
13,"apy","","","api","ind","","","api"
14,"anubhava","ANUBHAV","a","anubhava","noun-adj","","a","anubhava"
15,"siddham","SIDDH","am","siddha","noun-adj","","am","siddham"
16,"eva","","","eva","ind","","","eva"
17,"/","","","","punct","","","/"
NA,"</s>","","","","","","",""
NA,"<s number=""86"">","","","","","","",""
1,"manomaya","MANOMAY","a","manomaya","noun-adj","","a","manomaya"
2,"mātram","MĀTR","am","mātra","noun-adj","","am","mātram"
3,"tūrt","TŪRT","","tūrta","noun-adj","","","tūrt"
4,"itvena","ITV","ena","itvan","noun-adj","","ena","itvena"
5,"sarva","SARV","a","sarva","noun-adj","","a","sarva"
6,"dharmāṇāṃ","DHARM","āṇāṃ","dharma","noun-adj","","ānām","dharmānām"
7,"cakravarty","CAKRAVART","y","cakravartin","noun-adj","","i","cakravarti"
8,"ādi","ĀD","i","ādi","noun-adj","","i","ādi"
9,"bhāvanābhyo","BHĀVAN","ābhyo","bhāvana","noun-adj","","ābhyaḥ","bhāvanābhyaḥ"
10,"api","","","api","ind","","","api"
11,"tat","TAT","","tad","pron","","","tat"
12,"sphuṭī","SPHUṬ","ī","sphuṭi","noun-adj","","ī","sphuṭī"
13,"bhāve","BHĀV","e","bhāva","noun-adj","","e","bhāve"
14,"ko","","","kim","pron","","","kim"
15,"virodhaḥ","VIRODH","aḥ","virodha","noun-adj","","aḥ","virodhaḥ"
16,"?","","","","punct","","","?"
17,"uktaṃ","UKT","aṃ","ukta","noun-adj","","am","uktam"
18,"ca","","","ca","ind","","","ca"
19,"saraha","SARAH","a","saraha","noun-adj","","a","saraha"
20,"pādaiḥ","PĀD","aiḥ","pāda","noun-adj","","air","pādair"
21,"/","","","","punct","","","/"
NA,"</s>","","","","","","",""
NA,"<s number=""87"">","","","","","","",""
1,"//","","","","punct","","","//"
NA,"</s>","","","","","","",""
NA,"<s number=""88"">","","","","","","",""
NA,"</page>","","","","","","",""
NA,"<page number=""11"">","","","","","","",""
3,"citt","CITT","a","citta","noun-adj","","a","citta"
4,"^aika","EK","a","eka","noun-adj","","a","eka"
5,"sa","","","tad","pron","","","tad"
6,"a","","","alpha_privativum","ind","","","alpha_privativum"
7,"labīaṃ","LAB","īaṃ","","noun-adj","","īaṃ","labīaṃ"
8,"bhava","BHAV","a","bhava","noun-adj","","a","bhava"
9,"nibbāṇā","NIBBĀṆ","ā","nibbāṇā","noun-adj","","ā","nibbāṇā"
10,"vi","","","vi","ind","","","vi"
11,"jassa","JAS","sa","jasa","noun-adj","","sa","jassa"
12,"visphuranti","VISPHUR","anti","visphur","verb","","anti","visphuranti"
13,"/","","","","punct","","","/"
14,"tañ","","","tad","pron","","","tad"
15,"cintāmaṇir","CINTĀMAṆ","ir","cintāmaṇi","noun-adj","","iḥ","cintāmaṇiḥ"
16,"ūaṃ","","","","ind","","",""
17,"paṇa","PAṆ","a","paṇa","noun-adj","","a","paṇa"
18,"maha","MAH","a","mahat","noun-adj","","a","maha"
19,"icchā","ICCH","ā","icchā","noun-adj","","ā","icchā"
20,"phalaṃ","PHAL","aṃ","phala","noun-adj","","am","phalam"
21,"dei","","","","ind","","",""
22,"//","","","","punct","","","//"
NA,"</s>","","","","","","",""
NA,"<s number=""89"">","","","","","","",""
1,"iti","","","iti","ind","","","iti"
2,"/","","","","punct","","","/"
NA,"</s>","","","","","","",""
NA,"<s number=""90"">","","","","","","",""
1,"bhāvanāmaya","BHĀVANĀMAY","a","bhāvanāmaya","noun-adj","","a","bhāvanāmaya"
2,"eva","","","eva","ind","","","eva"
3,"ca","","","ca","ind","","","ca"
4,"mantra","MANTR","a","mantra","noun-adj","","a","mantra"
5,"naye","NAY","e","naya","noun-adj","","e","naye"
6,"mārgaḥ","MĀRG","aḥ","mārga","noun-adj","","aḥ","mārgaḥ"
7,"/","","","","punct","","","/"
NA,"</s>","","","","","","",""
NA,"<s number=""91"">","","","","","","",""
1,"kriy","KRIY","a","kriya","noun-adj","","a","kriya"
2,"^āmayam","ĀMAY","am","āmaya","noun-adj","","am","āmayam"
3,"api","","","api","ind","","","api"
4,"mārgam","MĀRG","am","mārga","noun-adj","","am","mārgam"
5,"abhyupagatānāṃ","ABHYUPAGAT","ānāṃ","abhyupagata","noun-adj","","ānām","abhyupagatānām"
6,"pāramitā","PĀRAMIT","ā","pāramitā","noun-adj","","ā","pāramitā"
7,"naya","NAY","a","naya","noun-adj","","a","naya"
8,"sthānāṃ","STHĀN","āṃ","stha","noun-adj","","ām","sthānām"
9,"bhāvan","BHĀVAN","a","bhāvanā","noun-adj","","a","bhāvanā"
10,"^ātmika","ĀTM","ika","ātmika","noun-adj","","ika","ātmika"
11,"iva","","","iva","ind","","","iva"
12,"sarvā","SARV","ā","sarva","noun-adj","","āḥ","sarvāḥ"
13,"pravṛttiḥ","PRAVṚTT","iḥ","pravṛtti","noun-adj","","iḥ","pravṛttiḥ"
14,"/","","","","punct","","","/"
NA,"</s>","","","","","","",""
NA,"<s number=""92"">","","","","","","",""
1,"śīl","ŚĪL","a","śīla","noun-adj","","a","śīla"
2,"^āder","ĀD","er","ādi","noun-adj","","eḥ","ādeḥ"
3,"bāhya","BĀHY","a","bāhya","noun-adj","","a","bāhya"
4,"vastu","VAST","u","vastu","noun-adj","","u","vastu"
5,"nirapekṣakatvāt","NIRAPEKṢ","akatvāt","nirapekṣaka","noun-adj","","akatvāt","nirapekṣakatvāt"
6,"/","","","","punct","","","/"
NA,"</s>","","","","","","",""
NA,"<s number=""93"">","","","","","","",""
1,"uktaṃ","UKT","aṃ","ukta","noun-adj","","am","uktam"
2,"ca","","","ca","ind","","","ca"
3,"/","","","","punct","","","/"
NA,"</s>","","","","","","",""
NA,"<s number=""94"">","","","","","","",""
1,"matsy","MATSY","a","matsya","noun-adj","","a","matsya"
2,"^ādayaḥ","ĀD","ayaḥ","ādi","noun-adj","","ayaḥ","ādayaḥ"
3,"kva","","","kva","ind","","","kva"
4,"nīyantāṃ","NĪY","antāṃ","nay","verb","nī","antāṃ","nīyantāṃ"
5,"mā","","","mā","ind","","","mā"
6,"rayeyaṃ","RAY","eyaṃ","r","verb","","eyaṃ","rayeyaṃ"
7,"yato","","","yatas","ind","","","yatas"
8,"na","","","na","ind","","","na"
9,"tān","","","tad","pron","","","tad"
10,"/","","","","punct","","","/"
11,"labdhe","LABDH","e","labdha","noun-adj","","e","labdhe"
12,"virati","VIRAT","i","virati","noun-adj","","i","virati"
13,"citte","CITT","e","citta","noun-adj","","e","citte"
14,"tu","","","tu","ind","","","tu"
15,"śīla","ŚĪL","a","śīla","noun-adj","","a","śīla"
16,"pāramitā","PĀRAMIT","ā","pāramitā","noun-adj","","ā","pāramitā"
17,"matā","MAT","ā","mata","noun-adj","","ā","matā"
18,"//","","","","punct","","","//"
NA,"</s>","","","","","","",""
NA,"<s number=""95"">","","","","","","",""
1,"iti","","","iti","ind","","","iti"
2,"/","","","","punct","","","/"
NA,"</s>","","","","","","",""
NA,"<s number=""96"">","","","","","","",""
1,"dānapāramitām","DĀNAPĀRAMIT","ām","dānapāramitā","noun-adj","","ām","dānapāramitām"
2,"apy","","","api","ind","","","api"
3,"adhikṛty","ADHIKṚTY","a","adhikṛtya","noun-adj","","a","adhikṛtya"
4,"^āha","ĀH","a","āha","noun-adj","","a","āha"
5,"/","","","","punct","","","/"
NA,"</s>","","","","","","",""
NA,"<s number=""97"">","","","","","","",""
1,"phalena","PHAL","ena","phala","noun-adj","","ena","phalena"
2,"saha","SAH","a","sa_saha","ind","","a","saha"
3,"sarvasva","SARVASV","a","sarvasva","noun-adj","","a","sarvasva"
4,"tyāga","TYĀG","a","tyāga","noun-adj","","a","tyāga"
5,"cittāj","CITT","āj","citta","noun-adj","","āt","cittāt"
6,"jane","JAN","e","jana","noun-adj","","e","jane"
7,"a","","","alpha_privativum","ind","","","alpha_privativum"
8,"khile","KHIL","e","khila","noun-adj","","e","khile"
9,"/","","","","punct","","","/"
10,"dānapāramitā","DĀNAPĀRAMIT","ā","dānapāramitā","noun-adj","","ā","dānapāramitā"
11,"proktā","PROKT","ā","prokta","noun-adj","","āḥ","proktāḥ"
12,"tasmāt","","","tad","pron","","","tad"
13,"sā","","","tad","pron","","","tad"
14,"cittam","CITT","am","citta","noun-adj","","am","cittam"
15,"eva","","","eva","ind","","","eva"
16,"tu","","","tu","ind","","","tu"
17,"//","","","","punct","","","//"
NA,"</s>","","","","","","",""
NA,"<s number=""98"">","","","","","","",""
1,"iti","","","iti","ind","","","iti"
2,"/","","","","punct","","","/"
NA,"</s>","","","","","","",""
NA,"<s number=""99"">","","","","","","",""
1,"jñāna","JÑĀN","a","jñāna","noun-adj","","a","jñāna"
2,"saṃbhāras","SAṂBHĀR","as","saṃbhāra","noun-adj","","aḥ","saṃbhāraḥ"
3,"tu","","","tu","ind","","","tu"
4,"bhāvanā","BHĀVAN","ā","bhāvanā","noun-adj","","ā","bhāvanā"
5,"mātreṇa","MĀTR","eṇa","mātra","noun-adj","","ena","mātrena"
6,"bhaved","BHAV","ed","bhav","verb","bhū","ed","bhaved"
7,"iti","","","iti","ind","","","iti"
8,"su","","","su","ind","","","su"
9,"pratītam","PRATĪT","am","pratīta","noun-adj","","am","pratītam"
10,"/","","","","punct","","","/"
NA,"</s>","","","","","","",""
NA,"<s number=""100"">","","","","","","",""
1,"ato","","","atas","ind","","","atas"
2,"bhāvanay","BHĀVANAY","a","bhāvanayā","noun-adj","","a","bhāvanayā"
3,"^aiva","","","eva","ind","","","eva"
4,"//","","","","punct","","","//"
NA,"</s>","","","","","","",""
NA,"<s number=""101"">","","","","","","",""
NA,"</page>","","","","","","",""
NA,"<page number=""12"">","","","","","","",""
3,"puṇya","PUṆY","a","puṇya","noun-adj","","a","puṇya"
4,"jñāna","JÑĀN","a","jñāna","noun-adj","","a","jñāna"
5,"saṃbhāraḥ","SAṂBHĀR","aḥ","saṃbhāra","noun-adj","","aḥ","saṃbhāraḥ"
6,"paripūrayitavyaḥ","PARIPŪRAY","itavyaḥ","paripṛ","verb","paripṛ","itavyaḥ","paripūrayitavyaḥ"
7,"/","","","","punct","","","/"
NA,"</s>","","","","","","",""
NA,"<s number=""102"">","","","","","","",""
1,"yad","","","yad","pron","","","yad"
2,"āhur","ĀH","ur","āhu","noun-adj","","ur","āhur"
3,"ārya","ĀRY","a","ārya","noun-adj","","a","ārya"
4,"pādāḥ","PĀD","āḥ","pāda","noun-adj","","āḥ","pādāḥ"
5,"/","","","","punct","","","/"
NA,"</s>","","","","","","",""
NA,"<s number=""103"">","","","","","","",""
1,"mahāyānasya","MAHĀYĀN","asya","mahāyāna","noun-adj","","asya","mahāyānasya"
2,"māhātmyāt","MĀHĀTMY","āt","māhātmya","noun-adj","","āt","māhātmyāt"
3,"puṇya","PUṆY","a","puṇya","noun-adj","","a","puṇya"
4,"jñānasya","JÑĀN","asya","jñāna","noun-adj","","asya","jñānasya"
5,"saṃbhṛtih","SAṂBHṚT","ih","","noun-adj","","ih","saṃbhṛtih"
6,"/","","","","punct","","","/"
7,"sarvajñatv","SARVAJÑAT","v","sarvajñatā","noun-adj","","v","sarvajñatv"
8,"apadaṃ","APAD","aṃ","apada","noun-adj","","am","apadam"
9,"tasmāt","","","tad","pron","","","tad"
10,"sadyo","SADY","o","sadya","noun-adj","","aḥ","sadyaḥ"
11,"janmani","JANM","ani","janma","noun-adj","","āni","janmāni"
12,"labhyate","LABH","yate","labh","verb","labh","yate","labhyate"
13,"//","","","","punct","","","//"
NA,"</s>","","","","","","",""
NA,"<s number=""104"">","","","","","","",""
1,"iti","","","iti","ind","","","iti"
2,"/","","","","punct","","","/"
NA,"</s>","","","","","","",""
NA,"<s number=""105"">","","","","","","",""
1,"tathā","","","tathā","ind","","","tathā"
2,"/","","","","punct","","","/"
NA,"</s>","","","","","","",""
NA,"<s number=""106"">","","","","","","",""
1,"anya","ANY","a","anya","pron","","a","anya"
2,"ev","","","eva","ind","","","eva"
3,"ādhimokṣo","ADHIMOKṢ","o","adhimokṣa","noun-adj","","aḥ","adhimokṣaḥ"
4,"ayam","","","idam","pron","","","idam"
5,"anyathā","ANYATH","ā","anyathā","ind","","ā","anyathā"
6,"bodhi","BODH","i","bodhi","noun-adj","","i","bodhi"
7,"cārikā","CĀRIK","ā","cārikā","noun-adj","","ā","cārikā"
8,"/","","","","punct","","","/"
9,"anyā","ANY","ā","anyā","noun-adj","","ā","anyā"
10,"citta","CITT","a","citta","noun-adj","","a","citta"
11,"viśuddhīś","VIŚUDDH","īś","","noun-adj","","īś","viśuddhīś"
12,"ca","","","ca","ind","","","ca"
13,"phalam","PHAL","am","phala","noun-adj","","am","phalam"
14,"anyad","ANY","ad","anya","pron","","at","anyat"
15,"ih","","","iha","ind","","","iha"
16,"ekṣyate","IKṢ","yate","ikṣ","verb","","yate","ikṣyate"
17,"//","","","","punct","","","//"
NA,"</s>","","","","","","",""
NA,"<s number=""107"">","","","","","","",""
1,"iti","","","iti","ind","","","iti"
2,"yathā","","","yathā","ind","","","yathā"
3,"latā","LAT","ā","latā","noun-adj","","ā","latā"
4,"samudbhūtaṃ","SAMUDBHŪT","aṃ","samudbhūta","noun-adj","","am","samudbhūtam"
5,"phalaṃ","PHAL","aṃ","phala","noun-adj","","am","phalam"
6,"puṣpa","PUṢP","a","puṣpa","noun-adj","","a","puṣpa"
7,"samanvitam","SAMANVIT","am","samanvita","noun-adj","","am","samanvitam"
8,"/","","","","punct","","","/"
9,"tath","","a","tathā","ind","","a","tathā"
10,"^aika","EK","a","eka","noun-adj","","a","eka"
11,"kṣaṇa","KṢAṆ","a","kṣaṇa","noun-adj","","a","kṣaṇa"
12,"saṃbodhiḥ","SAṂBODH","iḥ","saṃbodhi","noun-adj","","iḥ","saṃbodhiḥ"
13,"saṃbhāra","SAṂBHĀR","a","saṃbhāra","noun-adj","","a","saṃbhāra"
14,"dvaya","DVAY","a","dvaya","noun-adj","","a","dvaya"
15,"saṃbhṛtā","SAMBHṚT","ā","sambhṛta","noun-adj","","ā","sambhṛtā"
16,"//","","","","punct","","","//"
NA,"</s>","","","","","","",""
NA,"<s number=""108"">","","","","","","",""
1,"iti","","","iti","ind","","","iti"
2,"ca","","","ca","ind","","","ca"
3,"/","","","","punct","","","/"
NA,"</s>","","","","","","",""
NA,"<s number=""109"">","","","","","","",""
1,"ata","","","atas","ind","","","atas"
2,"eva","","","eva","ind","","","eva"
3,"n","","a","na","ind","","a","na"
4,"^ā","","","alpha_privativum","ind","","","alpha_privativum"
5,"cira","CIR","a","cira","noun-adj","","a","cira"
6,"sthāyitva","STHĀY","itva","sthāyitva","noun-adj","","itva","sthāyitva"
7,"prasaṅgo","PRASAṄG","o","prasaṅga","noun-adj","","aḥ","prasaṅgaḥ"
8,"api","","","api","ind","","","api"
9,"/","","","","punct","","","/"
NA,"</s>","","","","","","",""
NA,"<s number=""110"">","","","","","","",""
1,"a","","","alpha_privativum","ind","","","alpha_privativum"
2,"tattv","TATTV","a","tattva","noun-adj","","a","tattva"
3,"^ābhiniveśa","ABHINIVEŚ","a","abhiniveśa","noun-adj","","a","abhiniveśa"
4,"prabhavasy","PRABHAV","asya","prabhava","noun-adj","","asya","prabhavasya"
5,"^aiva","","","eva","ind","","","eva"
6,"vai","","","vai","ind","","","vai"
7,"vartikatvāt","VARTIK","atvāt","vartikatva","noun-adj","","atvāt","vartikatvāt"
8,"/","","","","punct","","","/"
NA,"</s>","","","","","","",""
NA,"<s number=""111"">","","","","","","",""
1,"śabd","ŚABD","a","śabda","noun-adj","","a","śabda"
2,"^ādeś","ĀDEŚ","","ādeśa","noun-adj","","","ādeś"
3,"ca","","","ca","ind","","","ca"
4,"varṇ","VARṆ","a","varṇa","noun-adj","","a","varṇa"
5,"^ādi","ĀD","i","ādi","noun-adj","","i","ādi"
6,"mattā","MATT","ā","mattā","noun-adj","","ā","mattā"
7,"/","","","","punct","","","/"
NA,"</s>","","","","","","",""
NA,"<s number=""112"">","","","","","","",""
1,"bhuja","BHUJ","a","bhuja","noun-adj","","a","bhuja"
2,"mukh","MUKH","a","mukha","noun-adj","","a","mukha"
3,"^ādy","ĀD","y","ādi","noun-adj","","i","ādi"
4,"ākāravac","ĀKĀR","avac","ākāru","noun-adj","","avac","ākāravac"
5,"citt","CITT","","citta","noun-adj","","","citt"
6,"ā","","","alpha_privativum","ind","","","alpha_privativum"
7,"vyatireka","VYATIREK","a","vyatireka","noun-adj","","a","vyatireka"
8,"tay","TAY","a","tad","pron","","a","taya"
9,"^aiva","","","eva","ind","","","eva"
10,"/","","","","punct","","","/"
NA,"</s>","","","","","","",""
NA,"<s number=""113"">","","","","","","",""
1,"tathā","","","tathā","ind","","","tathā"
2,"hi","","","hi","ind","","","hi"
3,"bhagavāṃś","BHAGAV","āṃś","bhagavat","noun-adj","","āṃś","bhagavāṃś"
4,"cakṣuṣ","CAKṢUṢ","a","cakṣuṣa","noun-adj","","a","cakṣuṣa"
5,"^āpi","","","api","ind","","","api"
6,"śṛṇoti","ŚṚṆ","oti","śṛṇ","verb","śru","ati","śṛṇati"
7,"jighrat","JIGHR","at","ghrā","verb","ghrā","at","jighrat"
8,"i","","","","ind","","",""
9,"ity","","","iti","ind","","","iti"
10,"ādi","ĀD","i","ādi","noun-adj","","i","ādi"
11,"vistaraḥ","VISTAR","aḥ","vistara","noun-adj","","aḥ","vistaraḥ"
12,"/","","","","punct","","","/"
NA,"</s>","","","","","","",""
NA,"<s number=""114"">","","","","","","",""
1,"tantre","TANTR","e","tantra","noun-adj","","e","tantre"
2,"api","","","api","ind","","","api"
3,"/","","","","punct","","","/"
NA,"</s>","","","","","","",""
NA,"<s number=""115"">","","","","","","",""
1,"//","","","","punct","","","//"
NA,"</s>","","","","","","",""
NA,"<s number=""116"">","","","","","","",""
NA,"</page>","","","","","","",""
NA,"<page number=""13"">","","","","","","",""
3,"sarvataḥ","SARV","ataḥ","sarva","noun-adj","","ataḥ","sarvataḥ"
4,"pāṇi","PĀṆ","i","pāṇi","noun-adj","","i","pāṇi"
5,"pādād","PĀD","ād","pāda","noun-adj","","āt","pādāt"
6,"yaṃ","","","yad","pron","","","yad"
7,"sarvato","SARV","ato","sarva","noun-adj","","ataḥ","sarvataḥ"
8,"akṣi","AKṢ","i","akṣi","noun-adj","","i","akṣi"
9,"śiro","ŚIR","o","śiras","noun-adj","","aḥ","śiraḥ"
10,"mukham","MUKH","am","mukha","noun-adj","","am","mukham"
11,"/","","","","punct","","","/"
12,"sarvataḥ","SARV","ataḥ","sarva","noun-adj","","ataḥ","sarvataḥ"
13,"śruti","ŚRUT","i","śruti","noun-adj","","i","śruti"
14,"mal","MAL","","mala","noun-adj","","","mal"
15,"loke","LOK","e","loka","noun-adj","","e","loke"
16,"sarvam","SARV","am","sarva","noun-adj","","am","sarvam"
17,"āvṛtya","ĀVṚT","ya","āvṛtya","noun-adj","","ya","āvṛtya"
18,"tiṣṭhati","TIṢṬH","ati","tiṣṭh","verb","sthā","ati","tiṣṭhati"
19,"//","","","","punct","","","//"
NA,"</s>","","","","","","",""
NA,"<s number=""117"">","","","","","","",""
1,"iti","","","iti","ind","","","iti"
2,"/","","","","punct","","","/"
NA,"</s>","","","","","","",""
NA,"<s number=""118"">","","","","","","",""
1,"rūpitve","RŪPIT","ve","rūpita","noun-adj","","ve","rūpitve"
2,"api","","","api","ind","","","api"
3,"n","","a","na","ind","","a","na"
4,"^ā","","","alpha_privativum","ind","","","alpha_privativum"
5,"vyāpitva","VYĀP","itva","vyāpitva","verb","","itva","vyāpitva"
6,"doṣaḥ","DOṢ","aḥ","doṣa","noun-adj","","aḥ","doṣaḥ"
7,"/","","","","punct","","","/"
NA,"</s>","","","","","","",""
NA,"<s number=""119"">","","","","","","",""
1,"rūpasy","RŪP","asya","rūpa","noun-adj","","asya","rūpasya"
2,"^āpi","","","api","ind","","","api"
3,"vyāpitvāt","VYĀP","itvāt","vyāpitva","verb","","itvāt","vyāpitvāt"
4,"/","","","","punct","","","/"
NA,"</s>","","","","","","",""
NA,"<s number=""120"">","","","","","","",""
1,"tad","","","tad","pron","","","tad"
2,"uktaṃ","UKT","aṃ","ukta","noun-adj","","am","uktam"
3,"bhagavatyām","BHAGAV","atyām","bhagava","noun-adj","","atyām","bhagavatyām"
4,"/","","","","punct","","","/"
NA,"</s>","","","","","","",""
NA,"<s number=""121"">","","","","","","",""
1,"rūp","RŪP","a","rūpa","noun-adj","","a","rūpa"
2,"^ānanta","ANANT","a","ananta","noun-adj","","a","ananta"
3,"tay","TAY","a","tad","pron","","a","taya"
4,"^ānanta","ANANT","a","ananta","noun-adj","","a","ananta"
5,"pāramit","PĀRAMIT","a","pāramitā","noun-adj","","a","pāramitā"
6,"^eyam","","","idam","pron","","","idam"
7,"ityi","","","","ind","","",""
8,"/","","","","punct","","","/"
NA,"</s>","","","","","","",""
NA,"<s number=""122"">","","","","","","",""
1,"ghaṭasya","GHAṬ","asya","ghaṭa","noun-adj","","asya","ghaṭasya"
2,"tu","","","tu","ind","","","tu"
3,"grāhya","GRĀHY","a","grāhya","noun-adj","","a","grāhya"
4,"grāhak","GRĀH","ak","grāhaka","noun-adj","","ak","grāhak"
5,"ābhiniveśa","ABHINIVEŚ","a","abhiniveśa","noun-adj","","a","abhiniveśa"
6,"prabhavatvād","PRABHAV","atvād","prabhavatva","noun-adj","","atvād","prabhavatvād"
7,"a","","","alpha_privativum","ind","","","alpha_privativum"
8,"vyāpitva","VYĀP","itva","vyāpitva","verb","","itva","vyāpitva"
9,"vyavahāraḥ","VYAVAHĀR","aḥ","vyavahāra","noun-adj","","aḥ","vyavahāraḥ"
10,"/","","","","punct","","","/"
NA,"</s>","","","","","","",""
NA,"<s number=""123"">","","","","","","",""
1,"na","","","na","ind","","","na"
2,"tu","","","tu","ind","","","tu"
3,"rūpitv","RŪPIT","v","rūpita","noun-adj","","v","rūpitv"
4,"amātreṇa","AMĀTR","eṇa","amātra","noun-adj","","ena","amātrena"
5,"/","","","","punct","","","/"
NA,"</s>","","","","","","",""
NA,"<s number=""124"">","","","","","","",""
1,"śūnyat","ŚŪNYAT","a","śūnyatā","noun-adj","","a","śūnyatā"
2,"^aika","EK","a","eka","noun-adj","","a","eka"
3,"rasa","RAS","a","rasa","noun-adj","","a","rasa"
4,"mahākaruṇ","MAHĀKARUṆ","a","mahākaruṇā","noun-adj","","a","mahākaruṇā"
5,"^ākṛta","ĀKṚT","a","akṛta","noun-adj","","a","ākṛta"
6,"praṇidhi","PRAṆIDH","i","praṇidhi","noun-adj","","i","praṇidhi"
7,"pāramit","PĀRAMIT","a","pāramitā","noun-adj","","a","pāramitā"
8,"^āmayatvena","ĀMAY","atvena","āmayatva","noun-adj","","atvena","āmayatvena"
9,"hi","","","hi","ind","","","hi"
10,"viśvarūpatā","VIŚVARŪP","atā","viśvarūpatā","noun-adj","","atām","viśvarūpatām"
11,"/","","","","punct","","","/"
NA,"</s>","","","","","","",""
NA,"<s number=""125"">","","","","","","",""
1,"na","","","na","ind","","","na"
2,"tu","","","tu","ind","","","tu"
3,"śūnyatā","ŚŪNYAT","ā","śūnyatā","noun-adj","","ā","śūnyatā"
4,"mātra","MĀTR","a","mātra","noun-adj","","a","mātra"
5,"bhāvanayā","BHĀVAN","ayā","bhāvanā","noun-adj","","ayā","bhāvanayā"
6,"/","","","","punct","","","/"
NA,"</s>","","","","","","",""
NA,"<s number=""126"">","","","","","","",""
1,"śrī","ŚRĪ","","śrī","noun-adj","","","śrī"
2,"saṃvar","SAṂVAR","a","saṃvara","noun-adj","","a","saṃvara"
3,"^ādy","ĀD","y","ādi","noun-adj","","i","ādi"
4,"ākāraś","ĀKĀR","aś","ākāra","noun-adj","","aḥ","ākāraḥ"
5,"ca","","","ca","ind","","","ca"
6,"tath","","a","tathā","ind","","a","tathā"
7,"^aiva","","","eva","ind","","","eva"
8,"bhāvyamāno","BHĀV","yamāno","bhav","verb","bhū","yamāno","bhāvyamāno"
9,"viśvarūpaḥ","VIŚVARŪP","aḥ","viśvarūpa","noun-adj","","aḥ","viśvarūpaḥ"
10,"sidhyan","SIDH","yan","","noun-adj","","yan","sidhyan"
11,"kena","","","kim","pron","","","kim"
12,"nivāraṇīyaḥ","NIVĀRAṆ","īyaḥ","nivāraṇīya","noun-adj","","īyaḥ","nivāraṇīyaḥ"
13,"/","","","","punct","","","/"
NA,"</s>","","","","","","",""
NA,"<s number=""127"">","","","","","","",""
1,"//","","","","punct","","","//"
NA,"</s>","","","","","","",""
NA,"<s number=""128"">","","","","","","",""
NA,"</page>","","","","","","",""
NA,"<page number=""14"">","","","","","","",""
3,"āgamavirodhas","ĀGAMAVIRODH","as","āgamavirodha","noun-adj","","aḥ","āgamavirodhaḥ"
4,"tv","","","tu","ind","","","tu"
5,"abhiprāy","ABHIPRĀY","","abhiprāya","noun-adj","","","abhiprāy"
6,"ā","","","alpha_privativum","ind","","","alpha_privativum"
7,"parijñānāt","PARIJÑĀN","āt","parijñāna","noun-adj","","āt","parijñānāt"
8,"/","","","","punct","","","/"
NA,"</s>","","","","","","",""
NA,"<s number=""129"">","","","","","","",""
1,"tathā","","","tathā","ind","","","tathā"
2,"hi","","","hi","ind","","","hi"
3,"ye","","","yad","pron","","","yad"
4,"devat","DEVAT","a","devatā","noun-adj","","a","devatā"
5,"^ākār","ĀKĀR","a","ākāra","noun-adj","","a","ākāra"
6,"^ādikam","ĀDIK","am","ādika","noun-adj","","am","ādikam"
7,"eva","","","eva","ind","","","eva"
8,"kevalaṃ","KEVAL","aṃ","kevala","noun-adj","","am","kevalam"
9,"tattvataḥ","TATTV","ataḥ","tattva","noun-adj","","ataḥ","tattvataḥ"
10,"pratipannās","PRATIPANN","ās","pratipanna","noun-adj","","āḥ","pratipannāḥ"
11,"tān","","","tad","pron","","","tad"
12,"ārabhya","ĀRABH","ya","ārabhya","ind","","ya","ārabhya"
13,"yathet","","","","ind","","",""
14,"yādi","YĀD","i","yādi","noun-adj","","i","yādi"
15,"pravacanaṃ","PRAVACAN","aṃ","pravacana","noun-adj","","am","pravacanam"
16,"siddh","SIDDH","a","siddha","noun-adj","","a","siddha"
17,"^ācārya","ĀCĀRY","a","ācārya","noun-adj","","a","ācārya"
18,"vacanaṃ","VACAN","aṃ","vacana","noun-adj","","am","vacanam"
19,"ca","","","ca","ind","","","ca"
20,"/","","","","punct","","","/"
NA,"</s>","","","","","","",""
NA,"<s number=""130"">","","","","","","",""
1,"tattvasya","TATTV","asya","tattva","noun-adj","","asya","tattvasya"
2,"sat","SAT","","sat","noun-adj","","","sat"
3,"y","","","ya","ind","","","ya"
4,"advay","ADVAY","","advaya","noun-adj","","","advay"
5,"ā","","","alpha_privativum","ind","","","alpha_privativum"
6,"dvaya","DVAY","a","dvaya","noun-adj","","a","dvaya"
7,"rūpatvāt","RŪPATV","āt","rūpatva","noun-adj","","āt","rūpatvāt"
8,"/","","","","punct","","","/"
NA,"</s>","","","","","","",""
NA,"<s number=""131"">","","","","","","",""
1,"tad","","","tad","pron","","","tad"
2,"vinā","","","vinā","ind","","","vinā"
3,"ca","","","ca","ind","","","ca"
4,"/","","","","punct","","","/"
NA,"</s>","","","","","","",""
NA,"<s number=""132"">","","","","","","",""
1,"tad","","","tad","pron","","","tad"
2,"uktaṃ","UKT","aṃ","ukta","noun-adj","","am","uktam"
3,"ca","","","ca","ind","","","ca"
4,"tur","TUR","","tura","noun-adj","","","tur"
5,"—","","","","punct","","","—"
6,"devīpa","DEV","īpa","","noun-adj","","īpa","devīpa"
7,"ripṛech","RIP","ṛech","ripu","noun-adj","","ṛech","ripṛech"
8,"āyām","ĀYĀM","","idam","pron","","","āyām"
9,"/","","","","punct","","","/"
NA,"</s>","","","","","","",""
NA,"<s number=""133"">","","","","","","",""
1,"catura","CAT","ura","catur","noun-adj","","ura","catura"
2,"śīti","ŚĪT","i","śīti","noun-adj","","i","śīti"
3,"sāhasre","SĀHASR","e","sāhasra","noun-adj","","e","sāhasre"
4,"dharma","DHARM","a","dharma","noun-adj","","a","dharma"
5,"skandhe","SKANDH","e","skandha","noun-adj","","e","skandhe"
6,"mahāmuneḥ","MAHĀMUN","eḥ","mahāmuni","noun-adj","","eḥ","mahāmuneḥ"
7,"h","","","hi","ind","","","hi"
8,"/","","","","punct","","","/"
9,"tattvaṃ","TATTV","aṃ","tattva","noun-adj","","am","tattvam"
10,"ye","","","yad","pron","","","yad"
11,"vai","","","vai","ind","","","vai"
12,"na","","","na","ind","","","na"
13,"jananti","JAN","anti","jan","verb","jan","anti","jananti"
14,"te","","","tad","pron","","","tad"
15,"ca","","","ca","ind","","","ca"
16,"sarve","SARV","e","sarva","noun-adj","","e","sarve"
17,"ca","","","ca","ind","","","ca"
18,"niṣphalāḥ","NIṢPHAL","āḥ","niṣphala","noun-adj","","āḥ","niṣphalāḥ"
19,"//","","","","punct","","","//"
NA,"</s>","","","","","","",""
NA,"<s number=""134"">","","","","","","",""
1,"iti","","","iti","ind","","","iti"
2,"/","","","","punct","","","/"
NA,"</s>","","","","","","",""
NA,"<s number=""135"">","","","","","","",""
1,"indr","INDR","","indra","noun-adj","","","indr"
2,"a","","","alpha_privativum","ind","","","alpha_privativum"
3,"bhūti","BHŪT","i","bhūti","noun-adj","","i","bhūti"
4,"pādair","PĀD","air","pāda","noun-adj","","air","pādair"
5,"api","","","api","ind","","","api"
6,"vistaram","VISTAR","am","vistara","noun-adj","","am","vistaram"
7,"uktv","UKTV","a","uktvā","noun-adj","","a","uktvā"
8,"^oktam","UKT","am","ukta","noun-adj","","am","uktam"
9,"/","","","","punct","","","/"
NA,"</s>","","","","","","",""
NA,"<s number=""136"">","","","","","","",""
1,"mithyā","MITHY","ā","mithyā","noun-adj","","ā","mithyā"
2,"tattvāni","TATTV","āni","tattva","noun-adj","","āni","tattvāni"
3,"sarvāṇi","SARV","āṇi","sarva","noun-adj","","āni","sarvāni"
4,"kalpitāni","KALPIT","āni","kalpita","noun-adj","","āni","kalpitāni"
5,"su","","","su","ind","","","su"
6,"mohibhiḥ","MOH","ibhiḥ","mohin","noun-adj","","ibhiḥ","mohibhiḥ"
7,"/","","","","punct","","","/"
NA,"</s>","","","","","","",""
NA,"<s number=""137"">","","","","","","",""
1,"iti","","","iti","ind","","","iti"
2,"/","","","","punct","","","/"
NA,"</s>","","","","","","",""
NA,"<s number=""138"">","","","","","","",""
1,"saraha","SARAH","a","saraha","noun-adj","","a","saraha"
2,"pādair","PĀD","air","pāda","noun-adj","","air","pādair"
3,"api","","","api","ind","","","api"
4,"/","","","","punct","","","/"
NA,"</s>","","","","","","",""
NA,"<s number=""139"">","","","","","","",""
1,"jai","","","ja","ind","","","ja"
2,"rasāla","RAS","āala","rasa","noun-adj","","āala","rasāala"
3,"pai","","","","ind","","",""
4,"sarahu","SARAH","u","saraha","noun-adj","","u","sarahu"
5,"aha","","","aha","ind","","","aha"
6,"vikka","VIKK","a","vikka","noun-adj","","a","vikka"
7,"maha","MAH","a","mahat","noun-adj","","a","maha"
8,"āsu","","","idam","pron","","",""
9,"/","","","","punct","","","/"
10,"b","","","","ind","","",""
11,"hiṇṇāra","HIṆ","āāra","hiṇḍ","noun-adj","","āāra","hiṇāāra"
12,"muṇesi","MUṆ","esi","muṇ","verb","","asi","muṇasi"
13,"tahu","TAH","u","tahi","noun-adj","","u","tahu"
14,"kaha","","","","ind","","",""
15,"mukk","MUK","k","mukk","noun-adj","","k","mukk"
16,"haha","HAH","a","hahā","noun-adj","","a","hahā"
17,"paccāsa","PAC","cāsa","paca","noun-adj","","cāsa","paccāsa"
18,"//","","","","punct","","","//"
NA,"</s>","","","","","","",""
NA,"<s number=""140"">","","","","","","",""
1,"iti","","","iti","ind","","","iti"
2,"/","","","","punct","","","/"
NA,"</s>","","","","","","",""
NA,"<s number=""141"">","","","","","","",""
1,"//","","","","punct","","","//"
NA,"</s>","","","","","","",""
NA,"<s number=""142"">","","","","","","",""
NA,"</page>","","","","","","",""
NA,"<page number=""15"">","","","","","","",""
3,"na","","","na","ind","","","na"
4,"hi","","","hi","ind","","","hi"
5,"daridrasya","DARIDR","asya","daridra","noun-adj","","asya","daridrasya"
6,"//","","","","punct","","","//"
NA,"</s>","","","","","","",""
NA,"<s number=""143"">","","","","","","",""
1,"a","","","alpha_privativum","ind","","","alpha_privativum"
2,"kasmāt","KASMĀT","","kim","pron","","","kasmāt"
3,"//","","","","punct","","","//"
NA,"</s>","","","","","","",""
NA,"<s number=""144"">","","","","","","",""
1,"kramād","KRAM","ād","krama","noun-adj","","āt","kramāt"
2,"abhyāsa","ABHYĀS","a","abhyāsa","noun-adj","","a","abhyāsa"
3,"yogena","YOG","ena","yoga","noun-adj","","ena","yogena"
4,"yasya","","","yad","pron","","","yad"
5,"cintā","CINT","ā","cintā","noun-adj","","ā","cintā"
6,"pravartate","PRAVART","ate","pravart","verb","pravṛt","ate","pravartate"
7,"/","","","","punct","","","/"
8,"buddho","BUDDH","o","buddha","noun-adj","","aḥ","buddhaḥ"
9,"bhaved","BHAV","ed","bhav","verb","bhū","ed","bhaved"
10,"asau","","","adas","pron","","","adas"
11,"yogī","YOG","ī","yogin","noun-adj","","ī","yogī"
12,"n","","","na","ind","","","na"
13,"ānye","ANY","e","anya","pron","","e","anye"
14,"buddhatva","BUDDHATV","a","buddhatva","noun-adj","","a","buddhatva"
15,"sādhakāḥ","SĀDH","akāḥ","sādhaka","noun-adj","","akāḥ","sādhakāḥ"
16,"//","","","","punct","","","//"
NA,"</s>","","","","","","",""
NA,"<s number=""145"">","","","","","","",""
1,"svabhāvād","SVABHĀV","ād","svabhāva","noun-adj","","āt","svabhāvāt"
2,"yadi","","","yadi","ind","","","yadi"
3,"te","","","tad","pron","","","tad"
4,"buddhān","BUDDH","ān","buddha","noun-adj","","ān","buddhān"
5,"ābhyāsena","ABHYĀS","ena","abhyāsa","noun-adj","","ena","abhyāsena"
6,"prayojanam","PRAYOJAN","am","prayojana","noun-adj","","am","prayojanam"
7,"/","","","","punct","","","/"
8,"sa","","","tad","pron","","","tad"
9,"yuktikaṃ","YUKT","ikaṃ","yuktika","noun-adj","","ikaṃ","yuktikaṃ"
10,"sad","SAD","a","sadā","ind","","a","sadā"
11,"^ābhyāsaṃ","ABHYĀS","aṃ","abhyāsa","noun-adj","","am","abhyāsam"
12,"n","","","na","ind","","","na"
13,"ābhyāsaṃ","ABHYĀS","aṃ","abhyāsa","noun-adj","","am","abhyāsam"
14,"yukti","YUKT","i","yukti","noun-adj","","i","yukti"
15,"varjītam","VARJ","ītam","varjīta","noun-adj","","ītam","varjītam"
16,"//","","","","punct","","","//"
NA,"</s>","","","","","","",""
NA,"<s number=""146"">","","","","","","",""
1,"yady","","","yadi","ind","","","yadi"
2,"a","","","alpha_privativum","ind","","","alpha_privativum"
3,"nātho","NĀTH","o","nātha","noun-adj","","aḥ","nāthaḥ"
4,"janaḥ","JAN","aḥ","jana","noun-adj","","aḥ","janaḥ"
5,"kaścid","","","kimcit","ind","","","kimcit"
6,"rājāham","RĀJĀH","am","rājāhi","noun-adj","","am","rājāham"
7,"iti","","","iti","ind","","","iti"
8,"bhāvayet","BHĀVAY","et","bhav","verb","bhū","et","bhāvayet"
9,"/","","","","punct","","","/"
10,"kalpa","KALP","a","kalpa","noun-adj","","a","kalpa"
11,"koṭi","KOṬ","i","koṭi","noun-adj","","i","koṭi"
12,"śaten","ŚAT","ena","śata","noun-adj","","ena","śatena"
13,"^āpi","","","api","ind","","","api"
14,"n","","a","na","ind","","a","na"
15,"^rājyam","RĀJY","am","rājya","noun-adj","","am","rājyam"
16,"avāpnuyāt","AVĀPN","uyāt","avāpn","verb","avāp","uyāt","avāpnuyāt"
17,"/","","","","punct","","","/"
18,"mithyā","MITHY","ā","mithyā","noun-adj","","ā","mithyā"
19,"kalpanayā","KALPAN","ayā","kalpanā","noun-adj","","ayā","kalpanayā"
20,"yasmād","","","yad","pron","","","yad"
21,"rājyaṃ","RĀJY","aṃ","rājya","noun-adj","","am","rājyam"
22,"tasya","","","tad","pron","","","tad"
23,"na","","","na","ind","","","na"
24,"vidyate","VID","yate","vid","verb","vid","yate","vidyate"
25,"/","","","","punct","","","/"
26,"mithyā","MITHY","ā","mithyā","noun-adj","","ā","mithyā"
27,"bhāvanayā","BHĀVAN","ayā","bhāvanā","noun-adj","","ayā","bhāvanayā"
28,"tasmād","","","tad","pron","","","tad"
29,"buddhatvaṃ","BUDDHATV","aṃ","buddhatva","noun-adj","","am","buddhatvam"
30,"na","","","na","ind","","","na"
31,"bhaviṣyati","BHAVIṢ","yati","bhav","verb","bhū","yati","bhaviṣyati"
32,"//","","","","punct","","","//"
NA,"</s>","","","","","","",""
NA,"<s number=""147"">","","","","","","",""
1,"tathā","","","tathā","ind","","","tathā"
2,"tantr","TANTR","a","tantra","noun-adj","","a","tantra"
3,"^ānusāreṇa","ANUSĀR","eṇa","anusāra","noun-adj","","ena","anusārena"
4,"kurvanti","KURV","anti","kar","verb","kṛ","anti","kurvanti"
5,"prakriyāṃ","PRAKRIY","āṃ","prakriyā","noun-adj","","ām","prakriyām"
6,"narāḥ","NAR","āḥ","nara","noun-adj","","āḥ","narāḥ"
7,"/","","","","punct","","","/"
8,"yatnena","YATN","ena","yatna","noun-adj","","ena","yatnena"
9,"kleśam","KLEŚ","am","kleśa","noun-adj","","am","kleśam"
10,"utthāpya","UTTHĀP","ya","uttiṣṭh","verb","","ya","utthāpya"
11,"svaceto","SVACET","o","svacetas","noun-adj","","aḥ","svacetaḥ"
12,"vidravanti","VIDRAVANT","i","vidrav","noun-adj","","i","vidravanti"
13,"hi","","","hi","ind","","","hi"
14,"//","","","","punct","","","//"
NA,"</s>","","","","","","",""
NA,"<s number=""148"">","","","","","","",""
1,"tasmāt","","","tad","pron","","","tad"
2,"sarvaprayatnena","SARVAPRAYATNEN","a","sarvaprayatnena","noun-adj","","a","sarvaprayatnena"
3,"maṇḍal","MAṆḌAL","a","maṇḍala","noun-adj","","a","maṇḍala"
4,"^ādi","ĀD","i","ādi","noun-adj","","i","ādi"
5,"vidhi","VIDH","i","vidhi","noun-adj","","i","vidhi"
6,"kriyā","KRIY","ā","kriyā","noun-adj","","ā","kriyā"
7,"/","","","","punct","","","/"
8,"vimokṣ","VIMOKṢ","","vimokṣa","noun-adj","","","vimokṣ"
9,"ā","","","alpha_privativum","ind","","","alpha_privativum"
10,"vāhikān","VĀHIK","āna","vāhika","noun-adj","","āna","vāhikāna"
11,"^aiva","","","eva","ind","","","eva"
12,"paraṃ","PAR","aṃ","para","noun-adj","","am","param"
13,"ha","","","ha","ind","","","ha"
14,"vyāsa","VYĀS","a","vyāsa","noun-adj","","a","vyāsa"
15,"kāraṇaṃ","KĀRAṆ","aṃ","kāraṇa","noun-adj","","am","kāraṇam"
16,"//","","","","punct","","","//"
NA,"</s>","","","","","","",""
NA,"<s number=""149"">","","","","","","",""
NA,"</s>","","","","","","",""
NA,"</page>","","","","","","",""
NA,"</doc>","","","","","","",""
