"WordID","word","NormSTEM","suffix","lemma","PoS","Root","NormSuffix","NormWord"
"1","saṃjaya","_","_","saṃjaya","NC","","_","_"
"2","uvāca","_","_","vak","V","vac","_","_"
"1","tathā","_","_","tathā","CX","","_","_"
"2","paruṣitaṃ","_","_","paruṣita","JJ","","_","_"
"3","dṛṣṭvā","_","_","dṛś","CGDA","","_","_"
"4","sūtaputreṇa","_","_","sūtaputra","NC","","_","_"
"5","mātulam","_","_","mātula","NC","","_","_"
"1","khaḍgam","_","_","khaḍga","NC","","_","_"
"2","udyamya","_","_","udya","CGDA","","_","_"
"3","vegena","_","_","vega","NC","","_","_"
"4","drauṇir","_","_","drauṇi","NC","","_","_"
"5","abhyapatad","_","_","abhipat","V","abhipat","_","_"
"6","drutam","_","_","druta","CX","","_","_"
"1","_","_","_","aśvatthāman","NC","","_","_"
"2","_","_","_","vak","V","vac","_","_"
"1","karṇa","_","_","karṇa","NC","","_","_"
"2","paśya","_","_","paś","V","paś","_","_"
"3","_","_","_","su","CAD","","_","_"
"4","_","_","_","durbuddhi","JJ","","_","_"
"5","_","_","_","tiṣṭh","V","sthā","_","_"
"6","_","_","_","idānīm","CX","","_","_"
"7","_","_","_","nara","NC","","_","_"
"8","_","_","_","adhama","JJ","","_","_"
"1","eṣa","_","_","tad","PRD","","_","_"
"2","te","_","_","tvat","PPR","","_","_"
"3","'dya","_","_","adya","CX","","_","_"
"4","śiraḥ","_","_","śiras","NC","","_","_"
"5","kāyād","_","_","kāya","NC","","_","_"
"6","uddharāmi","_","_","uddhar","V","uddhṛ","_","_"
"7","_","_","_","su","CAD","","_","_"
"8","_","_","_","durmati","JJ","","_","_"
"1","saṃjaya","_","_","saṃjaya","NC","","_","_"
"2","uvāca","_","_","vak","V","vac","_","_"
"1","tam","_","_","tad","PRD","","_","_"
"2","utpatantaṃ","_","_","utpat","KDP","","_","_"
"3","vegena","_","_","vega","NC","","_","_"
"4","rājā","_","_","rājan","NC","","_","_"
"5","duryodhanaḥ","_","_","duryodhana","NC","","_","_"
"6","svayam","_","_","svaya","CX","","_","_"
"1","_","_","_","nivāray","V","nivāray","_","_"
"2","_","_","_","mahat","JJ","","_","_"
"3","_","_","_","rāja","NC","","_","_"
"4","_","_","_","kṛpa","NC","","_","_"
"5","_","_","_","ca","CCD","","_","_"
"6","dvipadāṃ","_","_","dvipad","NC","","_","_"
"7","varaḥ","_","_","vara","JJ","","_","_"
"1","karṇa","_","_","karṇa","NC","","_","_"
"2","uvāca","_","_","vak","V","vac","_","_"
"1","śūro","_","_","śūra","NC","","_","_"
"2","'yaṃ","_","_","ida","PRD","","_","_"
"3","_","_","_","samara","NC","","_","_"
"4","_","_","_","ślāghin","JJ","","_","_"
"5","_","_","_","durmati","JJ","","_","_"
"6","_","_","_","ca","CCD","","_","_"
"7","_","_","_","dvija","NC","","_","_"
"8","_","_","_","adhama","JJ","","_","_"
"1","āsādayatu","_","_","āsāday","V","āsāday","_","_"
"2","_","_","_","mat","PPR","","_","_"
"3","_","_","_","vīrya","NC","","_","_"
"4","_","_","_","muñc","V","muc","_","_"
"5","_","_","_","ida","PRD","","_","_"
"6","_","_","_","kuru","NC","","_","_"
"7","_","_","_","sattama","JJ","","_","_"
"1","_","_","_","aśvatthāman","NC","","_","_"
"2","_","_","_","vak","V","vac","_","_"
"1","_","_","_","tvat","PPR","","_","_"
"2","_","_","_","tad","PRD","","_","_"
"3","kṣamyate","_","_","kṣa","V","kṣa","_","_"
"4","'smābhiḥ","_","_","mat","PPR","","_","_"
"5","_","_","_","sūta","NC","","_","_"
"6","_","_","_","ātmaja","NC","","_","_"
"7","_","_","_","su","CAD","","_","_"
"8","_","_","_","durmati","JJ","","_","_"
"1","darpam","_","_","darpa","NC","","_","_"
"2","utsiktam","_","_","utsic","PPP","","_","_"
"3","etat","_","_","tad","PRD","","_","_"
"4","te","_","_","tvat","PPR","","_","_"
"5","phalguno","_","_","phalguna","NC","","_","_"
"6","nāśayiṣyati","_","_","naś","V","naś","_","_"
"1","duryodhana","_","_","duryodhana","NC","","_","_"
"2","uvāca","_","_","vak","V","vac","_","_"
"1","aśvatthāman","_","_","aśvatthāman","NC","","_","_"
"2","prasīdasva","_","_","prasīd","V","prasad","_","_"
"3","kṣantum","_","_","kṣa","CGDI","","_","_"
"4","arhasi","_","_","arh","V","arh","_","_"
"5","mānada","_","_","mānada","JJ","","_","_"
"1","kopaḥ","_","_","kopa","NC","","_","_"
"2","khalu","_","_","khalu","CX","","_","_"
"3","na","_","_","na","CNG","","_","_"
"4","kartavyaḥ","_","_","kṛ","KDG","","_","_"
"5","sūtaputre","_","_","sūtaputra","NC","","_","_"
"6","kathaṃcana","_","_","kathaṃcana","CX","","_","_"
"1","tvayi","_","_","tvat","PPR","","_","_"
"2","karṇe","_","_","karṇa","NC","","_","_"
"3","kṛpe","_","_","kṛpa","NC","","_","_"
"4","droṇe","_","_","droṇa","NC","","_","_"
"5","_","_","_","madra","NC","","_","_"
"6","_","_","_","rāja","NC","","_","_"
"7","'tha","_","_","atha","CAD","","_","_"
"8","saubale","_","_","saubala","NC","","_","_"
"1","mahat","_","_","mahat","JJ","","_","_"
"2","kāryaṃ","_","_","kārya","NC","","_","_"
"3","samāyattaṃ","_","_","samāyat","PPP","","_","_"
"4","prasīda","_","_","prasīd","V","prasad","_","_"
"5","dvijasattama","_","_","dvijasattama","NC","","_","_"
"1","ete","_","_","tad","PRD","","_","_"
"2","_","_","_","hi","CX","","_","_"
"3","_","_","_","abhimukha","JJ","","_","_"
"4","sarve","_","_","sarva","JQ","","_","_"
"5","rādheyena","_","_","rādheya","NC","","_","_"
"6","yuyutsavaḥ","_","_","yuyutsu","JJ","","_","_"
"1","āyānti","_","_","āyā","V","āyā","_","_"
"2","pāṇḍavā","_","_","pāṇḍava","NC","","_","_"
"3","brahmann","_","_","brahman","NC","","_","_"
"4","āhvayantaḥ","_","_","āhvā","KDP","","_","_"
"5","samantataḥ","_","_","samantataḥ","CX","","_","_"
"1","saṃjaya","_","_","saṃjaya","NC","","_","_"
"2","uvāca","_","_","vak","V","vac","_","_"
"1","karṇo","_","_","karṇa","NC","","_","_"
"2","'pi","_","_","api","CX","","_","_"
"3","rathināṃ","_","_","rathin","NC","","_","_"
"4","_","_","_","śreṣṭha","JJ","","_","_"
"5","_","_","_","cāpa","NC","","_","_"
"6","udyamya","_","_","udya","CGDA","","_","_"
"7","vīryavān","_","_","vīryavat","JJ","","_","_"
"1","_","_","_","kaurava","NC","","_","_"
"2","_","_","_","agrya","JJ","","_","_"
"3","parivṛtaḥ","_","_","parivṛ","PPP","","_","_"
"4","śakro","_","_","śakra","NC","","_","_"
"5","_","_","_","deva","NC","","_","_"
"6","_","_","_","gaṇa","NC","","_","_"
"7","iva","_","_","iva","CCM","","_","_"
"1","paryatiṣṭhata","_","_","pariṣṭhā","V","pariṣṭhā","_","_"
"2","tejasvī","_","_","tejasvin","JJ","","_","_"
"3","_","_","_","sva","JJ","","_","_"
"4","_","_","_","bāhu","NC","","_","_"
"5","_","_","_","bala","NC","","_","_"
"6","āśritaḥ","_","_","āśri","PPP","","_","_"
"1","tataḥ","_","_","tatas","CX","","_","_"
"2","pravavṛte","_","_","pravart","V","pravṛt","_","_"
"3","yuddhaṃ","_","_","yuddha","NC","","_","_"
"4","karṇasya","_","_","karṇa","NC","","_","_"
"5","saha","_","_","saha","CX","","_","_"
"6","pāṇḍavaiḥ","_","_","pāṇḍava","NC","","_","_"
"1","saṃrabdhasya","_","_","saṃrabh","PPP","","_","_"
"2","_","_","_","mahat","JJ","","_","_"
"3","_","_","_","rāja","NC","","_","_"
"4","_","_","_","siṃhanāda","NC","","_","_"
"5","_","_","_","vināday","PPP","","_","_"
"1","_","_","_","tatas","CX","","_","_"
"2","_","_","_","tad","PRD","","_","_"
"3","pāṇḍavā","_","_","pāṇḍava","NC","","_","_"
"4","rājan","_","_","rājan","NC","","_","_"
"5","_","_","_","pāñcāla","NC","","_","_"
"6","_","_","_","ca","CCD","","_","_"
"7","yaśasvinaḥ","_","_","yaśasvin","JJ","","_","_"
"1","dṛṣṭvā","_","_","dṛś","CGDA","","_","_"
"2","karṇaṃ","_","_","karṇa","NC","","_","_"
"3","_","_","_","mahat","JJ","","_","_"
"4","_","_","_","bāhu","NC","","_","_"
"5","uccaiḥ","_","_","uccais","CX","","_","_"
"6","śabdam","_","_","śabda","NC","","_","_"
"7","_","_","_","atha","CAD","","_","_"
"8","_","_","_","nad","V","nad","_","_"
"1","ayaṃ","_","_","ida","PRD","","_","_"
"2","karṇaḥ","_","_","karṇa","NC","","_","_"
"3","kutaḥ","_","_","kutas","CX","","_","_"
"4","_","_","_","karṇa","NC","","_","_"
"5","_","_","_","tiṣṭh","V","sthā","_","_"
"6","karṇa","_","_","karṇa","NC","","_","_"
"7","_","_","_","mahat","JJ","","_","_"
"8","_","_","_","raṇa","NC","","_","_"
"1","yudhyasva","_","_","yudh","V","yudh","_","_"
"2","sahito","_","_","sahita","JJ","","_","_"
"3","'smābhir","_","_","mat","PPR","","_","_"
"4","durātman","_","_","durātman","JJ","","_","_"
"5","_","_","_","puruṣa","NC","","_","_"
"6","_","_","_","adhama","JJ","","_","_"
"1","anye","_","_","anya","PPX","","_","_"
"2","tu","_","_","tu","CCD","","_","_"
"3","dṛṣṭvā","_","_","dṛś","CGDA","","_","_"
"4","rādheyaṃ","_","_","rādheya","NC","","_","_"
"5","_","_","_","krodha","NC","","_","_"
"6","_","_","_","rakta","JJ","","_","_"
"7","_","_","_","īkṣaṇa","NC","","_","_"
"8","_","_","_","abravīta","V","brū","_","_"
"1","hanyatām","_","_","han","V","han","_","_"
"2","ayam","_","_","ida","PRD","","_","_"
"3","utsiktaḥ","_","_","utsic","PPP","","_","_"
"4","sūtaputro","_","_","sūtaputra","NC","","_","_"
"5","_","_","_","alpa","JJ","","_","_"
"6","_","_","_","cetanā","NC","","_","_"
"1","sarvaiḥ","_","_","sarva","JQ","","_","_"
"2","_","_","_","pārthiva","NC","","_","_"
"3","_","_","_","śārdūla","NC","","_","_"
"4","_","_","_","na","CNG","","_","_"
"5","_","_","_","ida","PRD","","_","_"
"6","_","_","_","artha","NC","","_","_"
"7","'sti","_","_","as","V","as","_","_"
"8","jīvatā","_","_","jīv","KDP","","_","_"
"1","_","_","_","atyanta","JJ","","_","_"
"2","_","_","_","vairin","JJ","","_","_"
"3","pārthānāṃ","_","_","pārtha","NC","","_","_"
"4","satataṃ","_","_","satata","CX","","_","_"
"5","_","_","_","pāpa","JJ","","_","_"
"6","_","_","_","pūruṣa","NC","","_","_"
"1","eṣa","_","_","tad","PRD","","_","_"
"2","mūlaṃ","_","_","mūla","NC","","_","_"
"3","_","_","_","hi","CX","","_","_"
"4","_","_","_","anartha","NC","","_","_"
"5","_","_","_","duryodhana","NC","","_","_"
"6","_","_","_","mata","NC","","_","_"
"7","sthitaḥ","_","_","sthā","PPP","","_","_"
"1","_","_","_","han","V","han","_","_"
"2","_","_","_","a","PRD","","_","_"
"3","iti","_","_","iti","CQT","","_","_"
"4","jalpantaḥ","_","_","jalp","KDP","","_","_"
"5","kṣatriyāḥ","_","_","kṣatriya","NC","","_","_"
"6","samupādravan","_","_","samupadru","V","samupadru","_","_"
"1","mahatā","_","_","mahat","JJ","","_","_"
"2","_","_","_","śara","NC","","_","_"
"3","_","_","_","varṣa","NC","","_","_"
"4","chādayanto","_","_","chāday","KDP","","_","_"
"5","_","_","_","mahat","JJ","","_","_"
"6","_","_","_","ratha","NC","","_","_"
"1","_","_","_","vadha","NC","","_","_"
"2","_","_","_","artha","NC","","_","_"
"3","sūtaputrasya","_","_","sūtaputra","NC","","_","_"
"4","pāṇḍaveyena","_","_","pāṇḍaveya","NC","","_","_"
"5","coditāḥ","_","_","coday","PPP","","_","_"
"1","_","_","_","tad","PRD","","_","_"
"2","_","_","_","tu","CCD","","_","_"
"3","_","_","_","sarva","JQ","","_","_"
"4","_","_","_","tathā","CX","","_","_"
"5","dṛṣṭvā","_","_","dṛś","CGDA","","_","_"
"6","_","_","_","dhāv","KDP","","_","_"
"7","_","_","_","mahat","JJ","","_","_"
"8","_","_","_","ratha","NC","","_","_"
"1","na","_","_","na","CNG","","_","_"
"2","vivyathe","_","_","vyath","V","vyath","_","_"
"3","sūtaputro","_","_","sūtaputra","NC","","_","_"
"4","na","_","_","na","CNG","","_","_"
"5","ca","_","_","ca","CCD","","_","_"
"6","trāsam","_","_","trāsa","NC","","_","_"
"7","agacchata","_","_","ga","V","ga","_","_"
"1","dṛṣṭvā","_","_","dṛś","CGDA","","_","_"
"2","_","_","_","nagara","NC","","_","_"
"3","_","_","_","kalpa","JJ","","_","_"
"4","tam","_","_","tad","PRD","","_","_"
"5","uddhūtaṃ","_","_","uddhū","PPP","","_","_"
"6","_","_","_","sainya","NC","","_","_"
"7","_","_","_","sāgara","NC","","_","_"
"1","_","_","_","piprīṣu","JJ","","_","_"
"2","_","_","_","tvat","PPR","","_","_"
"3","putrāṇāṃ","_","_","putra","NC","","_","_"
"4","_","_","_","saṃgrāma","NC","","_","_"
"5","_","_","_","aparājita","JJ","","_","_"
"1","_","_","_","sāyaka","NC","","_","_"
"2","_","_","_","ogha","NC","","_","_"
"3","balavān","_","_","balavat","JJ","","_","_"
"4","kṣiprakārī","_","_","kṣiprakārin","JJ","","_","_"
"5","_","_","_","mahat","JJ","","_","_"
"6","_","_","_","bala","NC","","_","_"
"1","vārayāmāsa","_","_","vāray","V","vāray","_","_"
"2","tat","_","_","tad","PRD","","_","_"
"3","sainyaṃ","_","_","sainya","NC","","_","_"
"4","samantād","_","_","samantāt","CX","","_","_"
"5","_","_","_","bharata","NC","","_","_"
"6","_","_","_","ṛṣabha","NC","","_","_"
"1","_","_","_","tatas","CX","","_","_"
"2","_","_","_","tu","CCD","","_","_"
"3","_","_","_","śara","NC","","_","_"
"4","_","_","_","varṣa","NC","","_","_"
"5","_","_","_","pārthiva","NC","","_","_"
"6","_","_","_","tad","PRD","","_","_"
"7","avārayan","_","_","vāray","V","vāray","_","_"
"1","dhanūṃṣi","_","_","dhanus","NC","","_","_"
"2","te","_","_","tad","PRD","","_","_"
"3","vidhunvānāḥ","_","_","vidhū","KDP","","_","_"
"4","śataśo","_","_","śataśas","CX","","_","_"
"5","'tha","_","_","atha","CAD","","_","_"
"6","sahasraśaḥ","_","_","sahasraśas","CX","","_","_"
"1","ayodhayanta","_","_","yodhay","V","yodhay","_","_"
"2","rādheyaṃ","_","_","rādheya","NC","","_","_"
"3","śakraṃ","_","_","śakra","NC","","_","_"
"4","_","_","_","daitya","NC","","_","_"
"5","_","_","_","gaṇa","NC","","_","_"
"6","iva","_","_","iva","CCM","","_","_"
"1","_","_","_","śara","NC","","_","_"
"2","_","_","_","varṣa","NC","","_","_"
"3","tu","_","_","tu","CCD","","_","_"
"4","tat","_","_","tad","PRD","","_","_"
"5","karṇaḥ","_","_","karṇa","NC","","_","_"
"6","pārthivaiḥ","_","_","pārthiva","NC","","_","_"
"7","samudīritam","_","_","samudīray","PPP","","_","_"
"1","_","_","_","śara","NC","","_","_"
"2","_","_","_","varṣa","NC","","_","_"
"3","mahatā","_","_","mahat","JJ","","_","_"
"4","samantād","_","_","samantāt","CX","","_","_"
"5","vyakirat","_","_","vikar","V","vikṛ","_","_"
"6","prabho","_","_","prabhu","JJ","","_","_"
"1","tad","_","_","tad","PRD","","_","_"
"2","yuddham","_","_","yuddha","NC","","_","_"
"3","abhavat","_","_","bhav","V","bhū","_","_"
"4","teṣāṃ","_","_","tad","PRD","","_","_"
"5","_","_","_","kṛ","PPP","","_","_"
"6","_","_","_","pratikṛ","PPP","","_","_"
"7","_","_","_","eṣin","JJ","","_","_"
"1","yathā","_","_","yathā","CCM","","_","_"
"2","devāsure","_","_","devāsura","NC","","_","_"
"3","yuddhe","_","_","yuddha","NC","","_","_"
"4","śakrasya","_","_","śakra","NC","","_","_"
"5","saha","_","_","saha","CX","","_","_"
"6","dānavaiḥ","_","_","dānava","NC","","_","_"
"1","_","_","_","tatra","CAD","","_","_"
"2","_","_","_","adbhuta","JJ","","_","_"
"3","apaśyāma","_","_","paś","V","paś","_","_"
"4","sūtaputrasya","_","_","sūtaputra","NC","","_","_"
"5","lāghavam","_","_","lāghava","NC","","_","_"
"1","yad","_","_","yat","CSB","","_","_"
"2","enaṃ","_","_","a","PRD","","_","_"
"3","samare","_","_","samara","NC","","_","_"
"4","yattā","_","_","yat","PPP","","_","_"
"5","_","_","_","na","CNG","","_","_"
"6","_","_","_","āpn","V","āp","_","_"
"7","pare","_","_","para","PPX","","_","_"
"8","yudhi","_","_","yudh","NC","","_","_"
"1","nivārya","_","_","nivāray","CGDA","","_","_"
"2","ca","_","_","ca","CCD","","_","_"
"3","_","_","_","śara","NC","","_","_"
"4","_","_","_","ogha","NC","","_","_"
"5","_","_","_","tad","PRD","","_","_"
"6","pārthivānāṃ","_","_","pārthiva","NC","","_","_"
"7","_","_","_","mahat","JJ","","_","_"
"8","_","_","_","ratha","NC","","_","_"
"1","_","_","_","yuga","NC","","_","_"
"2","_","_","_","īṣā","NC","","_","_"
"3","chatreṣu","_","_","chattra","NC","","_","_"
"4","dhvajeṣu","_","_","dhvaja","NC","","_","_"
"5","ca","_","_","ca","CCD","","_","_"
"6","hayeṣu","_","_","haya","NC","","_","_"
"7","ca","_","_","ca","CCD","","_","_"
"1","_","_","_","ātman","NC","","_","_"
"2","_","_","_","nāman","NC","","_","_"
"3","_","_","_","aṅkay","PPP","","_","_"
"4","bāṇān","_","_","bāṇa","NC","","_","_"
"5","rādheyaḥ","_","_","rādheya","NC","","_","_"
"6","_","_","_","prahi","V","prahi","_","_"
"7","_","_","_","śā","PPP","","_","_"
"1","_","_","_","tatas","CX","","_","_"
"2","_","_","_","tad","PRD","","_","_"
"3","vyākulībhūtā","_","_","vyākulībhū","PPP","","_","_"
"4","rājānaḥ","_","_","rājan","NC","","_","_"
"5","_","_","_","karṇa","NC","","_","_"
"6","_","_","_","pīḍay","PPP","","_","_"
"1","_","_","_","bhra","V","bhra","_","_"
"2","_","_","_","tatra","CAD","","_","_"
"3","_","_","_","tatra","CAD","","_","_"
"4","_","_","_","eva","CEM","","_","_"
"5","gāvaḥ","_","_","go","NC","","_","_"
"6","_","_","_","śīta","NC","","_","_"
"7","_","_","_","arday","PPP","","_","_"
"8","iva","_","_","iva","CCM","","_","_"
"1","hayānāṃ","_","_","haya","NC","","_","_"
"2","vadhyamānānāṃ","_","_","vadh","KDP","","_","_"
"3","gajānāṃ","_","_","gaja","NC","","_","_"
"4","rathināṃ","_","_","rathin","NC","","_","_"
"5","tathā","_","_","tathā","CX","","_","_"
"1","tatra","_","_","tatra","CAD","","_","_"
"2","_","_","_","tatra","CAD","","_","_"
"3","_","_","_","abhyavekṣ","V","abhyavekṣ","_","_"
"4","saṃghān","_","_","saṃgha","NC","","_","_"
"5","karṇena","_","_","karṇa","NC","","_","_"
"6","pātitān","_","_","pātay","PPP","","_","_"
"1","śirobhiḥ","_","_","śiras","NC","","_","_"
"2","patitai","_","_","pat","PPP","","_","_"
"3","rājan","_","_","rājan","NC","","_","_"
"4","_","_","_","bāhu","NC","","_","_"
"5","_","_","_","ca","CCD","","_","_"
"6","samantataḥ","_","_","samantataḥ","CX","","_","_"
"1","āstīrṇā","_","_","āstṛ","PPP","","_","_"
"2","vasudhā","_","_","vasudhā","NC","","_","_"
"3","sarvā","_","_","sarva","JQ","","_","_"
"4","śūrāṇām","_","_","śūra","NC","","_","_"
"5","anivartinām","_","_","anivartin","JJ","","_","_"
"1","_","_","_","han","PPP","","_","_"
"2","_","_","_","ca","CCD","","_","_"
"3","_","_","_","han","KDP","","_","_"
"4","_","_","_","ca","CCD","","_","_"
"5","_","_","_","niṣṭan","KDP","","_","_"
"6","_","_","_","ca","CCD","","_","_"
"7","sarvaśaḥ","_","_","sarvaśas","CX","","_","_"
"1","_","_","_","bhav","V","bhū","_","_"
"2","_","_","_","āyodhana","NC","","_","_"
"3","raudraṃ","_","_","raudra","JJ","","_","_"
"4","_","_","_","vaivasvata","NC","","_","_"
"5","_","_","_","pura","NC","","_","_"
"6","_","_","_","upama","JJ","","_","_"
"1","tato","_","_","tatas","CX","","_","_"
"2","duryodhano","_","_","duryodhana","NC","","_","_"
"3","rājā","_","_","rājan","NC","","_","_"
"4","dṛṣṭvā","_","_","dṛś","CGDA","","_","_"
"5","karṇasya","_","_","karṇa","NC","","_","_"
"6","vikramam","_","_","vikrama","NC","","_","_"
"1","aśvatthāmānam","_","_","aśvatthāman","NC","","_","_"
"2","āsādya","_","_","āsāday","CGDA","","_","_"
"3","tadā","_","_","tadā","CAD","","_","_"
"4","vākyam","_","_","vākya","NC","","_","_"
"5","uvāca","_","_","vak","V","vac","_","_"
"6","ha","_","_","ha","CEM","","_","_"
"1","yudhyate","_","_","yudh","V","yudh","_","_"
"2","'sau","_","_","adas","PRD","","_","_"
"3","raṇe","_","_","raṇa","NC","","_","_"
"4","karṇo","_","_","karṇa","NC","","_","_"
"5","daṃśitaḥ","_","_","daṃśay","PPP","","_","_"
"6","_","_","_","sarva","JQ","","_","_"
"7","_","_","_","pārthiva","NC","","_","_"
"1","_","_","_","paś","V","paś","_","_"
"2","_","_","_","tad","PRD","","_","_"
"3","dravatīṃ","_","_","dru","KDP","","_","_"
"4","senāṃ","_","_","senā","NC","","_","_"
"5","_","_","_","karṇa","NC","","_","_"
"6","_","_","_","sāyaka","NC","","_","_"
"7","_","_","_","pīḍay","PPP","","_","_"
"1","kārttikeyena","_","_","kārttikeya","NC","","_","_"
"2","vidhvastām","_","_","vidhvaṃs","PPP","","_","_"
"3","āsurīṃ","_","_","āsura","JJ","","_","_"
"4","pṛtanām","_","_","pṛtanā","NC","","_","_"
"5","iva","_","_","iva","CCM","","_","_"
"1","_","_","_","dṛś","CGDA","","_","_"
"2","_","_","_","tad","PRD","","_","_"
"3","nirjitāṃ","_","_","nirji","PPP","","_","_"
"4","senāṃ","_","_","senā","NC","","_","_"
"5","raṇe","_","_","raṇa","NC","","_","_"
"6","karṇena","_","_","karṇa","NC","","_","_"
"7","dhīmatā","_","_","dhīmat","JJ","","_","_"
"1","_","_","_","abhiyā","V","abhiyā","_","_"
"2","_","_","_","tad","PRD","","_","_"
"3","bībhatsuḥ","_","_","bībhatsu","NC","","_","_"
"4","_","_","_","sūtaputra","NC","","_","_"
"5","_","_","_","jighāṃsā","NC","","_","_"
"1","tad","_","_","tad","PRD","","_","_"
"2","yathā","_","_","yathā","CCM","","_","_"
"3","paśyamānānāṃ","_","_","paś","KDP","","_","_"
"4","sūtaputraṃ","_","_","sūtaputra","NC","","_","_"
"5","_","_","_","mahat","JJ","","_","_"
"6","_","_","_","ratha","NC","","_","_"
"1","na","_","_","na","CNG","","_","_"
"2","hanyāt","_","_","han","V","han","_","_"
"3","pāṇḍavaḥ","_","_","pāṇḍava","NC","","_","_"
"4","saṃkhye","_","_","saṃkhya","NC","","_","_"
"5","tathā","_","_","tathā","CX","","_","_"
"6","nītir","_","_","nīti","NC","","_","_"
"7","vidhīyatām","_","_","vidadh","V","vidhā","_","_"
"1","tato","_","_","tatas","CX","","_","_"
"2","drauṇiḥ","_","_","drauṇi","NC","","_","_"
"3","kṛpaḥ","_","_","kṛpa","NC","","_","_"
"4","śalyo","_","_","śalya","NC","","_","_"
"5","_","_","_","hārdikya","NC","","_","_"
"6","_","_","_","ca","CCD","","_","_"
"7","_","_","_","mahat","JJ","","_","_"
"8","_","_","_","ratha","NC","","_","_"
"1","_","_","_","pratyudyā","V","pratyudyā","_","_"
"2","_","_","_","tadā","CAD","","_","_"
"3","pārthaṃ","_","_","pārtha","NC","","_","_"
"4","_","_","_","sūtaputra","NC","","_","_"
"5","_","_","_","parīpsā","NC","","_","_"
"1","āyāntaṃ","_","_","āyā","KDP","","_","_"
"2","dṛśya","_","_","dṛś","CGDA","","_","_"
"3","kaunteyaṃ","_","_","kaunteya","NC","","_","_"
"4","vṛtraṃ","_","_","vṛtra","NC","","_","_"
"5","_","_","_","deva","NC","","_","_"
"6","_","_","_","camū","NC","","_","_"
"7","iva","_","_","iva","CCM","","_","_"
"1","pratyudyayau","_","_","pratyudyā","V","pratyudyā","_","_"
"2","tadā","_","_","tadā","CAD","","_","_"
"3","karṇo","_","_","karṇa","NC","","_","_"
"4","yathā","_","_","yathā","CCM","","_","_"
"5","śakraḥ","_","_","śakra","NC","","_","_"
"6","pratāpavān","_","_","pratāpavat","JJ","","_","_"
"1","dhṛtarāṣṭra","_","_","dhṛtarāṣṭra","NC","","_","_"
"2","uvāca","_","_","vak","V","vac","_","_"
"1","saṃrabdhaṃ","_","_","saṃrabh","PPP","","_","_"
"2","phalgunaṃ","_","_","phalguna","NC","","_","_"
"3","dṛṣṭvā","_","_","dṛś","CGDA","","_","_"
"4","_","_","_","kāla","NC","","_","_"
"5","_","_","_","antaka","NC","","_","_"
"6","_","_","_","yama","NC","","_","_"
"7","_","_","_","upama","JJ","","_","_"
"1","karṇo","_","_","karṇa","NC","","_","_"
"2","vaikartanaḥ","_","_","vaikartana","NC","","_","_"
"3","sūta","_","_","sūta","NC","","_","_"
"4","pratyapadyat","_","_","pratipad","V","pratipad","_","_"
"5","kim","_","_","kiṃ","PRQ","","_","_"
"6","uttaram","_","_","uttara","JJ","","_","_"
"1","sa","_","_","tad","PRD","","_","_"
"2","_","_","_","hi","CX","","_","_"
"3","_","_","_","spardh","V","spṛdh","_","_"
"4","pārthena","_","_","pārtha","NC","","_","_"
"5","nityam","_","_","nitya","CX","","_","_"
"6","eva","_","_","eva","CEM","","_","_"
"7","_","_","_","mahat","JJ","","_","_"
"8","_","_","_","ratha","NC","","_","_"
"1","āśaṃsate","_","_","āśaṃs","V","āśaṃs","_","_"
"2","ca","_","_","ca","CCD","","_","_"
"3","bībhatsuṃ","_","_","bībhatsu","NC","","_","_"
"4","yuddhe","_","_","yuddha","NC","","_","_"
"5","jetuṃ","_","_","ji","CGDI","","_","_"
"6","_","_","_","su","CAD","","_","_"
"7","_","_","_","dāruṇa","JJ","","_","_"
"1","sa","_","_","tad","PRD","","_","_"
"2","tu","_","_","tu","CCD","","_","_"
"3","taṃ","_","_","tad","PRD","","_","_"
"4","sahasā","_","_","sahas","NC","","_","_"
"5","prāptaṃ","_","_","prāp","PPP","","_","_"
"6","nityam","_","_","nitya","CX","","_","_"
"7","_","_","_","atyanta","JJ","","_","_"
"8","_","_","_","vairin","JJ","","_","_"
"1","karṇo","_","_","karṇa","NC","","_","_"
"2","vaikartanaḥ","_","_","vaikartana","NC","","_","_"
"3","sūta","_","_","sūta","NC","","_","_"
"4","kim","_","_","kiṃ","PRQ","","_","_"
"5","uttaram","_","_","uttara","JJ","","_","_"
"6","apadyata","_","_","pad","V","pad","_","_"
"1","saṃjaya","_","_","saṃjaya","NC","","_","_"
"2","uvāca","_","_","vak","V","vac","_","_"
"1","āyāntaṃ","_","_","āyā","KDP","","_","_"
"2","pāṇḍavaṃ","_","_","pāṇḍava","NC","","_","_"
"3","dṛṣṭvā","_","_","dṛś","CGDA","","_","_"
"4","gajaḥ","_","_","gaja","NC","","_","_"
"5","pratigajaṃ","_","_","pratigaja","NC","","_","_"
"6","yathā","_","_","yathā","CCM","","_","_"
"1","asaṃbhrāntataraḥ","_","_","asaṃbhrāntatara","JJ","","_","_"
"2","karṇaḥ","_","_","karṇa","NC","","_","_"
"3","pratyudīyād","_","_","pratyudi","V","pratyudi","_","_"
"4","dhanaṃjayam","_","_","dhanaṃjaya","NC","","_","_"
"1","tam","_","_","tad","PRD","","_","_"
"2","āpatantaṃ","_","_","āpat","KDP","","_","_"
"3","vegena","_","_","vega","NC","","_","_"
"4","vaikartanam","_","_","vaikartana","NC","","_","_"
"5","ajihmagaiḥ","_","_","ajihmaga","NC","","_","_"
"1","vārayāmāsa","_","_","vāray","V","vāray","_","_"
"2","tejasvī","_","_","tejasvin","JJ","","_","_"
"3","pāṇḍavaḥ","_","_","pāṇḍava","NC","","_","_"
"4","_","_","_","śatru","NC","","_","_"
"5","_","_","_","tāpana","JJ","","_","_"
"1","taṃ","_","_","tad","PRD","","_","_"
"2","karṇaḥ","_","_","karṇa","NC","","_","_"
"3","_","_","_","śara","NC","","_","_"
"4","_","_","_","jāla","NC","","_","_"
"5","chādayāmāsa","_","_","chāday","V","chāday","_","_"
"6","māriṣa","_","_","māriṣa","NC","","_","_"
"1","vivyādha","_","_","vyadh","V","vyadh","_","_"
"2","ca","_","_","ca","CCD","","_","_"
"3","_","_","_","su","CAD","","_","_"
"4","_","_","_","saṃkrudh","PPP","","_","_"
"5","_","_","_","śara","NC","","_","_"
"6","_","_","_","tri","NUM","","_","_"
"7","ajihmagaiḥ","_","_","ajihmaga","NC","","_","_"
"1","tasya","_","_","tad","PRD","","_","_"
"2","tal","_","_","tad","PRD","","_","_"
"3","lāghavaṃ","_","_","lāghava","NC","","_","_"
"4","pārtho","_","_","pārtha","NC","","_","_"
"5","_","_","_","na","CNG","","_","_"
"6","_","_","_","mṛṣ","V","mṛṣ","_","_"
"7","_","_","_","mahat","JJ","","_","_"
"8","_","_","_","bala","NC","","_","_"
"1","tasmai","_","_","tad","PRD","","_","_"
"2","bāṇāñ","_","_","bāṇa","NC","","_","_"
"3","_","_","_","śilā","NC","","_","_"
"4","_","_","_","dhāv","PPP","","_","_"
"5","_","_","_","prasad","PPP","","_","_"
"6","_","_","_","agra","NC","","_","_"
"7","ajihmagān","_","_","ajihmaga","NC","","_","_"
"1","prāhiṇot","_","_","prāhiṇa","V","prahi","_","_"
"2","sūtaputrāya","_","_","sūtaputra","NC","","_","_"
"3","triṃśataṃ","_","_","triṃśat","NC","","_","_"
"4","_","_","_","śatru","NC","","_","_"
"5","_","_","_","tāpana","JJ","","_","_"
"1","vivyādha","_","_","vyadh","V","vyadh","_","_"
"2","_","_","_","ca","CCD","","_","_"
"3","_","_","_","a","PRD","","_","_"
"4","saṃrabdho","_","_","saṃrabh","PPP","","_","_"
"5","_","_","_","bāṇa","NC","","_","_"
"6","_","_","_","eka","PPX","","_","_"
"7","vīryavān","_","_","vīryavat","JJ","","_","_"
"1","savye","_","_","savya","JJ","","_","_"
"2","_","_","_","bhuja","NC","","_","_"
"3","_","_","_","agra","NC","","_","_"
"4","_","_","_","balavat","JJ","","_","_"
"5","_","_","_","nārāca","NC","","_","_"
"6","hasann","_","_","has","KDP","","_","_"
"7","iva","_","_","iva","CCM","","_","_"
"1","tasya","_","_","tad","PRD","","_","_"
"2","viddhasya","_","_","vyadh","PPP","","_","_"
"3","vegena","_","_","vega","NC","","_","_"
"4","_","_","_","kara","NC","","_","_"
"5","_","_","_","cāpa","NC","","_","_"
"6","papāta","_","_","pat","V","pat","_","_"
"7","ha","_","_","ha","CEM","","_","_"
"1","punar","_","_","punar","CAD","","_","_"
"2","ādāya","_","_","ādā","CGDA","","_","_"
"3","_","_","_","tad","PRD","","_","_"
"4","_","_","_","cāpa","NC","","_","_"
"5","_","_","_","nimeṣa","NC","","_","_"
"6","_","_","_","ardha","NC","","_","_"
"7","_","_","_","mahat","JJ","","_","_"
"8","_","_","_","bala","NC","","_","_"
"1","chādayāmāsa","_","_","chāday","V","chāday","_","_"
"2","_","_","_","bāṇa","NC","","_","_"
"3","_","_","_","ogha","NC","","_","_"
"4","phalgunaṃ","_","_","phalguna","NC","","_","_"
"5","_","_","_","kṛtahasta","JJ","","_","_"
"6","_","_","_","vat","CX","","_","_"
"1","_","_","_","śara","NC","","_","_"
"2","_","_","_","vṛṣṭi","NC","","_","_"
"3","tu","_","_","tu","CCD","","_","_"
"4","tāṃ","_","_","tad","PRD","","_","_"
"5","muktāṃ","_","_","muc","PPP","","_","_"
"6","sūtaputreṇa","_","_","sūtaputra","NC","","_","_"
"7","bhārata","_","_","bhārata","NC","","_","_"
"1","_","_","_","vidha","V","vidha","_","_"
"2","_","_","_","śara","NC","","_","_"
"3","_","_","_","varṣa","NC","","_","_"
"4","smayann","_","_","smi","KDP","","_","_"
"5","iva","_","_","iva","CCM","","_","_"
"6","dhanaṃjayaḥ","_","_","dhanaṃjaya","NC","","_","_"
"1","tau","_","_","tad","PRD","","_","_"
"2","parasparam","_","_","paraspara","PRC","","_","_"
"3","āsādya","_","_","āsāday","CGDA","","_","_"
"4","_","_","_","śara","NC","","_","_"
"5","_","_","_","varṣa","NC","","_","_"
"6","pārthiva","_","_","pārthiva","NC","","_","_"
"1","chādayetāṃ","_","_","chāday","V","chāday","_","_"
"2","_","_","_","mahat","JJ","","_","_"
"3","_","_","_","iṣvāsa","NC","","_","_"
"4","_","_","_","kṛ","PPP","","_","_"
"5","_","_","_","pratikṛ","PPP","","_","_"
"6","_","_","_","eṣin","JJ","","_","_"
"1","tad","_","_","tad","PRD","","_","_"
"2","adbhutam","_","_","adbhuta","JJ","","_","_"
"3","abhūd","_","_","bhav","V","bhū","_","_"
"4","yuddhaṃ","_","_","yuddha","NC","","_","_"
"5","_","_","_","karṇa","NC","","_","_"
"6","_","_","_","pāṇḍava","NC","","_","_"
"7","mṛdhe","_","_","mṛdha","NC","","_","_"
"1","kruddhayor","_","_","krudh","PPP","","_","_"
"2","_","_","_","vāśitā","NC","","_","_"
"3","_","_","_","hetu","NC","","_","_"
"4","vanyayor","_","_","vanya","JJ","","_","_"
"5","gajayor","_","_","gaja","NC","","_","_"
"6","iva","_","_","iva","CCM","","_","_"
"1","tataḥ","_","_","tatas","CX","","_","_"
"2","pārtho","_","_","pārtha","NC","","_","_"
"3","_","_","_","mahat","JJ","","_","_"
"4","_","_","_","iṣvāsa","NC","","_","_"
"5","dṛṣṭvā","_","_","dṛś","CGDA","","_","_"
"6","karṇasya","_","_","karṇa","NC","","_","_"
"7","vikramam","_","_","vikrama","NC","","_","_"
"1","muṣṭideśe","_","_","muṣṭideśa","NC","","_","_"
"2","_","_","_","dhanus","NC","","_","_"
"3","_","_","_","tad","PRD","","_","_"
"4","_","_","_","tvarā","NC","","_","_"
"5","_","_","_","anvita","JJ","","_","_"
"1","_","_","_","aśva","NC","","_","_"
"2","_","_","_","ca","CCD","","_","_"
"3","caturo","_","_","catur","NUM","","_","_"
"4","bhallair","_","_","bhalla","NC","","_","_"
"5","anayad","_","_","nay","V","nī","_","_"
"6","_","_","_","yama","NC","","_","_"
"7","_","_","_","sādana","NC","","_","_"
"1","_","_","_","sārathi","NC","","_","_"
"2","_","_","_","ca","CCD","","_","_"
"3","śiraḥ","_","_","śiras","NC","","_","_"
"4","kāyād","_","_","kāya","NC","","_","_"
"5","_","_","_","har","V","hṛ","_","_"
"6","_","_","_","śatru","NC","","_","_"
"7","_","_","_","tāpana","JJ","","_","_"
"1","_","_","_","atha","CAD","","_","_"
"2","_","_","_","a","PRD","","_","_"
"3","_","_","_","chid","PPP","","_","_"
"4","_","_","_","dhanvan","NC","","_","_"
"5","_","_","_","han","PPP","","_","_"
"6","_","_","_","aśva","NC","","_","_"
"7","_","_","_","han","PPP","","_","_"
"8","_","_","_","sārathi","NC","","_","_"
"1","vivyādha","_","_","vyadh","V","vyadh","_","_"
"2","sāyakaiḥ","_","_","sāyaka","NC","","_","_"
"3","_","_","_","pārtha","NC","","_","_"
"4","_","_","_","catur","NUM","","_","_"
"5","_","_","_","pāṇḍu","NC","","_","_"
"6","_","_","_","nandana","NC","","_","_"
"1","_","_","_","han","PPP","","_","_"
"2","_","_","_","aśva","NC","","_","_"
"3","tu","_","_","tu","CCD","","_","_"
"4","rathāt","_","_","ratha","NC","","_","_"
"5","tūrṇam","_","_","tūrṇa","CX","","_","_"
"6","avaplutya","_","_","avaplu","CGDA","","_","_"
"7","_","_","_","nara","NC","","_","_"
"8","_","_","_","ṛṣabha","NC","","_","_"
"1","āruroha","_","_","āroh","V","āruh","_","_"
"2","rathaṃ","_","_","ratha","NC","","_","_"
"3","tūrṇaṃ","_","_","tūrṇa","CX","","_","_"
"4","kṛpasya","_","_","kṛpa","NC","","_","_"
"5","_","_","_","śara","NC","","_","_"
"6","_","_","_","pīḍay","PPP","","_","_"
"1","rādheyaṃ","_","_","rādheya","NC","","_","_"
"2","nirjitaṃ","_","_","nirji","PPP","","_","_"
"3","dṛṣṭvā","_","_","dṛś","CGDA","","_","_"
"4","tāvakā","_","_","tāvaka","JJ","","_","_"
"5","_","_","_","bharata","NC","","_","_"
"6","_","_","_","ṛṣabha","NC","","_","_"
"1","_","_","_","dhanaṃjaya","NC","","_","_"
"2","_","_","_","śara","NC","","_","_"
"3","nunnāḥ","_","_","nud","PPP","","_","_"
"4","prādravanta","_","_","pradru","V","pradru","_","_"
"5","diśo","_","_","diś","NC","","_","_"
"6","daśa","_","_","daśan","NUM","","_","_"
"1","_","_","_","dru","KDP","","_","_"
"2","_","_","_","tad","PRD","","_","_"
"3","samālokya","_","_","samālokay","CGDA","","_","_"
"4","rājā","_","_","rājan","NC","","_","_"
"5","duryodhano","_","_","duryodhana","NC","","_","_"
"6","nṛpa","_","_","nṛpa","NC","","_","_"
"1","nivartayāmāsa","_","_","nivartay","V","nivartay","_","_"
"2","tadā","_","_","tadā","CAD","","_","_"
"3","vākyaṃ","_","_","vākya","NC","","_","_"
"4","_","_","_","ca","CCD","","_","_"
"5","_","_","_","ida","PRD","","_","_"
"6","uvāca","_","_","vak","V","vac","_","_"
"7","ha","_","_","ha","CEM","","_","_"
"1","alaṃ","_","_","ala","CX","","_","_"
"2","drutena","_","_","dru","PPP","","_","_"
"3","vaḥ","_","_","tvat","PPR","","_","_"
"4","_","_","_","śūra","NC","","_","_"
"5","_","_","_","tiṣṭh","V","sthā","_","_"
"6","_","_","_","kṣatriya","NC","","_","_"
"7","_","_","_","ṛṣabha","NC","","_","_"
"1","eṣa","_","_","tad","PRD","","_","_"
"2","_","_","_","pārtha","NC","","_","_"
"3","_","_","_","vadha","NC","","_","_"
"4","_","_","_","mat","PPR","","_","_"
"5","svayaṃ","_","_","svaya","CX","","_","_"
"6","gacchāmi","_","_","gacch","V","gam","_","_"
"7","saṃyuge","_","_","saṃyuga","NC","","_","_"
"1","ahaṃ","_","_","mat","PPR","","_","_"
"2","pārthān","_","_","pārtha","NC","","_","_"
"3","haniṣyāmi","_","_","han","V","han","_","_"
"4","_","_","_","sa_saha","CX","","_","_"
"5","_","_","_","pāñcāla","NC","","_","_"
"6","_","_","_","sa_saha","CX","","_","_"
"7","_","_","_","somaka","NC","","_","_"
"1","adya","_","_","adya","CX","","_","_"
"2","me","_","_","mat","PPR","","_","_"
"3","yudhyamānasya","_","_","yudh","KDP","","_","_"
"4","saha","_","_","saha","CX","","_","_"
"5","gāṇḍīvadhanvanā","_","_","gāṇḍīvadhanvan","NC","","_","_"
"1","drakṣyanti","_","_","darś","V","dṛś","_","_"
"2","vikramaṃ","_","_","vikrama","NC","","_","_"
"3","pārthāḥ","_","_","pārtha","NC","","_","_"
"4","_","_","_","kāla","NC","","_","_"
"5","_","_","_","iva","CCM","","_","_"
"6","_","_","_","yuga","NC","","_","_"
"7","_","_","_","kṣaya","NC","","_","_"
"1","adya","_","_","adya","CX","","_","_"
"2","_","_","_","mat","PPR","","_","_"
"3","_","_","_","bāṇa","NC","","_","_"
"4","_","_","_","jāla","NC","","_","_"
"5","vimuktāni","_","_","vimuc","PPP","","_","_"
"6","sahasraśaḥ","_","_","sahasraśas","CX","","_","_"
"1","drakṣyanti","_","_","darś","V","dṛś","_","_"
"2","samare","_","_","samara","NC","","_","_"
"3","yodhāḥ","_","_","yodha","NC","","_","_"
"4","śalabhānām","_","_","śalabha","NC","","_","_"
"5","_","_","_","iva","CCM","","_","_"
"6","_","_","_","āyati","NC","","_","_"
"1","adya","_","_","adya","CX","","_","_"
"2","_","_","_","bāṇa","NC","","_","_"
"3","_","_","_","maya","JJ","","_","_"
"4","varṣaṃ","_","_","varṣa","NC","","_","_"
"5","sṛjato","_","_","sṛj","KDP","","_","_"
"6","mama","_","_","mat","PPR","","_","_"
"7","dhanvinaḥ","_","_","dhanvin","JJ","","_","_"
"1","_","_","_","jīmūta","NC","","_","_"
"2","_","_","_","iva","CCM","","_","_"
"3","_","_","_","gharma","NC","","_","_"
"4","_","_","_","anta","NC","","_","_"
"5","drakṣyanti","_","_","darś","V","dṛś","_","_"
"6","yudhi","_","_","yudh","NC","","_","_"
"7","sainikāḥ","_","_","sainika","NC","","_","_"
"1","_","_","_","jay","V","ji","_","_"
"2","_","_","_","adya","CX","","_","_"
"3","raṇe","_","_","raṇa","NC","","_","_"
"4","pārthaṃ","_","_","pārtha","NC","","_","_"
"5","sāyakair","_","_","sāyaka","NC","","_","_"
"6","_","_","_","na","PPP","","_","_"
"7","_","_","_","parvan","NC","","_","_"
"1","tiṣṭhadhvaṃ","_","_","tiṣṭh","V","sthā","_","_"
"2","samare","_","_","samara","NC","","_","_"
"3","śūrā","_","_","śūra","NC","","_","_"
"4","bhayaṃ","_","_","bhaya","NC","","_","_"
"5","tyajata","_","_","tyaj","V","tyaj","_","_"
"6","phalgunāt","_","_","phalguna","NC","","_","_"
"1","na","_","_","na","CNG","","_","_"
"2","hi","_","_","hi","CX","","_","_"
"3","_","_","_","mat","PPR","","_","_"
"4","_","_","_","vīrya","NC","","_","_"
"5","āsādya","_","_","āsāday","CGDA","","_","_"
"6","phalgunaḥ","_","_","phalguna","NC","","_","_"
"7","prasahiṣyati","_","_","prasah","V","prasah","_","_"
"1","yathā","_","_","yathā","CCM","","_","_"
"2","velāṃ","_","_","velā","NC","","_","_"
"3","samāsādya","_","_","samāsāday","CGDA","","_","_"
"4","sāgaro","_","_","sāgara","NC","","_","_"
"5","_","_","_","makara","NC","","_","_"
"6","_","_","_","ālaya","NC","","_","_"
"1","_","_","_","iti","CQT","","_","_"
"2","_","_","_","vac","CGDA","","_","_"
"3","prayayau","_","_","prayā","V","prayā","_","_"
"4","rājā","_","_","rājan","NC","","_","_"
"5","sainyena","_","_","sainya","NC","","_","_"
"6","mahatā","_","_","mahat","JJ","","_","_"
"7","vṛtaḥ","_","_","vṛ","PPP","","_","_"
"1","phalgunaṃ","_","_","phalguna","NC","","_","_"
"2","prati","_","_","prati","CADP","","_","_"
"3","durdharṣaḥ","_","_","durdharṣa","JJ","","_","_"
"4","_","_","_","krodha","NC","","_","_"
"5","_","_","_","saṃrañj","PPP","","_","_"
"6","_","_","_","locana","NC","","_","_"
"1","taṃ","_","_","tad","PRD","","_","_"
"2","prayāntaṃ","_","_","prayā","KDP","","_","_"
"3","_","_","_","mahat","JJ","","_","_"
"4","_","_","_","bāhu","NC","","_","_"
"5","dṛṣṭvā","_","_","dṛś","CGDA","","_","_"
"6","_","_","_","śāradvata","NC","","_","_"
"7","_","_","_","tadā","CAD","","_","_"
"1","aśvatthāmānam","_","_","aśvatthāman","NC","","_","_"
"2","āsādya","_","_","āsāday","CGDA","","_","_"
"3","vākyam","_","_","vākya","NC","","_","_"
"4","etad","_","_","tad","PRD","","_","_"
"5","uvāca","_","_","vak","V","vac","_","_"
"6","ha","_","_","ha","CEM","","_","_"
"1","eṣa","_","_","tad","PRD","","_","_"
"2","rājā","_","_","rājan","NC","","_","_"
"3","_","_","_","mahat","JJ","","_","_"
"4","_","_","_","bāhu","NC","","_","_"
"5","amarṣī","_","_","amarṣin","JJ","","_","_"
"6","_","_","_","krodha","NC","","_","_"
"7","_","_","_","mūrchay","PPP","","_","_"
"1","_","_","_","pataṃga","NC","","_","_"
"2","_","_","_","vṛtti","NC","","_","_"
"3","āsthāya","_","_","āsthā","CGDA","","_","_"
"4","phalgunaṃ","_","_","phalguna","NC","","_","_"
"5","yoddhum","_","_","yudh","CGDI","","_","_"
"6","icchati","_","_","iṣ","V","iṣ","_","_"
"1","_","_","_","yāvat","CX","","_","_"
"2","_","_","_","mat","PPR","","_","_"
"3","paśyamānānāṃ","_","_","paś","KDP","","_","_"
"4","prāṇān","_","_","prāṇa","NC","","_","_"
"5","pārthena","_","_","pārtha","NC","","_","_"
"6","saṃgataḥ","_","_","saṃga","PPP","","_","_"
"1","na","_","_","na","CNG","","_","_"
"2","jahyāt","_","_","jah","V","hā","_","_"
"3","_","_","_","puruṣa","NC","","_","_"
"4","_","_","_","vyāghra","NC","","_","_"
"5","_","_","_","tāvat","CX","","_","_"
"6","vāraya","_","_","vāray","V","vāray","_","_"
"7","kauravam","_","_","kaurava","NC","","_","_"
"1","yāvat","_","_","yāvat","CX","","_","_"
"2","_","_","_","phalguna","NC","","_","_"
"3","_","_","_","bāṇa","NC","","_","_"
"4","gocaraṃ","_","_","gocara","NC","","_","_"
"5","_","_","_","na","CNG","","_","_"
"6","_","_","_","adhiga","V","adhiga","_","_"
"1","kauravaḥ","_","_","kaurava","NC","","_","_"
"2","pārthivo","_","_","pārthiva","NC","","_","_"
"3","_","_","_","vīra","NC","","_","_"
"4","_","_","_","tāvat","CX","","_","_"
"5","vāraya","_","_","vāray","V","vāray","_","_"
"6","taṃ","_","_","tad","PRD","","_","_"
"7","drutam","_","_","druta","CX","","_","_"
"1","yāvat","_","_","yāvat","CX","","_","_"
"2","_","_","_","pārtha","NC","","_","_"
"3","_","_","_","śara","NC","","_","_"
"4","ghorair","_","_","ghora","JJ","","_","_"
"5","_","_","_","nirmuc","PPP","","_","_"
"6","_","_","_","uraga","NC","","_","_"
"7","_","_","_","saṃnibha","JJ","","_","_"
"1","na","_","_","na","CNG","","_","_"
"2","bhasmīkriyate","_","_","bhasmīkar","V","bhasmīkṛ","_","_"
"3","rājā","_","_","rājan","NC","","_","_"
"4","tāvad","_","_","tāvat","CX","","_","_"
"5","_","_","_","yuddha","NC","","_","_"
"6","_","_","_","nivāray","V","nivāray","_","_"
"1","ayuktam","_","_","ayukta","JJ","","_","_"
"2","iva","_","_","iva","CCM","","_","_"
"3","paśyāmi","_","_","paś","V","paś","_","_"
"4","_","_","_","sthā","KDP","","_","_"
"5","_","_","_","mat","PPR","","_","_"
"6","mānada","_","_","mānada","JJ","","_","_"
"1","svayaṃ","_","_","svaya","CX","","_","_"
"2","yuddhāya","_","_","yuddha","NC","","_","_"
"3","yad","_","_","yat","CSB","","_","_"
"4","rājā","_","_","rājan","NC","","_","_"
"5","pārthaṃ","_","_","pārtha","NC","","_","_"
"6","_","_","_","yā","V","yā","_","_"
"7","_","_","_","asahāyavat","JJ","","_","_"
"1","durlabhaṃ","_","_","durlabha","JJ","","_","_"
"2","jīvitaṃ","_","_","jīvita","NC","","_","_"
"3","manye","_","_","man","V","man","_","_"
"4","kauravyasya","_","_","kauravya","NC","","_","_"
"5","kirīṭinā","_","_","kirīṭin","NC","","_","_"
"1","yudhyamānasya","_","_","yudh","KDP","","_","_"
"2","pārthena","_","_","pārtha","NC","","_","_"
"3","_","_","_","śārdūla","NC","","_","_"
"4","_","_","_","iva","CCM","","_","_"
"5","hastinaḥ","_","_","hastin","NC","","_","_"
"1","_","_","_","mātula","NC","","_","_"
"2","_","_","_","eva","CX","","_","_"
"3","_","_","_","vac","PPP","","_","_"
"4","_","_","_","tu","CCD","","_","_"
"5","drauṇiḥ","_","_","drauṇi","NC","","_","_"
"6","śastrabhṛtāṃ","_","_","śastrabhṛt","NC","","_","_"
"7","varaḥ","_","_","vara","JJ","","_","_"
"1","duryodhanam","_","_","duryodhana","NC","","_","_"
"2","idaṃ","_","_","ida","PRD","","_","_"
"3","vākyaṃ","_","_","vākya","NC","","_","_"
"4","tvaritaṃ","_","_","tvarita","CX","","_","_"
"5","samabhāṣata","_","_","sambhāṣ","V","sambhāṣ","_","_"
"1","mayi","_","_","mat","PPR","","_","_"
"2","jīvati","_","_","jīv","KDP","","_","_"
"3","gāndhāre","_","_","gāndhāri","NC","","_","_"
"4","na","_","_","na","CNG","","_","_"
"5","yuddhaṃ","_","_","yuddha","NC","","_","_"
"6","gantum","_","_","ga","CGDI","","_","_"
"7","arhasi","_","_","arh","V","arh","_","_"
"1","mām","_","_","mat","PPR","","_","_"
"2","anādṛtya","_","_","anādṛtya","CX","","_","_"
"3","kauravya","_","_","kauravya","NC","","_","_"
"4","tava","_","_","tvat","PPR","","_","_"
"5","nityaṃ","_","_","nitya","CX","","_","_"
"6","_","_","_","hita","NC","","_","_"
"7","_","_","_","eṣin","JJ","","_","_"
"1","na","_","_","na","CNG","","_","_"
"2","hi","_","_","hi","CX","","_","_"
"3","te","_","_","tvat","PPR","","_","_"
"4","saṃbhramaḥ","_","_","sambhrama","NC","","_","_"
"5","kāryaḥ","_","_","kṛ","KDG","","_","_"
"6","pārthasya","_","_","pārtha","NC","","_","_"
"7","vijayaṃ","_","_","vijaya","NC","","_","_"
"8","prati","_","_","prati","CADP","","_","_"
"1","aham","_","_","mat","PPR","","_","_"
"2","āvārayiṣyāmi","_","_","āvāray","V","āvāray","_","_"
"3","pārthaṃ","_","_","pārtha","NC","","_","_"
"4","tiṣṭha","_","_","tiṣṭh","V","sthā","_","_"
"5","suyodhana","_","_","suyodhana","NC","","_","_"
"1","duryodhana","_","_","duryodhana","NC","","_","_"
"2","uvāca","_","_","vak","V","vac","_","_"
"1","ācāryaḥ","_","_","ācārya","NC","","_","_"
"2","_","_","_","pāṇḍu","NC","","_","_"
"3","_","_","_","putra","NC","","_","_"
"4","vai","_","_","vai","CX","","_","_"
"5","_","_","_","putra","NC","","_","_"
"6","_","_","_","vat","CX","","_","_"
"7","parirakṣati","_","_","parirakṣ","V","parirakṣ","_","_"
"1","tvam","_","_","tvat","PPR","","_","_"
"2","_","_","_","api","CX","","_","_"
"3","_","_","_","upekṣā","NC","","_","_"
"4","kuruṣe","_","_","kar","V","kṛ","_","_"
"5","teṣu","_","_","tad","PRD","","_","_"
"6","nityaṃ","_","_","nitya","CX","","_","_"
"7","dvijottama","_","_","dvijottama","NC","","_","_"
"1","mama","_","_","mat","PPR","","_","_"
"2","vā","_","_","vā","CCD","","_","_"
"3","_","_","_","mandabhāgya","JJ","","_","_"
"5","_","_","_","manda","JJ","","_","_"
"6","_","_","_","tvat","PPR","","_","_"
"7","vikramo","_","_","vikrama","NC","","_","_"
"8","yudhi","_","_","yudh","NC","","_","_"
"1","_","_","_","dharmarāja","NC","","_","_"
"2","_","_","_","priya","JJ","","_","_"
"3","_","_","_","artha","NC","","_","_"
"4","vā","_","_","vā","CCD","","_","_"
"5","draupadyā","_","_","draupadī","NC","","_","_"
"6","vā","_","_","vā","CCD","","_","_"
"7","na","_","_","na","CNG","","_","_"
"8","vidma","_","_","vid","V","vid","_","_"
"9","tat","_","_","tad","PRD","","_","_"
"1","dhig","_","_","dhik","CX","","_","_"
"2","astu","_","_","as","V","as","_","_"
"3","mama","_","_","mat","PPR","","_","_"
"4","lubdhasya","_","_","lubh","PPP","","_","_"
"5","_","_","_","yad","PRL","","_","_"
"6","_","_","_","kṛte","CX","","_","_"
"7","_","_","_","sarva","JQ","","_","_"
"8","_","_","_","bāndhava","NC","","_","_"
"1","_","_","_","sukha","NC","","_","_"
"2","_","_","_","arha","JJ","","_","_"
"3","paramaṃ","_","_","parama","JJ","","_","_"
"4","duḥkhaṃ","_","_","duḥkha","NC","","_","_"
"5","_","_","_","prāpn","V","prāp","_","_"
"6","_","_","_","aparājita","JJ","","_","_"
"1","ko","_","_","kiṃ","PRQ","","_","_"
"2","hi","_","_","hi","CX","","_","_"
"3","śastrabhṛtāṃ","_","_","śastrabhṛt","NC","","_","_"
"4","mukhyo","_","_","mukhya","JJ","","_","_"
"5","_","_","_","maheśvara","NC","","_","_"
"6","_","_","_","sama","PPX","","_","_"
"7","yudhi","_","_","yudh","NC","","_","_"
"1","_","_","_","śatru","NC","","_","_"
"2","_","_","_","na","CNG","","_","_"
"3","_","_","_","kṣapay","V","kṣapay","_","_"
"4","_","_","_","śak","PPP","","_","_"
"5","yo","_","_","yad","PRL","","_","_"
"6","na","_","_","na","CNG","","_","_"
"7","syād","_","_","as","V","as","_","_"
"8","gautamīsutaḥ","_","_","gautamīsuta","NC","","_","_"
"1","aśvatthāman","_","_","aśvatthāman","NC","","_","_"
"2","prasīdasva","_","_","prasīd","V","prasad","_","_"
"3","_","_","_","nāśay","V","nāśay","_","_"
"4","_","_","_","tad","PRD","","_","_"
"5","_","_","_","mat","PPR","","_","_"
"6","_","_","_","ahita","JJ","","_","_"
"1","_","_","_","tvat","PPR","","_","_"
"2","_","_","_","astra","NC","","_","_"
"3","_","_","_","gocara","NC","","_","_"
"4","śaktāḥ","_","_","śak","PPP","","_","_"
"5","sthātuṃ","_","_","sthā","CGDI","","_","_"
"6","_","_","_","deva","NC","","_","_"
"7","_","_","_","api","CX","","_","_"
"8","_","_","_","na","CNG","","_","_"
"9","_","_","_","anagha","JJ","","_","_"
"1","pāñcālān","_","_","pāñcāla","NC","","_","_"
"2","_","_","_","somaka","NC","","_","_"
"3","_","_","_","ca","CCD","","_","_"
"4","_","_","_","eva","CEM","","_","_"
"5","jahi","_","_","jah","V","hā","_","_"
"6","drauṇe","_","_","drauṇi","NC","","_","_"
"7","_","_","_","saha","CX","","_","_"
"8","_","_","_","anuga","JJ","","_","_"
"1","vayaṃ","_","_","mat","PPR","","_","_"
"2","śeṣān","_","_","śeṣa","JJ","","_","_"
"3","_","_","_","han","V","han","_","_"
"4","_","_","_","tvat","PPR","","_","_"
"5","_","_","_","eva","CEM","","_","_"
"6","parirakṣitāḥ","_","_","parirakṣ","PPP","","_","_"
"1","ete","_","_","tad","PRD","","_","_"
"2","hi","_","_","hi","CX","","_","_"
"3","somakā","_","_","somaka","NC","","_","_"
"4","vipra","_","_","vipra","NC","","_","_"
"5","_","_","_","pāñcāla","NC","","_","_"
"6","_","_","_","ca","CCD","","_","_"
"7","yaśasvinaḥ","_","_","yaśasvin","JJ","","_","_"
"1","mama","_","_","mat","PPR","","_","_"
"2","sainyeṣu","_","_","sainya","NC","","_","_"
"3","saṃrabdhā","_","_","saṃrabh","PPP","","_","_"
"4","vicaranti","_","_","vicar","V","vicar","_","_"
"5","_","_","_","dava","NC","","_","_"
"6","_","_","_","agni","NC","","_","_"
"7","_","_","_","vat","CX","","_","_"
"1","tān","_","_","tad","PRD","","_","_"
"2","vāraya","_","_","vāray","V","vāray","_","_"
"3","_","_","_","mahat","JJ","","_","_"
"4","_","_","_","bāhu","NC","","_","_"
"5","_","_","_","kekaya","NC","","_","_"
"6","_","_","_","ca","CCD","","_","_"
"7","narottama","_","_","narottama","NC","","_","_"
"1","purā","_","_","purā","CX","","_","_"
"2","kurvanti","_","_","kar","V","kṛ","_","_"
"3","niḥśeṣaṃ","_","_","niḥśeṣa","JJ","","_","_"
"4","rakṣyamāṇāḥ","_","_","rakṣ","KDP","","_","_"
"5","kirīṭinā","_","_","kirīṭin","NC","","_","_"
"1","ādau","_","_","ādau","CX","","_","_"
"2","vā","_","_","vā","CCD","","_","_"
"3","yadi","_","_","yadi","CSB","","_","_"
"4","vā","_","_","vā","CCD","","_","_"
"5","paścāt","_","_","paścāt","CAD","","_","_"
"6","_","_","_","tvat","PPR","","_","_"
"_","","","","","","","",""
"7","_","_","_","ida","PRD","","_","_"
"_","","","","","","","",""
"8","karma","_","_","karman","NC","","_","_"
"_","","","","","","","",""
"9","māriṣa","_","_","māriṣa","NC","","_","_"
"_","","","","","","","",""
"1","tvam","_","_","tvat","PPR","","_","_"
"2","utpanno","_","_","utpad","PPP","","_","_"
"3","_","_","_","mahat","JJ","","_","_"
"4","_","_","_","bāhu","NC","","_","_"
"5","pāñcālānāṃ","_","_","pāñcāla","NC","","_","_"
"6","vadhaṃ","_","_","vadha","NC","","_","_"
"7","prati","_","_","prati","CADP","","_","_"
"1","kariṣyasi","_","_","kar","V","kṛ","_","_"
"2","jagat","_","_","jagat","NC","","_","_"
"3","sarvam","_","_","sarva","JQ","","_","_"
"4","a","_","_","alpha_privativum","JJ","","_","_"
"4","apāñcālaṃ","_","_","pāñcāla","JJ","","_","_"
"5","_","_","_","kila","CX","","_","_"
"6","_","_","_","acyuta","NC","","_","_"
"1","evaṃ","_","_","eva","CX","","_","_"
"2","_","_","_","siddha","NC","","_","_"
"3","_","_","_","abravīta","V","brū","_","_"
"4","vāco","_","_","vāc","NC","","_","_"
"5","bhaviṣyati","_","_","bhav","V","bhū","_","_"
"6","ca","_","_","ca","CCD","","_","_"
"7","tat","_","_","tad","PRD","","_","_"
"8","tathā","_","_","tathā","CX","","_","_"
"1","na","_","_","na","CNG","","_","_"
"2","te","_","_","tvat","PPR","","_","_"
"3","_","_","_","astra","NC","","_","_"
"4","_","_","_","gocara","NC","","_","_"
"5","śaktāḥ","_","_","śak","PPP","","_","_"
"6","sthātuṃ","_","_","sthā","CGDI","","_","_"
"7","devāḥ","_","_","deva","NC","","_","_"
"8","_","_","_","sa_saha","CX","","_","_"
"9","_","_","_","vāsava","NC","","_","_"
"1","kimu","_","_","kimu","CX","","_","_"
"2","pārthāḥ","_","_","pārtha","NC","","_","_"
"3","_","_","_","sa_saha","CX","","_","_"
"4","_","_","_","pāñcāla","NC","","_","_"
"5","satyam","_","_","satya","JJ","","_","_"
"6","etad","_","_","tad","PRD","","_","_"
"7","vaco","_","_","vacas","NC","","_","_"
"8","mama","_","_","mat","PPR","","_","_"
