"WordID","word","NormSTEM","suffix","lemma","PoS","Root","NormSuffix","NormWord"
1,"yaśo","_","_","yaśas","NC","","_","_"
2,"havir","_","_","havis","NC","","_","_"
3,"vardhatām","_","_","vṛdh","V","vṛdh","_","_"
4,"_","_","_","indra","NC","","_","_"
5,"_","_","_","jū","PPP","","_","_"
6,"_","_","_","sahasra","NUM","","_","_"
7,"_","_","_","vīrya","NC","","_","_"
8,"_","_","_","su","CAD","","_","_"
9,"_","_","_","bhṛ","PPP","","_","_"
10,"sahaskṛtam","_","_","sahaskṛta","JJ","","_","_"
1,"prasarsrāṇam","_","_","prasarsṛ","KDP","","_","_"
2,"anu","_","_","anu","CADP","","_","_"
3,"dīrghāya","_","_","dīrgha","JJ","","_","_"
4,"cakṣase","_","_","cakṣas","NC","","_","_"
5,"haviṣmantaṃ","_","_","haviṣmat","JJ","","_","_"
6,"mā","_","_","mat","PPR","","_","_"
7,"vardhaya","_","_","vardhay","V","vardhay","_","_"
8,"jyeṣṭhatātaye","_","_","jyeṣṭhatāti","NC","","_","_"
1,"acchā","_","_","acchā","CADP","","_","_"
2,"na","_","_","mat","PPR","","_","_"
3,"indraṃ","_","_","indra","NC","","_","_"
4,"yaśasaṃ","_","_","yaśas","JJ","","_","_"
5,"yaśobhir","_","_","yaśas","NC","","_","_"
6,"yaśasvinaṃ","_","_","yaśasvin","JJ","","_","_"
7,"namasānā","_","_","namasāna","JJ","","_","_"
8,"vidhema","_","_","vidh","V","vidh","_","_"
1,"sa","_","_","tad","PRD","","_","_"
2,"no","_","_","mat","PPR","","_","_"
3,"rāsva","_","_","rā","V","rā","_","_"
4,"rāṣṭram","_","_","rāṣṭra","NC","","_","_"
5,"_","_","_","indra","NC","","_","_"
6,"_","_","_","jū","PPP","","_","_"
7,"tasya","_","_","tad","PRD","","_","_"
8,"te","_","_","tvat","PPR","","_","_"
9,"rātau","_","_","rāti","NC","","_","_"
10,"yaśasaḥ","_","_","yaśas","JJ","","_","_"
11,"syāma","_","_","as","V","as","_","_"
1,"yaśā","_","_","yaśas","JJ","","_","_"
2,"indro","_","_","indra","NC","","_","_"
3,"yaśā","_","_","yaśas","JJ","","_","_"
4,"agnir","_","_","agni","NC","","_","_"
5,"yaśāḥ","_","_","yaśas","JJ","","_","_"
6,"somo","_","_","soma","NC","","_","_"
7,"ajāyata","_","_","jan","V","jan","_","_"
1,"yaśā","_","_","yaśas","JJ","","_","_"
2,"viśvasya","_","_","viśva","JQ","","_","_"
3,"bhūtasya","_","_","bhūta","NC","","_","_"
4,"aham","_","_","mat","PPR","","_","_"
5,"asmi","_","_","as","V","as","_","_"
6,"yaśastamaḥ","_","_","yaśastama","JJ","","_","_"
