"WordID","word","NormSTEM","suffix","lemma","PoS","Root","NormSuffix","NormWord"
1,"_","_","_","hiraṇya","NC","","_","_"
2,"_","_","_","garbha","NC","","_","_"
3,"sam","_","_","sa","CADP","","_","_"
4,"_","_","_","vart","V","vṛt","_","_"
5,"_","_","_","agra","NC","","_","_"
6,"bhūtasya","_","_","bhūta","NC","","_","_"
7,"jātaḥ","_","_","jan","PPP","","_","_"
8,"patir","_","_","pati","NC","","_","_"
9,"eka","_","_","eka","PPX","","_","_"
10,"āsīt","_","_","as","V","as","_","_"
1,"sa","_","_","tad","PRD","","_","_"
2,"dādhāra","_","_","dhar","V","dhṛ","_","_"
3,"pṛthivīṃ","_","_","pṛthivī","NC","","_","_"
4,"dyām","_","_","div","NC","","_","_"
5,"_","_","_","uta","CCD","","_","_"
6,"_","_","_","ida","PRD","","_","_"
7,"kasmai","_","_","kiṃ","PRQ","","_","_"
8,"devāya","_","_","deva","NC","","_","_"
9,"haviṣā","_","_","havis","NC","","_","_"
10,"vidhema","_","_","vidh","V","vidh","_","_"
1,"ya","_","_","yad","PRL","","_","_"
2,"_","_","_","ātman","NC","","_","_"
3,"_","_","_","dā","JJ","","_","_"
4,"_","_","_","bala","NC","","_","_"
5,"_","_","_","dā","JJ","","_","_"
6,"yasya","_","_","yad","PRL","","_","_"
7,"viśva","_","_","viśva","JQ","","_","_"
8,"upāsate","_","_","ās","V","ās","_","_"
9,"praśiṣaṃ","_","_","praśis","NC","","_","_"
10,"yasya","_","_","yad","PRL","","_","_"
11,"devāḥ","_","_","deva","NC","","_","_"
1,"yasya","_","_","yad","PRL","","_","_"
2,"_","_","_","chāyā","NC","","_","_"
3,"_","_","_","amṛta","NC","","_","_"
4,"yasya","_","_","yad","PRL","","_","_"
5,"mṛtyuḥ","_","_","mṛtyu","NC","","_","_"
6,"kasmai","_","_","kiṃ","PRQ","","_","_"
7,"devāya","_","_","deva","NC","","_","_"
8,"haviṣā","_","_","havis","NC","","_","_"
9,"vidhema","_","_","vidh","V","vidh","_","_"
1,"yaḥ","_","_","yad","PRL","","_","_"
2,"prāṇato","_","_","prāṇ","KDP","","_","_"
3,"nimiṣato","_","_","nimiṣ","KDP","","_","_"
4,"_","_","_","mahitva","NC","","_","_"
5,"_","_","_","eka","PPX","","_","_"
6,"id","_","_","id","CEM","","_","_"
7,"rājā","_","_","rājan","NC","","_","_"
8,"jagato","_","_","jagat","NC","","_","_"
9,"babhūva","_","_","bhav","V","bhū","_","_"
1,"ya","_","_","yad","PRL","","_","_"
2,"īśe","_","_","īś","V","īś","_","_"
3,"asya","_","_","ida","PRD","","_","_"
4,"dvipadaś","_","_","dvipad","NC","","_","_"
5,"catuṣpadaḥ","_","_","catuṣpada","JJ","","_","_"
6,"kasmai","_","_","kiṃ","PRQ","","_","_"
7,"devāya","_","_","deva","NC","","_","_"
8,"haviṣā","_","_","havis","NC","","_","_"
9,"vidhema","_","_","vidh","V","vidh","_","_"
1,"_","_","_","yad","PRL","","_","_"
2,"_","_","_","ida","PRD","","_","_"
3,"himavanto","_","_","himavat","NC","","_","_"
4,"mahitvā","_","_","mahitva","NC","","_","_"
5,"yasya","_","_","yad","PRL","","_","_"
6,"samudraṃ","_","_","samudra","NC","","_","_"
7,"rasayā","_","_","rasā","NC","","_","_"
8,"_","_","_","saha","CX","","_","_"
9,"_","_","_","ah","V","ah","_","_"
1,"_","_","_","yad","PRL","","_","_"
2,"_","_","_","ida","PRD","","_","_"
3,"pradiśo","_","_","pradiś","NC","","_","_"
4,"yasya","_","_","yad","PRL","","_","_"
5,"bāhū","_","_","bāhu","NC","","_","_"
6,"kasmai","_","_","kiṃ","PRQ","","_","_"
7,"devāya","_","_","deva","NC","","_","_"
8,"haviṣā","_","_","havis","NC","","_","_"
9,"vidhema","_","_","vidh","V","vidh","_","_"
1,"yena","_","_","yad","PRL","","_","_"
2,"dyaur","_","_","div","NC","","_","_"
3,"ugrā","_","_","ugra","JJ","","_","_"
4,"pṛthivī","_","_","pṛthivī","NC","","_","_"
5,"ca","_","_","ca","CCD","","_","_"
6,"dṛḍhā","_","_","dṛh","PPP","","_","_"
7,"yena","_","_","yad","PRL","","_","_"
8,"sva","_","_","svar","NC","","_","_"
9,"stabhitaṃ","_","_","stambh","PPP","","_","_"
10,"yena","_","_","yad","PRL","","_","_"
11,"nākaḥ","_","_","nāka","NC","","_","_"
1,"yo","_","_","yad","PRL","","_","_"
2,"antarikṣe","_","_","antarikṣa","NC","","_","_"
3,"rajaso","_","_","rajas","NC","","_","_"
4,"vimānaḥ","_","_","vimāna","JJ","","_","_"
5,"kasmai","_","_","kiṃ","PRQ","","_","_"
6,"devāya","_","_","deva","NC","","_","_"
7,"haviṣā","_","_","havis","NC","","_","_"
8,"vidhema","_","_","vidh","V","vidh","_","_"
1,"yaṃ","_","_","yad","PRL","","_","_"
2,"krandasī","_","_","krandas","NC","","_","_"
3,"avasā","_","_","avas","NC","","_","_"
4,"tastabhāne","_","_","stambh","KDP","","_","_"
5,"abhy","_","_","abhi","CADP","","_","_"
6,"aikṣetām","_","_","īkṣ","V","īkṣ","_","_"
7,"manasā","_","_","manas","NC","","_","_"
8,"rejamāne","_","_","rej","KDP","","_","_"
1,"_","_","_","yatra","CX","","_","_"
2,"_","_","_","adhi","CADP","","_","_"
3,"sūra","_","_","sūra","NC","","_","_"
4,"udito","_","_","udi","PPP","","_","_"
5,"vibhāti","_","_","vibhā","V","vibhā","_","_"
6,"kasmai","_","_","kiṃ","PRQ","","_","_"
7,"devāya","_","_","deva","NC","","_","_"
8,"haviṣā","_","_","havis","NC","","_","_"
9,"vidhema","_","_","vidh","V","vidh","_","_"
1,"āpo","_","_","ap","NC","","_","_"
2,"ha","_","_","ha","CEM","","_","_"
3,"yad","_","_","yat","CSB","","_","_"
4,"bṛhatīr","_","_","bṛhat","JJ","","_","_"
5,"viśvam","_","_","viśva","JQ","","_","_"
6,"āyan","_","_","e","V","i","_","_"
7,"garbhaṃ","_","_","garbha","NC","","_","_"
8,"dadhānā","_","_","dhā","KDP","","_","_"
9,"janayantīr","_","_","janay","KDP","","_","_"
10,"agnim","_","_","agni","NC","","_","_"
1,"tato","_","_","tatas","CX","","_","_"
2,"devānāṃ","_","_","deva","NC","","_","_"
3,"sam","_","_","sa","CADP","","_","_"
4,"_","_","_","vart","V","vṛt","_","_"
5,"_","_","_","asu","NC","","_","_"
6,"ekaḥ","_","_","eka","PPX","","_","_"
7,"kasmai","_","_","kiṃ","PRQ","","_","_"
8,"devāya","_","_","deva","NC","","_","_"
9,"haviṣā","_","_","havis","NC","","_","_"
10,"vidhema","_","_","vidh","V","vidh","_","_"
1,"yaś","_","_","yad","PRL","","_","_"
2,"cid","_","_","cit","CEM","","_","_"
3,"āpo","_","_","ap","NC","","_","_"
4,"mahinā","_","_","mahi","NC","","_","_"
5,"paryapaśyad","_","_","paripaś","V","paripaś","_","_"
6,"dakṣaṃ","_","_","dakṣa","NC","","_","_"
7,"dadhānā","_","_","dhā","KDP","","_","_"
8,"janayantīr","_","_","janay","KDP","","_","_"
9,"yajñam","_","_","yajña","NC","","_","_"
1,"yo","_","_","yad","PRL","","_","_"
2,"deveṣv","_","_","deva","NC","","_","_"
3,"adhi","_","_","adhi","CADP","","_","_"
4,"deva","_","_","deva","NC","","_","_"
5,"eka","_","_","eka","PPX","","_","_"
6,"āsīt","_","_","as","V","as","_","_"
7,"kasmai","_","_","kiṃ","PRQ","","_","_"
8,"devāya","_","_","deva","NC","","_","_"
9,"haviṣā","_","_","havis","NC","","_","_"
10,"vidhema","_","_","vidh","V","vidh","_","_"
1,"mā","_","_","mā","CNG","","_","_"
2,"no","_","_","mat","PPR","","_","_"
3,"hiṃsīj","_","_","hiṃs","V","hiṃs","_","_"
4,"janitā","_","_","janitṛ","NC","","_","_"
5,"yaḥ","_","_","yad","PRL","","_","_"
6,"pṛthivyā","_","_","pṛthivī","NC","","_","_"
7,"yo","_","_","yad","PRL","","_","_"
8,"vā","_","_","vā","CCD","","_","_"
9,"divaṃ","_","_","div","NC","","_","_"
10,"_","_","_","satya","JJ","","_","_"
11,"_","_","_","dharman","NC","","_","_"
12,"jajāna","_","_","jan","V","jan","_","_"
1,"yaś","_","_","yad","PRL","","_","_"
2,"_","_","_","ca","CCD","","_","_"
3,"_","_","_","ap","NC","","_","_"
4,"candrā","_","_","candra","JJ","","_","_"
5,"bṛhatīr","_","_","bṛhat","JJ","","_","_"
6,"jajāna","_","_","jan","V","jan","_","_"
7,"kasmai","_","_","kiṃ","PRQ","","_","_"
8,"devāya","_","_","deva","NC","","_","_"
9,"haviṣā","_","_","havis","NC","","_","_"
10,"vidhema","_","_","vidh","V","vidh","_","_"
1,"prajāpate","_","_","prajāpati","NC","","_","_"
2,"na","_","_","na","CNG","","_","_"
3,"tvad","_","_","tvat","PPR","","_","_"
4,"etāny","_","_","tad","PRD","","_","_"
5,"anyo","_","_","anya","PPX","","_","_"
6,"viśvā","_","_","viśva","JQ","","_","_"
7,"jātāni","_","_","jan","PPP","","_","_"
8,"pari","_","_","pari","CADP","","_","_"
9,"tā","_","_","tad","PRD","","_","_"
10,"babhūva","_","_","bhav","V","bhū","_","_"
1,"_","_","_","yad","PRL","","_","_"
2,"_","_","_","kāma","NC","","_","_"
3,"te","_","_","tvat","PPR","","_","_"
4,"juhumas","_","_","hu","V","hu","_","_"
5,"tan","_","_","tad","PRD","","_","_"
6,"no","_","_","mat","PPR","","_","_"
7,"astu","_","_","as","V","as","_","_"
8,"vayaṃ","_","_","mat","PPR","","_","_"
9,"syāma","_","_","as","V","as","_","_"
10,"patayo","_","_","pati","NC","","_","_"
11,"rayīṇām","_","_","rayi","NC","","_","_"
