"WordID","word","NormSTEM","suffix","lemma","PoS","Root","NormSuffix","NormWord"
1,"bhīṣma","_","_","bhīṣma","NC","","_","_"
2,"uvāca","_","_","vak","V","vac","_","_"
1,"_","_","_","ātman","NC","","_","_"
2,"_","_","_","tu","CCD","","_","_"
3,"tataḥ","_","_","tatas","CX","","_","_"
4,"sūto","_","_","sūta","NC","","_","_"
5,"hayānāṃ","_","_","haya","NC","","_","_"
6,"ca","_","_","ca","CCD","","_","_"
7,"viśāṃ","_","_","viś","NC","","_","_"
8,"pate","_","_","pati","NC","","_","_"
1,"mama","_","_","mat","PPR","","_","_"
2,"_","_","_","ca","CCD","","_","_"
3,"_","_","_","apanay","V","apanī","_","_"
4,"śalyān","_","_","śalya","NC","","_","_"
5,"_","_","_","kuśala","JJ","","_","_"
6,"_","_","_","samman","PPP","","_","_"
1,"_","_","_","snā","PPP","","_","_"
2,"_","_","_","upavṛt","PPP","","_","_"
3,"_","_","_","turaga","NC","","_","_"
4,"_","_","_","labh","PPP","","_","_"
5,"_","_","_","toya","NC","","_","_"
6,"avihvalaiḥ","_","_","avihvala","JJ","","_","_"
1,"prabhāta","_","_","prabhāta","NC","","_","_"
2,"udite","_","_","udi","PPP","","_","_"
3,"sūrye","_","_","sūrya","NC","","_","_"
4,"tato","_","_","tatas","CX","","_","_"
5,"yuddham","_","_","yuddha","NC","","_","_"
6,"avartata","_","_","vart","V","vṛt","_","_"
1,"dṛṣṭvā","_","_","dṛś","CGDA","","_","_"
2,"māṃ","_","_","mat","PPR","","_","_"
3,"tūrṇam","_","_","tūrṇa","CX","","_","_"
4,"āyāntaṃ","_","_","āyā","KDP","","_","_"
5,"daṃśitaṃ","_","_","daṃśay","PPP","","_","_"
6,"syandane","_","_","syandana","NC","","_","_"
7,"sthitam","_","_","sthā","PPP","","_","_"
1,"akarod","_","_","kar","V","kṛ","_","_"
2,"ratham","_","_","ratha","NC","","_","_"
3,"atyarthaṃ","_","_","atyartha","CX","","_","_"
4,"rāmaḥ","_","_","rāma","NC","","_","_"
5,"sajjaṃ","_","_","sajja","JJ","","_","_"
6,"pratāpavān","_","_","pratāpavat","JJ","","_","_"
1,"tato","_","_","tatas","CX","","_","_"
2,"'haṃ","_","_","mat","PPR","","_","_"
3,"rāmam","_","_","rāma","NC","","_","_"
4,"āyāntaṃ","_","_","āyā","KDP","","_","_"
5,"dṛṣṭvā","_","_","dṛś","CGDA","","_","_"
6,"_","_","_","samara","NC","","_","_"
7,"_","_","_","kāṅkṣin","JJ","","_","_"
1,"_","_","_","dhanus","NC","","_","_"
2,"_","_","_","śreṣṭha","JJ","","_","_"
3,"samutsṛjya","_","_","samutsṛj","CGDA","","_","_"
4,"_","_","_","sahasā","CX","","_","_"
5,"_","_","_","avatar","V","avatṛ","_","_"
6,"rathāt","_","_","ratha","NC","","_","_"
1,"abhivādya","_","_","abhivāday","CGDA","","_","_"
2,"_","_","_","tathā","CX","","_","_"
3,"_","_","_","eva","CEM","","_","_"
4,"_","_","_","mat","PPR","","_","_"
5,"ratham","_","_","ratha","NC","","_","_"
6,"āruhya","_","_","āruh","CGDA","","_","_"
7,"bhārata","_","_","bhārata","NC","","_","_"
1,"yuyutsur","_","_","yuyutsu","JJ","","_","_"
2,"jāmadagnyasya","_","_","jāmadagnya","NC","","_","_"
3,"pramukhe","_","_","pramukha","NC","","_","_"
4,"_","_","_","vī","PPP","","_","_"
5,"_","_","_","bhī","NC","","_","_"
6,"sthitaḥ","_","_","sthā","PPP","","_","_"
1,"tato","_","_","tatas","CX","","_","_"
2,"māṃ","_","_","mat","PPR","","_","_"
3,"_","_","_","śara","NC","","_","_"
4,"_","_","_","varṣa","NC","","_","_"
5,"mahatā","_","_","mahat","JJ","","_","_"
6,"samavākirat","_","_","samavakṛ","V","samavakṛ","_","_"
1,"ahaṃ","_","_","mat","PPR","","_","_"
2,"ca","_","_","ca","CCD","","_","_"
3,"_","_","_","śara","NC","","_","_"
4,"_","_","_","varṣa","NC","","_","_"
5,"varṣantaṃ","_","_","vṛṣ","KDP","","_","_"
6,"samavākiram","_","_","samavakṛ","V","samavakṛ","_","_"
1,"saṃkruddho","_","_","saṃkrudh","PPP","","_","_"
2,"_","_","_","jāmadagnya","NC","","_","_"
3,"_","_","_","tu","CCD","","_","_"
4,"punar","_","_","punar","CAD","","_","_"
5,"eva","_","_","eva","CEM","","_","_"
6,"patatriṇaḥ","_","_","patatrin","NC","","_","_"
1,"preṣayāmāsa","_","_","preṣay","V","preṣay","_","_"
2,"me","_","_","mat","PPR","","_","_"
3,"rājan","_","_","rājan","NC","","_","_"
4,"_","_","_","dīp","PPP","","_","_"
5,"_","_","_","āsya","NC","","_","_"
6,"uragān","_","_","uraga","NC","","_","_"
7,"iva","_","_","iva","CCM","","_","_"
1,"tān","_","_","tad","PRD","","_","_"
2,"ahaṃ","_","_","mat","PPR","","_","_"
3,"niśitair","_","_","niśā","PPP","","_","_"
4,"bhallaiḥ","_","_","bhalla","NC","","_","_"
5,"śataśo","_","_","śataśas","CX","","_","_"
6,"'tha","_","_","atha","CAD","","_","_"
7,"sahasraśaḥ","_","_","sahasraśas","CX","","_","_"
1,"achidaṃ","_","_","chid","V","chid","_","_"
2,"sahasā","_","_","sahasā","CX","","_","_"
3,"rājann","_","_","rājan","NC","","_","_"
4,"antarikṣe","_","_","antarikṣa","NC","","_","_"
5,"punaḥ","_","_","punar","CAD","","_","_"
6,"punaḥ","_","_","punar","CAD","","_","_"
1,"_","_","_","tatas","CX","","_","_"
2,"_","_","_","tu","CCD","","_","_"
3,"_","_","_","astra","NC","","_","_"
4,"divyāni","_","_","divya","JJ","","_","_"
5,"jāmadagnyaḥ","_","_","jāmadagnya","NC","","_","_"
6,"pratāpavān","_","_","pratāpavat","JJ","","_","_"
1,"mayi","_","_","mat","PPR","","_","_"
2,"pracodayāmāsa","_","_","pracoday","V","pracoday","_","_"
3,"_","_","_","tad","PRD","","_","_"
4,"_","_","_","mat","PPR","","_","_"
5,"pratyaṣedhayam","_","_","pratiṣedhay","V","pratiṣedhay","_","_"
1,"astrair","_","_","astra","NC","","_","_"
2,"eva","_","_","eva","CEM","","_","_"
3,"_","_","_","mahat","JJ","","_","_"
4,"_","_","_","bāhu","NC","","_","_"
5,"cikīrṣann","_","_","cikīrṣ","KDP","","_","_"
6,"adhikāṃ","_","_","adhika","JJ","","_","_"
7,"kriyām","_","_","kriyā","NC","","_","_"
1,"tato","_","_","tatas","CX","","_","_"
2,"divi","_","_","div","NC","","_","_"
3,"_","_","_","mahat","JJ","","_","_"
4,"_","_","_","nāda","NC","","_","_"
5,"prādurāsīt","_","_","prāduras","V","prāduras","_","_"
6,"samantataḥ","_","_","samantataḥ","CX","","_","_"
1,"tato","_","_","tatas","CX","","_","_"
2,"'ham","_","_","mat","PPR","","_","_"
3,"astraṃ","_","_","astra","NC","","_","_"
4,"vāyavyaṃ","_","_","vāyavya","JJ","","_","_"
5,"jāmadagnye","_","_","jāmadagnya","NC","","_","_"
6,"prayuktavān","_","_","prayuj","KDP","","_","_"
1,"pratyājaghne","_","_","pratyāhan","V","pratyāhan","_","_"
2,"ca","_","_","ca","CCD","","_","_"
3,"tad","_","_","tad","PRD","","_","_"
4,"rāmo","_","_","rāma","NC","","_","_"
5,"_","_","_","guhyaka","NC","","_","_"
6,"_","_","_","astra","NC","","_","_"
7,"bhārata","_","_","bhārata","NC","","_","_"
1,"tato","_","_","tatas","CX","","_","_"
2,"'stram","_","_","astra","NC","","_","_"
3,"aham","_","_","mat","PPR","","_","_"
4,"āgneyam","_","_","āgneya","JJ","","_","_"
5,"anumantrya","_","_","anumantray","CGDA","","_","_"
6,"prayuktavān","_","_","prayuj","KDP","","_","_"
1,"_","_","_","vāruṇa","JJ","","_","_"
2,"_","_","_","eva","CEM","","_","_"
3,"_","_","_","rāma","NC","","_","_"
4,"_","_","_","tad","PRD","","_","_"
5,"vārayāmāsa","_","_","vāray","V","vāray","_","_"
6,"me","_","_","mat","PPR","","_","_"
7,"vibhuḥ","_","_","vibhu","JJ","","_","_"
1,"evam","_","_","eva","CX","","_","_"
2,"astrāṇi","_","_","astra","NC","","_","_"
3,"divyāni","_","_","divya","JJ","","_","_"
4,"_","_","_","rāma","NC","","_","_"
5,"_","_","_","mat","PPR","","_","_"
6,"avārayam","_","_","vāray","V","vāray","_","_"
1,"_","_","_","rāma","NC","","_","_"
2,"_","_","_","ca","CCD","","_","_"
3,"mama","_","_","mat","PPR","","_","_"
4,"tejasvī","_","_","tejasvin","JJ","","_","_"
5,"_","_","_","divya","JJ","","_","_"
6,"_","_","_","astra","NC","","_","_"
7,"_","_","_","vid","JJ","","_","_"
8,"ariṃdamaḥ","_","_","ariṃdama","JJ","","_","_"
1,"tato","_","_","tatas","CX","","_","_"
2,"māṃ","_","_","mat","PPR","","_","_"
3,"savyato","_","_","savyatas","CX","","_","_"
4,"rājan","_","_","rājan","NC","","_","_"
5,"rāmaḥ","_","_","rāma","NC","","_","_"
6,"kurvan","_","_","kṛ","KDP","","_","_"
7,"dvijottamaḥ","_","_","dvijottama","NC","","_","_"
1,"_","_","_","uras","NC","","_","_"
2,"_","_","_","vyadh","V","vyadh","_","_"
3,"saṃkruddho","_","_","saṃkrudh","PPP","","_","_"
4,"jāmadagnyo","_","_","jāmadagnya","NC","","_","_"
5,"_","_","_","mahat","JJ","","_","_"
6,"_","_","_","bala","NC","","_","_"
1,"tato","_","_","tatas","CX","","_","_"
2,"'haṃ","_","_","mat","PPR","","_","_"
3,"_","_","_","bharata","NC","","_","_"
4,"_","_","_","śreṣṭha","JJ","","_","_"
5,"saṃnyaṣīdaṃ","_","_","saṃniṣad","V","saṃniṣad","_","_"
6,"_","_","_","ratha","NC","","_","_"
7,"_","_","_","uttama","JJ","","_","_"
1,"atha","_","_","atha","CAD","","_","_"
2,"māṃ","_","_","mat","PPR","","_","_"
3,"_","_","_","kaśmala","NC","","_","_"
4,"_","_","_","āviś","PPP","","_","_"
5,"_","_","_","sūta","NC","","_","_"
6,"_","_","_","tūrṇa","CX","","_","_"
7,"apāvahat","_","_","apavah","V","apavah","_","_"
1,"_","_","_","go","CX","","_","_"
2,"_","_","_","ru","PPP","","_","_"
3,"_","_","_","bharata","NC","","_","_"
4,"_","_","_","śreṣṭha","JJ","","_","_"
5,"_","_","_","rāma","NC","","_","_"
6,"_","_","_","bāṇa","NC","","_","_"
7,"_","_","_","prapīḍay","PPP","","_","_"
1,"tato","_","_","tatas","CX","","_","_"
2,"mām","_","_","mat","PPR","","_","_"
3,"apayātaṃ","_","_","apayā","PPP","","_","_"
4,"vai","_","_","vai","CX","","_","_"
5,"bhṛśaṃ","_","_","bhṛśa","CX","","_","_"
6,"viddham","_","_","vyadh","PPP","","_","_"
7,"acetasam","_","_","acetas","JJ","","_","_"
1,"_","_","_","rāma","NC","","_","_"
2,"_","_","_","anucara","JJ","","_","_"
3,"hṛṣṭāḥ","_","_","hṛṣ","PPP","","_","_"
4,"sarve","_","_","sarva","JQ","","_","_"
5,"dṛṣṭvā","_","_","dṛś","CGDA","","_","_"
6,"pracukruśuḥ","_","_","prakroś","V","prakruś","_","_"
1,"_","_","_","akṛtavraṇa","NC","","_","_"
2,"_","_","_","prabhṛti","NC","","_","_"
3,"_","_","_","kāśi","NC","","_","_"
4,"_","_","_","kanyā","NC","","_","_"
5,"ca","_","_","ca","CCD","","_","_"
6,"bhārata","_","_","bhārata","NC","","_","_"
1,"_","_","_","tatas","CX","","_","_"
2,"_","_","_","tu","CCD","","_","_"
3,"_","_","_","labh","PPP","","_","_"
4,"_","_","_","saṃjñā","NC","","_","_"
5,"'haṃ","_","_","mat","PPR","","_","_"
6,"jñātvā","_","_","jñā","CGDA","","_","_"
7,"sūtam","_","_","sūta","NC","","_","_"
8,"_","_","_","atha","CAD","","_","_"
9,"_","_","_","abravīta","V","brū","_","_"
1,"yāhi","_","_","yā","V","yā","_","_"
2,"sūta","_","_","sūta","NC","","_","_"
3,"yato","_","_","yatas","CX","","_","_"
4,"rāmaḥ","_","_","rāma","NC","","_","_"
5,"sajjo","_","_","sajja","JJ","","_","_"
6,"'haṃ","_","_","mat","PPR","","_","_"
7,"_","_","_","ga","PPP","","_","_"
8,"_","_","_","vedanā","NC","","_","_"
1,"tato","_","_","tatas","CX","","_","_"
2,"mām","_","_","mat","PPR","","_","_"
3,"avahat","_","_","vah","V","vah","_","_"
4,"sūto","_","_","sūta","NC","","_","_"
5,"hayaiḥ","_","_","haya","NC","","_","_"
6,"_","_","_","parama","JJ","","_","_"
7,"_","_","_","śobhay","PPP","","_","_"
1,"nṛtyadbhir","_","_","nṛt","KDP","","_","_"
2,"iva","_","_","iva","CCM","","_","_"
3,"kauravya","_","_","kauravya","NC","","_","_"
4,"_","_","_","māruta","NC","","_","_"
5,"_","_","_","pratima","JJ","","_","_"
6,"gatau","_","_","gati","NC","","_","_"
1,"tato","_","_","tatas","CX","","_","_"
2,"'haṃ","_","_","mat","PPR","","_","_"
3,"rāmam","_","_","rāma","NC","","_","_"
4,"āsādya","_","_","āsāday","CGDA","","_","_"
5,"_","_","_","bāṇa","NC","","_","_"
6,"_","_","_","jāla","NC","","_","_"
7,"kaurava","_","_","kaurava","NC","","_","_"
1,"avākiraṃ","_","_","avakṛ","V","avakṛ","_","_"
2,"_","_","_","su","CAD","","_","_"
3,"_","_","_","saṃrabh","PPP","","_","_"
4,"saṃrabdhaṃ","_","_","saṃrabh","PPP","","_","_"
5,"vijigīṣayā","_","_","vijigīṣā","NC","","_","_"
1,"tān","_","_","tad","PRD","","_","_"
2,"āpatata","_","_","āpat","KDP","","_","_"
3,"_","_","_","eva","CEM","","_","_"
4,"_","_","_","adas","PRD","","_","_"
5,"rāmo","_","_","rāma","NC","","_","_"
6,"bāṇān","_","_","bāṇa","NC","","_","_"
7,"ajihmagān","_","_","ajihmaga","NC","","_","_"
1,"bāṇair","_","_","bāṇa","NC","","_","_"
2,"_","_","_","eva","CEM","","_","_"
3,"_","_","_","chid","V","chid","_","_"
4,"tūrṇam","_","_","tūrṇa","CX","","_","_"
5,"ekaikaṃ","_","_","ekaika","PRC","","_","_"
6,"tribhir","_","_","tri","NUM","","_","_"
7,"āhave","_","_","āhava","NC","","_","_"
1,"_","_","_","tatas","CX","","_","_"
2,"_","_","_","tad","PRD","","_","_"
3,"mṛditāḥ","_","_","mṛd","PPP","","_","_"
4,"sarve","_","_","sarva","JQ","","_","_"
5,"mama","_","_","mat","PPR","","_","_"
6,"bāṇāḥ","_","_","bāṇa","NC","","_","_"
7,"_","_","_","su","CAD","","_","_"
8,"_","_","_","saṃśā","PPP","","_","_"
1,"_","_","_","rāma","NC","","_","_"
2,"_","_","_","bāṇa","NC","","_","_"
3,"dvidhā","_","_","dvidhā","CX","","_","_"
4,"chinnāḥ","_","_","chid","PPP","","_","_"
5,"śataśo","_","_","śataśas","CX","","_","_"
6,"'tha","_","_","atha","CAD","","_","_"
7,"_","_","_","mahat","JJ","","_","_"
8,"_","_","_","āhava","NC","","_","_"
1,"tataḥ","_","_","tatas","CX","","_","_"
2,"punaḥ","_","_","punar","CAD","","_","_"
3,"śaraṃ","_","_","śara","NC","","_","_"
4,"dīptaṃ","_","_","dīp","PPP","","_","_"
5,"_","_","_","su","CAD","","_","_"
6,"_","_","_","prabhā","NC","","_","_"
7,"_","_","_","kāla","NC","","_","_"
8,"_","_","_","saṃmā","PPP","","_","_"
1,"asṛjaṃ","_","_","sṛj","V","sṛj","_","_"
2,"jāmadagnyāya","_","_","jāmadagnya","NC","","_","_"
3,"_","_","_","rāma","NC","","_","_"
4,"_","_","_","mat","PPR","","_","_"
5,"jighāṃsayā","_","_","jighāṃsā","NC","","_","_"
1,"tena","_","_","tad","PRD","","_","_"
2,"_","_","_","tu","CCD","","_","_"
3,"_","_","_","abhihan","PPP","","_","_"
4,"gāḍhaṃ","_","_","gāḍha","CX","","_","_"
5,"_","_","_","bāṇa","NC","","_","_"
6,"_","_","_","cheda","NC","","_","_"
7,"_","_","_","vaśa","NC","","_","_"
8,"gataḥ","_","_","ga","PPP","","_","_"
1,"mumoha","_","_","muh","V","muh","_","_"
2,"sahasā","_","_","sahas","NC","","_","_"
3,"rāmo","_","_","rāma","NC","","_","_"
4,"bhūmau","_","_","bhūmi","NC","","_","_"
5,"ca","_","_","ca","CCD","","_","_"
6,"nipapāta","_","_","nipat","V","nipat","_","_"
7,"ha","_","_","ha","CEM","","_","_"
1,"tato","_","_","tatas","CX","","_","_"
2,"hāhākṛtaṃ","_","_","hāhākṛta","JJ","","_","_"
3,"sarvaṃ","_","_","sarva","JQ","","_","_"
4,"rāme","_","_","rāma","NC","","_","_"
5,"_","_","_","bhū","NC","","_","_"
6,"_","_","_","tala","NC","","_","_"
7,"āśrite","_","_","āśri","PPP","","_","_"
1,"jagad","_","_","jagat","NC","","_","_"
2,"bhārata","_","_","bhārata","NC","","_","_"
3,"saṃvignaṃ","_","_","saṃvij","PPP","","_","_"
4,"_","_","_","yathā","CCM","","_","_"
5,"_","_","_","arka","NC","","_","_"
6,"_","_","_","patana","NC","","_","_"
7,"'bhavat","_","_","bhav","V","bhū","_","_"
1,"tata","_","_","tatas","CX","","_","_"
2,"enaṃ","_","_","a","PRD","","_","_"
3,"_","_","_","su","CAD","","_","_"
4,"_","_","_","saṃvij","PPP","","_","_"
5,"sarva","_","_","sarva","JQ","","_","_"
6,"_","_","_","eva","CEM","","_","_"
7,"_","_","_","abhidru","V","abhidru","_","_"
1,"_","_","_","tapodhana","JJ","","_","_"
2,"_","_","_","tad","PRD","","_","_"
3,"sahasā","_","_","sahas","NC","","_","_"
4,"kāśyā","_","_","kāśyā","NC","","_","_"
5,"ca","_","_","ca","CCD","","_","_"
6,"bhṛgunandanam","_","_","bhṛgunandana","NC","","_","_"
1,"ta","_","_","tad","PRD","","_","_"
2,"enaṃ","_","_","a","PRD","","_","_"
3,"sampariṣvajya","_","_","sampariṣvaj","CGDA","","_","_"
4,"śanair","_","_","śanais","CX","","_","_"
5,"_","_","_","āśvāsay","V","āśvāsay","_","_"
6,"_","_","_","tadā","CAD","","_","_"
1,"pāṇibhir","_","_","pāṇi","NC","","_","_"
2,"_","_","_","jala","NC","","_","_"
3,"_","_","_","śīta","JJ","","_","_"
4,"_","_","_","ca","CCD","","_","_"
5,"_","_","_","jaya","NC","","_","_"
6,"_","_","_","āśis","NC","","_","_"
7,"_","_","_","ca","CCD","","_","_"
8,"kaurava","_","_","kaurava","NC","","_","_"
1,"tataḥ","_","_","tatas","CX","","_","_"
2,"sa","_","_","tad","PRD","","_","_"
3,"vihvalo","_","_","vihvala","JJ","","_","_"
4,"vākyaṃ","_","_","vākya","NC","","_","_"
5,"rāma","_","_","rāma","NC","","_","_"
6,"utthāya","_","_","utthā","CGDA","","_","_"
7,"_","_","_","mat","PPR","","_","_"
8,"_","_","_","abravīta","V","brū","_","_"
1,"tiṣṭha","_","_","tiṣṭh","V","sthā","_","_"
2,"bhīṣma","_","_","bhīṣma","NC","","_","_"
3,"hato","_","_","han","PPP","","_","_"
4,"_","_","_","as","V","as","_","_"
5,"_","_","_","iti","CQT","","_","_"
6,"bāṇaṃ","_","_","bāṇa","NC","","_","_"
7,"saṃdhāya","_","_","saṃdhā","CGDA","","_","_"
8,"kārmuke","_","_","kārmuka","NC","","_","_"
1,"sa","_","_","tad","PRD","","_","_"
2,"mukto","_","_","muc","PPP","","_","_"
3,"nyapatat","_","_","nipat","V","nipat","_","_"
4,"tūrṇaṃ","_","_","tūrṇa","CX","","_","_"
5,"pārśve","_","_","pārśva","NC","","_","_"
6,"savye","_","_","savya","JJ","","_","_"
7,"_","_","_","mahat","JJ","","_","_"
8,"_","_","_","āhava","NC","","_","_"
1,"_","_","_","yad","PRL","","_","_"
2,"_","_","_","mat","PPR","","_","_"
3,"_","_","_","bhṛśa","JJ","","_","_"
4,"_","_","_","saṃvij","PPP","","_","_"
5,"vyāghūrṇita","_","_","vyāghūrṇ","PPP","","_","_"
6,"iva","_","_","iva","CCM","","_","_"
7,"drumaḥ","_","_","druma","NC","","_","_"
1,"hatvā","_","_","han","CGDA","","_","_"
2,"_","_","_","haya","NC","","_","_"
3,"_","_","_","tatas","CX","","_","_"
4,"rājañ","_","_","rājan","NC","","_","_"
5,"_","_","_","śīghra","JJ","","_","_"
6,"_","_","_","astra","NC","","_","_"
7,"_","_","_","mahat","JJ","","_","_"
8,"_","_","_","āhava","NC","","_","_"
1,"_","_","_","avakṛ","V","avakṛ","_","_"
2,"_","_","_","mat","PPR","","_","_"
3,"viśrabdho","_","_","viśrambh","PPP","","_","_"
4,"_","_","_","bāṇa","NC","","_","_"
5,"_","_","_","tad","PRD","","_","_"
6,"lomavāhibhiḥ","_","_","lomavāhin","JJ","","_","_"
1,"tato","_","_","tatas","CX","","_","_"
2,"'ham","_","_","mat","PPR","","_","_"
3,"api","_","_","api","CX","","_","_"
4,"_","_","_","śīghra","JJ","","_","_"
5,"_","_","_","astra","NC","","_","_"
6,"samare","_","_","samara","NC","","_","_"
7,"a","_","_","alpha_privativum","JJ","","_","_"
7,"'prativāraṇam","_","_","prativāraṇa","JJ","","_","_"
1,"avāsṛjaṃ","_","_","avasṛj","V","avasṛj","_","_"
2,"_","_","_","mahat","JJ","","_","_"
3,"_","_","_","bāhu","NC","","_","_"
4,"te","_","_","tad","PRD","","_","_"
5,"_","_","_","antara","NC","","_","_"
6,"_","_","_","adhiṣṭhā","PPP","","_","_"
7,"śarāḥ","_","_","śara","NC","","_","_"
1,"rāmasya","_","_","rāma","NC","","_","_"
2,"mama","_","_","mat","PPR","","_","_"
3,"_","_","_","ca","CCD","","_","_"
4,"_","_","_","eva","CEM","","_","_"
5,"_","_","_","āśu","CX","","_","_"
6,"_","_","_","vyoman","NC","","_","_"
7,"_","_","_","āvṛ","CGDA","","_","_"
8,"samantataḥ","_","_","samantataḥ","CX","","_","_"
1,"na","_","_","na","CNG","","_","_"
2,"sma","_","_","sma","CX","","_","_"
3,"sūryaḥ","_","_","sūrya","NC","","_","_"
4,"pratapati","_","_","pratap","V","pratap","_","_"
5,"_","_","_","śara","NC","","_","_"
6,"_","_","_","jāla","NC","","_","_"
7,"_","_","_","samāvṛ","PPP","","_","_"
1,"_","_","_","mātariśvan","NC","","_","_"
2,"_","_","_","antara","NC","","_","_"
3,"_","_","_","tad","PRD","","_","_"
4,"_","_","_","megha","NC","","_","_"
5,"_","_","_","rudh","PPP","","_","_"
6,"_","_","_","iva","CCM","","_","_"
7,"_","_","_","nad","V","nad","_","_"
1,"tato","_","_","tatas","CX","","_","_"
2,"vāyoḥ","_","_","vāyu","NC","","_","_"
3,"_","_","_","prakampa","NC","","_","_"
4,"_","_","_","ca","CCD","","_","_"
5,"sūryasya","_","_","sūrya","NC","","_","_"
6,"ca","_","_","ca","CCD","","_","_"
7,"marīcibhiḥ","_","_","marīci","NC","","_","_"
1,"abhitāpāt","_","_","abhitāpa","NC","","_","_"
2,"_","_","_","svabhāva","NC","","_","_"
3,"_","_","_","ca","CCD","","_","_"
4,"pāvakaḥ","_","_","pāvaka","NC","","_","_"
5,"samajāyata","_","_","saṃjan","V","saṃjan","_","_"
1,"te","_","_","tad","PRD","","_","_"
2,"śarāḥ","_","_","śara","NC","","_","_"
3,"_","_","_","sva","JJ","","_","_"
4,"_","_","_","samuttha","JJ","","_","_"
5,"_","_","_","pradīp","PPP","","_","_"
6,"_","_","_","citrabhānu","NC","","_","_"
1,"bhūmau","_","_","bhūmi","NC","","_","_"
2,"sarve","_","_","sarva","JQ","","_","_"
3,"tadā","_","_","tadā","CAD","","_","_"
4,"rājan","_","_","rājan","NC","","_","_"
5,"_","_","_","bhasman","NC","","_","_"
6,"_","_","_","bhū","PPP","","_","_"
7,"prapedire","_","_","prapad","V","prapad","_","_"
1,"tadā","_","_","tadā","CAD","","_","_"
2,"_","_","_","śata","NUM","","_","_"
3,"_","_","_","sahasra","NUM","","_","_"
4,"_","_","_","prayuta","NC","","_","_"
5,"_","_","_","arbuda","NC","","_","_"
6,"ca","_","_","ca","CCD","","_","_"
1,"_","_","_","ayuta","NC","","_","_"
2,"_","_","_","atha","CAD","","_","_"
3,"kharvāṇi","_","_","kharva","NC","","_","_"
4,"nikharvāṇi","_","_","nikharva","NC","","_","_"
5,"ca","_","_","ca","CCD","","_","_"
6,"kaurava","_","_","kaurava","NC","","_","_"
1,"rāmaḥ","_","_","rāma","NC","","_","_"
2,"śarāṇāṃ","_","_","śara","NC","","_","_"
3,"saṃkruddho","_","_","saṃkrudh","PPP","","_","_"
4,"mayi","_","_","mat","PPR","","_","_"
5,"tūrṇam","_","_","tūrṇa","CX","","_","_"
6,"apātayat","_","_","pātay","V","pātay","_","_"
1,"tato","_","_","tatas","CX","","_","_"
2,"'haṃ","_","_","mat","PPR","","_","_"
3,"tān","_","_","tad","PRD","","_","_"
4,"api","_","_","api","CX","","_","_"
5,"raṇe","_","_","raṇa","NC","","_","_"
6,"śarair","_","_","śara","NC","","_","_"
7,"_","_","_","āśīviṣa","NC","","_","_"
8,"_","_","_","upama","JJ","","_","_"
1,"saṃchidya","_","_","saṃchid","CGDA","","_","_"
2,"bhūmau","_","_","bhūmi","NC","","_","_"
3,"nṛpate","_","_","nṛpati","NC","","_","_"
4,"'pātayaṃ","_","_","pātay","V","pātay","_","_"
5,"pannagān","_","_","pannaga","NC","","_","_"
6,"iva","_","_","iva","CCM","","_","_"
1,"evaṃ","_","_","eva","CX","","_","_"
2,"tad","_","_","tad","PRD","","_","_"
3,"abhavad","_","_","bhav","V","bhū","_","_"
4,"yuddhaṃ","_","_","yuddha","NC","","_","_"
5,"tadā","_","_","tadā","CAD","","_","_"
6,"_","_","_","bharata","NC","","_","_"
7,"_","_","_","sattama","JJ","","_","_"
1,"_","_","_","saṃdhyā","NC","","_","_"
2,"_","_","_","kāla","NC","","_","_"
3,"vyatīte","_","_","vyatī","PPP","","_","_"
4,"tu","_","_","tu","CCD","","_","_"
5,"vyapāyāt","_","_","vyapayā","V","vyapayā","_","_"
6,"sa","_","_","tad","PRD","","_","_"
7,"ca","_","_","ca","CCD","","_","_"
8,"me","_","_","mat","PPR","","_","_"
9,"guruḥ","_","_","guru","NC","","_","_"
