"WordID","word","NormSTEM","suffix","lemma","PoS","Root","NormSuffix","NormWord"
1,"vāyo","_","_","vāyu","NC","","_","_"
2,"ye","_","_","yad","PRL","","_","_"
3,"te","_","_","tvat","PPR","","_","_"
4,"sahasriṇo","_","_","sahasrin","JJ","","_","_"
5,"rathāsas","_","_","ratha","NC","","_","_"
6,"tebhir","_","_","tad","PRD","","_","_"
7,"ā","_","_","ā","CADP","","_","_"
8,"gahi","_","_","ga","V","ga","_","_"
1,"niyutvān","_","_","niyutvat","JJ","","_","_"
2,"_","_","_","soma","NC","","_","_"
3,"_","_","_","pīti","NC","","_","_"
1,"niyutvān","_","_","niyutvat","JJ","","_","_"
2,"vāyav","_","_","vāyu","NC","","_","_"
3,"ā","_","_","ā","CADP","","_","_"
4,"gahy","_","_","ga","V","ga","_","_"
5,"ayaṃ","_","_","ida","PRD","","_","_"
6,"śukro","_","_","śukra","JJ","","_","_"
7,"ayāmi","_","_","ya","V","ya","_","_"
8,"te","_","_","tvat","PPR","","_","_"
1,"gantāsi","_","_","ganta","V","ga","_","_"
2,"sunvato","_","_","su","KDP","","_","_"
3,"gṛham","_","_","gṛha","NC","","_","_"
1,"_","_","_","śukra","JJ","","_","_"
2,"_","_","_","adya","CX","","_","_"
3,"gavāśira","_","_","gavāśir","JJ","","_","_"
4,"_","_","_","indra","NC","","_","_"
5,"_","_","_","vāyu","NC","","_","_"
6,"niyutvataḥ","_","_","niyutvat","JJ","","_","_"
1,"ā","_","_","ā","CADP","","_","_"
2,"yātam","_","_","yā","V","yā","_","_"
3,"pibataṃ","_","_","pib","V","pā","_","_"
4,"narā","_","_","nṛ","NC","","_","_"
1,"ayaṃ","_","_","ida","PRD","","_","_"
2,"vām","_","_","tvat","PPR","","_","_"
3,"mitrāvaruṇā","_","_","mitrāvaruṇa","NC","","_","_"
4,"sutaḥ","_","_","su","PPP","","_","_"
5,"soma","_","_","soma","NC","","_","_"
6,"ṛtāvṛdhā","_","_","ṛtāvṛdh","JJ","","_","_"
1,"_","_","_","mat","PPR","","_","_"
2,"_","_","_","id","CEM","","_","_"
3,"iha","_","_","iha","CAD","","_","_"
4,"śrutaṃ","_","_","śṛṇ","V","śru","_","_"
5,"havam","_","_","hava","NC","","_","_"
1,"rājānāv","_","_","rājan","NC","","_","_"
2,"_","_","_","an","CX","","_","_"
3,"_","_","_","abhidruh","JJ","","_","_"
4,"dhruve","_","_","dhruva","JJ","","_","_"
5,"sadasy","_","_","sadas","NC","","_","_"
6,"uttame","_","_","uttama","JJ","","_","_"
1,"_","_","_","sahasra","NUM","","_","_"
2,"_","_","_","sthūṇa","NC","","_","_"
3,"āsāte","_","_","ās","V","ās","_","_"
1,"tā","_","_","tad","PRD","","_","_"
2,"samrājā","_","_","samrāj","NC","","_","_"
3,"_","_","_","ghṛta","NC","","_","_"
4,"_","_","_","āsuti","NC","","_","_"
5,"ādityā","_","_","āditya","NC","","_","_"
6,"dānunas","_","_","dānu","NC","","_","_"
7,"patī","_","_","pati","NC","","_","_"
1,"sacete","_","_","sac","V","sac","_","_"
2,"anavahvaram","_","_","anavahvara","JJ","","_","_"
1,"gomad","_","_","gomat","JJ","","_","_"
2,"ū","_","_","u","CEM","","_","_"
3,"ṣu","_","_","su","CAD","","_","_"
4,"_","_","_","nāsatya","NC","","_","_"
5,"_","_","_","aśvāvat","JJ","","_","_"
6,"yātam","_","_","yā","V","yā","_","_"
7,"aśvinā","_","_","aśvin","NC","","_","_"
1,"vartī","_","_","vartis","NC","","_","_"
2,"rudrā","_","_","rudra","NC","","_","_"
3,"nṛpāyyam","_","_","nṛpāyya","JJ","","_","_"
1,"na","_","_","na","CNG","","_","_"
2,"yat","_","_","yad","PRL","","_","_"
3,"paro","_","_","paras","CX","","_","_"
4,"_","_","_","na","CNG","","_","_"
5,"_","_","_","antare","CX","","_","_"
6,"ādadharṣad","_","_","ādhṛṣ","V","ādhṛṣ","_","_"
7,"vṛṣaṇvasū","_","_","vṛṣaṇvasu","JJ","","_","_"
1,"duḥśaṃso","_","_","duḥśaṃsa","JJ","","_","_"
2,"martyo","_","_","martya","JJ","","_","_"
3,"ripuḥ","_","_","ripu","NC","","_","_"
1,"tā","_","_","tad","PRD","","_","_"
2,"na","_","_","mat","PPR","","_","_"
3,"ā","_","_","ā","CADP","","_","_"
4,"voḍham","_","_","vah","V","vah","_","_"
5,"aśvinā","_","_","aśvin","NC","","_","_"
6,"rayim","_","_","rayi","NC","","_","_"
7,"_","_","_","piśaṅga","JJ","","_","_"
8,"_","_","_","saṃdṛś","NC","","_","_"
1,"dhiṣṇyā","_","_","dhiṣṇya","JJ","","_","_"
2,"_","_","_","varivas","NC","","_","_"
3,"_","_","_","vid","JJ","","_","_"
1,"indro","_","_","indra","NC","","_","_"
2,"aṅga","_","_","aṅga","CEM","","_","_"
3,"mahad","_","_","mahat","JJ","","_","_"
4,"bhayam","_","_","bhaya","NC","","_","_"
5,"abhī","_","_","abhi","CADP","","_","_"
6,"ṣad","_","_","as","KDP","","_","_"
7,"apa","_","_","apa","CX","","_","_"
8,"cucyavat","_","_","cyu","V","cyu","_","_"
1,"sa","_","_","tad","PRD","","_","_"
2,"hi","_","_","hi","CX","","_","_"
3,"sthiro","_","_","sthira","JJ","","_","_"
4,"vicarṣaṇiḥ","_","_","vicarṣaṇi","JJ","","_","_"
1,"indraś","_","_","indra","NC","","_","_"
2,"ca","_","_","ca","CCD","","_","_"
3,"mṛḍayāti","_","_","mṛḍay","V","mṛḍay","_","_"
4,"no","_","_","mat","PPR","","_","_"
5,"na","_","_","na","CNG","","_","_"
6,"naḥ","_","_","mat","PPR","","_","_"
7,"paścād","_","_","paścāt","CAD","","_","_"
8,"aghaṃ","_","_","agha","NC","","_","_"
9,"naśat","_","_","naś","V","naś","_","_"
1,"bhadram","_","_","bhadra","NC","","_","_"
2,"bhavāti","_","_","bhav","V","bhū","_","_"
3,"naḥ","_","_","mat","PPR","","_","_"
4,"puraḥ","_","_","puras","CX","","_","_"
1,"indra","_","_","indra","NC","","_","_"
2,"āśābhyas","_","_","āśā","NC","","_","_"
3,"pari","_","_","pari","CADP","","_","_"
4,"sarvābhyo","_","_","sarva","JQ","","_","_"
5,"abhayaṃ","_","_","abhaya","NC","","_","_"
6,"karat","_","_","kar","V","kṛ","_","_"
1,"jetā","_","_","jay","V","ji","_","_"
2,"śatrūn","_","_","śatru","NC","","_","_"
3,"vicarṣaṇiḥ","_","_","vicarṣaṇi","JJ","","_","_"
1,"viśve","_","_","viśva","JQ","","_","_"
2,"devāsa","_","_","deva","NC","","_","_"
3,"ā","_","_","ā","CADP","","_","_"
4,"gata","_","_","ga","V","ga","_","_"
5,"śṛṇutā","_","_","śṛṇ","V","śru","_","_"
6,"ma","_","_","mat","PPR","","_","_"
7,"imaṃ","_","_","ida","PRD","","_","_"
8,"havam","_","_","hava","NC","","_","_"
1,"_","_","_","ā","CADP","","_","_"
2,"_","_","_","ida","PRD","","_","_"
3,"barhir","_","_","barhis","NC","","_","_"
4,"ni","_","_","ni","CADP","","_","_"
5,"ṣīdata","_","_","sīd","V","sad","_","_"
1,"tīvro","_","_","tīvra","JJ","","_","_"
2,"vo","_","_","tvat","PPR","","_","_"
3,"madhumāṁ","_","_","madhumat","JJ","","_","_"
4,"ayaṃ","_","_","ida","PRD","","_","_"
5,"śunahotreṣu","_","_","śunahotra","NC","","_","_"
6,"matsaraḥ","_","_","matsara","JJ","","_","_"
1,"etam","_","_","tad","PRD","","_","_"
2,"pibata","_","_","pib","V","pā","_","_"
3,"kāmyam","_","_","kāmya","JJ","","_","_"
1,"_","_","_","indra","NC","","_","_"
2,"_","_","_","jyeṣṭha","JJ","","_","_"
3,"_","_","_","marut","NC","","_","_"
4,"_","_","_","gaṇa","NC","","_","_"
5,"devāsaḥ","_","_","deva","NC","","_","_"
6,"_","_","_","pūṣan","NC","","_","_"
7,"_","_","_","rāti","NC","","_","_"
1,"viśve","_","_","viśva","JQ","","_","_"
2,"mama","_","_","mat","PPR","","_","_"
3,"śrutā","_","_","śṛṇ","V","śru","_","_"
4,"havam","_","_","hava","NC","","_","_"
1,"ambitame","_","_","ambitamā","NC","","_","_"
2,"nadītame","_","_","nadītamā","NC","","_","_"
3,"devitame","_","_","devitamā","NC","","_","_"
4,"sarasvati","_","_","sarasvatī","NC","","_","_"
1,"apraśastā","_","_","apraśasta","JJ","","_","_"
2,"iva","_","_","iva","CCM","","_","_"
3,"smasi","_","_","as","V","as","_","_"
4,"praśastim","_","_","praśasti","NC","","_","_"
5,"amba","_","_","ambā","NC","","_","_"
6,"nas","_","_","mat","PPR","","_","_"
7,"kṛdhi","_","_","kar","V","kṛ","_","_"
1,"tve","_","_","tvat","PPR","","_","_"
2,"viśvā","_","_","viśva","JQ","","_","_"
3,"sarasvati","_","_","sarasvatī","NC","","_","_"
4,"_","_","_","śri","PPP","","_","_"
5,"_","_","_","āyus","NC","","_","_"
6,"devyām","_","_","devī","NC","","_","_"
1,"śunahotreṣu","_","_","śunahotra","NC","","_","_"
2,"matsva","_","_","mat","V","mat","_","_"
3,"prajāṃ","_","_","prajā","NC","","_","_"
4,"devi","_","_","devī","NC","","_","_"
5,"didiḍḍhi","_","_","diś","V","diś","_","_"
6,"naḥ","_","_","mat","PPR","","_","_"
1,"imā","_","_","ida","PRD","","_","_"
2,"brahma","_","_","brahman","NC","","_","_"
3,"sarasvati","_","_","sarasvatī","NC","","_","_"
4,"juṣasva","_","_","juṣ","V","juṣ","_","_"
5,"vājinīvati","_","_","vājinīvat","JJ","","_","_"
1,"yā","_","_","yad","PRL","","_","_"
2,"te","_","_","tvat","PPR","","_","_"
3,"manma","_","_","manman","NC","","_","_"
4,"gṛtsamadā","_","_","gṛtsamada","NC","","_","_"
5,"ṛtāvari","_","_","ṛtāvan","JJ","","_","_"
6,"priyā","_","_","priya","JJ","","_","_"
7,"deveṣu","_","_","deva","NC","","_","_"
8,"juhvati","_","_","hu","V","hu","_","_"
1,"pretāṃ","_","_","prai","V","prai","_","_"
2,"yajñasya","_","_","yajña","NC","","_","_"
3,"śambhuvā","_","_","śambhu","JJ","","_","_"
4,"yuvām","_","_","tvat","PPR","","_","_"
5,"id","_","_","id","CEM","","_","_"
6,"ā","_","_","ā","CADP","","_","_"
7,"vṛṇīmahe","_","_","vṛ","V","vṛ","_","_"
1,"agniṃ","_","_","agni","NC","","_","_"
2,"ca","_","_","ca","CCD","","_","_"
3,"havyavāhanam","_","_","havyavāhana","NC","","_","_"
1,"dyāvā","_","_","div","NC","","_","_"
2,"naḥ","_","_","mat","PPR","","_","_"
3,"pṛthivī","_","_","pṛthivī","NC","","_","_"
4,"imaṃ","_","_","ida","PRD","","_","_"
5,"sidhram","_","_","sidhra","JJ","","_","_"
6,"adya","_","_","adya","CX","","_","_"
7,"divispṛśam","_","_","divispṛś","JJ","","_","_"
1,"yajñaṃ","_","_","yajña","NC","","_","_"
2,"deveṣu","_","_","deva","NC","","_","_"
3,"yacchatām","_","_","ya","V","ya","_","_"
1,"ā","_","_","ā","CADP","","_","_"
2,"vām","_","_","tvat","PPR","","_","_"
3,"upastham","_","_","upastha","NC","","_","_"
4,"a","_","_","alpha_privativum","JJ","","_","_"
4,"adruhā","_","_","druh","JJ","","_","_"
5,"devāḥ","_","_","deva","NC","","_","_"
6,"sīdantu","_","_","sīd","V","sad","_","_"
7,"yajñiyāḥ","_","_","yajñiya","JJ","","_","_"
1,"_","_","_","iha","CAD","","_","_"
2,"_","_","_","adya","CX","","_","_"
3,"_","_","_","soma","NC","","_","_"
4,"_","_","_","pīti","NC","","_","_"
