"WordID","word","NormSTEM","suffix","lemma","PoS","Root","NormSuffix","NormWord"
1,"dhṛtarāṣṭra","_","_","dhṛtarāṣṭra","NC","","_","_"
2,"uvāca","_","_","vak","V","vac","_","_"
1,"kathaṃ","_","_","katha","CX","","_","_"
2,"śikhaṇḍī","_","_","śikhaṇḍin","NC","","_","_"
3,"gāṅgeyam","_","_","gāṅgeya","NC","","_","_"
4,"abhyadhāvat","_","_","abhidhāv","V","abhidhāv","_","_"
5,"pitāmaham","_","_","pitāmaha","NC","","_","_"
1,"pāñcālyaḥ","_","_","pāñcālya","JJ","","_","_"
2,"samare","_","_","samara","NC","","_","_"
3,"kruddho","_","_","krudh","PPP","","_","_"
4,"_","_","_","dharma","NC","","_","_"
5,"_","_","_","ātman","NC","","_","_"
6,"_","_","_","ya","PPP","","_","_"
7,"_","_","_","vrata","NC","","_","_"
1,"ke","_","_","kiṃ","PRQ","","_","_"
2,"'rakṣan","_","_","rakṣ","V","rakṣ","_","_"
3,"_","_","_","pāṇḍava","NC","","_","_"
4,"_","_","_","anīka","NC","","_","_"
5,"śikhaṇḍinam","_","_","śikhaṇḍin","NC","","_","_"
6,"udāyudham","_","_","udāyudha","JJ","","_","_"
1,"_","_","_","tvar","KDP","","_","_"
2,"_","_","_","tvarā","NC","","_","_"
3,"_","_","_","kāla","NC","","_","_"
4,"jigīṣanto","_","_","jigīṣ","KDP","","_","_"
5,"_","_","_","mahat","JJ","","_","_"
6,"_","_","_","ratha","NC","","_","_"
1,"kathaṃ","_","_","katha","CX","","_","_"
2,"śāṃtanavo","_","_","śāṃtanava","NC","","_","_"
3,"bhīṣmaḥ","_","_","bhīṣma","NC","","_","_"
4,"sa","_","_","tad","PRD","","_","_"
5,"tasmin","_","_","tad","PRD","","_","_"
6,"daśame","_","_","daśama","JJ","","_","_"
7,"'hani","_","_","ahar","NC","","_","_"
1,"ayudhyata","_","_","yudh","V","yudh","_","_"
2,"_","_","_","mahat","JJ","","_","_"
3,"_","_","_","vīrya","NC","","_","_"
4,"pāṇḍavaiḥ","_","_","pāṇḍava","NC","","_","_"
5,"_","_","_","saha","CX","","_","_"
6,"_","_","_","sṛñjaya","NC","","_","_"
1,"na","_","_","na","CNG","","_","_"
2,"mṛṣyāmi","_","_","mṛṣ","V","mṛṣ","_","_"
3,"raṇe","_","_","raṇa","NC","","_","_"
4,"bhīṣmaṃ","_","_","bhīṣma","NC","","_","_"
5,"pratyudyātaṃ","_","_","pratyudyā","PPP","","_","_"
6,"śikhaṇḍinam","_","_","śikhaṇḍin","NC","","_","_"
1,"_","_","_","kaccit","CX","","_","_"
2,"_","_","_","na","CNG","","_","_"
3,"_","_","_","ratha","NC","","_","_"
4,"_","_","_","bhaṅga","NC","","_","_"
5,"'sya","_","_","ida","PRD","","_","_"
6,"dhanur","_","_","dhanus","NC","","_","_"
7,"_","_","_","vā","CCD","","_","_"
8,"_","_","_","śṛ","V","śṛ","_","_"
9,"_","_","_","as","KDP","","_","_"
1,"saṃjaya","_","_","saṃjaya","NC","","_","_"
2,"uvāca","_","_","vak","V","vac","_","_"
1,"_","_","_","na","CNG","","_","_"
2,"_","_","_","śṛ","V","śṛ","_","_"
3,"_","_","_","dhanus","NC","","_","_"
4,"_","_","_","tad","PRD","","_","_"
5,"_","_","_","ratha","NC","","_","_"
6,"_","_","_","bhaṅga","NC","","_","_"
7,"na","_","_","na","CNG","","_","_"
8,"_","_","_","ca","CCD","","_","_"
9,"_","_","_","api","CX","","_","_"
10,"_","_","_","bhav","V","bhū","_","_"
1,"yudhyamānasya","_","_","yudh","KDP","","_","_"
2,"saṃgrāme","_","_","saṃgrāma","NC","","_","_"
3,"bhīṣmasya","_","_","bhīṣma","NC","","_","_"
4,"_","_","_","bharata","NC","","_","_"
5,"_","_","_","ṛṣabha","NC","","_","_"
1,"nighnataḥ","_","_","nihan","KDP","","_","_"
2,"samare","_","_","samara","NC","","_","_"
3,"śatrūñ","_","_","śatru","NC","","_","_"
4,"śaraiḥ","_","_","śara","NC","","_","_"
5,"_","_","_","saṃna","PPP","","_","_"
6,"_","_","_","parvan","NC","","_","_"
1,"_","_","_","aneka","JJ","","_","_"
2,"_","_","_","śata","NUM","","_","_"
3,"_","_","_","sāhasra","JJ","","_","_"
4,"_","_","_","tāvaka","JJ","","_","_"
5,"_","_","_","mahat","JJ","","_","_"
6,"_","_","_","ratha","NC","","_","_"
1,"_","_","_","ratha","NC","","_","_"
2,"_","_","_","dantin","NC","","_","_"
3,"_","_","_","gaṇa","NC","","_","_"
4,"rājan","_","_","rājan","NC","","_","_"
5,"_","_","_","haya","NC","","_","_"
6,"_","_","_","ca","CCD","","_","_"
7,"_","_","_","eva","CEM","","_","_"
8,"_","_","_","su","CAD","","_","_"
9,"_","_","_","sajjay","PPP","","_","_"
1,"abhyavartanta","_","_","abhivart","V","abhivṛt","_","_"
2,"yuddhāya","_","_","yuddha","NC","","_","_"
3,"puraskṛtya","_","_","puraskṛ","CGDA","","_","_"
4,"pitāmaham","_","_","pitāmaha","NC","","_","_"
1,"yathāpratijñaṃ","_","_","yathāpratijña","CX","","_","_"
2,"kauravya","_","_","kauravya","NC","","_","_"
3,"sa","_","_","tad","PRD","","_","_"
4,"_","_","_","ca","CCD","","_","_"
5,"_","_","_","api","CX","","_","_"
6,"samitiṃjayaḥ","_","_","samitiṃjaya","NC","","_","_"
1,"pārthānām","_","_","pārtha","NC","","_","_"
2,"akarod","_","_","kar","V","kṛ","_","_"
3,"bhīṣmaḥ","_","_","bhīṣma","NC","","_","_"
4,"satataṃ","_","_","satata","CX","","_","_"
5,"_","_","_","samiti","NC","","_","_"
6,"_","_","_","kṣaya","NC","","_","_"
1,"yudhyamānaṃ","_","_","yudh","KDP","","_","_"
2,"_","_","_","mahat","JJ","","_","_"
3,"_","_","_","iṣvāsa","NC","","_","_"
4,"vinighnantaṃ","_","_","vinihan","KDP","","_","_"
5,"parāñ","_","_","para","PPX","","_","_"
6,"śaraiḥ","_","_","śara","NC","","_","_"
1,"pāñcālāḥ","_","_","pāñcāla","NC","","_","_"
2,"pāṇḍavaiḥ","_","_","pāṇḍava","NC","","_","_"
3,"sārdhaṃ","_","_","sārdha","CX","","_","_"
4,"sarva","_","_","sarva","JQ","","_","_"
5,"_","_","_","eva","CEM","","_","_"
6,"_","_","_","abhivāray","V","abhivāray","_","_"
1,"daśame","_","_","daśama","JJ","","_","_"
2,"'hani","_","_","ahar","NC","","_","_"
3,"samprāpte","_","_","samprāp","PPP","","_","_"
4,"tatāpa","_","_","tap","V","tap","_","_"
5,"_","_","_","ripu","NC","","_","_"
6,"_","_","_","vāhinī","NC","","_","_"
1,"kīryamāṇāṃ","_","_","kṛ","KDP","","_","_"
2,"śitair","_","_","śā","PPP","","_","_"
3,"bāṇaiḥ","_","_","bāṇa","NC","","_","_"
4,"śataśo","_","_","śataśas","CX","","_","_"
5,"'tha","_","_","atha","CAD","","_","_"
6,"sahasraśaḥ","_","_","sahasraśas","CX","","_","_"
1,"na","_","_","na","CNG","","_","_"
2,"hi","_","_","hi","CX","","_","_"
3,"bhīṣmaṃ","_","_","bhīṣma","NC","","_","_"
4,"_","_","_","mahat","JJ","","_","_"
5,"_","_","_","iṣvāsa","NC","","_","_"
6,"pāṇḍavāḥ","_","_","pāṇḍava","NC","","_","_"
7,"_","_","_","pāṇḍu","NC","","_","_"
8,"_","_","_","pūrvaja","NC","","_","_"
1,"aśaknuvan","_","_","śakn","V","śak","_","_"
2,"raṇe","_","_","raṇa","NC","","_","_"
3,"jetuṃ","_","_","ji","CGDI","","_","_"
4,"_","_","_","pāśa","NC","","_","_"
5,"_","_","_","hasta","NC","","_","_"
6,"_","_","_","iva","CCM","","_","_"
7,"_","_","_","antaka","NC","","_","_"
1,"_","_","_","atha","CAD","","_","_"
2,"_","_","_","upayā","V","upayā","_","_"
3,"_","_","_","mahat","JJ","","_","_"
4,"_","_","_","rāja","NC","","_","_"
5,"savyasācī","_","_","savyasācin","NC","","_","_"
6,"paraṃtapaḥ","_","_","paraṃtapa","JJ","","_","_"
1,"trāsayan","_","_","trāsay","KDP","","_","_"
2,"rathinaḥ","_","_","rathin","NC","","_","_"
3,"sarvān","_","_","sarva","JQ","","_","_"
4,"bībhatsur","_","_","bībhatsu","NC","","_","_"
5,"aparājitaḥ","_","_","aparājita","JJ","","_","_"
1,"_","_","_","siṃha","NC","","_","_"
2,"_","_","_","vat","CX","","_","_"
3,"vinadann","_","_","vinad","KDP","","_","_"
4,"uccair","_","_","uccais","CX","","_","_"
5,"_","_","_","dhanus","NC","","_","_"
6,"_","_","_","jyā","NC","","_","_"
7,"_","_","_","vikṣip","KDP","","_","_"
8,"_","_","_","muhur","CX","","_","_"
1,"_","_","_","śara","NC","","_","_"
2,"_","_","_","ogha","NC","","_","_"
3,"visṛjan","_","_","visṛj","KDP","","_","_"
4,"pārtho","_","_","pārtha","NC","","_","_"
5,"vyacarat","_","_","vicar","V","vicar","_","_"
6,"_","_","_","kāla","NC","","_","_"
7,"_","_","_","vat","CX","","_","_"
8,"raṇe","_","_","raṇa","NC","","_","_"
1,"tasya","_","_","tad","PRD","","_","_"
2,"śabdena","_","_","śabda","NC","","_","_"
3,"_","_","_","vitras","PPP","","_","_"
4,"_","_","_","tāvaka","JJ","","_","_"
5,"_","_","_","bharata","NC","","_","_"
6,"_","_","_","ṛṣabha","NC","","_","_"
1,"_","_","_","siṃha","NC","","_","_"
2,"_","_","_","iva","CCM","","_","_"
3,"mṛgā","_","_","mṛga","NC","","_","_"
4,"rājan","_","_","rājan","NC","","_","_"
5,"vyadravanta","_","_","vidru","V","vidru","_","_"
6,"_","_","_","mahat","JJ","","_","_"
7,"_","_","_","bhaya","NC","","_","_"
1,"jayantaṃ","_","_","ji","KDP","","_","_"
2,"pāṇḍavaṃ","_","_","pāṇḍava","NC","","_","_"
3,"dṛṣṭvā","_","_","dṛś","CGDA","","_","_"
4,"_","_","_","tvat","PPR","","_","_"
5,"_","_","_","sainya","NC","","_","_"
6,"_","_","_","ca","CCD","","_","_"
7,"_","_","_","abhipīḍay","PPP","","_","_"
1,"_","_","_","duryodhana","NC","","_","_"
2,"_","_","_","tatas","CX","","_","_"
3,"bhīṣmam","_","_","bhīṣma","NC","","_","_"
4,"abravīd","_","_","abravīta","V","brū","_","_"
5,"_","_","_","bhṛśa","JJ","","_","_"
6,"_","_","_","pīḍay","PPP","","_","_"
1,"eṣa","_","_","tad","PRD","","_","_"
2,"_","_","_","pāṇḍu","NC","","_","_"
3,"_","_","_","suta","NC","","_","_"
4,"_","_","_","tāta","NC","","_","_"
5,"śvetāśvaḥ","_","_","śvetāśva","NC","","_","_"
6,"kṛṣṇasārathiḥ","_","_","kṛṣṇasārathi","NC","","_","_"
1,"dahate","_","_","dah","V","dah","_","_"
2,"māmakān","_","_","māmaka","JJ","","_","_"
3,"sarvān","_","_","sarva","JQ","","_","_"
4,"_","_","_","kṛṣṇavartman","NC","","_","_"
5,"_","_","_","iva","CCM","","_","_"
6,"kānanam","_","_","kānana","NC","","_","_"
1,"paśya","_","_","paś","V","paś","_","_"
2,"sainyāni","_","_","sainya","NC","","_","_"
3,"gāṅgeya","_","_","gāṅgeya","NC","","_","_"
4,"dravamāṇāni","_","_","dru","KDP","","_","_"
5,"sarvaśaḥ","_","_","sarvaśas","CX","","_","_"
1,"pāṇḍavena","_","_","pāṇḍava","NC","","_","_"
2,"yudhāṃ","_","_","yudh","NC","","_","_"
3,"śreṣṭha","_","_","śreṣṭha","JJ","","_","_"
4,"kālyamānāni","_","_","kālay","KDP","","_","_"
5,"saṃyuge","_","_","saṃyuga","NC","","_","_"
1,"yathā","_","_","yathā","CCM","","_","_"
2,"_","_","_","paśu","NC","","_","_"
3,"_","_","_","gaṇa","NC","","_","_"
4,"pālaḥ","_","_","pāla","NC","","_","_"
5,"saṃkālayati","_","_","saṃkālay","V","saṃkālay","_","_"
6,"kānane","_","_","kānana","NC","","_","_"
1,"_","_","_","tathā","CX","","_","_"
2,"_","_","_","ida","PRD","","_","_"
3,"māmakaṃ","_","_","māmaka","JJ","","_","_"
4,"sainyaṃ","_","_","sainya","NC","","_","_"
5,"kālyate","_","_","kālay","V","kālay","_","_"
6,"_","_","_","śatru","NC","","_","_"
7,"_","_","_","tāpana","JJ","","_","_"
1,"_","_","_","dhanaṃjaya","NC","","_","_"
2,"_","_","_","śara","NC","","_","_"
3,"bhagnaṃ","_","_","bhañj","PPP","","_","_"
4,"dravamāṇam","_","_","dru","KDP","","_","_"
5,"_","_","_","itas","CX","","_","_"
6,"_","_","_","tatas","CX","","_","_"
1,"bhīmo","_","_","bhīma","NC","","_","_"
2,"_","_","_","hi","CX","","_","_"
3,"_","_","_","tad","PRD","","_","_"
4,"durādharṣo","_","_","durādharṣa","JJ","","_","_"
5,"vidrāvayati","_","_","vidrāvay","V","vidrāvay","_","_"
6,"me","_","_","mat","PPR","","_","_"
7,"balam","_","_","bala","NC","","_","_"
1,"_","_","_","sātyaki","NC","","_","_"
2,"_","_","_","cekitāna","NC","","_","_"
3,"_","_","_","ca","CCD","","_","_"
4,"_","_","_","mādrī","NC","","_","_"
5,"_","_","_","putra","NC","","_","_"
6,"ca","_","_","ca","CCD","","_","_"
7,"pāṇḍavau","_","_","pāṇḍava","NC","","_","_"
1,"_","_","_","abhimanyu","NC","","_","_"
2,"_","_","_","ca","CCD","","_","_"
3,"vikrānto","_","_","vikra","PPP","","_","_"
4,"vāhinīṃ","_","_","vāhinī","NC","","_","_"
5,"dahate","_","_","dah","V","dah","_","_"
6,"mama","_","_","mat","PPR","","_","_"
1,"_","_","_","dhṛṣṭadyumna","NC","","_","_"
2,"_","_","_","tathā","CX","","_","_"
3,"śūro","_","_","śūra","NC","","_","_"
4,"_","_","_","rākṣasa","NC","","_","_"
5,"_","_","_","ca","CCD","","_","_"
6,"ghaṭotkacaḥ","_","_","ghaṭotkaca","NC","","_","_"
1,"vyadrāvayetāṃ","_","_","vidrāvay","V","vidrāvay","_","_"
2,"sahasā","_","_","sahas","NC","","_","_"
3,"sainyaṃ","_","_","sainya","NC","","_","_"
4,"mama","_","_","mat","PPR","","_","_"
5,"_","_","_","mahat","JJ","","_","_"
6,"_","_","_","bala","NC","","_","_"
1,"vadhyamānasya","_","_","vadh","KDP","","_","_"
2,"sainyasya","_","_","sainya","NC","","_","_"
3,"sarvair","_","_","sarva","JQ","","_","_"
4,"etair","_","_","tad","PRD","","_","_"
5,"_","_","_","mahat","JJ","","_","_"
6,"_","_","_","bala","NC","","_","_"
1,"_","_","_","na","CNG","","_","_"
2,"_","_","_","anya","PPX","","_","_"
3,"gatiṃ","_","_","gati","NC","","_","_"
4,"prapaśyāmi","_","_","prapaś","V","prapaś","_","_"
5,"sthāne","_","_","sthāna","NC","","_","_"
6,"yuddhe","_","_","yuddha","NC","","_","_"
7,"ca","_","_","ca","CCD","","_","_"
8,"bhārata","_","_","bhārata","NC","","_","_"
1,"ṛte","_","_","ṛte","CX","","_","_"
2,"tvāṃ","_","_","tvat","PPR","","_","_"
3,"_","_","_","puruṣa","NC","","_","_"
4,"_","_","_","vyāghra","NC","","_","_"
5,"_","_","_","deva","NC","","_","_"
6,"_","_","_","tulya","JJ","","_","_"
7,"_","_","_","parākrama","NC","","_","_"
1,"_","_","_","paryāp","PPP","","_","_"
2,"_","_","_","ca","CCD","","_","_"
3,"bhavān","_","_","bhavat","JJ","","_","_"
4,"kṣipraṃ","_","_","kṣipra","CX","","_","_"
5,"pīḍitānāṃ","_","_","pīḍay","PPP","","_","_"
6,"gatir","_","_","gati","NC","","_","_"
7,"bhava","_","_","bhav","V","bhū","_","_"
1,"evam","_","_","eva","CX","","_","_"
2,"ukto","_","_","vac","PPP","","_","_"
3,"_","_","_","mahat","JJ","","_","_"
4,"_","_","_","rāja","NC","","_","_"
5,"pitā","_","_","pitṛ","NC","","_","_"
6,"_","_","_","devavrata","NC","","_","_"
7,"_","_","_","tvat","PPR","","_","_"
1,"cintayitvā","_","_","cintay","CGDA","","_","_"
2,"muhūrtaṃ","_","_","muhūrta","NC","","_","_"
3,"tu","_","_","tu","CCD","","_","_"
4,"kṛtvā","_","_","kṛ","CGDA","","_","_"
5,"niścayam","_","_","niścaya","NC","","_","_"
6,"ātmanaḥ","_","_","ātman","NC","","_","_"
1,"tava","_","_","tvat","PPR","","_","_"
2,"saṃdhārayan","_","_","saṃdhāray","KDP","","_","_"
3,"putram","_","_","putra","NC","","_","_"
4,"_","_","_","abravīta","V","brū","_","_"
5,"_","_","_","śaṃtanu","NC","","_","_"
6,"sutaḥ","_","_","suta","NC","","_","_"
1,"duryodhana","_","_","duryodhana","NC","","_","_"
2,"vijānīhi","_","_","vijān","V","vijñā","_","_"
3,"sthiro","_","_","sthira","JJ","","_","_"
4,"bhava","_","_","bhav","V","bhū","_","_"
5,"viśāṃ","_","_","viś","NC","","_","_"
6,"pate","_","_","pati","NC","","_","_"
1,"_","_","_","pūrva","PPX","","_","_"
2,"_","_","_","kāla","NC","","_","_"
3,"tava","_","_","tvat","PPR","","_","_"
4,"mayā","_","_","mat","PPR","","_","_"
5,"pratijñātaṃ","_","_","pratijñā","PPP","","_","_"
6,"_","_","_","mahat","JJ","","_","_"
7,"_","_","_","bala","NC","","_","_"
1,"hatvā","_","_","han","CGDA","","_","_"
2,"daśa","_","_","daśan","NUM","","_","_"
3,"sahasrāṇi","_","_","sahasra","NUM","","_","_"
4,"kṣatriyāṇāṃ","_","_","kṣatriya","NC","","_","_"
5,"mahātmanām","_","_","mahātman","JJ","","_","_"
1,"saṃgrāmād","_","_","saṃgrāma","NC","","_","_"
2,"vyapayātavyam","_","_","vyapayā","KDG","","_","_"
3,"etat","_","_","tad","PRD","","_","_"
4,"karma","_","_","karman","NC","","_","_"
5,"_","_","_","mat","PPR","","_","_"
6,"_","_","_","āhnika","JJ","","_","_"
1,"iti","_","_","iti","CQT","","_","_"
2,"tat","_","_","tad","PRD","","_","_"
3,"_","_","_","kṛ","KDP","","_","_"
4,"_","_","_","ca","CCD","","_","_"
5,"_","_","_","mat","PPR","","_","_"
6,"yathoktaṃ","_","_","yathokta","CX","","_","_"
7,"_","_","_","bharata","NC","","_","_"
8,"_","_","_","ṛṣabha","NC","","_","_"
1,"adya","_","_","adya","CX","","_","_"
2,"_","_","_","ca","CCD","","_","_"
3,"_","_","_","api","CX","","_","_"
4,"mahat","_","_","mahat","JJ","","_","_"
5,"karma","_","_","karman","NC","","_","_"
6,"prakariṣye","_","_","prakar","V","prakṛ","_","_"
7,"_","_","_","mahat","JJ","","_","_"
8,"_","_","_","āhava","NC","","_","_"
1,"ahaṃ","_","_","mat","PPR","","_","_"
2,"vā","_","_","vā","CCD","","_","_"
3,"nihataḥ","_","_","nihan","PPP","","_","_"
4,"śeṣye","_","_","śī","V","śī","_","_"
5,"haniṣye","_","_","han","V","han","_","_"
6,"_","_","_","vā","CCD","","_","_"
7,"_","_","_","adya","CX","","_","_"
8,"pāṇḍavān","_","_","pāṇḍava","NC","","_","_"
1,"adya","_","_","adya","CX","","_","_"
2,"te","_","_","tvat","PPR","","_","_"
3,"_","_","_","puruṣa","NC","","_","_"
4,"_","_","_","vyāghra","NC","","_","_"
5,"pratimokṣye","_","_","pratimuñc","V","pratimuc","_","_"
6,"ṛṇaṃ","_","_","ṛṇa","NC","","_","_"
7,"mahat","_","_","mahat","JJ","","_","_"
1,"_","_","_","bhartṛ","NC","","_","_"
2,"_","_","_","piṇḍa","NC","","_","_"
3,"_","_","_","kṛ","PPP","","_","_"
4,"_","_","_","rājan","NC","","_","_"
5,"_","_","_","nihan","PPP","","_","_"
6,"_","_","_","pṛtanā","NC","","_","_"
7,"_","_","_","mukha","NC","","_","_"
1,"_","_","_","iti","CQT","","_","_"
2,"_","_","_","vac","CGDA","","_","_"
3,"_","_","_","bharata","NC","","_","_"
4,"_","_","_","śreṣṭha","JJ","","_","_"
5,"kṣatriyān","_","_","kṣatriya","NC","","_","_"
6,"pratapañ","_","_","pratap","KDP","","_","_"
7,"śaraiḥ","_","_","śara","NC","","_","_"
1,"āsasāda","_","_","āsīd","V","āsad","_","_"
2,"durādharṣaḥ","_","_","durādharṣa","JJ","","_","_"
3,"pāṇḍavānām","_","_","pāṇḍava","NC","","_","_"
4,"anīkinīm","_","_","anīkinī","NC","","_","_"
1,"_","_","_","anīka","NC","","_","_"
2,"_","_","_","madhya","NC","","_","_"
3,"tiṣṭhantaṃ","_","_","sthā","KDP","","_","_"
4,"gāṅgeyaṃ","_","_","gāṅgeya","NC","","_","_"
5,"_","_","_","bharata","NC","","_","_"
6,"_","_","_","ṛṣabha","NC","","_","_"
1,"āśīviṣam","_","_","āśīviṣa","NC","","_","_"
2,"iva","_","_","iva","CCM","","_","_"
3,"kruddhaṃ","_","_","krudh","PPP","","_","_"
4,"pāṇḍavāḥ","_","_","pāṇḍava","NC","","_","_"
5,"paryavārayan","_","_","parivāray","V","parivāray","_","_"
1,"daśame","_","_","daśama","JJ","","_","_"
2,"'hani","_","_","ahar","NC","","_","_"
3,"_","_","_","tad","PRD","","_","_"
4,"_","_","_","tu","CCD","","_","_"
5,"darśayañ","_","_","darśay","KDP","","_","_"
6,"śaktim","_","_","śakti","NC","","_","_"
7,"ātmanaḥ","_","_","ātman","NC","","_","_"
1,"rājañ","_","_","rājan","NC","","_","_"
2,"_","_","_","śata","NUM","","_","_"
3,"_","_","_","sahasra","NUM","","_","_"
4,"so","_","_","tad","PRD","","_","_"
5,"'vadhīt","_","_","vadh","V","vadh","_","_"
6,"_","_","_","kuru","NC","","_","_"
7,"_","_","_","nandana","NC","","_","_"
1,"pañcālānāṃ","_","_","pañcāla","NC","","_","_"
2,"ca","_","_","ca","CCD","","_","_"
3,"ye","_","_","yad","PRL","","_","_"
4,"śreṣṭhā","_","_","śreṣṭha","JJ","","_","_"
5,"_","_","_","rājan","NC","","_","_"
6,"_","_","_","putra","NC","","_","_"
7,"_","_","_","mahat","JJ","","_","_"
8,"_","_","_","bala","NC","","_","_"
1,"teṣām","_","_","tad","PRD","","_","_"
2,"ādatta","_","_","ādad","V","ādā","_","_"
3,"tejāṃsi","_","_","tejas","NC","","_","_"
4,"jalaṃ","_","_","jala","NC","","_","_"
5,"sūrya","_","_","sūrya","NC","","_","_"
6,"_","_","_","iva","CCM","","_","_"
7,"_","_","_","aṃśu","NC","","_","_"
1,"hatvā","_","_","han","CGDA","","_","_"
2,"daśa","_","_","daśan","NUM","","_","_"
3,"sahasrāṇi","_","_","sahasra","NUM","","_","_"
4,"kuñjarāṇāṃ","_","_","kuñjara","NC","","_","_"
5,"tarasvinām","_","_","tarasvin","JJ","","_","_"
1,"_","_","_","sa_saha","CX","","_","_"
2,"_","_","_","āroha","NC","","_","_"
3,"_","_","_","mahat","JJ","","_","_"
4,"_","_","_","rāja","NC","","_","_"
5,"hayānāṃ","_","_","haya","NC","","_","_"
6,"_","_","_","ca","CCD","","_","_"
7,"_","_","_","ayuta","NC","","_","_"
8,"punaḥ","_","_","punar","CAD","","_","_"
1,"pūrṇe","_","_","pṛ","PPP","","_","_"
2,"_","_","_","śata","NUM","","_","_"
3,"_","_","_","sahasra","NUM","","_","_"
4,"dve","_","_","dvi","NUM","","_","_"
5,"padātīnāṃ","_","_","padāti","NC","","_","_"
6,"_","_","_","nara","NC","","_","_"
7,"_","_","_","uttama","JJ","","_","_"
1,"prajajvāla","_","_","prajval","V","prajval","_","_"
2,"raṇe","_","_","raṇa","NC","","_","_"
3,"bhīṣmo","_","_","bhīṣma","NC","","_","_"
4,"vidhūma","_","_","vidhūma","JJ","","_","_"
5,"iva","_","_","iva","CCM","","_","_"
6,"pāvakaḥ","_","_","pāvaka","NC","","_","_"
1,"na","_","_","na","CNG","","_","_"
2,"_","_","_","ca","CCD","","_","_"
3,"_","_","_","a","PRD","","_","_"
4,"pāṇḍaveyānāṃ","_","_","pāṇḍaveya","NC","","_","_"
5,"_","_","_","kiṃcit","PRI","","_","_"
6,"_","_","_","śakn","V","śak","_","_"
7,"nirīkṣitum","_","_","nirīkṣ","CGDI","","_","_"
1,"uttaraṃ","_","_","uttara","JJ","","_","_"
2,"mārgam","_","_","mārga","NC","","_","_"
3,"āsthāya","_","_","āsthā","CGDA","","_","_"
4,"tapantam","_","_","tap","KDP","","_","_"
5,"iva","_","_","iva","CCM","","_","_"
6,"bhāskaram","_","_","bhāskara","NC","","_","_"
1,"te","_","_","tad","PRD","","_","_"
2,"pāṇḍaveyāḥ","_","_","pāṇḍaveya","NC","","_","_"
3,"saṃrabdhā","_","_","saṃrabh","PPP","","_","_"
4,"_","_","_","mahat","JJ","","_","_"
5,"_","_","_","iṣvāsa","NC","","_","_"
6,"pīḍitāḥ","_","_","pīḍay","PPP","","_","_"
1,"_","_","_","vadha","NC","","_","_"
2,"_","_","_","abhidru","V","abhidru","_","_"
3,"bhīṣmaṃ","_","_","bhīṣma","NC","","_","_"
4,"_","_","_","sṛñjaya","NC","","_","_"
5,"_","_","_","ca","CCD","","_","_"
6,"_","_","_","mahat","JJ","","_","_"
7,"_","_","_","ratha","NC","","_","_"
1,"sa","_","_","tad","PRD","","_","_"
2,"yudhyamāno","_","_","yudh","KDP","","_","_"
3,"bahubhir","_","_","bahu","JJ","","_","_"
4,"bhīṣmaḥ","_","_","bhīṣma","NC","","_","_"
5,"_","_","_","śāṃtanava","NC","","_","_"
6,"_","_","_","tadā","CAD","","_","_"
1,"avakīrṇo","_","_","avakṛ","PPP","","_","_"
2,"_","_","_","mahat","JJ","","_","_"
3,"_","_","_","bāhu","NC","","_","_"
4,"śailo","_","_","śaila","NC","","_","_"
5,"meghair","_","_","megha","NC","","_","_"
6,"_","_","_","iva","CCM","","_","_"
7,"_","_","_","asita","JJ","","_","_"
1,"_","_","_","putra","NC","","_","_"
2,"_","_","_","tu","CCD","","_","_"
3,"tava","_","_","tvat","PPR","","_","_"
4,"gāṅgeyaṃ","_","_","gāṅgeya","NC","","_","_"
5,"samantāt","_","_","samantāt","CX","","_","_"
6,"paryavārayan","_","_","parivāray","V","parivāray","_","_"
1,"mahatyā","_","_","mahat","JJ","","_","_"
2,"senayā","_","_","senā","NC","","_","_"
3,"sārdhaṃ","_","_","sārdha","CX","","_","_"
4,"tato","_","_","tatas","CX","","_","_"
5,"yuddham","_","_","yuddha","NC","","_","_"
6,"avartata","_","_","vart","V","vṛt","_","_"
