"WordID","word","NormSTEM","suffix","lemma","PoS","Root","NormSuffix","NormWord"
1,"vajro","_","_","vajra","NC","","_","_"
2,"vā","_","_","vai","CX","","_","_"
3,"eṣa","_","_","tad","PRD","","_","_"
4,"yad","_","_","yad","PRL","","_","_"
5,"vaṣaṭkāro","_","_","vaṣaṭkāra","NC","","_","_"
6,"yaṃ","_","_","yad","PRL","","_","_"
7,"dviṣyāt","_","_","dviṣ","V","dviṣ","_","_"
8,"taṃ","_","_","tad","PRD","","_","_"
9,"dhyāyed","_","_","dhyāy","V","dhyai","_","_"
10,"vaṣaṭkariṣyaṃs","_","_","vaṣaṭkṛ","KDP","","_","_"
11,"tasminn","_","_","tad","PRD","","_","_"
12,"eva","_","_","eva","CEM","","_","_"
13,"taṃ","_","_","tad","PRD","","_","_"
14,"vajram","_","_","vajra","NC","","_","_"
15,"āsthāpayati","_","_","ātiṣṭh","V","āsthā","_","_"
1,"ṣaﾱ","_","_","ṣaṣ","NUM","","_","_"
2,"iti","_","_","iti","CQT","","_","_"
3,"vaṣaṭkaroti","_","_","vaṣaṭkṛ","V","vaṣaṭkṛ","_","_"
4,"ṣaḍ","_","_","ṣaṣ","NUM","","_","_"
5,"vā","_","_","vai","CX","","_","_"
6,"ṛtava","_","_","ṛtu","NC","","_","_"
7,"ṛtūn","_","_","ṛtu","NC","","_","_"
8,"eva","_","_","eva","CEM","","_","_"
9,"tat","_","_","tad","PRD","","_","_"
10,"kalpayaty","_","_","kalp","V","kḷp","_","_"
11,"ṛtūn","_","_","ṛtu","NC","","_","_"
12,"pratiṣṭhāpayaty","_","_","pratitiṣṭh","V","pratisthā","_","_"
13,"ṛtūn","_","_","ṛtu","NC","","_","_"
14,"vai","_","_","vai","CX","","_","_"
15,"pratitiṣṭhata","_","_","pratiṣṭhā","KDP","","_","_"
16,"idaṃ","_","_","ida","PRD","","_","_"
17,"sarvam","_","_","sarva","JQ","","_","_"
18,"anupratitiṣṭhati","_","_","anupratiṣṭhā","V","anupratiṣṭhā","_","_"
19,"yad","_","_","yad","PRL","","_","_"
20,"idaṃ","_","_","ida","PRD","","_","_"
21,"kiṃca","_","_","kiṃca","CX","","_","_"
1,"pratitiṣṭhati","_","_","prastha","V","pratiṣṭhā","_","_"
2,"ya","_","_","yad","PRL","","_","_"
3,"evaṃ","_","_","eva","CX","","_","_"
4,"veda","_","_","vid","V","vid","_","_"
1,"tad","_","_","tad","PRD","","_","_"
2,"u","_","_","u","CEM","","_","_"
3,"ha","_","_","ha","CEM","","_","_"
4,"_","_","_","sma","CX","","_","_"
5,"_","_","_","ah","V","ah","_","_"
6,"hiraṇyadan","_","_","hiraṇyadat","NC","","_","_"
7,"baida","_","_","baida","NC","","_","_"
8,"etāni","_","_","tad","PRD","","_","_"
9,"vā","_","_","vā","CCD","","_","_"
10,"etena","_","_","tad","PRD","","_","_"
11,"ṣaṭ","_","_","ṣaṣ","NUM","","_","_"
12,"pratiṣṭhāpayati","_","_","pratitiṣṭh","V","pratisthā","_","_"
13,"dyaur","_","_","div","NC","","_","_"
14,"antarikṣe","_","_","antarikṣa","NC","","_","_"
15,"_","_","_","pratiṣṭhā","PPP","","_","_"
16,"_","_","_","antarikṣa","NC","","_","_"
17,"pṛthivyām","_","_","pṛthivī","NC","","_","_"
18,"pṛthivy","_","_","pṛthivī","NC","","_","_"
19,"apsv","_","_","ap","NC","","_","_"
20,"āpaḥ","_","_","ap","NC","","_","_"
21,"satye","_","_","satya","NC","","_","_"
22,"satyam","_","_","satya","NC","","_","_"
23,"brahmaṇi","_","_","brahman","NC","","_","_"
24,"brahma","_","_","brahman","NC","","_","_"
25,"_","_","_","tapas","NC","","_","_"
26,"_","_","_","iti","CQT","","_","_"
27,"etā","_","_","tad","PRD","","_","_"
28,"eva","_","_","eva","CEM","","_","_"
29,"tat","_","_","tad","PRD","","_","_"
30,"pratiṣṭhāḥ","_","_","pratiṣṭhā","NC","","_","_"
31,"pratitiṣṭhantīr","_","_","pratiṣṭhā","KDP","","_","_"
32,"idaṃ","_","_","ida","PRD","","_","_"
33,"sarvam","_","_","sarva","JQ","","_","_"
34,"anupratitiṣṭhati","_","_","anupratiṣṭhā","V","anupratiṣṭhā","_","_"
35,"yad","_","_","yad","PRL","","_","_"
36,"idaṃ","_","_","ida","PRD","","_","_"
37,"kiṃca","_","_","kiṃca","CX","","_","_"
38,"pratitiṣṭhati","_","_","prastha","V","pratiṣṭhā","_","_"
39,"ya","_","_","yad","PRL","","_","_"
40,"evaṃ","_","_","eva","CX","","_","_"
41,"veda","_","_","vid","V","vid","_","_"
1,"vauṣaﾱ","_","_","vauṣaṭ","CX","","_","_"
2,"iti","_","_","iti","CQT","","_","_"
3,"vaṣaṭkaroty","_","_","vaṣaṭkṛ","V","vaṣaṭkṛ","_","_"
4,"asau","_","_","adas","PRD","","_","_"
5,"vāva","_","_","vāva","CX","","_","_"
6,"vāv","_","_","vau","CX","","_","_"
7,"ṛtavaḥ","_","_","ṛtu","NC","","_","_"
8,"ṣaﾱ","_","_","ṣaṣ","NUM","","_","_"
9,"etam","_","_","tad","PRD","","_","_"
10,"eva","_","_","eva","CEM","","_","_"
11,"tad","_","_","tad","PRD","","_","_"
12,"ṛtuṣv","_","_","ṛtu","NC","","_","_"
13,"ādadhāty","_","_","ādadh","V","ādhā","_","_"
14,"ṛtuṣu","_","_","ṛtu","NC","","_","_"
15,"pratiṣṭhāpayati","_","_","pratitiṣṭh","V","pratisthā","_","_"
16,"yādṛg","_","_","yādṛś","JJ","","_","_"
17,"iva","_","_","iva","CCM","","_","_"
18,"vai","_","_","vai","CX","","_","_"
19,"devebhyaḥ","_","_","deva","NC","","_","_"
20,"karoti","_","_","kar","V","kṛ","_","_"
21,"tādṛg","_","_","tādṛś","JJ","","_","_"
22,"_","_","_","iva","CCM","","_","_"
23,"_","_","_","ida","PRD","","_","_"
24,"devāḥ","_","_","deva","NC","","_","_"
25,"kurvanti","_","_","kar","V","kṛ","_","_"
