"WordID","word","NormSTEM","suffix","lemma","PoS","Root","NormSuffix","NormWord"
1,"kapila","_","_","kapila","NC","","_","_"
2,"uvāca","_","_","vak","V","vac","_","_"
1,"vedāḥ","_","_","veda","NC","","_","_"
2,"pramāṇaṃ","_","_","pramāṇa","NC","","_","_"
3,"lokānāṃ","_","_","loka","NC","","_","_"
4,"na","_","_","na","CNG","","_","_"
5,"vedāḥ","_","_","veda","NC","","_","_"
6,"_","_","_","pṛṣṭhatas","CX","","_","_"
7,"_","_","_","kṛ","PPP","","_","_"
1,"dve","_","_","dvi","NUM","","_","_"
2,"brahmaṇī","_","_","brahman","NC","","_","_"
3,"veditavye","_","_","vid","KDG","","_","_"
4,"śabdabrahma","_","_","śabdabrahman","NC","","_","_"
5,"paraṃ","_","_","para","PPX","","_","_"
6,"ca","_","_","ca","CCD","","_","_"
7,"yat","_","_","yad","PRL","","_","_"
1,"śabdabrahmaṇi","_","_","śabdabrahman","NC","","_","_"
2,"niṣṇātaḥ","_","_","niṣṇāta","JJ","","_","_"
3,"paraṃ","_","_","para","PPX","","_","_"
4,"_","_","_","brahman","NC","","_","_"
5,"_","_","_","adhiga","V","adhiga","_","_"
1,"śarīram","_","_","śarīra","NC","","_","_"
2,"etat","_","_","tad","PRD","","_","_"
3,"kurute","_","_","kar","V","kṛ","_","_"
4,"yad","_","_","yad","PRL","","_","_"
5,"vede","_","_","veda","NC","","_","_"
6,"kurute","_","_","kar","V","kṛ","_","_"
7,"tanum","_","_","tanu","NC","","_","_"
1,"_","_","_","kṛ","PPP","","_","_"
2,"_","_","_","śudh","PPP","","_","_"
3,"_","_","_","śarīra","NC","","_","_"
4,"hi","_","_","hi","CX","","_","_"
5,"pātraṃ","_","_","pātra","NC","","_","_"
6,"bhavati","_","_","bhav","V","bhū","_","_"
7,"brāhmaṇaḥ","_","_","brāhmaṇa","NC","","_","_"
1,"ānantyam","_","_","ānantya","NC","","_","_"
2,"anuyuṅkte","_","_","anuyuj","V","anuyuj","_","_"
3,"yaḥ","_","_","yad","PRL","","_","_"
4,"karmaṇā","_","_","karman","NC","","_","_"
5,"tad","_","_","tad","PRD","","_","_"
6,"bravīmi","_","_","abravīta","V","brū","_","_"
7,"te","_","_","tvat","PPR","","_","_"
1,"nirāgamam","_","_","nirāgama","JJ","","_","_"
2,"anaitihyaṃ","_","_","anaitihya","JJ","","_","_"
3,"pratyakṣaṃ","_","_","pratyakṣa","JJ","","_","_"
4,"_","_","_","loka","NC","","_","_"
5,"_","_","_","sākṣika","NC","","_","_"
1,"dharma","_","_","dharma","NC","","_","_"
2,"_","_","_","iti","CQT","","_","_"
3,"_","_","_","eva","CEM","","_","_"
4,"ye","_","_","yad","PRL","","_","_"
5,"yajñān","_","_","yajña","NC","","_","_"
6,"vitanvanti","_","_","vitan","V","vitan","_","_"
1,"_","_","_","utpad","PPP","","_","_"
2,"_","_","_","tyāgin","JJ","","_","_"
3,"'lubdhāḥ","_","_","alubdha","JJ","","_","_"
4,"_","_","_","kṛpā","NC","","_","_"
5,"_","_","_","asūyā","NC","","_","_"
6,"_","_","_","vivarjay","PPP","","_","_"
1,"dhanānām","_","_","dhana","NC","","_","_"
2,"eṣa","_","_","tad","PRD","","_","_"
3,"vai","_","_","vai","CX","","_","_"
4,"_","_","_","pathin","NC","","_","_"
5,"_","_","_","tīrtha","NC","","_","_"
6,"pratipādanam","_","_","pratipādana","NC","","_","_"
1,"anāśritāḥ","_","_","anāśrita","JJ","","_","_"
2,"_","_","_","pāpa","NC","","_","_"
3,"_","_","_","kṛtya","NC","","_","_"
4,"kadācit","_","_","kadācid","CX","","_","_"
5,"_","_","_","karman","NC","","_","_"
6,"_","_","_","yoni","NC","","_","_"
1,"_","_","_","manas","NC","","_","_"
2,"_","_","_","saṃkalpa","NC","","_","_"
3,"_","_","_","saṃsidh","PPP","","_","_"
4,"_","_","_","viśudh","PPP","","_","_"
5,"_","_","_","jñāna","NC","","_","_"
6,"_","_","_","niścaya","NC","","_","_"
1,"akrudhyanto","_","_","akrudhyat","JJ","","_","_"
2,"'nasūyanto","_","_","anasūyat","JJ","","_","_"
3,"_","_","_","nirahaṃkāra","JJ","","_","_"
4,"_","_","_","matsara","NC","","_","_"
1,"_","_","_","jñāna","NC","","_","_"
2,"_","_","_","niṣṭhā","NC","","_","_"
3,"_","_","_","tri","NUM","","_","_"
4,"_","_","_","śukla","JJ","","_","_"
5,"_","_","_","ca","CCD","","_","_"
6,"_","_","_","sarva","JQ","","_","_"
7,"_","_","_","bhūta","NC","","_","_"
8,"_","_","_","hita","NC","","_","_"
9,"ratāḥ","_","_","ra","PPP","","_","_"
1,"āsan","_","_","as","V","as","_","_"
2,"gṛhasthā","_","_","gṛhastha","NC","","_","_"
3,"bhūyiṣṭham","_","_","bhūyiṣṭha","JJ","","_","_"
4,"a","_","_","alpha_privativum","JJ","","_","_"
4,"avyutkrāntāḥ","_","_","vyutkrānta","JJ","","_","_"
5,"_","_","_","sva","JJ","","_","_"
6,"_","_","_","karman","NC","","_","_"
1,"_","_","_","rājan","NC","","_","_"
2,"_","_","_","ca","CCD","","_","_"
3,"tathā","_","_","tathā","CX","","_","_"
4,"yuktā","_","_","yuj","PPP","","_","_"
5,"_","_","_","brāhmaṇa","NC","","_","_"
6,"_","_","_","ca","CCD","","_","_"
7,"yathāvidhi","_","_","yathāvidhi","CX","","_","_"
1,"samā","_","_","sama","PPX","","_","_"
2,"_","_","_","hi","CX","","_","_"
3,"_","_","_","ārjava","NC","","_","_"
4,"_","_","_","sampad","PPP","","_","_"
5,"saṃtuṣṭā","_","_","saṃtuṣ","PPP","","_","_"
6,"_","_","_","jñāna","NC","","_","_"
7,"_","_","_","niścaya","NC","","_","_"
1,"_","_","_","pratyakṣa","JJ","","_","_"
2,"_","_","_","dharma","NC","","_","_"
3,"śucayaḥ","_","_","śuci","JJ","","_","_"
4,"śraddadhānāḥ","_","_","śraddhā","KDP","","_","_"
5,"parāvare","_","_","parāvara","NC","","_","_"
1,"purastād","_","_","purastāt","CX","","_","_"
2,"bhāvitātmāno","_","_","bhāvitātman","JJ","","_","_"
3,"_","_","_","yathāvat","CX","","_","_"
4,"_","_","_","car","PPP","","_","_"
5,"_","_","_","vrata","NC","","_","_"
1,"caranti","_","_","car","V","car","_","_"
2,"dharmaṃ","_","_","dharma","NC","","_","_"
3,"kṛcchre","_","_","kṛcchra","NC","","_","_"
4,"'pi","_","_","api","CX","","_","_"
5,"durge","_","_","durga","NC","","_","_"
6,"_","_","_","ca","CCD","","_","_"
7,"_","_","_","eva","CEM","","_","_"
8,"_","_","_","ādhi","NC","","_","_"
9,"_","_","_","saṃhan","PPP","","_","_"
1,"saṃhatya","_","_","saṃhan","CGDA","","_","_"
2,"dharmaṃ","_","_","dharma","NC","","_","_"
3,"caratāṃ","_","_","car","KDP","","_","_"
4,"_","_","_","purā","CX","","_","_"
5,"_","_","_","as","V","as","_","_"
6,"sukham","_","_","sukha","NC","","_","_"
7,"eva","_","_","eva","CEM","","_","_"
8,"tat","_","_","tad","PRD","","_","_"
1,"teṣāṃ","_","_","tad","PRD","","_","_"
2,"_","_","_","na","CNG","","_","_"
3,"_","_","_","as","V","as","_","_"
4,"vidhātavyaṃ","_","_","vidhā","KDG","","_","_"
5,"prāyaścittaṃ","_","_","prāyaścitta","NC","","_","_"
6,"kadācana","_","_","kadācana","CX","","_","_"
1,"satyaṃ","_","_","satya","JJ","","_","_"
2,"hi","_","_","hi","CX","","_","_"
3,"dharmam","_","_","dharma","NC","","_","_"
4,"āsthāya","_","_","āsthā","CGDA","","_","_"
5,"durādharṣatamā","_","_","durādharṣatama","JJ","","_","_"
6,"matāḥ","_","_","man","PPP","","_","_"
1,"na","_","_","na","CNG","","_","_"
2,"mātrām","_","_","mātrā","NC","","_","_"
3,"anurudhyante","_","_","anurudh","V","anurudh","_","_"
4,"na","_","_","na","CNG","","_","_"
5,"_","_","_","dharma","NC","","_","_"
6,"_","_","_","chala","NC","","_","_"
7,"antataḥ","_","_","antatas","CX","","_","_"
1,"ya","_","_","yad","PRL","","_","_"
2,"eva","_","_","eva","CEM","","_","_"
3,"prathamaḥ","_","_","prathama","JJ","","_","_"
4,"_","_","_","kalpa","NC","","_","_"
5,"_","_","_","tad","PRD","","_","_"
6,"_","_","_","eva","CEM","","_","_"
7,"_","_","_","abhyācar","V","abhyācar","_","_"
8,"saha","_","_","saha","CX","","_","_"
1,"asyāṃ","_","_","ida","PRD","","_","_"
2,"sthitau","_","_","sthiti","NC","","_","_"
3,"sthitānāṃ","_","_","sthā","PPP","","_","_"
4,"hi","_","_","hi","CX","","_","_"
5,"prāyaścittaṃ","_","_","prāyaścitta","NC","","_","_"
6,"na","_","_","na","CNG","","_","_"
7,"vidyate","_","_","vid","V","vid","_","_"
1,"_","_","_","durbala","JJ","","_","_"
2,"_","_","_","ātman","NC","","_","_"
3,"utpannaṃ","_","_","utpad","PPP","","_","_"
4,"prāyaścittam","_","_","prāyaścitta","NC","","_","_"
5,"iti","_","_","iti","CQT","","_","_"
6,"śrutiḥ","_","_","śruti","NC","","_","_"
1,"yata","_","_","yatas","CX","","_","_"
2,"evaṃvidhā","_","_","evaṃvidha","JJ","","_","_"
3,"viprāḥ","_","_","vipra","NC","","_","_"
4,"purāṇā","_","_","purāṇa","JJ","","_","_"
5,"_","_","_","yajña","NC","","_","_"
6,"_","_","_","vāhana","JJ","","_","_"
1,"_","_","_","traividya","NC","","_","_"
2,"_","_","_","vṛdh","PPP","","_","_"
3,"śucayo","_","_","śuci","JJ","","_","_"
4,"vṛttavanto","_","_","vṛttavat","JJ","","_","_"
5,"yaśasvinaḥ","_","_","yaśasvin","JJ","","_","_"
1,"yajanto","_","_","yaj","KDP","","_","_"
2,"'har","_","_","ahar","NC","","_","_"
3,"ahar","_","_","ahar","NC","","_","_"
4,"yajñair","_","_","yajña","NC","","_","_"
5,"nirāśīrbandhanā","_","_","budha","JJ","","_","_"
1,"teṣāṃ","_","_","tad","PRD","","_","_"
2,"_","_","_","yajña","NC","","_","_"
3,"_","_","_","ca","CCD","","_","_"
4,"_","_","_","veda","NC","","_","_"
5,"_","_","_","ca","CCD","","_","_"
6,"karmāṇi","_","_","karman","NC","","_","_"
7,"ca","_","_","ca","CCD","","_","_"
8,"yathāgamam","_","_","yathāgama","JJ","","_","_"
1,"_","_","_","āgama","NC","","_","_"
2,"_","_","_","ca","CCD","","_","_"
3,"yathākālaṃ","_","_","yathākāla","CX","","_","_"
4,"_","_","_","saṃkalpa","NC","","_","_"
5,"_","_","_","ca","CCD","","_","_"
6,"_","_","_","yathā","CCM","","_","_"
7,"_","_","_","vrata","NC","","_","_"
1,"_","_","_","ape","PPP","","_","_"
2,"_","_","_","kāma","NC","","_","_"
3,"_","_","_","krodha","NC","","_","_"
4,"prakṛtyā","_","_","prakṛti","NC","","_","_"
5,"_","_","_","saṃśita","JJ","","_","_"
6,"_","_","_","ātman","NC","","_","_"
1,"ṛjūnāṃ","_","_","ṛju","JJ","","_","_"
2,"_","_","_","śama","NC","","_","_"
3,"_","_","_","nitya","JJ","","_","_"
4,"sthitānāṃ","_","_","sthā","PPP","","_","_"
5,"sveṣu","_","_","sva","JJ","","_","_"
6,"karmasu","_","_","karman","NC","","_","_"
1,"sarvam","_","_","sarva","JQ","","_","_"
2,"ānantyam","_","_","ānantya","NC","","_","_"
3,"_","_","_","eva","CEM","","_","_"
4,"_","_","_","as","V","as","_","_"
5,"iti","_","_","iti","CQT","","_","_"
6,"naḥ","_","_","mat","PPR","","_","_"
7,"śāśvatī","_","_","śāśvata","JJ","","_","_"
8,"śrutiḥ","_","_","śruti","NC","","_","_"
1,"teṣām","_","_","tad","PRD","","_","_"
2,"_","_","_","adīna","JJ","","_","_"
3,"_","_","_","sattva","NC","","_","_"
4,"_","_","_","duścara","JJ","","_","_"
5,"_","_","_","ācāra","NC","","_","_"
6,"_","_","_","karman","NC","","_","_"
1,"_","_","_","sva","JJ","","_","_"
2,"_","_","_","karman","NC","","_","_"
3,"saṃvṛtānāṃ","_","_","saṃvṛ","PPP","","_","_"
4,"tapo","_","_","tapas","NC","","_","_"
5,"_","_","_","ghora","JJ","","_","_"
7,"āgatam","_","_","āga","PPP","","_","_"
1,"taṃ","_","_","tad","PRD","","_","_"
2,"_","_","_","sat","JJ","","_","_"
3,"_","_","_","ācāra","NC","","_","_"
4,"āścaryaṃ","_","_","āścarya","JJ","","_","_"
5,"purāṇaṃ","_","_","purāṇa","JJ","","_","_"
6,"śāśvataṃ","_","_","śāśvata","JJ","","_","_"
7,"dhruvam","_","_","dhruva","CX","","_","_"
1,"_","_","_","aśaknuvat","JJ","","_","_"
2,"_","_","_","car","CGDI","","_","_"
3,"kiṃcid","_","_","kiṃcit","PRI","","_","_"
4,"dharmeṣu","_","_","dharma","NC","","_","_"
5,"sūcitam","_","_","sūcay","PPP","","_","_"
1,"_","_","_","nirāpad","NC","","_","_"
2,"_","_","_","dharma","NC","","_","_"
3,"_","_","_","ācāra","NC","","_","_"
4,"_","_","_","tu","CCD","","_","_"
5,"_","_","_","apramāda","NC","","_","_"
6,"a","_","_","alpha_privativum","NC","","_","_"
6,"'parābhavaḥ","_","_","parābhava","NC","","_","_"
1,"_","_","_","sarva","JQ","","_","_"
2,"_","_","_","varṇa","NC","","_","_"
3,"yat","_","_","yat","CSB","","_","_"
4,"teṣu","_","_","tad","PRD","","_","_"
5,"_","_","_","na","CNG","","_","_"
6,"_","_","_","as","V","as","_","_"
7,"kaścid","_","_","kiṃcit","PRI","","_","_"
8,"vyatikramaḥ","_","_","vyatikrama","NC","","_","_"
1,"dharmam","_","_","dharma","NC","","_","_"
2,"ekaṃ","_","_","eka","PPX","","_","_"
3,"catuṣpādam","_","_","catuṣpāda","JJ","","_","_"
4,"_","_","_","āśri","PPP","","_","_"
5,"_","_","_","tad","PRD","","_","_"
6,"_","_","_","nara","NC","","_","_"
7,"_","_","_","ṛṣabha","NC","","_","_"
1,"taṃ","_","_","tad","PRD","","_","_"
2,"santo","_","_","as","KDP","","_","_"
3,"vidhivat","_","_","vidhivat","CX","","_","_"
4,"prāpya","_","_","prāp","CGDA","","_","_"
5,"gacchanti","_","_","gacch","V","gam","_","_"
6,"paramāṃ","_","_","parama","JJ","","_","_"
7,"gatim","_","_","gati","NC","","_","_"
1,"gṛhebhya","_","_","gṛha","NC","","_","_"
2,"eva","_","_","eva","CEM","","_","_"
3,"niṣkramya","_","_","niṣkra","CGDA","","_","_"
4,"vanam","_","_","vana","NC","","_","_"
5,"anye","_","_","anya","PPX","","_","_"
6,"samāśritāḥ","_","_","samāśri","PPP","","_","_"
1,"gṛham","_","_","gṛha","NC","","_","_"
2,"_","_","_","eva","CEM","","_","_"
3,"_","_","_","abhisaṃśri","CGDA","","_","_"
4,"tato","_","_","tatas","CX","","_","_"
5,"'nye","_","_","anya","PPX","","_","_"
6,"brahmacāriṇaḥ","_","_","brahmacārin","NC","","_","_"
1,"dharmam","_","_","dharma","NC","","_","_"
2,"etaṃ","_","_","tad","PRD","","_","_"
3,"catuṣpādam","_","_","catuṣpāda","JJ","","_","_"
4,"āśramaṃ","_","_","āśrama","NC","","_","_"
5,"brāhmaṇā","_","_","brāhmaṇa","NC","","_","_"
6,"viduḥ","_","_","vid","V","vid","_","_"
1,"ānantyaṃ","_","_","ānantya","NC","","_","_"
2,"brahmaṇaḥ","_","_","brahman","NC","","_","_"
3,"sthānaṃ","_","_","sthāna","NC","","_","_"
4,"brāhmaṇā","_","_","brāhmaṇa","NC","","_","_"
5,"nāma","_","_","nāma","CX","","_","_"
6,"niścayaḥ","_","_","niścaya","NC","","_","_"
1,"ata","_","_","atas","CX","","_","_"
2,"evaṃvidhā","_","_","evaṃvidha","JJ","","_","_"
3,"viprāḥ","_","_","vipra","NC","","_","_"
4,"purāṇā","_","_","purāṇa","JJ","","_","_"
5,"_","_","_","dharma","NC","","_","_"
6,"_","_","_","cārin","JJ","","_","_"
1,"ta","_","_","tad","PRD","","_","_"
2,"ete","_","_","tad","PRD","","_","_"
3,"divi","_","_","div","NC","","_","_"
4,"dṛśyante","_","_","darś","V","dṛś","_","_"
5,"_","_","_","jyotis","NC","","_","_"
6,"_","_","_","bhū","PPP","","_","_"
7,"dvijātayaḥ","_","_","dvijāti","NC","","_","_"
1,"_","_","_","nakṣatra","NC","","_","_"
2,"_","_","_","iva","CCM","","_","_"
3,"dhiṣṇyeṣu","_","_","dhiṣṇya","NC","","_","_"
4,"_","_","_","bahu","JJ","","_","_"
5,"_","_","_","tārakā","NC","","_","_"
6,"_","_","_","gaṇa","NC","","_","_"
1,"ānantyam","_","_","ānantya","NC","","_","_"
2,"upasaṃprāptāḥ","_","_","upasaṃprāp","PPP","","_","_"
3,"saṃtoṣād","_","_","saṃtoṣa","NC","","_","_"
4,"iti","_","_","iti","CQT","","_","_"
5,"vaidikam","_","_","vaidika","JJ","","_","_"
1,"_","_","_","yadi","CSB","","_","_"
2,"_","_","_","āga","V","āga","_","_"
3,"saṃsāraṃ","_","_","saṃsāra","NC","","_","_"
4,"punar","_","_","punar","CAD","","_","_"
5,"yoniṣu","_","_","yoni","NC","","_","_"
6,"tādṛśāḥ","_","_","tādṛśa","JJ","","_","_"
1,"na","_","_","na","CNG","","_","_"
2,"lipyante","_","_","lip","V","lip","_","_"
3,"_","_","_","pāpa","NC","","_","_"
4,"_","_","_","kṛtya","NC","","_","_"
5,"kadācit","_","_","kadācid","CX","","_","_"
6,"_","_","_","karman","NC","","_","_"
7,"_","_","_","yoni","NC","","_","_"
1,"evaṃ","_","_","eva","CX","","_","_"
2,"yukto","_","_","yuj","PPP","","_","_"
3,"brāhmaṇaḥ","_","_","brāhmaṇa","NC","","_","_"
4,"syād","_","_","as","V","as","_","_"
5,"anyo","_","_","anya","PPX","","_","_"
6,"brāhmaṇako","_","_","brāhmaṇaka","NC","","_","_"
7,"bhavet","_","_","bhav","V","bhū","_","_"
1,"_","_","_","karman","NC","","_","_"
2,"_","_","_","eva","CEM","","_","_"
3,"_","_","_","puruṣa","NC","","_","_"
4,"_","_","_","ah","V","ah","_","_"
5,"śubhaṃ","_","_","śubha","JJ","","_","_"
6,"vā","_","_","vā","CCD","","_","_"
7,"yadi","_","_","yadi","CSB","","_","_"
8,"_","_","_","vā","CCD","","_","_"
9,"_","_","_","aśubha","JJ","","_","_"
1,"evaṃ","_","_","eva","CX","","_","_"
2,"_","_","_","pakva","JJ","","_","_"
3,"_","_","_","kaṣāya","NC","","_","_"
4,"ānantyena","_","_","ānantya","NC","","_","_"
5,"śrutena","_","_","śruta","NC","","_","_"
6,"ca","_","_","ca","CCD","","_","_"
1,"sarvam","_","_","sarva","JQ","","_","_"
2,"ānantyam","_","_","ānantya","NC","","_","_"
3,"_","_","_","eva","CEM","","_","_"
4,"_","_","_","as","V","as","_","_"
5,"evaṃ","_","_","eva","CX","","_","_"
6,"naḥ","_","_","mat","PPR","","_","_"
7,"śāśvatī","_","_","śāśvata","JJ","","_","_"
8,"śrutiḥ","_","_","śruti","NC","","_","_"
1,"teṣām","_","_","tad","PRD","","_","_"
2,"_","_","_","ape","PPP","","_","_"
3,"_","_","_","tṛṣṇā","NC","","_","_"
4,"nirṇiktānāṃ","_","_","nirṇij","PPP","","_","_"
5,"_","_","_","śubha","JJ","","_","_"
6,"_","_","_","ātman","NC","","_","_"
1,"caturtha","_","_","caturtha","JJ","","_","_"
2,"aupaniṣado","_","_","aupaniṣada","JJ","","_","_"
3,"dharmaḥ","_","_","dharma","NC","","_","_"
4,"sādhāraṇaḥ","_","_","sādhāraṇa","JJ","","_","_"
5,"smṛtaḥ","_","_","smṛ","PPP","","_","_"
1,"sa","_","_","tad","PRD","","_","_"
2,"siddhaiḥ","_","_","siddha","JJ","","_","_"
3,"sādhyate","_","_","sādh","V","sādh","_","_"
4,"nityaṃ","_","_","nitya","CX","","_","_"
5,"brāhmaṇair","_","_","brāhmaṇa","NC","","_","_"
6,"_","_","_","niya","PPP","","_","_"
7,"_","_","_","ātman","NC","","_","_"
1,"_","_","_","saṃtoṣa","NC","","_","_"
2,"_","_","_","mūla","NC","","_","_"
3,"_","_","_","tyāga","NC","","_","_"
4,"_","_","_","ātman","NC","","_","_"
5,"_","_","_","jñāna","NC","","_","_"
6,"_","_","_","adhiṣṭhāna","NC","","_","_"
7,"ucyate","_","_","vak","V","vac","_","_"
1,"_","_","_","apavarga","NC","","_","_"
2,"_","_","_","gati","NC","","_","_"
3,"nityo","_","_","nitya","JJ","","_","_"
4,"_","_","_","yati","NC","","_","_"
5,"_","_","_","dharma","NC","","_","_"
6,"sanātanaḥ","_","_","sanātana","JJ","","_","_"
1,"sādhāraṇaḥ","_","_","sādhāraṇa","JJ","","_","_"
2,"kevalo","_","_","kevala","JJ","","_","_"
3,"vā","_","_","vā","CCD","","_","_"
4,"yathābalam","_","_","yathābala","CX","","_","_"
5,"upāsyate","_","_","upās","V","upās","_","_"
1,"gacchato","_","_","ga","KDP","","_","_"
2,"gacchataḥ","_","_","ga","KDP","","_","_"
3,"kṣemaṃ","_","_","kṣema","NC","","_","_"
4,"durbalo","_","_","durbala","JJ","","_","_"
5,"_","_","_","atra","CAD","","_","_"
6,"_","_","_","avasīd","V","avasad","_","_"
1,"brahmaṇaḥ","_","_","brahman","NC","","_","_"
2,"padam","_","_","pada","NC","","_","_"
3,"anvicchan","_","_","anviṣ","KDP","","_","_"
4,"_","_","_","saṃsāra","NC","","_","_"
5,"_","_","_","muñc","V","muc","_","_"
6,"śuciḥ","_","_","śuci","JJ","","_","_"
1,"syūmaraśmir","_","_","syūmaraśmi","NC","","_","_"
2,"uvāca","_","_","vak","V","vac","_","_"
1,"ye","_","_","yad","PRL","","_","_"
2,"bhuñjate","_","_","bhuj","V","bhuj","_","_"
3,"ye","_","_","yad","PRL","","_","_"
4,"dadate","_","_","dad","V","dā","_","_"
5,"yajante","_","_","yaj","V","yaj","_","_"
6,"'dhīyate","_","_","adhye","V","adhī","_","_"
7,"ca","_","_","ca","CCD","","_","_"
8,"ye","_","_","yad","PRL","","_","_"
1,"mātrābhir","_","_","mātrā","NC","","_","_"
2,"_","_","_","dharma","NC","","_","_"
3,"_","_","_","labh","PPP","","_","_"
4,"ye","_","_","yad","PRL","","_","_"
5,"vā","_","_","vā","CCD","","_","_"
6,"tyāgaṃ","_","_","tyāga","NC","","_","_"
7,"samāśritāḥ","_","_","samāśri","PPP","","_","_"
1,"eteṣāṃ","_","_","tad","PRD","","_","_"
2,"pretyabhāve","_","_","pretyabhāva","NC","","_","_"
3,"tu","_","_","tu","CCD","","_","_"
4,"katamaḥ","_","_","katama","PRQ","","_","_"
5,"_","_","_","svarga","NC","","_","_"
6,"_","_","_","jittama","JJ","","_","_"
1,"etad","_","_","tad","PRD","","_","_"
2,"ācakṣva","_","_","cakṣ","V","cakṣ","_","_"
3,"me","_","_","mat","PPR","","_","_"
4,"brahman","_","_","brahman","NC","","_","_"
5,"yathātathyena","_","_","yathātathya","CX","","_","_"
6,"pṛcchataḥ","_","_","pracch","KDP","","_","_"
1,"kapila","_","_","kapila","NC","","_","_"
2,"uvāca","_","_","vak","V","vac","_","_"
1,"parigrahāḥ","_","_","parigraha","NC","","_","_"
2,"śubhāḥ","_","_","śubha","JJ","","_","_"
3,"sarve","_","_","sarva","JQ","","_","_"
4,"guṇato","_","_","guṇa","NC","","_","_"
5,"_","_","_","abhyudaya","NC","","_","_"
6,"_","_","_","ca","CCD","","_","_"
7,"ye","_","_","yad","PRL","","_","_"
1,"na","_","_","na","CNG","","_","_"
2,"tu","_","_","tu","CCD","","_","_"
3,"_","_","_","tyāga","NC","","_","_"
4,"_","_","_","sukha","NC","","_","_"
5,"prāptā","_","_","prāp","PPP","","_","_"
6,"etat","_","_","tad","PRD","","_","_"
7,"tvam","_","_","tvat","PPR","","_","_"
8,"api","_","_","api","CX","","_","_"
9,"paśyasi","_","_","paś","V","paś","_","_"
1,"syūmaraśmir","_","_","syūmaraśmi","NC","","_","_"
2,"uvāca","_","_","vak","V","vac","_","_"
1,"bhavanto","_","_","bhavat","JJ","","_","_"
2,"_","_","_","jñāna","NC","","_","_"
3,"_","_","_","niṣṭhā","NC","","_","_"
4,"vai","_","_","vai","CX","","_","_"
5,"gṛhasthāḥ","_","_","gṛhastha","NC","","_","_"
6,"_","_","_","karman","NC","","_","_"
7,"_","_","_","niścaya","NC","","_","_"
1,"āśramāṇāṃ","_","_","āśrama","NC","","_","_"
2,"ca","_","_","ca","CCD","","_","_"
3,"sarveṣāṃ","_","_","sarva","JQ","","_","_"
4,"niṣṭhāyām","_","_","niṣṭhā","NC","","_","_"
5,"aikyam","_","_","aikya","NC","","_","_"
6,"ucyate","_","_","vak","V","vac","_","_"
1,"ekatve","_","_","ekatva","NC","","_","_"
2,"ca","_","_","ca","CCD","","_","_"
3,"pṛthaktve","_","_","pṛthaktva","NC","","_","_"
4,"ca","_","_","ca","CCD","","_","_"
5,"viśeṣo","_","_","viśeṣa","NC","","_","_"
6,"_","_","_","na","CNG","","_","_"
7,"_","_","_","anya","PPX","","_","_"
8,"ucyate","_","_","vak","V","vac","_","_"
1,"tad","_","_","tad","PRD","","_","_"
2,"yathāvad","_","_","yathāvat","CX","","_","_"
3,"yathānyāyaṃ","_","_","yathānyāya","CX","","_","_"
4,"bhagavān","_","_","bhagavat","JJ","","_","_"
5,"prabravītu","_","_","prabrū","V","prabrū","_","_"
6,"me","_","_","mat","PPR","","_","_"
1,"kapila","_","_","kapila","NC","","_","_"
2,"uvāca","_","_","vak","V","vac","_","_"
1,"_","_","_","śarīra","NC","","_","_"
2,"_","_","_","pakti","NC","","_","_"
3,"karmāṇi","_","_","karman","NC","","_","_"
4,"jñānaṃ","_","_","jñāna","NC","","_","_"
5,"tu","_","_","tu","CCD","","_","_"
6,"paramā","_","_","parama","JJ","","_","_"
7,"gatiḥ","_","_","gati","NC","","_","_"
1,"pakve","_","_","pakva","JJ","","_","_"
2,"kaṣāye","_","_","kaṣāya","NC","","_","_"
3,"vamanai","_","_","vamana","NC","","_","_"
4,"_","_","_","rasa","NC","","_","_"
5,"_","_","_","jñāna","NC","","_","_"
6,"na","_","_","na","CNG","","_","_"
7,"tiṣṭhati","_","_","tiṣṭh","V","sthā","_","_"
1,"ānṛśaṃsyaṃ","_","_","ānṛśaṃsya","NC","","_","_"
2,"kṣamā","_","_","kṣamā","NC","","_","_"
3,"śāntir","_","_","śānti","NC","","_","_"
4,"ahiṃsā","_","_","ahiṃsā","NC","","_","_"
5,"satyam","_","_","satya","NC","","_","_"
6,"ārjavam","_","_","ārjava","NC","","_","_"
1,"adroho","_","_","adroha","NC","","_","_"
2,"_","_","_","na","CNG","","_","_"
3,"_","_","_","abhimāna","NC","","_","_"
4,"_","_","_","ca","CCD","","_","_"
5,"_","_","_","hrī","NC","","_","_"
6,"_","_","_","titikṣā","NC","","_","_"
7,"_","_","_","śama","NC","","_","_"
8,"_","_","_","tathā","CX","","_","_"
1,"panthāno","_","_","pathin","NC","","_","_"
2,"_","_","_","brahman","NC","","_","_"
3,"_","_","_","tu","CCD","","_","_"
4,"_","_","_","tad","PRD","","_","_"
5,"etaiḥ","_","_","tad","PRD","","_","_"
6,"prāpnoti","_","_","prāpn","V","prāp","_","_"
7,"yat","_","_","yad","PRL","","_","_"
8,"param","_","_","para","PPX","","_","_"
1,"tad","_","_","tad","PRD","","_","_"
2,"vidvān","_","_","vidvas","JJ","","_","_"
3,"anubudhyeta","_","_","anubodh","V","anubudh","_","_"
4,"manasā","_","_","manas","NC","","_","_"
5,"_","_","_","karman","NC","","_","_"
6,"_","_","_","niścaya","NC","","_","_"
1,"yāṃ","_","_","yad","PRL","","_","_"
2,"viprāḥ","_","_","vipra","NC","","_","_"
3,"sarvataḥ","_","_","sarvatas","CX","","_","_"
4,"śāntā","_","_","śa","PPP","","_","_"
5,"viśuddhā","_","_","viśudh","PPP","","_","_"
6,"_","_","_","jñāna","NC","","_","_"
7,"_","_","_","niścaya","NC","","_","_"
1,"gatiṃ","_","_","gati","NC","","_","_"
2,"gacchanti","_","_","gacch","V","gam","_","_"
3,"_","_","_","saṃtuṣ","PPP","","_","_"
4,"_","_","_","tad","PRD","","_","_"
5,"āhuḥ","_","_","ah","V","ah","_","_"
6,"paramāṃ","_","_","parama","JJ","","_","_"
7,"gatim","_","_","gati","NC","","_","_"
1,"_","_","_","veda","NC","","_","_"
2,"_","_","_","ca","CCD","","_","_"
3,"veditavyaṃ","_","_","vid","KDG","","_","_"
4,"ca","_","_","ca","CCD","","_","_"
5,"viditvā","_","_","vid","CGDA","","_","_"
6,"ca","_","_","ca","CCD","","_","_"
7,"yathāsthiti","_","_","yathāsthiti","CX","","_","_"
1,"evaṃ","_","_","eva","CX","","_","_"
2,"_","_","_","veda","NC","","_","_"
3,"_","_","_","vid","JJ","","_","_"
4,"_","_","_","iti","CQT","","_","_"
5,"_","_","_","ah","V","ah","_","_"
6,"ato","_","_","atas","CX","","_","_"
7,"'nyo","_","_","anya","PPX","","_","_"
8,"vātareṭakaḥ","_","_","vātareṭaka","NC","","_","_"
1,"sarvaṃ","_","_","sarva","JQ","","_","_"
2,"vidur","_","_","vid","V","vid","_","_"
3,"_","_","_","veda","NC","","_","_"
4,"_","_","_","vid","JJ","","_","_"
5,"vede","_","_","veda","NC","","_","_"
6,"sarvaṃ","_","_","sarva","JQ","","_","_"
7,"pratiṣṭhitam","_","_","pratiṣṭhā","PPP","","_","_"
1,"vede","_","_","veda","NC","","_","_"
2,"hi","_","_","hi","CX","","_","_"
3,"niṣṭhā","_","_","niṣṭhā","NC","","_","_"
4,"sarvasya","_","_","sarva","JQ","","_","_"
5,"yad","_","_","yad","PRL","","_","_"
6,"yad","_","_","yad","PRL","","_","_"
7,"asti","_","_","as","V","as","_","_"
8,"ca","_","_","ca","CCD","","_","_"
9,"_","_","_","na","CNG","","_","_"
10,"_","_","_","as","V","as","_","_"
11,"ca","_","_","ca","CCD","","_","_"
1,"_","_","_","tad","PRD","","_","_"
2,"_","_","_","eva","CEM","","_","_"
3,"niṣṭhā","_","_","niṣṭhā","NC","","_","_"
4,"sarvasya","_","_","sarva","JQ","","_","_"
5,"yad","_","_","yad","PRL","","_","_"
6,"yad","_","_","yad","PRL","","_","_"
7,"asti","_","_","as","V","as","_","_"
8,"ca","_","_","ca","CCD","","_","_"
9,"_","_","_","na","CNG","","_","_"
10,"_","_","_","as","V","as","_","_"
11,"ca","_","_","ca","CCD","","_","_"
1,"etad","_","_","tad","PRD","","_","_"
2,"antaṃ","_","_","anta","NC","","_","_"
3,"ca","_","_","ca","CCD","","_","_"
4,"madhyaṃ","_","_","madhya","NC","","_","_"
5,"ca","_","_","ca","CCD","","_","_"
6,"_","_","_","as","KDP","","_","_"
7,"_","_","_","ca","CCD","","_","_"
8,"_","_","_","asat","JJ","","_","_"
9,"_","_","_","ca","CCD","","_","_"
10,"vijānataḥ","_","_","vijñā","KDP","","_","_"
1,"_","_","_","samasta","JJ","","_","_"
2,"_","_","_","tyāga","NC","","_","_"
3,"_","_","_","iti","CQT","","_","_"
4,"_","_","_","eva","CEM","","_","_"
5,"śama","_","_","śama","NC","","_","_"
6,"_","_","_","iti","CQT","","_","_"
7,"_","_","_","eva","CEM","","_","_"
8,"niṣṭhitaḥ","_","_","niṣṭhā","PPP","","_","_"
1,"saṃtoṣa","_","_","saṃtoṣa","NC","","_","_"
2,"_","_","_","iti","CQT","","_","_"
3,"_","_","_","atra","CAD","","_","_"
4,"śubham","_","_","śubha","JJ","","_","_"
5,"apavarge","_","_","apavarga","NC","","_","_"
6,"pratiṣṭhitam","_","_","pratiṣṭhā","PPP","","_","_"
1,"ṛtaṃ","_","_","ṛta","NC","","_","_"
2,"satyaṃ","_","_","satya","NC","","_","_"
3,"viditaṃ","_","_","vid","PPP","","_","_"
4,"veditavyaṃ","_","_","vid","KDG","","_","_"
5,"_","_","_","sarva","JQ","","_","_"
6,"_","_","_","ātman","NC","","_","_"
7,"jaṅgamaṃ","_","_","jaṅgama","JJ","","_","_"
8,"sthāvaraṃ","_","_","sthāvara","JJ","","_","_"
9,"ca","_","_","ca","CCD","","_","_"
1,"sarvaṃ","_","_","sarva","JQ","","_","_"
2,"sukhaṃ","_","_","sukha","NC","","_","_"
3,"_","_","_","yad","PRL","","_","_"
4,"_","_","_","śiva","JJ","","_","_"
5,"uttamaṃ","_","_","uttama","JJ","","_","_"
6,"ca","_","_","ca","CCD","","_","_"
7,"_","_","_","brahman","NC","","_","_"
8,"_","_","_","avyakta","NC","","_","_"
9,"_","_","_","prabhava","NC","","_","_"
10,"_","_","_","ca","CCD","","_","_"
11,"_","_","_","avyaya","JJ","","_","_"
12,"_","_","_","ca","CCD","","_","_"
1,"tejaḥ","_","_","tejas","NC","","_","_"
2,"kṣamā","_","_","kṣamā","NC","","_","_"
3,"śāntir","_","_","śānti","NC","","_","_"
4,"anāmayaṃ","_","_","anāmaya","NC","","_","_"
5,"śubhaṃ","_","_","śubha","JJ","","_","_"
6,"tathāvidhaṃ","_","_","tathāvidha","JJ","","_","_"
7,"vyoma","_","_","vyoman","NC","","_","_"
8,"sanātanaṃ","_","_","sanātana","JJ","","_","_"
9,"dhruvam","_","_","dhruva","JJ","","_","_"
1,"etaiḥ","_","_","tad","PRD","","_","_"
2,"śabdair","_","_","śabda","NC","","_","_"
3,"gamyate","_","_","gacch","V","gam","_","_"
4,"_","_","_","buddhi","NC","","_","_"
5,"_","_","_","netra","NC","","_","_"
6,"tasmai","_","_","tad","PRD","","_","_"
7,"namo","_","_","namas","NC","","_","_"
8,"brahmaṇe","_","_","brahman","NC","","_","_"
9,"brāhmaṇāya","_","_","brāhmaṇa","NC","","_","_"
