"WordID","word","NormSTEM","suffix","lemma","PoS","Root","NormSuffix","NormWord"
NA,"<doc textid = ""anantabuddhaksetragunodbhavanadharmaparyaya"" genre = ""sūtra"" title = ""anantabuddhakṣetraguṇodbhāvanadharmaparyāya"" author = "" n/ a"" discourse = ""homiletic"" tradition = ""buddh"" period = ""foundational"" source = ""pdf"" date_range = ""2.-4. ce"" notes = ""edition from cambridge add. 1680.8 manuscript 12th-13th centuries . part of a chapter from the buddhāvataṃsaka. there is already one anantabuddhakṣetraguṇodbhāvana in the corpus; but the text is different from this one"" religion = ""buddh"" edition = ""based on the ed. by gergely hidas. powers of protection. the buddhist tradition of spells in the dhāraṇīsaṃgraha collections"" digitization = ""ocr by tilak balavijayan & buddhist translators worbench team"" segmentation_lemmatization = ""ligeia lugli & buddhist translators workbench team"" metadata_enrichment = ""buddhist translators workbench team"" proofreader = """" permission = """" reconstructions = ""none"">","","","","","","",""
NA,"<page number=""18"">","","","","","","",""
NA,"<s number=""1"">","","","","","","",""
1,"buddhakṣetra","BUDDHAKṢETR","a","buddhakṣetra","noun-adj","","a","buddhakṣetra"
2,"/","","","","punct","","","/"
NA,"</s>","","","","","","",""
NA,"<s number=""2"">","","","","","","",""
1,"ekaṃ","EK","aṃ","eka","noun-adj","","am","ekam"
2,"rātriṃ","RĀTR","iṃ","rātri","noun-adj","","im","rātrim"
3,"divasaṃ","DIVAS","aṃ","divasa","noun-adj","","am","divasam"
4,"yat","YAT","","yad","pron","","","yat"
5,"khalu","KHAL","u","khalu","noun-adj","","u","khalu"
6,"punar","","","punar","ind","","","punar"
7,"bho","BHO","","bhos","noun-adj","","","bho"
8,"jinaputrā","JINAPUTR","ā","jinaputra","noun-adj","","āḥ","jinaputrāḥ"
9,"kāṣāp","KĀṢ","āp","kāṣa","noun-adj","","āp","kāṣāp"
10,"addha","ADDH","a","addha","noun-adj","","a","addha"
11,"jāyāṃ","JĀY","āṃ","jāyā","noun-adj","","ām","jāyām"
12,"lokadhātau","LOKADHĀT","au","lokadhātu","noun-adj","","au","lokadhātau"
13,"kalpaṃ","KALP","aṃ","kalpa","noun-adj","","am","kalpam"
14,"tad","TAD","","tad","pron","","","tad"
15,"avaivartikacakra","AVAIVARTIKACAKR","a","avaivartikacakra","noun-adj","","a","avaivartikacakra"
16,"nirghoṣāyāṃ","NIRGHOṢ","āyāṃ","nirghoṣa","noun-adj","","āyām","nirghoṣāyām"
17,"lokadhātau","LOKADHĀT","au","lokadhātu","noun-adj","","au","lokadhātau"
18,"bhagavataḥ","BHAGAV","ataḥ","bhagavat","noun-adj","","ataḥ","bhagavataḥ"
19,"su","","","su","ind","","","su"
20,"nicita","NICIT","a","nicita","noun-adj","","a","nicita"
21,"padma","PADM","a","padma","noun-adj","","a","padma"
22,"praphullita","PRAPHULLIT","a","praphullita","noun-adj","","a","praphullita"
23,"gātrasya","GĀTR","asya","gātra","noun-adj","","asya","gātrasya"
24,"tathāgatasya","TATHĀGAT","asya","tathāgata","noun-adj","","asya","tathāgatasya"
25,"buddhakṣetre","BUDDHAKṢETR","e","buddhakṣetra","noun-adj","","e","buddhakṣetre"
26,"ekaṃ","EK","aṃ","eka","noun-adj","","am","ekam"
27,"rātriṃ","RĀTR","iṃ","rātri","noun-adj","","im","rātrim"
28,"divasaṃ","DIVAS","aṃ","divasa","noun-adj","","am","divasam"
29,"yat","YAT","","yad","pron","","","yat"
30,"khalu","KHAL","u","khalu","noun-adj","","u","khalu"
31,"puna","PUN","a","puna","noun-adj","","a","puna"
32,"bho","BHO","","bhos","noun-adj","","","bho"
33,"jinaputrāḥ","JINAPUTR","āḥ","jinaputra","noun-adj","","āḥ","jinaputrāḥ"
34,"/","","","","punct","","","/"
NA,"</s>","","","","","","",""
NA,"<s number=""3"">","","","","","","",""
1,"avaivartikacakra","AVAIVARTIKACAKR","a","avaivartikacakra","noun-adj","","a","avaivartikacakra"
2,"nirghoṣāyāṃ","NIRGHOṢ","āyāṃ","nirghoṣa","noun-adj","","āyām","nirghoṣāyām"
3,"lokadhātau","LOKADHĀT","au","lokadhātu","noun-adj","","au","lokadhātau"
4,"kalpaṃ","KALP","aṃ","kalpa","noun-adj","","am","kalpam"
5,"tad","TAD","","tad","pron","","","tad"
6,"hi","","","hi","ind","","","hi"
7,"rajāyāṃ","RAJ","āyāṃ","raji","noun-adj","","āyām","rajāyām"
8,"lokadhātau","LOKADHĀT","au","lokadhātu","noun-adj","","au","lokadhātau"
9,"bhagavato","BHAGAV","ato","bhagavat","noun-adj","","ataḥ","bhagavataḥ"
10,"dharmadhvajasya","DHARMADHVAJ","asya","dharmadhvaja","noun-adj","","asya","dharmadhvajasya"
11,"tathāgatasya","TATHĀGAT","asya","tathāgata","noun-adj","","asya","tathāgatasya"
12,"buddhakṣetre","BUDDHAKṢETR","e","buddhakṣetra","noun-adj","","e","buddhakṣetre"
13,"ekaṃ","EK","aṃ","eka","noun-adj","","am","ekam"
14,"rātriṃ","RĀTR","iṃ","rātri","noun-adj","","im","rātrim"
15,"divasaṃ","DIVAS","aṃ","divasa","noun-adj","","am","divasam"
16,"yat","YAT","","yad","pron","","","yat"
17,"khalu","KHAL","u","khalu","noun-adj","","u","khalu"
18,"punar","","","punar","ind","","","punar"
19,"bho","BHO","","bhos","noun-adj","","","bho"
20,"jinaputr","JINAPUTR","a","jinaputra","noun-adj","","a","jinaputra"
21,"^ādhira","ĀDHIR","a","ādhira","noun-adj","","a","ādhira"
22,"jāyāṃ","JĀY","āṃ","jāyā","noun-adj","","ām","jāyām"
23,"lokadhātau","LOKADHĀT","au","lokadhātu","noun-adj","","au","lokadhātau"
24,"kalpaṃ","KALP","aṃ","kalpa","noun-adj","","am","kalpam"
25,"tat","TAT","","tad","pron","","","tat"
26,"pradīpāyāṃ","PRADĪP","āyāṃ","pradīpāya","noun-adj","","āyām","pradīpāyām"
27,"lokadhātau","LOKADHĀT","au","lokadhātu","noun-adj","","au","lokadhātau"
28,"bhagavataḥ","BHAGAV","ataḥ","bhagavat","noun-adj","","ataḥ","bhagavataḥ"
29,"siṃhasya","SIṂH","asya","siṃha","noun-adj","","asya","siṃhasya"
30,"tathāgatasya","TATHĀGAT","asya","tathāgata","noun-adj","","asya","tathāgatasya"
31,"buddhakṣetre","BUDDHAKṢETR","e","buddhakṣetra","noun-adj","","e","buddhakṣetre"
32,"ekaṃ","EK","aṃ","eka","noun-adj","","am","ekam"
33,"rātriṃ","RĀTR","iṃ","rātri","noun-adj","","im","rātrim"
34,"divasaṃ","DIVAS","aṃ","divasa","noun-adj","","am","divasam"
35,"yat","YAT","","yad","pron","","","yat"
36,"khalu","KHAL","u","khalu","noun-adj","","u","khalu"
37,"punar","","","punar","ind","","","punar"
38,"bho","BHO","","bhos","noun-adj","","","bho"
39,"jinaputrāḥ","JINAPUTR","āḥ","jinaputra","noun-adj","","āḥ","jinaputrāḥ"
40,"pradīpāyāṃ","PRADĪP","āyāṃ","pradīpāya","noun-adj","","āyām","pradīpāyām"
41,"lokadhātau","LOKADHĀT","au","lokadhātu","noun-adj","","au","lokadhātau"
42,"kalpaṃ","KALP","aṃ","kalpa","noun-adj","","am","kalpam"
43,"tat","TAT","","tad","pron","","","tat"
44,"su","","","su","ind","","","su"
45,"prabhāyāṃ","PRABH","āyāṃ","prabhā","noun-adj","","āyām","prabhāyām"
46,"lokadhātau","LOKADHĀT","au","lokadhātu","noun-adj","","au","lokadhātau"
47,"bhagavato","BHAGAV","ato","bhagavat","noun-adj","","ataḥ","bhagavataḥ"
48,"vairocanasya","VAIROCAN","asya","vairocana","noun-adj","","asya","vairocanasya"
49,"tathāgatasya","TATHĀGAT","asya","tathāgata","noun-adj","","asya","tathāgatasya"
50,"buddhakṣetre","BUDDHAKṢETR","e","buddhakṣetra","noun-adj","","e","buddhakṣetre"
51,"ekaṃ","EK","aṃ","eka","noun-adj","","am","ekam"
52,"rātriṃ","RĀTR","iṃ","rātri","noun-adj","","im","rātrim"
53,"divasaṃ","DIVAS","aṃ","divasa","noun-adj","","am","divasam"
54,"yat","YAT","","yad","pron","","","yat"
55,"khalu","KHAL","u","khalu","noun-adj","","u","khalu"
56,"punar","","","punar","ind","","","punar"
57,"bho","BHO","","bhos","noun-adj","","","bho"
58,"jinaputrāḥ","JINAPUTR","āḥ","jinaputra","noun-adj","","āḥ","jinaputrāḥ"
59,"su","","","su","ind","","","su"
60,"prabhāyāṃ","PRABH","āyāṃ","prabhā","noun-adj","","āyām","prabhāyām"
61,"lokadhātau","LOKADHĀT","au","lokadhātu","noun-adj","","au","lokadhātau"
62,"kalpaṃ","KALP","aṃ","kalpa","noun-adj","","am","kalpam"
63,"tad","TAD","","tad","pron","","","tad"
64,"duratikramāyāṃ","DURATIKRAM","āyāṃ","duratikrama","noun-adj","","āyām","duratikramāyām"
65,"lokadhātau","LOKADHĀT","au","lokadhātu","noun-adj","","au","lokadhātau"
66,"bhagavato","BHAGAV","ato","bhagavat","noun-adj","","ataḥ","bhagavataḥ"
67,"dharma","DHARM","a","dharma","noun-adj","","a","dharma"
68,"raśmi","RAŚM","i","raśmi","noun-adj","","i","raśmi"
69,"praphullita","PRAPHULLIT","a","praphullita","noun-adj","","a","praphullita"
70,"gātrasya","GĀTR","asya","gātra","noun-adj","","asya","gātrasya"
71,"tathāgatasya","TATHĀGAT","asya","tathāgata","noun-adj","","asya","tathāgatasya"
72,"buddhakṣetre","BUDDHAKṢETR","e","buddhakṣetra","noun-adj","","e","buddhakṣetre"
73,"ekaṃ","EK","aṃ","eka","noun-adj","","am","ekam"
74,"rātriṃ","RĀTR","iṃ","rātri","noun-adj","","im","rātrim"
75,"divasaṃ","DIVAS","aṃ","divasa","noun-adj","","am","divasam"
76,"yat","YAT","","yad","pron","","","yat"
77,"khalu","KHAL","u","khalu","noun-adj","","u","khalu"
78,"punar","","","punar","ind","","","punar"
79,"bho","BHO","","bhos","noun-adj","","","bho"
80,"jinaputrā","JINAPUTR","ā","jinaputra","noun-adj","","āḥ","jinaputrāḥ"
81,"duratikramāyāṃ","DURATIKRAM","āyāṃ","duratikrama","noun-adj","","āyām","duratikramāyām"
82,"lokadhātau","LOKADHĀT","au","lokadhātu","noun-adj","","au","lokadhātau"
83,"kalpaṃ","KALP","aṃ","kalpa","noun-adj","","am","kalpam"
84,"buddha","BUDDH","a","buddha","noun-adj","","a","buddha"
85,"vyūhāyāṃ","VYŪH","āyāṃ","vyūhā","noun-adj","","āyām","vyūhāyām"
86,"lokadhātau","LOKADHĀT","au","lokadhātu","noun-adj","","au","lokadhātau"
87,"bhagavataḥ","BHAGAV","ataḥ","bhagavat","noun-adj","","ataḥ","bhagavataḥ"
88,"sarvābhis","SARV","ābhis","sarva","noun-adj","","ābhis","sarvābhis"
89,"tu","","","tu","ind","","","tu"
90,"mati","MAT","i","mati","noun-adj","","i","mati"
91,"raśmirājasya","RAŚMIRĀJ","asya","raśmirāja","noun-adj","","asya","raśmirājasya"
92,"tathāgatasya","TATHĀGAT","asya","tathāgata","noun-adj","","asya","tathāgatasya"
93,"buddhakṣetre","BUDDHAKṢETR","e","buddhakṣetra","noun-adj","","e","buddhakṣetre"
94,"ekaṃ","EK","aṃ","eka","noun-adj","","am","ekam"
95,"rātriṃ","RĀTR","iṃ","rātri","noun-adj","","im","rātrim"
96,"divasaṃ","DIVAS","aṃ","divasa","noun-adj","","am","divasam"
97,"yat","YAT","","yad","pron","","","yat"
98,"khalu","KHAL","u","khalu","noun-adj","","u","khalu"
99,"punar","","","punar","ind","","","punar"
100,"bho","BHO","","bhos","noun-adj","","","bho"
101,"jinaputrā","JINAPUTR","ā","jinaputra","noun-adj","","āḥ","jinaputrāḥ"
102,"vyūhāyāṃ","VYŪH","āyāṃ","vyūhā","noun-adj","","āyām","vyūhāyām"
103,"lokadhātau","LOKADHĀT","au","lokadhātu","noun-adj","","au","lokadhātau"
104,"kalpaṃ","KALP","aṃ","kalpa","noun-adj","","am","kalpam"
105,"tadā","","","tadā","ind","","","tadā"
106,"daśa","DAŚ","a","daśa","noun-adj","","a","daśa"
107,"maṇḍala","MAṆḌAL","a","maṇḍala","noun-adj","","a","maṇḍala"
108,"nirghoṣāyāṃ","NIRGHOṢ","āyāṃ","nirghoṣa","noun-adj","","āyām","nirghoṣāyām"
109,"lokadhātau","LOKADHĀT","au","lokadhātu","noun-adj","","au","lokadhātau"
110,"bhagavataś","BHAGAV","ataś","bhagavat","noun-adj","","ataḥ","bhagavataḥ"
111,"candra","CANDR","a","candra","noun-adj","","a","candra"
112,"buddhe","BUDDH","e","buddha","noun-adj","","e","buddhe"
113,"tathāgatasya","TATHĀGAT","asya","tathāgata","noun-adj","","asya","tathāgatasya"
114,"buddhakṣetre","BUDDHAKṢETR","e","buddhakṣetra","noun-adj","","e","buddhakṣetre"
115,"ekaṃ","EK","aṃ","eka","noun-adj","","am","ekam"
116,"rātriṃ","RĀTR","iṃ","rātri","noun-adj","","im","rātrim"
117,"divasaṃ","DIVAS","aṃ","divasa","noun-adj","","am","divasam"
118,"yat","YAT","","yad","pron","","","yat"
119,"khalu","KHAL","u","khalu","noun-adj","","u","khalu"
120,"punar","","","punar","ind","","","punar"
121,"bho","BHO","","bhos","noun-adj","","","bho"
122,"jinaputrāḥ","JINAPUTR","āḥ","jinaputra","noun-adj","","āḥ","jinaputrāḥ"
123,"lokadhātau","LOKADHĀT","au","lokadhātu","noun-adj","","au","lokadhātau"
124,"kalpa","KALP","a","kalpa","noun-adj","","a","kalpa"
125,"gaṇanā","GAṆAN","ā","gaṇanā","noun-adj","","ā","gaṇanā"
126,"praveśena","PRAVEŚ","ena","praveśa","noun-adj","","ena","praveśena"
127,"pariphullāṃ","PARIPHULL","āṃ","pariphullā","noun-adj","","ām","pariphullām"
128,"daśa","DAŚ","a","daśa","noun-adj","","a","daśa"
129,"buddhakṣetra","BUDDHAKṢETR","a","buddhakṣetra","noun-adj","","a","buddhakṣetra"
130,"param","PARAM","a","parama","noun-adj","","a","parama"
131,"^ānta","ANT","a","anta","noun-adj","","a","anta"
132,"—","","","","punct","","","—"
133,"rajaḥ","RAJ","aḥ","raja","noun-adj","","aḥ","rajaḥ"
134,"samāṃ","SAM","āṃ","samā","noun-adj","","ām","samām"
135,"buddhakṣetra","BUDDHAKṢETR","a","buddhakṣetra","noun-adj","","a","buddhakṣetra"
136,"śatasahasrāṇy","ŚATASAHASR","āṇy","śatasahasra","noun-adj","","āni","śatasahasrāni"
137,"atikramya","ATIKRAMY","a","atikramya","noun-adj","","a","atikramya"
138,"tataḥ","","","tatas","ind","","","tatas"
139,"padmaśriyā","PADMAŚR","iyā","","noun-adj","","iyā","padmaśriyā"
140,"lokadhātau","LOKADHĀT","au","lokadhātu","noun-adj","","au","lokadhātau"
141,"bhagavato","BHAGAV","ato","bhagavat","noun-adj","","ataḥ","bhagavataḥ"
142,"bhadraśriyasya","BHADRAŚRIY","asya","bhadraśriya","noun-adj","","asya","bhadraśriyasya"
143,"tathāgatasya","TATHĀGAT","asya","tathāgata","noun-adj","","asya","tathāgatasya"
144,"buddhakṣetre","BUDDHAKṢETR","e","buddhakṣetra","noun-adj","","e","buddhakṣetre"
145,"ekaṃ","EK","aṃ","eka","noun-adj","","am","ekam"
146,"rātriṃ","RĀTR","iṃ","rātri","noun-adj","","im","rātrim"
147,"divasaṃ","DIVAS","aṃ","divasa","noun-adj","","am","divasam"
148,"yatra","","","yatra","ind","","","yatra"
149,"samantabhadra","SAMANTABHADR","a","samantabhadra","noun-adj","","a","samantabhadra"
150,"caritānāṃ","CARIT","ānāṃ","carita","noun-adj","","ānām","caritānām"
151,"bodhisattvānāṃ","BODHISATTV","ānāṃ","bodhisattva","noun-adj","","ānām","bodhisattvānām"
152,"bhūmi","BHŪM","i","bhūmi","noun-adj","","i","bhūmi"
153,"parikarma","PARIKARM","a","parikarma","noun-adj","","a","parikarma"
154,"viśeṣaḥ","VIŚEṢ","aḥ","viśeṣa","noun-adj","","aḥ","viśeṣaḥ"
155,"/","","","","punct","","","/"
NA,"</s>","","","","","","",""
NA,"<s number=""4"">","","","","","","",""
1,"yaḥ","","","yad","pron","","","yad"
2,"kaścid","KAŚCID","","kimcit","noun-adj","","","kaścid"
3,"bho","BHO","","bhos","noun-adj","","","bho"
4,"jinaputrā","JINAPUTR","ā","jinaputra","noun-adj","","āḥ","jinaputrāḥ"
5,"kulaputro","KULAPUTR","o","kulaputra","noun-adj","","aḥ","kulaputraḥ"
6,"vā","","","vā","ind","","","vā"
7,"kuladuhitā","KULADUHIT","ā","kuladuhitā","noun-adj","","ā","kuladuhitā"
8,"vā","","","vā","ind","","","vā"
9,"imaṃ","","","idam","pron","","","idam"
10,"tathāgatānām","TATHĀGAT","ānām","tathāgata","noun-adj","","ānām","tathāgatānām"
11,"ananta","ANANT","a","ananta","noun-adj","","a","ananta"
12,"buddhakṣetra","BUDDHAKṢETR","a","buddhakṣetra","noun-adj","","a","buddhakṣetra"
13,"guṇ","GUṆ","a","guṇa","noun-adj","","a","guṇa"
14,"^odbhāvanaṃ","UDBHĀVAN","aṃ","udbhāvana","noun-adj","","am","udbhāvanam"
15,"dharmaparyāyam","DHARMAPARYĀY","am","dharmaparyāya","noun-adj","","am","dharmaparyāyam"
16,"udgrahīṣyati","UDGRAHĪṢ","yati","udgrahīṣ","verb","","yati","udgrahīṣyati"
17,"dhārayiṣyati","DHĀR","ayiṣyati","dhar","verb","dhṛ","ayiṣyati","dhārayiṣyati"
18,"vācayiṣyati","VĀC","ayiṣyati","vak","verb","vac","ayiṣyati","vācayiṣyati"
19,"paryavāpsyati","PARYAVĀPS","yati","paryavāpn","verb","paryavāp","yati","paryavāpsyati"
20,"yonisaś","YONIŚ","aś","yoniśas","noun-adj","","aḥ","yoniśaḥ"
21,"ca","","","ca","ind","","","ca"
22,"manasi","MANAS","i","manas","noun-adj","","i","manasi"
NA,"</s>","","","","","","",""
NA,"</page>","","","","","","",""
NA,"</doc>","","","","","","",""
