"WordID","word","NormSTEM","suffix","lemma","PoS","Root","NormSuffix","NormWord"
1,"vaiśaṃpāyana","_","_","vaiśampāyana","NC","","_","_"
2,"uvāca","_","_","vak","V","vac","_","_"
1,"vasatsu","_","_","vas","KDP","","_","_"
2,"teṣu","_","_","tad","PRD","","_","_"
3,"pracchannaṃ","_","_","pracchad","PPP","","_","_"
4,"pāṇḍaveṣu","_","_","pāṇḍava","NC","","_","_"
5,"mahātmasu","_","_","mahātman","JJ","","_","_"
1,"_","_","_","āga","V","āga","_","_"
2,"_","_","_","atha","CAD","","_","_"
3,"tān","_","_","tad","PRD","","_","_"
4,"draṣṭuṃ","_","_","dṛś","CGDI","","_","_"
5,"vyāsaḥ","_","_","vyāsa","NC","","_","_"
6,"_","_","_","satyavatī","NC","","_","_"
7,"_","_","_","suta","NC","","_","_"
1,"tam","_","_","tad","PRD","","_","_"
2,"āgatam","_","_","āga","PPP","","_","_"
3,"abhiprekṣya","_","_","abhiprekṣ","CGDA","","_","_"
4,"pratyudgamya","_","_","pratyudga","CGDA","","_","_"
5,"paraṃtapāḥ","_","_","paraṃtapa","JJ","","_","_"
1,"_","_","_","praṇipat","CGDA","","_","_"
2,"_","_","_","abhivāday","CGDA","","_","_"
3,"_","_","_","a","PRD","","_","_"
4,"tasthuḥ","_","_","tiṣṭh","V","sthā","_","_"
5,"_","_","_","prāñjali","JJ","","_","_"
6,"_","_","_","tadā","CAD","","_","_"
1,"samanujñāpya","_","_","samanujñāpay","CGDA","","_","_"
2,"tān","_","_","tad","PRD","","_","_"
3,"sarvān","_","_","sarva","JQ","","_","_"
4,"āsīnān","_","_","ās","PPP","","_","_"
5,"munir","_","_","muni","NC","","_","_"
6,"abravīt","_","_","abravīta","V","brū","_","_"
1,"prasannaḥ","_","_","prasad","PPP","","_","_"
2,"pūjitaḥ","_","_","pūjay","PPP","","_","_"
3,"pārthaiḥ","_","_","pārtha","NC","","_","_"
4,"_","_","_","prīti","NC","","_","_"
5,"_","_","_","pūrva","CX","","_","_"
6,"idaṃ","_","_","ida","PRD","","_","_"
7,"vacaḥ","_","_","vacas","NC","","_","_"
1,"api","_","_","api","CX","","_","_"
2,"dharmeṇa","_","_","dharma","NC","","_","_"
3,"vartadhvaṃ","_","_","vart","V","vṛt","_","_"
4,"śāstreṇa","_","_","śāstra","NC","","_","_"
5,"ca","_","_","ca","CCD","","_","_"
6,"paraṃtapāḥ","_","_","paraṃtapa","JJ","","_","_"
1,"api","_","_","api","CX","","_","_"
2,"vipreṣu","_","_","vipra","NC","","_","_"
3,"vaḥ","_","_","tvat","PPR","","_","_"
4,"pūjā","_","_","pūjā","NC","","_","_"
5,"_","_","_","pūjā","NC","","_","_"
6,"_","_","_","arha","JJ","","_","_"
7,"na","_","_","na","CNG","","_","_"
8,"hīyate","_","_","jah","V","hā","_","_"
1,"atha","_","_","atha","CAD","","_","_"
2,"_","_","_","dharma","NC","","_","_"
3,"_","_","_","artha","NC","","_","_"
4,"_","_","_","vat","CX","","_","_"
5,"vākyam","_","_","vākya","NC","","_","_"
6,"uktvā","_","_","vac","CGDA","","_","_"
7,"sa","_","_","tad","PRD","","_","_"
8,"bhagavān","_","_","bhagavat","JJ","","_","_"
9,"ṛṣiḥ","_","_","ṛṣi","NC","","_","_"
1,"_","_","_","vicitra","JJ","","_","_"
2,"_","_","_","ca","CCD","","_","_"
3,"_","_","_","kathā","NC","","_","_"
4,"_","_","_","tad","PRD","","_","_"
5,"_","_","_","tad","PRD","","_","_"
6,"punar","_","_","punar","CAD","","_","_"
7,"_","_","_","eva","CEM","","_","_"
8,"_","_","_","ida","PRD","","_","_"
9,"abravīt","_","_","abravīta","V","brū","_","_"
1,"āsīt","_","_","as","V","as","_","_"
2,"_","_","_","tapas","NC","","_","_"
3,"_","_","_","vana","NC","","_","_"
4,"kācid","_","_","kiṃcit","PRI","","_","_"
5,"ṛṣeḥ","_","_","ṛṣi","NC","","_","_"
6,"kanyā","_","_","kanyā","NC","","_","_"
7,"mahātmanaḥ","_","_","mahātman","JJ","","_","_"
1,"_","_","_","vilagna","NC","","_","_"
2,"_","_","_","madhya","NC","","_","_"
3,"suśroṇī","_","_","suśroṇī","NC","","_","_"
4,"subhrūḥ","_","_","subhrū","NC","","_","_"
5,"_","_","_","sarva","JQ","","_","_"
6,"_","_","_","guṇa","NC","","_","_"
7,"_","_","_","anvita","JJ","","_","_"
1,"karmabhiḥ","_","_","karman","NC","","_","_"
2,"_","_","_","sva","JJ","","_","_"
3,"_","_","_","kṛ","PPP","","_","_"
4,"sā","_","_","tad","PRD","","_","_"
5,"tu","_","_","tu","CCD","","_","_"
6,"durbhagā","_","_","durbhaga","JJ","","_","_"
7,"samapadyata","_","_","saṃpad","V","saṃpad","_","_"
1,"_","_","_","na","CNG","","_","_"
2,"_","_","_","adhiga","V","adhiga","_","_"
3,"patiṃ","_","_","pati","NC","","_","_"
4,"sā","_","_","tad","PRD","","_","_"
5,"tu","_","_","tu","CCD","","_","_"
6,"kanyā","_","_","kanyā","NC","","_","_"
7,"rūpavatī","_","_","rūpavat","JJ","","_","_"
8,"satī","_","_","as","KDP","","_","_"
1,"_","_","_","tapas","NC","","_","_"
2,"_","_","_","tap","CGDI","","_","_"
3,"_","_","_","atha","CAD","","_","_"
4,"_","_","_","ārabh","V","ārabh","_","_"
5,"_","_","_","pati","NC","","_","_"
6,"_","_","_","artha","NC","","_","_"
7,"asukhā","_","_","asukha","JJ","","_","_"
8,"tataḥ","_","_","tatas","CX","","_","_"
1,"toṣayāmāsa","_","_","toṣay","V","toṣay","_","_"
2,"tapasā","_","_","tapas","NC","","_","_"
3,"sā","_","_","tad","PRD","","_","_"
4,"_","_","_","kila","CX","","_","_"
5,"_","_","_","ugra","JJ","","_","_"
6,"śaṃkaram","_","_","śaṃkara","NC","","_","_"
1,"tasyāḥ","_","_","tad","PRD","","_","_"
2,"sa","_","_","tad","PRD","","_","_"
3,"_","_","_","bhagavat","NC","","_","_"
4,"_","_","_","tuṣ","PPP","","_","_"
5,"_","_","_","tad","PRD","","_","_"
6,"uvāca","_","_","vak","V","vac","_","_"
7,"tapasvinīm","_","_","tapasvinī","NC","","_","_"
1,"varaṃ","_","_","vara","NC","","_","_"
2,"varaya","_","_","varaya","V","varay","_","_"
3,"bhadraṃ","_","_","bhadra","NC","","_","_"
4,"te","_","_","tvat","PPR","","_","_"
5,"_","_","_","vara","NC","","_","_"
6,"_","_","_","da","JJ","","_","_"
7,"_","_","_","as","V","as","_","_"
8,"_","_","_","iti","CQT","","_","_"
9,"bhāmini","_","_","bhāminī","NC","","_","_"
1,"_","_","_","atha","CAD","","_","_"
2,"_","_","_","īśvara","NC","","_","_"
3,"_","_","_","vak","V","vac","_","_"
4,"_","_","_","ida","PRD","","_","_"
5,"ātmanaḥ","_","_","ātman","NC","","_","_"
6,"sā","_","_","tad","PRD","","_","_"
7,"vaco","_","_","vacas","NC","","_","_"
8,"hitam","_","_","hita","JJ","","_","_"
1,"patiṃ","_","_","pati","NC","","_","_"
2,"_","_","_","sarva","JQ","","_","_"
3,"_","_","_","guṇa","NC","","_","_"
4,"_","_","_","upe","PPP","","_","_"
5,"_","_","_","iṣ","V","iṣ","_","_"
6,"_","_","_","iti","CQT","","_","_"
7,"punaḥ","_","_","punar","CAD","","_","_"
8,"punaḥ","_","_","punar","CAD","","_","_"
1,"tām","_","_","tad","PRD","","_","_"
2,"atha","_","_","atha","CAD","","_","_"
3,"_","_","_","prativak","V","prativac","_","_"
4,"_","_","_","ida","PRD","","_","_"
5,"īśāno","_","_","īśāna","NC","","_","_"
6,"vadatāṃ","_","_","vad","KDP","","_","_"
7,"varaḥ","_","_","vara","JJ","","_","_"
1,"pañca","_","_","pañcan","NUM","","_","_"
2,"te","_","_","tvat","PPR","","_","_"
3,"patayo","_","_","pati","NC","","_","_"
4,"bhadre","_","_","bhadra","JJ","","_","_"
5,"_","_","_","bhav","V","bhū","_","_"
6,"_","_","_","iti","CQT","","_","_"
7,"śaṃkaraḥ","_","_","śaṃkara","NC","","_","_"
1,"evam","_","_","eva","CX","","_","_"
2,"uktā","_","_","vac","PPP","","_","_"
3,"tataḥ","_","_","tatas","CX","","_","_"
4,"kanyā","_","_","kanyā","NC","","_","_"
5,"devaṃ","_","_","deva","NC","","_","_"
6,"_","_","_","vara","NC","","_","_"
7,"_","_","_","da","JJ","","_","_"
8,"abravīt","_","_","abravīta","V","brū","_","_"
1,"pratibruvantīm","_","_","pratibrū","KDP","","_","_"
2,"ekaṃ","_","_","eka","PPX","","_","_"
3,"me","_","_","mat","PPR","","_","_"
4,"patiṃ","_","_","pati","NC","","_","_"
5,"_","_","_","dad","V","dā","_","_"
6,"_","_","_","iti","CQT","","_","_"
7,"śaṃkaram","_","_","śaṃkara","NC","","_","_"
1,"punar","_","_","punar","CAD","","_","_"
2,"_","_","_","eva","CEM","","_","_"
3,"_","_","_","abravīta","V","brū","_","_"
4,"deva","_","_","deva","NC","","_","_"
5,"idaṃ","_","_","ida","PRD","","_","_"
6,"vacanam","_","_","vacana","NC","","_","_"
7,"uttamam","_","_","uttama","JJ","","_","_"
1,"_","_","_","pañcan","NUM","","_","_"
2,"_","_","_","kṛtvas","CX","","_","_"
3,"_","_","_","tvat","PPR","","_","_"
4,"uktaḥ","_","_","vac","PPP","","_","_"
5,"patiṃ","_","_","pati","NC","","_","_"
6,"_","_","_","dad","V","dā","_","_"
7,"_","_","_","iti","CQT","","_","_"
8,"_","_","_","mat","PPR","","_","_"
9,"punaḥ","_","_","punar","CAD","","_","_"
1,"deham","_","_","deha","NC","","_","_"
2,"anyaṃ","_","_","anya","PPX","","_","_"
3,"_","_","_","ga","PPP","","_","_"
4,"_","_","_","tvat","PPR","","_","_"
5,"yathoktaṃ","_","_","yathokta","CX","","_","_"
6,"tad","_","_","tad","PRD","","_","_"
7,"bhaviṣyati","_","_","bhav","V","bhū","_","_"
1,"drupadasya","_","_","drupada","NC","","_","_"
2,"kule","_","_","kula","NC","","_","_"
3,"jātā","_","_","jan","PPP","","_","_"
4,"kanyā","_","_","kanyā","NC","","_","_"
5,"sā","_","_","tad","PRD","","_","_"
6,"_","_","_","deva","NC","","_","_"
7,"_","_","_","rūpin","JJ","","_","_"
1,"nirdiṣṭā","_","_","nirdiś","PPP","","_","_"
2,"bhavatāṃ","_","_","bhavat","JJ","","_","_"
3,"patnī","_","_","patnī","NC","","_","_"
4,"kṛṣṇā","_","_","kṛṣṇā","NC","","_","_"
5,"_","_","_","pārṣatī","NC","","_","_"
6,"_","_","_","anindita","JJ","","_","_"
1,"_","_","_","pāñcāla","NC","","_","_"
2,"_","_","_","nagara","NC","","_","_"
3,"tasmāt","_","_","tad","PRD","","_","_"
4,"praviśadhvaṃ","_","_","praviś","V","praviś","_","_"
5,"_","_","_","mahat","JJ","","_","_"
6,"_","_","_","bala","NC","","_","_"
1,"_","_","_","sukhin","JJ","","_","_"
2,"_","_","_","tad","PRD","","_","_"
3,"anuprāpya","_","_","anuprāp","CGDA","","_","_"
4,"bhaviṣyatha","_","_","bhav","V","bhū","_","_"
5,"na","_","_","na","CNG","","_","_"
6,"saṃśayaḥ","_","_","saṃśaya","NC","","_","_"
1,"rājyaṃ","_","_","rājya","NC","","_","_"
2,"_","_","_","ca","CCD","","_","_"
3,"_","_","_","eva","CEM","","_","_"
4,"_","_","_","āga","PPP","","_","_"
5,"pārthā","_","_","pārtha","NC","","_","_"
6,"indraprasthaṃ","_","_","indraprastha","NC","","_","_"
7,"praviśya","_","_","praviś","CGDA","","_","_"
8,"ha","_","_","ha","CEM","","_","_"
1,"evam","_","_","eva","CX","","_","_"
2,"uktvā","_","_","vac","CGDA","","_","_"
3,"mahābhāgaḥ","_","_","mahābhāga","JJ","","_","_"
4,"pāṇḍavānāṃ","_","_","pāṇḍava","NC","","_","_"
5,"pitāmahaḥ","_","_","pitāmaha","NC","","_","_"
1,"pārthān","_","_","pārtha","NC","","_","_"
2,"āmantrya","_","_","āmantray","CGDA","","_","_"
3,"kuntīṃ","_","_","kuntī","NC","","_","_"
4,"ca","_","_","ca","CCD","","_","_"
5,"prātiṣṭhata","_","_","pratiṣṭh","V","prasthā","_","_"
6,"_","_","_","mahat","JJ","","_","_"
7,"_","_","_","tapas","NC","","_","_"
1,"vaiśaṃpāyanaḥ","_","_","vaiśampāyana","NC","","_","_"
1,"yudhiṣṭhiraḥ","_","_","yudhiṣṭhira","NC","","_","_"
1,"brāhmaṇāḥ","_","_","brāhmaṇa","NC","","_","_"
1,"yudhiṣṭhiraḥ","_","_","yudhiṣṭhira","NC","","_","_"
1,"te","_","_","tad","PRD","","_","_"
2,"prayātā","_","_","prayā","PPP","","_","_"
3,"_","_","_","nara","NC","","_","_"
4,"_","_","_","vyāghra","NC","","_","_"
5,"mātrā","_","_","mātṛ","NC","","_","_"
6,"saha","_","_","saha","CX","","_","_"
7,"paraṃtapāḥ","_","_","paraṃtapa","JJ","","_","_"
1,"brāhmaṇān","_","_","brāhmaṇa","NC","","_","_"
2,"gacchato","_","_","ga","KDP","","_","_"
3,"'paśyan","_","_","paś","V","paś","_","_"
4,"pāñcālān","_","_","pāñcāla","NC","","_","_"
5,"_","_","_","sa_saha","CX","","_","_"
6,"_","_","_","gaṇa","NC","","_","_"
7,"bahūn","_","_","bahu","JJ","","_","_"
1,"atha","_","_","atha","CAD","","_","_"
2,"te","_","_","tad","PRD","","_","_"
3,"brāhmaṇā","_","_","brāhmaṇa","NC","","_","_"
4,"ūcuḥ","_","_","vak","V","vac","_","_"
5,"pāṇḍavān","_","_","pāṇḍava","NC","","_","_"
6,"_","_","_","dharma","NC","","_","_"
7,"_","_","_","cārin","JJ","","_","_"
1,"kva","_","_","kva","CX","","_","_"
2,"bhavanto","_","_","bhavat","JJ","","_","_"
3,"gamiṣyanti","_","_","gacch","V","gam","_","_"
4,"kuto","_","_","kutas","CX","","_","_"
5,"_","_","_","vā","CCD","","_","_"
6,"_","_","_","ga","V","ga","_","_"
7,"_","_","_","iti","CQT","","_","_"
8,"ha","_","_","ha","CEM","","_","_"
1,"prayātān","_","_","prayā","PPP","","_","_"
2,"ekacakrāyāḥ","_","_","ekacakrā","NC","","_","_"
3,"sodaryān","_","_","sodarya","JJ","","_","_"
4,"_","_","_","deva","NC","","_","_"
5,"_","_","_","darśin","JJ","","_","_"
1,"bhavanto","_","_","bhavat","JJ","","_","_"
2,"no","_","_","mat","PPR","","_","_"
3,"'bhijānantu","_","_","abhijān","V","abhijñā","_","_"
4,"sahitān","_","_","sahita","JJ","","_","_"
5,"_","_","_","mātṛ","NC","","_","_"
6,"_","_","_","cārin","JJ","","_","_"
1,"gacchato","_","_","ga","KDP","","_","_"
2,"_","_","_","mat","PPR","","_","_"
3,"_","_","_","tu","CCD","","_","_"
4,"pāñcālān","_","_","pāñcāla","NC","","_","_"
5,"drupadasya","_","_","drupada","NC","","_","_"
6,"purīṃ","_","_","purī","NC","","_","_"
7,"prati","_","_","prati","CADP","","_","_"
1,"icchāmo","_","_","iṣ","V","iṣ","_","_"
2,"bhavato","_","_","bhavat","JJ","","_","_"
3,"jñātuṃ","_","_","jñā","CGDI","","_","_"
4,"mahat","_","_","mahat","JJ","","_","_"
5,"kautūhalaṃ","_","_","kautūhala","NC","","_","_"
6,"hi","_","_","hi","CX","","_","_"
7,"naḥ","_","_","mat","PPR","","_","_"
1,"_","_","_","eka","PPX","","_","_"
2,"_","_","_","sārtha","NC","","_","_"
3,"prayātāḥ","_","_","prayā","PPP","","_","_"
4,"sma","_","_","sma","CX","","_","_"
5,"vayam","_","_","mat","PPR","","_","_"
6,"_","_","_","api","CX","","_","_"
7,"_","_","_","atra","CAD","","_","_"
8,"gāminaḥ","_","_","gāmin","JJ","","_","_"
1,"_","_","_","tatra","CAD","","_","_"
2,"_","_","_","api","CX","","_","_"
3,"_","_","_","adbhuta","JJ","","_","_"
4,"_","_","_","saṃkāśa","NC","","_","_"
5,"utsavo","_","_","utsava","NC","","_","_"
6,"bhavitā","_","_","bhav","V","bhū","_","_"
7,"mahān","_","_","mahat","JJ","","_","_"
1,"_","_","_","tatas","CX","","_","_"
2,"_","_","_","tu","CCD","","_","_"
3,"yajñasenasya","_","_","yajñasa","NC","","_","_"
4,"drupadasya","_","_","drupada","NC","","_","_"
5,"mahātmanaḥ","_","_","mahātman","JJ","","_","_"
1,"_","_","_","yad","PRL","","_","_"
2,"_","_","_","adas","PRD","","_","_"
3,"_","_","_","ayonija","JJ","","_","_"
4,"kanyā","_","_","kanyā","NC","","_","_"
5,"sthāsyate","_","_","tiṣṭh","V","sthā","_","_"
6,"sā","_","_","tad","PRD","","_","_"
7,"svayaṃvare","_","_","svayaṃvara","NC","","_","_"
1,"_","_","_","darśanīya","JJ","","_","_"
2,"_","_","_","anavadya","JJ","","_","_"
3,"_","_","_","aṅga","JJ","","_","_"
4,"sukumārī","_","_","sukumāra","JJ","","_","_"
5,"yaśasvinī","_","_","yaśasvin","JJ","","_","_"
1,"dhṛṣṭadyumnasya","_","_","dhṛṣṭadyumna","NC","","_","_"
2,"bhaginī","_","_","bhaginī","NC","","_","_"
3,"_","_","_","droṇa","NC","","_","_"
4,"_","_","_","śatru","NC","","_","_"
5,"pratāpinaḥ","_","_","pratāpin","JJ","","_","_"
1,"jāto","_","_","jan","PPP","","_","_"
2,"yaḥ","_","_","yad","PRL","","_","_"
3,"_","_","_","pāvaka","NC","","_","_"
4,"_","_","_","śūra","NC","","_","_"
5,"_","_","_","sa_saha","CX","","_","_"
6,"_","_","_","śara","NC","","_","_"
7,"_","_","_","sa_saha","CX","","_","_"
8,"_","_","_","śarāsana","NC","","_","_"
1,"_","_","_","su","CAD","","_","_"
2,"_","_","_","samindh","PPP","","_","_"
3,"mahābhāgaḥ","_","_","mahābhāga","JJ","","_","_"
4,"somakānāṃ","_","_","somaka","NC","","_","_"
5,"_","_","_","mahat","JJ","","_","_"
6,"_","_","_","ratha","NC","","_","_"
1,"tasmin","_","_","tad","PRD","","_","_"
2,"saṃjāyamāne","_","_","saṃjan","KDP","","_","_"
3,"ca","_","_","ca","CCD","","_","_"
4,"vāg","_","_","vāc","NC","","_","_"
5,"_","_","_","vak","V","vac","_","_"
6,"_","_","_","aśarīrin","JJ","","_","_"
1,"eṣa","_","_","tad","PRD","","_","_"
2,"_","_","_","mṛtyu","NC","","_","_"
3,"_","_","_","ca","CCD","","_","_"
4,"_","_","_","śiṣya","NC","","_","_"
5,"_","_","_","ca","CCD","","_","_"
6,"bhāradvājasya","_","_","bhāradvāja","NC","","_","_"
7,"jāyate","_","_","jan","V","jan","_","_"
1,"svasā","_","_","svasṛ","NC","","_","_"
2,"tasya","_","_","tad","PRD","","_","_"
3,"tu","_","_","tu","CCD","","_","_"
4,"_","_","_","vedi","NC","","_","_"
5,"_","_","_","ca","CCD","","_","_"
6,"jātā","_","_","jan","PPP","","_","_"
7,"tasmin","_","_","tad","PRD","","_","_"
8,"_","_","_","mahat","JJ","","_","_"
9,"_","_","_","makha","NC","","_","_"
1,"_","_","_","strī","NC","","_","_"
2,"_","_","_","ratna","NC","","_","_"
3,"a","_","_","alpha_privativum","JJ","","_","_"
3,"asitāpāṅgī","_","_","sitāpāṅga","JJ","","_","_"
4,"śyāmā","_","_","śyāma","JJ","","_","_"
5,"nīlotpalaṃ","_","_","nīlotpala","NC","","_","_"
6,"yathā","_","_","yathā","CCM","","_","_"
1,"tāṃ","_","_","tad","PRD","","_","_"
2,"yajñasenasya","_","_","yajñasa","NC","","_","_"
3,"sutāṃ","_","_","sutā","NC","","_","_"
4,"draupadīṃ","_","_","draupadī","NC","","_","_"
5,"_","_","_","parama","JJ","","_","_"
6,"_","_","_","strī","NC","","_","_"
1,"_","_","_","ga","V","ga","_","_"
2,"_","_","_","tatra","CAD","","_","_"
3,"vai","_","_","vai","CX","","_","_"
4,"draṣṭuṃ","_","_","dṛś","CGDI","","_","_"
5,"taṃ","_","_","tad","PRD","","_","_"
6,"_","_","_","ca","CCD","","_","_"
7,"_","_","_","eva","CEM","","_","_"
8,"_","_","_","ida","PRD","","_","_"
9,"svayaṃvaram","_","_","svayaṃvara","NC","","_","_"
1,"rājāno","_","_","rājan","NC","","_","_"
2,"_","_","_","rājan","NC","","_","_"
3,"_","_","_","putra","NC","","_","_"
4,"_","_","_","ca","CCD","","_","_"
5,"yajvāno","_","_","yajvan","NC","","_","_"
6,"_","_","_","bhūri","JQ","","_","_"
7,"_","_","_","dakṣiṇā","NC","","_","_"
1,"svādhyāyavantaḥ","_","_","svādhyāyavat","JJ","","_","_"
2,"śucayo","_","_","śuci","JJ","","_","_"
3,"mahātmāno","_","_","mahātman","JJ","","_","_"
4,"_","_","_","dhṛ","PPP","","_","_"
5,"_","_","_","vrata","NC","","_","_"
1,"taruṇā","_","_","taruṇa","JJ","","_","_"
2,"_","_","_","dṛś","KDG","","_","_"
3,"_","_","_","ca","CCD","","_","_"
4,"balavanto","_","_","balavat","JJ","","_","_"
5,"durāsadāḥ","_","_","durāsada","JJ","","_","_"
1,"_","_","_","mahat","JJ","","_","_"
2,"_","_","_","ratha","NC","","_","_"
3,"_","_","_","kṛtāstra","JJ","","_","_"
4,"_","_","_","ca","CCD","","_","_"
5,"_","_","_","sami","V","sami","_","_"
6,"_","_","_","iha","CAD","","_","_"
7,"bhūmipāḥ","_","_","bhūmipa","NC","","_","_"
1,"te","_","_","tad","PRD","","_","_"
2,"tatra","_","_","tatra","CAD","","_","_"
3,"vividhaṃ","_","_","vividha","JJ","","_","_"
4,"dānaṃ","_","_","dāna","NC","","_","_"
5,"_","_","_","vijaya","NC","","_","_"
6,"_","_","_","artha","NC","","_","_"
7,"nareśvarāḥ","_","_","nareśvara","NC","","_","_"
1,"pradāsyanti","_","_","pradad","V","pradā","_","_"
2,"dhanaṃ","_","_","dhana","NC","","_","_"
3,"_","_","_","go","NC","","_","_"
4,"_","_","_","ca","CCD","","_","_"
5,"bhakṣyaṃ","_","_","bhakṣya","NC","","_","_"
6,"bhojyaṃ","_","_","bhojya","NC","","_","_"
7,"ca","_","_","ca","CCD","","_","_"
8,"sarvaśaḥ","_","_","sarvaśas","CX","","_","_"
1,"pratilabhya","_","_","pratilabh","CGDA","","_","_"
2,"ca","_","_","ca","CCD","","_","_"
3,"tat","_","_","tad","PRD","","_","_"
4,"sarvaṃ","_","_","sarva","JQ","","_","_"
5,"dṛṣṭvā","_","_","dṛś","CGDA","","_","_"
6,"kṛṣṇāṃ","_","_","kṛṣṇā","NC","","_","_"
7,"svayaṃvare","_","_","svayaṃvara","NC","","_","_"
1,"yaṃ","_","_","yad","PRL","","_","_"
2,"ca","_","_","ca","CCD","","_","_"
3,"sā","_","_","tad","PRD","","_","_"
4,"kṣatriyaṃ","_","_","kṣatriya","NC","","_","_"
5,"raṅge","_","_","raṅga","NC","","_","_"
6,"kumārī","_","_","kumārī","NC","","_","_"
7,"varayiṣyati","_","_","varay","V","varay","_","_"
1,"naṭā","_","_","naṭa","NC","","_","_"
2,"_","_","_","vaitālika","NC","","_","_"
3,"_","_","_","ca","CCD","","_","_"
4,"_","_","_","eva","CEM","","_","_"
5,"nartakāḥ","_","_","nartaka","NC","","_","_"
6,"_","_","_","sūta","NC","","_","_"
7,"_","_","_","māgadha","NC","","_","_"
1,"_","_","_","niyodhaka","NC","","_","_"
2,"_","_","_","ca","CCD","","_","_"
3,"deśebhyaḥ","_","_","deśa","NC","","_","_"
4,"sameṣyanti","_","_","sami","V","sami","_","_"
5,"_","_","_","mahat","JJ","","_","_"
6,"_","_","_","bala","NC","","_","_"
1,"etat","_","_","tad","PRD","","_","_"
2,"kautūhalaṃ","_","_","kautūhala","NC","","_","_"
3,"tatra","_","_","tatra","CAD","","_","_"
4,"dṛṣṭvā","_","_","dṛś","CGDA","","_","_"
5,"vai","_","_","vai","CX","","_","_"
6,"pratigṛhya","_","_","pratigrah","CGDA","","_","_"
7,"ca","_","_","ca","CCD","","_","_"
1,"_","_","_","saha","CX","","_","_"
2,"_","_","_","mat","PPR","","_","_"
3,"mahātmāno","_","_","mahātman","JJ","","_","_"
4,"mātrā","_","_","mātṛ","NC","","_","_"
5,"saha","_","_","saha","CX","","_","_"
6,"nivartsyatha","_","_","nivart","V","nivṛt","_","_"
1,"_","_","_","darśanīya","JJ","","_","_"
2,"_","_","_","ca","CCD","","_","_"
3,"vaḥ","_","_","tvat","PPR","","_","_"
4,"sarvān","_","_","sarva","JQ","","_","_"
5,"_","_","_","eka","PPX","","_","_"
6,"_","_","_","rūpa","NC","","_","_"
7,"avasthitān","_","_","avasthā","PPP","","_","_"
1,"samīkṣya","_","_","samīkṣ","CGDA","","_","_"
2,"kṛṣṇā","_","_","kṛṣṇā","NC","","_","_"
3,"varayet","_","_","vṛ","V","vṛ","_","_"
4,"_","_","_","saṃga","CGDA","","_","_"
5,"_","_","_","anyatama","JJ","","_","_"
6,"patim","_","_","pati","NC","","_","_"
1,"ayam","_","_","ida","PRD","","_","_"
2,"_","_","_","eka","PPX","","_","_"
3,"_","_","_","ca","CCD","","_","_"
4,"vo","_","_","tvat","PPR","","_","_"
5,"bhrātā","_","_","bhrātṛ","NC","","_","_"
6,"darśanīyo","_","_","darśanīya","JJ","","_","_"
7,"_","_","_","mahat","JJ","","_","_"
8,"_","_","_","bhuja","NC","","_","_"
1,"niyudhyamāno","_","_","niyudh","KDP","","_","_"
2,"vijayet","_","_","vijay","V","viji","_","_"
3,"saṃgatyā","_","_","saṃgati","NC","","_","_"
4,"draviṇaṃ","_","_","draviṇa","NC","","_","_"
5,"mahat","_","_","mahat","JJ","","_","_"
1,"paramaṃ","_","_","parama","JJ","","_","_"
2,"bho","_","_","bho","CX","","_","_"
3,"gamiṣyāmo","_","_","ga","V","ga","_","_"
4,"draṣṭuṃ","_","_","dṛś","CGDI","","_","_"
5,"tatra","_","_","tatra","CAD","","_","_"
6,"svayaṃvaram","_","_","svayaṃvara","NC","","_","_"
1,"draupadīṃ","_","_","draupadī","NC","","_","_"
2,"yajñasenasya","_","_","yajñasa","NC","","_","_"
3,"kanyāṃ","_","_","kanyā","NC","","_","_"
4,"_","_","_","tad","PRD","","_","_"
5,"_","_","_","tathā","CX","","_","_"
6,"_","_","_","utsava","NC","","_","_"
