"WordID","word","NormSTEM","suffix","lemma","PoS","Root","NormSuffix","NormWord"
1,"ubhā","_","_","ubh","PPX","","_","_"
2,"hi","_","_","hi","CX","","_","_"
3,"dasrā","_","_","dasra","JJ","","_","_"
4,"bhiṣajā","_","_","bhiṣaj","NC","","_","_"
5,"_","_","_","mayobhu","JJ","","_","_"
6,"_","_","_","ubh","PPX","","_","_"
7,"dakṣasya","_","_","dakṣa","JJ","","_","_"
8,"vacaso","_","_","vacas","NC","","_","_"
9,"babhūvathuḥ","_","_","bhav","V","bhū","_","_"
1,"tā","_","_","tad","PRD","","_","_"
2,"vāṃ","_","_","tvat","PPR","","_","_"
3,"viśvako","_","_","viśvaka","NC","","_","_"
4,"havate","_","_","hvā","V","hvā","_","_"
5,"_","_","_","tanū","NC","","_","_"
6,"_","_","_","kṛtha","NC","","_","_"
7,"mā","_","_","mā","CNG","","_","_"
8,"no","_","_","mat","PPR","","_","_"
9,"vi","_","_","vi","CADP","","_","_"
10,"yauṣṭaṃ","_","_","yu","V","yu","_","_"
11,"sakhyā","_","_","sakhya","NC","","_","_"
12,"mumocatam","_","_","muñc","V","muc","_","_"
1,"kathā","_","_","kathā","CX","","_","_"
2,"nūnaṃ","_","_","nūna","CX","","_","_"
3,"vāṃ","_","_","tvat","PPR","","_","_"
4,"vimanā","_","_","vimanas","JJ","","_","_"
5,"upa","_","_","upa","CADP","","_","_"
6,"stavad","_","_","stu","V","stu","_","_"
7,"yuvaṃ","_","_","tvat","PPR","","_","_"
8,"dhiyaṃ","_","_","dhī","NC","","_","_"
9,"dadathur","_","_","dad","V","dā","_","_"
10,"vasyaiṣṭaye","_","_","vasyaiṣṭi","NC","","_","_"
1,"tā","_","_","tad","PRD","","_","_"
2,"vāṃ","_","_","tvat","PPR","","_","_"
3,"viśvako","_","_","viśvaka","NC","","_","_"
4,"havate","_","_","hvā","V","hvā","_","_"
5,"_","_","_","tanū","NC","","_","_"
6,"_","_","_","kṛtha","NC","","_","_"
7,"mā","_","_","mā","CNG","","_","_"
8,"no","_","_","mat","PPR","","_","_"
9,"vi","_","_","vi","CADP","","_","_"
10,"yauṣṭaṃ","_","_","yu","V","yu","_","_"
11,"sakhyā","_","_","sakhya","NC","","_","_"
12,"mumocatam","_","_","muñc","V","muc","_","_"
1,"yuvaṃ","_","_","tvat","PPR","","_","_"
2,"hi","_","_","hi","CX","","_","_"
3,"ṣmā","_","_","sma","CX","","_","_"
4,"_","_","_","puru","JJ","","_","_"
5,"_","_","_","bhuj","JJ","","_","_"
6,"_","_","_","ida","PRD","","_","_"
7,"edhatuṃ","_","_","edhatu","NC","","_","_"
8,"viṣṇāpve","_","_","viṣṇāpū","NC","","_","_"
9,"dadathur","_","_","dad","V","dā","_","_"
10,"vasyaiṣṭaye","_","_","vasyaiṣṭi","NC","","_","_"
1,"tā","_","_","tad","PRD","","_","_"
2,"vāṃ","_","_","tvat","PPR","","_","_"
3,"viśvako","_","_","viśvaka","NC","","_","_"
4,"havate","_","_","hvā","V","hvā","_","_"
5,"_","_","_","tanū","NC","","_","_"
6,"_","_","_","kṛtha","NC","","_","_"
7,"mā","_","_","mā","CNG","","_","_"
8,"no","_","_","mat","PPR","","_","_"
9,"vi","_","_","vi","CADP","","_","_"
10,"yauṣṭaṃ","_","_","yu","V","yu","_","_"
11,"sakhyā","_","_","sakhya","NC","","_","_"
12,"mumocatam","_","_","muñc","V","muc","_","_"
1,"uta","_","_","uta","CCD","","_","_"
2,"tyaṃ","_","_","tya","PRD","","_","_"
3,"vīraṃ","_","_","vīra","NC","","_","_"
4,"_","_","_","dhana","NC","","_","_"
5,"_","_","_","sā","JJ","","_","_"
6,"ṛjīṣiṇaṃ","_","_","ṛjīṣin","JJ","","_","_"
7,"dūre","_","_","dūra","NC","","_","_"
8,"cit","_","_","cit","CEM","","_","_"
9,"santam","_","_","as","KDP","","_","_"
10,"avase","_","_","av","CGDI","","_","_"
11,"havāmahe","_","_","hvā","V","hvā","_","_"
1,"yasya","_","_","yad","PRL","","_","_"
2,"svādiṣṭhā","_","_","svādiṣṭha","JJ","","_","_"
3,"sumatiḥ","_","_","sumati","NC","","_","_"
4,"pitur","_","_","pitṛ","NC","","_","_"
5,"yathā","_","_","yathā","CCM","","_","_"
6,"mā","_","_","mā","CNG","","_","_"
7,"no","_","_","mat","PPR","","_","_"
8,"vi","_","_","vi","CADP","","_","_"
9,"yauṣṭaṃ","_","_","yu","V","yu","_","_"
10,"sakhyā","_","_","sakhya","NC","","_","_"
11,"mumocatam","_","_","muñc","V","muc","_","_"
1,"ṛtena","_","_","ṛta","NC","","_","_"
2,"devaḥ","_","_","deva","NC","","_","_"
3,"savitā","_","_","savitṛ","NC","","_","_"
4,"śamāyata","_","_","śamāy","V","śamāy","_","_"
5,"ṛtasya","_","_","ṛta","NC","","_","_"
6,"śṛṅgam","_","_","śṛṅga","NC","","_","_"
7,"urviyā","_","_","urviyā","CX","","_","_"
8,"vi","_","_","vi","CADP","","_","_"
9,"paprathe","_","_","prath","V","prath","_","_"
1,"ṛtaṃ","_","_","ṛta","NC","","_","_"
2,"sāsāha","_","_","sah","V","sah","_","_"
3,"mahi","_","_","mahi","JJ","","_","_"
4,"cit","_","_","cit","CEM","","_","_"
5,"pṛtanyato","_","_","pṛtany","KDP","","_","_"
6,"mā","_","_","mā","CNG","","_","_"
7,"no","_","_","mat","PPR","","_","_"
8,"vi","_","_","vi","CADP","","_","_"
9,"yauṣṭaṃ","_","_","yu","V","yu","_","_"
10,"sakhyā","_","_","sakhya","NC","","_","_"
11,"mumocatam","_","_","muñc","V","muc","_","_"
