"WordID","word","NormSTEM","suffix","lemma","PoS","Root","NormSuffix","NormWord"
1,"parāśara","_","_","parāśara","NC","","_","_"
2,"uvāca","_","_","vak","V","vac","_","_"
1,"_","_","_","manoratha","NC","","_","_"
2,"_","_","_","ratha","NC","","_","_"
3,"prāpya","_","_","prāp","CGDA","","_","_"
4,"_","_","_","indriya","NC","","_","_"
5,"_","_","_","artha","NC","","_","_"
6,"_","_","_","haya","NC","","_","_"
7,"naraḥ","_","_","nara","NC","","_","_"
1,"raśmibhir","_","_","raśmi","NC","","_","_"
2,"_","_","_","jñāna","NC","","_","_"
3,"_","_","_","sambhū","PPP","","_","_"
4,"yo","_","_","yad","PRL","","_","_"
5,"gacchati","_","_","gacch","V","gam","_","_"
6,"sa","_","_","tad","PRD","","_","_"
7,"buddhimān","_","_","buddhimat","JJ","","_","_"
1,"_","_","_","sevā","NC","","_","_"
2,"_","_","_","āśri","PPP","","_","_"
3,"manasā","_","_","manas","NC","","_","_"
4,"_","_","_","vṛtti","NC","","_","_"
5,"_","_","_","hā","PPP","","_","_"
6,"śasyate","_","_","śaṃs","V","śaṃs","_","_"
1,"_","_","_","dvijāti","NC","","_","_"
2,"_","_","_","hasta","NC","","_","_"
3,"_","_","_","nirvṛt","PPP","","_","_"
4,"na","_","_","na","CNG","","_","_"
5,"tu","_","_","tu","CCD","","_","_"
6,"tulyāt","_","_","tulya","JJ","","_","_"
7,"parasparam","_","_","paraspara","PRC","","_","_"
1,"āyur","_","_","āyus","NC","","_","_"
2,"_","_","_","na","CNG","","_","_"
3,"_","_","_","sulabha","JJ","","_","_"
4,"labdhvā","_","_","labh","CGDA","","_","_"
5,"_","_","_","na","CNG","","_","_"
6,"_","_","_","avakṛṣ","V","avakṛṣ","_","_"
7,"viśāṃ","_","_","viś","NC","","_","_"
8,"pate","_","_","pati","NC","","_","_"
1,"_","_","_","utkarṣa","NC","","_","_"
2,"_","_","_","artha","NC","","_","_"
3,"prayatate","_","_","prayat","V","prayat","_","_"
4,"naraḥ","_","_","nara","NC","","_","_"
5,"puṇyena","_","_","puṇya","JJ","","_","_"
6,"karmaṇā","_","_","karman","NC","","_","_"
1,"varṇebhyo","_","_","varṇa","NC","","_","_"
2,"'pi","_","_","api","CX","","_","_"
3,"paribhraṣṭaḥ","_","_","paribhraṃś","PPP","","_","_"
4,"sa","_","_","tad","PRD","","_","_"
5,"vai","_","_","vai","CX","","_","_"
6,"saṃmānam","_","_","sammāna","NC","","_","_"
7,"arhati","_","_","arh","V","arh","_","_"
1,"na","_","_","na","CNG","","_","_"
2,"tu","_","_","tu","CCD","","_","_"
3,"yaḥ","_","_","yad","PRL","","_","_"
4,"satkriyāṃ","_","_","satkriyā","NC","","_","_"
5,"prāpya","_","_","prāp","CGDA","","_","_"
6,"rājasaṃ","_","_","rājasa","JJ","","_","_"
7,"karma","_","_","karman","NC","","_","_"
8,"sevate","_","_","sev","V","sev","_","_"
1,"_","_","_","varṇa","NC","","_","_"
2,"_","_","_","utkarṣa","NC","","_","_"
3,"avāpnoti","_","_","avāpn","V","avāp","_","_"
4,"naraḥ","_","_","nara","NC","","_","_"
5,"puṇyena","_","_","puṇya","JJ","","_","_"
6,"karmaṇā","_","_","karman","NC","","_","_"
1,"durlabhaṃ","_","_","durlabha","JJ","","_","_"
2,"tam","_","_","tad","PRD","","_","_"
3,"a","_","_","alpha_privativum","JJ","","_","_"
3,"alabdhā","_","_","labdhṛ","JJ","","_","_"
4,"hi","_","_","hi","CX","","_","_"
5,"hanyāt","_","_","han","V","han","_","_"
6,"pāpena","_","_","pāpa","JJ","","_","_"
7,"karmaṇā","_","_","karman","NC","","_","_"
1,"_","_","_","ajñāna","NC","","_","_"
2,"_","_","_","hi","CX","","_","_"
3,"kṛtaṃ","_","_","kṛ","PPP","","_","_"
4,"pāpaṃ","_","_","pāpa","NC","","_","_"
5,"_","_","_","tapas","NC","","_","_"
6,"_","_","_","eva","CEM","","_","_"
7,"_","_","_","abhinirṇud","V","abhinirṇud","_","_"
1,"pāpaṃ","_","_","pāpa","JJ","","_","_"
2,"hi","_","_","hi","CX","","_","_"
3,"karma","_","_","karman","NC","","_","_"
4,"phalati","_","_","phal","V","phal","_","_"
5,"pāpam","_","_","pāpa","NC","","_","_"
6,"eva","_","_","eva","CEM","","_","_"
7,"svayaṃ","_","_","svaya","CX","","_","_"
8,"kṛtam","_","_","kṛ","PPP","","_","_"
1,"tasmāt","_","_","tasmāt","CX","","_","_"
2,"pāpaṃ","_","_","pāpa","JJ","","_","_"
3,"na","_","_","na","CNG","","_","_"
4,"seveta","_","_","sev","V","sev","_","_"
5,"karma","_","_","karman","NC","","_","_"
6,"_","_","_","duḥkha","NC","","_","_"
7,"_","_","_","phala","NC","","_","_"
8,"_","_","_","udaya","NC","","_","_"
1,"_","_","_","pāpa","NC","","_","_"
2,"_","_","_","anubandha","NC","","_","_"
3,"yat","_","_","yad","PRL","","_","_"
4,"karma","_","_","karman","NC","","_","_"
5,"_","_","_","yadi","CSB","","_","_"
6,"_","_","_","api","CX","","_","_"
7,"_","_","_","as","V","as","_","_"
8,"_","_","_","mahat","JJ","","_","_"
9,"_","_","_","phala","NC","","_","_"
1,"na","_","_","na","CNG","","_","_"
2,"tat","_","_","tad","PRD","","_","_"
3,"seveta","_","_","sev","V","sev","_","_"
4,"medhāvī","_","_","medhāvin","JJ","","_","_"
5,"śuciḥ","_","_","śuci","JJ","","_","_"
6,"kusalilaṃ","_","_","kusalila","NC","","_","_"
7,"yathā","_","_","yathā","CCM","","_","_"
1,"_","_","_","kiṃ","PRQ","","_","_"
2,"_","_","_","kaṣṭa","JJ","","_","_"
3,"anupaśyāmi","_","_","anupaś","V","anupaś","_","_"
4,"phalaṃ","_","_","phala","NC","","_","_"
5,"pāpasya","_","_","pāpa","JJ","","_","_"
6,"karmaṇaḥ","_","_","karman","NC","","_","_"
1,"pratyāpannasya","_","_","pratyāpad","PPP","","_","_"
2,"hi","_","_","hi","CX","","_","_"
3,"sato","_","_","as","KDP","","_","_"
4,"_","_","_","na","CNG","","_","_"
5,"_","_","_","ātman","NC","","_","_"
6,"tāvad","_","_","tāvat","CX","","_","_"
7,"virocate","_","_","viroc","V","viruc","_","_"
1,"_","_","_","pratyāpatti","NC","","_","_"
2,"_","_","_","ca","CCD","","_","_"
3,"_","_","_","yad","PRL","","_","_"
4,"_","_","_","iha","CAD","","_","_"
5,"bāliśasya","_","_","bāliśa","NC","","_","_"
6,"na","_","_","na","CNG","","_","_"
7,"jāyate","_","_","jan","V","jan","_","_"
1,"_","_","_","tad","PRD","","_","_"
2,"_","_","_","api","CX","","_","_"
3,"_","_","_","su","CAD","","_","_"
4,"_","_","_","mahat","JJ","","_","_"
5,"_","_","_","tāpa","NC","","_","_"
6,"_","_","_","prasthā","PPP","","_","_"
7,"_","_","_","upajan","V","upajan","_","_"
1,"viraktaṃ","_","_","virañj","PPP","","_","_"
2,"śodhyate","_","_","śodhay","V","śodhay","_","_"
3,"vastraṃ","_","_","vastra","NC","","_","_"
4,"na","_","_","na","CNG","","_","_"
5,"tu","_","_","tu","CCD","","_","_"
6,"_","_","_","kṛṣṇa","JJ","","_","_"
7,"_","_","_","upasaṃdhā","PPP","","_","_"
1,"prayatnena","_","_","prayatna","NC","","_","_"
2,"_","_","_","manuṣya","NC","","_","_"
3,"_","_","_","indra","NC","","_","_"
4,"pāpam","_","_","pāpa","NC","","_","_"
5,"evaṃ","_","_","eva","CX","","_","_"
6,"nibodha","_","_","nibodh","V","nibudh","_","_"
7,"me","_","_","mat","PPR","","_","_"
1,"svayaṃ","_","_","svaya","CX","","_","_"
2,"kṛtvā","_","_","kṛ","CGDA","","_","_"
3,"tu","_","_","tu","CCD","","_","_"
4,"yaḥ","_","_","yad","PRL","","_","_"
5,"pāpaṃ","_","_","pāpa","NC","","_","_"
6,"śubham","_","_","śubha","JJ","","_","_"
7,"_","_","_","eva","CEM","","_","_"
8,"_","_","_","anuṣṭhā","V","anuṣṭhā","_","_"
1,"prāyaścittaṃ","_","_","prāyaścitta","NC","","_","_"
2,"naraḥ","_","_","nara","NC","","_","_"
3,"kartum","_","_","kṛ","CGDI","","_","_"
4,"ubhayaṃ","_","_","ubhaya","JJ","","_","_"
5,"so","_","_","tad","PRD","","_","_"
6,"'śnute","_","_","aś","V","aś","_","_"
7,"pṛthak","_","_","pṛthak","CX","","_","_"
1,"ajñānāt","_","_","ajñāna","NC","","_","_"
2,"tu","_","_","tu","CCD","","_","_"
3,"kṛtāṃ","_","_","kṛ","PPP","","_","_"
4,"hiṃsām","_","_","hiṃsā","NC","","_","_"
5,"ahiṃsā","_","_","ahiṃsā","NC","","_","_"
6,"vyapakarṣati","_","_","vyapakṛṣ","V","vyapakṛṣ","_","_"
1,"brāhmaṇāḥ","_","_","brāhmaṇa","NC","","_","_"
2,"_","_","_","śāstra","NC","","_","_"
3,"_","_","_","nirdeśa","NC","","_","_"
4,"_","_","_","iti","CQT","","_","_"
5,"_","_","_","ah","V","ah","_","_"
6,"_","_","_","brahman","NC","","_","_"
7,"_","_","_","vādin","JJ","","_","_"
1,"tathā","_","_","tathā","CX","","_","_"
2,"_","_","_","kāma","NC","","_","_"
3,"_","_","_","kṛ","PPP","","_","_"
4,"_","_","_","ca","CCD","","_","_"
5,"_","_","_","ida","PRD","","_","_"
6,"_","_","_","vihiṃsā","NC","","_","_"
7,"_","_","_","eva","CEM","","_","_"
8,"_","_","_","apakṛṣ","V","apakṛṣ","_","_"
1,"_","_","_","iti","CQT","","_","_"
2,"_","_","_","ah","V","ah","_","_"
3,"_","_","_","dharma","NC","","_","_"
4,"_","_","_","śāstra","NC","","_","_"
5,"_","_","_","jña","JJ","","_","_"
6,"brāhmaṇā","_","_","brāhmaṇa","NC","","_","_"
7,"vedapāragāḥ","_","_","vedapāraga","NC","","_","_"
1,"ahaṃ","_","_","mat","PPR","","_","_"
2,"tu","_","_","tu","CCD","","_","_"
3,"tāvat","_","_","tāvat","CX","","_","_"
4,"paśyāmi","_","_","paś","V","paś","_","_"
5,"karma","_","_","karman","NC","","_","_"
6,"yad","_","_","yad","PRL","","_","_"
7,"vartate","_","_","vart","V","vṛt","_","_"
8,"kṛtam","_","_","kṛ","PPP","","_","_"
1,"_","_","_","guṇa","NC","","_","_"
2,"_","_","_","yuj","PPP","","_","_"
3,"prakāśaṃ","_","_","prakāśa","JJ","","_","_"
4,"ca","_","_","ca","CCD","","_","_"
5,"_","_","_","pāpa","JJ","","_","_"
6,"_","_","_","anupasaṃhita","JJ","","_","_"
1,"yathā","_","_","yathā","CCM","","_","_"
2,"sūkṣmāṇi","_","_","sūkṣma","JJ","","_","_"
3,"karmāṇi","_","_","karman","NC","","_","_"
4,"_","_","_","phal","V","phal","_","_"
5,"_","_","_","iha","CAD","","_","_"
6,"yathātatham","_","_","yathātatha","JJ","","_","_"
1,"_","_","_","buddhi","NC","","_","_"
2,"_","_","_","yuj","PPP","","_","_"
3,"_","_","_","tad","PRD","","_","_"
4,"_","_","_","iha","CAD","","_","_"
5,"kṛtāni","_","_","kṛ","PPP","","_","_"
6,"manasā","_","_","manas","NC","","_","_"
7,"saha","_","_","saha","CX","","_","_"
1,"_","_","_","bhav","V","bhū","_","_"
2,"_","_","_","alpa","JJ","","_","_"
3,"_","_","_","phala","NC","","_","_"
4,"karma","_","_","karman","NC","","_","_"
5,"sevitaṃ","_","_","sev","PPP","","_","_"
6,"nityam","_","_","nitya","CX","","_","_"
7,"ulbaṇam","_","_","ulbaṇa","JJ","","_","_"
1,"_","_","_","abuddhi","JJ","","_","_"
2,"_","_","_","pūrva","PPX","","_","_"
3,"_","_","_","dharma","NC","","_","_"
4,"_","_","_","jña","JJ","","_","_"
5,"kṛtam","_","_","kṛ","PPP","","_","_"
6,"ugreṇa","_","_","ugra","JJ","","_","_"
7,"karmaṇā","_","_","karman","NC","","_","_"
1,"kṛtāni","_","_","kṛ","PPP","","_","_"
2,"yāni","_","_","yad","PRL","","_","_"
3,"karmāṇi","_","_","karman","NC","","_","_"
4,"daivatair","_","_","daivata","JJ","","_","_"
5,"_","_","_","muni","NC","","_","_"
6,"_","_","_","tathā","CX","","_","_"
1,"_","_","_","na","CNG","","_","_"
2,"_","_","_","ācar","V","ācar","_","_"
3,"tāni","_","_","tad","PRD","","_","_"
4,"_","_","_","dharma","NC","","_","_"
5,"_","_","_","ātman","NC","","_","_"
6,"śrutvā","_","_","śru","CGDA","","_","_"
7,"_","_","_","ca","CCD","","_","_"
8,"_","_","_","api","CX","","_","_"
9,"na","_","_","na","CNG","","_","_"
10,"kutsayet","_","_","kutsay","V","kutsay","_","_"
1,"saṃcintya","_","_","saṃcintay","CGDA","","_","_"
2,"manasā","_","_","manas","NC","","_","_"
3,"rājan","_","_","rājan","NC","","_","_"
4,"viditvā","_","_","vid","CGDA","","_","_"
5,"śaktim","_","_","śakti","NC","","_","_"
6,"ātmanaḥ","_","_","ātman","NC","","_","_"
1,"karoti","_","_","kar","V","kṛ","_","_"
2,"yaḥ","_","_","yad","PRL","","_","_"
3,"śubhaṃ","_","_","śubha","JJ","","_","_"
4,"karma","_","_","karman","NC","","_","_"
5,"sa","_","_","tad","PRD","","_","_"
6,"vai","_","_","vai","CX","","_","_"
7,"bhadrāṇi","_","_","bhadra","JJ","","_","_"
8,"paśyati","_","_","paś","V","paś","_","_"
1,"nave","_","_","nava","JJ","","_","_"
2,"kapāle","_","_","kapāla","NC","","_","_"
3,"salilaṃ","_","_","salila","NC","","_","_"
4,"saṃnyastaṃ","_","_","saṃnyas","PPP","","_","_"
5,"hīyate","_","_","jah","V","hā","_","_"
6,"yathā","_","_","yathā","CCM","","_","_"
1,"navetare","_","_","navetara","JJ","","_","_"
2,"_","_","_","tathā","CX","","_","_"
3,"_","_","_","abhāva","NC","","_","_"
4,"prāpnoti","_","_","prāpn","V","prāp","_","_"
5,"_","_","_","sukha","NC","","_","_"
6,"_","_","_","bhāvay","PPP","","_","_"
1,"_","_","_","sa_saha","CX","","_","_"
2,"_","_","_","toya","NC","","_","_"
3,"'nyat","_","_","anya","PPX","","_","_"
4,"tu","_","_","tu","CCD","","_","_"
5,"yat","_","_","yad","PRL","","_","_"
6,"toyaṃ","_","_","toya","NC","","_","_"
7,"tasminn","_","_","tad","PRD","","_","_"
8,"eva","_","_","eva","CEM","","_","_"
9,"prasicyate","_","_","prasic","V","prasic","_","_"
1,"vṛddhe","_","_","vṛddha","JJ","","_","_"
2,"vṛddhim","_","_","vṛddhi","NC","","_","_"
3,"avāpnoti","_","_","avāpn","V","avāp","_","_"
4,"salile","_","_","salila","NC","","_","_"
5,"salilaṃ","_","_","salila","NC","","_","_"
6,"yathā","_","_","yathā","CCM","","_","_"
1,"evaṃ","_","_","eva","CX","","_","_"
2,"karmāṇi","_","_","karman","NC","","_","_"
3,"_","_","_","yad","PRL","","_","_"
4,"_","_","_","iha","CAD","","_","_"
5,"_","_","_","buddhi","NC","","_","_"
6,"_","_","_","yuj","PPP","","_","_"
7,"bhūpate","_","_","bhūpati","NC","","_","_"
1,"_","_","_","na","CNG","","_","_"
2,"_","_","_","sama","PPX","","_","_"
3,"_","_","_","iha","CAD","","_","_"
4,"hīnāni","_","_","hā","PPP","","_","_"
5,"tāni","_","_","tad","PRD","","_","_"
6,"_","_","_","puṇyatama","JJ","","_","_"
7,"_","_","_","api","CX","","_","_"
1,"rājñā","_","_","rājan","NC","","_","_"
2,"jetavyāḥ","_","_","ji","KDG","","_","_"
3,"_","_","_","sa_saha","CX","","_","_"
4,"_","_","_","āyudha","NC","","_","_"
5,"_","_","_","ca","CCD","","_","_"
6,"_","_","_","unna","PPP","","_","_"
7,"_","_","_","ca","CCD","","_","_"
8,"samyak","_","_","samyak","CX","","_","_"
9,"kartavyaṃ","_","_","kṛ","KDG","","_","_"
10,"pālanaṃ","_","_","pālana","NC","","_","_"
11,"ca","_","_","ca","CCD","","_","_"
12,"prajānām","_","_","prajā","NC","","_","_"
1,"_","_","_","agni","NC","","_","_"
2,"_","_","_","ci","KDG","","_","_"
3,"_","_","_","bahu","JJ","","_","_"
4,"_","_","_","ca","CCD","","_","_"
5,"_","_","_","api","CX","","_","_"
6,"yajñair","_","_","yajña","NC","","_","_"
7,"ante","_","_","anta","NC","","_","_"
8,"madhye","_","_","madhya","NC","","_","_"
9,"vā","_","_","vā","CCD","","_","_"
10,"vanam","_","_","vana","NC","","_","_"
11,"āśritya","_","_","āśri","CGDA","","_","_"
12,"stheyam","_","_","sthā","KDG","","_","_"
1,"_","_","_","dama","NC","","_","_"
2,"_","_","_","anvita","JJ","","_","_"
3,"puruṣo","_","_","puruṣa","NC","","_","_"
4,"_","_","_","dharma","NC","","_","_"
5,"_","_","_","śīla","NC","","_","_"
6,"bhūtāni","_","_","bhūta","NC","","_","_"
7,"_","_","_","ca","CCD","","_","_"
8,"_","_","_","ātman","NC","","_","_"
9,"_","_","_","iva","CCM","","_","_"
10,"_","_","_","anupaś","V","anupaś","_","_"
1,"garīyasaḥ","_","_","garīyas","JJ","","_","_"
2,"pūjayed","_","_","pūj","V","pūj","_","_"
3,"_","_","_","ātman","NC","","_","_"
4,"_","_","_","śakti","NC","","_","_"
5,"satyena","_","_","satya","NC","","_","_"
6,"śīlena","_","_","śīla","NC","","_","_"
7,"sukhaṃ","_","_","sukha","CX","","_","_"
8,"narendra","_","_","narendra","NC","","_","_"
