"WordID","word","NormSTEM","suffix","lemma","PoS","Root","NormSuffix","NormWord"
1,"_","_","_","grāvan","NC","","_","_"
2,"_","_","_","iva","CCM","","_","_"
3,"tad","_","_","tad","PRD","","_","_"
4,"id","_","_","id","CEM","","_","_"
5,"arthaṃ","_","_","artha","NC","","_","_"
6,"jarethe","_","_","jar","V","jṛ","_","_"
7,"_","_","_","gṛdhra","NC","","_","_"
8,"_","_","_","iva","CCM","","_","_"
9,"vṛkṣaṃ","_","_","vṛkṣa","NC","","_","_"
10,"nidhimantam","_","_","nidhimat","JJ","","_","_"
11,"accha","_","_","acchā","CADP","","_","_"
1,"_","_","_","brahman","NC","","_","_"
2,"_","_","_","iva","CCM","","_","_"
3,"vidatha","_","_","vidatha","NC","","_","_"
4,"_","_","_","uktha","NC","","_","_"
5,"_","_","_","śās","NC","","_","_"
6,"_","_","_","dūta","NC","","_","_"
7,"_","_","_","iva","CCM","","_","_"
8,"havyā","_","_","hu","KDG","","_","_"
9,"janyā","_","_","janya","NC","","_","_"
10,"purutrā","_","_","purutrā","CX","","_","_"
1,"_","_","_","prātar","CX","","_","_"
2,"_","_","_","yāvan","NC","","_","_"
3,"_","_","_","rathya","JJ","","_","_"
4,"_","_","_","iva","CCM","","_","_"
5,"_","_","_","vīra","NC","","_","_"
6,"_","_","_","aja","NC","","_","_"
7,"_","_","_","iva","CCM","","_","_"
8,"yamā","_","_","yama","NC","","_","_"
9,"varam","_","_","vara","NC","","_","_"
10,"ā","_","_","ā","CADP","","_","_"
11,"sacethe","_","_","sac","V","sac","_","_"
1,"mene","_","_","menā","NC","","_","_"
2,"iva","_","_","iva","CCM","","_","_"
3,"tanvā","_","_","tanū","NC","","_","_"
4,"śumbhamāne","_","_","śubh","KDP","","_","_"
5,"_","_","_","dampati","NC","","_","_"
6,"_","_","_","iva","CCM","","_","_"
7,"_","_","_","kratu","NC","","_","_"
8,"_","_","_","vid","JJ","","_","_"
9,"janeṣu","_","_","jana","NC","","_","_"
1,"_","_","_","śṛṅga","NC","","_","_"
2,"_","_","_","iva","CCM","","_","_"
3,"naḥ","_","_","mat","PPR","","_","_"
4,"prathamā","_","_","prathama","JJ","","_","_"
5,"gantam","_","_","ganta","V","ga","_","_"
6,"arvāk","_","_","arvāk","CX","","_","_"
7,"chaphāv","_","_","śapha","NC","","_","_"
8,"iva","_","_","iva","CCM","","_","_"
9,"jarbhurāṇā","_","_","jarbhur","KDP","","_","_"
10,"tarobhiḥ","_","_","taras","NC","","_","_"
1,"_","_","_","cakravāka","NC","","_","_"
2,"_","_","_","iva","CCM","","_","_"
3,"prati","_","_","prati","CADP","","_","_"
4,"vastor","_","_","vastu","NC","","_","_"
5,"_","_","_","usra","NC","","_","_"
6,"_","_","_","arvāñc","JJ","","_","_"
7,"yātaṃ","_","_","yā","V","yā","_","_"
8,"_","_","_","rathya","JJ","","_","_"
9,"_","_","_","iva","CCM","","_","_"
10,"śakrā","_","_","śakra","JJ","","_","_"
1,"_","_","_","nau","NC","","_","_"
2,"_","_","_","iva","CCM","","_","_"
3,"naḥ","_","_","mat","PPR","","_","_"
4,"pārayataṃ","_","_","pāray","V","pāray","_","_"
5,"_","_","_","yuga","NC","","_","_"
6,"_","_","_","iva","CCM","","_","_"
7,"_","_","_","nabhya","NC","","_","_"
8,"_","_","_","iva","CCM","","_","_"
9,"na","_","_","mat","PPR","","_","_"
10,"_","_","_","upadhi","NC","","_","_"
11,"_","_","_","iva","CCM","","_","_"
12,"_","_","_","pradhi","NC","","_","_"
13,"_","_","_","iva","CCM","","_","_"
1,"_","_","_","śvan","NC","","_","_"
2,"_","_","_","iva","CCM","","_","_"
3,"no","_","_","mat","PPR","","_","_"
4,"ariṣaṇyā","_","_","ariṣaṇya","JJ","","_","_"
5,"tanūnāṃ","_","_","tanū","NC","","_","_"
6,"_","_","_","khṛgala","NC","","_","_"
7,"_","_","_","iva","CCM","","_","_"
8,"visrasaḥ","_","_","visraṃs","CGDI","","_","_"
9,"pātam","_","_","pib","V","pā","_","_"
10,"asmān","_","_","mat","PPR","","_","_"
1,"_","_","_","vāta","NC","","_","_"
2,"_","_","_","iva","CCM","","_","_"
3,"a","_","_","alpha_privativum","JJ","","_","_"
3,"_","_","_","jurya","JJ","","_","_"
4,"_","_","_","nadī","NC","","_","_"
5,"_","_","_","iva","CCM","","_","_"
6,"rītir","_","_","rīti","NC","","_","_"
7,"akṣī","_","_","akṣi","NC","","_","_"
8,"iva","_","_","iva","CCM","","_","_"
9,"cakṣuṣā","_","_","cakṣus","NC","","_","_"
10,"yātam","_","_","yā","V","yā","_","_"
11,"arvāk","_","_","arvāk","CX","","_","_"
1,"hastāv","_","_","hasta","NC","","_","_"
2,"iva","_","_","iva","CCM","","_","_"
3,"tanve","_","_","tanū","NC","","_","_"
4,"śambhaviṣṭhā","_","_","śambhaviṣṭha","JJ","","_","_"
5,"_","_","_","pāda","NC","","_","_"
6,"_","_","_","iva","CCM","","_","_"
7,"no","_","_","mat","PPR","","_","_"
8,"nayataṃ","_","_","nay","V","nī","_","_"
9,"vasyo","_","_","vasyas","NC","","_","_"
10,"accha","_","_","acchā","CADP","","_","_"
1,"oṣṭhāv","_","_","oṣṭha","NC","","_","_"
2,"iva","_","_","iva","CCM","","_","_"
3,"madhv","_","_","madhu","NC","","_","_"
4,"āsne","_","_","āsan","NC","","_","_"
5,"vadantā","_","_","vad","KDP","","_","_"
6,"stanāv","_","_","stana","NC","","_","_"
7,"iva","_","_","iva","CCM","","_","_"
8,"pipyataṃ","_","_","pyā","V","pyā","_","_"
9,"jīvase","_","_","jīv","CGDI","","_","_"
10,"naḥ","_","_","mat","PPR","","_","_"
1,"_","_","_","nāsā","NC","","_","_"
2,"_","_","_","iva","CCM","","_","_"
3,"nas","_","_","mat","PPR","","_","_"
4,"tanvo","_","_","tanū","NC","","_","_"
5,"rakṣitārā","_","_","rakṣitṛ","JJ","","_","_"
6,"karṇāv","_","_","karṇa","NC","","_","_"
7,"iva","_","_","iva","CCM","","_","_"
8,"_","_","_","su","CAD","","_","_"
9,"_","_","_","śrut","JJ","","_","_"
10,"bhūtam","_","_","bhav","V","bhū","_","_"
11,"asme","_","_","mat","PPR","","_","_"
1,"_","_","_","hasta","NC","","_","_"
2,"_","_","_","iva","CCM","","_","_"
3,"śaktim","_","_","śakti","NC","","_","_"
4,"abhi","_","_","abhi","CADP","","_","_"
5,"saṃdadī","_","_","saṃdadi","JJ","","_","_"
6,"naḥ","_","_","mat","PPR","","_","_"
7,"_","_","_","kṣa","NC","","_","_"
8,"_","_","_","iva","CCM","","_","_"
9,"naḥ","_","_","mat","PPR","","_","_"
10,"sam","_","_","sa","CADP","","_","_"
11,"ajataṃ","_","_","aj","V","aj","_","_"
12,"rajāṃsi","_","_","rajas","NC","","_","_"
1,"imā","_","_","ida","PRD","","_","_"
2,"giro","_","_","gir","NC","","_","_"
3,"aśvinā","_","_","aśvin","NC","","_","_"
4,"yuṣmayantīḥ","_","_","yuṣmayat","JJ","","_","_"
5,"_","_","_","kṣṇotra","NC","","_","_"
6,"_","_","_","iva","CCM","","_","_"
7,"svadhitiṃ","_","_","svadhiti","NC","","_","_"
8,"saṃ","_","_","sa","CADP","","_","_"
9,"śiśītam","_","_","śā","V","śā","_","_"
1,"etāni","_","_","tad","PRD","","_","_"
2,"vām","_","_","tvat","PPR","","_","_"
3,"aśvinā","_","_","aśvin","NC","","_","_"
4,"vardhanāni","_","_","vardhana","JJ","","_","_"
5,"brahma","_","_","brahman","NC","","_","_"
6,"stomaṃ","_","_","stoma","NC","","_","_"
7,"gṛtsamadāso","_","_","gṛtsamada","NC","","_","_"
8,"akran","_","_","kar","V","kṛ","_","_"
1,"tāni","_","_","tad","PRD","","_","_"
2,"narā","_","_","nṛ","NC","","_","_"
3,"_","_","_","juṣ","KDP","","_","_"
4,"_","_","_","upa","CADP","","_","_"
5,"yātam","_","_","yā","V","yā","_","_"
6,"bṛhad","_","_","bṛhat","NC","","_","_"
7,"vadema","_","_","vad","V","vad","_","_"
8,"vidathe","_","_","vidatha","NC","","_","_"
9,"_","_","_","su","CAD","","_","_"
10,"_","_","_","vīra","NC","","_","_"
