"WordID","word","NormSTEM","suffix","lemma","PoS","Root","NormSuffix","NormWord"
1,"saṃjaya","_","_","saṃjaya","NC","","_","_"
2,"uvāca","_","_","vak","V","vac","_","_"
1,"priyam","_","_","priya","JJ","","_","_"
2,"indrasya","_","_","indra","NC","","_","_"
3,"satataṃ","_","_","satata","CX","","_","_"
4,"sakhāyam","_","_","sakhi","NC","","_","_"
5,"_","_","_","amita","JJ","","_","_"
6,"_","_","_","ojas","NC","","_","_"
1,"hatvā","_","_","han","CGDA","","_","_"
2,"prāgjyotiṣaṃ","_","_","prāgjyotiṣa","NC","","_","_"
3,"pārthaḥ","_","_","pārtha","NC","","_","_"
4,"pradakṣiṇam","_","_","pradakṣiṇa","JJ","","_","_"
5,"avartata","_","_","vart","V","vṛt","_","_"
1,"tato","_","_","tatas","CX","","_","_"
2,"gāndhārarājasya","_","_","gāndhārarāja","NC","","_","_"
3,"sutau","_","_","suta","NC","","_","_"
4,"parapuraṃjayau","_","_","parapuraṃjaya","JJ","","_","_"
1,"ārchetām","_","_","ṛch","V","ṛch","_","_"
2,"arjunaṃ","_","_","arjuna","NC","","_","_"
3,"saṃkhye","_","_","saṃkhya","NC","","_","_"
4,"bhrātarau","_","_","bhrātṛ","NC","","_","_"
5,"_","_","_","vṛṣaka","NC","","_","_"
6,"_","_","_","acala","NC","","_","_"
1,"tau","_","_","tad","PRD","","_","_"
2,"_","_","_","same","CGDA","","_","_"
3,"_","_","_","arjuna","NC","","_","_"
4,"vīrau","_","_","vīra","NC","","_","_"
5,"puraḥ","_","_","puras","CX","","_","_"
6,"_","_","_","paścāt","CAD","","_","_"
7,"_","_","_","ca","CCD","","_","_"
8,"dhanvinau","_","_","dhanvin","JJ","","_","_"
1,"avidhyetāṃ","_","_","vyadh","V","vyadh","_","_"
2,"_","_","_","mahat","JJ","","_","_"
3,"_","_","_","vega","NC","","_","_"
4,"niśitair","_","_","niśā","PPP","","_","_"
5,"āśugair","_","_","āśuga","NC","","_","_"
6,"bhṛśam","_","_","bhṛśa","CX","","_","_"
1,"vṛṣakasya","_","_","vṛṣaka","NC","","_","_"
2,"hayān","_","_","haya","NC","","_","_"
3,"sūtaṃ","_","_","sūta","NC","","_","_"
4,"_","_","_","dhanus","NC","","_","_"
5,"_","_","_","chattra","NC","","_","_"
6,"rathaṃ","_","_","ratha","NC","","_","_"
7,"dhvajam","_","_","dhvaja","NC","","_","_"
1,"tilaśo","_","_","tilaśas","CX","","_","_"
2,"vyadhamat","_","_","vidha","V","vidha","_","_"
3,"pārthaḥ","_","_","pārtha","NC","","_","_"
4,"saubalasya","_","_","saubala","NC","","_","_"
5,"śitaiḥ","_","_","śā","PPP","","_","_"
6,"śaraiḥ","_","_","śara","NC","","_","_"
1,"tato","_","_","tatas","CX","","_","_"
2,"'rjunaḥ","_","_","arjuna","NC","","_","_"
3,"_","_","_","śara","NC","","_","_"
4,"_","_","_","vrāta","NC","","_","_"
5,"_","_","_","nānā","CX","","_","_"
6,"_","_","_","praharaṇa","NC","","_","_"
7,"api","_","_","api","CX","","_","_"
1,"gāndhārān","_","_","gāndhāra","NC","","_","_"
2,"_","_","_","vyākula","JJ","","_","_"
3,"_","_","_","kar","V","kṛ","_","_"
4,"_","_","_","saubala","NC","","_","_"
5,"_","_","_","pramukha","JJ","","_","_"
6,"punaḥ","_","_","punar","CAD","","_","_"
1,"tataḥ","_","_","tatas","CX","","_","_"
2,"pañcaśatān","_","_","pañcaśata","JJ","","_","_"
3,"vīrān","_","_","vīra","NC","","_","_"
4,"gāndhārān","_","_","gāndhāra","NC","","_","_"
5,"_","_","_","udya","PPP","","_","_"
6,"_","_","_","āyudha","NC","","_","_"
1,"_","_","_","prahi","V","prahi","_","_"
2,"_","_","_","mṛtyu","NC","","_","_"
3,"_","_","_","loka","NC","","_","_"
4,"kruddho","_","_","krudh","PPP","","_","_"
5,"bāṇair","_","_","bāṇa","NC","","_","_"
6,"dhanaṃjayaḥ","_","_","dhanaṃjaya","NC","","_","_"
1,"_","_","_","han","PPP","","_","_"
2,"_","_","_","aśva","NC","","_","_"
3,"tu","_","_","tu","CCD","","_","_"
4,"rathāt","_","_","ratha","NC","","_","_"
5,"tūrṇam","_","_","tūrṇa","CX","","_","_"
6,"avatīrya","_","_","avatṛ","CGDA","","_","_"
7,"_","_","_","mahat","JJ","","_","_"
8,"_","_","_","bhuja","NC","","_","_"
1,"āruroha","_","_","āroh","V","āruh","_","_"
2,"rathaṃ","_","_","ratha","NC","","_","_"
3,"bhrātur","_","_","bhrātṛ","NC","","_","_"
4,"_","_","_","anya","PPX","","_","_"
5,"_","_","_","ca","CCD","","_","_"
6,"dhanur","_","_","dhanus","NC","","_","_"
7,"ādade","_","_","ādad","V","ādā","_","_"
1,"_","_","_","tad","PRD","","_","_"
2,"_","_","_","eka","PPX","","_","_"
3,"_","_","_","ratha","NC","","_","_"
4,"ārūḍhau","_","_","āruh","PPP","","_","_"
5,"bhrātarau","_","_","bhrātṛ","NC","","_","_"
6,"_","_","_","vṛṣaka","NC","","_","_"
7,"_","_","_","acala","NC","","_","_"
1,"_","_","_","śara","NC","","_","_"
2,"_","_","_","varṣa","NC","","_","_"
3,"bībhatsum","_","_","bībhatsu","NC","","_","_"
4,"avidhyetāṃ","_","_","vyadh","V","vyadh","_","_"
5,"punaḥ","_","_","punar","CAD","","_","_"
6,"punaḥ","_","_","punar","CAD","","_","_"
1,"syālau","_","_","syāla","NC","","_","_"
2,"tava","_","_","tvat","PPR","","_","_"
3,"mahātmānau","_","_","mahātman","JJ","","_","_"
4,"rājānau","_","_","rājan","NC","","_","_"
5,"_","_","_","vṛṣaka","NC","","_","_"
6,"_","_","_","acala","NC","","_","_"
1,"bhṛśaṃ","_","_","bhṛśa","CX","","_","_"
2,"nijaghnatuḥ","_","_","nihan","V","nihan","_","_"
3,"pārtham","_","_","pārtha","NC","","_","_"
4,"indraṃ","_","_","indra","NC","","_","_"
5,"_","_","_","vṛtra","NC","","_","_"
6,"_","_","_","bala","NC","","_","_"
7,"_","_","_","iva","CCM","","_","_"
1,"_","_","_","labh","PPP","","_","_"
2,"_","_","_","lakṣya","NC","","_","_"
3,"tu","_","_","tu","CCD","","_","_"
4,"gāndhārāv","_","_","gāndhāra","NC","","_","_"
5,"ahatāṃ","_","_","han","V","han","_","_"
6,"pāṇḍavaṃ","_","_","pāṇḍava","NC","","_","_"
7,"punaḥ","_","_","punar","CAD","","_","_"
1,"_","_","_","nidāgha","NC","","_","_"
2,"_","_","_","vārṣika","JJ","","_","_"
3,"māsau","_","_","māsa","NC","","_","_"
4,"lokaṃ","_","_","loka","NC","","_","_"
5,"gharmāmbubhir","_","_","gharmāmbu","NC","","_","_"
6,"yathā","_","_","yathā","CCM","","_","_"
1,"tau","_","_","tad","PRD","","_","_"
2,"_","_","_","ratha","NC","","_","_"
3,"_","_","_","stha","JJ","","_","_"
4,"_","_","_","nara","NC","","_","_"
5,"_","_","_","vyāghra","NC","","_","_"
6,"rājānau","_","_","rājan","NC","","_","_"
7,"_","_","_","vṛṣaka","NC","","_","_"
8,"_","_","_","acala","NC","","_","_"
1,"_","_","_","saṃśliṣ","PPP","","_","_"
2,"_","_","_","aṅga","NC","","_","_"
3,"sthitau","_","_","sthā","PPP","","_","_"
4,"rājañ","_","_","rājan","NC","","_","_"
5,"_","_","_","han","V","han","_","_"
6,"_","_","_","eka","PPX","","_","_"
7,"_","_","_","iṣu","NC","","_","_"
8,"_","_","_","arjuna","NC","","_","_"
1,"tau","_","_","tad","PRD","","_","_"
2,"rathāt","_","_","ratha","NC","","_","_"
3,"_","_","_","siṃha","NC","","_","_"
4,"_","_","_","saṃkāśa","NC","","_","_"
5,"_","_","_","lohita","JJ","","_","_"
6,"_","_","_","akṣa","NC","","_","_"
7,"_","_","_","mahat","JJ","","_","_"
8,"_","_","_","bhuja","NC","","_","_"
1,"gatāsū","_","_","gatāsu","JJ","","_","_"
2,"petatur","_","_","pat","V","pat","_","_"
3,"vīrau","_","_","vīra","NC","","_","_"
4,"_","_","_","sodarya","JJ","","_","_"
5,"_","_","_","eka","PPX","","_","_"
6,"_","_","_","lakṣaṇa","NC","","_","_"
1,"tayor","_","_","tad","PRD","","_","_"
2,"dehau","_","_","deha","NC","","_","_"
3,"rathād","_","_","ratha","NC","","_","_"
4,"bhūmiṃ","_","_","bhūmi","NC","","_","_"
5,"gatau","_","_","ga","PPP","","_","_"
6,"_","_","_","bandhu","NC","","_","_"
7,"_","_","_","jana","NC","","_","_"
8,"_","_","_","priya","JJ","","_","_"
1,"yaśo","_","_","yaśas","NC","","_","_"
2,"daśa","_","_","daśan","NUM","","_","_"
3,"diśaḥ","_","_","diś","NC","","_","_"
4,"puṇyaṃ","_","_","puṇya","JJ","","_","_"
5,"gamayitvā","_","_","gamay","CGDA","","_","_"
6,"vyavasthitau","_","_","vyavasthā","PPP","","_","_"
1,"dṛṣṭvā","_","_","dṛś","CGDA","","_","_"
2,"vinihatau","_","_","vinihan","PPP","","_","_"
3,"saṃkhye","_","_","saṃkhya","NC","","_","_"
4,"_","_","_","mātula","NC","","_","_"
5,"a","_","_","alpha_privativum","JJ","","_","_"
5,"_","_","_","palāyin","JJ","","_","_"
1,"bhṛśaṃ","_","_","bhṛśa","CX","","_","_"
2,"mumucur","_","_","muñc","V","muc","_","_"
3,"aśrūṇi","_","_","aśru","NC","","_","_"
4,"_","_","_","putra","NC","","_","_"
5,"_","_","_","tvat","PPR","","_","_"
6,"viśāṃ","_","_","viś","NC","","_","_"
7,"pate","_","_","pati","NC","","_","_"
1,"nihatau","_","_","nihan","PPP","","_","_"
2,"bhrātarau","_","_","bhrātṛ","NC","","_","_"
3,"dṛṣṭvā","_","_","dṛś","CGDA","","_","_"
4,"_","_","_","māyā","NC","","_","_"
5,"_","_","_","śata","NUM","","_","_"
6,"_","_","_","viśārada","JJ","","_","_"
1,"kṛṣṇau","_","_","kṛṣṇa","NC","","_","_"
2,"_","_","_","saṃmohay","KDP","","_","_"
3,"_","_","_","māyā","NC","","_","_"
4,"vidadhe","_","_","vidadh","V","vidhā","_","_"
5,"_","_","_","śakuni","NC","","_","_"
6,"_","_","_","tatas","CX","","_","_"
1,"_","_","_","laguḍa","NC","","_","_"
2,"_","_","_","ayas","NC","","_","_"
3,"_","_","_","guḍa","NC","","_","_"
4,"_","_","_","aśman","NC","","_","_"
5,"_","_","_","śataghnī","NC","","_","_"
6,"_","_","_","ca","CCD","","_","_"
7,"_","_","_","sa_saha","CX","","_","_"
8,"_","_","_","śakti","NC","","_","_"
1,"_","_","_","gadā","NC","","_","_"
2,"_","_","_","parigha","NC","","_","_"
3,"_","_","_","nistriṃśa","NC","","_","_"
4,"_","_","_","śūla","NC","","_","_"
5,"_","_","_","mudgara","NC","","_","_"
6,"_","_","_","paṭṭiśa","NC","","_","_"
1,"_","_","_","sa_saha","CX","","_","_"
2,"_","_","_","kampana","NC","","_","_"
3,"_","_","_","ṛṣṭi","NC","","_","_"
4,"_","_","_","nakhara","NC","","_","_"
5,"musalāni","_","_","musala","NC","","_","_"
6,"paraśvadhāḥ","_","_","paraśvadha","NC","","_","_"
1,"kṣurāḥ","_","_","kṣura","NC","","_","_"
2,"_","_","_","kṣurapra","NC","","_","_"
3,"_","_","_","nālīka","NC","","_","_"
4,"vatsadantās","_","_","vatsadanta","NC","","_","_"
5,"trisaṃdhinaḥ","_","_","trisaṃdhin","NC","","_","_"
1,"cakrāṇi","_","_","cakra","NC","","_","_"
2,"viśikhāḥ","_","_","viśikha","NC","","_","_"
3,"prāsā","_","_","prāsa","NC","","_","_"
4,"_","_","_","vividha","JJ","","_","_"
5,"_","_","_","āyudha","NC","","_","_"
6,"ca","_","_","ca","CCD","","_","_"
1,"prapetuḥ","_","_","prapat","V","prapat","_","_"
2,"sarvato","_","_","sarvatas","CX","","_","_"
3,"digbhyaḥ","_","_","diś","NC","","_","_"
4,"pradigbhyaś","_","_","pradiś","NC","","_","_"
5,"_","_","_","ca","CCD","","_","_"
6,"_","_","_","arjuna","NC","","_","_"
7,"prati","_","_","prati","CADP","","_","_"
1,"_","_","_","khara","NC","","_","_"
2,"_","_","_","uṣṭra","NC","","_","_"
3,"_","_","_","mahiṣa","NC","","_","_"
4,"siṃhā","_","_","siṃha","NC","","_","_"
5,"vyāghrāḥ","_","_","vyāghra","NC","","_","_"
6,"_","_","_","sṛmara","NC","","_","_"
7,"_","_","_","cillikā","NC","","_","_"
1,"ṛkṣāḥ","_","_","ṛkṣa","NC","","_","_"
2,"sālāvṛkā","_","_","śālāvṛka","NC","","_","_"
3,"gṛdhrāḥ","_","_","gṛdhra","NC","","_","_"
4,"kapayo","_","_","kapi","NC","","_","_"
5,"'tha","_","_","atha","CAD","","_","_"
6,"sarīsṛpāḥ","_","_","sarīsṛpa","NC","","_","_"
1,"vividhāni","_","_","vividha","JJ","","_","_"
2,"ca","_","_","ca","CCD","","_","_"
3,"rakṣāṃsi","_","_","rakṣas","NC","","_","_"
4,"_","_","_","kṣudh","PPP","","_","_"
5,"_","_","_","arjuna","NC","","_","_"
6,"prati","_","_","prati","CADP","","_","_"
1,"_","_","_","saṃkrudh","PPP","","_","_"
2,"_","_","_","abhidhāv","V","abhidhāv","_","_"
3,"vividhāni","_","_","vividha","JJ","","_","_"
4,"vayāṃsi","_","_","vayas","NC","","_","_"
5,"ca","_","_","ca","CCD","","_","_"
1,"tato","_","_","tatas","CX","","_","_"
2,"_","_","_","divya","JJ","","_","_"
3,"_","_","_","astra","NC","","_","_"
4,"_","_","_","vid","JJ","","_","_"
5,"_","_","_","śūra","NC","","_","_"
6,"_","_","_","kuntī","NC","","_","_"
7,"_","_","_","putra","NC","","_","_"
8,"dhanaṃjayaḥ","_","_","dhanaṃjaya","NC","","_","_"
1,"visṛjann","_","_","visṛj","KDP","","_","_"
2,"_","_","_","iṣu","NC","","_","_"
3,"_","_","_","jāla","NC","","_","_"
4,"sahasā","_","_","sahasā","CX","","_","_"
5,"_","_","_","tad","PRD","","_","_"
6,"_","_","_","tāḍay","V","tāḍay","_","_"
1,"te","_","_","tad","PRD","","_","_"
2,"hanyamānāḥ","_","_","han","KDP","","_","_"
3,"śūreṇa","_","_","śūra","NC","","_","_"
4,"pravaraiḥ","_","_","pravara","JJ","","_","_"
5,"sāyakair","_","_","sāyaka","NC","","_","_"
6,"dṛḍhaiḥ","_","_","dṛḍha","JJ","","_","_"
1,"viruvanto","_","_","viru","KDP","","_","_"
2,"_","_","_","mahat","JJ","","_","_"
3,"_","_","_","rāva","NC","","_","_"
4,"vineśuḥ","_","_","vinaś","V","vinaś","_","_"
5,"sarvato","_","_","sarvatas","CX","","_","_"
6,"hatāḥ","_","_","han","PPP","","_","_"
1,"_","_","_","tatas","CX","","_","_"
2,"_","_","_","tamas","NC","","_","_"
3,"prādurabhūd","_","_","prādurbhav","V","prādurbhū","_","_"
4,"arjunasya","_","_","arjuna","NC","","_","_"
5,"rathaṃ","_","_","ratha","NC","","_","_"
6,"prati","_","_","prati","CADP","","_","_"
1,"_","_","_","tad","PRD","","_","_"
2,"_","_","_","ca","CCD","","_","_"
3,"tamaso","_","_","tamas","NC","","_","_"
4,"vācaḥ","_","_","vāc","NC","","_","_"
5,"krūrāḥ","_","_","krūra","JJ","","_","_"
6,"pārtham","_","_","pārtha","NC","","_","_"
7,"abhartsayan","_","_","bhartsay","V","bhartsay","_","_"
1,"tat","_","_","tad","PRD","","_","_"
2,"tamo","_","_","tamas","NC","","_","_"
3,"'streṇa","_","_","astra","NC","","_","_"
4,"mahatā","_","_","mahat","JJ","","_","_"
5,"_","_","_","jyotiṣa","NC","","_","_"
6,"_","_","_","arjuna","NC","","_","_"
7,"'vadhīt","_","_","vadh","V","vadh","_","_"
1,"hate","_","_","han","PPP","","_","_"
2,"tasmiñ","_","_","tad","PRD","","_","_"
3,"_","_","_","jala","NC","","_","_"
4,"_","_","_","ogha","NC","","_","_"
5,"_","_","_","tu","CCD","","_","_"
6,"prādurāsan","_","_","prāduras","V","prāduras","_","_"
7,"bhayānakāḥ","_","_","bhayānaka","JJ","","_","_"
1,"_","_","_","ambhas","NC","","_","_"
2,"_","_","_","tad","PRD","","_","_"
3,"_","_","_","nāśa","NC","","_","_"
4,"_","_","_","artha","NC","","_","_"
5,"_","_","_","āditya","NC","","_","_"
6,"_","_","_","astra","NC","","_","_"
7,"_","_","_","atha","CAD","","_","_"
8,"_","_","_","arjuna","NC","","_","_"
1,"_","_","_","prayuj","V","prayuj","_","_"
2,"_","_","_","ambhas","NC","","_","_"
3,"_","_","_","tatas","CX","","_","_"
4,"_","_","_","tad","PRD","","_","_"
5,"prāyaśo","_","_","prāyaśas","CX","","_","_"
6,"'streṇa","_","_","astra","NC","","_","_"
7,"śoṣitam","_","_","śoṣay","PPP","","_","_"
1,"evaṃ","_","_","eva","CX","","_","_"
2,"bahuvidhā","_","_","bahuvidha","JJ","","_","_"
3,"māyāḥ","_","_","māyā","NC","","_","_"
4,"saubalasya","_","_","saubala","NC","","_","_"
5,"kṛtāḥ","_","_","kṛ","PPP","","_","_"
6,"kṛtāḥ","_","_","kṛ","PPP","","_","_"
1,"_","_","_","han","V","han","_","_"
2,"_","_","_","astra","NC","","_","_"
3,"_","_","_","bala","NC","","_","_"
4,"_","_","_","āśu","CX","","_","_"
5,"prahasann","_","_","prahas","KDP","","_","_"
6,"_","_","_","arjuna","NC","","_","_"
7,"_","_","_","tadā","CAD","","_","_"
1,"tathā","_","_","tathā","CX","","_","_"
2,"hatāsu","_","_","han","PPP","","_","_"
3,"māyāsu","_","_","māyā","NC","","_","_"
4,"trasto","_","_","tras","PPP","","_","_"
5,"_","_","_","arjuna","NC","","_","_"
6,"_","_","_","śara","NC","","_","_"
7,"_","_","_","āhan","PPP","","_","_"
1,"_","_","_","apayā","V","apayā","_","_"
2,"_","_","_","javana","JJ","","_","_"
3,"aśvaiḥ","_","_","aśva","NC","","_","_"
4,"śakuniḥ","_","_","śakuni","NC","","_","_"
5,"prākṛto","_","_","prākṛta","JJ","","_","_"
6,"yathā","_","_","yathā","CCM","","_","_"
1,"tato","_","_","tatas","CX","","_","_"
2,"'rjuno","_","_","arjuna","NC","","_","_"
3,"_","_","_","astra","NC","","_","_"
4,"_","_","_","vid","JJ","","_","_"
5,"_","_","_","śraiṣṭhya","NC","","_","_"
6,"darśayann","_","_","darśay","KDP","","_","_"
7,"ātmano","_","_","ātman","NC","","_","_"
8,"'riṣu","_","_","ari","NC","","_","_"
1,"_","_","_","abhivṛṣ","V","abhivṛṣ","_","_"
2,"_","_","_","śara","NC","","_","_"
3,"_","_","_","ogha","NC","","_","_"
4,"kauravāṇām","_","_","kaurava","NC","","_","_"
5,"anīkinīm","_","_","anīkinī","NC","","_","_"
1,"sā","_","_","tad","PRD","","_","_"
2,"hanyamānā","_","_","han","KDP","","_","_"
3,"pārthena","_","_","pārtha","NC","","_","_"
4,"putrasya","_","_","putra","NC","","_","_"
5,"tava","_","_","tvat","PPR","","_","_"
6,"vāhinī","_","_","vāhinī","NC","","_","_"
1,"dvaidhībhūtā","_","_","dvaidhībhū","PPP","","_","_"
2,"_","_","_","mahat","JJ","","_","_"
3,"_","_","_","rāja","NC","","_","_"
4,"_","_","_","gaṅgā","NC","","_","_"
5,"_","_","_","iva","CCM","","_","_"
6,"_","_","_","āsāday","CGDA","","_","_"
7,"parvatam","_","_","parvata","NC","","_","_"
1,"droṇam","_","_","droṇa","NC","","_","_"
2,"_","_","_","eva","CEM","","_","_"
3,"_","_","_","anupad","V","anupad","_","_"
4,"kecit","_","_","kiṃcit","PRI","","_","_"
5,"tatra","_","_","tatra","CAD","","_","_"
6,"_","_","_","mahat","JJ","","_","_"
7,"_","_","_","ratha","NC","","_","_"
1,"kecid","_","_","kiṃcit","PRI","","_","_"
2,"duryodhanaṃ","_","_","duryodhana","NC","","_","_"
3,"rājann","_","_","rājan","NC","","_","_"
4,"ardyamānāḥ","_","_","arday","KDP","","_","_"
5,"kirīṭinā","_","_","kirīṭin","NC","","_","_"
1,"_","_","_","na","CNG","","_","_"
2,"_","_","_","paś","V","paś","_","_"
3,"_","_","_","tatas","CX","","_","_"
4,"_","_","_","tu","CCD","","_","_"
5,"_","_","_","tad","PRD","","_","_"
6,"sainyaṃ","_","_","sainya","NC","","_","_"
7,"vai","_","_","vai","CX","","_","_"
8,"_","_","_","tamas","NC","","_","_"
9,"_","_","_","āvṛ","PPP","","_","_"
1,"gāṇḍīvasya","_","_","gāṇḍīva","NC","","_","_"
2,"ca","_","_","ca","CCD","","_","_"
3,"nirghoṣaḥ","_","_","nirghoṣa","NC","","_","_"
4,"śruto","_","_","śru","PPP","","_","_"
5,"dakṣiṇato","_","_","dakṣiṇatas","CX","","_","_"
6,"mayā","_","_","mat","PPR","","_","_"
1,"_","_","_","śaṅkha","NC","","_","_"
2,"_","_","_","dundubhi","NC","","_","_"
3,"_","_","_","nirghoṣa","NC","","_","_"
4,"vāditrāṇāṃ","_","_","vāditra","NC","","_","_"
5,"ca","_","_","ca","CCD","","_","_"
6,"nisvanam","_","_","nisvana","NC","","_","_"
1,"gāṇḍīvasya","_","_","gāṇḍīva","NC","","_","_"
2,"ca","_","_","ca","CCD","","_","_"
3,"nirghoṣo","_","_","nirghoṣa","NC","","_","_"
4,"_","_","_","vyatikra","CGDA","","_","_"
5,"_","_","_","spṛś","V","spṛś","_","_"
6,"divam","_","_","div","NC","","_","_"
1,"tataḥ","_","_","tatas","CX","","_","_"
2,"punar","_","_","punar","CAD","","_","_"
3,"dakṣiṇataḥ","_","_","dakṣiṇatas","CX","","_","_"
4,"_","_","_","saṃgrāma","NC","","_","_"
5,"_","_","_","citra","JJ","","_","_"
6,"_","_","_","yodhin","JJ","","_","_"
1,"_","_","_","su","CAD","","_","_"
2,"_","_","_","yuddha","NC","","_","_"
3,"_","_","_","arjuna","NC","","_","_"
4,"_","_","_","as","V","as","_","_"
5,"ahaṃ","_","_","mat","PPR","","_","_"
6,"tu","_","_","tu","CCD","","_","_"
7,"droṇam","_","_","droṇa","NC","","_","_"
8,"anvagām","_","_","anugā","V","anugā","_","_"
1,"_","_","_","nānāvidha","JJ","","_","_"
2,"_","_","_","anīka","NC","","_","_"
3,"putrāṇāṃ","_","_","putra","NC","","_","_"
4,"tava","_","_","tvat","PPR","","_","_"
5,"bhārata","_","_","bhārata","NC","","_","_"
1,"arjuno","_","_","arjuna","NC","","_","_"
2,"vyadhamat","_","_","vidha","V","vidha","_","_"
3,"kāle","_","_","kāla","NC","","_","_"
4,"_","_","_","div","NC","","_","_"
5,"_","_","_","iva","CCM","","_","_"
6,"_","_","_","abhra","NC","","_","_"
7,"mārutaḥ","_","_","māruta","NC","","_","_"
1,"taṃ","_","_","tad","PRD","","_","_"
2,"vāsavam","_","_","vāsava","NC","","_","_"
3,"_","_","_","iva","CCM","","_","_"
4,"_","_","_","āyā","KDP","","_","_"
5,"_","_","_","bhūri","JQ","","_","_"
6,"_","_","_","varṣa","NC","","_","_"
7,"_","_","_","śara","NC","","_","_"
8,"_","_","_","oghin","JJ","","_","_"
1,"_","_","_","mahat","JJ","","_","_"
2,"_","_","_","iṣvāsa","NC","","_","_"
3,"_","_","_","nara","NC","","_","_"
4,"_","_","_","vyāghra","NC","","_","_"
5,"_","_","_","na","CNG","","_","_"
6,"_","_","_","ugra","JJ","","_","_"
7,"kaścid","_","_","kiṃcit","PRI","","_","_"
8,"avārayat","_","_","vāray","V","vāray","_","_"
1,"te","_","_","tad","PRD","","_","_"
2,"hanyamānāḥ","_","_","han","KDP","","_","_"
3,"pārthena","_","_","pārtha","NC","","_","_"
4,"tvadīyā","_","_","tvadīya","JJ","","_","_"
5,"vyathitā","_","_","vyath","PPP","","_","_"
6,"bhṛśam","_","_","bhṛśa","CX","","_","_"
1,"svān","_","_","sva","JJ","","_","_"
2,"eva","_","_","eva","CEM","","_","_"
3,"bahavo","_","_","bahu","JJ","","_","_"
4,"jaghnur","_","_","han","V","han","_","_"
5,"_","_","_","vidru","KDP","","_","_"
6,"_","_","_","tatas","CX","","_","_"
7,"_","_","_","tatas","CX","","_","_"
1,"te","_","_","tad","PRD","","_","_"
2,"'rjunena","_","_","arjuna","NC","","_","_"
3,"śarā","_","_","śara","NC","","_","_"
4,"muktāḥ","_","_","muc","PPP","","_","_"
5,"_","_","_","kaṅka","NC","","_","_"
6,"_","_","_","pattra","NC","","_","_"
7,"_","_","_","tanu","NC","","_","_"
8,"_","_","_","chid","JJ","","_","_"
1,"śalabhā","_","_","śalabha","NC","","_","_"
2,"iva","_","_","iva","CCM","","_","_"
3,"saṃpetuḥ","_","_","sampat","V","sampat","_","_"
4,"saṃvṛṇvānā","_","_","saṃvṛ","KDP","","_","_"
5,"diśo","_","_","diś","NC","","_","_"
6,"daśa","_","_","daśan","NUM","","_","_"
1,"turagaṃ","_","_","turaga","NC","","_","_"
2,"rathinaṃ","_","_","rathin","NC","","_","_"
3,"nāgaṃ","_","_","nāga","NC","","_","_"
4,"padātim","_","_","padāti","NC","","_","_"
5,"api","_","_","api","CX","","_","_"
6,"māriṣa","_","_","māriṣa","NC","","_","_"
1,"vinirbhidya","_","_","vinirbhid","CGDA","","_","_"
2,"kṣitiṃ","_","_","kṣiti","NC","","_","_"
3,"jagmur","_","_","ga","V","ga","_","_"
4,"valmīkam","_","_","valmīka","NC","","_","_"
5,"iva","_","_","iva","CCM","","_","_"
6,"pannagāḥ","_","_","pannaga","NC","","_","_"
1,"na","_","_","na","CNG","","_","_"
2,"ca","_","_","ca","CCD","","_","_"
3,"dvitīyaṃ","_","_","dvitīya","JJ","","_","_"
4,"vyasṛjat","_","_","visṛj","V","visṛj","_","_"
5,"_","_","_","kuñjara","NC","","_","_"
6,"_","_","_","aśva","NC","","_","_"
7,"_","_","_","nara","NC","","_","_"
8,"saḥ","_","_","tad","PRD","","_","_"
1,"pṛthag","_","_","pṛthak","CX","","_","_"
2,"_","_","_","eka","PPX","","_","_"
3,"_","_","_","śara","NC","","_","_"
4,"_","_","_","āruj","PPP","","_","_"
5,"_","_","_","nipat","V","nipat","_","_"
6,"_","_","_","tad","PRD","","_","_"
7,"gatāsavaḥ","_","_","gatāsu","JJ","","_","_"
1,"hatair","_","_","han","PPP","","_","_"
2,"_","_","_","manuṣya","NC","","_","_"
3,"_","_","_","turaga","NC","","_","_"
4,"_","_","_","ca","CCD","","_","_"
5,"sarvataḥ","_","_","sarvatas","CX","","_","_"
6,"_","_","_","śara","NC","","_","_"
7,"_","_","_","abhivṛṣ","PPP","","_","_"
8,"_","_","_","dvirada","NC","","_","_"
9,"_","_","_","ca","CCD","","_","_"
10,"pātitaiḥ","_","_","pātay","PPP","","_","_"
1,"tadā","_","_","tadā","CAD","","_","_"
2,"śvagomāyubaḍābhināditaṃ","_","_","vicitra","JJ","","_","_"
3,"_","_","_","āyodha","NC","","_","_"
4,"_","_","_","śiras","NC","","_","_"
5,"āyodhaśiro","_","_","bhav","V","bhū","_","_"
6,"babhūva","_","_","ha","CEM","","_","_"
1,"pitā","_","_","pitṛ","NC","","_","_"
2,"sutaṃ","_","_","suta","NC","","_","_"
3,"tyajati","_","_","tyaj","V","tyaj","_","_"
4,"_","_","_","suhṛd","NC","","_","_"
5,"_","_","_","vara","JJ","","_","_"
6,"suhṛt","_","_","suhṛd","NC","","_","_"
7,"_","_","_","tathā","CX","","_","_"
8,"_","_","_","eva","CEM","","_","_"
9,"putraḥ","_","_","putra","NC","","_","_"
10,"pitaraṃ","_","_","pitṛ","NC","","_","_"
11,"_","_","_","śara","NC","","_","_"
12,"_","_","_","ātura","JJ","","_","_"
1,"_","_","_","sva","JJ","","_","_"
2,"_","_","_","rakṣaṇa","NC","","_","_"
3,"_","_","_","kṛ","PPP","","_","_"
4,"_","_","_","mati","NC","","_","_"
5,"_","_","_","tadā","CAD","","_","_"
6,"janās","_","_","jana","NC","","_","_"
7,"tyajanti","_","_","tyaj","V","tyaj","_","_"
8,"vāhān","_","_","vāha","NC","","_","_"
9,"api","_","_","api","CX","","_","_"
10,"_","_","_","pārtha","NC","","_","_"
11,"_","_","_","pīḍay","PPP","","_","_"
