"WordID","word","NormSTEM","suffix","lemma","PoS","Root","NormSuffix","NormWord"
1,"brahmacārīṣṇaṃś","_","_","brahmacārīṣṇat","JJ","","_","_"
2,"carati","_","_","car","V","car","_","_"
3,"rodasī","_","_","rodasī","NC","","_","_"
4,"ubhe","_","_","ubh","PPX","","_","_"
5,"tasmin","_","_","tad","PRD","","_","_"
6,"devāḥ","_","_","deva","NC","","_","_"
7,"saṃmanaso","_","_","sammanas","JJ","","_","_"
8,"bhavanti","_","_","bhav","V","bhū","_","_"
1,"sa","_","_","tad","PRD","","_","_"
2,"dādhāra","_","_","dhar","V","dhṛ","_","_"
3,"pṛthivīṃ","_","_","pṛthivī","NC","","_","_"
4,"divaṃ","_","_","div","NC","","_","_"
5,"ca","_","_","ca","CCD","","_","_"
6,"sa","_","_","tad","PRD","","_","_"
7,"ācāryaṃ","_","_","ācārya","NC","","_","_"
8,"tapasā","_","_","tapas","NC","","_","_"
9,"piparti","_","_","pṛ","V","pṛ","_","_"
1,"brahmacāriṇaṃ","_","_","brahmacārin","NC","","_","_"
2,"pitaro","_","_","pitṛ","NC","","_","_"
3,"_","_","_","deva","NC","","_","_"
4,"_","_","_","jana","NC","","_","_"
5,"pṛthag","_","_","pṛthak","CX","","_","_"
6,"devā","_","_","deva","NC","","_","_"
7,"anusaṃyanti","_","_","anusami","V","anusami","_","_"
8,"sarve","_","_","sarva","JQ","","_","_"
1,"gandharvā","_","_","gandharva","NC","","_","_"
2,"enam","_","_","a","PRD","","_","_"
3,"anv","_","_","anu","CADP","","_","_"
4,"āyan","_","_","e","V","i","_","_"
5,"trayastriṃśat","_","_","trayastriṃśat","NC","","_","_"
6,"_","_","_","tri","NUM","","_","_"
7,"_","_","_","śata","NUM","","_","_"
8,"_","_","_","ṣaṣ","NUM","","_","_"
9,"_","_","_","sahasra","NUM","","_","_"
10,"sarvānt","_","_","sarva","JQ","","_","_"
11,"sa","_","_","tad","PRD","","_","_"
12,"devāṃs","_","_","deva","NC","","_","_"
13,"tapasā","_","_","tapas","NC","","_","_"
14,"piparti","_","_","pṛ","V","pṛ","_","_"
1,"ācārya","_","_","ācārya","NC","","_","_"
2,"upanayamāno","_","_","upanī","KDP","","_","_"
3,"brahmacāriṇaṃ","_","_","brahmacārin","NC","","_","_"
4,"kṛṇute","_","_","kar","V","kṛ","_","_"
5,"garbham","_","_","garbha","NC","","_","_"
6,"antaḥ","_","_","antar","CAD","","_","_"
1,"taṃ","_","_","tad","PRD","","_","_"
2,"rātrīs","_","_","rātri","NC","","_","_"
3,"tisra","_","_","tri","NUM","","_","_"
4,"udare","_","_","udara","NC","","_","_"
5,"bibharti","_","_","bhṛ","V","bhṛ","_","_"
6,"taṃ","_","_","tad","PRD","","_","_"
7,"jātaṃ","_","_","jan","PPP","","_","_"
8,"draṣṭum","_","_","dṛś","CGDI","","_","_"
9,"abhisaṃyanti","_","_","abhisami","V","abhisami","_","_"
10,"devāḥ","_","_","deva","NC","","_","_"
1,"iyaṃ","_","_","ida","PRD","","_","_"
2,"samit","_","_","samidh","NC","","_","_"
3,"pṛthivī","_","_","pṛthivī","NC","","_","_"
4,"dyaur","_","_","div","NC","","_","_"
5,"_","_","_","dvitīya","JJ","","_","_"
6,"_","_","_","uta","CCD","","_","_"
7,"_","_","_","antarikṣa","NC","","_","_"
8,"samidhā","_","_","samidh","NC","","_","_"
9,"pṛṇāti","_","_","pṛ","V","pṛ","_","_"
1,"brahmacārī","_","_","brahmacārin","NC","","_","_"
2,"samidhā","_","_","samidh","NC","","_","_"
3,"mekhalayā","_","_","mekhalā","NC","","_","_"
4,"śrameṇa","_","_","śrama","NC","","_","_"
5,"lokāṃs","_","_","loka","NC","","_","_"
6,"tapasā","_","_","tapas","NC","","_","_"
7,"piparti","_","_","pṛ","V","pṛ","_","_"
1,"pūrvo","_","_","pūrva","PPX","","_","_"
2,"jāto","_","_","jan","PPP","","_","_"
3,"brahmaṇo","_","_","brahman","NC","","_","_"
4,"brahmacārī","_","_","brahmacārin","NC","","_","_"
5,"gharmaṃ","_","_","gharma","NC","","_","_"
6,"vasānas","_","_","vas","KDP","","_","_"
7,"_","_","_","tapas","NC","","_","_"
8,"_","_","_","utthā","V","utthā","_","_"
1,"tasmāj","_","_","tad","PRD","","_","_"
2,"jātaṃ","_","_","jan","PPP","","_","_"
3,"brāhmaṇaṃ","_","_","brāhmaṇa","NC","","_","_"
4,"brahma","_","_","brahman","NC","","_","_"
5,"jyeṣṭhaṃ","_","_","jyeṣṭha","JJ","","_","_"
6,"devāś","_","_","deva","NC","","_","_"
7,"ca","_","_","ca","CCD","","_","_"
8,"sarve","_","_","sarva","JQ","","_","_"
9,"amṛtena","_","_","amṛta","NC","","_","_"
10,"sākam","_","_","sāka","CX","","_","_"
1,"brahmacāry","_","_","brahmacārin","NC","","_","_"
2,"eti","_","_","e","V","i","_","_"
3,"samidhā","_","_","samidh","NC","","_","_"
4,"samiddhaḥ","_","_","samindh","PPP","","_","_"
5,"kārṣṇaṃ","_","_","kārṣṇa","JJ","","_","_"
6,"vasāno","_","_","vas","KDP","","_","_"
7,"dīkṣito","_","_","dīkṣ","PPP","","_","_"
8,"_","_","_","dīrgha","JJ","","_","_"
9,"_","_","_","śmaśru","NC","","_","_"
1,"sa","_","_","tad","PRD","","_","_"
2,"sadya","_","_","sadyas","CAD","","_","_"
3,"eti","_","_","e","V","i","_","_"
4,"pūrvasmād","_","_","pūrva","PPX","","_","_"
5,"uttaraṃ","_","_","uttara","JJ","","_","_"
6,"samudraṃ","_","_","samudra","NC","","_","_"
7,"lokānt","_","_","loka","NC","","_","_"
8,"saṃgṛbhya","_","_","saṃgrah","CGDA","","_","_"
9,"muhur","_","_","muhur","CX","","_","_"
10,"ācarikrat","_","_","ākarikṛ","V","ākarikṛ","_","_"
1,"brahmacārī","_","_","brahmacārin","NC","","_","_"
2,"janayan","_","_","janay","KDP","","_","_"
3,"_","_","_","brahman","NC","","_","_"
4,"_","_","_","ap","NC","","_","_"
5,"lokaṃ","_","_","loka","NC","","_","_"
6,"prajāpatiṃ","_","_","prajāpati","NC","","_","_"
7,"parameṣṭhinaṃ","_","_","parameṣṭhin","JJ","","_","_"
8,"virājam","_","_","virāj","NC","","_","_"
1,"garbho","_","_","garbha","NC","","_","_"
2,"_","_","_","bhū","CGDA","","_","_"
3,"_","_","_","amṛta","NC","","_","_"
4,"yonāv","_","_","yoni","NC","","_","_"
5,"indro","_","_","indra","NC","","_","_"
6,"ha","_","_","ha","CEM","","_","_"
7,"_","_","_","bhū","CGDA","","_","_"
8,"_","_","_","sura","NC","","_","_"
9,"tatarha","_","_","tṛh","V","tṛh","_","_"
1,"ācāryas","_","_","ācārya","NC","","_","_"
2,"tatakṣa","_","_","takṣ","V","takṣ","_","_"
3,"nabhasī","_","_","nabhas","NC","","_","_"
4,"ubhe","_","_","ubh","PPX","","_","_"
5,"ime","_","_","ida","PRD","","_","_"
6,"urvī","_","_","urvī","NC","","_","_"
7,"gambhīre","_","_","gambhīra","JJ","","_","_"
8,"pṛthivīṃ","_","_","pṛthivī","NC","","_","_"
9,"divaṃ","_","_","div","NC","","_","_"
10,"ca","_","_","ca","CCD","","_","_"
1,"te","_","_","tad","PRD","","_","_"
2,"rakṣati","_","_","rakṣ","V","rakṣ","_","_"
3,"tapasā","_","_","tapas","NC","","_","_"
4,"brahmacārī","_","_","brahmacārin","NC","","_","_"
5,"tasmin","_","_","tad","PRD","","_","_"
6,"devāḥ","_","_","deva","NC","","_","_"
7,"saṃmanaso","_","_","sammanas","JJ","","_","_"
8,"bhavanti","_","_","bhav","V","bhū","_","_"
1,"imāṃ","_","_","ida","PRD","","_","_"
2,"bhūmiṃ","_","_","bhūmi","NC","","_","_"
3,"pṛthivīṃ","_","_","pṛthivī","NC","","_","_"
4,"brahmacārī","_","_","brahmacārin","NC","","_","_"
5,"bhikṣām","_","_","bhikṣā","NC","","_","_"
6,"ā","_","_","ā","CADP","","_","_"
7,"jabhāra","_","_","bhṛ","V","bhṛ","_","_"
8,"prathamo","_","_","prathama","JJ","","_","_"
9,"divaṃ","_","_","div","NC","","_","_"
10,"ca","_","_","ca","CCD","","_","_"
1,"te","_","_","tad","PRD","","_","_"
2,"kṛtvā","_","_","kṛ","CGDA","","_","_"
3,"samidhāv","_","_","samidh","NC","","_","_"
4,"upāste","_","_","ās","V","ās","_","_"
5,"tayor","_","_","tad","PRD","","_","_"
6,"ārpitā","_","_","ārpay","PPP","","_","_"
7,"bhuvanāni","_","_","bhuvana","NC","","_","_"
8,"viśvā","_","_","viśva","JQ","","_","_"
1,"arvāg","_","_","arvāk","CX","","_","_"
2,"anyaḥ","_","_","anya","PPX","","_","_"
3,"paro","_","_","paras","CX","","_","_"
4,"anyo","_","_","anya","PPX","","_","_"
5,"divas","_","_","div","NC","","_","_"
6,"pṛṣṭhād","_","_","pṛṣṭha","NC","","_","_"
7,"guhā","_","_","guhā","CX","","_","_"
8,"nidhī","_","_","nidhi","NC","","_","_"
9,"nihitau","_","_","nidhā","PPP","","_","_"
10,"brāhmaṇasya","_","_","brāhmaṇa","NC","","_","_"
1,"tau","_","_","tad","PRD","","_","_"
2,"rakṣati","_","_","rakṣ","V","rakṣ","_","_"
3,"tapasā","_","_","tapas","NC","","_","_"
4,"brahmacārī","_","_","brahmacārin","NC","","_","_"
5,"tat","_","_","tad","PRD","","_","_"
6,"kevalaṃ","_","_","kevala","JJ","","_","_"
7,"kṛṇute","_","_","kar","V","kṛ","_","_"
8,"brahma","_","_","brahman","NC","","_","_"
9,"vidvān","_","_","vid","KDP","","_","_"
1,"arvāg","_","_","arvāk","CX","","_","_"
2,"anya","_","_","anya","PPX","","_","_"
3,"ito","_","_","itas","CX","","_","_"
4,"anyaḥ","_","_","anya","PPX","","_","_"
5,"pṛthivyā","_","_","pṛthivī","NC","","_","_"
6,"agnī","_","_","agni","NC","","_","_"
7,"sameto","_","_","same","V","same","_","_"
8,"nabhasī","_","_","nabhas","NC","","_","_"
9,"_","_","_","antarā","CX","","_","_"
10,"_","_","_","ida","PRD","","_","_"
1,"tayoḥ","_","_","tad","PRD","","_","_"
2,"śrayante","_","_","śray","V","śri","_","_"
3,"raśmayo","_","_","raśmi","NC","","_","_"
4,"'dhi","_","_","adhi","CADP","","_","_"
5,"dṛḍhās","_","_","dṛh","PPP","","_","_"
6,"tān","_","_","tad","PRD","","_","_"
7,"ā","_","_","ā","CADP","","_","_"
8,"tiṣṭhati","_","_","tiṣṭh","V","sthā","_","_"
9,"tapasā","_","_","tapas","NC","","_","_"
10,"brahmacārī","_","_","brahmacārin","NC","","_","_"
1,"abhikrandan","_","_","abhikrand","KDP","","_","_"
2,"stanayann","_","_","stanay","KDP","","_","_"
3,"aruṇaḥ","_","_","aruṇa","JJ","","_","_"
4,"śitiṅgo","_","_","śitiṅga","JJ","","_","_"
5,"bṛhac","_","_","bṛhat","JJ","","_","_"
6,"chepo","_","_","śepas","NC","","_","_"
7,"'nu","_","_","anu","CADP","","_","_"
8,"bhūmau","_","_","bhūmi","NC","","_","_"
9,"jabhāra","_","_","bhṛ","V","bhṛ","_","_"
1,"brahmacārī","_","_","brahmacārin","NC","","_","_"
2,"siñcati","_","_","sic","V","sic","_","_"
3,"sānau","_","_","sānu","NC","","_","_"
4,"retaḥ","_","_","retas","NC","","_","_"
5,"pṛthivyāṃ","_","_","pṛthivī","NC","","_","_"
6,"tena","_","_","tad","PRD","","_","_"
7,"jīvanti","_","_","jīv","V","jīv","_","_"
8,"pradiśaś","_","_","pradiś","NC","","_","_"
9,"catasraḥ","_","_","catur","NUM","","_","_"
1,"agnau","_","_","agni","NC","","_","_"
2,"sūrye","_","_","sūrya","NC","","_","_"
3,"candramasi","_","_","candramas","NC","","_","_"
4,"mātariśvan","_","_","mātariśvan","NC","","_","_"
5,"brahmacāry","_","_","brahmacārin","NC","","_","_"
6,"apsu","_","_","ap","NC","","_","_"
7,"samidham","_","_","samidh","NC","","_","_"
8,"ā","_","_","ā","CADP","","_","_"
9,"dadhāti","_","_","dadh","V","dhā","_","_"
1,"tāsām","_","_","tad","PRD","","_","_"
2,"arcīṃṣi","_","_","arcis","NC","","_","_"
3,"pṛthag","_","_","pṛthak","CX","","_","_"
4,"abhre","_","_","abhra","NC","","_","_"
5,"caranti","_","_","car","V","car","_","_"
6,"tāsām","_","_","tad","PRD","","_","_"
7,"ājyaṃ","_","_","ājya","NC","","_","_"
8,"puruṣo","_","_","puruṣa","NC","","_","_"
9,"varṣam","_","_","varṣa","NC","","_","_"
10,"āpaḥ","_","_","ap","NC","","_","_"
1,"ācāryo","_","_","ācārya","NC","","_","_"
2,"mṛtyur","_","_","mṛtyu","NC","","_","_"
3,"varuṇaḥ","_","_","varuṇa","NC","","_","_"
4,"soma","_","_","soma","NC","","_","_"
5,"oṣadhayaḥ","_","_","oṣadhi","NC","","_","_"
6,"payaḥ","_","_","payas","NC","","_","_"
1,"jīmūtā","_","_","jīmūta","NC","","_","_"
2,"āsant","_","_","as","V","as","_","_"
3,"satvānas","_","_","satvan","NC","","_","_"
4,"tair","_","_","tad","PRD","","_","_"
5,"idaṃ","_","_","ida","PRD","","_","_"
6,"svar","_","_","svar","NC","","_","_"
7,"ābhṛtam","_","_","ābhṛ","PPP","","_","_"
1,"amā","_","_","amā","CX","","_","_"
2,"ghṛtaṃ","_","_","ghṛta","NC","","_","_"
3,"kṛṇute","_","_","kar","V","kṛ","_","_"
4,"kevalam","_","_","kevala","JJ","","_","_"
5,"ācāryo","_","_","ācārya","NC","","_","_"
6,"bhūtvā","_","_","bhū","CGDA","","_","_"
7,"varuṇaḥ","_","_","varuṇa","NC","","_","_"
1,"_","_","_","yad","PRL","","_","_"
2,"_","_","_","yad","PRL","","_","_"
3,"aicchat","_","_","iṣ","V","iṣ","_","_"
4,"prajāpatau","_","_","prajāpati","NC","","_","_"
5,"tad","_","_","tad","PRD","","_","_"
6,"brahmacārī","_","_","brahmacārin","NC","","_","_"
7,"prāyacchat","_","_","praya","V","praya","_","_"
8,"svān","_","_","sva","JJ","","_","_"
9,"mitro","_","_","mitra","NC","","_","_"
10,"adhy","_","_","adhi","CADP","","_","_"
11,"ātmanaḥ","_","_","ātman","NC","","_","_"
1,"ācāryo","_","_","ācārya","NC","","_","_"
2,"brahmacārī","_","_","brahmacārin","NC","","_","_"
3,"brahmacārī","_","_","brahmacārin","NC","","_","_"
4,"prajāpatiḥ","_","_","prajāpati","NC","","_","_"
1,"prajāpatir","_","_","prajāpati","NC","","_","_"
2,"virājati","_","_","virāj","V","virāj","_","_"
3,"virāḍ","_","_","virāj","NC","","_","_"
4,"indro","_","_","indra","NC","","_","_"
5,"'bhavad","_","_","bhav","V","bhū","_","_"
6,"vaśī","_","_","vaśin","JJ","","_","_"
1,"brahmacaryeṇa","_","_","brahmacarya","NC","","_","_"
2,"tapasā","_","_","tapas","NC","","_","_"
3,"rājā","_","_","rājan","NC","","_","_"
4,"rāṣṭraṃ","_","_","rāṣṭra","NC","","_","_"
5,"virakṣati","_","_","virakṣ","V","virakṣ","_","_"
1,"ācāryo","_","_","ācārya","NC","","_","_"
2,"brahmacaryeṇa","_","_","brahmacarya","NC","","_","_"
3,"brahmacāriṇam","_","_","brahmacārin","NC","","_","_"
4,"icchate","_","_","iṣ","V","iṣ","_","_"
1,"brahmacaryeṇa","_","_","brahmacarya","NC","","_","_"
2,"kanyā","_","_","kanyā","NC","","_","_"
3,"yuvānaṃ","_","_","yuvan","JJ","","_","_"
4,"vindate","_","_","vid","V","vid","_","_"
5,"patim","_","_","pati","NC","","_","_"
1,"anaḍvān","_","_","anaḍuh","NC","","_","_"
2,"_","_","_","brahmacarya","NC","","_","_"
3,"_","_","_","aśva","NC","","_","_"
4,"ghāsaṃ","_","_","ghāsa","NC","","_","_"
5,"jigīṣati","_","_","jigīṣ","V","jigīṣ","_","_"
1,"brahmacaryeṇa","_","_","brahmacarya","NC","","_","_"
2,"tapasā","_","_","tapas","NC","","_","_"
3,"devā","_","_","deva","NC","","_","_"
4,"mṛtyum","_","_","mṛtyu","NC","","_","_"
5,"apāghnata","_","_","apahan","V","apahan","_","_"
1,"indro","_","_","indra","NC","","_","_"
2,"ha","_","_","ha","CEM","","_","_"
3,"brahmacaryeṇa","_","_","brahmacarya","NC","","_","_"
4,"devebhyaḥ","_","_","deva","NC","","_","_"
5,"svar","_","_","svar","NC","","_","_"
6,"ābharat","_","_","ābhṛ","V","ābhṛ","_","_"
1,"oṣadhayo","_","_","oṣadhi","NC","","_","_"
2,"_","_","_","bhū","PPP","","_","_"
3,"_","_","_","bhū","KDG","","_","_"
4,"ahorātre","_","_","ahorātra","NC","","_","_"
5,"vanaspatiḥ","_","_","vanaspati","NC","","_","_"
1,"saṃvatsaraḥ","_","_","saṃvatsara","NC","","_","_"
2,"saha","_","_","saha","CX","","_","_"
3,"ṛtubhis","_","_","ṛtu","NC","","_","_"
4,"te","_","_","tad","PRD","","_","_"
5,"jātā","_","_","jan","PPP","","_","_"
6,"brahmacāriṇaḥ","_","_","brahmacārin","NC","","_","_"
1,"pārthivā","_","_","pārthiva","JJ","","_","_"
2,"divyāḥ","_","_","divya","JJ","","_","_"
3,"paśava","_","_","paśu","NC","","_","_"
4,"āraṇyā","_","_","āraṇya","JJ","","_","_"
5,"grāmyāś","_","_","grāmya","JJ","","_","_"
6,"ca","_","_","ca","CCD","","_","_"
7,"ye","_","_","yad","PRL","","_","_"
1,"apakṣāḥ","_","_","apakṣa","JJ","","_","_"
2,"pakṣiṇaś","_","_","pakṣin","JJ","","_","_"
3,"ca","_","_","ca","CCD","","_","_"
4,"ye","_","_","yad","PRL","","_","_"
5,"te","_","_","tad","PRD","","_","_"
6,"jātā","_","_","jan","PPP","","_","_"
7,"brahmacāriṇaḥ","_","_","brahmacārin","NC","","_","_"
1,"pṛthak","_","_","pṛthak","CX","","_","_"
2,"sarve","_","_","sarva","JQ","","_","_"
3,"prājāpatyāḥ","_","_","prājāpatya","JJ","","_","_"
4,"prāṇān","_","_","prāṇa","NC","","_","_"
5,"ātmasu","_","_","ātman","NC","","_","_"
6,"bibhrati","_","_","bhṛ","V","bhṛ","_","_"
1,"tānt","_","_","tad","PRD","","_","_"
2,"sarvān","_","_","sarva","JQ","","_","_"
3,"brahma","_","_","brahman","NC","","_","_"
4,"rakṣati","_","_","rakṣ","V","rakṣ","_","_"
5,"brahmacāriṇy","_","_","brahmacārin","NC","","_","_"
6,"ābhṛtam","_","_","ābhṛ","PPP","","_","_"
1,"devānām","_","_","deva","NC","","_","_"
2,"etat","_","_","tad","PRD","","_","_"
3,"pariṣūtam","_","_","pariṣū","PPP","","_","_"
4,"_","_","_","an","CX","","_","_"
5,"_","_","_","abhyāruh","PPP","","_","_"
6,"carati","_","_","car","V","car","_","_"
7,"rocamānam","_","_","ruc","KDP","","_","_"
1,"tasmāj","_","_","tad","PRD","","_","_"
2,"jātaṃ","_","_","jan","PPP","","_","_"
3,"brāhmaṇaṃ","_","_","brāhmaṇa","NC","","_","_"
4,"brahma","_","_","brahman","NC","","_","_"
5,"jyeṣṭhaṃ","_","_","jyeṣṭha","JJ","","_","_"
6,"devāś","_","_","deva","NC","","_","_"
7,"ca","_","_","ca","CCD","","_","_"
8,"sarve","_","_","sarva","JQ","","_","_"
9,"amṛtena","_","_","amṛta","NC","","_","_"
10,"sākam","_","_","sāka","CX","","_","_"
1,"brahmacārī","_","_","brahmacārin","NC","","_","_"
2,"brahma","_","_","brahman","NC","","_","_"
3,"bhrājad","_","_","bhrāj","KDP","","_","_"
4,"bibharti","_","_","bhṛ","V","bhṛ","_","_"
5,"tasmin","_","_","tad","PRD","","_","_"
6,"devā","_","_","deva","NC","","_","_"
7,"adhi","_","_","adhi","CADP","","_","_"
8,"viśve","_","_","viśva","JQ","","_","_"
9,"samotāḥ","_","_","samāve","PPP","","_","_"
1,"_","_","_","prāṇa","NC","","_","_"
2,"_","_","_","apāna","NC","","_","_"
3,"janayann","_","_","janay","KDP","","_","_"
4,"ād","_","_","āt","CX","","_","_"
5,"vyānaṃ","_","_","vyāna","NC","","_","_"
6,"vācaṃ","_","_","vāc","NC","","_","_"
7,"mano","_","_","manas","NC","","_","_"
8,"hṛdayaṃ","_","_","hṛdaya","NC","","_","_"
9,"brahma","_","_","brahman","NC","","_","_"
10,"medhām","_","_","medhā","NC","","_","_"
1,"cakṣuḥ","_","_","cakṣus","NC","","_","_"
2,"śrotraṃ","_","_","śrotra","NC","","_","_"
3,"yaśo","_","_","yaśas","NC","","_","_"
4,"asmāsu","_","_","mat","PPR","","_","_"
5,"dhehy","_","_","dadh","V","dhā","_","_"
6,"annaṃ","_","_","anna","NC","","_","_"
7,"reto","_","_","retas","NC","","_","_"
8,"lohitam","_","_","lohita","NC","","_","_"
9,"udaram","_","_","udara","NC","","_","_"
1,"tāni","_","_","tad","PRD","","_","_"
2,"kalpad","_","_","kﾱp","V","kﾱp","_","_"
3,"brahmacārī","_","_","brahmacārin","NC","","_","_"
4,"salilasya","_","_","salila","NC","","_","_"
5,"pṛṣṭhe","_","_","pṛṣṭha","NC","","_","_"
6,"tapo","_","_","tapas","NC","","_","_"
7,"'tiṣṭhat","_","_","tiṣṭh","V","sthā","_","_"
8,"tapyamānaḥ","_","_","tap","KDP","","_","_"
9,"samudre","_","_","samudra","NC","","_","_"
1,"sa","_","_","tad","PRD","","_","_"
2,"snāto","_","_","snā","PPP","","_","_"
3,"babhruḥ","_","_","babhru","JJ","","_","_"
4,"piṅgalaḥ","_","_","piṅgala","JJ","","_","_"
5,"pṛthivyāṃ","_","_","pṛthivī","NC","","_","_"
6,"bahu","_","_","bahu","JJ","","_","_"
7,"rocate","_","_","roc","V","ruc","_","_"
