"WordID","word","NormSTEM","suffix","lemma","PoS","Root","NormSuffix","NormWord"
1,"_","_","_","yat","CSB","","_","_"
2,"_","_","_","ha","CEM","","_","_"
3,"syā","_","_","tvat","PPR","","_","_"
4,"ta","_","_","indra","NC","","_","_"
5,"indra","_","_","śruṣṭi","NC","","_","_"
6,"śruṣṭir","_","_","as","V","as","_","_"
7,"asti","_","_","yad","PRL","","_","_"
8,"yayā","_","_","bhav","V","bhū","_","_"
9,"babhūtha","_","_","jaritṛ","NC","","_","_"
10,"jaritṛbhya","_","_","ūti","NC","","_","_"
1,"mā","_","_","mā","CNG","","_","_"
2,"naḥ","_","_","mat","PPR","","_","_"
3,"kāmam","_","_","kāma","NC","","_","_"
4,"mahayantam","_","_","mahay","KDP","","_","_"
5,"ā","_","_","ā","CADP","","_","_"
6,"dhag","_","_","dagh","V","dagh","_","_"
7,"viśvā","_","_","viśva","JQ","","_","_"
8,"te","_","_","tvat","PPR","","_","_"
9,"aśyām","_","_","aś","V","aś","_","_"
10,"pary","_","_","pari","CADP","","_","_"
11,"āpa","_","_","āpn","V","āp","_","_"
12,"āyoḥ","_","_","āyu","NC","","_","_"
1,"na","_","_","na","CNG","","_","_"
2,"ghā","_","_","gha","CX","","_","_"
3,"_","_","_","rājan","NC","","_","_"
4,"_","_","_","indra","NC","","_","_"
5,"ā","_","_","ā","CADP","","_","_"
6,"dabhan","_","_","dabh","V","dabh","_","_"
7,"no","_","_","mat","PPR","","_","_"
8,"yā","_","_","yad","PRL","","_","_"
9,"nu","_","_","nu","CX","","_","_"
10,"svasārā","_","_","svasṛ","NC","","_","_"
11,"kṛṇavanta","_","_","kar","V","kṛ","_","_"
12,"yonau","_","_","yoni","NC","","_","_"
1,"āpaś","_","_","ap","NC","","_","_"
2,"cid","_","_","cit","CEM","","_","_"
3,"asmai","_","_","ida","PRD","","_","_"
4,"sutukā","_","_","sutuka","JJ","","_","_"
5,"aveṣan","_","_","viṣ","V","viṣ","_","_"
6,"gaman","_","_","ga","V","ga","_","_"
7,"na","_","_","mat","PPR","","_","_"
8,"indraḥ","_","_","indra","NC","","_","_"
9,"sakhyā","_","_","sakhya","NC","","_","_"
10,"vayaś","_","_","vayas","NC","","_","_"
11,"ca","_","_","ca","CCD","","_","_"
1,"jetā","_","_","jay","V","ji","_","_"
2,"nṛbhir","_","_","nṛ","NC","","_","_"
3,"indraḥ","_","_","indra","NC","","_","_"
4,"pṛtsu","_","_","pṛt","NC","","_","_"
5,"śūraḥ","_","_","śūra","NC","","_","_"
6,"śrotā","_","_","śṛṇ","V","śru","_","_"
7,"havaṃ","_","_","hava","NC","","_","_"
8,"nādhamānasya","_","_","nādh","KDP","","_","_"
9,"kāroḥ","_","_","kāru","NC","","_","_"
1,"prabhartā","_","_","prabhṛ","V","prabhṛ","_","_"
2,"rathaṃ","_","_","ratha","NC","","_","_"
3,"dāśuṣa","_","_","dāś","KDP","","_","_"
4,"upāka","_","_","upāka","JJ","","_","_"
5,"udyantā","_","_","udya","V","udya","_","_"
6,"giro","_","_","gir","NC","","_","_"
7,"yadi","_","_","yadi","CSB","","_","_"
8,"ca","_","_","ca","CCD","","_","_"
9,"tmanā","_","_","tman","NC","","_","_"
10,"bhūt","_","_","bhav","V","bhū","_","_"
1,"evā","_","_","eva","CEM","","_","_"
2,"nṛbhir","_","_","nṛ","NC","","_","_"
3,"indraḥ","_","_","indra","NC","","_","_"
4,"_","_","_","su","CAD","","_","_"
5,"_","_","_","śravasyā","NC","","_","_"
6,"prakhādaḥ","_","_","prakhāda","JJ","","_","_"
7,"pṛkṣo","_","_","pṛkṣa","JJ","","_","_"
8,"abhi","_","_","abhi","CADP","","_","_"
9,"mitriṇo","_","_","mitrin","JJ","","_","_"
10,"bhūt","_","_","bhav","V","bhū","_","_"
1,"samarya","_","_","samarya","NC","","_","_"
2,"iṣa","_","_","iṣ","NC","","_","_"
3,"stavate","_","_","stu","V","stu","_","_"
4,"vivāci","_","_","vivāc","NC","","_","_"
5,"satrākaro","_","_","satrākara","JJ","","_","_"
6,"yajamānasya","_","_","yaj","KDP","","_","_"
7,"śaṃsaḥ","_","_","śaṃsa","NC","","_","_"
1,"tvayā","_","_","tvat","PPR","","_","_"
2,"vayam","_","_","mat","PPR","","_","_"
3,"maghavann","_","_","maghavan","NC","","_","_"
4,"indra","_","_","indra","NC","","_","_"
5,"śatrūn","_","_","śatru","NC","","_","_"
6,"abhi","_","_","abhi","CADP","","_","_"
7,"ṣyāma","_","_","as","V","as","_","_"
8,"mahato","_","_","mahat","JJ","","_","_"
9,"manyamānān","_","_","man","KDP","","_","_"
1,"tvaṃ","_","_","tvat","PPR","","_","_"
2,"trātā","_","_","trā","V","trā","_","_"
3,"tvam","_","_","tvat","PPR","","_","_"
4,"u","_","_","u","CEM","","_","_"
5,"no","_","_","mat","PPR","","_","_"
6,"vṛdhe","_","_","vṛdh","CGDI","","_","_"
7,"bhūr","_","_","bhav","V","bhū","_","_"
8,"_","_","_","vid","V","vid","_","_"
9,"_","_","_","iṣa","JJ","","_","_"
10,"vṛjanaṃ","_","_","vṛjana","NC","","_","_"
11,"_","_","_","jīra","JJ","","_","_"
12,"_","_","_","dānu","NC","","_","_"
