"WordID","word","NormSTEM","suffix","lemma","PoS","Root","NormSuffix","NormWord"
1,"vaiśaṃpāyana","_","_","vaiśampāyana","NC","","_","_"
2,"uvāca","_","_","vak","V","vac","_","_"
1,"indratīrthaṃ","_","_","indratīrtha","NC","","_","_"
2,"tato","_","_","tatas","CX","","_","_"
3,"gatvā","_","_","ga","CGDA","","_","_"
4,"yadūnāṃ","_","_","yadu","NC","","_","_"
5,"pravaro","_","_","pravara","JJ","","_","_"
6,"balī","_","_","balin","JJ","","_","_"
1,"viprebhyo","_","_","vipra","NC","","_","_"
2,"_","_","_","dhana","NC","","_","_"
3,"_","_","_","ratna","NC","","_","_"
4,"dadau","_","_","dad","V","dā","_","_"
5,"snātvā","_","_","snā","CGDA","","_","_"
6,"yathāvidhi","_","_","yathāvidhi","CX","","_","_"
1,"tatra","_","_","tatra","CAD","","_","_"
2,"_","_","_","hi","CX","","_","_"
3,"_","_","_","amararāja","NC","","_","_"
4,"_","_","_","adas","PRD","","_","_"
5,"_","_","_","yaj","V","yaj","_","_"
6,"_","_","_","kratu","NC","","_","_"
7,"_","_","_","śata","NUM","","_","_"
8,"ha","_","_","ha","CEM","","_","_"
1,"_","_","_","bṛhaspati","NC","","_","_"
2,"_","_","_","ca","CCD","","_","_"
3,"deveśaḥ","_","_","deveśa","NC","","_","_"
4,"pradadau","_","_","pradad","V","pradā","_","_"
5,"vipulaṃ","_","_","vipula","JJ","","_","_"
6,"dhanam","_","_","dhana","NC","","_","_"
1,"nirargalān","_","_","nirargala","JJ","","_","_"
2,"_","_","_","sa_saha","CX","","_","_"
3,"_","_","_","jārūthya","JJ","","_","_"
4,"sarvān","_","_","sarva","JQ","","_","_"
5,"_","_","_","vividha","JJ","","_","_"
6,"_","_","_","dakṣiṇā","NC","","_","_"
1,"ājahāra","_","_","āhar","V","āhṛ","_","_"
2,"_","_","_","kratu","NC","","_","_"
3,"_","_","_","tatra","CAD","","_","_"
4,"_","_","_","yathā","CCM","","_","_"
5,"_","_","_","vac","PPP","","_","_"
6,"vedapāragaiḥ","_","_","vedapāraga","NC","","_","_"
1,"tān","_","_","tad","PRD","","_","_"
2,"kratūn","_","_","kratu","NC","","_","_"
3,"_","_","_","bharata","NC","","_","_"
4,"_","_","_","śreṣṭha","JJ","","_","_"
5,"_","_","_","śata","NUM","","_","_"
6,"_","_","_","kṛtvas","CX","","_","_"
7,"_","_","_","mahat","JJ","","_","_"
8,"_","_","_","dyuti","NC","","_","_"
1,"pūrayāmāsa","_","_","pūray","V","pūray","_","_"
2,"vidhivat","_","_","vidhivat","CX","","_","_"
3,"tataḥ","_","_","tatas","CX","","_","_"
4,"khyātaḥ","_","_","khyā","PPP","","_","_"
5,"śatakratuḥ","_","_","śatakratu","NC","","_","_"
1,"tasya","_","_","tad","PRD","","_","_"
2,"nāmnā","_","_","nāman","NC","","_","_"
3,"ca","_","_","ca","CCD","","_","_"
4,"tat","_","_","tad","PRD","","_","_"
5,"tīrthaṃ","_","_","tīrtha","NC","","_","_"
6,"śivaṃ","_","_","śiva","JJ","","_","_"
7,"puṇyaṃ","_","_","puṇya","JJ","","_","_"
8,"sanātanam","_","_","sanātana","JJ","","_","_"
1,"indratīrtham","_","_","indratīrtha","NC","","_","_"
2,"iti","_","_","iti","CQT","","_","_"
3,"khyātaṃ","_","_","khyā","PPP","","_","_"
4,"_","_","_","sarva","JQ","","_","_"
5,"_","_","_","pāpa","NC","","_","_"
6,"_","_","_","pramocana","JJ","","_","_"
1,"upaspṛśya","_","_","upaspṛś","CGDA","","_","_"
2,"ca","_","_","ca","CCD","","_","_"
3,"_","_","_","tatra","CAD","","_","_"
4,"_","_","_","api","CX","","_","_"
5,"_","_","_","vidhivat","CX","","_","_"
6,"_","_","_","musalāyudha","NC","","_","_"
1,"brāhmaṇān","_","_","brāhmaṇa","NC","","_","_"
2,"pūjayitvā","_","_","pūjay","CGDA","","_","_"
3,"ca","_","_","ca","CCD","","_","_"
4,"_","_","_","pāna","NC","","_","_"
5,"_","_","_","ācchādana","NC","","_","_"
6,"_","_","_","bhojana","NC","","_","_"
1,"śubhaṃ","_","_","śubha","JJ","","_","_"
2,"_","_","_","tīrtha","NC","","_","_"
3,"_","_","_","vara","JJ","","_","_"
4,"tasmād","_","_","tad","PRD","","_","_"
5,"rāmatīrthaṃ","_","_","rāmatīrtha","NC","","_","_"
6,"jagāma","_","_","ga","V","ga","_","_"
7,"ha","_","_","ha","CEM","","_","_"
1,"yatra","_","_","yatra","CX","","_","_"
2,"rāmo","_","_","rāma","NC","","_","_"
3,"mahābhāgo","_","_","mahābhāga","JJ","","_","_"
4,"bhārgavaḥ","_","_","bhārgava","NC","","_","_"
5,"_","_","_","su","CAD","","_","_"
6,"_","_","_","mahat","JJ","","_","_"
7,"_","_","_","tapas","NC","","_","_"
1,"a","_","_","alpha_privativum","CX","","_","_"
1,"asakṛt","_","_","sakṛt","CX","","_","_"
2,"pṛthivīṃ","_","_","pṛthivī","NC","","_","_"
3,"sarvāṃ","_","_","sarva","JQ","","_","_"
4,"_","_","_","han","PPP","","_","_"
5,"_","_","_","kṣatriya","NC","","_","_"
6,"_","_","_","puṃgava","NC","","_","_"
1,"upādhyāyaṃ","_","_","upādhyāya","NC","","_","_"
2,"puraskṛtya","_","_","puraskṛ","CGDA","","_","_"
3,"kaśyapaṃ","_","_","kaśyapa","NC","","_","_"
4,"_","_","_","muni","NC","","_","_"
5,"_","_","_","sattama","JJ","","_","_"
1,"ayajad","_","_","yaj","V","yaj","_","_"
2,"vājapeyena","_","_","vājapeya","NC","","_","_"
3,"so","_","_","tad","PRD","","_","_"
4,"_","_","_","aśvamedha","NC","","_","_"
5,"_","_","_","śata","NUM","","_","_"
6,"ca","_","_","ca","CCD","","_","_"
1,"pradadau","_","_","pradad","V","pradā","_","_"
2,"_","_","_","dakṣiṇā","NC","","_","_"
3,"_","_","_","artha","NC","","_","_"
4,"ca","_","_","ca","CCD","","_","_"
5,"pṛthivīṃ","_","_","pṛthivī","NC","","_","_"
6,"vai","_","_","vai","CX","","_","_"
7,"_","_","_","sa_saha","CX","","_","_"
8,"_","_","_","sāgara","NC","","_","_"
1,"rāmo","_","_","rāma","NC","","_","_"
2,"dattvā","_","_","dā","CGDA","","_","_"
3,"dhanaṃ","_","_","dhana","NC","","_","_"
4,"tatra","_","_","tatra","CAD","","_","_"
5,"dvijebhyo","_","_","dvija","NC","","_","_"
6,"janamejaya","_","_","janamejaya","NC","","_","_"
1,"upaspṛśya","_","_","upaspṛś","CGDA","","_","_"
2,"yathānyāyaṃ","_","_","yathānyāya","CX","","_","_"
3,"pūjayitvā","_","_","pūjay","CGDA","","_","_"
4,"tathā","_","_","tathā","CX","","_","_"
5,"dvijān","_","_","dvija","NC","","_","_"
1,"puṇye","_","_","puṇya","JJ","","_","_"
2,"tīrthe","_","_","tīrtha","NC","","_","_"
3,"śubhe","_","_","śubha","JJ","","_","_"
4,"deśe","_","_","deśa","NC","","_","_"
5,"vasu","_","_","vasu","NC","","_","_"
6,"dattvā","_","_","dā","CGDA","","_","_"
7,"_","_","_","śubha","JJ","","_","_"
8,"_","_","_","ānana","NC","","_","_"
1,"_","_","_","muni","NC","","_","_"
2,"_","_","_","ca","CCD","","_","_"
3,"_","_","_","eva","CEM","","_","_"
4,"_","_","_","abhivāday","CGDA","","_","_"
5,"_","_","_","atha","CAD","","_","_"
6,"yamunātīrtham","_","_","yamunātīrtha","NC","","_","_"
7,"āgamat","_","_","āgacch","V","āgam","_","_"
1,"_","_","_","yatra","CX","","_","_"
2,"_","_","_","ānay","V","ānī","_","_"
3,"tadā","_","_","tadā","CAD","","_","_"
4,"rājasūyaṃ","_","_","rājasūya","NC","","_","_"
5,"mahīpate","_","_","mahīpati","NC","","_","_"
1,"putro","_","_","putra","NC","","_","_"
2,"'diter","_","_","aditi","NC","","_","_"
3,"mahābhāgo","_","_","mahābhāga","JJ","","_","_"
4,"varuṇo","_","_","varuṇa","NC","","_","_"
5,"vai","_","_","vai","CX","","_","_"
6,"_","_","_","sita","JJ","","_","_"
7,"_","_","_","prabhā","NC","","_","_"
1,"tatra","_","_","tatra","CAD","","_","_"
2,"nirjitya","_","_","nirji","CGDA","","_","_"
3,"saṃgrāme","_","_","saṃgrāma","NC","","_","_"
4,"mānuṣān","_","_","mānuṣa","JJ","","_","_"
5,"_","_","_","daivata","JJ","","_","_"
6,"_","_","_","tathā","CX","","_","_"
1,"varaṃ","_","_","vara","JJ","","_","_"
2,"kratuṃ","_","_","kratu","NC","","_","_"
3,"samājahre","_","_","samāhar","V","samāhṛ","_","_"
4,"varuṇaḥ","_","_","varuṇa","NC","","_","_"
5,"_","_","_","para","PPX","","_","_"
6,"_","_","_","vīra","NC","","_","_"
7,"_","_","_","han","JJ","","_","_"
1,"tasmin","_","_","tad","PRD","","_","_"
2,"_","_","_","kratu","NC","","_","_"
3,"_","_","_","vara","JJ","","_","_"
4,"vṛtte","_","_","vṛt","PPP","","_","_"
5,"saṃgrāmaḥ","_","_","saṃgrāma","NC","","_","_"
6,"samajāyata","_","_","saṃjan","V","saṃjan","_","_"
1,"devānāṃ","_","_","deva","NC","","_","_"
2,"dānavānāṃ","_","_","dānava","NC","","_","_"
3,"ca","_","_","ca","CCD","","_","_"
4,"trailokyasya","_","_","trailokya","NC","","_","_"
5,"_","_","_","kṣaya","NC","","_","_"
6,"_","_","_","āvaha","JJ","","_","_"
1,"rājasūye","_","_","rājasūya","NC","","_","_"
2,"_","_","_","kratu","NC","","_","_"
3,"_","_","_","śreṣṭha","JJ","","_","_"
4,"nivṛtte","_","_","nivṛt","PPP","","_","_"
5,"janamejaya","_","_","janamejaya","NC","","_","_"
1,"jāyate","_","_","jan","V","jan","_","_"
2,"_","_","_","su","CAD","","_","_"
3,"_","_","_","mahat","JJ","","_","_"
4,"_","_","_","ghora","JJ","","_","_"
5,"saṃgrāmaḥ","_","_","saṃgrāma","NC","","_","_"
6,"kṣatriyān","_","_","kṣatriya","NC","","_","_"
7,"prati","_","_","prati","CADP","","_","_"
1,"_","_","_","sīrāyudha","NC","","_","_"
2,"_","_","_","tadā","CAD","","_","_"
3,"_","_","_","rāma","NC","","_","_"
4,"_","_","_","tad","PRD","","_","_"
5,"_","_","_","tīrtha","NC","","_","_"
6,"_","_","_","vara","JJ","","_","_"
7,"tadā","_","_","tadā","CAD","","_","_"
1,"tatra","_","_","tatra","CAD","","_","_"
2,"snātvā","_","_","snā","CGDA","","_","_"
3,"ca","_","_","ca","CCD","","_","_"
4,"dattvā","_","_","dā","CGDA","","_","_"
5,"ca","_","_","ca","CCD","","_","_"
6,"dvijebhyo","_","_","dvija","NC","","_","_"
7,"vasu","_","_","vasu","NC","","_","_"
8,"mādhavaḥ","_","_","mādhava","NC","","_","_"
1,"vanamālī","_","_","vanamālin","NC","","_","_"
2,"tato","_","_","tatas","CX","","_","_"
3,"hṛṣṭaḥ","_","_","hṛṣ","PPP","","_","_"
4,"stūyamāno","_","_","stu","KDP","","_","_"
5,"dvijātibhiḥ","_","_","dvijāti","NC","","_","_"
1,"tasmād","_","_","tad","PRD","","_","_"
2,"ādityatīrthaṃ","_","_","ādityatīrtha","NC","","_","_"
3,"ca","_","_","ca","CCD","","_","_"
4,"jagāma","_","_","ga","V","ga","_","_"
5,"_","_","_","kamala","NC","","_","_"
6,"_","_","_","īkṣaṇa","NC","","_","_"
1,"_","_","_","yatra","CX","","_","_"
2,"_","_","_","yaj","CGDA","","_","_"
3,"bhagavāñ","_","_","bhagavat","JJ","","_","_"
4,"jyotir","_","_","jyotis","NC","","_","_"
5,"bhāskaro","_","_","bhāskara","NC","","_","_"
6,"_","_","_","rājan","NC","","_","_"
7,"_","_","_","sattama","JJ","","_","_"
1,"jyotiṣām","_","_","jyotis","NC","","_","_"
2,"ādhipatyaṃ","_","_","ādhipatya","NC","","_","_"
3,"ca","_","_","ca","CCD","","_","_"
4,"prabhāvaṃ","_","_","prabhāva","NC","","_","_"
5,"_","_","_","ca","CCD","","_","_"
6,"_","_","_","abhipad","V","abhipad","_","_"
1,"tasyā","_","_","tad","PRD","","_","_"
2,"_","_","_","nadī","NC","","_","_"
3,"_","_","_","tu","CCD","","_","_"
4,"tīre","_","_","tīra","NC","","_","_"
5,"vai","_","_","vai","CX","","_","_"
6,"sarve","_","_","sarva","JQ","","_","_"
7,"devāḥ","_","_","deva","NC","","_","_"
8,"_","_","_","sa_saha","CX","","_","_"
9,"_","_","_","vāsava","NC","","_","_"
1,"viśvedevāḥ","_","_","viśvedeva","NC","","_","_"
2,"_","_","_","sa_saha","CX","","_","_"
3,"_","_","_","marut","NC","","_","_"
4,"_","_","_","gandharva","NC","","_","_"
5,"_","_","_","apsaras","NC","","_","_"
6,"_","_","_","ca","CCD","","_","_"
7,"ha","_","_","ha","CEM","","_","_"
1,"dvaipāyanaḥ","_","_","dvaipāyana","NC","","_","_"
2,"_","_","_","śuka","NC","","_","_"
3,"_","_","_","ca","CCD","","_","_"
4,"_","_","_","eva","CEM","","_","_"
5,"_","_","_","kṛṣṇa","NC","","_","_"
6,"_","_","_","ca","CCD","","_","_"
7,"madhusūdanaḥ","_","_","madhusūdana","NC","","_","_"
1,"_","_","_","yakṣa","NC","","_","_"
2,"_","_","_","ca","CCD","","_","_"
3,"_","_","_","rākṣasa","NC","","_","_"
4,"_","_","_","ca","CCD","","_","_"
5,"_","_","_","eva","CEM","","_","_"
6,"_","_","_","piśāca","NC","","_","_"
7,"_","_","_","ca","CCD","","_","_"
8,"viśāṃ","_","_","viś","NC","","_","_"
9,"pate","_","_","pati","NC","","_","_"
1,"ete","_","_","tad","PRD","","_","_"
2,"_","_","_","ca","CCD","","_","_"
3,"_","_","_","anya","PPX","","_","_"
4,"ca","_","_","ca","CCD","","_","_"
5,"bahavo","_","_","bahu","JJ","","_","_"
6,"_","_","_","yoga","NC","","_","_"
7,"_","_","_","sidh","PPP","","_","_"
8,"sahasraśaḥ","_","_","sahasraśas","CX","","_","_"
1,"_","_","_","tad","PRD","","_","_"
2,"_","_","_","tīrtha","NC","","_","_"
3,"sarasvatyāḥ","_","_","sarasvatī","NC","","_","_"
4,"śive","_","_","śiva","JJ","","_","_"
5,"puṇye","_","_","puṇya","JJ","","_","_"
6,"paraṃtapa","_","_","paraṃtapa","JJ","","_","_"
1,"tatra","_","_","tatra","CAD","","_","_"
2,"hatvā","_","_","han","CGDA","","_","_"
3,"purā","_","_","purā","CX","","_","_"
4,"viṣṇur","_","_","viṣṇu","NC","","_","_"
5,"asurau","_","_","asura","NC","","_","_"
6,"_","_","_","madhu","NC","","_","_"
7,"_","_","_","kaiṭabha","NC","","_","_"
1,"āpluto","_","_","āplu","PPP","","_","_"
2,"_","_","_","bharata","NC","","_","_"
3,"_","_","_","śreṣṭha","JJ","","_","_"
4,"_","_","_","tīrtha","NC","","_","_"
5,"_","_","_","pravara","JJ","","_","_"
6,"uttame","_","_","uttama","JJ","","_","_"
1,"_","_","_","dvaipāyana","NC","","_","_"
2,"_","_","_","ca","CCD","","_","_"
3,"_","_","_","dharma","NC","","_","_"
4,"_","_","_","ātman","NC","","_","_"
5,"_","_","_","tatra","CAD","","_","_"
6,"_","_","_","eva","CEM","","_","_"
7,"_","_","_","āplu","CGDA","","_","_"
8,"bhārata","_","_","bhārata","NC","","_","_"
1,"samprāptaḥ","_","_","samprāp","PPP","","_","_"
2,"paramaṃ","_","_","parama","JJ","","_","_"
3,"yogaṃ","_","_","yoga","NC","","_","_"
4,"siddhiṃ","_","_","siddhi","NC","","_","_"
5,"ca","_","_","ca","CCD","","_","_"
6,"paramāṃ","_","_","parama","JJ","","_","_"
7,"gataḥ","_","_","ga","PPP","","_","_"
1,"asito","_","_","asita","NC","","_","_"
2,"_","_","_","devala","NC","","_","_"
3,"_","_","_","ca","CCD","","_","_"
4,"_","_","_","eva","CEM","","_","_"
5,"tasminn","_","_","tad","PRD","","_","_"
6,"eva","_","_","eva","CEM","","_","_"
7,"_","_","_","mahat","JJ","","_","_"
8,"_","_","_","tapas","NC","","_","_"
1,"paramaṃ","_","_","parama","JJ","","_","_"
2,"yogam","_","_","yoga","NC","","_","_"
3,"āsthāya","_","_","āsthā","CGDA","","_","_"
4,"ṛṣir","_","_","ṛṣi","NC","","_","_"
5,"yogam","_","_","yoga","NC","","_","_"
6,"avāptavān","_","_","avāp","KDP","","_","_"
