"WordID","word","NormSTEM","suffix","lemma","PoS","Root","NormSuffix","NormWord"
1,"vaiśaṃpāyana","_","_","vaiśampāyana","NC","","_","_"
2,"uvāca","_","_","vak","V","vac","_","_"
1,"punar","_","_","punar","CAD","","_","_"
2,"eva","_","_","eva","CEM","","_","_"
3,"_","_","_","mahat","JJ","","_","_"
4,"_","_","_","ṛṣi","NC","","_","_"
5,"_","_","_","tad","PRD","","_","_"
6,"kṛṣṇadvaipāyano","_","_","kṛṣṇadvaipāyana","NC","","_","_"
7,"'bravīt","_","_","abravīta","V","brū","_","_"
1,"_","_","_","ajāta","JJ","","_","_"
2,"_","_","_","śatru","NC","","_","_"
3,"kaunteyam","_","_","kaunteya","NC","","_","_"
4,"idaṃ","_","_","ida","PRD","","_","_"
5,"vacanam","_","_","vacana","NC","","_","_"
6,"arthavat","_","_","arthavat","JJ","","_","_"
1,"araṇye","_","_","araṇya","NC","","_","_"
2,"vasatāṃ","_","_","vas","KDP","","_","_"
3,"tāta","_","_","tāta","NC","","_","_"
4,"bhrātṝṇāṃ","_","_","bhrātṛ","NC","","_","_"
5,"te","_","_","tvat","PPR","","_","_"
6,"tapasvinām","_","_","tapasvin","NC","","_","_"
1,"manorathā","_","_","manoratha","NC","","_","_"
2,"_","_","_","mahat","JJ","","_","_"
3,"_","_","_","rāja","NC","","_","_"
4,"ye","_","_","yad","PRL","","_","_"
5,"_","_","_","tatra","CAD","","_","_"
6,"_","_","_","as","V","as","_","_"
7,"yudhiṣṭhira","_","_","yudhiṣṭhira","NC","","_","_"
1,"tān","_","_","tad","PRD","","_","_"
2,"ime","_","_","ida","PRD","","_","_"
3,"_","_","_","bharata","NC","","_","_"
4,"_","_","_","śreṣṭha","JJ","","_","_"
5,"prāpnuvantu","_","_","prāpn","V","prāp","_","_"
6,"_","_","_","mahat","JJ","","_","_"
7,"_","_","_","ratha","NC","","_","_"
1,"praśādhi","_","_","praśās","V","praśās","_","_"
2,"pṛthivīṃ","_","_","pṛthivī","NC","","_","_"
3,"pārtha","_","_","pārtha","NC","","_","_"
4,"yayātir","_","_","yayāti","NC","","_","_"
5,"iva","_","_","iva","CCM","","_","_"
6,"nāhuṣaḥ","_","_","nāhuṣa","NC","","_","_"
1,"araṇye","_","_","araṇya","NC","","_","_"
2,"_","_","_","duḥkha","JJ","","_","_"
3,"_","_","_","vasati","NC","","_","_"
4,"anubhūtā","_","_","anubhū","PPP","","_","_"
5,"tapasvibhiḥ","_","_","tapasvin","NC","","_","_"
1,"_","_","_","duḥkha","NC","","_","_"
2,"_","_","_","anta","NC","","_","_"
3,"_","_","_","nara","NC","","_","_"
4,"_","_","_","vyāghra","NC","","_","_"
5,"sukhaṃ","_","_","sukha","NC","","_","_"
6,"_","_","_","tu","CCD","","_","_"
7,"_","_","_","anubhav","V","anubhū","_","_"
8,"_","_","_","ida","PRD","","_","_"
1,"dharmam","_","_","dharma","NC","","_","_"
2,"arthaṃ","_","_","artha","NC","","_","_"
3,"ca","_","_","ca","CCD","","_","_"
4,"kāmaṃ","_","_","kāma","NC","","_","_"
5,"ca","_","_","ca","CCD","","_","_"
6,"bhrātṛbhiḥ","_","_","bhrātṛ","NC","","_","_"
7,"saha","_","_","saha","CX","","_","_"
8,"bhārata","_","_","bhārata","NC","","_","_"
1,"anubhūya","_","_","anubhū","CGDA","","_","_"
2,"tataḥ","_","_","tatas","CX","","_","_"
3,"paścāt","_","_","paścāt","CAD","","_","_"
4,"prasthātāsi","_","_","pratiṣṭh","V","prasthā","_","_"
5,"viśāṃ","_","_","viś","NC","","_","_"
6,"pate","_","_","pati","NC","","_","_"
1,"atithīnāṃ","_","_","atithi","NC","","_","_"
2,"ca","_","_","ca","CCD","","_","_"
3,"pitṝṇāṃ","_","_","pitṛ","NC","","_","_"
4,"devatānāṃ","_","_","devatā","NC","","_","_"
5,"ca","_","_","ca","CCD","","_","_"
6,"bhārata","_","_","bhārata","NC","","_","_"
1,"ānṛṇyaṃ","_","_","ānṛṇya","NC","","_","_"
2,"gaccha","_","_","ga","V","ga","_","_"
3,"kaunteya","_","_","kaunteya","NC","","_","_"
4,"tataḥ","_","_","tatas","CX","","_","_"
5,"svargaṃ","_","_","svarga","NC","","_","_"
6,"gamiṣyasi","_","_","gacch","V","gam","_","_"
1,"_","_","_","sarvamedha","NC","","_","_"
2,"_","_","_","aśvamedha","NC","","_","_"
3,"yajasva","_","_","yaj","V","yaj","_","_"
4,"_","_","_","kuru","NC","","_","_"
5,"_","_","_","nandana","NC","","_","_"
1,"tataḥ","_","_","tatas","CX","","_","_"
2,"_","_","_","paścāt","CAD","","_","_"
3,"_","_","_","mahat","JJ","","_","_"
4,"_","_","_","rāja","NC","","_","_"
5,"gamiṣyasi","_","_","gacch","V","gam","_","_"
6,"parāṃ","_","_","para","PPX","","_","_"
7,"gatim","_","_","gati","NC","","_","_"
1,"_","_","_","bhrātṛ","NC","","_","_"
2,"_","_","_","ca","CCD","","_","_"
3,"sarvān","_","_","sarva","JQ","","_","_"
4,"kratubhiḥ","_","_","kratu","NC","","_","_"
5,"saṃyojya","_","_","saṃyojay","CGDA","","_","_"
6,"_","_","_","bahu","JJ","","_","_"
7,"_","_","_","dakṣiṇā","NC","","_","_"
1,"_","_","_","sa","CADP","","_","_"
2,"_","_","_","prāp","PPP","","_","_"
3,"kīrtim","_","_","kīrti","NC","","_","_"
4,"atulāṃ","_","_","atula","JJ","","_","_"
5,"pāṇḍaveya","_","_","pāṇḍaveya","NC","","_","_"
6,"bhaviṣyasi","_","_","bhav","V","bhū","_","_"
1,"vidma","_","_","vid","V","vid","_","_"
2,"te","_","_","tvat","PPR","","_","_"
3,"_","_","_","puruṣa","NC","","_","_"
4,"_","_","_","vyāghra","NC","","_","_"
5,"vacanaṃ","_","_","vacana","NC","","_","_"
6,"_","_","_","kuru","NC","","_","_"
7,"_","_","_","nandana","NC","","_","_"
1,"śṛṇu","_","_","śṛṇ","V","śru","_","_"
2,"_","_","_","mat","PPR","","_","_"
3,"_","_","_","ca","CCD","","_","_"
4,"yathā","_","_","yathā","CCM","","_","_"
5,"kurvan","_","_","kṛ","KDP","","_","_"
6,"_","_","_","dharma","NC","","_","_"
7,"_","_","_","na","CNG","","_","_"
8,"cyavate","_","_","cyavata","V","cyu","_","_"
9,"nṛpaḥ","_","_","nṛpa","NC","","_","_"
1,"ādadānasya","_","_","ādā","KDP","","_","_"
2,"ca","_","_","ca","CCD","","_","_"
3,"dhanaṃ","_","_","dhana","NC","","_","_"
4,"nigrahaṃ","_","_","nigraha","NC","","_","_"
5,"ca","_","_","ca","CCD","","_","_"
6,"yudhiṣṭhira","_","_","yudhiṣṭhira","NC","","_","_"
1,"samānaṃ","_","_","samāna","JJ","","_","_"
2,"_","_","_","dharma","NC","","_","_"
3,"_","_","_","kuśala","JJ","","_","_"
4,"sthāpayanti","_","_","tiṣṭh","V","sthā","_","_"
5,"nareśvara","_","_","nareśvara","NC","","_","_"
1,"_","_","_","deśa","NC","","_","_"
2,"_","_","_","kāla","NC","","_","_"
3,"_","_","_","pratīkṣa","JJ","","_","_"
4,"yo","_","_","yad","PRL","","_","_"
5,"dasyor","_","_","dasyu","NC","","_","_"
6,"darśayate","_","_","darś","V","dṛś","_","_"
7,"nṛpaḥ","_","_","nṛpa","NC","","_","_"
1,"_","_","_","śāstra","NC","","_","_"
2,"_","_","_","ja","JJ","","_","_"
3,"buddhim","_","_","buddhi","NC","","_","_"
4,"āsthāya","_","_","āsthā","CGDA","","_","_"
5,"_","_","_","na","CNG","","_","_"
6,"_","_","_","enas","NC","","_","_"
7,"sa","_","_","tad","PRD","","_","_"
8,"hi","_","_","hi","CX","","_","_"
9,"yujyate","_","_","yuj","V","yuj","_","_"
1,"ādāya","_","_","ādā","CGDA","","_","_"
2,"_","_","_","bali","NC","","_","_"
3,"_","_","_","ṣaṣ","NUM","","_","_"
4,"_","_","_","bhāga","NC","","_","_"
5,"yo","_","_","yad","PRL","","_","_"
6,"rāṣṭraṃ","_","_","rāṣṭra","NC","","_","_"
7,"_","_","_","na","CNG","","_","_"
8,"_","_","_","abhirakṣ","V","abhirakṣ","_","_"
1,"pratigṛhṇāti","_","_","pratigrah","V","pratigrah","_","_"
2,"tat","_","_","tad","PRD","","_","_"
3,"pāpaṃ","_","_","pāpa","NC","","_","_"
4,"_","_","_","caturtha","JJ","","_","_"
5,"_","_","_","aṃśa","NC","","_","_"
6,"pārthivaḥ","_","_","pārthiva","NC","","_","_"
1,"nibodha","_","_","nibodh","V","nibudh","_","_"
2,"ca","_","_","ca","CCD","","_","_"
3,"_","_","_","yathā","CCM","","_","_"
4,"_","_","_","āsthā","KDP","","_","_"
5,"_","_","_","dharma","NC","","_","_"
6,"_","_","_","na","CNG","","_","_"
7,"cyavate","_","_","cyavata","V","cyu","_","_"
8,"nṛpaḥ","_","_","nṛpa","NC","","_","_"
1,"nigrahād","_","_","nigraha","NC","","_","_"
2,"_","_","_","dharma","NC","","_","_"
3,"_","_","_","śāstra","NC","","_","_"
4,"anurudhyann","_","_","anurudh","KDP","","_","_"
5,"_","_","_","ape","PPP","","_","_"
6,"_","_","_","bhī","NC","","_","_"
1,"_","_","_","kāma","NC","","_","_"
2,"_","_","_","krodha","NC","","_","_"
3,"_","_","_","anādṛtya","CX","","_","_"
4,"_","_","_","pitṛ","NC","","_","_"
5,"_","_","_","iva","CCM","","_","_"
6,"_","_","_","sama","PPX","","_","_"
7,"_","_","_","darśana","NC","","_","_"
1,"_","_","_","daiva","NC","","_","_"
2,"_","_","_","upahan","PPP","","_","_"
3,"rājā","_","_","rājan","NC","","_","_"
4,"_","_","_","karman","NC","","_","_"
5,"_","_","_","kāla","NC","","_","_"
6,"_","_","_","mahat","JJ","","_","_"
7,"_","_","_","dyuti","NC","","_","_"
1,"pramādayati","_","_","pramāday","V","pramāday","_","_"
2,"tat","_","_","tad","PRD","","_","_"
3,"karma","_","_","karman","NC","","_","_"
4,"na","_","_","na","CNG","","_","_"
5,"_","_","_","tatra","CAD","","_","_"
6,"_","_","_","ah","V","ah","_","_"
7,"atikramam","_","_","atikrama","NC","","_","_"
1,"tarasā","_","_","taras","NC","","_","_"
2,"_","_","_","buddhi","NC","","_","_"
3,"_","_","_","pūrva","CX","","_","_"
4,"vā","_","_","vā","CCD","","_","_"
5,"nigrāhyā","_","_","nigrah","KDG","","_","_"
6,"eva","_","_","eva","CEM","","_","_"
7,"śatravaḥ","_","_","śatru","NC","","_","_"
1,"pāpaiḥ","_","_","pāpa","JJ","","_","_"
2,"saha","_","_","saha","CX","","_","_"
3,"na","_","_","na","CNG","","_","_"
4,"saṃdadhyād","_","_","saṃdadh","V","saṃdhā","_","_"
5,"rāṣṭraṃ","_","_","rāṣṭra","NC","","_","_"
6,"paṇyaṃ","_","_","paṇya","NC","","_","_"
7,"na","_","_","na","CNG","","_","_"
8,"kārayet","_","_","kar","V","kṛ","_","_"
1,"_","_","_","śūra","NC","","_","_"
2,"_","_","_","ca","CCD","","_","_"
3,"_","_","_","ārya","JJ","","_","_"
4,"_","_","_","ca","CCD","","_","_"
5,"satkāryā","_","_","satkṛ","KDG","","_","_"
6,"_","_","_","vidvas","JJ","","_","_"
7,"_","_","_","ca","CCD","","_","_"
8,"yudhiṣṭhira","_","_","yudhiṣṭhira","NC","","_","_"
1,"gomato","_","_","gomat","JJ","","_","_"
2,"_","_","_","dhanin","JJ","","_","_"
3,"_","_","_","ca","CCD","","_","_"
4,"_","_","_","eva","CEM","","_","_"
5,"paripālyā","_","_","paripālay","KDG","","_","_"
6,"viśeṣataḥ","_","_","viśeṣataḥ","CX","","_","_"
1,"vyavahāreṣu","_","_","vyavahāra","NC","","_","_"
2,"dharmyeṣu","_","_","dharmya","JJ","","_","_"
3,"_","_","_","niyuj","KDG","","_","_"
4,"_","_","_","ca","CCD","","_","_"
5,"_","_","_","bahu","JJ","","_","_"
6,"_","_","_","śruta","NC","","_","_"
1,"_","_","_","guṇa","NC","","_","_"
2,"_","_","_","yuj","PPP","","_","_"
3,"'pi","_","_","api","CX","","_","_"
4,"_","_","_","na","CNG","","_","_"
5,"_","_","_","eka","PPX","","_","_"
6,"_","_","_","viśvas","V","viśvas","_","_"
7,"_","_","_","ca","CCD","","_","_"
8,"vicakṣaṇaḥ","_","_","vicakṣaṇa","JJ","","_","_"
1,"a","_","_","alpha_privativum","JJ","","_","_"
1,"arakṣitā","_","_","rakṣitṛ","JJ","","_","_"
2,"durvinīto","_","_","durvinīta","JJ","","_","_"
3,"mānī","_","_","mānin","JJ","","_","_"
4,"stabdho","_","_","stambh","PPP","","_","_"
5,"'bhyasūyakaḥ","_","_","abhyasūyaka","JJ","","_","_"
1,"enasā","_","_","enas","NC","","_","_"
2,"yujyate","_","_","yuj","V","yuj","_","_"
3,"rājā","_","_","rājan","NC","","_","_"
4,"durdānta","_","_","durdānta","JJ","","_","_"
5,"iti","_","_","iti","CQT","","_","_"
6,"_","_","_","ca","CCD","","_","_"
7,"_","_","_","vak","V","vac","_","_"
1,"ye","_","_","yad","PRL","","_","_"
2,"a","_","_","alpha_privativum","JJ","","_","_"
2,"'rakṣyamāṇā","_","_","rakṣyamāṇa","JJ","","_","_"
3,"hīyante","_","_","jah","V","hā","_","_"
4,"_","_","_","daiva","NC","","_","_"
5,"_","_","_","upahan","PPP","","_","_"
6,"nṛpe","_","_","nṛpa","NC","","_","_"
1,"_","_","_","taskara","NC","","_","_"
2,"_","_","_","ca","CCD","","_","_"
3,"_","_","_","api","CX","","_","_"
4,"hanyante","_","_","han","V","han","_","_"
5,"sarvaṃ","_","_","sarva","JQ","","_","_"
6,"tad","_","_","tad","PRD","","_","_"
7,"_","_","_","rājan","NC","","_","_"
8,"_","_","_","kilbiṣa","NC","","_","_"
1,"_","_","_","su","CAD","","_","_"
2,"_","_","_","mantray","PPP","","_","_"
3,"_","_","_","su","CAD","","_","_"
4,"_","_","_","nī","PPP","","_","_"
5,"ca","_","_","ca","CCD","","_","_"
6,"_","_","_","vidhivat","CX","","_","_"
7,"_","_","_","ca","CCD","","_","_"
8,"_","_","_","upapāday","PPP","","_","_"
1,"pauruṣe","_","_","pauruṣa","NC","","_","_"
2,"karmaṇi","_","_","karman","NC","","_","_"
3,"kṛte","_","_","kṛ","PPP","","_","_"
4,"_","_","_","na","CNG","","_","_"
5,"_","_","_","as","V","as","_","_"
6,"_","_","_","adharma","NC","","_","_"
7,"yudhiṣṭhira","_","_","yudhiṣṭhira","NC","","_","_"
1,"vipadyante","_","_","vipad","V","vipad","_","_"
2,"samārambhāḥ","_","_","samārambha","NC","","_","_"
3,"_","_","_","sidh","V","sidh","_","_"
4,"_","_","_","api","CX","","_","_"
5,"ca","_","_","ca","CCD","","_","_"
6,"daivataḥ","_","_","daiva","NC","","_","_"
1,"kṛte","_","_","kṛ","PPP","","_","_"
2,"puruṣakāre","_","_","puruṣakāra","NC","","_","_"
3,"tu","_","_","tu","CCD","","_","_"
4,"_","_","_","na","CNG","","_","_"
5,"_","_","_","enas","NC","","_","_"
6,"spṛśati","_","_","spṛś","V","spṛś","_","_"
7,"pārthivam","_","_","pārthiva","NC","","_","_"
1,"atra","_","_","atra","CAD","","_","_"
2,"te","_","_","tvat","PPR","","_","_"
3,"_","_","_","rājan","NC","","_","_"
4,"_","_","_","śārdūla","NC","","_","_"
5,"vartayiṣye","_","_","vart","V","vṛt","_","_"
6,"kathām","_","_","kathā","NC","","_","_"
7,"imām","_","_","ida","PRD","","_","_"
1,"yad","_","_","yad","PRL","","_","_"
2,"vṛttaṃ","_","_","vṛtta","NC","","_","_"
3,"_","_","_","pūrva","PPX","","_","_"
4,"_","_","_","rājarṣi","NC","","_","_"
5,"hayagrīvasya","_","_","hayagrīva","NC","","_","_"
6,"pārthiva","_","_","pārthiva","NC","","_","_"
1,"śatrūn","_","_","śatru","NC","","_","_"
2,"hatvā","_","_","han","CGDA","","_","_"
3,"_","_","_","han","PPP","","_","_"
4,"_","_","_","āji","NC","","_","_"
5,"_","_","_","śūra","NC","","_","_"
6,"a","_","_","alpha_privativum","JJ","","_","_"
6,"_","_","_","kliṣṭa","JJ","","_","_"
7,"_","_","_","karman","NC","","_","_"
1,"asahāyasya","_","_","asahāya","JJ","","_","_"
2,"dhīrasya","_","_","dhīra","JJ","","_","_"
3,"nirjitasya","_","_","nirji","PPP","","_","_"
4,"yudhiṣṭhira","_","_","yudhiṣṭhira","NC","","_","_"
1,"yat","_","_","yad","PRL","","_","_"
2,"karma","_","_","karman","NC","","_","_"
3,"vai","_","_","vai","CX","","_","_"
4,"nigrahe","_","_","nigraha","NC","","_","_"
5,"śātravāṇāṃ","_","_","śātrava","NC","","_","_"
6,"_","_","_","yoga","NC","","_","_"
7,"_","_","_","ca","CCD","","_","_"
8,"_","_","_","agrya","JJ","","_","_"
9,"pālane","_","_","pālana","NC","","_","_"
10,"mānavānām","_","_","mānava","NC","","_","_"
1,"kṛtvā","_","_","kṛ","CGDA","","_","_"
2,"karma","_","_","karman","NC","","_","_"
3,"prāpya","_","_","prāp","CGDA","","_","_"
4,"kīrtiṃ","_","_","kīrti","NC","","_","_"
5,"_","_","_","su","CAD","","_","_"
6,"_","_","_","yuddha","NC","","_","_"
7,"vājigrīvo","_","_","vājigrīva","NC","","_","_"
8,"modate","_","_","mod","V","mud","_","_"
9,"_","_","_","deva","NC","","_","_"
10,"_","_","_","loka","NC","","_","_"
1,"_","_","_","saṃtyaj","PPP","","_","_"
2,"_","_","_","ātman","NC","","_","_"
3,"_","_","_","samara","NC","","_","_"
4,"_","_","_","ātatāyin","JJ","","_","_"
5,"_","_","_","śastra","NC","","_","_"
6,"_","_","_","chid","PPP","","_","_"
7,"dasyubhir","_","_","dasyu","NC","","_","_"
8,"ardyamānaḥ","_","_","arday","KDP","","_","_"
1,"aśvagrīvaḥ","_","_","aśvagrīva","NC","","_","_"
2,"_","_","_","karman","NC","","_","_"
3,"_","_","_","śīla","NC","","_","_"
4,"mahātmā","_","_","mahātman","JJ","","_","_"
5,"_","_","_","saṃsidh","PPP","","_","_"
6,"_","_","_","ātman","NC","","_","_"
7,"modate","_","_","mod","V","mud","_","_"
8,"_","_","_","deva","NC","","_","_"
9,"_","_","_","loka","NC","","_","_"
1,"dhanur","_","_","dhanus","NC","","_","_"
2,"yūpo","_","_","yūpa","NC","","_","_"
3,"raśanā","_","_","raśanā","NC","","_","_"
4,"jyā","_","_","jyā","NC","","_","_"
5,"śaraḥ","_","_","śara","NC","","_","_"
6,"sruk","_","_","sruc","NC","","_","_"
7,"sruvaḥ","_","_","sruva","NC","","_","_"
8,"khaḍgo","_","_","khaḍga","NC","","_","_"
9,"rudhiraṃ","_","_","rudhira","NC","","_","_"
10,"yatra","_","_","yatra","CX","","_","_"
11,"_","_","_","ca","CCD","","_","_"
12,"_","_","_","ājya","NC","","_","_"
1,"ratho","_","_","ratha","NC","","_","_"
2,"vedī","_","_","vedi","NC","","_","_"
3,"kāmago","_","_","kāmaga","JJ","","_","_"
4,"yuddham","_","_","yuddha","NC","","_","_"
5,"agniś","_","_","agni","NC","","_","_"
6,"cāturhotraṃ","_","_","cāturhotra","NC","","_","_"
7,"caturo","_","_","catur","NUM","","_","_"
8,"_","_","_","vājin","NC","","_","_"
9,"_","_","_","mukhya","JJ","","_","_"
1,"hutvā","_","_","hu","CGDA","","_","_"
2,"tasmin","_","_","tad","PRD","","_","_"
3,"_","_","_","yajña","NC","","_","_"
4,"_","_","_","vahni","NC","","_","_"
5,"_","_","_","atha","CAD","","_","_"
6,"_","_","_","ari","NC","","_","_"
7,"_","_","_","pāpa","NC","","_","_"
8,"_","_","_","muc","PPP","","_","_"
9,"_","_","_","rājan","NC","","_","_"
10,"_","_","_","siṃha","NC","","_","_"
11,"_","_","_","tarasvin","JJ","","_","_"
1,"prāṇān","_","_","prāṇa","NC","","_","_"
2,"hutvā","_","_","hu","CGDA","","_","_"
3,"_","_","_","ca","CCD","","_","_"
4,"_","_","_","avabhṛtha","NC","","_","_"
5,"raṇe","_","_","raṇa","NC","","_","_"
6,"sa","_","_","tad","PRD","","_","_"
7,"vājigrīvo","_","_","vājigrīva","NC","","_","_"
8,"modate","_","_","mod","V","mud","_","_"
9,"_","_","_","deva","NC","","_","_"
10,"_","_","_","loka","NC","","_","_"
1,"rāṣṭraṃ","_","_","rāṣṭra","NC","","_","_"
2,"rakṣan","_","_","rakṣ","KDP","","_","_"
3,"_","_","_","buddhi","NC","","_","_"
4,"_","_","_","pūrva","CX","","_","_"
5,"nayena","_","_","naya","NC","","_","_"
6,"_","_","_","saṃtyaj","PPP","","_","_"
7,"_","_","_","ātman","NC","","_","_"
8,"_","_","_","yajña","NC","","_","_"
9,"_","_","_","śīla","NC","","_","_"
10,"mahātmā","_","_","mahātman","JJ","","_","_"
1,"sarvāṃl","_","_","sarva","JQ","","_","_"
2,"lokān","_","_","loka","NC","","_","_"
3,"vyāpya","_","_","vyāp","CGDA","","_","_"
4,"kīrtyā","_","_","kīrti","NC","","_","_"
5,"manasvī","_","_","manasvin","JJ","","_","_"
6,"vājigrīvo","_","_","vājigrīva","NC","","_","_"
7,"modate","_","_","mod","V","mud","_","_"
8,"_","_","_","deva","NC","","_","_"
9,"_","_","_","loka","NC","","_","_"
1,"daivīṃ","_","_","daiva","JJ","","_","_"
2,"siddhiṃ","_","_","siddhi","NC","","_","_"
3,"mānuṣīṃ","_","_","mānuṣa","JJ","","_","_"
4,"daṇḍanītiṃ","_","_","daṇḍanīti","NC","","_","_"
5,"_","_","_","yoga","NC","","_","_"
6,"_","_","_","nyāya","NC","","_","_"
7,"pālayitvā","_","_","pālay","CGDA","","_","_"
8,"mahīṃ","_","_","mahī","NC","","_","_"
9,"ca","_","_","ca","CCD","","_","_"
1,"tasmād","_","_","tasmāt","CX","","_","_"
2,"rājā","_","_","rājan","NC","","_","_"
3,"_","_","_","dharma","NC","","_","_"
4,"_","_","_","śīla","NC","","_","_"
5,"mahātmā","_","_","mahātman","JJ","","_","_"
6,"hayagrīvo","_","_","hayagrīva","NC","","_","_"
7,"modate","_","_","mod","V","mud","_","_"
8,"_","_","_","svarga","NC","","_","_"
9,"_","_","_","loka","NC","","_","_"
1,"_","_","_","vidvas","JJ","","_","_"
2,"_","_","_","tyāgin","JJ","","_","_"
3,"śraddadhānaḥ","_","_","śraddhā","KDP","","_","_"
4,"kṛtajñas","_","_","kṛtajña","JJ","","_","_"
5,"tyaktvā","_","_","tyaj","CGDA","","_","_"
6,"lokaṃ","_","_","loka","NC","","_","_"
7,"mānuṣaṃ","_","_","mānuṣa","JJ","","_","_"
8,"karma","_","_","karman","NC","","_","_"
9,"kṛtvā","_","_","kṛ","CGDA","","_","_"
1,"medhāvināṃ","_","_","medhāvin","JJ","","_","_"
2,"viduṣāṃ","_","_","vidvas","JJ","","_","_"
3,"saṃmatānāṃ","_","_","samman","PPP","","_","_"
4,"_","_","_","tanu","NC","","_","_"
5,"_","_","_","tyaj","JJ","","_","_"
6,"lokam","_","_","loka","NC","","_","_"
7,"ākramya","_","_","ākra","CGDA","","_","_"
8,"rājā","_","_","rājan","NC","","_","_"
1,"samyag","_","_","samyak","CX","","_","_"
2,"vedān","_","_","veda","NC","","_","_"
3,"prāpya","_","_","prāp","CGDA","","_","_"
4,"_","_","_","śāstra","NC","","_","_"
5,"a","_","_","alpha_privativum","CGDA","","_","_"
5,"_","_","_","dhī","CGDA","","_","_"
6,"samyag","_","_","samyak","CX","","_","_"
7,"rāṣṭraṃ","_","_","rāṣṭra","NC","","_","_"
8,"pālayitvā","_","_","pālay","CGDA","","_","_"
9,"mahātmā","_","_","mahātman","JJ","","_","_"
1,"cāturvarṇyaṃ","_","_","cāturvarṇya","NC","","_","_"
2,"sthāpayitvā","_","_","sthāpay","CGDA","","_","_"
3,"svadharme","_","_","svadharma","NC","","_","_"
4,"vājigrīvo","_","_","vājigrīva","NC","","_","_"
5,"modate","_","_","mod","V","mud","_","_"
6,"_","_","_","deva","NC","","_","_"
7,"_","_","_","loka","NC","","_","_"
1,"jitvā","_","_","ji","CGDA","","_","_"
2,"saṃgrāmān","_","_","saṃgrāma","NC","","_","_"
3,"pālayitvā","_","_","pālay","CGDA","","_","_"
4,"_","_","_","prajā","NC","","_","_"
5,"_","_","_","ca","CCD","","_","_"
6,"somaṃ","_","_","soma","NC","","_","_"
7,"pītvā","_","_","pā","CGDA","","_","_"
8,"tarpayitvā","_","_","tarpay","CGDA","","_","_"
9,"dvijāgryān","_","_","dvijāgrya","NC","","_","_"
1,"yuktyā","_","_","yukti","NC","","_","_"
2,"daṇḍaṃ","_","_","daṇḍa","NC","","_","_"
3,"dhārayitvā","_","_","dhāray","CGDA","","_","_"
4,"prajānāṃ","_","_","prajā","NC","","_","_"
5,"yuddhe","_","_","yuddha","NC","","_","_"
6,"kṣīṇo","_","_","kṣi","PPP","","_","_"
7,"modate","_","_","mod","V","mud","_","_"
8,"_","_","_","deva","NC","","_","_"
9,"_","_","_","loka","NC","","_","_"
1,"vṛttaṃ","_","_","vṛtta","NC","","_","_"
2,"yasya","_","_","yad","PRL","","_","_"
3,"ślāghanīyaṃ","_","_","ślāgh","KDG","","_","_"
4,"manuṣyāḥ","_","_","manuṣya","NC","","_","_"
5,"santo","_","_","sat","JJ","","_","_"
6,"_","_","_","vidvas","JJ","","_","_"
7,"_","_","_","ca","CCD","","_","_"
8,"_","_","_","arhay","V","arhay","_","_"
9,"_","_","_","arh","KDG","","_","_"
1,"svargaṃ","_","_","svarga","NC","","_","_"
2,"jitvā","_","_","ji","CGDA","","_","_"
3,"_","_","_","vīra","NC","","_","_"
4,"_","_","_","loka","NC","","_","_"
5,"_","_","_","ca","CCD","","_","_"
6,"gatvā","_","_","ga","CGDA","","_","_"
7,"siddhiṃ","_","_","siddhi","NC","","_","_"
8,"prāptaḥ","_","_","prāp","PPP","","_","_"
9,"_","_","_","puṇya","JJ","","_","_"
10,"_","_","_","kīrti","NC","","_","_"
11,"mahātmā","_","_","mahātman","JJ","","_","_"
