"WordID","word","NormSTEM","suffix","lemma","PoS","Root","NormSuffix","NormWord"
1,"aśvinā","_","_","aśvin","NC","","_","_"
2,"yajvarīr","_","_","yajvan","JJ","","_","_"
3,"iṣo","_","_","iṣ","NC","","_","_"
4,"_","_","_","dru","KDP","","_","_"
5,"_","_","_","pāṇi","NC","","_","_"
6,"śubhas","_","_","śubh","NC","","_","_"
7,"patī","_","_","pati","NC","","_","_"
1,"_","_","_","puru","JJ","","_","_"
2,"_","_","_","bhuj","JJ","","_","_"
3,"canasyatam","_","_","canasy","V","canasy","_","_"
1,"aśvinā","_","_","aśvin","NC","","_","_"
2,"_","_","_","puru","JJ","","_","_"
3,"_","_","_","daṃsas","NC","","_","_"
4,"narā","_","_","nara","NC","","_","_"
5,"śavīrayā","_","_","śavīra","JJ","","_","_"
6,"dhiyā","_","_","dhī","NC","","_","_"
1,"dhiṣṇyā","_","_","dhiṣṇya","JJ","","_","_"
2,"vanataṃ","_","_","van","V","van","_","_"
3,"giraḥ","_","_","gir","NC","","_","_"
1,"dasrā","_","_","dasra","NC","","_","_"
2,"yuvākavaḥ","_","_","yuvāku","JJ","","_","_"
3,"sutā","_","_","suta","NC","","_","_"
4,"nāsatyā","_","_","nāsatya","NC","","_","_"
5,"_","_","_","vṛj","PPP","","_","_"
6,"_","_","_","barhis","NC","","_","_"
1,"ā","_","_","ā","CADP","","_","_"
2,"yātaṃ","_","_","yā","V","yā","_","_"
3,"rudravartanī","_","_","rudravartani","NC","","_","_"
1,"_","_","_","indra","NC","","_","_"
2,"_","_","_","ā","CADP","","_","_"
3,"yāhi","_","_","yā","V","yā","_","_"
4,"_","_","_","citra","JJ","","_","_"
5,"_","_","_","bhānu","NC","","_","_"
6,"sutā","_","_","suta","NC","","_","_"
7,"ime","_","_","ida","PRD","","_","_"
8,"tvāyavaḥ","_","_","tvāyu","JJ","","_","_"
1,"aṇvībhis","_","_","aṇu","JJ","","_","_"
2,"tanā","_","_","tan","NC","","_","_"
3,"pūtāsaḥ","_","_","pū","PPP","","_","_"
1,"_","_","_","indra","NC","","_","_"
2,"_","_","_","ā","CADP","","_","_"
3,"yāhi","_","_","yā","V","yā","_","_"
4,"_","_","_","dhī","NC","","_","_"
5,"_","_","_","iṣay","PPP","","_","_"
6,"_","_","_","vipra","NC","","_","_"
7,"_","_","_","jū","PPP","","_","_"
8,"sutāvataḥ","_","_","sutāvat","JJ","","_","_"
1,"upa","_","_","upa","CADP","","_","_"
2,"brahmāṇi","_","_","brahman","NC","","_","_"
3,"vāghataḥ","_","_","vāghat","NC","","_","_"
1,"_","_","_","indra","NC","","_","_"
2,"_","_","_","ā","CADP","","_","_"
3,"yāhi","_","_","yā","V","yā","_","_"
4,"tūtujāna","_","_","tuj","KDP","","_","_"
5,"upa","_","_","upa","CADP","","_","_"
6,"brahmāṇi","_","_","brahman","NC","","_","_"
7,"harivaḥ","_","_","harivat","JJ","","_","_"
1,"sute","_","_","suta","NC","","_","_"
2,"dadhiṣva","_","_","dadh","V","dhā","_","_"
3,"naś","_","_","mat","PPR","","_","_"
4,"canaḥ","_","_","canas","NC","","_","_"
1,"omāsaś","_","_","oma","NC","","_","_"
2,"_","_","_","carṣaṇi","NC","","_","_"
3,"_","_","_","dhṛt","JJ","","_","_"
4,"viśve","_","_","viśva","JQ","","_","_"
5,"devāsa","_","_","deva","NC","","_","_"
6,"ā","_","_","ā","CADP","","_","_"
7,"gata","_","_","ga","V","ga","_","_"
1,"dāśvāṃso","_","_","dāś","KDP","","_","_"
2,"dāśuṣaḥ","_","_","dāś","KDP","","_","_"
3,"sutam","_","_","suta","NC","","_","_"
1,"viśve","_","_","viśva","JQ","","_","_"
2,"devāso","_","_","deva","NC","","_","_"
3,"apturaḥ","_","_","aptur","JJ","","_","_"
4,"sutam","_","_","suta","NC","","_","_"
5,"ā","_","_","ā","CADP","","_","_"
6,"ganta","_","_","ganta","V","ga","_","_"
7,"tūrṇayaḥ","_","_","tūrṇi","JJ","","_","_"
1,"usrā","_","_","usrā","NC","","_","_"
2,"iva","_","_","iva","CCM","","_","_"
3,"svasarāṇi","_","_","svasara","NC","","_","_"
1,"viśve","_","_","viśva","JQ","","_","_"
2,"devāso","_","_","deva","NC","","_","_"
3,"a","_","_","alpha_privativum","JJ","","_","_"
3,"asridha","_","_","sridh","JJ","","_","_"
4,"ehimāyāso","_","_","ehimāya","JJ","","_","_"
5,"a","_","_","alpha_privativum","JJ","","_","_"
5,"adruhaḥ","_","_","druh","JJ","","_","_"
1,"medhaṃ","_","_","medha","NC","","_","_"
2,"juṣanta","_","_","juṣ","V","juṣ","_","_"
3,"vahnayaḥ","_","_","vahni","NC","","_","_"
1,"pāvakā","_","_","pāvaka","JJ","","_","_"
2,"naḥ","_","_","mat","PPR","","_","_"
3,"sarasvatī","_","_","sarasvatī","NC","","_","_"
4,"vājebhir","_","_","vāja","NC","","_","_"
5,"vājinīvatī","_","_","vājinīvat","JJ","","_","_"
1,"yajñaṃ","_","_","yajña","NC","","_","_"
2,"vaṣṭu","_","_","vaś","V","vaś","_","_"
3,"dhiyāvasuḥ","_","_","dhiyāvasu","JJ","","_","_"
1,"codayitrī","_","_","codayitṛ","JJ","","_","_"
2,"sūnṛtānāṃ","_","_","sūnṛta","NC","","_","_"
3,"cetantī","_","_","cit","KDP","","_","_"
4,"sumatīnām","_","_","sumati","NC","","_","_"
1,"yajñaṃ","_","_","yajña","NC","","_","_"
2,"dadhe","_","_","dadh","V","dhā","_","_"
3,"sarasvatī","_","_","sarasvatī","NC","","_","_"
1,"maho","_","_","mah","JJ","","_","_"
2,"arṇaḥ","_","_","arṇas","NC","","_","_"
3,"sarasvatī","_","_","sarasvatī","NC","","_","_"
4,"pra","_","_","pra","CADP","","_","_"
5,"cetayati","_","_","cetay","V","cetay","_","_"
6,"ketunā","_","_","ketu","NC","","_","_"
1,"dhiyo","_","_","dhī","NC","","_","_"
2,"viśvā","_","_","viśva","JQ","","_","_"
3,"vi","_","_","vi","CADP","","_","_"
4,"rājati","_","_","rājati","V","rāj","_","_"
