"WordID","word","NormSTEM","suffix","lemma","PoS","Root","NormSuffix","NormWord"
1,"sūta","_","_","sūta","NC","","_","_"
2,"uvāca","_","_","vak","V","vac","_","_"
1,"tataḥ","_","_","tatas","CX","","_","_"
2,"_","_","_","kāma","NC","","_","_"
3,"_","_","_","gama","JJ","","_","_"
4,"pakṣī","_","_","pakṣin","NC","","_","_"
5,"_","_","_","mahat","JJ","","_","_"
6,"_","_","_","vīrya","NC","","_","_"
7,"_","_","_","mahat","JJ","","_","_"
8,"_","_","_","bala","NC","","_","_"
1,"mātur","_","_","mātṛ","NC","","_","_"
2,"antikam","_","_","antika","NC","","_","_"
3,"āgacchat","_","_","gacch","V","gam","_","_"
4,"paraṃ","_","_","para","PPX","","_","_"
5,"tīraṃ","_","_","tīra","NC","","_","_"
6,"mahodadheḥ","_","_","mahodadhi","NC","","_","_"
1,"yatra","_","_","yatra","CX","","_","_"
2,"sā","_","_","tad","PRD","","_","_"
3,"vinatā","_","_","vinatā","NC","","_","_"
4,"tasmin","_","_","tad","PRD","","_","_"
5,"paṇitena","_","_","paṇita","NC","","_","_"
6,"parājitā","_","_","parāji","PPP","","_","_"
1,"atīva","_","_","atīva","CX","","_","_"
2,"_","_","_","duḥkha","NC","","_","_"
3,"_","_","_","saṃtap","PPP","","_","_"
4,"_","_","_","dāsī","NC","","_","_"
5,"_","_","_","bhāva","NC","","_","_"
6,"upāgatā","_","_","upāga","PPP","","_","_"
1,"tataḥ","_","_","tatas","CX","","_","_"
2,"kadācid","_","_","kadācid","CX","","_","_"
3,"vinatāṃ","_","_","vinatā","NC","","_","_"
4,"pravaṇāṃ","_","_","pravaṇa","JJ","","_","_"
5,"_","_","_","putra","NC","","_","_"
6,"_","_","_","saṃnidhi","NC","","_","_"
1,"kāla","_","_","kāla","NC","","_","_"
2,"āhūya","_","_","āhvā","CGDA","","_","_"
3,"vacanaṃ","_","_","vacana","NC","","_","_"
4,"kadrūr","_","_","kadru","NC","","_","_"
5,"idam","_","_","ida","PRD","","_","_"
6,"abhāṣata","_","_","bhāṣ","V","bhāṣ","_","_"
1,"nāgānām","_","_","nāga","NC","","_","_"
2,"ālayaṃ","_","_","ālaya","NC","","_","_"
3,"bhadre","_","_","bhadra","JJ","","_","_"
4,"_","_","_","su","CAD","","_","_"
5,"_","_","_","ramya","JJ","","_","_"
6,"ramaṇīyakam","_","_","ramaṇīyaka","NC","","_","_"
1,"_","_","_","samudra","NC","","_","_"
2,"_","_","_","kukṣi","NC","","_","_"
3,"_","_","_","ekānta","NC","","_","_"
4,"tatra","_","_","tatra","CAD","","_","_"
5,"māṃ","_","_","mat","PPR","","_","_"
6,"vinate","_","_","vinatā","NC","","_","_"
7,"vaha","_","_","vah","V","vah","_","_"
1,"tataḥ","_","_","tatas","CX","","_","_"
2,"_","_","_","suparṇa","NC","","_","_"
3,"_","_","_","mātṛ","NC","","_","_"
4,"tām","_","_","tad","PRD","","_","_"
5,"avahat","_","_","vah","V","vah","_","_"
6,"_","_","_","sarpa","NC","","_","_"
7,"_","_","_","mātṛ","NC","","_","_"
1,"pannagān","_","_","pannaga","NC","","_","_"
2,"_","_","_","garuḍa","NC","","_","_"
3,"_","_","_","ca","CCD","","_","_"
4,"_","_","_","api","CX","","_","_"
5,"mātur","_","_","mātṛ","NC","","_","_"
6,"_","_","_","vacana","NC","","_","_"
7,"_","_","_","coday","PPP","","_","_"
1,"sa","_","_","tad","PRD","","_","_"
2,"_","_","_","sūrya","NC","","_","_"
3,"_","_","_","abhitas","CX","","_","_"
4,"yāti","_","_","yā","V","yā","_","_"
5,"vainateyo","_","_","vainateya","NC","","_","_"
6,"vihaṃgamaḥ","_","_","vihaṃgama","NC","","_","_"
1,"_","_","_","sūrya","NC","","_","_"
2,"_","_","_","raśmi","NC","","_","_"
3,"_","_","_","parī","PPP","","_","_"
4,"_","_","_","ca","CCD","","_","_"
5,"mūrchitāḥ","_","_","mūrchay","PPP","","_","_"
6,"_","_","_","pannaga","NC","","_","_"
7,"_","_","_","bhav","V","bhū","_","_"
1,"_","_","_","tad","PRD","","_","_"
2,"_","_","_","avasthā","NC","","_","_"
3,"sutān","_","_","suta","NC","","_","_"
4,"dṛṣṭvā","_","_","dṛś","CGDA","","_","_"
5,"kadrūḥ","_","_","kadru","NC","","_","_"
6,"śakram","_","_","śakra","NC","","_","_"
7,"_","_","_","atha","CAD","","_","_"
8,"_","_","_","stu","V","stu","_","_"
1,"_","_","_","namas","NC","","_","_"
2,"_","_","_","tvat","PPR","","_","_"
3,"devadeveśa","_","_","devadeveśa","NC","","_","_"
4,"_","_","_","namas","NC","","_","_"
5,"_","_","_","tvat","PPR","","_","_"
6,"balasūdana","_","_","balasūdana","NC","","_","_"
1,"_","_","_","namuci","NC","","_","_"
2,"_","_","_","ghna","JJ","","_","_"
3,"_","_","_","namas","NC","","_","_"
4,"_","_","_","tvat","PPR","","_","_"
5,"'stu","_","_","as","V","as","_","_"
6,"sahasrākṣa","_","_","sahasrākṣa","NC","","_","_"
7,"śacīpate","_","_","śacīpati","NC","","_","_"
1,"sarpāṇāṃ","_","_","sarpa","NC","","_","_"
2,"_","_","_","sūrya","NC","","_","_"
3,"_","_","_","tap","PPP","","_","_"
4,"vāriṇā","_","_","vāri","NC","","_","_"
5,"tvaṃ","_","_","tvat","PPR","","_","_"
6,"plavo","_","_","plava","NC","","_","_"
7,"bhava","_","_","bhav","V","bhū","_","_"
1,"tvam","_","_","tvat","PPR","","_","_"
2,"eva","_","_","eva","CEM","","_","_"
3,"paramaṃ","_","_","parama","JJ","","_","_"
4,"trāṇam","_","_","trāṇa","NC","","_","_"
5,"asmākam","_","_","mat","PPR","","_","_"
6,"_","_","_","amara","NC","","_","_"
7,"_","_","_","uttama","JJ","","_","_"
1,"īśo","_","_","īśa","JJ","","_","_"
2,"_","_","_","hi","CX","","_","_"
3,"_","_","_","as","V","as","_","_"
4,"payaḥ","_","_","payas","NC","","_","_"
5,"sraṣṭuṃ","_","_","sṛj","CGDI","","_","_"
6,"tvam","_","_","tvat","PPR","","_","_"
7,"analpaṃ","_","_","analpa","JJ","","_","_"
8,"puraṃdara","_","_","puraṃdara","NC","","_","_"
1,"tvam","_","_","tvat","PPR","","_","_"
2,"eva","_","_","eva","CEM","","_","_"
3,"_","_","_","megha","NC","","_","_"
4,"_","_","_","tvat","PPR","","_","_"
5,"_","_","_","vāyu","NC","","_","_"
6,"_","_","_","tvat","PPR","","_","_"
7,"agnir","_","_","agni","NC","","_","_"
8,"vaidyuto","_","_","vaidyuta","JJ","","_","_"
9,"'mbare","_","_","ambara","NC","","_","_"
1,"tvam","_","_","tvat","PPR","","_","_"
2,"_","_","_","abhra","NC","","_","_"
3,"_","_","_","ghana","NC","","_","_"
4,"_","_","_","vikṣeptṛ","NC","","_","_"
5,"tvām","_","_","tvat","PPR","","_","_"
6,"_","_","_","eva","CEM","","_","_"
7,"_","_","_","ah","V","ah","_","_"
8,"punar","_","_","punar","CAD","","_","_"
9,"ghanam","_","_","ghana","NC","","_","_"
1,"tvaṃ","_","_","tvat","PPR","","_","_"
2,"vajram","_","_","vajra","NC","","_","_"
3,"atulaṃ","_","_","atula","JJ","","_","_"
4,"ghoraṃ","_","_","ghora","JJ","","_","_"
5,"_","_","_","ghoṣavat","JJ","","_","_"
6,"_","_","_","tvat","PPR","","_","_"
7,"balāhakaḥ","_","_","balāhaka","NC","","_","_"
1,"sraṣṭā","_","_","sraṣṭṛ","NC","","_","_"
2,"tvam","_","_","tvat","PPR","","_","_"
3,"eva","_","_","eva","CEM","","_","_"
4,"lokānāṃ","_","_","loka","NC","","_","_"
5,"saṃhartā","_","_","saṃhartṛ","JJ","","_","_"
6,"_","_","_","ca","CCD","","_","_"
7,"_","_","_","aparājita","JJ","","_","_"
1,"tvaṃ","_","_","tvat","PPR","","_","_"
2,"jyotiḥ","_","_","jyotis","NC","","_","_"
3,"_","_","_","sarva","JQ","","_","_"
4,"_","_","_","bhūta","NC","","_","_"
5,"tvam","_","_","tvat","PPR","","_","_"
6,"ādityo","_","_","āditya","NC","","_","_"
7,"vibhāvasuḥ","_","_","vibhāvasu","NC","","_","_"
1,"tvaṃ","_","_","tvat","PPR","","_","_"
2,"mahad","_","_","mahat","JJ","","_","_"
3,"bhūtam","_","_","bhūta","NC","","_","_"
4,"āścaryaṃ","_","_","āścarya","NC","","_","_"
5,"tvaṃ","_","_","tvat","PPR","","_","_"
6,"rājā","_","_","rājan","NC","","_","_"
7,"tvaṃ","_","_","tvat","PPR","","_","_"
8,"_","_","_","sura","NC","","_","_"
9,"_","_","_","uttama","JJ","","_","_"
1,"tvaṃ","_","_","tvat","PPR","","_","_"
2,"_","_","_","viṣṇu","NC","","_","_"
3,"_","_","_","tvat","PPR","","_","_"
4,"_","_","_","sahasrākṣa","NC","","_","_"
5,"_","_","_","tvat","PPR","","_","_"
6,"_","_","_","deva","NC","","_","_"
7,"_","_","_","tvat","PPR","","_","_"
8,"parāyaṇam","_","_","parāyaṇa","NC","","_","_"
1,"tvaṃ","_","_","tvat","PPR","","_","_"
2,"sarvam","_","_","sarva","JQ","","_","_"
3,"amṛtaṃ","_","_","amṛta","NC","","_","_"
4,"deva","_","_","deva","NC","","_","_"
5,"tvaṃ","_","_","tvat","PPR","","_","_"
6,"somaḥ","_","_","soma","NC","","_","_"
7,"_","_","_","parama","JJ","","_","_"
8,"_","_","_","arcay","PPP","","_","_"
1,"tvaṃ","_","_","tvat","PPR","","_","_"
2,"_","_","_","muhūrta","NC","","_","_"
3,"_","_","_","tithi","NC","","_","_"
4,"_","_","_","ca","CCD","","_","_"
5,"tvaṃ","_","_","tvat","PPR","","_","_"
6,"_","_","_","lava","NC","","_","_"
7,"_","_","_","tvat","PPR","","_","_"
8,"vai","_","_","vai","CX","","_","_"
9,"punaḥ","_","_","punar","CAD","","_","_"
10,"kṣaṇaḥ","_","_","kṣaṇa","NC","","_","_"
1,"_","_","_","śukla","JJ","","_","_"
2,"_","_","_","tvat","PPR","","_","_"
3,"_","_","_","bahula","JJ","","_","_"
4,"_","_","_","ca","CCD","","_","_"
5,"_","_","_","eva","CEM","","_","_"
6,"kalā","_","_","kalā","NC","","_","_"
7,"kāṣṭhā","_","_","kāṣṭhā","NC","","_","_"
8,"_","_","_","truṭi","NC","","_","_"
9,"_","_","_","tathā","CX","","_","_"
1,"_","_","_","saṃvatsara","NC","","_","_"
2,"_","_","_","ṛtu","NC","","_","_"
3,"māsā","_","_","māsa","NC","","_","_"
4,"_","_","_","rajanī","NC","","_","_"
5,"_","_","_","ca","CCD","","_","_"
6,"dināni","_","_","dina","NC","","_","_"
7,"ca","_","_","ca","CCD","","_","_"
1,"tvam","_","_","tvat","PPR","","_","_"
2,"uttamā","_","_","uttama","JJ","","_","_"
3,"_","_","_","sa_saha","CX","","_","_"
4,"_","_","_","giri","NC","","_","_"
5,"_","_","_","vana","NC","","_","_"
6,"vasuṃdharā","_","_","vasuṃdharā","NC","","_","_"
7,"_","_","_","sa_saha","CX","","_","_"
8,"_","_","_","bhāskara","NC","","_","_"
9,"vitimiram","_","_","vitimira","JJ","","_","_"
10,"ambaraṃ","_","_","ambara","NC","","_","_"
11,"tathā","_","_","tathā","CX","","_","_"
1,"mahodadhiḥ","_","_","mahodadhi","NC","","_","_"
2,"_","_","_","satimi","JJ","","_","_"
3,"_","_","_","timiṅgila","NC","","_","_"
4,"_","_","_","tathā","CX","","_","_"
5,"_","_","_","mahat","JJ","","_","_"
6,"_","_","_","ūrmimat","JJ","","_","_"
7,"_","_","_","bahu","JJ","","_","_"
8,"_","_","_","makara","NC","","_","_"
9,"_","_","_","jhaṣa","NC","","_","_"
10,"_","_","_","ālaya","NC","","_","_"
1,"mahad","_","_","mahat","JJ","","_","_"
2,"_","_","_","yaśas","NC","","_","_"
3,"_","_","_","tvat","PPR","","_","_"
4,"iti","_","_","iti","CQT","","_","_"
5,"_","_","_","sadā","CAD","","_","_"
6,"_","_","_","abhipūjay","V","abhipūjay","_","_"
7,"manīṣibhir","_","_","manīṣin","JJ","","_","_"
8,"_","_","_","mud","PPP","","_","_"
9,"_","_","_","manas","NC","","_","_"
10,"_","_","_","mahat","JJ","","_","_"
11,"_","_","_","ṛṣi","NC","","_","_"
1,"abhiṣṭutaḥ","_","_","abhiṣṭu","PPP","","_","_"
2,"pibasi","_","_","pib","V","pā","_","_"
3,"ca","_","_","ca","CCD","","_","_"
4,"somam","_","_","soma","NC","","_","_"
5,"adhvare","_","_","adhvara","NC","","_","_"
6,"_","_","_","vaṣaṭkṛ","PPP","","_","_"
7,"_","_","_","api","CX","","_","_"
8,"ca","_","_","ca","CCD","","_","_"
9,"havīṃṣi","_","_","havis","NC","","_","_"
10,"bhūtaye","_","_","bhūti","NC","","_","_"
1,"tvaṃ","_","_","tvat","PPR","","_","_"
2,"vipraiḥ","_","_","vipra","NC","","_","_"
3,"satatam","_","_","satata","CX","","_","_"
4,"_","_","_","iha","CAD","","_","_"
5,"_","_","_","yaj","V","yaj","_","_"
6,"_","_","_","phala","NC","","_","_"
7,"_","_","_","artha","NC","","_","_"
8,"_","_","_","vedāṅga","NC","","_","_"
9,"_","_","_","atula","JJ","","_","_"
10,"_","_","_","bala","NC","","_","_"
11,"_","_","_","ogha","NC","","_","_"
12,"gīyase","_","_","gāy","V","gai","_","_"
13,"ca","_","_","ca","CCD","","_","_"
1,"_","_","_","tvat","PPR","","_","_"
2,"_","_","_","hetu","NC","","_","_"
3,"_","_","_","yajana","NC","","_","_"
4,"_","_","_","parāyaṇa","NC","","_","_"
5,"dvijendrā","_","_","dvijendra","NC","","_","_"
6,"_","_","_","vedāṅga","NC","","_","_"
7,"_","_","_","abhigamay","V","abhigamay","_","_"
8,"_","_","_","sarva","JQ","","_","_"
9,"_","_","_","veda","NC","","_","_"
