"WordID","word","NormSTEM","suffix","lemma","PoS","Root","NormSuffix","NormWord"
1,"mā","_","_","mā","CNG","","_","_"
2,"no","_","_","mat","PPR","","_","_"
3,"vidan","_","_","vid","V","vid","_","_"
4,"vivyādhino","_","_","vivyādhin","JJ","","_","_"
5,"_","_","_","mā","CNG","","_","_"
6,"_","_","_","u","CEM","","_","_"
7,"abhivyādhino","_","_","abhivyādhin","JJ","","_","_"
8,"vidan","_","_","vid","V","vid","_","_"
1,"_","_","_","ārāt","CX","","_","_"
2,"_","_","_","śaravyā","NC","","_","_"
3,"asmad","_","_","mat","PPR","","_","_"
4,"viṣūcīr","_","_","viṣvañc","JJ","","_","_"
5,"indra","_","_","indra","NC","","_","_"
6,"pātaya","_","_","pātay","V","pātay","_","_"
1,"viṣvañco","_","_","viṣvañc","JJ","","_","_"
2,"_","_","_","mat","PPR","","_","_"
3,"_","_","_","śaru","NC","","_","_"
4,"patantu","_","_","pat","V","pat","_","_"
5,"ye","_","_","yad","PRL","","_","_"
6,"astā","_","_","as","PPP","","_","_"
7,"ye","_","_","yad","PRL","","_","_"
8,"_","_","_","ca","CCD","","_","_"
9,"_","_","_","as","KDG","","_","_"
1,"daivīr","_","_","daiva","JJ","","_","_"
2,"_","_","_","manuṣya","NC","","_","_"
3,"_","_","_","iṣu","NC","","_","_"
4,"_","_","_","mat","PPR","","_","_"
5,"_","_","_","amitra","NC","","_","_"
6,"vi","_","_","vi","CADP","","_","_"
7,"vidhyata","_","_","vyadh","V","vyadh","_","_"
1,"yo","_","_","yad","PRL","","_","_"
2,"naḥ","_","_","mat","PPR","","_","_"
3,"svo","_","_","sva","JJ","","_","_"
4,"yo","_","_","yad","PRL","","_","_"
5,"araṇaḥ","_","_","araṇa","JJ","","_","_"
6,"sajāta","_","_","sajāta","JJ","","_","_"
7,"uta","_","_","uta","CCD","","_","_"
8,"niṣṭyo","_","_","niṣṭya","JJ","","_","_"
9,"yo","_","_","yad","PRL","","_","_"
10,"asmāṁ","_","_","mat","PPR","","_","_"
11,"abhidāsati","_","_","abhidās","V","abhidās","_","_"
1,"rudraḥ","_","_","rudra","NC","","_","_"
2,"_","_","_","śaravyā","NC","","_","_"
3,"_","_","_","tad","PRD","","_","_"
4,"_","_","_","mat","PPR","","_","_"
5,"_","_","_","amitra","NC","","_","_"
6,"vi","_","_","vi","CADP","","_","_"
7,"vidhyatu","_","_","vyadh","V","vyadh","_","_"
1,"yaḥ","_","_","yad","PRL","","_","_"
2,"sapatno","_","_","sapatna","NC","","_","_"
3,"yo","_","_","yad","PRL","","_","_"
4,"_","_","_","a","CNG","","_","_"
5,"_","_","_","sapatna","NC","","_","_"
6,"yaś","_","_","yad","PRL","","_","_"
7,"ca","_","_","ca","CCD","","_","_"
8,"_","_","_","dviṣ","KDP","","_","_"
9,"_","_","_","śap","V","śap","_","_"
10,"naḥ","_","_","mat","PPR","","_","_"
1,"devās","_","_","deva","NC","","_","_"
2,"taṃ","_","_","tad","PRD","","_","_"
3,"sarve","_","_","sarva","JQ","","_","_"
4,"dhūrvantu","_","_","dhūrv","V","dhūrv","_","_"
5,"brahma","_","_","brahman","NC","","_","_"
6,"varma","_","_","varman","NC","","_","_"
7,"_","_","_","mat","PPR","","_","_"
8,"_","_","_","antara","JJ","","_","_"
