"WordID","word","NormSTEM","suffix","lemma","PoS","Root","NormSuffix","NormWord"
1,"abhi","_","_","abhi","CADP","","_","_"
2,"no","_","_","mat","PPR","","_","_"
3,"_","_","_","vāja","NC","","_","_"
4,"_","_","_","sātama","JJ","","_","_"
5,"rayim","_","_","rayi","NC","","_","_"
6,"arṣa","_","_","ṛṣ","V","ṛṣ","_","_"
7,"puruspṛham","_","_","puruspṛh","JJ","","_","_"
1,"indo","_","_","indu","NC","","_","_"
2,"sahasrabharṇasaṃ","_","_","sahasrabharṇas","JJ","","_","_"
3,"_","_","_","tuvi","JJ","","_","_"
4,"_","_","_","dyumna","NC","","_","_"
5,"vibhvāsaham","_","_","vibhvāsah","JJ","","_","_"
1,"pari","_","_","pari","CADP","","_","_"
2,"ṣya","_","_","tya","PRD","","_","_"
3,"suvāno","_","_","sū","KDP","","_","_"
4,"avyayaṃ","_","_","avyaya","JJ","","_","_"
5,"rathe","_","_","ratha","NC","","_","_"
6,"na","_","_","na","CNG","","_","_"
7,"_","_","_","varman","NC","","_","_"
8,"_","_","_","vye","V","vye","_","_"
1,"indur","_","_","indu","NC","","_","_"
2,"abhi","_","_","abhi","CADP","","_","_"
3,"druṇā","_","_","dru","NC","","_","_"
4,"hito","_","_","dhā","PPP","","_","_"
5,"hiyāno","_","_","hi","KDP","","_","_"
6,"dhārābhir","_","_","dhārā","NC","","_","_"
7,"akṣāḥ","_","_","kṣar","V","kṣar","_","_"
1,"pari","_","_","pari","CADP","","_","_"
2,"ṣya","_","_","tya","PRD","","_","_"
3,"suvāno","_","_","sū","KDP","","_","_"
4,"akṣā","_","_","kṣar","V","kṣar","_","_"
5,"indur","_","_","indu","NC","","_","_"
6,"avye","_","_","avya","JJ","","_","_"
7,"_","_","_","mada","NC","","_","_"
8,"_","_","_","cyu","PPP","","_","_"
1,"dhārā","_","_","dhārā","NC","","_","_"
2,"ya","_","_","yad","PRL","","_","_"
3,"ūrdhvo","_","_","ūrdhva","JJ","","_","_"
4,"adhvare","_","_","adhvara","NC","","_","_"
5,"bhrājā","_","_","bhrāj","NC","","_","_"
6,"_","_","_","na","CNG","","_","_"
7,"_","_","_","e","V","i","_","_"
8,"gavyayuḥ","_","_","gavyayu","JJ","","_","_"
1,"sa","_","_","tad","PRD","","_","_"
2,"hi","_","_","hi","CX","","_","_"
3,"tvaṃ","_","_","tvat","PPR","","_","_"
4,"deva","_","_","deva","NC","","_","_"
5,"śaśvate","_","_","śaśvat","JJ","","_","_"
6,"vasu","_","_","vasu","NC","","_","_"
7,"martāya","_","_","marta","NC","","_","_"
8,"dāśuṣe","_","_","dāś","KDP","","_","_"
1,"indo","_","_","indu","NC","","_","_"
2,"sahasriṇaṃ","_","_","sahasrin","JJ","","_","_"
3,"rayiṃ","_","_","rayi","NC","","_","_"
4,"_","_","_","śata","NUM","","_","_"
5,"_","_","_","ātman","NC","","_","_"
6,"vivāsasi","_","_","ve","V","ve","_","_"
1,"vayaṃ","_","_","mat","PPR","","_","_"
2,"te","_","_","tvat","PPR","","_","_"
3,"asya","_","_","ida","PRD","","_","_"
4,"_","_","_","vṛtra","NC","","_","_"
5,"_","_","_","han","JJ","","_","_"
6,"vaso","_","_","vasu","JJ","","_","_"
7,"vasvaḥ","_","_","vasu","NC","","_","_"
8,"puruspṛhaḥ","_","_","puruspṛh","JJ","","_","_"
1,"ni","_","_","ni","CADP","","_","_"
2,"nediṣṭhatamā","_","_","nediṣṭhatama","JJ","","_","_"
3,"iṣaḥ","_","_","iṣ","NC","","_","_"
4,"syāma","_","_","as","V","as","_","_"
5,"_","_","_","sumna","NC","","_","_"
6,"_","_","_","adhrigu","JJ","","_","_"
1,"dvir","_","_","dvis","CX","","_","_"
2,"yam","_","_","yad","PRL","","_","_"
3,"pañca","_","_","pañcan","NUM","","_","_"
4,"_","_","_","sva","JJ","","_","_"
5,"_","_","_","yaśas","NC","","_","_"
6,"svasāro","_","_","svasṛ","NC","","_","_"
7,"_","_","_","adri","NC","","_","_"
8,"_","_","_","saṃhan","PPP","","_","_"
1,"priyam","_","_","priya","JJ","","_","_"
2,"indrasya","_","_","indra","NC","","_","_"
3,"kāmyam","_","_","kāmya","JJ","","_","_"
4,"prasnāpayanty","_","_","prasnāpay","V","prasnāpay","_","_"
5,"ūrmiṇam","_","_","ūrmin","JJ","","_","_"
1,"pari","_","_","pari","CADP","","_","_"
2,"tyaṃ","_","_","tya","PRD","","_","_"
3,"haryataṃ","_","_","haryata","JJ","","_","_"
4,"harim","_","_","hari","JJ","","_","_"
5,"babhrum","_","_","babhru","JJ","","_","_"
6,"punanti","_","_","pū","V","pū","_","_"
7,"vāreṇa","_","_","vāra","NC","","_","_"
1,"yo","_","_","yad","PRL","","_","_"
2,"devān","_","_","deva","NC","","_","_"
3,"viśvāṁ","_","_","viśva","NC","","_","_"
4,"it","_","_","id","CEM","","_","_"
5,"pari","_","_","pari","CADP","","_","_"
6,"madena","_","_","mada","NC","","_","_"
7,"saha","_","_","saha","CX","","_","_"
8,"gacchati","_","_","gacch","V","gam","_","_"
1,"asya","_","_","ida","PRD","","_","_"
2,"vo","_","_","tvat","PPR","","_","_"
3,"hy","_","_","hi","CX","","_","_"
4,"avasā","_","_","avas","NC","","_","_"
5,"pānto","_","_","pā","KDP","","_","_"
6,"_","_","_","dakṣa","JJ","","_","_"
7,"_","_","_","sādhana","NC","","_","_"
1,"yaḥ","_","_","yad","PRL","","_","_"
2,"sūriṣu","_","_","sūri","NC","","_","_"
3,"śravo","_","_","śravas","NC","","_","_"
4,"bṛhad","_","_","bṛhat","JJ","","_","_"
5,"dadhe","_","_","dadh","V","dhā","_","_"
6,"svar","_","_","svar","NC","","_","_"
7,"ṇa","_","_","na","CNG","","_","_"
8,"haryataḥ","_","_","haryata","JJ","","_","_"
1,"sa","_","_","tad","PRD","","_","_"
2,"vāṃ","_","_","tvat","PPR","","_","_"
3,"yajñeṣu","_","_","yajña","NC","","_","_"
4,"mānavī","_","_","mānavī","NC","","_","_"
5,"indur","_","_","indu","NC","","_","_"
6,"janiṣṭa","_","_","jan","V","jan","_","_"
7,"rodasī","_","_","rodasī","NC","","_","_"
1,"devo","_","_","deva","NC","","_","_"
2,"devī","_","_","devī","NC","","_","_"
3,"giriṣṭhā","_","_","giriṣṭhā","NC","","_","_"
4,"asredhan","_","_","sridh","V","sridh","_","_"
5,"taṃ","_","_","tad","PRD","","_","_"
6,"tuviṣvaṇi","_","_","tuviṣvaṇi","JJ","","_","_"
1,"indrāya","_","_","indra","NC","","_","_"
2,"soma","_","_","soma","NC","","_","_"
3,"pātave","_","_","pā","CGDI","","_","_"
4,"_","_","_","vṛtra","NC","","_","_"
5,"_","_","_","han","JJ","","_","_"
6,"pari","_","_","pari","CADP","","_","_"
7,"ṣicyase","_","_","sic","V","sic","_","_"
1,"nare","_","_","nṛ","NC","","_","_"
2,"ca","_","_","ca","CCD","","_","_"
3,"dakṣiṇāvate","_","_","dakṣiṇāvat","JJ","","_","_"
4,"devāya","_","_","deva","NC","","_","_"
5,"sadanāsade","_","_","sadanāsad","JJ","","_","_"
1,"te","_","_","tad","PRD","","_","_"
2,"pratnāso","_","_","pratna","JJ","","_","_"
3,"vyuṣṭiṣu","_","_","vyuṣṭi","NC","","_","_"
4,"somāḥ","_","_","soma","NC","","_","_"
5,"pavitre","_","_","pavitra","NC","","_","_"
6,"akṣaran","_","_","kṣar","V","kṣar","_","_"
1,"apaprothantaḥ","_","_","apapruth","KDP","","_","_"
2,"sanutar","_","_","sanutar","CX","","_","_"
3,"huraścitaḥ","_","_","huraścit","JJ","","_","_"
4,"prātas","_","_","prātar","CX","","_","_"
5,"tāṁ","_","_","tad","PRD","","_","_"
6,"apracetasaḥ","_","_","apracetas","JJ","","_","_"
1,"taṃ","_","_","tad","PRD","","_","_"
2,"sakhāyaḥ","_","_","sakhi","NC","","_","_"
3,"purorucaṃ","_","_","puroruc","JJ","","_","_"
4,"yūyaṃ","_","_","tvat","PPR","","_","_"
5,"vayaṃ","_","_","mat","PPR","","_","_"
6,"ca","_","_","ca","CCD","","_","_"
7,"sūrayaḥ","_","_","sūri","NC","","_","_"
1,"aśyāma","_","_","aś","V","aś","_","_"
2,"vājagandhyaṃ","_","_","vājagandhya","JJ","","_","_"
3,"sanema","_","_","san","V","san","_","_"
4,"_","_","_","vāja","NC","","_","_"
5,"_","_","_","pastyā","NC","","_","_"
