"WordID","word","NormSTEM","suffix","lemma","PoS","Root","NormSuffix","NormWord"
1,"_","_","_","samidh","NC","","_","_"
2,"_","_","_","agni","NC","","_","_"
3,"duvasyat","_","_","duvasy","V","duvasy","_","_"
4,"ā","_","_","ā","CADP","","_","_"
5,"pyāyasva","_","_","pyā","V","pyā","_","_"
6,"sam","_","_","sa","CADP","","_","_"
7,"etu","_","_","e","V","i","_","_"
8,"ta","_","_","tvat","PPR","","_","_"
9,"ity","_","_","iti","CQT","","_","_"
10,"_","_","_","ājya","NC","","_","_"
11,"_","_","_","bhāga","NC","","_","_"
12,"puronuvākye","_","_","puronuvākyā","NC","","_","_"
13,"bhavata","_","_","bhav","V","bhū","_","_"
14,"ātithyavatyau","_","_","ātithyavat","JJ","","_","_"
15,"_","_","_","rūpa","NC","","_","_"
16,"_","_","_","samṛdh","PPP","","_","_"
1,"etad","_","_","tad","PRD","","_","_"
2,"vai","_","_","vai","CX","","_","_"
3,"yajñasya","_","_","yajña","NC","","_","_"
4,"samṛddhaṃ","_","_","samṛdh","PPP","","_","_"
5,"_","_","_","yad","PRL","","_","_"
6,"_","_","_","rūpa","NC","","_","_"
7,"_","_","_","samṛdh","PPP","","_","_"
8,"yat","_","_","yad","PRL","","_","_"
9,"karma","_","_","karman","NC","","_","_"
10,"kriyamāṇam","_","_","kṛ","KDP","","_","_"
11,"ṛg","_","_","ṛc","NC","","_","_"
12,"abhivadati","_","_","abhivad","V","abhivad","_","_"
1,"_","_","_","tad","PRD","","_","_"
2,"_","_","_","tad","PRD","","_","_"
3,"_","_","_","āgneya","JJ","","_","_"
4,"atithimatī","_","_","atithimat","JJ","","_","_"
5,"na","_","_","na","CNG","","_","_"
6,"_","_","_","saumya","JJ","","_","_"
7,"_","_","_","atithimat","JJ","","_","_"
8,"asti","_","_","as","V","as","_","_"
9,"yat","_","_","yat","CSB","","_","_"
10,"_","_","_","saumya","JJ","","_","_"
11,"_","_","_","atithimat","JJ","","_","_"
12,"_","_","_","as","V","as","_","_"
13,"_","_","_","śaśvat","CX","","_","_"
14,"sā","_","_","tad","PRD","","_","_"
15,"syāt","_","_","as","V","as","_","_"
1,"etat","_","_","tad","PRD","","_","_"
2,"tv","_","_","tu","CCD","","_","_"
3,"_","_","_","eva","CEM","","_","_"
4,"_","_","_","tad","PRD","","_","_"
5,"_","_","_","atithimat","JJ","","_","_"
6,"yad","_","_","yat","CSB","","_","_"
7,"āpīnavatī","_","_","āpīnavat","JJ","","_","_"
1,"yadā","_","_","yadā","CSB","","_","_"
2,"vā","_","_","vai","CX","","_","_"
3,"atithim","_","_","atithi","NC","","_","_"
4,"pariveviṣaty","_","_","pariveviṣ","V","pariveviṣ","_","_"
5,"āpīna","_","_","āpyā","PPP","","_","_"
6,"iva","_","_","iva","CCM","","_","_"
7,"vai","_","_","vai","CX","","_","_"
8,"sa","_","_","tad","PRD","","_","_"
9,"tarhi","_","_","tarhi","CX","","_","_"
10,"bhavati","_","_","bhav","V","bhū","_","_"
1,"tayor","_","_","tad","PRD","","_","_"
2,"_","_","_","juṣ","KDP","","_","_"
3,"_","_","_","eva","CEM","","_","_"
4,"yajati","_","_","yaj","V","yaj","_","_"
1,"idaṃ","_","_","ida","PRD","","_","_"
2,"viṣṇur","_","_","viṣṇu","NC","","_","_"
3,"vi","_","_","vi","CADP","","_","_"
4,"cakrame","_","_","kra","V","kra","_","_"
5,"tad","_","_","tad","PRD","","_","_"
6,"asya","_","_","ida","PRD","","_","_"
7,"priyam","_","_","priya","JJ","","_","_"
8,"abhi","_","_","abhi","CADP","","_","_"
9,"pātho","_","_","pāthas","NC","","_","_"
10,"aśyām","_","_","aś","V","aś","_","_"
11,"iti","_","_","iti","CQT","","_","_"
12,"vaiṣṇavyau","_","_","vaiṣṇava","JJ","","_","_"
1,"tripadām","_","_","tripada","JJ","","_","_"
2,"anūcya","_","_","anuvac","CGDA","","_","_"
3,"catuṣpadayā","_","_","catuṣpada","JJ","","_","_"
4,"yajati","_","_","yaj","V","yaj","_","_"
1,"sapta","_","_","saptan","NUM","","_","_"
2,"padāni","_","_","pada","NC","","_","_"
3,"bhavanti","_","_","bhav","V","bhū","_","_"
4,"śiro","_","_","śiras","NC","","_","_"
5,"vā","_","_","vai","CX","","_","_"
6,"etad","_","_","tad","PRD","","_","_"
7,"yajñasya","_","_","yajña","NC","","_","_"
8,"yad","_","_","yad","PRL","","_","_"
9,"ātithyaṃ","_","_","ātithya","NC","","_","_"
10,"sapta","_","_","saptan","NUM","","_","_"
11,"vai","_","_","vai","CX","","_","_"
12,"śīrṣan","_","_","śīrṣan","NC","","_","_"
13,"prāṇāḥ","_","_","prāṇa","NC","","_","_"
14,"śīrṣann","_","_","śīrṣan","NC","","_","_"
15,"eva","_","_","eva","CEM","","_","_"
16,"tat","_","_","tad","PRD","","_","_"
17,"prāṇān","_","_","prāṇa","NC","","_","_"
18,"dadhāti","_","_","dadh","V","dhā","_","_"
1,"hotāraṃ","_","_","hotṛ","NC","","_","_"
2,"_","_","_","citra","JJ","","_","_"
3,"_","_","_","ratha","NC","","_","_"
4,"adhvarasya","_","_","adhvara","NC","","_","_"
5,"pra","_","_","pra","CADP","","_","_"
6,"_","_","_","pra","CADP","","_","_"
7,"_","_","_","ida","PRD","","_","_"
8,"agnir","_","_","agni","NC","","_","_"
9,"bharatasya","_","_","bharata","NC","","_","_"
10,"śṛṇva","_","_","śṛṇ","V","śru","_","_"
11,"iti","_","_","iti","CQT","","_","_"
12,"sviṣṭakṛtaḥ","_","_","sviṣṭakṛt","JJ","","_","_"
13,"saṃyājye","_","_","saṃyājyā","NC","","_","_"
14,"bhavata","_","_","bhav","V","bhū","_","_"
15,"ātithyavatyau","_","_","ātithyavat","JJ","","_","_"
16,"_","_","_","rūpa","NC","","_","_"
17,"_","_","_","samṛdh","PPP","","_","_"
18,"etad","_","_","tad","PRD","","_","_"
19,"vai","_","_","vai","CX","","_","_"
20,"yajñasya","_","_","yajña","NC","","_","_"
21,"samṛddhaṃ","_","_","samṛdh","PPP","","_","_"
22,"yad","_","_","yad","PRL","","_","_"
23,"_","_","_","rūpa","NC","","_","_"
24,"_","_","_","samṛdh","PPP","","_","_"
25,"yat","_","_","yad","PRL","","_","_"
26,"karma","_","_","karman","NC","","_","_"
27,"kriyamāṇam","_","_","kṛ","KDP","","_","_"
28,"ṛg","_","_","ṛc","NC","","_","_"
29,"abhivadati","_","_","abhivad","V","abhivad","_","_"
1,"triṣṭubhau","_","_","triṣṭubh","NC","","_","_"
2,"bhavataḥ","_","_","bhav","V","bhū","_","_"
3,"_","_","_","sa_saha","CX","","_","_"
4,"_","_","_","indriya","NC","","_","_"
1,"_","_","_","iḍā","NC","","_","_"
2,"_","_","_","anta","NC","","_","_"
3,"_","_","_","bhav","V","bhū","_","_"
4,"_","_","_","iḍā","NC","","_","_"
5,"_","_","_","anta","NC","","_","_"
6,"vā","_","_","vai","CX","","_","_"
7,"etena","_","_","tad","PRD","","_","_"
8,"devā","_","_","deva","NC","","_","_"
9,"arādhnuvan","_","_","rādh","V","rādh","_","_"
10,"yad","_","_","yad","PRL","","_","_"
11,"ātithyaṃ","_","_","ātithya","NC","","_","_"
12,"tasmād","_","_","tasmāt","CX","","_","_"
13,"_","_","_","iḍā","NC","","_","_"
14,"_","_","_","anta","NC","","_","_"
15,"eva","_","_","eva","CEM","","_","_"
16,"kartavyam","_","_","kṛ","KDG","","_","_"
1,"prayājān","_","_","prayāja","NC","","_","_"
2,"_","_","_","eva","CEM","","_","_"
3,"_","_","_","atra","CAD","","_","_"
4,"yajanti","_","_","yaj","V","yaj","_","_"
5,"_","_","_","na","CNG","","_","_"
6,"_","_","_","anuyāja","NC","","_","_"
1,"prāṇā","_","_","prāṇa","NC","","_","_"
2,"vai","_","_","vai","CX","","_","_"
3,"_","_","_","prayāja","NC","","_","_"
4,"_","_","_","anuyāja","NC","","_","_"
5,"te","_","_","tad","PRD","","_","_"
6,"ya","_","_","yad","PRL","","_","_"
7,"ime","_","_","ida","PRD","","_","_"
8,"śīrṣan","_","_","śīrṣan","NC","","_","_"
9,"prāṇās","_","_","prāṇa","NC","","_","_"
10,"te","_","_","tad","PRD","","_","_"
11,"prayājā","_","_","prayāja","NC","","_","_"
12,"ye","_","_","yad","PRL","","_","_"
13,"'vāñcas","_","_","avāñc","JJ","","_","_"
14,"te","_","_","tad","PRD","","_","_"
15,"'nuyājāḥ","_","_","anuyāja","NC","","_","_"
16,"sa","_","_","tad","PRD","","_","_"
17,"yo","_","_","yad","PRL","","_","_"
18,"_","_","_","atra","CAD","","_","_"
19,"_","_","_","anuyāja","NC","","_","_"
20,"yajed","_","_","yaj","V","yaj","_","_"
21,"_","_","_","yathā","CCM","","_","_"
22,"_","_","_","ida","PRD","","_","_"
23,"prāṇān","_","_","prāṇa","NC","","_","_"
24,"ālupya","_","_","ālup","CGDA","","_","_"
25,"śīrṣan","_","_","śīrṣan","NC","","_","_"
26,"dhitset","_","_","dhits","V","dhits","_","_"
27,"tādṛk","_","_","tādṛś","JJ","","_","_"
28,"tat","_","_","tad","PRD","","_","_"
1,"atiriktaṃ","_","_","atiric","PPP","","_","_"
2,"tat","_","_","tad","PRD","","_","_"
3,"sam","_","_","sa","CADP","","_","_"
4,"u","_","_","u","CEM","","_","_"
5,"vā","_","_","vai","CX","","_","_"
6,"ime","_","_","ida","PRD","","_","_"
7,"prāṇā","_","_","prāṇa","NC","","_","_"
8,"vidre","_","_","vid","V","vid","_","_"
9,"ye","_","_","yad","PRL","","_","_"
10,"_","_","_","ca","CCD","","_","_"
11,"_","_","_","ida","PRD","","_","_"
12,"ye","_","_","yad","PRL","","_","_"
13,"_","_","_","ca","CCD","","_","_"
14,"_","_","_","ida","PRD","","_","_"
1,"tad","_","_","tad","PRD","","_","_"
2,"yad","_","_","yat","CSB","","_","_"
3,"_","_","_","eva","CEM","","_","_"
4,"_","_","_","atra","CAD","","_","_"
5,"prayājān","_","_","prayāja","NC","","_","_"
6,"yajanti","_","_","yaj","V","yaj","_","_"
7,"_","_","_","na","CNG","","_","_"
8,"_","_","_","anuyāja","NC","","_","_"
9,"tatra","_","_","tatra","CAD","","_","_"
10,"sa","_","_","tad","PRD","","_","_"
11,"kāma","_","_","kāma","NC","","_","_"
12,"upāpto","_","_","upāp","PPP","","_","_"
13,"yo","_","_","yad","PRL","","_","_"
14,"'nuyājeṣu","_","_","anuyāja","NC","","_","_"
15,"yo","_","_","yad","PRL","","_","_"
16,"'nuyājeṣu","_","_","anuyāja","NC","","_","_"
