"WordID","word","NormSTEM","suffix","lemma","PoS","Root","NormSuffix","NormWord"
1,"_","_","_","kuntī","NC","","_","_"
2,"_","_","_","vak","V","vac","_","_"
1,"arjunaṃ","_","_","arjuna","NC","","_","_"
2,"keśava","_","_","keśava","NC","","_","_"
3,"_","_","_","abravīta","V","brū","_","_"
4,"_","_","_","tvat","PPR","","_","_"
5,"jāte","_","_","jan","PPP","","_","_"
6,"sma","_","_","sma","CX","","_","_"
7,"sūtake","_","_","sūtaka","NC","","_","_"
1,"upopaviṣṭā","_","_","upopaviś","PPP","","_","_"
2,"nārībhir","_","_","nārī","NC","","_","_"
3,"āśrame","_","_","āśrama","NC","","_","_"
4,"parivāritā","_","_","parivāray","PPP","","_","_"
1,"_","_","_","atha","CAD","","_","_"
2,"_","_","_","antarikṣa","NC","","_","_"
3,"vāg","_","_","vāc","NC","","_","_"
4,"āsīd","_","_","as","V","as","_","_"
5,"_","_","_","divya","JJ","","_","_"
6,"_","_","_","rūpa","NC","","_","_"
7,"manoramā","_","_","manorama","JJ","","_","_"
1,"_","_","_","sahasrākṣa","NC","","_","_"
2,"_","_","_","sama","PPX","","_","_"
3,"kunti","_","_","kuntī","NC","","_","_"
4,"_","_","_","bhav","V","bhū","_","_"
5,"_","_","_","tad","PRD","","_","_"
6,"te","_","_","tvat","PPR","","_","_"
7,"sutaḥ","_","_","suta","NC","","_","_"
1,"eṣa","_","_","tad","PRD","","_","_"
2,"jeṣyati","_","_","jay","V","ji","_","_"
3,"saṃgrāme","_","_","saṃgrāma","NC","","_","_"
4,"kurūn","_","_","kuru","NC","","_","_"
5,"sarvān","_","_","sarva","JQ","","_","_"
6,"samāgatān","_","_","samāga","PPP","","_","_"
1,"_","_","_","bhīmasa","NC","","_","_"
2,"_","_","_","dvitīya","JJ","","_","_"
3,"_","_","_","ca","CCD","","_","_"
4,"lokam","_","_","loka","NC","","_","_"
5,"udvartayiṣyati","_","_","udvartay","V","udvartay","_","_"
1,"_","_","_","putra","NC","","_","_"
2,"_","_","_","tvat","PPR","","_","_"
3,"pṛthivīṃ","_","_","pṛthivī","NC","","_","_"
4,"jetā","_","_","jay","V","ji","_","_"
5,"_","_","_","yaśas","NC","","_","_"
6,"_","_","_","ca","CCD","","_","_"
7,"_","_","_","ida","PRD","","_","_"
8,"_","_","_","diva","NC","","_","_"
9,"_","_","_","spṛśa","JJ","","_","_"
1,"hatvā","_","_","han","CGDA","","_","_"
2,"kurūn","_","_","kuru","NC","","_","_"
3,"_","_","_","grāma","NC","","_","_"
4,"_","_","_","jan","KDG","","_","_"
5,"_","_","_","vāsudeva","NC","","_","_"
6,"_","_","_","sahāyavat","JJ","","_","_"
1,"pitryam","_","_","pitrya","JJ","","_","_"
2,"aṃśaṃ","_","_","aṃśa","NC","","_","_"
3,"pranaṣṭaṃ","_","_","praṇaś","PPP","","_","_"
4,"ca","_","_","ca","CCD","","_","_"
5,"punar","_","_","punar","CAD","","_","_"
6,"_","_","_","api","CX","","_","_"
7,"_","_","_","uddhar","V","uddhṛ","_","_"
1,"bhrātṛbhiḥ","_","_","bhrātṛ","NC","","_","_"
2,"sahitaḥ","_","_","sahita","JJ","","_","_"
3,"_","_","_","śrīmat","JJ","","_","_"
4,"_","_","_","tri","NUM","","_","_"
5,"_","_","_","medha","NC","","_","_"
6,"āhariṣyati","_","_","āhar","V","āhṛ","_","_"
1,"taṃ","_","_","tad","PRD","","_","_"
2,"_","_","_","satya","JJ","","_","_"
3,"_","_","_","saṃdhā","NC","","_","_"
4,"bībhatsuṃ","_","_","bībhatsu","NC","","_","_"
5,"savyasācinam","_","_","savyasācin","NC","","_","_"
6,"acyuta","_","_","acyuta","NC","","_","_"
1,"_","_","_","yathā","CCM","","_","_"
2,"_","_","_","mat","PPR","","_","_"
3,"evaṃ","_","_","eva","CX","","_","_"
4,"jānāmi","_","_","jān","V","jñā","_","_"
5,"balavantaṃ","_","_","balavat","JJ","","_","_"
6,"durāsadam","_","_","durāsada","JJ","","_","_"
1,"tathā","_","_","tathā","CX","","_","_"
2,"tad","_","_","tad","PRD","","_","_"
3,"astu","_","_","as","V","as","_","_"
4,"dāśārha","_","_","dāśārha","NC","","_","_"
5,"yathā","_","_","yathā","CCM","","_","_"
6,"vāg","_","_","vāc","NC","","_","_"
7,"abhyabhāṣata","_","_","abhibhāṣ","V","abhibhāṣ","_","_"
1,"_","_","_","dharma","NC","","_","_"
2,"_","_","_","ced","CX","","_","_"
3,"asti","_","_","as","V","as","_","_"
4,"vārṣṇeya","_","_","vārṣṇeya","NC","","_","_"
5,"tathā","_","_","tathā","CX","","_","_"
6,"satyaṃ","_","_","satya","NC","","_","_"
7,"bhaviṣyati","_","_","bhav","V","bhū","_","_"
1,"tvaṃ","_","_","tvat","PPR","","_","_"
2,"_","_","_","ca","CCD","","_","_"
3,"_","_","_","api","CX","","_","_"
4,"tat","_","_","tad","PRD","","_","_"
5,"tathā","_","_","tathā","CX","","_","_"
6,"kṛṣṇa","_","_","kṛṣṇa","NC","","_","_"
7,"sarvaṃ","_","_","sarva","JQ","","_","_"
8,"saṃpādayiṣyasi","_","_","sampāday","V","sampāday","_","_"
1,"_","_","_","na","CNG","","_","_"
2,"_","_","_","mat","PPR","","_","_"
3,"tad","_","_","tad","PRD","","_","_"
4,"abhyasūyāmi","_","_","abhyasūy","V","abhyasūy","_","_"
5,"yathā","_","_","yathā","CCM","","_","_"
6,"vāg","_","_","vāc","NC","","_","_"
7,"abhyabhāṣata","_","_","abhibhāṣ","V","abhibhāṣ","_","_"
1,"namo","_","_","namas","NC","","_","_"
2,"dharmāya","_","_","dharma","NC","","_","_"
3,"mahate","_","_","mahat","JJ","","_","_"
4,"dharmo","_","_","dharma","NC","","_","_"
5,"dhārayati","_","_","dhar","V","dhṛ","_","_"
6,"prajāḥ","_","_","prajā","NC","","_","_"
1,"etad","_","_","tad","PRD","","_","_"
2,"dhanaṃjayo","_","_","dhanaṃjaya","NC","","_","_"
3,"vācyo","_","_","vac","KDG","","_","_"
4,"_","_","_","nitya","JJ","","_","_"
5,"_","_","_","udyuj","PPP","","_","_"
6,"vṛkodaraḥ","_","_","vṛkodara","NC","","_","_"
1,"_","_","_","yad","PRL","","_","_"
2,"_","_","_","artha","NC","","_","_"
3,"kṣatriyā","_","_","kṣatriyā","NC","","_","_"
4,"sūte","_","_","suv","V","sū","_","_"
5,"tasya","_","_","tad","PRD","","_","_"
6,"kālo","_","_","kāla","NC","","_","_"
7,"'yam","_","_","ida","PRD","","_","_"
8,"āgataḥ","_","_","āga","PPP","","_","_"
1,"na","_","_","na","CNG","","_","_"
2,"hi","_","_","hi","CX","","_","_"
3,"vairaṃ","_","_","vaira","NC","","_","_"
4,"samāsādya","_","_","samāsāday","CGDA","","_","_"
5,"sīdanti","_","_","sīd","V","sad","_","_"
6,"_","_","_","puruṣa","NC","","_","_"
7,"_","_","_","ṛṣabha","NC","","_","_"
1,"viditā","_","_","vid","PPP","","_","_"
2,"te","_","_","tvat","PPR","","_","_"
3,"sadā","_","_","sadā","CAD","","_","_"
4,"buddhir","_","_","buddhi","NC","","_","_"
5,"bhīmasya","_","_","bhīma","NC","","_","_"
6,"na","_","_","na","CNG","","_","_"
7,"sa","_","_","tad","PRD","","_","_"
8,"śāmyati","_","_","śam","V","śam","_","_"
1,"_","_","_","yāvat","CX","","_","_"
2,"_","_","_","anta","NC","","_","_"
3,"na","_","_","na","CNG","","_","_"
4,"kurute","_","_","kar","V","kṛ","_","_"
5,"śatrūṇāṃ","_","_","śatru","NC","","_","_"
6,"_","_","_","śatru","NC","","_","_"
7,"_","_","_","karśana","JJ","","_","_"
1,"_","_","_","sarva","JQ","","_","_"
2,"_","_","_","dharma","NC","","_","_"
3,"_","_","_","viśeṣa","NC","","_","_"
4,"_","_","_","jña","JJ","","_","_"
5,"snuṣāṃ","_","_","snuṣā","NC","","_","_"
6,"pāṇḍor","_","_","pāṇḍu","NC","","_","_"
7,"mahātmanaḥ","_","_","mahātman","JJ","","_","_"
1,"brūyā","_","_","abravīta","V","brū","_","_"
2,"mādhava","_","_","mādhava","NC","","_","_"
3,"kalyāṇīṃ","_","_","kalyāṇa","JJ","","_","_"
4,"kṛṣṇāṃ","_","_","kṛṣṇā","NC","","_","_"
5,"kṛṣṇa","_","_","kṛṣṇa","NC","","_","_"
6,"yaśasvinīm","_","_","yaśasvin","JJ","","_","_"
1,"yuktam","_","_","yukta","JJ","","_","_"
2,"_","_","_","tad","PRD","","_","_"
3,"_","_","_","mahābhāga","JJ","","_","_"
4,"kule","_","_","kula","NC","","_","_"
5,"jāte","_","_","jan","PPP","","_","_"
6,"yaśasvini","_","_","yaśasvin","JJ","","_","_"
1,"_","_","_","yat","CSB","","_","_"
2,"_","_","_","mat","PPR","","_","_"
3,"putreṣu","_","_","putra","NC","","_","_"
4,"sarveṣu","_","_","sarva","JQ","","_","_"
5,"yathāvat","_","_","yathāvat","CX","","_","_"
6,"tvam","_","_","tvat","PPR","","_","_"
7,"avartithāḥ","_","_","vart","V","vṛt","_","_"
1,"_","_","_","mādrī","NC","","_","_"
2,"_","_","_","putra","NC","","_","_"
3,"ca","_","_","ca","CCD","","_","_"
4,"vaktavyau","_","_","vac","KDG","","_","_"
5,"_","_","_","kṣatra","NC","","_","_"
6,"_","_","_","dharma","NC","","_","_"
7,"_","_","_","ra","PPP","","_","_"
8,"_","_","_","ubh","PPX","","_","_"
1,"_","_","_","vikrama","NC","","_","_"
2,"_","_","_","arjay","PPP","","_","_"
3,"bhogān","_","_","bhoga","NC","","_","_"
4,"vṛṇītaṃ","_","_","vṛ","V","vṛ","_","_"
5,"jīvitād","_","_","jīvita","NC","","_","_"
6,"api","_","_","api","CX","","_","_"
1,"_","_","_","vikrama","NC","","_","_"
2,"_","_","_","adhiga","PPP","","_","_"
3,"_","_","_","hi","CX","","_","_"
4,"_","_","_","artha","NC","","_","_"
5,"_","_","_","kṣatra","NC","","_","_"
6,"_","_","_","dharma","NC","","_","_"
7,"jīvataḥ","_","_","jīv","KDP","","_","_"
1,"mano","_","_","manas","NC","","_","_"
2,"manuṣyasya","_","_","manuṣya","NC","","_","_"
3,"sadā","_","_","sadā","CAD","","_","_"
4,"prīṇanti","_","_","prīṇ","V","prī","_","_"
5,"puruṣottama","_","_","puruṣottama","NC","","_","_"
1,"_","_","_","yad","PRL","","_","_"
2,"_","_","_","ca","CCD","","_","_"
3,"vaḥ","_","_","tvat","PPR","","_","_"
4,"prekṣamāṇānāṃ","_","_","prekṣ","KDP","","_","_"
5,"_","_","_","sarva","JQ","","_","_"
6,"_","_","_","dharma","NC","","_","_"
7,"_","_","_","upacāyin","JJ","","_","_"
1,"pāñcālī","_","_","pāñcālī","NC","","_","_"
2,"_","_","_","paruṣa","JJ","","_","_"
3,"_","_","_","vac","PPP","","_","_"
4,"ko","_","_","kiṃ","PRQ","","_","_"
5,"nu","_","_","nu","CX","","_","_"
6,"tat","_","_","tad","PRD","","_","_"
7,"kṣantum","_","_","kṣa","CGDI","","_","_"
8,"arhati","_","_","arh","V","arh","_","_"
1,"na","_","_","na","CNG","","_","_"
2,"_","_","_","rājya","NC","","_","_"
3,"_","_","_","haraṇa","NC","","_","_"
4,"duḥkhaṃ","_","_","duḥkha","NC","","_","_"
5,"dyūte","_","_","dyūta","NC","","_","_"
6,"_","_","_","ca","CCD","","_","_"
7,"_","_","_","api","CX","","_","_"
8,"parājayaḥ","_","_","parājaya","NC","","_","_"
1,"pravrājanaṃ","_","_","pravrājana","NC","","_","_"
2,"sutānāṃ","_","_","suta","NC","","_","_"
3,"vā","_","_","vā","CCD","","_","_"
4,"na","_","_","na","CNG","","_","_"
5,"me","_","_","mat","PPR","","_","_"
6,"tad","_","_","tad","PRD","","_","_"
7,"_","_","_","duḥkha","NC","","_","_"
8,"_","_","_","kāraṇa","NC","","_","_"
1,"yat","_","_","yat","CSB","","_","_"
2,"tu","_","_","tu","CCD","","_","_"
3,"sā","_","_","tad","PRD","","_","_"
4,"bṛhatī","_","_","bṛhat","JJ","","_","_"
5,"śyāmā","_","_","śyāma","JJ","","_","_"
6,"sabhāyāṃ","_","_","sabhā","NC","","_","_"
7,"rudatī","_","_","rud","KDP","","_","_"
8,"tadā","_","_","tadā","CAD","","_","_"
1,"aśrauṣīt","_","_","śṛṇ","V","śru","_","_"
2,"paruṣā","_","_","paruṣa","JJ","","_","_"
3,"_","_","_","vāc","NC","","_","_"
4,"_","_","_","tad","PRD","","_","_"
5,"_","_","_","mat","PPR","","_","_"
6,"duḥkhataraṃ","_","_","duḥkhatara","NC","","_","_"
7,"matam","_","_","man","PPP","","_","_"
1,"_","_","_","strī","NC","","_","_"
2,"_","_","_","dharmin","JJ","","_","_"
3,"varārohā","_","_","varāroha","JJ","","_","_"
4,"_","_","_","kṣatra","NC","","_","_"
5,"_","_","_","dharma","NC","","_","_"
6,"_","_","_","ra","PPP","","_","_"
7,"sadā","_","_","sadā","CAD","","_","_"
1,"_","_","_","na","CNG","","_","_"
2,"_","_","_","adhiga","V","adhiga","_","_"
3,"tadā","_","_","tadā","CAD","","_","_"
4,"nāthaṃ","_","_","nātha","NC","","_","_"
5,"kṛṣṇā","_","_","kṛṣṇā","NC","","_","_"
6,"nāthavatī","_","_","nāthavat","JJ","","_","_"
7,"satī","_","_","as","KDP","","_","_"
1,"taṃ","_","_","tad","PRD","","_","_"
2,"vai","_","_","vai","CX","","_","_"
3,"brūhi","_","_","abravīta","V","brū","_","_"
4,"_","_","_","mahat","JJ","","_","_"
5,"_","_","_","bāhu","NC","","_","_"
6,"_","_","_","sarva","JQ","","_","_"
7,"_","_","_","śastrabhṛt","NC","","_","_"
8,"varam","_","_","vara","JJ","","_","_"
1,"arjunaṃ","_","_","arjuna","NC","","_","_"
2,"_","_","_","puruṣa","NC","","_","_"
3,"_","_","_","vyāghra","NC","","_","_"
4,"draupadyāḥ","_","_","draupadī","NC","","_","_"
5,"padavīṃ","_","_","padavī","NC","","_","_"
6,"cara","_","_","car","V","car","_","_"
1,"viditau","_","_","vid","PPP","","_","_"
2,"hi","_","_","hi","CX","","_","_"
3,"_","_","_","tvat","PPR","","_","_"
4,"_","_","_","atyanta","CX","","_","_"
5,"_","_","_","krudh","PPP","","_","_"
6,"_","_","_","iva","CCM","","_","_"
7,"_","_","_","yama","NC","","_","_"
8,"_","_","_","antaka","NC","","_","_"
1,"_","_","_","bhīma","NC","","_","_"
2,"_","_","_","arjuna","NC","","_","_"
3,"nayetāṃ","_","_","nay","V","nī","_","_"
4,"hi","_","_","hi","CX","","_","_"
5,"devān","_","_","deva","NC","","_","_"
6,"api","_","_","api","CX","","_","_"
7,"parāṃ","_","_","para","PPX","","_","_"
8,"gatim","_","_","gati","NC","","_","_"
1,"_","_","_","tad","PRD","","_","_"
2,"_","_","_","ca","CCD","","_","_"
3,"_","_","_","tad","PRD","","_","_"
4,"avajñānaṃ","_","_","avajñāna","NC","","_","_"
5,"yat","_","_","yat","CSB","","_","_"
6,"sā","_","_","tad","PRD","","_","_"
7,"kṛṣṇā","_","_","kṛṣṇā","NC","","_","_"
8,"_","_","_","sabhā","NC","","_","_"
9,"_","_","_","ga","PPP","","_","_"
1,"_","_","_","duḥśāsana","NC","","_","_"
2,"_","_","_","ca","CCD","","_","_"
3,"yad","_","_","yat","CSB","","_","_"
4,"bhīmaṃ","_","_","bhīma","NC","","_","_"
5,"_","_","_","kaṭuka","JJ","","_","_"
6,"_","_","_","abhibhāṣ","V","abhibhāṣ","_","_"
1,"paśyatāṃ","_","_","dṛś","KDP","","_","_"
2,"_","_","_","kuru","NC","","_","_"
3,"_","_","_","vīra","NC","","_","_"
4,"_","_","_","tad","PRD","","_","_"
5,"_","_","_","ca","CCD","","_","_"
6,"saṃsmārayeḥ","_","_","saṃsmāray","V","saṃsmāray","_","_"
7,"punaḥ","_","_","punar","CAD","","_","_"
1,"pāṇḍavān","_","_","pāṇḍava","NC","","_","_"
2,"kuśalaṃ","_","_","kuśala","NC","","_","_"
3,"pṛccheḥ","_","_","pracch","V","pracch","_","_"
4,"_","_","_","sa_saha","CX","","_","_"
5,"_","_","_","putra","NC","","_","_"
6,"kṛṣṇayā","_","_","kṛṣṇā","NC","","_","_"
7,"saha","_","_","saha","CX","","_","_"
1,"māṃ","_","_","mat","PPR","","_","_"
2,"ca","_","_","ca","CCD","","_","_"
3,"kuśalinīṃ","_","_","kuśalin","JJ","","_","_"
4,"_","_","_","abravīta","V","brū","_","_"
5,"_","_","_","tad","PRD","","_","_"
6,"bhūyo","_","_","bhūyas","CX","","_","_"
7,"janārdana","_","_","janārdana","NC","","_","_"
1,"a","_","_","alpha_privativum","JJ","","_","_"
1,"ariṣṭaṃ","_","_","riṣṭa","JJ","","_","_"
2,"gaccha","_","_","ga","V","ga","_","_"
3,"panthānaṃ","_","_","pathin","NC","","_","_"
4,"_","_","_","putra","NC","","_","_"
5,"_","_","_","mat","PPR","","_","_"
6,"paripālaya","_","_","paripālay","V","paripālay","_","_"
1,"vaiśaṃpāyana","_","_","vaiśampāyana","NC","","_","_"
2,"uvāca","_","_","vak","V","vac","_","_"
1,"_","_","_","abhivāday","CGDA","","_","_"
2,"_","_","_","atha","CAD","","_","_"
3,"tāṃ","_","_","tad","PRD","","_","_"
4,"kṛṣṇaḥ","_","_","kṛṣṇa","NC","","_","_"
5,"kṛtvā","_","_","kṛ","CGDA","","_","_"
6,"_","_","_","ca","CCD","","_","_"
7,"_","_","_","abhipradakṣiṇa","CX","","_","_"
1,"niścakrāma","_","_","niṣkra","V","niṣkra","_","_"
2,"_","_","_","mahat","JJ","","_","_"
3,"_","_","_","bāhu","NC","","_","_"
4,"_","_","_","siṃha","NC","","_","_"
5,"_","_","_","khela","JJ","","_","_"
6,"_","_","_","gati","NC","","_","_"
7,"_","_","_","tatas","CX","","_","_"
1,"tato","_","_","tatas","CX","","_","_"
2,"visarjayāmāsa","_","_","visarjay","V","visarjay","_","_"
3,"_","_","_","bhīṣma","NC","","_","_"
4,"_","_","_","ādi","NC","","_","_"
5,"_","_","_","kuru","NC","","_","_"
6,"_","_","_","puṃgava","NC","","_","_"
1,"āropya","_","_","āropay","CGDA","","_","_"
2,"ca","_","_","ca","CCD","","_","_"
3,"rathe","_","_","ratha","NC","","_","_"
4,"karṇaṃ","_","_","karṇa","NC","","_","_"
5,"prāyāt","_","_","prayā","V","prayā","_","_"
6,"sātyakinā","_","_","sātyaki","NC","","_","_"
7,"saha","_","_","saha","CX","","_","_"
1,"tataḥ","_","_","tatas","CX","","_","_"
2,"prayāte","_","_","prayā","PPP","","_","_"
3,"dāśārhe","_","_","dāśārha","NC","","_","_"
4,"kuravaḥ","_","_","kuru","NC","","_","_"
5,"saṃgatā","_","_","saṃga","PPP","","_","_"
6,"mithaḥ","_","_","mithas","CX","","_","_"
1,"jajalpur","_","_","jalp","V","jalp","_","_"
2,"mahad","_","_","mahat","JJ","","_","_"
3,"āścaryaṃ","_","_","āścarya","NC","","_","_"
4,"keśave","_","_","keśava","NC","","_","_"
5,"_","_","_","parama","JJ","","_","_"
6,"_","_","_","adbhuta","JJ","","_","_"
1,"pramūḍhā","_","_","pramuh","PPP","","_","_"
2,"pṛthivī","_","_","pṛthivī","NC","","_","_"
3,"sarvā","_","_","sarva","JQ","","_","_"
4,"_","_","_","mṛtyu","NC","","_","_"
5,"_","_","_","pāśa","NC","","_","_"
6,"_","_","_","sā","PPP","","_","_"
7,"kṛtā","_","_","kṛ","PPP","","_","_"
1,"duryodhanasya","_","_","duryodhana","NC","","_","_"
2,"_","_","_","bāliśya","NC","","_","_"
3,"_","_","_","na","CNG","","_","_"
4,"_","_","_","tad","PRD","","_","_"
5,"_","_","_","as","V","as","_","_"
6,"_","_","_","iti","CQT","","_","_"
7,"_","_","_","ca","CCD","","_","_"
8,"_","_","_","abravīta","V","brū","_","_"
1,"tato","_","_","tatas","CX","","_","_"
2,"niryāya","_","_","niryā","CGDA","","_","_"
3,"nagarāt","_","_","nagara","NC","","_","_"
4,"prayayau","_","_","prayā","V","prayā","_","_"
5,"puruṣottamaḥ","_","_","puruṣottama","NC","","_","_"
1,"mantrayāmāsa","_","_","mantray","V","mantray","_","_"
2,"ca","_","_","ca","CCD","","_","_"
3,"tadā","_","_","tadā","CAD","","_","_"
4,"karṇena","_","_","karṇa","NC","","_","_"
5,"_","_","_","su","CAD","","_","_"
6,"_","_","_","cira","CX","","_","_"
7,"saha","_","_","saha","CX","","_","_"
1,"visarjayitvā","_","_","visarjay","CGDA","","_","_"
2,"rādheyaṃ","_","_","rādheya","NC","","_","_"
3,"_","_","_","sarva","JQ","","_","_"
4,"_","_","_","yādava","NC","","_","_"
5,"_","_","_","nandana","NC","","_","_"
1,"tato","_","_","tatas","CX","","_","_"
2,"javena","_","_","java","NC","","_","_"
3,"mahatā","_","_","mahat","JJ","","_","_"
4,"tūrṇam","_","_","tūrṇa","CX","","_","_"
5,"aśvān","_","_","aśva","NC","","_","_"
6,"acodayat","_","_","coday","V","coday","_","_"
1,"te","_","_","tad","PRD","","_","_"
2,"pibanta","_","_","pā","KDP","","_","_"
3,"_","_","_","iva","CCM","","_","_"
4,"_","_","_","ākāśa","NC","","_","_"
5,"dārukeṇa","_","_","dāruka","NC","","_","_"
6,"pracoditāḥ","_","_","pracoday","PPP","","_","_"
1,"hayā","_","_","haya","NC","","_","_"
2,"jagmur","_","_","ga","V","ga","_","_"
3,"_","_","_","mahat","JJ","","_","_"
4,"_","_","_","vega","NC","","_","_"
5,"_","_","_","manas","NC","","_","_"
6,"_","_","_","māruta","NC","","_","_"
7,"_","_","_","raṃhas","NC","","_","_"
1,"te","_","_","tad","PRD","","_","_"
2,"vyatītya","_","_","vyatī","CGDA","","_","_"
3,"tam","_","_","tad","PRD","","_","_"
4,"adhvānaṃ","_","_","adhvan","NC","","_","_"
5,"kṣipraṃ","_","_","kṣipra","CX","","_","_"
6,"śyenā","_","_","śya","NC","","_","_"
7,"_","_","_","iva","CCM","","_","_"
8,"_","_","_","āśu","JJ","","_","_"
9,"_","_","_","ga","JJ","","_","_"
1,"uccaiḥ","_","_","uccais","CX","","_","_"
2,"sūryam","_","_","sūrya","NC","","_","_"
3,"upaplavyaṃ","_","_","upaplavya","NC","","_","_"
4,"śārṅgadhanvānam","_","_","śārṅgadhanvan","NC","","_","_"
5,"āvahan","_","_","āvah","V","āvah","_","_"
