"WordID","word","NormSTEM","suffix","lemma","PoS","Root","NormSuffix","NormWord"
1,"vaiśaṃpāyana","_","_","vaiśampāyana","NC","","_","_"
2,"uvāca","_","_","vak","V","vac","_","_"
1,"kīcakasya","_","_","kīcaka","NC","","_","_"
2,"tu","_","_","tu","CCD","","_","_"
3,"ghātena","_","_","ghāta","NC","","_","_"
4,"_","_","_","sa_saha","CX","","_","_"
5,"_","_","_","anuja","NC","","_","_"
6,"viśāṃ","_","_","viś","NC","","_","_"
7,"pate","_","_","pati","NC","","_","_"
1,"atyāhitaṃ","_","_","atyāhita","NC","","_","_"
2,"cintayitvā","_","_","cintay","CGDA","","_","_"
3,"vyasmayanta","_","_","vismi","V","vismi","_","_"
4,"pṛthagjanāḥ","_","_","pṛthagjana","NC","","_","_"
1,"tasmin","_","_","tad","PRD","","_","_"
2,"pure","_","_","pura","NC","","_","_"
3,"janapade","_","_","janapada","NC","","_","_"
4,"saṃjalpo","_","_","saṃjalpa","NC","","_","_"
5,"_","_","_","bhav","V","bhū","_","_"
6,"_","_","_","ca","CCD","","_","_"
7,"sarvaśaḥ","_","_","sarvaśas","CX","","_","_"
1,"_","_","_","śaurya","NC","","_","_"
2,"_","_","_","hi","CX","","_","_"
3,"vallabho","_","_","vallabha","JJ","","_","_"
4,"rājño","_","_","rājan","NC","","_","_"
5,"_","_","_","mahat","JJ","","_","_"
6,"_","_","_","sattva","NC","","_","_"
7,"_","_","_","ca","CCD","","_","_"
8,"kīcakaḥ","_","_","kīcaka","NC","","_","_"
1,"āsīt","_","_","as","V","as","_","_"
2,"prahartā","_","_","prahartṛ","NC","","_","_"
3,"ca","_","_","ca","CCD","","_","_"
4,"nṛṇāṃ","_","_","nṛ","NC","","_","_"
5,"_","_","_","dāra","NC","","_","_"
6,"_","_","_","āmarśin","JJ","","_","_"
7,"ca","_","_","ca","CCD","","_","_"
8,"durmatiḥ","_","_","durmati","JJ","","_","_"
1,"sa","_","_","tad","PRD","","_","_"
2,"hataḥ","_","_","han","PPP","","_","_"
3,"khalu","_","_","khalu","CX","","_","_"
4,"_","_","_","pāpa","JJ","","_","_"
5,"_","_","_","ātman","NC","","_","_"
6,"gandharvair","_","_","gandharva","NC","","_","_"
7,"_","_","_","duṣṭa","JJ","","_","_"
8,"_","_","_","pūruṣa","NC","","_","_"
1,"_","_","_","iti","CQT","","_","_"
2,"_","_","_","jalp","V","jalp","_","_"
3,"_","_","_","mahat","JJ","","_","_"
4,"_","_","_","rāja","NC","","_","_"
5,"_","_","_","para","PPX","","_","_"
6,"_","_","_","anīka","NC","","_","_"
7,"_","_","_","viśātana","JJ","","_","_"
1,"deśe","_","_","deśa","NC","","_","_"
2,"deśe","_","_","deśa","NC","","_","_"
3,"_","_","_","manuṣya","NC","","_","_"
4,"_","_","_","ca","CCD","","_","_"
5,"kīcakaṃ","_","_","kīcaka","NC","","_","_"
6,"duṣpradharṣaṇam","_","_","duṣpradharṣaṇa","JJ","","_","_"
1,"atha","_","_","atha","CAD","","_","_"
2,"vai","_","_","vai","CX","","_","_"
3,"dhārtarāṣṭreṇa","_","_","dhārtarāṣṭra","NC","","_","_"
4,"prayuktā","_","_","prayuj","PPP","","_","_"
5,"ye","_","_","yad","PRL","","_","_"
6,"bahiścarāḥ","_","_","bahiścara","JJ","","_","_"
1,"mṛgayitvā","_","_","mṛgay","CGDA","","_","_"
2,"bahūn","_","_","bahu","JJ","","_","_"
3,"grāmān","_","_","grāma","NC","","_","_"
4,"rāṣṭrāṇi","_","_","rāṣṭra","NC","","_","_"
5,"nagarāṇi","_","_","nagara","NC","","_","_"
6,"ca","_","_","ca","CCD","","_","_"
1,"saṃvidhāya","_","_","saṃvidhā","CGDA","","_","_"
2,"yathādiṣṭaṃ","_","_","yathādiṣṭa","JJ","","_","_"
3,"_","_","_","yathā","CCM","","_","_"
4,"_","_","_","deśa","NC","","_","_"
5,"_","_","_","pradarśana","NC","","_","_"
1,"_","_","_","kṛ","PPP","","_","_"
2,"_","_","_","cintā","NC","","_","_"
3,"nyavartanta","_","_","nivart","V","nivṛt","_","_"
4,"te","_","_","tad","PRD","","_","_"
5,"ca","_","_","ca","CCD","","_","_"
6,"nāgapuraṃ","_","_","nāgapura","NC","","_","_"
7,"prati","_","_","prati","CADP","","_","_"
1,"tatra","_","_","tatra","CAD","","_","_"
2,"dṛṣṭvā","_","_","dṛś","CGDA","","_","_"
3,"tu","_","_","tu","CCD","","_","_"
4,"rājānaṃ","_","_","rājan","NC","","_","_"
5,"kauravyaṃ","_","_","kauravya","NC","","_","_"
6,"_","_","_","dhṛtarāṣṭra","NC","","_","_"
7,"_","_","_","ja","JJ","","_","_"
1,"_","_","_","droṇa","NC","","_","_"
2,"_","_","_","karṇa","NC","","_","_"
3,"_","_","_","kṛpa","NC","","_","_"
4,"sārdhaṃ","_","_","sārdha","CX","","_","_"
5,"bhīṣmeṇa","_","_","bhīṣma","NC","","_","_"
6,"ca","_","_","ca","CCD","","_","_"
7,"mahātmanā","_","_","mahātman","JJ","","_","_"
1,"saṃgataṃ","_","_","saṃga","PPP","","_","_"
2,"_","_","_","bhrātṛ","NC","","_","_"
3,"_","_","_","ca","CCD","","_","_"
4,"_","_","_","api","CX","","_","_"
5,"_","_","_","trigarta","NC","","_","_"
6,"_","_","_","ca","CCD","","_","_"
7,"_","_","_","mahat","JJ","","_","_"
8,"_","_","_","ratha","NC","","_","_"
1,"duryodhanaṃ","_","_","duryodhana","NC","","_","_"
2,"_","_","_","sabhā","NC","","_","_"
3,"_","_","_","madhya","NC","","_","_"
4,"āsīnam","_","_","ās","PPP","","_","_"
5,"idam","_","_","ida","PRD","","_","_"
6,"abruvan","_","_","abravīta","V","brū","_","_"
1,"kṛto","_","_","kṛ","PPP","","_","_"
2,"'smābhiḥ","_","_","mat","PPR","","_","_"
3,"paro","_","_","para","PPX","","_","_"
4,"_","_","_","yatna","NC","","_","_"
5,"_","_","_","tad","PRD","","_","_"
6,"anveṣaṇe","_","_","anveṣaṇa","NC","","_","_"
7,"sadā","_","_","sadā","CAD","","_","_"
1,"pāṇḍavānāṃ","_","_","pāṇḍava","NC","","_","_"
2,"_","_","_","manuṣya","NC","","_","_"
3,"_","_","_","indra","NC","","_","_"
4,"_","_","_","tad","PRD","","_","_"
5,"_","_","_","mahat","JJ","","_","_"
6,"kānane","_","_","kānana","NC","","_","_"
1,"nirjane","_","_","nirjana","JJ","","_","_"
2,"_","_","_","mṛga","NC","","_","_"
3,"_","_","_","saṃkṛ","PPP","","_","_"
4,"_","_","_","nānā","CX","","_","_"
5,"_","_","_","druma","NC","","_","_"
6,"_","_","_","latā","NC","","_","_"
7,"_","_","_","āvṛ","PPP","","_","_"
1,"_","_","_","latā","NC","","_","_"
2,"_","_","_","pratāna","NC","","_","_"
3,"_","_","_","bahula","JJ","","_","_"
4,"_","_","_","nānā","CX","","_","_"
5,"_","_","_","gulma","NC","","_","_"
6,"_","_","_","samāvṛ","PPP","","_","_"
1,"na","_","_","na","CNG","","_","_"
2,"ca","_","_","ca","CCD","","_","_"
3,"vidmo","_","_","vid","V","vid","_","_"
4,"gatā","_","_","ga","PPP","","_","_"
5,"yena","_","_","yad","PRL","","_","_"
6,"pārthāḥ","_","_","pārtha","NC","","_","_"
7,"syur","_","_","as","V","as","_","_"
8,"_","_","_","dṛḍha","JJ","","_","_"
9,"_","_","_","vikrama","NC","","_","_"
1,"mārgamāṇāḥ","_","_","mārg","KDP","","_","_"
2,"_","_","_","pada","NC","","_","_"
3,"_","_","_","nyāsa","NC","","_","_"
4,"teṣu","_","_","tad","PRD","","_","_"
5,"teṣu","_","_","tad","PRD","","_","_"
6,"tathā","_","_","tathā","CX","","_","_"
7,"tathā","_","_","tathā","CX","","_","_"
1,"_","_","_","giri","NC","","_","_"
2,"_","_","_","kūṭa","NC","","_","_"
3,"tuṅgeṣu","_","_","tuṅga","NC","","_","_"
4,"_","_","_","nānā","CX","","_","_"
5,"_","_","_","janapada","NC","","_","_"
6,"ca","_","_","ca","CCD","","_","_"
1,"_","_","_","jana","NC","","_","_"
2,"_","_","_","ākṛ","PPP","","_","_"
3,"deśeṣu","_","_","deśa","NC","","_","_"
4,"kharvaṭeṣu","_","_","kharvaṭa","NC","","_","_"
5,"pureṣu","_","_","pura","NC","","_","_"
6,"ca","_","_","ca","CCD","","_","_"
1,"narendra","_","_","narendra","NC","","_","_"
2,"bahuśo","_","_","bahuśas","CX","","_","_"
3,"'nviṣṭā","_","_","anviṣ","PPP","","_","_"
4,"_","_","_","na","CNG","","_","_"
5,"_","_","_","eva","CEM","","_","_"
6,"_","_","_","vid","V","vid","_","_"
7,"_","_","_","ca","CCD","","_","_"
8,"pāṇḍavān","_","_","pāṇḍava","NC","","_","_"
1,"_","_","_","atyanta","JJ","","_","_"
2,"_","_","_","bhāva","NC","","_","_"
3,"_","_","_","naś","PPP","","_","_"
4,"_","_","_","tad","PRD","","_","_"
5,"bhadraṃ","_","_","bhadra","NC","","_","_"
6,"tubhyaṃ","_","_","tvat","PPR","","_","_"
7,"_","_","_","nara","NC","","_","_"
8,"_","_","_","ṛṣabha","NC","","_","_"
1,"_","_","_","vartman","NC","","_","_"
2,"_","_","_","anviṣ","KDP","","_","_"
3,"_","_","_","tu","CCD","","_","_"
4,"rathānāṃ","_","_","ratha","NC","","_","_"
5,"_","_","_","ratha","NC","","_","_"
6,"_","_","_","sattama","JJ","","_","_"
1,"kaṃcit","_","_","kiṃcit","PRI","","_","_"
2,"kālaṃ","_","_","kāla","NC","","_","_"
3,"_","_","_","manuṣya","NC","","_","_"
4,"_","_","_","indra","NC","","_","_"
5,"sūtānām","_","_","sūta","NC","","_","_"
6,"anugā","_","_","anuga","JJ","","_","_"
7,"vayam","_","_","mat","PPR","","_","_"
1,"mṛgayitvā","_","_","mṛgay","CGDA","","_","_"
2,"yathānyāyaṃ","_","_","yathānyāya","CX","","_","_"
3,"_","_","_","vid","PPP","","_","_"
4,"_","_","_","artha","NC","","_","_"
5,"sma","_","_","sma","CX","","_","_"
6,"tattvataḥ","_","_","tattva","NC","","_","_"
1,"prāptā","_","_","prāp","PPP","","_","_"
2,"dvāravatīṃ","_","_","dvāravatī","NC","","_","_"
3,"sūtā","_","_","sūta","NC","","_","_"
4,"ṛte","_","_","ṛte","CX","","_","_"
5,"pārthaiḥ","_","_","pārtha","NC","","_","_"
6,"paraṃtapa","_","_","paraṃtapa","JJ","","_","_"
1,"na","_","_","na","CNG","","_","_"
2,"tatra","_","_","tatra","CAD","","_","_"
3,"pāṇḍavā","_","_","pāṇḍava","NC","","_","_"
4,"_","_","_","rājan","NC","","_","_"
5,"_","_","_","na","CNG","","_","_"
6,"_","_","_","api","CX","","_","_"
7,"kṛṣṇā","_","_","kṛṣṇā","NC","","_","_"
8,"pativratā","_","_","pativratā","NC","","_","_"
1,"sarvathā","_","_","sarvathā","CX","","_","_"
2,"_","_","_","vipraṇaś","PPP","","_","_"
3,"_","_","_","tad","PRD","","_","_"
4,"_","_","_","namas","NC","","_","_"
5,"_","_","_","tvat","PPR","","_","_"
6,"_","_","_","bharata","NC","","_","_"
7,"_","_","_","ṛṣabha","NC","","_","_"
1,"na","_","_","na","CNG","","_","_"
2,"hi","_","_","hi","CX","","_","_"
3,"vidmo","_","_","vid","V","vid","_","_"
4,"gatiṃ","_","_","gati","NC","","_","_"
5,"teṣāṃ","_","_","tad","PRD","","_","_"
6,"vāsaṃ","_","_","vāsa","NC","","_","_"
7,"_","_","_","vā","CCD","","_","_"
8,"_","_","_","api","CX","","_","_"
9,"mahātmanām","_","_","mahātman","JJ","","_","_"
1,"pāṇḍavānāṃ","_","_","pāṇḍava","NC","","_","_"
2,"pravṛttiṃ","_","_","pravṛtti","NC","","_","_"
3,"vā","_","_","vā","CCD","","_","_"
4,"vidmaḥ","_","_","vid","V","vid","_","_"
5,"_","_","_","karman","NC","","_","_"
6,"_","_","_","api","CX","","_","_"
7,"vā","_","_","vā","CCD","","_","_"
8,"kṛtam","_","_","kṛ","PPP","","_","_"
1,"sa","_","_","tad","PRD","","_","_"
2,"naḥ","_","_","mat","PPR","","_","_"
3,"śādhi","_","_","śās","V","śās","_","_"
4,"_","_","_","manuṣya","NC","","_","_"
5,"_","_","_","indra","NC","","_","_"
6,"ata","_","_","atas","CX","","_","_"
7,"ūrdhvaṃ","_","_","ūrdhva","CX","","_","_"
8,"viśāṃ","_","_","viś","NC","","_","_"
9,"pate","_","_","pati","NC","","_","_"
1,"anveṣaṇe","_","_","anveṣaṇa","NC","","_","_"
2,"pāṇḍavānāṃ","_","_","pāṇḍava","NC","","_","_"
3,"bhūyaḥ","_","_","bhūyas","CX","","_","_"
4,"kiṃ","_","_","kiṃ","PRQ","","_","_"
5,"karavāmahe","_","_","kar","V","kṛ","_","_"
1,"imāṃ","_","_","ida","PRD","","_","_"
2,"ca","_","_","ca","CCD","","_","_"
3,"naḥ","_","_","mat","PPR","","_","_"
4,"priyām","_","_","priya","JJ","","_","_"
5,"īkṣa","_","_","vāc","NC","","_","_"
6,"vācaṃ","_","_","bhadravat","JJ","","_","_"
7,"bhadravatīṃ","_","_","śubha","JJ","","_","_"
1,"yena","_","_","yad","PRL","","_","_"
2,"trigartā","_","_","trigarta","NC","","_","_"
3,"nikṛtā","_","_","nikṛ","PPP","","_","_"
4,"balena","_","_","bala","NC","","_","_"
5,"mahatā","_","_","mahat","JJ","","_","_"
6,"nṛpa","_","_","nṛpa","NC","","_","_"
1,"sūtena","_","_","sūta","NC","","_","_"
2,"rājño","_","_","rājan","NC","","_","_"
3,"matsyasya","_","_","matsya","NC","","_","_"
4,"kīcakena","_","_","kīcaka","NC","","_","_"
5,"mahātmanā","_","_","mahātman","JJ","","_","_"
1,"sa","_","_","tad","PRD","","_","_"
2,"hataḥ","_","_","han","PPP","","_","_"
3,"patitaḥ","_","_","pat","PPP","","_","_"
4,"śete","_","_","śī","V","śī","_","_"
5,"gandharvair","_","_","gandharva","NC","","_","_"
6,"niśi","_","_","niś","NC","","_","_"
7,"bhārata","_","_","bhārata","NC","","_","_"
1,"adṛśyamānair","_","_","adṛśyamāna","JJ","","_","_"
2,"_","_","_","duṣṭa","JJ","","_","_"
3,"_","_","_","ātman","NC","","_","_"
4,"saha","_","_","saha","CX","","_","_"
5,"bhrātṛbhir","_","_","bhrātṛ","NC","","_","_"
6,"acyuta","_","_","acyuta","JJ","","_","_"
1,"priyam","_","_","priya","JJ","","_","_"
2,"etad","_","_","tad","PRD","","_","_"
3,"upaśrutya","_","_","upaśru","CGDA","","_","_"
4,"śatrūṇāṃ","_","_","śatru","NC","","_","_"
5,"tu","_","_","tu","CCD","","_","_"
6,"parābhavam","_","_","parābhava","NC","","_","_"
1,"_","_","_","kṛtakṛtya","JJ","","_","_"
2,"_","_","_","ca","CCD","","_","_"
3,"kauravya","_","_","kauravya","NC","","_","_"
4,"vidhatsva","_","_","vidadh","V","vidhā","_","_"
5,"yad","_","_","yad","PRL","","_","_"
6,"anantaram","_","_","anantara","JJ","","_","_"
