"WordID","word","NormSTEM","suffix","lemma","PoS","Root","NormSuffix","NormWord"
1,"vaiśaṃpāyana","_","_","vaiśampāyana","NC","","_","_"
2,"uvāca","_","_","vak","V","vac","_","_"
1,"tata","_","_","tatas","CX","","_","_"
2,"āhūya","_","_","āhvā","CGDA","","_","_"
3,"pāñcālyo","_","_","pāñcālya","JJ","","_","_"
4,"_","_","_","rājan","NC","","_","_"
5,"_","_","_","putra","NC","","_","_"
6,"yudhiṣṭhiram","_","_","yudhiṣṭhira","NC","","_","_"
1,"parigraheṇa","_","_","parigraha","NC","","_","_"
2,"brāhmeṇa","_","_","brāhma","JJ","","_","_"
3,"parigṛhya","_","_","parigrah","CGDA","","_","_"
4,"_","_","_","mahat","JJ","","_","_"
5,"_","_","_","dyuti","NC","","_","_"
1,"paryapṛcchad","_","_","paripracch","V","paripracch","_","_"
2,"_","_","_","adīna","JJ","","_","_"
3,"_","_","_","ātman","NC","","_","_"
4,"_","_","_","kuntī","NC","","_","_"
5,"_","_","_","putra","NC","","_","_"
6,"suvarcasam","_","_","suvarcas","JJ","","_","_"
1,"kathaṃ","_","_","katha","CX","","_","_"
2,"jānīma","_","_","jān","V","jñā","_","_"
3,"bhavataḥ","_","_","bhavat","JJ","","_","_"
4,"kṣatriyān","_","_","kṣatriya","NC","","_","_"
5,"brāhmaṇān","_","_","brāhmaṇa","NC","","_","_"
6,"uta","_","_","uta","CCD","","_","_"
1,"vaiśyān","_","_","vaiśya","NC","","_","_"
2,"vā","_","_","vā","CCD","","_","_"
3,"_","_","_","guṇa","NC","","_","_"
4,"_","_","_","sampad","PPP","","_","_"
5,"uta","_","_","uta","CCD","","_","_"
6,"vā","_","_","vā","CCD","","_","_"
7,"_","_","_","śūdra","NC","","_","_"
8,"_","_","_","yoni","NC","","_","_"
9,"_","_","_","ja","JJ","","_","_"
1,"māyām","_","_","māyā","NC","","_","_"
2,"āsthāya","_","_","āsthā","CGDA","","_","_"
3,"vā","_","_","vā","CCD","","_","_"
4,"_","_","_","siddha","NC","","_","_"
5,"_","_","_","car","KDP","","_","_"
6,"sarvatodiśam","_","_","sarvatodiśa","CX","","_","_"
1,"_","_","_","kṛṣṇā","NC","","_","_"
2,"_","_","_","hetu","NC","","_","_"
3,"anuprāptān","_","_","anuprāp","PPP","","_","_"
4,"divaḥ","_","_","div","NC","","_","_"
5,"_","_","_","saṃdarśana","NC","","_","_"
6,"_","_","_","arthin","JJ","","_","_"
1,"bravītu","_","_","abravīta","V","brū","_","_"
2,"no","_","_","mat","PPR","","_","_"
3,"bhavān","_","_","bhavat","JJ","","_","_"
4,"satyaṃ","_","_","satya","JJ","","_","_"
5,"saṃdeho","_","_","saṃdeha","NC","","_","_"
6,"_","_","_","hi","CX","","_","_"
7,"_","_","_","atra","CAD","","_","_"
8,"no","_","_","mat","PPR","","_","_"
9,"mahān","_","_","mahat","JJ","","_","_"
1,"api","_","_","api","CX","","_","_"
2,"naḥ","_","_","mat","PPR","","_","_"
3,"_","_","_","saṃśaya","NC","","_","_"
4,"_","_","_","anta","NC","","_","_"
5,"_","_","_","manas","NC","","_","_"
6,"_","_","_","tuṣṭi","NC","","_","_"
7,"_","_","_","iha","CAD","","_","_"
8,"_","_","_","āviś","V","āviś","_","_"
1,"api","_","_","api","CX","","_","_"
2,"no","_","_","mat","PPR","","_","_"
3,"bhāgadheyāni","_","_","bhāgadheya","NC","","_","_"
4,"śubhāni","_","_","śubha","JJ","","_","_"
5,"syuḥ","_","_","as","V","as","_","_"
6,"paraṃtapa","_","_","paraṃtapa","JJ","","_","_"
1,"kāmayā","_","_","kāmayā","CX","","_","_"
2,"brūhi","_","_","abravīta","V","brū","_","_"
3,"satyaṃ","_","_","satya","NC","","_","_"
4,"tvaṃ","_","_","tvat","PPR","","_","_"
5,"satyaṃ","_","_","satya","NC","","_","_"
6,"rājasu","_","_","rājan","NC","","_","_"
7,"śobhate","_","_","śubh","V","śubh","_","_"
1,"iṣṭāpūrtena","_","_","iṣṭāpūrta","NC","","_","_"
2,"ca","_","_","ca","CCD","","_","_"
3,"tathā","_","_","tathā","CX","","_","_"
4,"vaktavyam","_","_","vac","KDG","","_","_"
5,"anṛtaṃ","_","_","anṛta","NC","","_","_"
6,"na","_","_","na","CNG","","_","_"
7,"tu","_","_","tu","CCD","","_","_"
1,"śrutvā","_","_","śru","CGDA","","_","_"
2,"_","_","_","hi","CX","","_","_"
3,"_","_","_","amara","NC","","_","_"
4,"_","_","_","saṃkāśa","NC","","_","_"
5,"tava","_","_","tvat","PPR","","_","_"
6,"vākyam","_","_","vākya","NC","","_","_"
7,"ariṃdama","_","_","ariṃdama","JJ","","_","_"
1,"dhruvaṃ","_","_","dhruva","CX","","_","_"
2,"_","_","_","vivāha","NC","","_","_"
3,"_","_","_","karaṇa","NC","","_","_"
4,"āsthāsyāmi","_","_","ātiṣṭh","V","āsthā","_","_"
5,"vidhānataḥ","_","_","vidhāna","NC","","_","_"
1,"yudhiṣṭhira","_","_","yudhiṣṭhira","NC","","_","_"
2,"uvāca","_","_","vak","V","vac","_","_"
1,"mā","_","_","mā","CNG","","_","_"
2,"rājan","_","_","rājan","NC","","_","_"
3,"vimanā","_","_","vimanas","JJ","","_","_"
4,"_","_","_","bhav","V","bhū","_","_"
5,"_","_","_","tvat","PPR","","_","_"
6,"pāñcālya","_","_","pāñcālya","JJ","","_","_"
7,"prītir","_","_","prīti","NC","","_","_"
8,"astu","_","_","as","V","as","_","_"
9,"te","_","_","tvat","PPR","","_","_"
1,"_","_","_","īpsay","PPP","","_","_"
2,"_","_","_","tvat","PPR","","_","_"
3,"dhruvaḥ","_","_","dhruva","JJ","","_","_"
4,"kāmaḥ","_","_","kāma","NC","","_","_"
5,"saṃvṛtto","_","_","saṃvṛt","PPP","","_","_"
6,"'yam","_","_","ida","PRD","","_","_"
7,"asaṃśayam","_","_","asaṃśaya","NC","","_","_"
1,"vayaṃ","_","_","mat","PPR","","_","_"
2,"hi","_","_","hi","CX","","_","_"
3,"kṣatriyā","_","_","kṣatriya","NC","","_","_"
4,"rājan","_","_","rājan","NC","","_","_"
5,"pāṇḍoḥ","_","_","pāṇḍu","NC","","_","_"
6,"putrā","_","_","putra","NC","","_","_"
7,"mahātmanaḥ","_","_","mahātman","JJ","","_","_"
1,"jyeṣṭhaṃ","_","_","jyeṣṭha","JJ","","_","_"
2,"māṃ","_","_","mat","PPR","","_","_"
3,"viddhi","_","_","vid","V","vid","_","_"
4,"kaunteyaṃ","_","_","kaunteya","NC","","_","_"
5,"_","_","_","bhīmasa","NC","","_","_"
6,"_","_","_","arjuna","NC","","_","_"
7,"_","_","_","ida","PRD","","_","_"
1,"yābhyāṃ","_","_","yad","PRL","","_","_"
2,"tava","_","_","tvat","PPR","","_","_"
3,"sutā","_","_","sutā","NC","","_","_"
4,"rājan","_","_","rājan","NC","","_","_"
5,"nirjitā","_","_","nirji","PPP","","_","_"
6,"_","_","_","rājan","NC","","_","_"
7,"_","_","_","saṃsad","NC","","_","_"
1,"yamau","_","_","yama","NC","","_","_"
2,"tu","_","_","tu","CCD","","_","_"
3,"tatra","_","_","tatra","CAD","","_","_"
4,"_","_","_","rājan","NC","","_","_"
5,"_","_","_","indra","NC","","_","_"
6,"yatra","_","_","yatra","CX","","_","_"
7,"kṛṣṇā","_","_","kṛṣṇā","NC","","_","_"
8,"pratiṣṭhitā","_","_","pratiṣṭhā","PPP","","_","_"
1,"vyetu","_","_","vye","V","vī","_","_"
2,"te","_","_","tvat","PPR","","_","_"
3,"mānasaṃ","_","_","mānasa","JJ","","_","_"
4,"duḥkhaṃ","_","_","duḥkha","NC","","_","_"
5,"kṣatriyāḥ","_","_","kṣatriya","NC","","_","_"
6,"smo","_","_","as","V","as","_","_"
7,"_","_","_","nara","NC","","_","_"
8,"_","_","_","ṛṣabha","NC","","_","_"
1,"_","_","_","padminī","NC","","_","_"
2,"_","_","_","iva","CCM","","_","_"
3,"_","_","_","sutā","NC","","_","_"
4,"_","_","_","ida","PRD","","_","_"
5,"te","_","_","tvat","PPR","","_","_"
6,"hradād","_","_","hrada","NC","","_","_"
7,"anyaṃ","_","_","anya","PPX","","_","_"
8,"hradaṃ","_","_","hrada","NC","","_","_"
9,"gatā","_","_","ga","PPP","","_","_"
1,"iti","_","_","iti","CQT","","_","_"
2,"tathyaṃ","_","_","tathya","JJ","","_","_"
3,"_","_","_","mahat","JJ","","_","_"
4,"_","_","_","rāja","NC","","_","_"
5,"sarvam","_","_","sarva","JQ","","_","_"
6,"etad","_","_","tad","PRD","","_","_"
7,"bravīmi","_","_","abravīta","V","brū","_","_"
8,"te","_","_","tvat","PPR","","_","_"
1,"bhavān","_","_","bhavat","JJ","","_","_"
2,"hi","_","_","hi","CX","","_","_"
3,"gurur","_","_","guru","NC","","_","_"
4,"asmākaṃ","_","_","mat","PPR","","_","_"
5,"paramaṃ","_","_","parama","JJ","","_","_"
6,"ca","_","_","ca","CCD","","_","_"
7,"parāyaṇam","_","_","parāyaṇa","NC","","_","_"
1,"vaiśaṃpāyana","_","_","vaiśampāyana","NC","","_","_"
2,"uvāca","_","_","vak","V","vac","_","_"
1,"tataḥ","_","_","tatas","CX","","_","_"
2,"sa","_","_","tad","PRD","","_","_"
3,"drupado","_","_","drupada","NC","","_","_"
4,"rājā","_","_","rājan","NC","","_","_"
5,"_","_","_","harṣa","NC","","_","_"
6,"_","_","_","vyākula","JJ","","_","_"
7,"_","_","_","locana","NC","","_","_"
1,"prativaktuṃ","_","_","prativac","CGDI","","_","_"
2,"tadā","_","_","tadā","CAD","","_","_"
3,"yuktaṃ","_","_","yuj","PPP","","_","_"
4,"_","_","_","na","CNG","","_","_"
5,"_","_","_","śakn","V","śak","_","_"
6,"taṃ","_","_","tad","PRD","","_","_"
7,"yudhiṣṭhiram","_","_","yudhiṣṭhira","NC","","_","_"
1,"yatnena","_","_","yatna","NC","","_","_"
2,"tu","_","_","tu","CCD","","_","_"
3,"sa","_","_","tad","PRD","","_","_"
4,"taṃ","_","_","tad","PRD","","_","_"
5,"harṣaṃ","_","_","harṣa","NC","","_","_"
6,"saṃnigṛhya","_","_","saṃnigrah","CGDA","","_","_"
7,"paraṃtapaḥ","_","_","paraṃtapa","JJ","","_","_"
1,"anurūpaṃ","_","_","anurūpa","JJ","","_","_"
2,"tato","_","_","tatas","CX","","_","_"
3,"rājā","_","_","rājan","NC","","_","_"
4,"pratyuvāca","_","_","prativak","V","prativac","_","_"
5,"yudhiṣṭhiram","_","_","yudhiṣṭhira","NC","","_","_"
1,"papraccha","_","_","pṛcch","V","prach","_","_"
2,"_","_","_","ca","CCD","","_","_"
3,"_","_","_","a","PRD","","_","_"
4,"_","_","_","dharma","NC","","_","_"
5,"_","_","_","ātman","NC","","_","_"
6,"yathā","_","_","yathā","CCM","","_","_"
7,"te","_","_","tad","PRD","","_","_"
8,"pradrutāḥ","_","_","pradru","PPP","","_","_"
9,"purā","_","_","purā","CX","","_","_"
1,"sa","_","_","tad","PRD","","_","_"
2,"tasmai","_","_","tad","PRD","","_","_"
3,"sarvam","_","_","sarva","JQ","","_","_"
4,"_","_","_","ākhyā","V","ākhyā","_","_"
5,"_","_","_","ānupūrvya","NC","","_","_"
6,"pāṇḍavaḥ","_","_","pāṇḍava","NC","","_","_"
1,"_","_","_","tad","PRD","","_","_"
2,"_","_","_","śru","CGDA","","_","_"
3,"drupado","_","_","drupada","NC","","_","_"
4,"rājā","_","_","rājan","NC","","_","_"
5,"_","_","_","kuntī","NC","","_","_"
6,"_","_","_","putra","NC","","_","_"
7,"bhāṣitam","_","_","bhāṣita","NC","","_","_"
1,"vigarhayāmāsa","_","_","vigarhay","V","vigarhay","_","_"
2,"tadā","_","_","tadā","CAD","","_","_"
3,"dhṛtarāṣṭraṃ","_","_","dhṛtarāṣṭra","NC","","_","_"
4,"janeśvaram","_","_","janeśvara","NC","","_","_"
1,"āśvāsayāmāsa","_","_","āśvas","V","āśvas","_","_"
2,"ca","_","_","ca","CCD","","_","_"
3,"taṃ","_","_","tad","PRD","","_","_"
4,"_","_","_","kuntī","NC","","_","_"
5,"_","_","_","putra","NC","","_","_"
6,"yudhiṣṭhiram","_","_","yudhiṣṭhira","NC","","_","_"
1,"pratijajñe","_","_","pratijān","V","pratijñā","_","_"
2,"ca","_","_","ca","CCD","","_","_"
3,"rājyāya","_","_","rājya","NC","","_","_"
4,"drupado","_","_","drupada","NC","","_","_"
5,"vadatāṃ","_","_","vad","KDP","","_","_"
6,"varaḥ","_","_","vara","JJ","","_","_"
1,"tataḥ","_","_","tatas","CX","","_","_"
2,"kuntī","_","_","kuntī","NC","","_","_"
3,"ca","_","_","ca","CCD","","_","_"
4,"kṛṣṇā","_","_","kṛṣṇā","NC","","_","_"
5,"ca","_","_","ca","CCD","","_","_"
6,"_","_","_","bhīmasa","NC","","_","_"
7,"_","_","_","arjuna","NC","","_","_"
8,"_","_","_","api","CX","","_","_"
1,"yamau","_","_","yama","NC","","_","_"
2,"ca","_","_","ca","CCD","","_","_"
3,"rājñā","_","_","rājan","NC","","_","_"
4,"saṃdiṣṭau","_","_","saṃdiś","PPP","","_","_"
5,"viviśur","_","_","viś","V","viś","_","_"
6,"bhavanaṃ","_","_","bhavana","NC","","_","_"
7,"mahat","_","_","mahat","JJ","","_","_"
1,"tatra","_","_","tatra","CAD","","_","_"
2,"te","_","_","tad","PRD","","_","_"
3,"nyavasan","_","_","nivas","V","nivas","_","_"
4,"rājan","_","_","rājan","NC","","_","_"
5,"yajñasenena","_","_","yajñasa","NC","","_","_"
6,"pūjitāḥ","_","_","pūjay","PPP","","_","_"
1,"_","_","_","pratyāśvas","PPP","","_","_"
2,"_","_","_","tatas","CX","","_","_"
3,"rājā","_","_","rājan","NC","","_","_"
4,"saha","_","_","saha","CX","","_","_"
5,"putrair","_","_","putra","NC","","_","_"
6,"uvāca","_","_","vak","V","vac","_","_"
7,"tān","_","_","tad","PRD","","_","_"
1,"gṛhṇātu","_","_","grah","V","grah","_","_"
2,"vidhivat","_","_","vidhivat","CX","","_","_"
3,"pāṇim","_","_","pāṇi","NC","","_","_"
4,"_","_","_","adya","CX","","_","_"
5,"_","_","_","eva","CEM","","_","_"
6,"_","_","_","kuru","NC","","_","_"
7,"_","_","_","nandana","NC","","_","_"
1,"puṇye","_","_","puṇya","JJ","","_","_"
2,"'hani","_","_","ahar","NC","","_","_"
3,"_","_","_","mahat","JJ","","_","_"
4,"_","_","_","bāhu","NC","","_","_"
5,"arjunaḥ","_","_","arjuna","NC","","_","_"
6,"kurutāṃ","_","_","kar","V","kṛ","_","_"
7,"kṣaṇam","_","_","kṣaṇa","NC","","_","_"
1,"_","_","_","tatas","CX","","_","_"
2,"_","_","_","tad","PRD","","_","_"
3,"abravīd","_","_","abravīta","V","brū","_","_"
4,"rājā","_","_","rājan","NC","","_","_"
5,"dharmaputro","_","_","dharmaputra","NC","","_","_"
6,"yudhiṣṭhiraḥ","_","_","yudhiṣṭhira","NC","","_","_"
1,"_","_","_","mat","PPR","","_","_"
2,"_","_","_","api","CX","","_","_"
3,"_","_","_","dāra","NC","","_","_"
4,"_","_","_","sambandha","NC","","_","_"
5,"_","_","_","kṛ","KDG","","_","_"
6,"_","_","_","tāvat","CX","","_","_"
7,"viśāṃ","_","_","viś","NC","","_","_"
8,"pate","_","_","pati","NC","","_","_"
1,"tasmāt","_","_","tad","PRD","","_","_"
2,"pūrvaṃ","_","_","pūrva","CX","","_","_"
3,"mayā","_","_","mat","PPR","","_","_"
4,"kāryaṃ","_","_","kṛ","KDG","","_","_"
5,"yad","_","_","yad","PRL","","_","_"
6,"bhavān","_","_","bhavat","JJ","","_","_"
7,"anumanyate","_","_","anuman","V","anuman","_","_"
1,"drupada","_","_","drupada","NC","","_","_"
2,"uvāca","_","_","vak","V","vac","_","_"
1,"bhavān","_","_","bhavat","JJ","","_","_"
2,"vā","_","_","vā","CCD","","_","_"
3,"vidhivat","_","_","vidhivat","CX","","_","_"
4,"pāṇiṃ","_","_","pāṇi","NC","","_","_"
5,"gṛhṇātu","_","_","grah","V","grah","_","_"
6,"duhitur","_","_","duhitṛ","NC","","_","_"
7,"mama","_","_","mat","PPR","","_","_"
1,"yasya","_","_","yad","PRL","","_","_"
2,"vā","_","_","vā","CCD","","_","_"
3,"manyase","_","_","man","V","man","_","_"
4,"vīra","_","_","vīra","NC","","_","_"
5,"tasya","_","_","tad","PRD","","_","_"
6,"kṛṣṇām","_","_","kṛṣṇā","NC","","_","_"
7,"upādiśa","_","_","upādiś","V","upādiś","_","_"
1,"yudhiṣṭhira","_","_","yudhiṣṭhira","NC","","_","_"
2,"uvāca","_","_","vak","V","vac","_","_"
1,"sarveṣāṃ","_","_","sarva","JQ","","_","_"
2,"draupadī","_","_","draupadī","NC","","_","_"
3,"rājan","_","_","rājan","NC","","_","_"
4,"mahiṣī","_","_","mahiṣī","NC","","_","_"
5,"no","_","_","mat","PPR","","_","_"
6,"bhaviṣyati","_","_","bhav","V","bhū","_","_"
1,"evaṃ","_","_","eva","CX","","_","_"
2,"hi","_","_","hi","CX","","_","_"
3,"vyāhṛtaṃ","_","_","vyāhṛ","PPP","","_","_"
4,"pūrvaṃ","_","_","pūrva","CX","","_","_"
5,"mama","_","_","mat","PPR","","_","_"
6,"mātrā","_","_","mātṛ","NC","","_","_"
7,"viśāṃ","_","_","viś","NC","","_","_"
8,"pate","_","_","pati","NC","","_","_"
1,"ahaṃ","_","_","mat","PPR","","_","_"
2,"_","_","_","ca","CCD","","_","_"
3,"_","_","_","api","CX","","_","_"
4,"a","_","_","alpha_privativum","JJ","","_","_"
4,"_","_","_","niviṣṭa","JJ","","_","_"
5,"vai","_","_","vai","CX","","_","_"
6,"_","_","_","bhīmasa","NC","","_","_"
7,"_","_","_","ca","CCD","","_","_"
8,"pāṇḍavaḥ","_","_","pāṇḍava","NC","","_","_"
1,"pārthena","_","_","pārtha","NC","","_","_"
2,"vijitā","_","_","viji","PPP","","_","_"
3,"_","_","_","ca","CCD","","_","_"
4,"_","_","_","tad","PRD","","_","_"
5,"_","_","_","ratna","NC","","_","_"
6,"_","_","_","bhū","PPP","","_","_"
7,"ca","_","_","ca","CCD","","_","_"
8,"te","_","_","tvat","PPR","","_","_"
9,"sutā","_","_","sutā","NC","","_","_"
1,"eṣa","_","_","tad","PRD","","_","_"
2,"naḥ","_","_","mat","PPR","","_","_"
3,"samayo","_","_","samaya","NC","","_","_"
4,"rājan","_","_","rājan","NC","","_","_"
5,"ratnasya","_","_","ratna","NC","","_","_"
6,"sahabhojanam","_","_","sahabhojana","NC","","_","_"
1,"na","_","_","na","CNG","","_","_"
2,"ca","_","_","ca","CCD","","_","_"
3,"taṃ","_","_","tad","PRD","","_","_"
4,"hātum","_","_","hā","CGDI","","_","_"
5,"icchāmaḥ","_","_","iṣ","V","iṣ","_","_"
6,"samayaṃ","_","_","samaya","NC","","_","_"
7,"_","_","_","rājan","NC","","_","_"
8,"_","_","_","sattama","JJ","","_","_"
1,"akrameṇa","_","_","akrama","NC","","_","_"
2,"niveśe","_","_","niveśa","NC","","_","_"
3,"ca","_","_","ca","CCD","","_","_"
4,"_","_","_","dharma","NC","","_","_"
5,"_","_","_","lopa","NC","","_","_"
6,"mahān","_","_","mahat","JJ","","_","_"
7,"bhavet","_","_","bhav","V","bhū","_","_"
1,"nirjitā","_","_","nirji","PPP","","_","_"
2,"_","_","_","ca","CCD","","_","_"
3,"_","_","_","eva","CEM","","_","_"
4,"pārthena","_","_","pārtha","NC","","_","_"
5,"_","_","_","ratna","NC","","_","_"
6,"_","_","_","bhū","PPP","","_","_"
7,"ca","_","_","ca","CCD","","_","_"
8,"te","_","_","tvat","PPR","","_","_"
9,"sutā","_","_","sutā","NC","","_","_"
1,"sarveṣāṃ","_","_","sarva","JQ","","_","_"
2,"dharmataḥ","_","_","dharma","NC","","_","_"
3,"kṛṣṇā","_","_","kṛṣṇā","NC","","_","_"
4,"mahiṣī","_","_","mahiṣī","NC","","_","_"
5,"no","_","_","mat","PPR","","_","_"
6,"bhaviṣyati","_","_","bhav","V","bhū","_","_"
1,"ānupūrvyeṇa","_","_","ānupūrvya","NC","","_","_"
2,"sarveṣāṃ","_","_","sarva","JQ","","_","_"
3,"gṛhṇātu","_","_","grah","V","grah","_","_"
4,"jvalane","_","_","jvalana","NC","","_","_"
5,"karam","_","_","kara","NC","","_","_"
1,"drupada","_","_","drupada","NC","","_","_"
2,"uvāca","_","_","vak","V","vac","_","_"
1,"ekasya","_","_","eka","PPX","","_","_"
2,"bahvyo","_","_","bahu","JJ","","_","_"
3,"vihitā","_","_","vidhā","PPP","","_","_"
4,"mahiṣyaḥ","_","_","mahiṣī","NC","","_","_"
5,"_","_","_","kuru","NC","","_","_"
6,"_","_","_","nandana","NC","","_","_"
1,"_","_","_","na","CNG","","_","_"
2,"_","_","_","eka","PPX","","_","_"
3,"bahavaḥ","_","_","bahu","JJ","","_","_"
4,"puṃso","_","_","puṃs","NC","","_","_"
5,"vidhīyante","_","_","vidadh","V","vidhā","_","_"
6,"kadācana","_","_","kadācana","CX","","_","_"
1,"so","_","_","tad","PRD","","_","_"
2,"'yaṃ","_","_","ida","PRD","","_","_"
3,"na","_","_","na","CNG","","_","_"
4,"loke","_","_","loka","NC","","_","_"
5,"vede","_","_","veda","NC","","_","_"
6,"vā","_","_","vā","CCD","","_","_"
7,"jātu","_","_","jātu","CX","","_","_"
8,"dharmaḥ","_","_","dharma","NC","","_","_"
9,"praśasyate","_","_","praśaṃs","V","praśaṃs","_","_"
1,"_","_","_","loka","NC","","_","_"
2,"_","_","_","veda","NC","","_","_"
3,"_","_","_","virudh","PPP","","_","_"
5,"_","_","_","na","CNG","","_","_"
6,"_","_","_","adharma","NC","","_","_"
7,"dhārmikaḥ","_","_","dhārmika","JJ","","_","_"
8,"śuciḥ","_","_","śuci","JJ","","_","_"
1,"kartum","_","_","kṛ","CGDI","","_","_"
2,"arhasi","_","_","arh","V","arh","_","_"
3,"kaunteya","_","_","kaunteya","NC","","_","_"
4,"kasmāt","_","_","kiṃ","PRQ","","_","_"
5,"te","_","_","tvat","PPR","","_","_"
6,"buddhir","_","_","buddhi","NC","","_","_"
7,"īdṛśī","_","_","īdṛśa","JJ","","_","_"
1,"yudhiṣṭhira","_","_","yudhiṣṭhira","NC","","_","_"
2,"uvāca","_","_","vak","V","vac","_","_"
1,"sūkṣmo","_","_","sūkṣma","JJ","","_","_"
2,"dharmo","_","_","dharma","NC","","_","_"
3,"_","_","_","mahat","JJ","","_","_"
4,"_","_","_","rāja","NC","","_","_"
5,"_","_","_","na","CNG","","_","_"
6,"_","_","_","ida","PRD","","_","_"
7,"vidmo","_","_","vid","V","vid","_","_"
8,"vayaṃ","_","_","mat","PPR","","_","_"
9,"gatim","_","_","gati","NC","","_","_"
1,"pūrveṣām","_","_","pūrva","PPX","","_","_"
2,"ānupūrvyeṇa","_","_","ānupūrvya","NC","","_","_"
3,"yātaṃ","_","_","yā","PPP","","_","_"
4,"_","_","_","vartman","NC","","_","_"
5,"_","_","_","anuyā","V","anuyā","_","_"
1,"_","_","_","loka","NC","","_","_"
2,"_","_","_","dharma","NC","","_","_"
3,"_","_","_","virudh","PPP","","_","_"
4,"'yaṃ","_","_","ida","PRD","","_","_"
5,"dharmo","_","_","dharma","NC","","_","_"
6,"_","_","_","dharma","NC","","_","_"
7,"_","_","_","bhṛt","JJ","","_","_"
8,"vara","_","_","vara","JJ","","_","_"
1,"na","_","_","na","CNG","","_","_"
2,"me","_","_","mat","PPR","","_","_"
3,"vāg","_","_","vāc","NC","","_","_"
4,"anṛtaṃ","_","_","anṛta","NC","","_","_"
5,"prāha","_","_","prāh","V","prāh","_","_"
6,"_","_","_","na","CNG","","_","_"
7,"_","_","_","adharma","NC","","_","_"
8,"dhīyate","_","_","dadh","V","dhā","_","_"
9,"matiḥ","_","_","mati","NC","","_","_"
1,"evaṃ","_","_","eva","CX","","_","_"
2,"_","_","_","ca","CCD","","_","_"
3,"_","_","_","eva","CEM","","_","_"
4,"_","_","_","vad","V","vad","_","_"
5,"_","_","_","ambā","NC","","_","_"
6,"mama","_","_","mat","PPR","","_","_"
7,"_","_","_","ca","CCD","","_","_"
8,"_","_","_","eva","CEM","","_","_"
9,"manogatam","_","_","manogata","NC","","_","_"
1,"āśrame","_","_","āśrama","NC","","_","_"
2,"_","_","_","rudra","NC","","_","_"
3,"_","_","_","nirdiś","PPP","","_","_"
4,"vyāsād","_","_","vyāsa","NC","","_","_"
5,"etan","_","_","tad","PRD","","_","_"
6,"mayā","_","_","mat","PPR","","_","_"
7,"śrutam","_","_","śru","PPP","","_","_"
1,"eṣa","_","_","tad","PRD","","_","_"
2,"dharmo","_","_","dharma","NC","","_","_"
3,"dhruvo","_","_","dhruva","NC","","_","_"
4,"_","_","_","rājan","NC","","_","_"
5,"_","_","_","car","V","car","_","_"
6,"_","_","_","a","PRD","","_","_"
7,"avicārayan","_","_","avicārayat","JJ","","_","_"
1,"mā","_","_","mā","CNG","","_","_"
2,"ca","_","_","ca","CCD","","_","_"
3,"te","_","_","tvat","PPR","","_","_"
4,"'tra","_","_","atra","CAD","","_","_"
5,"viśaṅkā","_","_","viśaṅkā","NC","","_","_"
6,"bhūt","_","_","bhav","V","bhū","_","_"
7,"kathaṃcid","_","_","kathaṃcid","CX","","_","_"
8,"api","_","_","api","CX","","_","_"
9,"pārthiva","_","_","pārthiva","NC","","_","_"
1,"drupada","_","_","drupada","NC","","_","_"
2,"uvācatā","_","_","vak","V","vac","_","_"
2,"ca","_","_","ca","CCD","","_","_"
3,"kuntī","_","_","kuntī","NC","","_","_"
4,"ca","_","_","ca","CCD","","_","_"
5,"kaunteya","_","_","kaunteya","NC","","_","_"
6,"_","_","_","dhṛṣṭadyumna","NC","","_","_"
7,"_","_","_","ca","CCD","","_","_"
8,"me","_","_","mat","PPR","","_","_"
9,"sutaḥ","_","_","suta","NC","","_","_"
1,"_","_","_","kathay","V","kathay","_","_"
2,"_","_","_","itikartavya","JJ","","_","_"
3,"śvaḥ","_","_","śvas","CX","","_","_"
4,"kāle","_","_","kāla","NC","","_","_"
5,"karavāmahe","_","_","kar","V","kṛ","_","_"
1,"vaiśaṃpāyana","_","_","vaiśampāyana","NC","","_","_"
2,"uvāca","_","_","vak","V","vac","_","_"
1,"te","_","_","tad","PRD","","_","_"
2,"sametya","_","_","same","CGDA","","_","_"
3,"tataḥ","_","_","tatas","CX","","_","_"
4,"sarve","_","_","sarva","JQ","","_","_"
5,"kathayanti","_","_","kath","V","kath","_","_"
6,"sma","_","_","sma","CX","","_","_"
7,"bhārata","_","_","bhārata","NC","","_","_"
1,"atha","_","_","atha","CAD","","_","_"
2,"dvaipāyano","_","_","dvaipāyana","NC","","_","_"
3,"rājann","_","_","rājan","NC","","_","_"
4,"abhyāgacchad","_","_","abhyāga","V","abhyāga","_","_"
5,"yadṛcchayā","_","_","yadṛcchā","NC","","_","_"
