"WordID","word","NormSTEM","suffix","lemma","PoS","Root","NormSuffix","NormWord"
1,"bhīṣma","_","_","bhīṣma","NC","","_","_"
2,"uvāca","_","_","vak","V","vac","_","_"
1,"evaṃ","_","_","eva","CX","","_","_"
2,"_","_","_","śvan","NC","","_","_"
3,"_","_","_","asama","JJ","","_","_"
4,"bhṛtyān","_","_","bhṛtya","NC","","_","_"
5,"_","_","_","sva","JJ","","_","_"
6,"_","_","_","sthāna","NC","","_","_"
7,"yo","_","_","yad","PRL","","_","_"
8,"narādhipaḥ","_","_","narādhipa","NC","","_","_"
1,"niyojayati","_","_","niyojay","V","niyojay","_","_"
2,"kṛtyeṣu","_","_","kṛtya","NC","","_","_"
3,"sa","_","_","tad","PRD","","_","_"
4,"_","_","_","rājya","NC","","_","_"
5,"_","_","_","phala","NC","","_","_"
6,"aśnute","_","_","aśn","V","aś","_","_"
1,"na","_","_","na","CNG","","_","_"
2,"śvā","_","_","śvan","NC","","_","_"
3,"_","_","_","sva","JJ","","_","_"
4,"_","_","_","sthāna","NC","","_","_"
5,"utkramya","_","_","utkra","CGDA","","_","_"
6,"pramāṇam","_","_","pramāṇa","NC","","_","_"
7,"abhi","_","_","abhi","CADP","","_","_"
8,"satkṛtaḥ","_","_","satkṛ","PPP","","_","_"
1,"āropyaḥ","_","_","āropay","KDG","","_","_"
2,"śvā","_","_","śvan","NC","","_","_"
3,"svakāt","_","_","svaka","JJ","","_","_"
4,"sthānād","_","_","sthāna","NC","","_","_"
5,"_","_","_","utkra","CGDA","","_","_"
6,"_","_","_","anya","PPX","","_","_"
7,"prapadyate","_","_","prapad","V","prapad","_","_"
1,"_","_","_","sva","JJ","","_","_"
2,"_","_","_","jāti","NC","","_","_"
3,"_","_","_","kula","NC","","_","_"
4,"_","_","_","sampad","PPP","","_","_"
5,"sveṣu","_","_","sva","JJ","","_","_"
6,"_","_","_","karman","NC","","_","_"
7,"_","_","_","avasthā","PPP","","_","_"
1,"prakartavyā","_","_","prakṛ","KDG","","_","_"
2,"budhā","_","_","budha","JJ","","_","_"
3,"bhṛtyā","_","_","bhṛtya","NC","","_","_"
4,"_","_","_","na","CNG","","_","_"
5,"_","_","_","asthāna","NC","","_","_"
6,"prakriyā","_","_","prakriyā","NC","","_","_"
7,"kṣamā","_","_","kṣama","JJ","","_","_"
1,"anurūpāṇi","_","_","anurūpa","JJ","","_","_"
2,"karmāṇi","_","_","karman","NC","","_","_"
3,"bhṛtyebhyo","_","_","bhṛtya","NC","","_","_"
4,"yaḥ","_","_","yad","PRL","","_","_"
5,"prayacchati","_","_","praya","V","praya","_","_"
1,"sa","_","_","sa_saha","CX","","_","_"
2,"_","_","_","bhṛtya","NC","","_","_"
3,"_","_","_","guṇa","NC","","_","_"
4,"_","_","_","sampad","PPP","","_","_"
5,"rājā","_","_","rājan","NC","","_","_"
6,"phalam","_","_","phala","NC","","_","_"
7,"upāśnute","_","_","upāśnuta","V","upāś","_","_"
1,"śarabhaḥ","_","_","śarabha","NC","","_","_"
2,"_","_","_","śarabha","NC","","_","_"
3,"_","_","_","sthāna","NC","","_","_"
4,"siṃhaḥ","_","_","siṃha","NC","","_","_"
5,"siṃha","_","_","siṃha","NC","","_","_"
6,"_","_","_","iva","CCM","","_","_"
7,"_","_","_","ūrjay","PPP","","_","_"
1,"vyāghro","_","_","vyāghra","NC","","_","_"
2,"vyāghra","_","_","vyāghra","NC","","_","_"
3,"iva","_","_","iva","CCM","","_","_"
4,"sthāpyo","_","_","sthāpay","KDG","","_","_"
5,"dvīpī","_","_","dvīpin","NC","","_","_"
6,"dvīpī","_","_","dvīpin","NC","","_","_"
7,"yathā","_","_","yathā","CCM","","_","_"
8,"tathā","_","_","tathā","CX","","_","_"
1,"_","_","_","karman","NC","","_","_"
2,"_","_","_","iha","CAD","","_","_"
3,"_","_","_","anurūpa","NC","","_","_"
4,"nyasyā","_","_","nyas","KDG","","_","_"
5,"bhṛtyā","_","_","bhṛtya","NC","","_","_"
6,"yathāvidhi","_","_","yathāvidhi","CX","","_","_"
1,"pratilomaṃ","_","_","pratiloma","JJ","","_","_"
2,"na","_","_","na","CNG","","_","_"
3,"_","_","_","bhṛtya","NC","","_","_"
4,"_","_","_","tad","PRD","","_","_"
5,"sthāpyāḥ","_","_","sthāpay","KDG","","_","_"
6,"_","_","_","karman","NC","","_","_"
7,"_","_","_","phala","NC","","_","_"
8,"_","_","_","eṣin","JJ","","_","_"
1,"yaḥ","_","_","yad","PRL","","_","_"
2,"pramāṇam","_","_","pramāṇa","NC","","_","_"
3,"atikramya","_","_","atikra","CGDA","","_","_"
4,"pratilomaṃ","_","_","pratiloma","JJ","","_","_"
5,"narādhipaḥ","_","_","narādhipa","NC","","_","_"
1,"bhṛtyān","_","_","bhṛtya","NC","","_","_"
2,"sthāpayate","_","_","sthāpay","V","sthāpay","_","_"
3,"'buddhir","_","_","abuddhi","JJ","","_","_"
4,"na","_","_","na","CNG","","_","_"
5,"sa","_","_","tad","PRD","","_","_"
6,"rañjayate","_","_","raj","V","raj","_","_"
7,"prajāḥ","_","_","prajā","NC","","_","_"
1,"na","_","_","na","CNG","","_","_"
2,"bāliśā","_","_","bāliśa","NC","","_","_"
3,"na","_","_","na","CNG","","_","_"
4,"ca","_","_","ca","CCD","","_","_"
5,"kṣudrā","_","_","kṣudra","JJ","","_","_"
6,"na","_","_","na","CNG","","_","_"
7,"_","_","_","ca","CCD","","_","_"
8,"_","_","_","a","CNG","","_","_"
9,"_","_","_","pratimā","PPP","","_","_"
10,"_","_","_","indriya","NC","","_","_"
1,"_","_","_","na","CNG","","_","_"
2,"_","_","_","akulīna","JJ","","_","_"
3,"narāḥ","_","_","nara","NC","","_","_"
4,"pārśve","_","_","pārśva","NC","","_","_"
5,"sthāpyā","_","_","sthāpay","KDG","","_","_"
6,"rājñā","_","_","rājan","NC","","_","_"
7,"_","_","_","hita","NC","","_","_"
8,"_","_","_","eṣin","JJ","","_","_"
1,"sādhavaḥ","_","_","sādhu","JJ","","_","_"
2,"kuśalāḥ","_","_","kuśala","JJ","","_","_"
3,"śūrā","_","_","śūra","NC","","_","_"
4,"jñānavanto","_","_","jñānavat","JJ","","_","_"
5,"'nasūyakāḥ","_","_","anasūyaka","JJ","","_","_"
1,"akṣudrāḥ","_","_","akṣudra","JJ","","_","_"
2,"śucayo","_","_","śuci","JJ","","_","_"
3,"dakṣā","_","_","dakṣa","JJ","","_","_"
4,"narāḥ","_","_","nara","NC","","_","_"
5,"syuḥ","_","_","as","V","as","_","_"
6,"pāripārśvakāḥ","_","_","pāripārśvaka","NC","","_","_"
1,"_","_","_","nyagbhūta","JJ","","_","_"
2,"_","_","_","tad","PRD","","_","_"
3,"_","_","_","para","PPX","","_","_"
4,"_","_","_","kṣa","PPP","","_","_"
5,"_","_","_","caukṣa","JJ","","_","_"
6,"_","_","_","prakṛti","NC","","_","_"
7,"_","_","_","ja","JJ","","_","_"
8,"śubhāḥ","_","_","śubha","JJ","","_","_"
1,"sve","_","_","sva","JJ","","_","_"
2,"sve","_","_","sva","JJ","","_","_"
3,"sthāne","_","_","sthāna","NC","","_","_"
4,"_","_","_","a","CNG","","_","_"
5,"_","_","_","parikruś","PPP","","_","_"
6,"_","_","_","tad","PRD","","_","_"
7,"syū","_","_","as","V","as","_","_"
8,"rājño","_","_","rājan","NC","","_","_"
9,"bahiścarāḥ","_","_","bahiścara","JJ","","_","_"
1,"siṃhasya","_","_","siṃha","NC","","_","_"
2,"satataṃ","_","_","satata","CX","","_","_"
3,"pārśve","_","_","pārśva","NC","","_","_"
4,"siṃha","_","_","siṃha","NC","","_","_"
5,"eva","_","_","eva","CEM","","_","_"
6,"jano","_","_","jana","NC","","_","_"
7,"bhavet","_","_","bhav","V","bhū","_","_"
1,"_","_","_","a","CNG","","_","_"
2,"_","_","_","siṃha","NC","","_","_"
3,"_","_","_","siṃha","NC","","_","_"
4,"_","_","_","sahita","JJ","","_","_"
5,"_","_","_","siṃha","NC","","_","_"
6,"_","_","_","vat","CX","","_","_"
7,"labhate","_","_","labh","V","labh","_","_"
8,"phalam","_","_","phala","NC","","_","_"
1,"_","_","_","yad","PRL","","_","_"
2,"_","_","_","tu","CCD","","_","_"
3,"siṃhaḥ","_","_","siṃha","NC","","_","_"
4,"śvabhiḥ","_","_","śvan","NC","","_","_"
5,"kīrṇaḥ","_","_","kṛ","PPP","","_","_"
6,"_","_","_","siṃha","NC","","_","_"
7,"_","_","_","karman","NC","","_","_"
8,"_","_","_","phala","NC","","_","_"
9,"rataḥ","_","_","ra","PPP","","_","_"
1,"na","_","_","na","CNG","","_","_"
2,"sa","_","_","tad","PRD","","_","_"
3,"_","_","_","siṃha","NC","","_","_"
4,"_","_","_","phala","NC","","_","_"
5,"bhoktuṃ","_","_","bhuj","CGDI","","_","_"
6,"śaktaḥ","_","_","śak","PPP","","_","_"
7,"śvabhir","_","_","śvan","NC","","_","_"
8,"upāsitaḥ","_","_","upās","PPP","","_","_"
1,"evam","_","_","eva","CX","","_","_"
2,"etair","_","_","tad","PRD","","_","_"
3,"_","_","_","manuṣya","NC","","_","_"
4,"_","_","_","indra","NC","","_","_"
5,"śūraiḥ","_","_","śūra","NC","","_","_"
6,"prājñair","_","_","prājña","JJ","","_","_"
7,"_","_","_","bahu","JJ","","_","_"
8,"_","_","_","śruta","NC","","_","_"
1,"kulīnaiḥ","_","_","kulīna","JJ","","_","_"
2,"saha","_","_","saha","CX","","_","_"
3,"śakyeta","_","_","śakn","V","śak","_","_"
4,"kṛtsnāṃ","_","_","kṛtsna","JJ","","_","_"
5,"jetuṃ","_","_","ji","CGDI","","_","_"
6,"vasuṃdharām","_","_","vasuṃdharā","NC","","_","_"
1,"_","_","_","na","CNG","","_","_"
2,"_","_","_","a","CNG","","_","_"
3,"_","_","_","vaidya","NC","","_","_"
4,"_","_","_","na","CNG","","_","_"
5,"_","_","_","anṛju","JJ","","_","_"
6,"pārśve","_","_","pārśva","NC","","_","_"
7,"_","_","_","na","CNG","","_","_"
8,"_","_","_","a","CNG","","_","_"
9,"_","_","_","vidyā","NC","","_","_"
10,"_","_","_","na","CNG","","_","_"
11,"_","_","_","a","CNG","","_","_"
12,"_","_","_","mahādhana","JJ","","_","_"
1,"saṃgrāhyo","_","_","saṃgrah","KDG","","_","_"
2,"_","_","_","vasudhā","NC","","_","_"
3,"_","_","_","pāla","NC","","_","_"
4,"bhṛtyo","_","_","bhṛtya","NC","","_","_"
5,"bhṛtyavatāṃ","_","_","bhṛtyavat","JJ","","_","_"
6,"vara","_","_","vara","JJ","","_","_"
1,"_","_","_","bāṇa","NC","","_","_"
2,"_","_","_","vat","CX","","_","_"
3,"visṛtā","_","_","visṛ","PPP","","_","_"
4,"yānti","_","_","yā","V","yā","_","_"
5,"_","_","_","svāmin","NC","","_","_"
6,"_","_","_","kārya","NC","","_","_"
7,"_","_","_","para","PPX","","_","_"
8,"janāḥ","_","_","jana","NC","","_","_"
1,"ye","_","_","yad","PRL","","_","_"
2,"bhṛtyāḥ","_","_","bhṛtya","NC","","_","_"
3,"_","_","_","pārthiva","NC","","_","_"
4,"_","_","_","hi","PPP","","_","_"
5,"_","_","_","tad","PRD","","_","_"
6,"sāntvaṃ","_","_","sāntva","NC","","_","_"
7,"prayojayet","_","_","prayuj","V","prayuj","_","_"
1,"_","_","_","kośa","NC","","_","_"
2,"_","_","_","ca","CCD","","_","_"
3,"satataṃ","_","_","satata","CX","","_","_"
4,"rakṣyo","_","_","rakṣ","KDG","","_","_"
5,"yatnam","_","_","yatna","NC","","_","_"
6,"āsthāya","_","_","āsthā","CGDA","","_","_"
7,"rājabhiḥ","_","_","rājan","NC","","_","_"
1,"_","_","_","kośa","NC","","_","_"
2,"_","_","_","mūla","NC","","_","_"
3,"hi","_","_","hi","CX","","_","_"
4,"rājānaḥ","_","_","rājan","NC","","_","_"
5,"_","_","_","kośa","NC","","_","_"
6,"_","_","_","mūla","NC","","_","_"
7,"_","_","_","kara","JJ","","_","_"
8,"bhava","_","_","bhav","V","bhū","_","_"
1,"koṣṭhāgāraṃ","_","_","koṣṭhāgāra","NC","","_","_"
2,"ca","_","_","ca","CCD","","_","_"
3,"te","_","_","tvat","PPR","","_","_"
4,"nityaṃ","_","_","nitya","CX","","_","_"
5,"sphītaṃ","_","_","sphīta","JJ","","_","_"
6,"dhānyaiḥ","_","_","dhānya","NC","","_","_"
7,"_","_","_","su","CAD","","_","_"
8,"_","_","_","saṃci","PPP","","_","_"
1,"_","_","_","sadā","CAD","","_","_"
2,"_","_","_","as","V","as","_","_"
3,"satsu","_","_","sat","JJ","","_","_"
4,"saṃnyastaṃ","_","_","saṃnyas","PPP","","_","_"
5,"_","_","_","dhana","NC","","_","_"
6,"_","_","_","dhānya","NC","","_","_"
7,"_","_","_","para","PPX","","_","_"
8,"bhava","_","_","bhav","V","bhū","_","_"
1,"_","_","_","nitya","JJ","","_","_"
2,"_","_","_","yuj","PPP","","_","_"
3,"_","_","_","ca","CCD","","_","_"
4,"te","_","_","tvat","PPR","","_","_"
5,"bhṛtyā","_","_","bhṛtya","NC","","_","_"
6,"bhavantu","_","_","bhav","V","bhū","_","_"
7,"_","_","_","raṇa","NC","","_","_"
8,"_","_","_","kovida","JJ","","_","_"
1,"vājināṃ","_","_","vājin","NC","","_","_"
2,"ca","_","_","ca","CCD","","_","_"
3,"prayogeṣu","_","_","prayoga","NC","","_","_"
4,"vaiśāradyam","_","_","vaiśāradya","NC","","_","_"
5,"_","_","_","iha","CAD","","_","_"
6,"_","_","_","iṣ","V","iṣ","_","_"
1,"_","_","_","jñāti","NC","","_","_"
2,"_","_","_","bandhu","NC","","_","_"
3,"_","_","_","jana","NC","","_","_"
4,"_","_","_","avekṣin","JJ","","_","_"
5,"_","_","_","mitra","NC","","_","_"
6,"_","_","_","sambandhin","JJ","","_","_"
7,"_","_","_","saṃvṛ","PPP","","_","_"
1,"_","_","_","paura","NC","","_","_"
2,"_","_","_","kārya","NC","","_","_"
3,"_","_","_","hita","NC","","_","_"
4,"_","_","_","anveṣin","JJ","","_","_"
5,"bhava","_","_","bhav","V","bhū","_","_"
6,"_","_","_","kaurava","NC","","_","_"
7,"_","_","_","nandana","NC","","_","_"
1,"eṣā","_","_","tad","PRD","","_","_"
2,"te","_","_","tvat","PPR","","_","_"
3,"naiṣṭhikī","_","_","naiṣṭhika","JJ","","_","_"
4,"buddhiḥ","_","_","buddhi","NC","","_","_"
5,"prajñā","_","_","prajñā","NC","","_","_"
6,"_","_","_","ca","CCD","","_","_"
7,"_","_","_","abhidhā","PPP","","_","_"
8,"mayā","_","_","mat","PPR","","_","_"
1,"śvā","_","_","śvan","NC","","_","_"
2,"te","_","_","tvat","PPR","","_","_"
3,"nidarśanaṃ","_","_","nidarśana","NC","","_","_"
4,"tāta","_","_","tāta","NC","","_","_"
5,"kiṃ","_","_","kiṃ","PRQ","","_","_"
6,"bhūyaḥ","_","_","bhūyas","CX","","_","_"
7,"śrotum","_","_","śru","CGDI","","_","_"
8,"icchasi","_","_","iṣ","V","iṣ","_","_"
