"WordID","word","NormSTEM","suffix","lemma","PoS","Root","NormSuffix","NormWord"
1,"prati","_","_","prati","CADP","","_","_"
2,"ketavaḥ","_","_","ketu","NC","","_","_"
3,"prathamā","_","_","prathama","JJ","","_","_"
4,"adṛśrann","_","_","darś","V","dṛś","_","_"
5,"ūrdhvā","_","_","ūrdhva","JJ","","_","_"
6,"asyā","_","_","ida","PRD","","_","_"
7,"añjayo","_","_","añji","NC","","_","_"
8,"vi","_","_","vi","CADP","","_","_"
9,"śrayante","_","_","śray","V","śri","_","_"
1,"uṣo","_","_","uṣas","NC","","_","_"
2,"arvācā","_","_","arvāñc","JJ","","_","_"
3,"bṛhatā","_","_","bṛhat","JJ","","_","_"
4,"rathena","_","_","ratha","NC","","_","_"
5,"jyotiṣmatā","_","_","jyotiṣmat","JJ","","_","_"
6,"vāmam","_","_","vāma","JJ","","_","_"
7,"asmabhyaṃ","_","_","mat","PPR","","_","_"
8,"vakṣi","_","_","vah","V","vah","_","_"
1,"prati","_","_","prati","CADP","","_","_"
2,"ṣīm","_","_","sīm","CX","","_","_"
3,"agnir","_","_","agni","NC","","_","_"
4,"jarate","_","_","jar","V","jṛ","_","_"
5,"samiddhaḥ","_","_","samindh","PPP","","_","_"
6,"prati","_","_","prati","CADP","","_","_"
7,"viprāso","_","_","vipra","NC","","_","_"
8,"matibhir","_","_","mati","NC","","_","_"
9,"gṛṇantaḥ","_","_","gṛ","KDP","","_","_"
1,"uṣā","_","_","uṣas","NC","","_","_"
2,"yāti","_","_","yā","V","yā","_","_"
3,"jyotiṣā","_","_","jyotis","NC","","_","_"
4,"bādhamānā","_","_","bādh","KDP","","_","_"
5,"viśvā","_","_","viśva","JQ","","_","_"
6,"tamāṃsi","_","_","tamas","NC","","_","_"
7,"_","_","_","durita","NC","","_","_"
8,"_","_","_","apa","CX","","_","_"
9,"devī","_","_","devī","NC","","_","_"
1,"etā","_","_","tad","PRD","","_","_"
2,"u","_","_","u","CEM","","_","_"
3,"tyāḥ","_","_","tya","PRD","","_","_"
4,"praty","_","_","prati","CADP","","_","_"
5,"adṛśran","_","_","darś","V","dṛś","_","_"
6,"purastāj","_","_","purastāt","CX","","_","_"
7,"jyotir","_","_","jyotis","NC","","_","_"
8,"yacchantīr","_","_","ya","KDP","","_","_"
9,"uṣaso","_","_","uṣas","NC","","_","_"
10,"vibhātīḥ","_","_","vibhā","KDP","","_","_"
1,"ajījanan","_","_","jan","V","jan","_","_"
2,"sūryaṃ","_","_","sūrya","NC","","_","_"
3,"yajñam","_","_","yajña","NC","","_","_"
4,"agnim","_","_","agni","NC","","_","_"
5,"apācīnaṃ","_","_","apācīna","JJ","","_","_"
6,"tamo","_","_","tamas","NC","","_","_"
7,"agād","_","_","gā","V","gā","_","_"
8,"a","_","_","alpha_privativum","JJ","","_","_"
8,"ajuṣṭam","_","_","juṣṭa","JJ","","_","_"
1,"aceti","_","_","cit","V","cit","_","_"
2,"divo","_","_","div","NC","","_","_"
3,"duhitā","_","_","duhitṛ","NC","","_","_"
4,"maghonī","_","_","maghavan","JJ","","_","_"
5,"viśve","_","_","viśva","JQ","","_","_"
6,"paśyanty","_","_","paś","V","paś","_","_"
7,"uṣasaṃ","_","_","uṣas","NC","","_","_"
8,"vibhātīm","_","_","vibhā","KDP","","_","_"
1,"āsthād","_","_","ātiṣṭh","V","āsthā","_","_"
2,"rathaṃ","_","_","ratha","NC","","_","_"
3,"svadhayā","_","_","svadhā","NC","","_","_"
4,"yujyamānam","_","_","yuj","KDP","","_","_"
5,"ā","_","_","ā","CADP","","_","_"
6,"yam","_","_","yad","PRL","","_","_"
7,"aśvāsaḥ","_","_","aśva","NC","","_","_"
8,"_","_","_","su","CAD","","_","_"
9,"_","_","_","yuj","NC","","_","_"
10,"vahanti","_","_","vahan","V","vah","_","_"
1,"prati","_","_","prati","CADP","","_","_"
2,"_","_","_","tvat","PPR","","_","_"
3,"_","_","_","adya","CX","","_","_"
4,"sumanaso","_","_","sumanas","JJ","","_","_"
5,"_","_","_","bodh","V","budh","_","_"
6,"_","_","_","asmāka","JJ","","_","_"
7,"maghavāno","_","_","maghavan","JJ","","_","_"
8,"vayaṃ","_","_","mat","PPR","","_","_"
9,"ca","_","_","ca","CCD","","_","_"
1,"tilvilāyadhvam","_","_","tilvilāy","V","tilvilāy","_","_"
2,"uṣaso","_","_","uṣas","NC","","_","_"
3,"vibhātīr","_","_","vibhā","KDP","","_","_"
4,"yūyam","_","_","tvat","PPR","","_","_"
5,"pāta","_","_","pib","V","pā","_","_"
6,"svastibhiḥ","_","_","svasti","NC","","_","_"
7,"sadā","_","_","sadā","CAD","","_","_"
8,"naḥ","_","_","mat","PPR","","_","_"
