"WordID","word","NormSTEM","suffix","lemma","PoS","Root","NormSuffix","NormWord"
1,"bhīṣma","_","_","bhīṣma","NC","","_","_"
2,"uvāca","_","_","vak","V","vac","_","_"
1,"bhūtānāṃ","_","_","bhūta","NC","","_","_"
2,"_","_","_","guṇa","NC","","_","_"
3,"_","_","_","saṃkhyāna","NC","","_","_"
4,"bhūyaḥ","_","_","bhūyas","CX","","_","_"
5,"putra","_","_","putra","NC","","_","_"
6,"niśāmaya","_","_","niśāmay","V","niśāmay","_","_"
1,"_","_","_","dvaipāyana","NC","","_","_"
2,"_","_","_","mukha","NC","","_","_"
3,"bhraṣṭaṃ","_","_","bhraṃś","PPP","","_","_"
4,"ślāghayā","_","_","ślāghā","NC","","_","_"
5,"_","_","_","para","PPX","","_","_"
6,"_","_","_","anagha","JJ","","_","_"
1,"_","_","_","dīp","PPP","","_","_"
2,"_","_","_","anala","NC","","_","_"
3,"_","_","_","nibha","JJ","","_","_"
4,"prāha","_","_","prāh","V","prāh","_","_"
5,"bhagavān","_","_","bhagavat","JJ","","_","_"
6,"_","_","_","dhūmra","JJ","","_","_"
7,"_","_","_","varcas","NC","","_","_"
1,"tato","_","_","tatas","CX","","_","_"
2,"'ham","_","_","mat","PPR","","_","_"
3,"api","_","_","api","CX","","_","_"
4,"vakṣyāmi","_","_","vak","V","vac","_","_"
5,"bhūyaḥ","_","_","bhūyas","CX","","_","_"
6,"putra","_","_","putra","NC","","_","_"
7,"nidarśanam","_","_","nidarśana","NC","","_","_"
1,"bhūmeḥ","_","_","bhūmi","NC","","_","_"
2,"sthairyaṃ","_","_","sthairya","NC","","_","_"
3,"_","_","_","pṛthu","JJ","","_","_"
5,"ca","_","_","ca","CCD","","_","_"
6,"kāṭhinyaṃ","_","_","kāṭhinya","NC","","_","_"
7,"_","_","_","prasava","NC","","_","_"
8,"_","_","_","ātman","NC","","_","_"
1,"gandho","_","_","gandha","NC","","_","_"
2,"_","_","_","guru","JJ","","_","_"
4,"_","_","_","śakti","NC","","_","_"
5,"_","_","_","ca","CCD","","_","_"
6,"saṃghātaḥ","_","_","saṃghāta","NC","","_","_"
7,"sthāpanā","_","_","sthāpanā","NC","","_","_"
8,"dhṛtiḥ","_","_","dhṛti","NC","","_","_"
1,"apāṃ","_","_","ap","NC","","_","_"
2,"śaityaṃ","_","_","śaitya","NC","","_","_"
3,"rasaḥ","_","_","rasa","NC","","_","_"
4,"kledo","_","_","kleda","NC","","_","_"
5,"_","_","_","drava","JJ","","_","_"
7,"_","_","_","sneha","NC","","_","_"
8,"_","_","_","saumya","JJ","","_","_"
1,"jihvā","_","_","jihvā","NC","","_","_"
2,"viṣyandinī","_","_","viṣyandin","JJ","","_","_"
3,"_","_","_","ca","CCD","","_","_"
4,"_","_","_","eva","CEM","","_","_"
5,"bhaumāpyāsravaṇaṃ","_","_","tathā","CX","","_","_"
1,"agner","_","_","agni","NC","","_","_"
2,"_","_","_","durdharṣa","JJ","","_","_"
4,"_","_","_","tejas","NC","","_","_"
5,"_","_","_","tāpa","NC","","_","_"
6,"pākaḥ","_","_","pāka","NC","","_","_"
7,"prakāśanam","_","_","prakāśana","NC","","_","_"
1,"śaucaṃ","_","_","śauca","NC","","_","_"
2,"rāgo","_","_","rāga","NC","","_","_"
3,"_","_","_","laghu","JJ","","_","_"
4,"_","_","_","taikṣṇya","NC","","_","_"
5,"daśamaṃ","_","_","daśama","JJ","","_","_"
6,"_","_","_","ca","CCD","","_","_"
7,"_","_","_","ūrdhva","JJ","","_","_"
8,"_","_","_","bhāgin","JJ","","_","_"
1,"vāyor","_","_","vāyu","NC","","_","_"
2,"aniyamaḥ","_","_","aniyama","NC","","_","_"
3,"sparśo","_","_","sparśa","NC","","_","_"
4,"_","_","_","vāda","NC","","_","_"
5,"_","_","_","sthāna","NC","","_","_"
6,"_","_","_","svatantra","JJ","","_","_"
1,"balaṃ","_","_","bala","NC","","_","_"
2,"śaighryaṃ","_","_","śaighrya","NC","","_","_"
3,"ca","_","_","ca","CCD","","_","_"
4,"_","_","_","moha","NC","","_","_"
5,"_","_","_","ca","CCD","","_","_"
6,"ceṣṭā","_","_","ceṣṭā","NC","","_","_"
7,"_","_","_","karman","NC","","_","_"
8,"_","_","_","kṛ","PPP","","_","_"
9,"bhavaḥ","_","_","bhava","NC","","_","_"
1,"ākāśasya","_","_","ākāśa","NC","","_","_"
2,"guṇaḥ","_","_","guṇa","NC","","_","_"
3,"śabdo","_","_","śabda","NC","","_","_"
4,"_","_","_","vyāpin","JJ","","_","_"
6,"_","_","_","chidra","JJ","","_","_"
8,"_","_","_","api","CX","","_","_"
9,"ca","_","_","ca","CCD","","_","_"
1,"anāśrayam","_","_","anāśraya","NC","","_","_"
2,"anālambam","_","_","anālamba","NC","","_","_"
3,"avyaktam","_","_","avyakta","JJ","","_","_"
4,"_","_","_","avikārin","JJ","","_","_"
1,"a","_","_","alpha_privativum","NC","","_","_"
1,"_","_","_","pratīghāta","NC","","_","_"
3,"_","_","_","ca","CCD","","_","_"
4,"_","_","_","eva","CEM","","_","_"
5,"_","_","_","bhū","PPP","","_","_"
7,"vikṛtāni","_","_","vikṛ","PPP","","_","_"
8,"ca","_","_","ca","CCD","","_","_"
1,"guṇāḥ","_","_","guṇa","NC","","_","_"
2,"pañcāśataṃ","_","_","pañcāśata","NC","","_","_"
3,"proktāḥ","_","_","pravac","PPP","","_","_"
4,"_","_","_","pañcan","NUM","","_","_"
5,"_","_","_","bhūta","NC","","_","_"
6,"_","_","_","ātman","NC","","_","_"
7,"_","_","_","bhāvay","PPP","","_","_"
1,"_","_","_","cala","JJ","","_","_"
2,"_","_","_","upapatti","NC","","_","_"
3,"_","_","_","vyakti","NC","","_","_"
4,"_","_","_","ca","CCD","","_","_"
5,"visargaḥ","_","_","visarga","NC","","_","_"
6,"kalpanā","_","_","kalpanā","NC","","_","_"
7,"kṣamā","_","_","kṣamā","NC","","_","_"
1,"sad","_","_","as","KDP","","_","_"
2,"_","_","_","asat","JJ","","_","_"
3,"_","_","_","ca","CCD","","_","_"
4,"_","_","_","āśu","JJ","","_","_"
6,"_","_","_","ca","CCD","","_","_"
7,"_","_","_","eva","CEM","","_","_"
8,"manaso","_","_","manas","NC","","_","_"
9,"nava","_","_","navan","NUM","","_","_"
10,"vai","_","_","vai","CX","","_","_"
11,"guṇāḥ","_","_","guṇa","NC","","_","_"
1,"_","_","_","iṣ","PPP","","_","_"
2,"_","_","_","aniṣṭa","JJ","","_","_"
3,"_","_","_","vikalpa","NC","","_","_"
4,"_","_","_","ca","CCD","","_","_"
5,"vyavasāyaḥ","_","_","vyavasāya","NC","","_","_"
6,"_","_","_","samādhi","NC","","_","_"
1,"saṃśayaḥ","_","_","saṃśaya","NC","","_","_"
2,"_","_","_","pratipatti","NC","","_","_"
3,"_","_","_","ca","CCD","","_","_"
4,"buddhau","_","_","buddhi","NC","","_","_"
5,"_","_","_","pañcan","NUM","","_","_"
6,"_","_","_","iha","CAD","","_","_"
7,"ye","_","_","yad","PRL","","_","_"
8,"guṇāḥ","_","_","guṇa","NC","","_","_"
1,"yudhiṣṭhira","_","_","yudhiṣṭhira","NC","","_","_"
2,"uvāca","_","_","vak","V","vac","_","_"
1,"kathaṃ","_","_","katha","CX","","_","_"
2,"_","_","_","pañcan","NUM","","_","_"
3,"_","_","_","guṇa","NC","","_","_"
4,"buddhiḥ","_","_","buddhi","NC","","_","_"
5,"kathaṃ","_","_","katha","CX","","_","_"
6,"_","_","_","pañcan","NUM","","_","_"
7,"_","_","_","indriya","NC","","_","_"
8,"guṇāḥ","_","_","guṇa","NC","","_","_"
1,"_","_","_","tad","PRD","","_","_"
2,"_","_","_","mat","PPR","","_","_"
3,"sarvam","_","_","sarva","JQ","","_","_"
4,"ācakṣva","_","_","cakṣ","V","cakṣ","_","_"
5,"_","_","_","sūkṣma","JJ","","_","_"
6,"_","_","_","jñāna","NC","","_","_"
7,"pitāmaha","_","_","pitāmaha","NC","","_","_"
1,"bhīṣma","_","_","bhīṣma","NC","","_","_"
2,"uvāca","_","_","vak","V","vac","_","_"
1,"āhuḥ","_","_","ah","V","ah","_","_"
2,"ṣaṣṭiṃ","_","_","ṣaṣṭi","NC","","_","_"
3,"_","_","_","bhūta","NC","","_","_"
4,"_","_","_","guṇa","NC","","_","_"
5,"vai","_","_","vai","CX","","_","_"
6,"_","_","_","bhūta","NC","","_","_"
7,"_","_","_","viśiṣ","PPP","","_","_"
8,"_","_","_","nitya","JJ","","_","_"
9,"_","_","_","viṣañj","PPP","","_","_"
1,"_","_","_","bhūta","NC","","_","_"
2,"_","_","_","viṣañj","PPP","","_","_"
3,"_","_","_","ca","CCD","","_","_"
4,"_","_","_","akṣara","NC","","_","_"
5,"_","_","_","sṛj","PPP","","_","_"
6,"putra","_","_","putra","NC","","_","_"
7,"na","_","_","na","CNG","","_","_"
8,"nityaṃ","_","_","nitya","JJ","","_","_"
9,"tad","_","_","tad","PRD","","_","_"
10,"iha","_","_","iha","CAD","","_","_"
11,"vadanti","_","_","vad","V","vad","_","_"
1,"tat","_","_","tad","PRD","","_","_"
2,"putra","_","_","putra","NC","","_","_"
3,"_","_","_","cintā","NC","","_","_"
4,"_","_","_","kalay","PPP","","_","_"
5,"yad","_","_","yad","PRL","","_","_"
6,"uktam","_","_","vac","PPP","","_","_"
7,"anāgataṃ","_","_","anāgata","JJ","","_","_"
8,"vai","_","_","vai","CX","","_","_"
9,"tava","_","_","tvat","PPR","","_","_"
10,"_","_","_","samprati","CX","","_","_"
11,"_","_","_","iha","CAD","","_","_"
1,"_","_","_","bhūta","NC","","_","_"
2,"_","_","_","artha","NC","","_","_"
3,"_","_","_","tattva","NC","","_","_"
4,"tad","_","_","tad","PRD","","_","_"
5,"avāpya","_","_","avāp","CGDA","","_","_"
6,"sarvaṃ","_","_","sarva","JQ","","_","_"
7,"_","_","_","bhūta","NC","","_","_"
8,"_","_","_","prabhāva","NC","","_","_"
9,"bhava","_","_","bhav","V","bhū","_","_"
10,"_","_","_","śa","PPP","","_","_"
11,"_","_","_","buddhi","NC","","_","_"
