"WordID","word","NormSTEM","suffix","lemma","PoS","Root","NormSuffix","NormWord"
1,"yas","_","_","yad","PRL","","_","_"
2,"tvām","_","_","tvat","PPR","","_","_"
3,"agna","_","_","agni","NC","","_","_"
4,"inadhate","_","_","indh","V","indh","_","_"
5,"_","_","_","ya","PPP","","_","_"
6,"_","_","_","sruc","NC","","_","_"
7,"tris","_","_","tris","CX","","_","_"
8,"te","_","_","tvat","PPR","","_","_"
9,"annaṃ","_","_","anna","NC","","_","_"
10,"kṛṇavat","_","_","kar","V","kṛ","_","_"
11,"sasminn","_","_","tad","PRD","","_","_"
12,"ahan","_","_","ahar","NC","","_","_"
1,"sa","_","_","tad","PRD","","_","_"
2,"su","_","_","su","CAD","","_","_"
3,"dyumnair","_","_","dyumna","NC","","_","_"
4,"abhy","_","_","abhi","CADP","","_","_"
5,"astu","_","_","as","V","as","_","_"
6,"prasakṣat","_","_","prasah","KDP","","_","_"
7,"tava","_","_","tvat","PPR","","_","_"
8,"kratvā","_","_","kratu","NC","","_","_"
9,"jātavedaś","_","_","jātavedas","NC","","_","_"
10,"cikitvān","_","_","cit","KDP","","_","_"
1,"idhmaṃ","_","_","idhma","NC","","_","_"
2,"yas","_","_","yad","PRL","","_","_"
3,"te","_","_","tvat","PPR","","_","_"
4,"jabharac","_","_","bhṛ","V","bhṛ","_","_"
5,"chaśramāṇo","_","_","śra","KDP","","_","_"
6,"maho","_","_","mah","JJ","","_","_"
7,"agne","_","_","agni","NC","","_","_"
8,"anīkam","_","_","anīka","NC","","_","_"
9,"ā","_","_","ā","CADP","","_","_"
10,"saparyan","_","_","sapary","KDP","","_","_"
1,"sa","_","_","tad","PRD","","_","_"
2,"idhānaḥ","_","_","indh","KDP","","_","_"
3,"prati","_","_","prati","CADP","","_","_"
4,"doṣām","_","_","doṣā","NC","","_","_"
5,"uṣāsam","_","_","uṣas","NC","","_","_"
6,"puṣyan","_","_","puṣ","KDP","","_","_"
7,"rayiṃ","_","_","rayi","NC","","_","_"
8,"sacate","_","_","sac","V","sac","_","_"
9,"ghnann","_","_","han","KDP","","_","_"
10,"amitrān","_","_","amitra","NC","","_","_"
1,"agnir","_","_","agni","NC","","_","_"
2,"īśe","_","_","īś","V","īś","_","_"
3,"bṛhataḥ","_","_","bṛhat","JJ","","_","_"
4,"_","_","_","kṣatriya","NC","","_","_"
5,"_","_","_","agni","NC","","_","_"
6,"vājasya","_","_","vāja","NC","","_","_"
7,"paramasya","_","_","parama","JJ","","_","_"
8,"rāyaḥ","_","_","rai","NC","","_","_"
1,"dadhāti","_","_","dadh","V","dhā","_","_"
2,"ratnaṃ","_","_","ratna","NC","","_","_"
3,"vidhate","_","_","vidh","KDP","","_","_"
4,"yaviṣṭho","_","_","yaviṣṭha","JJ","","_","_"
5,"vy","_","_","vi","CADP","","_","_"
6,"ānuṣaṅ","_","_","ānuṣak","CX","","_","_"
7,"martyāya","_","_","martya","NC","","_","_"
8,"svadhāvān","_","_","svadhāvat","JJ","","_","_"
1,"yac","_","_","yat","CSB","","_","_"
2,"cid","_","_","cit","CEM","","_","_"
3,"dhi","_","_","hi","CX","","_","_"
4,"te","_","_","tvat","PPR","","_","_"
5,"puruṣatrā","_","_","puruṣatrā","CX","","_","_"
6,"_","_","_","yaviṣṭha","JJ","","_","_"
7,"_","_","_","acitti","NC","","_","_"
8,"cakṛmā","_","_","kar","V","kṛ","_","_"
9,"kac","_","_","kiṃ","PRQ","","_","_"
10,"cid","_","_","cit","CEM","","_","_"
11,"āgaḥ","_","_","āgas","NC","","_","_"
1,"kṛdhī","_","_","kar","V","kṛ","_","_"
2,"ṣv","_","_","su","CAD","","_","_"
3,"asmāṁ","_","_","mat","PPR","","_","_"
4,"aditer","_","_","aditi","NC","","_","_"
5,"anāgān","_","_","anāga","JJ","","_","_"
6,"vy","_","_","vi","CADP","","_","_"
7,"enāṃsi","_","_","enas","NC","","_","_"
8,"śiśratho","_","_","śrath","V","śrath","_","_"
9,"viṣvag","_","_","viṣvañc","JJ","","_","_"
10,"agne","_","_","agni","NC","","_","_"
1,"mahaś","_","_","mah","JJ","","_","_"
2,"cid","_","_","cit","CEM","","_","_"
3,"agna","_","_","agni","NC","","_","_"
4,"enaso","_","_","enas","NC","","_","_"
5,"abhīka","_","_","abhīka","NC","","_","_"
6,"ūrvād","_","_","ūrva","NC","","_","_"
7,"devānām","_","_","deva","NC","","_","_"
8,"uta","_","_","uta","CCD","","_","_"
9,"martyānām","_","_","martya","NC","","_","_"
1,"mā","_","_","mā","CNG","","_","_"
2,"te","_","_","tvat","PPR","","_","_"
3,"sakhāyaḥ","_","_","sakhi","NC","","_","_"
4,"sadam","_","_","sada","CAD","","_","_"
5,"id","_","_","id","CEM","","_","_"
6,"riṣāma","_","_","riṣ","V","riṣ","_","_"
7,"yacchā","_","_","yacchā","V","ya","_","_"
8,"tokāya","_","_","toka","NC","","_","_"
9,"tanayāya","_","_","tanaya","JJ","","_","_"
10,"śaṃ","_","_","śa","NC","","_","_"
11,"yoḥ","_","_","yos","NC","","_","_"
1,"yathā","_","_","yathā","CCM","","_","_"
2,"ha","_","_","ha","CEM","","_","_"
3,"tyad","_","_","tya","PRD","","_","_"
4,"vasavo","_","_","vasu","NC","","_","_"
5,"gauryaṃ","_","_","gaurī","NC","","_","_"
6,"cit","_","_","cit","CEM","","_","_"
7,"padi","_","_","pad","NC","","_","_"
8,"ṣitām","_","_","sā","PPP","","_","_"
9,"amuñcatā","_","_","muñc","V","muc","_","_"
10,"yajatrāḥ","_","_","yajatra","JJ","","_","_"
1,"_","_","_","eva","CEM","","_","_"
2,"_","_","_","u","CEM","","_","_"
3,"ṣv","_","_","su","CAD","","_","_"
4,"asman","_","_","mat","PPR","","_","_"
5,"muñcatā","_","_","muñc","V","muc","_","_"
6,"vy","_","_","vi","CADP","","_","_"
7,"aṃhaḥ","_","_","aṃhas","NC","","_","_"
8,"pra","_","_","pra","CADP","","_","_"
9,"tāry","_","_","tar","V","tṛ","_","_"
10,"agne","_","_","agni","NC","","_","_"
11,"prataraṃ","_","_","pratara","CX","","_","_"
12,"na","_","_","mat","PPR","","_","_"
13,"āyuḥ","_","_","āyus","NC","","_","_"
