"WordID","word","NormSTEM","suffix","lemma","PoS","Root","NormSuffix","NormWord"
1,"vaiśampāyana","_","_","vaiśampāyana","NC","","_","_"
2,"uvāca","_","_","vak","V","vac","_","_"
1,"prabhātāyāṃ","_","_","prabhā","PPP","","_","_"
2,"tu","_","_","tu","CCD","","_","_"
3,"śarvaryāṃ","_","_","śarvarī","NC","","_","_"
4,"teṣām","_","_","tad","PRD","","_","_"
5,"a","_","_","alpha_privativum","JJ","","_","_"
5,"_","_","_","kliṣṭa","JJ","","_","_"
6,"_","_","_","karman","NC","","_","_"
1,"vanaṃ","_","_","vana","NC","","_","_"
2,"yiyāsatāṃ","_","_","yiyās","KDP","","_","_"
3,"viprās","_","_","vipra","NC","","_","_"
4,"tasthur","_","_","tiṣṭh","V","sthā","_","_"
5,"_","_","_","bhikṣā","NC","","_","_"
6,"_","_","_","bhuj","JJ","","_","_"
7,"'grataḥ","_","_","agratas","CX","","_","_"
1,"tān","_","_","tad","PRD","","_","_"
2,"uvāca","_","_","vak","V","vac","_","_"
3,"tato","_","_","tatas","CX","","_","_"
4,"rājā","_","_","rājan","NC","","_","_"
5,"_","_","_","kuntī","NC","","_","_"
6,"_","_","_","putra","NC","","_","_"
7,"yudhiṣṭhiraḥ","_","_","yudhiṣṭhira","NC","","_","_"
1,"vayaṃ","_","_","mat","PPR","","_","_"
2,"hi","_","_","hi","CX","","_","_"
3,"_","_","_","hṛ","PPP","","_","_"
4,"_","_","_","sarvasva","NC","","_","_"
5,"_","_","_","hṛ","PPP","","_","_"
6,"_","_","_","rājya","NC","","_","_"
7,"_","_","_","hṛ","PPP","","_","_"
8,"_","_","_","śrī","NC","","_","_"
1,"_","_","_","phala","NC","","_","_"
2,"_","_","_","mūla","NC","","_","_"
3,"_","_","_","āmiṣa","NC","","_","_"
4,"_","_","_","āhāra","NC","","_","_"
5,"vanaṃ","_","_","vana","NC","","_","_"
6,"yāsyāma","_","_","yā","V","yā","_","_"
7,"duḥkhitāḥ","_","_","duḥkhita","JJ","","_","_"
1,"vanaṃ","_","_","vana","NC","","_","_"
2,"ca","_","_","ca","CCD","","_","_"
3,"_","_","_","doṣa","NC","","_","_"
4,"_","_","_","bahula","JJ","","_","_"
5,"_","_","_","bahu","JJ","","_","_"
6,"_","_","_","vyāla","NC","","_","_"
7,"_","_","_","sarīsṛpa","NC","","_","_"
1,"parikleśaś","_","_","parikleśa","NC","","_","_"
2,"ca","_","_","ca","CCD","","_","_"
3,"vo","_","_","tvat","PPR","","_","_"
4,"manye","_","_","man","V","man","_","_"
5,"dhruvaṃ","_","_","dhruva","CX","","_","_"
6,"tatra","_","_","tatra","CAD","","_","_"
7,"bhaviṣyati","_","_","bhav","V","bhū","_","_"
1,"brāhmaṇānāṃ","_","_","brāhmaṇa","NC","","_","_"
2,"parikleśo","_","_","parikleśa","NC","","_","_"
3,"_","_","_","daivata","NC","","_","_"
4,"_","_","_","api","CX","","_","_"
5,"sādayet","_","_","sīd","V","sad","_","_"
1,"kiṃ","_","_","kiṃ","PRQ","","_","_"
2,"punar","_","_","punar","CAD","","_","_"
3,"mām","_","_","mat","PPR","","_","_"
4,"ito","_","_","itas","CX","","_","_"
5,"viprā","_","_","vipra","NC","","_","_"
6,"nivartadhvaṃ","_","_","nivart","V","nivṛt","_","_"
7,"yatheṣṭataḥ","_","_","yatheṣṭa","JJ","","_","_"
1,"brāhmaṇā","_","_","brāhmaṇa","NC","","_","_"
2,"ūcuḥ","_","_","vak","V","vac","_","_"
1,"gatir","_","_","gati","NC","","_","_"
2,"yā","_","_","yad","PRL","","_","_"
3,"bhavatāṃ","_","_","bhavat","JJ","","_","_"
4,"rājaṃs","_","_","rājan","NC","","_","_"
5,"tāṃ","_","_","tad","PRD","","_","_"
6,"vayaṃ","_","_","mat","PPR","","_","_"
7,"gantum","_","_","ga","CGDI","","_","_"
8,"udyatāḥ","_","_","udya","PPP","","_","_"
1,"_","_","_","na","CNG","","_","_"
2,"_","_","_","arh","V","arh","_","_"
3,"_","_","_","mat","PPR","","_","_"
4,"parityaktuṃ","_","_","parityaj","CGDI","","_","_"
5,"bhaktān","_","_","bhakta","NC","","_","_"
6,"_","_","_","saddharma","NC","","_","_"
7,"_","_","_","darśin","JJ","","_","_"
1,"anukampāṃ","_","_","anukampā","NC","","_","_"
2,"hi","_","_","hi","CX","","_","_"
3,"bhakteṣu","_","_","bhakta","NC","","_","_"
4,"daivatāny","_","_","daivata","NC","","_","_"
5,"api","_","_","api","CX","","_","_"
6,"kurvate","_","_","kar","V","kṛ","_","_"
1,"viśeṣato","_","_","viśeṣataḥ","CX","","_","_"
2,"brāhmaṇeṣu","_","_","brāhmaṇa","NC","","_","_"
3,"_","_","_","sadācāra","NC","","_","_"
4,"_","_","_","avalambin","JJ","","_","_"
1,"yudhiṣṭhira","_","_","yudhiṣṭhira","NC","","_","_"
2,"uvāca","_","_","vak","V","vac","_","_"
1,"_","_","_","mat","PPR","","_","_"
2,"_","_","_","api","CX","","_","_"
3,"paramā","_","_","parama","JJ","","_","_"
4,"bhaktir","_","_","bhakti","NC","","_","_"
5,"brāhmaṇeṣu","_","_","brāhmaṇa","NC","","_","_"
6,"sadā","_","_","sadā","CAD","","_","_"
7,"dvijāḥ","_","_","dvija","NC","","_","_"
1,"_","_","_","sahāya","NC","","_","_"
2,"_","_","_","viparibhraṃśa","NC","","_","_"
3,"tv","_","_","tu","CCD","","_","_"
4,"ayaṃ","_","_","ida","PRD","","_","_"
5,"_","_","_","sāday","V","sāday","_","_"
6,"_","_","_","iva","CCM","","_","_"
7,"mām","_","_","mat","PPR","","_","_"
1,"āhareyur","_","_","āhar","V","āhṛ","_","_"
2,"hi","_","_","hi","CX","","_","_"
3,"me","_","_","mat","PPR","","_","_"
4,"ye","_","_","yad","PRL","","_","_"
5,"'pi","_","_","api","CX","","_","_"
6,"_","_","_","phala","NC","","_","_"
7,"_","_","_","mūla","NC","","_","_"
8,"_","_","_","mṛga","NC","","_","_"
9,"tathā","_","_","tathā","CX","","_","_"
1,"ta","_","_","tad","PRD","","_","_"
2,"ime","_","_","ida","PRD","","_","_"
3,"_","_","_","śoka","NC","","_","_"
4,"_","_","_","ja","JJ","","_","_"
5,"duḥkhair","_","_","duḥkha","NC","","_","_"
6,"bhrātaro","_","_","bhrātṛ","NC","","_","_"
7,"me","_","_","mat","PPR","","_","_"
8,"vimohitāḥ","_","_","vimohay","PPP","","_","_"
1,"draupadyā","_","_","draupadī","NC","","_","_"
2,"viprakarṣeṇa","_","_","viprakarṣa","NC","","_","_"
3,"_","_","_","rājya","NC","","_","_"
4,"_","_","_","apaharaṇa","NC","","_","_"
5,"ca","_","_","ca","CCD","","_","_"
1,"_","_","_","duḥkha","NC","","_","_"
2,"_","_","_","anvita","JJ","","_","_"
3,"imān","_","_","ida","PRD","","_","_"
4,"kleśair","_","_","kleśa","NC","","_","_"
5,"_","_","_","na","CNG","","_","_"
6,"_","_","_","mat","PPR","","_","_"
7,"yoktum","_","_","yuj","CGDI","","_","_"
8,"_","_","_","iha","CAD","","_","_"
9,"_","_","_","utsah","V","utsah","_","_"
1,"brāhmaṇā","_","_","brāhmaṇa","NC","","_","_"
2,"ūcuḥ","_","_","vak","V","vac","_","_"
1,"_","_","_","mat","PPR","","_","_"
2,"_","_","_","poṣaṇa","NC","","_","_"
3,"_","_","_","ja","JJ","","_","_"
4,"cintā","_","_","cintā","NC","","_","_"
5,"mā","_","_","mā","CNG","","_","_"
6,"bhūt","_","_","bhav","V","bhū","_","_"
7,"te","_","_","tad","PRD","","_","_"
8,"hṛdi","_","_","hṛd","NC","","_","_"
9,"pārthiva","_","_","pārthiva","NC","","_","_"
1,"svayam","_","_","svaya","CX","","_","_"
2,"āhṛtya","_","_","āhṛ","CGDA","","_","_"
3,"vanyāni","_","_","vanya","NC","","_","_"
4,"anuyāsyāmahe","_","_","anuyā","V","anuyā","_","_"
5,"vayam","_","_","mat","PPR","","_","_"
1,"anudhyānena","_","_","anudhyāna","NC","","_","_"
2,"japyena","_","_","japya","NC","","_","_"
3,"vidhāsyāmaḥ","_","_","vidadh","V","vidhā","_","_"
4,"śivaṃ","_","_","śiva","NC","","_","_"
5,"tava","_","_","tvat","PPR","","_","_"
1,"kathābhiś","_","_","kathā","NC","","_","_"
2,"_","_","_","ca","CCD","","_","_"
3,"_","_","_","anukūla","JJ","","_","_"
4,"saha","_","_","saha","CX","","_","_"
5,"raṃsyāmahe","_","_","ra","V","ra","_","_"
6,"vane","_","_","vana","NC","","_","_"
1,"yudhiṣṭhira","_","_","yudhiṣṭhira","NC","","_","_"
2,"uvāca","_","_","vak","V","vac","_","_"
1,"evam","_","_","eva","CX","","_","_"
2,"etan","_","_","tad","PRD","","_","_"
3,"na","_","_","na","CNG","","_","_"
4,"saṃdeho","_","_","saṃdeha","NC","","_","_"
5,"rameyaṃ","_","_","ra","V","ra","_","_"
6,"brāhmaṇaiḥ","_","_","brāhmaṇa","NC","","_","_"
7,"saha","_","_","saha","CX","","_","_"
1,"nyūnabhāvāt","_","_","nyūnabhāva","NC","","_","_"
2,"tu","_","_","tu","CCD","","_","_"
3,"paśyāmi","_","_","paś","V","paś","_","_"
4,"pratyādeśam","_","_","pratyādeśa","NC","","_","_"
5,"_","_","_","iva","CCM","","_","_"
6,"_","_","_","ātman","NC","","_","_"
1,"kathaṃ","_","_","katha","CX","","_","_"
2,"drakṣyāmi","_","_","darś","V","dṛś","_","_"
3,"vaḥ","_","_","tvat","PPR","","_","_"
4,"sarvān","_","_","sarva","JQ","","_","_"
5,"svayam","_","_","svaya","CX","","_","_"
6,"_","_","_","āhṛ","PPP","","_","_"
7,"_","_","_","bhojana","NC","","_","_"
1,"_","_","_","mat","PPR","","_","_"
2,"_","_","_","bhakti","NC","","_","_"
3,"kliśyato","_","_","kliś","KDP","","_","_"
4,"'narhān","_","_","anarha","JJ","","_","_"
5,"dhik","_","_","pāpa","JJ","","_","_"
6,"_","_","_","dhṛtarāṣṭra","NC","","_","_"
7,"_","_","_","ja","JJ","","_","_"
1,"vaiśampāyana","_","_","vaiśampāyana","NC","","_","_"
2,"uvāca","_","_","vak","V","vac","_","_"
1,"ity","_","_","iti","CQT","","_","_"
2,"uktvā","_","_","vac","CGDA","","_","_"
3,"sa","_","_","tad","PRD","","_","_"
4,"nṛpaḥ","_","_","nṛpa","NC","","_","_"
5,"śocan","_","_","śuc","KDP","","_","_"
6,"niṣasāda","_","_","niṣad","V","niṣad","_","_"
7,"_","_","_","mahī","NC","","_","_"
8,"_","_","_","tala","NC","","_","_"
1,"tam","_","_","tad","PRD","","_","_"
2,"_","_","_","adhyātma","NC","","_","_"
3,"_","_","_","rati","NC","","_","_"
4,"vidvāñ","_","_","vidvas","JJ","","_","_"
5,"śaunako","_","_","śaunaka","NC","","_","_"
6,"nāma","_","_","nāma","CX","","_","_"
7,"vai","_","_","vai","CX","","_","_"
8,"dvijaḥ","_","_","dvija","NC","","_","_"
1,"yoge","_","_","yoga","NC","","_","_"
2,"sāṃkhye","_","_","sāṃkhya","NC","","_","_"
3,"ca","_","_","ca","CCD","","_","_"
4,"kuśalo","_","_","kuśala","JJ","","_","_"
5,"rājānam","_","_","rājan","NC","","_","_"
6,"idam","_","_","ida","PRD","","_","_"
7,"abravīt","_","_","abravīta","V","brū","_","_"
1,"_","_","_","śoka","NC","","_","_"
2,"_","_","_","sthāna","NC","","_","_"
3,"_","_","_","sahasra","NUM","","_","_"
4,"_","_","_","bhaya","NC","","_","_"
5,"_","_","_","sthāna","NC","","_","_"
6,"_","_","_","śata","NUM","","_","_"
7,"ca","_","_","ca","CCD","","_","_"
1,"divase","_","_","divasa","NC","","_","_"
2,"divase","_","_","divasa","NC","","_","_"
3,"mūḍham","_","_","muh","PPP","","_","_"
4,"āviśanti","_","_","āviś","V","āviś","_","_"
5,"na","_","_","na","CNG","","_","_"
6,"paṇḍitam","_","_","paṇḍita","NC","","_","_"
1,"na","_","_","na","CNG","","_","_"
2,"hi","_","_","hi","CX","","_","_"
3,"_","_","_","jñāna","NC","","_","_"
4,"_","_","_","virudh","PPP","","_","_"
5,"_","_","_","bahu","JJ","","_","_"
6,"_","_","_","doṣa","NC","","_","_"
7,"karmasu","_","_","karman","NC","","_","_"
1,"_","_","_","śreyas","NC","","_","_"
2,"_","_","_","ghātin","JJ","","_","_"
3,"sajjante","_","_","sañj","V","sañj","_","_"
4,"buddhimanto","_","_","buddhimat","JJ","","_","_"
5,"bhavadvidhāḥ","_","_","bhavadvidha","JJ","","_","_"
1,"aṣṭāṅgāṃ","_","_","aṣṭāṅga","JJ","","_","_"
2,"buddhim","_","_","buddhi","NC","","_","_"
3,"āhur","_","_","ah","V","ah","_","_"
4,"yāṃ","_","_","yad","PRL","","_","_"
5,"_","_","_","sarva","JQ","","_","_"
6,"_","_","_","aśreyas","JJ","","_","_"
7,"_","_","_","vighātin","JJ","","_","_"
1,"_","_","_","śruti","NC","","_","_"
2,"_","_","_","smṛti","NC","","_","_"
3,"_","_","_","samāyuj","PPP","","_","_"
4,"sā","_","_","tad","PRD","","_","_"
5,"rājaṃs","_","_","rājan","NC","","_","_"
6,"tvayy","_","_","tvat","PPR","","_","_"
7,"avasthitā","_","_","avasthā","PPP","","_","_"
1,"_","_","_","artha","NC","","_","_"
2,"_","_","_","kṛcchra","NC","","_","_"
3,"durgeṣu","_","_","durga","NC","","_","_"
4,"vyāpatsu","_","_","vyāpad","NC","","_","_"
5,"_","_","_","sva","JJ","","_","_"
6,"_","_","_","jana","NC","","_","_"
7,"ca","_","_","ca","CCD","","_","_"
1,"_","_","_","śārīra","JJ","","_","_"
2,"_","_","_","mānasa","JJ","","_","_"
3,"duḥkhair","_","_","duḥkha","NC","","_","_"
4,"na","_","_","na","CNG","","_","_"
5,"sīdanti","_","_","sīd","V","sad","_","_"
6,"bhavadvidhāḥ","_","_","bhavadvidha","JJ","","_","_"
1,"śrūyatāṃ","_","_","śṛṇ","V","śru","_","_"
2,"_","_","_","ca","CCD","","_","_"
3,"_","_","_","abhidadh","V","abhidhā","_","_"
4,"janakena","_","_","janaka","NC","","_","_"
5,"yathā","_","_","yathā","CCM","","_","_"
6,"purā","_","_","purā","CX","","_","_"
1,"_","_","_","ātman","NC","","_","_"
2,"_","_","_","vyavasthāna","NC","","_","_"
3,"_","_","_","kara","JJ","","_","_"
4,"gītāḥ","_","_","gā","PPP","","_","_"
5,"ślokā","_","_","śloka","NC","","_","_"
6,"mahātmanā","_","_","mahātman","JJ","","_","_"
1,"_","_","_","manas","NC","","_","_"
2,"_","_","_","deha","NC","","_","_"
3,"_","_","_","samuttha","JJ","","_","_"
4,"duḥkhābhyām","_","_","duḥkha","NC","","_","_"
5,"arditaṃ","_","_","arday","PPP","","_","_"
6,"jagat","_","_","jagat","NC","","_","_"
1,"tayor","_","_","tad","PRD","","_","_"
2,"_","_","_","vyāsa","NC","","_","_"
3,"_","_","_","samāsa","NC","","_","_"
4,"_","_","_","śama","NC","","_","_"
5,"_","_","_","upāya","NC","","_","_"
6,"imaṃ","_","_","ida","PRD","","_","_"
7,"śṛṇu","_","_","śṛṇ","V","śru","_","_"
1,"vyādher","_","_","vyādhi","NC","","_","_"
2,"_","_","_","aniṣṭa","JJ","","_","_"
3,"_","_","_","saṃsparśa","NC","","_","_"
4,"chramād","_","_","śrama","NC","","_","_"
5,"_","_","_","iṣ","PPP","","_","_"
6,"_","_","_","vivarjana","NC","","_","_"
1,"duḥkhaṃ","_","_","duḥkha","NC","","_","_"
2,"caturbhiḥ","_","_","catur","NUM","","_","_"
3,"śārīraṃ","_","_","śārīra","JJ","","_","_"
4,"kāraṇaiḥ","_","_","kāraṇa","NC","","_","_"
5,"sampravartate","_","_","saṃpravart","V","saṃpravṛt","_","_"
1,"tad","_","_","tad","PRD","","_","_"
2,"_","_","_","āśu","JJ","","_","_"
3,"_","_","_","pratikāra","NC","","_","_"
4,"ca","_","_","ca","CCD","","_","_"
5,"satataṃ","_","_","satata","CX","","_","_"
6,"_","_","_","ca","CCD","","_","_"
7,"_","_","_","avicintana","NC","","_","_"
1,"_","_","_","ādhi","NC","","_","_"
2,"_","_","_","vyādhi","NC","","_","_"
3,"_","_","_","praśamana","JJ","","_","_"
4,"_","_","_","kriyā","NC","","_","_"
5,"_","_","_","yoga","NC","","_","_"
6,"_","_","_","dvaya","NC","","_","_"
7,"tu","_","_","tu","CCD","","_","_"
1,"matimanto","_","_","matimat","JJ","","_","_"
2,"_","_","_","hi","CX","","_","_"
3,"_","_","_","atas","CX","","_","_"
4,"vaidyāḥ","_","_","vaidya","NC","","_","_"
5,"śamaṃ","_","_","śama","NC","","_","_"
6,"prāg","_","_","prāñc","JJ","","_","_"
7,"eva","_","_","eva","CEM","","_","_"
8,"kurvate","_","_","kar","V","kṛ","_","_"
1,"mānasasya","_","_","mānasa","JJ","","_","_"
2,"_","_","_","priya","JJ","","_","_"
3,"_","_","_","ākhyāna","NC","","_","_"
4,"_","_","_","sambhoga","NC","","_","_"
5,"_","_","_","upanaya","NC","","_","_"
6,"nṛṇām","_","_","nṛ","NC","","_","_"
1,"mānasena","_","_","mānasa","JJ","","_","_"
2,"hi","_","_","hi","CX","","_","_"
3,"duḥkhena","_","_","duḥkha","NC","","_","_"
4,"śarīram","_","_","śarīra","NC","","_","_"
5,"upatapyate","_","_","upatap","V","upatap","_","_"
1,"_","_","_","ayas","NC","","_","_"
2,"_","_","_","piṇḍa","NC","","_","_"
3,"taptena","_","_","tap","PPP","","_","_"
4,"_","_","_","kumbha","NC","","_","_"
5,"_","_","_","saṃstha","JJ","","_","_"
6,"_","_","_","iva","CCM","","_","_"
7,"_","_","_","udaka","NC","","_","_"
1,"mānasaṃ","_","_","mānasa","JJ","","_","_"
2,"śamayet","_","_","śam","V","śam","_","_"
3,"tasmāj","_","_","tad","PRD","","_","_"
4,"_","_","_","jñāna","NC","","_","_"
5,"_","_","_","agni","NC","","_","_"
6,"_","_","_","iva","CCM","","_","_"
7,"_","_","_","ambu","NC","","_","_"
1,"praśānte","_","_","praśa","PPP","","_","_"
2,"mānase","_","_","mānasa","JJ","","_","_"
3,"duḥkhe","_","_","duḥkha","NC","","_","_"
4,"śārīram","_","_","śārīra","JJ","","_","_"
5,"upaśāmyati","_","_","upaśa","V","upaśa","_","_"
1,"manaso","_","_","manas","NC","","_","_"
2,"_","_","_","duḥkha","NC","","_","_"
3,"_","_","_","mūla","NC","","_","_"
4,"tu","_","_","tu","CCD","","_","_"
5,"sneha","_","_","sneha","NC","","_","_"
6,"ity","_","_","iti","CQT","","_","_"
7,"upalabhyate","_","_","upalabh","V","upalabh","_","_"
1,"snehāt","_","_","sneha","NC","","_","_"
2,"tu","_","_","tu","CCD","","_","_"
3,"sajjate","_","_","sañj","V","sañj","_","_"
4,"jantur","_","_","jantu","NC","","_","_"
5,"_","_","_","duḥkha","NC","","_","_"
6,"_","_","_","yoga","NC","","_","_"
7,"upaiti","_","_","upai","V","upe","_","_"
8,"ca","_","_","ca","CCD","","_","_"
1,"_","_","_","sneha","NC","","_","_"
2,"_","_","_","mūla","NC","","_","_"
3,"duḥkhāni","_","_","duḥkha","NC","","_","_"
4,"_","_","_","sneha","NC","","_","_"
5,"_","_","_","ja","JJ","","_","_"
6,"bhayāni","_","_","bhaya","NC","","_","_"
7,"ca","_","_","ca","CCD","","_","_"
1,"_","_","_","śoka","NC","","_","_"
2,"_","_","_","harṣa","NC","","_","_"
3,"_","_","_","tathā","CX","","_","_"
4,"_","_","_","āyāsa","NC","","_","_"
5,"sarvaṃ","_","_","sarva","JQ","","_","_"
6,"snehāt","_","_","sneha","NC","","_","_"
7,"pravartate","_","_","pravart","V","pravṛt","_","_"
1,"snehāt","_","_","sneha","NC","","_","_"
2,"_","_","_","karaṇa","NC","","_","_"
3,"_","_","_","rāga","NC","","_","_"
4,"ca","_","_","ca","CCD","","_","_"
5,"prajajñe","_","_","prajan","V","prajan","_","_"
6,"vaiṣayas","_","_","vaiṣaya","JJ","","_","_"
7,"tathā","_","_","tathā","CX","","_","_"
1,"aśreyaskāv","_","_","aśreyaska","JJ","","_","_"
2,"ubhāv","_","_","ubh","PPX","","_","_"
3,"etau","_","_","tad","PRD","","_","_"
4,"pūrvas","_","_","pūrva","PPX","","_","_"
5,"tatra","_","_","tatra","CAD","","_","_"
6,"guruḥ","_","_","guru","JJ","","_","_"
7,"smṛtaḥ","_","_","smṛ","PPP","","_","_"
1,"_","_","_","koṭara","NC","","_","_"
2,"_","_","_","agni","NC","","_","_"
3,"_","_","_","yathā","CCM","","_","_"
4,"_","_","_","aśeṣa","JJ","","_","_"
5,"samūlaṃ","_","_","samūla","JJ","","_","_"
6,"pādapaṃ","_","_","pādapa","NC","","_","_"
7,"dahet","_","_","dah","V","dah","_","_"
1,"_","_","_","dharma","NC","","_","_"
2,"_","_","_","arthin","JJ","","_","_"
3,"_","_","_","tathā","CX","","_","_"
4,"_","_","_","alpa","JJ","","_","_"
5,"'pi","_","_","api","CX","","_","_"
6,"_","_","_","rāga","NC","","_","_"
7,"_","_","_","doṣa","NC","","_","_"
8,"vināśayet","_","_","vinaś","V","vinaś","_","_"
1,"viprayoge","_","_","viprayoga","NC","","_","_"
2,"na","_","_","na","CNG","","_","_"
3,"tu","_","_","tu","CCD","","_","_"
4,"tyāgī","_","_","tyāgin","JJ","","_","_"
5,"_","_","_","doṣa","NC","","_","_"
6,"_","_","_","darśin","JJ","","_","_"
7,"samāgamāt","_","_","samāgama","NC","","_","_"
1,"virāgaṃ","_","_","virāga","NC","","_","_"
2,"bhajate","_","_","bhaj","V","bhaj","_","_"
3,"jantur","_","_","jantu","NC","","_","_"
4,"nirvairo","_","_","nirvaira","JJ","","_","_"
5,"niṣparigrahaḥ","_","_","niṣparigraha","JJ","","_","_"
1,"tasmāt","_","_","tad","PRD","","_","_"
2,"snehaṃ","_","_","sneha","NC","","_","_"
3,"_","_","_","sva","JJ","","_","_"
4,"_","_","_","pakṣa","NC","","_","_"
5,"mitrebhyo","_","_","mitra","NC","","_","_"
6,"_","_","_","dhana","NC","","_","_"
7,"_","_","_","saṃcaya","NC","","_","_"
1,"_","_","_","sva","JJ","","_","_"
2,"_","_","_","śarīra","NC","","_","_"
3,"_","_","_","samuttha","JJ","","_","_"
4,"tu","_","_","tu","CCD","","_","_"
5,"jñānena","_","_","jñāna","NC","","_","_"
6,"vinivartayet","_","_","vinivart","V","vinivṛt","_","_"
1,"_","_","_","jñāna","NC","","_","_"
2,"_","_","_","anvita","JJ","","_","_"
3,"mukhyeṣu","_","_","mukhya","JJ","","_","_"
4,"_","_","_","śāstra","NC","","_","_"
5,"_","_","_","jña","JJ","","_","_"
6,"kṛtātmasu","_","_","kṛtātman","JJ","","_","_"
1,"na","_","_","na","CNG","","_","_"
2,"teṣu","_","_","tad","PRD","","_","_"
3,"sajjate","_","_","sañj","V","sañj","_","_"
4,"snehaḥ","_","_","sneha","NC","","_","_"
5,"_","_","_","padma","NC","","_","_"
6,"_","_","_","pattra","NC","","_","_"
7,"_","_","_","iva","CCM","","_","_"
8,"_","_","_","udaka","NC","","_","_"
1,"_","_","_","rāga","NC","","_","_"
2,"_","_","_","abhibhū","PPP","","_","_"
3,"puruṣaḥ","_","_","puruṣa","NC","","_","_"
4,"kāmena","_","_","kāma","NC","","_","_"
5,"parikṛṣyate","_","_","parikṛṣ","V","parikṛṣ","_","_"
1,"icchā","_","_","icchā","NC","","_","_"
2,"saṃjāyate","_","_","saṃjan","V","saṃjan","_","_"
3,"tasya","_","_","tad","PRD","","_","_"
4,"tatas","_","_","tatas","CX","","_","_"
5,"tṛṣṇā","_","_","tṛṣṇā","NC","","_","_"
6,"pravartate","_","_","pravart","V","pravṛt","_","_"
1,"tṛṣṇā","_","_","tṛṣṇā","NC","","_","_"
2,"hi","_","_","hi","CX","","_","_"
3,"_","_","_","sarva","JQ","","_","_"
4,"_","_","_","pāpiṣṭha","JJ","","_","_"
5,"_","_","_","nitya","JJ","","_","_"
6,"_","_","_","udvega","NC","","_","_"
7,"_","_","_","kara","JJ","","_","_"
8,"nṛṇām","_","_","nṛ","NC","","_","_"
1,"_","_","_","adharma","NC","","_","_"
2,"_","_","_","bahula","JJ","","_","_"
3,"_","_","_","ca","CCD","","_","_"
4,"_","_","_","eva","CEM","","_","_"
5,"ghorā","_","_","ghora","JJ","","_","_"
6,"_","_","_","pāpa","NC","","_","_"
7,"_","_","_","anubandhin","JJ","","_","_"
1,"yā","_","_","yad","PRL","","_","_"
2,"dustyajā","_","_","dustyaja","JJ","","_","_"
3,"durmatibhir","_","_","durmati","JJ","","_","_"
4,"yā","_","_","yad","PRL","","_","_"
5,"na","_","_","na","CNG","","_","_"
6,"jīryati","_","_","jar","V","jṛ","_","_"
7,"jīryataḥ","_","_","jṛ","KDP","","_","_"
1,"yo","_","_","yad","PRL","","_","_"
2,"'sau","_","_","adas","PRD","","_","_"
3,"prāṇāntiko","_","_","prāṇāntika","JJ","","_","_"
4,"rogas","_","_","roga","NC","","_","_"
5,"tāṃ","_","_","tad","PRD","","_","_"
6,"tṛṣṇāṃ","_","_","tṛṣṇā","NC","","_","_"
7,"tyajataḥ","_","_","tyaj","KDP","","_","_"
8,"sukham","_","_","sukha","NC","","_","_"
1,"anādyantā","_","_","anādyanta","JJ","","_","_"
2,"tu","_","_","tu","CCD","","_","_"
3,"sā","_","_","tad","PRD","","_","_"
4,"tṛṣṇā","_","_","tṛṣṇā","NC","","_","_"
5,"_","_","_","antar","CAD","","_","_"
6,"_","_","_","deha","NC","","_","_"
7,"_","_","_","ga","PPP","","_","_"
8,"nṛṇām","_","_","nṛ","NC","","_","_"
1,"vināśayati","_","_","vinaś","V","vinaś","_","_"
2,"sambhūtā","_","_","sambhū","PPP","","_","_"
3,"ayonija","_","_","ayonija","JJ","","_","_"
4,"_","_","_","iva","CCM","","_","_"
5,"_","_","_","anala","NC","","_","_"
1,"_","_","_","yathā","CCM","","_","_"
2,"_","_","_","edhas","NC","","_","_"
3,"_","_","_","sva","JJ","","_","_"
4,"_","_","_","samuttha","JJ","","_","_"
5,"vahninā","_","_","vahni","NC","","_","_"
6,"nāśam","_","_","nāśa","NC","","_","_"
7,"ṛcchati","_","_","ṛch","V","ṛch","_","_"
1,"_","_","_","tathā","CX","","_","_"
2,"_","_","_","akṛtātman","JJ","","_","_"
3,"lobhena","_","_","lobha","NC","","_","_"
4,"sahajena","_","_","sahaja","JJ","","_","_"
5,"vinaśyati","_","_","vinaś","V","vinaś","_","_"
1,"rājataḥ","_","_","rājan","NC","","_","_"
2,"salilād","_","_","salila","NC","","_","_"
3,"agneś","_","_","agni","NC","","_","_"
4,"corataḥ","_","_","cora","NC","","_","_"
5,"_","_","_","sva","JJ","","_","_"
6,"_","_","_","jana","NC","","_","_"
7,"api","_","_","api","CX","","_","_"
1,"bhayam","_","_","bhaya","NC","","_","_"
2,"arthavatāṃ","_","_","arthavat","JJ","","_","_"
3,"nityaṃ","_","_","nitya","JJ","","_","_"
4,"mṛtyoḥ","_","_","mṛtyu","NC","","_","_"
5,"prāṇabhṛtām","_","_","prāṇabhṛt","JJ","","_","_"
6,"iva","_","_","iva","CCM","","_","_"
1,"yathā","_","_","yathā","CCM","","_","_"
2,"hy","_","_","hi","CX","","_","_"
3,"āmiṣam","_","_","āmiṣa","NC","","_","_"
4,"ākāśe","_","_","ākāśa","NC","","_","_"
5,"pakṣibhiḥ","_","_","pakṣin","NC","","_","_"
6,"śvāpadair","_","_","śvāpada","NC","","_","_"
7,"bhuvi","_","_","bhū","NC","","_","_"
1,"bhakṣyate","_","_","bhaj","V","bhaj","_","_"
2,"salile","_","_","salila","NC","","_","_"
3,"matsyais","_","_","matsya","NC","","_","_"
4,"tathā","_","_","tathā","CX","","_","_"
5,"sarveṇa","_","_","sarva","JQ","","_","_"
6,"vittavān","_","_","vittavat","JJ","","_","_"
1,"artha","_","_","artha","NC","","_","_"
2,"eva","_","_","eva","CEM","","_","_"
3,"hi","_","_","hi","CX","","_","_"
4,"keṣāṃcid","_","_","kiṃcit","PRI","","_","_"
5,"anartho","_","_","anartha","JJ","","_","_"
6,"bhavitā","_","_","bhavitṛ","JJ","","_","_"
7,"nṛṇām","_","_","nṛ","NC","","_","_"
1,"_","_","_","artha","NC","","_","_"
2,"_","_","_","śreyas","NC","","_","_"
3,"_","_","_","ca","CCD","","_","_"
4,"_","_","_","āsañj","PPP","","_","_"
5,"na","_","_","na","CNG","","_","_"
6,"śreyo","_","_","śreyas","NC","","_","_"
7,"vindate","_","_","vid","V","vid","_","_"
8,"naraḥ","_","_","nara","NC","","_","_"
1,"tasmād","_","_","tad","PRD","","_","_"
2,"_","_","_","artha","NC","","_","_"
3,"_","_","_","āgama","NC","","_","_"
4,"sarve","_","_","sarva","JQ","","_","_"
5,"_","_","_","manas","NC","","_","_"
6,"_","_","_","moha","NC","","_","_"
7,"_","_","_","vivardhana","JJ","","_","_"
1,"kārpaṇyaṃ","_","_","kārpaṇya","NC","","_","_"
2,"_","_","_","darpa","NC","","_","_"
3,"_","_","_","māna","NC","","_","_"
4,"ca","_","_","ca","CCD","","_","_"
5,"bhayam","_","_","bhaya","NC","","_","_"
6,"udvega","_","_","udvega","NC","","_","_"
7,"eva","_","_","eva","CEM","","_","_"
8,"ca","_","_","ca","CCD","","_","_"
1,"_","_","_","artha","NC","","_","_"
2,"_","_","_","ja","JJ","","_","_"
3,"viduḥ","_","_","vid","V","vid","_","_"
4,"prājñā","_","_","prājña","JJ","","_","_"
5,"duḥkhāny","_","_","duḥkha","NC","","_","_"
6,"etāni","_","_","tad","PRD","","_","_"
7,"dehinām","_","_","dehin","NC","","_","_"
1,"_","_","_","artha","NC","","_","_"
2,"_","_","_","upārjana","NC","","_","_"
3,"duḥkhaṃ","_","_","duḥkha","NC","","_","_"
4,"pālane","_","_","pālana","NC","","_","_"
5,"ca","_","_","ca","CCD","","_","_"
6,"kṣaye","_","_","kṣaya","NC","","_","_"
7,"tathā","_","_","tathā","CX","","_","_"
1,"nāśe","_","_","nāśa","NC","","_","_"
2,"duḥkhaṃ","_","_","duḥkha","NC","","_","_"
3,"vyaye","_","_","vyaya","NC","","_","_"
4,"duḥkhaṃ","_","_","duḥkha","NC","","_","_"
5,"ghnanti","_","_","han","V","han","_","_"
6,"_","_","_","ca","CCD","","_","_"
7,"_","_","_","eva","CEM","","_","_"
8,"_","_","_","artha","NC","","_","_"
9,"_","_","_","kāraṇa","NC","","_","_"
1,"arthā","_","_","artha","NC","","_","_"
2,"duḥkhaṃ","_","_","duḥkha","JJ","","_","_"
3,"parityaktuṃ","_","_","parityaj","CGDI","","_","_"
4,"pālitāś","_","_","pālay","PPP","","_","_"
5,"_","_","_","ca","CCD","","_","_"
6,"_","_","_","api","CX","","_","_"
7,"te","_","_","tad","PRD","","_","_"
8,"'sukhāḥ","_","_","asukha","JJ","","_","_"
1,"duḥkhena","_","_","duḥkha","NC","","_","_"
2,"_","_","_","ca","CCD","","_","_"
3,"_","_","_","adhiga","V","adhiga","_","_"
4,"teṣāṃ","_","_","tad","PRD","","_","_"
5,"nāśaṃ","_","_","nāśa","NC","","_","_"
6,"na","_","_","na","CNG","","_","_"
7,"cintayet","_","_","cint","V","cint","_","_"
1,"_","_","_","asaṃtoṣa","NC","","_","_"
2,"_","_","_","para","PPX","","_","_"
3,"mūḍhāḥ","_","_","muh","PPP","","_","_"
4,"saṃtoṣaṃ","_","_","saṃtoṣa","NC","","_","_"
5,"yānti","_","_","yā","V","yā","_","_"
6,"paṇḍitāḥ","_","_","paṇḍita","NC","","_","_"
1,"anto","_","_","anta","NC","","_","_"
2,"_","_","_","na","CNG","","_","_"
3,"_","_","_","as","V","as","_","_"
4,"pipāsāyāḥ","_","_","pipāsā","NC","","_","_"
5,"saṃtoṣaḥ","_","_","saṃtoṣa","NC","","_","_"
6,"paramaṃ","_","_","parama","JJ","","_","_"
7,"sukham","_","_","sukha","NC","","_","_"
1,"tasmāt","_","_","tad","PRD","","_","_"
2,"saṃtoṣam","_","_","saṃtoṣa","NC","","_","_"
3,"_","_","_","eva","CEM","","_","_"
4,"_","_","_","iha","CAD","","_","_"
5,"dhanaṃ","_","_","dhana","NC","","_","_"
6,"paśyanti","_","_","paś","V","paś","_","_"
7,"paṇḍitāḥ","_","_","paṇḍita","NC","","_","_"
1,"anityaṃ","_","_","anitya","JJ","","_","_"
2,"yauvanaṃ","_","_","yauvana","NC","","_","_"
3,"rūpaṃ","_","_","rūpa","NC","","_","_"
4,"jīvitaṃ","_","_","jīvita","NC","","_","_"
5,"_","_","_","dravya","NC","","_","_"
6,"_","_","_","saṃcaya","NC","","_","_"
1,"aiśvaryaṃ","_","_","aiśvarya","NC","","_","_"
2,"_","_","_","priya","JJ","","_","_"
3,"_","_","_","saṃvāsa","NC","","_","_"
4,"gṛdhyed","_","_","gṛdhy","V","gṛdh","_","_"
5,"eṣu","_","_","ida","PRD","","_","_"
6,"na","_","_","na","CNG","","_","_"
7,"paṇḍitaḥ","_","_","paṇḍita","NC","","_","_"
1,"tyajeta","_","_","tyaj","V","tyaj","_","_"
2,"saṃcayāṃs","_","_","saṃcaya","NC","","_","_"
3,"tasmāt","_","_","tad","PRD","","_","_"
4,"tajjaṃ","_","_","tajja","JJ","","_","_"
5,"kleśaṃ","_","_","kleśa","NC","","_","_"
6,"saheta","_","_","sah","V","sah","_","_"
7,"kaḥ","_","_","kiṃ","PRQ","","_","_"
1,"na","_","_","na","CNG","","_","_"
2,"hi","_","_","hi","CX","","_","_"
3,"saṃcayavān","_","_","saṃcayavat","JJ","","_","_"
4,"kaścid","_","_","kiṃcit","PRI","","_","_"
5,"dṛśyate","_","_","darś","V","dṛś","_","_"
6,"nirupadravaḥ","_","_","nirupadrava","JJ","","_","_"
1,"ataś","_","_","atas","CX","","_","_"
2,"ca","_","_","ca","CCD","","_","_"
3,"dharmibhiḥ","_","_","dharmin","JJ","","_","_"
4,"puṃbhir","_","_","puṃs","NC","","_","_"
5,"_","_","_","anīha","JJ","","_","_"
6,"_","_","_","artha","NC","","_","_"
7,"praśasyate","_","_","praśaṃs","V","praśaṃs","_","_"
1,"_","_","_","prakṣālana","NC","","_","_"
2,"_","_","_","hi","CX","","_","_"
3,"paṅkasya","_","_","paṅka","NC","","_","_"
4,"dūrād","_","_","dūra","JJ","","_","_"
5,"asparśanaṃ","_","_","asparśana","NC","","_","_"
6,"varam","_","_","vara","JJ","","_","_"
1,"_","_","_","yudhiṣṭhira","NC","","_","_"
2,"_","_","_","eva","CX","","_","_"
3,"artheṣu","_","_","artha","NC","","_","_"
4,"na","_","_","na","CNG","","_","_"
5,"spṛhāṃ","_","_","spṛhā","NC","","_","_"
6,"kartum","_","_","kṛ","CGDI","","_","_"
7,"arhasi","_","_","arh","V","arh","_","_"
1,"dharmeṇa","_","_","dharma","NC","","_","_"
2,"yadi","_","_","yadi","CSB","","_","_"
3,"te","_","_","tvat","PPR","","_","_"
4,"kāryaṃ","_","_","kārya","NC","","_","_"
5,"_","_","_","vimuc","PPP","","_","_"
6,"_","_","_","icchā","NC","","_","_"
7,"_","_","_","bhav","V","bhū","_","_"
8,"_","_","_","arthatas","CX","","_","_"
1,"yudhiṣṭhira","_","_","yudhiṣṭhira","NC","","_","_"
2,"uvāca","_","_","vak","V","vac","_","_"
1,"_","_","_","na","CNG","","_","_"
2,"_","_","_","artha","NC","","_","_"
3,"_","_","_","upabhoga","NC","","_","_"
4,"_","_","_","lipsā","NC","","_","_"
5,"_","_","_","artha","NC","","_","_"
6,"iyam","_","_","ida","PRD","","_","_"
7,"_","_","_","artha","NC","","_","_"
8,"_","_","_","īpsutā","NC","","_","_"
9,"mama","_","_","mat","PPR","","_","_"
1,"_","_","_","bharaṇa","NC","","_","_"
2,"_","_","_","artha","NC","","_","_"
3,"tu","_","_","tu","CCD","","_","_"
4,"viprāṇāṃ","_","_","vipra","NC","","_","_"
5,"brahman","_","_","brahman","NC","","_","_"
6,"kāṅkṣe","_","_","kāṅkṣ","V","kāṅkṣ","_","_"
7,"na","_","_","na","CNG","","_","_"
8,"lobhataḥ","_","_","lobha","NC","","_","_"
1,"kathaṃ","_","_","katha","CX","","_","_"
2,"hy","_","_","hi","CX","","_","_"
3,"asmadvidho","_","_","asmadvidha","JJ","","_","_"
4,"brahman","_","_","brahman","NC","","_","_"
5,"vartamāno","_","_","vṛt","KDP","","_","_"
6,"gṛhāśrame","_","_","gṛhāśrama","NC","","_","_"
1,"bharaṇaṃ","_","_","bharaṇa","NC","","_","_"
2,"pālanaṃ","_","_","pālana","NC","","_","_"
3,"_","_","_","ca","CCD","","_","_"
4,"_","_","_","api","CX","","_","_"
5,"na","_","_","na","CNG","","_","_"
6,"kuryād","_","_","kar","V","kṛ","_","_"
7,"anuyāyinām","_","_","anuyāyin","JJ","","_","_"
1,"saṃvibhāgo","_","_","saṃvibhāga","NC","","_","_"
2,"hi","_","_","hi","CX","","_","_"
3,"bhūtānāṃ","_","_","bhūta","NC","","_","_"
4,"sarveṣām","_","_","sarva","JQ","","_","_"
5,"eva","_","_","eva","CEM","","_","_"
6,"śiṣyate","_","_","śās","V","śās","_","_"
1,"_","_","_","tathā","CX","","_","_"
2,"_","_","_","eva","CEM","","_","_"
3,"_","_","_","apacamāna","JJ","","_","_"
4,"pradeyaṃ","_","_","pradā","KDG","","_","_"
5,"gṛhamedhinā","_","_","gṛhamedhin","NC","","_","_"
1,"tṛṇāni","_","_","tṛṇa","NC","","_","_"
2,"bhūmir","_","_","bhūmi","NC","","_","_"
3,"udakaṃ","_","_","udaka","NC","","_","_"
4,"vāk","_","_","vāc","NC","","_","_"
5,"caturthī","_","_","caturtha","JJ","","_","_"
6,"ca","_","_","ca","CCD","","_","_"
7,"sūnṛtā","_","_","sūnṛta","JJ","","_","_"
1,"satām","_","_","as","KDP","","_","_"
2,"etāni","_","_","tad","PRD","","_","_"
3,"geheṣu","_","_","geha","NC","","_","_"
4,"_","_","_","na","CNG","","_","_"
5,"_","_","_","ucchid","V","ucchid","_","_"
6,"kadācana","_","_","kadācana","CX","","_","_"
1,"deyam","_","_","dā","KDG","","_","_"
2,"ārtasya","_","_","ārta","JJ","","_","_"
3,"śayanaṃ","_","_","śayana","NC","","_","_"
4,"_","_","_","sthā","PPP","","_","_"
5,"_","_","_","śra","PPP","","_","_"
6,"_","_","_","ca","CCD","","_","_"
7,"_","_","_","āsana","NC","","_","_"
1,"tṛṣitasya","_","_","tṛṣita","JJ","","_","_"
2,"ca","_","_","ca","CCD","","_","_"
3,"pānīyaṃ","_","_","pānīya","NC","","_","_"
4,"kṣudhitasya","_","_","kṣudh","PPP","","_","_"
5,"ca","_","_","ca","CCD","","_","_"
6,"bhojanam","_","_","bhojana","NC","","_","_"
1,"cakṣur","_","_","cakṣus","NC","","_","_"
2,"dadyān","_","_","dad","V","dā","_","_"
3,"mano","_","_","manas","NC","","_","_"
4,"dadyād","_","_","dad","V","dā","_","_"
5,"vācaṃ","_","_","vāc","NC","","_","_"
6,"dadyāc","_","_","dad","V","dā","_","_"
7,"ca","_","_","ca","CCD","","_","_"
8,"sūnṛtām","_","_","sūnṛta","JJ","","_","_"
1,"_","_","_","pratyudga","CGDA","","_","_"
2,"_","_","_","abhigamana","NC","","_","_"
3,"kuryān","_","_","kar","V","kṛ","_","_"
4,"nyāyena","_","_","nyāya","NC","","_","_"
5,"_","_","_","ca","CCD","","_","_"
6,"_","_","_","arcana","NC","","_","_"
1,"agnihotram","_","_","agnihotra","NC","","_","_"
2,"anaḍvāṃś","_","_","anaḍuh","NC","","_","_"
3,"ca","_","_","ca","CCD","","_","_"
4,"jñātayo","_","_","jñāti","NC","","_","_"
5,"_","_","_","atithi","NC","","_","_"
6,"_","_","_","bāndhava","NC","","_","_"
1,"_","_","_","putra","NC","","_","_"
2,"_","_","_","dāra","NC","","_","_"
3,"_","_","_","bhṛ","PPP","","_","_"
4,"_","_","_","ca","CCD","","_","_"
5,"_","_","_","eva","CEM","","_","_"
6,"nirdaheyur","_","_","nirdah","V","nirdah","_","_"
7,"apūjitāḥ","_","_","apūjita","JJ","","_","_"
1,"_","_","_","na","CNG","","_","_"
2,"_","_","_","ātman","NC","","_","_"
3,"_","_","_","artha","NC","","_","_"
4,"pācayed","_","_","pācay","V","pācay","_","_"
5,"annaṃ","_","_","anna","NC","","_","_"
6,"na","_","_","na","CNG","","_","_"
7,"vṛthā","_","_","vṛthā","CX","","_","_"
8,"ghātayet","_","_","han","V","han","_","_"
9,"paśūn","_","_","paśu","NC","","_","_"
1,"na","_","_","na","CNG","","_","_"
2,"ca","_","_","ca","CCD","","_","_"
3,"tat","_","_","tad","PRD","","_","_"
4,"svayam","_","_","svaya","CX","","_","_"
5,"aśnīyād","_","_","aś","V","aś","_","_"
6,"vidhivad","_","_","vidhivat","CX","","_","_"
7,"yan","_","_","yat","CSB","","_","_"
8,"na","_","_","na","CNG","","_","_"
9,"nirvapet","_","_","nirvap","V","nirvap","_","_"
1,"śvabhyaś","_","_","śvan","NC","","_","_"
2,"ca","_","_","ca","CCD","","_","_"
3,"śvapacebhyaś","_","_","śvapaca","NC","","_","_"
4,"ca","_","_","ca","CCD","","_","_"
5,"vayobhyaś","_","_","vayas","NC","","_","_"
6,"_","_","_","ca","CCD","","_","_"
7,"_","_","_","āvap","V","āvap","_","_"
8,"bhuvi","_","_","bhū","NC","","_","_"
1,"vaiśvadevaṃ","_","_","vaiśvadeva","NC","","_","_"
2,"hi","_","_","hi","CX","","_","_"
3,"_","_","_","nāma","CX","","_","_"
4,"_","_","_","tad","PRD","","_","_"
5,"_","_","_","sāya","NC","","_","_"
6,"_","_","_","prātar","CX","","_","_"
7,"vidhīyate","_","_","vidadh","V","vidhā","_","_"
1,"_","_","_","vighasa","NC","","_","_"
2,"_","_","_","āśin","JJ","","_","_"
3,"bhavet","_","_","bhav","V","bhū","_","_"
4,"tasmān","_","_","tad","PRD","","_","_"
5,"nityaṃ","_","_","nitya","CX","","_","_"
6,"_","_","_","ca","CCD","","_","_"
7,"_","_","_","amṛta","NC","","_","_"
8,"_","_","_","bhojana","NC","","_","_"
1,"vighasaṃ","_","_","vighasa","NC","","_","_"
2,"_","_","_","bhṛtya","NC","","_","_"
3,"_","_","_","śeṣa","NC","","_","_"
4,"tu","_","_","tu","CCD","","_","_"
5,"_","_","_","yajña","NC","","_","_"
6,"_","_","_","śeṣa","NC","","_","_"
7,"_","_","_","tathā","CX","","_","_"
8,"_","_","_","amṛta","NC","","_","_"
1,"etāṃ","_","_","tad","PRD","","_","_"
2,"yo","_","_","yad","PRL","","_","_"
3,"vartate","_","_","vart","V","vṛt","_","_"
4,"vṛttiṃ","_","_","vṛtti","NC","","_","_"
5,"vartamāno","_","_","vṛt","KDP","","_","_"
6,"gṛhāśrame","_","_","gṛhāśrama","NC","","_","_"
1,"tasya","_","_","tad","PRD","","_","_"
2,"dharmaṃ","_","_","dharma","NC","","_","_"
3,"paraṃ","_","_","para","PPX","","_","_"
4,"prāhuḥ","_","_","prāh","V","prāh","_","_"
5,"kathaṃ","_","_","katha","CX","","_","_"
6,"vā","_","_","vā","CCD","","_","_"
7,"vipra","_","_","vipra","NC","","_","_"
8,"manyase","_","_","man","V","man","_","_"
1,"śaunaka","_","_","śaunaka","NC","","_","_"
2,"uvāca","_","_","vak","V","vac","_","_"
1,"aho","_","_","aho","CX","","_","_"
2,"bata","_","_","bata","CX","","_","_"
3,"mahat","_","_","mahat","JJ","","_","_"
4,"kaṣṭaṃ","_","_","kaṣṭa","JJ","","_","_"
5,"viparītam","_","_","viparīta","JJ","","_","_"
6,"idaṃ","_","_","ida","PRD","","_","_"
7,"jagat","_","_","jagat","NC","","_","_"
1,"_","_","_","yad","PRL","","_","_"
2,"_","_","_","apatrap","V","apatrap","_","_"
3,"sādhur","_","_","sādhu","JJ","","_","_"
4,"asādhus","_","_","asādhu","JJ","","_","_"
5,"tena","_","_","tad","PRD","","_","_"
6,"tuṣyati","_","_","tuṣ","V","tuṣ","_","_"
1,"_","_","_","śiśna","NC","","_","_"
2,"_","_","_","udara","NC","","_","_"
3,"_","_","_","kṛ","PPP","","_","_"
4,"'prājñaḥ","_","_","aprājña","JJ","","_","_"
5,"karoti","_","_","kar","V","kṛ","_","_"
6,"vighasaṃ","_","_","vighasa","NC","","_","_"
7,"bahu","_","_","bahu","JJ","","_","_"
1,"_","_","_","moha","NC","","_","_"
2,"_","_","_","rāga","NC","","_","_"
3,"_","_","_","samākra","PPP","","_","_"
4,"_","_","_","indriyārtha","NC","","_","_"
5,"_","_","_","vaśa","NC","","_","_"
6,"_","_","_","anuga","JJ","","_","_"
1,"hriyate","_","_","har","V","hṛ","_","_"
2,"budhyamāno","_","_","budh","KDP","","_","_"
3,"'pi","_","_","api","CX","","_","_"
4,"naro","_","_","nara","NC","","_","_"
5,"hāribhir","_","_","hārin","JJ","","_","_"
6,"indriyaiḥ","_","_","indriya","NC","","_","_"
1,"_","_","_","vimuh","PPP","","_","_"
2,"_","_","_","saṃjñā","NC","","_","_"
3,"_","_","_","duṣ","PPP","","_","_"
4,"_","_","_","aśva","NC","","_","_"
5,"udbhrāntair","_","_","udbhra","PPP","","_","_"
6,"iva","_","_","iva","CCM","","_","_"
7,"sārathiḥ","_","_","sārathi","NC","","_","_"
1,"_","_","_","ṣaṣ","NUM","","_","_"
2,"_","_","_","indriya","NC","","_","_"
3,"viṣayaṃ","_","_","viṣaya","NC","","_","_"
4,"samāgacchanti","_","_","samāgacch","V","samāgam","_","_"
5,"vai","_","_","vai","CX","","_","_"
6,"yadā","_","_","yadā","CSB","","_","_"
1,"tadā","_","_","tadā","CAD","","_","_"
2,"prādurbhavaty","_","_","prādurbhav","V","prādurbhū","_","_"
3,"eṣāṃ","_","_","ida","PRD","","_","_"
4,"_","_","_","pūrva","PPX","","_","_"
5,"_","_","_","saṃkalpa","NC","","_","_"
6,"_","_","_","ja","JJ","","_","_"
7,"manaḥ","_","_","manas","NC","","_","_"
1,"mano","_","_","manas","NC","","_","_"
2,"_","_","_","yad","PRL","","_","_"
3,"_","_","_","indriya","NC","","_","_"
4,"_","_","_","grāma","NC","","_","_"
5,"_","_","_","viṣaya","NC","","_","_"
6,"prati","_","_","prati","CADP","","_","_"
7,"coditam","_","_","coday","PPP","","_","_"
1,"_","_","_","tad","PRD","","_","_"
2,"_","_","_","autsukya","NC","","_","_"
3,"sambhavati","_","_","sambhav","V","sambhū","_","_"
4,"pravṛttiś","_","_","pravṛtti","NC","","_","_"
5,"_","_","_","ca","CCD","","_","_"
6,"_","_","_","upajan","V","upajan","_","_"
1,"tataḥ","_","_","tatas","CX","","_","_"
2,"_","_","_","saṃkalpa","NC","","_","_"
3,"_","_","_","vīrya","NC","","_","_"
4,"kāmena","_","_","kāma","NC","","_","_"
5,"_","_","_","viṣaya","NC","","_","_"
6,"_","_","_","iṣu","NC","","_","_"
1,"viddhaḥ","_","_","vyadh","PPP","","_","_"
2,"patati","_","_","pat","V","pat","_","_"
3,"_","_","_","lobha","NC","","_","_"
4,"_","_","_","agni","NC","","_","_"
5,"jyotir","_","_","jyotis","NC","","_","_"
6,"lobhāt","_","_","lobha","NC","","_","_"
7,"_","_","_","pataṃga","NC","","_","_"
8,"_","_","_","vat","CX","","_","_"
1,"tato","_","_","tatas","CX","","_","_"
2,"vihārair","_","_","vihāra","NC","","_","_"
3,"āhārair","_","_","āhāra","NC","","_","_"
4,"mohitaś","_","_","mohay","PPP","","_","_"
5,"ca","_","_","ca","CCD","","_","_"
6,"_","_","_","viś","NC","","_","_"
7,"_","_","_","pati","NC","","_","_"
1,"_","_","_","mahat","JJ","","_","_"
2,"_","_","_","moha","NC","","_","_"
3,"_","_","_","mukha","NC","","_","_"
4,"magno","_","_","majj","PPP","","_","_"
5,"_","_","_","na","CNG","","_","_"
6,"_","_","_","ātman","NC","","_","_"
7,"avabudhyate","_","_","avabodh","V","avabudh","_","_"
1,"evaṃ","_","_","eva","CX","","_","_"
2,"patati","_","_","pat","V","pat","_","_"
3,"saṃsāre","_","_","saṃsāra","NC","","_","_"
4,"tāsu","_","_","tad","PRD","","_","_"
5,"_","_","_","tad","PRD","","_","_"
6,"_","_","_","iha","CAD","","_","_"
7,"yoniṣu","_","_","yoni","NC","","_","_"
1,"_","_","_","avidyā","NC","","_","_"
2,"_","_","_","karman","NC","","_","_"
3,"_","_","_","tṛṣṇā","NC","","_","_"
4,"bhrāmyamāṇo","_","_","bhrāmay","KDP","","_","_"
5,"'tha","_","_","atha","CAD","","_","_"
6,"_","_","_","cakra","NC","","_","_"
7,"_","_","_","vat","CX","","_","_"
1,"_","_","_","brahman","NC","","_","_"
2,"_","_","_","ādi","NC","","_","_"
3,"_","_","_","tṛṇa","NC","","_","_"
4,"_","_","_","anta","NC","","_","_"
5,"bhūteṣu","_","_","bhūta","NC","","_","_"
6,"parivartate","_","_","parivart","V","parivṛt","_","_"
1,"jale","_","_","jala","NC","","_","_"
2,"bhuvi","_","_","bhū","NC","","_","_"
3,"_","_","_","tathā","CX","","_","_"
4,"_","_","_","ākāśa","NC","","_","_"
5,"jāyamānaḥ","_","_","jan","KDP","","_","_"
6,"punaḥ","_","_","punar","CAD","","_","_"
7,"punaḥ","_","_","punar","CAD","","_","_"
1,"abudhānāṃ","_","_","abudha","JJ","","_","_"
2,"gatis","_","_","gati","NC","","_","_"
3,"_","_","_","tu","CCD","","_","_"
4,"_","_","_","tad","PRD","","_","_"
5,"budhānām","_","_","budha","NC","","_","_"
6,"api","_","_","api","CX","","_","_"
7,"me","_","_","mat","PPR","","_","_"
8,"śṛṇu","_","_","śṛṇ","V","śru","_","_"
1,"ye","_","_","yad","PRL","","_","_"
2,"dharme","_","_","dharma","NC","","_","_"
3,"śreyasi","_","_","śreyas","JJ","","_","_"
4,"ratā","_","_","ra","PPP","","_","_"
5,"_","_","_","vimokṣa","NC","","_","_"
6,"_","_","_","rati","NC","","_","_"
7,"janāḥ","_","_","jana","NC","","_","_"
1,"yad","_","_","yad","PRL","","_","_"
2,"idaṃ","_","_","ida","PRD","","_","_"
3,"_","_","_","veda","NC","","_","_"
4,"_","_","_","vacana","NC","","_","_"
5,"kuru","_","_","kar","V","kṛ","_","_"
6,"karma","_","_","karman","NC","","_","_"
7,"_","_","_","tyaj","V","tyaj","_","_"
8,"_","_","_","iti","CQT","","_","_"
9,"ca","_","_","ca","CCD","","_","_"
1,"tasmād","_","_","tad","PRD","","_","_"
2,"dharmān","_","_","dharma","NC","","_","_"
3,"imān","_","_","ida","PRD","","_","_"
4,"sarvān","_","_","sarva","JQ","","_","_"
5,"_","_","_","na","CNG","","_","_"
6,"_","_","_","abhimāna","NC","","_","_"
7,"samācaret","_","_","samācar","V","samācar","_","_"
1,"_","_","_","ijyā","NC","","_","_"
2,"_","_","_","adhyayana","NC","","_","_"
3,"_","_","_","dāna","NC","","_","_"
4,"tapaḥ","_","_","tapas","NC","","_","_"
5,"satyaṃ","_","_","satya","NC","","_","_"
6,"kṣamā","_","_","kṣamā","NC","","_","_"
7,"damaḥ","_","_","dama","NC","","_","_"
1,"alobha","_","_","alobha","NC","","_","_"
2,"iti","_","_","iti","CQT","","_","_"
3,"mārgo","_","_","mārga","NC","","_","_"
4,"'yaṃ","_","_","ida","PRD","","_","_"
5,"_","_","_","dharma","NC","","_","_"
6,"_","_","_","aṣṭavidha","JJ","","_","_"
7,"smṛtaḥ","_","_","smṛ","PPP","","_","_"
1,"tatra","_","_","tatra","CAD","","_","_"
2,"pūrvaś","_","_","pūrva","PPX","","_","_"
3,"caturvargaḥ","_","_","caturvarga","NC","","_","_"
4,"_","_","_","pitṛ","NC","","_","_"
5,"_","_","_","yāna","NC","","_","_"
6,"_","_","_","patha","NC","","_","_"
7,"sthitaḥ","_","_","sthā","PPP","","_","_"
1,"kartavyam","_","_","kṛ","KDG","","_","_"
2,"iti","_","_","iti","CQT","","_","_"
3,"yat","_","_","yad","PRL","","_","_"
4,"kāryaṃ","_","_","kṛ","KDG","","_","_"
5,"_","_","_","na","CNG","","_","_"
6,"_","_","_","abhimāna","NC","","_","_"
7,"samācaret","_","_","samācar","V","samācar","_","_"
1,"uttaro","_","_","uttara","JJ","","_","_"
2,"_","_","_","deva","NC","","_","_"
3,"_","_","_","yāna","NC","","_","_"
4,"tu","_","_","tu","CCD","","_","_"
5,"sadbhir","_","_","as","KDP","","_","_"
6,"ācaritaḥ","_","_","ācar","PPP","","_","_"
7,"sadā","_","_","sadā","CAD","","_","_"
1,"_","_","_","aṣṭāṅga","JJ","","_","_"
2,"_","_","_","eva","CEM","","_","_"
3,"mārgeṇa","_","_","mārga","NC","","_","_"
4,"_","_","_","viśudh","PPP","","_","_"
5,"_","_","_","ātman","NC","","_","_"
6,"samācaret","_","_","samācar","V","samācar","_","_"
1,"samyak","_","_","samyak","CX","","_","_"
2,"_","_","_","saṃkalpa","NC","","_","_"
3,"_","_","_","sambandha","NC","","_","_"
4,"samyak","_","_","samyak","CX","","_","_"
5,"_","_","_","ca","CCD","","_","_"
6,"_","_","_","indriya","NC","","_","_"
7,"_","_","_","nigraha","NC","","_","_"
1,"samyag","_","_","samyak","CX","","_","_"
2,"_","_","_","vrata","NC","","_","_"
3,"_","_","_","viśeṣa","NC","","_","_"
4,"ca","_","_","ca","CCD","","_","_"
5,"samyak","_","_","samyak","CX","","_","_"
6,"ca","_","_","ca","CCD","","_","_"
7,"_","_","_","guru","NC","","_","_"
8,"_","_","_","sevana","NC","","_","_"
1,"samyag","_","_","samyak","CX","","_","_"
2,"_","_","_","āhāra","NC","","_","_"
3,"_","_","_","yoga","NC","","_","_"
4,"ca","_","_","ca","CCD","","_","_"
5,"samyak","_","_","samyak","CX","","_","_"
6,"_","_","_","ca","CCD","","_","_"
7,"_","_","_","adhyayana","NC","","_","_"
8,"_","_","_","āgama","NC","","_","_"
1,"samyak","_","_","samyak","CX","","_","_"
2,"_","_","_","karman","NC","","_","_"
3,"_","_","_","upasaṃnyāsa","NC","","_","_"
4,"samyak","_","_","samyak","CX","","_","_"
5,"_","_","_","citta","NC","","_","_"
6,"_","_","_","nirodhana","NC","","_","_"
1,"evaṃ","_","_","eva","CX","","_","_"
2,"karmāṇi","_","_","karman","NC","","_","_"
3,"kurvanti","_","_","kar","V","kṛ","_","_"
4,"_","_","_","saṃsāra","NC","","_","_"
5,"_","_","_","vijigīṣu","JJ","","_","_"
1,"_","_","_","rāga","NC","","_","_"
2,"_","_","_","dveṣa","NC","","_","_"
3,"_","_","_","vinirmuc","PPP","","_","_"
4,"aiśvaryaṃ","_","_","aiśvarya","NC","","_","_"
5,"devatā","_","_","devatā","NC","","_","_"
6,"gatāḥ","_","_","ga","PPP","","_","_"
1,"rudrāḥ","_","_","rudra","NC","","_","_"
2,"sādhyās","_","_","sādhya","NC","","_","_"
3,"_","_","_","tathā","CX","","_","_"
4,"_","_","_","āditya","NC","","_","_"
5,"vasavo","_","_","vasu","NC","","_","_"
6,"_","_","_","atha","CAD","","_","_"
7,"_","_","_","aśvin","NC","","_","_"
8,"_","_","_","api","CX","","_","_"
1,"_","_","_","yoga","NC","","_","_"
2,"_","_","_","aiśvarya","NC","","_","_"
3,"saṃyuktā","_","_","saṃyuj","PPP","","_","_"
4,"dhārayanti","_","_","dhar","V","dhṛ","_","_"
5,"prajā","_","_","prajā","NC","","_","_"
6,"imāḥ","_","_","ida","PRD","","_","_"
1,"tathā","_","_","tathā","CX","","_","_"
2,"tvam","_","_","tvat","PPR","","_","_"
3,"api","_","_","api","CX","","_","_"
4,"kaunteya","_","_","kaunteya","NC","","_","_"
5,"śamam","_","_","śama","NC","","_","_"
6,"āsthāya","_","_","āsthā","CGDA","","_","_"
7,"puṣkalam","_","_","puṣkala","JJ","","_","_"
1,"tapasā","_","_","tapas","NC","","_","_"
2,"siddhim","_","_","siddhi","NC","","_","_"
3,"anviccha","_","_","anviṣ","V","anviṣ","_","_"
4,"_","_","_","yoga","NC","","_","_"
5,"_","_","_","siddhi","NC","","_","_"
6,"ca","_","_","ca","CCD","","_","_"
7,"bhārata","_","_","bhārata","JJ","","_","_"
1,"_","_","_","pitṛ","NC","","_","_"
2,"_","_","_","mātṛ","NC","","_","_"
3,"_","_","_","maya","JJ","","_","_"
4,"siddhiḥ","_","_","siddhi","NC","","_","_"
5,"prāptā","_","_","prāp","PPP","","_","_"
6,"_","_","_","karman","NC","","_","_"
7,"_","_","_","maya","JJ","","_","_"
8,"ca","_","_","ca","CCD","","_","_"
9,"te","_","_","tvat","PPR","","_","_"
1,"tapasā","_","_","tapas","NC","","_","_"
2,"siddhim","_","_","siddhi","NC","","_","_"
3,"anviccha","_","_","anviṣ","V","anviṣ","_","_"
4,"dvijānāṃ","_","_","dvija","NC","","_","_"
5,"bharaṇāya","_","_","bharaṇa","NC","","_","_"
6,"vai","_","_","vai","CX","","_","_"
1,"siddhā","_","_","siddha","NC","","_","_"
2,"hi","_","_","hi","CX","","_","_"
3,"yad","_","_","yad","PRL","","_","_"
4,"yad","_","_","yad","PRL","","_","_"
5,"icchanti","_","_","iṣ","V","iṣ","_","_"
6,"kurvate","_","_","kar","V","kṛ","_","_"
7,"tad","_","_","tad","PRD","","_","_"
8,"anugrahāt","_","_","anugraha","NC","","_","_"
1,"tasmāt","_","_","tad","PRD","","_","_"
2,"tapaḥ","_","_","tapas","NC","","_","_"
3,"samāsthāya","_","_","samāsthā","CGDA","","_","_"
4,"_","_","_","kar","V","kṛ","_","_"
5,"_","_","_","ātman","NC","","_","_"
6,"_","_","_","manoratha","NC","","_","_"
