"WordID","word","NormSTEM","suffix","lemma","PoS","Root","NormSuffix","NormWord"
1,"dhṛtarāṣṭra","_","_","dhṛtarāṣṭra","NC","","_","_"
2,"uvāca","_","_","vak","V","vac","_","_"
1,"_","_","_","vyavahāra","NC","","_","_"
2,"_","_","_","ca","CCD","","_","_"
3,"te","_","_","tad","PRD","","_","_"
4,"tāta","_","_","tāta","NC","","_","_"
5,"nityam","_","_","nitya","CX","","_","_"
6,"āptair","_","_","āpta","NC","","_","_"
7,"adhiṣṭhitāḥ","_","_","adhiṣṭhā","PPP","","_","_"
1,"_","_","_","yuj","KDG","","_","_"
2,"_","_","_","tuṣ","PPP","","_","_"
3,"hitai","_","_","hita","JJ","","_","_"
4,"_","_","_","rājan","NC","","_","_"
5,"_","_","_","nitya","CX","","_","_"
6,"cārair","_","_","cāra","NC","","_","_"
7,"anuṣṭhitāḥ","_","_","anuṣṭhā","PPP","","_","_"
1,"parimāṇaṃ","_","_","parimāṇa","NC","","_","_"
2,"viditvā","_","_","vid","CGDA","","_","_"
3,"ca","_","_","ca","CCD","","_","_"
4,"daṇḍaṃ","_","_","daṇḍa","NC","","_","_"
5,"daṇḍyeṣu","_","_","daṇḍay","KDG","","_","_"
6,"bhārata","_","_","bhārata","NC","","_","_"
1,"praṇayeyur","_","_","praṇī","V","praṇī","_","_"
2,"yathānyāyaṃ","_","_","yathānyāya","CX","","_","_"
3,"_","_","_","puruṣa","NC","","_","_"
4,"_","_","_","tvat","PPR","","_","_"
5,"yudhiṣṭhira","_","_","yudhiṣṭhira","NC","","_","_"
1,"_","_","_","ādāna","NC","","_","_"
2,"_","_","_","ruci","NC","","_","_"
3,"_","_","_","ca","CCD","","_","_"
4,"_","_","_","eva","CEM","","_","_"
5,"_","_","_","para","PPX","","_","_"
6,"_","_","_","dāra","NC","","_","_"
7,"_","_","_","abhimarśaka","JJ","","_","_"
1,"_","_","_","ugra","JJ","","_","_"
2,"_","_","_","daṇḍa","NC","","_","_"
3,"_","_","_","pradhāna","NC","","_","_"
4,"_","_","_","ca","CCD","","_","_"
5,"mithyā","_","_","mithyā","CX","","_","_"
6,"_","_","_","vyāhārin","JJ","","_","_"
7,"_","_","_","tathā","CX","","_","_"
1,"_","_","_","ākroṣṭṛ","NC","","_","_"
2,"_","_","_","ca","CCD","","_","_"
3,"_","_","_","lubh","PPP","","_","_"
4,"_","_","_","ca","CCD","","_","_"
5,"hantāraḥ","_","_","hantṛ","JJ","","_","_"
6,"_","_","_","sāhasa","NC","","_","_"
7,"_","_","_","priya","JJ","","_","_"
1,"_","_","_","sabhā","NC","","_","_"
2,"_","_","_","vihāra","NC","","_","_"
3,"_","_","_","bhettṛ","JJ","","_","_"
4,"varṇānāṃ","_","_","varṇa","NC","","_","_"
5,"ca","_","_","ca","CCD","","_","_"
6,"pradūṣakāḥ","_","_","pradūṣaka","JJ","","_","_"
1,"_","_","_","hiraṇya","NC","","_","_"
2,"_","_","_","daṇḍay","KDG","","_","_"
3,"_","_","_","vadh","KDG","","_","_"
4,"_","_","_","ca","CCD","","_","_"
5,"kartavyā","_","_","kṛ","KDG","","_","_"
6,"_","_","_","deśa","NC","","_","_"
7,"_","_","_","kāla","NC","","_","_"
1,"prātar","_","_","prātar","CX","","_","_"
2,"eva","_","_","eva","CEM","","_","_"
3,"hi","_","_","hi","CX","","_","_"
4,"paśyethā","_","_","paś","V","paś","_","_"
5,"ye","_","_","yad","PRL","","_","_"
6,"kuryur","_","_","kar","V","kṛ","_","_"
7,"_","_","_","vyaya","NC","","_","_"
8,"_","_","_","karman","NC","","_","_"
9,"te","_","_","tvat","PPR","","_","_"
1,"alaṃkāram","_","_","alaṃkāra","NC","","_","_"
2,"atho","_","_","atho","CX","","_","_"
3,"bhojyam","_","_","bhojya","NC","","_","_"
4,"ata","_","_","atas","CX","","_","_"
5,"ūrdhvaṃ","_","_","ūrdhva","CX","","_","_"
6,"samācareḥ","_","_","samācar","V","samācar","_","_"
1,"_","_","_","paś","V","paś","_","_"
2,"_","_","_","ca","CCD","","_","_"
3,"tato","_","_","tatas","CX","","_","_"
4,"yodhān","_","_","yodha","NC","","_","_"
5,"sadā","_","_","sadā","CAD","","_","_"
6,"tvaṃ","_","_","tvat","PPR","","_","_"
7,"pariharṣayan","_","_","pariharṣay","KDP","","_","_"
1,"dūtānāṃ","_","_","dūta","NC","","_","_"
2,"ca","_","_","ca","CCD","","_","_"
3,"carāṇāṃ","_","_","cara","NC","","_","_"
4,"ca","_","_","ca","CCD","","_","_"
5,"_","_","_","pradoṣa","NC","","_","_"
6,"_","_","_","tvat","PPR","","_","_"
7,"sadā","_","_","sadā","CAD","","_","_"
8,"bhavet","_","_","bhav","V","bhū","_","_"
1,"sadā","_","_","sadā","CAD","","_","_"
2,"_","_","_","ca","CCD","","_","_"
3,"_","_","_","apararātra","NC","","_","_"
4,"te","_","_","tvat","PPR","","_","_"
5,"bhavet","_","_","bhav","V","bhū","_","_"
6,"_","_","_","kārya","NC","","_","_"
7,"_","_","_","artha","NC","","_","_"
8,"_","_","_","nirṇaya","NC","","_","_"
1,"madhyarātre","_","_","madhyarātra","NC","","_","_"
2,"_","_","_","vihāra","NC","","_","_"
3,"_","_","_","tvat","PPR","","_","_"
4,"madhyāhne","_","_","madhyāhna","NC","","_","_"
5,"ca","_","_","ca","CCD","","_","_"
6,"sadā","_","_","sadā","CAD","","_","_"
7,"bhavet","_","_","bhav","V","bhū","_","_"
1,"sarve","_","_","sarva","JQ","","_","_"
2,"_","_","_","tu","CCD","","_","_"
3,"_","_","_","ātyayika","JJ","","_","_"
4,"kālāḥ","_","_","kāla","NC","","_","_"
5,"kāryāṇāṃ","_","_","kārya","NC","","_","_"
6,"_","_","_","bharata","NC","","_","_"
7,"_","_","_","ṛṣabha","NC","","_","_"
1,"_","_","_","tathā","CX","","_","_"
2,"_","_","_","eva","CEM","","_","_"
3,"_","_","_","alaṃkṛ","PPP","","_","_"
4,"kāle","_","_","kāla","NC","","_","_"
5,"tiṣṭhethā","_","_","tiṣṭh","V","sthā","_","_"
6,"_","_","_","bhūri","JQ","","_","_"
7,"_","_","_","dakṣiṇā","NC","","_","_"
1,"_","_","_","cakra","NC","","_","_"
2,"_","_","_","vat","CX","","_","_"
3,"karmaṇāṃ","_","_","karman","NC","","_","_"
4,"tāta","_","_","tāta","NC","","_","_"
5,"paryāyo","_","_","paryāya","NC","","_","_"
6,"_","_","_","hi","CX","","_","_"
7,"_","_","_","tad","PRD","","_","_"
8,"nityaśaḥ","_","_","nityaśas","CX","","_","_"
1,"kośasya","_","_","kośa","NC","","_","_"
2,"saṃcaye","_","_","saṃcaya","NC","","_","_"
3,"yatnaṃ","_","_","yatna","NC","","_","_"
4,"kurvīthā","_","_","kar","V","kṛ","_","_"
5,"nyāyataḥ","_","_","nyāya","NC","","_","_"
6,"sadā","_","_","sadā","CAD","","_","_"
1,"dvividhasya","_","_","dvividha","JJ","","_","_"
2,"_","_","_","mahat","JJ","","_","_"
3,"_","_","_","rāja","NC","","_","_"
4,"viparītaṃ","_","_","viparīta","JJ","","_","_"
5,"vivarjayeḥ","_","_","vivarjay","V","vivarjay","_","_"
1,"cārair","_","_","cāra","NC","","_","_"
2,"viditvā","_","_","vid","CGDA","","_","_"
3,"_","_","_","śatru","NC","","_","_"
4,"_","_","_","ca","CCD","","_","_"
5,"ye","_","_","yad","PRL","","_","_"
6,"te","_","_","tvat","PPR","","_","_"
7,"_","_","_","rājya","NC","","_","_"
8,"_","_","_","antarāyin","JJ","","_","_"
1,"tān","_","_","tad","PRD","","_","_"
2,"āptaiḥ","_","_","āpta","JJ","","_","_"
3,"puruṣair","_","_","puruṣa","NC","","_","_"
4,"dūrād","_","_","dūrāt","CX","","_","_"
5,"ghātayethāḥ","_","_","ghātay","V","ghātay","_","_"
6,"parasparam","_","_","paraspara","PRC","","_","_"
1,"_","_","_","karman","NC","","_","_"
2,"_","_","_","dṛṣṭi","NC","","_","_"
3,"_","_","_","atha","CAD","","_","_"
4,"_","_","_","bhṛtya","NC","","_","_"
5,"_","_","_","tvat","PPR","","_","_"
6,"varayethāḥ","_","_","varay","V","varay","_","_"
7,"_","_","_","kuru","NC","","_","_"
8,"_","_","_","udvaha","NC","","_","_"
1,"_","_","_","kāray","V","kāray","_","_"
2,"_","_","_","ca","CCD","","_","_"
3,"karmāṇi","_","_","karman","NC","","_","_"
4,"_","_","_","yuj","PPP","","_","_"
5,"_","_","_","ayukta","JJ","","_","_"
6,"adhiṣṭhitaiḥ","_","_","adhiṣṭhā","PPP","","_","_"
1,"_","_","_","senā","NC","","_","_"
2,"_","_","_","praṇetṛ","NC","","_","_"
3,"ca","_","_","ca","CCD","","_","_"
4,"bhavet","_","_","bhav","V","bhū","_","_"
5,"tava","_","_","tvat","PPR","","_","_"
6,"tāta","_","_","tāta","NC","","_","_"
7,"_","_","_","dṛḍha","JJ","","_","_"
8,"_","_","_","vrata","NC","","_","_"
1,"śūraḥ","_","_","śūra","NC","","_","_"
2,"_","_","_","kleśa","NC","","_","_"
3,"_","_","_","saha","JJ","","_","_"
4,"_","_","_","ca","CCD","","_","_"
5,"_","_","_","eva","CEM","","_","_"
6,"_","_","_","priya","JJ","","_","_"
7,"_","_","_","ca","CCD","","_","_"
8,"tava","_","_","tvat","PPR","","_","_"
9,"mānavaḥ","_","_","mānava","NC","","_","_"
1,"sarve","_","_","sarva","JQ","","_","_"
2,"_","_","_","jānapada","NC","","_","_"
3,"_","_","_","ca","CCD","","_","_"
4,"_","_","_","eva","CEM","","_","_"
5,"tava","_","_","tvat","PPR","","_","_"
6,"karmāṇi","_","_","karman","NC","","_","_"
7,"pāṇḍava","_","_","pāṇḍava","NC","","_","_"
1,"_","_","_","paurogava","NC","","_","_"
2,"_","_","_","ca","CCD","","_","_"
3,"_","_","_","sabhya","NC","","_","_"
4,"_","_","_","ca","CCD","","_","_"
5,"kuryur","_","_","kar","V","kṛ","_","_"
6,"ye","_","_","yad","PRL","","_","_"
7,"vyavahāriṇaḥ","_","_","vyavahārin","JJ","","_","_"
1,"_","_","_","sva","JJ","","_","_"
2,"_","_","_","randhra","NC","","_","_"
3,"_","_","_","para","PPX","","_","_"
4,"_","_","_","randhra","NC","","_","_"
5,"ca","_","_","ca","CCD","","_","_"
6,"sveṣu","_","_","sva","JJ","","_","_"
7,"_","_","_","ca","CCD","","_","_"
8,"_","_","_","eva","CEM","","_","_"
9,"pareṣu","_","_","para","PPX","","_","_"
10,"ca","_","_","ca","CCD","","_","_"
1,"upalakṣayitavyaṃ","_","_","upalakṣay","KDG","","_","_"
2,"te","_","_","tvat","PPR","","_","_"
3,"nityam","_","_","nitya","CX","","_","_"
4,"eva","_","_","eva","CEM","","_","_"
5,"yudhiṣṭhira","_","_","yudhiṣṭhira","NC","","_","_"
1,"_","_","_","deśa","NC","","_","_"
2,"_","_","_","antara","JJ","","_","_"
3,"_","_","_","stha","JJ","","_","_"
4,"_","_","_","ca","CCD","","_","_"
5,"narā","_","_","nara","NC","","_","_"
6,"vikrāntāḥ","_","_","vikra","PPP","","_","_"
7,"_","_","_","sarva","JQ","","_","_"
8,"_","_","_","karman","NC","","_","_"
1,"mātrābhir","_","_","mātrā","NC","","_","_"
2,"anurūpābhir","_","_","anurūpa","JJ","","_","_"
3,"anugrāhyā","_","_","anugrah","KDG","","_","_"
4,"_","_","_","hita","JJ","","_","_"
5,"_","_","_","tvat","PPR","","_","_"
1,"_","_","_","guṇa","NC","","_","_"
2,"_","_","_","arthin","JJ","","_","_"
3,"guṇaḥ","_","_","guṇa","NC","","_","_"
4,"kāryo","_","_","kṛ","KDG","","_","_"
5,"viduṣāṃ","_","_","vidvas","JJ","","_","_"
6,"te","_","_","tvat","PPR","","_","_"
7,"janādhipa","_","_","janādhipa","NC","","_","_"
1,"_","_","_","a","CNG","","_","_"
2,"_","_","_","vicālay","KDG","","_","_"
3,"_","_","_","ca","CCD","","_","_"
4,"te","_","_","tad","PRD","","_","_"
5,"te","_","_","tvat","PPR","","_","_"
6,"syur","_","_","as","V","as","_","_"
7,"yathā","_","_","yathā","CCM","","_","_"
8,"merur","_","_","meru","NC","","_","_"
9,"_","_","_","mahat","JJ","","_","_"
10,"_","_","_","giri","NC","","_","_"
