"WordID","word","NormSTEM","suffix","lemma","PoS","Root","NormSuffix","NormWord"
1,"kaṇva","_","_","kaṇva","NC","","_","_"
2,"uvāca","_","_","vak","V","vac","_","_"
1,"_","_","_","garuḍa","NC","","_","_"
2,"_","_","_","tad","PRD","","_","_"
3,"tu","_","_","tu","CCD","","_","_"
4,"śuśrāva","_","_","śṛṇ","V","śru","_","_"
5,"yathāvṛttaṃ","_","_","yathāvṛtta","NC","","_","_"
6,"_","_","_","mahat","JJ","","_","_"
7,"_","_","_","bala","NC","","_","_"
1,"_","_","_","āyus","NC","","_","_"
2,"_","_","_","pradāna","NC","","_","_"
3,"śakreṇa","_","_","śakra","NC","","_","_"
4,"kṛtaṃ","_","_","kṛ","PPP","","_","_"
5,"nāgasya","_","_","nāga","NC","","_","_"
6,"bhārata","_","_","bhārata","NC","","_","_"
1,"_","_","_","pakṣa","NC","","_","_"
2,"_","_","_","vāta","NC","","_","_"
3,"mahatā","_","_","mahat","JJ","","_","_"
4,"ruddhvā","_","_","rudh","CGDA","","_","_"
5,"tribhuvanaṃ","_","_","tribhuvana","NC","","_","_"
6,"khagaḥ","_","_","khaga","NC","","_","_"
1,"suparṇaḥ","_","_","suparṇa","NC","","_","_"
2,"_","_","_","parama","JJ","","_","_"
3,"_","_","_","krudh","PPP","","_","_"
4,"vāsavaṃ","_","_","vāsava","NC","","_","_"
5,"samupādravat","_","_","samupadru","V","samupadru","_","_"
1,"garuḍa","_","_","garuḍa","NC","","_","_"
2,"uvāca","_","_","vak","V","vac","_","_"
1,"bhagavan","_","_","bhagavat","JJ","","_","_"
2,"kim","_","_","kim","CX","","_","_"
3,"avajñānāt","_","_","avajñāna","NC","","_","_"
4,"kṣudhāṃ","_","_","kṣudhā","NC","","_","_"
5,"prati","_","_","prati","CADP","","_","_"
6,"bhaye","_","_","bhaya","NC","","_","_"
7,"mama","_","_","mat","PPR","","_","_"
1,"_","_","_","kāmakāra","NC","","_","_"
2,"_","_","_","vara","NC","","_","_"
3,"dattvā","_","_","dā","CGDA","","_","_"
4,"punaś","_","_","punar","CAD","","_","_"
5,"calitavān","_","_","cal","KDP","","_","_"
6,"asi","_","_","as","V","as","_","_"
1,"nisargāt","_","_","nisarga","NC","","_","_"
2,"_","_","_","sarva","JQ","","_","_"
3,"_","_","_","bhūta","NC","","_","_"
4,"_","_","_","sarva","JQ","","_","_"
5,"_","_","_","bhūta","NC","","_","_"
6,"_","_","_","īśvara","NC","","_","_"
7,"me","_","_","mat","PPR","","_","_"
1,"āhāro","_","_","āhāra","NC","","_","_"
2,"vihito","_","_","vidhā","PPP","","_","_"
3,"dhātrā","_","_","dhātṛ","NC","","_","_"
4,"kimarthaṃ","_","_","kimartha","CX","","_","_"
5,"vāryate","_","_","vṛ","V","vṛ","_","_"
6,"tvayā","_","_","tvat","PPR","","_","_"
1,"_","_","_","vṛ","PPP","","_","_"
2,"_","_","_","ca","CCD","","_","_"
3,"_","_","_","tad","PRD","","_","_"
4,"_","_","_","mahat","JJ","","_","_"
5,"_","_","_","nāga","NC","","_","_"
6,"sthāpitaḥ","_","_","sthāpay","PPP","","_","_"
7,"_","_","_","samaya","NC","","_","_"
8,"_","_","_","ca","CCD","","_","_"
9,"me","_","_","mat","PPR","","_","_"
1,"anena","_","_","ida","PRD","","_","_"
2,"ca","_","_","ca","CCD","","_","_"
3,"mayā","_","_","mat","PPR","","_","_"
4,"deva","_","_","deva","NC","","_","_"
5,"bhartavyaḥ","_","_","bhṛ","KDG","","_","_"
6,"prasavo","_","_","prasava","NC","","_","_"
7,"mahān","_","_","mahat","JJ","","_","_"
1,"_","_","_","tad","PRD","","_","_"
2,"_","_","_","tu","CCD","","_","_"
3,"_","_","_","anyathābhūta","JJ","","_","_"
4,"_","_","_","na","CNG","","_","_"
5,"_","_","_","anya","PPX","","_","_"
6,"hiṃsitum","_","_","hiṃs","CGDI","","_","_"
7,"utsahe","_","_","utsaha","V","utsah","_","_"
1,"krīḍase","_","_","krīḍ","V","krīḍ","_","_"
2,"kāmakāreṇa","_","_","kāmakāra","NC","","_","_"
3,"devarāja","_","_","devarāja","NC","","_","_"
4,"yathecchakam","_","_","yathecchaka","JJ","","_","_"
1,"so","_","_","tad","PRD","","_","_"
2,"'haṃ","_","_","mat","PPR","","_","_"
3,"prāṇān","_","_","prāṇa","NC","","_","_"
4,"vimokṣyāmi","_","_","vimuñc","V","vimuc","_","_"
5,"tathā","_","_","tathā","CX","","_","_"
6,"parijano","_","_","parijana","NC","","_","_"
7,"mama","_","_","mat","PPR","","_","_"
1,"ye","_","_","yad","PRL","","_","_"
2,"ca","_","_","ca","CCD","","_","_"
3,"bhṛtyā","_","_","bhṛtya","NC","","_","_"
4,"mama","_","_","mat","PPR","","_","_"
5,"gṛhe","_","_","gṛha","NC","","_","_"
6,"prītimān","_","_","prītimat","JJ","","_","_"
7,"bhava","_","_","bhav","V","bhū","_","_"
8,"vāsava","_","_","vāsava","NC","","_","_"
1,"_","_","_","tad","PRD","","_","_"
2,"_","_","_","ca","CCD","","_","_"
3,"_","_","_","eva","CEM","","_","_"
4,"_","_","_","mat","PPR","","_","_"
5,"arhāmi","_","_","arh","V","arh","_","_"
6,"_","_","_","bhūyas","CX","","_","_"
7,"_","_","_","ca","CCD","","_","_"
8,"_","_","_","bala","NC","","_","_"
9,"_","_","_","vṛtra","NC","","_","_"
10,"_","_","_","han","JJ","","_","_"
1,"_","_","_","trailokya","NC","","_","_"
2,"_","_","_","īśvara","NC","","_","_"
3,"yo","_","_","yad","PRL","","_","_"
4,"'haṃ","_","_","mat","PPR","","_","_"
5,"_","_","_","para","PPX","","_","_"
6,"_","_","_","bhṛtya","NC","","_","_"
8,"āgataḥ","_","_","āga","PPP","","_","_"
1,"tvayi","_","_","tvat","PPR","","_","_"
2,"tiṣṭhati","_","_","sthā","KDP","","_","_"
3,"deveśa","_","_","deveśa","NC","","_","_"
4,"na","_","_","na","CNG","","_","_"
5,"viṣṇuḥ","_","_","viṣṇu","NC","","_","_"
6,"kāraṇaṃ","_","_","kāraṇa","NC","","_","_"
7,"mama","_","_","mat","PPR","","_","_"
1,"_","_","_","trailokya","NC","","_","_"
2,"_","_","_","rāja","NC","","_","_"
3,"rājyaṃ","_","_","rājya","NC","","_","_"
4,"hi","_","_","hi","CX","","_","_"
5,"tvayi","_","_","tvat","PPR","","_","_"
6,"vāsava","_","_","vāsava","NC","","_","_"
7,"śāśvatam","_","_","śāśvata","JJ","","_","_"
1,"_","_","_","mat","PPR","","_","_"
2,"_","_","_","api","CX","","_","_"
3,"dakṣasya","_","_","dakṣa","NC","","_","_"
4,"sutā","_","_","sutā","NC","","_","_"
5,"jananī","_","_","jananī","NC","","_","_"
6,"kaśyapaḥ","_","_","kaśyapa","NC","","_","_"
7,"pitā","_","_","pitṛ","NC","","_","_"
1,"aham","_","_","mat","PPR","","_","_"
2,"_","_","_","api","CX","","_","_"
3,"_","_","_","utsah","V","utsah","_","_"
4,"lokān","_","_","loka","NC","","_","_"
5,"samastān","_","_","samasta","JJ","","_","_"
6,"voḍhum","_","_","vah","CGDI","","_","_"
7,"añjasā","_","_","añjasā","CX","","_","_"
1,"asahyaṃ","_","_","asahya","JJ","","_","_"
2,"_","_","_","sarva","JQ","","_","_"
3,"_","_","_","bhūta","NC","","_","_"
4,"_","_","_","mat","PPR","","_","_"
5,"_","_","_","api","CX","","_","_"
6,"vipulaṃ","_","_","vipula","JJ","","_","_"
7,"balam","_","_","bala","NC","","_","_"
1,"_","_","_","mat","PPR","","_","_"
2,"_","_","_","api","CX","","_","_"
3,"_","_","_","su","CAD","","_","_"
4,"_","_","_","mahat","JJ","","_","_"
5,"karma","_","_","karman","NC","","_","_"
6,"kṛtaṃ","_","_","kṛ","PPP","","_","_"
7,"_","_","_","daiteya","NC","","_","_"
8,"_","_","_","vigraha","NC","","_","_"
1,"_","_","_","śrutasa","NC","","_","_"
2,"_","_","_","ca","CCD","","_","_"
3,"vivasvān","_","_","vivasvat","NC","","_","_"
4,"rocanāmukhaḥ","_","_","rocanāmukha","NC","","_","_"
1,"prasabhaḥ","_","_","prasabha","JJ","","_","_"
2,"_","_","_","kālakākṣa","NC","","_","_"
3,"_","_","_","ca","CCD","","_","_"
4,"_","_","_","mat","PPR","","_","_"
5,"_","_","_","api","CX","","_","_"
6,"ditijā","_","_","ditija","NC","","_","_"
7,"hatāḥ","_","_","han","PPP","","_","_"
1,"yat","_","_","yat","CSB","","_","_"
2,"tu","_","_","tu","CCD","","_","_"
3,"_","_","_","dhvaja","NC","","_","_"
4,"_","_","_","sthāna","NC","","_","_"
5,"_","_","_","ga","PPP","","_","_"
6,"yatnāt","_","_","yatna","NC","","_","_"
7,"_","_","_","paricar","V","paricar","_","_"
8,"_","_","_","mat","PPR","","_","_"
1,"vahāmi","_","_","vah","V","vah","_","_"
2,"_","_","_","ca","CCD","","_","_"
3,"_","_","_","eva","CEM","","_","_"
4,"_","_","_","anuja","NC","","_","_"
5,"te","_","_","tvat","PPR","","_","_"
6,"tena","_","_","ta","CX","","_","_"
7,"mām","_","_","mat","PPR","","_","_"
8,"avamanyase","_","_","avaman","V","avaman","_","_"
1,"ko","_","_","kiṃ","PRQ","","_","_"
2,"'nyo","_","_","anya","PPX","","_","_"
3,"_","_","_","bhāra","NC","","_","_"
4,"_","_","_","saha","JJ","","_","_"
5,"_","_","_","hi","CX","","_","_"
6,"_","_","_","as","V","as","_","_"
7,"ko","_","_","kiṃ","PRQ","","_","_"
8,"'nyo","_","_","anya","PPX","","_","_"
9,"'sti","_","_","as","V","as","_","_"
10,"balavattaraḥ","_","_","balavattara","JJ","","_","_"
1,"mayā","_","_","mat","PPR","","_","_"
2,"yo","_","_","yad","PRL","","_","_"
3,"'haṃ","_","_","mat","PPR","","_","_"
4,"viśiṣṭaḥ","_","_","viśiṣ","PPP","","_","_"
5,"san","_","_","as","KDP","","_","_"
6,"_","_","_","vah","V","vah","_","_"
7,"_","_","_","ida","PRD","","_","_"
8,"_","_","_","sa_saha","CX","","_","_"
9,"_","_","_","bāndhava","NC","","_","_"
1,"avajñāya","_","_","avajñā","CGDA","","_","_"
2,"tu","_","_","tu","CCD","","_","_"
3,"yat","_","_","yat","CSB","","_","_"
4,"te","_","_","tvat","PPR","","_","_"
5,"'haṃ","_","_","mat","PPR","","_","_"
6,"bhojanād","_","_","bhojana","NC","","_","_"
7,"vyaparopitaḥ","_","_","vyaparopay","PPP","","_","_"
1,"tena","_","_","ta","CX","","_","_"
2,"me","_","_","mat","PPR","","_","_"
3,"gauravaṃ","_","_","gaurava","NC","","_","_"
4,"naṣṭaṃ","_","_","naś","PPP","","_","_"
5,"_","_","_","tvat","PPR","","_","_"
6,"_","_","_","ca","CCD","","_","_"
7,"_","_","_","ida","PRD","","_","_"
8,"_","_","_","ca","CCD","","_","_"
9,"vāsava","_","_","vāsava","NC","","_","_"
1,"adityāṃ","_","_","aditi","NC","","_","_"
2,"ya","_","_","yad","PRL","","_","_"
3,"ime","_","_","ida","PRD","","_","_"
4,"jātā","_","_","jan","PPP","","_","_"
5,"_","_","_","bala","NC","","_","_"
6,"_","_","_","vikrama","NC","","_","_"
7,"_","_","_","śālin","JJ","","_","_"
1,"tvam","_","_","tvat","PPR","","_","_"
2,"eṣāṃ","_","_","ida","PRD","","_","_"
3,"kila","_","_","kila","CX","","_","_"
4,"sarveṣāṃ","_","_","sarva","JQ","","_","_"
5,"viśeṣād","_","_","viśeṣāt","CX","","_","_"
6,"balavattaraḥ","_","_","balavattara","JJ","","_","_"
1,"so","_","_","tad","PRD","","_","_"
2,"'haṃ","_","_","mat","PPR","","_","_"
3,"_","_","_","pakṣa","NC","","_","_"
4,"_","_","_","eka","PPX","","_","_"
5,"_","_","_","deśa","NC","","_","_"
6,"vahāmi","_","_","vah","V","vah","_","_"
7,"tvāṃ","_","_","tvat","PPR","","_","_"
8,"_","_","_","ga","PPP","","_","_"
9,"_","_","_","klama","NC","","_","_"
1,"vimṛśa","_","_","vimṛś","V","vimṛś","_","_"
2,"tvaṃ","_","_","tvat","PPR","","_","_"
3,"_","_","_","śanais","CX","","_","_"
4,"_","_","_","tāta","NC","","_","_"
5,"ko","_","_","kiṃ","PRQ","","_","_"
6,"_","_","_","nu","CX","","_","_"
7,"_","_","_","atra","CAD","","_","_"
8,"balavān","_","_","balavat","JJ","","_","_"
9,"iti","_","_","iti","CQT","","_","_"
1,"kaṇva","_","_","kaṇva","NC","","_","_"
2,"uvāca","_","_","vak","V","vac","_","_"
1,"tasya","_","_","tad","PRD","","_","_"
2,"tad","_","_","tad","PRD","","_","_"
3,"vacanaṃ","_","_","vacana","NC","","_","_"
4,"śrutvā","_","_","śru","CGDA","","_","_"
5,"_","_","_","khaga","NC","","_","_"
6,"_","_","_","udarka","NC","","_","_"
7,"_","_","_","dāruṇa","JJ","","_","_"
1,"akṣobhyaṃ","_","_","akṣobhya","JJ","","_","_"
2,"_","_","_","kṣobhay","KDP","","_","_"
3,"_","_","_","tārkṣya","NC","","_","_"
4,"uvāca","_","_","vak","V","vac","_","_"
5,"_","_","_","ratha","NC","","_","_"
6,"_","_","_","cakra","NC","","_","_"
7,"_","_","_","bhṛt","JJ","","_","_"
1,"_","_","_","garutmat","NC","","_","_"
2,"_","_","_","man","V","man","_","_"
3,"'%%tmānaṃ","_","_","balavat","JJ","","_","_"
4,"_","_","_","su","CAD","","_","_"
5,"_","_","_","durbala","JJ","","_","_"
1,"alam","_","_","ala","CX","","_","_"
2,"_","_","_","mat","PPR","","_","_"
3,"_","_","_","samakṣa","JJ","","_","_"
4,"te","_","_","tvat","PPR","","_","_"
5,"stotum","_","_","stu","CGDI","","_","_"
6,"ātmānam","_","_","ātman","NC","","_","_"
7,"aṇḍaja","_","_","aṇḍaja","NC","","_","_"
1,"trailokyam","_","_","trailokya","NC","","_","_"
2,"api","_","_","api","CX","","_","_"
3,"me","_","_","mat","PPR","","_","_"
4,"kṛtsnam","_","_","kṛtsna","JJ","","_","_"
5,"aśaktaṃ","_","_","aśakta","JJ","","_","_"
6,"_","_","_","deha","NC","","_","_"
7,"_","_","_","dhāraṇa","NC","","_","_"
1,"aham","_","_","mat","PPR","","_","_"
2,"_","_","_","eva","CEM","","_","_"
3,"_","_","_","ātman","NC","","_","_"
4,"_","_","_","ātman","NC","","_","_"
5,"vahāmi","_","_","vah","V","vah","_","_"
6,"tvāṃ","_","_","tvat","PPR","","_","_"
7,"ca","_","_","ca","CCD","","_","_"
8,"dhāraye","_","_","dhāray","V","dhāray","_","_"
1,"imaṃ","_","_","ida","PRD","","_","_"
2,"_","_","_","tāvat","CX","","_","_"
3,"_","_","_","mat","PPR","","_","_"
4,"_","_","_","eka","PPX","","_","_"
5,"tvaṃ","_","_","tvat","PPR","","_","_"
6,"bāhuṃ","_","_","bāhu","NC","","_","_"
7,"savyetaraṃ","_","_","savyetara","JJ","","_","_"
8,"vaha","_","_","vah","V","vah","_","_"
1,"_","_","_","yadi","CSB","","_","_"
2,"_","_","_","a","PRD","","_","_"
3,"_","_","_","dhāray","V","dhāray","_","_"
4,"_","_","_","eka","PPX","","_","_"
5,"_","_","_","sa_saha","CX","","_","_"
6,"_","_","_","phala","NC","","_","_"
7,"te","_","_","tvat","PPR","","_","_"
8,"vikatthitam","_","_","vikatth","PPP","","_","_"
1,"tataḥ","_","_","tatas","CX","","_","_"
2,"sa","_","_","tad","PRD","","_","_"
3,"_","_","_","bhagavat","NC","","_","_"
4,"_","_","_","tad","PRD","","_","_"
5,"skandhe","_","_","skandha","NC","","_","_"
6,"bāhuṃ","_","_","bāhu","NC","","_","_"
7,"samāsajat","_","_","samāsañj","V","samāsañj","_","_"
1,"nipapāta","_","_","nipat","V","nipat","_","_"
2,"sa","_","_","tad","PRD","","_","_"
3,"_","_","_","bhāra","NC","","_","_"
4,"_","_","_","ārta","JJ","","_","_"
5,"vihvalo","_","_","vihvala","JJ","","_","_"
6,"_","_","_","naś","PPP","","_","_"
7,"_","_","_","cetanā","NC","","_","_"
1,"yāvān","_","_","yāvat","JJ","","_","_"
2,"hi","_","_","hi","CX","","_","_"
3,"bhāraḥ","_","_","bhāra","NC","","_","_"
4,"kṛtsnāyāḥ","_","_","kṛtsna","JJ","","_","_"
5,"pṛthivyāḥ","_","_","pṛthivī","NC","","_","_"
6,"parvataiḥ","_","_","parvata","NC","","_","_"
7,"saha","_","_","saha","CX","","_","_"
1,"ekasyā","_","_","eka","PPX","","_","_"
2,"_","_","_","deha","NC","","_","_"
3,"_","_","_","śākhā","NC","","_","_"
4,"_","_","_","tāvat","CX","","_","_"
5,"bhāram","_","_","bhāra","NC","","_","_"
6,"amanyata","_","_","man","V","man","_","_"
1,"na","_","_","na","CNG","","_","_"
2,"_","_","_","tu","CCD","","_","_"
3,"_","_","_","a","PRD","","_","_"
4,"pīḍayāmāsa","_","_","pīḍay","V","pīḍay","_","_"
5,"balena","_","_","bala","NC","","_","_"
6,"balavattaraḥ","_","_","balavattara","JJ","","_","_"
1,"tato","_","_","tatas","CX","","_","_"
2,"hi","_","_","hi","CX","","_","_"
3,"jīvitaṃ","_","_","jīvita","NC","","_","_"
4,"tasya","_","_","tad","PRD","","_","_"
5,"na","_","_","na","CNG","","_","_"
6,"vyanīnaśad","_","_","vinaś","V","vinaś","_","_"
7,"acyutaḥ","_","_","acyuta","JJ","","_","_"
1,"vipakṣaḥ","_","_","vipakṣa","JJ","","_","_"
2,"_","_","_","sraṃs","PPP","","_","_"
3,"_","_","_","kāya","NC","","_","_"
4,"_","_","_","ca","CCD","","_","_"
5,"vicetā","_","_","vicetas","JJ","","_","_"
6,"vihvalaḥ","_","_","vihvala","JJ","","_","_"
7,"khagaḥ","_","_","khaga","NC","","_","_"
1,"mumoca","_","_","muñc","V","muc","_","_"
2,"patrāṇi","_","_","pattra","NC","","_","_"
3,"tadā","_","_","tadā","CAD","","_","_"
4,"_","_","_","guru","JJ","","_","_"
5,"_","_","_","bhāra","NC","","_","_"
6,"_","_","_","prapīḍay","PPP","","_","_"
1,"sa","_","_","sa_saha","CX","","_","_"
2,"viṣṇuṃ","_","_","viṣṇu","NC","","_","_"
3,"śirasā","_","_","śiras","NC","","_","_"
4,"pakṣī","_","_","pakṣin","NC","","_","_"
5,"praṇamya","_","_","praṇa","CGDA","","_","_"
6,"_","_","_","vinatā","NC","","_","_"
7,"_","_","_","suta","NC","","_","_"
1,"vicetā","_","_","vicetas","JJ","","_","_"
2,"vihvalo","_","_","vihvala","JJ","","_","_"
3,"dīnaḥ","_","_","dīna","JJ","","_","_"
4,"kiṃcid","_","_","kiṃcit","PRI","","_","_"
5,"vacanam","_","_","vacana","NC","","_","_"
6,"abravīt","_","_","abravīta","V","brū","_","_"
1,"bhagavaṃl","_","_","bhagavat","NC","","_","_"
2,"_","_","_","loka","NC","","_","_"
3,"_","_","_","sāra","NC","","_","_"
4,"sadṛśena","_","_","sadṛśa","JJ","","_","_"
5,"vapuṣmatā","_","_","vapuṣmat","JJ","","_","_"
1,"bhujena","_","_","bhuja","NC","","_","_"
2,"_","_","_","svaira","JJ","","_","_"
3,"_","_","_","muc","PPP","","_","_"
4,"niṣpiṣṭo","_","_","niṣpiṣ","PPP","","_","_"
5,"'smi","_","_","as","V","as","_","_"
6,"_","_","_","mahī","NC","","_","_"
7,"_","_","_","tala","NC","","_","_"
1,"kṣantum","_","_","kṣa","CGDI","","_","_"
2,"arhasi","_","_","arh","V","arh","_","_"
3,"me","_","_","mat","PPR","","_","_"
4,"deva","_","_","deva","NC","","_","_"
5,"_","_","_","vihvala","JJ","","_","_"
6,"_","_","_","alpa","JJ","","_","_"
7,"_","_","_","cetas","NC","","_","_"
1,"_","_","_","bala","NC","","_","_"
2,"_","_","_","dāha","NC","","_","_"
3,"_","_","_","vidah","PPP","","_","_"
4,"pakṣiṇo","_","_","pakṣin","NC","","_","_"
5,"_","_","_","dhvaja","NC","","_","_"
6,"_","_","_","vāsin","JJ","","_","_"
1,"na","_","_","na","CNG","","_","_"
2,"vijñātaṃ","_","_","vijñā","PPP","","_","_"
3,"balaṃ","_","_","bala","NC","","_","_"
4,"deva","_","_","deva","NC","","_","_"
5,"mayā","_","_","mat","PPR","","_","_"
6,"te","_","_","tvat","PPR","","_","_"
7,"paramaṃ","_","_","parama","JJ","","_","_"
8,"vibho","_","_","vibhu","JJ","","_","_"
1,"tena","_","_","ta","CX","","_","_"
2,"_","_","_","man","V","man","_","_"
3,"_","_","_","mat","PPR","","_","_"
4,"vīryam","_","_","vīrya","NC","","_","_"
5,"ātmano","_","_","ātman","NC","","_","_"
6,"'sadṛśaṃ","_","_","asadṛśa","JJ","","_","_"
7,"paraiḥ","_","_","para","PPX","","_","_"
1,"_","_","_","tatas","CX","","_","_"
2,"_","_","_","kar","V","kṛ","_","_"
3,"sa","_","_","tad","PRD","","_","_"
4,"bhagavān","_","_","bhagavat","NC","","_","_"
5,"prasādaṃ","_","_","prasāda","NC","","_","_"
6,"vai","_","_","vai","CX","","_","_"
7,"garutmataḥ","_","_","garutmat","NC","","_","_"
1,"_","_","_","mā","CNG","","_","_"
2,"_","_","_","eva","CX","","_","_"
3,"bhūya","_","_","bhūyas","CX","","_","_"
4,"iti","_","_","iti","CQT","","_","_"
5,"snehāt","_","_","sneha","NC","","_","_"
6,"tadā","_","_","tadā","CAD","","_","_"
7,"_","_","_","ca","CCD","","_","_"
8,"_","_","_","a","PRD","","_","_"
9,"uvāca","_","_","vak","V","vac","_","_"
10,"ha","_","_","ha","CEM","","_","_"
1,"tathā","_","_","tathā","CX","","_","_"
2,"tvam","_","_","tvat","PPR","","_","_"
3,"api","_","_","api","CX","","_","_"
4,"gāndhāre","_","_","gāndhāri","NC","","_","_"
5,"yāvat","_","_","yāvat","CX","","_","_"
6,"_","_","_","pāṇḍu","NC","","_","_"
7,"_","_","_","suta","NC","","_","_"
8,"raṇe","_","_","raṇa","NC","","_","_"
1,"_","_","_","na","CNG","","_","_"
2,"_","_","_","āsāday","V","āsāday","_","_"
3,"tān","_","_","tad","PRD","","_","_"
4,"_","_","_","vīra","NC","","_","_"
5,"_","_","_","tāvat","CX","","_","_"
6,"_","_","_","jīv","V","jīv","_","_"
7,"putraka","_","_","putraka","NC","","_","_"
1,"bhīmaḥ","_","_","bhīma","NC","","_","_"
2,"praharatāṃ","_","_","prahṛ","KDP","","_","_"
3,"śreṣṭho","_","_","śreṣṭha","JJ","","_","_"
4,"vāyuputro","_","_","vāyuputra","NC","","_","_"
5,"_","_","_","mahat","JJ","","_","_"
6,"_","_","_","bala","NC","","_","_"
1,"_","_","_","dhanaṃjaya","NC","","_","_"
2,"_","_","_","ca","CCD","","_","_"
3,"_","_","_","indra","NC","","_","_"
4,"_","_","_","suta","NC","","_","_"
5,"na","_","_","na","CNG","","_","_"
6,"hanyātāṃ","_","_","han","V","han","_","_"
7,"tu","_","_","tu","CCD","","_","_"
8,"kaṃ","_","_","kiṃ","PRQ","","_","_"
9,"raṇe","_","_","raṇa","NC","","_","_"
1,"viṣṇur","_","_","viṣṇu","NC","","_","_"
2,"_","_","_","vāyu","NC","","_","_"
3,"_","_","_","ca","CCD","","_","_"
4,"_","_","_","śakra","NC","","_","_"
5,"_","_","_","ca","CCD","","_","_"
6,"_","_","_","dharma","NC","","_","_"
7,"_","_","_","tad","PRD","","_","_"
8,"_","_","_","ca","CCD","","_","_"
9,"_","_","_","aśvin","NC","","_","_"
10,"_","_","_","ubh","PPX","","_","_"
1,"ete","_","_","tad","PRD","","_","_"
2,"_","_","_","deva","NC","","_","_"
3,"_","_","_","tvat","PPR","","_","_"
4,"kena","_","_","kiṃ","PRQ","","_","_"
5,"hetunā","_","_","hetu","NC","","_","_"
6,"śakyam","_","_","śakya","JJ","","_","_"
7,"īkṣitum","_","_","īkṣ","CGDI","","_","_"
1,"tad","_","_","tad","PRD","","_","_"
2,"alaṃ","_","_","ala","CX","","_","_"
3,"te","_","_","tvat","PPR","","_","_"
4,"virodhena","_","_","virodha","NC","","_","_"
5,"śamaṃ","_","_","śama","NC","","_","_"
6,"gaccha","_","_","ga","V","ga","_","_"
7,"_","_","_","nṛpa","NC","","_","_"
8,"_","_","_","ātmaja","NC","","_","_"
1,"vāsudevena","_","_","vāsudeva","JJ","","_","_"
2,"tīrthena","_","_","tīrtha","NC","","_","_"
3,"kulaṃ","_","_","kula","NC","","_","_"
4,"rakṣitum","_","_","rakṣ","CGDI","","_","_"
5,"arhasi","_","_","arh","V","arh","_","_"
1,"pratyakṣo","_","_","pratyakṣa","JJ","","_","_"
2,"_","_","_","hi","CX","","_","_"
3,"_","_","_","ida","PRD","","_","_"
4,"sarvasya","_","_","sarva","JQ","","_","_"
5,"nārado","_","_","nārada","NC","","_","_"
6,"'yaṃ","_","_","ida","PRD","","_","_"
7,"_","_","_","mahat","JJ","","_","_"
8,"_","_","_","tapas","NC","","_","_"
1,"māhātmyaṃ","_","_","māhātmya","NC","","_","_"
2,"yat","_","_","yad","PRL","","_","_"
3,"tadā","_","_","tadā","CAD","","_","_"
4,"viṣṇor","_","_","viṣṇu","NC","","_","_"
5,"yo","_","_","yad","PRL","","_","_"
6,"'yaṃ","_","_","ida","PRD","","_","_"
7,"_","_","_","cakra","NC","","_","_"
8,"_","_","_","gadā","NC","","_","_"
9,"_","_","_","dhara","JJ","","_","_"
1,"vaiśaṃpāyana","_","_","vaiśampāyana","NC","","_","_"
2,"uvāca","_","_","vak","V","vac","_","_"
1,"_","_","_","duryodhana","NC","","_","_"
2,"_","_","_","tu","CCD","","_","_"
3,"_","_","_","tad","PRD","","_","_"
4,"_","_","_","śru","CGDA","","_","_"
5,"niḥśvasan","_","_","niḥśvas","KDP","","_","_"
6,"_","_","_","bhṛkuṭī","NC","","_","_"
7,"_","_","_","mukha","NC","","_","_"
1,"rādheyam","_","_","rādheya","NC","","_","_"
2,"abhisamprekṣya","_","_","abhisamprekṣ","CGDA","","_","_"
3,"jahāsa","_","_","has","V","has","_","_"
4,"svanavat","_","_","svanavat","JJ","","_","_"
5,"tadā","_","_","tadā","CAD","","_","_"
1,"kadarthīkṛtya","_","_","kadarthīkṛ","CGDA","","_","_"
2,"tad","_","_","tad","PRD","","_","_"
3,"vākyam","_","_","vākya","NC","","_","_"
4,"ṛṣeḥ","_","_","ṛṣi","NC","","_","_"
5,"kaṇvasya","_","_","kaṇva","NC","","_","_"
6,"durmatiḥ","_","_","durmati","JJ","","_","_"
1,"ūruṃ","_","_","ūru","NC","","_","_"
2,"_","_","_","gaja","NC","","_","_"
3,"_","_","_","kara","NC","","_","_"
4,"_","_","_","ākāra","NC","","_","_"
5,"tāḍayann","_","_","tāḍay","KDP","","_","_"
6,"idam","_","_","ida","PRD","","_","_"
7,"abravīt","_","_","abravīta","V","brū","_","_"
1,"_","_","_","yathā","CCM","","_","_"
2,"_","_","_","eva","CEM","","_","_"
3,"_","_","_","īśvara","NC","","_","_"
4,"_","_","_","sṛj","PPP","","_","_"
5,"'smi","_","_","as","V","as","_","_"
6,"yad","_","_","yad","PRL","","_","_"
7,"bhāvi","_","_","bhāvin","JJ","","_","_"
8,"yā","_","_","yad","PRL","","_","_"
9,"ca","_","_","ca","CCD","","_","_"
10,"me","_","_","mat","PPR","","_","_"
11,"gatiḥ","_","_","gati","NC","","_","_"
1,"tathā","_","_","tathā","CX","","_","_"
2,"_","_","_","mahat","JJ","","_","_"
3,"_","_","_","ṛṣi","NC","","_","_"
4,"vartāmi","_","_","vart","V","vṛt","_","_"
5,"kiṃ","_","_","kim","CX","","_","_"
6,"pralāpaḥ","_","_","pralāpa","NC","","_","_"
7,"kariṣyati","_","_","kar","V","kṛ","_","_"
