"WordID","word","NormSTEM","suffix","lemma","PoS","Root","NormSuffix","NormWord"
1,"pra","_","_","pra","CADP","","_","_"
2,"vaḥ","_","_","tvat","PPR","","_","_"
3,"śukrāya","_","_","śukra","JJ","","_","_"
4,"bhānave","_","_","bhānu","NC","","_","_"
5,"bharadhvaṃ","_","_","bhṛ","V","bhṛ","_","_"
6,"havyam","_","_","havya","NC","","_","_"
7,"matiṃ","_","_","mati","NC","","_","_"
8,"_","_","_","ca","CCD","","_","_"
9,"_","_","_","agni","NC","","_","_"
10,"_","_","_","su","CAD","","_","_"
11,"_","_","_","pū","PPP","","_","_"
1,"yo","_","_","yad","PRL","","_","_"
2,"daivyāni","_","_","daivya","JJ","","_","_"
3,"mānuṣā","_","_","mānuṣa","JJ","","_","_"
4,"janūṃṣy","_","_","janus","NC","","_","_"
5,"antar","_","_","antar","CAD","","_","_"
6,"viśvāni","_","_","viśva","JQ","","_","_"
7,"vidmanā","_","_","vidman","NC","","_","_"
8,"jigāti","_","_","gā","V","gā","_","_"
1,"sa","_","_","tad","PRD","","_","_"
2,"gṛtso","_","_","gṛtsa","JJ","","_","_"
3,"agnis","_","_","agni","NC","","_","_"
4,"taruṇaś","_","_","taruṇa","JJ","","_","_"
5,"cid","_","_","cit","CEM","","_","_"
6,"astu","_","_","as","V","as","_","_"
7,"yato","_","_","yatas","CX","","_","_"
8,"yaviṣṭho","_","_","yaviṣṭha","JJ","","_","_"
9,"ajaniṣṭa","_","_","jan","V","jan","_","_"
10,"mātuḥ","_","_","mātṛ","NC","","_","_"
1,"saṃ","_","_","sa","CADP","","_","_"
2,"yo","_","_","yad","PRL","","_","_"
3,"vanā","_","_","vana","NC","","_","_"
4,"yuvate","_","_","yu","V","yu","_","_"
5,"śucidan","_","_","śucidat","JJ","","_","_"
6,"bhūri","_","_","bhūri","JQ","","_","_"
7,"cid","_","_","cit","CEM","","_","_"
8,"annā","_","_","anna","NC","","_","_"
9,"sam","_","_","sa","CADP","","_","_"
10,"id","_","_","id","CEM","","_","_"
11,"atti","_","_","ad","V","ad","_","_"
12,"sadyaḥ","_","_","sadyas","CAD","","_","_"
1,"asya","_","_","ida","PRD","","_","_"
2,"devasya","_","_","deva","NC","","_","_"
3,"saṃsady","_","_","saṃsad","NC","","_","_"
4,"anīke","_","_","anīka","NC","","_","_"
5,"yam","_","_","yad","PRL","","_","_"
6,"martāsaḥ","_","_","marta","NC","","_","_"
7,"śyetaṃ","_","_","śyeta","JJ","","_","_"
8,"jagṛbhre","_","_","grah","V","grah","_","_"
1,"ni","_","_","ni","CADP","","_","_"
2,"yo","_","_","yad","PRL","","_","_"
3,"gṛbham","_","_","gṛbh","NC","","_","_"
4,"pauruṣeyīm","_","_","pauruṣeya","JJ","","_","_"
5,"uvoca","_","_","uc","V","uc","_","_"
6,"durokam","_","_","duroka","CX","","_","_"
7,"agnir","_","_","agni","NC","","_","_"
8,"āyave","_","_","āyu","NC","","_","_"
9,"śuśoca","_","_","śuc","V","śuc","_","_"
1,"ayaṃ","_","_","ida","PRD","","_","_"
2,"kavir","_","_","kavi","NC","","_","_"
3,"akaviṣu","_","_","akavi","JJ","","_","_"
4,"pracetā","_","_","pracetas","NC","","_","_"
5,"marteṣv","_","_","marta","NC","","_","_"
6,"agnir","_","_","agni","NC","","_","_"
7,"amṛto","_","_","amṛta","JJ","","_","_"
8,"ni","_","_","ni","CADP","","_","_"
9,"dhāyi","_","_","dadh","V","dhā","_","_"
1,"sa","_","_","tad","PRD","","_","_"
2,"mā","_","_","mā","CNG","","_","_"
3,"no","_","_","mat","PPR","","_","_"
4,"atra","_","_","atra","CAD","","_","_"
5,"juhuraḥ","_","_","hvṛ","V","hvṛ","_","_"
6,"sahasvaḥ","_","_","sahasvat","JJ","","_","_"
7,"sadā","_","_","sadā","CAD","","_","_"
8,"tve","_","_","tvat","PPR","","_","_"
9,"sumanasaḥ","_","_","sumanas","JJ","","_","_"
10,"syāma","_","_","as","V","as","_","_"
1,"ā","_","_","ā","CADP","","_","_"
2,"yo","_","_","yad","PRL","","_","_"
3,"yoniṃ","_","_","yoni","NC","","_","_"
4,"_","_","_","deva","NC","","_","_"
5,"_","_","_","kṛ","PPP","","_","_"
6,"sasāda","_","_","sīd","V","sad","_","_"
7,"kratvā","_","_","kratu","NC","","_","_"
8,"hy","_","_","hi","CX","","_","_"
9,"agnir","_","_","agni","NC","","_","_"
10,"amṛtāṁ","_","_","amṛta","JJ","","_","_"
11,"atārīt","_","_","tar","V","tṛ","_","_"
1,"tam","_","_","tad","PRD","","_","_"
2,"oṣadhīś","_","_","oṣadhī","NC","","_","_"
3,"ca","_","_","ca","CCD","","_","_"
4,"vaninaś","_","_","vanin","NC","","_","_"
5,"ca","_","_","ca","CCD","","_","_"
6,"garbham","_","_","garbha","NC","","_","_"
7,"bhūmiś","_","_","bhūmi","NC","","_","_"
8,"ca","_","_","ca","CCD","","_","_"
9,"_","_","_","viśva","JQ","","_","_"
10,"_","_","_","dhāyas","JJ","","_","_"
11,"bibharti","_","_","bhṛ","V","bhṛ","_","_"
1,"īśe","_","_","īś","V","īś","_","_"
2,"hy","_","_","hi","CX","","_","_"
3,"agnir","_","_","agni","NC","","_","_"
4,"amṛtasya","_","_","amṛta","NC","","_","_"
5,"bhūrer","_","_","bhūri","JQ","","_","_"
6,"īśe","_","_","īśa","NC","","_","_"
7,"rāyaḥ","_","_","rai","NC","","_","_"
8,"_","_","_","su","CAD","","_","_"
9,"_","_","_","vīrya","NC","","_","_"
10,"dātoḥ","_","_","dā","CGDI","","_","_"
1,"mā","_","_","mā","CNG","","_","_"
2,"tvā","_","_","tvat","PPR","","_","_"
3,"vayaṃ","_","_","mat","PPR","","_","_"
4,"sahasāvann","_","_","sahasāvat","JJ","","_","_"
5,"avīrā","_","_","avīra","JJ","","_","_"
6,"_","_","_","mā","CNG","","_","_"
7,"_","_","_","apsu","JJ","","_","_"
8,"pari","_","_","pari","CADP","","_","_"
9,"ṣadāma","_","_","sīd","V","sad","_","_"
10,"_","_","_","mā","CNG","","_","_"
11,"_","_","_","a","CNG","","_","_"
12,"_","_","_","duvas","NC","","_","_"
1,"pariṣadyaṃ","_","_","pariṣad","KDG","","_","_"
2,"hy","_","_","hi","CX","","_","_"
3,"araṇasya","_","_","araṇa","JJ","","_","_"
4,"rekṇo","_","_","rekṇas","NC","","_","_"
5,"nityasya","_","_","nitya","JJ","","_","_"
6,"rāyaḥ","_","_","rai","NC","","_","_"
7,"patayaḥ","_","_","pati","NC","","_","_"
8,"syāma","_","_","as","V","as","_","_"
1,"na","_","_","na","CNG","","_","_"
2,"śeṣo","_","_","śeṣas","NC","","_","_"
3,"agne","_","_","agni","NC","","_","_"
4,"_","_","_","anya","PPX","","_","_"
5,"_","_","_","jan","PPP","","_","_"
6,"asty","_","_","as","V","as","_","_"
7,"acetānasya","_","_","acetāna","JJ","","_","_"
8,"mā","_","_","mā","CNG","","_","_"
9,"patho","_","_","pathin","NC","","_","_"
10,"vi","_","_","vi","CADP","","_","_"
11,"dukṣaḥ","_","_","duh","V","duh","_","_"
1,"nahi","_","_","nahi","CX","","_","_"
2,"_","_","_","grabha","NC","","_","_"
3,"_","_","_","araṇa","JJ","","_","_"
4,"_","_","_","su","CAD","","_","_"
5,"_","_","_","śeva","JJ","","_","_"
6,"_","_","_","anya","PPX","","_","_"
7,"_","_","_","udarya","JJ","","_","_"
8,"manasā","_","_","manas","NC","","_","_"
9,"mantavā","_","_","man","CGDI","","_","_"
10,"u","_","_","u","CEM","","_","_"
1,"adhā","_","_","adha","CX","","_","_"
2,"cid","_","_","cit","CEM","","_","_"
3,"okaḥ","_","_","oka","NC","","_","_"
4,"punar","_","_","punar","CAD","","_","_"
5,"it","_","_","id","CEM","","_","_"
6,"sa","_","_","tad","PRD","","_","_"
7,"ety","_","_","e","V","i","_","_"
8,"ā","_","_","ā","CADP","","_","_"
9,"no","_","_","mat","PPR","","_","_"
10,"vājy","_","_","vājin","NC","","_","_"
11,"abhīṣāﾱ","_","_","abhīṣāh","JJ","","_","_"
12,"etu","_","_","e","V","i","_","_"
13,"navyaḥ","_","_","navya","JJ","","_","_"
1,"tvam","_","_","tvat","PPR","","_","_"
2,"agne","_","_","agni","NC","","_","_"
3,"vanuṣyato","_","_","vanuṣy","KDP","","_","_"
4,"ni","_","_","ni","CADP","","_","_"
5,"pāhi","_","_","pib","V","pā","_","_"
6,"tvam","_","_","tvat","PPR","","_","_"
7,"u","_","_","u","CEM","","_","_"
8,"naḥ","_","_","mat","PPR","","_","_"
9,"sahasāvann","_","_","sahasāvat","JJ","","_","_"
10,"avadyāt","_","_","avadya","NC","","_","_"
1,"saṃ","_","_","sa","CADP","","_","_"
2,"tvā","_","_","tvat","PPR","","_","_"
3,"dhvasmanvad","_","_","dhvasmanvat","JJ","","_","_"
4,"abhy","_","_","abhi","CADP","","_","_"
5,"etu","_","_","e","V","i","_","_"
6,"pāthaḥ","_","_","pāthas","NC","","_","_"
7,"saṃ","_","_","sa","CADP","","_","_"
8,"rayi","_","_","rayi","NC","","_","_"
9,"spṛhayāyyaḥ","_","_","spṛhayāyya","JJ","","_","_"
10,"sahasrī","_","_","sahasrin","JJ","","_","_"
1,"etā","_","_","tad","PRD","","_","_"
2,"no","_","_","mat","PPR","","_","_"
3,"agne","_","_","agni","NC","","_","_"
4,"saubhagā","_","_","saubhaga","NC","","_","_"
5,"didīhy","_","_","dīdī","V","dīdī","_","_"
6,"api","_","_","api","CX","","_","_"
7,"kratuṃ","_","_","kratu","NC","","_","_"
8,"_","_","_","su","CAD","","_","_"
9,"_","_","_","cetas","NC","","_","_"
10,"vatema","_","_","vat","V","vat","_","_"
1,"viśvā","_","_","viśva","JQ","","_","_"
2,"stotṛbhyo","_","_","stotṛ","JJ","","_","_"
3,"gṛṇate","_","_","gṛ","KDP","","_","_"
4,"ca","_","_","ca","CCD","","_","_"
5,"santu","_","_","as","V","as","_","_"
6,"yūyam","_","_","tvat","PPR","","_","_"
7,"pāta","_","_","pib","V","pā","_","_"
8,"svastibhiḥ","_","_","svasti","NC","","_","_"
9,"sadā","_","_","sadā","CAD","","_","_"
10,"naḥ","_","_","mat","PPR","","_","_"
