"WordID","word","NormSTEM","suffix","lemma","PoS","Root","NormSuffix","NormWord"
1,"bhīṣma","_","_","bhīṣma","NC","","_","_"
2,"uvāca","_","_","vak","V","vac","_","_"
1,"sā","_","_","tad","PRD","","_","_"
2,"niṣkramantī","_","_","niṣkra","KDP","","_","_"
3,"_","_","_","nagara","NC","","_","_"
4,"_","_","_","cintay","V","cintay","_","_"
5,"bhārata","_","_","bhārata","NC","","_","_"
1,"pṛthivyāṃ","_","_","pṛthivī","NC","","_","_"
2,"_","_","_","na","CNG","","_","_"
3,"_","_","_","as","V","as","_","_"
4,"yuvatir","_","_","yuvati","NC","","_","_"
5,"_","_","_","viṣama","JJ","","_","_"
6,"_","_","_","sthatara","JJ","","_","_"
7,"mayā","_","_","mat","PPR","","_","_"
1,"bāndhavair","_","_","bāndhava","NC","","_","_"
2,"_","_","_","viprahā","PPP","","_","_"
3,"_","_","_","as","V","as","_","_"
4,"śālvena","_","_","śālva","NC","","_","_"
5,"ca","_","_","ca","CCD","","_","_"
6,"nirākṛtā","_","_","nirākṛ","PPP","","_","_"
1,"na","_","_","na","CNG","","_","_"
2,"ca","_","_","ca","CCD","","_","_"
3,"śakyaṃ","_","_","śakya","JJ","","_","_"
4,"punar","_","_","punar","CAD","","_","_"
5,"gantuṃ","_","_","ga","CGDI","","_","_"
6,"mayā","_","_","mat","PPR","","_","_"
7,"vāraṇasāhvayam","_","_","vāraṇasāhvaya","NC","","_","_"
1,"_","_","_","anujñā","PPP","","_","_"
2,"_","_","_","as","V","as","_","_"
3,"bhīṣmeṇa","_","_","bhīṣma","NC","","_","_"
4,"śālvam","_","_","śālva","NC","","_","_"
5,"uddiśya","_","_","uddiś","CGDA","","_","_"
6,"kāraṇam","_","_","kāraṇa","NC","","_","_"
1,"kiṃ","_","_","kim","CX","","_","_"
2,"nu","_","_","nu","CX","","_","_"
3,"_","_","_","garh","V","garh","_","_"
4,"_","_","_","atha","CAD","","_","_"
5,"_","_","_","ātman","NC","","_","_"
6,"atha","_","_","atha","CAD","","_","_"
7,"bhīṣmaṃ","_","_","bhīṣma","NC","","_","_"
8,"durāsadam","_","_","durāsada","JJ","","_","_"
1,"āhosvit","_","_","āhosvit","CX","","_","_"
2,"pitaraṃ","_","_","pitṛ","NC","","_","_"
3,"mūḍhaṃ","_","_","muh","PPP","","_","_"
4,"yo","_","_","yad","PRL","","_","_"
5,"me","_","_","mat","PPR","","_","_"
6,"'kārṣīt","_","_","kar","V","kṛ","_","_"
7,"svayaṃvaram","_","_","svayaṃvara","NC","","_","_"
1,"_","_","_","mat","PPR","","_","_"
2,"_","_","_","ida","PRD","","_","_"
3,"_","_","_","sva","JJ","","_","_"
4,"_","_","_","kṛ","PPP","","_","_"
5,"doṣo","_","_","doṣa","NC","","_","_"
6,"_","_","_","yad","PRL","","_","_"
7,"_","_","_","mat","PPR","","_","_"
8,"_","_","_","bhīṣma","NC","","_","_"
9,"_","_","_","ratha","NC","","_","_"
10,"tadā","_","_","tadā","CAD","","_","_"
1,"pravṛtte","_","_","pravṛt","PPP","","_","_"
2,"vaiśase","_","_","vaiśasa","NC","","_","_"
3,"yuddhe","_","_","yuddha","NC","","_","_"
4,"_","_","_","śālva","NC","","_","_"
5,"_","_","_","artha","NC","","_","_"
6,"_","_","_","na","CNG","","_","_"
7,"_","_","_","pat","V","pat","_","_"
8,"purā","_","_","purā","CX","","_","_"
1,"_","_","_","tad","PRD","","_","_"
2,"_","_","_","ida","PRD","","_","_"
3,"_","_","_","phala","NC","","_","_"
4,"_","_","_","nirvṛtti","NC","","_","_"
5,"yad","_","_","yad","PRL","","_","_"
6,"_","_","_","āpad","PPP","","_","_"
7,"_","_","_","as","V","as","_","_"
8,"_","_","_","muh","PPP","","_","_"
9,"_","_","_","vat","CX","","_","_"
1,"dhig","_","_","dhik","CX","","_","_"
2,"bhīṣmaṃ","_","_","bhīṣma","NC","","_","_"
3,"dhik","_","_","dhik","CX","","_","_"
4,"ca","_","_","ca","CCD","","_","_"
5,"me","_","_","mat","PPR","","_","_"
6,"mandaṃ","_","_","manda","JJ","","_","_"
7,"pitaraṃ","_","_","pitṛ","NC","","_","_"
8,"_","_","_","muh","PPP","","_","_"
9,"_","_","_","cetas","NC","","_","_"
1,"_","_","_","yad","PRL","","_","_"
2,"_","_","_","mat","PPR","","_","_"
3,"_","_","_","vīrya","NC","","_","_"
4,"_","_","_","śulka","NC","","_","_"
5,"_","_","_","paṇya","NC","","_","_"
6,"_","_","_","strī","NC","","_","_"
7,"_","_","_","vat","CX","","_","_"
8,"praveritā","_","_","praverita","JJ","","_","_"
1,"dhiṅ","_","_","dhik","CX","","_","_"
2,"māṃ","_","_","mat","PPR","","_","_"
3,"dhik","_","_","dhik","CX","","_","_"
4,"_","_","_","śālva","NC","","_","_"
5,"_","_","_","rājan","NC","","_","_"
6,"dhig","_","_","dhik","CX","","_","_"
7,"dhātāram","_","_","dhātṛ","NC","","_","_"
8,"_","_","_","atha","CAD","","_","_"
9,"_","_","_","api","CX","","_","_"
10,"ca","_","_","ca","CCD","","_","_"
1,"yeṣāṃ","_","_","yad","PRL","","_","_"
2,"_","_","_","durnīta","JJ","","_","_"
3,"_","_","_","bhāva","NC","","_","_"
4,"_","_","_","prāp","PPP","","_","_"
5,"_","_","_","as","V","as","_","_"
6,"_","_","_","āpad","NC","","_","_"
7,"uttamām","_","_","uttama","JJ","","_","_"
1,"sarvathā","_","_","sarvathā","CX","","_","_"
2,"bhāgadheyāni","_","_","bhāgadheya","NC","","_","_"
3,"svāni","_","_","sva","JJ","","_","_"
4,"prāpnoti","_","_","prāpn","V","prāp","_","_"
5,"mānavaḥ","_","_","mānava","NC","","_","_"
1,"_","_","_","anaya","NC","","_","_"
2,"_","_","_","ida","PRD","","_","_"
3,"tu","_","_","tu","CCD","","_","_"
4,"mukhaṃ","_","_","mukha","NC","","_","_"
5,"bhīṣmaḥ","_","_","bhīṣma","NC","","_","_"
6,"śāṃtanavo","_","_","śāṃtanava","NC","","_","_"
7,"mama","_","_","mat","PPR","","_","_"
1,"sā","_","_","tad","PRD","","_","_"
2,"bhīṣme","_","_","bhīṣma","NC","","_","_"
3,"pratikartavyam","_","_","pratikṛ","KDG","","_","_"
4,"ahaṃ","_","_","mat","PPR","","_","_"
5,"paśyāmi","_","_","paś","V","paś","_","_"
6,"sāṃpratam","_","_","sāṃprata","CX","","_","_"
1,"tapasā","_","_","tapas","NC","","_","_"
2,"vā","_","_","vā","CCD","","_","_"
3,"yudhā","_","_","yudh","NC","","_","_"
4,"_","_","_","vā","CCD","","_","_"
5,"_","_","_","api","CX","","_","_"
6,"_","_","_","duḥkha","NC","","_","_"
7,"_","_","_","hetu","NC","","_","_"
8,"sa","_","_","tad","PRD","","_","_"
9,"me","_","_","mat","PPR","","_","_"
10,"mataḥ","_","_","man","PPP","","_","_"
1,"ko","_","_","kiṃ","PRQ","","_","_"
2,"nu","_","_","nu","CX","","_","_"
3,"bhīṣmaṃ","_","_","bhīṣma","NC","","_","_"
4,"yudhā","_","_","yudh","NC","","_","_"
5,"jetum","_","_","ji","CGDI","","_","_"
6,"utsaheta","_","_","utsah","V","utsah","_","_"
7,"mahīpatiḥ","_","_","mahīpati","NC","","_","_"
1,"evaṃ","_","_","eva","CX","","_","_"
2,"sā","_","_","tad","PRD","","_","_"
3,"pariniścitya","_","_","pariniści","CGDA","","_","_"
4,"jagāma","_","_","ga","V","ga","_","_"
5,"nagarād","_","_","nagara","NC","","_","_"
6,"bahiḥ","_","_","bahis","CX","","_","_"
1,"āśramaṃ","_","_","āśrama","NC","","_","_"
2,"_","_","_","puṇya","JJ","","_","_"
3,"_","_","_","śīla","NC","","_","_"
4,"tāpasānāṃ","_","_","tāpasa","NC","","_","_"
5,"mahātmanām","_","_","mahātman","JJ","","_","_"
1,"_","_","_","tatas","CX","","_","_"
2,"_","_","_","tad","PRD","","_","_"
3,"avasad","_","_","vas","V","vas","_","_"
4,"rātriṃ","_","_","rātri","NC","","_","_"
5,"tāpasaiḥ","_","_","tāpasa","NC","","_","_"
6,"parivāritā","_","_","parivāray","PPP","","_","_"
1,"ācakhyau","_","_","ākhyā","V","ākhyā","_","_"
2,"ca","_","_","ca","CCD","","_","_"
3,"yathā","_","_","yathā","CCM","","_","_"
4,"vṛttaṃ","_","_","vṛt","PPP","","_","_"
5,"sarvam","_","_","sarva","JQ","","_","_"
6,"ātmani","_","_","ātman","NC","","_","_"
7,"bhārata","_","_","bhārata","NC","","_","_"
1,"vistareṇa","_","_","vistara","NC","","_","_"
2,"_","_","_","mahat","JJ","","_","_"
3,"_","_","_","bāhu","NC","","_","_"
4,"nikhilena","_","_","nikhila","CX","","_","_"
5,"_","_","_","śuci","JJ","","_","_"
6,"_","_","_","smita","NC","","_","_"
1,"haraṇaṃ","_","_","haraṇa","NC","","_","_"
2,"ca","_","_","ca","CCD","","_","_"
3,"visargaṃ","_","_","visarga","NC","","_","_"
4,"ca","_","_","ca","CCD","","_","_"
5,"śālvena","_","_","śālva","NC","","_","_"
6,"ca","_","_","ca","CCD","","_","_"
7,"visarjanam","_","_","visarjana","NC","","_","_"
1,"_","_","_","tatas","CX","","_","_"
2,"_","_","_","tatra","CAD","","_","_"
3,"mahān","_","_","mahat","JJ","","_","_"
4,"āsīd","_","_","as","V","as","_","_"
5,"brāhmaṇaḥ","_","_","brāhmaṇa","NC","","_","_"
6,"_","_","_","saṃśita","JJ","","_","_"
7,"_","_","_","vrata","NC","","_","_"
1,"_","_","_","śaikhāvatya","NC","","_","_"
2,"_","_","_","tapas","NC","","_","_"
3,"_","_","_","vṛddha","JJ","","_","_"
4,"śāstre","_","_","śāstra","NC","","_","_"
5,"_","_","_","ca","CCD","","_","_"
6,"_","_","_","āraṇyaka","NC","","_","_"
7,"guruḥ","_","_","guru","NC","","_","_"
1,"ārtāṃ","_","_","ārta","JJ","","_","_"
2,"tām","_","_","tad","PRD","","_","_"
3,"āha","_","_","ah","V","ah","_","_"
4,"sa","_","_","tad","PRD","","_","_"
5,"muniḥ","_","_","muni","NC","","_","_"
6,"śaikhāvatyo","_","_","śaikhāvatya","NC","","_","_"
7,"_","_","_","mahat","JJ","","_","_"
8,"_","_","_","tapas","NC","","_","_"
1,"niḥśvasantīṃ","_","_","niḥśvas","KDP","","_","_"
2,"satīṃ","_","_","as","KDP","","_","_"
3,"bālāṃ","_","_","bālā","NC","","_","_"
4,"_","_","_","duḥkha","NC","","_","_"
5,"_","_","_","śoka","NC","","_","_"
6,"_","_","_","parāyaṇa","NC","","_","_"
1,"evaṃ","_","_","eva","CX","","_","_"
2,"gate","_","_","ga","PPP","","_","_"
3,"kiṃ","_","_","kiṃ","PRQ","","_","_"
4,"nu","_","_","nu","CX","","_","_"
5,"bhadre","_","_","bhadra","JJ","","_","_"
6,"śakyaṃ","_","_","śakya","JJ","","_","_"
7,"kartuṃ","_","_","kṛ","CGDI","","_","_"
8,"tapasvibhiḥ","_","_","tapasvin","NC","","_","_"
1,"_","_","_","āśrama","NC","","_","_"
2,"_","_","_","stha","JJ","","_","_"
3,"_","_","_","mahābhāga","JJ","","_","_"
4,"_","_","_","tapas","NC","","_","_"
5,"_","_","_","nitya","JJ","","_","_"
6,"mahātmabhiḥ","_","_","mahātman","JJ","","_","_"
1,"sā","_","_","tad","PRD","","_","_"
2,"_","_","_","tu","CCD","","_","_"
3,"_","_","_","a","PRD","","_","_"
4,"abravīd","_","_","abravīta","V","brū","_","_"
5,"rājan","_","_","rājan","NC","","_","_"
6,"kriyatāṃ","_","_","kar","V","kṛ","_","_"
7,"_","_","_","mat","PPR","","_","_"
8,"_","_","_","anugraha","NC","","_","_"
1,"pravrājitum","_","_","pravraj","CGDI","","_","_"
2,"_","_","_","iha","CAD","","_","_"
3,"_","_","_","iṣ","V","iṣ","_","_"
4,"_","_","_","tapas","NC","","_","_"
5,"_","_","_","tap","V","tap","_","_"
6,"duścaram","_","_","duścara","JJ","","_","_"
1,"_","_","_","mat","PPR","","_","_"
2,"_","_","_","eva","CEM","","_","_"
3,"_","_","_","tad","PRD","","_","_"
4,"karmāṇi","_","_","karman","NC","","_","_"
5,"_","_","_","pūrva","PPX","","_","_"
6,"_","_","_","deha","NC","","_","_"
7,"mūḍhayā","_","_","muh","PPP","","_","_"
1,"kṛtāni","_","_","kṛ","PPP","","_","_"
2,"nūnaṃ","_","_","nūna","CX","","_","_"
3,"pāpāni","_","_","pāpa","JJ","","_","_"
4,"teṣām","_","_","tad","PRD","","_","_"
5,"etat","_","_","tad","PRD","","_","_"
6,"phalaṃ","_","_","phala","NC","","_","_"
7,"dhruvam","_","_","dhruva","CX","","_","_"
1,"_","_","_","na","CNG","","_","_"
2,"_","_","_","utsah","V","utsah","_","_"
3,"punar","_","_","punar","CAD","","_","_"
4,"gantuṃ","_","_","ga","CGDI","","_","_"
5,"_","_","_","sva","JJ","","_","_"
6,"_","_","_","jana","NC","","_","_"
7,"prati","_","_","prati","CADP","","_","_"
8,"tāpasāḥ","_","_","tāpasa","NC","","_","_"
1,"pratyākhyātā","_","_","pratyākhyā","PPP","","_","_"
2,"nirānandā","_","_","nirānanda","JJ","","_","_"
3,"śālvena","_","_","śālva","NC","","_","_"
4,"ca","_","_","ca","CCD","","_","_"
5,"nirākṛtā","_","_","nirākṛ","PPP","","_","_"
1,"upadiṣṭam","_","_","upadiś","PPP","","_","_"
2,"_","_","_","iha","CAD","","_","_"
3,"_","_","_","iṣ","V","iṣ","_","_"
4,"tāpasyaṃ","_","_","tāpasya","NC","","_","_"
5,"_","_","_","vī","PPP","","_","_"
6,"_","_","_","kalmaṣa","NC","","_","_"
1,"yuṣmābhir","_","_","tvat","PPR","","_","_"
2,"_","_","_","deva","NC","","_","_"
3,"_","_","_","saṃkāśa","NC","","_","_"
4,"kṛpā","_","_","kṛpā","NC","","_","_"
5,"bhavatu","_","_","bhav","V","bhū","_","_"
6,"vo","_","_","tvat","PPR","","_","_"
7,"mayi","_","_","mat","PPR","","_","_"
1,"sa","_","_","tad","PRD","","_","_"
2,"tām","_","_","tad","PRD","","_","_"
3,"āśvāsayat","_","_","āśvāsay","V","āśvāsay","_","_"
4,"kanyāṃ","_","_","kanyā","NC","","_","_"
5,"_","_","_","dṛṣṭānta","NC","","_","_"
6,"_","_","_","āgama","NC","","_","_"
7,"_","_","_","hetu","NC","","_","_"
1,"sāntvayāmāsa","_","_","sāntvay","V","sāntvay","_","_"
2,"kāryaṃ","_","_","kārya","NC","","_","_"
3,"ca","_","_","ca","CCD","","_","_"
4,"pratijajñe","_","_","pratijān","V","pratijñā","_","_"
5,"dvijaiḥ","_","_","dvija","NC","","_","_"
6,"saha","_","_","saha","CX","","_","_"
