"WordID","word","NormSTEM","suffix","lemma","PoS","Root","NormSuffix","NormWord"
1,"abhy","_","_","abhi","CADP","","_","_"
2,"avasthāḥ","_","_","avasthā","NC","","_","_"
3,"pra","_","_","pra","CADP","","_","_"
4,"jāyante","_","_","jan","V","jan","_","_"
5,"pra","_","_","pra","CADP","","_","_"
6,"vavrer","_","_","vavri","NC","","_","_"
7,"vavriś","_","_","vavri","NC","","_","_"
8,"ciketa","_","_","cit","V","cit","_","_"
1,"upasthe","_","_","upastha","NC","","_","_"
2,"mātur","_","_","mātṛ","NC","","_","_"
3,"vi","_","_","vi","CADP","","_","_"
4,"caṣṭe","_","_","cakṣ","V","cakṣ","_","_"
1,"juhure","_","_","hu","V","hu","_","_"
2,"vi","_","_","vi","CADP","","_","_"
3,"citayanto","_","_","citay","KDP","","_","_"
4,"'nimiṣaṃ","_","_","animiṣa","JJ","","_","_"
5,"nṛmṇam","_","_","nṛmṇa","NC","","_","_"
6,"pānti","_","_","pib","V","pā","_","_"
1,"ā","_","_","ā","CADP","","_","_"
2,"dṛﾱhām","_","_","dṛḍha","JJ","","_","_"
3,"puraṃ","_","_","pur","NC","","_","_"
4,"viviśuḥ","_","_","viś","V","viś","_","_"
1,"ā","_","_","ā","CADP","","_","_"
2,"śvaitreyasya","_","_","śvaitreya","NC","","_","_"
3,"jantavo","_","_","jantu","NC","","_","_"
4,"dyumad","_","_","dyumat","JJ","","_","_"
5,"vardhanta","_","_","vṛdh","V","vṛdh","_","_"
6,"kṛṣṭayaḥ","_","_","kṛṣṭi","NC","","_","_"
1,"_","_","_","niṣka","NC","","_","_"
2,"_","_","_","grīvā","NC","","_","_"
3,"bṛhaduktha","_","_","bṛhaduktha","NC","","_","_"
4,"enā","_","_","ida","PRD","","_","_"
5,"madhvā","_","_","madhu","NC","","_","_"
6,"na","_","_","na","CNG","","_","_"
7,"vājayuḥ","_","_","vājayu","JJ","","_","_"
1,"priyaṃ","_","_","priya","JJ","","_","_"
2,"dugdhaṃ","_","_","dugdha","NC","","_","_"
3,"na","_","_","na","CNG","","_","_"
4,"kāmyam","_","_","kāmya","JJ","","_","_"
5,"ajāmi","_","_","ajāmi","JJ","","_","_"
6,"jāmyoḥ","_","_","jāmi","JJ","","_","_"
7,"sacā","_","_","sacā","CX","","_","_"
1,"gharmo","_","_","gharma","NC","","_","_"
2,"na","_","_","na","CNG","","_","_"
3,"_","_","_","vāja","NC","","_","_"
4,"_","_","_","jaṭhara","NC","","_","_"
5,"'dabdhaḥ","_","_","adabdha","JJ","","_","_"
6,"śaśvato","_","_","śaśvat","JJ","","_","_"
7,"dabhaḥ","_","_","dabha","JJ","","_","_"
1,"krīﾱan","_","_","krīḍ","KDP","","_","_"
2,"no","_","_","mat","PPR","","_","_"
3,"raśma","_","_","raśmi","NC","","_","_"
4,"ā","_","_","ā","CADP","","_","_"
5,"bhuvaḥ","_","_","bhav","V","bhū","_","_"
6,"sam","_","_","sa","CADP","","_","_"
7,"bhasmanā","_","_","bhasman","JJ","","_","_"
8,"vāyunā","_","_","vāyu","NC","","_","_"
9,"vevidānaḥ","_","_","vevid","KDP","","_","_"
1,"tā","_","_","tad","PRD","","_","_"
2,"asya","_","_","ida","PRD","","_","_"
3,"san","_","_","as","V","as","_","_"
4,"dhṛṣajo","_","_","dhṛṣaj","NC","","_","_"
5,"na","_","_","na","CNG","","_","_"
6,"tigmāḥ","_","_","tigma","JJ","","_","_"
7,"_","_","_","su","CAD","","_","_"
8,"_","_","_","saṃśā","PPP","","_","_"
9,"vakṣyo","_","_","vakṣi","NC","","_","_"
10,"vakṣaṇesthāḥ","_","_","vakṣaṇesthā","JJ","","_","_"
