"WordID","word","NormSTEM","suffix","lemma","PoS","Root","NormSuffix","NormWord"
1,"vanaspate","_","_","vanaspati","NC","","_","_"
2,"_","_","_","vīḍu","JJ","","_","_"
3,"_","_","_","aṅga","NC","","_","_"
4,"hi","_","_","hi","CX","","_","_"
5,"bhūyā","_","_","bhav","V","bhū","_","_"
6,"_","_","_","mat","PPR","","_","_"
7,"_","_","_","sakhi","NC","","_","_"
8,"prataraṇaḥ","_","_","prataraṇa","JJ","","_","_"
9,"_","_","_","su","CAD","","_","_"
10,"_","_","_","vīra","NC","","_","_"
1,"gobhiḥ","_","_","go","NC","","_","_"
2,"saṃnaddho","_","_","saṃnah","PPP","","_","_"
3,"asi","_","_","as","V","as","_","_"
4,"_","_","_","vīḍay","V","vīḍay","_","_"
5,"_","_","_","āsthātṛ","JJ","","_","_"
6,"te","_","_","tvat","PPR","","_","_"
7,"jayatu","_","_","jay","V","ji","_","_"
8,"jetvāni","_","_","ji","KDG","","_","_"
1,"divas","_","_","div","NC","","_","_"
2,"pṛthivyāḥ","_","_","pṛthivī","NC","","_","_"
3,"pary","_","_","pari","CADP","","_","_"
4,"oja","_","_","ojas","NC","","_","_"
5,"udbhṛtaṃ","_","_","udbhṛ","PPP","","_","_"
6,"vanaspatibhyaḥ","_","_","vanaspati","NC","","_","_"
7,"pary","_","_","pari","CADP","","_","_"
8,"ābhṛtaṃ","_","_","ābhṛ","PPP","","_","_"
9,"sahaḥ","_","_","sahas","NC","","_","_"
1,"apām","_","_","ap","NC","","_","_"
2,"ojmānaṃ","_","_","ojman","NC","","_","_"
3,"pari","_","_","pari","CADP","","_","_"
4,"gobhir","_","_","go","NC","","_","_"
5,"āvṛtam","_","_","āvṛ","PPP","","_","_"
6,"indrasya","_","_","indra","NC","","_","_"
7,"vajraṃ","_","_","vajra","NC","","_","_"
8,"haviṣā","_","_","havis","NC","","_","_"
9,"rathaṃ","_","_","ratha","NC","","_","_"
10,"yaja","_","_","yaj","V","yaj","_","_"
1,"_","_","_","indra","NC","","_","_"
2,"_","_","_","ojas","NC","","_","_"
3,"marutām","_","_","marut","NC","","_","_"
4,"anīkaṃ","_","_","anīka","NC","","_","_"
5,"mitrasya","_","_","mitra","NC","","_","_"
6,"garbho","_","_","garbha","NC","","_","_"
7,"varuṇasya","_","_","varuṇa","NC","","_","_"
8,"nābhiḥ","_","_","nābhi","NC","","_","_"
1,"sa","_","_","tad","PRD","","_","_"
2,"imāṃ","_","_","ida","PRD","","_","_"
3,"no","_","_","mat","PPR","","_","_"
4,"_","_","_","havya","NC","","_","_"
5,"_","_","_","dāti","NC","","_","_"
6,"juṣāṇo","_","_","juṣ","KDP","","_","_"
7,"deva","_","_","deva","JJ","","_","_"
8,"ratha","_","_","ratha","NC","","_","_"
9,"prati","_","_","prati","CADP","","_","_"
10,"havyā","_","_","havya","NC","","_","_"
11,"gṛbhāya","_","_","gṛbhāy","V","gṛbhāy","_","_"
