"WordID","word","NormSTEM","suffix","lemma","PoS","Root","NormSuffix","NormWord"
1,"vaiśaṃpāyana","_","_","vaiśampāyana","NC","","_","_"
2,"uvāca","_","_","vak","V","vac","_","_"
1,"_","_","_","prabudh","PPP","","_","_"
2,"_","_","_","tad","PRD","","_","_"
3,"hiḍimbāyā","_","_","hiḍimbā","NC","","_","_"
4,"rūpaṃ","_","_","rūpa","NC","","_","_"
5,"_","_","_","dṛś","CGDA","","_","_"
6,"_","_","_","atimānuṣa","JJ","","_","_"
1,"vismitāḥ","_","_","vismi","PPP","","_","_"
2,"_","_","_","puruṣa","NC","","_","_"
3,"_","_","_","vyāghra","NC","","_","_"
4,"babhūvuḥ","_","_","bhav","V","bhū","_","_"
5,"pṛthayā","_","_","pṛthā","NC","","_","_"
6,"saha","_","_","saha","CX","","_","_"
1,"tataḥ","_","_","tatas","CX","","_","_"
2,"kuntī","_","_","kuntī","NC","","_","_"
3,"_","_","_","samīkṣ","CGDA","","_","_"
4,"_","_","_","a","PRD","","_","_"
5,"vismitā","_","_","vismi","PPP","","_","_"
6,"_","_","_","rūpa","NC","","_","_"
7,"_","_","_","sampad","NC","","_","_"
1,"uvāca","_","_","vak","V","vac","_","_"
2,"madhuraṃ","_","_","madhura","JJ","","_","_"
3,"vākyaṃ","_","_","vākya","NC","","_","_"
4,"_","_","_","sāntva","NC","","_","_"
5,"_","_","_","pūrva","CX","","_","_"
6,"idaṃ","_","_","ida","PRD","","_","_"
7,"śanaiḥ","_","_","śanais","CX","","_","_"
1,"kasya","_","_","kiṃ","PRQ","","_","_"
2,"tvaṃ","_","_","tvat","PPR","","_","_"
3,"_","_","_","sura","NC","","_","_"
4,"_","_","_","garbha","NC","","_","_"
5,"_","_","_","ābha","JJ","","_","_"
6,"kā","_","_","kiṃ","PRQ","","_","_"
7,"_","_","_","ca","CCD","","_","_"
8,"_","_","_","as","V","as","_","_"
9,"varavarṇini","_","_","varavarṇinī","NC","","_","_"
1,"kena","_","_","kiṃ","PRQ","","_","_"
2,"kāryeṇa","_","_","kārya","NC","","_","_"
3,"suśroṇi","_","_","suśroṇī","NC","","_","_"
4,"_","_","_","kutas","CX","","_","_"
5,"_","_","_","ca","CCD","","_","_"
6,"_","_","_","āgamana","NC","","_","_"
7,"tava","_","_","tvat","PPR","","_","_"
1,"yadi","_","_","yadi","CSB","","_","_"
2,"_","_","_","vā","CCD","","_","_"
3,"_","_","_","ida","PRD","","_","_"
4,"_","_","_","vana","NC","","_","_"
5,"_","_","_","as","V","as","_","_"
6,"devatā","_","_","devatā","NC","","_","_"
7,"yadi","_","_","yadi","CSB","","_","_"
8,"_","_","_","vā","CCD","","_","_"
9,"_","_","_","apsaras","NC","","_","_"
1,"ācakṣva","_","_","cakṣ","V","cakṣ","_","_"
2,"mama","_","_","mat","PPR","","_","_"
3,"tat","_","_","tad","PRD","","_","_"
4,"sarvaṃ","_","_","sarva","JQ","","_","_"
5,"_","_","_","kiṃ","PRQ","","_","_"
6,"_","_","_","artha","NC","","_","_"
7,"_","_","_","ca","CCD","","_","_"
8,"_","_","_","iha","CAD","","_","_"
9,"tiṣṭhasi","_","_","tiṣṭh","V","sthā","_","_"
1,"_","_","_","hiḍimbā","NC","","_","_"
2,"_","_","_","vak","V","vac","_","_"
1,"yad","_","_","yad","PRL","","_","_"
2,"etat","_","_","tad","PRD","","_","_"
3,"paśyasi","_","_","paś","V","paś","_","_"
4,"vanaṃ","_","_","vana","NC","","_","_"
5,"_","_","_","nīla","JJ","","_","_"
6,"_","_","_","megha","NC","","_","_"
7,"_","_","_","nibha","JJ","","_","_"
8,"mahat","_","_","mahat","JJ","","_","_"
1,"nivāso","_","_","nivāsa","NC","","_","_"
2,"_","_","_","rākṣasa","NC","","_","_"
3,"_","_","_","tad","PRD","","_","_"
4,"_","_","_","hiḍimba","NC","","_","_"
5,"_","_","_","mat","PPR","","_","_"
6,"_","_","_","eva","CEM","","_","_"
7,"ca","_","_","ca","CCD","","_","_"
1,"tasya","_","_","tad","PRD","","_","_"
2,"māṃ","_","_","mat","PPR","","_","_"
3,"_","_","_","rākṣasa","NC","","_","_"
4,"_","_","_","indra","NC","","_","_"
5,"bhaginīṃ","_","_","bhaginī","NC","","_","_"
6,"viddhi","_","_","vid","V","vid","_","_"
7,"bhāmini","_","_","bhāminī","NC","","_","_"
1,"bhrātrā","_","_","bhrātṛ","NC","","_","_"
2,"saṃpreṣitām","_","_","saṃpreṣay","PPP","","_","_"
3,"ārye","_","_","ārya","JJ","","_","_"
4,"tvāṃ","_","_","tvat","PPR","","_","_"
5,"_","_","_","sa_saha","CX","","_","_"
6,"_","_","_","putra","NC","","_","_"
7,"jighāṃsatā","_","_","jighāṃs","KDP","","_","_"
1,"_","_","_","krūra","JJ","","_","_"
2,"_","_","_","buddhi","NC","","_","_"
3,"ahaṃ","_","_","mat","PPR","","_","_"
4,"tasya","_","_","tad","PRD","","_","_"
5,"vacanād","_","_","vacana","NC","","_","_"
6,"āgatā","_","_","āga","PPP","","_","_"
7,"iha","_","_","iha","CAD","","_","_"
1,"adrākṣaṃ","_","_","darś","V","dṛś","_","_"
2,"_","_","_","heman","NC","","_","_"
3,"_","_","_","varṇa","NC","","_","_"
4,"_","_","_","ābha","JJ","","_","_"
5,"tava","_","_","tvat","PPR","","_","_"
6,"putraṃ","_","_","putra","NC","","_","_"
7,"_","_","_","mahat","JJ","","_","_"
8,"_","_","_","ojas","NC","","_","_"
1,"tato","_","_","tatas","CX","","_","_"
2,"'haṃ","_","_","mat","PPR","","_","_"
3,"_","_","_","sarva","JQ","","_","_"
4,"_","_","_","bhūta","NC","","_","_"
5,"bhāve","_","_","bhāva","NC","","_","_"
6,"vicaratā","_","_","vicar","KDP","","_","_"
7,"śubhe","_","_","śubha","JJ","","_","_"
1,"coditā","_","_","coday","PPP","","_","_"
2,"tava","_","_","tvat","PPR","","_","_"
3,"putrasya","_","_","putra","NC","","_","_"
4,"manmathena","_","_","manmatha","NC","","_","_"
5,"_","_","_","vaśa","NC","","_","_"
6,"_","_","_","anuga","JJ","","_","_"
1,"tato","_","_","tatas","CX","","_","_"
2,"vṛto","_","_","vṛ","PPP","","_","_"
3,"mayā","_","_","mat","PPR","","_","_"
4,"bhartā","_","_","bhartṛ","NC","","_","_"
5,"tava","_","_","tvat","PPR","","_","_"
6,"putro","_","_","putra","NC","","_","_"
7,"_","_","_","mahat","JJ","","_","_"
8,"_","_","_","bala","NC","","_","_"
1,"apanetuṃ","_","_","apanī","CGDI","","_","_"
2,"ca","_","_","ca","CCD","","_","_"
3,"yatito","_","_","yat","PPP","","_","_"
4,"na","_","_","na","CNG","","_","_"
5,"_","_","_","ca","CCD","","_","_"
6,"_","_","_","eva","CEM","","_","_"
7,"śakito","_","_","śak","PPP","","_","_"
8,"mayā","_","_","mat","PPR","","_","_"
1,"cirāyamāṇāṃ","_","_","cirāy","KDP","","_","_"
2,"māṃ","_","_","mat","PPR","","_","_"
3,"jñātvā","_","_","jñā","CGDA","","_","_"
4,"tataḥ","_","_","tatas","CX","","_","_"
5,"sa","_","_","tad","PRD","","_","_"
6,"puruṣādakaḥ","_","_","puruṣādaka","NC","","_","_"
1,"svayam","_","_","svaya","CX","","_","_"
2,"_","_","_","eva","CEM","","_","_"
3,"_","_","_","āga","PPP","","_","_"
4,"hantum","_","_","han","CGDI","","_","_"
5,"imān","_","_","ida","PRD","","_","_"
6,"_","_","_","sarva","JQ","","_","_"
7,"_","_","_","tvat","PPR","","_","_"
8,"_","_","_","ātmaja","NC","","_","_"
1,"sa","_","_","tad","PRD","","_","_"
2,"tena","_","_","tad","PRD","","_","_"
3,"mama","_","_","mat","PPR","","_","_"
4,"kāntena","_","_","kānta","NC","","_","_"
5,"tava","_","_","tvat","PPR","","_","_"
6,"putreṇa","_","_","putra","NC","","_","_"
7,"dhīmatā","_","_","dhīmat","JJ","","_","_"
1,"balād","_","_","bala","NC","","_","_"
2,"ito","_","_","itas","CX","","_","_"
3,"viniṣpiṣya","_","_","viniṣpiṣ","CGDA","","_","_"
4,"vyapakṛṣṭo","_","_","vyapakṛṣ","PPP","","_","_"
5,"mahātmanā","_","_","mahātman","JJ","","_","_"
1,"vikarṣantau","_","_","vikṛṣ","KDP","","_","_"
2,"_","_","_","mahat","JJ","","_","_"
3,"_","_","_","vega","NC","","_","_"
4,"garjamānau","_","_","garj","KDP","","_","_"
5,"parasparam","_","_","paraspara","PRC","","_","_"
1,"paśyadhvaṃ","_","_","paś","V","paś","_","_"
2,"yudhi","_","_","yudh","NC","","_","_"
3,"_","_","_","vikra","PPP","","_","_"
4,"_","_","_","tad","PRD","","_","_"
5,"tau","_","_","tad","PRD","","_","_"
6,"_","_","_","nara","NC","","_","_"
7,"_","_","_","rākṣasa","NC","","_","_"
1,"yudhyantau","_","_","yudh","KDP","","_","_"
2,"_","_","_","vijaya","NC","","_","_"
3,"_","_","_","ākāṅkṣin","JJ","","_","_"
4,"rākṣaso","_","_","rākṣasa","NC","","_","_"
5,"_","_","_","manda","JJ","","_","_"
6,"_","_","_","buddhimat","JJ","","_","_"
1,"na","_","_","na","CNG","","_","_"
2,"vāñche","_","_","vāñch","V","vāñch","_","_"
3,"'haṃ","_","_","mat","PPR","","_","_"
4,"jīvitaṃ","_","_","jīvita","NC","","_","_"
5,"bhrātuḥ","_","_","bhrātṛ","NC","","_","_"
6,"kadā","_","_","kadā","CX","","_","_"
7,"ye","_","_","yad","PRL","","_","_"
8,"_","_","_","duṣ","PPP","","_","_"
9,"_","_","_","karman","NC","","_","_"
1,"vaiśaṃpāyana","_","_","vaiśampāyana","NC","","_","_"
2,"uvāca","_","_","vak","V","vac","_","_"
1,"tasyāḥ","_","_","tad","PRD","","_","_"
2,"_","_","_","śru","CGDA","","_","_"
3,"_","_","_","eva","CEM","","_","_"
4,"vacanam","_","_","vacana","NC","","_","_"
5,"utpapāta","_","_","utpat","V","utpat","_","_"
6,"yudhiṣṭhiraḥ","_","_","yudhiṣṭhira","NC","","_","_"
1,"arjuno","_","_","arjuna","NC","","_","_"
2,"_","_","_","nakula","NC","","_","_"
3,"_","_","_","ca","CCD","","_","_"
4,"_","_","_","eva","CEM","","_","_"
5,"_","_","_","sahadeva","NC","","_","_"
6,"_","_","_","ca","CCD","","_","_"
7,"vīryavān","_","_","vīryavat","JJ","","_","_"
1,"tau","_","_","tad","PRD","","_","_"
2,"te","_","_","tad","PRD","","_","_"
3,"dadṛśur","_","_","darś","V","dṛś","_","_"
4,"āsaktau","_","_","āsañj","PPP","","_","_"
5,"vikarṣantau","_","_","vikṛṣ","KDP","","_","_"
6,"parasparam","_","_","paraspara","PRC","","_","_"
1,"kāṅkṣamāṇau","_","_","kāṅkṣ","KDP","","_","_"
2,"jayaṃ","_","_","jaya","NC","","_","_"
3,"_","_","_","ca","CCD","","_","_"
4,"_","_","_","eva","CEM","","_","_"
5,"_","_","_","siṃha","NC","","_","_"
6,"_","_","_","iva","CCM","","_","_"
7,"_","_","_","raṇa","NC","","_","_"
8,"_","_","_","utkaṭa","JJ","","_","_"
1,"_","_","_","tad","PRD","","_","_"
2,"_","_","_","anyonya","PRC","","_","_"
3,"samāśliṣya","_","_","samāśliṣ","CGDA","","_","_"
4,"vikarṣantau","_","_","vikṛṣ","KDP","","_","_"
5,"parasparam","_","_","paraspara","PRC","","_","_"
1,"_","_","_","dāva","NC","","_","_"
2,"_","_","_","agni","NC","","_","_"
3,"_","_","_","dhūma","NC","","_","_"
4,"_","_","_","sadṛśa","JJ","","_","_"
5,"cakratuḥ","_","_","kar","V","kṛ","_","_"
6,"pārthivaṃ","_","_","pārthiva","JJ","","_","_"
7,"rajaḥ","_","_","rajas","NC","","_","_"
1,"_","_","_","vasudhā","NC","","_","_"
2,"_","_","_","reṇu","NC","","_","_"
3,"_","_","_","saṃvye","PPP","","_","_"
4,"_","_","_","vasudhādhara","NC","","_","_"
5,"_","_","_","saṃnibha","JJ","","_","_"
1,"vibhrājetāṃ","_","_","vibhrāj","V","vibhrāj","_","_"
2,"yathā","_","_","yathā","CCM","","_","_"
3,"śailau","_","_","śaila","NC","","_","_"
4,"_","_","_","nīhāra","NC","","_","_"
5,"_","_","_","abhisaṃvṛ","PPP","","_","_"
1,"te","_","_","tad","PRD","","_","_"
2,"paśyanto","_","_","dṛś","KDP","","_","_"
3,"mahad","_","_","mahat","JJ","","_","_"
4,"yuddhaṃ","_","_","yuddha","NC","","_","_"
5,"sarve","_","_","sarva","JQ","","_","_"
6,"_","_","_","vyath","PPP","","_","_"
7,"_","_","_","cetas","NC","","_","_"
1,"rākṣasena","_","_","rākṣasa","NC","","_","_"
2,"tathā","_","_","tathā","CX","","_","_"
3,"bhīmaṃ","_","_","bhīma","NC","","_","_"
4,"kliśyamānaṃ","_","_","kliś","KDP","","_","_"
5,"nirīkṣya","_","_","nirīkṣ","CGDA","","_","_"
6,"tu","_","_","tu","CCD","","_","_"
1,"_","_","_","cira","JJ","","_","_"
2,"_","_","_","prayudh","PPP","","_","_"
3,"tau","_","_","tad","PRD","","_","_"
4,"dṛṣṭvā","_","_","dṛś","CGDA","","_","_"
5,"_","_","_","tu","CCD","","_","_"
6,"_","_","_","anyonya","PRC","","_","_"
7,"_","_","_","vadha","NC","","_","_"
8,"_","_","_","kāṅkṣā","NC","","_","_"
1,"_","_","_","vak","V","vac","_","_"
2,"_","_","_","ida","PRD","","_","_"
3,"vacaḥ","_","_","vacas","NC","","_","_"
4,"pārthaḥ","_","_","pārtha","NC","","_","_"
5,"prahasañ","_","_","prahas","KDP","","_","_"
6,"śanakair","_","_","śanakais","CX","","_","_"
7,"iva","_","_","iva","CCM","","_","_"
1,"bhīma","_","_","bhīma","NC","","_","_"
2,"mā","_","_","mā","CNG","","_","_"
3,"bhair","_","_","bhī","V","bhī","_","_"
4,"_","_","_","mahat","JJ","","_","_"
5,"_","_","_","bāhu","NC","","_","_"
6,"na","_","_","na","CNG","","_","_"
7,"tvāṃ","_","_","tvat","PPR","","_","_"
8,"budhyāmahe","_","_","bodh","V","budh","_","_"
9,"vayam","_","_","mat","PPR","","_","_"
1,"sametaṃ","_","_","same","PPP","","_","_"
2,"_","_","_","bhīma","JJ","","_","_"
3,"_","_","_","rūpa","NC","","_","_"
4,"prasuptāḥ","_","_","prasvap","PPP","","_","_"
5,"_","_","_","śrama","NC","","_","_"
6,"_","_","_","karśay","PPP","","_","_"
1,"sāhāyye","_","_","sāhāyya","NC","","_","_"
2,"'smi","_","_","as","V","as","_","_"
3,"sthitaḥ","_","_","sthā","PPP","","_","_"
4,"pārtha","_","_","pārtha","NC","","_","_"
5,"yodhayiṣyāmi","_","_","yodhay","V","yodhay","_","_"
6,"rākṣasam","_","_","rākṣasa","NC","","_","_"
1,"nakulaḥ","_","_","nakula","NC","","_","_"
2,"_","_","_","sahadeva","NC","","_","_"
3,"_","_","_","ca","CCD","","_","_"
4,"mātaraṃ","_","_","mātṛ","NC","","_","_"
5,"gopayiṣyataḥ","_","_","gopay","V","gopay","_","_"
1,"bhīma","_","_","bhīma","NC","","_","_"
2,"uvāca","_","_","vak","V","vac","_","_"
1,"udāsīno","_","_","udās","PPP","","_","_"
2,"nirīkṣasva","_","_","nirīkṣ","V","nirīkṣ","_","_"
3,"na","_","_","na","CNG","","_","_"
4,"kāryaḥ","_","_","kṛ","KDG","","_","_"
5,"_","_","_","sambhrama","NC","","_","_"
6,"_","_","_","tvat","PPR","","_","_"
1,"na","_","_","na","CNG","","_","_"
2,"_","_","_","jātu","CX","","_","_"
3,"_","_","_","ida","PRD","","_","_"
4,"punar","_","_","punar","CAD","","_","_"
5,"jīven","_","_","jīv","V","jīv","_","_"
6,"_","_","_","mat","PPR","","_","_"
7,"_","_","_","bāhu","NC","","_","_"
8,"_","_","_","antara","NC","","_","_"
9,"āgataḥ","_","_","āga","PPP","","_","_"
1,"bhujayor","_","_","bhuja","NC","","_","_"
2,"antaraṃ","_","_","antara","NC","","_","_"
3,"prāpto","_","_","prāp","PPP","","_","_"
4,"bhīmasenasya","_","_","bhīmasa","NC","","_","_"
5,"rākṣasaḥ","_","_","rākṣasa","NC","","_","_"
1,"a","_","_","alpha_privativum","CX","","_","_"
1,"amuktvā","_","_","muktvā","CX","","_","_"
2,"pārtha","_","_","pārtha","NC","","_","_"
3,"vīryeṇa","_","_","vīrya","NC","","_","_"
4,"mṛto","_","_","mṛ","PPP","","_","_"
5,"mā","_","_","mā","CNG","","_","_"
6,"bhūd","_","_","bhav","V","bhū","_","_"
7,"iti","_","_","iti","CQT","","_","_"
8,"dhvaniḥ","_","_","dhvani","NC","","_","_"
1,"ayam","_","_","ida","PRD","","_","_"
2,"asmān","_","_","mat","PPR","","_","_"
3,"na","_","_","na","CNG","","_","_"
4,"no","_","_","mat","PPR","","_","_"
5,"_","_","_","han","V","han","_","_"
6,"_","_","_","jātu","CX","","_","_"
7,"vai","_","_","vai","CX","","_","_"
8,"pārtha","_","_","pārtha","NC","","_","_"
9,"rākṣasaḥ","_","_","rākṣasa","NC","","_","_"
1,"jīvantaṃ","_","_","jīv","KDP","","_","_"
2,"na","_","_","na","CNG","","_","_"
3,"pramokṣyāmi","_","_","pramuñc","V","pramuc","_","_"
4,"mā","_","_","mā","CNG","","_","_"
5,"bhaiṣīr","_","_","bhaiṣī","V","bhī","_","_"
6,"_","_","_","bharata","NC","","_","_"
7,"_","_","_","ṛṣabha","NC","","_","_"
1,"arjuna","_","_","arjuna","NC","","_","_"
2,"uvāca","_","_","vak","V","vac","_","_"
1,"_","_","_","pūrva","PPX","","_","_"
2,"_","_","_","rātra","NC","","_","_"
3,"prabuddho","_","_","prabudh","PPP","","_","_"
4,"'si","_","_","as","V","as","_","_"
5,"bhīma","_","_","bhīma","NC","","_","_"
6,"krūreṇa","_","_","krūra","JJ","","_","_"
7,"rakṣasā","_","_","rakṣas","NC","","_","_"
1,"kṣapā","_","_","kṣapā","NC","","_","_"
2,"vyuṣṭā","_","_","vivas","PPP","","_","_"
3,"na","_","_","na","CNG","","_","_"
4,"_","_","_","ca","CCD","","_","_"
5,"_","_","_","idānīm","CX","","_","_"
6,"samāpto","_","_","samāp","PPP","","_","_"
7,"'si","_","_","as","V","as","_","_"
8,"_","_","_","mahat","JJ","","_","_"
9,"_","_","_","raṇa","NC","","_","_"
1,"kim","_","_","kiṃ","PRQ","","_","_"
2,"anena","_","_","ida","PRD","","_","_"
3,"ciraṃ","_","_","cira","JJ","","_","_"
4,"bhīma","_","_","bhīma","NC","","_","_"
5,"jīvatā","_","_","jīv","KDP","","_","_"
6,"_","_","_","pāpa","NC","","_","_"
7,"_","_","_","rakṣas","NC","","_","_"
1,"gantavyaṃ","_","_","ga","KDG","","_","_"
2,"naciraṃ","_","_","nacira","JJ","","_","_"
3,"sthātum","_","_","sthā","CGDI","","_","_"
4,"iha","_","_","iha","CAD","","_","_"
5,"śakyam","_","_","śakya","JJ","","_","_"
6,"ariṃdama","_","_","ariṃdama","JJ","","_","_"
1,"purā","_","_","purā","CX","","_","_"
2,"saṃrajyate","_","_","saṃrañj","V","saṃrañj","_","_"
3,"prācī","_","_","prācī","NC","","_","_"
4,"purā","_","_","purā","CX","","_","_"
5,"saṃdhyā","_","_","saṃdhyā","NC","","_","_"
6,"pravartate","_","_","pravart","V","pravṛt","_","_"
1,"raudre","_","_","raudra","JJ","","_","_"
2,"muhūrte","_","_","muhūrta","NC","","_","_"
3,"rakṣāṃsi","_","_","rakṣas","NC","","_","_"
4,"prabalāni","_","_","prabala","JJ","","_","_"
5,"bhavanti","_","_","bhav","V","bhū","_","_"
6,"ca","_","_","ca","CCD","","_","_"
1,"tvarasva","_","_","tvar","V","tvar","_","_"
2,"bhīma","_","_","bhīma","NC","","_","_"
3,"mā","_","_","mā","CNG","","_","_"
4,"krīḍa","_","_","krīḍ","V","krīḍ","_","_"
5,"jahi","_","_","jah","V","hā","_","_"
6,"rakṣo","_","_","rakṣas","NC","","_","_"
7,"vibhīṣaṇam","_","_","vibhīṣaṇa","JJ","","_","_"
1,"purā","_","_","purā","CX","","_","_"
2,"vikurute","_","_","vikar","V","vikṛ","_","_"
3,"māyāṃ","_","_","māyā","NC","","_","_"
4,"bhujayoḥ","_","_","bhuja","NC","","_","_"
5,"sāram","_","_","sāra","NC","","_","_"
6,"arpaya","_","_","arp","V","ṛ","_","_"
1,"māhātmyam","_","_","māhātmya","NC","","_","_"
2,"ātmano","_","_","ātman","NC","","_","_"
3,"vettha","_","_","vid","V","vid","_","_"
4,"narāṇāṃ","_","_","nara","NC","","_","_"
5,"_","_","_","hita","NC","","_","_"
6,"_","_","_","kāmyā","NC","","_","_"
1,"rakṣo","_","_","rakṣas","NC","","_","_"
2,"jahi","_","_","jah","V","hā","_","_"
3,"yathā","_","_","yathā","CCM","","_","_"
4,"śakraḥ","_","_","śakra","NC","","_","_"
5,"purā","_","_","purā","CX","","_","_"
6,"vṛtraṃ","_","_","vṛtra","NC","","_","_"
7,"_","_","_","mahat","JJ","","_","_"
8,"_","_","_","vana","NC","","_","_"
1,"vaiśaṃpāyana","_","_","vaiśampāyana","NC","","_","_"
2,"uvāca","_","_","vak","V","vac","_","_"
1,"_","_","_","arjuna","NC","","_","_"
2,"_","_","_","eva","CX","","_","_"
3,"_","_","_","vac","PPP","","_","_"
4,"_","_","_","tu","CCD","","_","_"
5,"bhīmo","_","_","bhīma","NC","","_","_"
6,"bhīmasya","_","_","bhīma","JJ","","_","_"
7,"rakṣasaḥ","_","_","rakṣas","NC","","_","_"
1,"bhīmo","_","_","bhīma","NC","","_","_"
2,"_","_","_","roṣa","NC","","_","_"
3,"_","_","_","jval","KDP","","_","_"
4,"iva","_","_","iva","CCM","","_","_"
1,"balam","_","_","bala","NC","","_","_"
2,"āhārayāmāsa","_","_","āhāray","V","āhāray","_","_"
3,"yad","_","_","yad","PRL","","_","_"
4,"vāyor","_","_","vāyu","NC","","_","_"
5,"jagataḥ","_","_","jagat","NC","","_","_"
6,"kṣaye","_","_","kṣaya","NC","","_","_"
1,"_","_","_","tatas","CX","","_","_"
2,"_","_","_","tad","PRD","","_","_"
3,"_","_","_","ambuda","NC","","_","_"
4,"_","_","_","ābha","JJ","","_","_"
1,"_","_","_","utkṣip","CGDA","","_","_"
2,"_","_","_","bhrāmay","V","bhrāmay","_","_"
3,"dehaṃ","_","_","deha","NC","","_","_"
4,"tūrṇaṃ","_","_","tūrṇa","CX","","_","_"
5,"_","_","_","guṇa","NC","","_","_"
6,"_","_","_","śata","NUM","","_","_"
7,"_","_","_","adhika","JJ","","_","_"
1,"iti","_","_","iti","CQT","","_","_"
2,"_","_","_","ca","CCD","","_","_"
3,"_","_","_","vak","V","vac","_","_"
4,"saṃkruddho","_","_","saṃkrudh","PPP","","_","_"
5,"bhrāmayan","_","_","bhrāmay","KDP","","_","_"
6,"rākṣasaṃ","_","_","rākṣasa","NC","","_","_"
7,"tu","_","_","tu","CCD","","_","_"
8,"saḥ","_","_","tad","PRD","","_","_"
1,"bhīmaseno","_","_","bhīmasa","NC","","_","_"
2,"_","_","_","mahat","JJ","","_","_"
3,"_","_","_","bāhu","NC","","_","_"
4,"abhigarjan","_","_","abhigarj","KDP","","_","_"
5,"muhur","_","_","muhur","CX","","_","_"
6,"muhuḥ","_","_","muhur","CX","","_","_"
1,"bhīma","_","_","bhīma","NC","","_","_"
2,"uvāca","_","_","vak","V","vac","_","_"
1,"_","_","_","vṛthā","CX","","_","_"
2,"_","_","_","māṃsa","NC","","_","_"
3,"vṛthā","_","_","vṛthā","CX","","_","_"
4,"puṣṭo","_","_","puṣ","PPP","","_","_"
5,"vṛthā","_","_","vṛthā","CX","","_","_"
6,"vṛddho","_","_","vṛdh","PPP","","_","_"
7,"vṛthāmatiḥ","_","_","vṛthāmati","JJ","","_","_"
1,"_","_","_","vṛthā","CX","","_","_"
2,"_","_","_","maraṇa","NC","","_","_"
3,"_","_","_","arha","JJ","","_","_"
4,"_","_","_","tvat","PPR","","_","_"
5,"_","_","_","vṛthā","CX","","_","_"
6,"_","_","_","adya","CX","","_","_"
7,"na","_","_","na","CNG","","_","_"
8,"bhaviṣyasi","_","_","bhav","V","bhū","_","_"
1,"kṣemam","_","_","kṣema","JJ","","_","_"
2,"adya","_","_","adya","CX","","_","_"
3,"kariṣyāmi","_","_","kar","V","kṛ","_","_"
4,"yathā","_","_","yathā","CCM","","_","_"
5,"vanam","_","_","vana","NC","","_","_"
6,"a","_","_","alpha_privativum","JJ","","_","_"
6,"akaṇṭakam","_","_","kaṇṭaka","JJ","","_","_"
1,"na","_","_","na","CNG","","_","_"
2,"punar","_","_","punar","CAD","","_","_"
3,"mānuṣān","_","_","mānuṣa","NC","","_","_"
4,"hatvā","_","_","han","CGDA","","_","_"
5,"bhakṣayiṣyasi","_","_","bhakṣay","V","bhakṣay","_","_"
6,"rākṣasa","_","_","rākṣasa","NC","","_","_"
1,"arjuna","_","_","arjuna","NC","","_","_"
2,"uvāca","_","_","vak","V","vac","_","_"
1,"atha","_","_","atha","CAD","","_","_"
2,"vā","_","_","vā","CCD","","_","_"
3,"manyase","_","_","man","V","man","_","_"
4,"bhāraṃ","_","_","bhāra","NC","","_","_"
5,"tvam","_","_","tvat","PPR","","_","_"
6,"imaṃ","_","_","ida","PRD","","_","_"
7,"rākṣasaṃ","_","_","rākṣasa","NC","","_","_"
8,"yudhi","_","_","yudh","NC","","_","_"
1,"karomi","_","_","kar","V","kṛ","_","_"
2,"tava","_","_","tvat","PPR","","_","_"
3,"sāhāyyaṃ","_","_","sāhāyya","NC","","_","_"
4,"śīghram","_","_","śīghra","JJ","","_","_"
5,"eva","_","_","eva","CEM","","_","_"
6,"nihanyatām","_","_","nihan","V","nihan","_","_"
1,"atha","_","_","atha","CAD","","_","_"
2,"_","_","_","vā","CCD","","_","_"
3,"_","_","_","api","CX","","_","_"
4,"_","_","_","mat","PPR","","_","_"
5,"_","_","_","eva","CEM","","_","_"
6,"_","_","_","a","PRD","","_","_"
7,"haniṣyāmi","_","_","han","V","han","_","_"
8,"vṛkodara","_","_","vṛkodara","NC","","_","_"
1,"_","_","_","kṛ","PPP","","_","_"
2,"_","_","_","karman","NC","","_","_"
3,"pariśrāntaḥ","_","_","pariśra","PPP","","_","_"
4,"sādhu","_","_","sādhu","JJ","","_","_"
5,"tāvad","_","_","tāvat","CX","","_","_"
6,"upārama","_","_","upāra","V","upāra","_","_"
1,"vaiśaṃpāyana","_","_","vaiśampāyana","NC","","_","_"
2,"uvāca","_","_","vak","V","vac","_","_"
1,"tasya","_","_","tad","PRD","","_","_"
2,"tad","_","_","tad","PRD","","_","_"
3,"vacanaṃ","_","_","vacana","NC","","_","_"
4,"śrutvā","_","_","śru","CGDA","","_","_"
5,"bhīmaseno","_","_","bhīmasa","NC","","_","_"
6,"'tyamarṣaṇaḥ","_","_","atyamarṣaṇa","JJ","","_","_"
1,"_","_","_","niṣpiṣ","CGDA","","_","_"
2,"_","_","_","a","PRD","","_","_"
3,"balād","_","_","bala","NC","","_","_"
4,"bhūmau","_","_","bhūmi","NC","","_","_"
5,"paśumāram","_","_","paśumāra","NC","","_","_"
6,"amārayat","_","_","māray","V","māray","_","_"
1,"_","_","_","atha","CAD","","_","_"
2,"_","_","_","a","PRD","","_","_"
3,"ākṣipya","_","_","ākṣip","CGDA","","_","_"
4,"balāt","_","_","bala","NC","","_","_"
5,"_","_","_","paśu","NC","","_","_"
6,"_","_","_","vat","CX","","_","_"
7,"_","_","_","ca","CCD","","_","_"
8,"_","_","_","api","CX","","_","_"
9,"_","_","_","māray","V","māray","_","_"
1,"sa","_","_","tad","PRD","","_","_"
2,"māryamāṇo","_","_","māray","KDP","","_","_"
3,"bhīmena","_","_","bhīma","NC","","_","_"
4,"nanāda","_","_","nad","V","nad","_","_"
5,"vipulaṃ","_","_","vipula","JJ","","_","_"
6,"svanam","_","_","svana","NC","","_","_"
1,"_","_","_","pūray","KDP","","_","_"
2,"_","_","_","tad","PRD","","_","_"
3,"vanaṃ","_","_","vana","NC","","_","_"
4,"sarvaṃ","_","_","sarva","JQ","","_","_"
5,"_","_","_","jala","NC","","_","_"
6,"_","_","_","ārdra","JJ","","_","_"
7,"iva","_","_","iva","CCM","","_","_"
8,"dundubhiḥ","_","_","dundubhi","NC","","_","_"
1,"bhujābhyāṃ","_","_","bhuja","NC","","_","_"
2,"yoktrayitvā","_","_","yoktray","CGDA","","_","_"
3,"taṃ","_","_","tad","PRD","","_","_"
4,"balavān","_","_","balavat","JJ","","_","_"
5,"_","_","_","pāṇḍu","NC","","_","_"
6,"_","_","_","nandana","NC","","_","_"
1,"samudbhrāmya","_","_","samudbhra","CGDA","","_","_"
2,"_","_","_","śiras","NC","","_","_"
3,"_","_","_","ca","CCD","","_","_"
4,"_","_","_","ida","PRD","","_","_"
5,"sagrīvaṃ","_","_","sagrīva","JJ","","_","_"
6,"tad","_","_","tad","PRD","","_","_"
7,"udāvahat","_","_","udāvah","V","udāvah","_","_"
1,"madhye","_","_","madhya","NC","","_","_"
2,"bhittvā","_","_","bhid","CGDA","","_","_"
3,"_","_","_","śiras","NC","","_","_"
4,"_","_","_","ca","CCD","","_","_"
5,"_","_","_","ida","PRD","","_","_"
6,"sugrīvaṃ","_","_","sugrīva","JJ","","_","_"
7,"tad","_","_","tad","PRD","","_","_"
8,"upākṣipat","_","_","upakṣip","V","upakṣip","_","_"
1,"tasya","_","_","tad","PRD","","_","_"
2,"_","_","_","niṣkarṇa","JJ","","_","_"
3,"_","_","_","nayana","NC","","_","_"
4,"nirjihvaṃ","_","_","nirjihva","JJ","","_","_"
5,"_","_","_","rudhira","NC","","_","_"
6,"_","_","_","ukṣ","PPP","","_","_"
1,"praviddhaṃ","_","_","pravyadh","PPP","","_","_"
2,"bhīmasenena","_","_","bhīmasa","NC","","_","_"
3,"śiro","_","_","śiras","NC","","_","_"
4,"vidaśanaṃ","_","_","vidaśana","JJ","","_","_"
5,"babhau","_","_","bhā","V","bhā","_","_"
1,"_","_","_","bhid","PPP","","_","_"
2,"_","_","_","māṃsa","NC","","_","_"
3,"_","_","_","tvac","NC","","_","_"
4,"_","_","_","antara","NC","","_","_"
1,"_","_","_","kabandha","NC","","_","_"
2,"_","_","_","bhū","PPP","","_","_"
3,"_","_","_","tatra","CAD","","_","_"
4,"_","_","_","as","V","as","_","_"
5,"adrir","_","_","adri","NC","","_","_"
6,"_","_","_","vajra","NC","","_","_"
7,"_","_","_","han","PPP","","_","_"
8,"yathā","_","_","yathā","CCM","","_","_"
1,"madhye","_","_","madhya","NC","","_","_"
2,"bhaṅktvā","_","_","bhañj","CGDA","","_","_"
3,"sa","_","_","tad","PRD","","_","_"
4,"balavān","_","_","balavat","JJ","","_","_"
5,"harṣayāmāsa","_","_","harṣay","V","harṣay","_","_"
6,"pāṇḍavān","_","_","pāṇḍava","NC","","_","_"
1,"hiḍimbaṃ","_","_","hiḍimba","NC","","_","_"
2,"nihataṃ","_","_","nihan","PPP","","_","_"
3,"dṛṣṭvā","_","_","dṛś","CGDA","","_","_"
4,"_","_","_","saṃhṛṣ","PPP","","_","_"
5,"_","_","_","tad","PRD","","_","_"
6,"tarasvinaḥ","_","_","tarasvin","JJ","","_","_"
1,"hiḍimbā","_","_","hiḍimbā","NC","","_","_"
2,"_","_","_","ca","CCD","","_","_"
3,"_","_","_","eva","CEM","","_","_"
4,"samprekṣya","_","_","samprekṣ","CGDA","","_","_"
5,"nihataṃ","_","_","nihan","PPP","","_","_"
6,"rākṣasaṃ","_","_","rākṣasa","NC","","_","_"
7,"raṇe","_","_","raṇa","NC","","_","_"
1,"_","_","_","adṛśya","JJ","","_","_"
2,"_","_","_","ca","CCD","","_","_"
3,"_","_","_","eva","CEM","","_","_"
4,"ye","_","_","yad","PRL","","_","_"
5,"svasthāḥ","_","_","svastha","JJ","","_","_"
6,"sametā","_","_","same","PPP","","_","_"
7,"_","_","_","bhūta","NC","","_","_"
8,"_","_","_","vādika","NC","","_","_"
1,"pūjayanti","_","_","pūj","V","pūj","_","_"
2,"sma","_","_","sma","CX","","_","_"
3,"saṃhṛṣṭāḥ","_","_","saṃhṛṣ","PPP","","_","_"
4,"sādhu","_","_","sādhu","JJ","","_","_"
5,"_","_","_","sādhu","JJ","","_","_"
6,"_","_","_","iti","CQT","","_","_"
7,"pāṇḍavam","_","_","pāṇḍava","NC","","_","_"
1,"_","_","_","bhrātṛ","NC","","_","_"
2,"_","_","_","ca","CCD","","_","_"
3,"_","_","_","api","CX","","_","_"
4,"saṃhṛṣṭā","_","_","saṃhṛṣ","PPP","","_","_"
5,"_","_","_","yudhiṣṭhira","NC","","_","_"
6,"_","_","_","purogama","JJ","","_","_"
1,"apūjayan","_","_","pūjay","V","pūjay","_","_"
2,"_","_","_","nara","NC","","_","_"
3,"_","_","_","vyāghra","NC","","_","_"
4,"bhīmasenam","_","_","bhīmasa","NC","","_","_"
5,"ariṃdamam","_","_","ariṃdama","JJ","","_","_"
1,"abhipūjya","_","_","abhipūjay","CGDA","","_","_"
2,"mahātmānaṃ","_","_","mahātman","JJ","","_","_"
3,"bhīmaṃ","_","_","bhīma","NC","","_","_"
4,"_","_","_","bhīma","JJ","","_","_"
5,"_","_","_","parākrama","NC","","_","_"
1,"punar","_","_","punar","CAD","","_","_"
2,"_","_","_","eva","CEM","","_","_"
3,"_","_","_","arjuna","NC","","_","_"
4,"vākyam","_","_","vākya","NC","","_","_"
5,"_","_","_","vak","V","vac","_","_"
6,"_","_","_","ida","PRD","","_","_"
7,"vṛkodaram","_","_","vṛkodara","NC","","_","_"
1,"_","_","_","na","CNG","","_","_"
2,"_","_","_","dūra","JJ","","_","_"
3,"nagaraṃ","_","_","nagara","NC","","_","_"
4,"manye","_","_","man","V","man","_","_"
5,"vanād","_","_","vana","NC","","_","_"
6,"asmād","_","_","ida","PRD","","_","_"
7,"ahaṃ","_","_","mat","PPR","","_","_"
8,"prabho","_","_","prabhu","NC","","_","_"
1,"śīghraṃ","_","_","śīghra","JJ","","_","_"
2,"gacchāma","_","_","gacch","V","gam","_","_"
3,"bhadraṃ","_","_","bhadra","NC","","_","_"
4,"te","_","_","tvat","PPR","","_","_"
5,"na","_","_","na","CNG","","_","_"
6,"no","_","_","mat","PPR","","_","_"
7,"vidyāt","_","_","vid","V","vid","_","_"
8,"suyodhanaḥ","_","_","suyodhana","NC","","_","_"
1,"tataḥ","_","_","tatas","CX","","_","_"
2,"sarve","_","_","sarva","JQ","","_","_"
3,"_","_","_","tathā","CX","","_","_"
4,"_","_","_","iti","CQT","","_","_"
5,"_","_","_","vac","CGDA","","_","_"
6,"saha","_","_","saha","CX","","_","_"
7,"mātrā","_","_","mātṛ","NC","","_","_"
8,"paraṃtapāḥ","_","_","paraṃtapa","JJ","","_","_"
1,"prayayuḥ","_","_","prayā","V","prayā","_","_"
2,"_","_","_","puruṣa","NC","","_","_"
3,"_","_","_","vyāghra","NC","","_","_"
4,"hiḍimbā","_","_","hiḍimbā","NC","","_","_"
5,"_","_","_","ca","CCD","","_","_"
6,"_","_","_","eva","CEM","","_","_"
7,"rākṣasī","_","_","rākṣasī","NC","","_","_"
