"WordID","word","NormSTEM","suffix","lemma","PoS","Root","NormSuffix","NormWord"
NA,"<doc textid = ""halahalahrdaya"" genre = ""dhāraṇī"" title = ""halāhalahṛdaya"" author = "" n/ a"" discourse = """" tradition = ""buddh"" period = ""unknown"" source = ""pdf"" date_range = """" notes = ""edition from cambridge add. 1680.8 manuscript 12th-13th centuries .the last part of sādhanamālā no. 28 with ritual instructions added. “the classication of dhāraṇī scriptures as sūtra or tantra is much varied and sometimes controversial within tibetan and chinese textual systems; showing that the positioning of these scriptures was problematic in earlier times as well.” brill "" religion = ""buddh"" edition = ""based on the ed. by gergely hidas. powers of protection. the buddhist tradition of spells in the dhāraṇīsaṃgraha collections"" digitization = ""ocr by tilak balavijayan & buddhist translators worbench team"" segmentation_lemmatization = ""ligeia lugli & buddhist translators workbench team"" metadata_enrichment = ""buddhist translators workbench team"" proofreader = """" permission = """" reconstructions = ""none"">","","","","","","",""
NA,"<page number=""24"">","","","","","","",""
NA,"<s number=""1"">","","","","","","",""
1,"a","","","alpha_privativum","ind","","","alpha_privativum"
2,"kṣobhya","KṢOBHY","a","kṣobhya","noun-adj","","a","kṣobhya"
3,"āry","ĀRY","a","ārya","noun-adj","","a","ārya"
4,"^āvalokiteśvara","AVALOKITEŚVAR","a","avalokiteśvara","noun-adj","","a","avalokiteśvara"
5,"—","","","","punct","","","—"
6,"mahāsthāmaprāpta","MAHĀSTHĀMAPRĀPT","a","mahāsthāmaprāpta","noun-adj","","a","mahāsthāmaprāpta"
7,"ārya","ĀRY","a","ārya","noun-adj","","a","ārya"
8,"maitreya","MAITREY","a","maitreya","noun-adj","","a","maitreya"
9,"—","","","","punct","","","—"
10,"ārya","ĀRY","a","ārya","noun-adj","","a","ārya"
11,"mañjuśrī","MAÑJUŚR","ī","mañjuśrī","noun-adj","","ī","mañjuśrī"
12,"—","","","","punct","","","—"
13,"ārya","ĀRY","a","ārya","noun-adj","","a","ārya"
14,"vajrapāṇi","VAJRAPĀṆ","i","vajrapāṇi","noun-adj","","i","vajrapāṇi"
15,"—","","","","punct","","","—"
16,"ārya","ĀRY","a","ārya","noun-adj","","a","ārya"
17,"samanta","SAMANT","a","samanta","noun-adj","","a","samanta"
18,"bhadra","BHADR","a","bhadra","noun-adj","","a","bhadra"
19,"prabhṛtibhyo","PRABHṚT","ibhyo","","noun-adj","","ibhyaḥ","prabhṛtibhyaḥ"
20,"mahā","MAH","ā","mahat","noun-adj","","ā","mahā"
21,"buddha","BUDDH","a","buddha","noun-adj","","a","buddha"
22,"bodhisattva","BODHISATTV","a","bodhisattva","noun-adj","","a","bodhisattva"
23,"van","VAN","","vat","noun-adj","","","van"
24,"āry","ĀRY","a","ārya","noun-adj","","a","ārya"
25,"^āvalokiteśvara","AVALOKITEŚVAR","a","avalokiteśvara","noun-adj","","a","avalokiteśvara"
26,"tava","TAV","a","tvat","pron","","a","tava"
27,"hṛdayam","HṚDAY","am","hṛdaya","noun-adj","","am","hṛdayam"
NA,"</page>","","","","","","",""
NA,"<page number=""25"">","","","","","","",""
30,"āvartayiṣyāmi","ĀVARTAYIṢ","yāmi","avavart","verb","avavṛt","yāmi","āvartayiṣyāmi"
31,"/","","","","punct","","","/"
NA,"</s>","","","","","","",""
NA,"<s number=""2"">","","","","","","",""
1,"sarvakāma","SARVAKĀM","a","sarvakāma","noun-adj","","a","sarvakāma"
2,"prasādhakam","PRASĀDHAK","am","prasādhaka","noun-adj","","am","prasādhakam"
3,"/","","","","punct","","","/"
NA,"</s>","","","","","","",""
NA,"<s number=""3"">","","","","","","",""
1,"a","","","alpha_privativum","ind","","","alpha_privativum"
2,"dhṛṣyaṃ","DHṚṢY","aṃ","dhṛṣya","noun-adj","","am","dhṛṣyam"
3,"sarva","SARV","a","sarva","noun-adj","","a","sarva"
4,"bhūtebhyai","BHŪT","ebhyai","bhūta","noun-adj","","ebhyai","bhūtebhyai"
5,"bhava","BHAV","a","bhava","noun-adj","","a","bhava"
6,"mārga","MĀRG","a","mārga","noun-adj","","a","mārga"
7,"vināśanam","VINĀŚAN","am","vināśana","noun-adj","","am","vināśanam"
8,"/","","","","punct","","","/"
NA,"</s>","","","","","","",""
NA,"<s number=""4"">","","","","","","",""
1,"saṃyath","SAṂYAT","h","saṃyata","noun-adj","","h","saṃyath"
2,"edam","EDAM","","idam","pron","","","edam"
3,"/","","","","punct","","","/"
NA,"</s>","","","","","","",""
NA,"<s number=""5"">","","","","","","",""
1,"he","","","","ind","","",""
2,"bodhisattva","BODHISATTV","a","bodhisattva","noun-adj","","a","bodhisattva"
3,"priya","PRIY","a","priya","noun-adj","","a","priya"
4,"bodhisattva","BODHISATTV","a","bodhisattva","noun-adj","","a","bodhisattva"
5,"mahā","MAH","ā","mahat","noun-adj","","ā","mahā"
6,"bodhisattva","BODHISATTV","a","bodhisattva","noun-adj","","a","bodhisattva"
7,"he","","","","ind","","",""
8,"hale","HAL","e","hala","noun-adj","","e","hale"
9,"āry","ĀRY","a","ārya","noun-adj","","a","ārya"
10,"^āvalokiteśvara","AVALOKITEŚVAR","a","avalokiteśvara","noun-adj","","a","avalokiteśvara"
11,"maheśvara","MAHEŚVAR","a","maheśvara","noun-adj","","a","maheśvara"
12,"parama","PARAM","a","parama","noun-adj","","a","parama"
13,"maitra","MAITR","a","maitra","noun-adj","","a","maitra"
14,"citta","CITT","a","citta","noun-adj","","a","citta"
15,"hita","HIT","a","hita","noun-adj","","a","hita"
16,"citta","CITT","a","citta","noun-adj","","a","citta"
17,"mahākāruṇika","MAHĀKĀRUṆIK","a","mahākāruṇika","noun-adj","","a","mahākāruṇika"
18,"kāmaṃ","KĀM","aṃ","kāma","noun-adj","","am","kāmam"
19,"gama","GAM","a","gama","noun-adj","","a","gama"
20,"/","","","","punct","","","/"
NA,"</s>","","","","","","",""
NA,"<s number=""6"">","","","","","","",""
1,"viyaṃ","VIY","aṃ","viya","noun-adj","","am","viyam"
2,"gama","GAM","a","gama","noun-adj","","a","gama"
3,"viyati","VIYAT","i","vi","noun-adj","","i","viyati"
4,"mahā","MAH","ā","mahat","noun-adj","","ā","mahā"
5,"viyati","VIYAT","i","vi","noun-adj","","i","viyati"
6,"dhara","DHAR","a","dhara","noun-adj","","a","dhara"
7,"dhiri","DHIR","i","dhiri","noun-adj","","i","dhiri"
8,"dhuru","DHUR","u","dhura","noun-adj","","u","dhuru"
9,"dhar","DHAR","","dhara","noun-adj","","","dhar"
10,"ā","","","alpha_privativum","ind","","","alpha_privativum"
11,"dhara","DHAR","a","dhara","noun-adj","","a","dhara"
12,"cala","CAL","a","cala","noun-adj","","a","cala"
13,"candrā","CANDR","ā","candra","noun-adj","","āḥ","candrāḥ"
14,"cala","CAL","a","cala","noun-adj","","a","cala"
15,"namas","NAM","as","namas","noun-adj","","aḥ","namaḥ"
16,"te","","","tad","pron","","","tad"
17,"astu","","","as","verb","as","",""
18,"oṃ","","","oṃ","ind","","","oṃ"
19,"hrīḥ","HR","īḥ","hrī","noun-adj","","īḥ","hrīḥ"
20,"sarva","SARV","a","sarva","noun-adj","","a","sarva"
21,"sattvā","SATTV","ā","sattvā","noun-adj","","ā","sattvā"
22,"bhaya","BHAY","a","bhaya","noun-adj","","a","bhaya"
23,"prada","PRAD","a","prada","noun-adj","","a","prada"
24,"hāhā","HĀH","ā","hāhā","noun-adj","","ā","hāhā"
25,"hari","HAR","i","hari","noun-adj","","i","hari"
26,"hari","HAR","i","hari","noun-adj","","i","hari"
27,"vāhan","VĀHAN","a","vāhana","noun-adj","","a","vāhana"
28,"^odbhava","UDBHAV","a","udbhava","noun-adj","","a","udbhava"
29,"bhav","BHAV","","bhava","noun-adj","","","bhav"
30,"ā","","","alpha_privativum","ind","","","alpha_privativum"
31,"bhava","BHAV","a","bhava","noun-adj","","a","bhava"
32,"bhavāna","BHAVĀN","a","bhava","noun-adj","","a","bhavāna"
33,"gha","GH","a","gha","noun-adj","","a","gha"
34,"turu","TUR","u","tura","noun-adj","","u","turu"
35,"kuru","KUR","u","kar","verb","kṛ","u","kuru"
36,"suru","SUR","u","sura","noun-adj","","u","suru"
37,"muru","MUR","u","muru","noun-adj","","u","muru"
38,"curu","CUR","u","curu","noun-adj","","u","curu"
39,"su","","","su","ind","","","su"
40,"prasāda","PRASĀD","a","prasāda","noun-adj","","a","prasāda"
41,"sit","SIT","a","sita","noun-adj","","a","sita"
42,"^āmala","ĀMAL","a","āmal","noun-adj","","a","āmala"
43,"vimala","VIMAL","a","vimala","noun-adj","","a","vimala"
44,"mūrte","MŪRT","e","mūrta","noun-adj","","e","mūrte"
45,"he","","","","ind","","",""
46,"he","","","","ind","","",""
47,"bhagavan","BHAGAV","an","bhagavat","noun-adj","","ān","bhagavān"
48,"āry","ĀRY","a","ārya","noun-adj","","a","ārya"
49,"^āvalokiteśvara","AVALOKITEŚVAR","a","avalokiteśvara","noun-adj","","a","avalokiteśvara"
50,"maheśvara","MAHEŚVAR","a","maheśvara","noun-adj","","a","maheśvara"
51,"mahākāruṇika","MAHĀKĀRUṆIK","a","mahākāruṇika","noun-adj","","a","mahākāruṇika"
52,"kṛṣṇā","KṚṢṆ","ā","kṛṣṇā","noun-adj","","ā","kṛṣṇā"
53,"jina","JIN","a","jina","noun-adj","","a","jina"
54,"dhara","DHAR","a","dhara","noun-adj","","a","dhara"
55,"akṣadhara","AKṢADHAR","a","akṣadhara","noun-adj","","a","akṣadhara"
56,"kamaṇḍalu","KAMAṆḌAL","u","kamaṇḍalu","noun-adj","","u","kamaṇḍalu"
57,"daṇḍa","DAṆḌ","a","daṇḍa","noun-adj","","a","daṇḍa"
58,"dhara","DHAR","a","dhara","noun-adj","","a","dhara"
59,"padma","PADM","a","padma","noun-adj","","a","padma"
60,"dhara","DHAR","a","dhara","noun-adj","","a","dhara"
61,"pūta","PŪT","a","pūta","noun-adj","","a","pūta"
62,"pavitra","PAVITR","a","pavitra","noun-adj","","a","pavitra"
63,"jaṭā","JAṬ","ā","jaṭā","noun-adj","","ā","jaṭā"
64,"makuṭ","MAKUṬ","a","makuṭa","noun-adj","","a","makuṭa"
65,"^ālamba","ĀLAMB","a","ālamba","noun-adj","","a","ālamba"
66,"pralamba","PRALA","a","pralamba","noun-adj","","a","pralaa"
67,"cala","CAL","a","cala","noun-adj","","a","cala"
68,"mala","MAL","a","mala","noun-adj","","a","mala"
69,"kala","KAL","a","kala","noun-adj","","a","kala"
70,"kamala","KAMAL","a","kamala","noun-adj","","a","kamala"
71,"cala","CAL","a","cala","noun-adj","","a","cala"
72,"nala","NAL","a","nala","noun-adj","","a","nala"
73,"dala","DAL","a","dala","noun-adj","","a","dala"
74,"jala","JAL","a","jala","noun-adj","","a","jala"
75,"hala","HAL","a","hala","noun-adj","","a","hala"
76,"hili","HIL","i","hili","noun-adj","","i","hili"
77,"hulu","HUL","u","hulu","noun-adj","","u","hulu"
78,"halāhala","HALĀHAL","a","halāhala","noun-adj","","a","halāhala"
79,"halāhala","HALĀHAL","a","halāhala","noun-adj","","a","halāhala"
80,"he","","","","ind","","",""
81,"bodhisattva","BODHISATTV","a","bodhisattva","noun-adj","","a","bodhisattva"
82,"priya","PRIY","a","priya","noun-adj","","a","priya"
83,"bodhisattva","BODHISATTV","a","bodhisattva","noun-adj","","a","bodhisattva"
84,"mahā","MAH","ā","mahat","noun-adj","","ā","mahā"
85,"bodhisattva","BODHISATTV","a","bodhisattva","noun-adj","","a","bodhisattva"
86,"namas","NAM","as","namas","noun-adj","","aḥ","namaḥ"
87,"te","","","tad","pron","","","tad"
88,"astu","","","as","verb","as","",""
89,"hūṃ","","","","ind","","",""
90,"hūṃ","","","","ind","","",""
91,"kuru","KUR","u","kar","verb","kṛ","u","kuru"
92,"hṛdayam","HṚDAY","am","hṛdaya","noun-adj","","am","hṛdayam"
93,"anusmara","ANUSMAR","a","anusmar","noun-adj","","a","anusmara"
94,"samayam","SAMAY","am","samaya","noun-adj","","am","samayam"
95,"anusmara","ANUSMAR","a","anusmar","noun-adj","","a","anusmara"
96,"jātim","JĀT","im","jāti","noun-adj","","im","jātim"
97,"anusmara","ANUSMAR","a","anusmar","noun-adj","","a","anusmara"
98,"satyam","SATY","am","satya","noun-adj","","am","satyam"
99,"anusmara","ANUSMAR","a","anusmar","noun-adj","","a","anusmara"
100,"buddha","BUDDH","a","buddha","noun-adj","","a","buddha"
101,"satyam","SATY","am","satya","noun-adj","","am","satyam"
102,"anusmara","ANUSMAR","a","anusmar","noun-adj","","a","anusmara"
103,"dharma","DHARM","a","dharma","noun-adj","","a","dharma"
104,"satyam","SATY","am","satya","noun-adj","","am","satyam"
105,"anusmara","ANUSMAR","a","anusmar","noun-adj","","a","anusmara"
106,"saṃgha","SAṂGH","a","saṃgha","noun-adj","","a","saṃgha"
107,"satyam","SATY","am","satya","noun-adj","","am","satyam"
108,"anusmara","ANUSMAR","a","anusmar","noun-adj","","a","anusmara"
109,"/","","","","punct","","","/"
NA,"</s>","","","","","","",""
NA,"<s number=""7"">","","","","","","",""
1,"idaṃ","IDAṂ","","idam","pron","","","idaṃ"
2,"ca","","","ca","ind","","","ca"
3,"me","","","mat","pron","","","mat"
4,"kāryaṃ","KĀRY","aṃ","kārya","noun-adj","","am","kāryam"
5,"kuru","KUR","u","kar","verb","kṛ","u","kuru"
6,"bhūta","BHŪT","a","bhūta","noun-adj","","a","bhūta"
7,"mahābhūta","MAHĀBHŪT","a","mahābhūta","noun-adj","","a","mahābhūta"
8,"svāhā","SVĀH","ā","svāhā","noun-adj","","ā","svāhā"
9,"//","","","","punct","","","//"
NA,"</s>","","","","","","",""
NA,"<s number=""8"">","","","","","","",""
1,"eṣa","","","tad","pron","","","tad"
2,"vidhiḥ","VIDH","iḥ","vidhi","noun-adj","","iḥ","vidhiḥ"
3,"pratidinaṃ","PRATIDIN","aṃ","pratidā","noun-adj","","am","pratidinam"
4,"prātar","PRĀTAR","","prātara","noun-adj","","","prātar"
5,"utthāya","UTTHĀY","a","utthāya","noun-adj","","a","utthāya"
6,"śucinā","ŚUC","inā","śuci","noun-adj","","inā","śucinā"
7,"śuci","ŚUC","i","śuci","noun-adj","","i","śuci"
8,"vastra","VASTR","a","vastra","noun-adj","","a","vastra"
9,"prāvṛtena","PRĀVṚT","ena","prāvṛta","noun-adj","","ena","prāvṛtena"
10,"bhagavata","BHAGAV","ata","bhagavat","noun-adj","","ati","bhagavati"
11,"āry","ĀRY","a","ārya","noun-adj","","a","ārya"
12,"^āvalokiteśvarasya","AVALOKITEŚVAR","asya","avalokiteśvara","noun-adj","","asya","avalokiteśvarasya"
13,"purato","PURAT","o","puratas","noun-adj","","aḥ","purataḥ"
14,"apatita","APATIT","a","apatitā","noun-adj","","a","apatitā"
15,"gomayena","GOMAY","ena","gomaya","noun-adj","","ena","gomayena"
16,"catur","CAT","ur","catur","noun-adj","","ur","catur"
17,"asraṃ","ASR","aṃ","asra","noun-adj","","am","asram"
18,"maṇḍalakaṃ","MAṆḌALAK","aṃ","maṇḍalaka","noun-adj","","am","maṇḍalakam"
19,"kṛtvā","KṚTV","ā","kṛtvā","noun-adj","","ā","kṛtvā"
20,"trayodaśa","TRAYODAŚ","a","tri","noun-adj","","a","trayodaśa"
21,"vārān","VĀR","ān","vāra","noun-adj","","ān","vārān"
22,"uccārayi","UCCĀR","ayi","uccāra","noun-adj","","ayi","uccārayi"
23,"/","","","","punct","","","/"
NA,"</s>","","","","","","",""
NA,"<s number=""9"">","","","","","","",""
1,"tataḥ","","","tatas","ind","","","tatas"
2,"sarva","SARV","a","sarva","noun-adj","","a","sarva"
3,"vyādhīn","VYĀDH","īn","vyādhi","noun-adj","","īn","vyādhīn"
4,"apanayati","APAN","ayati","apanay","verb","apanī","ayati","apanayati"
5,"/","","","","punct","","","/"
NA,"</s>","","","","","","",""
NA,"<s number=""10"">","","","","","","",""
1,"māraṃ","MĀR","aṃ","māra","noun-adj","","am","māram"
2,"c","","a","ca","ind","","a","ca"
3,"^opaśamayati","UPAŚAM","ayati","upaśam","verb","upaśam","ayati","upaśamayati"
4,"/","","","","punct","","","/"
NA,"</s>","","","","","","",""
NA,"<s number=""11"">","","","","","","",""
1,"eka","EK","a","eka","noun-adj","","a","eka"
2,"manorathaṃ","MANORATH","aṃ","manoratha","noun-adj","","am","manoratham"
3,"kṛtvā","KṚTV","ā","kṛtvā","noun-adj","","ā","kṛtvā"
4,"ṣaṇmāsena","ṢAṆMĀS","ena","ṣaṇmāsa","noun-adj","","ena","ṣaṇmāsena"
5,"kurvato","KURV","ato","kurvat","noun-adj","","ataḥ","kurvataḥ"
6,"manorathaṃ","MANORATH","aṃ","manoratha","noun-adj","","am","manoratham"
7,"bhagavān","BHAGAV","ān","bhagavat","noun-adj","","ān","bhagavān"
8,"avalokiteśvaraḥ","AVALOKITEŚVAR","aḥ","avalokiteśvara","noun-adj","","aḥ","avalokiteśvaraḥ"
9,"/","","","","punct","","","/"
NA,"</s>","","","","","","",""
NA,"<s number=""12"">","","","","","","",""
1,"pañc","PAÑC","a","pañca","noun-adj","","a","pañca"
2,"^ānantarya","ĀNANTARY","a","ānantarya","noun-adj","","a","ānantarya"
3,"kārī","KĀR","ī","kāri","noun-adj","","ī","kārī"
4,"api","","","api","ind","","","api"
5,"sidhyet","SIDHY","et","sidh","verb","sidh","et","sidhyet"
6,"/","","","","punct","","","/"
NA,"</s>","","","","","","",""
NA,"<s number=""13"">","","","","","","",""
1,"yadi","","","yadi","ind","","","yadi"
2,"na","","","na","ind","","","na"
3,"sidhyet","SIDHY","et","sidh","verb","sidh","et","sidhyet"
4,"tadā","","","tadā","ind","","","tadā"
5,"aham","AHAM","","mat","pron","","","aham"
6,"eva","","","eva","ind","","","eva"
7,"pañc","PAÑC","a","pañca","noun-adj","","a","pañca"
8,"^ānantarya","ĀNANTARY","a","ānantarya","noun-adj","","a","ānantarya"
9,"kārī","KĀR","ī","kāri","noun-adj","","ī","kārī"
10,"syām","","","as","verb","as","",""
11,"/","","","","punct","","","/"
NA,"</s>","","","","","","",""
NA,"<s number=""14"">","","","","","","",""
1,"visaṃvādi","VISAṂVĀD","i","visaṃvādin","noun-adj","","i","visaṃvādi"
NA,"</s>","","","","","","",""
NA,"</page>","","","","","","",""
NA,"</doc>","","","","","","",""
