"WordID","word","NormSTEM","suffix","lemma","PoS","Root","NormSuffix","NormWord"
1,"yudhiṣṭhira","_","_","yudhiṣṭhira","NC","","_","_"
2,"uvāca","_","_","vak","V","vac","_","_"
1,"_","_","_","dharma","NC","","_","_"
2,"_","_","_","jña","JJ","","_","_"
3,"_","_","_","balavat","JJ","","_","_"
4,"_","_","_","śūra","NC","","_","_"
5,"sadyo","_","_","sadyas","CAD","","_","_"
6,"_","_","_","rākṣasa","NC","","_","_"
7,"_","_","_","puṃgava","NC","","_","_"
1,"bhakto","_","_","bhakta","JJ","","_","_"
2,"'smān","_","_","mat","PPR","","_","_"
3,"aurasaḥ","_","_","aurasa","NC","","_","_"
4,"putro","_","_","putra","NC","","_","_"
5,"bhīma","_","_","bhīma","NC","","_","_"
6,"gṛhṇātu","_","_","grah","V","grah","_","_"
7,"mātaram","_","_","mātṛ","NC","","_","_"
1,"tava","_","_","tvat","PPR","","_","_"
2,"bhīma","_","_","bhīma","NC","","_","_"
3,"_","_","_","bala","NC","","_","_"
4,"_","_","_","mat","PPR","","_","_"
5,"_","_","_","ati","CADP","","_","_"
6,"_","_","_","bhīma","JJ","","_","_"
7,"_","_","_","parākrama","NC","","_","_"
1,"akṣataḥ","_","_","akṣata","JJ","","_","_"
2,"saha","_","_","saha","CX","","_","_"
3,"pāñcālyā","_","_","pāñcālī","NC","","_","_"
4,"gaccheyaṃ","_","_","gacch","V","gam","_","_"
5,"gandhamādanam","_","_","gandhamādana","NC","","_","_"
1,"vaiśampāyana","_","_","vaiśampāyana","NC","","_","_"
2,"uvāca","_","_","vak","V","vac","_","_"
1,"bhrātur","_","_","bhrātṛ","NC","","_","_"
2,"vacanam","_","_","vacana","NC","","_","_"
3,"ājñāya","_","_","ājñā","CGDA","","_","_"
4,"bhīmaseno","_","_","bhīmasa","NC","","_","_"
5,"ghaṭotkacam","_","_","ghaṭotkaca","NC","","_","_"
1,"ādideśa","_","_","ādiś","V","ādiś","_","_"
2,"_","_","_","nara","NC","","_","_"
3,"_","_","_","vyāghra","NC","","_","_"
4,"tanayaṃ","_","_","tanaya","NC","","_","_"
5,"_","_","_","śatru","NC","","_","_"
6,"_","_","_","karśana","JJ","","_","_"
1,"haiḍimbeya","_","_","haiḍimbeya","JJ","","_","_"
2,"pariśrāntā","_","_","pariśra","PPP","","_","_"
3,"tava","_","_","tvat","PPR","","_","_"
4,"_","_","_","mātṛ","NC","","_","_"
5,"_","_","_","aparājita","JJ","","_","_"
1,"tvaṃ","_","_","tvat","PPR","","_","_"
2,"ca","_","_","ca","CCD","","_","_"
3,"_","_","_","kāma","NC","","_","_"
4,"_","_","_","gama","JJ","","_","_"
5,"tāta","_","_","tāta","NC","","_","_"
6,"balavān","_","_","balavat","JJ","","_","_"
7,"vaha","_","_","vah","V","vah","_","_"
8,"tāṃ","_","_","tad","PRD","","_","_"
9,"khaga","_","_","khaga","NC","","_","_"
1,"skandham","_","_","skandha","NC","","_","_"
2,"āropya","_","_","āropay","CGDA","","_","_"
3,"bhadraṃ","_","_","bhadra","NC","","_","_"
4,"te","_","_","tvat","PPR","","_","_"
5,"madhye","_","_","madhya","NC","","_","_"
6,"'smākaṃ","_","_","mat","PPR","","_","_"
7,"vihāyasā","_","_","vihāyas","NC","","_","_"
1,"gaccha","_","_","ga","V","ga","_","_"
2,"nīcikayā","_","_","nīcikā","NC","","_","_"
3,"gatyā","_","_","gati","NC","","_","_"
4,"yathā","_","_","yathā","CCM","","_","_"
5,"_","_","_","ca","CCD","","_","_"
6,"_","_","_","a","PRD","","_","_"
7,"na","_","_","na","CNG","","_","_"
8,"pīḍayeḥ","_","_","pīḍay","V","pīḍay","_","_"
1,"ghaṭotkaca","_","_","ghaṭotkaca","NC","","_","_"
2,"uvāca","_","_","vak","V","vac","_","_"
1,"dharmarājaṃ","_","_","dharmarāja","NC","","_","_"
2,"ca","_","_","ca","CCD","","_","_"
3,"dhaumyaṃ","_","_","dhaumya","NC","","_","_"
4,"ca","_","_","ca","CCD","","_","_"
5,"_","_","_","rājan","NC","","_","_"
6,"_","_","_","putrī","NC","","_","_"
7,"yamau","_","_","yama","NC","","_","_"
8,"tathā","_","_","tathā","CX","","_","_"
1,"eko","_","_","eka","PPX","","_","_"
2,"_","_","_","api","CX","","_","_"
3,"_","_","_","mat","PPR","","_","_"
4,"alaṃ","_","_","ala","CX","","_","_"
5,"voḍhuṃ","_","_","vah","CGDI","","_","_"
6,"kim","_","_","kiṃ","PRQ","","_","_"
7,"_","_","_","uta","CCD","","_","_"
8,"_","_","_","adya","CX","","_","_"
9,"sahāyavān","_","_","sahāyavat","JJ","","_","_"
1,"vaiśampāyana","_","_","vaiśampāyana","NC","","_","_"
2,"uvāca","_","_","vak","V","vac","_","_"
1,"evam","_","_","eva","CX","","_","_"
2,"uktvā","_","_","vac","CGDA","","_","_"
3,"tataḥ","_","_","tatas","CX","","_","_"
4,"kṛṣṇām","_","_","kṛṣṇā","NC","","_","_"
5,"uvāha","_","_","vah","V","vah","_","_"
6,"sa","_","_","tad","PRD","","_","_"
7,"ghaṭotkacaḥ","_","_","ghaṭotkaca","NC","","_","_"
1,"pāṇḍūnāṃ","_","_","pāṇḍu","NC","","_","_"
2,"_","_","_","madhya","NC","","_","_"
3,"_","_","_","ga","JJ","","_","_"
4,"vīraḥ","_","_","vīra","NC","","_","_"
5,"pāṇḍavān","_","_","pāṇḍava","NC","","_","_"
6,"api","_","_","api","CX","","_","_"
7,"_","_","_","ca","CCD","","_","_"
8,"_","_","_","apara","PPX","","_","_"
1,"lomaśaḥ","_","_","lomaśa","NC","","_","_"
2,"_","_","_","siddha","NC","","_","_"
3,"_","_","_","mārga","NC","","_","_"
4,"_","_","_","ga","V","ga","_","_"
5,"_","_","_","anupama","JJ","","_","_"
6,"_","_","_","dyuti","NC","","_","_"
1,"_","_","_","sva","JJ","","_","_"
2,"_","_","_","eva","CEM","","_","_"
3,"_","_","_","ātman","NC","","_","_"
4,"_","_","_","prabhāva","NC","","_","_"
5,"dvitīya","_","_","dvitīya","JJ","","_","_"
6,"iva","_","_","iva","CCM","","_","_"
7,"bhāskaraḥ","_","_","bhāskara","NC","","_","_"
1,"brāhmaṇāṃś","_","_","brāhmaṇa","NC","","_","_"
2,"_","_","_","ca","CCD","","_","_"
3,"_","_","_","api","CX","","_","_"
4,"tān","_","_","tad","PRD","","_","_"
5,"sarvān","_","_","sarva","JQ","","_","_"
6,"samupādāya","_","_","samupādā","CGDA","","_","_"
7,"rākṣasāḥ","_","_","rākṣasa","NC","","_","_"
1,"niyogād","_","_","niyoga","NC","","_","_"
2,"_","_","_","rākṣasa","NC","","_","_"
3,"_","_","_","indra","NC","","_","_"
4,"jagmur","_","_","ga","V","ga","_","_"
5,"_","_","_","bhīma","JJ","","_","_"
6,"_","_","_","parākrama","NC","","_","_"
1,"evaṃ","_","_","eva","CX","","_","_"
2,"_","_","_","vana","NC","","_","_"
3,"_","_","_","upavana","NC","","_","_"
4,"vanānyupavanāni","_","_","ca","CCD","","_","_"
1,"ālokayantas","_","_","ālokay","KDP","","_","_"
2,"te","_","_","tad","PRD","","_","_"
3,"jagmur","_","_","ga","V","ga","_","_"
4,"viśālāṃ","_","_","viśāla","JJ","","_","_"
5,"badarīṃ","_","_","badarī","NC","","_","_"
6,"prati","_","_","prati","CADP","","_","_"
1,"te","_","_","tad","PRD","","_","_"
2,"_","_","_","tu","CCD","","_","_"
3,"_","_","_","āśu","JJ","","_","_"
4,"_","_","_","gati","NC","","_","_"
5,"vīrā","_","_","vīra","NC","","_","_"
6,"rākṣasais","_","_","rākṣasa","NC","","_","_"
7,"tair","_","_","tad","PRD","","_","_"
8,"_","_","_","mahat","JJ","","_","_"
9,"_","_","_","bala","NC","","_","_"
1,"uhyamānā","_","_","vah","KDP","","_","_"
2,"yayuḥ","_","_","yā","V","yā","_","_"
3,"śīghraṃ","_","_","śīghra","JJ","","_","_"
4,"mahad","_","_","mahat","JJ","","_","_"
5,"adhvānam","_","_","adhvan","NC","","_","_"
6,"_","_","_","alpa","JJ","","_","_"
7,"_","_","_","vat","CX","","_","_"
1,"deśān","_","_","deśa","NC","","_","_"
2,"_","_","_","mleccha","NC","","_","_"
3,"_","_","_","gaṇa","NC","","_","_"
4,"_","_","_","ākṛ","PPP","","_","_"
5,"_","_","_","nānā","CX","","_","_"
6,"_","_","_","ratna","NC","","_","_"
7,"_","_","_","ākara","NC","","_","_"
8,"_","_","_","āyuta","JJ","","_","_"
1,"dadṛśur","_","_","darś","V","dṛś","_","_"
2,"_","_","_","giri","NC","","_","_"
3,"_","_","_","pāda","NC","","_","_"
4,"ca","_","_","ca","CCD","","_","_"
5,"_","_","_","nānā","CX","","_","_"
6,"_","_","_","dhātu","NC","","_","_"
7,"_","_","_","samāci","PPP","","_","_"
1,"_","_","_","vidyādhara","NC","","_","_"
2,"_","_","_","gaṇa","NC","","_","_"
3,"_","_","_","ākṛ","PPP","","_","_"
4,"yutān","_","_","yuta","JJ","","_","_"
5,"_","_","_","vānara","NC","","_","_"
6,"_","_","_","kiṃnara","NC","","_","_"
1,"tathā","_","_","tathā","CX","","_","_"
2,"_","_","_","kimpuruṣa","NC","","_","_"
3,"_","_","_","ca","CCD","","_","_"
4,"_","_","_","eva","CEM","","_","_"
5,"gandharvaiś","_","_","gandharva","NC","","_","_"
6,"ca","_","_","ca","CCD","","_","_"
7,"samantataḥ","_","_","samantataḥ","CX","","_","_"
1,"_","_","_","nadī","NC","","_","_"
2,"_","_","_","jāla","NC","","_","_"
3,"_","_","_","samākṛ","PPP","","_","_"
4,"_","_","_","nānā","CX","","_","_"
5,"_","_","_","pakṣin","NC","","_","_"
6,"_","_","_","ruta","NC","","_","_"
7,"_","_","_","ākula","JJ","","_","_"
1,"nānāvidhair","_","_","nānāvidha","JJ","","_","_"
2,"mṛgair","_","_","mṛga","NC","","_","_"
3,"juṣṭān","_","_","juṣ","PPP","","_","_"
4,"vānaraiś","_","_","vānara","NC","","_","_"
5,"_","_","_","ca","CCD","","_","_"
6,"_","_","_","upaśobhay","PPP","","_","_"
1,"te","_","_","tad","PRD","","_","_"
2,"vyatītya","_","_","vyatī","CGDA","","_","_"
3,"bahūn","_","_","bahu","JJ","","_","_"
4,"deśān","_","_","deśa","NC","","_","_"
5,"uttarāṃś","_","_","uttara","JJ","","_","_"
6,"ca","_","_","ca","CCD","","_","_"
7,"kurūn","_","_","kuru","NC","","_","_"
8,"api","_","_","api","CX","","_","_"
1,"dadṛśur","_","_","darś","V","dṛś","_","_"
2,"_","_","_","vividha","JJ","","_","_"
3,"_","_","_","āścarya","NC","","_","_"
4,"kailāsaṃ","_","_","kailāsa","NC","","_","_"
5,"_","_","_","parvata","NC","","_","_"
6,"_","_","_","uttama","JJ","","_","_"
1,"_","_","_","tad","PRD","","_","_"
2,"_","_","_","abhyāśa","NC","","_","_"
3,"tu","_","_","tu","CCD","","_","_"
4,"dadṛśur","_","_","darś","V","dṛś","_","_"
5,"_","_","_","nara","NC","","_","_"
6,"_","_","_","nārāyaṇa","NC","","_","_"
7,"_","_","_","āśrama","NC","","_","_"
1,"upetaṃ","_","_","upe","PPP","","_","_"
2,"pādapair","_","_","pādapa","NC","","_","_"
3,"divyaiḥ","_","_","divya","JJ","","_","_"
4,"_","_","_","sadāpuṣpa","JJ","","_","_"
5,"_","_","_","phala","NC","","_","_"
6,"_","_","_","upaga","JJ","","_","_"
1,"dadṛśus","_","_","darś","V","dṛś","_","_"
2,"tāṃ","_","_","tad","PRD","","_","_"
3,"ca","_","_","ca","CCD","","_","_"
4,"badarīṃ","_","_","badarī","NC","","_","_"
5,"_","_","_","vṛtta","JJ","","_","_"
6,"_","_","_","skandha","NC","","_","_"
7,"manoramām","_","_","manorama","JJ","","_","_"
1,"snigdhām","_","_","snigdha","JJ","","_","_"
2,"_","_","_","avirala","JJ","","_","_"
3,"_","_","_","chāyā","NC","","_","_"
4,"śriyā","_","_","śrī","NC","","_","_"
5,"paramayā","_","_","parama","JJ","","_","_"
6,"yutām","_","_","yuta","JJ","","_","_"
1,"pattraiḥ","_","_","pattra","NC","","_","_"
2,"snigdhair","_","_","snigdha","JJ","","_","_"
3,"aviralair","_","_","avirala","JJ","","_","_"
4,"upetāṃ","_","_","upe","PPP","","_","_"
5,"mṛdubhiḥ","_","_","mṛdu","JJ","","_","_"
6,"śubhām","_","_","śubha","JJ","","_","_"
1,"_","_","_","viśāla","JJ","","_","_"
2,"_","_","_","śākhā","NC","","_","_"
3,"vistīrṇām","_","_","vistṛ","PPP","","_","_"
4,"_","_","_","atidyuti","JJ","","_","_"
5,"_","_","_","samanvita","JJ","","_","_"
1,"phalair","_","_","phala","NC","","_","_"
2,"upacitair","_","_","upaci","PPP","","_","_"
3,"divyair","_","_","divya","JJ","","_","_"
4,"ācitāṃ","_","_","āci","PPP","","_","_"
5,"svādubhir","_","_","svādu","JJ","","_","_"
6,"bhṛśam","_","_","bhṛśa","CX","","_","_"
1,"_","_","_","madhu","NC","","_","_"
2,"_","_","_","srava","NC","","_","_"
3,"sadā","_","_","sadā","CAD","","_","_"
4,"divyāṃ","_","_","divya","JJ","","_","_"
5,"_","_","_","mahat","JJ","","_","_"
6,"_","_","_","ṛṣi","NC","","_","_"
7,"_","_","_","gaṇa","NC","","_","_"
8,"_","_","_","sev","PPP","","_","_"
1,"_","_","_","mada","NC","","_","_"
2,"_","_","_","pramud","PPP","","_","_"
3,"nityaṃ","_","_","nitya","CX","","_","_"
4,"_","_","_","nānā","CX","","_","_"
5,"_","_","_","dvija","NC","","_","_"
6,"_","_","_","gaṇa","NC","","_","_"
7,"yutām","_","_","yuta","JJ","","_","_"
1,"a","_","_","alpha_privativum","JJ","","_","_"
1,"_","_","_","daṃśa","JJ","","_","_"
2,"_","_","_","maśaka","NC","","_","_"
3,"deśe","_","_","deśa","NC","","_","_"
4,"_","_","_","bahu","JJ","","_","_"
5,"_","_","_","mūla","NC","","_","_"
6,"_","_","_","phala","NC","","_","_"
7,"_","_","_","udaka","NC","","_","_"
1,"_","_","_","nīla","JJ","","_","_"
2,"_","_","_","śādvala","NC","","_","_"
3,"_","_","_","saṃchad","PPP","","_","_"
4,"_","_","_","deva","NC","","_","_"
5,"_","_","_","gandharva","NC","","_","_"
6,"_","_","_","sev","PPP","","_","_"
1,"su","_","_","su","JJ","","_","_"
1,"_","_","_","samīkṛta","JJ","","_","_"
2,"_","_","_","bhūbhāga","NC","","_","_"
3,"_","_","_","svabhāva","NC","","_","_"
4,"_","_","_","vidhā","PPP","","_","_"
5,"śubhe","_","_","śubha","JJ","","_","_"
1,"jātāṃ","_","_","jan","PPP","","_","_"
2,"_","_","_","hima","JJ","","_","_"
3,"_","_","_","mṛdu","JJ","","_","_"
4,"_","_","_","sparśa","NC","","_","_"
5,"deśe","_","_","deśa","NC","","_","_"
6,"_","_","_","apahan","PPP","","_","_"
7,"_","_","_","kaṇṭaka","NC","","_","_"
1,"tām","_","_","tad","PRD","","_","_"
2,"upetya","_","_","upe","CGDA","","_","_"
3,"mahātmānaḥ","_","_","mahātman","JJ","","_","_"
4,"saha","_","_","saha","CX","","_","_"
5,"tair","_","_","tad","PRD","","_","_"
6,"_","_","_","brāhmaṇa","NC","","_","_"
7,"_","_","_","ṛṣabha","NC","","_","_"
1,"avaterus","_","_","avatar","V","avatṛ","_","_"
2,"tataḥ","_","_","tatas","CX","","_","_"
3,"sarve","_","_","sarva","JQ","","_","_"
4,"_","_","_","rākṣasa","NC","","_","_"
5,"_","_","_","skandha","NC","","_","_"
6,"śanaiḥ","_","_","śanais","CX","","_","_"
1,"tatas","_","_","tatas","CX","","_","_"
2,"tam","_","_","tad","PRD","","_","_"
3,"āśramaṃ","_","_","āśrama","NC","","_","_"
4,"puṇyaṃ","_","_","puṇya","JJ","","_","_"
5,"_","_","_","nara","NC","","_","_"
6,"_","_","_","nārāyaṇa","NC","","_","_"
7,"_","_","_","āśri","PPP","","_","_"
1,"dadṛśuḥ","_","_","darś","V","dṛś","_","_"
2,"pāṇḍavā","_","_","pāṇḍava","NC","","_","_"
3,"rājan","_","_","rājan","NC","","_","_"
4,"sahitā","_","_","sahita","JJ","","_","_"
5,"_","_","_","dvija","NC","","_","_"
6,"_","_","_","puṃgava","NC","","_","_"
1,"tamasā","_","_","tamas","NC","","_","_"
2,"rahitaṃ","_","_","rahita","JJ","","_","_"
3,"puṇyam","_","_","puṇya","JJ","","_","_"
4,"anāmṛṣṭaṃ","_","_","anāmṛṣṭa","JJ","","_","_"
5,"raveḥ","_","_","ravi","NC","","_","_"
6,"karaiḥ","_","_","kara","NC","","_","_"
1,"_","_","_","kṣut","NC","","_","_"
2,"_","_","_","tṛṣ","NC","","_","_"
3,"_","_","_","śīta","JJ","","_","_"
4,"_","_","_","uṣṇa","JJ","","_","_"
5,"_","_","_","doṣa","NC","","_","_"
6,"ca","_","_","ca","CCD","","_","_"
7,"varjitaṃ","_","_","varjay","PPP","","_","_"
8,"_","_","_","śoka","NC","","_","_"
9,"_","_","_","nāśana","JJ","","_","_"
1,"_","_","_","mahat","JJ","","_","_"
2,"_","_","_","ṛṣi","NC","","_","_"
3,"_","_","_","gaṇa","NC","","_","_"
4,"_","_","_","sambādha","NC","","_","_"
5,"brāhmyā","_","_","brāhma","JJ","","_","_"
6,"lakṣmyā","_","_","lakṣmī","NC","","_","_"
7,"samanvitam","_","_","samanvita","JJ","","_","_"
1,"duṣpraveśaṃ","_","_","duṣpraveśa","JJ","","_","_"
2,"_","_","_","mahat","JJ","","_","_"
3,"_","_","_","rāja","NC","","_","_"
4,"narair","_","_","nara","NC","","_","_"
5,"_","_","_","dharma","NC","","_","_"
6,"_","_","_","bahiṣkṛ","PPP","","_","_"
1,"_","_","_","bali","NC","","_","_"
2,"_","_","_","homa","NC","","_","_"
3,"_","_","_","arcay","PPP","","_","_"
4,"divyaṃ","_","_","divya","JJ","","_","_"
5,"_","_","_","su","CAD","","_","_"
6,"_","_","_","sammṛj","PPP","","_","_"
7,"_","_","_","anulepana","NC","","_","_"
1,"_","_","_","divya","JJ","","_","_"
2,"_","_","_","puṣpa","NC","","_","_"
3,"_","_","_","upahāra","NC","","_","_"
4,"ca","_","_","ca","CCD","","_","_"
5,"sarvato","_","_","sarvatas","CX","","_","_"
6,"'bhivirājitam","_","_","abhivirāj","PPP","","_","_"
1,"viśālair","_","_","viśāla","JJ","","_","_"
2,"_","_","_","agni","NC","","_","_"
3,"_","_","_","śaraṇa","NC","","_","_"
4,"_","_","_","sruc","NC","","_","_"
5,"_","_","_","bhāṇḍa","NC","","_","_"
6,"ācitaṃ","_","_","āci","PPP","","_","_"
7,"śubhaiḥ","_","_","śubha","JJ","","_","_"
1,"mahadbhis","_","_","mahat","JJ","","_","_"
2,"_","_","_","toya","NC","","_","_"
3,"_","_","_","kalaśa","NC","","_","_"
4,"kaṭhinaiś","_","_","kaṭhina","JJ","","_","_"
5,"_","_","_","ca","CCD","","_","_"
6,"_","_","_","upaśobhay","PPP","","_","_"
1,"śaraṇyaṃ","_","_","śaraṇya","JJ","","_","_"
2,"_","_","_","sarva","JQ","","_","_"
3,"_","_","_","bhūta","NC","","_","_"
4,"_","_","_","brahmaghoṣa","NC","","_","_"
5,"_","_","_","nināday","PPP","","_","_"
1,"divyam","_","_","divya","JJ","","_","_"
2,"āśrayaṇīyaṃ","_","_","āśri","KDG","","_","_"
3,"tam","_","_","tad","PRD","","_","_"
4,"āśramaṃ","_","_","āśrama","NC","","_","_"
5,"_","_","_","śrama","NC","","_","_"
6,"_","_","_","nāśana","JJ","","_","_"
1,"śriyā","_","_","śrī","NC","","_","_"
2,"yutam","_","_","yuta","JJ","","_","_"
3,"anirdeśyaṃ","_","_","anirdeśya","JJ","","_","_"
4,"_","_","_","deva","NC","","_","_"
5,"_","_","_","caryā","NC","","_","_"
6,"_","_","_","upaśobhay","PPP","","_","_"
1,"_","_","_","phala","NC","","_","_"
2,"_","_","_","mūla","NC","","_","_"
3,"_","_","_","aśana","NC","","_","_"
4,"dāntaiś","_","_","da","PPP","","_","_"
5,"_","_","_","cīra","NC","","_","_"
6,"_","_","_","kṛṣṇa","JJ","","_","_"
7,"_","_","_","ajina","NC","","_","_"
8,"_","_","_","ambara","NC","","_","_"
1,"_","_","_","sūrya","NC","","_","_"
2,"_","_","_","vaiśvānara","NC","","_","_"
3,"_","_","_","sama","PPX","","_","_"
4,"tapasā","_","_","tapas","NC","","_","_"
5,"bhāvitātmabhiḥ","_","_","bhāvitātman","JJ","","_","_"
1,"_","_","_","mahat","JJ","","_","_"
2,"_","_","_","ṛṣi","NC","","_","_"
3,"_","_","_","mokṣa","NC","","_","_"
4,"_","_","_","para","PPX","","_","_"
5,"yatibhir","_","_","yati","NC","","_","_"
6,"_","_","_","niya","PPP","","_","_"
7,"_","_","_","indriya","NC","","_","_"
1,"_","_","_","brahman","NC","","_","_"
2,"_","_","_","bhū","PPP","","_","_"
3,"mahābhāgair","_","_","mahābhāga","JJ","","_","_"
4,"upetaṃ","_","_","upe","PPP","","_","_"
5,"_","_","_","brahman","NC","","_","_"
6,"_","_","_","vādin","JJ","","_","_"
1,"so","_","_","tad","PRD","","_","_"
2,"'bhyagacchan","_","_","abhiga","V","abhiga","_","_"
3,"_","_","_","mahat","JJ","","_","_"
4,"_","_","_","tejas","NC","","_","_"
5,"tān","_","_","tad","PRD","","_","_"
6,"ṛṣīn","_","_","ṛṣi","NC","","_","_"
7,"niyataḥ","_","_","niya","PPP","","_","_"
8,"śuciḥ","_","_","śuci","JJ","","_","_"
1,"bhrātṛbhiḥ","_","_","bhrātṛ","NC","","_","_"
2,"sahito","_","_","sahita","JJ","","_","_"
3,"dhīmān","_","_","dhīmat","JJ","","_","_"
4,"_","_","_","dharma","NC","","_","_"
5,"_","_","_","putra","NC","","_","_"
6,"yudhiṣṭhiraḥ","_","_","yudhiṣṭhira","NC","","_","_"
1,"_","_","_","divya","JJ","","_","_"
2,"_","_","_","jñāna","NC","","_","_"
3,"_","_","_","upapad","PPP","","_","_"
4,"te","_","_","tad","PRD","","_","_"
5,"dṛṣṭvā","_","_","dṛś","CGDA","","_","_"
6,"prāptaṃ","_","_","prāp","PPP","","_","_"
7,"yudhiṣṭhiram","_","_","yudhiṣṭhira","NC","","_","_"
1,"abhyagacchanta","_","_","abhiga","V","abhiga","_","_"
2,"_","_","_","su","CAD","","_","_"
3,"_","_","_","prī","PPP","","_","_"
4,"sarva","_","_","sarva","JQ","","_","_"
5,"eva","_","_","eva","CEM","","_","_"
6,"_","_","_","mahat","JJ","","_","_"
7,"_","_","_","ṛṣi","NC","","_","_"
1,"āśīrvādān","_","_","āśīrvāda","NC","","_","_"
2,"prayuñjānāḥ","_","_","prayuj","KDP","","_","_"
3,"_","_","_","svādhyāya","NC","","_","_"
4,"_","_","_","nira","PPP","","_","_"
5,"bhṛśam","_","_","bhṛśa","CX","","_","_"
1,"prītās","_","_","prī","PPP","","_","_"
2,"te","_","_","tad","PRD","","_","_"
3,"tasya","_","_","tad","PRD","","_","_"
4,"satkāraṃ","_","_","satkāra","NC","","_","_"
5,"vidhinā","_","_","vidhi","NC","","_","_"
6,"_","_","_","pāvaka","NC","","_","_"
7,"_","_","_","upama","JJ","","_","_"
1,"upājahruś","_","_","upāhṛ","V","upāhṛ","_","_"
2,"ca","_","_","ca","CCD","","_","_"
3,"salilaṃ","_","_","salila","NC","","_","_"
4,"_","_","_","puṣpa","NC","","_","_"
5,"_","_","_","mūla","NC","","_","_"
6,"_","_","_","phala","NC","","_","_"
7,"śuci","_","_","śuci","JJ","","_","_"
1,"sa","_","_","tad","PRD","","_","_"
2,"taiḥ","_","_","tad","PRD","","_","_"
3,"_","_","_","prīti","NC","","_","_"
4,"_","_","_","atha","CAD","","_","_"
5,"satkāram","_","_","satkāra","NC","","_","_"
6,"upanītaṃ","_","_","upanī","PPP","","_","_"
7,"_","_","_","mahat","JJ","","_","_"
8,"_","_","_","ṛṣi","NC","","_","_"
1,"prayataḥ","_","_","praya","PPP","","_","_"
2,"_","_","_","pratigrah","CGDA","","_","_"
3,"_","_","_","atha","CAD","","_","_"
4,"_","_","_","dharma","NC","","_","_"
5,"_","_","_","putra","NC","","_","_"
6,"yudhiṣṭhiraḥ","_","_","yudhiṣṭhira","NC","","_","_"
1,"taṃ","_","_","tad","PRD","","_","_"
2,"_","_","_","śakra","NC","","_","_"
3,"_","_","_","sadana","NC","","_","_"
4,"_","_","_","prakhyā","NC","","_","_"
5,"_","_","_","divya","JJ","","_","_"
6,"_","_","_","gandha","NC","","_","_"
7,"manoramam","_","_","manorama","JJ","","_","_"
1,"prītaḥ","_","_","prī","PPP","","_","_"
2,"_","_","_","svarga","NC","","_","_"
3,"_","_","_","upama","JJ","","_","_"
4,"puṇyaṃ","_","_","puṇya","JJ","","_","_"
5,"pāṇḍavaḥ","_","_","pāṇḍava","NC","","_","_"
6,"saha","_","_","saha","CX","","_","_"
7,"kṛṣṇayā","_","_","kṛṣṇā","NC","","_","_"
1,"viveśa","_","_","viś","V","viś","_","_"
2,"śobhayā","_","_","śobha","JJ","","_","_"
3,"yuktaṃ","_","_","yuj","PPP","","_","_"
4,"bhrātṛbhiś","_","_","bhrātṛ","NC","","_","_"
5,"ca","_","_","ca","CCD","","_","_"
6,"_","_","_","saha","CX","","_","_"
7,"_","_","_","anagha","JJ","","_","_"
1,"brāhmaṇair","_","_","brāhmaṇa","NC","","_","_"
2,"_","_","_","veda","NC","","_","_"
3,"_","_","_","vedāṅga","NC","","_","_"
4,"_","_","_","pāraga","JJ","","_","_"
5,"ca","_","_","ca","CCD","","_","_"
6,"_","_","_","saha","CX","","_","_"
7,"_","_","_","acyuta","JJ","","_","_"
1,"_","_","_","tatra","CAD","","_","_"
2,"_","_","_","paś","V","paś","_","_"
3,"sa","_","_","tad","PRD","","_","_"
4,"_","_","_","dharma","NC","","_","_"
5,"_","_","_","ātman","NC","","_","_"
6,"_","_","_","deva","NC","","_","_"
7,"_","_","_","devarṣi","NC","","_","_"
8,"_","_","_","pūjay","PPP","","_","_"
1,"_","_","_","nara","NC","","_","_"
2,"_","_","_","nārāyaṇa","NC","","_","_"
3,"_","_","_","sthāna","NC","","_","_"
4,"_","_","_","bhāgīrathī","NC","","_","_"
5,"_","_","_","upaśobhay","PPP","","_","_"
1,"_","_","_","madhu","NC","","_","_"
2,"_","_","_","srava","NC","","_","_"
3,"_","_","_","phala","NC","","_","_"
4,"divyāṃ","_","_","divya","JJ","","_","_"
5,"_","_","_","mahat","JJ","","_","_"
6,"_","_","_","ṛṣi","NC","","_","_"
7,"_","_","_","gaṇa","NC","","_","_"
8,"_","_","_","sev","PPP","","_","_"
1,"tām","_","_","tad","PRD","","_","_"
2,"upetya","_","_","upe","CGDA","","_","_"
3,"mahātmānas","_","_","mahātman","JJ","","_","_"
4,"te","_","_","tad","PRD","","_","_"
5,"'vasan","_","_","vas","V","vas","_","_"
6,"brāhmaṇaiḥ","_","_","brāhmaṇa","NC","","_","_"
7,"saha","_","_","saha","CX","","_","_"
1,"ālokayanto","_","_","ālokay","KDP","","_","_"
2,"mainākaṃ","_","_","maināka","NC","","_","_"
3,"_","_","_","nānā","CX","","_","_"
4,"_","_","_","dvija","NC","","_","_"
5,"_","_","_","gaṇa","NC","","_","_"
6,"_","_","_","āyuta","JJ","","_","_"
1,"_","_","_","hiraṇya","NC","","_","_"
2,"_","_","_","śikhara","NC","","_","_"
3,"_","_","_","ca","CCD","","_","_"
4,"_","_","_","eva","CEM","","_","_"
5,"_","_","_","tad","PRD","","_","_"
6,"_","_","_","ca","CCD","","_","_"
7,"bindusaraḥ","_","_","bindusaras","NC","","_","_"
8,"śivam","_","_","śiva","JJ","","_","_"
1,"bhāgīrathīṃ","_","_","bhāgīrathī","NC","","_","_"
2,"sutīrthāṃ","_","_","sutīrtha","JJ","","_","_"
3,"ca","_","_","ca","CCD","","_","_"
4,"_","_","_","śīta","JJ","","_","_"
5,"_","_","_","amala","JJ","","_","_"
6,"_","_","_","jala","NC","","_","_"
7,"śivām","_","_","śiva","JJ","","_","_"
1,"_","_","_","maṇi","NC","","_","_"
2,"_","_","_","pravāla","NC","","_","_"
3,"_","_","_","prastāra","NC","","_","_"
4,"pādapair","_","_","pādapa","NC","","_","_"
5,"upaśobhitām","_","_","upaśobhay","PPP","","_","_"
1,"_","_","_","divya","JJ","","_","_"
2,"_","_","_","puṣpa","NC","","_","_"
3,"_","_","_","samākṛ","PPP","","_","_"
4,"manasaḥ","_","_","manas","NC","","_","_"
5,"_","_","_","prīti","NC","","_","_"
6,"_","_","_","vardhana","JJ","","_","_"
1,"vīkṣamāṇā","_","_","vīkṣ","KDP","","_","_"
2,"mahātmāno","_","_","mahātman","JJ","","_","_"
3,"vijahrus","_","_","vihar","V","vihṛ","_","_"
4,"tatra","_","_","tatra","CAD","","_","_"
5,"pāṇḍavāḥ","_","_","pāṇḍava","NC","","_","_"
1,"tatra","_","_","tatra","CAD","","_","_"
2,"devān","_","_","deva","NC","","_","_"
3,"pitṝṃś","_","_","pitṛ","NC","","_","_"
4,"_","_","_","ca","CCD","","_","_"
5,"_","_","_","eva","CEM","","_","_"
6,"tarpayantaḥ","_","_","tarpay","KDP","","_","_"
7,"punaḥ","_","_","punar","CAD","","_","_"
8,"punaḥ","_","_","punar","CAD","","_","_"
1,"brāhmaṇaiḥ","_","_","brāhmaṇa","NC","","_","_"
2,"sahitā","_","_","sahita","JJ","","_","_"
3,"vīrā","_","_","vīra","NC","","_","_"
4,"nyavasan","_","_","nivas","V","nivas","_","_"
5,"_","_","_","puruṣa","NC","","_","_"
6,"_","_","_","ṛṣabha","NC","","_","_"
1,"kṛṣṇāyās","_","_","kṛṣṇā","NC","","_","_"
2,"tatra","_","_","tatra","CAD","","_","_"
3,"paśyantaḥ","_","_","dṛś","KDP","","_","_"
4,"_","_","_","krīḍita","NC","","_","_"
5,"_","_","_","amara","NC","","_","_"
6,"_","_","_","prabhā","NC","","_","_"
1,"vicitrāṇi","_","_","vicitra","JJ","","_","_"
2,"_","_","_","nara","NC","","_","_"
3,"_","_","_","vyāghra","NC","","_","_"
4,"remire","_","_","ra","V","ra","_","_"
5,"tatra","_","_","tatra","CAD","","_","_"
6,"pāṇḍavāḥ","_","_","pāṇḍava","NC","","_","_"
