"WordID","word","NormSTEM","suffix","lemma","PoS","Root","NormSuffix","NormWord"
1,"_","_","_","astṛ","NC","","_","_"
2,"_","_","_","iva","CCM","","_","_"
3,"su","_","_","su","CAD","","_","_"
4,"prataraṃ","_","_","pratara","CX","","_","_"
5,"lāyam","_","_","lāya","NC","","_","_"
6,"asyan","_","_","as","KDP","","_","_"
7,"bhūṣann","_","_","bhūṣ","KDP","","_","_"
8,"iva","_","_","iva","CCM","","_","_"
9,"pra","_","_","pra","CADP","","_","_"
10,"bharā","_","_","bhṛ","V","bhṛ","_","_"
11,"stomam","_","_","stoma","NC","","_","_"
12,"asmai","_","_","ida","PRD","","_","_"
1,"vācā","_","_","vāc","NC","","_","_"
2,"viprās","_","_","vipra","NC","","_","_"
3,"tarata","_","_","tar","V","tṛ","_","_"
4,"vācam","_","_","vāc","NC","","_","_"
5,"aryo","_","_","ari","JJ","","_","_"
6,"ni","_","_","ni","CADP","","_","_"
7,"rāmaya","_","_","rāmay","V","rāmay","_","_"
8,"jaritaḥ","_","_","jaritṛ","NC","","_","_"
9,"soma","_","_","soma","NC","","_","_"
10,"indram","_","_","indra","NC","","_","_"
1,"dohena","_","_","doha","NC","","_","_"
2,"gām","_","_","go","NC","","_","_"
3,"upa","_","_","upa","CADP","","_","_"
4,"śikṣā","_","_","śikṣ","V","śikṣ","_","_"
5,"sakhāyam","_","_","sakhi","NC","","_","_"
6,"pra","_","_","pra","CADP","","_","_"
7,"bodhaya","_","_","bodhay","V","bodhay","_","_"
8,"jaritar","_","_","jaritṛ","NC","","_","_"
9,"jāram","_","_","jāra","NC","","_","_"
10,"indram","_","_","indra","NC","","_","_"
1,"kośaṃ","_","_","kośa","NC","","_","_"
2,"na","_","_","na","CNG","","_","_"
3,"pūrṇaṃ","_","_","pṛ","PPP","","_","_"
4,"vasunā","_","_","vasu","NC","","_","_"
5,"nyṛṣṭam","_","_","nyṛṣ","PPP","","_","_"
6,"ā","_","_","ā","CADP","","_","_"
7,"cyāvaya","_","_","cyāvay","V","cyāvay","_","_"
8,"_","_","_","magha","NC","","_","_"
9,"_","_","_","deya","NC","","_","_"
10,"śūram","_","_","śūra","NC","","_","_"
1,"kim","_","_","kim","CX","","_","_"
2,"aṅga","_","_","aṅga","CEM","","_","_"
3,"tvā","_","_","tvat","PPR","","_","_"
4,"maghavan","_","_","maghavan","NC","","_","_"
5,"bhojam","_","_","bhoja","JJ","","_","_"
6,"āhuḥ","_","_","ah","V","ah","_","_"
7,"śiśīhi","_","_","śā","V","śā","_","_"
8,"mā","_","_","mat","PPR","","_","_"
9,"śiśayaṃ","_","_","śiśaya","JJ","","_","_"
10,"tvā","_","_","tvat","PPR","","_","_"
11,"śṛṇomi","_","_","śṛṇ","V","śru","_","_"
1,"apnasvatī","_","_","apnasvat","JJ","","_","_"
2,"mama","_","_","mat","PPR","","_","_"
3,"dhīr","_","_","dhī","NC","","_","_"
4,"astu","_","_","as","V","as","_","_"
5,"śakra","_","_","śakra","NC","","_","_"
6,"_","_","_","vasu","NC","","_","_"
7,"_","_","_","vid","JJ","","_","_"
8,"bhagam","_","_","bhaga","NC","","_","_"
9,"_","_","_","indra","NC","","_","_"
10,"_","_","_","ā","CADP","","_","_"
11,"bharā","_","_","bhṛ","V","bhṛ","_","_"
12,"naḥ","_","_","mat","PPR","","_","_"
1,"tvāṃ","_","_","tvat","PPR","","_","_"
2,"janā","_","_","jana","NC","","_","_"
3,"mamasatyeṣv","_","_","mamasatya","NC","","_","_"
4,"indra","_","_","indra","NC","","_","_"
5,"saṃtasthānā","_","_","saṃsthā","KDP","","_","_"
6,"vi","_","_","vi","CADP","","_","_"
7,"hvayante","_","_","hvā","V","hvā","_","_"
8,"samīke","_","_","samīka","NC","","_","_"
1,"atrā","_","_","atra","CAD","","_","_"
2,"yujaṃ","_","_","yuj","NC","","_","_"
3,"kṛṇute","_","_","kar","V","kṛ","_","_"
4,"yo","_","_","yad","PRL","","_","_"
5,"haviṣmān","_","_","haviṣmat","JJ","","_","_"
6,"_","_","_","na","CNG","","_","_"
7,"_","_","_","a","CNG","","_","_"
8,"_","_","_","su","KDP","","_","_"
9,"sakhyaṃ","_","_","sakhya","NC","","_","_"
10,"vaṣṭi","_","_","vaś","V","vaś","_","_"
11,"śūraḥ","_","_","śūra","NC","","_","_"
1,"dhanaṃ","_","_","dhana","NC","","_","_"
2,"na","_","_","na","CNG","","_","_"
3,"syandram","_","_","syandra","JJ","","_","_"
4,"bahulaṃ","_","_","bahula","JJ","","_","_"
5,"yo","_","_","yad","PRL","","_","_"
6,"asmai","_","_","ida","PRD","","_","_"
7,"tīvrān","_","_","tīvra","JJ","","_","_"
8,"somāṁ","_","_","soma","NC","","_","_"
9,"ā","_","_","ā","CADP","","_","_"
10,"sunoti","_","_","sun","V","su","_","_"
11,"prayasvān","_","_","prayasvat","JJ","","_","_"
1,"tasmai","_","_","tad","PRD","","_","_"
2,"śatrūn","_","_","śatru","NC","","_","_"
3,"sutukān","_","_","sutuka","JJ","","_","_"
4,"prātar","_","_","prātar","CX","","_","_"
5,"ahno","_","_","ahar","NC","","_","_"
6,"ni","_","_","ni","CADP","","_","_"
7,"svaṣṭrān","_","_","svaṣṭra","JJ","","_","_"
8,"yuvati","_","_","yu","V","yu","_","_"
9,"hanti","_","_","han","V","han","_","_"
10,"vṛtram","_","_","vṛtra","NC","","_","_"
1,"yasmin","_","_","yad","PRL","","_","_"
2,"vayaṃ","_","_","mat","PPR","","_","_"
3,"dadhimā","_","_","śaṃsa","NC","","_","_"
4,"śaṃsam","_","_","indra","NC","","_","_"
5,"indre","_","_","yad","PRL","","_","_"
6,"yaḥ","_","_","śray","V","śri","_","_"
7,"śiśrāya","_","_","maghavan","NC","","_","_"
8,"maghavā","_","_","kāma","NC","","_","_"
9,"kāmam","_","_","mat","PPR","","_","_"
1,"ārāc","_","_","ārāt","CX","","_","_"
2,"cit","_","_","cit","CEM","","_","_"
3,"san","_","_","as","KDP","","_","_"
4,"bhayatām","_","_","bhī","V","bhī","_","_"
5,"asya","_","_","ida","PRD","","_","_"
6,"śatrur","_","_","śatru","NC","","_","_"
7,"ny","_","_","ni","CADP","","_","_"
8,"asmai","_","_","ida","PRD","","_","_"
9,"dyumnā","_","_","dyumna","NC","","_","_"
10,"janyā","_","_","janya","JJ","","_","_"
11,"namantām","_","_","na","V","na","_","_"
1,"ārāc","_","_","ārāt","CX","","_","_"
2,"chatrum","_","_","śatru","NC","","_","_"
3,"apa","_","_","apa","CX","","_","_"
4,"bādhasva","_","_","bādh","V","bādh","_","_"
5,"dūram","_","_","dūra","CX","","_","_"
6,"ugro","_","_","ugra","JJ","","_","_"
7,"yaḥ","_","_","yad","PRL","","_","_"
8,"śambaḥ","_","_","śamba","NC","","_","_"
9,"puruhūta","_","_","puruhūta","NC","","_","_"
10,"tena","_","_","tad","PRD","","_","_"
1,"asme","_","_","mat","PPR","","_","_"
2,"dhehi","_","_","dadh","V","dhā","_","_"
3,"yavamad","_","_","yavamat","JJ","","_","_"
4,"gomad","_","_","gomat","JJ","","_","_"
5,"indra","_","_","indra","NC","","_","_"
6,"kṛdhī","_","_","kar","V","kṛ","_","_"
7,"dhiyaṃ","_","_","dhī","NC","","_","_"
8,"jaritre","_","_","jaritṛ","NC","","_","_"
9,"_","_","_","vāja","NC","","_","_"
10,"_","_","_","ratna","NC","","_","_"
1,"pra","_","_","pra","CADP","","_","_"
2,"yam","_","_","yad","PRL","","_","_"
3,"antar","_","_","antar","CAD","","_","_"
4,"_","_","_","vṛṣan","JJ","","_","_"
5,"_","_","_","sava","NC","","_","_"
6,"agman","_","_","ga","V","ga","_","_"
7,"tīvrāḥ","_","_","tīvra","JJ","","_","_"
8,"somā","_","_","soma","NC","","_","_"
9,"_","_","_","bahula","JJ","","_","_"
10,"_","_","_","anta","NC","","_","_"
11,"indram","_","_","indra","NC","","_","_"
1,"_","_","_","na","CNG","","_","_"
2,"_","_","_","aha","CX","","_","_"
3,"dāmānam","_","_","dāman","NC","","_","_"
4,"maghavā","_","_","maghavan","NC","","_","_"
5,"ni","_","_","ni","CADP","","_","_"
6,"yaṃsan","_","_","ya","V","ya","_","_"
7,"ni","_","_","ni","CADP","","_","_"
8,"sunvate","_","_","su","KDP","","_","_"
9,"vahati","_","_","vah","V","vah","_","_"
10,"bhūri","_","_","bhūri","JQ","","_","_"
11,"vāmam","_","_","vāma","JJ","","_","_"
1,"uta","_","_","uta","CCD","","_","_"
2,"prahām","_","_","prahā","NC","","_","_"
3,"ati","_","_","ati","CADP","","_","_"
4,"dīvyā","_","_","dīv","CGDA","","_","_"
5,"jayāti","_","_","jay","V","ji","_","_"
6,"kṛtaṃ","_","_","kṛta","NC","","_","_"
7,"yac","_","_","yat","CSB","","_","_"
8,"chvaghnī","_","_","śvaghnin","NC","","_","_"
9,"vicinoti","_","_","vicin","V","vici","_","_"
10,"kāle","_","_","kāla","NC","","_","_"
1,"yo","_","_","yad","PRL","","_","_"
2,"_","_","_","deva","NC","","_","_"
3,"_","_","_","kāma","NC","","_","_"
4,"na","_","_","na","CNG","","_","_"
5,"dhanā","_","_","dhana","NC","","_","_"
6,"ruṇaddhi","_","_","rudh","V","rudh","_","_"
7,"sam","_","_","sa","CADP","","_","_"
8,"it","_","_","id","CEM","","_","_"
9,"taṃ","_","_","tad","PRD","","_","_"
10,"rāyā","_","_","rai","NC","","_","_"
11,"sṛjati","_","_","sṛj","V","sṛj","_","_"
12,"svadhāvān","_","_","svadhāvat","JJ","","_","_"
1,"gobhiṣ","_","_","go","NC","","_","_"
2,"_","_","_","tar","V","tṛ","_","_"
3,"_","_","_","amati","NC","","_","_"
4,"durevāṃ","_","_","dureva","JJ","","_","_"
5,"yavena","_","_","yava","NC","","_","_"
6,"kṣudham","_","_","kṣudh","NC","","_","_"
7,"puruhūta","_","_","puruhūta","NC","","_","_"
8,"viśvām","_","_","viśva","JQ","","_","_"
1,"vayaṃ","_","_","mat","PPR","","_","_"
2,"rājabhiḥ","_","_","rājan","NC","","_","_"
3,"prathamā","_","_","prathama","JJ","","_","_"
4,"dhanāny","_","_","dhana","NC","","_","_"
5,"asmākena","_","_","asmāka","JJ","","_","_"
6,"vṛjanenā","_","_","vṛjana","NC","","_","_"
7,"jayema","_","_","jay","V","ji","_","_"
1,"bṛhaspatir","_","_","bṛhaspati","NC","","_","_"
2,"naḥ","_","_","mat","PPR","","_","_"
3,"pari","_","_","pari","CADP","","_","_"
4,"pātu","_","_","pib","V","pā","_","_"
5,"paścād","_","_","paścāt","CAD","","_","_"
6,"_","_","_","uta","CCD","","_","_"
7,"_","_","_","uttara","JJ","","_","_"
8,"adharād","_","_","adharāt","CX","","_","_"
9,"aghāyoḥ","_","_","aghāyu","JJ","","_","_"
1,"indraḥ","_","_","indra","NC","","_","_"
2,"purastād","_","_","purastāt","CX","","_","_"
3,"uta","_","_","uta","CCD","","_","_"
4,"madhyato","_","_","madhyatas","CX","","_","_"
5,"naḥ","_","_","mat","PPR","","_","_"
6,"sakhā","_","_","sakhi","NC","","_","_"
7,"sakhibhyo","_","_","sakhi","NC","","_","_"
8,"varivaḥ","_","_","varivas","NC","","_","_"
9,"kṛṇotu","_","_","kar","V","kṛ","_","_"
