"WordID","word","NormSTEM","suffix","lemma","PoS","Root","NormSuffix","NormWord"
1,"nārāyaṇaṃ","_","_","nārāyaṇa","NC","","_","_"
2,"namaskṛtya","_","_","namaskṛ","CGDA","","_","_"
3,"naraṃ","_","_","nara","NC","","_","_"
4,"_","_","_","ca","CCD","","_","_"
5,"_","_","_","eva","CEM","","_","_"
6,"narottamam","_","_","narottama","NC","","_","_"
1,"devīṃ","_","_","devī","NC","","_","_"
2,"sarasvatīṃ","_","_","sarasvatī","NC","","_","_"
3,"_","_","_","ca","CCD","","_","_"
4,"_","_","_","eva","CEM","","_","_"
5,"tato","_","_","tatas","CX","","_","_"
6,"jayam","_","_","jaya","NC","","_","_"
7,"udīrayet","_","_","udīr","V","udīr","_","_"
1,"oṃ","_","_","oṃ","CX","","_","_"
2,"namo","_","_","namas","NC","","_","_"
3,"bhagavate","_","_","bhagavat","JJ","","_","_"
4,"tasmai","_","_","tad","PRD","","_","_"
5,"_","_","_","vyāsa","NC","","_","_"
6,"_","_","_","amita","JJ","","_","_"
7,"_","_","_","tejas","NC","","_","_"
1,"yasya","_","_","yad","PRL","","_","_"
2,"prasādād","_","_","prasāda","NC","","_","_"
3,"vakṣyāmi","_","_","vak","V","vac","_","_"
4,"_","_","_","nārāyaṇa","NC","","_","_"
5,"_","_","_","kathā","NC","","_","_"
6,"śubhām","_","_","śubha","JJ","","_","_"
1,"tato","_","_","tatas","CX","","_","_"
2,"_","_","_","ajñāna","NC","","_","_"
3,"_","_","_","tamas","NC","","_","_"
4,"_","_","_","andha","JJ","","_","_"
5,"_","_","_","kiṃ","PRQ","","_","_"
6,"_","_","_","avasthā","NC","","_","_"
7,"jagato","_","_","jagat","NC","","_","_"
8,"bhavet","_","_","bhav","V","bhū","_","_"
1,"janamejaya","_","_","janamejaya","NC","","_","_"
2,"uvāca","_","_","vak","V","vac","_","_"
1,"mayasya","_","_","maya","NC","","_","_"
2,"tu","_","_","tu","CCD","","_","_"
3,"kathāṃ","_","_","kathā","NC","","_","_"
4,"divyāṃ","_","_","divya","JJ","","_","_"
5,"śrotum","_","_","śru","CGDI","","_","_"
6,"icchāmi","_","_","iṣ","V","iṣ","_","_"
7,"sattama","_","_","sattama","JJ","","_","_"
1,"sabhāṃ","_","_","sabhā","NC","","_","_"
2,"_","_","_","ca","CCD","","_","_"
3,"_","_","_","eva","CEM","","_","_"
4,"kṛtāṃ","_","_","kṛ","PPP","","_","_"
5,"tena","_","_","tad","PRD","","_","_"
6,"dharmarājasya","_","_","dharmarāja","NC","","_","_"
7,"dhīmataḥ","_","_","dhīmat","JJ","","_","_"
1,"janamejaya","_","_","janamejaya","NC","","_","_"
2,"uvāca","_","_","vak","V","vac","_","_"
1,"rakṣitaḥ","_","_","rakṣ","PPP","","_","_"
2,"pāṇḍavā","_","_","maya","NC","","_","_"
3,"[...","_","_","nāma","CX","","_","_"
4,"_","_","_","mahat","JJ","","_","_"
5,"_","_","_","asura","NC","","_","_"
1,"_","_","_","kṛṣṇa","NC","","_","_"
2,"_","_","_","ca","CCD","","_","_"
3,"_","_","_","pāvaka","NC","","_","_"
4,"_","_","_","ca","CCD","","_","_"
5,"_","_","_","eva","CEM","","_","_"
6,"_","_","_","pārtha","NC","","_","_"
7,"_","_","_","amita","JJ","","_","_"
8,"_","_","_","tejas","NC","","_","_"
1,"sa","_","_","tad","PRD","","_","_"
2,"cakāra","_","_","kar","V","kṛ","_","_"
3,"yad","_","_","yad","PRL","","_","_"
4,"ūrdhvaṃ","_","_","ūrdhva","CX","","_","_"
5,"vai","_","_","vai","CX","","_","_"
6,"karma","_","_","karman","NC","","_","_"
7,"_","_","_","pratyaya","NC","","_","_"
8,"_","_","_","kāraka","JJ","","_","_"
1,"tad","_","_","tad","PRD","","_","_"
2,"brūhi","_","_","abravīta","V","brū","_","_"
3,"bhagavan","_","_","bhagavat","JJ","","_","_"
4,"sarvaṃ","_","_","sarva","JQ","","_","_"
5,"prāṇadāya","_","_","prāṇada","NC","","_","_"
6,"kirīṭine","_","_","kirīṭin","NC","","_","_"
1,"janamejayaḥ","_","_","janamejaya","NC","","_","_"
1,"arjuno","_","_","arjuna","NC","","_","_"
2,"jayatāṃ","_","_","ji","KDP","","_","_"
3,"śreṣṭho","_","_","śreṣṭha","JJ","","_","_"
4,"mokṣayitvā","_","_","mokṣay","CGDA","","_","_"
5,"mayaṃ","_","_","maya","NC","","_","_"
6,"tadā","_","_","tadā","CAD","","_","_"
1,"kiṃ","_","_","kiṃ","PRQ","","_","_"
2,"cakāra","_","_","kar","V","kṛ","_","_"
3,"_","_","_","mahat","JJ","","_","_"
4,"_","_","_","tejas","NC","","_","_"
5,"_","_","_","tad","PRD","","_","_"
6,"_","_","_","mat","PPR","","_","_"
7,"brūhi","_","_","abravīta","V","brū","_","_"
8,"dvijottama","_","_","dvijottama","NC","","_","_"
