"WordID","word","NormSTEM","suffix","lemma","PoS","Root","NormSuffix","NormWord"
1,"dhṛtarāṣṭra","_","_","dhṛtarāṣṭra","NC","","_","_"
2,"uvāca","_","_","vak","V","vac","_","_"
1,"tathā","_","_","tathā","CX","","_","_"
2,"gateṣu","_","_","ga","PPP","","_","_"
3,"śūreṣu","_","_","śūra","NC","","_","_"
4,"teṣāṃ","_","_","tad","PRD","","_","_"
5,"mama","_","_","mat","PPR","","_","_"
6,"ca","_","_","ca","CCD","","_","_"
7,"saṃjaya","_","_","saṃjaya","NC","","_","_"
1,"kiṃ","_","_","kiṃ","PRQ","","_","_"
2,"vai","_","_","vai","CX","","_","_"
3,"_","_","_","bhīma","NC","","_","_"
4,"_","_","_","tadā","CAD","","_","_"
5,"_","_","_","kar","V","kṛ","_","_"
6,"_","_","_","tad","PRD","","_","_"
7,"_","_","_","mat","PPR","","_","_"
8,"_","_","_","ācakṣ","V","ācakṣ","_","_"
9,"saṃjaya","_","_","saṃjaya","NC","","_","_"
1,"saṃjaya","_","_","saṃjaya","NC","","_","_"
2,"uvāca","_","_","vak","V","vac","_","_"
1,"viratho","_","_","viratha","JJ","","_","_"
2,"bhīmaseno","_","_","bhīmasa","NC","","_","_"
3,"vai","_","_","vai","CX","","_","_"
4,"_","_","_","karṇa","NC","","_","_"
5,"_","_","_","vāc","NC","","_","_"
6,"_","_","_","śalya","NC","","_","_"
7,"_","_","_","pīḍay","PPP","","_","_"
1,"_","_","_","amarṣa","NC","","_","_"
2,"_","_","_","vaśa","NC","","_","_"
3,"āpannaḥ","_","_","āpad","PPP","","_","_"
4,"phalgunaṃ","_","_","phalguna","NC","","_","_"
5,"vākyam","_","_","vākya","NC","","_","_"
6,"abravīt","_","_","abravīta","V","brū","_","_"
1,"punaḥ","_","_","punar","CAD","","_","_"
2,"_","_","_","punar","CAD","","_","_"
3,"_","_","_","tūbaraka","NC","","_","_"
4,"mūḍha","_","_","muh","PPP","","_","_"
5,"_","_","_","audarika","JJ","","_","_"
6,"_","_","_","iti","CQT","","_","_"
7,"ca","_","_","ca","CCD","","_","_"
1,"akṛtāstraka","_","_","akṛtāstraka","JJ","","_","_"
2,"mā","_","_","mā","CNG","","_","_"
3,"yodhīr","_","_","yudh","V","yudh","_","_"
4,"bāla","_","_","bāla","NC","","_","_"
5,"_","_","_","saṃgrāma","NC","","_","_"
6,"_","_","_","kātara","JJ","","_","_"
1,"iti","_","_","iti","CQT","","_","_"
2,"mām","_","_","mat","PPR","","_","_"
3,"abravīt","_","_","abravīta","V","brū","_","_"
4,"karṇaḥ","_","_","karṇa","NC","","_","_"
5,"_","_","_","dṛś","KDP","","_","_"
6,"_","_","_","tvat","PPR","","_","_"
7,"dhanaṃjaya","_","_","dhanaṃjaya","NC","","_","_"
1,"evaṃ","_","_","eva","CX","","_","_"
2,"vaktā","_","_","vaktṛ","JJ","","_","_"
3,"ca","_","_","ca","CCD","","_","_"
4,"me","_","_","mat","PPR","","_","_"
5,"_","_","_","vadh","KDG","","_","_"
6,"_","_","_","tad","PRD","","_","_"
7,"_","_","_","ca","CCD","","_","_"
8,"_","_","_","vac","PPP","","_","_"
9,"'smi","_","_","as","V","as","_","_"
10,"bhārata","_","_","bhārata","NC","","_","_"
1,"etad","_","_","tad","PRD","","_","_"
2,"vrataṃ","_","_","vrata","NC","","_","_"
3,"_","_","_","mahat","JJ","","_","_"
4,"_","_","_","bāhu","NC","","_","_"
5,"tvayā","_","_","tvat","PPR","","_","_"
6,"saha","_","_","saha","CX","","_","_"
7,"kṛtaṃ","_","_","kṛ","PPP","","_","_"
8,"mayā","_","_","mat","PPR","","_","_"
1,"_","_","_","yathā","CCM","","_","_"
2,"_","_","_","tad","PRD","","_","_"
3,"_","_","_","mat","PPR","","_","_"
4,"kaunteya","_","_","kaunteya","NC","","_","_"
5,"tathā","_","_","tathā","CX","","_","_"
6,"tava","_","_","tvat","PPR","","_","_"
7,"na","_","_","na","CNG","","_","_"
8,"saṃśayaḥ","_","_","saṃśaya","NC","","_","_"
1,"_","_","_","tad","PRD","","_","_"
2,"_","_","_","vadha","NC","","_","_"
3,"_","_","_","nara","NC","","_","_"
4,"_","_","_","śreṣṭha","JJ","","_","_"
5,"_","_","_","smar","V","smṛ","_","_"
6,"_","_","_","tad","PRD","","_","_"
7,"vacanaṃ","_","_","vacana","NC","","_","_"
8,"mama","_","_","mat","PPR","","_","_"
1,"yathā","_","_","yathā","CCM","","_","_"
2,"bhavati","_","_","bhav","V","bhū","_","_"
3,"tat","_","_","tad","PRD","","_","_"
4,"satyaṃ","_","_","satya","NC","","_","_"
5,"tathā","_","_","tathā","CX","","_","_"
6,"kuru","_","_","kar","V","kṛ","_","_"
7,"dhanaṃjaya","_","_","dhanaṃjaya","NC","","_","_"
1,"_","_","_","tad","PRD","","_","_"
2,"_","_","_","śru","CGDA","","_","_"
3,"vacanaṃ","_","_","vacana","NC","","_","_"
4,"tasya","_","_","tad","PRD","","_","_"
5,"_","_","_","bhīma","NC","","_","_"
6,"_","_","_","amita","JJ","","_","_"
7,"_","_","_","vikrama","NC","","_","_"
1,"tato","_","_","tatas","CX","","_","_"
2,"'rjuno","_","_","arjuna","NC","","_","_"
3,"'bravīt","_","_","abravīta","V","brū","_","_"
4,"karṇaṃ","_","_","karṇa","NC","","_","_"
5,"kiṃcid","_","_","kiṃcit","PRI","","_","_"
6,"abhyetya","_","_","abhye","CGDA","","_","_"
7,"saṃyuge","_","_","saṃyuga","NC","","_","_"
1,"karṇa","_","_","karṇa","NC","","_","_"
2,"karṇa","_","_","karṇa","NC","","_","_"
3,"_","_","_","vṛthā","CX","","_","_"
4,"_","_","_","dṛṣṭi","NC","","_","_"
5,"_","_","_","sūtaputra","NC","","_","_"
6,"_","_","_","ātman","NC","","_","_"
7,"_","_","_","saṃstu","PPP","","_","_"
1,"_","_","_","adharma","NC","","_","_"
2,"_","_","_","buddhi","NC","","_","_"
3,"śṛṇu","_","_","śṛṇ","V","śru","_","_"
4,"me","_","_","mat","PPR","","_","_"
5,"yat","_","_","yad","PRL","","_","_"
6,"tvā","_","_","tvat","PPR","","_","_"
7,"vakṣyāmi","_","_","vak","V","vac","_","_"
8,"sāṃpratam","_","_","sāṃprata","CX","","_","_"
1,"dvividhaṃ","_","_","dvividha","JJ","","_","_"
2,"karma","_","_","karman","NC","","_","_"
3,"śūrāṇāṃ","_","_","śūra","NC","","_","_"
4,"yuddhe","_","_","yuddha","NC","","_","_"
5,"_","_","_","jaya","NC","","_","_"
6,"_","_","_","parājaya","NC","","_","_"
1,"tau","_","_","tad","PRD","","_","_"
2,"_","_","_","ca","CCD","","_","_"
3,"_","_","_","api","CX","","_","_"
4,"_","_","_","anitya","JJ","","_","_"
5,"rādheya","_","_","rādheya","NC","","_","_"
6,"_","_","_","vāsava","NC","","_","_"
7,"_","_","_","api","CX","","_","_"
8,"yudhyataḥ","_","_","yudh","KDP","","_","_"
1,"mumūrṣur","_","_","mumūrṣu","JJ","","_","_"
2,"yuyudhānena","_","_","yuyudhāna","NC","","_","_"
3,"viratho","_","_","viratha","JJ","","_","_"
4,"'si","_","_","as","V","as","_","_"
5,"visarjitaḥ","_","_","visarjay","PPP","","_","_"
1,"yadṛcchayā","_","_","yadṛcchā","NC","","_","_"
2,"bhīmasenaṃ","_","_","bhīmasa","NC","","_","_"
3,"virathaṃ","_","_","viratha","JJ","","_","_"
4,"kṛtavān","_","_","kṛ","KDP","","_","_"
5,"asi","_","_","as","V","as","_","_"
1,"_","_","_","adharma","NC","","_","_"
2,"_","_","_","tu","CCD","","_","_"
3,"_","_","_","tad","PRD","","_","_"
4,"rādheya","_","_","rādheya","NC","","_","_"
5,"yat","_","_","yad","PRL","","_","_"
6,"tvaṃ","_","_","tvat","PPR","","_","_"
7,"bhīmam","_","_","bhīma","NC","","_","_"
8,"avocathāḥ","_","_","vak","V","vac","_","_"
1,"_","_","_","yuddha","NC","","_","_"
2,"_","_","_","dharma","NC","","_","_"
3,"vijānan","_","_","vijñā","KDP","","_","_"
4,"vai","_","_","vai","CX","","_","_"
5,"yudhyantam","_","_","yudh","KDP","","_","_"
6,"a","_","_","alpha_privativum","JJ","","_","_"
6,"apalāyinam","_","_","palāyin","JJ","","_","_"
1,"pūrayantaṃ","_","_","pūray","KDP","","_","_"
2,"yathāśakti","_","_","yathāśakti","CX","","_","_"
3,"_","_","_","śūra","NC","","_","_"
4,"_","_","_","karman","NC","","_","_"
5,"_","_","_","āhava","NC","","_","_"
6,"tathā","_","_","tathā","CX","","_","_"
1,"paśyatāṃ","_","_","dṛś","KDP","","_","_"
2,"_","_","_","sarva","JQ","","_","_"
3,"_","_","_","sainya","NC","","_","_"
4,"keśavasya","_","_","keśava","NC","","_","_"
5,"_","_","_","mat","PPR","","_","_"
6,"_","_","_","eva","CEM","","_","_"
7,"ca","_","_","ca","CCD","","_","_"
1,"viratho","_","_","viratha","JJ","","_","_"
2,"bhīmasenena","_","_","bhīmasa","NC","","_","_"
3,"kṛto","_","_","kṛ","PPP","","_","_"
4,"'si","_","_","as","V","as","_","_"
5,"bahuśo","_","_","bahuśas","CX","","_","_"
6,"raṇe","_","_","raṇa","NC","","_","_"
1,"na","_","_","na","CNG","","_","_"
2,"ca","_","_","ca","CCD","","_","_"
3,"tvāṃ","_","_","tvat","PPR","","_","_"
4,"paruṣaṃ","_","_","paruṣa","JJ","","_","_"
5,"kiṃcid","_","_","kiṃcit","PRI","","_","_"
6,"uktavān","_","_","vac","KDP","","_","_"
7,"_","_","_","pāṇḍu","NC","","_","_"
8,"_","_","_","nandana","NC","","_","_"
1,"yasmāt","_","_","yasmāt","CX","","_","_"
2,"tu","_","_","tu","CCD","","_","_"
3,"bahu","_","_","bahu","JJ","","_","_"
4,"rūkṣaṃ","_","_","rūkṣa","JJ","","_","_"
5,"ca","_","_","ca","CCD","","_","_"
6,"_","_","_","śrāvay","PPP","","_","_"
7,"_","_","_","tvat","PPR","","_","_"
8,"vṛkodaraḥ","_","_","vṛkodara","NC","","_","_"
1,"parokṣaṃ","_","_","parokṣa","JJ","","_","_"
2,"_","_","_","yat","CSB","","_","_"
3,"_","_","_","ca","CCD","","_","_"
4,"saubhadro","_","_","saubhadra","NC","","_","_"
5,"yuṣmābhir","_","_","tvat","PPR","","_","_"
6,"nihato","_","_","nihan","PPP","","_","_"
7,"mama","_","_","mat","PPR","","_","_"
1,"tasmād","_","_","tasmāt","CX","","_","_"
2,"_","_","_","ida","PRD","","_","_"
3,"_","_","_","avalepa","NC","","_","_"
4,"sadyaḥ","_","_","sadyas","CAD","","_","_"
5,"phalam","_","_","phala","NC","","_","_"
6,"avāpnuhi","_","_","avāpn","V","avāp","_","_"
1,"tvayā","_","_","tvat","PPR","","_","_"
2,"tasya","_","_","tad","PRD","","_","_"
3,"_","_","_","dhanus","NC","","_","_"
4,"_","_","_","chid","PPP","","_","_"
5,"_","_","_","ātman","NC","","_","_"
6,"_","_","_","nāśa","NC","","_","_"
7,"durmate","_","_","durmati","JJ","","_","_"
1,"tasmād","_","_","tasmāt","CX","","_","_"
2,"vadhyo","_","_","vadh","KDG","","_","_"
3,"'si","_","_","as","V","as","_","_"
4,"me","_","_","mat","PPR","","_","_"
5,"mūḍha","_","_","muh","PPP","","_","_"
6,"_","_","_","sa_saha","CX","","_","_"
7,"_","_","_","bhṛtya","NC","","_","_"
8,"_","_","_","bala","NC","","_","_"
9,"_","_","_","vāhana","NC","","_","_"
1,"kuru","_","_","kar","V","kṛ","_","_"
2,"tvaṃ","_","_","tvat","PPR","","_","_"
3,"_","_","_","sarva","JQ","","_","_"
4,"_","_","_","kṛtya","NC","","_","_"
5,"mahat","_","_","mahat","JJ","","_","_"
6,"te","_","_","tvat","PPR","","_","_"
7,"bhayam","_","_","bhaya","NC","","_","_"
8,"āgatam","_","_","āga","PPP","","_","_"
1,"hantāsmi","_","_","han","V","han","_","_"
2,"vṛṣasenaṃ","_","_","vṛṣasa","NC","","_","_"
3,"te","_","_","tvat","PPR","","_","_"
4,"prekṣamāṇasya","_","_","prekṣ","KDP","","_","_"
5,"saṃyuge","_","_","saṃyuga","NC","","_","_"
1,"ye","_","_","yad","PRL","","_","_"
2,"_","_","_","ca","CCD","","_","_"
3,"_","_","_","anya","PPX","","_","_"
4,"_","_","_","api","CX","","_","_"
5,"_","_","_","upayā","V","upayā","_","_"
6,"_","_","_","buddhi","NC","","_","_"
7,"_","_","_","moha","NC","","_","_"
8,"māṃ","_","_","mat","PPR","","_","_"
9,"nṛpāḥ","_","_","nṛpa","NC","","_","_"
1,"_","_","_","tad","PRD","","_","_"
2,"_","_","_","ca","CCD","","_","_"
3,"sarvān","_","_","sarva","JQ","","_","_"
4,"haniṣyāmi","_","_","han","V","han","_","_"
5,"_","_","_","satya","NC","","_","_"
6,"_","_","_","āyudha","NC","","_","_"
7,"ālabhe","_","_","ālabh","V","ālabh","_","_"
1,"tvāṃ","_","_","tvat","PPR","","_","_"
2,"ca","_","_","ca","CCD","","_","_"
3,"_","_","_","muh","PPP","","_","_"
4,"_","_","_","akṛta","JJ","","_","_"
5,"_","_","_","prajñā","NC","","_","_"
6,"atimāninam","_","_","atimānin","JJ","","_","_"
7,"āhave","_","_","āhava","NC","","_","_"
1,"dṛṣṭvā","_","_","dṛś","CGDA","","_","_"
2,"duryodhano","_","_","duryodhana","NC","","_","_"
3,"mando","_","_","manda","JJ","","_","_"
4,"bhṛśaṃ","_","_","bhṛśa","CX","","_","_"
5,"tapsyati","_","_","tap","V","tap","_","_"
6,"pātitam","_","_","pātay","PPP","","_","_"
1,"arjunena","_","_","arjuna","NC","","_","_"
2,"pratijñāte","_","_","pratijñā","PPP","","_","_"
3,"vadhe","_","_","vadha","NC","","_","_"
4,"_","_","_","karṇa","NC","","_","_"
5,"_","_","_","suta","NC","","_","_"
6,"tu","_","_","tu","CCD","","_","_"
1,"mahān","_","_","mahat","JJ","","_","_"
2,"_","_","_","su","CAD","","_","_"
3,"_","_","_","tumula","JJ","","_","_"
4,"śabdo","_","_","śabda","NC","","_","_"
5,"babhūva","_","_","bhav","V","bhū","_","_"
6,"rathināṃ","_","_","rathin","NC","","_","_"
7,"tadā","_","_","tadā","CAD","","_","_"
1,"tasminn","_","_","tad","PRD","","_","_"
2,"_","_","_","ākula","JJ","","_","_"
3,"_","_","_","saṃgrāma","NC","","_","_"
4,"vartamāne","_","_","vṛt","KDP","","_","_"
5,"_","_","_","mahat","JJ","","_","_"
6,"_","_","_","bhaya","NC","","_","_"
1,"_","_","_","manda","JJ","","_","_"
2,"_","_","_","raśmi","NC","","_","_"
3,"sahasrāṃśur","_","_","sahasrāṃśu","NC","","_","_"
4,"astaṃ","_","_","asta","NC","","_","_"
5,"girim","_","_","giri","NC","","_","_"
6,"upāgamat","_","_","upagacch","V","upagam","_","_"
1,"tato","_","_","tatas","CX","","_","_"
2,"rājan","_","_","rājan","NC","","_","_"
3,"hṛṣīkeśaḥ","_","_","hṛṣīkeśa","NC","","_","_"
4,"_","_","_","saṃgrāma","NC","","_","_"
5,"_","_","_","śiras","NC","","_","_"
6,"sthitam","_","_","sthā","PPP","","_","_"
1,"_","_","_","tṛ","PPP","","_","_"
2,"_","_","_","pratijñā","NC","","_","_"
3,"bībhatsuṃ","_","_","bībhatsu","NC","","_","_"
4,"_","_","_","pariṣvaj","CGDA","","_","_"
5,"_","_","_","ida","PRD","","_","_"
6,"abravīt","_","_","abravīta","V","brū","_","_"
1,"diṣṭyā","_","_","diṣṭi","NC","","_","_"
2,"sampāditā","_","_","sampāday","PPP","","_","_"
3,"jiṣṇo","_","_","jiṣṇu","NC","","_","_"
4,"pratijñā","_","_","pratijñā","NC","","_","_"
5,"mahatī","_","_","mahat","JJ","","_","_"
6,"tvayā","_","_","tvat","PPR","","_","_"
1,"diṣṭyā","_","_","diṣṭi","NC","","_","_"
2,"ca","_","_","ca","CCD","","_","_"
3,"nihataḥ","_","_","nihan","PPP","","_","_"
4,"pāpo","_","_","pāpa","JJ","","_","_"
5,"vṛddhakṣatraḥ","_","_","vṛddhakṣatra","NC","","_","_"
6,"_","_","_","saha","CX","","_","_"
7,"_","_","_","ātmaja","NC","","_","_"
1,"_","_","_","dhārtarāṣṭra","NC","","_","_"
2,"_","_","_","bala","NC","","_","_"
3,"prāpya","_","_","prāp","CGDA","","_","_"
4,"_","_","_","deva","NC","","_","_"
5,"_","_","_","senā","NC","","_","_"
6,"_","_","_","api","CX","","_","_"
7,"bhārata","_","_","bhārata","NC","","_","_"
1,"sīdeta","_","_","sīd","V","sad","_","_"
2,"samare","_","_","samara","NC","","_","_"
3,"jiṣṇo","_","_","jiṣṇu","NC","","_","_"
4,"_","_","_","na","CNG","","_","_"
5,"_","_","_","atra","CAD","","_","_"
6,"kāryā","_","_","kṛ","KDG","","_","_"
7,"vicāraṇā","_","_","vicāraṇā","NC","","_","_"
1,"na","_","_","na","CNG","","_","_"
2,"taṃ","_","_","tad","PRD","","_","_"
3,"paśyāmi","_","_","paś","V","paś","_","_"
4,"lokeṣu","_","_","loka","NC","","_","_"
5,"cintayan","_","_","cintay","KDP","","_","_"
6,"puruṣaṃ","_","_","puruṣa","NC","","_","_"
7,"kvacit","_","_","kvacid","CX","","_","_"
1,"tvad","_","_","tvat","PPR","","_","_"
2,"ṛte","_","_","ṛte","CX","","_","_"
3,"_","_","_","puruṣa","NC","","_","_"
4,"_","_","_","vyāghra","NC","","_","_"
5,"ya","_","_","yad","PRL","","_","_"
6,"etad","_","_","tad","PRD","","_","_"
7,"yodhayed","_","_","yodhay","V","yodhay","_","_"
8,"balam","_","_","bala","NC","","_","_"
1,"_","_","_","mahat","JJ","","_","_"
2,"_","_","_","prabhāva","NC","","_","_"
3,"_","_","_","bahu","JJ","","_","_"
4,"_","_","_","tvat","PPR","","_","_"
5,"_","_","_","tulya","JJ","","_","_"
6,"_","_","_","adhika","JJ","","_","_"
7,"_","_","_","api","CX","","_","_"
8,"vā","_","_","vā","CCD","","_","_"
1,"sametāḥ","_","_","same","PPP","","_","_"
2,"pṛthivīpālā","_","_","pṛthivīpāla","NC","","_","_"
3,"dhārtarāṣṭrasya","_","_","dhārtarāṣṭra","NC","","_","_"
4,"kāraṇāt","_","_","kāraṇa","NC","","_","_"
1,"te","_","_","tad","PRD","","_","_"
2,"tvāṃ","_","_","tvat","PPR","","_","_"
3,"prāpya","_","_","prāp","CGDA","","_","_"
4,"raṇe","_","_","raṇa","NC","","_","_"
5,"kruddhaṃ","_","_","krudh","PPP","","_","_"
6,"_","_","_","na","CNG","","_","_"
7,"_","_","_","abhivart","V","abhivṛt","_","_"
8,"daṃśitāḥ","_","_","daṃśay","PPP","","_","_"
1,"tava","_","_","tvat","PPR","","_","_"
2,"vīryaṃ","_","_","vīrya","NC","","_","_"
3,"balaṃ","_","_","bala","NC","","_","_"
4,"_","_","_","ca","CCD","","_","_"
5,"_","_","_","eva","CEM","","_","_"
6,"_","_","_","rudra","NC","","_","_"
7,"_","_","_","śakra","NC","","_","_"
8,"_","_","_","antaka","NC","","_","_"
9,"_","_","_","upama","JJ","","_","_"
1,"_","_","_","na","CNG","","_","_"
2,"_","_","_","īdṛśa","JJ","","_","_"
3,"śaknuyāt","_","_","śakn","V","śak","_","_"
4,"kaścid","_","_","kiṃcit","PRI","","_","_"
5,"raṇe","_","_","raṇa","NC","","_","_"
6,"kartuṃ","_","_","kṛ","CGDI","","_","_"
7,"parākramam","_","_","parākrama","NC","","_","_"
1,"yādṛśaṃ","_","_","yādṛśa","JJ","","_","_"
2,"kṛtavān","_","_","kṛ","KDP","","_","_"
3,"adya","_","_","adya","CX","","_","_"
4,"tvam","_","_","tvat","PPR","","_","_"
5,"ekaḥ","_","_","eka","PPX","","_","_"
6,"_","_","_","śatru","NC","","_","_"
7,"_","_","_","tāpana","JJ","","_","_"
1,"evam","_","_","eva","CX","","_","_"
2,"eva","_","_","eva","CEM","","_","_"
3,"hate","_","_","han","PPP","","_","_"
4,"karṇe","_","_","karṇa","NC","","_","_"
5,"_","_","_","sa_saha","CX","","_","_"
6,"_","_","_","anubandha","NC","","_","_"
7,"durātmani","_","_","durātman","JJ","","_","_"
1,"vardhayiṣyāmi","_","_","vardhay","V","vardhay","_","_"
2,"_","_","_","bhūyas","CX","","_","_"
3,"_","_","_","tvat","PPR","","_","_"
4,"_","_","_","viji","PPP","","_","_"
5,"_","_","_","ari","NC","","_","_"
6,"_","_","_","han","PPP","","_","_"
7,"_","_","_","dviṣ","JJ","","_","_"
1,"tam","_","_","tad","PRD","","_","_"
2,"arjunaḥ","_","_","arjuna","NC","","_","_"
3,"pratyuvāca","_","_","prativak","V","prativac","_","_"
4,"prasādāt","_","_","prasāda","NC","","_","_"
5,"tava","_","_","tvat","PPR","","_","_"
6,"mādhava","_","_","mādhava","NC","","_","_"
1,"_","_","_","pratijñā","NC","","_","_"
2,"_","_","_","ida","PRD","","_","_"
3,"_","_","_","mat","PPR","","_","_"
4,"_","_","_","uttṛ","PPP","","_","_"
5,"vibudhair","_","_","vibudha","NC","","_","_"
6,"api","_","_","api","CX","","_","_"
7,"dustarā","_","_","dustara","JJ","","_","_"
1,"anāścaryo","_","_","anāścarya","JJ","","_","_"
2,"_","_","_","jaya","NC","","_","_"
3,"_","_","_","tad","PRD","","_","_"
4,"yeṣāṃ","_","_","yad","PRL","","_","_"
5,"nātho","_","_","nātha","NC","","_","_"
6,"'si","_","_","as","V","as","_","_"
7,"mādhava","_","_","mādhava","NC","","_","_"
1,"_","_","_","tvat","PPR","","_","_"
2,"_","_","_","prasāda","NC","","_","_"
3,"_","_","_","mahī","NC","","_","_"
4,"kṛtsnāṃ","_","_","kṛtsna","JJ","","_","_"
5,"samprāpsyati","_","_","samprāpn","V","samprāp","_","_"
6,"yudhiṣṭhiraḥ","_","_","yudhiṣṭhira","NC","","_","_"
1,"_","_","_","tvat","PPR","","_","_"
2,"_","_","_","eva","CEM","","_","_"
3,"bhāro","_","_","bhāra","NC","","_","_"
4,"vārṣṇeya","_","_","vārṣṇeya","NC","","_","_"
5,"_","_","_","tvat","PPR","","_","_"
6,"_","_","_","eva","CEM","","_","_"
7,"vijayaḥ","_","_","vijaya","NC","","_","_"
8,"prabho","_","_","prabhu","JJ","","_","_"
1,"_","_","_","vṛdh","KDG","","_","_"
2,"_","_","_","tvat","PPR","","_","_"
3,"vayaṃ","_","_","mat","PPR","","_","_"
4,"_","_","_","preṣya","NC","","_","_"
5,"_","_","_","ca","CCD","","_","_"
6,"madhusūdana","_","_","madhusūdana","NC","","_","_"
1,"evam","_","_","eva","CX","","_","_"
2,"uktaḥ","_","_","vac","PPP","","_","_"
3,"smayan","_","_","smi","KDP","","_","_"
4,"kṛṣṇaḥ","_","_","kṛṣṇa","NC","","_","_"
5,"śanakair","_","_","śanakais","CX","","_","_"
6,"vāhayan","_","_","vāhay","KDP","","_","_"
7,"hayān","_","_","haya","NC","","_","_"
1,"darśayāmāsa","_","_","darśay","V","darśay","_","_"
2,"pārthāya","_","_","pārtha","NC","","_","_"
3,"krūram","_","_","krūra","JJ","","_","_"
4,"āyodhanaṃ","_","_","āyodhana","NC","","_","_"
5,"mahat","_","_","mahat","JJ","","_","_"
1,"_","_","_","śrī","NC","","_","_"
2,"_","_","_","kṛṣṇa","NC","","_","_"
3,"uvāca","_","_","vak","V","vac","_","_"
1,"prārthayanto","_","_","prārthay","KDP","","_","_"
2,"jayaṃ","_","_","jaya","NC","","_","_"
3,"yuddhe","_","_","yuddha","NC","","_","_"
4,"prathitaṃ","_","_","prath","PPP","","_","_"
5,"ca","_","_","ca","CCD","","_","_"
6,"mahad","_","_","mahat","JJ","","_","_"
7,"yaśaḥ","_","_","yaśas","NC","","_","_"
1,"pṛthivyāṃ","_","_","pṛthivī","NC","","_","_"
2,"śerate","_","_","śī","V","śī","_","_"
3,"śūrāḥ","_","_","śūra","NC","","_","_"
4,"_","_","_","pārthiva","NC","","_","_"
5,"_","_","_","tvat","PPR","","_","_"
6,"_","_","_","śara","NC","","_","_"
7,"hatāḥ","_","_","han","PPP","","_","_"
1,"_","_","_","vikṛ","PPP","","_","_"
2,"_","_","_","śastra","NC","","_","_"
3,"_","_","_","ābharaṇa","NC","","_","_"
4,"_","_","_","vipad","PPP","","_","_"
5,"_","_","_","aśva","NC","","_","_"
6,"_","_","_","ratha","NC","","_","_"
7,"_","_","_","dvipa","NC","","_","_"
1,"_","_","_","saṃchid","PPP","","_","_"
2,"_","_","_","bhid","PPP","","_","_"
3,"_","_","_","varman","NC","","_","_"
4,"vaiklavyaṃ","_","_","vaiklavya","NC","","_","_"
5,"paramaṃ","_","_","parama","JJ","","_","_"
6,"gatāḥ","_","_","ga","PPP","","_","_"
1,"_","_","_","sa_saha","CX","","_","_"
2,"_","_","_","sattva","NC","","_","_"
3,"_","_","_","gatasattva","JJ","","_","_"
4,"_","_","_","ca","CCD","","_","_"
5,"prabhayā","_","_","prabhā","NC","","_","_"
6,"parayā","_","_","para","PPX","","_","_"
7,"yutāḥ","_","_","yuta","JJ","","_","_"
1,"_","_","_","sa_saha","CX","","_","_"
2,"_","_","_","jīva","NC","","_","_"
3,"iva","_","_","iva","CCM","","_","_"
4,"lakṣyante","_","_","lakṣ","V","lakṣ","_","_"
5,"gatasattvā","_","_","gatasattva","JJ","","_","_"
6,"narādhipāḥ","_","_","narādhipa","NC","","_","_"
1,"teṣāṃ","_","_","tad","PRD","","_","_"
2,"śaraiḥ","_","_","śara","NC","","_","_"
3,"_","_","_","svarṇa","NC","","_","_"
4,"_","_","_","puṅkha","NC","","_","_"
5,"_","_","_","śastra","NC","","_","_"
6,"_","_","_","ca","CCD","","_","_"
7,"vividhaiḥ","_","_","vividha","JJ","","_","_"
8,"śitaiḥ","_","_","śā","PPP","","_","_"
1,"vāhanair","_","_","vāhana","NC","","_","_"
2,"_","_","_","āyudha","NC","","_","_"
3,"_","_","_","ca","CCD","","_","_"
4,"_","_","_","eva","CEM","","_","_"
5,"sampūrṇāṃ","_","_","sampṛ","PPP","","_","_"
6,"paśya","_","_","paś","V","paś","_","_"
7,"medinīm","_","_","medinī","NC","","_","_"
1,"_","_","_","varman","NC","","_","_"
2,"_","_","_","carman","NC","","_","_"
3,"hāraiḥ","_","_","hāra","NC","","_","_"
4,"_","_","_","śiras","NC","","_","_"
5,"_","_","_","ca","CCD","","_","_"
6,"_","_","_","sa_saha","CX","","_","_"
7,"_","_","_","kuṇḍala","NC","","_","_"
1,"uṣṇīṣair","_","_","uṣṇīṣa","NC","","_","_"
2,"mukuṭaiḥ","_","_","mukuṭa","NC","","_","_"
3,"_","_","_","sraj","NC","","_","_"
4,"_","_","_","cūḍāmaṇi","NC","","_","_"
5,"ambaraiḥ","_","_","ambara","NC","","_","_"
1,"_","_","_","kaṇṭha","NC","","_","_"
2,"_","_","_","sūtra","NC","","_","_"
3,"_","_","_","aṅgada","NC","","_","_"
4,"_","_","_","ca","CCD","","_","_"
5,"niṣkair","_","_","niṣka","NC","","_","_"
6,"api","_","_","api","CX","","_","_"
7,"ca","_","_","ca","CCD","","_","_"
8,"_","_","_","su","CAD","","_","_"
9,"_","_","_","prabhā","NC","","_","_"
1,"_","_","_","anya","PPX","","_","_"
2,"_","_","_","ca","CCD","","_","_"
3,"_","_","_","ābharaṇa","NC","","_","_"
4,"_","_","_","citra","JJ","","_","_"
5,"bhāti","_","_","bhā","V","bhā","_","_"
6,"bhārata","_","_","bhārata","NC","","_","_"
7,"medinī","_","_","medinī","NC","","_","_"
1,"cāmarair","_","_","cāmara","NC","","_","_"
2,"_","_","_","vyajana","NC","","_","_"
3,"_","_","_","citra","JJ","","_","_"
4,"_","_","_","dhvaja","NC","","_","_"
5,"_","_","_","ca","CCD","","_","_"
6,"_","_","_","aśva","NC","","_","_"
7,"_","_","_","ratha","NC","","_","_"
8,"_","_","_","dvipa","NC","","_","_"
1,"_","_","_","vividha","JJ","","_","_"
2,"_","_","_","ca","CCD","","_","_"
3,"paristomair","_","_","paristoma","NC","","_","_"
4,"aśvānāṃ","_","_","aśva","NC","","_","_"
5,"ca","_","_","ca","CCD","","_","_"
6,"prakīrṇakaiḥ","_","_","prakīrṇaka","NC","","_","_"
1,"_","_","_","kutha","NC","","_","_"
2,"_","_","_","ca","CCD","","_","_"
3,"vicitrābhir","_","_","vicitra","JJ","","_","_"
4,"_","_","_","varūtha","NC","","_","_"
5,"_","_","_","ca","CCD","","_","_"
6,"mahādhanaiḥ","_","_","mahādhana","JJ","","_","_"
1,"saṃstīrṇāṃ","_","_","saṃstṛ","PPP","","_","_"
2,"vasudhāṃ","_","_","vasudhā","NC","","_","_"
3,"paśya","_","_","paś","V","paś","_","_"
4,"_","_","_","citra","JJ","","_","_"
5,"_","_","_","paṭṭa","NC","","_","_"
6,"_","_","_","iva","CCM","","_","_"
7,"_","_","_","āvṛ","PPP","","_","_"
1,"nāgebhyaḥ","_","_","nāga","NC","","_","_"
2,"patitān","_","_","pat","PPP","","_","_"
3,"anyān","_","_","anya","PPX","","_","_"
4,"kalpitebhyo","_","_","kalpay","PPP","","_","_"
5,"dvipaiḥ","_","_","dvipa","NC","","_","_"
6,"saha","_","_","saha","CX","","_","_"
1,"siṃhān","_","_","siṃha","NC","","_","_"
2,"_","_","_","vajra","NC","","_","_"
3,"_","_","_","praṇud","PPP","","_","_"
4,"_","_","_","giri","NC","","_","_"
5,"_","_","_","agra","NC","","_","_"
6,"iva","_","_","iva","CCM","","_","_"
7,"cyutān","_","_","cyu","PPP","","_","_"
1,"saṃsyūtān","_","_","saṃsīv","PPP","","_","_"
2,"vājibhiḥ","_","_","vājin","NC","","_","_"
3,"sārdhaṃ","_","_","sārdha","CX","","_","_"
4,"dharaṇyāṃ","_","_","dharaṇī","NC","","_","_"
5,"paśya","_","_","paś","V","paś","_","_"
6,"_","_","_","ca","CCD","","_","_"
7,"_","_","_","apara","PPX","","_","_"
1,"_","_","_","padāti","NC","","_","_"
2,"_","_","_","sādin","NC","","_","_"
3,"_","_","_","saṃgha","NC","","_","_"
4,"_","_","_","ca","CCD","","_","_"
5,"_","_","_","kṣataja","NC","","_","_"
6,"_","_","_","ogha","NC","","_","_"
7,"_","_","_","pariplu","PPP","","_","_"
1,"saṃjaya","_","_","saṃjaya","NC","","_","_"
2,"uvāca","_","_","vak","V","vac","_","_"
1,"evaṃ","_","_","eva","CX","","_","_"
2,"saṃdarśayan","_","_","saṃdarśay","KDP","","_","_"
3,"kṛṣṇo","_","_","kṛṣṇa","NC","","_","_"
4,"_","_","_","raṇa","NC","","_","_"
5,"_","_","_","bhūmi","NC","","_","_"
6,"kirīṭinaḥ","_","_","kirīṭin","NC","","_","_"
1,"svaiḥ","_","_","sva","JJ","","_","_"
2,"sametaḥ","_","_","same","PPP","","_","_"
3,"sa","_","_","tad","PRD","","_","_"
4,"muditaḥ","_","_","mud","PPP","","_","_"
5,"pāñcajanyaṃ","_","_","pāñcajanya","NC","","_","_"
6,"vyanādayat","_","_","vināday","V","vināday","_","_"
