"WordID","word","NormSTEM","suffix","lemma","PoS","Root","NormSuffix","NormWord"
1,"yayor","_","_","yad","PRL","","_","_"
2,"ojasā","_","_","ojas","NC","","_","_"
3,"skabhitā","_","_","skambh","PPP","","_","_"
4,"rajāṃsi","_","_","rajas","NC","","_","_"
5,"yau","_","_","yad","PRL","","_","_"
6,"vīryair","_","_","vīrya","NC","","_","_"
7,"vīratamā","_","_","vīratama","NC","","_","_"
8,"śaviṣṭhā","_","_","śaviṣṭha","JJ","","_","_"
1,"yau","_","_","yad","PRL","","_","_"
2,"patyete","_","_","paty","V","paty","_","_"
3,"apratītau","_","_","apratīta","JJ","","_","_"
4,"sahobhir","_","_","sahas","NC","","_","_"
5,"viṣṇum","_","_","viṣṇu","NC","","_","_"
6,"agan","_","_","ga","V","ga","_","_"
7,"varuṇaṃ","_","_","varuṇa","NC","","_","_"
8,"_","_","_","pūrva","PPX","","_","_"
9,"_","_","_","hūti","NC","","_","_"
1,"_","_","_","yad","PRL","","_","_"
2,"_","_","_","ida","PRD","","_","_"
3,"pradiśi","_","_","pradiś","NC","","_","_"
4,"yad","_","_","yad","PRL","","_","_"
5,"virocate","_","_","viroc","V","viruc","_","_"
6,"pra","_","_","pra","CADP","","_","_"
7,"_","_","_","ca","CCD","","_","_"
8,"_","_","_","an","V","an","_","_"
9,"vi","_","_","vi","CADP","","_","_"
10,"ca","_","_","ca","CCD","","_","_"
11,"caṣṭe","_","_","cakṣ","V","cakṣ","_","_"
12,"śacībhiḥ","_","_","śacī","NC","","_","_"
1,"purā","_","_","purā","CX","","_","_"
2,"devasya","_","_","deva","NC","","_","_"
3,"dharmaṇā","_","_","dharman","NC","","_","_"
4,"sahobhir","_","_","sahas","NC","","_","_"
5,"viṣṇum","_","_","viṣṇu","NC","","_","_"
6,"agan","_","_","ga","V","ga","_","_"
7,"varuṇaṃ","_","_","varuṇa","NC","","_","_"
8,"_","_","_","pūrva","PPX","","_","_"
9,"_","_","_","hūti","NC","","_","_"
