"WordID","word","NormSTEM","suffix","lemma","PoS","Root","NormSuffix","NormWord"
1,"_","_","_","daśan","NUM","","_","_"
2,"_","_","_","vṛkṣa","NC","","_","_"
3,"_","_","_","muñc","V","muc","_","_"
4,"_","_","_","ida","PRD","","_","_"
5,"rakṣaso","_","_","rakṣas","NC","","_","_"
6,"grāhyā","_","_","grāhi","NC","","_","_"
7,"adhi","_","_","adhi","CADP","","_","_"
8,"_","_","_","yad","PRL","","_","_"
9,"_","_","_","a","PRD","","_","_"
10,"jagrāha","_","_","grah","V","grah","_","_"
11,"parvasu","_","_","parvan","NC","","_","_"
1,"_","_","_","atha","CAD","","_","_"
2,"_","_","_","u","CEM","","_","_"
3,"enam","_","_","a","PRD","","_","_"
4,"vanaspate","_","_","vanaspati","NC","","_","_"
5,"jīvānāṃ","_","_","jīva","JJ","","_","_"
6,"lokam","_","_","loka","NC","","_","_"
7,"un","_","_","ud","CADP","","_","_"
8,"naya","_","_","nay","V","nī","_","_"
1,"āgād","_","_","āgā","V","āgā","_","_"
2,"ud","_","_","ud","CADP","","_","_"
3,"agād","_","_","gā","V","gā","_","_"
4,"ayaṃ","_","_","ida","PRD","","_","_"
5,"jīvānāṃ","_","_","jīva","JJ","","_","_"
6,"vrātam","_","_","vrāta","NC","","_","_"
7,"apy","_","_","api","CX","","_","_"
8,"agāt","_","_","gā","V","gā","_","_"
1,"abhūd","_","_","bhav","V","bhū","_","_"
2,"u","_","_","u","CEM","","_","_"
3,"putrāṇāṃ","_","_","putra","NC","","_","_"
4,"pitā","_","_","pitṛ","NC","","_","_"
5,"nṛṇāṃ","_","_","nṛ","NC","","_","_"
6,"ca","_","_","ca","CCD","","_","_"
7,"bhagavattamaḥ","_","_","bhagavattama","JJ","","_","_"
1,"adhītīr","_","_","adhīti","NC","","_","_"
2,"adhy","_","_","adhi","CADP","","_","_"
3,"agād","_","_","gā","V","gā","_","_"
4,"ayam","_","_","ida","PRD","","_","_"
5,"adhi","_","_","adhi","CADP","","_","_"
6,"_","_","_","jīva","JJ","","_","_"
7,"_","_","_","pura","NC","","_","_"
8,"agan","_","_","ga","V","ga","_","_"
1,"śataṃ","_","_","śata","NUM","","_","_"
2,"hy","_","_","hi","CX","","_","_"
3,"asya","_","_","ida","PRD","","_","_"
4,"bhiṣajaḥ","_","_","bhiṣaj","NC","","_","_"
5,"sahasram","_","_","sahasra","NUM","","_","_"
6,"uta","_","_","uta","CCD","","_","_"
7,"vīrudhaḥ","_","_","vīrudh","NC","","_","_"
1,"devās","_","_","deva","NC","","_","_"
2,"te","_","_","tvat","PPR","","_","_"
3,"cītim","_","_","cīti","NC","","_","_"
4,"avidan","_","_","vid","V","vid","_","_"
5,"brahmāṇa","_","_","brahman","NC","","_","_"
6,"uta","_","_","uta","CCD","","_","_"
7,"vīrudhaḥ","_","_","vīrudh","NC","","_","_"
1,"cītiṃ","_","_","cīti","NC","","_","_"
2,"te","_","_","tvat","PPR","","_","_"
3,"viśve","_","_","viśva","JQ","","_","_"
4,"devā","_","_","deva","NC","","_","_"
5,"avidan","_","_","vid","V","vid","_","_"
6,"bhūmyām","_","_","bhūmi","NC","","_","_"
7,"adhi","_","_","adhi","CADP","","_","_"
1,"yaś","_","_","yad","PRL","","_","_"
2,"cakāra","_","_","kar","V","kṛ","_","_"
3,"sa","_","_","tad","PRD","","_","_"
4,"niṣ","_","_","niḥ","CADP","","_","_"
5,"karat","_","_","kar","V","kṛ","_","_"
6,"sa","_","_","tad","PRD","","_","_"
7,"eva","_","_","eva","CEM","","_","_"
8,"_","_","_","su","CAD","","_","_"
9,"_","_","_","bhiṣaktama","NC","","_","_"
1,"sa","_","_","tad","PRD","","_","_"
2,"eva","_","_","eva","CEM","","_","_"
3,"tubhyaṃ","_","_","tvat","PPR","","_","_"
4,"bheṣajāni","_","_","bheṣaja","NC","","_","_"
5,"kṛṇavad","_","_","kar","V","kṛ","_","_"
6,"bhiṣajā","_","_","bhiṣaj","NC","","_","_"
7,"śuciḥ","_","_","śuci","JJ","","_","_"
