"WordID","word","NormSTEM","suffix","lemma","PoS","Root","NormSuffix","NormWord"
1,"_","_","_","na","CNG","","_","_"
2,"_","_","_","id","CEM","","_","_"
3,"_","_","_","śatru","NC","","_","_"
4,"prāśaṃ","_","_","prāś","NC","","_","_"
5,"jayāti","_","_","jay","V","ji","_","_"
6,"_","_","_","sah","KDP","","_","_"
7,"_","_","_","abhibhū","JJ","","_","_"
8,"asi","_","_","as","V","as","_","_"
1,"prāśaṃ","_","_","prāś","NC","","_","_"
2,"pratiprāśo","_","_","pratiprāś","NC","","_","_"
3,"jahy","_","_","han","V","han","_","_"
4,"arasān","_","_","arasa","JJ","","_","_"
5,"kṛṇv","_","_","kar","V","kṛ","_","_"
6,"oṣadhe","_","_","oṣadhi","NC","","_","_"
1,"suparṇas","_","_","suparṇa","NC","","_","_"
2,"_","_","_","tvat","PPR","","_","_"
3,"_","_","_","anu","CADP","","_","_"
4,"avindat","_","_","vid","V","vid","_","_"
5,"sūkaras","_","_","sūkara","NC","","_","_"
6,"_","_","_","tvat","PPR","","_","_"
7,"_","_","_","khan","V","khan","_","_"
8,"nasā","_","_","nas","NC","","_","_"
1,"prāśaṃ","_","_","prāś","NC","","_","_"
2,"pratiprāśo","_","_","pratiprāś","NC","","_","_"
3,"jahy","_","_","han","V","han","_","_"
4,"arasān","_","_","arasa","JJ","","_","_"
5,"kṛṇv","_","_","kar","V","kṛ","_","_"
6,"oṣadhe","_","_","oṣadhi","NC","","_","_"
1,"indro","_","_","indra","NC","","_","_"
2,"ha","_","_","ha","CEM","","_","_"
3,"cakre","_","_","kar","V","kṛ","_","_"
4,"tvā","_","_","tvat","PPR","","_","_"
5,"bāhāv","_","_","bāhu","NC","","_","_"
6,"asurebhya","_","_","asura","NC","","_","_"
7,"starītave","_","_","stṛ","CGDI","","_","_"
1,"prāśaṃ","_","_","prāś","NC","","_","_"
2,"pratiprāśo","_","_","pratiprāś","NC","","_","_"
3,"jahy","_","_","han","V","han","_","_"
4,"arasān","_","_","arasa","JJ","","_","_"
5,"kṛṇv","_","_","kar","V","kṛ","_","_"
6,"oṣadhe","_","_","oṣadhi","NC","","_","_"
1,"pāṭām","_","_","pāṭā","NC","","_","_"
2,"indro","_","_","indra","NC","","_","_"
3,"vy","_","_","vi","CADP","","_","_"
4,"āśnād","_","_","aś","V","aś","_","_"
5,"asurebhya","_","_","asura","NC","","_","_"
6,"starītave","_","_","stṛ","CGDI","","_","_"
1,"prāśaṃ","_","_","prāś","NC","","_","_"
2,"pratiprāśo","_","_","pratiprāś","NC","","_","_"
3,"jahy","_","_","han","V","han","_","_"
4,"arasān","_","_","arasa","JJ","","_","_"
5,"kṛṇv","_","_","kar","V","kṛ","_","_"
6,"oṣadhe","_","_","oṣadhi","NC","","_","_"
1,"_","_","_","tad","PRD","","_","_"
2,"_","_","_","mat","PPR","","_","_"
3,"śatrūnt","_","_","śatru","NC","","_","_"
4,"sākṣa","_","_","sah","V","sah","_","_"
5,"indraḥ","_","_","indra","NC","","_","_"
6,"sālāvṛkāṁ","_","_","śālāvṛka","NC","","_","_"
7,"iva","_","_","iva","CCM","","_","_"
1,"prāśaṃ","_","_","prāś","NC","","_","_"
2,"pratiprāśo","_","_","pratiprāś","NC","","_","_"
3,"jahy","_","_","han","V","han","_","_"
4,"arasān","_","_","arasa","JJ","","_","_"
5,"kṛṇv","_","_","kar","V","kṛ","_","_"
6,"oṣadhe","_","_","oṣadhi","NC","","_","_"
1,"rudra","_","_","rudra","NC","","_","_"
2,"_","_","_","jalāṣa","JJ","","_","_"
3,"_","_","_","bheṣaja","NC","","_","_"
4,"_","_","_","nīla","JJ","","_","_"
5,"_","_","_","śikhaṇḍa","NC","","_","_"
6,"_","_","_","karman","NC","","_","_"
7,"_","_","_","kṛt","JJ","","_","_"
1,"prāśaṃ","_","_","prāś","NC","","_","_"
2,"pratiprāśo","_","_","pratiprāś","NC","","_","_"
3,"jahy","_","_","han","V","han","_","_"
4,"arasān","_","_","arasa","JJ","","_","_"
5,"kṛṇv","_","_","kar","V","kṛ","_","_"
6,"oṣadhe","_","_","oṣadhi","NC","","_","_"
1,"tasya","_","_","tad","PRD","","_","_"
2,"prāśaṃ","_","_","prāś","NC","","_","_"
3,"tvaṃ","_","_","tvat","PPR","","_","_"
4,"jahi","_","_","han","V","han","_","_"
5,"yo","_","_","yad","PRL","","_","_"
6,"na","_","_","mat","PPR","","_","_"
7,"_","_","_","indra","NC","","_","_"
8,"_","_","_","abhidās","V","abhidās","_","_"
1,"adhi","_","_","adhi","CADP","","_","_"
2,"no","_","_","mat","PPR","","_","_"
3,"brūhi","_","_","abravīta","V","brū","_","_"
4,"śaktibhiḥ","_","_","śakti","NC","","_","_"
5,"prāśi","_","_","prāś","NC","","_","_"
6,"mām","_","_","mat","PPR","","_","_"
7,"uttaraṃ","_","_","uttara","JJ","","_","_"
8,"kṛdhi","_","_","kar","V","kṛ","_","_"
