"WordID","word","NormSTEM","suffix","lemma","PoS","Root","NormSuffix","NormWord"
1,"dhṛṣṭadyumna","_","_","dhṛṣṭadyumna","NC","","_","_"
2,"uvāca","_","_","vak","V","vac","_","_"
1,"duryodhano","_","_","duryodhana","NC","","_","_"
2,"durviṣaho","_","_","durviṣaha","NC","","_","_"
3,"durmukho","_","_","durmukha","NC","","_","_"
4,"duṣpradharṣaṇaḥ","_","_","duṣpradharṣaṇa","NC","","_","_"
1,"viviṃśatir","_","_","viviṃśati","NC","","_","_"
2,"_","_","_","vikarṇa","NC","","_","_"
3,"_","_","_","ca","CCD","","_","_"
4,"saho","_","_","saha","NC","","_","_"
5,"duḥśāsanaḥ","_","_","duḥśāsana","NC","","_","_"
6,"samaḥ","_","_","sama","PPX","","_","_"
1,"yuyutsur","_","_","yuyutsu","NC","","_","_"
2,"_","_","_","vātavega","NC","","_","_"
3,"_","_","_","ca","CCD","","_","_"
4,"_","_","_","bhīmavega","NC","","_","_"
5,"_","_","_","dhara","JJ","","_","_"
6,"_","_","_","tathā","CX","","_","_"
1,"ugrāyudho","_","_","ugrāyudha","NC","","_","_"
2,"balākī","_","_","balākin","NC","","_","_"
3,"ca","_","_","ca","CCD","","_","_"
4,"kanakāyur","_","_","kanakāyu","NC","","_","_"
5,"virocanaḥ","_","_","virocana","NC","","_","_"
1,"_","_","_","sukuṇḍala","NC","","_","_"
2,"_","_","_","citrasa","NC","","_","_"
3,"suvarcāḥ","_","_","suvarcas","NC","","_","_"
4,"kanakadhvajaḥ","_","_","kanakadhvaja","NC","","_","_"
1,"nandako","_","_","nandaka","NC","","_","_"
2,"bāhuśālī","_","_","bāhuśālin","NC","","_","_"
3,"ca","_","_","ca","CCD","","_","_"
4,"kuṇḍajo","_","_","kuṇḍaja","NC","","_","_"
5,"_","_","_","vikaṭa","NC","","_","_"
6,"_","_","_","tathā","CX","","_","_"
1,"_","_","_","vinda","NC","","_","_"
2,"_","_","_","ca","CCD","","_","_"
3,"_","_","_","api","CX","","_","_"
4,"_","_","_","anuvinda","NC","","_","_"
5,"_","_","_","ca","CCD","","_","_"
6,"sajīvī","_","_","vikala","NC","","_","_"
7,"vikalaḥ","_","_","karin","NC","","_","_"
1,"ete","_","_","tad","PRD","","_","_"
2,"_","_","_","ca","CCD","","_","_"
3,"_","_","_","anya","PPX","","_","_"
4,"ca","_","_","ca","CCD","","_","_"
5,"bahavo","_","_","bahu","JJ","","_","_"
6,"dhārtarāṣṭrā","_","_","dhārtarāṣṭra","NC","","_","_"
7,"_","_","_","mahat","JJ","","_","_"
8,"_","_","_","bala","NC","","_","_"
1,"karṇena","_","_","karṇa","NC","","_","_"
2,"sahitā","_","_","sahita","JJ","","_","_"
3,"_","_","_","vīra","NC","","_","_"
4,"_","_","_","tvat","PPR","","_","_"
5,"_","_","_","artha","NC","","_","_"
6,"samupāgatāḥ","_","_","samupāga","PPP","","_","_"
1,"_","_","_","śata","NUM","","_","_"
2,"_","_","_","saṃkhyā","NC","","_","_"
3,"mahātmānaḥ","_","_","mahātman","JJ","","_","_"
4,"prathitāḥ","_","_","prath","PPP","","_","_"
5,"_","_","_","kṣatriya","NC","","_","_"
6,"_","_","_","ṛṣabha","NC","","_","_"
1,"_","_","_","śakuni","NC","","_","_"
2,"_","_","_","ca","CCD","","_","_"
3,"_","_","_","bala","NC","","_","_"
4,"_","_","_","ca","CCD","","_","_"
5,"_","_","_","eva","CEM","","_","_"
6,"vṛṣako","_","_","vṛṣaka","NC","","_","_"
7,"'tha","_","_","atha","CAD","","_","_"
8,"_","_","_","bṛhat","JJ","","_","_"
9,"_","_","_","bala","NC","","_","_"
1,"ete","_","_","tad","PRD","","_","_"
2,"_","_","_","gāndhāra","NC","","_","_"
3,"_","_","_","rāja","NC","","_","_"
4,"sutāḥ","_","_","sutā","NC","","_","_"
5,"sarve","_","_","sarva","JQ","","_","_"
6,"samāgatāḥ","_","_","samāga","PPP","","_","_"
1,"aśvatthāmā","_","_","aśvatthāman","NC","","_","_"
2,"ca","_","_","ca","CCD","","_","_"
3,"_","_","_","bhoja","NC","","_","_"
4,"_","_","_","ca","CCD","","_","_"
5,"_","_","_","sarva","JQ","","_","_"
6,"_","_","_","śastra","NC","","_","_"
7,"_","_","_","bhṛt","JJ","","_","_"
8,"varau","_","_","vara","JJ","","_","_"
1,"samavetau","_","_","samave","PPP","","_","_"
2,"mahātmānau","_","_","mahātman","JJ","","_","_"
3,"_","_","_","tvat","PPR","","_","_"
4,"_","_","_","artha","NC","","_","_"
5,"samalaṃkṛtau","_","_","samalaṃkṛ","PPP","","_","_"
1,"bṛhanto","_","_","bṛhanta","NC","","_","_"
2,"_","_","_","maṇimat","NC","","_","_"
3,"_","_","_","ca","CCD","","_","_"
4,"_","_","_","eva","CEM","","_","_"
5,"_","_","_","daṇḍadhāra","NC","","_","_"
6,"_","_","_","ca","CCD","","_","_"
7,"vīryavān","_","_","vīryavat","JJ","","_","_"
1,"sahadevo","_","_","sahadeva","NC","","_","_"
2,"jayatseno","_","_","jayatsa","NC","","_","_"
3,"_","_","_","meghasaṃdhi","NC","","_","_"
4,"_","_","_","ca","CCD","","_","_"
5,"māgadhaḥ","_","_","māgadha","NC","","_","_"
1,"virāṭaḥ","_","_","virāṭa","NC","","_","_"
2,"saha","_","_","saha","CX","","_","_"
3,"putrābhyāṃ","_","_","putra","NC","","_","_"
4,"_","_","_","śaṅkha","NC","","_","_"
5,"_","_","_","eva","CEM","","_","_"
6,"_","_","_","uttara","JJ","","_","_"
7,"ca","_","_","ca","CCD","","_","_"
1,"vārdhakṣemiḥ","_","_","vārddhakṣemi","NC","","_","_"
2,"_","_","_","suvarcas","NC","","_","_"
3,"_","_","_","ca","CCD","","_","_"
4,"_","_","_","senābindu","NC","","_","_"
5,"_","_","_","ca","CCD","","_","_"
6,"pārthivaḥ","_","_","pārthiva","NC","","_","_"
1,"saha","_","_","saha","CX","","_","_"
2,"putreṇa","_","_","putra","NC","","_","_"
3,"sudāmnā","_","_","sudāman","NC","","_","_"
4,"ca","_","_","ca","CCD","","_","_"
5,"suvarcasā","_","_","suvarcas","NC","","_","_"
1,"sumitraḥ","_","_","sumitra","NC","","_","_"
2,"_","_","_","sukumāra","NC","","_","_"
3,"_","_","_","ca","CCD","","_","_"
4,"vṛkaḥ","_","_","vṛka","NC","","_","_"
5,"_","_","_","satyadhṛti","NC","","_","_"
6,"_","_","_","tathā","CX","","_","_"
1,"sūryadhvajo","_","_","sūryadhvaja","NC","","_","_"
2,"rocamāno","_","_","rocamāna","NC","","_","_"
3,"_","_","_","nīla","NC","","_","_"
4,"_","_","_","citrāyudha","NC","","_","_"
5,"_","_","_","tathā","CX","","_","_"
1,"_","_","_","aṃśumat","NC","","_","_"
2,"_","_","_","cekitāna","JJ","","_","_"
3,"_","_","_","ca","CCD","","_","_"
4,"_","_","_","śreṇimat","NC","","_","_"
5,"_","_","_","ca","CCD","","_","_"
6,"_","_","_","mahat","JJ","","_","_"
7,"_","_","_","bala","NC","","_","_"
1,"_","_","_","samudrasa","NC","","_","_"
2,"_","_","_","putra","NC","","_","_"
3,"_","_","_","ca","CCD","","_","_"
4,"candrasenaḥ","_","_","candrasa","NC","","_","_"
5,"pratāpavān","_","_","pratāpavat","JJ","","_","_"
1,"jalasaṃdhaḥ","_","_","jalasaṃdha","NC","","_","_"
2,"pitāputrau","_","_","pitāputra","NC","","_","_"
3,"sudaṇḍo","_","_","sudaṇḍa","NC","","_","_"
4,"daṇḍa","_","_","daṇḍa","NC","","_","_"
5,"eva","_","_","eva","CEM","","_","_"
6,"ca","_","_","ca","CCD","","_","_"
1,"pauṇḍrako","_","_","pauṇḍraka","NC","","_","_"
2,"_","_","_","vāsudeva","NC","","_","_"
3,"_","_","_","ca","CCD","","_","_"
4,"_","_","_","bhagadatta","NC","","_","_"
5,"_","_","_","ca","CCD","","_","_"
6,"vīryavān","_","_","vīryavat","JJ","","_","_"
1,"_","_","_","kaliṅga","NC","","_","_"
2,"_","_","_","tāmralipta","NC","","_","_"
3,"_","_","_","ca","CCD","","_","_"
4,"_","_","_","pattanādhipati","NC","","_","_"
5,"_","_","_","tathā","CX","","_","_"
1,"_","_","_","madra","NC","","_","_"
2,"_","_","_","rāja","NC","","_","_"
3,"_","_","_","tathā","CX","","_","_"
4,"śalyaḥ","_","_","śalya","NC","","_","_"
5,"sahaputro","_","_","sahaputra","JJ","","_","_"
6,"_","_","_","mahat","JJ","","_","_"
7,"_","_","_","ratha","NC","","_","_"
1,"rukmāṅgadena","_","_","rukmāṅgada","NC","","_","_"
2,"vīreṇa","_","_","vīra","NC","","_","_"
3,"tathā","_","_","tathā","CX","","_","_"
4,"rukmarathena","_","_","rukmaratha","NC","","_","_"
5,"ca","_","_","ca","CCD","","_","_"
1,"kauravyaḥ","_","_","kauravya","NC","","_","_"
2,"_","_","_","somadatta","NC","","_","_"
3,"_","_","_","ca","CCD","","_","_"
4,"_","_","_","putra","NC","","_","_"
5,"_","_","_","ca","CCD","","_","_"
6,"_","_","_","ida","PRD","","_","_"
7,"_","_","_","mahat","JJ","","_","_"
8,"_","_","_","ratha","NC","","_","_"
1,"_","_","_","samave","PPP","","_","_"
2,"_","_","_","tri","NUM","","_","_"
3,"śūrā","_","_","śūra","NC","","_","_"
4,"bhūrir","_","_","bhūri","NC","","_","_"
5,"bhūriśravāḥ","_","_","bhūriśravas","NC","","_","_"
6,"śalaḥ","_","_","śala","NC","","_","_"
1,"_","_","_","sudakṣiṇa","NC","","_","_"
2,"_","_","_","ca","CCD","","_","_"
3,"kāmbojo","_","_","kāmboja","NC","","_","_"
4,"dṛḍhadhanvā","_","_","dṛḍhadhanvan","NC","","_","_"
5,"ca","_","_","ca","CCD","","_","_"
6,"kauravaḥ","_","_","kaurava","NC","","_","_"
1,"_","_","_","bṛhat","JJ","","_","_"
2,"_","_","_","bala","NC","","_","_"
3,"_","_","_","suṣeṇa","NC","","_","_"
4,"_","_","_","ca","CCD","","_","_"
5,"śibir","_","_","śibi","NC","","_","_"
6,"_","_","_","auśīnara","JJ","","_","_"
7,"_","_","_","tathā","CX","","_","_"
1,"_","_","_","paṭaccara","NC","","_","_"
2,"_","_","_","nihantṛ","NC","","_","_"
3,"ca","_","_","ca","CCD","","_","_"
4,"_","_","_","kārūṣa","NC","","_","_"
5,"_","_","_","adhipati","NC","","_","_"
6,"_","_","_","tathā","CX","","_","_"
1,"_","_","_","pāṇḍya","NC","","_","_"
2,"_","_","_","kerala","NC","","_","_"
3,"_","_","_","cola","NC","","_","_"
4,"_","_","_","indra","NC","","_","_"
5,"_","_","_","tri","NUM","","_","_"
6,"_","_","_","tretāgni","NC","","_","_"
7,"yathā","_","_","yathā","CCM","","_","_"
1,"āsaneṣu","_","_","āsana","NC","","_","_"
2,"virājante","_","_","virāj","V","virāj","_","_"
3,"āśām","_","_","āśā","NC","","_","_"
4,"āgastyam","_","_","āgastya","NC","","_","_"
5,"āśritāḥ","_","_","āśri","PPP","","_","_"
1,"saṃkarṣaṇo","_","_","saṃkarṣaṇa","NC","","_","_"
2,"vāsudevo","_","_","vāsudeva","NC","","_","_"
3,"_","_","_","raukmiṇeya","NC","","_","_"
4,"_","_","_","ca","CCD","","_","_"
5,"vīryavān","_","_","vīryavat","JJ","","_","_"
1,"_","_","_","sāmba","NC","","_","_"
2,"_","_","_","ca","CCD","","_","_"
3,"_","_","_","cārudeṣṇa","NC","","_","_"
4,"_","_","_","ca","CCD","","_","_"
5,"sāraṇo","_","_","sāraṇa","NC","","_","_"
6,"'tha","_","_","atha","CAD","","_","_"
7,"_","_","_","gada","NC","","_","_"
8,"_","_","_","tathā","CX","","_","_"
1,"akrūraḥ","_","_","akrūra","NC","","_","_"
2,"_","_","_","sātyaki","NC","","_","_"
3,"_","_","_","ca","CCD","","_","_"
4,"_","_","_","eva","CEM","","_","_"
5,"_","_","_","uddhava","NC","","_","_"
6,"_","_","_","ca","CCD","","_","_"
7,"_","_","_","mahat","JJ","","_","_"
8,"_","_","_","bala","NC","","_","_"
1,"kṛtavarmā","_","_","kṛtavarman","NC","","_","_"
2,"ca","_","_","ca","CCD","","_","_"
3,"hārdikyaḥ","_","_","hārdikya","NC","","_","_"
4,"pṛthur","_","_","pṛthu","NC","","_","_"
5,"vipṛthur","_","_","vipṛthu","NC","","_","_"
6,"eva","_","_","eva","CEM","","_","_"
7,"ca","_","_","ca","CCD","","_","_"
1,"_","_","_","vidūratha","NC","","_","_"
2,"_","_","_","ca","CCD","","_","_"
3,"_","_","_","kaṅka","NC","","_","_"
4,"_","_","_","ca","CCD","","_","_"
1,"ye","_","_","yad","PRL","","_","_"
2,"_","_","_","ca","CCD","","_","_"
3,"_","_","_","anya","PPX","","_","_"
4,"_","_","_","yādava","NC","","_","_"
5,"_","_","_","tathā","CX","","_","_"
1,"_","_","_","āga","PPP","","_","_"
2,"_","_","_","tvat","PPR","","_","_"
3,"_","_","_","hetu","NC","","_","_"
4,"_","_","_","ca","CCD","","_","_"
5,"kṛṣṇe","_","_","kṛṣṇā","NC","","_","_"
6,"jānīhi","_","_","jān","V","jñā","_","_"
7,"satvaram","_","_","satvara","JJ","","_","_"
1,"kṛtavarmā","_","_","kṛtavarman","NC","","_","_"
2,"ca","_","_","ca","CCD","","_","_"
3,"hārdikyaḥ","_","_","hārdikya","NC","","_","_"
1,"_","_","_","śaṅku","NC","","_","_"
2,"_","_","_","ca","CCD","","_","_"
3,"_","_","_","sa_saha","CX","","_","_"
4,"_","_","_","gaveṣaṇa","NC","","_","_"
1,"āśāvaho","_","_","āśāvaha","NC","","_","_"
2,"_","_","_","aniruddha","NC","","_","_"
3,"_","_","_","ca","CCD","","_","_"
1,"vīro","_","_","vīra","NC","","_","_"
2,"_","_","_","vātapati","NC","","_","_"
3,"_","_","_","ca","CCD","","_","_"
4,"_","_","_","eva","CEM","","_","_"
5,"jhillī","_","_","jhillin","NC","","_","_"
6,"_","_","_","piṇḍāraka","NC","","_","_"
7,"_","_","_","tathā","CX","","_","_"
1,"_","_","_","uśīnara","NC","","_","_"
2,"_","_","_","ca","CCD","","_","_"
3,"vikrānto","_","_","vikrānta","NC","","_","_"
4,"_","_","_","vṛṣṇi","NC","","_","_"
5,"_","_","_","tvat","PPR","","_","_"
6,"prakīrtitāḥ","_","_","prakīrtay","PPP","","_","_"
1,"bhagīratho","_","_","bhagīratha","NC","","_","_"
2,"bṛhatkṣatraḥ","_","_","bṛhatkṣatra","NC","","_","_"
3,"_","_","_","saindhava","NC","","_","_"
4,"_","_","_","ca","CCD","","_","_"
5,"jayadrathaḥ","_","_","jayadratha","NC","","_","_"
1,"bṛhadratho","_","_","bṛhadratha","NC","","_","_"
2,"_","_","_","bāhlika","NC","","_","_"
3,"_","_","_","ca","CCD","","_","_"
4,"_","_","_","śrutāyu","NC","","_","_"
5,"_","_","_","ca","CCD","","_","_"
6,"_","_","_","mahat","JJ","","_","_"
7,"_","_","_","ratha","NC","","_","_"
1,"ulūkaḥ","_","_","ulūka","NC","","_","_"
2,"kaitavo","_","_","kaitava","NC","","_","_"
3,"rājā","_","_","rājan","NC","","_","_"
4,"_","_","_","citrāṅgada","NC","","_","_"
5,"_","_","_","śubhāṅgada","NC","","_","_"
1,"_","_","_","vatsa","NC","","_","_"
2,"_","_","_","rāja","NC","","_","_"
3,"_","_","_","ca","CCD","","_","_"
4,"dhṛtimān","_","_","dhṛtimat","NC","","_","_"
5,"_","_","_","kosala","NC","","_","_"
6,"_","_","_","adhipati","NC","","_","_"
7,"_","_","_","tathā","CX","","_","_"
1,"_","_","_","karṇa","NC","","_","_"
2,"_","_","_","ca","CCD","","_","_"
3,"saha","_","_","saha","CX","","_","_"
4,"putreṇa","_","_","putra","NC","","_","_"
5,"vṛṣasenena","_","_","vṛṣasa","NC","","_","_"
6,"vīryavān","_","_","vīryavat","JJ","","_","_"
1,"_","_","_","bṛhat","JJ","","_","_"
2,"_","_","_","bala","NC","","_","_"
3,"_","_","_","ca","CCD","","_","_"
4,"balavān","_","_","balavat","JJ","","_","_"
5,"rājā","_","_","rājan","NC","","_","_"
6,"_","_","_","ca","CCD","","_","_"
7,"_","_","_","eva","CEM","","_","_"
8,"_","_","_","atha","CAD","","_","_"
9,"durjayaḥ","_","_","durjaya","NC","","_","_"
1,"_","_","_","damaghoṣa","NC","","_","_"
2,"_","_","_","ātmaja","NC","","_","_"
3,"_","_","_","ca","CCD","","_","_"
4,"_","_","_","eva","CEM","","_","_"
5,"śiśupālo","_","_","śiśupāla","NC","","_","_"
6,"_","_","_","mahat","JJ","","_","_"
7,"_","_","_","bala","NC","","_","_"
1,"cedīnām","_","_","cedi","NC","","_","_"
2,"adhipo","_","_","adhipa","NC","","_","_"
3,"vīro","_","_","vīra","NC","","_","_"
4,"balavān","_","_","balavat","JJ","","_","_"
5,"_","_","_","antaka","NC","","_","_"
6,"_","_","_","upama","JJ","","_","_"
1,"_","_","_","prācya","JJ","","_","_"
2,"_","_","_","udīcya","JJ","","_","_"
3,"_","_","_","pratīcya","JJ","","_","_"
4,"_","_","_","ca","CCD","","_","_"
5,"dākṣiṇātyāḥ","_","_","dākṣiṇātya","JJ","","_","_"
6,"kṣitīśvarāḥ","_","_","kṣitīśvara","NC","","_","_"
1,"_","_","_","śiśupāla","NC","","_","_"
2,"_","_","_","ca","CCD","","_","_"
3,"vikrānto","_","_","vikrānta","NC","","_","_"
4,"_","_","_","jarāsaṃdha","NC","","_","_"
5,"_","_","_","tathā","CX","","_","_"
6,"_","_","_","eva","CEM","","_","_"
7,"ca","_","_","ca","CCD","","_","_"
1,"ete","_","_","tad","PRD","","_","_"
2,"_","_","_","ca","CCD","","_","_"
3,"_","_","_","anya","PPX","","_","_"
4,"ca","_","_","ca","CCD","","_","_"
5,"bahavo","_","_","bahu","JJ","","_","_"
6,"_","_","_","nānā","CX","","_","_"
7,"_","_","_","janapada","NC","","_","_"
8,"_","_","_","īśvara","NC","","_","_"
1,"_","_","_","tvat","PPR","","_","_"
2,"_","_","_","artha","NC","","_","_"
3,"āgatā","_","_","āga","PPP","","_","_"
4,"bhadre","_","_","bhadra","JJ","","_","_"
5,"kṣatriyāḥ","_","_","kṣatriya","NC","","_","_"
6,"prathitā","_","_","prath","PPP","","_","_"
7,"bhuvi","_","_","bhū","NC","","_","_"
1,"ete","_","_","tad","PRD","","_","_"
2,"vetsyanti","_","_","vid","V","vid","_","_"
3,"_","_","_","vikra","PPP","","_","_"
4,"_","_","_","tvat","PPR","","_","_"
5,"_","_","_","artha","NC","","_","_"
6,"lakṣyam","_","_","lakṣya","NC","","_","_"
7,"uttamam","_","_","uttama","JJ","","_","_"
1,"vidhyeta","_","_","vyadh","V","vyadh","_","_"
2,"ya","_","_","yad","PRL","","_","_"
3,"imaṃ","_","_","ida","PRD","","_","_"
4,"lakṣyaṃ","_","_","lakṣya","NC","","_","_"
5,"varayethāḥ","_","_","varay","V","varay","_","_"
6,"śubhe","_","_","śubha","JJ","","_","_"
7,"'dya","_","_","adya","CX","","_","_"
8,"tam","_","_","tad","PRD","","_","_"
