"WordID","word","NormSTEM","suffix","lemma","PoS","Root","NormSuffix","NormWord"
1,"nāradād","_","_","nārada","NC","","_","_"
2,"yāś","_","_","yad","PRL","","_","_"
3,"ca","_","_","ca","CCD","","_","_"
4,"munayo","_","_","muni","NC","","_","_"
5,"yamaṃ","_","_","yama","NC","","_","_"
6,"_","_","_","dharma","NC","","_","_"
7,"_","_","_","bhṛt","JJ","","_","_"
8,"varam","_","_","vara","JJ","","_","_"
1,"praṇamya","_","_","praṇa","CGDA","","_","_"
2,"sukham","_","_","sukha","NC","","_","_"
3,"āsīnaṃ","_","_","ās","PPP","","_","_"
4,"vṛddhaṃ","_","_","vṛdh","PPP","","_","_"
5,"_","_","_","jñāna","NC","","_","_"
6,"_","_","_","vid","JJ","","_","_"
7,"varam","_","_","vara","JJ","","_","_"
1,"papracchur","_","_","pṛcch","V","prach","_","_"
2,"vaidikaṃ","_","_","vaidika","JJ","","_","_"
3,"karma","_","_","karman","NC","","_","_"
4,"_","_","_","sarva","JQ","","_","_"
5,"_","_","_","loka","NC","","_","_"
6,"_","_","_","upakāraka","JJ","","_","_"
1,"_","_","_","sarva","JQ","","_","_"
2,"_","_","_","pāpa","NC","","_","_"
3,"_","_","_","kṣaya","NC","","_","_"
4,"_","_","_","kara","JJ","","_","_"
5,"_","_","_","śravaṇa","NC","","_","_"
6,"_","_","_","ājñāna","NC","","_","_"
7,"_","_","_","mahat","JJ","","_","_"
1,"_","_","_","mahat","JJ","","_","_"
2,"_","_","_","ṛṣi","NC","","_","_"
3,"sampravakṣyāmi","_","_","saṃpravak","V","saṃpravac","_","_"
4,"yamo","_","_","yama","NC","","_","_"
5,"na","_","_","na","CNG","","_","_"
6,"_","_","_","tvat","PPR","","_","_"
7,"_","_","_","atri","NC","","_","_"
8,"_","_","_","locana","NC","","_","_"
1,"saṃgṛhya","_","_","saṃgrah","CGDA","","_","_"
2,"dharmaśāstrāṇi","_","_","dharmaśāstra","NC","","_","_"
3,"_","_","_","sarva","JQ","","_","_"
4,"_","_","_","loka","NC","","_","_"
5,"_","_","_","upakāraka","JJ","","_","_"
1,"_","_","_","svap","PPP","","_","_"
2,"_","_","_","utthā","CGDA","","_","_"
3,"uṣaḥ","_","_","prātar","CX","","_","_"
4,"_","_","_","āca","CGDA","","_","_"
5,"_","_","_","atha","CAD","","_","_"
6,"_","_","_","hara","NC","","_","_"
7,"ācamyāthaharaṃ","_","_","smar","V","smṛ","_","_"
1,"_","_","_","uttha","NC","","_","_"
2,"_","_","_","ayana","NC","","_","_"
3,"ṛte","_","_","ṛte","CX","","_","_"
4,"_","_","_","mala","NC","","_","_"
5,"_","_","_","mūtra","NC","","_","_"
6,"malamūtre","_","_","visarjay","V","visarjay","_","_"
1,"ataraṅgatvā","_","_","tṛṇa","NC","","_","_"
2,"tṛṇair","_","_","ācchāday","CGDA","","_","_"
3,"ācchādya","_","_","medinī","NC","","_","_"
1,"śiraḥ","_","_","śiras","NC","","_","_"
2,"prāvṛtya","_","_","prāvṛ","CGDA","","_","_"
3,"vastreṇa","_","_","vastra","NC","","_","_"
4,"_","_","_","pidhā","CGDA","","_","_"
5,"_","_","_","āsya","NC","","_","_"
6,"kareṇa","_","_","kara","NC","","_","_"
7,"ca","_","_","ca","CCD","","_","_"
1,"_","_","_","uttara","JJ","","_","_"
2,"_","_","_","ādi","NC","","_","_"
3,"_","_","_","mukha","NC","","_","_"
4,"kuryāt","_","_","kar","V","kṛ","_","_"
5,"saṃdhyayor","_","_","saṃdhyā","NC","","_","_"
6,"_","_","_","mala","NC","","_","_"
7,"_","_","_","mūtraka","NC","","_","_"
1,"_","_","_","divā","CX","","_","_"
2,"_","_","_","uttara","JJ","","_","_"
3,"_","_","_","mukha","NC","","_","_"
4,"kuryād","_","_","kar","V","kṛ","_","_"
5,"rātrau","_","_","rātri","NC","","_","_"
6,"_","_","_","yāmya","JJ","","_","_"
7,"_","_","_","hariṅmukha","JJ","","_","_"
1,"_","_","_","pratyañc","JJ","","_","_"
2,"_","_","_","mukha","NC","","_","_"
3,"tu","_","_","tu","CCD","","_","_"
4,"pūrvāhṇe","_","_","pūrvāhṇa","NC","","_","_"
5,"parāhṇe","_","_","parāhṇa","NC","","_","_"
6,"_","_","_","hari","NC","","_","_"
7,"_","_","_","diś","NC","","_","_"
8,"_","_","_","mukha","NC","","_","_"
1,"na","_","_","na","CNG","","_","_"
2,"kedāre","_","_","kedāra","NC","","_","_"
3,"na","_","_","na","CNG","","_","_"
4,"setau","_","_","setu","NC","","_","_"
5,"ca","_","_","ca","CCD","","_","_"
6,"_","_","_","na","CNG","","_","_"
7,"_","_","_","aśuci","JJ","","_","_"
8,"na","_","_","na","CNG","","_","_"
9,"ca","_","_","ca","CCD","","_","_"
10,"bhūruhe","_","_","bhūruha","NC","","_","_"
1,"gaṇḍūṣayen","_","_","gaṇḍūṣay","V","gaṇḍūṣay","_","_"
2,"mūtrayed","_","_","mūtray","V","mūtray","_","_"
3,"vā","_","_","vā","CCD","","_","_"
4,"_","_","_","nadī","NC","","_","_"
5,"_","_","_","devālaya","NC","","_","_"
6,"_","_","_","antika","NC","","_","_"
1,"_","_","_","danta","NC","","_","_"
2,"_","_","_","śuddhi","NC","","_","_"
3,"ca","_","_","ca","CCD","","_","_"
4,"yaḥ","_","_","yad","PRL","","_","_"
5,"kuryāt","_","_","kar","V","kṛ","_","_"
6,"pacyate","_","_","pac","V","pac","_","_"
7,"_","_","_","naraka","NC","","_","_"
8,"_","_","_","ādi","NC","","_","_"
1,"_","_","_","grah","PPP","","_","_"
2,"_","_","_","śiśna","NC","","_","_"
3,"_","_","_","ca","CCD","","_","_"
4,"_","_","_","utthā","CGDA","","_","_"
5,"_","_","_","maunī","NC","","_","_"
6,"_","_","_","vastra","NC","","_","_"
7,"_","_","_","avakuṇṭhita","JJ","","_","_"
1,"pūrvam","_","_","pūrva","CX","","_","_"
2,"_","_","_","uddhṛ","PPP","","_","_"
3,"_","_","_","toya","NC","","_","_"
4,"śaucaṃ","_","_","śauca","NC","","_","_"
5,"kuryāt","_","_","kar","V","kṛ","_","_"
6,"tathā","_","_","tathā","CX","","_","_"
7,"mṛdā","_","_","mṛd","NC","","_","_"
1,"na","_","_","na","CNG","","_","_"
1,"_","_","_","na","CNG","","_","_"
2,"_","_","_","anya","PPX","","_","_"
3,"_","_","_","śiṣ","PPP","","_","_"
4,"ca","_","_","ca","CCD","","_","_"
5,"_","_","_","na","CNG","","_","_"
6,"_","_","_","ārdra","JJ","","_","_"
7,"ca","_","_","ca","CCD","","_","_"
8,"_","_","_","śauca","NC","","_","_"
9,"_","_","_","artha","NC","","_","_"
10,"mṛdam","_","_","mṛd","NC","","_","_"
11,"āharet","_","_","āhar","V","āhṛ","_","_"
1,"_","_","_","guda","NC","","_","_"
2,"_","_","_","iṣ","PPP","","_","_"
3,"dvādaśabhiḥ","_","_","dvādaśan","NUM","","_","_"
4,"mṛdbhiḥ","_","_","mṛd","NC","","_","_"
5,"ṣoḍaśabhiś","_","_","ṣoḍaśan","JJ","","_","_"
6,"ca","_","_","ca","CCD","","_","_"
7,"vā","_","_","vā","CCD","","_","_"
1,"caturviṃśatibhiś","_","_","caturviṃśati","NC","","_","_"
2,"_","_","_","ca","CCD","","_","_"
3,"_","_","_","api","CX","","_","_"
4,"_","_","_","atha","CAD","","_","_"
5,"_","_","_","api","CX","","_","_"
6,"athāpi","_","_","vā","CCD","","_","_"
1,"nyūnādhikān","_","_","nyūnādhika","JJ","","_","_"
2,"akartavyā","_","_","asaṃkhya","JJ","","_","_"
3,"asaṃkhyāś","_","_","ca","CCD","","_","_"
4,"ca","_","_","vṛthā","CX","","_","_"
5,"vṛthā","_","_","bhav","V","bhū","_","_"
1,"yāvad","_","_","yāvat","CX","","_","_"
2,"_","_","_","gandha","NC","","_","_"
3,"_","_","_","kṣaya","NC","","_","_"
4,"_","_","_","vā","CCD","","_","_"
5,"_","_","_","api","CX","","_","_"
6,"śaucaṃ","_","_","śauca","NC","","_","_"
7,"kuryād","_","_","kar","V","kṛ","_","_"
8,"viśuddhaye","_","_","viśuddhi","NC","","_","_"
1,"_","_","_","ādi","NC","","_","_"
2,"_","_","_","anta","NC","","_","_"
3,"_","_","_","śodhana","NC","","_","_"
4,"kuryāt","_","_","kar","V","kṛ","_","_"
5,"_","_","_","śauca","NC","","_","_"
6,"_","_","_","sthala","NC","","_","_"
7,"_","_","_","aharniśa","NC","","_","_"
1,"_","_","_","no","CX","","_","_"
2,"_","_","_","ced","CX","","_","_"
3,"pitṝn","_","_","pitṛ","NC","","_","_"
4,"bhakṣayati","_","_","bhakṣay","V","bhakṣay","_","_"
5,"svayaṃ","_","_","svaya","CX","","_","_"
6,"_","_","_","ca","CCD","","_","_"
7,"a","_","_","alpha_privativum","JJ","","_","_"
7,"_","_","_","śucita","JJ","","_","_"
8,"vrajet","_","_","vraj","V","vraj","_","_"
1,"_","_","_","liṅga","NC","","_","_"
2,"_","_","_","iti","CQT","","_","_"
3,"saḥ","_","_","tad","PRD","","_","_"
4,"kare","_","_","kara","NC","","_","_"
5,"vāme","_","_","vāma","JJ","","_","_"
6,"_","_","_","daśā","NC","","_","_"
7,"_","_","_","saptan","NUM","","_","_"
8,"ca","_","_","ca","CCD","","_","_"
9,"dakṣiṇe","_","_","dakṣiṇa","JJ","","_","_"
1,"pādayoḥ","_","_","pāda","NC","","_","_"
2,"sapta","_","_","saptan","NUM","","_","_"
3,"vā","_","_","vā","CCD","","_","_"
4,"tisro","_","_","tri","NUM","","_","_"
5,"_","_","_","mṛd","NC","","_","_"
6,"_","_","_","āmalaka","NC","","_","_"
7,"_","_","_","mātrā","NC","","_","_"
1,"_","_","_","mala","NC","","_","_"
2,"_","_","_","visarga","NC","","_","_"
3,"tu","_","_","tu","CCD","","_","_"
4,"_","_","_","mūtra","NC","","_","_"
5,"_","_","_","śauca","NC","","_","_"
6,"tu","_","_","tu","CCD","","_","_"
7,"kathyate","_","_","kath","V","kath","_","_"
1,"kare","_","_","kara","NC","","_","_"
2,"tisraḥ","_","_","tri","NUM","","_","_"
3,"dve","_","_","dvi","NUM","","_","_"
4,"vā","_","_","vā","CCD","","_","_"
5,"pañca","_","_","pañcan","NUM","","_","_"
6,"ca","_","_","ca","CCD","","_","_"
7,"hastayoḥ","_","_","hasta","NC","","_","_"
1,"_","_","_","savya","JJ","","_","_"
2,"_","_","_","hasta","NC","","_","_"
3,"bahir","_","_","bahis","CX","","_","_"
4,"jānau","_","_","jānu","NC","","_","_"
5,"_","_","_","apaśya","JJ","","_","_"
6,"_","_","_","eva","CEM","","_","_"
7,"tad","_","_","tad","PRD","","_","_"
8,"antarā","_","_","antarā","CX","","_","_"
1,"evaṃ","_","_","eva","CX","","_","_"
2,"śocaṃ","_","_","dvija","NC","","_","_"
3,"dvijaḥ","_","_","kṛ","CGDA","","_","_"
4,"_","_","_","ājānu","CX","","_","_"
5,"_","_","_","kṣālay","V","kṣālay","_","_"
6,"ājānukṣālayet","_","_","pada","NC","","_","_"
1,"_","_","_","śauca","NC","","_","_"
2,"_","_","_","ittha","CX","","_","_"
3,"gṛhasthasya","_","_","gṛhastha","NC","","_","_"
4,"varṇī","_","_","varṇin","NC","","_","_"
5,"tu","_","_","tu","CCD","","_","_"
6,"dviguṇaṃ","_","_","dviguṇa","JJ","","_","_"
7,"caret","_","_","car","V","car","_","_"
1,"triguṇaṃ","_","_","triguṇa","JJ","","_","_"
2,"tu","_","_","tu","CCD","","_","_"
3,"vanasthasya","_","_","vanastha","NC","","_","_"
4,"yatīnāṃ","_","_","yati","NC","","_","_"
5,"tu","_","_","tu","CCD","","_","_"
6,"caturguṇam","_","_","caturguṇa","JJ","","_","_"
1,"_","_","_","strī","NC","","_","_"
2,"_","_","_","śūdra","NC","","_","_"
3,"yathā","_","_","yathā","CCM","","_","_"
4,"śocaṃ","_","_","sarva","JQ","","_","_"
5,"sarveṣāṃ","_","_","ca","CCD","","_","_"
6,"ca","_","_","manas","NC","","_","_"
7,"manaḥ","_","_","śuci","JJ","","_","_"
1,"kṛtvā","_","_","kṛ","CGDA","","_","_"
2,"_","_","_","dvādaśan","NUM","","_","_"
3,"_","_","_","gaṇḍūṣa","NC","","_","_"
4,"_","_","_","mala","NC","","_","_"
5,"_","_","_","sūtra","NC","","_","_"
6,"tu","_","_","tu","CCD","","_","_"
7,"ṣaḍ","_","_","ṣaṣ","NUM","","_","_"
8,"bhavet","_","_","bhav","V","bhū","_","_"
1,"praveśayet","_","_","praviś","V","praviś","_","_"
2,"karaṃ","_","_","kara","NC","","_","_"
3,"savyaṃ","_","_","savya","JJ","","_","_"
4,"jale","_","_","jala","NC","","_","_"
5,"cāmaṇi","_","_","bandhana","NC","","_","_"
1,"tata","_","_","tatas","CX","","_","_"
2,"_","_","_","ādā","CGDA","","_","_"
3,"_","_","_","hasta","NC","","_","_"
4,"prāṅmukhaḥ","_","_","prāṅmukha","JJ","","_","_"
5,"salilaṃ","_","_","salila","NC","","_","_"
6,"pibet","_","_","pib","V","pā","_","_"
1,"samantrakam","_","_","samantraka","JJ","","_","_"
2,"aśabdaṃ","_","_","aśabda","JJ","","_","_"
3,"ca","_","_","ca","CCD","","_","_"
4,"_","_","_","hṛdaya","NC","","_","_"
5,"_","_","_","stha","JJ","","_","_"
6,"jale","_","_","jala","NC","","_","_"
7,"punaḥ","_","_","punar","CAD","","_","_"
1,"ca","_","_","ca","CCD","","_","_"
2,"_","_","_","dvādaśan","NUM","","_","_"
3,"_","_","_","aṅga","NC","","_","_"
4,"saṃspṛśet","_","_","saṃspṛś","V","saṃspṛś","_","_"
1,"madhye","_","_","madhya","NC","","_","_"
2,"madhye","_","_","madhya","NC","","_","_"
3,"jalaṃ","_","_","jala","NC","","_","_"
4,"spṛśya","_","_","spṛś","CGDA","","_","_"
5,"_","_","_","tad","PRD","","_","_"
6,"_","_","_","tad","PRD","","_","_"
7,"evaṃ","_","_","eva","CX","","_","_"
8,"su","_","_","cintay","V","cintay","_","_"
1,"parimṛśya","_","_","parimṛś","CGDA","","_","_"
2,"dvir","_","_","dvis","CX","","_","_"
3,"āsyaṃ","_","_","āsya","NC","","_","_"
4,"tu","_","_","tu","CCD","","_","_"
5,"sakṛd","_","_","sakṛt","CX","","_","_"
6,"oṣṭhau","_","_","oṣṭha","NC","","_","_"
7,"parispṛśet","_","_","parispṛś","V","parispṛś","_","_"
1,"_","_","_","veda","NC","","_","_"
2,"_","_","_","traya","NC","","_","_"
3,"samuccāryam","_","_","samuccāray","KDG","","_","_"
4,"āṣamātrajalaṃ","_","_","pib","V","pā","_","_"
1,"tvaṃ","_","_","tvat","PPR","","_","_"
2,"nyūnam","_","_","nyūna","JJ","","_","_"
3,"adhikaṃ","_","_","adhika","JJ","","_","_"
4,"pītaṃ","_","_","pā","PPP","","_","_"
5,"_","_","_","sura","NC","","_","_"
6,"_","_","_","iti","CQT","","_","_"
7,"kavayo","_","_","kavi","NC","","_","_"
8,"viduḥ","_","_","vid","V","vid","_","_"
1,"vyāhṛtībhiś","_","_","vyāhṛti","NC","","_","_"
2,"_","_","_","catur","NUM","","_","_"
3,"_","_","_","vāra","NC","","_","_"
4,"triḥ","_","_","tris","CX","","_","_"
5,"pibet","_","_","pib","V","pā","_","_"
6,"praṇavena","_","_","praṇava","NC","","_","_"
7,"vā","_","_","vā","CCD","","_","_"
1,"sāvitryā","_","_","sāvitrī","NC","","_","_"
2,"va","_","_","pib","V","pā","_","_"
3,"pibed","_","_","tris","CX","","_","_"
4,"ambū","_","_","pib","V","pā","_","_"
5,"_","_","_","vā","CCD","","_","_"
6,"_","_","_","api","CX","","_","_"
1,"_","_","_","gokarṇa","NC","","_","_"
2,"_","_","_","vat","CX","","_","_"
3,"karaṃ","_","_","kara","NC","","_","_"
4,"kṛtvā","_","_","kṛ","CGDA","","_","_"
5,"gṛhṇīyād","_","_","grah","V","grah","_","_"
6,"_","_","_","deva","NC","","_","_"
7,"_","_","_","tīrtha","NC","","_","_"
1,"pibe","_","_","piba","JJ","","_","_"
2,"ca","_","_","ca","CCD","","_","_"
3,"brahmatīrthe","_","_","brahmatīrtha","NC","","_","_"
4,"na","_","_","na","CNG","","_","_"
5,"divā","_","_","divā","CX","","_","_"
6,"vīkṣya","_","_","vīkṣ","CGDA","","_","_"
7,"jalaṃ","_","_","jala","NC","","_","_"
8,"pibet","_","_","pib","V","pā","_","_"
1,"pibed","_","_","pib","V","pā","_","_"
2,"vipro","_","_","vipra","NC","","_","_"
3,"jale","_","_","jala","NC","","_","_"
4,"_","_","_","karman","NC","","_","_"
5,"_","_","_","stha","JJ","","_","_"
6,"karmasthe","_","_","bāhuja","NC","","_","_"
7,"bāhujaḥ","_","_","punar","CAD","","_","_"
1,"vaiśyāśūdrās","_","_","vaiśyāśūdra","NC","","_","_"
2,"tathā","_","_","tathā","CX","","_","_"
3,"nārya","_","_","nārī","NC","","_","_"
4,"_","_","_","āsya","NC","","_","_"
5,"_","_","_","stha","JJ","","_","_"
6,"ca","_","_","ca","CCD","","_","_"
7,"punāti","_","_","pū","V","pū","_","_"
8,"ca","_","_","ca","CCD","","_","_"
1,"pavitraṃ","_","_","pavitra","NC","","_","_"
2,"dhārayan","_","_","dhāray","KDP","","_","_"
3,"vipraḥ","_","_","vipra","NC","","_","_"
4,"_","_","_","śuddha","JJ","","_","_"
5,"_","_","_","ācamana","NC","","_","_"
6,"ācaret","_","_","ācar","V","ācar","_","_"
1,"matyājyaṃ","_","_","pavitra","NC","","_","_"
2,"pavitraṃ","_","_","tu","CCD","","_","_"
1,"brahmagandhiṃ","_","_","brahmagandhi","NC","","_","_"
2,"_","_","_","karman","NC","","_","_"
3,"_","_","_","kāla","NC","","_","_"
4,"_","_","_","bhukti","NC","","_","_"
5,"_","_","_","kāla","NC","","_","_"
6,"ca","_","_","ca","CCD","","_","_"
7,"vartulam","_","_","vartula","NC","","_","_"
1,"catubhir","_","_","catu","JJ","","_","_"
2,"_","_","_","darbha","NC","","_","_"
3,"_","_","_","piñjūlī","NC","","_","_"
4,"brāhmaṇasya","_","_","brāhmaṇa","NC","","_","_"
5,"pavitrakam","_","_","pavitraka","NC","","_","_"
1,"_","_","_","eka","PPX","","_","_"
2,"_","_","_","eka","PPX","","_","_"
3,"nyūnam","_","_","nyūna","JJ","","_","_"
4,"uddiṣṭaṃ","_","_","uddiś","PPP","","_","_"
5,"varṇe","_","_","varṇa","NC","","_","_"
6,"varṇe","_","_","varṇa","NC","","_","_"
7,"yathā","_","_","yathā","CCM","","_","_"
8,"kramam","_","_","krama","NC","","_","_"
1,"_","_","_","danta","NC","","_","_"
2,"_","_","_","śuddhi","NC","","_","_"
3,"tataḥ","_","_","tatas","CX","","_","_"
4,"kuryād","_","_","kar","V","kṛ","_","_"
5,"dantakāṣṭhaiḥ","_","_","dantakāṣṭha","NC","","_","_"
6,"śubhaiḥ","_","_","śubha","JJ","","_","_"
7,"samaiḥ","_","_","sama","PPX","","_","_"
1,"_","_","_","kṣīravṛkṣa","NC","","_","_"
2,"_","_","_","udbhava","JJ","","_","_"
3,"kuryād","_","_","kar","V","kṛ","_","_"
4,"yad","_","_","yad","PRL","","_","_"
5,"vā","_","_","vā","CCD","","_","_"
6,"_","_","_","kaṇṭaka","NC","","_","_"
7,"_","_","_","vṛkṣaka","NC","","_","_"
1,"kramukaiḥ","_","_","kramuka","NC","","_","_"
2,"kāśaiḥ","_","_","kāśa","NC","","_","_"
3,"kharguraś","_","_","ca","CCD","","_","_"
4,"_","_","_","niṣidh","PPP","","_","_"
5,"_","_","_","ja","JJ","","_","_"
1,"na","_","_","na","CNG","","_","_"
2,"kurddantasi","_","_","ca","CCD","","_","_"
3,"śuddhyaṃ","_","_","kṛ","CGDA","","_","_"
4,"ca","_","_","tyaj","JJ","","_","_"
5,"kṛtvā","_","_","bhav","V","bhū","_","_"
1,"_","_","_","krameṇa","CX","","_","_"
2,"_","_","_","eva","CEM","","_","_"
3,"_","_","_","manda","JJ","","_","_"
4,"_","_","_","yantra","NC","","_","_"
5,"kārayet","_","_","kar","V","kṛ","_","_"
1,"_","_","_","bhū","PPP","","_","_"
2,"_","_","_","ṣaṣṭhī","NC","","_","_"
3,"navabhyām","_","_","navan","NUM","","_","_"
4,"_","_","_","atha","CAD","","_","_"
5,"_","_","_","parvan","NC","","_","_"
1,"śrāddhāhe","_","_","śrāddhāha","NC","","_","_"
2,"_","_","_","danta","NC","","_","_"
3,"_","_","_","śuddhi","NC","","_","_"
4,"ced","_","_","ced","CX","","_","_"
5,"dahaty","_","_","dah","V","dah","_","_"
6,"_","_","_","āsaptama","JJ","","_","_"
7,"_","_","_","kula","NC","","_","_"
1,"_","_","_","saptamī","NC","","_","_"
2,"_","_","_","asita","JJ","","_","_"
3,"_","_","_","arka","NC","","_","_"
4,"śravaṇe","_","_","śravaṇa","NC","","_","_"
1,"na","_","_","na","CNG","","_","_"
2,"kuryād","_","_","kar","V","kṛ","_","_"
3,"dantaśudhyaṃ","_","_","tad","PRD","","_","_"
1,"aindre","_","_","aindra","NC","","_","_"
2,"sampadam","_","_","sampad","NC","","_","_"
3,"āpnoti","_","_","āpn","V","āp","_","_"
4,"aiśānyāṃ","_","_","aiśānī","NC","","_","_"
5,"_","_","_","sarva","JQ","","_","_"
6,"_","_","_","siddhi","NC","","_","_"
1,"itaratra","_","_","itaratra","CX","","_","_"
2,"mahān","_","_","mahat","JJ","","_","_"
3,"doṣaḥ","_","_","doṣa","NC","","_","_"
4,"_","_","_","putra","NC","","_","_"
5,"_","_","_","strī","NC","","_","_"
6,"_","_","_","paśu","NC","","_","_"
7,"_","_","_","nāśana","JJ","","_","_"
1,"evaṃ","_","_","eva","CX","","_","_"
2,"dantānūśucī","_","_","kṛ","CGDA","","_","_"
3,"kṛtvā","_","_","punar","CAD","","_","_"
4,"punar","_","_","āca","CGDA","","_","_"
5,"ācamya","_","_","buddhimat","JJ","","_","_"
1,"saṃkalpya","_","_","saṃkalpay","CGDA","","_","_"
2,"vidhipūrvaṃ","_","_","vidhipūrva","CX","","_","_"
3,"tu","_","_","tu","CCD","","_","_"
4,"tataḥ","_","_","tatas","CX","","_","_"
5,"snātum","_","_","snā","CGDI","","_","_"
6,"upakramet","_","_","upakram","V","upakram","_","_"
