"WordID","word","NormSTEM","suffix","lemma","PoS","Root","NormSuffix","NormWord"
1,"yā","_","_","yad","PRL","","_","_"
2,"ta","_","_","tvat","PPR","","_","_"
3,"ūtir","_","_","ūti","NC","","_","_"
4,"avamā","_","_","avama","JJ","","_","_"
5,"yā","_","_","yad","PRL","","_","_"
6,"paramā","_","_","parama","JJ","","_","_"
7,"yā","_","_","yad","PRL","","_","_"
8,"_","_","_","madhyama","JJ","","_","_"
9,"_","_","_","indra","NC","","_","_"
10,"śuṣminn","_","_","śuṣmin","JJ","","_","_"
11,"asti","_","_","as","V","as","_","_"
1,"tābhir","_","_","tad","PRD","","_","_"
2,"ū","_","_","u","CEM","","_","_"
3,"ṣu","_","_","su","CAD","","_","_"
4,"_","_","_","vṛtra","NC","","_","_"
5,"_","_","_","hatya","NC","","_","_"
6,"'vīr","_","_","av","V","av","_","_"
7,"na","_","_","mat","PPR","","_","_"
8,"ebhiś","_","_","ida","PRD","","_","_"
9,"ca","_","_","ca","CCD","","_","_"
10,"vājair","_","_","vāja","NC","","_","_"
11,"mahān","_","_","mahat","JJ","","_","_"
12,"na","_","_","mat","PPR","","_","_"
13,"ugra","_","_","ugra","JJ","","_","_"
1,"ābhi","_","_","ida","PRD","","_","_"
2,"spṛdho","_","_","spṛdh","NC","","_","_"
3,"mithatīr","_","_","mith","KDP","","_","_"
4,"_","_","_","a","CNG","","_","_"
5,"_","_","_","riṣaṇy","KDP","","_","_"
6,"amitrasya","_","_","amitra","NC","","_","_"
7,"vyathayā","_","_","vyathay","V","vyathay","_","_"
8,"manyum","_","_","manyu","NC","","_","_"
9,"indra","_","_","indra","NC","","_","_"
1,"ābhir","_","_","ida","PRD","","_","_"
2,"viśvā","_","_","viśva","JQ","","_","_"
3,"abhiyujo","_","_","abhiyuj","NC","","_","_"
4,"viṣūcīr","_","_","viṣvañc","JJ","","_","_"
5,"āryāya","_","_","ārya","NC","","_","_"
6,"viśo","_","_","viś","NC","","_","_"
7,"'va","_","_","ava","CX","","_","_"
8,"tārīr","_","_","tar","V","tṛ","_","_"
9,"dāsīḥ","_","_","dāsa","JJ","","_","_"
1,"indra","_","_","indra","NC","","_","_"
2,"jāmaya","_","_","jāmi","JJ","","_","_"
3,"uta","_","_","uta","CCD","","_","_"
4,"ye","_","_","yad","PRL","","_","_"
5,"'jāmayo","_","_","ajāmi","JJ","","_","_"
6,"'rvācīnāso","_","_","arvācīna","JJ","","_","_"
7,"vanuṣo","_","_","vanus","JJ","","_","_"
8,"yuyujre","_","_","yuj","V","yuj","_","_"
1,"tvam","_","_","tvat","PPR","","_","_"
2,"eṣāṃ","_","_","ida","PRD","","_","_"
3,"vithurā","_","_","vithura","JJ","","_","_"
4,"śavāṃsi","_","_","śavas","NC","","_","_"
5,"jahi","_","_","han","V","han","_","_"
6,"vṛṣṇyāni","_","_","vṛṣṇya","NC","","_","_"
7,"kṛṇuhī","_","_","kar","V","kṛ","_","_"
8,"parācaḥ","_","_","parāñc","JJ","","_","_"
1,"śūro","_","_","śūra","NC","","_","_"
2,"vā","_","_","vā","CCD","","_","_"
3,"śūraṃ","_","_","śūra","NC","","_","_"
4,"vanate","_","_","van","V","van","_","_"
5,"śarīrais","_","_","śarīra","NC","","_","_"
6,"tanūrucā","_","_","tanūruc","JJ","","_","_"
7,"taruṣi","_","_","tarus","NC","","_","_"
8,"yat","_","_","yat","CSB","","_","_"
9,"kṛṇvaite","_","_","kar","V","kṛ","_","_"
1,"toke","_","_","toka","NC","","_","_"
2,"vā","_","_","vā","CCD","","_","_"
3,"goṣu","_","_","go","NC","","_","_"
4,"tanaye","_","_","tanaya","JJ","","_","_"
5,"yad","_","_","yat","CSB","","_","_"
6,"apsu","_","_","ap","NC","","_","_"
7,"vi","_","_","vi","CADP","","_","_"
8,"krandasī","_","_","krandas","NC","","_","_"
9,"urvarāsu","_","_","urvarā","NC","","_","_"
10,"bravaite","_","_","abravīta","V","brū","_","_"
1,"nahi","_","_","nahi","CX","","_","_"
2,"tvā","_","_","tvat","PPR","","_","_"
3,"śūro","_","_","śūra","JJ","","_","_"
4,"na","_","_","na","CNG","","_","_"
5,"turo","_","_","tura","JJ","","_","_"
6,"na","_","_","na","CNG","","_","_"
7,"dhṛṣṇur","_","_","dhṛṣṇu","JJ","","_","_"
8,"na","_","_","na","CNG","","_","_"
9,"tvā","_","_","tvat","PPR","","_","_"
10,"yodho","_","_","yodha","NC","","_","_"
11,"manyamāno","_","_","man","KDP","","_","_"
12,"yuyodha","_","_","yudh","V","yudh","_","_"
1,"indra","_","_","indra","NC","","_","_"
2,"nakiṣ","_","_","nakir","CX","","_","_"
3,"ṭvā","_","_","tvat","PPR","","_","_"
4,"praty","_","_","prati","CADP","","_","_"
5,"asty","_","_","as","V","as","_","_"
6,"eṣāṃ","_","_","ida","PRD","","_","_"
7,"viśvā","_","_","viśva","JQ","","_","_"
8,"jātāny","_","_","jāta","NC","","_","_"
9,"abhy","_","_","abhi","CADP","","_","_"
10,"asi","_","_","as","V","as","_","_"
11,"tāni","_","_","tad","PRD","","_","_"
1,"sa","_","_","tad","PRD","","_","_"
2,"patyata","_","_","paty","V","paty","_","_"
3,"ubhayor","_","_","ubhaya","JJ","","_","_"
4,"nṛmṇam","_","_","nṛmṇa","NC","","_","_"
5,"ayor","_","_","ida","PRD","","_","_"
6,"yadī","_","_","yadi","CSB","","_","_"
7,"vedhasaḥ","_","_","vedhas","NC","","_","_"
8,"samithe","_","_","samitha","NC","","_","_"
9,"havante","_","_","hve","V","hve","_","_"
1,"vṛtre","_","_","vṛtra","NC","","_","_"
2,"vā","_","_","vā","CCD","","_","_"
3,"maho","_","_","mah","JJ","","_","_"
4,"nṛvati","_","_","nṛvat","JJ","","_","_"
5,"kṣaye","_","_","kṣaya","NC","","_","_"
6,"vā","_","_","vā","CCD","","_","_"
7,"vyacasvantā","_","_","vyacasvat","JJ","","_","_"
8,"yadi","_","_","yadi","CSB","","_","_"
9,"vitantasaite","_","_","vitantas","V","vitantas","_","_"
1,"adha","_","_","adha","CX","","_","_"
2,"smā","_","_","sma","CX","","_","_"
3,"te","_","_","tvat","PPR","","_","_"
4,"carṣaṇayo","_","_","carṣaṇi","NC","","_","_"
5,"yad","_","_","yat","CSB","","_","_"
6,"ejān","_","_","ej","V","ej","_","_"
7,"indra","_","_","indra","NC","","_","_"
8,"_","_","_","trātṛ","NC","","_","_"
9,"_","_","_","uta","CCD","","_","_"
10,"bhavā","_","_","bhav","V","bhū","_","_"
11,"varūtā","_","_","varūtṛ","JJ","","_","_"
1,"asmākāso","_","_","asmāka","JJ","","_","_"
2,"ye","_","_","yad","PRL","","_","_"
3,"nṛtamāso","_","_","nṛtama","JJ","","_","_"
4,"arya","_","_","ari","JJ","","_","_"
5,"indra","_","_","indra","NC","","_","_"
6,"sūrayo","_","_","sūri","NC","","_","_"
7,"dadhire","_","_","dadh","V","dhā","_","_"
8,"puro","_","_","puras","CX","","_","_"
9,"naḥ","_","_","mat","PPR","","_","_"
1,"anu","_","_","anu","CADP","","_","_"
2,"te","_","_","tvat","PPR","","_","_"
3,"dāyi","_","_","dad","V","dā","_","_"
4,"maha","_","_","mah","JJ","","_","_"
5,"indriyāya","_","_","indriya","NC","","_","_"
6,"satrā","_","_","satrā","CX","","_","_"
7,"te","_","_","tvat","PPR","","_","_"
8,"viśvam","_","_","viśva","JQ","","_","_"
9,"anu","_","_","anu","CADP","","_","_"
10,"_","_","_","vṛtra","NC","","_","_"
11,"_","_","_","hatya","NC","","_","_"
1,"anu","_","_","anu","CADP","","_","_"
2,"kṣatram","_","_","kṣatra","NC","","_","_"
3,"anu","_","_","anu","CADP","","_","_"
4,"saho","_","_","sahas","NC","","_","_"
5,"_","_","_","yajatra","JJ","","_","_"
6,"_","_","_","indra","NC","","_","_"
7,"devebhir","_","_","deva","NC","","_","_"
8,"anu","_","_","anu","CADP","","_","_"
9,"te","_","_","tvat","PPR","","_","_"
10,"nṛṣahye","_","_","nṛṣahya","NC","","_","_"
1,"evā","_","_","eva","CEM","","_","_"
2,"na","_","_","mat","PPR","","_","_"
3,"spṛdhaḥ","_","_","spṛdh","NC","","_","_"
4,"sam","_","_","sa","CADP","","_","_"
5,"ajā","_","_","aj","V","aj","_","_"
6,"samatsv","_","_","samad","NC","","_","_"
7,"indra","_","_","indra","NC","","_","_"
8,"rārandhi","_","_","ran","V","ran","_","_"
9,"mithatīr","_","_","mith","KDP","","_","_"
10,"adevīḥ","_","_","adeva","JJ","","_","_"
1,"vidyāma","_","_","vid","V","vid","_","_"
2,"vastor","_","_","vastu","NC","","_","_"
3,"avasā","_","_","avas","NC","","_","_"
4,"gṛṇanto","_","_","gṛ","KDP","","_","_"
5,"bharadvājā","_","_","bharadvāja","NC","","_","_"
6,"uta","_","_","uta","CCD","","_","_"
7,"ta","_","_","tvat","PPR","","_","_"
8,"indra","_","_","indra","NC","","_","_"
9,"nūnam","_","_","nūna","CX","","_","_"
