"WordID","word","NormSTEM","suffix","lemma","PoS","Root","NormSuffix","NormWord"
1,"vaiśaṃpāyana","_","_","vaiśampāyana","NC","","_","_"
2,"uvāca","_","_","vak","V","vac","_","_"
1,"sa","_","_","tad","PRD","","_","_"
2,"evaṃ","_","_","eva","CX","","_","_"
3,"śaṃtanur","_","_","śaṃtanu","NC","","_","_"
4,"dhīmān","_","_","dhīmat","JJ","","_","_"
5,"_","_","_","deva","NC","","_","_"
6,"_","_","_","rājan","NC","","_","_"
7,"_","_","_","ṛṣi","NC","","_","_"
8,"_","_","_","satkṛ","PPP","","_","_"
1,"_","_","_","dharma","NC","","_","_"
2,"_","_","_","ātman","NC","","_","_"
3,"_","_","_","sarva","JQ","","_","_"
4,"_","_","_","loka","NC","","_","_"
5,"_","_","_","satya","JJ","","_","_"
6,"_","_","_","vāc","NC","","_","_"
7,"iti","_","_","iti","CQT","","_","_"
8,"viśrutaḥ","_","_","viśru","PPP","","_","_"
1,"śaṃtanoḥ","_","_","śaṃtanu","NC","","_","_"
2,"kīrtayiṣyāmi","_","_","kīrtay","V","kīrtay","_","_"
3,"sarvān","_","_","sarva","JQ","","_","_"
4,"eva","_","_","eva","CEM","","_","_"
5,"guṇān","_","_","guṇa","NC","","_","_"
6,"aham","_","_","mat","PPR","","_","_"
1,"damo","_","_","dama","NC","","_","_"
2,"dānaṃ","_","_","dāna","NC","","_","_"
3,"kṣamā","_","_","kṣamā","NC","","_","_"
4,"buddhir","_","_","buddhi","NC","","_","_"
5,"hrīr","_","_","hrī","NC","","_","_"
6,"_","_","_","dhṛti","NC","","_","_"
7,"_","_","_","tejas","NC","","_","_"
8,"uttamam","_","_","uttama","JJ","","_","_"
1,"_","_","_","nitya","JJ","","_","_"
2,"_","_","_","as","V","as","_","_"
3,"_","_","_","mahat","JJ","","_","_"
4,"_","_","_","sattva","NC","","_","_"
5,"śaṃtanau","_","_","śaṃtanu","NC","","_","_"
6,"_","_","_","puruṣa","NC","","_","_"
7,"_","_","_","ṛṣabha","NC","","_","_"
1,"evaṃ","_","_","eva","CX","","_","_"
2,"sa","_","_","tad","PRD","","_","_"
3,"_","_","_","guṇa","NC","","_","_"
4,"_","_","_","sampad","PPP","","_","_"
5,"_","_","_","dharma","NC","","_","_"
6,"_","_","_","artha","NC","","_","_"
7,"_","_","_","kuśala","JJ","","_","_"
8,"nṛpaḥ","_","_","nṛpa","NC","","_","_"
1,"āsīd","_","_","as","V","as","_","_"
2,"_","_","_","bharata","NC","","_","_"
3,"_","_","_","vaṃśa","NC","","_","_"
4,"goptā","_","_","goptṛ","JJ","","_","_"
5,"_","_","_","sādhu","JJ","","_","_"
6,"_","_","_","jana","NC","","_","_"
7,"ca","_","_","ca","CCD","","_","_"
1,"_","_","_","kambu","NC","","_","_"
2,"_","_","_","grīva","NC","","_","_"
3,"_","_","_","pṛthu","JJ","","_","_"
4,"_","_","_","vyaṃsa","JJ","","_","_"
5,"_","_","_","mat","PPP","","_","_"
6,"_","_","_","vāraṇa","NC","","_","_"
7,"_","_","_","vikrama","NC","","_","_"
1,"anvitaḥ","_","_","anvita","JJ","","_","_"
2,"_","_","_","paripṛ","PPP","","_","_"
3,"_","_","_","artha","NC","","_","_"
4,"sarvair","_","_","sarva","JQ","","_","_"
5,"_","_","_","nṛpati","NC","","_","_"
6,"_","_","_","lakṣaṇa","NC","","_","_"
1,"tasya","_","_","tad","PRD","","_","_"
2,"kīrtimato","_","_","kīrtimat","JJ","","_","_"
3,"vṛttam","_","_","vṛtta","NC","","_","_"
4,"avekṣya","_","_","avekṣ","CGDA","","_","_"
5,"satataṃ","_","_","satata","CX","","_","_"
6,"narāḥ","_","_","nara","NC","","_","_"
1,"dharma","_","_","dharma","NC","","_","_"
2,"eva","_","_","eva","CEM","","_","_"
3,"paraḥ","_","_","para","PPX","","_","_"
4,"kāmād","_","_","kāma","NC","","_","_"
5,"_","_","_","artha","NC","","_","_"
6,"_","_","_","ca","CCD","","_","_"
7,"_","_","_","iti","CQT","","_","_"
8,"vyavasthitaḥ","_","_","vyavasthā","PPP","","_","_"
1,"_","_","_","tad","PRD","","_","_"
2,"_","_","_","as","V","as","_","_"
3,"_","_","_","mahat","JJ","","_","_"
4,"_","_","_","sattva","NC","","_","_"
5,"śaṃtanau","_","_","śaṃtanu","NC","","_","_"
6,"_","_","_","bharata","NC","","_","_"
7,"_","_","_","ṛṣabha","NC","","_","_"
1,"na","_","_","na","CNG","","_","_"
2,"_","_","_","ca","CCD","","_","_"
3,"_","_","_","ida","PRD","","_","_"
4,"sadṛśaḥ","_","_","sadṛśa","JJ","","_","_"
5,"kaścit","_","_","kiṃcit","PRI","","_","_"
6,"kṣatriyo","_","_","kṣatriya","NC","","_","_"
7,"dharmato","_","_","dharma","NC","","_","_"
8,"'bhavat","_","_","bhav","V","bhū","_","_"
1,"vartamānaṃ","_","_","vṛt","KDP","","_","_"
2,"hi","_","_","hi","CX","","_","_"
3,"dharme","_","_","dharma","NC","","_","_"
4,"sve","_","_","sva","JJ","","_","_"
5,"_","_","_","sarva","JQ","","_","_"
6,"_","_","_","dharma","NC","","_","_"
7,"_","_","_","vid","JJ","","_","_"
8,"varam","_","_","vara","JJ","","_","_"
1,"taṃ","_","_","tad","PRD","","_","_"
2,"mahīpā","_","_","mahīpa","NC","","_","_"
3,"mahīpālaṃ","_","_","mahīpāla","NC","","_","_"
4,"_","_","_","rājan","NC","","_","_"
5,"_","_","_","rājya","NC","","_","_"
6,"'bhyaṣecayan","_","_","abhiṣecay","V","abhiṣecay","_","_"
1,"_","_","_","vī","PPP","","_","_"
2,"_","_","_","śoka","NC","","_","_"
3,"_","_","_","bhaya","NC","","_","_"
4,"_","_","_","ābādha","NC","","_","_"
5,"_","_","_","sukha","NC","","_","_"
6,"_","_","_","svapna","NC","","_","_"
7,"_","_","_","vibodhana","NC","","_","_"
1,"prati","_","_","prati","CADP","","_","_"
2,"_","_","_","bhārata","NC","","_","_"
3,"_","_","_","goptṛ","JJ","","_","_"
4,"samapadyanta","_","_","sampad","V","sampad","_","_"
5,"bhūmipāḥ","_","_","bhūmipa","NC","","_","_"
1,"tena","_","_","tad","PRD","","_","_"
2,"kīrtimatā","_","_","kīrtimat","NC","","_","_"
3,"śiṣṭāḥ","_","_","śās","PPP","","_","_"
4,"_","_","_","śakra","NC","","_","_"
5,"_","_","_","pratima","JJ","","_","_"
6,"_","_","_","tejas","NC","","_","_"
1,"_","_","_","yajña","NC","","_","_"
2,"_","_","_","dāna","NC","","_","_"
3,"_","_","_","tapas","NC","","_","_"
4,"_","_","_","śīla","NC","","_","_"
5,"samapadyanta","_","_","sampad","V","sampad","_","_"
6,"pārthivāḥ","_","_","pārthiva","NC","","_","_"
1,"_","_","_","śaṃtanu","NC","","_","_"
2,"_","_","_","pramukha","JJ","","_","_"
3,"gupte","_","_","gup","PPP","","_","_"
4,"loke","_","_","loka","NC","","_","_"
5,"_","_","_","nṛpati","NC","","_","_"
6,"_","_","_","tadā","CAD","","_","_"
1,"niyamāt","_","_","niyama","NC","","_","_"
2,"_","_","_","sarva","JQ","","_","_"
3,"_","_","_","varṇa","NC","","_","_"
4,"_","_","_","brahman","NC","","_","_"
5,"_","_","_","uttara","JJ","","_","_"
6,"avartata","_","_","vart","V","vṛt","_","_"
1,"brahma","_","_","brahman","NC","","_","_"
2,"paryacarat","_","_","paricar","V","paricar","_","_"
3,"kṣatraṃ","_","_","kṣatra","NC","","_","_"
4,"viśaḥ","_","_","viś","NC","","_","_"
5,"kṣatram","_","_","kṣatra","NC","","_","_"
6,"anuvratāḥ","_","_","anuvrata","JJ","","_","_"
1,"_","_","_","brahman","NC","","_","_"
2,"_","_","_","kṣatra","NC","","_","_"
3,"_","_","_","anurañj","PPP","","_","_"
4,"_","_","_","ca","CCD","","_","_"
5,"śūdrāḥ","_","_","śūdra","NC","","_","_"
6,"paryacaran","_","_","paricar","V","paricar","_","_"
7,"viśaḥ","_","_","viś","NC","","_","_"
1,"sa","_","_","tad","PRD","","_","_"
2,"hāstinapure","_","_","hāstinapura","NC","","_","_"
3,"ramye","_","_","ramya","JJ","","_","_"
4,"kurūṇāṃ","_","_","kuru","NC","","_","_"
5,"puṭabhedane","_","_","puṭabhedana","NC","","_","_"
1,"vasan","_","_","vas","KDP","","_","_"
2,"_","_","_","sāgara","NC","","_","_"
3,"_","_","_","paryanta","NC","","_","_"
4,"anvaśād","_","_","anuśās","V","anuśās","_","_"
5,"vai","_","_","vai","CX","","_","_"
6,"vasuṃdharām","_","_","vasuṃdharā","NC","","_","_"
1,"sa","_","_","tad","PRD","","_","_"
2,"_","_","_","deva","NC","","_","_"
3,"_","_","_","rājan","NC","","_","_"
4,"_","_","_","sadṛśa","JJ","","_","_"
5,"_","_","_","dharma","NC","","_","_"
6,"_","_","_","jña","JJ","","_","_"
7,"_","_","_","satya","JJ","","_","_"
8,"_","_","_","vāc","NC","","_","_"
9,"ṛjuḥ","_","_","ṛju","JJ","","_","_"
1,"_","_","_","dāna","NC","","_","_"
2,"_","_","_","dharma","NC","","_","_"
3,"_","_","_","tapas","NC","","_","_"
4,"_","_","_","yoga","NC","","_","_"
5,"_","_","_","śrī","NC","","_","_"
6,"paramayā","_","_","parama","JJ","","_","_"
7,"yutaḥ","_","_","yuta","JJ","","_","_"
1,"_","_","_","arāga","JJ","","_","_"
2,"_","_","_","dveṣa","NC","","_","_"
3,"_","_","_","saṃyuj","PPP","","_","_"
4,"_","_","_","soma","NC","","_","_"
5,"_","_","_","vat","CX","","_","_"
6,"_","_","_","priya","JJ","","_","_"
7,"_","_","_","darśana","NC","","_","_"
1,"tejasā","_","_","tejas","NC","","_","_"
2,"_","_","_","sūrya","NC","","_","_"
3,"_","_","_","saṃkāśa","NC","","_","_"
4,"_","_","_","vāyu","NC","","_","_"
5,"_","_","_","vega","NC","","_","_"
6,"_","_","_","sama","JJ","","_","_"
7,"jave","_","_","java","NC","","_","_"
1,"_","_","_","antaka","NC","","_","_"
2,"_","_","_","pratima","JJ","","_","_"
3,"kope","_","_","kopa","NC","","_","_"
4,"kṣamayā","_","_","kṣamā","NC","","_","_"
5,"_","_","_","pṛthivī","NC","","_","_"
6,"_","_","_","sama","PPX","","_","_"
1,"vadhaḥ","_","_","vadha","NC","","_","_"
2,"_","_","_","paśu","NC","","_","_"
3,"_","_","_","varāha","NC","","_","_"
4,"_","_","_","tathā","CX","","_","_"
5,"_","_","_","eva","CEM","","_","_"
6,"_","_","_","mṛga","NC","","_","_"
7,"_","_","_","pakṣin","NC","","_","_"
1,"śaṃtanau","_","_","śaṃtanu","NC","","_","_"
2,"_","_","_","pṛthivī","NC","","_","_"
3,"_","_","_","pāla","NC","","_","_"
4,"_","_","_","na","CNG","","_","_"
5,"_","_","_","vart","V","vṛt","_","_"
6,"vṛthā","_","_","vṛthā","CX","","_","_"
7,"nṛpa","_","_","nṛpa","NC","","_","_"
1,"_","_","_","dharma","NC","","_","_"
2,"_","_","_","brahman","NC","","_","_"
3,"_","_","_","uttara","JJ","","_","_"
4,"rājye","_","_","rājya","NC","","_","_"
5,"śaṃtanur","_","_","śaṃtanu","NC","","_","_"
6,"_","_","_","vinaya","NC","","_","_"
7,"_","_","_","ātmavat","JJ","","_","_"
1,"samaṃ","_","_","sama","PPX","","_","_"
2,"śaśāsa","_","_","śās","V","śās","_","_"
3,"bhūtāni","_","_","bhūta","NC","","_","_"
4,"_","_","_","kāma","NC","","_","_"
5,"_","_","_","rāga","NC","","_","_"
6,"_","_","_","vivarjay","PPP","","_","_"
1,"_","_","_","cakora","NC","","_","_"
2,"_","_","_","netra","NC","","_","_"
3,"_","_","_","tāmra","NC","","_","_"
4,"_","_","_","āsya","NC","","_","_"
5,"_","_","_","siṃha","NC","","_","_"
6,"_","_","_","ṛṣabha","NC","","_","_"
7,"_","_","_","gati","NC","","_","_"
8,"yuvā","_","_","yuvan","NC","","_","_"
1,"guṇair","_","_","guṇa","NC","","_","_"
2,"anupamair","_","_","anupama","JJ","","_","_"
3,"yuktaḥ","_","_","yuj","PPP","","_","_"
4,"samastair","_","_","samasta","JJ","","_","_"
5,"abhikāmikaiḥ","_","_","abhikāmika","JJ","","_","_"
1,"gambhīraḥ","_","_","gambhīra","JJ","","_","_"
2,"_","_","_","sattva","NC","","_","_"
3,"_","_","_","sampad","PPP","","_","_"
4,"_","_","_","pūrṇa","JJ","","_","_"
5,"_","_","_","candra","NC","","_","_"
6,"_","_","_","nibha","JJ","","_","_"
7,"_","_","_","ānana","NC","","_","_"
1,"_","_","_","devarṣi","NC","","_","_"
2,"_","_","_","pitṛ","NC","","_","_"
3,"_","_","_","yajña","NC","","_","_"
4,"_","_","_","artha","NC","","_","_"
5,"ārabhyanta","_","_","ārabh","V","ārabh","_","_"
6,"tadā","_","_","tadā","CAD","","_","_"
7,"kriyāḥ","_","_","kriyā","NC","","_","_"
1,"na","_","_","na","CNG","","_","_"
2,"_","_","_","ca","CCD","","_","_"
3,"_","_","_","adharma","NC","","_","_"
4,"keṣāṃcit","_","_","kiṃcit","PRI","","_","_"
5,"prāṇinām","_","_","prāṇin","NC","","_","_"
6,"abhavad","_","_","bhav","V","bhū","_","_"
7,"vadhaḥ","_","_","vadha","NC","","_","_"
1,"asukhānām","_","_","asukha","JJ","","_","_"
2,"anāthānāṃ","_","_","anātha","JJ","","_","_"
3,"tiryagyoniṣu","_","_","tiryagyoni","NC","","_","_"
4,"vartatām","_","_","vṛt","KDP","","_","_"
1,"sa","_","_","tad","PRD","","_","_"
2,"eva","_","_","eva","CEM","","_","_"
3,"rājā","_","_","rājan","NC","","_","_"
4,"bhūtānāṃ","_","_","bhūta","NC","","_","_"
5,"sarveṣām","_","_","sarva","JQ","","_","_"
6,"abhavat","_","_","bhav","V","bhū","_","_"
7,"pitā","_","_","pitṛ","NC","","_","_"
1,"tasmin","_","_","tad","PRD","","_","_"
2,"_","_","_","kuru","NC","","_","_"
3,"_","_","_","pati","NC","","_","_"
4,"_","_","_","śreṣṭha","JJ","","_","_"
5,"_","_","_","rājan","NC","","_","_"
6,"_","_","_","rājan","NC","","_","_"
7,"_","_","_","īśvara","NC","","_","_"
8,"sati","_","_","as","KDP","","_","_"
1,"śritā","_","_","śri","PPP","","_","_"
2,"vāg","_","_","vāc","NC","","_","_"
3,"abhavat","_","_","bhav","V","bhū","_","_"
4,"satyaṃ","_","_","satya","NC","","_","_"
5,"_","_","_","dāna","NC","","_","_"
6,"_","_","_","dharma","NC","","_","_"
7,"_","_","_","āśri","PPP","","_","_"
8,"manaḥ","_","_","manas","NC","","_","_"
1,"_","_","_","yajña","NC","","_","_"
2,"_","_","_","artha","NC","","_","_"
3,"paśavaḥ","_","_","paśu","NC","","_","_"
4,"sṛṣṭāḥ","_","_","sṛj","PPP","","_","_"
5,"_","_","_","saṃtāna","NC","","_","_"
6,"_","_","_","artha","NC","","_","_"
7,"ca","_","_","ca","CCD","","_","_"
8,"maithunam","_","_","maithuna","NC","","_","_"
1,"sa","_","_","tad","PRD","","_","_"
2,"samāḥ","_","_","samā","NC","","_","_"
3,"_","_","_","ṣoḍaśan","JJ","","_","_"
4,"_","_","_","aṣṭan","NUM","","_","_"
5,"ca","_","_","ca","CCD","","_","_"
6,"catasro","_","_","catur","NUM","","_","_"
7,"'ṣṭau","_","_","aṣṭan","NUM","","_","_"
8,"_","_","_","tathā","CX","","_","_"
9,"_","_","_","apara","PPX","","_","_"
1,"ratim","_","_","rati","NC","","_","_"
2,"_","_","_","a","CNG","","_","_"
3,"_","_","_","prāp","KDP","","_","_"
4,"strīṣu","_","_","strī","NC","","_","_"
5,"babhūva","_","_","bhav","V","bhū","_","_"
6,"_","_","_","vana","NC","","_","_"
7,"_","_","_","gocara","JJ","","_","_"
1,"tapasā","_","_","tapas","NC","","_","_"
2,"_","_","_","karṣay","PPP","","_","_"
3,"_","_","_","ugra","JJ","","_","_"
4,"_","_","_","japa","NC","","_","_"
5,"_","_","_","dhyāna","NC","","_","_"
6,"_","_","_","ra","PPP","","_","_"
7,"sadā","_","_","sadā","CAD","","_","_"
1,"_","_","_","tathā","CX","","_","_"
2,"_","_","_","rūpa","NC","","_","_"
3,"_","_","_","tathā","CX","","_","_"
4,"_","_","_","cāra","NC","","_","_"
5,"_","_","_","tathā","CX","","_","_"
6,"_","_","_","vṛt","PPP","","_","_"
7,"_","_","_","tathā","CX","","_","_"
8,"_","_","_","śru","PPP","","_","_"
1,"_","_","_","gāṅgeya","NC","","_","_"
2,"_","_","_","tad","PRD","","_","_"
3,"putro","_","_","putra","NC","","_","_"
4,"'bhūn","_","_","bhav","V","bhū","_","_"
5,"nāmnā","_","_","nāman","NC","","_","_"
6,"devavrato","_","_","devavrata","NC","","_","_"
7,"vasuḥ","_","_","vasu","NC","","_","_"
1,"_","_","_","sarva","JQ","","_","_"
2,"_","_","_","astra","NC","","_","_"
3,"sa","_","_","tad","PRD","","_","_"
4,"niṣṇātaḥ","_","_","niṣṇāta","JJ","","_","_"
5,"_","_","_","pārthiva","NC","","_","_"
6,"_","_","_","itara","PPX","","_","_"
7,"ca","_","_","ca","CCD","","_","_"
1,"_","_","_","mahat","JJ","","_","_"
2,"_","_","_","bala","NC","","_","_"
3,"_","_","_","mahat","JJ","","_","_"
4,"_","_","_","sattva","NC","","_","_"
5,"_","_","_","mahat","JJ","","_","_"
6,"_","_","_","vīrya","NC","","_","_"
7,"_","_","_","mahat","JJ","","_","_"
8,"_","_","_","ratha","NC","","_","_"
1,"sa","_","_","tad","PRD","","_","_"
2,"kadācin","_","_","kadācid","CX","","_","_"
3,"mṛgaṃ","_","_","mṛga","NC","","_","_"
4,"viddhvā","_","_","vyadh","CGDA","","_","_"
5,"gaṅgām","_","_","gaṅgā","NC","","_","_"
6,"anusaran","_","_","anusṛ","KDP","","_","_"
7,"nadīm","_","_","nadī","NC","","_","_"
1,"bhāgīrathīm","_","_","bhāgīrathī","NC","","_","_"
2,"_","_","_","alpa","JJ","","_","_"
3,"_","_","_","jala","NC","","_","_"
4,"śaṃtanur","_","_","śaṃtanu","NC","","_","_"
5,"dṛṣṭavān","_","_","dṛś","KDP","","_","_"
6,"nṛpaḥ","_","_","nṛpa","NC","","_","_"
1,"tāṃ","_","_","tad","PRD","","_","_"
2,"dṛṣṭvā","_","_","dṛś","CGDA","","_","_"
3,"cintayāmāsa","_","_","cintay","V","cintay","_","_"
4,"śaṃtanuḥ","_","_","śaṃtanu","NC","","_","_"
5,"_","_","_","puruṣa","NC","","_","_"
6,"_","_","_","ṛṣabha","NC","","_","_"
1,"syandate","_","_","syand","V","syand","_","_"
2,"kiṃ","_","_","kiṃ","PRQ","","_","_"
3,"_","_","_","nu","CX","","_","_"
4,"_","_","_","ida","PRD","","_","_"
5,"_","_","_","na","CNG","","_","_"
6,"_","_","_","adya","CX","","_","_"
7,"_","_","_","sarit","NC","","_","_"
8,"_","_","_","śreṣṭha","JJ","","_","_"
9,"yathā","_","_","yathā","CCM","","_","_"
10,"purā","_","_","purā","CX","","_","_"
1,"tato","_","_","tatas","CX","","_","_"
2,"nimittam","_","_","nimitta","NC","","_","_"
3,"anvicchan","_","_","anviṣ","KDP","","_","_"
4,"dadarśa","_","_","darś","V","dṛś","_","_"
5,"sa","_","_","tad","PRD","","_","_"
6,"_","_","_","mahat","JJ","","_","_"
7,"_","_","_","manas","NC","","_","_"
1,"kumāraṃ","_","_","kumāra","NC","","_","_"
2,"_","_","_","rūpa","NC","","_","_"
3,"_","_","_","sampad","PPP","","_","_"
4,"bṛhantaṃ","_","_","bṛhat","JJ","","_","_"
5,"_","_","_","cāru","JJ","","_","_"
6,"_","_","_","darśana","NC","","_","_"
1,"divyam","_","_","divya","JJ","","_","_"
2,"astraṃ","_","_","astra","NC","","_","_"
3,"vikurvāṇaṃ","_","_","vikṛ","KDP","","_","_"
4,"yathā","_","_","yathā","CCM","","_","_"
5,"devaṃ","_","_","deva","NC","","_","_"
6,"puraṃdaram","_","_","puraṃdara","NC","","_","_"
1,"kṛtsnāṃ","_","_","kṛtsna","JJ","","_","_"
2,"gaṅgāṃ","_","_","gaṅgā","NC","","_","_"
3,"samāvṛtya","_","_","samāvṛ","CGDA","","_","_"
4,"_","_","_","śara","NC","","_","_"
5,"_","_","_","tīkṣṇa","JJ","","_","_"
6,"avasthitam","_","_","avasthā","PPP","","_","_"
1,"tāṃ","_","_","tad","PRD","","_","_"
2,"śarair","_","_","śara","NC","","_","_"
3,"āvṛtāṃ","_","_","āvṛ","PPP","","_","_"
4,"dṛṣṭvā","_","_","dṛś","CGDA","","_","_"
5,"nadīṃ","_","_","nadī","NC","","_","_"
6,"gaṅgāṃ","_","_","gaṅgā","NC","","_","_"
7,"_","_","_","tad","PRD","","_","_"
8,"_","_","_","antika","NC","","_","_"
1,"abhavad","_","_","bhav","V","bhū","_","_"
2,"vismito","_","_","vismi","PPP","","_","_"
3,"rājā","_","_","rājan","NC","","_","_"
4,"karma","_","_","karman","NC","","_","_"
5,"_","_","_","dṛś","CGDA","","_","_"
6,"_","_","_","atimānuṣa","JJ","","_","_"
1,"_","_","_","jan","PPP","","_","_"
2,"_","_","_","mātra","NC","","_","_"
3,"purā","_","_","purā","CX","","_","_"
4,"dṛṣṭaṃ","_","_","dṛś","PPP","","_","_"
5,"taṃ","_","_","tad","PRD","","_","_"
6,"putraṃ","_","_","putra","NC","","_","_"
7,"_","_","_","śaṃtanu","NC","","_","_"
8,"_","_","_","tadā","CAD","","_","_"
1,"_","_","_","na","CNG","","_","_"
2,"_","_","_","upalabh","V","upalabh","_","_"
3,"smṛtiṃ","_","_","smṛti","NC","","_","_"
4,"dhīmān","_","_","dhīmat","JJ","","_","_"
5,"abhijñātuṃ","_","_","abhijñā","CGDI","","_","_"
6,"tam","_","_","tad","PRD","","_","_"
7,"ātmajam","_","_","ātmaja","NC","","_","_"
1,"na","_","_","na","CNG","","_","_"
2,"smṛtiḥ","_","_","smṛti","NC","","_","_"
3,"śaṃtanor","_","_","śaṃtanu","NC","","_","_"
4,"āsīd","_","_","as","V","as","_","_"
5,"abhijñātuṃ","_","_","abhijñā","CGDI","","_","_"
6,"svam","_","_","sva","JJ","","_","_"
7,"ātmajam","_","_","ātmaja","NC","","_","_"
1,"sa","_","_","tad","PRD","","_","_"
2,"tu","_","_","tu","CCD","","_","_"
3,"taṃ","_","_","tad","PRD","","_","_"
4,"pitaraṃ","_","_","pitṛ","NC","","_","_"
5,"dṛṣṭvā","_","_","dṛś","CGDA","","_","_"
6,"mohayāmāsa","_","_","mohay","V","mohay","_","_"
7,"māyayā","_","_","māyā","NC","","_","_"
1,"saṃmohya","_","_","saṃmohay","CGDA","","_","_"
2,"tu","_","_","tu","CCD","","_","_"
3,"tataḥ","_","_","tatas","CX","","_","_"
4,"kṣipraṃ","_","_","kṣipra","CX","","_","_"
5,"_","_","_","tatra","CAD","","_","_"
6,"_","_","_","eva","CEM","","_","_"
7,"_","_","_","antardhā","V","antardhā","_","_"
1,"tad","_","_","tad","PRD","","_","_"
2,"adbhutaṃ","_","_","adbhuta","NC","","_","_"
3,"tadā","_","_","tadā","CAD","","_","_"
4,"dṛṣṭvā","_","_","dṛś","CGDA","","_","_"
5,"tatra","_","_","tatra","CAD","","_","_"
6,"rājā","_","_","rājan","NC","","_","_"
7,"sa","_","_","tad","PRD","","_","_"
8,"śaṃtanuḥ","_","_","śaṃtanu","NC","","_","_"
1,"śaṅkamānaḥ","_","_","śaṅk","KDP","","_","_"
2,"sutaṃ","_","_","suta","NC","","_","_"
3,"gaṅgām","_","_","gaṅgā","NC","","_","_"
4,"abravīd","_","_","abravīta","V","brū","_","_"
5,"_","_","_","darśay","V","darśay","_","_"
6,"_","_","_","iti","CQT","","_","_"
7,"ha","_","_","ha","CEM","","_","_"
1,"śaṅkamānaḥ","_","_","śaṅk","KDP","","_","_"
2,"sutaṃ","_","_","suta","NC","","_","_"
3,"prāpya","_","_","prāp","CGDA","","_","_"
4,"gaṅgā","_","_","gaṅgā","NC","","_","_"
5,"vacanam","_","_","vacana","NC","","_","_"
6,"abravīt","_","_","abravīta","V","brū","_","_"
1,"darśayāmāsa","_","_","darśay","V","darśay","_","_"
2,"taṃ","_","_","tad","PRD","","_","_"
3,"gaṅgā","_","_","gaṅgā","NC","","_","_"
4,"bibhratī","_","_","bhṛ","KDP","","_","_"
5,"rūpam","_","_","rūpa","NC","","_","_"
6,"uttamam","_","_","uttama","JJ","","_","_"
1,"gṛhītvā","_","_","grah","CGDA","","_","_"
2,"dakṣiṇe","_","_","dakṣiṇa","JJ","","_","_"
3,"pāṇau","_","_","pāṇi","NC","","_","_"
4,"taṃ","_","_","tad","PRD","","_","_"
5,"kumāram","_","_","kumāra","NC","","_","_"
6,"alaṃkṛtam","_","_","alaṃkṛ","PPP","","_","_"
1,"alaṃkṛtām","_","_","alaṃkṛ","PPP","","_","_"
2,"ābharaṇair","_","_","ābharaṇa","NC","","_","_"
3,"_","_","_","arajas","JJ","","_","_"
4,"_","_","_","ambara","NC","","_","_"
5,"_","_","_","dhārin","JJ","","_","_"
1,"_","_","_","dṛś","PPP","","_","_"
2,"_","_","_","pūrva","PPX","","_","_"
3,"api","_","_","api","CX","","_","_"
4,"satīṃ","_","_","satī","NC","","_","_"
5,"_","_","_","na","CNG","","_","_"
6,"_","_","_","abhijān","V","abhijñā","_","_"
7,"sa","_","_","tad","PRD","","_","_"
8,"śaṃtanuḥ","_","_","śaṃtanu","NC","","_","_"
1,"_","_","_","gaṅgā","NC","","_","_"
2,"_","_","_","vak","V","vac","_","_"
1,"yaṃ","_","_","yad","PRL","","_","_"
2,"putram","_","_","putra","NC","","_","_"
3,"aṣṭamaṃ","_","_","aṣṭama","JJ","","_","_"
4,"_","_","_","rājan","NC","","_","_"
5,"_","_","_","tvat","PPR","","_","_"
6,"purā","_","_","purā","CX","","_","_"
7,"_","_","_","mat","PPR","","_","_"
8,"_","_","_","jan","V","jan","_","_"
1,"sa","_","_","tad","PRD","","_","_"
2,"te","_","_","tvat","PPR","","_","_"
3,"'yaṃ","_","_","ida","PRD","","_","_"
4,"_","_","_","puruṣa","NC","","_","_"
5,"_","_","_","vyāghra","NC","","_","_"
6,"_","_","_","nay","V","nī","_","_"
7,"_","_","_","a","PRD","","_","_"
8,"_","_","_","gṛha","NC","","_","_"
9,"_","_","_","antika","NC","","_","_"
1,"_","_","_","sarva","JQ","","_","_"
2,"_","_","_","astra","NC","","_","_"
3,"_","_","_","vid","JJ","","_","_"
4,"anuttamaḥ","_","_","anuttama","JJ","","_","_"
1,"_","_","_","grah","V","grah","_","_"
2,"_","_","_","ida","PRD","","_","_"
3,"_","_","_","mahat","JJ","","_","_"
4,"_","_","_","rāja","NC","","_","_"
5,"mayā","_","_","mat","PPR","","_","_"
6,"saṃvardhitaṃ","_","_","saṃvardhay","PPP","","_","_"
7,"sutam","_","_","suta","NC","","_","_"
1,"ādāya","_","_","ādā","CGDA","","_","_"
2,"_","_","_","puruṣa","NC","","_","_"
3,"_","_","_","vyāghra","NC","","_","_"
1,"vedān","_","_","veda","NC","","_","_"
2,"adhijage","_","_","adhigā","V","adhigā","_","_"
3,"_","_","_","sa_saha","CX","","_","_"
4,"_","_","_","aṅga","NC","","_","_"
5,"vasiṣṭhād","_","_","vasiṣṭha","NC","","_","_"
6,"eva","_","_","eva","CEM","","_","_"
7,"vīryavān","_","_","vīryavat","JJ","","_","_"
1,"sa","_","_","tad","PRD","","_","_"
2,"khilān","_","_","khila","NC","","_","_"
3,"_","_","_","sa_saha","CX","","_","_"
4,"_","_","_","upaniṣada","NC","","_","_"
5,"_","_","_","sa_saha","CX","","_","_"
6,"_","_","_","aṅga","NC","","_","_"
7,"_","_","_","upāṅga","NC","","_","_"
8,"yathāvidhi","_","_","yathāvidhi","CX","","_","_"
1,"kṛtāstraḥ","_","_","kṛtāstra","JJ","","_","_"
2,"_","_","_","parama","JJ","","_","_"
3,"_","_","_","iṣvāsa","NC","","_","_"
4,"_","_","_","devarāja","NC","","_","_"
5,"_","_","_","sama","PPX","","_","_"
6,"yudhi","_","_","yudh","NC","","_","_"
1,"surāṇāṃ","_","_","sura","NC","","_","_"
2,"saṃmato","_","_","samman","PPP","","_","_"
3,"nityam","_","_","nitya","CX","","_","_"
4,"asurāṇāṃ","_","_","asura","NC","","_","_"
5,"ca","_","_","ca","CCD","","_","_"
6,"bhārata","_","_","bhārata","NC","","_","_"
1,"uśanā","_","_","uśanas","NC","","_","_"
2,"veda","_","_","vid","V","vid","_","_"
3,"_","_","_","yad","PRL","","_","_"
4,"_","_","_","śāstra","NC","","_","_"
5,"ayaṃ","_","_","ida","PRD","","_","_"
6,"tad","_","_","tad","PRD","","_","_"
7,"veda","_","_","vid","V","vid","_","_"
8,"sarvaśaḥ","_","_","sarvaśas","CX","","_","_"
1,"_","_","_","tathā","CX","","_","_"
2,"_","_","_","eva","CEM","","_","_"
3,"_","_","_","aṅgiras","NC","","_","_"
4,"putraḥ","_","_","putra","NC","","_","_"
5,"_","_","_","sura","NC","","_","_"
6,"_","_","_","asura","NC","","_","_"
7,"_","_","_","namaskṛ","PPP","","_","_"
1,"yad","_","_","yad","PRL","","_","_"
2,"veda","_","_","vid","V","vid","_","_"
3,"śāstraṃ","_","_","śāstra","NC","","_","_"
4,"_","_","_","tad","PRD","","_","_"
5,"_","_","_","ca","CCD","","_","_"
6,"_","_","_","api","CX","","_","_"
7,"kṛtsnam","_","_","kṛtsna","JJ","","_","_"
8,"asmin","_","_","ida","PRD","","_","_"
9,"pratiṣṭhitam","_","_","pratiṣṭhā","PPP","","_","_"
1,"tava","_","_","tvat","PPR","","_","_"
2,"putre","_","_","putra","NC","","_","_"
3,"_","_","_","mahat","JJ","","_","_"
4,"_","_","_","bāhu","NC","","_","_"
5,"_","_","_","sāṅga","JJ","","_","_"
6,"_","_","_","upāṅga","NC","","_","_"
7,"mahātmani","_","_","mahātman","JJ","","_","_"
1,"ṛṣiḥ","_","_","ṛṣi","NC","","_","_"
2,"parair","_","_","para","PPX","","_","_"
3,"anādhṛṣyo","_","_","anādhṛṣya","JJ","","_","_"
4,"jāmadagnyaḥ","_","_","jāmadagnya","NC","","_","_"
5,"pratāpavān","_","_","pratāpavat","JJ","","_","_"
1,"_","_","_","sarva","JQ","","_","_"
2,"_","_","_","śāstra","NC","","_","_"
3,"_","_","_","artha","NC","","_","_"
4,"_","_","_","tattva","NC","","_","_"
5,"_","_","_","jña","JJ","","_","_"
6,"smṛtimān","_","_","smṛtimat","JJ","","_","_"
7,"pratibhānavān","_","_","pratibhānavat","JJ","","_","_"
1,"yad","_","_","yad","PRL","","_","_"
2,"astraṃ","_","_","astra","NC","","_","_"
3,"veda","_","_","vid","V","vid","_","_"
4,"_","_","_","rāma","NC","","_","_"
5,"_","_","_","ca","CCD","","_","_"
6,"tad","_","_","tad","PRD","","_","_"
7,"_","_","_","api","CX","","_","_"
8,"_","_","_","ida","PRD","","_","_"
9,"pratiṣṭhitam","_","_","pratiṣṭhā","PPP","","_","_"
1,"_","_","_","mahat","JJ","","_","_"
2,"_","_","_","iṣvāsa","NC","","_","_"
3,"imaṃ","_","_","ida","PRD","","_","_"
4,"rājan","_","_","rājan","NC","","_","_"
5,"_","_","_","rājan","NC","","_","_"
6,"_","_","_","dharma","NC","","_","_"
7,"_","_","_","artha","NC","","_","_"
8,"_","_","_","kovida","JJ","","_","_"
1,"mayā","_","_","mat","PPR","","_","_"
2,"dattaṃ","_","_","dā","PPP","","_","_"
3,"nijaṃ","_","_","nija","JJ","","_","_"
4,"putraṃ","_","_","putra","NC","","_","_"
5,"vīraṃ","_","_","vīra","NC","","_","_"
6,"vīra","_","_","vīra","NC","","_","_"
7,"gṛhān","_","_","gṛha","NC","","_","_"
8,"naya","_","_","nay","V","nī","_","_"
1,"vaiśaṃpāyana","_","_","vaiśampāyana","NC","","_","_"
2,"uvāca","_","_","vak","V","vac","_","_"
1,"_","_","_","tad","PRD","","_","_"
2,"_","_","_","eva","CX","","_","_"
3,"samanujñātaḥ","_","_","samanujñā","PPP","","_","_"
4,"putram","_","_","putra","NC","","_","_"
5,"ādāya","_","_","ādā","CGDA","","_","_"
6,"śaṃtanuḥ","_","_","śaṃtanu","NC","","_","_"
1,"bhrājamānaṃ","_","_","bhrāj","KDP","","_","_"
2,"_","_","_","yathā","CCM","","_","_"
3,"_","_","_","āditya","NC","","_","_"
4,"āyayau","_","_","āyā","V","āyā","_","_"
5,"_","_","_","sva","JJ","","_","_"
6,"_","_","_","pura","NC","","_","_"
7,"prati","_","_","prati","CADP","","_","_"
1,"_","_","_","iti","CQT","","_","_"
2,"_","_","_","vac","CGDA","","_","_"
3,"sā","_","_","tad","PRD","","_","_"
4,"mahābhāgā","_","_","mahābhāga","JJ","","_","_"
5,"_","_","_","tatra","CAD","","_","_"
6,"_","_","_","eva","CEM","","_","_"
7,"_","_","_","antardhā","V","antardhā","_","_"
1,"pauravaḥ","_","_","paurava","NC","","_","_"
2,"_","_","_","sva","JJ","","_","_"
3,"_","_","_","pura","NC","","_","_"
4,"gatvā","_","_","ga","CGDA","","_","_"
5,"_","_","_","puraṃdara","NC","","_","_"
6,"_","_","_","pura","NC","","_","_"
7,"_","_","_","upama","JJ","","_","_"
1,"_","_","_","sarva","JQ","","_","_"
2,"_","_","_","kāma","NC","","_","_"
3,"_","_","_","samṛdh","PPP","","_","_"
4,"_","_","_","artha","NC","","_","_"
5,"mene","_","_","man","V","man","_","_"
6,"ātmānam","_","_","ātman","NC","","_","_"
7,"ātmanā","_","_","ātman","NC","","_","_"
1,"pauraveṣu","_","_","paurava","NC","","_","_"
2,"tataḥ","_","_","tatas","CX","","_","_"
3,"putraṃ","_","_","putra","NC","","_","_"
4,"yauvarājye","_","_","yauvarājya","NC","","_","_"
5,"'bhyaṣecayat","_","_","abhiṣecay","V","abhiṣecay","_","_"
1,"_","_","_","rājya","NC","","_","_"
2,"_","_","_","artha","NC","","_","_"
3,"_","_","_","abhaya","NC","","_","_"
4,"_","_","_","prada","JJ","","_","_"
1,"guṇavantaṃ","_","_","guṇavat","JJ","","_","_"
2,"mahātmānam","_","_","mahātman","JJ","","_","_"
1,"pauravāñ","_","_","paurava","NC","","_","_"
2,"śaṃtanoḥ","_","_","śaṃtanu","NC","","_","_"
3,"putraḥ","_","_","putra","NC","","_","_"
4,"pitaraṃ","_","_","pitṛ","NC","","_","_"
5,"ca","_","_","ca","CCD","","_","_"
6,"_","_","_","mahat","JJ","","_","_"
7,"_","_","_","yaśas","NC","","_","_"
1,"rāṣṭraṃ","_","_","rāṣṭra","NC","","_","_"
2,"ca","_","_","ca","CCD","","_","_"
3,"rañjayāmāsa","_","_","rañjay","V","rañjay","_","_"
4,"vṛttena","_","_","vṛtta","NC","","_","_"
5,"_","_","_","bharata","NC","","_","_"
6,"_","_","_","ṛṣabha","NC","","_","_"
1,"_","_","_","tathā","CX","","_","_"
2,"_","_","_","vṛt","PPP","","_","_"
3,"_","_","_","samācāra","NC","","_","_"
4,"_","_","_","tathā","CX","","_","_"
5,"_","_","_","dharma","NC","","_","_"
6,"_","_","_","tathā","CX","","_","_"
7,"_","_","_","śru","PPP","","_","_"
1,"putro","_","_","putra","NC","","_","_"
2,"devavrato","_","_","devavrata","NC","","_","_"
3,"nāma","_","_","nāma","CX","","_","_"
4,"śaṃtanor","_","_","śaṃtanu","NC","","_","_"
5,"adhiko","_","_","adhika","JJ","","_","_"
6,"guṇaiḥ","_","_","guṇa","NC","","_","_"
1,"_","_","_","sarva","JQ","","_","_"
2,"_","_","_","astra","NC","","_","_"
3,"_","_","_","abhyanujñā","PPP","","_","_"
4,"_","_","_","pārthiva","NC","","_","_"
5,"_","_","_","itara","PPX","","_","_"
6,"ca","_","_","ca","CCD","","_","_"
1,"guṇair","_","_","guṇa","NC","","_","_"
2,"viśiṣṭo","_","_","viśiṣ","PPP","","_","_"
3,"bahubhiḥ","_","_","bahu","JJ","","_","_"
4,"putro","_","_","putra","NC","","_","_"
5,"devavrato","_","_","devavrata","NC","","_","_"
6,"'bhavat","_","_","bhav","V","bhū","_","_"
1,"sa","_","_","tad","PRD","","_","_"
2,"tathā","_","_","tathā","CX","","_","_"
3,"saha","_","_","saha","CX","","_","_"
4,"putreṇa","_","_","putra","NC","","_","_"
5,"ramamāṇo","_","_","ra","KDP","","_","_"
6,"mahīpatiḥ","_","_","mahīpati","NC","","_","_"
1,"vartayāmāsa","_","_","vartay","V","vartay","_","_"
2,"varṣāṇi","_","_","varṣa","NC","","_","_"
3,"_","_","_","catur","NUM","","_","_"
4,"_","_","_","amita","JJ","","_","_"
5,"_","_","_","vikrama","NC","","_","_"
1,"sa","_","_","tad","PRD","","_","_"
2,"kadācid","_","_","kadācid","CX","","_","_"
3,"vanaṃ","_","_","vana","NC","","_","_"
4,"yāto","_","_","yā","PPP","","_","_"
5,"yamunām","_","_","yamunā","NC","","_","_"
6,"abhito","_","_","abhitas","CX","","_","_"
7,"nadīm","_","_","nadī","NC","","_","_"
1,"mahīpatir","_","_","mahīpati","NC","","_","_"
2,"anirdeśyam","_","_","anirdeśya","JJ","","_","_"
3,"ājighrad","_","_","āghrā","KDP","","_","_"
4,"gandham","_","_","gandha","NC","","_","_"
5,"uttamam","_","_","uttama","JJ","","_","_"
1,"tasya","_","_","tad","PRD","","_","_"
2,"prabhavam","_","_","prabhava","NC","","_","_"
3,"anvicchan","_","_","anviṣ","KDP","","_","_"
4,"vicacāra","_","_","vicar","V","vicar","_","_"
5,"samantataḥ","_","_","samantataḥ","CX","","_","_"
1,"sa","_","_","tad","PRD","","_","_"
2,"dadarśa","_","_","darś","V","dṛś","_","_"
3,"tadā","_","_","tadā","CAD","","_","_"
4,"kanyāṃ","_","_","kanyā","NC","","_","_"
5,"dāśānāṃ","_","_","dāśa","NC","","_","_"
6,"_","_","_","deva","NC","","_","_"
7,"_","_","_","rūpin","JJ","","_","_"
1,"tām","_","_","tad","PRD","","_","_"
2,"apṛcchat","_","_","pracch","V","pracch","_","_"
3,"sa","_","_","tad","PRD","","_","_"
4,"_","_","_","dṛś","CGDA","","_","_"
5,"_","_","_","eva","CEM","","_","_"
6,"kanyām","_","_","kanyā","NC","","_","_"
7,"_","_","_","asita","JJ","","_","_"
8,"_","_","_","locana","NC","","_","_"
1,"kasya","_","_","kiṃ","PRQ","","_","_"
2,"tvam","_","_","tvat","PPR","","_","_"
3,"asi","_","_","as","V","as","_","_"
4,"kā","_","_","kiṃ","PRQ","","_","_"
5,"_","_","_","ca","CCD","","_","_"
6,"_","_","_","as","V","as","_","_"
7,"kiṃ","_","_","kiṃ","PRQ","","_","_"
8,"ca","_","_","ca","CCD","","_","_"
9,"bhīru","_","_","bhīru","JJ","","_","_"
10,"cikīrṣasi","_","_","kar","V","kṛ","_","_"
1,"_","_","_","tad","PRD","","_","_"
2,"_","_","_","abravīta","V","brū","_","_"
3,"_","_","_","dāśa","NC","","_","_"
4,"_","_","_","kanyā","NC","","_","_"
5,"_","_","_","as","V","as","_","_"
6,"_","_","_","dharma","NC","","_","_"
7,"_","_","_","artha","NC","","_","_"
8,"vāhaye","_","_","vāhay","V","vāhay","_","_"
9,"tarīm","_","_","tarī","NC","","_","_"
1,"pitur","_","_","pitṛ","NC","","_","_"
2,"niyogād","_","_","niyoga","NC","","_","_"
3,"bhadraṃ","_","_","bhadra","NC","","_","_"
4,"te","_","_","tvat","PPR","","_","_"
5,"_","_","_","dāśa","NC","","_","_"
6,"_","_","_","rājan","NC","","_","_"
7,"mahātmanaḥ","_","_","mahātman","JJ","","_","_"
1,"_","_","_","rūpa","NC","","_","_"
2,"_","_","_","mādhurya","NC","","_","_"
3,"_","_","_","gandha","NC","","_","_"
4,"_","_","_","tad","PRD","","_","_"
5,"saṃyuktāṃ","_","_","saṃyuj","PPP","","_","_"
6,"_","_","_","deva","NC","","_","_"
7,"_","_","_","rūpin","JJ","","_","_"
1,"samīkṣya","_","_","samīkṣ","CGDA","","_","_"
2,"rājā","_","_","rājan","NC","","_","_"
3,"dāśeyīṃ","_","_","dāśeyī","NC","","_","_"
4,"kāmayāmāsa","_","_","kāmay","V","kāmay","_","_"
5,"śaṃtanuḥ","_","_","śaṃtanu","NC","","_","_"
1,"sa","_","_","tad","PRD","","_","_"
2,"gatvā","_","_","ga","CGDA","","_","_"
3,"pitaraṃ","_","_","pitṛ","NC","","_","_"
4,"tasyā","_","_","tad","PRD","","_","_"
5,"varayāmāsa","_","_","varay","V","varay","_","_"
6,"tāṃ","_","_","tad","PRD","","_","_"
7,"tadā","_","_","tadā","CAD","","_","_"
1,"paryapṛcchat","_","_","paripracch","V","paripracch","_","_"
2,"_","_","_","tatas","CX","","_","_"
3,"_","_","_","tad","PRD","","_","_"
4,"pitaraṃ","_","_","pitṛ","NC","","_","_"
5,"_","_","_","ca","CCD","","_","_"
6,"_","_","_","ātman","NC","","_","_"
7,"_","_","_","kāraṇa","NC","","_","_"
1,"icchāmi","_","_","iṣ","V","iṣ","_","_"
2,"_","_","_","dāśa","NC","","_","_"
3,"_","_","_","dā","PPP","","_","_"
4,"me","_","_","mat","PPR","","_","_"
5,"sutāṃ","_","_","sutā","NC","","_","_"
6,"bhāryām","_","_","bhāryā","NC","","_","_"
7,"aninditām","_","_","anindita","JJ","","_","_"
1,"sa","_","_","tad","PRD","","_","_"
2,"ca","_","_","ca","CCD","","_","_"
3,"taṃ","_","_","tad","PRD","","_","_"
4,"_","_","_","prativak","V","prativac","_","_"
5,"_","_","_","ida","PRD","","_","_"
6,"_","_","_","dāśa","NC","","_","_"
7,"_","_","_","rāja","NC","","_","_"
8,"mahīpatim","_","_","mahīpati","NC","","_","_"
1,"_","_","_","jan","PPP","","_","_"
2,"_","_","_","mātra","NC","","_","_"
3,"_","_","_","eva","CEM","","_","_"
4,"me","_","_","mat","PPR","","_","_"
5,"deyā","_","_","dā","KDG","","_","_"
6,"varāya","_","_","vara","NC","","_","_"
7,"varavarṇinī","_","_","varavarṇinī","NC","","_","_"
1,"hṛdi","_","_","hṛd","NC","","_","_"
2,"_","_","_","kāma","NC","","_","_"
3,"_","_","_","tu","CCD","","_","_"
4,"me","_","_","mat","PPR","","_","_"
5,"kaścit","_","_","kiṃcit","PRI","","_","_"
6,"taṃ","_","_","tad","PRD","","_","_"
7,"nibodha","_","_","nibodh","V","nibudh","_","_"
8,"janeśvara","_","_","janeśvara","NC","","_","_"
1,"_","_","_","yadi","CSB","","_","_"
2,"_","_","_","ida","PRD","","_","_"
3,"_","_","_","dharma","NC","","_","_"
4,"_","_","_","patnī","NC","","_","_"
5,"tvaṃ","_","_","tvat","PPR","","_","_"
6,"mattaḥ","_","_","mat","PPR","","_","_"
7,"prārthayase","_","_","prārthay","V","prārthay","_","_"
8,"'nagha","_","_","anagha","JJ","","_","_"
1,"_","_","_","satya","JJ","","_","_"
2,"_","_","_","vāc","NC","","_","_"
3,"asi","_","_","as","V","as","_","_"
4,"satyena","_","_","satya","NC","","_","_"
5,"samayaṃ","_","_","samaya","NC","","_","_"
6,"kuru","_","_","kar","V","kṛ","_","_"
7,"me","_","_","mat","PPR","","_","_"
8,"tataḥ","_","_","tatas","CX","","_","_"
1,"samayena","_","_","samaya","NC","","_","_"
2,"pradadyāṃ","_","_","pradad","V","pradā","_","_"
3,"te","_","_","tvat","PPR","","_","_"
4,"kanyām","_","_","kanyā","NC","","_","_"
5,"aham","_","_","mat","PPR","","_","_"
6,"imāṃ","_","_","ida","PRD","","_","_"
7,"nṛpa","_","_","nṛpa","NC","","_","_"
1,"na","_","_","na","CNG","","_","_"
2,"hi","_","_","hi","CX","","_","_"
3,"me","_","_","mat","PPR","","_","_"
4,"_","_","_","tvat","PPR","","_","_"
5,"_","_","_","sama","JJ","","_","_"
6,"kaścid","_","_","kiṃcit","PRI","","_","_"
7,"varo","_","_","vara","JJ","","_","_"
8,"jātu","_","_","jātu","CX","","_","_"
9,"bhaviṣyati","_","_","bhav","V","bhū","_","_"
1,"śaṃtanur","_","_","śaṃtanu","NC","","_","_"
2,"uvāca","_","_","vak","V","vac","_","_"
1,"śrutvā","_","_","śru","CGDA","","_","_"
2,"tava","_","_","tvat","PPR","","_","_"
3,"varaṃ","_","_","vara","NC","","_","_"
4,"dāśa","_","_","dāśa","NC","","_","_"
5,"vyavasyeyam","_","_","vyavasā","V","vyavasā","_","_"
6,"ahaṃ","_","_","mat","PPR","","_","_"
7,"na","_","_","na","CNG","","_","_"
8,"vā","_","_","vā","CCD","","_","_"
1,"dātavyaṃ","_","_","dā","KDG","","_","_"
2,"cet","_","_","ced","CX","","_","_"
3,"pradāsyāmi","_","_","pradad","V","pradā","_","_"
4,"na","_","_","na","CNG","","_","_"
5,"_","_","_","tu","CCD","","_","_"
6,"_","_","_","adeya","JJ","","_","_"
7,"kathaṃcana","_","_","kathaṃcana","CX","","_","_"
1,"dāśa","_","_","dāśa","NC","","_","_"
2,"uvāca","_","_","vak","V","vac","_","_"
1,"asyāṃ","_","_","ida","PRD","","_","_"
2,"jāyeta","_","_","jan","V","jan","_","_"
3,"yaḥ","_","_","yad","PRL","","_","_"
4,"putraḥ","_","_","putra","NC","","_","_"
5,"sa","_","_","tad","PRD","","_","_"
6,"rājā","_","_","rājan","NC","","_","_"
7,"pṛthivīpatiḥ","_","_","pṛthivīpati","NC","","_","_"
1,"tvad","_","_","tvat","PPR","","_","_"
2,"ūrdhvam","_","_","ūrdhva","CX","","_","_"
3,"abhiṣektavyo","_","_","abhiṣic","KDG","","_","_"
4,"_","_","_","na","CNG","","_","_"
5,"_","_","_","anya","PPX","","_","_"
6,"kaścana","_","_","kaścana","PRI","","_","_"
7,"pārthiva","_","_","pārthiva","NC","","_","_"
1,"vaiśaṃpāyana","_","_","vaiśampāyana","NC","","_","_"
2,"uvāca","_","_","vak","V","vac","_","_"
1,"_","_","_","na","CNG","","_","_"
2,"_","_","_","kāmay","V","kāmay","_","_"
3,"taṃ","_","_","tad","PRD","","_","_"
4,"dātuṃ","_","_","dā","CGDI","","_","_"
5,"varaṃ","_","_","vara","NC","","_","_"
6,"dāśāya","_","_","dāśa","NC","","_","_"
7,"śaṃtanuḥ","_","_","śaṃtanu","NC","","_","_"
1,"śarīrajena","_","_","śarīraja","NC","","_","_"
2,"tīvreṇa","_","_","tīvra","JJ","","_","_"
3,"dahyamāno","_","_","dah","KDP","","_","_"
4,"'pi","_","_","api","CX","","_","_"
5,"bhārata","_","_","bhārata","NC","","_","_"
1,"sa","_","_","tad","PRD","","_","_"
2,"cintayann","_","_","cintay","KDP","","_","_"
3,"eva","_","_","eva","CEM","","_","_"
4,"tadā","_","_","tadā","CAD","","_","_"
5,"_","_","_","dāśa","NC","","_","_"
6,"_","_","_","kanyā","NC","","_","_"
7,"mahīpatiḥ","_","_","mahīpati","NC","","_","_"
1,"_","_","_","pratiyā","V","pratiyā","_","_"
2,"_","_","_","hāstinapura","NC","","_","_"
3,"_","_","_","śoka","NC","","_","_"
4,"_","_","_","upahan","PPP","","_","_"
5,"_","_","_","cetanā","NC","","_","_"
1,"tataḥ","_","_","tatas","CX","","_","_"
2,"kadācic","_","_","kadācid","CX","","_","_"
3,"chocantaṃ","_","_","śuc","KDP","","_","_"
4,"śaṃtanuṃ","_","_","śaṃtanu","NC","","_","_"
5,"dhyānam","_","_","dhyāna","NC","","_","_"
6,"āsthitam","_","_","āsthā","PPP","","_","_"
1,"putro","_","_","putra","NC","","_","_"
2,"devavrato","_","_","devavrata","NC","","_","_"
3,"'bhyetya","_","_","abhye","CGDA","","_","_"
4,"pitaraṃ","_","_","pitṛ","NC","","_","_"
5,"vākyam","_","_","vākya","NC","","_","_"
6,"abravīt","_","_","abravīta","V","brū","_","_"
1,"sarvato","_","_","sarvatas","CX","","_","_"
2,"bhavataḥ","_","_","bhavat","JJ","","_","_"
3,"kṣemaṃ","_","_","kṣema","NC","","_","_"
4,"vidheyāḥ","_","_","vidhā","KDG","","_","_"
5,"_","_","_","sarva","JQ","","_","_"
6,"_","_","_","pārthiva","NC","","_","_"
1,"sa","_","_","tad","PRD","","_","_"
2,"kasmād","_","_","kiṃ","PRQ","","_","_"
3,"_","_","_","rājan","NC","","_","_"
4,"_","_","_","śārdūla","NC","","_","_"
5,"_","_","_","śuc","KDP","","_","_"
6,"_","_","_","tu","CCD","","_","_"
7,"paridahyase","_","_","paridah","V","paridah","_","_"
1,"tat","_","_","tad","PRD","","_","_"
2,"kimartham","_","_","kimartha","JJ","","_","_"
3,"_","_","_","iha","CAD","","_","_"
4,"_","_","_","abhīkṣṇa","JJ","","_","_"
5,"pariśocasi","_","_","pariśuc","V","pariśuc","_","_"
6,"duḥkhitaḥ","_","_","duḥkhita","JJ","","_","_"
1,"dhyāyann","_","_","dhyā","KDP","","_","_"
2,"iva","_","_","iva","CCM","","_","_"
3,"ca","_","_","ca","CCD","","_","_"
4,"kiṃ","_","_","kiṃ","PRQ","","_","_"
5,"rājan","_","_","rājan","NC","","_","_"
6,"_","_","_","na","CNG","","_","_"
7,"_","_","_","abhibhāṣ","V","abhibhāṣ","_","_"
8,"kiṃcana","_","_","kaścana","PRI","","_","_"
1,"na","_","_","na","CNG","","_","_"
2,"_","_","_","ca","CCD","","_","_"
3,"_","_","_","aśva","NC","","_","_"
4,"viniryāsi","_","_","viniryā","V","viniryā","_","_"
5,"vivarṇo","_","_","vivarṇa","JJ","","_","_"
6,"hariṇaḥ","_","_","hariṇa","JJ","","_","_"
7,"kṛśaḥ","_","_","kṛśa","JJ","","_","_"
1,"vyādhim","_","_","vyādhi","NC","","_","_"
2,"icchāmi","_","_","iṣ","V","iṣ","_","_"
3,"te","_","_","tvat","PPR","","_","_"
4,"jñātuṃ","_","_","jñā","CGDI","","_","_"
5,"pratikuryāṃ","_","_","pratikar","V","pratikṛ","_","_"
6,"hi","_","_","hi","CX","","_","_"
7,"tatra","_","_","tatra","CAD","","_","_"
8,"vai","_","_","vai","CX","","_","_"
1,"vaiśaṃpāyanaḥ","_","_","vaiśampāyana","NC","","_","_"
1,"sa","_","_","tad","PRD","","_","_"
2,"taṃ","_","_","tad","PRD","","_","_"
3,"kāmam","_","_","kāma","NC","","_","_"
4,"avācyaṃ","_","_","avācya","JJ","","_","_"
5,"vai","_","_","vai","CX","","_","_"
6,"_","_","_","dāśa","NC","","_","_"
7,"_","_","_","kanyā","NC","","_","_"
8,"_","_","_","prati","CADP","","_","_"
9,"_","_","_","īdṛśa","JJ","","_","_"
1,"vivṛtaṃ","_","_","vivṛ","PPP","","_","_"
2,"_","_","_","na","CNG","","_","_"
3,"_","_","_","śakn","V","śak","_","_"
4,"tasmai","_","_","tad","PRD","","_","_"
5,"pitā","_","_","pitṛ","NC","","_","_"
6,"putrāya","_","_","putra","NC","","_","_"
7,"śaṃsitum","_","_","śaṃs","CGDI","","_","_"
1,"evam","_","_","eva","CX","","_","_"
2,"uktaḥ","_","_","vac","PPP","","_","_"
3,"sa","_","_","tad","PRD","","_","_"
4,"putreṇa","_","_","putra","NC","","_","_"
5,"śaṃtanuḥ","_","_","śaṃtanu","NC","","_","_"
6,"pratyabhāṣata","_","_","pratibhāṣ","V","pratibhāṣ","_","_"
1,"asaṃśayaṃ","_","_","asaṃśaya","NC","","_","_"
2,"_","_","_","dhyāna","NC","","_","_"
3,"_","_","_","para","PPX","","_","_"
4,"yathā","_","_","yathā","CCM","","_","_"
5,"_","_","_","mat","PPR","","_","_"
6,"_","_","_","ah","V","ah","_","_"
7,"_","_","_","tathā","CX","","_","_"
8,"_","_","_","as","V","as","_","_"
9,"_","_","_","uta","CCD","","_","_"
1,"apatyaṃ","_","_","apatya","NC","","_","_"
2,"_","_","_","mat","PPR","","_","_"
3,"_","_","_","tvat","PPR","","_","_"
4,"_","_","_","eva","CEM","","_","_"
5,"_","_","_","eka","PPX","","_","_"
6,"kule","_","_","kula","NC","","_","_"
7,"mahati","_","_","mahat","JJ","","_","_"
8,"bhārata","_","_","bhārata","NC","","_","_"
1,"_","_","_","śastra","NC","","_","_"
2,"_","_","_","nitya","JJ","","_","_"
3,"_","_","_","ca","CCD","","_","_"
4,"satataṃ","_","_","satata","CX","","_","_"
5,"pauruṣe","_","_","pauruṣa","NC","","_","_"
6,"_","_","_","dhur","NC","","_","_"
7,"_","_","_","avasthā","PPP","","_","_"
1,"_","_","_","anitya","JJ","","_","_"
3,"ca","_","_","ca","CCD","","_","_"
4,"martyānām","_","_","martya","NC","","_","_"
5,"ataḥ","_","_","atas","CX","","_","_"
6,"śocāmi","_","_","śuc","V","śuc","_","_"
7,"putraka","_","_","putraka","NC","","_","_"
1,"kathaṃcit","_","_","kathaṃcid","CX","","_","_"
2,"tava","_","_","tvat","PPR","","_","_"
3,"gāṅgeya","_","_","gāṅgeya","NC","","_","_"
4,"vipattau","_","_","vipatti","NC","","_","_"
5,"_","_","_","na","CNG","","_","_"
6,"_","_","_","as","V","as","_","_"
7,"naḥ","_","_","mat","PPR","","_","_"
8,"kulam","_","_","kula","NC","","_","_"
1,"asaṃśayaṃ","_","_","asaṃśaya","NC","","_","_"
2,"tvam","_","_","tvat","PPR","","_","_"
3,"_","_","_","eva","CEM","","_","_"
4,"_","_","_","eka","PPX","","_","_"
5,"śatād","_","_","śata","NUM","","_","_"
6,"api","_","_","api","CX","","_","_"
7,"varaḥ","_","_","vara","JJ","","_","_"
8,"sutaḥ","_","_","suta","NC","","_","_"
1,"na","_","_","na","CNG","","_","_"
2,"_","_","_","ca","CCD","","_","_"
3,"_","_","_","api","CX","","_","_"
4,"_","_","_","mat","PPR","","_","_"
5,"vṛthā","_","_","vṛthā","CX","","_","_"
6,"bhūyo","_","_","bhūyas","CX","","_","_"
7,"dārān","_","_","dāra","NC","","_","_"
8,"kartum","_","_","kṛ","CGDI","","_","_"
9,"_","_","_","iha","CAD","","_","_"
10,"_","_","_","utsah","V","utsah","_","_"
1,"_","_","_","saṃtāna","NC","","_","_"
2,"_","_","_","avināśa","NC","","_","_"
3,"kāmaye","_","_","kāmaya","V","kāmay","_","_"
4,"bhadram","_","_","bhadra","NC","","_","_"
5,"astu","_","_","as","V","as","_","_"
6,"te","_","_","tvat","PPR","","_","_"
1,"_","_","_","anapatya","JJ","","_","_"
3,"_","_","_","eka","PPX","","_","_"
4,"_","_","_","putra","NC","","_","_"
6,"_","_","_","iti","CQT","","_","_"
7,"_","_","_","ah","V","ah","_","_"
8,"_","_","_","dharma","NC","","_","_"
9,"_","_","_","vādin","JJ","","_","_"
1,"cakṣur","_","_","cakṣus","NC","","_","_"
2,"ekaṃ","_","_","eka","PPX","","_","_"
3,"ca","_","_","ca","CCD","","_","_"
4,"putraṃ","_","_","putra","NC","","_","_"
5,"ca","_","_","ca","CCD","","_","_"
6,"asti","_","_","as","V","as","_","_"
7,"_","_","_","na","CNG","","_","_"
8,"_","_","_","as","V","as","_","_"
9,"ca","_","_","ca","CCD","","_","_"
10,"bhārata","_","_","bhārata","NC","","_","_"
1,"_","_","_","cakṣus","NC","","_","_"
2,"_","_","_","nāśa","NC","","_","_"
3,"tanor","_","_","tanu","NC","","_","_"
4,"nāśaḥ","_","_","nāśa","NC","","_","_"
5,"_","_","_","putra","NC","","_","_"
6,"_","_","_","nāśa","NC","","_","_"
7,"_","_","_","kula","NC","","_","_"
8,"_","_","_","kṣaya","NC","","_","_"
1,"agnihotraṃ","_","_","agnihotra","NC","","_","_"
2,"trayo","_","_","tri","NUM","","_","_"
3,"vedā","_","_","veda","NC","","_","_"
4,"_","_","_","yajña","NC","","_","_"
5,"_","_","_","ca","CCD","","_","_"
6,"_","_","_","saha","CX","","_","_"
7,"_","_","_","dakṣiṇā","NC","","_","_"
1,"_","_","_","sarva","JQ","","_","_"
2,"_","_","_","tad","PRD","","_","_"
3,"_","_","_","apatya","NC","","_","_"
4,"kalāṃ","_","_","kalā","NC","","_","_"
5,"_","_","_","na","CNG","","_","_"
6,"_","_","_","arh","V","arh","_","_"
7,"ṣoḍaśīm","_","_","ṣoḍaśa","JJ","","_","_"
1,"evam","_","_","eva","CX","","_","_"
2,"eva","_","_","eva","CEM","","_","_"
3,"manuṣyeṣu","_","_","manuṣya","NC","","_","_"
4,"_","_","_","as","V","as","_","_"
5,"_","_","_","ca","CCD","","_","_"
6,"_","_","_","sarva","JQ","","_","_"
7,"_","_","_","prajā","NC","","_","_"
8,"_","_","_","api","CX","","_","_"
1,"yad","_","_","yad","PRL","","_","_"
2,"apatyaṃ","_","_","apatya","NC","","_","_"
3,"_","_","_","mahat","JJ","","_","_"
4,"_","_","_","prājña","JJ","","_","_"
5,"tatra","_","_","tatra","CAD","","_","_"
6,"me","_","_","mat","PPR","","_","_"
7,"_","_","_","na","CNG","","_","_"
8,"_","_","_","as","V","as","_","_"
9,"saṃśayaḥ","_","_","saṃśaya","NC","","_","_"
1,"_","_","_","apatya","NC","","_","_"
2,"_","_","_","anṛṇa","JJ","","_","_"
3,"loke","_","_","loka","NC","","_","_"
4,"pitṝṇāṃ","_","_","pitṛ","NC","","_","_"
5,"_","_","_","na","CNG","","_","_"
6,"_","_","_","as","V","as","_","_"
7,"saṃśayaḥ","_","_","saṃśaya","NC","","_","_"
1,"eṣā","_","_","tad","PRD","","_","_"
2,"trayī","_","_","trayī","NC","","_","_"
3,"purāṇānām","_","_","purāṇa","JJ","","_","_"
4,"uttamānāṃ","_","_","uttama","JJ","","_","_"
5,"ca","_","_","ca","CCD","","_","_"
6,"śāśvatī","_","_","śāśvata","JJ","","_","_"
1,"apatyaṃ","_","_","apatya","NC","","_","_"
2,"karma","_","_","karman","NC","","_","_"
3,"vidyā","_","_","vidyā","NC","","_","_"
4,"ca","_","_","ca","CCD","","_","_"
5,"trīṇi","_","_","tri","NUM","","_","_"
6,"jyotīṃṣi","_","_","jyotis","NC","","_","_"
7,"bhārata","_","_","bhārata","NC","","_","_"
1,"yad","_","_","yad","PRL","","_","_"
2,"idaṃ","_","_","ida","PRD","","_","_"
3,"kāraṇaṃ","_","_","kāraṇa","NC","","_","_"
4,"tāta","_","_","tāta","NC","","_","_"
5,"sarvam","_","_","sarva","JQ","","_","_"
6,"ākhyātam","_","_","ākhyā","PPP","","_","_"
7,"añjasā","_","_","añjasā","CX","","_","_"
1,"tvaṃ","_","_","tvat","PPR","","_","_"
2,"ca","_","_","ca","CCD","","_","_"
3,"śūraḥ","_","_","śūra","NC","","_","_"
4,"_","_","_","sadā","CAD","","_","_"
5,"_","_","_","amarṣin","JJ","","_","_"
6,"_","_","_","śastra","NC","","_","_"
7,"_","_","_","nitya","JJ","","_","_"
8,"_","_","_","ca","CCD","","_","_"
9,"bhārata","_","_","bhārata","NC","","_","_"
1,"_","_","_","na","CNG","","_","_"
2,"_","_","_","anyatra","CX","","_","_"
3,"śastrāt","_","_","śastra","NC","","_","_"
4,"tasmāt","_","_","tad","PRD","","_","_"
5,"te","_","_","tvat","PPR","","_","_"
6,"nidhanaṃ","_","_","nidhana","NC","","_","_"
7,"vidyate","_","_","vid","V","vid","_","_"
8,"'nagha","_","_","anagha","JJ","","_","_"
1,"so","_","_","tad","PRD","","_","_"
2,"'smi","_","_","as","V","as","_","_"
3,"saṃśayam","_","_","saṃśaya","NC","","_","_"
4,"_","_","_","āpad","PPP","","_","_"
5,"_","_","_","tvat","PPR","","_","_"
6,"śānte","_","_","śa","PPP","","_","_"
7,"kathaṃ","_","_","katha","CX","","_","_"
8,"bhavet","_","_","bhav","V","bhū","_","_"
1,"iti","_","_","iti","CQT","","_","_"
2,"te","_","_","tvat","PPR","","_","_"
3,"kāraṇaṃ","_","_","kāraṇa","NC","","_","_"
4,"tāta","_","_","tāta","NC","","_","_"
5,"_","_","_","duḥkha","NC","","_","_"
6,"_","_","_","vac","PPP","","_","_"
7,"aśeṣataḥ","_","_","aśeṣatas","CX","","_","_"
1,"_","_","_","tatas","CX","","_","_"
2,"_","_","_","tad","PRD","","_","_"
3,"kāraṇaṃ","_","_","kāraṇa","NC","","_","_"
4,"jñātvā","_","_","jñā","CGDA","","_","_"
5,"kṛtsnaṃ","_","_","kṛtsna","JJ","","_","_"
6,"_","_","_","ca","CCD","","_","_"
7,"_","_","_","eva","CX","","_","_"
8,"aśeṣataḥ","_","_","aśeṣatas","CX","","_","_"
1,"devavrato","_","_","devavrata","NC","","_","_"
2,"_","_","_","mahat","JJ","","_","_"
3,"_","_","_","buddhi","NC","","_","_"
4,"_","_","_","prayā","V","prayā","_","_"
5,"_","_","_","anucintay","KDP","","_","_"
1,"sūtaḥ","_","_","sūta","NC","","_","_"
1,"vaiśaṃpāyanaḥ","_","_","vaiśampāyana","NC","","_","_"
1,"_","_","_","apatya","NC","","_","_"
2,"_","_","_","phala","NC","","_","_"
3,"_","_","_","saṃyuj","PPP","","_","_"
4,"_","_","_","tad","PRD","","_","_"
5,"_","_","_","śru","CGDA","","_","_"
6,"pitur","_","_","pitṛ","NC","","_","_"
7,"vacaḥ","_","_","vacas","NC","","_","_"
1,"sūtaṃ","_","_","sūta","NC","","_","_"
2,"bhūyo","_","_","bhūyas","CX","","_","_"
3,"'pi","_","_","api","CX","","_","_"
4,"saṃtapta","_","_","saṃtap","PPP","","_","_"
5,"āhvayāmāsa","_","_","āhvā","V","āhvā","_","_"
6,"vai","_","_","vai","CX","","_","_"
7,"pituḥ","_","_","pitṛ","NC","","_","_"
1,"_","_","_","sūta","NC","","_","_"
2,"_","_","_","tu","CCD","","_","_"
3,"_","_","_","kuru","NC","","_","_"
4,"_","_","_","mukhya","JJ","","_","_"
5,"_","_","_","upayā","PPP","","_","_"
6,"_","_","_","tad","PRD","","_","_"
7,"_","_","_","ājñā","NC","","_","_"
1,"tam","_","_","tad","PRD","","_","_"
2,"uvāca","_","_","vak","V","vac","_","_"
3,"_","_","_","mahat","JJ","","_","_"
4,"_","_","_","prājña","JJ","","_","_"
5,"bhīṣmo","_","_","bhīṣma","NC","","_","_"
6,"vai","_","_","vai","CX","","_","_"
7,"sārathiṃ","_","_","sārathi","NC","","_","_"
8,"pituḥ","_","_","pitṛ","NC","","_","_"
1,"tvaṃ","_","_","tvat","PPR","","_","_"
2,"sārathe","_","_","sārathi","NC","","_","_"
3,"pitur","_","_","pitṛ","NC","","_","_"
4,"mahyaṃ","_","_","mat","PPR","","_","_"
5,"_","_","_","sakhi","NC","","_","_"
6,"_","_","_","as","V","as","_","_"
7,"_","_","_","ratha","NC","","_","_"
8,"_","_","_","dhūrgata","JJ","","_","_"
1,"abhijānāsi","_","_","abhijān","V","abhijñā","_","_"
2,"yadi","_","_","yadi","CSB","","_","_"
3,"vai","_","_","vai","CX","","_","_"
4,"kasyāṃ","_","_","kiṃ","PRQ","","_","_"
5,"bhāvo","_","_","bhāva","NC","","_","_"
6,"nṛpasya","_","_","nṛpa","NC","","_","_"
7,"tu","_","_","tu","CCD","","_","_"
1,"etad","_","_","tad","PRD","","_","_"
2,"ācakṣva","_","_","cakṣ","V","cakṣ","_","_"
3,"me","_","_","mat","PPR","","_","_"
4,"pṛṣṭaḥ","_","_","pracch","PPP","","_","_"
5,"kariṣye","_","_","kar","V","kṛ","_","_"
6,"na","_","_","na","CNG","","_","_"
7,"_","_","_","tad","PRD","","_","_"
8,"_","_","_","anyathā","CX","","_","_"
1,"_","_","_","dāśa","NC","","_","_"
2,"_","_","_","kanyā","NC","","_","_"
3,"_","_","_","nara","NC","","_","_"
4,"_","_","_","śreṣṭha","JJ","","_","_"
5,"tatra","_","_","tatra","CAD","","_","_"
6,"bhāvaḥ","_","_","bhāva","NC","","_","_"
7,"pitur","_","_","pitṛ","NC","","_","_"
8,"gataḥ","_","_","ga","PPP","","_","_"
1,"vṛtaḥ","_","_","vṛ","PPP","","_","_"
2,"sa","_","_","tad","PRD","","_","_"
3,"naradevena","_","_","naradeva","NC","","_","_"
4,"tadā","_","_","tadā","CAD","","_","_"
5,"vacanam","_","_","vacana","NC","","_","_"
6,"abravīt","_","_","abravīta","V","brū","_","_"
1,"yo","_","_","yad","PRL","","_","_"
2,"'syāṃ","_","_","ida","PRD","","_","_"
3,"pumān","_","_","puṃs","NC","","_","_"
4,"bhaved","_","_","bhav","V","bhū","_","_"
5,"garbhaḥ","_","_","garbha","NC","","_","_"
6,"sa","_","_","tad","PRD","","_","_"
7,"rājā","_","_","rājan","NC","","_","_"
8,"_","_","_","tvat","PPR","","_","_"
9,"_","_","_","anantara","JJ","","_","_"
1,"_","_","_","na","CNG","","_","_"
2,"_","_","_","kāmay","V","kāmay","_","_"
3,"taṃ","_","_","tad","PRD","","_","_"
4,"dātuṃ","_","_","dā","CGDI","","_","_"
5,"pitā","_","_","pitṛ","NC","","_","_"
6,"tava","_","_","tvat","PPR","","_","_"
7,"varaṃ","_","_","vara","NC","","_","_"
8,"tadā","_","_","tadā","CAD","","_","_"
1,"sa","_","_","tad","PRD","","_","_"
2,"_","_","_","ca","CCD","","_","_"
3,"_","_","_","api","CX","","_","_"
4,"_","_","_","niścaya","NC","","_","_"
5,"_","_","_","tad","PRD","","_","_"
6,"na","_","_","na","CNG","","_","_"
7,"ca","_","_","ca","CCD","","_","_"
8,"dadyām","_","_","dad","V","dā","_","_"
9,"ato","_","_","atas","CX","","_","_"
10,"'nyathā","_","_","anyathā","CX","","_","_"
1,"evaṃ","_","_","eva","CX","","_","_"
2,"te","_","_","tvat","PPR","","_","_"
3,"kathitaṃ","_","_","kathay","PPP","","_","_"
4,"vīra","_","_","vīra","NC","","_","_"
5,"kuruṣva","_","_","kar","V","kṛ","_","_"
6,"yad","_","_","yad","PRL","","_","_"
7,"anantaram","_","_","anantara","JJ","","_","_"
1,"tataḥ","_","_","tatas","CX","","_","_"
2,"sa","_","_","tad","PRD","","_","_"
3,"pitur","_","_","pitṛ","NC","","_","_"
4,"ājñāya","_","_","ājñā","CGDA","","_","_"
5,"mataṃ","_","_","mata","NC","","_","_"
6,"samyag","_","_","samyak","CX","","_","_"
7,"avekṣya","_","_","avekṣ","CGDA","","_","_"
8,"ca","_","_","ca","CCD","","_","_"
1,"jñātvā","_","_","jñā","CGDA","","_","_"
2,"vimanasaṃ","_","_","vimanas","JJ","","_","_"
3,"putraḥ","_","_","putra","NC","","_","_"
4,"prayayau","_","_","prayā","V","prayā","_","_"
5,"yamunāṃ","_","_","yamunā","NC","","_","_"
6,"prati","_","_","prati","CADP","","_","_"
1,"abhyagacchat","_","_","abhiga","V","abhiga","_","_"
2,"_","_","_","tadā","CAD","","_","_"
3,"_","_","_","eva","CEM","","_","_"
4,"_","_","_","āśu","JJ","","_","_"
5,"_","_","_","vṛddha","JJ","","_","_"
6,"_","_","_","amātya","NC","","_","_"
7,"pitur","_","_","pitṛ","NC","","_","_"
8,"hitam","_","_","hita","JJ","","_","_"
1,"tam","_","_","tad","PRD","","_","_"
2,"apṛcchat","_","_","pracch","V","pracch","_","_"
3,"_","_","_","tadā","CAD","","_","_"
4,"_","_","_","abhye","CGDA","","_","_"
5,"_","_","_","pitṛ","NC","","_","_"
6,"_","_","_","tad","PRD","","_","_"
7,"_","_","_","śoka","NC","","_","_"
8,"_","_","_","kāraṇa","NC","","_","_"
1,"tasmai","_","_","tad","PRD","","_","_"
2,"sa","_","_","tad","PRD","","_","_"
3,"_","_","_","kuru","NC","","_","_"
4,"_","_","_","mukhya","JJ","","_","_"
5,"yathāvat","_","_","yathāvat","CX","","_","_"
6,"paripṛcchate","_","_","paripracch","KDP","","_","_"
1,"varaṃ","_","_","vara","NC","","_","_"
2,"śaśaṃsa","_","_","śaṃs","V","śaṃs","_","_"
3,"kanyāṃ","_","_","kanyā","NC","","_","_"
4,"tām","_","_","tad","PRD","","_","_"
5,"uddiśya","_","_","uddiś","CGDA","","_","_"
6,"_","_","_","bharata","NC","","_","_"
7,"_","_","_","ṛṣabha","NC","","_","_"
1,"tato","_","_","tatas","CX","","_","_"
2,"devavrato","_","_","devavrata","NC","","_","_"
3,"vṛddhaiḥ","_","_","vṛddha","JJ","","_","_"
4,"kṣatriyaiḥ","_","_","kṣatriya","NC","","_","_"
5,"_","_","_","sahita","JJ","","_","_"
6,"_","_","_","tadā","CAD","","_","_"
1,"abhigamya","_","_","abhiga","CGDA","","_","_"
2,"_","_","_","dāśa","NC","","_","_"
3,"_","_","_","rājan","NC","","_","_"
4,"kanyāṃ","_","_","kanyā","NC","","_","_"
5,"vavre","_","_","vṛ","V","vṛ","_","_"
6,"pituḥ","_","_","pitṛ","NC","","_","_"
7,"svayam","_","_","svaya","CX","","_","_"
1,"taṃ","_","_","tad","PRD","","_","_"
2,"dāśaḥ","_","_","dāśa","NC","","_","_"
3,"pratijagrāha","_","_","pratigrah","V","pratigrah","_","_"
4,"vidhivat","_","_","vidhivat","CX","","_","_"
5,"pratipūjya","_","_","pratipūjay","CGDA","","_","_"
6,"ca","_","_","ca","CCD","","_","_"
1,"_","_","_","abravīta","V","brū","_","_"
2,"_","_","_","ca","CCD","","_","_"
3,"_","_","_","a","PRD","","_","_"
4,"āsīnaṃ","_","_","ās","PPP","","_","_"
5,"_","_","_","rājan","NC","","_","_"
6,"_","_","_","saṃsad","NC","","_","_"
7,"bhārata","_","_","bhārata","NC","","_","_"
1,"uccaiḥśravāḥ","_","_","uccaiḥśravas","NC","","_","_"
1,"_","_","_","rājya","NC","","_","_"
2,"_","_","_","śulka","NC","","_","_"
3,"pradātavyā","_","_","pradā","KDG","","_","_"
4,"_","_","_","kanyā","NC","","_","_"
5,"_","_","_","ida","PRD","","_","_"
6,"yācatāṃ","_","_","yāc","KDP","","_","_"
7,"vara","_","_","vara","NC","","_","_"
1,"apatyaṃ","_","_","apatya","NC","","_","_"
2,"yad","_","_","yad","PRL","","_","_"
3,"bhaved","_","_","bhav","V","bhū","_","_"
4,"asyāḥ","_","_","ida","PRD","","_","_"
5,"sa","_","_","tad","PRD","","_","_"
6,"_","_","_","rājan","NC","","_","_"
7,"_","_","_","as","V","as","_","_"
8,"pituḥ","_","_","pitṛ","NC","","_","_"
9,"param","_","_","para","PPX","","_","_"
1,"tvam","_","_","tvat","PPR","","_","_"
2,"eva","_","_","eva","CEM","","_","_"
3,"nāthaḥ","_","_","nātha","NC","","_","_"
4,"paryāptaḥ","_","_","paryāp","PPP","","_","_"
5,"śaṃtanoḥ","_","_","śaṃtanu","NC","","_","_"
6,"_","_","_","puruṣa","NC","","_","_"
7,"_","_","_","ṛṣabha","NC","","_","_"
1,"putraḥ","_","_","putra","NC","","_","_"
2,"putravatāṃ","_","_","putravat","JJ","","_","_"
3,"śreṣṭhaḥ","_","_","śreṣṭha","JJ","","_","_"
4,"kiṃ","_","_","kiṃ","PRQ","","_","_"
5,"nu","_","_","nu","CX","","_","_"
6,"vakṣyāmi","_","_","vak","V","vac","_","_"
7,"te","_","_","tvat","PPR","","_","_"
8,"vacaḥ","_","_","vacas","NC","","_","_"
1,"kumārikāyāḥ","_","_","kumārikā","NC","","_","_"
2,"śulkena","_","_","śulka","NC","","_","_"
3,"kiṃcid","_","_","kiṃcit","PRI","","_","_"
4,"vakṣyāmi","_","_","vak","V","vac","_","_"
5,"bhārata","_","_","bhārata","NC","","_","_"
1,"ko","_","_","kiṃ","PRQ","","_","_"
2,"hi","_","_","hi","CX","","_","_"
3,"saṃbandhakaṃ","_","_","sambandhaka","JJ","","_","_"
4,"ślāghyam","_","_","ślāgh","KDG","","_","_"
5,"īpsitaṃ","_","_","īpsay","PPP","","_","_"
6,"yaunam","_","_","yauna","NC","","_","_"
7,"īdṛśam","_","_","īdṛśa","JJ","","_","_"
1,"atikrāman","_","_","atikra","KDP","","_","_"
2,"na","_","_","na","CNG","","_","_"
3,"tapyeta","_","_","tap","V","tap","_","_"
4,"sākṣād","_","_","sākṣāt","CX","","_","_"
5,"api","_","_","api","CX","","_","_"
6,"śatakratuḥ","_","_","śatakratu","NC","","_","_"
1,"apatyaṃ","_","_","apatya","NC","","_","_"
2,"_","_","_","ca","CCD","","_","_"
3,"_","_","_","tad","PRD","","_","_"
4,"āryasya","_","_","ārya","JJ","","_","_"
5,"yo","_","_","yad","PRL","","_","_"
6,"yuṣmākaṃ","_","_","tvat","PPR","","_","_"
7,"samo","_","_","sama","PPX","","_","_"
8,"guṇaiḥ","_","_","guṇa","NC","","_","_"
1,"yasya","_","_","yad","PRL","","_","_"
2,"śukrāt","_","_","śukra","NC","","_","_"
3,"satyavatī","_","_","satyavatī","NC","","_","_"
4,"prādurbhūtā","_","_","prādurbhū","PPP","","_","_"
5,"yaśasvinī","_","_","yaśasvin","JJ","","_","_"
1,"tena","_","_","tad","PRD","","_","_"
2,"me","_","_","mat","PPR","","_","_"
3,"_","_","_","bahuśas","CX","","_","_"
4,"_","_","_","tāta","NC","","_","_"
5,"pitā","_","_","pitṛ","NC","","_","_"
6,"te","_","_","tvat","PPR","","_","_"
7,"parikīrtitaḥ","_","_","parikīrtay","PPP","","_","_"
1,"arhaḥ","_","_","arha","JJ","","_","_"
2,"satyavatīṃ","_","_","satyavatī","NC","","_","_"
3,"voḍhuṃ","_","_","vah","CGDI","","_","_"
4,"_","_","_","sarva","JQ","","_","_"
5,"_","_","_","rājan","NC","","_","_"
6,"bhārata","_","_","bhārata","NC","","_","_"
1,"asito","_","_","asita","NC","","_","_"
2,"_","_","_","hi","CX","","_","_"
3,"_","_","_","api","CX","","_","_"
4,"_","_","_","deva","NC","","_","_"
5,"_","_","_","ṛṣi","NC","","_","_"
6,"pratyākhyātaḥ","_","_","pratyākhyā","PPP","","_","_"
7,"purā","_","_","purā","CX","","_","_"
8,"mayā","_","_","mat","PPR","","_","_"
1,"satyavatyā","_","_","satyavatī","NC","","_","_"
2,"bhṛśaṃ","_","_","bhṛśa","CX","","_","_"
3,"_","_","_","hi","CX","","_","_"
4,"_","_","_","arthin","JJ","","_","_"
5,"sa","_","_","tad","PRD","","_","_"
6,"āsīd","_","_","as","V","as","_","_"
7,"_","_","_","ṛṣi","NC","","_","_"
8,"_","_","_","sattama","JJ","","_","_"
1,"_","_","_","kanyā","NC","","_","_"
2,"_","_","_","pitṛ","NC","","_","_"
4,"kiṃcit","_","_","kiṃcit","PRI","","_","_"
5,"tu","_","_","tu","CCD","","_","_"
6,"vakṣyāmi","_","_","vak","V","vac","_","_"
7,"_","_","_","bharata","NC","","_","_"
8,"_","_","_","ṛṣabha","NC","","_","_"
1,"balavat","_","_","balavat","JJ","","_","_"
2,"_","_","_","sapatna","NC","","_","_"
4,"atra","_","_","atra","CAD","","_","_"
5,"doṣaṃ","_","_","doṣa","NC","","_","_"
6,"paśyāmi","_","_","paś","V","paś","_","_"
7,"kevalam","_","_","kevala","JJ","","_","_"
1,"bhūyāṃsaṃ","_","_","bhūyas","JJ","","_","_"
2,"tvayi","_","_","tvat","PPR","","_","_"
3,"paśyāmi","_","_","paś","V","paś","_","_"
4,"taṃ","_","_","tad","PRD","","_","_"
5,"doṣam","_","_","doṣa","NC","","_","_"
6,"aparājita","_","_","aparājita","JJ","","_","_"
1,"yasya","_","_","yad","PRL","","_","_"
2,"hi","_","_","hi","CX","","_","_"
3,"tvaṃ","_","_","tvat","PPR","","_","_"
4,"sapatnaḥ","_","_","sapatna","NC","","_","_"
5,"syā","_","_","as","V","as","_","_"
6,"_","_","_","gandharva","NC","","_","_"
7,"_","_","_","asura","NC","","_","_"
8,"vā","_","_","vā","CCD","","_","_"
1,"na","_","_","na","CNG","","_","_"
2,"sa","_","_","tad","PRD","","_","_"
3,"jātu","_","_","jātu","CX","","_","_"
4,"sukhaṃ","_","_","sukha","JJ","","_","_"
5,"jīvet","_","_","jīv","V","jīv","_","_"
6,"tvayi","_","_","tvat","PPR","","_","_"
7,"kruddhe","_","_","krudh","PPP","","_","_"
8,"paraṃtapa","_","_","paraṃtapa","JJ","","_","_"
1,"etāvān","_","_","etāvat","JJ","","_","_"
2,"atra","_","_","atra","CAD","","_","_"
3,"doṣo","_","_","doṣa","NC","","_","_"
4,"hi","_","_","hi","CX","","_","_"
5,"_","_","_","na","CNG","","_","_"
6,"_","_","_","anya","PPX","","_","_"
7,"kaścana","_","_","kaścana","PRI","","_","_"
8,"pārthiva","_","_","pārthiva","NC","","_","_"
1,"_","_","_","tad","PRD","","_","_"
2,"_","_","_","jān","V","jñā","_","_"
3,"bhadraṃ","_","_","bhadra","NC","","_","_"
4,"te","_","_","tvat","PPR","","_","_"
5,"_","_","_","dāna","NC","","_","_"
6,"_","_","_","ādāna","NC","","_","_"
7,"paraṃtapa","_","_","paraṃtapa","JJ","","_","_"
1,"evam","_","_","eva","CX","","_","_"
2,"_","_","_","vac","PPP","","_","_"
3,"_","_","_","tu","CCD","","_","_"
4,"_","_","_","gāṅgeya","NC","","_","_"
5,"_","_","_","tad","PRD","","_","_"
6,"_","_","_","yuj","PPP","","_","_"
7,"pratyabhāṣata","_","_","pratibhāṣ","V","pratibhāṣ","_","_"
1,"śṛṇvatāṃ","_","_","śru","KDP","","_","_"
2,"bhūmipālānāṃ","_","_","bhūmipāla","NC","","_","_"
3,"pitur","_","_","pitṛ","NC","","_","_"
4,"arthāya","_","_","artha","NC","","_","_"
5,"bhārata","_","_","bhārata","NC","","_","_"
1,"idaṃ","_","_","ida","PRD","","_","_"
2,"me","_","_","mat","PPR","","_","_"
3,"matam","_","_","mata","NC","","_","_"
4,"ādatsva","_","_","ādad","V","ādā","_","_"
5,"satyaṃ","_","_","satya","JJ","","_","_"
6,"satyavatāṃ","_","_","satyavat","JJ","","_","_"
7,"vara","_","_","vara","JJ","","_","_"
1,"_","_","_","na","CNG","","_","_"
2,"_","_","_","eva","CEM","","_","_"
3,"jāto","_","_","jan","PPP","","_","_"
4,"na","_","_","na","CNG","","_","_"
5,"_","_","_","vā","CCD","","_","_"
6,"_","_","_","ajāta","JJ","","_","_"
7,"īdṛśaṃ","_","_","īdṛśa","JJ","","_","_"
8,"vaktum","_","_","vac","CGDI","","_","_"
9,"utsahet","_","_","utsah","V","utsah","_","_"
1,"evam","_","_","eva","CX","","_","_"
2,"etat","_","_","tad","PRD","","_","_"
3,"kariṣyāmi","_","_","kar","V","kṛ","_","_"
4,"yathā","_","_","yathā","CCM","","_","_"
5,"tvam","_","_","tvat","PPR","","_","_"
6,"anubhāṣase","_","_","anubhāṣ","V","anubhāṣ","_","_"
1,"yo","_","_","yad","PRL","","_","_"
2,"'syāṃ","_","_","ida","PRD","","_","_"
3,"janiṣyate","_","_","jan","V","jan","_","_"
4,"putraḥ","_","_","putra","NC","","_","_"
5,"sa","_","_","tad","PRD","","_","_"
6,"no","_","_","mat","PPR","","_","_"
7,"rājā","_","_","rājan","NC","","_","_"
8,"bhaviṣyati","_","_","bhav","V","bhū","_","_"
1,"_","_","_","iti","CQT","","_","_"
2,"_","_","_","vac","PPP","","_","_"
3,"punar","_","_","punar","CAD","","_","_"
4,"_","_","_","eva","CEM","","_","_"
5,"_","_","_","atha","CAD","","_","_"
6,"taṃ","_","_","tad","PRD","","_","_"
7,"dāśaḥ","_","_","dāśa","NC","","_","_"
8,"pratyabhāṣata","_","_","pratibhāṣ","V","pratibhāṣ","_","_"
1,"cikīrṣur","_","_","cikīrṣu","JJ","","_","_"
2,"duṣkaraṃ","_","_","duṣkara","JJ","","_","_"
3,"karma","_","_","karman","NC","","_","_"
4,"_","_","_","rājya","NC","","_","_"
5,"_","_","_","artha","NC","","_","_"
6,"_","_","_","bharata","NC","","_","_"
7,"_","_","_","ṛṣabha","NC","","_","_"
1,"tvam","_","_","tvat","PPR","","_","_"
2,"eva","_","_","eva","CEM","","_","_"
3,"nāthaḥ","_","_","nātha","NC","","_","_"
4,"paryāptaḥ","_","_","paryāp","PPP","","_","_"
5,"śaṃtanor","_","_","śaṃtanu","NC","","_","_"
6,"_","_","_","amita","JJ","","_","_"
7,"_","_","_","dyuti","NC","","_","_"
1,"_","_","_","kanyā","NC","","_","_"
2,"_","_","_","ca","CCD","","_","_"
3,"_","_","_","eva","CEM","","_","_"
4,"_","_","_","dharma","NC","","_","_"
5,"_","_","_","ātman","NC","","_","_"
6,"prabhur","_","_","prabhu","JJ","","_","_"
7,"dānāya","_","_","dāna","NC","","_","_"
8,"_","_","_","ca","CCD","","_","_"
9,"_","_","_","īśvara","NC","","_","_"
1,"idaṃ","_","_","ida","PRD","","_","_"
2,"tu","_","_","tu","CCD","","_","_"
3,"vacanaṃ","_","_","vacana","NC","","_","_"
4,"saumya","_","_","saumya","JJ","","_","_"
5,"kāryaṃ","_","_","kārya","NC","","_","_"
6,"_","_","_","ca","CCD","","_","_"
7,"_","_","_","eva","CEM","","_","_"
8,"nibodha","_","_","nibodh","V","nibudh","_","_"
9,"me","_","_","mat","PPR","","_","_"
1,"kaumārikāṇāṃ","_","_","kaumārika","NC","","_","_"
2,"śīlena","_","_","śīla","NC","","_","_"
3,"_","_","_","vak","V","vac","_","_"
4,"_","_","_","mat","PPR","","_","_"
5,"ariṃdama","_","_","ariṃdama","NC","","_","_"
1,"yat","_","_","yad","PRL","","_","_"
2,"tvayā","_","_","tvat","PPR","","_","_"
3,"_","_","_","satyavatī","NC","","_","_"
4,"_","_","_","artha","NC","","_","_"
5,"_","_","_","satya","NC","","_","_"
6,"_","_","_","dharma","NC","","_","_"
7,"_","_","_","parāyaṇa","NC","","_","_"
1,"_","_","_","rājan","NC","","_","_"
2,"_","_","_","madhya","NC","","_","_"
3,"pratijñātam","_","_","pratijñā","PPP","","_","_"
4,"anurūpaṃ","_","_","anurūpa","JJ","","_","_"
5,"_","_","_","tvat","PPR","","_","_"
6,"_","_","_","eva","CEM","","_","_"
7,"tat","_","_","tad","PRD","","_","_"
1,"_","_","_","na","CNG","","_","_"
2,"_","_","_","anyathā","CX","","_","_"
3,"tan","_","_","tad","PRD","","_","_"
4,"_","_","_","mahat","JJ","","_","_"
5,"_","_","_","bāhu","NC","","_","_"
6,"saṃśayo","_","_","saṃśaya","NC","","_","_"
7,"'tra","_","_","atra","CAD","","_","_"
8,"na","_","_","na","CNG","","_","_"
9,"kaścana","_","_","kaścana","PRI","","_","_"
1,"_","_","_","na","CNG","","_","_"
2,"_","_","_","as","V","as","_","_"
3,"_","_","_","tad","PRD","","_","_"
4,"_","_","_","anyathā","CX","","_","_"
5,"_","_","_","bhāva","NC","","_","_"
6,"_","_","_","tvat","PPR","","_","_"
7,"_","_","_","ripu","NC","","_","_"
8,"_","_","_","nibarhaṇa","JJ","","_","_"
1,"vidyate","_","_","vid","V","vid","_","_"
2,"_","_","_","puruṣa","NC","","_","_"
3,"_","_","_","vyāghra","NC","","_","_"
4,"tvayi","_","_","tvat","PPR","","_","_"
5,"satyaṃ","_","_","satya","NC","","_","_"
6,"_","_","_","mahat","JJ","","_","_"
7,"_","_","_","vrata","NC","","_","_"
1,"_","_","_","tvat","PPR","","_","_"
2,"_","_","_","apatya","NC","","_","_"
3,"bhaved","_","_","bhav","V","bhū","_","_"
4,"yat","_","_","yad","PRL","","_","_"
5,"tu","_","_","tu","CCD","","_","_"
6,"tatra","_","_","tatra","CAD","","_","_"
7,"naḥ","_","_","mat","PPR","","_","_"
8,"saṃśayo","_","_","saṃśaya","NC","","_","_"
9,"mahān","_","_","mahat","JJ","","_","_"
1,"tasya","_","_","tad","PRD","","_","_"
2,"tan","_","_","tad","PRD","","_","_"
3,"matam","_","_","mata","NC","","_","_"
4,"ājñāya","_","_","ājñā","CGDA","","_","_"
5,"_","_","_","satya","NC","","_","_"
6,"_","_","_","dharma","NC","","_","_"
7,"_","_","_","parāyaṇa","NC","","_","_"
1,"pratyajānāt","_","_","pratijān","V","pratijñā","_","_"
2,"tadā","_","_","tadā","CAD","","_","_"
3,"rājan","_","_","rājan","NC","","_","_"
4,"pituḥ","_","_","pitṛ","NC","","_","_"
5,"_","_","_","priya","NC","","_","_"
6,"_","_","_","cikīrṣā","NC","","_","_"
1,"devavrata","_","_","devavrata","NC","","_","_"
2,"uvāca","_","_","vak","V","vac","_","_"
1,"_","_","_","dāśa","NC","","_","_"
2,"_","_","_","rāja","NC","","_","_"
3,"_","_","_","nibodh","V","nibudh","_","_"
4,"_","_","_","ida","PRD","","_","_"
5,"vacanaṃ","_","_","vacana","NC","","_","_"
6,"me","_","_","mat","PPR","","_","_"
7,"_","_","_","nṛpa","NC","","_","_"
8,"_","_","_","uttama","JJ","","_","_"
1,"ṛṣayo","_","_","ṛṣi","NC","","_","_"
2,"_","_","_","vā","CCD","","_","_"
3,"_","_","_","atha","CAD","","_","_"
4,"vā","_","_","vā","CCD","","_","_"
5,"devā","_","_","deva","NC","","_","_"
6,"_","_","_","bhūta","NC","","_","_"
7,"_","_","_","antardhā","PPP","","_","_"
8,"ca","_","_","ca","CCD","","_","_"
1,"yāni","_","_","yad","PRL","","_","_"
2,"_","_","_","tad","PRD","","_","_"
3,"_","_","_","iha","CAD","","_","_"
4,"śṛṇvantu","_","_","śṛṇ","V","śru","_","_"
5,"_","_","_","na","CNG","","_","_"
6,"_","_","_","as","V","as","_","_"
7,"_","_","_","vaktṛ","JJ","","_","_"
8,"_","_","_","ida","PRD","","_","_"
9,"_","_","_","mat","PPR","","_","_"
10,"_","_","_","samā","NC","","_","_"
1,"idaṃ","_","_","ida","PRD","","_","_"
2,"vacanam","_","_","vacana","NC","","_","_"
3,"ādhatsva","_","_","ādadh","V","ādhā","_","_"
4,"satyena","_","_","satya","NC","","_","_"
5,"mama","_","_","mat","PPR","","_","_"
6,"jalpataḥ","_","_","jalp","KDP","","_","_"
1,"śṛṇvatāṃ","_","_","śru","KDP","","_","_"
2,"bhūmipālānāṃ","_","_","bhūmipāla","NC","","_","_"
3,"yad","_","_","yad","PRL","","_","_"
4,"bravīmi","_","_","abravīta","V","brū","_","_"
5,"pituḥ","_","_","pitṛ","NC","","_","_"
6,"kṛte","_","_","kṛta","NC","","_","_"
1,"rājyaṃ","_","_","rājya","NC","","_","_"
2,"tāvat","_","_","tāvat","CX","","_","_"
3,"pūrvam","_","_","pūrva","CX","","_","_"
4,"eva","_","_","eva","CEM","","_","_"
5,"mayā","_","_","mat","PPR","","_","_"
6,"tyaktaṃ","_","_","tyaj","PPP","","_","_"
7,"_","_","_","nara","NC","","_","_"
8,"_","_","_","adhipa","NC","","_","_"
1,"_","_","_","apatya","NC","","_","_"
2,"_","_","_","hetu","NC","","_","_"
3,"api","_","_","api","CX","","_","_"
4,"ca","_","_","ca","CCD","","_","_"
5,"_","_","_","kar","V","kṛ","_","_"
6,"_","_","_","tad","PRD","","_","_"
7,"viniścayam","_","_","viniścaya","NC","","_","_"
1,"adya","_","_","adya","CX","","_","_"
2,"prabhṛti","_","_","prabhṛti","CX","","_","_"
3,"me","_","_","mat","PPR","","_","_"
4,"dāśa","_","_","dāśa","NC","","_","_"
5,"brahmacaryaṃ","_","_","brahmacarya","NC","","_","_"
6,"bhaviṣyati","_","_","bhav","V","bhū","_","_"
1,"_","_","_","aputra","JJ","","_","_"
2,"_","_","_","api","CX","","_","_"
3,"me","_","_","mat","PPR","","_","_"
4,"lokā","_","_","loka","NC","","_","_"
5,"_","_","_","bhav","V","bhū","_","_"
6,"_","_","_","akṣaya","JJ","","_","_"
7,"divi","_","_","div","NC","","_","_"
1,"na","_","_","na","CNG","","_","_"
2,"hi","_","_","hi","CX","","_","_"
3,"_","_","_","janman","NC","","_","_"
4,"_","_","_","prabhṛti","CX","","_","_"
5,"_","_","_","vac","PPP","","_","_"
6,"mayā","_","_","mat","PPR","","_","_"
7,"kiṃcid","_","_","kiṃcit","PRI","","_","_"
8,"_","_","_","iha","CAD","","_","_"
9,"_","_","_","anṛta","NC","","_","_"
1,"yāvat","_","_","yāvat","CX","","_","_"
2,"prāṇā","_","_","prāṇa","NC","","_","_"
3,"dhriyante","_","_","dhar","V","dhṛ","_","_"
4,"vai","_","_","vai","CX","","_","_"
5,"mama","_","_","mat","PPR","","_","_"
6,"dehaṃ","_","_","deha","NC","","_","_"
7,"samāśritāḥ","_","_","samāśri","PPP","","_","_"
1,"tāvan","_","_","tāvat","CX","","_","_"
2,"na","_","_","na","CNG","","_","_"
3,"janayiṣyāmi","_","_","jan","V","jan","_","_"
4,"pitre","_","_","pitṛ","NC","","_","_"
5,"kanyāṃ","_","_","kanyā","NC","","_","_"
6,"prayaccha","_","_","prayaccha","V","praya","_","_"
7,"me","_","_","mat","PPR","","_","_"
1,"_","_","_","parityaj","V","parityaj","_","_"
2,"_","_","_","mat","PPR","","_","_"
3,"rājyaṃ","_","_","rājya","NC","","_","_"
4,"maithunaṃ","_","_","maithuna","NC","","_","_"
5,"_","_","_","ca","CCD","","_","_"
6,"_","_","_","api","CX","","_","_"
7,"sarvaśaḥ","_","_","sarvaśas","CX","","_","_"
1,"ūrdhvaretā","_","_","ūrdhvaretas","JJ","","_","_"
2,"bhaviṣyāmi","_","_","bhav","V","bhū","_","_"
3,"dāśa","_","_","dāśa","NC","","_","_"
4,"satyaṃ","_","_","satya","NC","","_","_"
5,"bravīmi","_","_","abravīta","V","brū","_","_"
6,"te","_","_","tvat","PPR","","_","_"
1,"vaiśaṃpāyana","_","_","vaiśampāyana","NC","","_","_"
2,"uvāca","_","_","vak","V","vac","_","_"
1,"tasya","_","_","tad","PRD","","_","_"
2,"tad","_","_","tad","PRD","","_","_"
3,"vacanaṃ","_","_","vacana","NC","","_","_"
4,"śrutvā","_","_","śru","CGDA","","_","_"
5,"_","_","_","samprahṛṣ","PPP","","_","_"
6,"_","_","_","tanūruha","NC","","_","_"
1,"_","_","_","dad","V","dā","_","_"
2,"_","_","_","iti","CQT","","_","_"
3,"_","_","_","eva","CEM","","_","_"
4,"taṃ","_","_","tad","PRD","","_","_"
5,"dāśo","_","_","dāśa","NC","","_","_"
6,"_","_","_","dharma","NC","","_","_"
7,"_","_","_","ātman","NC","","_","_"
8,"pratyabhāṣata","_","_","pratibhāṣ","V","pratibhāṣ","_","_"
1,"tato","_","_","tatas","CX","","_","_"
2,"'ntarikṣe","_","_","antarikṣa","NC","","_","_"
3,"'psaraso","_","_","apsaras","NC","","_","_"
4,"devāḥ","_","_","deva","NC","","_","_"
5,"_","_","_","sa_saha","CX","","_","_"
6,"_","_","_","ṛṣi","NC","","_","_"
7,"_","_","_","gaṇa","NC","","_","_"
8,"_","_","_","tathā","CX","","_","_"
1,"taṃ","_","_","tad","PRD","","_","_"
2,"dṛṣṭvā","_","_","dṛś","CGDA","","_","_"
3,"duṣkaraṃ","_","_","duṣkara","JJ","","_","_"
4,"karma","_","_","karman","NC","","_","_"
5,"_","_","_","praśaṃs","V","praśaṃs","_","_"
6,"_","_","_","ca","CCD","","_","_"
7,"pārthivāḥ","_","_","pārthiva","NC","","_","_"
1,"abhyavarṣanta","_","_","abhivṛṣ","V","abhivṛṣ","_","_"
2,"kusumair","_","_","kusuma","NC","","_","_"
3,"bhīṣmo","_","_","bhīṣma","NC","","_","_"
4,"'yam","_","_","ida","PRD","","_","_"
5,"iti","_","_","iti","CQT","","_","_"
6,"_","_","_","ca","CCD","","_","_"
7,"_","_","_","abravīta","V","brū","_","_"
1,"tataḥ","_","_","tatas","CX","","_","_"
2,"sa","_","_","tad","PRD","","_","_"
3,"pitur","_","_","pitṛ","NC","","_","_"
4,"arthāya","_","_","artha","NC","","_","_"
5,"tām","_","_","tad","PRD","","_","_"
6,"uvāca","_","_","vak","V","vac","_","_"
7,"yaśasvinīm","_","_","yaśasvin","JJ","","_","_"
1,"adhiroha","_","_","adhiroh","V","adhiruh","_","_"
2,"rathaṃ","_","_","ratha","NC","","_","_"
3,"mātar","_","_","mātṛ","NC","","_","_"
4,"gacchāvaḥ","_","_","gacch","V","gam","_","_"
5,"_","_","_","sva","JJ","","_","_"
6,"_","_","_","gṛha","NC","","_","_"
7,"iti","_","_","iti","CQT","","_","_"
1,"evam","_","_","eva","CX","","_","_"
2,"uktvā","_","_","vac","CGDA","","_","_"
3,"tu","_","_","tu","CCD","","_","_"
4,"_","_","_","bhīṣma","NC","","_","_"
5,"_","_","_","tad","PRD","","_","_"
6,"ratham","_","_","ratha","NC","","_","_"
7,"āropya","_","_","āropay","CGDA","","_","_"
8,"bhāminīm","_","_","bhāminī","NC","","_","_"
1,"āgamya","_","_","āga","CGDA","","_","_"
2,"hāstinapuraṃ","_","_","hāstinapura","NC","","_","_"
3,"śaṃtanoḥ","_","_","śaṃtanu","NC","","_","_"
4,"saṃnyavedayat","_","_","saṃnyaveda","V","saṃniveday","_","_"
1,"tasya","_","_","tad","PRD","","_","_"
2,"tad","_","_","tad","PRD","","_","_"
3,"duṣkaraṃ","_","_","duṣkara","JJ","","_","_"
4,"karma","_","_","karman","NC","","_","_"
5,"praśaśaṃsur","_","_","praśaṃs","V","praśaṃs","_","_"
6,"_","_","_","nara","NC","","_","_"
7,"_","_","_","adhipa","NC","","_","_"
1,"_","_","_","same","PPP","","_","_"
2,"_","_","_","ca","CCD","","_","_"
3,"pṛthak","_","_","pṛthak","CX","","_","_"
4,"_","_","_","ca","CCD","","_","_"
5,"_","_","_","eva","CEM","","_","_"
6,"bhīṣmo","_","_","bhīṣma","NC","","_","_"
7,"'yam","_","_","ida","PRD","","_","_"
8,"iti","_","_","iti","CQT","","_","_"
9,"_","_","_","ca","CCD","","_","_"
10,"_","_","_","abravīta","V","brū","_","_"
1,"tad","_","_","tad","PRD","","_","_"
2,"dṛṣṭvā","_","_","dṛś","CGDA","","_","_"
3,"duṣkaraṃ","_","_","duṣkara","JJ","","_","_"
4,"karma","_","_","karman","NC","","_","_"
5,"kṛtaṃ","_","_","kṛ","PPP","","_","_"
6,"bhīṣmeṇa","_","_","bhīṣma","NC","","_","_"
7,"śaṃtanuḥ","_","_","śaṃtanu","NC","","_","_"
1,"babhūva","_","_","bhav","V","bhū","_","_"
2,"duḥkhito","_","_","duḥkhita","JJ","","_","_"
3,"rājā","_","_","rājan","NC","","_","_"
4,"cirarātrāya","_","_","cirarātra","NC","","_","_"
5,"bhārata","_","_","bhārata","NC","","_","_"
1,"sa","_","_","tad","PRD","","_","_"
2,"tena","_","_","tad","PRD","","_","_"
3,"karmaṇā","_","_","karman","NC","","_","_"
4,"sūnoḥ","_","_","sūnu","NC","","_","_"
5,"_","_","_","prī","PPP","","_","_"
6,"_","_","_","tad","PRD","","_","_"
7,"varaṃ","_","_","vara","NC","","_","_"
8,"dadau","_","_","dad","V","dā","_","_"
1,"_","_","_","svacchanda","JJ","","_","_"
2,"_","_","_","maraṇa","NC","","_","_"
3,"tasmai","_","_","tad","PRD","","_","_"
4,"dadau","_","_","dad","V","dā","_","_"
5,"tuṣṭaḥ","_","_","tuṣ","PPP","","_","_"
6,"pitā","_","_","pitṛ","NC","","_","_"
7,"svayam","_","_","svaya","CX","","_","_"
1,"na","_","_","na","CNG","","_","_"
2,"te","_","_","tvat","PPR","","_","_"
3,"prabhavitā","_","_","prabhav","V","prabhū","_","_"
4,"mṛtyur","_","_","mṛtyu","NC","","_","_"
5,"yāvad","_","_","yāvat","CX","","_","_"
6,"icchasi","_","_","iṣ","V","iṣ","_","_"
7,"jīvitum","_","_","jīv","CGDI","","_","_"
1,"tvatto","_","_","tvat","PPR","","_","_"
2,"_","_","_","hi","CX","","_","_"
3,"_","_","_","anujñā","NC","","_","_"
4,"samprāpya","_","_","samprāp","CGDA","","_","_"
5,"mṛtyuḥ","_","_","mṛtyu","NC","","_","_"
6,"_","_","_","prabhav","V","prabhū","_","_"
7,"_","_","_","anagha","JJ","","_","_"
1,"svena","_","_","sva","JJ","","_","_"
2,"kāmena","_","_","kāma","NC","","_","_"
3,"kartāsi","_","_","kar","V","kṛ","_","_"
4,"_","_","_","na","CNG","","_","_"
5,"_","_","_","akāma","JJ","","_","_"
6,"_","_","_","tvat","PPR","","_","_"
7,"kathaṃcana","_","_","kathaṃcana","CX","","_","_"
