"WordID","word","NormSTEM","suffix","lemma","PoS","Root","NormSuffix","NormWord"
1,"saṃjaya","_","_","saṃjaya","NC","","_","_"
2,"uvāca","_","_","vak","V","vac","_","_"
1,"mahad","_","_","mahat","JJ","","_","_"
2,"bhairavam","_","_","bhairava","JJ","","_","_"
3,"_","_","_","as","V","as","_","_"
4,"_","_","_","mat","PPR","","_","_"
5,"saṃnivṛtteṣu","_","_","saṃnivṛt","PPP","","_","_"
6,"pāṇḍuṣu","_","_","pāṇḍu","NC","","_","_"
1,"dṛṣṭvā","_","_","dṛś","CGDA","","_","_"
2,"droṇaṃ","_","_","droṇa","NC","","_","_"
3,"chādyamānaṃ","_","_","chāday","KDP","","_","_"
4,"tair","_","_","tad","PRD","","_","_"
5,"bhāskaram","_","_","bhāskara","NC","","_","_"
6,"_","_","_","iva","CCM","","_","_"
7,"_","_","_","ambuda","NC","","_","_"
1,"_","_","_","tad","PRD","","_","_"
2,"_","_","_","ca","CCD","","_","_"
3,"_","_","_","uddhū","PPP","","_","_"
4,"_","_","_","rajas","NC","","_","_"
5,"_","_","_","tīvra","JJ","","_","_"
6,"avacakre","_","_","avakṛ","V","avakṛ","_","_"
7,"camūṃ","_","_","camū","NC","","_","_"
8,"tava","_","_","tvat","PPR","","_","_"
1,"tato","_","_","tatas","CX","","_","_"
2,"hatam","_","_","han","PPP","","_","_"
3,"amanyāma","_","_","man","V","man","_","_"
4,"droṇaṃ","_","_","droṇa","NC","","_","_"
5,"_","_","_","dṛṣṭi","NC","","_","_"
6,"_","_","_","patha","NC","","_","_"
7,"hate","_","_","han","PPP","","_","_"
1,"_","_","_","tad","PRD","","_","_"
2,"_","_","_","tu","CCD","","_","_"
3,"_","_","_","śūra","NC","","_","_"
4,"_","_","_","mahat","JJ","","_","_"
5,"_","_","_","iṣvāsa","NC","","_","_"
6,"krūraṃ","_","_","krūra","JJ","","_","_"
7,"karma","_","_","karman","NC","","_","_"
8,"cikīrṣataḥ","_","_","cikīrṣ","KDP","","_","_"
1,"dṛṣṭvā","_","_","dṛś","CGDA","","_","_"
2,"_","_","_","duryodhana","NC","","_","_"
3,"_","_","_","tūrṇa","CX","","_","_"
4,"_","_","_","sva","JJ","","_","_"
5,"_","_","_","sainya","NC","","_","_"
6,"samacūcudat","_","_","saṃcod","V","saṃcud","_","_"
1,"yathāśakti","_","_","yathāśakti","CX","","_","_"
2,"yathotsāhaṃ","_","_","yathotsāha","JJ","","_","_"
3,"yathāsattvaṃ","_","_","yathāsattva","CX","","_","_"
4,"narādhipāḥ","_","_","narādhipa","NC","","_","_"
1,"vārayadhvaṃ","_","_","vāray","V","vāray","_","_"
2,"yathāyogaṃ","_","_","yathāyoga","CX","","_","_"
3,"pāṇḍavānām","_","_","pāṇḍava","NC","","_","_"
4,"anīkinīm","_","_","anīkinī","NC","","_","_"
1,"tato","_","_","tatas","CX","","_","_"
2,"durmarṣaṇo","_","_","durmarṣaṇa","NC","","_","_"
3,"bhīmam","_","_","bhīma","NC","","_","_"
4,"abhyagacchat","_","_","abhiga","V","abhiga","_","_"
5,"_","_","_","suta","NC","","_","_"
6,"_","_","_","tvat","PPR","","_","_"
1,"ārād","_","_","ārāt","CX","","_","_"
2,"dṛṣṭvā","_","_","dṛś","CGDA","","_","_"
3,"kiran","_","_","kṛ","KDP","","_","_"
4,"bāṇair","_","_","bāṇa","NC","","_","_"
5,"icchan","_","_","iṣ","KDP","","_","_"
6,"droṇasya","_","_","droṇa","NC","","_","_"
7,"jīvitam","_","_","jīvita","NC","","_","_"
1,"taṃ","_","_","tad","PRD","","_","_"
2,"bāṇair","_","_","bāṇa","NC","","_","_"
3,"a","_","_","alpha_privativum","V","avastṛ","_","_"
3,"avatastāra","_","_","vastṛ","V","avastṛ","_","_"
4,"kruddho","_","_","krudh","PPP","","_","_"
5,"mṛtyum","_","_","mṛtyu","NC","","_","_"
6,"_","_","_","iva","CCM","","_","_"
7,"_","_","_","āhava","NC","","_","_"
1,"taṃ","_","_","tad","PRD","","_","_"
2,"ca","_","_","ca","CCD","","_","_"
3,"bhīmo","_","_","bhīma","NC","","_","_"
4,"'tudad","_","_","tud","V","tud","_","_"
5,"_","_","_","bāṇa","NC","","_","_"
6,"_","_","_","tadā","CAD","","_","_"
7,"_","_","_","as","V","as","_","_"
8,"tumulaṃ","_","_","tumula","NC","","_","_"
9,"mahat","_","_","mahat","JJ","","_","_"
1,"ta","_","_","tad","PRD","","_","_"
2,"_","_","_","īśvara","NC","","_","_"
3,"_","_","_","samādis","PPP","","_","_"
4,"prājñāḥ","_","_","prājña","JJ","","_","_"
5,"śūrāḥ","_","_","śūra","NC","","_","_"
6,"prahāriṇaḥ","_","_","prahārin","JJ","","_","_"
1,"bāhyaṃ","_","_","bāhya","JJ","","_","_"
2,"_","_","_","mṛtyu","NC","","_","_"
3,"_","_","_","bhaya","NC","","_","_"
4,"kṛtvā","_","_","kṛ","CGDA","","_","_"
5,"pratyatiṣṭhan","_","_","prastha","V","pratiṣṭhā","_","_"
6,"parān","_","_","para","PPX","","_","_"
7,"yudhi","_","_","yudh","NC","","_","_"
1,"kṛtavarmā","_","_","kṛtavarman","NC","","_","_"
2,"śineḥ","_","_","śini","NC","","_","_"
3,"putraṃ","_","_","putra","NC","","_","_"
4,"_","_","_","droṇa","NC","","_","_"
5,"_","_","_","prepsu","JJ","","_","_"
6,"viśāṃ","_","_","viś","NC","","_","_"
7,"pate","_","_","pati","NC","","_","_"
1,"paryavārayad","_","_","parivāray","V","parivāray","_","_"
2,"āyāntaṃ","_","_","āyā","KDP","","_","_"
3,"śūraṃ","_","_","śūra","NC","","_","_"
4,"_","_","_","samiti","NC","","_","_"
5,"_","_","_","śobhana","JJ","","_","_"
1,"taṃ","_","_","tad","PRD","","_","_"
2,"śaineyaḥ","_","_","śaineya","NC","","_","_"
3,"_","_","_","śara","NC","","_","_"
4,"_","_","_","vrāta","NC","","_","_"
5,"kruddhaḥ","_","_","krudh","PPP","","_","_"
6,"kruddham","_","_","krudh","PPP","","_","_"
7,"avārayat","_","_","vāray","V","vāray","_","_"
1,"kṛtavarmā","_","_","kṛtavarman","NC","","_","_"
2,"ca","_","_","ca","CCD","","_","_"
3,"śaineyaṃ","_","_","śaineya","NC","","_","_"
4,"matto","_","_","mat","PPP","","_","_"
5,"mattam","_","_","mat","PPP","","_","_"
6,"iva","_","_","iva","CCM","","_","_"
7,"dvipam","_","_","dvipa","NC","","_","_"
1,"saindhavaḥ","_","_","saindhava","NC","","_","_"
2,"kṣatradharmāṇam","_","_","kṣatradharman","NC","","_","_"
3,"āpatantaṃ","_","_","āpat","KDP","","_","_"
4,"_","_","_","śara","NC","","_","_"
5,"_","_","_","oghin","JJ","","_","_"
1,"_","_","_","ugra","JJ","","_","_"
2,"_","_","_","dhanvan","NC","","_","_"
3,"_","_","_","mahat","JJ","","_","_"
4,"_","_","_","iṣvāsa","NC","","_","_"
5,"yatto","_","_","yat","PPP","","_","_"
6,"droṇād","_","_","droṇa","NC","","_","_"
7,"avārayat","_","_","vāray","V","vāray","_","_"
1,"kṣatradharmā","_","_","kṣatradharman","NC","","_","_"
2,"_","_","_","sindhupati","NC","","_","_"
3,"_","_","_","chid","CGDA","","_","_"
4,"_","_","_","ketana","NC","","_","_"
5,"_","_","_","kārmuka","NC","","_","_"
1,"nārācair","_","_","nārāca","NC","","_","_"
2,"bahubhiḥ","_","_","bahu","JJ","","_","_"
3,"kruddhaḥ","_","_","krudh","PPP","","_","_"
4,"_","_","_","sarva","JQ","","_","_"
5,"_","_","_","marman","NC","","_","_"
6,"_","_","_","tāḍay","V","tāḍay","_","_"
1,"_","_","_","atha","CAD","","_","_"
2,"_","_","_","anya","PPX","","_","_"
3,"dhanur","_","_","dhanus","NC","","_","_"
4,"ādāya","_","_","ādā","CGDA","","_","_"
5,"saindhavaḥ","_","_","saindhava","NC","","_","_"
6,"_","_","_","kṛtahasta","JJ","","_","_"
7,"_","_","_","vat","CX","","_","_"
1,"vivyādha","_","_","vyadh","V","vyadh","_","_"
2,"kṣatradharmāṇaṃ","_","_","kṣatradharman","NC","","_","_"
3,"raṇe","_","_","raṇa","NC","","_","_"
4,"_","_","_","sarva","JQ","","_","_"
5,"_","_","_","āyasa","JJ","","_","_"
6,"śaraiḥ","_","_","śara","NC","","_","_"
1,"yuyutsuṃ","_","_","yuyutsu","NC","","_","_"
2,"_","_","_","pāṇḍava","NC","","_","_"
3,"_","_","_","artha","NC","","_","_"
4,"yatamānaṃ","_","_","yat","KDP","","_","_"
5,"_","_","_","mahat","JJ","","_","_"
6,"_","_","_","ratha","NC","","_","_"
1,"subāhur","_","_","subāhu","NC","","_","_"
2,"bhrātaraṃ","_","_","bhrātṛ","NC","","_","_"
3,"śūraṃ","_","_","śūra","NC","","_","_"
4,"yatto","_","_","yat","PPP","","_","_"
5,"droṇād","_","_","droṇa","NC","","_","_"
6,"avārayat","_","_","vāray","V","vāray","_","_"
1,"subāhoḥ","_","_","subāhu","NC","","_","_"
2,"_","_","_","sa_saha","CX","","_","_"
3,"_","_","_","dhanus","NC","","_","_"
4,"_","_","_","bāṇa","NC","","_","_"
5,"_","_","_","as","KDP","","_","_"
6,"_","_","_","parigha","NC","","_","_"
7,"_","_","_","upama","JJ","","_","_"
1,"yuyutsuḥ","_","_","yuyutsu","NC","","_","_"
2,"_","_","_","śā","PPP","","_","_"
3,"_","_","_","pā","PPP","","_","_"
4,"kṣurābhyām","_","_","kṣura","NC","","_","_"
5,"achinad","_","_","chid","V","chid","_","_"
6,"bhujau","_","_","bhuja","NC","","_","_"
1,"rājānaṃ","_","_","rājan","NC","","_","_"
2,"_","_","_","pāṇḍava","NC","","_","_"
3,"_","_","_","śreṣṭha","JJ","","_","_"
4,"_","_","_","dharma","NC","","_","_"
5,"_","_","_","ātman","NC","","_","_"
6,"yudhiṣṭhiram","_","_","yudhiṣṭhira","NC","","_","_"
1,"_","_","_","velā","NC","","_","_"
2,"_","_","_","iva","CCM","","_","_"
3,"sāgaraṃ","_","_","sāgara","NC","","_","_"
4,"kṣubdhaṃ","_","_","kṣubh","PPP","","_","_"
5,"_","_","_","madra","NC","","_","_"
6,"_","_","_","rāj","NC","","_","_"
7,"samavārayat","_","_","saṃvāray","V","saṃvāray","_","_"
1,"taṃ","_","_","tad","PRD","","_","_"
2,"dharmarājo","_","_","dharmarāja","NC","","_","_"
3,"bahubhir","_","_","bahu","JJ","","_","_"
4,"_","_","_","marman","NC","","_","_"
5,"_","_","_","bhid","JJ","","_","_"
6,"avākirat","_","_","avakṛ","V","avakṛ","_","_"
1,"_","_","_","madra","NC","","_","_"
2,"_","_","_","īśa","NC","","_","_"
3,"_","_","_","tad","PRD","","_","_"
4,"catuḥṣaṣṭyā","_","_","catuḥṣaṣṭi","NC","","_","_"
5,"śarair","_","_","śara","NC","","_","_"
6,"_","_","_","vyadh","CGDA","","_","_"
7,"_","_","_","nad","V","nad","_","_"
8,"bhṛśam","_","_","bhṛśa","CX","","_","_"
1,"tasya","_","_","tad","PRD","","_","_"
2,"nānadataḥ","_","_","nānad","KDP","","_","_"
3,"ketum","_","_","ketu","NC","","_","_"
4,"uccakarta","_","_","utkṛt","V","utkṛt","_","_"
5,"_","_","_","sa_saha","CX","","_","_"
6,"_","_","_","kārmuka","NC","","_","_"
1,"kṣurābhyāṃ","_","_","kṣura","NC","","_","_"
2,"_","_","_","pāṇḍava","NC","","_","_"
3,"_","_","_","śreṣṭha","JJ","","_","_"
4,"_","_","_","tatas","CX","","_","_"
5,"uccukruśur","_","_","utkroś","V","utkruś","_","_"
6,"janāḥ","_","_","jana","NC","","_","_"
1,"_","_","_","tathā","CX","","_","_"
2,"_","_","_","eva","CEM","","_","_"
3,"rājā","_","_","rājan","NC","","_","_"
4,"bāhlīko","_","_","vāhlīka","NC","","_","_"
5,"rājānaṃ","_","_","rājan","NC","","_","_"
6,"drupadaṃ","_","_","drupada","NC","","_","_"
7,"śaraiḥ","_","_","śara","NC","","_","_"
1,"ādravantaṃ","_","_","ādru","KDP","","_","_"
2,"_","_","_","saha","CX","","_","_"
3,"_","_","_","anīka","NC","","_","_"
4,"_","_","_","saha","CX","","_","_"
5,"_","_","_","anīka","NC","","_","_"
6,"nyavārayat","_","_","nyavāra","V","nivāray","_","_"
1,"tad","_","_","tad","PRD","","_","_"
2,"yuddham","_","_","yuddha","NC","","_","_"
3,"abhavad","_","_","bhav","V","bhū","_","_"
4,"ghoraṃ","_","_","ghora","JJ","","_","_"
5,"vṛddhayoḥ","_","_","vṛddha","JJ","","_","_"
6,"_","_","_","saha","CX","","_","_"
7,"_","_","_","senā","NC","","_","_"
1,"yathā","_","_","yathā","CCM","","_","_"
2,"_","_","_","mahat","JJ","","_","_"
3,"_","_","_","yūthapa","NC","","_","_"
4,"dvipayoḥ","_","_","dvipa","NC","","_","_"
5,"samprabhinnayoḥ","_","_","samprabhinna","JJ","","_","_"
1,"_","_","_","vinda","NC","","_","_"
2,"_","_","_","anuvinda","NC","","_","_"
3,"_","_","_","āvantya","NC","","_","_"
4,"virāṭaṃ","_","_","virāṭa","NC","","_","_"
5,"matsyam","_","_","matsya","NC","","_","_"
6,"ārchatām","_","_","ṛch","V","ṛch","_","_"
1,"_","_","_","saha","CX","","_","_"
2,"_","_","_","sainya","NC","","_","_"
3,"_","_","_","saha","CX","","_","_"
4,"_","_","_","anīka","NC","","_","_"
5,"_","_","_","yathā","CCM","","_","_"
6,"_","_","_","indra","NC","","_","_"
7,"_","_","_","agni","NC","","_","_"
8,"purā","_","_","purā","CX","","_","_"
9,"balim","_","_","bali","NC","","_","_"
1,"tad","_","_","tad","PRD","","_","_"
2,"utpiñjalakaṃ","_","_","utpiñjalaka","JJ","","_","_"
3,"yuddham","_","_","yuddha","NC","","_","_"
4,"āsīd","_","_","as","V","as","_","_"
5,"_","_","_","devāsura","NC","","_","_"
6,"_","_","_","upama","JJ","","_","_"
1,"matsyānāṃ","_","_","matsya","NC","","_","_"
2,"kekayaiḥ","_","_","kekaya","NC","","_","_"
3,"sārdham","_","_","sārdha","CX","","_","_"
4,"_","_","_","abhīta","JJ","","_","_"
5,"_","_","_","aśva","NC","","_","_"
6,"_","_","_","ratha","NC","","_","_"
7,"_","_","_","dvipa","NC","","_","_"
1,"nākuliṃ","_","_","nākuli","NC","","_","_"
2,"tu","_","_","tu","CCD","","_","_"
3,"śatānīkaṃ","_","_","śatānīka","NC","","_","_"
4,"bhūtakarmā","_","_","bhūtakarman","NC","","_","_"
5,"sabhāpatiḥ","_","_","sabhāpati","NC","","_","_"
1,"asyantam","_","_","as","KDP","","_","_"
2,"_","_","_","iṣu","NC","","_","_"
3,"_","_","_","jāla","NC","","_","_"
4,"yāntaṃ","_","_","yā","KDP","","_","_"
5,"droṇād","_","_","droṇa","NC","","_","_"
6,"avārayat","_","_","vāray","V","vāray","_","_"
1,"tato","_","_","tatas","CX","","_","_"
2,"_","_","_","nakula","NC","","_","_"
3,"_","_","_","dāyāda","NC","","_","_"
4,"_","_","_","tri","NUM","","_","_"
5,"bhallaiḥ","_","_","bhalla","NC","","_","_"
6,"_","_","_","su","CAD","","_","_"
7,"_","_","_","saṃśā","PPP","","_","_"
1,"cakre","_","_","kar","V","kṛ","_","_"
2,"_","_","_","vibāhu","JJ","","_","_"
3,"_","_","_","śiras","NC","","_","_"
4,"bhūtakarmāṇam","_","_","bhūtakarman","NC","","_","_"
5,"āhave","_","_","āhava","NC","","_","_"
1,"sutasomaṃ","_","_","sutasoma","NC","","_","_"
2,"tu","_","_","tu","CCD","","_","_"
3,"vikrāntam","_","_","vikra","PPP","","_","_"
4,"āpatantaṃ","_","_","āpat","KDP","","_","_"
5,"_","_","_","śara","NC","","_","_"
6,"_","_","_","oghin","JJ","","_","_"
1,"_","_","_","droṇa","NC","","_","_"
2,"_","_","_","abhimukha","JJ","","_","_"
3,"vīraṃ","_","_","vīra","NC","","_","_"
4,"viviṃśatir","_","_","viviṃśati","NC","","_","_"
5,"avārayat","_","_","vāray","V","vāray","_","_"
1,"_","_","_","sutasoma","NC","","_","_"
2,"_","_","_","tu","CCD","","_","_"
3,"saṃkruddhaḥ","_","_","saṃkrudh","PPP","","_","_"
4,"_","_","_","sva","JJ","","_","_"
5,"_","_","_","pitṛvya","NC","","_","_"
6,"ajihmagaiḥ","_","_","ajihmaga","NC","","_","_"
1,"viviṃśatiṃ","_","_","viviṃśati","NC","","_","_"
2,"śarair","_","_","śara","NC","","_","_"
3,"viddhvā","_","_","vyadh","CGDA","","_","_"
4,"_","_","_","na","CNG","","_","_"
5,"_","_","_","abhivart","V","abhivṛt","_","_"
6,"daṃśitaḥ","_","_","daṃśay","PPP","","_","_"
1,"atha","_","_","atha","CAD","","_","_"
2,"bhīmarathaḥ","_","_","bhīmaratha","NC","","_","_"
3,"śālvam","_","_","śālva","NC","","_","_"
4,"āśugair","_","_","āśuga","NC","","_","_"
5,"āyasaiḥ","_","_","āyasa","JJ","","_","_"
6,"śitaiḥ","_","_","śā","PPP","","_","_"
1,"ṣaḍbhiḥ","_","_","ṣaṣ","NUM","","_","_"
2,"_","_","_","sa_saha","CX","","_","_"
3,"_","_","_","aśva","NC","","_","_"
4,"_","_","_","niyantṛ","NC","","_","_"
5,"anayad","_","_","nay","V","nī","_","_"
6,"_","_","_","yama","NC","","_","_"
7,"_","_","_","sādana","NC","","_","_"
1,"śrutakarmāṇam","_","_","śrutakarman","NC","","_","_"
2,"āyāntaṃ","_","_","āyā","KDP","","_","_"
3,"_","_","_","mayūra","NC","","_","_"
4,"_","_","_","sadṛśa","JJ","","_","_"
5,"hayaiḥ","_","_","haya","NC","","_","_"
1,"caitrasenir","_","_","caitraseni","NC","","_","_"
2,"_","_","_","mahat","JJ","","_","_"
3,"_","_","_","rāja","NC","","_","_"
4,"tava","_","_","tvat","PPR","","_","_"
5,"pautro","_","_","pautra","NC","","_","_"
6,"nyavārayat","_","_","nyavāra","V","nivāray","_","_"
1,"tau","_","_","tad","PRD","","_","_"
2,"pautrau","_","_","pautra","NC","","_","_"
3,"tava","_","_","tvat","PPR","","_","_"
4,"durdharṣau","_","_","durdharṣa","JJ","","_","_"
5,"_","_","_","paraspara","PRC","","_","_"
6,"_","_","_","vadha","NC","","_","_"
7,"_","_","_","eṣin","JJ","","_","_"
1,"pitṝṇām","_","_","pitṛ","NC","","_","_"
2,"_","_","_","artha","NC","","_","_"
3,"_","_","_","siddhi","NC","","_","_"
4,"_","_","_","artha","NC","","_","_"
5,"cakratur","_","_","kar","V","kṛ","_","_"
6,"yuddham","_","_","yuddha","NC","","_","_"
7,"uttamam","_","_","uttama","JJ","","_","_"
1,"tiṣṭhantam","_","_","sthā","KDP","","_","_"
2,"agrato","_","_","agratas","CX","","_","_"
3,"dṛṣṭvā","_","_","dṛś","CGDA","","_","_"
4,"prativindhyaṃ","_","_","prativindhya","NC","","_","_"
5,"tam","_","_","tad","PRD","","_","_"
6,"āhave","_","_","āhava","NC","","_","_"
1,"drauṇir","_","_","drauṇi","NC","","_","_"
2,"mānaṃ","_","_","māna","NC","","_","_"
3,"pituḥ","_","_","pitṛ","NC","","_","_"
4,"_","_","_","kṛ","KDP","","_","_"
5,"_","_","_","mārgaṇa","NC","","_","_"
6,"samavārayat","_","_","saṃvāray","V","saṃvāray","_","_"
1,"taṃ","_","_","tad","PRD","","_","_"
2,"kruddhaḥ","_","_","krudh","PPP","","_","_"
3,"prativivyādha","_","_","prativyadh","V","prativyadh","_","_"
4,"prativindhyaḥ","_","_","prativindhya","NC","","_","_"
5,"śitaiḥ","_","_","śā","PPP","","_","_"
6,"śaraiḥ","_","_","śara","NC","","_","_"
1,"_","_","_","siṃha","NC","","_","_"
2,"_","_","_","lāṅgūla","NC","","_","_"
3,"_","_","_","lakṣman","NC","","_","_"
4,"pitur","_","_","pitṛ","NC","","_","_"
5,"arthe","_","_","artha","NC","","_","_"
6,"vyavasthitam","_","_","vyavasthā","PPP","","_","_"
1,"pravapann","_","_","pravap","KDP","","_","_"
2,"iva","_","_","iva","CCM","","_","_"
3,"bījāni","_","_","bīja","NC","","_","_"
4,"_","_","_","bīja","NC","","_","_"
5,"_","_","_","kāla","NC","","_","_"
6,"_","_","_","nara","NC","","_","_"
7,"_","_","_","ṛṣabha","NC","","_","_"
1,"drauṇāyanir","_","_","drauṇāyani","NC","","_","_"
2,"draupadeyaṃ","_","_","draupadeya","NC","","_","_"
3,"_","_","_","śara","NC","","_","_"
4,"_","_","_","varṣa","NC","","_","_"
5,"avākirat","_","_","avakṛ","V","avakṛ","_","_"
1,"_","_","_","yad","PRL","","_","_"
2,"_","_","_","tu","CCD","","_","_"
3,"śūratamo","_","_","śūratama","JJ","","_","_"
4,"rājan","_","_","rājan","NC","","_","_"
5,"senayor","_","_","senā","NC","","_","_"
6,"ubhayor","_","_","ubhaya","JJ","","_","_"
7,"mataḥ","_","_","man","PPP","","_","_"
1,"taṃ","_","_","tad","PRD","","_","_"
2,"_","_","_","paṭaccara","NC","","_","_"
3,"_","_","_","hantṛ","JJ","","_","_"
4,"lakṣmaṇaḥ","_","_","lakṣmaṇa","NC","","_","_"
5,"samavārayat","_","_","saṃvāray","V","saṃvāray","_","_"
1,"sa","_","_","tad","PRD","","_","_"
2,"_","_","_","lakṣmaṇa","NC","","_","_"
3,"_","_","_","iṣvasana","NC","","_","_"
4,"chittvā","_","_","chid","CGDA","","_","_"
5,"lakṣma","_","_","lakṣman","NC","","_","_"
6,"ca","_","_","ca","CCD","","_","_"
7,"bhārata","_","_","bhārata","NC","","_","_"
1,"lakṣmaṇe","_","_","lakṣmaṇa","NC","","_","_"
2,"_","_","_","śara","NC","","_","_"
3,"_","_","_","jāla","NC","","_","_"
4,"visṛjan","_","_","visṛj","KDP","","_","_"
5,"_","_","_","bahu","JJ","","_","_"
6,"_","_","_","śubh","V","śubh","_","_"
1,"_","_","_","vikarṇa","NC","","_","_"
2,"_","_","_","tu","CCD","","_","_"
3,"_","_","_","mahat","JJ","","_","_"
4,"_","_","_","prājña","JJ","","_","_"
5,"yājñaseniṃ","_","_","yājñaseni","NC","","_","_"
6,"śikhaṇḍinam","_","_","śikhaṇḍin","NC","","_","_"
1,"paryavārayad","_","_","parivāray","V","parivāray","_","_"
2,"āyāntaṃ","_","_","āyā","KDP","","_","_"
3,"yuvānaṃ","_","_","yuvan","NC","","_","_"
4,"samare","_","_","samara","NC","","_","_"
5,"yuvā","_","_","yuvan","NC","","_","_"
1,"_","_","_","tatas","CX","","_","_"
2,"_","_","_","tad","PRD","","_","_"
3,"_","_","_","iṣu","NC","","_","_"
4,"_","_","_","jāla","NC","","_","_"
5,"yājñaseniḥ","_","_","yājñaseni","NC","","_","_"
6,"samāvṛṇot","_","_","samāvṛ","V","samāvṛ","_","_"
1,"vidhūya","_","_","vidhū","CGDA","","_","_"
2,"tad","_","_","tad","PRD","","_","_"
3,"_","_","_","bāṇa","NC","","_","_"
4,"_","_","_","jāla","NC","","_","_"
5,"babhau","_","_","bhā","V","bhā","_","_"
6,"tava","_","_","tvat","PPR","","_","_"
7,"suto","_","_","suta","NC","","_","_"
8,"balī","_","_","balin","JJ","","_","_"
1,"aṅgado","_","_","aṅgada","NC","","_","_"
2,"'bhimukhaḥ","_","_","abhimukha","JJ","","_","_"
3,"śūram","_","_","śūra","NC","","_","_"
4,"_","_","_","uttama","JJ","","_","_"
5,"_","_","_","ojas","NC","","_","_"
6,"āhave","_","_","āhava","NC","","_","_"
1,"_","_","_","droṇa","NC","","_","_"
2,"_","_","_","abhimukha","JJ","","_","_"
3,"yāntaṃ","_","_","yā","KDP","","_","_"
4,"vatsadantair","_","_","vatsadanta","NC","","_","_"
5,"avārayat","_","_","vāray","V","vāray","_","_"
1,"sa","_","_","tad","PRD","","_","_"
2,"_","_","_","samprahāra","NC","","_","_"
3,"_","_","_","tumula","JJ","","_","_"
4,"_","_","_","tad","PRD","","_","_"
5,"_","_","_","puruṣa","NC","","_","_"
6,"_","_","_","siṃha","NC","","_","_"
1,"sainikānāṃ","_","_","sainika","NC","","_","_"
2,"ca","_","_","ca","CCD","","_","_"
3,"sarveṣāṃ","_","_","sarva","JQ","","_","_"
4,"_","_","_","tad","PRD","","_","_"
5,"_","_","_","ca","CCD","","_","_"
6,"_","_","_","prīti","NC","","_","_"
7,"_","_","_","vardhana","JJ","","_","_"
1,"_","_","_","durmukha","NC","","_","_"
2,"_","_","_","tu","CCD","","_","_"
3,"_","_","_","mahat","JJ","","_","_"
4,"_","_","_","iṣvāsa","NC","","_","_"
5,"vīraṃ","_","_","vīra","NC","","_","_"
6,"purujitaṃ","_","_","purujit","NC","","_","_"
7,"balī","_","_","balin","JJ","","_","_"
1,"_","_","_","droṇa","NC","","_","_"
2,"_","_","_","abhimukha","JJ","","_","_"
3,"yāntaṃ","_","_","yā","KDP","","_","_"
4,"kuntibhojam","_","_","kuntibhoja","NC","","_","_"
5,"avārayat","_","_","vāray","V","vāray","_","_"
1,"sa","_","_","tad","PRD","","_","_"
2,"durmukhaṃ","_","_","durmukha","NC","","_","_"
3,"bhruvor","_","_","bhrū","NC","","_","_"
4,"madhye","_","_","madhya","NC","","_","_"
5,"nārācena","_","_","nārāca","NC","","_","_"
6,"vyatāḍayat","_","_","vitāḍay","V","vitāḍay","_","_"
1,"tasya","_","_","tad","PRD","","_","_"
2,"tad","_","_","tad","PRD","","_","_"
3,"vibabhau","_","_","vibabha","V","vibhā","_","_"
4,"vaktraṃ","_","_","vaktra","NC","","_","_"
5,"_","_","_","sa_saha","CX","","_","_"
6,"_","_","_","nāla","NC","","_","_"
7,"iva","_","_","iva","CCM","","_","_"
8,"paṅkajam","_","_","paṅkaja","NC","","_","_"
1,"_","_","_","karṇa","NC","","_","_"
2,"_","_","_","tu","CCD","","_","_"
3,"kekayān","_","_","kekaya","NC","","_","_"
4,"bhrātṝn","_","_","bhrātṛ","NC","","_","_"
5,"pañca","_","_","pañcan","NUM","","_","_"
6,"_","_","_","lohitaka","JJ","","_","_"
7,"_","_","_","dhvaja","NC","","_","_"
1,"_","_","_","droṇa","NC","","_","_"
2,"_","_","_","abhimukha","JJ","","_","_"
3,"yātāñ","_","_","yā","PPP","","_","_"
4,"_","_","_","śara","NC","","_","_"
5,"_","_","_","varṣa","NC","","_","_"
6,"avārayat","_","_","vāray","V","vāray","_","_"
1,"te","_","_","tad","PRD","","_","_"
2,"_","_","_","ca","CCD","","_","_"
3,"_","_","_","a","PRD","","_","_"
4,"_","_","_","bhṛśa","JJ","","_","_"
5,"_","_","_","saṃkrudh","PPP","","_","_"
6,"_","_","_","śara","NC","","_","_"
7,"_","_","_","vrāta","NC","","_","_"
8,"avākiran","_","_","avakṛ","V","avakṛ","_","_"
1,"sa","_","_","tad","PRD","","_","_"
2,"ca","_","_","ca","CCD","","_","_"
3,"_","_","_","tad","PRD","","_","_"
4,"_","_","_","chāday","V","chāday","_","_"
5,"_","_","_","śara","NC","","_","_"
6,"_","_","_","jāla","NC","","_","_"
7,"punaḥ","_","_","punar","CAD","","_","_"
8,"punaḥ","_","_","punar","CAD","","_","_"
1,"_","_","_","na","CNG","","_","_"
2,"_","_","_","eva","CEM","","_","_"
3,"karṇo","_","_","karṇa","NC","","_","_"
4,"na","_","_","na","CNG","","_","_"
5,"te","_","_","tad","PRD","","_","_"
6,"pañca","_","_","pañcan","NUM","","_","_"
7,"dadṛśur","_","_","darś","V","dṛś","_","_"
8,"_","_","_","bāṇa","NC","","_","_"
9,"_","_","_","saṃvṛ","PPP","","_","_"
1,"_","_","_","sa_saha","CX","","_","_"
2,"_","_","_","aśva","NC","","_","_"
3,"_","_","_","sūta","NC","","_","_"
4,"_","_","_","dhvaja","NC","","_","_"
5,"_","_","_","ratha","NC","","_","_"
6,"_","_","_","paraspara","PRC","","_","_"
7,"_","_","_","śara","NC","","_","_"
8,"_","_","_","āci","PPP","","_","_"
1,"_","_","_","putra","NC","","_","_"
2,"_","_","_","tvat","PPR","","_","_"
3,"_","_","_","durjaya","NC","","_","_"
4,"_","_","_","ca","CCD","","_","_"
5,"_","_","_","eva","CEM","","_","_"
6,"_","_","_","jaya","NC","","_","_"
7,"_","_","_","ca","CCD","","_","_"
8,"_","_","_","vijaya","NC","","_","_"
9,"_","_","_","ca","CCD","","_","_"
10,"ha","_","_","ha","CEM","","_","_"
1,"nīlaṃ","_","_","nīla","NC","","_","_"
2,"kāśyaṃ","_","_","kāśya","NC","","_","_"
3,"jayaṃ","_","_","jaya","NC","","_","_"
4,"_","_","_","śūra","NC","","_","_"
5,"_","_","_","tri","NUM","","_","_"
6,"_","_","_","tri","NUM","","_","_"
7,"pratyavārayan","_","_","prativāray","V","prativāray","_","_"
1,"tad","_","_","tad","PRD","","_","_"
2,"yuddham","_","_","yuddha","NC","","_","_"
3,"abhavad","_","_","bhav","V","bhū","_","_"
4,"ghoram","_","_","ghora","JJ","","_","_"
5,"_","_","_","īkṣitṛ","JJ","","_","_"
6,"_","_","_","prīti","NC","","_","_"
7,"_","_","_","vardhana","JJ","","_","_"
1,"_","_","_","siṃha","NC","","_","_"
2,"_","_","_","vyāghra","NC","","_","_"
3,"_","_","_","tarakṣu","NC","","_","_"
4,"_","_","_","yathā","CCM","","_","_"
5,"_","_","_","ibha","NC","","_","_"
6,"_","_","_","mahiṣa","NC","","_","_"
7,"_","_","_","ṛṣabha","NC","","_","_"
1,"_","_","_","kṣemadhūrti","NC","","_","_"
2,"_","_","_","bṛhanta","NC","","_","_"
3,"tau","_","_","tad","PRD","","_","_"
4,"bhrātarau","_","_","bhrātṛ","NC","","_","_"
5,"sātvataṃ","_","_","sātvata","NC","","_","_"
6,"yudhi","_","_","yudh","NC","","_","_"
1,"_","_","_","droṇa","NC","","_","_"
2,"_","_","_","abhimukha","JJ","","_","_"
3,"yāntaṃ","_","_","yā","KDP","","_","_"
4,"_","_","_","śara","NC","","_","_"
5,"_","_","_","tīkṣṇa","JJ","","_","_"
6,"_","_","_","takṣ","V","takṣ","_","_"
1,"_","_","_","tad","PRD","","_","_"
2,"_","_","_","tad","PRD","","_","_"
3,"ca","_","_","ca","CCD","","_","_"
4,"tad","_","_","tad","PRD","","_","_"
5,"yuddham","_","_","yuddha","NC","","_","_"
6,"_","_","_","ati","CADP","","_","_"
7,"_","_","_","adbhuta","JJ","","_","_"
8,"_","_","_","iva","CCM","","_","_"
9,"_","_","_","bhav","V","bhū","_","_"
1,"siṃhasya","_","_","siṃha","NC","","_","_"
2,"_","_","_","dvipa","NC","","_","_"
3,"_","_","_","mukhya","JJ","","_","_"
4,"prabhinnābhyāṃ","_","_","prabhid","PPP","","_","_"
5,"yathā","_","_","yathā","CCM","","_","_"
6,"vane","_","_","vana","NC","","_","_"
1,"rājānaṃ","_","_","rājan","NC","","_","_"
2,"tu","_","_","tu","CCD","","_","_"
3,"_","_","_","tathā","CX","","_","_"
4,"_","_","_","ambaṣṭha","NC","","_","_"
5,"ekaṃ","_","_","eka","PPX","","_","_"
6,"_","_","_","yuddha","NC","","_","_"
7,"_","_","_","abhinandin","JJ","","_","_"
1,"_","_","_","cedi","NC","","_","_"
2,"_","_","_","rāja","NC","","_","_"
3,"śarān","_","_","śara","NC","","_","_"
4,"asyan","_","_","as","KDP","","_","_"
5,"kruddho","_","_","krudh","PPP","","_","_"
6,"droṇād","_","_","droṇa","NC","","_","_"
7,"avārayat","_","_","vāray","V","vāray","_","_"
1,"tam","_","_","tad","PRD","","_","_"
2,"ambaṣṭho","_","_","ambaṣṭha","NC","","_","_"
3,"_","_","_","asthi","NC","","_","_"
4,"_","_","_","bhedin","JJ","","_","_"
5,"_","_","_","nirvyadh","V","nirvyadh","_","_"
6,"_","_","_","śalākā","NC","","_","_"
1,"sa","_","_","tad","PRD","","_","_"
2,"tyaktvā","_","_","tyaj","CGDA","","_","_"
3,"_","_","_","sa_saha","CX","","_","_"
4,"_","_","_","śara","NC","","_","_"
5,"cāpaṃ","_","_","cāpa","NC","","_","_"
6,"rathād","_","_","ratha","NC","","_","_"
7,"bhūmim","_","_","bhūmi","NC","","_","_"
8,"_","_","_","atha","CAD","","_","_"
9,"_","_","_","pat","V","pat","_","_"
1,"vārdhakṣemiṃ","_","_","vārddhakṣemi","NC","","_","_"
2,"tu","_","_","tu","CCD","","_","_"
3,"vārṣṇeyaṃ","_","_","vārṣṇeya","NC","","_","_"
4,"kṛpaḥ","_","_","kṛpa","NC","","_","_"
5,"śāradvataḥ","_","_","śāradvata","NC","","_","_"
6,"śaraiḥ","_","_","śara","NC","","_","_"
1,"akṣudraḥ","_","_","akṣudra","JJ","","_","_"
2,"kṣudrakair","_","_","kṣudraka","JJ","","_","_"
3,"droṇāt","_","_","droṇa","NC","","_","_"
4,"_","_","_","krudh","PPP","","_","_"
5,"_","_","_","rūpa","NC","","_","_"
6,"avārayat","_","_","vāray","V","vāray","_","_"
1,"yudhyantau","_","_","yudh","KDP","","_","_"
2,"_","_","_","kṛpa","NC","","_","_"
3,"_","_","_","vārṣṇeya","NC","","_","_"
4,"ye","_","_","yad","PRL","","_","_"
5,"_","_","_","paś","V","paś","_","_"
6,"_","_","_","citra","JJ","","_","_"
7,"_","_","_","yodhin","JJ","","_","_"
1,"te","_","_","tad","PRD","","_","_"
2,"_","_","_","yuddha","NC","","_","_"
3,"_","_","_","sañj","PPP","","_","_"
4,"_","_","_","manas","NC","","_","_"
5,"_","_","_","na","CNG","","_","_"
6,"_","_","_","anya","PPX","","_","_"
7,"bubudhire","_","_","bodh","V","budh","_","_"
8,"kriyāḥ","_","_","kriyā","NC","","_","_"
1,"_","_","_","saumadatti","NC","","_","_"
2,"_","_","_","tu","CCD","","_","_"
3,"rājānaṃ","_","_","rājan","NC","","_","_"
4,"maṇimantam","_","_","maṇimat","NC","","_","_"
5,"atandritam","_","_","atandrita","JJ","","_","_"
1,"paryavārayad","_","_","parivāray","V","parivāray","_","_"
2,"āyāntaṃ","_","_","āyā","KDP","","_","_"
3,"yaśo","_","_","yaśas","NC","","_","_"
4,"droṇasya","_","_","droṇa","NC","","_","_"
5,"vardhayan","_","_","vardhay","KDP","","_","_"
1,"sa","_","_","tad","PRD","","_","_"
2,"_","_","_","saumadatti","NC","","_","_"
3,"_","_","_","tvar","PPP","","_","_"
4,"_","_","_","chid","CGDA","","_","_"
5,"_","_","_","iṣvasana","NC","","_","_"
6,"_","_","_","ketana","NC","","_","_"
1,"punaḥ","_","_","punar","CAD","","_","_"
2,"patākāṃ","_","_","patākā","NC","","_","_"
3,"sūtaṃ","_","_","sūta","NC","","_","_"
4,"ca","_","_","ca","CCD","","_","_"
5,"chatraṃ","_","_","chattra","NC","","_","_"
6,"_","_","_","ca","CCD","","_","_"
7,"_","_","_","pātay","V","pātay","_","_"
8,"rathāt","_","_","ratha","NC","","_","_"
1,"_","_","_","atha","CAD","","_","_"
2,"_","_","_","āplu","CGDA","","_","_"
3,"rathāt","_","_","ratha","NC","","_","_"
4,"tūrṇaṃ","_","_","tūrṇa","CX","","_","_"
5,"yūpaketur","_","_","yūpaketu","NC","","_","_"
6,"_","_","_","amitra","NC","","_","_"
7,"_","_","_","han","JJ","","_","_"
1,"_","_","_","sa_saha","CX","","_","_"
2,"_","_","_","aśva","NC","","_","_"
3,"_","_","_","sūta","NC","","_","_"
4,"_","_","_","dhvaja","NC","","_","_"
5,"_","_","_","ratha","NC","","_","_"
6,"taṃ","_","_","tad","PRD","","_","_"
7,"cakarta","_","_","kṛt","V","kṛt","_","_"
8,"_","_","_","vara","JJ","","_","_"
9,"_","_","_","asi","NC","","_","_"
1,"rathaṃ","_","_","ratha","NC","","_","_"
2,"ca","_","_","ca","CCD","","_","_"
3,"svaṃ","_","_","sva","JJ","","_","_"
4,"samāsthāya","_","_","samāsthā","CGDA","","_","_"
5,"dhanur","_","_","dhanus","NC","","_","_"
6,"ādāya","_","_","ādā","CGDA","","_","_"
7,"_","_","_","ca","CCD","","_","_"
8,"_","_","_","apara","PPX","","_","_"
1,"svayaṃ","_","_","svaya","CX","","_","_"
2,"yacchan","_","_","ya","KDP","","_","_"
3,"hayān","_","_","haya","NC","","_","_"
4,"rājan","_","_","rājan","NC","","_","_"
5,"vyadhamat","_","_","vidha","V","vidha","_","_"
6,"pāṇḍavīṃ","_","_","pāṇḍava","JJ","","_","_"
7,"camūm","_","_","camū","NC","","_","_"
1,"musalair","_","_","musala","NC","","_","_"
2,"_","_","_","mudgara","NC","","_","_"
3,"_","_","_","cakra","NC","","_","_"
4,"bhiṇḍipālaiḥ","_","_","bhindipāla","NC","","_","_"
5,"paraśvadhaiḥ","_","_","paraśvadha","NC","","_","_"
1,"_","_","_","pāṃsu","NC","","_","_"
2,"_","_","_","vāta","NC","","_","_"
3,"_","_","_","agni","NC","","_","_"
4,"_","_","_","salila","NC","","_","_"
5,"_","_","_","bhasman","NC","","_","_"
6,"_","_","_","loṣṭa","NC","","_","_"
7,"_","_","_","tṛṇa","NC","","_","_"
8,"_","_","_","druma","NC","","_","_"
1,"ārujan","_","_","āruj","KDP","","_","_"
2,"prarujan","_","_","praruj","KDP","","_","_"
3,"_","_","_","bhañj","KDP","","_","_"
4,"_","_","_","nihan","KDP","","_","_"
5,"vidrāvayan","_","_","vidrāvay","KDP","","_","_"
6,"kṣipan","_","_","kṣip","KDP","","_","_"
1,"senāṃ","_","_","senā","NC","","_","_"
2,"vibhīṣayann","_","_","vibhīṣay","KDP","","_","_"
3,"āyād","_","_","āyā","V","āyā","_","_"
4,"_","_","_","droṇa","NC","","_","_"
5,"_","_","_","prepsu","JJ","","_","_"
6,"ghaṭotkacaḥ","_","_","ghaṭotkaca","NC","","_","_"
1,"taṃ","_","_","tad","PRD","","_","_"
2,"tu","_","_","tu","CCD","","_","_"
3,"_","_","_","nānā","CX","","_","_"
4,"_","_","_","praharaṇa","NC","","_","_"
5,"_","_","_","nānā","CX","","_","_"
6,"_","_","_","yuddha","NC","","_","_"
7,"_","_","_","viśeṣaṇa","NC","","_","_"
1,"rākṣasaṃ","_","_","rākṣasa","NC","","_","_"
2,"rākṣasaḥ","_","_","rākṣasa","NC","","_","_"
3,"kruddhaḥ","_","_","krudh","PPP","","_","_"
4,"samājaghne","_","_","samāhan","V","samāhan","_","_"
5,"_","_","_","hi","CX","","_","_"
6,"_","_","_","alambuṣa","NC","","_","_"
1,"_","_","_","tad","PRD","","_","_"
2,"_","_","_","tad","PRD","","_","_"
3,"abhavad","_","_","bhav","V","bhū","_","_"
4,"yuddhaṃ","_","_","yuddha","NC","","_","_"
5,"_","_","_","rakṣas","NC","","_","_"
6,"_","_","_","grāmaṇi","NC","","_","_"
7,"_","_","_","mukhya","JJ","","_","_"
1,"tādṛg","_","_","tādṛś","JJ","","_","_"
2,"yādṛk","_","_","yādṛś","JJ","","_","_"
3,"purā","_","_","purā","CX","","_","_"
4,"vṛttaṃ","_","_","vṛt","PPP","","_","_"
5,"_","_","_","śambara","NC","","_","_"
6,"_","_","_","amararāja","NC","","_","_"
1,"evaṃ","_","_","eva","CX","","_","_"
2,"_","_","_","dvaṃdva","NC","","_","_"
3,"_","_","_","śata","NUM","","_","_"
4,"_","_","_","as","V","as","_","_"
5,"_","_","_","ratha","NC","","_","_"
6,"_","_","_","vāraṇa","NC","","_","_"
7,"_","_","_","vājin","NC","","_","_"
1,"padātīnāṃ","_","_","padāti","NC","","_","_"
2,"ca","_","_","ca","CCD","","_","_"
3,"bhadraṃ","_","_","bhadra","NC","","_","_"
4,"te","_","_","tvat","PPR","","_","_"
5,"tava","_","_","tvat","PPR","","_","_"
6,"teṣāṃ","_","_","tad","PRD","","_","_"
7,"ca","_","_","ca","CCD","","_","_"
8,"saṃkulam","_","_","saṃkula","JJ","","_","_"
1,"_","_","_","na","CNG","","_","_"
2,"_","_","_","etādṛśa","JJ","","_","_"
3,"_","_","_","dṛś","PPP","","_","_"
4,"_","_","_","pūrva","PPX","","_","_"
5,"saṃgrāmo","_","_","saṃgrāma","NC","","_","_"
6,"_","_","_","na","CNG","","_","_"
7,"_","_","_","eva","CEM","","_","_"
8,"ca","_","_","ca","CCD","","_","_"
9,"śrutaḥ","_","_","śru","PPP","","_","_"
1,"_","_","_","droṇa","NC","","_","_"
2,"_","_","_","abhāva","NC","","_","_"
3,"_","_","_","bhāva","NC","","_","_"
4,"prasaktānāṃ","_","_","prasañj","PPP","","_","_"
5,"_","_","_","yathā","CCM","","_","_"
6,"_","_","_","bhav","V","bhū","_","_"
1,"idaṃ","_","_","ida","PRD","","_","_"
2,"ghoram","_","_","ghora","JJ","","_","_"
3,"idaṃ","_","_","ida","PRD","","_","_"
4,"citram","_","_","citra","JJ","","_","_"
5,"idaṃ","_","_","ida","PRD","","_","_"
6,"raudram","_","_","raudra","JJ","","_","_"
7,"iti","_","_","iti","CQT","","_","_"
8,"prabho","_","_","prabhu","NC","","_","_"
1,"tatra","_","_","tatra","CAD","","_","_"
2,"_","_","_","yuddha","NC","","_","_"
3,"_","_","_","darś","V","dṛś","_","_"
4,"pratatāni","_","_","pratan","PPP","","_","_"
5,"bahūni","_","_","bahu","JJ","","_","_"
6,"ca","_","_","ca","CCD","","_","_"
