"WordID","word","NormSTEM","suffix","lemma","PoS","Root","NormSuffix","NormWord"
1,"_","_","_","brahman","NC","","_","_"
2,"_","_","_","vak","V","vac","_","_"
1,"_","_","_","na","CNG","","_","_"
2,"_","_","_","eva","CEM","","_","_"
3,"śakyā","_","_","śakya","JJ","","_","_"
4,"guṇā","_","_","guṇa","NC","","_","_"
5,"vaktuṃ","_","_","vac","CGDI","","_","_"
6,"_","_","_","pṛthaktva","NC","","_","_"
7,"_","_","_","iha","CAD","","_","_"
8,"sarvaśaḥ","_","_","sarvaśas","CX","","_","_"
1,"avicchinnāni","_","_","avicchinna","JJ","","_","_"
2,"dṛśyante","_","_","darś","V","dṛś","_","_"
3,"rajaḥ","_","_","rajas","NC","","_","_"
4,"sattvaṃ","_","_","sattva","NC","","_","_"
5,"_","_","_","tamas","NC","","_","_"
6,"_","_","_","tathā","CX","","_","_"
1,"anyonyam","_","_","anyonya","PRC","","_","_"
2,"anuṣajjante","_","_","anuṣañj","V","anuṣañj","_","_"
3,"anyonyaṃ","_","_","anyonya","PRC","","_","_"
4,"_","_","_","ca","CCD","","_","_"
5,"_","_","_","anujīvin","JJ","","_","_"
1,"_","_","_","anyonya","PRC","","_","_"
2,"_","_","_","apāśraya","NC","","_","_"
3,"sarve","_","_","sarva","JQ","","_","_"
4,"_","_","_","tathā","CX","","_","_"
5,"_","_","_","anyonya","PRC","","_","_"
6,"_","_","_","anuvartin","JJ","","_","_"
1,"yāvat","_","_","yāvat","CX","","_","_"
2,"sattvaṃ","_","_","sattva","NC","","_","_"
3,"_","_","_","tamas","NC","","_","_"
4,"_","_","_","tāvat","CX","","_","_"
5,"vartate","_","_","vart","V","vṛt","_","_"
6,"_","_","_","na","CNG","","_","_"
7,"_","_","_","atra","CAD","","_","_"
8,"saṃśayaḥ","_","_","saṃśaya","NC","","_","_"
1,"yāvat","_","_","yāvat","CX","","_","_"
2,"_","_","_","tamas","NC","","_","_"
3,"_","_","_","ca","CCD","","_","_"
4,"sattvaṃ","_","_","sattva","NC","","_","_"
5,"ca","_","_","ca","CCD","","_","_"
6,"_","_","_","rajas","NC","","_","_"
7,"_","_","_","tāvat","CX","","_","_"
8,"_","_","_","iha","CAD","","_","_"
9,"_","_","_","vak","V","vac","_","_"
1,"saṃhatya","_","_","saṃhan","CGDA","","_","_"
2,"kurvate","_","_","kar","V","kṛ","_","_"
3,"yātrāṃ","_","_","yātrā","NC","","_","_"
4,"sahitāḥ","_","_","sahita","JJ","","_","_"
5,"_","_","_","saṃgha","NC","","_","_"
6,"_","_","_","cārin","JJ","","_","_"
1,"_","_","_","saṃghāta","NC","","_","_"
2,"_","_","_","vṛtti","NC","","_","_"
3,"_","_","_","hi","CX","","_","_"
4,"_","_","_","tad","PRD","","_","_"
5,"vartante","_","_","vart","V","vṛt","_","_"
6,"_","_","_","hetu","NC","","_","_"
7,"_","_","_","ahetu","NC","","_","_"
1,"_","_","_","udreka","NC","","_","_"
2,"_","_","_","vyatireka","NC","","_","_"
3,"teṣām","_","_","tad","PRD","","_","_"
4,"_","_","_","anyonya","PRC","","_","_"
5,"_","_","_","vartin","JJ","","_","_"
1,"vartate","_","_","vart","V","vṛt","_","_"
2,"tad","_","_","tad","PRD","","_","_"
3,"_","_","_","yathā","CCM","","_","_"
4,"_","_","_","nyūna","JJ","","_","_"
5,"vyatiriktaṃ","_","_","vyatiric","PPP","","_","_"
6,"ca","_","_","ca","CCD","","_","_"
7,"sarvaśaḥ","_","_","sarvaśas","CX","","_","_"
1,"vyatiriktaṃ","_","_","vyatiric","PPP","","_","_"
2,"tamo","_","_","tamas","NC","","_","_"
3,"yatra","_","_","yatra","CX","","_","_"
4,"_","_","_","tiryañc","JJ","","_","_"
5,"_","_","_","bhāva","NC","","_","_"
6,"_","_","_","ga","PPP","","_","_"
7,"bhavet","_","_","bhav","V","bhū","_","_"
1,"alpaṃ","_","_","alpa","JJ","","_","_"
2,"tatra","_","_","tatra","CAD","","_","_"
3,"rajo","_","_","rajas","NC","","_","_"
4,"jñeyaṃ","_","_","jñā","KDG","","_","_"
5,"sattvaṃ","_","_","sattva","NC","","_","_"
6,"_","_","_","ca","CCD","","_","_"
7,"_","_","_","alpatara","JJ","","_","_"
8,"tataḥ","_","_","tatas","CX","","_","_"
1,"udriktaṃ","_","_","udric","PPP","","_","_"
2,"ca","_","_","ca","CCD","","_","_"
3,"rajo","_","_","rajas","NC","","_","_"
4,"yatra","_","_","yatra","CX","","_","_"
5,"_","_","_","madhya","JJ","","_","_"
6,"_","_","_","srotas","NC","","_","_"
7,"_","_","_","ga","PPP","","_","_"
8,"bhavet","_","_","bhav","V","bhū","_","_"
1,"alpaṃ","_","_","alpa","JJ","","_","_"
2,"tatra","_","_","tatra","CAD","","_","_"
3,"tamo","_","_","tamas","NC","","_","_"
4,"jñeyaṃ","_","_","jñā","KDG","","_","_"
5,"sattvaṃ","_","_","sattva","NC","","_","_"
6,"_","_","_","ca","CCD","","_","_"
7,"_","_","_","alpatara","JJ","","_","_"
8,"tataḥ","_","_","tatas","CX","","_","_"
1,"udriktaṃ","_","_","udric","PPP","","_","_"
2,"ca","_","_","ca","CCD","","_","_"
3,"yadā","_","_","yadā","CSB","","_","_"
4,"sattvam","_","_","sattva","NC","","_","_"
5,"_","_","_","ūrdhva","JJ","","_","_"
6,"_","_","_","srotas","NC","","_","_"
7,"_","_","_","ga","PPP","","_","_"
8,"bhavet","_","_","bhav","V","bhū","_","_"
1,"alpaṃ","_","_","alpa","JJ","","_","_"
2,"tatra","_","_","tatra","CAD","","_","_"
3,"rajo","_","_","rajas","NC","","_","_"
4,"jñeyaṃ","_","_","jñā","KDG","","_","_"
5,"_","_","_","tamas","NC","","_","_"
6,"_","_","_","ca","CCD","","_","_"
7,"_","_","_","alpatara","JJ","","_","_"
8,"tataḥ","_","_","tatas","CX","","_","_"
1,"sattvaṃ","_","_","sattva","NC","","_","_"
2,"vaikārikaṃ","_","_","vaikārika","JJ","","_","_"
3,"yonir","_","_","yoni","NC","","_","_"
4,"indriyāṇāṃ","_","_","indriya","NC","","_","_"
5,"prakāśikā","_","_","prakāśaka","JJ","","_","_"
1,"na","_","_","na","CNG","","_","_"
2,"hi","_","_","hi","CX","","_","_"
3,"sattvāt","_","_","sattva","NC","","_","_"
4,"paro","_","_","para","PPX","","_","_"
5,"bhāvaḥ","_","_","bhāva","NC","","_","_"
6,"kaścid","_","_","kiṃcit","PRI","","_","_"
7,"anyo","_","_","anya","PPX","","_","_"
8,"vidhīyate","_","_","vidadh","V","vidhā","_","_"
1,"ūrdhvaṃ","_","_","ūrdhva","CX","","_","_"
2,"gacchanti","_","_","gacch","V","gam","_","_"
3,"_","_","_","sattva","NC","","_","_"
4,"_","_","_","stha","JJ","","_","_"
5,"madhye","_","_","madhya","NC","","_","_"
6,"tiṣṭhanti","_","_","tiṣṭh","V","sthā","_","_"
7,"rājasāḥ","_","_","rājasa","JJ","","_","_"
1,"_","_","_","jaghanya","JJ","","_","_"
2,"_","_","_","guṇa","NC","","_","_"
3,"_","_","_","saṃyuj","PPP","","_","_"
4,"_","_","_","yā","V","yā","_","_"
5,"_","_","_","adhas","CX","","_","_"
6,"_","_","_","tāmasa","JJ","","_","_"
7,"janāḥ","_","_","jana","NC","","_","_"
1,"tamaḥ","_","_","tamas","NC","","_","_"
2,"śūdre","_","_","śūdra","NC","","_","_"
3,"rajaḥ","_","_","rajas","NC","","_","_"
4,"kṣatre","_","_","kṣatra","NC","","_","_"
5,"brāhmaṇe","_","_","brāhmaṇa","NC","","_","_"
6,"sattvam","_","_","sattva","NC","","_","_"
7,"uttamam","_","_","uttama","JJ","","_","_"
1,"_","_","_","iti","CQT","","_","_"
2,"_","_","_","eva","CX","","_","_"
3,"triṣu","_","_","tri","NUM","","_","_"
4,"varṇeṣu","_","_","varṇa","NC","","_","_"
5,"vivartante","_","_","vivart","V","vivṛt","_","_"
6,"_","_","_","guṇa","NC","","_","_"
7,"_","_","_","tri","NUM","","_","_"
1,"dūrād","_","_","dūrāt","CX","","_","_"
2,"api","_","_","api","CX","","_","_"
3,"hi","_","_","hi","CX","","_","_"
4,"dṛśyante","_","_","darś","V","dṛś","_","_"
5,"sahitāḥ","_","_","sahita","JJ","","_","_"
6,"_","_","_","saṃgha","NC","","_","_"
7,"_","_","_","cārin","JJ","","_","_"
1,"tamaḥ","_","_","tamas","NC","","_","_"
2,"sattvaṃ","_","_","sattva","NC","","_","_"
3,"_","_","_","rajas","NC","","_","_"
4,"_","_","_","ca","CCD","","_","_"
5,"_","_","_","eva","CEM","","_","_"
6,"pṛthaktvaṃ","_","_","pṛthaktva","NC","","_","_"
7,"_","_","_","na","CNG","","_","_"
8,"_","_","_","anuśṛṇ","V","anuśru","_","_"
1,"dṛṣṭvā","_","_","dṛś","CGDA","","_","_"
2,"_","_","_","ca","CCD","","_","_"
3,"_","_","_","āditya","NC","","_","_"
4,"udyantaṃ","_","_","udi","KDP","","_","_"
5,"_","_","_","ku","CX","","_","_"
6,"_","_","_","cora","NC","","_","_"
7,"bhayaṃ","_","_","bhaya","NC","","_","_"
8,"bhavet","_","_","bhav","V","bhū","_","_"
1,"adhvagāḥ","_","_","adhvaga","NC","","_","_"
2,"_","_","_","paritap","V","paritap","_","_"
3,"_","_","_","tṛṣṇā","NC","","_","_"
4,"_","_","_","ārta","JJ","","_","_"
5,"_","_","_","duḥkha","NC","","_","_"
6,"_","_","_","bhāgin","JJ","","_","_"
1,"ādityaḥ","_","_","āditya","NC","","_","_"
2,"sattvam","_","_","sattva","NC","","_","_"
3,"uddiṣṭaṃ","_","_","uddiś","PPP","","_","_"
4,"_","_","_","ku","CX","","_","_"
5,"_","_","_","cora","NC","","_","_"
6,"_","_","_","tu","CCD","","_","_"
7,"yathā","_","_","yathā","CCM","","_","_"
8,"tamaḥ","_","_","tamas","NC","","_","_"
1,"paritāpo","_","_","paritāpa","NC","","_","_"
2,"'dhvagānāṃ","_","_","adhvaga","NC","","_","_"
3,"ca","_","_","ca","CCD","","_","_"
4,"rājaso","_","_","rājasa","JJ","","_","_"
5,"guṇa","_","_","guṇa","NC","","_","_"
6,"ucyate","_","_","vak","V","vac","_","_"
1,"prākāśyaṃ","_","_","prākāśya","NC","","_","_"
2,"sattvam","_","_","sattva","NC","","_","_"
3,"āditye","_","_","āditya","NC","","_","_"
4,"saṃtāpo","_","_","saṃtāpa","NC","","_","_"
5,"rājaso","_","_","rājasa","JJ","","_","_"
6,"guṇaḥ","_","_","guṇa","NC","","_","_"
1,"_","_","_","upaplava","NC","","_","_"
2,"_","_","_","tu","CCD","","_","_"
3,"_","_","_","vijñā","KDG","","_","_"
4,"_","_","_","tāmasa","JJ","","_","_"
5,"_","_","_","tad","PRD","","_","_"
6,"parvasu","_","_","parvan","NC","","_","_"
1,"evaṃ","_","_","eva","CX","","_","_"
2,"jyotiḥṣu","_","_","jyotis","NC","","_","_"
3,"sarveṣu","_","_","sarva","JQ","","_","_"
4,"vivartante","_","_","vivart","V","vivṛt","_","_"
5,"_","_","_","guṇa","NC","","_","_"
6,"_","_","_","tri","NUM","","_","_"
1,"paryāyeṇa","_","_","paryāya","NC","","_","_"
2,"ca","_","_","ca","CCD","","_","_"
3,"vartante","_","_","vart","V","vṛt","_","_"
4,"tatra","_","_","tatra","CAD","","_","_"
5,"tatra","_","_","tatra","CAD","","_","_"
6,"tathā","_","_","tathā","CX","","_","_"
7,"tathā","_","_","tathā","CX","","_","_"
1,"sthāvareṣu","_","_","sthāvara","JJ","","_","_"
2,"ca","_","_","ca","CCD","","_","_"
3,"bhūteṣu","_","_","bhūta","NC","","_","_"
4,"_","_","_","tiryañc","JJ","","_","_"
5,"_","_","_","bhāva","NC","","_","_"
6,"_","_","_","ga","PPP","","_","_"
7,"tamaḥ","_","_","tamas","NC","","_","_"
1,"_","_","_","rājasa","JJ","","_","_"
2,"_","_","_","tu","CCD","","_","_"
3,"vivartante","_","_","vivart","V","vivṛt","_","_"
4,"_","_","_","sneha","NC","","_","_"
5,"_","_","_","bhāva","NC","","_","_"
6,"_","_","_","tu","CCD","","_","_"
7,"sāttvikaḥ","_","_","sāttvika","JJ","","_","_"
1,"_","_","_","ahar","NC","","_","_"
2,"_","_","_","tridhā","CX","","_","_"
3,"tu","_","_","tu","CCD","","_","_"
4,"vijñeyaṃ","_","_","vijñā","KDG","","_","_"
5,"tridhā","_","_","tridhā","CX","","_","_"
6,"rātrir","_","_","rātri","NC","","_","_"
7,"vidhīyate","_","_","vidadh","V","vidhā","_","_"
1,"_","_","_","māsa","NC","","_","_"
2,"_","_","_","ardha","JJ","","_","_"
3,"_","_","_","māsa","NC","","_","_"
4,"_","_","_","varṣa","NC","","_","_"
5,"ṛtavaḥ","_","_","ṛtu","NC","","_","_"
6,"_","_","_","saṃdhi","NC","","_","_"
7,"_","_","_","tathā","CX","","_","_"
1,"tridhā","_","_","tridhā","CX","","_","_"
2,"dānāni","_","_","dāna","NC","","_","_"
3,"dīyante","_","_","dad","V","dā","_","_"
4,"tridhā","_","_","tridhā","CX","","_","_"
5,"yajñaḥ","_","_","yajña","NC","","_","_"
6,"pravartate","_","_","pravart","V","pravṛt","_","_"
1,"tridhā","_","_","tridhā","CX","","_","_"
2,"_","_","_","loka","NC","","_","_"
3,"_","_","_","tridhā","CX","","_","_"
4,"_","_","_","veda","NC","","_","_"
5,"_","_","_","tridhā","CX","","_","_"
6,"_","_","_","vidyā","NC","","_","_"
7,"_","_","_","tridhā","CX","","_","_"
8,"gatiḥ","_","_","gati","NC","","_","_"
1,"bhūtaṃ","_","_","bhū","PPP","","_","_"
2,"bhavyaṃ","_","_","bhū","KDG","","_","_"
3,"_","_","_","bhū","KDP","","_","_"
4,"_","_","_","ca","CCD","","_","_"
5,"dharmo","_","_","dharma","NC","","_","_"
6,"'rthaḥ","_","_","artha","NC","","_","_"
7,"kāma","_","_","kāma","NC","","_","_"
8,"_","_","_","iti","CQT","","_","_"
9,"_","_","_","api","CX","","_","_"
1,"_","_","_","prāṇa","NC","","_","_"
2,"_","_","_","apāna","NC","","_","_"
3,"_","_","_","udāna","NC","","_","_"
4,"_","_","_","ca","CCD","","_","_"
5,"_","_","_","api","CX","","_","_"
6,"_","_","_","tad","PRD","","_","_"
7,"eva","_","_","eva","CEM","","_","_"
8,"trayo","_","_","tri","NUM","","_","_"
9,"guṇāḥ","_","_","guṇa","NC","","_","_"
1,"yat","_","_","yad","PRL","","_","_"
2,"kiṃcid","_","_","kiṃcit","PRI","","_","_"
3,"iha","_","_","iha","CAD","","_","_"
4,"vai","_","_","vai","CX","","_","_"
5,"loke","_","_","loka","NC","","_","_"
6,"sarvam","_","_","sarva","JQ","","_","_"
7,"_","_","_","ida","PRD","","_","_"
8,"_","_","_","eva","CEM","","_","_"
9,"tat","_","_","tad","PRD","","_","_"
10,"triṣu","_","_","tri","NUM","","_","_"
1,"trayo","_","_","tri","NUM","","_","_"
2,"guṇāḥ","_","_","guṇa","NC","","_","_"
3,"pravartante","_","_","pravart","V","pravṛt","_","_"
4,"avyaktā","_","_","avyakta","JJ","","_","_"
5,"nityam","_","_","nitya","CX","","_","_"
6,"eva","_","_","eva","CEM","","_","_"
7,"tu","_","_","tu","CCD","","_","_"
1,"sattvaṃ","_","_","sattva","NC","","_","_"
2,"_","_","_","rajas","NC","","_","_"
3,"_","_","_","tamas","NC","","_","_"
4,"_","_","_","ca","CCD","","_","_"
5,"_","_","_","eva","CEM","","_","_"
6,"_","_","_","guṇa","NC","","_","_"
7,"_","_","_","sarga","NC","","_","_"
8,"sanātanaḥ","_","_","sanātana","JJ","","_","_"
1,"tamo","_","_","tamas","NC","","_","_"
2,"'vyaktaṃ","_","_","avyakta","JJ","","_","_"
3,"śivaṃ","_","_","śiva","JJ","","_","_"
4,"nityam","_","_","nitya","JJ","","_","_"
5,"ajaṃ","_","_","aja","JJ","","_","_"
6,"yoniḥ","_","_","yoni","NC","","_","_"
7,"sanātanaḥ","_","_","sanātana","JJ","","_","_"
1,"prakṛtir","_","_","prakṛti","NC","","_","_"
2,"vikāraḥ","_","_","vikāra","NC","","_","_"
3,"pralayaḥ","_","_","pralaya","NC","","_","_"
4,"pradhānaṃ","_","_","pradhāna","NC","","_","_"
5,"_","_","_","prabhava","NC","","_","_"
6,"_","_","_","apyaya","NC","","_","_"
1,"anudriktam","_","_","anudrikta","JJ","","_","_"
2,"anūnaṃ","_","_","anūna","JJ","","_","_"
3,"ca","_","_","ca","CCD","","_","_"
4,"_","_","_","hi","CX","","_","_"
5,"a","_","_","alpha_privativum","JJ","","_","_"
5,"_","_","_","kampa","JJ","","_","_"
6,"acalaṃ","_","_","acala","JJ","","_","_"
7,"dhruvam","_","_","dhruva","JJ","","_","_"
1,"sad","_","_","as","KDP","","_","_"
2,"_","_","_","asat","JJ","","_","_"
3,"_","_","_","ca","CCD","","_","_"
4,"_","_","_","eva","CEM","","_","_"
5,"tat","_","_","tad","PRD","","_","_"
6,"sarvam","_","_","sarva","JQ","","_","_"
7,"avyaktaṃ","_","_","avyakta","NC","","_","_"
8,"triguṇaṃ","_","_","triguṇa","JJ","","_","_"
9,"smṛtam","_","_","smṛ","PPP","","_","_"
1,"jñeyāni","_","_","jñā","KDG","","_","_"
2,"nāmadheyāni","_","_","nāmadheya","NC","","_","_"
3,"narair","_","_","nara","NC","","_","_"
4,"_","_","_","adhyātma","NC","","_","_"
5,"_","_","_","cintaka","JJ","","_","_"
1,"_","_","_","avyakta","NC","","_","_"
2,"_","_","_","nāman","NC","","_","_"
3,"_","_","_","guṇa","NC","","_","_"
4,"_","_","_","ca","CCD","","_","_"
5,"tattvato","_","_","tattva","NC","","_","_"
6,"yo","_","_","yad","PRL","","_","_"
7,"veda","_","_","vid","V","vid","_","_"
8,"sarvāṇi","_","_","sarva","JQ","","_","_"
9,"_","_","_","gati","NC","","_","_"
10,"_","_","_","ca","CCD","","_","_"
11,"kevalāḥ","_","_","kevala","JJ","","_","_"
1,"_","_","_","vimuc","PPP","","_","_"
2,"_","_","_","deha","NC","","_","_"
3,"_","_","_","pravibhāga","NC","","_","_"
4,"_","_","_","tattva","NC","","_","_"
5,"_","_","_","vid","JJ","","_","_"
6,"sa","_","_","tad","PRD","","_","_"
7,"mucyate","_","_","muñc","V","muc","_","_"
8,"_","_","_","sarva","JQ","","_","_"
9,"_","_","_","guṇa","NC","","_","_"
10,"nirāmayaḥ","_","_","nirāmaya","JJ","","_","_"
