"WordID","word","NormSTEM","suffix","lemma","PoS","Root","NormSuffix","NormWord"
1,"_","_","_","kuntī","NC","","_","_"
2,"_","_","_","vak","V","vac","_","_"
1,"evam","_","_","eva","CX","","_","_"
2,"_","_","_","tad","PRD","","_","_"
3,"_","_","_","mahat","JJ","","_","_"
4,"_","_","_","bāhu","NC","","_","_"
5,"yathā","_","_","yathā","CCM","","_","_"
6,"vadasi","_","_","vad","V","vad","_","_"
7,"pāṇḍava","_","_","pāṇḍava","NC","","_","_"
1,"kṛtam","_","_","kṛ","PPP","","_","_"
2,"uddharṣaṇaṃ","_","_","uddharṣaṇa","NC","","_","_"
3,"pūrvaṃ","_","_","pūrva","PPX","","_","_"
4,"mayā","_","_","mat","PPR","","_","_"
5,"vaḥ","_","_","tvat","PPR","","_","_"
6,"sīdatāṃ","_","_","sad","KDP","","_","_"
7,"nṛpa","_","_","nṛpa","NC","","_","_"
1,"_","_","_","dyūta","NC","","_","_"
2,"_","_","_","apahṛ","PPP","","_","_"
3,"_","_","_","rājya","NC","","_","_"
4,"patitānāṃ","_","_","pat","PPP","","_","_"
5,"sukhād","_","_","sukha","NC","","_","_"
6,"api","_","_","api","CX","","_","_"
1,"jñātibhiḥ","_","_","jñāti","NC","","_","_"
2,"paribhūtānāṃ","_","_","paribhū","PPP","","_","_"
3,"kṛtam","_","_","kṛ","PPP","","_","_"
4,"uddharṣaṇaṃ","_","_","uddharṣaṇa","NC","","_","_"
5,"mayā","_","_","mat","PPR","","_","_"
1,"kathaṃ","_","_","katha","CX","","_","_"
2,"pāṇḍor","_","_","pāṇḍu","NC","","_","_"
3,"na","_","_","na","CNG","","_","_"
4,"naśyeta","_","_","naś","V","naś","_","_"
5,"saṃtatiḥ","_","_","saṃtati","NC","","_","_"
6,"_","_","_","puruṣa","NC","","_","_"
7,"_","_","_","ṛṣabha","NC","","_","_"
1,"_","_","_","yaśas","NC","","_","_"
2,"_","_","_","ca","CCD","","_","_"
3,"vo","_","_","tvat","PPR","","_","_"
4,"na","_","_","na","CNG","","_","_"
5,"naśyeta","_","_","naś","V","naś","_","_"
6,"iti","_","_","iti","CQT","","_","_"
7,"_","_","_","ca","CCD","","_","_"
8,"_","_","_","uddharṣaṇa","NC","","_","_"
9,"kṛtam","_","_","kṛ","PPP","","_","_"
1,"yūyam","_","_","tvat","PPR","","_","_"
2,"_","_","_","indra","NC","","_","_"
3,"_","_","_","sama","PPX","","_","_"
4,"sarve","_","_","sarva","JQ","","_","_"
5,"_","_","_","deva","NC","","_","_"
6,"_","_","_","tulya","JJ","","_","_"
7,"_","_","_","parākrama","NC","","_","_"
1,"mā","_","_","mā","CNG","","_","_"
2,"pareṣāṃ","_","_","para","PPX","","_","_"
3,"_","_","_","mukha","NC","","_","_"
4,"_","_","_","prekṣā","NC","","_","_"
5,"_","_","_","as","V","as","_","_"
6,"_","_","_","iti","CQT","","_","_"
7,"_","_","_","eva","CX","","_","_"
8,"tat","_","_","tad","PRD","","_","_"
9,"kṛtaṃ","_","_","kṛ","PPP","","_","_"
10,"mayā","_","_","mat","PPR","","_","_"
1,"kathaṃ","_","_","katha","CX","","_","_"
2,"_","_","_","dharma","NC","","_","_"
3,"_","_","_","bhṛt","JJ","","_","_"
4,"śreṣṭho","_","_","śreṣṭha","JJ","","_","_"
5,"rājā","_","_","rājan","NC","","_","_"
6,"tvaṃ","_","_","tvat","PPR","","_","_"
7,"_","_","_","vāsava","NC","","_","_"
8,"_","_","_","upama","JJ","","_","_"
1,"punar","_","_","punar","CAD","","_","_"
2,"vane","_","_","vana","NC","","_","_"
3,"na","_","_","na","CNG","","_","_"
4,"duḥkhī","_","_","duḥkhin","JJ","","_","_"
5,"syā","_","_","as","V","as","_","_"
6,"iti","_","_","iti","CQT","","_","_"
7,"_","_","_","ca","CCD","","_","_"
8,"_","_","_","uddharṣaṇa","NC","","_","_"
9,"kṛtam","_","_","kṛ","PPP","","_","_"
1,"_","_","_","nāga","NC","","_","_"
2,"_","_","_","ayuta","NC","","_","_"
3,"_","_","_","sama","PPX","","_","_"
4,"_","_","_","prāṇa","NC","","_","_"
5,"_","_","_","khyā","PPP","","_","_"
6,"_","_","_","vikrama","NC","","_","_"
7,"_","_","_","pauruṣa","NC","","_","_"
1,"_","_","_","na","CNG","","_","_"
2,"_","_","_","ida","PRD","","_","_"
3,"bhīmo","_","_","bhīma","NC","","_","_"
4,"'tyayaṃ","_","_","atyaya","NC","","_","_"
5,"gacched","_","_","gacch","V","gam","_","_"
6,"iti","_","_","iti","CQT","","_","_"
7,"_","_","_","ca","CCD","","_","_"
8,"_","_","_","uddharṣaṇa","NC","","_","_"
9,"kṛtam","_","_","kṛ","PPP","","_","_"
1,"bhīmasenād","_","_","bhīmasa","NC","","_","_"
2,"_","_","_","avaraja","NC","","_","_"
3,"_","_","_","tathā","CX","","_","_"
4,"_","_","_","ida","PRD","","_","_"
5,"_","_","_","vāsava","NC","","_","_"
6,"_","_","_","upama","JJ","","_","_"
1,"vijayo","_","_","vijaya","NC","","_","_"
2,"_","_","_","na","CNG","","_","_"
3,"_","_","_","avasīd","V","avasad","_","_"
4,"iti","_","_","iti","CQT","","_","_"
5,"_","_","_","ca","CCD","","_","_"
6,"_","_","_","uddharṣaṇa","NC","","_","_"
7,"kṛtam","_","_","kṛ","PPP","","_","_"
1,"nakulaḥ","_","_","nakula","NC","","_","_"
2,"_","_","_","sahadeva","NC","","_","_"
3,"_","_","_","ca","CCD","","_","_"
4,"_","_","_","tathā","CX","","_","_"
5,"_","_","_","ida","PRD","","_","_"
6,"_","_","_","guru","NC","","_","_"
7,"_","_","_","vartin","JJ","","_","_"
1,"kṣudhā","_","_","kṣudh","NC","","_","_"
2,"kathaṃ","_","_","katha","CX","","_","_"
3,"na","_","_","na","CNG","","_","_"
4,"sīdetām","_","_","sīd","V","sad","_","_"
5,"iti","_","_","iti","CQT","","_","_"
6,"_","_","_","ca","CCD","","_","_"
7,"_","_","_","uddharṣaṇa","NC","","_","_"
8,"kṛtam","_","_","kṛ","PPP","","_","_"
1,"iyaṃ","_","_","ida","PRD","","_","_"
2,"ca","_","_","ca","CCD","","_","_"
3,"bṛhatī","_","_","bṛhat","JJ","","_","_"
4,"śyāmā","_","_","śyāma","JJ","","_","_"
5,"_","_","_","śrīmat","JJ","","_","_"
6,"_","_","_","āya","PPP","","_","_"
7,"_","_","_","locana","NC","","_","_"
1,"vṛthā","_","_","vṛthā","CX","","_","_"
2,"_","_","_","sabhā","NC","","_","_"
3,"_","_","_","tala","NC","","_","_"
4,"kliṣṭā","_","_","kliś","PPP","","_","_"
5,"mā","_","_","mā","CNG","","_","_"
6,"bhūd","_","_","bhav","V","bhū","_","_"
7,"iti","_","_","iti","CQT","","_","_"
8,"ca","_","_","ca","CCD","","_","_"
9,"tat","_","_","tad","PRD","","_","_"
10,"kṛtam","_","_","kṛ","PPP","","_","_"
1,"prekṣantyā","_","_","prekṣ","KDP","","_","_"
2,"me","_","_","mat","PPR","","_","_"
3,"tadā","_","_","tadā","CAD","","_","_"
4,"_","_","_","hi","CX","","_","_"
5,"_","_","_","ida","PRD","","_","_"
6,"vepantīṃ","_","_","vip","KDP","","_","_"
7,"kadalīm","_","_","kadala","NC","","_","_"
8,"iva","_","_","iva","CCM","","_","_"
1,"_","_","_","strī","NC","","_","_"
2,"_","_","_","dharmin","JJ","","_","_"
3,"_","_","_","anindya","JJ","","_","_"
4,"_","_","_","aṅga","JJ","","_","_"
5,"tathā","_","_","tathā","CX","","_","_"
6,"_","_","_","dyūta","NC","","_","_"
7,"_","_","_","parāji","PPP","","_","_"
1,"duḥśāsano","_","_","duḥśāsana","NC","","_","_"
2,"yadā","_","_","yadā","CSB","","_","_"
3,"mauḍhyād","_","_","mauḍhya","NC","","_","_"
4,"_","_","_","dāsī","NC","","_","_"
5,"_","_","_","vat","CX","","_","_"
6,"paryakarṣata","_","_","parikṛṣ","V","parikṛṣ","_","_"
1,"_","_","_","tadā","CAD","","_","_"
2,"_","_","_","eva","CEM","","_","_"
3,"viditaṃ","_","_","vid","PPP","","_","_"
4,"mahyaṃ","_","_","mat","PPR","","_","_"
5,"parābhūtam","_","_","parābhū","PPP","","_","_"
6,"idaṃ","_","_","ida","PRD","","_","_"
7,"kulam","_","_","kula","NC","","_","_"
1,"viṣaṇṇāḥ","_","_","viṣad","PPP","","_","_"
2,"_","_","_","kuru","NC","","_","_"
3,"_","_","_","ca","CCD","","_","_"
4,"_","_","_","eva","CEM","","_","_"
5,"tadā","_","_","tadā","CAD","","_","_"
6,"me","_","_","mat","PPR","","_","_"
7,"_","_","_","śvaśura","NC","","_","_"
8,"_","_","_","ādi","NC","","_","_"
1,"_","_","_","yadā","CSB","","_","_"
2,"_","_","_","tad","PRD","","_","_"
3,"nātham","_","_","nātha","NC","","_","_"
4,"icchantī","_","_","iṣ","KDP","","_","_"
5,"vyalapat","_","_","vilap","V","vilap","_","_"
6,"kurarī","_","_","kurarī","NC","","_","_"
7,"yathā","_","_","yathā","CCM","","_","_"
1,"_","_","_","keśa","NC","","_","_"
2,"_","_","_","pakṣa","NC","","_","_"
3,"parāmṛṣṭā","_","_","parāmṛś","PPP","","_","_"
4,"pāpena","_","_","pāpa","JJ","","_","_"
5,"hatabuddhinā","_","_","hatabuddhi","JJ","","_","_"
1,"yadā","_","_","yadā","CSB","","_","_"
2,"_","_","_","duḥśāsana","NC","","_","_"
3,"_","_","_","tad","PRD","","_","_"
4,"tadā","_","_","tadā","CAD","","_","_"
5,"_","_","_","muh","V","muh","_","_"
6,"_","_","_","mat","PPR","","_","_"
7,"nṛpa","_","_","nṛpa","NC","","_","_"
1,"_","_","_","tvat","PPR","","_","_"
2,"_","_","_","tejas","NC","","_","_"
3,"_","_","_","vivṛddhi","NC","","_","_"
4,"_","_","_","artha","NC","","_","_"
5,"mayā","_","_","mat","PPR","","_","_"
6,"_","_","_","hi","CX","","_","_"
7,"_","_","_","uddharṣaṇa","NC","","_","_"
8,"kṛtam","_","_","kṛ","PPP","","_","_"
1,"tadānīṃ","_","_","tadānīm","CX","","_","_"
2,"_","_","_","vidura","NC","","_","_"
3,"_","_","_","a","CNG","","_","_"
4,"_","_","_","vākya","NC","","_","_"
5,"iti","_","_","iti","CQT","","_","_"
6,"tad","_","_","tad","PRD","","_","_"
7,"vitta","_","_","vid","V","vid","_","_"
8,"putrakāḥ","_","_","putraka","NC","","_","_"
1,"kathaṃ","_","_","katha","CX","","_","_"
2,"na","_","_","na","CNG","","_","_"
3,"_","_","_","rājan","NC","","_","_"
4,"_","_","_","vaṃśa","NC","","_","_"
5,"'yaṃ","_","_","ida","PRD","","_","_"
6,"naśyet","_","_","naś","V","naś","_","_"
7,"prāpya","_","_","prāp","CGDA","","_","_"
8,"_","_","_","suta","NC","","_","_"
9,"_","_","_","mat","PPR","","_","_"
1,"pāṇḍor","_","_","pāṇḍu","NC","","_","_"
2,"iti","_","_","iti","CQT","","_","_"
3,"mayā","_","_","mat","PPR","","_","_"
4,"putra","_","_","putra","NC","","_","_"
5,"tasmād","_","_","tasmāt","CX","","_","_"
6,"uddharṣaṇaṃ","_","_","uddharṣaṇa","NC","","_","_"
7,"kṛtam","_","_","kṛ","PPP","","_","_"
1,"na","_","_","na","CNG","","_","_"
2,"tasya","_","_","tad","PRD","","_","_"
3,"putraḥ","_","_","putra","NC","","_","_"
4,"pautrau","_","_","pautra","NC","","_","_"
5,"vā","_","_","vā","CCD","","_","_"
6,"kuta","_","_","kutas","CX","","_","_"
7,"eva","_","_","eva","CEM","","_","_"
8,"sa","_","_","sa_saha","CX","","_","_"
9,"pārthiva","_","_","pārthiva","NC","","_","_"
1,"labhate","_","_","labh","V","labh","_","_"
2,"_","_","_","su","CAD","","_","_"
3,"_","_","_","kṛ","PPP","","_","_"
4,"_","_","_","loka","NC","","_","_"
5,"yasmād","_","_","yasmāt","CX","","_","_"
6,"vaṃśaḥ","_","_","vaṃśa","NC","","_","_"
7,"praṇaśyati","_","_","praṇaś","V","praṇaś","_","_"
1,"bhuktaṃ","_","_","bhuj","PPP","","_","_"
2,"_","_","_","rājya","NC","","_","_"
3,"_","_","_","phala","NC","","_","_"
4,"putrā","_","_","putra","NC","","_","_"
5,"bhartur","_","_","bhartṛ","NC","","_","_"
6,"me","_","_","mat","PPR","","_","_"
7,"vipulaṃ","_","_","vipula","JJ","","_","_"
8,"purā","_","_","purā","CX","","_","_"
1,"_","_","_","mahat","JJ","","_","_"
2,"_","_","_","dāna","NC","","_","_"
3,"dattāni","_","_","dā","PPP","","_","_"
4,"pītaḥ","_","_","pā","PPP","","_","_"
5,"somo","_","_","soma","NC","","_","_"
6,"yathāvidhi","_","_","yathāvidhi","CX","","_","_"
1,"_","_","_","tad","PRD","","_","_"
2,"_","_","_","mat","PPR","","_","_"
3,"_","_","_","na","CNG","","_","_"
4,"_","_","_","ātman","NC","","_","_"
5,"_","_","_","phala","NC","","_","_"
6,"_","_","_","artha","NC","","_","_"
7,"vai","_","_","vai","CX","","_","_"
8,"vāsudevam","_","_","vāsudeva","NC","","_","_"
9,"acūcudam","_","_","cod","V","cud","_","_"
1,"vidurāyāḥ","_","_","vidurā","NC","","_","_"
2,"_","_","_","pralāpa","NC","","_","_"
3,"_","_","_","tad","PRD","","_","_"
4,"_","_","_","plāvana","NC","","_","_"
5,"_","_","_","artha","NC","","_","_"
6,"tu","_","_","tu","CCD","","_","_"
7,"tat","_","_","tad","PRD","","_","_"
8,"kṛtam","_","_","kṛ","PPP","","_","_"
1,"_","_","_","na","CNG","","_","_"
2,"_","_","_","mat","PPR","","_","_"
3,"_","_","_","rājya","NC","","_","_"
4,"_","_","_","phala","NC","","_","_"
5,"putra","_","_","putra","NC","","_","_"
6,"kāmaye","_","_","kāmaya","V","kāmay","_","_"
7,"_","_","_","putra","NC","","_","_"
8,"_","_","_","nirji","PPP","","_","_"
1,"_","_","_","pati","NC","","_","_"
2,"_","_","_","loka","NC","","_","_"
3,"ahaṃ","_","_","mat","PPR","","_","_"
4,"puṇyān","_","_","puṇya","JJ","","_","_"
5,"kāmaye","_","_","kāmaya","V","kāmay","_","_"
6,"tapasā","_","_","tapas","NC","","_","_"
7,"vibho","_","_","vibhu","JJ","","_","_"
1,"_","_","_","śvaśrū","NC","","_","_"
2,"_","_","_","śvaśura","NC","","_","_"
3,"kṛtvā","_","_","kṛ","CGDA","","_","_"
4,"śuśrūṣāṃ","_","_","śuśrūṣā","NC","","_","_"
5,"_","_","_","vana","NC","","_","_"
6,"_","_","_","vāsin","JJ","","_","_"
1,"tapasā","_","_","tapas","NC","","_","_"
2,"śoṣayiṣyāmi","_","_","śuṣ","V","śuṣ","_","_"
3,"yudhiṣṭhira","_","_","yudhiṣṭhira","NC","","_","_"
4,"kalevaram","_","_","kalevara","NC","","_","_"
1,"nivartasva","_","_","nivart","V","nivṛt","_","_"
2,"kuruśreṣṭha","_","_","kuruśreṣṭha","NC","","_","_"
3,"_","_","_","bhīmasa","NC","","_","_"
4,"_","_","_","ādi","NC","","_","_"
5,"saha","_","_","saha","CX","","_","_"
1,"dharme","_","_","dharma","NC","","_","_"
2,"te","_","_","tvat","PPR","","_","_"
3,"dhīyatāṃ","_","_","dadh","V","dhā","_","_"
4,"buddhir","_","_","buddhi","NC","","_","_"
5,"_","_","_","manas","NC","","_","_"
6,"_","_","_","tvat","PPR","","_","_"
7,"mahad","_","_","mahat","JJ","","_","_"
8,"astu","_","_","as","V","as","_","_"
9,"ca","_","_","ca","CCD","","_","_"
