"WordID","word","NormSTEM","suffix","lemma","PoS","Root","NormSuffix","NormWord"
1,"saṃjaya","_","_","saṃjaya","NC","","_","_"
2,"uvāca","_","_","vak","V","vac","_","_"
1,"_","_","_","putra","NC","","_","_"
2,"_","_","_","tu","CCD","","_","_"
3,"te","_","_","tvat","PPR","","_","_"
4,"_","_","_","mahat","JJ","","_","_"
5,"_","_","_","rāja","NC","","_","_"
6,"_","_","_","ratha","NC","","_","_"
7,"_","_","_","stha","JJ","","_","_"
8,"rathināṃ","_","_","rathin","NC","","_","_"
9,"varaḥ","_","_","vara","JJ","","_","_"
1,"durutsaho","_","_","durutsaha","JJ","","_","_"
2,"babhau","_","_","bhā","V","bhā","_","_"
3,"yuddhe","_","_","yuddha","NC","","_","_"
4,"yathā","_","_","yathā","CCM","","_","_"
5,"rudraḥ","_","_","rudra","NC","","_","_"
6,"pratāpavān","_","_","pratāpavat","JJ","","_","_"
1,"tasya","_","_","tad","PRD","","_","_"
2,"_","_","_","bāṇa","NC","","_","_"
3,"_","_","_","sahasra","NUM","","_","_"
4,"_","_","_","tu","CCD","","_","_"
5,"pracchannā","_","_","pracchad","PPP","","_","_"
6,"_","_","_","hi","CX","","_","_"
7,"_","_","_","bhav","V","bhū","_","_"
8,"_","_","_","mahī","NC","","_","_"
1,"_","_","_","para","PPX","","_","_"
2,"_","_","_","ca","CCD","","_","_"
3,"siṣice","_","_","sic","V","sic","_","_"
4,"bāṇair","_","_","bāṇa","NC","","_","_"
5,"dhārābhir","_","_","dhārā","NC","","_","_"
6,"iva","_","_","iva","CCM","","_","_"
7,"parvatān","_","_","parvata","NC","","_","_"
1,"na","_","_","na","CNG","","_","_"
2,"ca","_","_","ca","CCD","","_","_"
3,"so","_","_","tad","PRD","","_","_"
4,"'sti","_","_","as","V","as","_","_"
5,"pumān","_","_","puṃs","NC","","_","_"
6,"kaścit","_","_","kiṃcit","PRI","","_","_"
7,"pāṇḍavānāṃ","_","_","pāṇḍava","NC","","_","_"
8,"_","_","_","mahat","JJ","","_","_"
9,"_","_","_","āhava","NC","","_","_"
1,"hayo","_","_","haya","NC","","_","_"
2,"gajo","_","_","gaja","NC","","_","_"
3,"ratho","_","_","ratha","NC","","_","_"
4,"_","_","_","vā","CCD","","_","_"
5,"_","_","_","api","CX","","_","_"
6,"yo","_","_","yad","PRL","","_","_"
7,"'sya","_","_","ida","PRD","","_","_"
8,"bāṇair","_","_","bāṇa","NC","","_","_"
9,"avikṣataḥ","_","_","avikṣata","JJ","","_","_"
1,"yaṃ","_","_","yad","PRL","","_","_"
2,"yaṃ","_","_","yad","PRL","","_","_"
3,"hi","_","_","hi","CX","","_","_"
4,"samare","_","_","samara","NC","","_","_"
5,"yodhaṃ","_","_","yodha","NC","","_","_"
6,"prapaśyāmi","_","_","prapaś","V","prapaś","_","_"
7,"viśāṃ","_","_","viś","NC","","_","_"
8,"pate","_","_","pati","NC","","_","_"
1,"sa","_","_","tad","PRD","","_","_"
2,"sa","_","_","tad","PRD","","_","_"
3,"_","_","_","bāṇa","NC","","_","_"
4,"_","_","_","ci","PPP","","_","_"
5,"'bhūd","_","_","bhav","V","bhū","_","_"
6,"vai","_","_","vai","CX","","_","_"
7,"putreṇa","_","_","putra","NC","","_","_"
8,"tava","_","_","tvat","PPR","","_","_"
9,"bhārata","_","_","bhārata","NC","","_","_"
1,"yathā","_","_","yathā","CCM","","_","_"
2,"sainyena","_","_","sainya","JJ","","_","_"
3,"rajasā","_","_","rajas","NC","","_","_"
4,"samuddhūtena","_","_","samuddhū","PPP","","_","_"
5,"vāhinī","_","_","vāhinī","NC","","_","_"
1,"pratyadṛśyata","_","_","pratyadṛśya","V","pratidṛś","_","_"
2,"saṃchannā","_","_","saṃchad","PPP","","_","_"
3,"tathā","_","_","tathā","CX","","_","_"
4,"bāṇair","_","_","bāṇa","NC","","_","_"
5,"mahātmanaḥ","_","_","mahātman","JJ","","_","_"
1,"_","_","_","bāṇa","NC","","_","_"
2,"_","_","_","bhū","PPP","","_","_"
3,"apaśyāma","_","_","paś","V","paś","_","_"
4,"pṛthivīṃ","_","_","pṛthivī","NC","","_","_"
5,"pṛthivīpate","_","_","pṛthivīpati","NC","","_","_"
1,"duryodhanena","_","_","duryodhana","NC","","_","_"
2,"prakṛtāṃ","_","_","prakṛ","PPP","","_","_"
3,"_","_","_","kṣipra","JJ","","_","_"
4,"_","_","_","hasta","NC","","_","_"
5,"dhanvinā","_","_","dhanvin","JJ","","_","_"
1,"teṣu","_","_","tad","PRD","","_","_"
2,"_","_","_","yodha","NC","","_","_"
3,"_","_","_","sahasra","NUM","","_","_"
4,"tāvakeṣu","_","_","tāvaka","JJ","","_","_"
5,"pareṣu","_","_","para","PPX","","_","_"
6,"ca","_","_","ca","CCD","","_","_"
1,"eko","_","_","eka","PPX","","_","_"
2,"duryodhano","_","_","duryodhana","NC","","_","_"
3,"_","_","_","hi","CX","","_","_"
4,"_","_","_","as","V","as","_","_"
5,"pumān","_","_","puṃs","NC","","_","_"
6,"iti","_","_","iti","CQT","","_","_"
7,"matir","_","_","mati","NC","","_","_"
8,"mama","_","_","mat","PPR","","_","_"
1,"_","_","_","tatra","CAD","","_","_"
2,"_","_","_","adbhuta","JJ","","_","_"
3,"apaśyāma","_","_","paś","V","paś","_","_"
4,"tava","_","_","tvat","PPR","","_","_"
5,"putrasya","_","_","putra","NC","","_","_"
6,"vikramam","_","_","vikrama","NC","","_","_"
1,"yad","_","_","yat","CSB","","_","_"
2,"ekaṃ","_","_","eka","PPX","","_","_"
3,"sahitāḥ","_","_","sahita","JJ","","_","_"
4,"pārthā","_","_","pārtha","NC","","_","_"
5,"_","_","_","na","CNG","","_","_"
6,"_","_","_","ativart","V","ativṛt","_","_"
7,"bhārata","_","_","bhārata","NC","","_","_"
1,"yudhiṣṭhiraṃ","_","_","yudhiṣṭhira","NC","","_","_"
2,"_","_","_","śata","NUM","","_","_"
3,"_","_","_","āji","NC","","_","_"
4,"vivyādha","_","_","vyadh","V","vyadh","_","_"
5,"_","_","_","bharata","NC","","_","_"
6,"_","_","_","ṛṣabha","NC","","_","_"
1,"bhīmasenaṃ","_","_","bhīmasa","NC","","_","_"
2,"ca","_","_","ca","CCD","","_","_"
3,"saptatyā","_","_","saptati","NC","","_","_"
4,"sahadevaṃ","_","_","sahadeva","NC","","_","_"
5,"ca","_","_","ca","CCD","","_","_"
6,"saptabhiḥ","_","_","saptan","NUM","","_","_"
1,"nakulaṃ","_","_","nakula","NC","","_","_"
2,"ca","_","_","ca","CCD","","_","_"
3,"catuḥṣaṣṭyā","_","_","catuḥṣaṣṭi","NC","","_","_"
4,"dhṛṣṭadyumnaṃ","_","_","dhṛṣṭadyumna","NC","","_","_"
5,"ca","_","_","ca","CCD","","_","_"
6,"pañcabhiḥ","_","_","pañcan","NUM","","_","_"
1,"saptabhir","_","_","saptan","NUM","","_","_"
2,"_","_","_","draupadeya","NC","","_","_"
3,"_","_","_","ca","CCD","","_","_"
4,"tribhir","_","_","tri","NUM","","_","_"
5,"vivyādha","_","_","vyadh","V","vyadh","_","_"
6,"sātyakim","_","_","sātyaki","NC","","_","_"
1,"_","_","_","dhanus","NC","","_","_"
2,"_","_","_","chid","V","chid","_","_"
3,"bhallena","_","_","bhalla","NC","","_","_"
4,"sahadevasya","_","_","sahadeva","NC","","_","_"
5,"māriṣa","_","_","māriṣa","NC","","_","_"
1,"tad","_","_","tad","PRD","","_","_"
2,"a","_","_","alpha_privativum","CGDA","","_","_"
2,"apāsya","_","_","pās","CGDA","","_","_"
3,"_","_","_","dhanus","NC","","_","_"
4,"_","_","_","chid","PPP","","_","_"
5,"_","_","_","mādrī","NC","","_","_"
6,"_","_","_","putra","NC","","_","_"
7,"pratāpavān","_","_","pratāpavat","JJ","","_","_"
1,"abhyadhāvata","_","_","abhidhāv","V","abhidhāv","_","_"
2,"rājānaṃ","_","_","rājan","NC","","_","_"
3,"_","_","_","pragrah","CGDA","","_","_"
4,"_","_","_","anya","PPX","","_","_"
5,"_","_","_","mahat","JJ","","_","_"
6,"dhanuḥ","_","_","dhanus","NC","","_","_"
1,"tato","_","_","tatas","CX","","_","_"
2,"duryodhanaṃ","_","_","duryodhana","NC","","_","_"
3,"saṃkhye","_","_","saṃkhya","NC","","_","_"
4,"vivyādha","_","_","vyadh","V","vyadh","_","_"
5,"daśabhiḥ","_","_","daśan","NUM","","_","_"
6,"śaraiḥ","_","_","śara","NC","","_","_"
1,"_","_","_","nakula","NC","","_","_"
2,"_","_","_","ca","CCD","","_","_"
3,"tato","_","_","tatas","CX","","_","_"
4,"vīro","_","_","vīra","NC","","_","_"
5,"rājānaṃ","_","_","rājan","NC","","_","_"
6,"navabhiḥ","_","_","navan","NUM","","_","_"
7,"śaraiḥ","_","_","śara","NC","","_","_"
1,"_","_","_","ghora","JJ","","_","_"
2,"_","_","_","rūpa","NC","","_","_"
3,"_","_","_","mahat","JJ","","_","_"
4,"_","_","_","iṣvāsa","NC","","_","_"
5,"vivyādha","_","_","vyadh","V","vyadh","_","_"
6,"ca","_","_","ca","CCD","","_","_"
7,"nanāda","_","_","nad","V","nad","_","_"
8,"ca","_","_","ca","CCD","","_","_"
1,"_","_","_","sātyaki","NC","","_","_"
2,"_","_","_","ca","CCD","","_","_"
3,"_","_","_","api","CX","","_","_"
4,"rājānaṃ","_","_","rājan","NC","","_","_"
5,"_","_","_","śara","NC","","_","_"
6,"_","_","_","āna","PPP","","_","_"
7,"_","_","_","parvan","NC","","_","_"
1,"_","_","_","draupadeya","NC","","_","_"
2,"_","_","_","trisaptati","NC","","_","_"
3,"_","_","_","dharmarāja","NC","","_","_"
4,"_","_","_","ca","CCD","","_","_"
5,"saptabhiḥ","_","_","saptan","NUM","","_","_"
1,"aśītyā","_","_","aśīti","NC","","_","_"
2,"_","_","_","bhīmasa","NC","","_","_"
3,"_","_","_","ca","CCD","","_","_"
4,"śarai","_","_","śara","NC","","_","_"
5,"rājānam","_","_","rājan","NC","","_","_"
6,"ārdayat","_","_","arday","V","arday","_","_"
1,"samantāt","_","_","samantāt","CX","","_","_"
2,"_","_","_","kṛ","KDP","","_","_"
3,"_","_","_","tu","CCD","","_","_"
4,"_","_","_","bāṇa","NC","","_","_"
5,"_","_","_","saṃgha","NC","","_","_"
6,"mahātmabhiḥ","_","_","mahātman","JJ","","_","_"
1,"na","_","_","na","CNG","","_","_"
2,"cacāla","_","_","cal","V","cal","_","_"
3,"_","_","_","mahat","JJ","","_","_"
4,"_","_","_","rāja","NC","","_","_"
5,"_","_","_","sarva","JQ","","_","_"
6,"_","_","_","sainya","NC","","_","_"
7,"paśyataḥ","_","_","dṛś","KDP","","_","_"
1,"lāghavaṃ","_","_","lāghava","NC","","_","_"
2,"sauṣṭhavaṃ","_","_","sauṣṭhava","NC","","_","_"
3,"_","_","_","ca","CCD","","_","_"
4,"_","_","_","api","CX","","_","_"
5,"vīryaṃ","_","_","vīrya","NC","","_","_"
6,"_","_","_","ca","CCD","","_","_"
7,"_","_","_","eva","CEM","","_","_"
8,"mahātmanaḥ","_","_","mahātman","JJ","","_","_"
1,"ati","_","_","ati","CADP","","_","_"
2,"sarvāṇi","_","_","sarva","JQ","","_","_"
3,"bhūtāni","_","_","bhūta","NC","","_","_"
4,"dadṛśuḥ","_","_","darś","V","dṛś","_","_"
5,"_","_","_","sarva","JQ","","_","_"
6,"_","_","_","mānava","NC","","_","_"
1,"_","_","_","dhārtarāṣṭra","NC","","_","_"
2,"_","_","_","tu","CCD","","_","_"
3,"_","_","_","rājan","NC","","_","_"
4,"_","_","_","indra","NC","","_","_"
5,"yātvā","_","_","yā","CGDA","","_","_"
6,"tu","_","_","tu","CCD","","_","_"
7,"_","_","_","su","CAD","","_","_"
8,"_","_","_","alpa","JJ","","_","_"
9,"antaram","_","_","antara","NC","","_","_"
1,"apaśyamānā","_","_","apaśyamāna","JJ","","_","_"
2,"rājānaṃ","_","_","rājan","NC","","_","_"
3,"paryavartanta","_","_","parivart","V","parivṛt","_","_"
4,"daṃśitāḥ","_","_","daṃśay","PPP","","_","_"
1,"teṣām","_","_","tad","PRD","","_","_"
2,"āpatatāṃ","_","_","āpat","KDP","","_","_"
3,"_","_","_","ghora","JJ","","_","_"
4,"_","_","_","tumula","JJ","","_","_"
5,"samajāyata","_","_","saṃjan","V","saṃjan","_","_"
1,"kṣubdhasya","_","_","kṣubh","PPP","","_","_"
2,"hi","_","_","hi","CX","","_","_"
3,"samudrasya","_","_","samudra","NC","","_","_"
4,"_","_","_","prāvṛṣ","NC","","_","_"
5,"_","_","_","kāla","NC","","_","_"
6,"yathā","_","_","yathā","CCM","","_","_"
7,"niśi","_","_","niś","NC","","_","_"
1,"samāsādya","_","_","samāsāday","CGDA","","_","_"
2,"raṇe","_","_","raṇa","NC","","_","_"
3,"te","_","_","tad","PRD","","_","_"
4,"tu","_","_","tu","CCD","","_","_"
5,"rājānam","_","_","rājan","NC","","_","_"
6,"aparājitam","_","_","aparājita","JJ","","_","_"
1,"pratyudyayur","_","_","pratyudyā","V","pratyudyā","_","_"
2,"_","_","_","mahat","JJ","","_","_"
3,"_","_","_","iṣvāsa","NC","","_","_"
4,"pāṇḍavān","_","_","pāṇḍava","NC","","_","_"
5,"ātatāyinaḥ","_","_","ātatāyin","JJ","","_","_"
1,"bhīmasenaṃ","_","_","bhīmasa","NC","","_","_"
2,"raṇe","_","_","raṇa","NC","","_","_"
3,"kruddhaṃ","_","_","krudh","PPP","","_","_"
4,"droṇaputro","_","_","droṇaputra","NC","","_","_"
5,"nyavārayat","_","_","nyavāra","V","nivāray","_","_"
1,"tato","_","_","tatas","CX","","_","_"
2,"bāṇair","_","_","bāṇa","NC","","_","_"
3,"_","_","_","mahat","JJ","","_","_"
4,"_","_","_","rāja","NC","","_","_"
5,"pramuktaiḥ","_","_","pramuc","PPP","","_","_"
6,"sarvatodiśam","_","_","sarvatodiśa","CX","","_","_"
1,"_","_","_","na","CNG","","_","_"
2,"_","_","_","jān","V","jñā","_","_"
3,"raṇe","_","_","raṇa","NC","","_","_"
4,"vīrā","_","_","vīra","NC","","_","_"
5,"na","_","_","na","CNG","","_","_"
6,"diśaḥ","_","_","diś","NC","","_","_"
7,"_","_","_","pradiś","NC","","_","_"
8,"_","_","_","tathā","CX","","_","_"
1,"_","_","_","tad","PRD","","_","_"
2,"_","_","_","ubh","PPX","","_","_"
3,"_","_","_","krūra","JJ","","_","_"
4,"_","_","_","karman","NC","","_","_"
5,"_","_","_","ubh","PPX","","_","_"
6,"bhārata","_","_","bhārata","NC","","_","_"
7,"duḥsahau","_","_","duḥsaha","JJ","","_","_"
1,"_","_","_","ghora","JJ","","_","_"
2,"_","_","_","rūpa","NC","","_","_"
3,"ayudhyetāṃ","_","_","yudh","V","yudh","_","_"
4,"_","_","_","kṛ","PPP","","_","_"
5,"_","_","_","pratikṛ","PPP","","_","_"
6,"_","_","_","eṣin","JJ","","_","_"
1,"trāsayantau","_","_","trāsay","KDP","","_","_"
2,"jagat","_","_","jagat","NC","","_","_"
3,"sarvaṃ","_","_","sarva","JQ","","_","_"
4,"_","_","_","jyā","NC","","_","_"
5,"_","_","_","kṣepa","NC","","_","_"
6,"_","_","_","vihan","PPP","","_","_"
7,"_","_","_","tvac","NC","","_","_"
1,"_","_","_","śakuni","NC","","_","_"
2,"_","_","_","tu","CCD","","_","_"
3,"raṇe","_","_","raṇa","NC","","_","_"
4,"vīro","_","_","vīra","NC","","_","_"
5,"yudhiṣṭhiram","_","_","yudhiṣṭhira","NC","","_","_"
6,"apīḍayat","_","_","pīḍay","V","pīḍay","_","_"
1,"_","_","_","tad","PRD","","_","_"
2,"_","_","_","aśva","NC","","_","_"
3,"_","_","_","catur","NUM","","_","_"
4,"hatvā","_","_","han","CGDA","","_","_"
5,"subalasya","_","_","subala","NC","","_","_"
6,"suto","_","_","suta","NC","","_","_"
7,"vibhuḥ","_","_","vibhu","JJ","","_","_"
1,"nādaṃ","_","_","nāda","NC","","_","_"
2,"cakāra","_","_","kar","V","kṛ","_","_"
3,"balavān","_","_","balavat","JJ","","_","_"
4,"_","_","_","sarva","JQ","","_","_"
5,"_","_","_","sainya","NC","","_","_"
6,"kampayan","_","_","kampay","KDP","","_","_"
1,"etasminn","_","_","tad","PRD","","_","_"
2,"antare","_","_","antara","NC","","_","_"
3,"vīraṃ","_","_","vīra","NC","","_","_"
4,"rājānam","_","_","rājan","NC","","_","_"
5,"aparājitam","_","_","aparājita","JJ","","_","_"
1,"apovāha","_","_","apavah","V","apavah","_","_"
2,"_","_","_","ratha","NC","","_","_"
3,"_","_","_","āji","NC","","_","_"
4,"sahadevaḥ","_","_","sahadeva","NC","","_","_"
5,"pratāpavān","_","_","pratāpavat","JJ","","_","_"
1,"_","_","_","atha","CAD","","_","_"
2,"_","_","_","anya","PPX","","_","_"
3,"ratham","_","_","ratha","NC","","_","_"
4,"āsthāya","_","_","āsthā","CGDA","","_","_"
5,"dharmarājo","_","_","dharmarāja","NC","","_","_"
6,"yudhiṣṭhiraḥ","_","_","yudhiṣṭhira","NC","","_","_"
1,"śakuniṃ","_","_","śakuni","NC","","_","_"
2,"navabhir","_","_","navan","NUM","","_","_"
3,"viddhvā","_","_","vyadh","CGDA","","_","_"
4,"punar","_","_","punar","CAD","","_","_"
5,"vivyādha","_","_","vyadh","V","vyadh","_","_"
6,"pañcabhiḥ","_","_","pañcan","NUM","","_","_"
1,"nanāda","_","_","nad","V","nad","_","_"
2,"ca","_","_","ca","CCD","","_","_"
3,"_","_","_","mahat","JJ","","_","_"
4,"_","_","_","nāda","NC","","_","_"
5,"pravaraḥ","_","_","pravara","JJ","","_","_"
6,"_","_","_","sarva","JQ","","_","_"
7,"_","_","_","dhanvin","JJ","","_","_"
1,"tad","_","_","tad","PRD","","_","_"
2,"yuddham","_","_","yuddha","NC","","_","_"
3,"_","_","_","bhav","V","bhū","_","_"
4,"_","_","_","citra","NC","","_","_"
5,"_","_","_","ghora","JJ","","_","_"
6,"_","_","_","rūpa","NC","","_","_"
7,"ca","_","_","ca","CCD","","_","_"
8,"māriṣa","_","_","māriṣa","NC","","_","_"
1,"_","_","_","īkṣitṛ","JJ","","_","_"
2,"_","_","_","prīti","NC","","_","_"
3,"_","_","_","janana","JJ","","_","_"
4,"_","_","_","siddha","NC","","_","_"
5,"_","_","_","cāraṇa","NC","","_","_"
6,"_","_","_","sev","PPP","","_","_"
1,"_","_","_","ulūka","NC","","_","_"
2,"_","_","_","tu","CCD","","_","_"
3,"_","_","_","mahat","JJ","","_","_"
4,"_","_","_","iṣvāsa","NC","","_","_"
5,"nakulaṃ","_","_","nakula","NC","","_","_"
6,"_","_","_","yuddha","NC","","_","_"
7,"_","_","_","durmada","JJ","","_","_"
1,"abhyadravad","_","_","abhidru","V","abhidru","_","_"
2,"_","_","_","ameya","JJ","","_","_"
3,"_","_","_","ātman","NC","","_","_"
4,"_","_","_","śara","NC","","_","_"
5,"_","_","_","varṣa","NC","","_","_"
6,"samantataḥ","_","_","samantataḥ","CX","","_","_"
1,"_","_","_","tathā","CX","","_","_"
2,"_","_","_","eva","CEM","","_","_"
3,"nakulaḥ","_","_","nakula","NC","","_","_"
4,"śūraḥ","_","_","śūra","NC","","_","_"
5,"saubalasya","_","_","saubala","NC","","_","_"
6,"sutaṃ","_","_","suta","NC","","_","_"
7,"raṇe","_","_","raṇa","NC","","_","_"
1,"_","_","_","śara","NC","","_","_"
2,"_","_","_","varṣa","NC","","_","_"
3,"mahatā","_","_","mahat","JJ","","_","_"
4,"samantāt","_","_","samantāt","CX","","_","_"
5,"paryavārayat","_","_","parivāray","V","parivāray","_","_"
1,"tau","_","_","tad","PRD","","_","_"
2,"tatra","_","_","tatra","CAD","","_","_"
3,"samare","_","_","samara","NC","","_","_"
4,"vīrau","_","_","vīra","NC","","_","_"
5,"_","_","_","kula","NC","","_","_"
6,"_","_","_","putra","NC","","_","_"
7,"_","_","_","mahat","JJ","","_","_"
8,"_","_","_","ratha","NC","","_","_"
1,"_","_","_","yodhay","KDP","","_","_"
2,"_","_","_","paś","V","paś","_","_"
3,"_","_","_","paraspara","PRC","","_","_"
4,"_","_","_","kṛ","PPP","","_","_"
5,"_","_","_","āgas","NC","","_","_"
1,"_","_","_","tathā","CX","","_","_"
2,"_","_","_","eva","CEM","","_","_"
3,"kṛtavarmā","_","_","kṛtavarman","NC","","_","_"
4,"tu","_","_","tu","CCD","","_","_"
5,"śaineyaṃ","_","_","śaineya","NC","","_","_"
6,"_","_","_","śatru","NC","","_","_"
7,"_","_","_","tāpana","JJ","","_","_"
1,"yodhayañ","_","_","yodhay","KDP","","_","_"
2,"śuśubhe","_","_","śubh","V","śubh","_","_"
3,"rājan","_","_","rājan","NC","","_","_"
4,"balaṃ","_","_","bala","NC","","_","_"
5,"śakra","_","_","śakra","NC","","_","_"
6,"_","_","_","iva","CCM","","_","_"
7,"_","_","_","āhava","NC","","_","_"
1,"duryodhano","_","_","duryodhana","NC","","_","_"
2,"_","_","_","dhanus","NC","","_","_"
3,"_","_","_","chid","CGDA","","_","_"
4,"dhṛṣṭadyumnasya","_","_","dhṛṣṭadyumna","NC","","_","_"
5,"saṃyuge","_","_","saṃyuga","NC","","_","_"
1,"_","_","_","atha","CAD","","_","_"
2,"_","_","_","a","PRD","","_","_"
3,"_","_","_","chid","PPP","","_","_"
4,"_","_","_","dhanvan","NC","","_","_"
5,"vivyādha","_","_","vyadh","V","vyadh","_","_"
6,"niśitaiḥ","_","_","niśā","PPP","","_","_"
7,"śaraiḥ","_","_","śara","NC","","_","_"
1,"dhṛṣṭadyumno","_","_","dhṛṣṭadyumna","NC","","_","_"
2,"'pi","_","_","api","CX","","_","_"
3,"samare","_","_","samara","NC","","_","_"
4,"pragṛhya","_","_","pragrah","CGDA","","_","_"
5,"_","_","_","parama","JJ","","_","_"
6,"_","_","_","āyudha","NC","","_","_"
1,"rājānaṃ","_","_","rājan","NC","","_","_"
2,"yodhayāmāsa","_","_","yodhay","V","yodhay","_","_"
3,"paśyatāṃ","_","_","dṛś","KDP","","_","_"
4,"_","_","_","sarva","JQ","","_","_"
5,"_","_","_","dhanvin","JJ","","_","_"
1,"tayor","_","_","tad","PRD","","_","_"
2,"yuddhaṃ","_","_","yuddha","NC","","_","_"
3,"_","_","_","mahat","JJ","","_","_"
4,"_","_","_","ca","CCD","","_","_"
5,"_","_","_","as","V","as","_","_"
6,"saṃgrāme","_","_","saṃgrāma","NC","","_","_"
7,"_","_","_","bharata","NC","","_","_"
8,"_","_","_","ṛṣabha","NC","","_","_"
1,"prabhinnayor","_","_","prabhid","PPP","","_","_"
2,"yathā","_","_","yathā","CCM","","_","_"
3,"saktaṃ","_","_","sañj","PPP","","_","_"
4,"mattayor","_","_","mat","PPP","","_","_"
5,"_","_","_","vara","JJ","","_","_"
6,"_","_","_","hastin","NC","","_","_"
1,"_","_","_","gautama","NC","","_","_"
2,"_","_","_","tu","CCD","","_","_"
3,"raṇe","_","_","raṇa","NC","","_","_"
4,"kruddho","_","_","krudh","PPP","","_","_"
5,"_","_","_","draupadeya","NC","","_","_"
6,"_","_","_","mahat","JJ","","_","_"
7,"_","_","_","bala","NC","","_","_"
1,"vivyādha","_","_","vyadh","V","vyadh","_","_"
2,"bahubhiḥ","_","_","bahu","JJ","","_","_"
3,"śūraḥ","_","_","śūra","NC","","_","_"
4,"śaraiḥ","_","_","śara","NC","","_","_"
5,"_","_","_","saṃna","PPP","","_","_"
6,"_","_","_","parvan","NC","","_","_"
1,"tasya","_","_","tad","PRD","","_","_"
2,"tair","_","_","tad","PRD","","_","_"
3,"abhavad","_","_","bhav","V","bhū","_","_"
4,"yuddham","_","_","yuddha","NC","","_","_"
5,"indriyair","_","_","indriya","NC","","_","_"
6,"iva","_","_","iva","CCM","","_","_"
7,"dehinaḥ","_","_","dehin","NC","","_","_"
1,"_","_","_","ghora","JJ","","_","_"
2,"_","_","_","rūpa","NC","","_","_"
3,"asaṃvāryaṃ","_","_","asaṃvārya","JJ","","_","_"
4,"nirmaryādam","_","_","nirmaryāda","JJ","","_","_"
5,"atīva","_","_","atīva","CX","","_","_"
6,"ca","_","_","ca","CCD","","_","_"
1,"te","_","_","tad","PRD","","_","_"
2,"ca","_","_","ca","CCD","","_","_"
3,"taṃ","_","_","tad","PRD","","_","_"
4,"pīḍayāmāsur","_","_","pīḍay","V","pīḍay","_","_"
5,"_","_","_","indriya","NC","","_","_"
6,"_","_","_","iva","CCM","","_","_"
7,"bāliśam","_","_","bāliśa","NC","","_","_"
1,"sa","_","_","tad","PRD","","_","_"
2,"ca","_","_","ca","CCD","","_","_"
3,"tān","_","_","tad","PRD","","_","_"
4,"pratisaṃrabdhaḥ","_","_","pratisaṃrabh","PPP","","_","_"
5,"pratyayodhayad","_","_","pratiyodhay","V","pratiyodhay","_","_"
6,"āhave","_","_","āhava","NC","","_","_"
1,"evaṃ","_","_","eva","CX","","_","_"
2,"citram","_","_","citra","JJ","","_","_"
3,"abhūd","_","_","bhav","V","bhū","_","_"
4,"yuddhaṃ","_","_","yuddha","NC","","_","_"
5,"tasya","_","_","tad","PRD","","_","_"
6,"taiḥ","_","_","tad","PRD","","_","_"
7,"saha","_","_","saha","CX","","_","_"
8,"bhārata","_","_","bhārata","NC","","_","_"
1,"_","_","_","utthā","CGDA","","_","_"
2,"_","_","_","utthā","CGDA","","_","_"
3,"hi","_","_","hi","CX","","_","_"
4,"yathā","_","_","yathā","CCM","","_","_"
5,"dehinām","_","_","dehin","NC","","_","_"
6,"indriyair","_","_","indriya","NC","","_","_"
7,"vibho","_","_","vibhu","JJ","","_","_"
1,"_","_","_","nara","NC","","_","_"
2,"_","_","_","ca","CCD","","_","_"
3,"_","_","_","eva","CEM","","_","_"
4,"naraiḥ","_","_","nara","NC","","_","_"
5,"sārdhaṃ","_","_","sārdha","CX","","_","_"
6,"dantino","_","_","dantin","NC","","_","_"
7,"_","_","_","dantin","NC","","_","_"
8,"_","_","_","tathā","CX","","_","_"
1,"hayā","_","_","haya","NC","","_","_"
2,"hayaiḥ","_","_","haya","NC","","_","_"
3,"samāsaktā","_","_","samāsañj","PPP","","_","_"
4,"rathino","_","_","rathin","NC","","_","_"
5,"_","_","_","rathin","NC","","_","_"
6,"_","_","_","tathā","CX","","_","_"
1,"saṃkulaṃ","_","_","saṃkula","JJ","","_","_"
2,"_","_","_","ca","CCD","","_","_"
3,"_","_","_","bhav","V","bhū","_","_"
4,"bhūyo","_","_","bhūyas","CX","","_","_"
5,"_","_","_","ghora","JJ","","_","_"
6,"_","_","_","rūpa","NC","","_","_"
7,"viśāṃ","_","_","viś","NC","","_","_"
8,"pate","_","_","pati","NC","","_","_"
1,"idaṃ","_","_","ida","PRD","","_","_"
2,"citram","_","_","citra","JJ","","_","_"
3,"idaṃ","_","_","ida","PRD","","_","_"
4,"ghoram","_","_","ghora","JJ","","_","_"
5,"idaṃ","_","_","ida","PRD","","_","_"
6,"raudram","_","_","raudra","JJ","","_","_"
7,"iti","_","_","iti","CQT","","_","_"
8,"prabho","_","_","prabhu","JJ","","_","_"
1,"_","_","_","yuddha","NC","","_","_"
2,"_","_","_","as","V","as","_","_"
3,"_","_","_","mahat","JJ","","_","_"
4,"_","_","_","rāja","NC","","_","_"
5,"ghorāṇi","_","_","ghora","JJ","","_","_"
6,"ca","_","_","ca","CCD","","_","_"
7,"bahūni","_","_","bahu","JJ","","_","_"
8,"ca","_","_","ca","CCD","","_","_"
1,"te","_","_","tad","PRD","","_","_"
2,"samāsādya","_","_","samāsāday","CGDA","","_","_"
3,"samare","_","_","samara","NC","","_","_"
4,"parasparam","_","_","paraspara","PRC","","_","_"
5,"ariṃdamāḥ","_","_","ariṃdama","JJ","","_","_"
1,"_","_","_","vyadh","V","vyadh","_","_"
2,"_","_","_","ca","CCD","","_","_"
3,"_","_","_","eva","CEM","","_","_"
4,"_","_","_","han","V","han","_","_"
5,"_","_","_","ca","CCD","","_","_"
6,"samāsādya","_","_","samāsāday","CGDA","","_","_"
7,"_","_","_","mahat","JJ","","_","_"
8,"_","_","_","āhava","NC","","_","_"
1,"teṣāṃ","_","_","tad","PRD","","_","_"
2,"_","_","_","śastra","NC","","_","_"
3,"_","_","_","samudbhū","PPP","","_","_"
4,"_","_","_","rajas","NC","","_","_"
5,"_","_","_","tīvra","JJ","","_","_"
6,"adṛśyata","_","_","darś","V","dṛś","_","_"
1,"_","_","_","pravāta","NC","","_","_"
2,"_","_","_","uddhan","PPP","","_","_"
3,"rājan","_","_","rājan","NC","","_","_"
4,"_","_","_","dhāv","KDP","","_","_"
5,"_","_","_","ca","CCD","","_","_"
6,"_","_","_","aśva","NC","","_","_"
7,"_","_","_","sādin","NC","","_","_"
1,"_","_","_","ratha","NC","","_","_"
2,"_","_","_","nemi","NC","","_","_"
3,"_","_","_","samudbhū","PPP","","_","_"
4,"_","_","_","niḥśvāsa","NC","","_","_"
5,"_","_","_","ca","CCD","","_","_"
6,"_","_","_","api","CX","","_","_"
7,"dantinām","_","_","dantin","NC","","_","_"
1,"rajaḥ","_","_","rajas","NC","","_","_"
2,"_","_","_","saṃdhyā","NC","","_","_"
3,"_","_","_","abhra","NC","","_","_"
4,"_","_","_","kapila","JJ","","_","_"
5,"_","_","_","divākara","NC","","_","_"
6,"_","_","_","patha","NC","","_","_"
7,"yayau","_","_","yā","V","yā","_","_"
1,"rajasā","_","_","rajas","NC","","_","_"
2,"tena","_","_","tad","PRD","","_","_"
3,"saṃpṛkte","_","_","sampṛc","PPP","","_","_"
4,"bhāskare","_","_","bhāskara","NC","","_","_"
5,"niṣprabhīkṛte","_","_","niṣprabhīkṛ","PPP","","_","_"
1,"_","_","_","saṃchāday","PPP","","_","_"
2,"_","_","_","bhav","V","bhū","_","_"
3,"_","_","_","bhūmi","NC","","_","_"
4,"_","_","_","tad","PRD","","_","_"
5,"ca","_","_","ca","CCD","","_","_"
6,"śūrā","_","_","śūra","NC","","_","_"
7,"_","_","_","mahat","JJ","","_","_"
8,"_","_","_","ratha","NC","","_","_"
1,"muhūrtād","_","_","muhūrta","NC","","_","_"
2,"iva","_","_","iva","CCM","","_","_"
3,"saṃvṛttaṃ","_","_","saṃvṛt","PPP","","_","_"
4,"nīrajaskaṃ","_","_","nīrajaska","JJ","","_","_"
5,"samantataḥ","_","_","samantataḥ","CX","","_","_"
1,"_","_","_","vīra","NC","","_","_"
2,"_","_","_","śoṇita","NC","","_","_"
3,"_","_","_","sic","PPP","","_","_"
4,"bhūmau","_","_","bhūmi","NC","","_","_"
5,"_","_","_","bharata","NC","","_","_"
6,"_","_","_","sattama","JJ","","_","_"
1,"upāśāmyat","_","_","upaśa","V","upaśa","_","_"
2,"_","_","_","tatas","CX","","_","_"
3,"_","_","_","tīvra","JJ","","_","_"
4,"tad","_","_","tad","PRD","","_","_"
5,"rajo","_","_","rajas","NC","","_","_"
6,"_","_","_","ghora","JJ","","_","_"
7,"_","_","_","darśana","NC","","_","_"
1,"tato","_","_","tatas","CX","","_","_"
2,"'paśyaṃ","_","_","paś","V","paś","_","_"
3,"_","_","_","mahat","JJ","","_","_"
4,"_","_","_","rāja","NC","","_","_"
5,"_","_","_","dvaṃdva","NC","","_","_"
6,"_","_","_","yuddha","NC","","_","_"
7,"bhārata","_","_","bhārata","NC","","_","_"
1,"yathāprāgryaṃ","_","_","yathāprāgrya","CX","","_","_"
2,"yathājyeṣṭhaṃ","_","_","yathājyeṣṭha","CX","","_","_"
3,"madhyāhne","_","_","madhyāhna","NC","","_","_"
4,"vai","_","_","vai","CX","","_","_"
5,"_","_","_","su","CAD","","_","_"
6,"_","_","_","dāruṇa","JJ","","_","_"
1,"varmaṇāṃ","_","_","varman","NC","","_","_"
2,"tatra","_","_","tatra","CAD","","_","_"
3,"_","_","_","rājan","NC","","_","_"
4,"_","_","_","indra","NC","","_","_"
5,"_","_","_","vidarś","V","vidṛś","_","_"
6,"_","_","_","ujjvala","JJ","","_","_"
7,"prabhāḥ","_","_","prabhā","NC","","_","_"
1,"śabdaḥ","_","_","śabda","NC","","_","_"
2,"_","_","_","su","CAD","","_","_"
3,"_","_","_","tumula","JJ","","_","_"
4,"saṃkhye","_","_","saṃkhya","NC","","_","_"
5,"śarāṇāṃ","_","_","śara","NC","","_","_"
6,"patatām","_","_","pat","KDP","","_","_"
7,"abhūt","_","_","bhav","V","bhū","_","_"
1,"_","_","_","mahat","JJ","","_","_"
2,"_","_","_","veṇu","NC","","_","_"
3,"_","_","_","vana","NC","","_","_"
4,"_","_","_","iva","CCM","","_","_"
5,"dahyamānasya","_","_","dah","KDP","","_","_"
6,"sarvataḥ","_","_","sarvatas","CX","","_","_"
