"WordID","word","NormSTEM","suffix","lemma","PoS","Root","NormSuffix","NormWord"
1,"mārkaṇḍeya","_","_","mārkaṇḍeya","NC","","_","_"
2,"uvāca","_","_","vak","V","vac","_","_"
1,"tasyāṃ","_","_","tad","PRD","","_","_"
2,"rātryāṃ","_","_","rātri","NC","","_","_"
3,"vyatītāyām","_","_","vyatī","PPP","","_","_"
4,"udite","_","_","vad","PPP","","_","_"
5,"_","_","_","sūrya","NC","","_","_"
6,"_","_","_","maṇḍala","NC","","_","_"
1,"_","_","_","kṛ","PPP","","_","_"
2,"_","_","_","pūrvāhṇika","JJ","","_","_"
3,"sarve","_","_","sarva","JQ","","_","_"
4,"_","_","_","same","V","same","_","_"
5,"_","_","_","tad","PRD","","_","_"
6,"tapodhanāḥ","_","_","tapodhana","JJ","","_","_"
1,"tad","_","_","tad","PRD","","_","_"
2,"eva","_","_","eva","CEM","","_","_"
3,"sarvaṃ","_","_","sarva","JQ","","_","_"
4,"sāvitryā","_","_","sāvitrī","NC","","_","_"
5,"_","_","_","mahat","JJ","","_","_"
6,"_","_","_","bhāgya","NC","","_","_"
7,"_","_","_","mahat","JJ","","_","_"
8,"_","_","_","ṛṣi","NC","","_","_"
1,"dyumatsenāya","_","_","dyumatsa","NC","","_","_"
2,"_","_","_","na","CNG","","_","_"
3,"_","_","_","tṛp","V","tṛp","_","_"
4,"kathayantaḥ","_","_","kathay","KDP","","_","_"
5,"punaḥ","_","_","punar","CAD","","_","_"
6,"punaḥ","_","_","punar","CAD","","_","_"
1,"tataḥ","_","_","tatas","CX","","_","_"
2,"prakṛtayaḥ","_","_","prakṛti","NC","","_","_"
3,"sarvāḥ","_","_","sarva","JQ","","_","_"
4,"śālvebhyo","_","_","śālva","NC","","_","_"
5,"'bhyāgatā","_","_","abhyāga","PPP","","_","_"
6,"nṛpa","_","_","nṛpa","NC","","_","_"
1,"ācakhyur","_","_","ākhyā","V","ākhyā","_","_"
2,"nihataṃ","_","_","nihan","PPP","","_","_"
3,"_","_","_","ca","CCD","","_","_"
4,"_","_","_","eva","CEM","","_","_"
5,"_","_","_","sva","JJ","","_","_"
6,"_","_","_","amātya","NC","","_","_"
7,"taṃ","_","_","tad","PRD","","_","_"
8,"nṛpam","_","_","nṛpa","NC","","_","_"
1,"taṃ","_","_","tad","PRD","","_","_"
2,"mantriṇā","_","_","mantrin","NC","","_","_"
3,"hataṃ","_","_","han","PPP","","_","_"
4,"śrutvā","_","_","śru","CGDA","","_","_"
5,"_","_","_","sa_saha","CX","","_","_"
6,"_","_","_","sahāya","NC","","_","_"
7,"_","_","_","sa_saha","CX","","_","_"
8,"_","_","_","bāndhava","NC","","_","_"
1,"nyavedayan","_","_","nyaveda","V","niveday","_","_"
2,"yathātattvaṃ","_","_","yathātattva","CX","","_","_"
3,"vidrutaṃ","_","_","vidru","PPP","","_","_"
4,"ca","_","_","ca","CCD","","_","_"
5,"_","_","_","dviṣ","KDP","","_","_"
6,"_","_","_","bala","NC","","_","_"
1,"aikamatyaṃ","_","_","aikamatya","NC","","_","_"
2,"ca","_","_","ca","CCD","","_","_"
3,"sarvasya","_","_","sarva","JQ","","_","_"
4,"_","_","_","jana","NC","","_","_"
5,"_","_","_","atha","CAD","","_","_"
6,"nṛpaṃ","_","_","nṛpa","NC","","_","_"
7,"prati","_","_","prati","CADP","","_","_"
1,"vāpyacakṣur","_","_","vā","CCD","","_","_"
2,"vā","_","_","tad","PRD","","_","_"
3,"sa","_","_","mat","PPR","","_","_"
4,"no","_","_","rājan","NC","","_","_"
5,"_","_","_","bhav","V","bhū","_","_"
6,"_","_","_","iti","CQT","","_","_"
1,"anena","_","_","ida","PRD","","_","_"
2,"_","_","_","niścaya","NC","","_","_"
3,"_","_","_","iha","CAD","","_","_"
4,"vayaṃ","_","_","mat","PPR","","_","_"
5,"prasthāpitā","_","_","prasthāpay","PPP","","_","_"
6,"nṛpa","_","_","nṛpa","NC","","_","_"
1,"_","_","_","prāp","PPP","","_","_"
2,"_","_","_","ida","PRD","","_","_"
3,"yānāni","_","_","yāna","NC","","_","_"
4,"_","_","_","catur","NUM","","_","_"
5,"_","_","_","aṅga","NC","","_","_"
6,"ca","_","_","ca","CCD","","_","_"
7,"te","_","_","tvat","PPR","","_","_"
8,"balam","_","_","bala","NC","","_","_"
1,"prayāhi","_","_","prayā","V","prayā","_","_"
2,"rājan","_","_","rājan","NC","","_","_"
3,"bhadraṃ","_","_","bhadra","NC","","_","_"
4,"te","_","_","tvat","PPR","","_","_"
5,"ghuṣṭas","_","_","ghuṣ","PPP","","_","_"
6,"te","_","_","tvat","PPR","","_","_"
7,"nagare","_","_","nagara","NC","","_","_"
8,"jayaḥ","_","_","jaya","NC","","_","_"
1,"adhyāssva","_","_","adhyās","V","adhyās","_","_"
2,"cirarātrāya","_","_","cirarātra","NC","","_","_"
3,"pitṛpaitāmahaṃ","_","_","pitṛpaitāmaha","JJ","","_","_"
4,"padam","_","_","pada","NC","","_","_"
1,"cakṣuṣmantaṃ","_","_","cakṣuṣmat","JJ","","_","_"
2,"ca","_","_","ca","CCD","","_","_"
3,"taṃ","_","_","tad","PRD","","_","_"
4,"dṛṣṭvā","_","_","dṛś","CGDA","","_","_"
5,"rājānaṃ","_","_","rājan","NC","","_","_"
6,"_","_","_","vapus","NC","","_","_"
7,"_","_","_","anvita","JJ","","_","_"
1,"mūrdhabhiḥ","_","_","mūrdhan","NC","","_","_"
2,"patitāḥ","_","_","pat","PPP","","_","_"
3,"sarve","_","_","sarva","JQ","","_","_"
4,"_","_","_","vismaya","NC","","_","_"
5,"_","_","_","utphulla","JJ","","_","_"
6,"_","_","_","locana","NC","","_","_"
1,"tato","_","_","tatas","CX","","_","_"
2,"'bhivādya","_","_","abhivāday","CGDA","","_","_"
3,"tān","_","_","tad","PRD","","_","_"
4,"vṛddhān","_","_","vṛddha","JJ","","_","_"
5,"dvijān","_","_","dvija","NC","","_","_"
6,"_","_","_","āśrama","NC","","_","_"
7,"_","_","_","vāsin","JJ","","_","_"
1,"taiś","_","_","tad","PRD","","_","_"
2,"_","_","_","ca","CCD","","_","_"
3,"_","_","_","abhipūjay","PPP","","_","_"
4,"sarvaiḥ","_","_","sarva","JQ","","_","_"
5,"prayayau","_","_","prayā","V","prayā","_","_"
6,"nagaraṃ","_","_","nagara","NC","","_","_"
7,"prati","_","_","prati","CADP","","_","_"
1,"śaibyā","_","_","śaibyā","NC","","_","_"
2,"ca","_","_","ca","CCD","","_","_"
3,"saha","_","_","saha","CX","","_","_"
4,"sāvitryā","_","_","sāvitrī","NC","","_","_"
5,"_","_","_","su","CAD","","_","_"
6,"_","_","_","āstṛ","PPP","","_","_"
7,"_","_","_","su","CAD","","_","_"
8,"_","_","_","varcas","NC","","_","_"
1,"_","_","_","nara","NC","","_","_"
2,"_","_","_","yuj","PPP","","_","_"
3,"yānena","_","_","yāna","NC","","_","_"
4,"prayayau","_","_","prayā","V","prayā","_","_"
5,"senayā","_","_","senā","NC","","_","_"
6,"vṛtā","_","_","vṛ","PPP","","_","_"
1,"tato","_","_","tatas","CX","","_","_"
2,"'bhiṣiṣicuḥ","_","_","abhiṣic","V","abhiṣic","_","_"
3,"prītyā","_","_","prīti","NC","","_","_"
4,"dyumatsenaṃ","_","_","dyumatsa","NC","","_","_"
5,"purohitāḥ","_","_","purohita","NC","","_","_"
1,"putraṃ","_","_","putra","NC","","_","_"
2,"_","_","_","ca","CCD","","_","_"
3,"_","_","_","ida","PRD","","_","_"
4,"mahātmānaṃ","_","_","mahātman","JJ","","_","_"
5,"yauvarājye","_","_","yauvarājya","NC","","_","_"
6,"'bhyaṣecayan","_","_","abhiṣecay","V","abhiṣecay","_","_"
1,"tataḥ","_","_","tatas","CX","","_","_"
2,"kālena","_","_","kāla","NC","","_","_"
3,"mahatā","_","_","mahat","JJ","","_","_"
4,"sāvitryāḥ","_","_","sāvitrī","NC","","_","_"
5,"_","_","_","kīrti","NC","","_","_"
6,"_","_","_","vardhana","JJ","","_","_"
1,"tad","_","_","tad","PRD","","_","_"
2,"vai","_","_","vai","CX","","_","_"
3,"_","_","_","putra","NC","","_","_"
4,"_","_","_","śata","NUM","","_","_"
5,"jajñe","_","_","jan","V","jan","_","_"
6,"śūrāṇām","_","_","śūra","NC","","_","_"
7,"anivartinām","_","_","anivartin","JJ","","_","_"
1,"bhrātṝṇāṃ","_","_","bhrātṛ","NC","","_","_"
2,"sodarāṇāṃ","_","_","sodara","NC","","_","_"
3,"ca","_","_","ca","CCD","","_","_"
4,"_","_","_","tathā","CX","","_","_"
5,"_","_","_","eva","CEM","","_","_"
6,"_","_","_","ida","PRD","","_","_"
7,"_","_","_","bhav","V","bhū","_","_"
8,"_","_","_","śata","NUM","","_","_"
1,"_","_","_","madra","NC","","_","_"
2,"_","_","_","adhipa","NC","","_","_"
3,"_","_","_","aśvapati","NC","","_","_"
4,"mālavyāṃ","_","_","mālavī","NC","","_","_"
5,"_","_","_","su","CAD","","_","_"
6,"_","_","_","mahat","JJ","","_","_"
7,"_","_","_","bala","NC","","_","_"
1,"evam","_","_","eva","CX","","_","_"
2,"ātmā","_","_","ātman","NC","","_","_"
3,"pitā","_","_","pitṛ","NC","","_","_"
4,"mātā","_","_","mātṛ","NC","","_","_"
5,"śvaśrūḥ","_","_","śvaśrū","NC","","_","_"
6,"śvaśura","_","_","śvaśura","NC","","_","_"
7,"eva","_","_","eva","CEM","","_","_"
8,"ca","_","_","ca","CCD","","_","_"
1,"bhartuḥ","_","_","bhartṛ","NC","","_","_"
2,"kulaṃ","_","_","kula","NC","","_","_"
3,"ca","_","_","ca","CCD","","_","_"
4,"sāvitryā","_","_","sāvitrī","NC","","_","_"
5,"sarvaṃ","_","_","sarva","JQ","","_","_"
6,"kṛcchrāt","_","_","kṛcchra","NC","","_","_"
7,"samuddhṛtam","_","_","samuddhṛ","PPP","","_","_"
1,"_","_","_","tathā","CX","","_","_"
2,"_","_","_","eva","CEM","","_","_"
3,"_","_","_","tad","PRD","","_","_"
4,"_","_","_","api","CX","","_","_"
5,"kalyāṇī","_","_","kalyāṇa","JJ","","_","_"
6,"draupadī","_","_","draupadī","NC","","_","_"
7,"_","_","_","śīla","NC","","_","_"
8,"_","_","_","samman","PPP","","_","_"
1,"tārayiṣyati","_","_","tar","V","tṛ","_","_"
2,"vaḥ","_","_","tvat","PPR","","_","_"
3,"sarvān","_","_","sarva","JQ","","_","_"
4,"_","_","_","sāvitrī","NC","","_","_"
5,"_","_","_","iva","CCM","","_","_"
6,"_","_","_","kula","NC","","_","_"
7,"_","_","_","aṅganā","NC","","_","_"
1,"vaiśampāyana","_","_","vaiśampāyana","NC","","_","_"
2,"uvāca","_","_","vak","V","vac","_","_"
1,"evaṃ","_","_","eva","CX","","_","_"
2,"sa","_","_","tad","PRD","","_","_"
3,"_","_","_","pāṇḍava","NC","","_","_"
4,"_","_","_","tad","PRD","","_","_"
5,"anunīto","_","_","anunī","PPP","","_","_"
6,"mahātmanā","_","_","mahātman","JJ","","_","_"
1,"viśoko","_","_","viśoka","JJ","","_","_"
2,"vijvaro","_","_","vijvara","JJ","","_","_"
3,"rājan","_","_","rājan","NC","","_","_"
4,"kāmyake","_","_","kāmyaka","NC","","_","_"
5,"nyavasat","_","_","nivas","V","nivas","_","_"
6,"tadā","_","_","tadā","CAD","","_","_"
