"WordID","word","NormSTEM","suffix","lemma","PoS","Root","NormSuffix","NormWord"
1,"vaiśaṃpāyana","_","_","vaiśampāyana","NC","","_","_"
2,"uvāca","_","_","vak","V","vac","_","_"
1,"atha","_","_","atha","CAD","","_","_"
2,"saṃgamya","_","_","saṃga","CGDA","","_","_"
3,"sarve","_","_","sarva","JQ","","_","_"
4,"tu","_","_","tu","CCD","","_","_"
5,"kauravāṇāṃ","_","_","kaurava","NC","","_","_"
6,"_","_","_","mahat","JJ","","_","_"
7,"_","_","_","ratha","NC","","_","_"
1,"arjunaṃ","_","_","arjuna","NC","","_","_"
2,"sahitā","_","_","sahita","JJ","","_","_"
3,"yattāḥ","_","_","yat","PPP","","_","_"
4,"pratyayudhyanta","_","_","pratiyudh","V","pratiyudh","_","_"
5,"bhārata","_","_","bhārata","NC","","_","_"
1,"sa","_","_","tad","PRD","","_","_"
2,"_","_","_","sāyaka","NC","","_","_"
3,"_","_","_","maya","JJ","","_","_"
4,"jālaiḥ","_","_","jāla","NC","","_","_"
5,"_","_","_","sarvatas","CX","","_","_"
6,"_","_","_","tad","PRD","","_","_"
7,"_","_","_","mahat","JJ","","_","_"
8,"_","_","_","ratha","NC","","_","_"
1,"prācchādayad","_","_","pracchāday","V","pracchāday","_","_"
2,"_","_","_","ameya","JJ","","_","_"
3,"_","_","_","ātman","NC","","_","_"
4,"nīhāra","_","_","nīhāra","NC","","_","_"
5,"iva","_","_","iva","CCM","","_","_"
6,"parvatān","_","_","parvata","NC","","_","_"
1,"_","_","_","nad","KDP","","_","_"
2,"_","_","_","ca","CCD","","_","_"
3,"_","_","_","mahat","JJ","","_","_"
4,"_","_","_","nāga","NC","","_","_"
5,"_","_","_","heṣ","KDP","","_","_"
6,"_","_","_","ca","CCD","","_","_"
7,"vājibhiḥ","_","_","vājin","NC","","_","_"
1,"_","_","_","bherī","NC","","_","_"
2,"_","_","_","śaṅkha","NC","","_","_"
3,"_","_","_","nināda","NC","","_","_"
4,"_","_","_","ca","CCD","","_","_"
5,"sa","_","_","tad","PRD","","_","_"
6,"_","_","_","śabda","NC","","_","_"
7,"_","_","_","tumula","JJ","","_","_"
8,"'bhavat","_","_","bhav","V","bhū","_","_"
1,"_","_","_","nara","NC","","_","_"
2,"_","_","_","aśva","NC","","_","_"
3,"_","_","_","kāya","NC","","_","_"
4,"_","_","_","nirbhid","CGDA","","_","_"
5,"lohāni","_","_","loha","JJ","","_","_"
6,"kavacāni","_","_","kavaca","NC","","_","_"
7,"ca","_","_","ca","CCD","","_","_"
1,"pārthasya","_","_","pārtha","NC","","_","_"
2,"_","_","_","śara","NC","","_","_"
3,"_","_","_","jāla","NC","","_","_"
4,"viniṣpetuḥ","_","_","viniṣpat","V","viniṣpat","_","_"
5,"sahasraśaḥ","_","_","sahasraśas","CX","","_","_"
1,"tvaramāṇaḥ","_","_","tvar","KDP","","_","_"
2,"śarān","_","_","śara","NC","","_","_"
3,"asyan","_","_","as","KDP","","_","_"
4,"pāṇḍavaḥ","_","_","pāṇḍava","NC","","_","_"
5,"sa","_","_","tad","PRD","","_","_"
6,"babhau","_","_","bhā","V","bhā","_","_"
7,"raṇe","_","_","raṇa","NC","","_","_"
1,"_","_","_","madhyaṃdina","NC","","_","_"
2,"_","_","_","ga","PPP","","_","_"
3,"_","_","_","arciṣmat","JJ","","_","_"
4,"_","_","_","śarad","NC","","_","_"
5,"_","_","_","iva","CCM","","_","_"
6,"divākaraḥ","_","_","divākara","NC","","_","_"
1,"upaplavanta","_","_","upaplav","V","upaplu","_","_"
2,"vitrastā","_","_","vitras","PPP","","_","_"
3,"rathebhyo","_","_","ratha","NC","","_","_"
4,"_","_","_","rathin","NC","","_","_"
5,"_","_","_","tadā","CAD","","_","_"
1,"_","_","_","sādin","NC","","_","_"
2,"_","_","_","ca","CCD","","_","_"
3,"_","_","_","aśva","NC","","_","_"
4,"_","_","_","pṛṣṭha","NC","","_","_"
5,"bhūmau","_","_","bhūmi","NC","","_","_"
6,"_","_","_","ca","CCD","","_","_"
7,"_","_","_","api","CX","","_","_"
8,"padātayaḥ","_","_","padāti","NC","","_","_"
1,"śaraiḥ","_","_","śara","NC","","_","_"
2,"saṃtāḍyamānānāṃ","_","_","saṃtāḍay","KDP","","_","_"
3,"kavacānāṃ","_","_","kavaca","NC","","_","_"
4,"mahātmanām","_","_","mahātman","JJ","","_","_"
1,"_","_","_","tāmra","NC","","_","_"
2,"_","_","_","rājata","NC","","_","_"
3,"_","_","_","loha","NC","","_","_"
4,"_","_","_","prāduras","V","prāduras","_","_"
5,"_","_","_","mahat","JJ","","_","_"
6,"_","_","_","svana","NC","","_","_"
1,"channam","_","_","chad","PPP","","_","_"
2,"āyodhanaṃ","_","_","āyodhana","NC","","_","_"
3,"sarvaṃ","_","_","sarva","JQ","","_","_"
4,"śarīrair","_","_","śarīra","NC","","_","_"
5,"_","_","_","ga","PPP","","_","_"
6,"_","_","_","cetas","NC","","_","_"
1,"_","_","_","gaja","NC","","_","_"
2,"_","_","_","aśva","NC","","_","_"
3,"_","_","_","sādin","NC","","_","_"
4,"_","_","_","tatra","CAD","","_","_"
5,"_","_","_","śā","PPP","","_","_"
6,"_","_","_","bāṇa","NC","","_","_"
7,"_","_","_","ādā","PPP","","_","_"
8,"_","_","_","jīvita","NC","","_","_"
1,"_","_","_","ratha","NC","","_","_"
2,"_","_","_","upastha","NC","","_","_"
3,"_","_","_","abhipat","PPP","","_","_"
4,"āstṛtā","_","_","āstṛ","PPP","","_","_"
5,"mānavair","_","_","mānava","NC","","_","_"
6,"mahī","_","_","mahī","NC","","_","_"
1,"pranṛtyad","_","_","pranṛt","V","pranṛt","_","_"
2,"iva","_","_","iva","CCM","","_","_"
3,"saṃgrāme","_","_","saṃgrāma","NC","","_","_"
4,"_","_","_","cāpa","NC","","_","_"
5,"_","_","_","hasta","NC","","_","_"
6,"dhanaṃjayaḥ","_","_","dhanaṃjaya","NC","","_","_"
1,"śrutvā","_","_","śru","CGDA","","_","_"
2,"_","_","_","gāṇḍīva","NC","","_","_"
3,"_","_","_","nirghoṣa","NC","","_","_"
4,"visphūrjitam","_","_","visphūrjita","NC","","_","_"
5,"_","_","_","iva","CCM","","_","_"
6,"_","_","_","aśani","NC","","_","_"
1,"trastāni","_","_","tras","PPP","","_","_"
2,"_","_","_","sarva","JQ","","_","_"
3,"_","_","_","bhūta","NC","","_","_"
4,"vyagacchanta","_","_","viga","V","viga","_","_"
5,"_","_","_","mahat","JJ","","_","_"
6,"_","_","_","āhava","NC","","_","_"
1,"_","_","_","kuṇḍala","NC","","_","_"
2,"_","_","_","uṣṇīṣa","NC","","_","_"
3,"_","_","_","dhārin","JJ","","_","_"
4,"_","_","_","jātarūpa","NC","","_","_"
5,"_","_","_","sraja","NC","","_","_"
6,"ca","_","_","ca","CCD","","_","_"
1,"patitāni","_","_","pat","PPP","","_","_"
2,"sma","_","_","sma","CX","","_","_"
3,"dṛśyante","_","_","darś","V","dṛś","_","_"
4,"śirāṃsi","_","_","śiras","NC","","_","_"
5,"_","_","_","raṇa","NC","","_","_"
6,"_","_","_","mūrdhan","NC","","_","_"
1,"_","_","_","viśikha","NC","","_","_"
2,"_","_","_","unmath","PPP","","_","_"
3,"gātrair","_","_","gātra","NC","","_","_"
4,"_","_","_","bāhu","NC","","_","_"
5,"_","_","_","ca","CCD","","_","_"
6,"_","_","_","sa_saha","CX","","_","_"
7,"_","_","_","kārmuka","NC","","_","_"
1,"_","_","_","sa_saha","CX","","_","_"
2,"_","_","_","hasta","NC","","_","_"
3,"_","_","_","ābharaṇa","NC","","_","_"
4,"_","_","_","ca","CCD","","_","_"
5,"_","_","_","anya","PPX","","_","_"
6,"pracchannā","_","_","pracchad","PPP","","_","_"
7,"bhāti","_","_","bhā","V","bhā","_","_"
8,"medinī","_","_","medinī","NC","","_","_"
1,"śirasāṃ","_","_","śiras","NC","","_","_"
2,"pātyamānānām","_","_","pātay","KDP","","_","_"
3,"antarā","_","_","antarā","CX","","_","_"
4,"niśitaiḥ","_","_","niśā","PPP","","_","_"
5,"śaraiḥ","_","_","śara","NC","","_","_"
1,"_","_","_","aśman","NC","","_","_"
2,"_","_","_","vṛṣṭi","NC","","_","_"
3,"_","_","_","iva","CCM","","_","_"
4,"_","_","_","ākāśa","NC","","_","_"
5,"abhavad","_","_","bhav","V","bhū","_","_"
6,"_","_","_","bharata","NC","","_","_"
7,"_","_","_","ṛṣabha","NC","","_","_"
1,"darśayitvā","_","_","darśay","CGDA","","_","_"
2,"_","_","_","tathā","CX","","_","_"
3,"_","_","_","ātman","NC","","_","_"
4,"raudraṃ","_","_","raudra","JJ","","_","_"
5,"_","_","_","rudra","JJ","","_","_"
6,"_","_","_","parākrama","NC","","_","_"
1,"_","_","_","avarudh","PPP","","_","_"
2,"_","_","_","car","KDP","","_","_"
3,"pārtho","_","_","pārtha","NC","","_","_"
4,"_","_","_","daśan","NUM","","_","_"
5,"_","_","_","varṣa","NC","","_","_"
6,"trīṇi","_","_","tri","NUM","","_","_"
7,"ca","_","_","ca","CCD","","_","_"
1,"_","_","_","krodha","NC","","_","_"
2,"_","_","_","agni","NC","","_","_"
3,"utsṛjad","_","_","utsṛj","V","utsṛj","_","_"
4,"ghoraṃ","_","_","ghora","JJ","","_","_"
5,"dhārtarāṣṭreṣu","_","_","dhārtarāṣṭra","NC","","_","_"
6,"pāṇḍavaḥ","_","_","pāṇḍava","NC","","_","_"
1,"tasya","_","_","tad","PRD","","_","_"
2,"tad","_","_","tad","PRD","","_","_"
3,"dahataḥ","_","_","dah","KDP","","_","_"
4,"sainyaṃ","_","_","sainya","NC","","_","_"
5,"dṛṣṭvā","_","_","dṛś","CGDA","","_","_"
6,"_","_","_","ca","CCD","","_","_"
7,"_","_","_","eva","CEM","","_","_"
8,"parākramam","_","_","parākrama","NC","","_","_"
1,"sarve","_","_","sarva","JQ","","_","_"
2,"_","_","_","śānti","NC","","_","_"
3,"_","_","_","para","PPX","","_","_"
4,"yodhā","_","_","yodha","NC","","_","_"
5,"dhārtarāṣṭrasya","_","_","dhārtarāṣṭra","NC","","_","_"
6,"paśyataḥ","_","_","dṛś","KDP","","_","_"
1,"vitrāsayitvā","_","_","vitrāsay","CGDA","","_","_"
2,"tat","_","_","tad","PRD","","_","_"
3,"sainyaṃ","_","_","sainya","NC","","_","_"
4,"drāvayitvā","_","_","drāvay","CGDA","","_","_"
5,"_","_","_","mahat","JJ","","_","_"
6,"_","_","_","ratha","NC","","_","_"
1,"arjuno","_","_","arjuna","NC","","_","_"
2,"jayatāṃ","_","_","ji","KDP","","_","_"
3,"śreṣṭhaḥ","_","_","śreṣṭha","JJ","","_","_"
4,"paryavartata","_","_","parivart","V","parivṛt","_","_"
5,"bhārata","_","_","bhārata","NC","","_","_"
1,"_","_","_","pravartay","V","pravartay","_","_"
2,"_","_","_","nadī","NC","","_","_"
3,"ghorāṃ","_","_","ghora","JJ","","_","_"
4,"_","_","_","śoṇita","NC","","_","_"
5,"_","_","_","ogha","NC","","_","_"
6,"_","_","_","taraṃgiṇī","NC","","_","_"
1,"_","_","_","asthi","NC","","_","_"
2,"_","_","_","śaivala","NC","","_","_"
3,"_","_","_","sambādha","NC","","_","_"
4,"_","_","_","yuga","NC","","_","_"
5,"_","_","_","anta","NC","","_","_"
6,"_","_","_","kāla","NC","","_","_"
7,"_","_","_","nirmā","PPP","","_","_"
1,"_","_","_","śara","NC","","_","_"
2,"_","_","_","cāpa","NC","","_","_"
3,"_","_","_","plava","NC","","_","_"
4,"ghorāṃ","_","_","ghora","JJ","","_","_"
5,"_","_","_","māṃsa","NC","","_","_"
6,"_","_","_","śoṇita","NC","","_","_"
7,"_","_","_","kardama","NC","","_","_"
1,"_","_","_","mahat","JJ","","_","_"
2,"_","_","_","ratha","NC","","_","_"
3,"_","_","_","mahat","JJ","","_","_"
4,"_","_","_","dvīpa","NC","","_","_"
5,"_","_","_","śaṅkha","NC","","_","_"
6,"_","_","_","dundubhi","NC","","_","_"
7,"_","_","_","nisvana","NC","","_","_"
1,"cakāra","_","_","kar","V","kṛ","_","_"
2,"mahatīṃ","_","_","mahat","JJ","","_","_"
3,"pārtho","_","_","pārtha","NC","","_","_"
4,"nadīm","_","_","nadī","NC","","_","_"
5,"_","_","_","uttara","JJ","","_","_"
6,"_","_","_","śoṇita","NC","","_","_"
1,"ādadānasya","_","_","ādā","KDP","","_","_"
2,"hi","_","_","hi","CX","","_","_"
3,"śarān","_","_","śara","NC","","_","_"
4,"saṃdhāya","_","_","saṃdhā","CGDA","","_","_"
5,"ca","_","_","ca","CCD","","_","_"
6,"vimuñcataḥ","_","_","vimuc","KDP","","_","_"
1,"_","_","_","vikṛṣ","KDP","","_","_"
2,"_","_","_","ca","CCD","","_","_"
3,"gāṇḍīvaṃ","_","_","gāṇḍīva","NC","","_","_"
4,"na","_","_","na","CNG","","_","_"
5,"kiṃcid","_","_","kiṃcit","PRI","","_","_"
6,"dṛśyate","_","_","darś","V","dṛś","_","_"
7,"'ntaram","_","_","antara","NC","","_","_"
