"WordID","word","NormSTEM","suffix","lemma","PoS","Root","NormSuffix","NormWord"
1,"vāsudeva","_","_","vāsudeva","NC","","_","_"
2,"uvāca","_","_","vak","V","vac","_","_"
1,"śṛṇu","_","_","śṛṇ","V","śru","_","_"
2,"kaunteya","_","_","kaunteya","NC","","_","_"
3,"rāmasya","_","_","rāma","NC","","_","_"
4,"mayā","_","_","mat","PPR","","_","_"
5,"yāvat","_","_","yāvat","CX","","_","_"
6,"pariśrutam","_","_","pariśru","PPP","","_","_"
1,"_","_","_","mahat","JJ","","_","_"
2,"_","_","_","ṛṣi","NC","","_","_"
3,"kathayatāṃ","_","_","kathay","KDP","","_","_"
4,"kāraṇaṃ","_","_","kāraṇa","NC","","_","_"
5,"tasya","_","_","tad","PRD","","_","_"
6,"janma","_","_","janman","NC","","_","_"
7,"ca","_","_","ca","CCD","","_","_"
1,"yathā","_","_","yathā","CCM","","_","_"
2,"ca","_","_","ca","CCD","","_","_"
3,"jāmadagnyena","_","_","jāmadagnya","NC","","_","_"
4,"koṭiśaḥ","_","_","koṭiśas","CX","","_","_"
5,"kṣatriyā","_","_","kṣatriya","NC","","_","_"
6,"hatāḥ","_","_","han","PPP","","_","_"
1,"udbhūtā","_","_","udbhū","PPP","","_","_"
2,"_","_","_","rājan","NC","","_","_"
3,"_","_","_","vaṃśa","NC","","_","_"
4,"ye","_","_","yad","PRL","","_","_"
5,"bhūyo","_","_","bhūyas","CX","","_","_"
6,"bhārate","_","_","bhārata","NC","","_","_"
7,"hatāḥ","_","_","han","PPP","","_","_"
1,"jahnor","_","_","jahnu","NC","","_","_"
2,"a","_","_","alpha_privativum","NC","","_","_"
2,"ajahnus","_","_","jahnu","NC","","_","_"
3,"tanayo","_","_","tanaya","NC","","_","_"
4,"_","_","_","ballava","NC","","_","_"
5,"_","_","_","tad","PRD","","_","_"
6,"_","_","_","ca","CCD","","_","_"
7,"_","_","_","ātmaja","NC","","_","_"
1,"kuśiko","_","_","kuśika","NC","","_","_"
2,"nāma","_","_","nāma","CX","","_","_"
3,"_","_","_","dharma","NC","","_","_"
4,"_","_","_","jña","JJ","","_","_"
5,"_","_","_","tad","PRD","","_","_"
6,"putro","_","_","putra","NC","","_","_"
7,"mahīpatiḥ","_","_","mahīpati","NC","","_","_"
1,"ugraṃ","_","_","ugra","JJ","","_","_"
2,"tapaḥ","_","_","tapas","NC","","_","_"
3,"samātiṣṭhat","_","_","samātiṣṭh","V","samāsthā","_","_"
4,"_","_","_","sahasrākṣa","NC","","_","_"
5,"_","_","_","sama","PPX","","_","_"
6,"bhuvi","_","_","bhū","NC","","_","_"
1,"putraṃ","_","_","putra","NC","","_","_"
2,"labheyam","_","_","labh","V","labh","_","_"
3,"ajitaṃ","_","_","ajita","JJ","","_","_"
4,"_","_","_","tri","NUM","","_","_"
5,"_","_","_","loka","NC","","_","_"
6,"_","_","_","īśvara","NC","","_","_"
7,"_","_","_","iti","CQT","","_","_"
8,"_","_","_","uta","CCD","","_","_"
1,"tam","_","_","tad","PRD","","_","_"
2,"_","_","_","ugra","JJ","","_","_"
3,"_","_","_","tapas","NC","","_","_"
4,"dṛṣṭvā","_","_","dṛś","CGDA","","_","_"
5,"sahasrākṣaḥ","_","_","sahasrākṣa","NC","","_","_"
6,"puraṃdaraḥ","_","_","puraṃdara","NC","","_","_"
1,"samarthaḥ","_","_","samartha","JJ","","_","_"
2,"_","_","_","putra","NC","","_","_"
3,"_","_","_","janana","NC","","_","_"
4,"svayam","_","_","svaya","CX","","_","_"
5,"_","_","_","eva","CEM","","_","_"
6,"_","_","_","e","CGDA","","_","_"
7,"bhārata","_","_","bhārata","NC","","_","_"
1,"_","_","_","putra","NC","","_","_"
3,"agamad","_","_","ga","V","ga","_","_"
4,"_","_","_","rājan","NC","","_","_"
5,"_","_","_","tad","PRD","","_","_"
6,"_","_","_","loka","NC","","_","_"
7,"_","_","_","īśvara","NC","","_","_"
8,"_","_","_","īśvara","NC","","_","_"
1,"gādhir","_","_","gādhi","NC","","_","_"
2,"_","_","_","nāma","CX","","_","_"
3,"_","_","_","bhav","V","bhū","_","_"
4,"putraḥ","_","_","putra","NC","","_","_"
5,"kauśikaḥ","_","_","kauśika","NC","","_","_"
6,"pākaśāsanaḥ","_","_","pākaśāsana","NC","","_","_"
1,"tasya","_","_","tad","PRD","","_","_"
2,"_","_","_","kanyā","NC","","_","_"
3,"_","_","_","bhav","V","bhū","_","_"
4,"_","_","_","rājan","NC","","_","_"
5,"_","_","_","nāman","NC","","_","_"
6,"satyavatī","_","_","satyavatī","NC","","_","_"
7,"prabho","_","_","prabhu","NC","","_","_"
1,"tāṃ","_","_","tad","PRD","","_","_"
2,"gādhiḥ","_","_","gādhi","NC","","_","_"
3,"_","_","_","kavi","NC","","_","_"
4,"_","_","_","putra","NC","","_","_"
5,"_","_","_","tad","PRD","","_","_"
6,"_","_","_","ṛcīka","NC","","_","_"
7,"dadau","_","_","dad","V","dā","_","_"
8,"prabhuḥ","_","_","prabhu","JJ","","_","_"
1,"tataḥ","_","_","tatas","CX","","_","_"
2,"_","_","_","prī","PPP","","_","_"
3,"_","_","_","tu","CCD","","_","_"
4,"kaunteya","_","_","kaunteya","NC","","_","_"
5,"bhārgavaḥ","_","_","bhārgava","NC","","_","_"
6,"_","_","_","kuru","NC","","_","_"
7,"_","_","_","nandana","NC","","_","_"
1,"_","_","_","putra","NC","","_","_"
2,"_","_","_","artha","NC","","_","_"
3,"śrapayāmāsa","_","_","śrapay","V","śrapay","_","_"
4,"caruṃ","_","_","caru","NC","","_","_"
5,"_","_","_","gādhi","NC","","_","_"
6,"_","_","_","tathā","CX","","_","_"
7,"_","_","_","eva","CEM","","_","_"
8,"ca","_","_","ca","CCD","","_","_"
1,"āhūya","_","_","āhvā","CGDA","","_","_"
2,"_","_","_","ca","CCD","","_","_"
3,"_","_","_","ah","V","ah","_","_"
4,"tāṃ","_","_","tad","PRD","","_","_"
5,"bhāryām","_","_","bhāryā","NC","","_","_"
6,"ṛcīko","_","_","ṛcīka","NC","","_","_"
7,"_","_","_","bhārgava","JJ","","_","_"
8,"_","_","_","tadā","CAD","","_","_"
1,"_","_","_","upayuj","KDG","","_","_"
2,"_","_","_","caru","NC","","_","_"
3,"ayaṃ","_","_","ida","PRD","","_","_"
4,"tvayā","_","_","tvat","PPR","","_","_"
5,"_","_","_","mātṛ","NC","","_","_"
6,"_","_","_","api","CX","","_","_"
7,"_","_","_","ida","PRD","","_","_"
8,"tava","_","_","tvat","PPR","","_","_"
1,"tasyā","_","_","tad","PRD","","_","_"
2,"janiṣyate","_","_","jan","V","jan","_","_"
3,"putro","_","_","putra","NC","","_","_"
4,"dīptimān","_","_","dīptimat","JJ","","_","_"
5,"_","_","_","kṣatriya","NC","","_","_"
6,"_","_","_","ṛṣabha","NC","","_","_"
1,"ajayyaḥ","_","_","ajayya","JJ","","_","_"
2,"kṣatriyair","_","_","kṣatriya","NC","","_","_"
3,"loke","_","_","loka","NC","","_","_"
4,"_","_","_","kṣatriya","NC","","_","_"
5,"_","_","_","ṛṣabha","NC","","_","_"
6,"_","_","_","sūdana","JJ","","_","_"
1,"_","_","_","tvat","PPR","","_","_"
2,"_","_","_","api","CX","","_","_"
3,"putraṃ","_","_","putra","NC","","_","_"
4,"kalyāṇi","_","_","kalyāṇa","JJ","","_","_"
5,"dhṛtimantaṃ","_","_","dhṛtimat","JJ","","_","_"
6,"_","_","_","tapas","NC","","_","_"
7,"_","_","_","anvita","JJ","","_","_"
1,"_","_","_","śama","NC","","_","_"
2,"_","_","_","ātmaka","JJ","","_","_"
3,"dvijaśreṣṭhaṃ","_","_","dvijaśreṣṭha","NC","","_","_"
4,"carur","_","_","caru","NC","","_","_"
5,"eṣa","_","_","tad","PRD","","_","_"
6,"vidhāsyati","_","_","vidadh","V","vidhā","_","_"
1,"_","_","_","iti","CQT","","_","_"
2,"_","_","_","eva","CX","","_","_"
3,"uktvā","_","_","vac","CGDA","","_","_"
4,"tāṃ","_","_","tad","PRD","","_","_"
5,"bhāryām","_","_","bhāryā","NC","","_","_"
6,"ṛcīko","_","_","ṛcīka","NC","","_","_"
7,"_","_","_","bhṛgu","NC","","_","_"
8,"_","_","_","nandana","NC","","_","_"
1,"_","_","_","tapas","NC","","_","_"
2,"_","_","_","abhira","PPP","","_","_"
3,"dhīmāñ","_","_","dhīmat","JJ","","_","_"
4,"_","_","_","ga","V","ga","_","_"
5,"_","_","_","araṇya","NC","","_","_"
6,"eva","_","_","eva","CEM","","_","_"
7,"ha","_","_","ha","CEM","","_","_"
1,"etasmin","_","_","tad","PRD","","_","_"
2,"eva","_","_","eva","CEM","","_","_"
3,"kāle","_","_","kāla","NC","","_","_"
4,"tu","_","_","tu","CCD","","_","_"
5,"_","_","_","tīrtha","NC","","_","_"
6,"_","_","_","yātrā","NC","","_","_"
7,"_","_","_","para","PPX","","_","_"
8,"nṛpaḥ","_","_","nṛpa","NC","","_","_"
1,"gādhiḥ","_","_","gādhi","NC","","_","_"
2,"_","_","_","sa_saha","CX","","_","_"
3,"_","_","_","dāra","NC","","_","_"
4,"samprāpta","_","_","samprāp","PPP","","_","_"
5,"_","_","_","ṛcīka","NC","","_","_"
6,"_","_","_","āśrama","NC","","_","_"
7,"prati","_","_","prati","CADP","","_","_"
1,"_","_","_","caru","NC","","_","_"
2,"_","_","_","dvaya","NC","","_","_"
3,"gṛhītvā","_","_","grah","CGDA","","_","_"
4,"tu","_","_","tu","CCD","","_","_"
5,"rājan","_","_","rājan","NC","","_","_"
6,"satyavatī","_","_","satyavatī","NC","","_","_"
7,"tadā","_","_","tadā","CAD","","_","_"
1,"bhartur","_","_","bhartṛ","NC","","_","_"
2,"vākyād","_","_","vākya","NC","","_","_"
3,"_","_","_","atha","CAD","","_","_"
4,"_","_","_","avyagra","JJ","","_","_"
5,"mātre","_","_","mātṛ","NC","","_","_"
6,"hṛṣṭā","_","_","hṛṣ","PPP","","_","_"
7,"nyavedayat","_","_","nyaveda","V","niveday","_","_"
1,"mātā","_","_","mātṛ","NC","","_","_"
2,"tu","_","_","tu","CCD","","_","_"
3,"tasyāḥ","_","_","tad","PRD","","_","_"
4,"kaunteya","_","_","kaunteya","NC","","_","_"
5,"duhitre","_","_","duhitṛ","NC","","_","_"
6,"svaṃ","_","_","sva","JJ","","_","_"
7,"caruṃ","_","_","caru","NC","","_","_"
8,"dadau","_","_","dad","V","dā","_","_"
1,"_","_","_","tad","PRD","","_","_"
2,"_","_","_","caru","NC","","_","_"
3,"_","_","_","atha","CAD","","_","_"
4,"_","_","_","ajñāta","JJ","","_","_"
5,"_","_","_","ātman","NC","","_","_"
6,"_","_","_","saṃstha","JJ","","_","_"
7,"cakāra","_","_","kar","V","kṛ","_","_"
8,"ha","_","_","ha","CEM","","_","_"
1,"atha","_","_","atha","CAD","","_","_"
2,"satyavatī","_","_","satyavatī","NC","","_","_"
3,"garbhaṃ","_","_","garbha","NC","","_","_"
4,"kṣatriyāntakaraṃ","_","_","kṣatriyāntakara","NC","","_","_"
5,"tadā","_","_","tadā","CAD","","_","_"
1,"dhārayāmāsa","_","_","dhāray","V","dhāray","_","_"
2,"dīptena","_","_","dīp","PPP","","_","_"
3,"vapuṣā","_","_","vapus","NC","","_","_"
4,"_","_","_","ghora","JJ","","_","_"
5,"_","_","_","darśana","NC","","_","_"
1,"tām","_","_","tad","PRD","","_","_"
2,"_","_","_","ṛcīka","NC","","_","_"
3,"_","_","_","tadā","CAD","","_","_"
4,"dṛṣṭvā","_","_","dṛś","CGDA","","_","_"
5,"_","_","_","dhyāna","NC","","_","_"
6,"_","_","_","yoga","NC","","_","_"
7,"vai","_","_","vai","CX","","_","_"
8,"tataḥ","_","_","tatas","CX","","_","_"
1,"abravīd","_","_","abravīta","V","brū","_","_"
2,"_","_","_","rājan","NC","","_","_"
3,"_","_","_","śārdūla","NC","","_","_"
4,"svāṃ","_","_","sva","JJ","","_","_"
5,"bhāryāṃ","_","_","bhāryā","NC","","_","_"
6,"varavarṇinīm","_","_","varavarṇinī","NC","","_","_"
1,"_","_","_","mātṛ","NC","","_","_"
2,"_","_","_","as","V","as","_","_"
3,"vyaṃsitā","_","_","vyaṃsay","PPP","","_","_"
4,"bhadre","_","_","bhadra","JJ","","_","_"
5,"_","_","_","caru","NC","","_","_"
6,"_","_","_","vyatyāsa","NC","","_","_"
7,"_","_","_","hetu","NC","","_","_"
1,"janiṣyate","_","_","jan","V","jan","_","_"
2,"hi","_","_","hi","CX","","_","_"
3,"te","_","_","tvat","PPR","","_","_"
4,"putraḥ","_","_","putra","NC","","_","_"
5,"_","_","_","krūra","JJ","","_","_"
6,"_","_","_","karman","NC","","_","_"
7,"_","_","_","mahat","JJ","","_","_"
8,"_","_","_","bala","NC","","_","_"
1,"janiṣyate","_","_","jan","V","jan","_","_"
2,"hi","_","_","hi","CX","","_","_"
3,"te","_","_","tvat","PPR","","_","_"
4,"bhrātā","_","_","bhrātṛ","NC","","_","_"
5,"_","_","_","brahman","NC","","_","_"
6,"_","_","_","bhū","PPP","","_","_"
7,"_","_","_","tapodhana","JJ","","_","_"
1,"viśvaṃ","_","_","viśva","JQ","","_","_"
2,"hi","_","_","hi","CX","","_","_"
3,"brahma","_","_","brahman","NC","","_","_"
4,"tapasā","_","_","tapas","NC","","_","_"
5,"mayā","_","_","mat","PPR","","_","_"
6,"tatra","_","_","tatra","CAD","","_","_"
7,"samarpitam","_","_","samarpay","PPP","","_","_"
1,"_","_","_","tad","PRD","","_","_"
2,"_","_","_","eva","CX","","_","_"
3,"uktā","_","_","vac","PPP","","_","_"
4,"mahābhāgā","_","_","mahābhāga","JJ","","_","_"
5,"bhartrā","_","_","bhartṛ","NC","","_","_"
6,"satyavatī","_","_","satyavatī","NC","","_","_"
7,"tadā","_","_","tadā","CAD","","_","_"
1,"papāta","_","_","pat","V","pat","_","_"
2,"śirasā","_","_","śiras","NC","","_","_"
3,"tasmai","_","_","tad","PRD","","_","_"
4,"vepantī","_","_","vip","KDP","","_","_"
5,"_","_","_","ca","CCD","","_","_"
6,"_","_","_","abravīta","V","brū","_","_"
7,"idam","_","_","ida","PRD","","_","_"
1,"_","_","_","na","CNG","","_","_"
2,"_","_","_","arha","JJ","","_","_"
3,"'si","_","_","as","V","as","_","_"
4,"bhagavann","_","_","bhagavat","JJ","","_","_"
5,"adya","_","_","adya","CX","","_","_"
6,"vaktum","_","_","vac","CGDI","","_","_"
7,"evaṃvidhaṃ","_","_","evaṃvidha","JJ","","_","_"
8,"vacaḥ","_","_","vacas","NC","","_","_"
1,"_","_","_","brāhmaṇa","NC","","_","_"
2,"_","_","_","apasada","NC","","_","_"
3,"putraṃ","_","_","putra","NC","","_","_"
4,"_","_","_","prāpn","V","prāp","_","_"
5,"_","_","_","iti","CQT","","_","_"
6,"_","_","_","mahat","JJ","","_","_"
7,"_","_","_","muni","NC","","_","_"
1,"ṛcīka","_","_","ṛcīka","NC","","_","_"
2,"uvāca","_","_","vak","V","vac","_","_"
1,"_","_","_","na","CNG","","_","_"
2,"_","_","_","tad","PRD","","_","_"
3,"saṃkalpitaḥ","_","_","saṃkalpay","PPP","","_","_"
4,"kāmo","_","_","kāma","NC","","_","_"
5,"mayā","_","_","mat","PPR","","_","_"
6,"bhadre","_","_","bhadra","JJ","","_","_"
7,"tathā","_","_","tathā","CX","","_","_"
8,"tvayi","_","_","tvat","PPR","","_","_"
1,"_","_","_","ugra","JJ","","_","_"
2,"_","_","_","karman","NC","","_","_"
3,"bhavet","_","_","bhav","V","bhū","_","_"
4,"_","_","_","putra","NC","","_","_"
5,"_","_","_","caru","NC","","_","_"
6,"mātā","_","_","mātṛ","NC","","_","_"
7,"ca","_","_","ca","CCD","","_","_"
8,"kāraṇam","_","_","kāraṇa","NC","","_","_"
1,"_","_","_","satyavatī","NC","","_","_"
2,"_","_","_","vak","V","vac","_","_"
1,"icchaṃl","_","_","iṣ","KDP","","_","_"
2,"lokān","_","_","loka","NC","","_","_"
3,"api","_","_","api","CX","","_","_"
4,"mune","_","_","muni","NC","","_","_"
5,"sṛjethāḥ","_","_","sṛj","V","sṛj","_","_"
6,"kiṃ","_","_","kiṃ","PRQ","","_","_"
7,"punar","_","_","punar","CAD","","_","_"
8,"mama","_","_","mat","PPR","","_","_"
1,"_","_","_","śama","NC","","_","_"
2,"_","_","_","ātmaka","JJ","","_","_"
3,"ṛjuṃ","_","_","ṛju","JJ","","_","_"
4,"putraṃ","_","_","putra","NC","","_","_"
5,"labheyaṃ","_","_","labh","V","labh","_","_"
6,"japatāṃ","_","_","jap","KDP","","_","_"
7,"vara","_","_","vara","JJ","","_","_"
1,"ṛcīka","_","_","ṛcīka","NC","","_","_"
2,"uvāca","_","_","vak","V","vac","_","_"
1,"_","_","_","na","CNG","","_","_"
2,"_","_","_","vac","PPP","","_","_"
3,"_","_","_","pūrva","PPX","","_","_"
4,"mayā","_","_","mat","PPR","","_","_"
5,"bhadre","_","_","bhadra","JJ","","_","_"
6,"_","_","_","svaira","JJ","","_","_"
7,"_","_","_","api","CX","","_","_"
8,"_","_","_","anṛta","JJ","","_","_"
9,"vacaḥ","_","_","vacas","NC","","_","_"
1,"kim","_","_","kim","CX","","_","_"
2,"_","_","_","uta","CCD","","_","_"
3,"_","_","_","agni","NC","","_","_"
4,"samādhāya","_","_","samādhā","CGDA","","_","_"
5,"_","_","_","mantravat","CX","","_","_"
6,"_","_","_","caru","NC","","_","_"
7,"_","_","_","sādhana","NC","","_","_"
1,"_","_","_","satyavatī","NC","","_","_"
2,"_","_","_","vak","V","vac","_","_"
1,"kāmam","_","_","kāma","CX","","_","_"
2,"evaṃ","_","_","eva","CX","","_","_"
3,"bhavet","_","_","bhav","V","bhū","_","_"
4,"pautro","_","_","pautra","NC","","_","_"
5,"_","_","_","mat","PPR","","_","_"
6,"_","_","_","iha","CAD","","_","_"
7,"tava","_","_","tvat","PPR","","_","_"
8,"_","_","_","ca","CCD","","_","_"
9,"_","_","_","eva","CEM","","_","_"
10,"ha","_","_","ha","CEM","","_","_"
1,"_","_","_","śama","NC","","_","_"
2,"_","_","_","ātmaka","JJ","","_","_"
3,"ṛjuṃ","_","_","ṛju","JJ","","_","_"
4,"putraṃ","_","_","putra","NC","","_","_"
5,"labheyaṃ","_","_","labh","V","labh","_","_"
6,"japatāṃ","_","_","jap","KDP","","_","_"
7,"vara","_","_","vara","JJ","","_","_"
1,"ṛcīka","_","_","ṛcīka","NC","","_","_"
2,"uvāca","_","_","vak","V","vac","_","_"
1,"putre","_","_","putra","NC","","_","_"
2,"_","_","_","na","CNG","","_","_"
3,"_","_","_","as","V","as","_","_"
4,"viśeṣo","_","_","viśeṣa","NC","","_","_"
5,"me","_","_","mat","PPR","","_","_"
6,"pautre","_","_","pautra","NC","","_","_"
7,"vā","_","_","vā","CCD","","_","_"
8,"varavarṇini","_","_","varavarṇinī","NC","","_","_"
1,"yathā","_","_","yathā","CCM","","_","_"
2,"_","_","_","tvat","PPR","","_","_"
3,"_","_","_","vac","PPP","","_","_"
4,"tu","_","_","tu","CCD","","_","_"
5,"_","_","_","vacas","NC","","_","_"
6,"_","_","_","tathā","CX","","_","_"
7,"bhadre","_","_","bhadra","JJ","","_","_"
8,"bhaviṣyati","_","_","bhav","V","bhū","_","_"
1,"vāsudeva","_","_","vāsudeva","NC","","_","_"
2,"uvāca","_","_","vak","V","vac","_","_"
1,"tataḥ","_","_","tatas","CX","","_","_"
2,"satyavatī","_","_","satyavatī","NC","","_","_"
3,"putraṃ","_","_","putra","NC","","_","_"
4,"janayāmāsa","_","_","janay","V","janay","_","_"
5,"bhārgavam","_","_","bhārgava","NC","","_","_"
1,"_","_","_","tapas","NC","","_","_"
2,"_","_","_","abhira","PPP","","_","_"
3,"śāntaṃ","_","_","śa","PPP","","_","_"
4,"jamadagniṃ","_","_","jamadagni","NC","","_","_"
5,"_","_","_","śama","NC","","_","_"
6,"_","_","_","ātmaka","JJ","","_","_"
1,"viśvāmitraṃ","_","_","viśvāmitra","NC","","_","_"
2,"ca","_","_","ca","CCD","","_","_"
3,"dāyādaṃ","_","_","dāyāda","NC","","_","_"
4,"gādhiḥ","_","_","gādhi","NC","","_","_"
5,"_","_","_","kuśika","NC","","_","_"
6,"_","_","_","nandana","NC","","_","_"
1,"prāpa","_","_","prāpn","V","prāp","_","_"
2,"_","_","_","brahman","NC","","_","_"
3,"_","_","_","ṛṣi","NC","","_","_"
4,"_","_","_","sami","PPP","","_","_"
5,"viśvena","_","_","viśva","JQ","","_","_"
6,"brahmaṇā","_","_","brahman","NC","","_","_"
7,"yutam","_","_","yuta","JJ","","_","_"
1,"ārcīko","_","_","ārcīka","NC","","_","_"
2,"janayāmāsa","_","_","janay","V","janay","_","_"
3,"jamadagniḥ","_","_","jamadagni","NC","","_","_"
4,"_","_","_","su","CAD","","_","_"
5,"_","_","_","dāruṇa","JJ","","_","_"
1,"_","_","_","sarva","JQ","","_","_"
2,"_","_","_","vidyā","NC","","_","_"
3,"_","_","_","antaga","JJ","","_","_"
4,"śreṣṭhaṃ","_","_","śreṣṭha","JJ","","_","_"
5,"dhanurvede","_","_","dhanurveda","NC","","_","_"
6,"ca","_","_","ca","CCD","","_","_"
7,"pāragam","_","_","pāraga","JJ","","_","_"
1,"rāmaṃ","_","_","rāma","NC","","_","_"
2,"_","_","_","kṣatriya","NC","","_","_"
3,"_","_","_","hantṛ","JJ","","_","_"
4,"pradīptam","_","_","pradīp","PPP","","_","_"
5,"iva","_","_","iva","CCM","","_","_"
6,"pāvakam","_","_","pāvaka","NC","","_","_"
1,"etasmin","_","_","tad","PRD","","_","_"
2,"eva","_","_","eva","CEM","","_","_"
3,"kāle","_","_","kāla","NC","","_","_"
4,"tu","_","_","tu","CCD","","_","_"
5,"_","_","_","kṛ","PPP","","_","_"
6,"_","_","_","vīrya","NC","","_","_"
7,"_","_","_","ātmaja","NC","","_","_"
8,"balī","_","_","balin","JJ","","_","_"
1,"arjuno","_","_","arjuna","NC","","_","_"
2,"nāma","_","_","nāma","CX","","_","_"
3,"tejasvī","_","_","tejasvin","JJ","","_","_"
4,"kṣatriyo","_","_","kṣatriya","NC","","_","_"
5,"_","_","_","haihaya","NC","","_","_"
6,"_","_","_","anvaya","NC","","_","_"
1,"dadāha","_","_","dah","V","dah","_","_"
2,"pṛthivīṃ","_","_","pṛthivī","NC","","_","_"
3,"sarvāṃ","_","_","sarva","JQ","","_","_"
4,"saptadvīpāṃ","_","_","saptadvīpā","NC","","_","_"
5,"_","_","_","sa_saha","CX","","_","_"
6,"_","_","_","pattana","NC","","_","_"
1,"_","_","_","sva","JJ","","_","_"
2,"_","_","_","bāhu","NC","","_","_"
3,"_","_","_","astra","NC","","_","_"
4,"_","_","_","bala","NC","","_","_"
5,"_","_","_","āji","NC","","_","_"
6,"dharmeṇa","_","_","dharma","NC","","_","_"
7,"parameṇa","_","_","parama","JJ","","_","_"
8,"ca","_","_","ca","CCD","","_","_"
1,"tṛṣitena","_","_","tṛṣita","JJ","","_","_"
2,"sa","_","_","tad","PRD","","_","_"
3,"kauravya","_","_","kauravya","NC","","_","_"
4,"_","_","_","bhikṣ","PPP","","_","_"
5,"_","_","_","citrabhānu","NC","","_","_"
1,"sahasrabāhur","_","_","sahasrabāhu","NC","","_","_"
2,"vikrāntaḥ","_","_","vikra","PPP","","_","_"
3,"prādād","_","_","pradad","V","pradā","_","_"
4,"bhikṣām","_","_","bhikṣā","NC","","_","_"
5,"_","_","_","atha","CAD","","_","_"
6,"_","_","_","agni","NC","","_","_"
1,"grāmān","_","_","grāma","NC","","_","_"
2,"purāṇi","_","_","pura","NC","","_","_"
3,"_","_","_","ghoṣa","NC","","_","_"
4,"_","_","_","ca","CCD","","_","_"
5,"pattanāni","_","_","pattana","NC","","_","_"
6,"ca","_","_","ca","CCD","","_","_"
7,"vīryavān","_","_","vīryavat","JJ","","_","_"
1,"jajvāla","_","_","jval","V","jval","_","_"
2,"tasya","_","_","tad","PRD","","_","_"
3,"_","_","_","bāṇa","NC","","_","_"
4,"_","_","_","tu","CCD","","_","_"
5,"citrabhānur","_","_","citrabhānu","NC","","_","_"
6,"didhakṣayā","_","_","didhakṣā","NC","","_","_"
1,"sa","_","_","tad","PRD","","_","_"
2,"tasya","_","_","tad","PRD","","_","_"
3,"_","_","_","puruṣa","NC","","_","_"
4,"_","_","_","indra","NC","","_","_"
5,"prabhāvena","_","_","prabhāva","NC","","_","_"
6,"_","_","_","mahat","JJ","","_","_"
7,"_","_","_","tapas","NC","","_","_"
1,"dadāha","_","_","dah","V","dah","_","_"
2,"kārtavīryasya","_","_","kārtavīrya","NC","","_","_"
3,"śailān","_","_","śaila","NC","","_","_"
4,"atha","_","_","atha","CAD","","_","_"
5,"vanāni","_","_","vana","NC","","_","_"
6,"ca","_","_","ca","CCD","","_","_"
1,"sa","_","_","tad","PRD","","_","_"
2,"śūnyam","_","_","śūnya","JJ","","_","_"
3,"_","_","_","āśrama","NC","","_","_"
4,"_","_","_","araṇya","NC","","_","_"
5,"_","_","_","varuṇa","NC","","_","_"
6,"_","_","_","ātmaja","NC","","_","_"
7,"tat","_","_","tad","PRD","","_","_"
1,"dadāha","_","_","dah","V","dah","_","_"
2,"_","_","_","pavana","NC","","_","_"
3,"_","_","_","indh","PPP","","_","_"
4,"_","_","_","citrabhānu","NC","","_","_"
5,"_","_","_","sa_saha","CX","","_","_"
6,"_","_","_","haihaya","NC","","_","_"
1,"_","_","_","āpava","NC","","_","_"
2,"_","_","_","tad","PRD","","_","_"
3,"tato","_","_","tatas","CX","","_","_"
4,"_","_","_","roṣa","NC","","_","_"
5,"_","_","_","śap","V","śap","_","_"
6,"_","_","_","arjuna","NC","","_","_"
7,"acyuta","_","_","acyuta","NC","","_","_"
1,"dagdhe","_","_","dah","PPP","","_","_"
2,"_","_","_","mahat","JJ","","_","_"
3,"_","_","_","rāja","NC","","_","_"
4,"mahārāja","_","_","kārtavīrya","NC","","_","_"
5,"kārtavīryeṇa","_","_","vīryavat","JJ","","_","_"
1,"tvayā","_","_","tvat","PPR","","_","_"
2,"na","_","_","na","CNG","","_","_"
3,"varjitaṃ","_","_","varjay","PPP","","_","_"
4,"mohād","_","_","moha","NC","","_","_"
5,"yasmād","_","_","yasmāt","CX","","_","_"
6,"vanam","_","_","vana","NC","","_","_"
7,"idaṃ","_","_","ida","PRD","","_","_"
8,"mama","_","_","mat","PPR","","_","_"
1,"dagdhaṃ","_","_","dah","PPP","","_","_"
2,"tasmād","_","_","tasmāt","CX","","_","_"
3,"raṇe","_","_","raṇa","NC","","_","_"
4,"rāmo","_","_","rāma","NC","","_","_"
5,"_","_","_","bāhu","NC","","_","_"
6,"_","_","_","tvat","PPR","","_","_"
7,"chetsyate","_","_","chid","V","chid","_","_"
8,"'rjuna","_","_","arjuna","NC","","_","_"
1,"_","_","_","arjuna","NC","","_","_"
2,"_","_","_","tu","CCD","","_","_"
3,"_","_","_","mahat","JJ","","_","_"
4,"_","_","_","rāja","NC","","_","_"
5,"balī","_","_","balin","JJ","","_","_"
6,"nityaṃ","_","_","nitya","CX","","_","_"
7,"_","_","_","śama","NC","","_","_"
8,"_","_","_","ātmaka","JJ","","_","_"
1,"_","_","_","brahmaṇya","JJ","","_","_"
2,"_","_","_","ca","CCD","","_","_"
3,"_","_","_","śaraṇya","JJ","","_","_"
4,"_","_","_","ca","CCD","","_","_"
5,"dātā","_","_","dātṛ","JJ","","_","_"
6,"_","_","_","śūra","NC","","_","_"
7,"_","_","_","ca","CCD","","_","_"
8,"bhārata","_","_","bhārata","NC","","_","_"
1,"tasya","_","_","tad","PRD","","_","_"
2,"putrāḥ","_","_","putra","NC","","_","_"
3,"_","_","_","su","CAD","","_","_"
4,"_","_","_","balin","JJ","","_","_"
5,"_","_","_","śāpa","NC","","_","_"
6,"_","_","_","as","V","as","_","_"
7,"pitur","_","_","pitṛ","NC","","_","_"
8,"vadhe","_","_","vadha","NC","","_","_"
1,"nimittam","_","_","nimitta","NC","","_","_"
2,"avaliptā","_","_","avalipta","JJ","","_","_"
3,"vai","_","_","vai","CX","","_","_"
4,"_","_","_","nṛśaṃsa","JJ","","_","_"
5,"_","_","_","ca","CCD","","_","_"
6,"_","_","_","eva","CEM","","_","_"
7,"nityadā","_","_","nityadā","CX","","_","_"
1,"_","_","_","jamadagni","NC","","_","_"
2,"_","_","_","dhenu","NC","","_","_"
3,"_","_","_","tad","PRD","","_","_"
4,"vatsam","_","_","vatsa","NC","","_","_"
5,"āninyur","_","_","ānay","V","ānī","_","_"
6,"_","_","_","bharata","NC","","_","_"
7,"_","_","_","ṛṣabha","NC","","_","_"
1,"ajñātaṃ","_","_","ajñāta","JJ","","_","_"
2,"kārtavīryasya","_","_","kārtavīrya","NC","","_","_"
3,"_","_","_","haihaya","NC","","_","_"
4,"_","_","_","indra","NC","","_","_"
5,"dhīmataḥ","_","_","dhīmat","JJ","","_","_"
1,"tato","_","_","tatas","CX","","_","_"
2,"'rjunasya","_","_","arjuna","NC","","_","_"
3,"_","_","_","bāhu","NC","","_","_"
4,"_","_","_","tu","CCD","","_","_"
5,"chittvā","_","_","chid","CGDA","","_","_"
6,"vai","_","_","vai","CX","","_","_"
7,"_","_","_","pauruṣa","NC","","_","_"
8,"_","_","_","anvita","JJ","","_","_"
1,"taṃ","_","_","tad","PRD","","_","_"
2,"ruvantaṃ","_","_","ru","KDP","","_","_"
3,"tato","_","_","tatas","CX","","_","_"
4,"vatsaṃ","_","_","vatsa","NC","","_","_"
5,"jāmadagnyaḥ","_","_","jāmadagnya","NC","","_","_"
6,"svam","_","_","sva","JJ","","_","_"
7,"āśramam","_","_","āśrama","NC","","_","_"
1,"pratyānayata","_","_","pratyānī","V","pratyānī","_","_"
2,"_","_","_","rājan","NC","","_","_"
3,"_","_","_","indra","NC","","_","_"
4,"teṣām","_","_","tad","PRD","","_","_"
5,"antaḥpurāt","_","_","antaḥpura","NC","","_","_"
6,"prabhuḥ","_","_","prabhu","JJ","","_","_"
1,"arjunasya","_","_","arjuna","NC","","_","_"
2,"_","_","_","suta","NC","","_","_"
3,"_","_","_","tad","PRD","","_","_"
4,"tu","_","_","tu","CCD","","_","_"
5,"_","_","_","sambhū","CGDA","","_","_"
6,"_","_","_","abuddhi","JJ","","_","_"
7,"_","_","_","tadā","CAD","","_","_"
1,"_","_","_","ga","CGDA","","_","_"
2,"_","_","_","āśrama","NC","","_","_"
3,"a","_","_","alpha_privativum","JJ","","_","_"
3,"asaṃbuddhaṃ","_","_","saṃbuddha","JJ","","_","_"
4,"jamadagner","_","_","jamadagni","NC","","_","_"
5,"mahātmanaḥ","_","_","mahātman","JJ","","_","_"
1,"apātayanta","_","_","pātay","V","pātay","_","_"
2,"_","_","_","bhalla","NC","","_","_"
3,"_","_","_","agra","NC","","_","_"
4,"śiraḥ","_","_","śiras","NC","","_","_"
5,"_","_","_","kāya","NC","","_","_"
6,"_","_","_","narādhipa","NC","","_","_"
1,"_","_","_","samidh","NC","","_","_"
2,"_","_","_","kuśa","NC","","_","_"
3,"_","_","_","artha","NC","","_","_"
4,"rāmasya","_","_","rāma","NC","","_","_"
5,"nirgatasya","_","_","nirga","PPP","","_","_"
6,"mahātmanaḥ","_","_","mahātman","JJ","","_","_"
1,"tataḥ","_","_","tatas","CX","","_","_"
2,"_","_","_","pitṛ","NC","","_","_"
3,"_","_","_","vadha","NC","","_","_"
4,"_","_","_","āmarṣa","NC","","_","_"
5,"rāmaḥ","_","_","rāma","NC","","_","_"
6,"_","_","_","parama","JJ","","_","_"
7,"_","_","_","manyumat","JJ","","_","_"
1,"niḥkṣatriyāṃ","_","_","niḥkṣatriya","JJ","","_","_"
2,"pratiśrutya","_","_","pratiśru","CGDA","","_","_"
3,"mahīṃ","_","_","mahī","NC","","_","_"
4,"śastram","_","_","śastra","NC","","_","_"
5,"agṛhṇata","_","_","grah","V","grah","_","_"
1,"tataḥ","_","_","tatas","CX","","_","_"
2,"sa","_","_","tad","PRD","","_","_"
3,"bhṛguśārdūlaḥ","_","_","bhṛguśārdūla","NC","","_","_"
4,"kārtavīryasya","_","_","kārtavīrya","NC","","_","_"
5,"vīryavān","_","_","vīryavat","JJ","","_","_"
1,"vikramya","_","_","vikra","CGDA","","_","_"
2,"_","_","_","nihan","V","nihan","_","_"
3,"_","_","_","āśu","CX","","_","_"
4,"putrān","_","_","putra","NC","","_","_"
5,"_","_","_","pautra","NC","","_","_"
6,"_","_","_","ca","CCD","","_","_"
7,"sarvaśaḥ","_","_","sarvaśas","CX","","_","_"
1,"sa","_","_","tad","PRD","","_","_"
2,"_","_","_","haihaya","NC","","_","_"
3,"_","_","_","sahasra","NUM","","_","_"
4,"hatvā","_","_","han","CGDA","","_","_"
5,"_","_","_","parama","JJ","","_","_"
6,"_","_","_","manyumat","JJ","","_","_"
1,"cakāra","_","_","kar","V","kṛ","_","_"
2,"bhārgavo","_","_","bhārgava","NC","","_","_"
3,"_","_","_","rājan","NC","","_","_"
4,"_","_","_","mahī","NC","","_","_"
5,"_","_","_","śoṇita","NC","","_","_"
6,"_","_","_","kardama","NC","","_","_"
1,"sa","_","_","tad","PRD","","_","_"
2,"tathā","_","_","tathā","CX","","_","_"
3,"_","_","_","su","CAD","","_","_"
4,"_","_","_","mahat","JJ","","_","_"
5,"_","_","_","tejas","NC","","_","_"
6,"kṛtvā","_","_","kṛ","CGDA","","_","_"
7,"niḥkṣatriyāṃ","_","_","niḥkṣatriya","JJ","","_","_"
8,"mahīm","_","_","mahī","NC","","_","_"
1,"kṛpayā","_","_","kṛpā","NC","","_","_"
2,"_","_","_","para","PPX","","_","_"
3,"_","_","_","āviś","PPP","","_","_"
4,"vanam","_","_","vana","NC","","_","_"
5,"eva","_","_","eva","CEM","","_","_"
6,"jagāma","_","_","ga","V","ga","_","_"
7,"ha","_","_","ha","CEM","","_","_"
1,"tato","_","_","tatas","CX","","_","_"
2,"_","_","_","varṣa","NC","","_","_"
3,"_","_","_","sahasra","NUM","","_","_"
4,"samatīteṣu","_","_","samatī","PPP","","_","_"
5,"keṣucit","_","_","kiṃcit","PRI","","_","_"
1,"kṣobhaṃ","_","_","kṣobha","NC","","_","_"
2,"_","_","_","samprāp","KDP","","_","_"
3,"_","_","_","tīvra","JJ","","_","_"
4,"prakṛtyā","_","_","prakṛti","NC","","_","_"
5,"kopanaḥ","_","_","kopana","JJ","","_","_"
6,"prabhuḥ","_","_","prabhu","JJ","","_","_"
1,"viśvāmitrasya","_","_","viśvāmitra","NC","","_","_"
2,"_","_","_","pautra","NC","","_","_"
3,"_","_","_","tu","CCD","","_","_"
4,"_","_","_","raibhya","NC","","_","_"
5,"_","_","_","putra","NC","","_","_"
6,"_","_","_","mahat","JJ","","_","_"
7,"_","_","_","tapas","NC","","_","_"
1,"parāvasur","_","_","parāvasu","NC","","_","_"
2,"_","_","_","mahat","JJ","","_","_"
3,"_","_","_","rāja","NC","","_","_"
4,"_","_","_","kṣip","CGDA","","_","_"
5,"_","_","_","ah","V","ah","_","_"
6,"_","_","_","jana","NC","","_","_"
7,"_","_","_","saṃsad","NC","","_","_"
1,"ye","_","_","yad","PRL","","_","_"
2,"te","_","_","tad","PRD","","_","_"
3,"yayātipatane","_","_","yayātipatana","NC","","_","_"
4,"yajñe","_","_","yajña","NC","","_","_"
5,"santaḥ","_","_","sat","JJ","","_","_"
6,"samāgatāḥ","_","_","samāga","PPP","","_","_"
1,"_","_","_","pratardana","NC","","_","_"
2,"_","_","_","prabhṛti","NC","","_","_"
3,"rāma","_","_","rāma","NC","","_","_"
4,"kiṃ","_","_","kim","CX","","_","_"
5,"kṣatriyā","_","_","kṣatriya","NC","","_","_"
6,"na","_","_","na","CNG","","_","_"
7,"te","_","_","tad","PRD","","_","_"
1,"mithyāpratijño","_","_","mithyāpratijña","JJ","","_","_"
2,"rāma","_","_","rāma","NC","","_","_"
3,"tvaṃ","_","_","tvat","PPR","","_","_"
4,"katthase","_","_","katth","V","katth","_","_"
5,"_","_","_","jana","NC","","_","_"
6,"_","_","_","saṃsad","NC","","_","_"
1,"bhayāt","_","_","bhaya","NC","","_","_"
2,"_","_","_","kṣatriya","NC","","_","_"
3,"_","_","_","vīra","NC","","_","_"
4,"parvataṃ","_","_","parvata","NC","","_","_"
5,"samupāśritaḥ","_","_","samupāśri","PPP","","_","_"
1,"sa","_","_","tad","PRD","","_","_"
2,"punaḥ","_","_","punar","CAD","","_","_"
3,"_","_","_","kṣatriya","NC","","_","_"
4,"_","_","_","śata","NUM","","_","_"
5,"pṛthivīm","_","_","pṛthivī","NC","","_","_"
6,"anusaṃtatām","_","_","anusaṃtan","PPP","","_","_"
1,"_","_","_","parāvasu","NC","","_","_"
2,"_","_","_","tadā","CAD","","_","_"
3,"śrutvā","_","_","śru","CGDA","","_","_"
4,"śastraṃ","_","_","śastra","NC","","_","_"
5,"jagrāha","_","_","grah","V","grah","_","_"
6,"bhārgavaḥ","_","_","bhārgava","NC","","_","_"
1,"tato","_","_","tatas","CX","","_","_"
2,"ye","_","_","yad","PRL","","_","_"
3,"kṣatriyā","_","_","kṣatriya","NC","","_","_"
4,"rājañ","_","_","rājan","NC","","_","_"
5,"_","_","_","śataśas","CX","","_","_"
6,"_","_","_","tad","PRD","","_","_"
7,"jīvitāḥ","_","_","jīvay","PPP","","_","_"
1,"te","_","_","tad","PRD","","_","_"
2,"vivṛddhā","_","_","vivṛdh","PPP","","_","_"
3,"_","_","_","mahat","JJ","","_","_"
4,"_","_","_","vīrya","NC","","_","_"
5,"pṛthivīpatayo","_","_","pṛthivīpati","NC","","_","_"
6,"'bhavan","_","_","bhav","V","bhū","_","_"
1,"sa","_","_","tad","PRD","","_","_"
2,"_","_","_","punar","CAD","","_","_"
3,"_","_","_","tad","PRD","","_","_"
4,"_","_","_","han","V","han","_","_"
5,"_","_","_","āśu","CX","","_","_"
6,"bālān","_","_","bāla","NC","","_","_"
7,"api","_","_","api","CX","","_","_"
8,"narādhipa","_","_","narādhipa","NC","","_","_"
1,"_","_","_","garbha","NC","","_","_"
2,"_","_","_","stha","JJ","","_","_"
3,"_","_","_","tu","CCD","","_","_"
4,"mahī","_","_","mahī","NC","","_","_"
5,"vyāptā","_","_","vyāp","PPP","","_","_"
6,"punar","_","_","punar","CAD","","_","_"
7,"_","_","_","eva","CEM","","_","_"
8,"_","_","_","bhav","V","bhū","_","_"
9,"tadā","_","_","tadā","CAD","","_","_"
1,"jātaṃ","_","_","jan","PPP","","_","_"
2,"jātaṃ","_","_","jan","PPP","","_","_"
3,"sa","_","_","sa_saha","CX","","_","_"
4,"garbhaṃ","_","_","garbha","NC","","_","_"
5,"tu","_","_","tu","CCD","","_","_"
6,"punar","_","_","punar","CAD","","_","_"
7,"eva","_","_","eva","CEM","","_","_"
8,"jaghāna","_","_","han","V","han","_","_"
9,"ha","_","_","ha","CEM","","_","_"
1,"_","_","_","arakṣat","JJ","","_","_"
2,"_","_","_","ca","CCD","","_","_"
3,"sutān","_","_","suta","NC","","_","_"
4,"kāṃścit","_","_","kiṃcit","PRI","","_","_"
5,"tadā","_","_","tadā","CAD","","_","_"
6,"_","_","_","kṣatriya","NC","","_","_"
7,"_","_","_","yoṣit","NC","","_","_"
1,"_","_","_","tris","CX","","_","_"
2,"_","_","_","saptan","NUM","","_","_"
3,"_","_","_","kṛtvas","CX","","_","_"
4,"pṛthivīṃ","_","_","pṛthivī","NC","","_","_"
5,"kṛtvā","_","_","kṛ","CGDA","","_","_"
6,"niḥkṣatriyāṃ","_","_","niḥkṣatriya","JJ","","_","_"
7,"prabhuḥ","_","_","prabhu","JJ","","_","_"
1,"dakṣiṇām","_","_","dakṣiṇā","NC","","_","_"
2,"_","_","_","aśvamedha","NC","","_","_"
3,"_","_","_","anta","NC","","_","_"
4,"_","_","_","kaśyapa","NC","","_","_"
5,"_","_","_","dad","V","dā","_","_"
6,"tataḥ","_","_","tatas","CX","","_","_"
1,"kṣatriyāṇāṃ","_","_","kṣatriya","NC","","_","_"
2,"tu","_","_","tu","CCD","","_","_"
3,"_","_","_","śeṣa","NC","","_","_"
4,"_","_","_","artha","NC","","_","_"
5,"_","_","_","kara","NC","","_","_"
6,"_","_","_","uddiś","CGDA","","_","_"
7,"kaśyapaḥ","_","_","kaśyapa","NC","","_","_"
1,"_","_","_","sruc","NC","","_","_"
2,"_","_","_","pragrahavat","JJ","","_","_"
3,"rājañ","_","_","rājan","NC","","_","_"
4,"śrīmān","_","_","śrīmat","JJ","","_","_"
5,"vākyam","_","_","vākya","NC","","_","_"
6,"_","_","_","atha","CAD","","_","_"
7,"_","_","_","abravīta","V","brū","_","_"
1,"gaccha","_","_","ga","V","ga","_","_"
2,"pāraṃ","_","_","pāra","NC","","_","_"
3,"samudrasya","_","_","samudra","NC","","_","_"
4,"dakṣiṇasya","_","_","dakṣiṇa","JJ","","_","_"
5,"_","_","_","mahat","JJ","","_","_"
6,"_","_","_","muni","NC","","_","_"
1,"na","_","_","na","CNG","","_","_"
2,"te","_","_","tvat","PPR","","_","_"
3,"_","_","_","mat","PPR","","_","_"
4,"_","_","_","viṣaya","NC","","_","_"
5,"rāma","_","_","rāma","NC","","_","_"
6,"vastavyam","_","_","vas","KDG","","_","_"
7,"iha","_","_","iha","CAD","","_","_"
8,"karhicit","_","_","karhicit","CX","","_","_"
1,"tataḥ","_","_","tatas","CX","","_","_"
2,"śūrpārakaṃ","_","_","śūrpāraka","NC","","_","_"
3,"deśaṃ","_","_","deśa","NC","","_","_"
4,"_","_","_","sāgara","NC","","_","_"
5,"_","_","_","tad","PRD","","_","_"
6,"nirmame","_","_","nirmā","V","nirmā","_","_"
1,"_","_","_","saṃtrāsa","NC","","_","_"
2,"_","_","_","jāmadagnya","NC","","_","_"
3,"so","_","_","tad","PRD","","_","_"
4,"_","_","_","apara","PPX","","_","_"
5,"_","_","_","anta","NC","","_","_"
6,"_","_","_","mahī","NC","","_","_"
7,"_","_","_","tala","NC","","_","_"
1,"_","_","_","kaśyapa","NC","","_","_"
2,"_","_","_","tu","CCD","","_","_"
3,"_","_","_","mahat","JJ","","_","_"
4,"_","_","_","rāja","NC","","_","_"
5,"pratigṛhya","_","_","pratigrah","CGDA","","_","_"
6,"mahīm","_","_","mahī","NC","","_","_"
7,"imām","_","_","ida","PRD","","_","_"
1,"kṛtvā","_","_","kṛ","CGDA","","_","_"
2,"_","_","_","brāhmaṇa","NC","","_","_"
3,"_","_","_","saṃsthā","NC","","_","_"
4,"vai","_","_","vai","CX","","_","_"
5,"praviveśa","_","_","praviś","V","praviś","_","_"
6,"_","_","_","mahat","JJ","","_","_"
7,"_","_","_","vana","NC","","_","_"
1,"tataḥ","_","_","tatas","CX","","_","_"
2,"_","_","_","śūdra","NC","","_","_"
3,"_","_","_","ca","CCD","","_","_"
4,"_","_","_","vaiśya","NC","","_","_"
5,"_","_","_","ca","CCD","","_","_"
6,"_","_","_","yathāsva","JJ","","_","_"
7,"a","_","_","alpha_privativum","JJ","","_","_"
7,"_","_","_","pracārin","JJ","","_","_"
1,"avartanta","_","_","vart","V","vṛt","_","_"
2,"dvijāgryāṇāṃ","_","_","dvijāgrya","NC","","_","_"
3,"dāreṣu","_","_","dāra","NC","","_","_"
4,"_","_","_","bharata","NC","","_","_"
5,"_","_","_","ṛṣabha","NC","","_","_"
1,"arājake","_","_","arājaka","JJ","","_","_"
2,"_","_","_","jīva","NC","","_","_"
3,"_","_","_","loka","NC","","_","_"
4,"durbalā","_","_","durbala","JJ","","_","_"
5,"balavattaraiḥ","_","_","balavattara","JJ","","_","_"
1,"bādhyante","_","_","bādh","V","bādh","_","_"
2,"na","_","_","na","CNG","","_","_"
3,"ca","_","_","ca","CCD","","_","_"
4,"vitteṣu","_","_","vitta","NC","","_","_"
5,"_","_","_","prabhu","JJ","","_","_"
7,"iha","_","_","iha","CAD","","_","_"
8,"kasyacit","_","_","kiṃcit","PRI","","_","_"
1,"tataḥ","_","_","tatas","CX","","_","_"
2,"kālena","_","_","kāla","NC","","_","_"
3,"pṛthivī","_","_","pṛthivī","NC","","_","_"
4,"praviveśa","_","_","praviś","V","praviś","_","_"
5,"rasātalam","_","_","rasātala","NC","","_","_"
1,"a","_","_","alpha_privativum","JJ","","_","_"
1,"arakṣyamāṇā","_","_","rakṣyamāṇa","JJ","","_","_"
2,"vidhivat","_","_","vidhivat","CX","","_","_"
3,"kṣatriyair","_","_","kṣatriya","NC","","_","_"
4,"_","_","_","dharma","NC","","_","_"
5,"_","_","_","rakṣin","JJ","","_","_"
1,"ūruṇā","_","_","ūru","NC","","_","_"
2,"dhārayāmāsa","_","_","dhāray","V","dhāray","_","_"
3,"kaśyapaḥ","_","_","kaśyapa","NC","","_","_"
4,"pṛthivīṃ","_","_","pṛthivī","NC","","_","_"
5,"tataḥ","_","_","tatas","CX","","_","_"
1,"nimajjantīṃ","_","_","nimajj","KDP","","_","_"
2,"tadā","_","_","tadā","CAD","","_","_"
3,"_","_","_","rājan","NC","","_","_"
4,"_","_","_","ta","CX","","_","_"
5,"_","_","_","urvī","NC","","_","_"
6,"_","_","_","iti","CQT","","_","_"
7,"mahī","_","_","mahī","NC","","_","_"
8,"smṛtā","_","_","smṛ","PPP","","_","_"
1,"_","_","_","rakṣin","JJ","","_","_"
2,"_","_","_","ca","CCD","","_","_"
3,"samuddiśya","_","_","samuddiś","CGDA","","_","_"
4,"prāyācat","_","_","prayāc","V","prayāc","_","_"
5,"pṛthivī","_","_","pṛthivī","NC","","_","_"
6,"tadā","_","_","tadā","CAD","","_","_"
1,"prasādya","_","_","prasāday","CGDA","","_","_"
2,"kaśyapaṃ","_","_","kaśyapa","NC","","_","_"
3,"devī","_","_","devī","NC","","_","_"
4,"kṣatriyān","_","_","kṣatriya","NC","","_","_"
5,"_","_","_","bāhu","NC","","_","_"
6,"_","_","_","śālin","JJ","","_","_"
1,"santi","_","_","as","V","as","_","_"
2,"_","_","_","brahman","NC","","_","_"
3,"_","_","_","mat","PPR","","_","_"
4,"guptā","_","_","gup","PPP","","_","_"
5,"nṛṣu","_","_","nṛ","NC","","_","_"
6,"_","_","_","kṣatriya","NC","","_","_"
7,"_","_","_","puṃgava","NC","","_","_"
1,"haihayānāṃ","_","_","haihaya","NC","","_","_"
2,"kule","_","_","kula","NC","","_","_"
3,"_","_","_","jan","PPP","","_","_"
4,"_","_","_","tad","PRD","","_","_"
5,"saṃrakṣantu","_","_","saṃrakṣ","V","saṃrakṣ","_","_"
6,"māṃ","_","_","mat","PPR","","_","_"
7,"mune","_","_","muni","NC","","_","_"
1,"asti","_","_","as","V","as","_","_"
2,"_","_","_","paurava","NC","","_","_"
3,"_","_","_","dāyāda","NC","","_","_"
4,"_","_","_","vidūratha","NC","","_","_"
5,"_","_","_","suta","NC","","_","_"
6,"prabho","_","_","prabhu","JJ","","_","_"
1,"ṛkṣaiḥ","_","_","ṛkṣa","NC","","_","_"
2,"saṃvardhito","_","_","saṃvardhay","PPP","","_","_"
3,"vipra","_","_","vipra","NC","","_","_"
4,"_","_","_","ṛkṣavat","NC","","_","_"
5,"_","_","_","eva","CEM","","_","_"
6,"parvate","_","_","parvata","NC","","_","_"
1,"_","_","_","tathā","CX","","_","_"
2,"_","_","_","anukamp","KDP","","_","_"
3,"_","_","_","yajvan","NC","","_","_"
4,"_","_","_","atha","CAD","","_","_"
5,"_","_","_","amita","JJ","","_","_"
6,"_","_","_","ojas","NC","","_","_"
1,"parāśareṇa","_","_","parāśara","NC","","_","_"
2,"dāyādaḥ","_","_","dāyāda","NC","","_","_"
3,"_","_","_","saudāsa","NC","","_","_"
4,"_","_","_","abhirakṣ","PPP","","_","_"
1,"_","_","_","sarva","JQ","","_","_"
2,"_","_","_","karman","NC","","_","_"
3,"kurute","_","_","kar","V","kṛ","_","_"
4,"_","_","_","tad","PRD","","_","_"
5,"_","_","_","ṛṣi","NC","","_","_"
6,"_","_","_","śūdra","NC","","_","_"
7,"_","_","_","vat","CX","","_","_"
8,"_","_","_","hi","CX","","_","_"
9,"saḥ","_","_","tad","PRD","","_","_"
1,"_","_","_","sarvakarman","NC","","_","_"
2,"_","_","_","iti","CQT","","_","_"
3,"_","_","_","abhikhyā","PPP","","_","_"
4,"sa","_","_","tad","PRD","","_","_"
5,"māṃ","_","_","mat","PPR","","_","_"
6,"rakṣatu","_","_","rakṣ","V","rakṣ","_","_"
7,"pārthivaḥ","_","_","pārthiva","NC","","_","_"
1,"śibeḥ","_","_","śibi","NC","","_","_"
2,"putro","_","_","putra","NC","","_","_"
3,"_","_","_","mahat","JJ","","_","_"
4,"_","_","_","tejas","NC","","_","_"
5,"gopatir","_","_","gopati","NC","","_","_"
6,"nāma","_","_","nāma","CX","","_","_"
7,"nāmataḥ","_","_","nāman","NC","","_","_"
1,"vane","_","_","vana","NC","","_","_"
2,"saṃrakṣito","_","_","saṃrakṣ","PPP","","_","_"
3,"gobhiḥ","_","_","go","NC","","_","_"
4,"so","_","_","tad","PRD","","_","_"
5,"'bhirakṣatu","_","_","abhirakṣ","V","abhirakṣ","_","_"
6,"māṃ","_","_","mat","PPR","","_","_"
7,"mune","_","_","muni","NC","","_","_"
1,"pratardanasya","_","_","pratardana","NC","","_","_"
2,"_","_","_","putra","NC","","_","_"
3,"_","_","_","tu","CCD","","_","_"
4,"vatso","_","_","vatsa","NC","","_","_"
5,"nāma","_","_","nāma","CX","","_","_"
6,"_","_","_","mahat","JJ","","_","_"
7,"_","_","_","yaśas","NC","","_","_"
1,"vatsaiḥ","_","_","vatsa","NC","","_","_"
2,"saṃvardhito","_","_","saṃvardhay","PPP","","_","_"
3,"goṣṭhe","_","_","goṣṭha","NC","","_","_"
4,"sa","_","_","tad","PRD","","_","_"
5,"māṃ","_","_","mat","PPR","","_","_"
6,"rakṣatu","_","_","rakṣ","V","rakṣ","_","_"
7,"pārthivaḥ","_","_","pārthiva","NC","","_","_"
1,"_","_","_","dadhivāhana","NC","","_","_"
2,"_","_","_","pautra","NC","","_","_"
3,"_","_","_","tu","CCD","","_","_"
4,"putro","_","_","putra","NC","","_","_"
5,"divirathasya","_","_","diviratha","NC","","_","_"
6,"ha","_","_","ha","CEM","","_","_"
1,"aṅgaḥ","_","_","aṅga","NC","","_","_"
2,"sa","_","_","tad","PRD","","_","_"
3,"_","_","_","gautama","NC","","_","_"
4,"_","_","_","api","CX","","_","_"
5,"_","_","_","gaṅgā","NC","","_","_"
6,"_","_","_","kūla","NC","","_","_"
7,"'bhirakṣitaḥ","_","_","abhirakṣ","PPP","","_","_"
1,"bṛhadratho","_","_","bṛhadratha","NC","","_","_"
2,"_","_","_","mahat","JJ","","_","_"
3,"_","_","_","bāhu","NC","","_","_"
4,"bhuvi","_","_","bhū","NC","","_","_"
5,"_","_","_","bhūti","NC","","_","_"
6,"_","_","_","puraskṛ","PPP","","_","_"
1,"golāṅgūlair","_","_","golāṅgūla","NC","","_","_"
2,"mahābhāgo","_","_","mahābhāga","JJ","","_","_"
3,"gṛdhrakūṭe","_","_","gṛdhrakūṭa","NC","","_","_"
4,"'bhirakṣitaḥ","_","_","abhirakṣ","PPP","","_","_"
1,"_","_","_","marut","NC","","_","_"
2,"_","_","_","tad","PRD","","_","_"
3,"_","_","_","anvavāya","NC","","_","_"
4,"tu","_","_","tu","CCD","","_","_"
5,"_","_","_","kṣatriya","NC","","_","_"
6,"_","_","_","turvasu","NC","","_","_"
7,"_","_","_","tri","NUM","","_","_"
1,"_","_","_","marutpati","NC","","_","_"
2,"_","_","_","sama","PPX","","_","_"
3,"vīrye","_","_","vīrya","NC","","_","_"
4,"_","_","_","samudra","NC","","_","_"
5,"_","_","_","abhirakṣ","PPP","","_","_"
1,"ete","_","_","tad","PRD","","_","_"
2,"_","_","_","kṣatriya","NC","","_","_"
3,"_","_","_","dāyāda","NC","","_","_"
4,"_","_","_","tatra","CAD","","_","_"
5,"tatra","_","_","tatra","CAD","","_","_"
6,"pariśrutāḥ","_","_","pariśru","PPP","","_","_"
1,"samyaṅ","_","_","samyak","CX","","_","_"
2,"mām","_","_","mat","PPR","","_","_"
3,"abhirakṣantu","_","_","abhirakṣ","V","abhirakṣ","_","_"
4,"tataḥ","_","_","tatas","CX","","_","_"
5,"sthāsyāmi","_","_","tiṣṭh","V","sthā","_","_"
6,"niścalā","_","_","niścala","JJ","","_","_"
1,"eteṣāṃ","_","_","tad","PRD","","_","_"
2,"_","_","_","pitṛ","NC","","_","_"
3,"_","_","_","ca","CCD","","_","_"
4,"_","_","_","eva","CEM","","_","_"
5,"_","_","_","tathā","CX","","_","_"
6,"_","_","_","eva","CEM","","_","_"
7,"ca","_","_","ca","CCD","","_","_"
8,"pitāmahāḥ","_","_","pitāmaha","NC","","_","_"
1,"_","_","_","mat","PPR","","_","_"
2,"_","_","_","artha","NC","","_","_"
3,"nihatā","_","_","nihan","PPP","","_","_"
4,"yuddhe","_","_","yuddha","NC","","_","_"
5,"_","_","_","rāma","NC","","_","_"
6,"a","_","_","alpha_privativum","JJ","","_","_"
6,"_","_","_","kliṣṭa","JJ","","_","_"
7,"_","_","_","karman","NC","","_","_"
1,"teṣām","_","_","tad","PRD","","_","_"
2,"_","_","_","apaciti","NC","","_","_"
3,"_","_","_","ca","CCD","","_","_"
4,"_","_","_","eva","CEM","","_","_"
5,"mayā","_","_","mat","PPR","","_","_"
6,"kāryā","_","_","kṛ","KDG","","_","_"
7,"na","_","_","na","CNG","","_","_"
8,"saṃśayaḥ","_","_","saṃśaya","NC","","_","_"
1,"na","_","_","na","CNG","","_","_"
2,"_","_","_","hi","CX","","_","_"
3,"_","_","_","mat","PPR","","_","_"
4,"kāmaye","_","_","kāmaya","V","kāmay","_","_"
5,"nityam","_","_","nitya","CX","","_","_"
6,"avikrāntena","_","_","avikrānta","JJ","","_","_"
7,"rakṣaṇam","_","_","rakṣaṇa","NC","","_","_"
1,"tataḥ","_","_","tatas","CX","","_","_"
2,"pṛthivyā","_","_","pṛthivī","NC","","_","_"
3,"_","_","_","nirdiś","PPP","","_","_"
4,"_","_","_","tad","PRD","","_","_"
5,"samānīya","_","_","samānī","CGDA","","_","_"
6,"kaśyapaḥ","_","_","kaśyapa","NC","","_","_"
1,"_","_","_","abhiṣic","V","abhiṣic","_","_"
2,"_","_","_","mahīpāla","NC","","_","_"
3,"kṣatriyān","_","_","kṣatriya","NC","","_","_"
4,"_","_","_","vīrya","NC","","_","_"
5,"_","_","_","samman","PPP","","_","_"
1,"teṣāṃ","_","_","tad","PRD","","_","_"
2,"_","_","_","putra","NC","","_","_"
3,"_","_","_","ca","CCD","","_","_"
4,"_","_","_","pautra","NC","","_","_"
5,"_","_","_","ca","CCD","","_","_"
6,"yeṣāṃ","_","_","yad","PRL","","_","_"
7,"vaṃśāḥ","_","_","vaṃśa","NC","","_","_"
8,"pratiṣṭhitāḥ","_","_","pratiṣṭhā","PPP","","_","_"
1,"evam","_","_","eva","CX","","_","_"
2,"etat","_","_","tad","PRD","","_","_"
3,"purā","_","_","purā","CX","","_","_"
4,"vṛttaṃ","_","_","vṛt","PPP","","_","_"
5,"_","_","_","yad","PRL","","_","_"
6,"_","_","_","mat","PPR","","_","_"
7,"pṛcchasi","_","_","pṛcch","V","prach","_","_"
8,"pāṇḍava","_","_","pāṇḍava","NC","","_","_"
1,"vaiśaṃpāyana","_","_","vaiśampāyana","NC","","_","_"
2,"uvāca","_","_","vak","V","vac","_","_"
1,"evaṃ","_","_","eva","CX","","_","_"
2,"bruvann","_","_","brū","KDP","","_","_"
3,"eva","_","_","eva","CEM","","_","_"
4,"_","_","_","yadu","NC","","_","_"
5,"_","_","_","pravīra","NC","","_","_"
6,"yudhiṣṭhiraṃ","_","_","yudhiṣṭhira","NC","","_","_"
7,"_","_","_","dharma","NC","","_","_"
8,"_","_","_","bhṛt","JJ","","_","_"
9,"variṣṭham","_","_","variṣṭha","JJ","","_","_"
1,"rathena","_","_","ratha","NC","","_","_"
2,"_","_","_","tad","PRD","","_","_"
3,"_","_","_","āśu","CX","","_","_"
4,"yayau","_","_","yā","V","yā","_","_"
5,"_","_","_","yathā","CCM","","_","_"
6,"_","_","_","arka","NC","","_","_"
7,"viśan","_","_","viś","KDP","","_","_"
8,"prabhābhir","_","_","prabhā","NC","","_","_"
9,"_","_","_","bhagavat","JJ","","_","_"
10,"_","_","_","triloka","NC","","_","_"
