"WordID","word","NormSTEM","suffix","lemma","PoS","Root","NormSuffix","NormWord"
1,"nārada","_","_","nārada","NC","","_","_"
2,"uvāca","_","_","vak","V","vac","_","_"
1,"sa","_","_","tad","PRD","","_","_"
2,"tu","_","_","tu","CCD","","_","_"
3,"rājā","_","_","rājan","NC","","_","_"
4,"_","_","_","punar","CAD","","_","_"
5,"_","_","_","tad","PRD","","_","_"
6,"_","_","_","kartu","NC","","_","_"
7,"_","_","_","kāma","NC","","_","_"
8,"svayaṃvaram","_","_","svayaṃvara","NC","","_","_"
1,"_","_","_","upaga","CGDA","","_","_"
2,"_","_","_","āśrama","NC","","_","_"
3,"_","_","_","pada","NC","","_","_"
4,"_","_","_","gaṅgā","NC","","_","_"
5,"_","_","_","yamunā","NC","","_","_"
6,"_","_","_","saṃgama","NC","","_","_"
1,"_","_","_","grah","PPP","","_","_"
2,"_","_","_","mālya","NC","","_","_"
3,"_","_","_","dāma","NC","","_","_"
4,"tāṃ","_","_","tad","PRD","","_","_"
5,"ratham","_","_","ratha","NC","","_","_"
6,"āropya","_","_","āropay","CGDA","","_","_"
7,"mādhavīm","_","_","mādhavī","NC","","_","_"
1,"pūrur","_","_","pūru","NC","","_","_"
2,"_","_","_","yadu","NC","","_","_"
3,"_","_","_","ca","CCD","","_","_"
4,"bhaginīm","_","_","bhaginī","NC","","_","_"
5,"āśrame","_","_","āśrama","NC","","_","_"
6,"paryadhāvatām","_","_","paridhāv","V","paridhāv","_","_"
1,"_","_","_","nāga","NC","","_","_"
2,"_","_","_","yakṣa","NC","","_","_"
3,"_","_","_","manuṣya","NC","","_","_"
4,"_","_","_","patatrin","NC","","_","_"
5,"_","_","_","mṛga","NC","","_","_"
6,"_","_","_","pakṣin","NC","","_","_"
1,"_","_","_","śaila","NC","","_","_"
2,"_","_","_","druma","NC","","_","_"
3,"_","_","_","vana","NC","","_","_"
4,"_","_","_","oka","NC","","_","_"
5,"āsīt","_","_","as","V","as","_","_"
6,"tatra","_","_","tatra","CAD","","_","_"
7,"samāgamaḥ","_","_","samāgama","NC","","_","_"
1,"_","_","_","nānā","CX","","_","_"
2,"_","_","_","puruṣa","NC","","_","_"
3,"_","_","_","deśa","NC","","_","_"
4,"_","_","_","īśvara","NC","","_","_"
5,"_","_","_","ca","CCD","","_","_"
6,"samākulam","_","_","samākula","JJ","","_","_"
1,"ṛṣibhir","_","_","ṛṣi","NC","","_","_"
2,"_","_","_","brahman","NC","","_","_"
3,"_","_","_","kalpa","JJ","","_","_"
4,"_","_","_","ca","CCD","","_","_"
5,"samantād","_","_","samantāt","CX","","_","_"
6,"āvṛtaṃ","_","_","āvṛ","PPP","","_","_"
7,"vanam","_","_","vana","NC","","_","_"
1,"nirdiśyamāneṣu","_","_","nirdiś","KDP","","_","_"
2,"tu","_","_","tu","CCD","","_","_"
3,"sā","_","_","tad","PRD","","_","_"
4,"vareṣu","_","_","vara","NC","","_","_"
5,"varavarṇinī","_","_","varavarṇinī","NC","","_","_"
1,"varān","_","_","vara","NC","","_","_"
2,"utkramya","_","_","utkra","CGDA","","_","_"
3,"_","_","_","sarva","JQ","","_","_"
4,"_","_","_","tad","PRD","","_","_"
5,"vanaṃ","_","_","vana","NC","","_","_"
6,"vṛtavatī","_","_","vṛ","KDP","","_","_"
7,"varam","_","_","vara","NC","","_","_"
1,"avatīrya","_","_","avatṛ","CGDA","","_","_"
2,"rathāt","_","_","ratha","NC","","_","_"
3,"kanyā","_","_","kanyā","NC","","_","_"
4,"namaskṛtvā","_","_","namaskṛ","CGDA","","_","_"
5,"ca","_","_","ca","CCD","","_","_"
6,"bandhuṣu","_","_","bandhu","NC","","_","_"
1,"upagamya","_","_","upaga","CGDA","","_","_"
2,"vanaṃ","_","_","vana","NC","","_","_"
3,"puṇyaṃ","_","_","puṇya","JJ","","_","_"
4,"_","_","_","tapas","NC","","_","_"
5,"_","_","_","tap","V","tap","_","_"
6,"yayātijā","_","_","yayātijā","NC","","_","_"
1,"_","_","_","upavāsa","NC","","_","_"
2,"_","_","_","ca","CCD","","_","_"
3,"vividhair","_","_","vividha","JJ","","_","_"
4,"dīkṣābhir","_","_","dīkṣā","NC","","_","_"
5,"_","_","_","niyama","NC","","_","_"
6,"_","_","_","tathā","CX","","_","_"
1,"ātmano","_","_","ātman","NC","","_","_"
2,"_","_","_","laghu","JJ","","_","_"
4,"kṛtvā","_","_","kṛ","CGDA","","_","_"
5,"babhūva","_","_","bhav","V","bhū","_","_"
6,"_","_","_","mṛga","NC","","_","_"
7,"_","_","_","cārin","JJ","","_","_"
1,"_","_","_","vaiḍūrya","NC","","_","_"
2,"_","_","_","aṅkura","NC","","_","_"
3,"_","_","_","kalpa","JJ","","_","_"
4,"mṛdūni","_","_","mṛdu","JJ","","_","_"
5,"haritāni","_","_","harita","JJ","","_","_"
6,"ca","_","_","ca","CCD","","_","_"
1,"carantī","_","_","car","KDP","","_","_"
2,"_","_","_","śaṣpa","NC","","_","_"
3,"_","_","_","mukhya","JJ","","_","_"
4,"tiktāni","_","_","tikta","JJ","","_","_"
5,"madhurāṇi","_","_","madhura","JJ","","_","_"
6,"ca","_","_","ca","CCD","","_","_"
1,"sravantīnāṃ","_","_","sravantī","NC","","_","_"
2,"ca","_","_","ca","CCD","","_","_"
3,"puṇyānāṃ","_","_","puṇya","JJ","","_","_"
4,"_","_","_","su","CAD","","_","_"
5,"_","_","_","rasa","NC","","_","_"
6,"śucīni","_","_","śuci","JJ","","_","_"
7,"ca","_","_","ca","CCD","","_","_"
1,"pibantī","_","_","pā","KDP","","_","_"
2,"_","_","_","vāri","NC","","_","_"
3,"_","_","_","mukhya","JJ","","_","_"
4,"śītāni","_","_","śīta","JJ","","_","_"
5,"vimalāni","_","_","vimala","JJ","","_","_"
6,"ca","_","_","ca","CCD","","_","_"
1,"vaneṣu","_","_","vana","NC","","_","_"
2,"mṛgarājeṣu","_","_","mṛgarāja","NC","","_","_"
3,"_","_","_","siṃha","NC","","_","_"
4,"_","_","_","vipravas","PPP","","_","_"
5,"ca","_","_","ca","CCD","","_","_"
1,"_","_","_","dāva","NC","","_","_"
2,"_","_","_","agni","NC","","_","_"
3,"_","_","_","vipramuc","PPP","","_","_"
4,"śūnyeṣu","_","_","śūnya","JJ","","_","_"
5,"gahaneṣu","_","_","gahana","NC","","_","_"
6,"ca","_","_","ca","CCD","","_","_"
1,"carantī","_","_","car","KDP","","_","_"
2,"hariṇaiḥ","_","_","hariṇa","NC","","_","_"
3,"sārdhaṃ","_","_","sārdha","CX","","_","_"
4,"_","_","_","mṛgī","NC","","_","_"
5,"_","_","_","iva","CCM","","_","_"
6,"_","_","_","vana","NC","","_","_"
7,"_","_","_","cārin","JJ","","_","_"
1,"cacāra","_","_","car","V","car","_","_"
2,"vipulaṃ","_","_","vipula","JJ","","_","_"
3,"dharmaṃ","_","_","dharma","NC","","_","_"
4,"brahmacaryeṇa","_","_","brahmacarya","NC","","_","_"
5,"saṃvṛtā","_","_","saṃvṛ","PPP","","_","_"
1,"yayātir","_","_","yayāti","NC","","_","_"
2,"api","_","_","api","CX","","_","_"
3,"pūrveṣāṃ","_","_","pūrva","PPX","","_","_"
4,"rājñāṃ","_","_","rājan","NC","","_","_"
5,"vṛttam","_","_","vṛtta","NC","","_","_"
6,"anuṣṭhitaḥ","_","_","anuṣṭhā","PPP","","_","_"
1,"_","_","_","bahu","JJ","","_","_"
2,"_","_","_","varṣa","NC","","_","_"
3,"_","_","_","sahasra","NUM","","_","_"
4,"_","_","_","āyus","NC","","_","_"
5,"ayujat","_","_","yuj","V","yuj","_","_"
6,"kāladharmaṇā","_","_","kāladharman","NC","","_","_"
1,"pūrur","_","_","pūru","NC","","_","_"
2,"_","_","_","yadu","NC","","_","_"
3,"_","_","_","ca","CCD","","_","_"
4,"dvau","_","_","dvi","NUM","","_","_"
5,"vaṃśau","_","_","vaṃśa","NC","","_","_"
6,"vardhamānau","_","_","vṛdh","KDP","","_","_"
7,"_","_","_","nara","NC","","_","_"
8,"_","_","_","uttama","JJ","","_","_"
1,"tābhyāṃ","_","_","tad","PRD","","_","_"
2,"pratiṣṭhito","_","_","pratiṣṭhā","PPP","","_","_"
3,"loke","_","_","loka","NC","","_","_"
4,"_","_","_","para","PPX","","_","_"
5,"_","_","_","loka","NC","","_","_"
6,"ca","_","_","ca","CCD","","_","_"
7,"nāhuṣaḥ","_","_","nāhuṣa","NC","","_","_"
1,"mahīyate","_","_","mahīy","V","mahīy","_","_"
2,"narapatir","_","_","narapati","NC","","_","_"
3,"yayātiḥ","_","_","yayāti","NC","","_","_"
4,"svargam","_","_","svarga","NC","","_","_"
5,"āsthitaḥ","_","_","āsthā","PPP","","_","_"
1,"_","_","_","mahat","JJ","","_","_"
2,"_","_","_","ṛṣi","NC","","_","_"
3,"_","_","_","kalpa","JJ","","_","_"
4,"nṛpatiḥ","_","_","nṛpati","NC","","_","_"
5,"_","_","_","svarga","NC","","_","_"
6,"_","_","_","agrya","JJ","","_","_"
7,"_","_","_","phala","NC","","_","_"
8,"_","_","_","bhuj","JJ","","_","_"
9,"vibhuḥ","_","_","vibhu","JJ","","_","_"
1,"_","_","_","bahu","JJ","","_","_"
2,"_","_","_","varṣa","NC","","_","_"
3,"_","_","_","sahasra","NUM","","_","_"
4,"_","_","_","ākhyā","NC","","_","_"
5,"kāle","_","_","kāla","NC","","_","_"
6,"bahuguṇe","_","_","bahuguṇa","JJ","","_","_"
7,"gate","_","_","ga","PPP","","_","_"
1,"_","_","_","rājan","NC","","_","_"
2,"_","_","_","ṛṣi","NC","","_","_"
3,"niṣaṇṇeṣu","_","_","niṣad","PPP","","_","_"
4,"mahīyaḥsu","_","_","mahīyas","JJ","","_","_"
5,"_","_","_","mahat","JJ","","_","_"
6,"_","_","_","ṛṣi","NC","","_","_"
1,"avamene","_","_","avaman","V","avaman","_","_"
2,"narān","_","_","nara","NC","","_","_"
3,"sarvān","_","_","sarva","JQ","","_","_"
4,"devān","_","_","deva","NC","","_","_"
5,"_","_","_","ṛṣi","NC","","_","_"
6,"_","_","_","gaṇa","NC","","_","_"
7,"_","_","_","tathā","CX","","_","_"
1,"yayātir","_","_","yayāti","NC","","_","_"
2,"_","_","_","muh","PPP","","_","_"
3,"_","_","_","vijñāna","NC","","_","_"
4,"_","_","_","vismaya","NC","","_","_"
5,"_","_","_","āviś","PPP","","_","_"
6,"_","_","_","cetanā","NC","","_","_"
1,"_","_","_","tatas","CX","","_","_"
2,"_","_","_","tad","PRD","","_","_"
3,"bubudhe","_","_","bodh","V","budh","_","_"
4,"devaḥ","_","_","deva","NC","","_","_"
5,"śakro","_","_","śakra","NC","","_","_"
6,"_","_","_","bala","NC","","_","_"
7,"_","_","_","niṣūdana","NC","","_","_"
1,"te","_","_","tad","PRD","","_","_"
2,"ca","_","_","ca","CCD","","_","_"
3,"_","_","_","rājan","NC","","_","_"
4,"_","_","_","ṛṣi","NC","","_","_"
5,"sarve","_","_","sarva","JQ","","_","_"
6,"dhig","_","_","dhik","CX","","_","_"
7,"dhig","_","_","dhik","CX","","_","_"
8,"_","_","_","iti","CQT","","_","_"
9,"_","_","_","eva","CX","","_","_"
10,"abruvan","_","_","abravīta","V","brū","_","_"
1,"_","_","_","vicāra","NC","","_","_"
2,"_","_","_","ca","CCD","","_","_"
3,"samutpanno","_","_","samutpad","PPP","","_","_"
4,"nirīkṣya","_","_","nirīkṣ","CGDA","","_","_"
5,"nahuṣātmajam","_","_","nahuṣātmaja","NC","","_","_"
1,"ko","_","_","kiṃ","PRQ","","_","_"
2,"_","_","_","nu","CX","","_","_"
3,"_","_","_","ida","PRD","","_","_"
4,"kasya","_","_","kiṃ","PRQ","","_","_"
5,"vā","_","_","vā","CCD","","_","_"
6,"rājñaḥ","_","_","rājan","NC","","_","_"
7,"kathaṃ","_","_","katha","CX","","_","_"
8,"vā","_","_","vā","CCD","","_","_"
9,"svargam","_","_","svarga","NC","","_","_"
10,"āgataḥ","_","_","āga","PPP","","_","_"
1,"karmaṇā","_","_","karman","NC","","_","_"
2,"kena","_","_","kiṃ","PRQ","","_","_"
3,"siddho","_","_","sidh","PPP","","_","_"
4,"'yaṃ","_","_","ida","PRD","","_","_"
5,"kva","_","_","kva","CX","","_","_"
6,"_","_","_","vā","CCD","","_","_"
7,"_","_","_","ida","PRD","","_","_"
8,"_","_","_","tapas","NC","","_","_"
9,"_","_","_","ci","PPP","","_","_"
1,"kathaṃ","_","_","katha","CX","","_","_"
2,"vā","_","_","vā","CCD","","_","_"
3,"jñāyate","_","_","jān","V","jñā","_","_"
4,"svarge","_","_","svarga","NC","","_","_"
5,"kena","_","_","kiṃ","PRQ","","_","_"
6,"vā","_","_","vā","CCD","","_","_"
7,"jñāyate","_","_","jān","V","jñā","_","_"
8,"_","_","_","api","CX","","_","_"
9,"_","_","_","uta","CCD","","_","_"
1,"evaṃ","_","_","eva","CX","","_","_"
2,"_","_","_","vicāray","KDP","","_","_"
3,"_","_","_","tad","PRD","","_","_"
4,"rājānaḥ","_","_","rājan","NC","","_","_"
5,"_","_","_","svarga","NC","","_","_"
6,"_","_","_","vāsin","JJ","","_","_"
1,"dṛṣṭvā","_","_","dṛś","CGDA","","_","_"
2,"papracchur","_","_","pṛcch","V","prach","_","_"
3,"anyonyaṃ","_","_","anyonya","PRC","","_","_"
4,"yayātiṃ","_","_","yayāti","NC","","_","_"
5,"nṛpatiṃ","_","_","nṛpati","NC","","_","_"
6,"prati","_","_","prati","CADP","","_","_"
1,"_","_","_","vimāna","NC","","_","_"
2,"_","_","_","pāla","NC","","_","_"
3,"śataśaḥ","_","_","śataśas","CX","","_","_"
4,"_","_","_","svarga","NC","","_","_"
5,"_","_","_","dvāra","NC","","_","_"
6,"_","_","_","abhirakṣin","JJ","","_","_"
1,"pṛṣṭā","_","_","pracch","PPP","","_","_"
2,"_","_","_","āsana","NC","","_","_"
3,"_","_","_","pāla","NC","","_","_"
4,"_","_","_","ca","CCD","","_","_"
5,"na","_","_","na","CNG","","_","_"
6,"_","_","_","jān","V","jñā","_","_"
7,"_","_","_","iti","CQT","","_","_"
8,"_","_","_","atha","CAD","","_","_"
9,"_","_","_","abravīta","V","brū","_","_"
1,"sarve","_","_","sarva","JQ","","_","_"
2,"te","_","_","tad","PRD","","_","_"
3,"_","_","_","hi","CX","","_","_"
4,"_","_","_","āvṛ","PPP","","_","_"
5,"_","_","_","jñāna","NC","","_","_"
6,"_","_","_","na","CNG","","_","_"
7,"_","_","_","abhijān","V","abhijñā","_","_"
8,"taṃ","_","_","tad","PRD","","_","_"
9,"nṛpam","_","_","nṛpa","NC","","_","_"
1,"sa","_","_","tad","PRD","","_","_"
2,"muhūrtād","_","_","muhūrta","NC","","_","_"
3,"atha","_","_","atha","CAD","","_","_"
4,"nṛpo","_","_","nṛpa","NC","","_","_"
5,"_","_","_","han","PPP","","_","_"
6,"_","_","_","ojas","NC","","_","_"
7,"abhavat","_","_","bhav","V","bhū","_","_"
8,"tadā","_","_","tadā","CAD","","_","_"
