"WordID","word","NormSTEM","suffix","lemma","PoS","Root","NormSuffix","NormWord"
"","<s number = ""1"">","","","","","","",""
"1","gorakṣa","GORAKṢ","a","gorakṣa","","","a","gorakṣa"
"2","śatakam","ŚATAK","am","śataka","noun-adj","","am","śatakam"
"3","om","","","oṃ","ind","","","oṃ"
"4","parama","PARAM","a","parama","noun-adj","","a","parama"
"5","gurave","GUR","ave","guru","noun-adj","","ave","gurave"
"6","gorakṣa","GORAKṢ","a","gorakṣa","","","a","gorakṣa"
"7","nāthāya","NĀTHĀY","a","nāthāya","noun-adj","","a","nāthāya"
"8","namaḥ","NAM","aḥ","namas","noun-adj","","aḥ","namaḥ"
"9","om","","","oṃ","ind","","","oṃ"
"10","gorakṣa","GORAKṢ","a","gorakṣa","","","a","gorakṣa"
"11","śatakam","ŚATAK","am","śataka","noun-adj","","am","śatakam"
"12","vakṣye","VAKṢ","ye","vak","verb","vac","ye","vakṣye"
"13","bhava","BHAV","a","bhava","noun-adj","","a","bhava"
"14","pāśa","PĀŚ","a","pāśa","noun-adj","","a","pāśa"
"15","vimuktaye","VIMUKT","aye","vimukti","noun-adj","","aye","vimuktaye"
"16","ātma","ĀTM","a","ātman","noun-adj","","a","ātma"
"17","bodha","BODH","a","bodha","noun-adj","","a","bodha"
"18","karam","KARAM","","karama","noun-adj","","","karam"
"19","puṃsām","PUṂS","ām","puṃsā","noun-adj","","ām","puṃsām"
"20","viveka","VIVEK","a","viveka","noun-adj","","a","viveka"
"21","dvāra","DVĀR","a","dvāra","noun-adj","","a","dvāra"
"22","kuñcikām","KUÑCIK","ām","kuñcikā","noun-adj","","ām","kuñcikām"
"23","//","","","","punct","","","//"
"","</s>","","","","","","",""
"","<s number = ""2"">","","","","","","",""
"1","etat","ETAT","","tad","pron","","","etat"
"2","vimukti","VIMUKT","i","vimukti","noun-adj","","i","vimukti"
"3","sopānam","SOPĀN","am","sopāna","noun-adj","","am","sopānam"
"4","etat","ETAT","","tad","pron","","","etat"
"5","kālasya","KĀL","asya","kāla","noun-adj","","asya","kālasya"
"6","vañcanam","VAÑCAN","am","vañcana","noun-adj","","am","vañcanam"
"7","yat","","","yad","pron","","","yad"
"8","vyāvṛttam","VYĀVṚTT","am","vyāvṛtta","noun-adj","","am","vyāvṛttam"
"9","manaḥ","MAN","aḥ","manas","noun-adj","","aḥ","manaḥ"
"10","mohāt","MOH","āt","moha","noun-adj","","āt","mohāt"
"11","āsaktam","ĀSAKT","am","āsakta","noun-adj","","am","āsaktam"
"12","paramātmani","PARAMĀTM","ani","paramātma","","","āni","paramātmāni"
"13","//","","","","punct","","","//"
"","</s>","","","","","","",""
"","<s number = ""3"">","","","","","","",""
"1","dvija","DVIJ","a","dvija","noun-adj","","a","dvija"
"2","sevita","SEVIT","a","sevita","noun-adj","","a","sevita"
"3","śākhasya","ŚĀKH","asya","śākha","noun-adj","","asya","śākhasya"
"4","śruti","ŚRUT","i","śruti","noun-adj","","i","śruti"
"5","kalpa","KALP","a","kalpa","noun-adj","","a","kalpa"
"6","taroḥ","","","taru","ind","","","taru"
"7","phalam","PHAL","am","phala","noun-adj","","am","phalam"
"8","śamanam","ŚAMAN","am","śamana","noun-adj","","am","śamanam"
"9","bhava","BHAV","a","bhava","noun-adj","","a","bhava"
"10","tāpasya","TĀPASY","a","tāpasya","noun-adj","","a","tāpasya"
"11","yogam","YOG","am","yoga","noun-adj","","am","yogam"
"12","bhajati","BHAJ","ati","bhaj","verb","bhaj","ati","bhajati"
"13","sat","SAT","","sat","noun-adj","","","sat"
"14","janaḥ","JAN","aḥ","jana","noun-adj","","aḥ","janaḥ"
"15","//","","","","punct","","","//"
"","</s>","","","","","","",""
"","<s number = ""4"">","","","","","","",""
"1","āsanam","ĀSAN","am","āsana","noun-adj","","am","āsanam"
"2","prāṇa","PRĀṆ","a","prāṇa","noun-adj","","a","prāṇa"
"3","saṃyāmaḥ","SAṂYĀM","aḥ","saṃyāma","","","aḥ","saṃyāmaḥ"
"4","pratyāhāraḥ","PRATYĀHĀR","aḥ","pratyāhāra","noun-adj","","aḥ","pratyāhāraḥ"
"5","tha","","","","ind","","",""
"6","dhāraṇā","DHĀRAṆ","ā","dhāraṇī","noun-adj","","ā","dhāraṇā"
"7","dhyānam","DHYĀN","am","dhyāna","noun-adj","","am","dhyānam"
"8","samādhiḥ","SAMĀDH","iḥ","samādhi","noun-adj","","iḥ","samādhiḥ"
"9","etāni","","","tad","pron","","","tad"
"10","yoga","YOG","a","yoga","noun-adj","","a","yoga"
"11","aṅgāni","AṄG","āni","aṅgī","noun-adj","","āni","aṅgāni"
"12","bhavanti","BHAV","anti","bhav","verb","bhū","anti","bhavanti"
"13","ṣaṭ","ṢAṬ","","ṣaṭ","noun-adj","","","ṣaṭ"
"14","//","","","","punct","","","//"
"","</s>","","","","","","",""
"","<s number = ""5"">","","","","","","",""
"1","āsanāni","ĀSAN","āni","āsana","noun-adj","","āni","āsanāni"
"2","tu","","","tu","ind","","","tu"
"3","tāvanti","TĀVANT","i","tāvanta","noun-adj","","i","tāvanti"
"4","yāvatyaḥ","YĀVAT","yaḥ","yāvat","ind","","yaḥ","yāvatyaḥ"
"5","jīva","JĪV","a","jīva","noun-adj","","a","jīva"
"6","jātayaḥ","JĀTAY","aḥ","jāta","noun-adj","","aḥ","jātayaḥ"
"7","eteṣām","","","tad","pron","","","tad"
"8","akhilān","AKHIL","ān","akhila","noun-adj","","ān","akhilān"
"9","bhedān","BHED","ān","bheda","noun-adj","","ān","bhedān"
"10","vijānāti","VIJĀN","āti","vijān","verb","vijñā","āti","vijānāti"
"11","maheśvaraḥ","MAHEŚVAR","aḥ","maheśvara","noun-adj","","aḥ","maheśvaraḥ"
"12","//","","","","punct","","","//"
"","</s>","","","","","","",""
"","<s number = ""6"">","","","","","","",""
"1","catura","CAT","ura","catur","noun-adj","","ura","catura"
"2","aśīti","AŚĪT","i","aśīti","noun-adj","","i","aśīti"
"3","lakṣāṇām","LAKṢ","āṇām","lakṣa","noun-adj","","ānām","lakṣānām"
"4","ekam","EK","am","eka","noun-adj","","am","ekam"
"5","ekam","EK","am","eka","noun-adj","","am","ekam"
"6","udāhṛtam","UDĀHṚT","am","udāhṛta","noun-adj","","am","udāhṛtam"
"7","tatas","","","tatas","ind","","","tatas"
"8","śivena","ŚIV","ena","śiva","noun-adj","","ena","śivena"
"9","pīṭhānām","PĪṬH","ānām","pīṭha","noun-adj","","ānām","pīṭhānām"
"10","ṣoḍeśānam","","","","","","",""
"11","śatam","ŚAT","am","śata","noun-adj","","am","śatam"
"12","kṛtam","KṚT","am","kṛta","noun-adj","","am","kṛtam"
"13","//","","","","punct","","","//"
"","</s>","","","","","","",""
"","<s number = ""7"">","","","","","","",""
"1","āsanebhyaḥ","ĀSAN","ebhyaḥ","āsana","noun-adj","","ebhyaḥ","āsanebhyaḥ"
"2","samastebhyaḥ","SAMAST","ebhyaḥ","samasta","","","ebhyaḥ","samastebhyaḥ"
"3","dvayam","DVAY","am","dvaya","noun-adj","","am","dvayam"
"4","eva","","","eva","ind","","","eva"
"5","viśiṣyate","VIŚIṢ","yate","viśās","verb","viśās","yate","viśiṣyate"
"6","ekam","EK","am","eka","noun-adj","","am","ekam"
"7","siddhāsanam","SIDDHĀSAN","am","siddhāsana","","","am","siddhāsanam"
"8","proktam","PROKT","am","prokta","noun-adj","","am","proktam"
"9","dvitīyam","DVITĪY","am","dvitīya","noun-adj","","am","dvitīyam"
"10","kamalāsanam","KAMALĀSAN","am","kamalāsana","","","am","kamalāsanam"
"11","//","","","","punct","","","//"
"","</s>","","","","","","",""
"","<s number = ""8"">","","","","","","",""
"1","yoni","YON","i","yoni","noun-adj","","i","yoni"
"2","sthānakam","STHĀNAK","am","sthānaka","","","am","sthānakam"
"3","aṅghri","AṄGHR","i","aṅghri","noun-adj","","i","aṅghri"
"4","mūla","MŪL","a","mūla","noun-adj","","a","mūla"
"5","ghaṭitam","GHAṬIT","am","ghaṭita","noun-adj","","am","ghaṭitam"
"6","kṛtvā","KṚT","vā","kar","verb","kṛ","vāḥ","kṛtvāḥ"
"7","dṛḍham","DṚḌH","am","dṛḍha","noun-adj","","am","dṛḍham"
"8","vinyaset","VINYAS","et","vinyas","verb","","et","vinyaset"
"9","meḍhre","MEḌHR","e","meḍhra","noun-adj","","e","meḍhre"
"10","pādam","PĀD","am","pāda","noun-adj","","am","pādam"
"11","atha","","","atha","ind","","","atha"
"12","ekam","EK","am","eka","noun-adj","","am","ekam"
"13","eva","","","eva","ind","","","eva"
"14","niyatam","NIYAT","am","niyata","noun-adj","","am","niyatam"
"15","kṛtvā","KṚT","vā","kar","verb","kṛ","vāḥ","kṛtvāḥ"
"16","samam","SAM","am","sama","noun-adj","","am","samam"
"17","vigraham","VIGRAH","am","vigraha","noun-adj","","am","vigraham"
"18","sthāṇuḥ","STHĀṆ","uḥ","sthāṇu","noun-adj","","uḥ","sthāṇuḥ"
"19","saṃyamita","SAṂYAMIT","a","saṃyamita","","","a","saṃyamita"
"20","indriyaḥ","INDRIY","aḥ","indriya","noun-adj","","aḥ","indriyaḥ"
"21","cala","CAL","a","cala","noun-adj","","a","cala"
"22","dṛśā","DṚŚ","ā","dṛśa","noun-adj","","āḥ","dṛśāḥ"
"23","paśyan","PAŚ","yan","paśyana","noun-adj","","yan","paśyan"
"24","bhruvoḥ","BHRUV","oḥ","bhruva","noun-adj","","oḥ","bhruvoḥ"
"25","antaram","ANTAR","am","antara","noun-adj","","am","antaram"
"26","etat","ETAT","","tad","pron","","","etat"
"27","mokṣa","MOKṢ","a","mokṣa","noun-adj","","a","mokṣa"
"28","kavāṭa","KAVĀṬ","a","kavāṭa","noun-adj","","a","kavāṭa"
"29","bheda","BHED","a","bheda","noun-adj","","a","bheda"
"30","janakam","JANAK","am","janaka","noun-adj","","am","janakam"
"31","siddhāsanam","SIDDHĀSAN","am","siddhāsana","","","am","siddhāsanam"
"32","procyate","PROC","yate","pravak","verb","pravac","yate","procyate"
"33","//","","","","punct","","","//"
"","</s>","","","","","","",""
"","<s number = ""9"">","","","","","","",""
"1","vāma","VĀM","a","vāma","noun-adj","","a","vāma"
"2","ūru","","","","ind","","",""
"3","upari","UPAR","i","upari","noun-adj","","i","upari"
"4","dakṣiṇam","DAKṢIṆ","am","dakṣiṇa","noun-adj","","am","dakṣiṇam"
"5","hi","","","hi","ind","","","hi"
"6","caraṇam","CARAṆ","am","caraṇa","noun-adj","","am","caraṇam"
"7","saṃsthāpya","SAṂSTHĀPY","a","saṃsthāpya","noun-adj","","a","saṃsthāpya"
"8","vāmam","VĀM","am","vāma","noun-adj","","am","vāmam"
"9","tathā","","","tathā","ind","","","tathā"
"10","dakṣa","DAKṢ","a","dakṣa","noun-adj","","a","dakṣa"
"11","ūru","","","","ind","","",""
"12","upari","UPAR","i","upari","noun-adj","","i","upari"
"13","paścimena","PAŚCIM","ena","paścima","noun-adj","","ena","paścimena"
"14","vidhinā","VIDH","inā","vidhi","noun-adj","","inā","vidhinā"
"15","dhṛtvā","DHṚTV","ā","dhṛtvā","noun-adj","","ā","dhṛtvā"
"16","karābhyām","KAR","ābhyām","kara","noun-adj","","ābhyām","karābhyām"
"17","dṛḍham","DṚḌH","am","dṛḍha","noun-adj","","am","dṛḍham"
"18","aṅguṣṭhau","AṄGUṢṬH","au","aṅguṣṭha","noun-adj","","au","aṅguṣṭhau"
"19","hṛdaye","HṚDAY","e","hṛdaya","noun-adj","","e","hṛdaye"
"20","nidhāya","NIDHĀY","a","nidhāya","noun-adj","","a","nidhāya"
"21","cibukam","CIBUK","am","cibuka","","","am","cibukam"
"22","nāsā","NĀS","ā","nāsā","noun-adj","","ā","nāsā"
"23","agram","AGR","am","agra","noun-adj","","am","agram"
"24","ālokayet","ĀLOK","ayet","ālok","verb","ālok","yet","ālokyet"
"25","etad","ETAD","","tad","pron","","","etad"
"26","vyādhi","VYĀDH","i","vyādhi","noun-adj","","i","vyādhi"
"27","vikāra","VIKĀR","a","vikāra","noun-adj","","a","vikāra"
"28","hāri","HĀR","i","hāri","noun-adj","","i","hāri"
"29","yaminām","YAM","inām","yamin","","","inām","yaminām"
"30","padmāsanam","PADMĀSAN","am","padmāsana","","","am","padmāsanam"
"31","procyate","PROC","yate","pravak","verb","pravac","yate","procyate"
"32","//","","","","punct","","","//"
"","</s>","","","","","","",""
"","<s number = ""10"">","","","","","","",""
"1","ādhāraḥ","ĀDHĀR","aḥ","ādhāra","noun-adj","","aḥ","ādhāraḥ"
"2","prathamam","PRATHAM","am","prathama","noun-adj","","am","prathamam"
"3","cakram","CAKR","am","cakra","noun-adj","","am","cakram"
"4","svādhiṣṭhānam","SVĀDHIṢṬHĀN","am","svādhiṣṭhāna","noun-adj","","am","svādhiṣṭhānam"
"5","dvitīyakam","DVITĪYAK","am","dvitīyaka","noun-adj","","am","dvitīyakam"
"6","yoni","YON","i","yoni","noun-adj","","i","yoni"
"7","sthānam","STHĀN","am","sthāna","noun-adj","","am","sthānam"
"8","dvayoḥ","DVAY","oḥ","dvayu","noun-adj","","oḥ","dvayoḥ"
"9","madhye","MADHY","e","madhya","noun-adj","","e","madhye"
"10","kāmarūpam","KĀMARŪP","am","kāmarūpa","noun-adj","","am","kāmarūpam"
"11","nigadyate","NIGAD","yate","nigad","verb","nigad","yate","nigadyate"
"12","//","","","","punct","","","//"
"","</s>","","","","","","",""
"","<s number = ""11"">","","","","","","",""
"1","ādhāra","ĀDHĀR","a","ādhāra","noun-adj","","a","ādhāra"
"2","ākhye","ĀKHY","e","ākhya","noun-adj","","e","ākhye"
"3","guda","GUD","a","guda","noun-adj","","a","guda"
"4","sthāne","STHĀN","e","sthāna","noun-adj","","e","sthāne"
"5","paṅkajam","PAṄKAJ","am","paṅkaja","noun-adj","","am","paṅkajam"
"6","yat","","","yad","pron","","","yad"
"7","catur","CAT","ur","catur","noun-adj","","ur","catur"
"8","dalam","DAL","am","dala","noun-adj","","am","dalam"
"9","tad","TAD","","tad","pron","","","tad"
"10","madhye","MADHY","e","madhya","noun-adj","","e","madhye"
"11","procyate","PROC","yate","pravak","verb","pravac","yate","procyate"
"12","yoniḥ","YON","iḥ","yoni","noun-adj","","iḥ","yoniḥ"
"13","kāma","KĀM","a","kāma","noun-adj","","a","kāma"
"14","ākhyā","ĀKHY","ā","ākhyā","noun-adj","","ā","ākhyā"
"15","siddha","SIDDH","a","siddha","noun-adj","","a","siddha"
"16","vanditā","VANDIT","ā","vandita","noun-adj","","ā","vanditā"
"17","//","","","","punct","","","//"
"","</s>","","","","","","",""
"","<s number = ""12"">","","","","","","",""
"1","yoni","YON","i","yoni","noun-adj","","i","yoni"
"2","madhye","MADHY","e","madhya","noun-adj","","e","madhye"
"3","mahā","MAH","ā","mahat","noun-adj","","ā","mahā"
"4","liṅgam","LIṄG","am","liṅga","noun-adj","","am","liṅgam"
"5","paścima","PAŚCIM","a","paścima","noun-adj","","a","paścima"
"6","abhimukham","ABHIMUKH","am","abhimukha","noun-adj","","am","abhimukham"
"7","sthitam","STHIT","am","sthita","noun-adj","","am","sthitam"
"8","mastake","MAST","ake","mastaka","noun-adj","","ake","mastake"
"9","maṇivat","MAṆIVAT","","maṇivat","noun-adj","","","maṇivat"
"10","bhinnam","BHINN","am","bhinna","noun-adj","","am","bhinnam"
"11","yaḥ","","","yad","pron","","","yad"
"12","jānāti","JĀN","āti","jān","verb","jñā","āti","jānāti"
"13","sa","","","tad","pron","","","tad"
"14","yoga","YOG","a","yoga","noun-adj","","a","yoga"
"15","vid","VID","","vid","noun-adj","","","vid"
"16","//","","","","punct","","","//"
"","</s>","","","","","","",""
"","<s number = ""13"">","","","","","","",""
"1","tapta","TAPT","a","tapta","noun-adj","","a","tapta"
"2","cāmīkara","CĀMĪKAR","a","cāmīkara","noun-adj","","a","cāmīkara"
"3","ābhāsam","ĀBHĀS","am","ābhāsa","noun-adj","","am","ābhāsam"
"4","taḍit","TAḌ","it","taḍita","noun-adj","","it","taḍit"
"5","lekhā","LEKH","ā","lekha","noun-adj","","āḥ","lekhāḥ"
"6","iva","","","iva","ind","","","iva"
"7","visphurat","VISPHUR","at","visphurat","noun-adj","","at","visphurat"
"8","catur","CAT","ur","catur","noun-adj","","ur","catur"
"9","asram","ASR","am","asra","noun-adj","","am","asram"
"10","puram","PUR","am","pura","noun-adj","","am","puram"
"11","vahneḥ","VAHN","eḥ","vahni","noun-adj","","eḥ","vahneḥ"
"12","adhas","ADH","as","adha","noun-adj","","aḥ","adhaḥ"
"13","meḍhram","MEḌHR","am","meḍhra","","","am","meḍhram"
"14","eva","","","eva","ind","","","eva"
"15","abhidhīyate","ABHIDHĪ","yate","abhidadh","verb","abhidhā","yate","abhidhīyate"
"16","//","","","","punct","","","//"
"","</s>","","","","","","",""
"","<s number = ""14"">","","","","","","",""
"1","sva","SV","a","sva","noun-adj","","a","sva"
"2","śabdena","ŚABD","ena","śabda","noun-adj","","ena","śabdena"
"3","bhavet","BHAV","et","bhav","verb","bhū","et","bhavet"
"4","prāṇaḥ","PRĀṆ","aḥ","prāṇa","noun-adj","","aḥ","prāṇaḥ"
"5","svādhiṣṭhānam","SVĀDHIṢṬHĀN","am","svādhiṣṭhāna","noun-adj","","am","svādhiṣṭhānam"
"6","tad","TAD","","tad","pron","","","tad"
"7","āśrayaḥ","ĀŚRAY","aḥ","āśraya","noun-adj","","aḥ","āśrayaḥ"
"8","svādhiṣṭhāna","SVĀDHIṢṬHĀN","a","svādhiṣṭhāna","noun-adj","","a","svādhiṣṭhāna"
"9","ākhyayā","ĀKHY","ayā","ākhyā","noun-adj","","ayā","ākhyayā"
"10","tasmāt","","","tad","pron","","","tad"
"11","meḍhram","MEḌHR","am","meḍhra","","","am","meḍhram"
"12","eva","","","eva","ind","","","eva"
"13","abhidhīyate","ABHIDHĪ","yate","abhidadh","verb","abhidhā","yate","abhidhīyate"
"14","//","","","","punct","","","//"
"","</s>","","","","","","",""
"","<s number = ""15"">","","","","","","",""
"1","tantunā","TANT","unā","tantu","noun-adj","","unā","tantunā"
"2","maṇivat","MAṆIVAT","","maṇivat","noun-adj","","","maṇivat"
"3","protaḥ","PROT","aḥ","prota","noun-adj","","aḥ","protaḥ"
"4","yatra","","","yatra","ind","","","yatra"
"5","kandaḥ","KAND","aḥ","kanda","","","aḥ","kandaḥ"
"6","suṣumṇayā","SUṢUMṆ","ayā","suṣumṇā","","","ayā","suṣumṇayā"
"7","tad","TAD","","tad","pron","","","tad"
"8","nābhi","NĀBH","i","nābhi","noun-adj","","i","nābhi"
"9","maṇḍalam","MAṆḌAL","am","maṇḍala","noun-adj","","am","maṇḍalam"
"10","cakram","CAKR","am","cakra","noun-adj","","am","cakram"
"11","procyate","PROC","yate","pravak","verb","pravac","yate","procyate"
"12","maṇipūrakam","MAṆIPŪRAK","am","maṇipūraka","","","am","maṇipūrakam"
"13","//","","","","punct","","","//"
"","</s>","","","","","","",""
"","<s number = ""16"">","","","","","","",""
"1","ūrdhvam","ŪRDHV","am","ūrdhva","noun-adj","","am","ūrdhvam"
"2","meḍhrāt","MEḌHR","āt","meḍhra","","","āt","meḍhrāt"
"3","adhas","ADH","as","adha","noun-adj","","aḥ","adhaḥ"
"4","nābheḥ","NĀBH","eḥ","nābhi","noun-adj","","eḥ","nābheḥ"
"5","kanda","KAND","a","kanda","noun-adj","","a","kanda"
"6","yoniḥ","YON","iḥ","yoni","noun-adj","","iḥ","yoniḥ"
"7","sva","SV","a","sva","noun-adj","","a","sva"
"8","gāṇḍavat","GĀṆḌ","avat","gāṇḍavat","","","avat","gāṇḍavat"
"9","tatra","","","tatra","ind","","","tatra"
"10","nāḍyaḥ","NĀḌY","aḥ","nāḍyā","noun-adj","","aḥ","nāḍyaḥ"
"11","samutpannāḥ","SAMUTPANN","āḥ","samutpanna","noun-adj","","āḥ","samutpannāḥ"
"12","sahasrāṇi","SAHASR","āṇi","sahasra","noun-adj","","āni","sahasrāni"
"13","dvisaptatiḥ","DVISAPTAT","iḥ","dvisaptati","","","iḥ","dvisaptatiḥ"
"14","//","","","","punct","","","//"
"","</s>","","","","","","",""
"","<s number = ""17"">","","","","","","",""
"1","teṣu","","","tad","pron","","","tad"
"2","nāḍi","NĀḌ","i","nāḍi","noun-adj","","i","nāḍi"
"3","sahasreṣu","SAHASR","eṣu","sahasra","noun-adj","","eṣu","sahasreṣu"
"4","dvisaptatiḥ","DVISAPTAT","iḥ","dvisaptati","","","iḥ","dvisaptatiḥ"
"5","udāhṛtāḥ","UDĀHṚT","āḥ","udāhṛta","noun-adj","","āḥ","udāhṛtāḥ"
"6","prādhānyāt","PRĀDHĀNY","āt","prādhānya","noun-adj","","āt","prādhānyāt"
"7","prāṇa","PRĀṆ","a","prāṇa","noun-adj","","a","prāṇa"
"8","vāhinyaḥ","VĀHIN","yaḥ","vāhin","noun-adj","","yaḥ","vāhinyaḥ"
"9","bhūyas","BHŪY","as","bhūyas","noun-adj","","aḥ","bhūyaḥ"
"10","tatra","","","tatra","ind","","","tatra"
"11","daśa","DAŚ","a","daśa","noun-adj","","a","daśa"
"12","smṛtāḥ","SMṚT","āḥ","smṛta","noun-adj","","āḥ","smṛtāḥ"
"13","//","","","","punct","","","//"
"","</s>","","","","","","",""
"","<s number = ""18"">","","","","","","",""
"1","iḍā","IḌ","ā","iḍā","","","ā","iḍā"
"2","ca","","","ca","ind","","","ca"
"3","piṅgalā","PIṄGAL","ā","piṅgala","noun-adj","","āḥ","piṅgalāḥ"
"4","ca","","","ca","ind","","","ca"
"5","eva","","","eva","ind","","","eva"
"6","suṣumṇā","SUṢUMṆ","ā","suṣumṇā","","","ā","suṣumṇā"
"7","ca","","","ca","ind","","","ca"
"8","tṛtīyakā","TṚTĪYAK","ā","tṛtīyaka","noun-adj","","āḥ","tṛtīyakāḥ"
"9","gāndhārī","GĀNDHĀR","ī","gāndhārī","noun-adj","","ī","gāndhārī"
"10","hastijihvā","HASTIJIHV","ā","hastijihvā","","","ā","hastijihvā"
"11","ca","","","ca","ind","","","ca"
"12","pūṣā","PŪṢ","ā","pūṣā","noun-adj","","ā","pūṣā"
"13","ca","","","ca","ind","","","ca"
"14","eva","","","eva","ind","","","eva"
"15","yaśasvinī","YAŚAS","vinī","yaśasa","noun-adj","","vinī","yaśasvinī"
"16","//","","","","punct","","","//"
"","</s>","","","","","","",""
"","<s number = ""19"">","","","","","","",""
"1","alambuṣā","ALAMBUṢ","ā","alambuṣā","","","ā","alambuṣā"
"2","kuhūḥ","KUH","ūḥ","kuhu","","","ūḥ","kuhūḥ"
"3","ca","","","ca","ind","","","ca"
"4","eva","","","eva","ind","","","eva"
"5","śaṅkhinī","ŚAṄKHIN","ī","śaṅkhin","noun-adj","","ī","śaṅkhinī"
"6","daśamī","DAŚAM","ī","daśamī","noun-adj","","ī","daśamī"
"7","smṛtā","SMṚT","ā","smṛta","noun-adj","","āḥ","smṛtāḥ"
"8","etat","ETAT","","tad","pron","","","etat"
"9","nāḍi","NĀḌ","i","nāḍi","noun-adj","","i","nāḍi"
"10","mayam","MAY","am","maya","noun-adj","","am","mayam"
"11","cakram","CAKR","am","cakra","noun-adj","","am","cakram"
"12","jñātavyam","JÑĀ","tavyam","jān","verb","jñā","tavyam","jñātavyam"
"13","yogibhiḥ","YOG","ibhiḥ","yogin","noun-adj","","ibhiḥ","yogibhiḥ"
"14","sadā","","","sada","ind","","","sada"
"15","//","","","","punct","","","//"
"","</s>","","","","","","",""
"","<s number = ""20"">","","","","","","",""
"1","iḍā","IḌ","ā","iḍā","","","ā","iḍā"
"2","vāme","VĀM","e","vāma","noun-adj","","e","vāme"
"3","sthitā","STHIT","ā","sthita","noun-adj","","āḥ","sthitāḥ"
"4","bhāge","BHĀG","e","bhāga","noun-adj","","e","bhāge"
"5","piṅgalā","PIṄGAL","ā","piṅgala","noun-adj","","āḥ","piṅgalāḥ"
"6","dakṣiṇe","DAKṢIṆ","e","dakṣiṇa","noun-adj","","e","dakṣiṇe"
"7","tathā","","","tathā","ind","","","tathā"
"8","suṣumṇā","SUṢUMṆ","ā","suṣumṇā","","","ā","suṣumṇā"
"9","madhyadeśe","MADHYADEŚ","e","madhyadeśa","noun-adj","","e","madhyadeśe"
"10","tu","","","tu","ind","","","tu"
"11","gāndhārī","GĀNDHĀR","ī","gāndhārī","noun-adj","","ī","gāndhārī"
"12","vāma","VĀM","a","vāma","noun-adj","","a","vāma"
"13","cakṣuṣi","CAKṢUṢ","i","cakṣuṣa","noun-adj","","i","cakṣuṣi"
"14","//","","","","punct","","","//"
"","</s>","","","","","","",""
"","<s number = ""21"">","","","","","","",""
"1","dakṣiṇe","DAKṢIṆ","e","dakṣiṇa","noun-adj","","e","dakṣiṇe"
"2","hastijihvā","HASTIJIHV","ā","hastijihvā","","","ā","hastijihvā"
"3","ca","","","ca","ind","","","ca"
"4","pūṣā","PŪṢ","ā","pūṣā","noun-adj","","ā","pūṣā"
"5","karṇe","KARṆ","e","karṇa","noun-adj","","e","karṇe"
"6","ca","","","ca","ind","","","ca"
"7","dakṣiṇe","DAKṢIṆ","e","dakṣiṇa","noun-adj","","e","dakṣiṇe"
"8","yaśasvinī","YAŚAS","vinī","yaśasa","noun-adj","","vinī","yaśasvinī"
"9","vāma","VĀM","a","vāma","noun-adj","","a","vāma"
"10","karṇe","KARṆ","e","karṇa","noun-adj","","e","karṇe"
"11","ca","","","ca","ind","","","ca"
"12","āsane","ĀSAN","e","āsana","noun-adj","","e","āsane"
"13","vā","","","vā","ind","","","vā"
"14","api","","","api","ind","","","api"
"15","alambuṣā","ALAMBUṢ","ā","alambuṣā","","","ā","alambuṣā"
"16","//","","","","punct","","","//"
"","</s>","","","","","","",""
"","<s number = ""22"">","","","","","","",""
"1","kūhuḥ","","","","","","",""
"2","ca","","","ca","ind","","","ca"
"3","liṅga","LIṄG","a","liṅga","noun-adj","","a","liṅga"
"4","deśe","DEŚ","e","deśa","noun-adj","","e","deśe"
"5","tu","","","tu","ind","","","tu"
"6","mūlasthāne","MŪLASTHĀN","e","mūlasthāna","","","e","mūlasthāne"
"7","ca","","","ca","ind","","","ca"
"8","śaṅkhinī","ŚAṄKHIN","ī","śaṅkhin","noun-adj","","ī","śaṅkhinī"
"9","evam","","","eva","ind","","","eva"
"10","dvāram","DVĀR","am","dvāra","noun-adj","","am","dvāram"
"11","upāśritya","UPĀŚRIT","ya","upāśray","verb","upāśri","ya","upāśritya"
"12","tiṣṭhanti","TIṢṬH","anti","tiṣṭh","verb","sthā","anti","tiṣṭhanti"
"13","daśa","DAŚ","a","daśa","noun-adj","","a","daśa"
"14","nāḍikāḥ","NĀḌIK","āḥ","nāḍika","noun-adj","","āḥ","nāḍikāḥ"
"15","//","","","","punct","","","//"
"","</s>","","","","","","",""
"","<s number = ""23"">","","","","","","",""
"1","satatam","SATAT","am","satata","noun-adj","","am","satatam"
"2","prāṇa","PRĀṆ","a","prāṇa","noun-adj","","a","prāṇa"
"3","vāhinyaḥ","VĀHIN","yaḥ","vāhin","noun-adj","","yaḥ","vāhinyaḥ"
"4","soma","SOM","a","soma","noun-adj","","a","soma"
"5","sūrya","SŪRY","a","sūrya","noun-adj","","a","sūrya"
"6","agni","AGN","i","agni","noun-adj","","i","agni"
"7","devatāḥ","DEVAT","āḥ","devatā","noun-adj","","āḥ","devatāḥ"
"8","iḍā","IḌ","ā","iḍā","","","ā","iḍā"
"9","piṅgalā","PIṄGAL","ā","piṅgala","noun-adj","","āḥ","piṅgalāḥ"
"10","suṣumṇā","SUṢUMṆ","ā","suṣumṇā","","","ā","suṣumṇā"
"11","ca","","","ca","ind","","","ca"
"12","tisraḥ","TISR","aḥ","tisrā","noun-adj","","aḥ","tisraḥ"
"13","nāḍyaḥ","NĀḌY","aḥ","nāḍyā","noun-adj","","aḥ","nāḍyaḥ"
"14","udāhṛtāḥ","UDĀHṚT","āḥ","udāhṛta","noun-adj","","āḥ","udāhṛtāḥ"
"15","//","","","","punct","","","//"
"","</s>","","","","","","",""
"","<s number = ""24"">","","","","","","",""
"1","prāṇa","PRĀṆ","a","prāṇa","noun-adj","","a","prāṇa"
"2","apānau","APĀN","au","apāna","noun-adj","","au","apānau"
"3","samānaḥ","SAMĀN","aḥ","samāna","noun-adj","","aḥ","samānaḥ"
"4","ca","","","ca","ind","","","ca"
"5","hi","","","hi","ind","","","hi"
"6","udānaḥ","UDĀN","aḥ","udāna","noun-adj","","aḥ","udānaḥ"
"7","vyānaḥ","VYĀN","aḥ","vyāna","noun-adj","","aḥ","vyānaḥ"
"8","eva","","","eva","ind","","","eva"
"9","ca","","","ca","ind","","","ca"
"10","nāgaḥ","NĀG","aḥ","nāga","noun-adj","","aḥ","nāgaḥ"
"11","kūrmaḥ","KŪRM","aḥ","kūrma","noun-adj","","aḥ","kūrmaḥ"
"12","ca","","","ca","ind","","","ca"
"13","kṛkaraḥ","KṚKAR","aḥ","kṛkara","","","aḥ","kṛkaraḥ"
"14","devadattaḥ","DEVADATT","aḥ","devadatta","noun-adj","","aḥ","devadattaḥ"
"15","dhanañjayaḥ","DHANAṂJ","aḥ","dhanaṃjaya","","","aḥ","dhanaṃjaḥ"
"16","//","","","","punct","","","//"
"","</s>","","","","","","",""
"","<s number = ""25"">","","","","","","",""
"1","nāga","NĀG","a","nāga","noun-adj","","a","nāga"
"2","ādyāḥ","ĀD","yāḥ","ādi","noun-adj","","yāḥ","ādyāḥ"
"3","pañca","PAÑC","a","pañca","noun-adj","","a","pañca"
"4","vikhyātāḥ","VIKHYĀT","āḥ","vikhyāta","noun-adj","","āḥ","vikhyātāḥ"
"5","prāṇa","PRĀṆ","a","prāṇa","noun-adj","","a","prāṇa"
"6","ādyāḥ","ĀD","yāḥ","ādi","noun-adj","","yāḥ","ādyāḥ"
"7","pañca","PAÑC","a","pañca","noun-adj","","a","pañca"
"8","vāyavaḥ","VĀYAV","aḥ","vāyava","noun-adj","","aḥ","vāyavaḥ"
"9","ete","","","tad","pron","","","tad"
"10","nāḍi","NĀḌ","i","nāḍi","noun-adj","","i","nāḍi"
"11","sahasreṣu","SAHASR","eṣu","sahasra","noun-adj","","eṣu","sahasreṣu"
"12","vartante","VART","ante","vart","verb","vṛt","ante","vartante"
"13","jīva","JĪV","a","jīva","noun-adj","","a","jīva"
"14","rūpiṇaḥ","RŪP","iṇaḥ","rūpin","noun-adj","","inaḥ","rūpinaḥ"
"15","//","","","","punct","","","//"
"","</s>","","","","","","",""
"","<s number = ""26"">","","","","","","",""
"1","prāṇa","PRĀṆ","a","prāṇa","noun-adj","","a","prāṇa"
"2","apāna","APĀN","a","apāna","noun-adj","","a","apāna"
"3","vaśaḥ","VAŚ","aḥ","vaśa","noun-adj","","aḥ","vaśaḥ"
"4","jīvaḥ","JĪV","aḥ","jīva","noun-adj","","aḥ","jīvaḥ"
"5","hi","","","hi","ind","","","hi"
"6","adhas","ADH","as","adha","noun-adj","","aḥ","adhaḥ"
"7","ca","","","ca","ind","","","ca"
"8","ūrdhvam","ŪRDHV","am","ūrdhva","noun-adj","","am","ūrdhvam"
"9","ca","","","ca","ind","","","ca"
"10","dhāvati","DHĀV","ati","dhāv","verb","","ati","dhāvati"
"11","vāma","VĀM","a","vāma","noun-adj","","a","vāma"
"12","dakṣiṇa","DAKṢIṆ","a","dakṣiṇa","noun-adj","","a","dakṣiṇa"
"13","mārgeṇa","MĀRG","eṇa","mārga","noun-adj","","ena","mārgena"
"14","cañcalatvāt","CAÑCAL","atvāt","cañcalatva","noun-adj","","atvāt","cañcalatvāt"
"15","na","","","na","ind","","","na"
"16","dṛśyate","DṚŚ","yate","darś","verb","dṛś","yate","dṛśyate"
"17","//","","","","punct","","","//"
"","</s>","","","","","","",""
"","<s number = ""27"">","","","","","","",""
"1","ākṣiptaḥ","ĀKṢIPT","aḥ","ākṣipta","noun-adj","","aḥ","ākṣiptaḥ"
"2","bhuvi","BHUV","i","bhuvi","noun-adj","","i","bhuvi"
"3","daṇḍena","DAṆḌ","ena","daṇḍa","noun-adj","","ena","daṇḍena"
"4","yathā","","","yathā","ind","","","yathā"
"5","uccalati","UCCAL","ati","uccal","verb","","ati","uccalati"
"6","kandukaḥ","KANDUK","aḥ","kanduka","noun-adj","","aḥ","kandukaḥ"
"7","prāṇa","PRĀṆ","a","prāṇa","noun-adj","","a","prāṇa"
"8","apāna","APĀN","a","apāna","noun-adj","","a","apāna"
"9","samākṣiptaḥ","SAMĀKṢIPT","aḥ","samākṣipta","","","aḥ","samākṣiptaḥ"
"10","tathā","","","tathā","ind","","","tathā"
"11","jīvaḥ","JĪV","aḥ","jīva","noun-adj","","aḥ","jīvaḥ"
"12","nu","","","nu","","","","nu"
"13","kṛṣyate","KṚṢ","yate","kṛṣ","verb","","yate","kṛṣyate"
"14","//","","","","punct","","","//"
"","</s>","","","","","","",""
"","<s number = ""28"">","","","","","","",""
"1","rajju","RAJJ","u","rajju","noun-adj","","u","rajju"
"2","baddhaḥ","BADDH","aḥ","baddha","noun-adj","","aḥ","baddhaḥ"
"3","yathā","","","yathā","ind","","","yathā"
"4","śyenaḥ","ŚYEN","aḥ","śyena","noun-adj","","aḥ","śyenaḥ"
"5","gataḥ","GAT","aḥ","gata","noun-adj","","aḥ","gataḥ"
"6","pi","","","api","ind","","","api"
"7","ākṛṣyate","ĀKṚṢ","yate","ākṛṣ","verb","","yate","ākṛṣyate"
"8","guṇa","GUṆ","a","guṇa","noun-adj","","a","guṇa"
"9","baddhaḥ","BADDH","aḥ","baddha","noun-adj","","aḥ","baddhaḥ"
"10","tathā","","","tathā","ind","","","tathā"
"11","jīvaḥ","JĪV","aḥ","jīva","noun-adj","","aḥ","jīvaḥ"
"12","prāṇa","PRĀṆ","a","prāṇa","noun-adj","","a","prāṇa"
"13","apānena","APĀN","ena","apāna","noun-adj","","ena","apānena"
"14","kṛṣyate","KṚṢ","yate","kṛṣ","verb","","yate","kṛṣyate"
"15","//","","","","punct","","","//"
"","</s>","","","","","","",""
"","<s number = ""29"">","","","","","","",""
"1","apānaḥ","APĀN","aḥ","apāna","noun-adj","","aḥ","apānaḥ"
"2","karṣati","KARṢ","ati","karṣ","verb","","ati","karṣati"
"3","prāṇaḥ","PRĀṆ","aḥ","prāṇa","noun-adj","","aḥ","prāṇaḥ"
"4","prāṇaḥ","PRĀṆ","aḥ","prāṇa","noun-adj","","aḥ","prāṇaḥ"
"5","pānam","PĀN","am","pāna","noun-adj","","am","pānam"
"6","ca","","","ca","ind","","","ca"
"7","karṣati","KARṢ","ati","karṣ","verb","","ati","karṣati"
"8","ūrdhva","ŪRDHV","a","ūrdhva","noun-adj","","a","ūrdhva"
"9","adhas","ADH","as","adha","noun-adj","","aḥ","adhaḥ"
"10","saṃsthitau","SAṂSTHIT","au","saṃsthita","noun-adj","","au","saṃsthitau"
"11","etau","","","tad","pron","","","tad"
"12","yaḥ","","","yad","pron","","","yad"
"13","jānāti","JĀN","āti","jān","verb","jñā","āti","jānāti"
"14","sa","","","tad","pron","","","tad"
"15","yoga","YOG","a","yoga","noun-adj","","a","yoga"
"16","vid","VID","","vid","noun-adj","","","vid"
"17","//","","","","punct","","","//"
"","</s>","","","","","","",""
"","<s number = ""30"">","","","","","","",""
"1","kanda","KAND","a","kanda","noun-adj","","a","kanda"
"2","ūrdhve","ŪRDHV","e","ūrdhva","noun-adj","","e","ūrdhve"
"3","kuṇḍalī","KUṆḌAL","ī","kuṇḍalin","noun-adj","","ī","kuṇḍalī"
"4","śaktiḥ","ŚAKT","iḥ","śakti","noun-adj","","iḥ","śaktiḥ"
"5","aṣṭadhā","AṢṬ","adhā","aṣṭa","noun-adj","","adhā","aṣṭadhā"
"6","kuṇḍalīkṛtā","KUṆḌALĪKṚT","ā","kuṇḍalīkṛta","","","āḥ","kuṇḍalīkṛtāḥ"
"7","brahmadvāra","BRAHMADVĀR","a","brahmadvāra","","","a","brahmadvāra"
"8","mukham","MUKH","am","mukha","noun-adj","","am","mukham"
"9","nityam","NITY","am","nitya","noun-adj","","am","nityam"
"10","mukhena","MUKH","ena","mukha","noun-adj","","ena","mukhena"
"11","āvṛtya","ĀVṚTY","a","āvṛtya","noun-adj","","a","āvṛtya"
"12","tiṣṭhati","TIṢṬH","ati","tiṣṭh","verb","sthā","ati","tiṣṭhati"
"13","//","","","","punct","","","//"
"","</s>","","","","","","",""
"","<s number = ""31"">","","","","","","",""
"1","prabuddhā","PRABUDDH","ā","prabuddha","noun-adj","","āḥ","prabuddhāḥ"
"2","vahni","VAHN","i","vahni","noun-adj","","i","vahni"
"3","yogena","YOG","ena","yoga","noun-adj","","ena","yogena"
"4","manasā","MAN","asā","manas","noun-adj","","asā","manasā"
"5","mārutā","MĀRUT","ā","māruta","noun-adj","","āḥ","mārutāḥ"
"6","hatā","HAT","ā","hata","noun-adj","","āḥ","hatāḥ"
"7","prajīva","PRAJĪV","a","prajīva","","","a","prajīva"
"8","guṇam","GUṆ","am","guṇa","noun-adj","","am","guṇam"
"9","ādāya","ĀDĀY","a","ādāya","noun-adj","","a","ādāya"
"10","vrajati","VRAJ","ati","vraj","verb","","ati","vrajati"
"11","ūrdhvam","ŪRDHV","am","ūrdhva","noun-adj","","am","ūrdhvam"
"12","suṣumṇayā","SUṢUMṆ","ayā","suṣumṇā","","","ayā","suṣumṇayā"
"13","//","","","","punct","","","//"
"","</s>","","","","","","",""
"","<s number = ""32"">","","","","","","",""
"1","mahāmudrām","MAHĀMUDR","ām","mahāmudrā","noun-adj","","ām","mahāmudrām"
"2","namaḥ","NAM","aḥ","namas","noun-adj","","aḥ","namaḥ"
"3","mudrām","MUDR","ām","mudrā","noun-adj","","ām","mudrām"
"4","uḍḍiyānam","UḌḌIYĀN","am","uḍḍiyāna","","","am","uḍḍiyānam"
"5","jalan","JAL","an","jalat","","","ān","jalān"
"6","dharam","DHAR","am","dhara","","","am","dharam"
"7","mūlabandham","MŪLABANDH","am","mūlabandha","","","am","mūlabandham"
"8","ca","","","ca","ind","","","ca"
"9","yaḥ","","","yad","pron","","","yad"
"10","vetti","VET","ti","vid","verb","vid","ti","vetti"
"11","sa","","","tad","pron","","","tad"
"12","yogī","YOG","ī","yogin","noun-adj","","ī","yogī"
"13","siddhi","SIDDH","i","siddhi","noun-adj","","i","siddhi"
"14","bhājanam","BHĀJAN","am","bhājana","noun-adj","","am","bhājanam"
"15","//","","","","punct","","","//"
"","</s>","","","","","","",""
"","<s number = ""33"">","","","","","","",""
"1","vakṣaḥ","VAKṢ","aḥ","vakṣas","noun-adj","","aḥ","vakṣaḥ"
"2","nyasta","NYAST","a","nyasta","noun-adj","","a","nyasta"
"3","hanuḥ","HAN","uḥ","hanu","noun-adj","","uḥ","hanuḥ"
"4","nipīḍya","NIPĪḌY","a","nipīḍya","noun-adj","","a","nipīḍya"
"5","su","","","su","ind","","","su"
"6","ciram","CIR","am","cira","noun-adj","","am","ciram"
"7","yonim","YON","im","yoni","noun-adj","","im","yonim"
"8","ca","","","ca","ind","","","ca"
"9","vāma","VĀM","a","vāma","noun-adj","","a","vāma"
"10","aṅghriṇā","AṄGHR","iṇā","aṅghri","","","inā","aṅghrinā"
"11","hastābhyām","HAST","ābhyām","hasta","noun-adj","","ābhyām","hastābhyām"
"12","avadhāritam","AVADHĀRIT","am","avadhārita","noun-adj","","am","avadhāritam"
"13","prasaritam","PRASAR","itam","prasarita","","","itam","prasaritam"
"14","pādam","PĀD","am","pāda","noun-adj","","am","pādam"
"15","tathā","","","tathā","ind","","","tathā"
"16","dakṣiṇam","DAKṢIṆ","am","dakṣiṇa","noun-adj","","am","dakṣiṇam"
"17","āpūrya","ĀPŪRY","a","āpūrya","noun-adj","","a","āpūrya"
"18","śvasanena","ŚVASAN","ena","śvasana","","","ena","śvasanena"
"19","kukṣi","KUKṢ","i","kukṣi","noun-adj","","i","kukṣi"
"20","yugalam","YUGAL","am","yugala","noun-adj","","am","yugalam"
"21","baddhvā","BADDHV","ā","baddhvā","noun-adj","","ā","baddhvā"
"22","śanais","ŚAN","ais","śani","noun-adj","","ais","śanais"
"23","recayet","RECAY","et","rec","verb","","et","recayet"
"24","eṣā","","","tad","pron","","","tad"
"25","pātaka","PĀTAK","a","pātaka","noun-adj","","a","pātaka"
"26","nāśinī","NĀŚ","inī","nāśin","noun-adj","","inī","nāśinī"
"27","su","","","su","ind","","","su"
"28","mahatī","MAHAT","ī","mahat","noun-adj","","ī","mahatī"
"29","mudrā","MUDR","ā","mudrā","noun-adj","","ā","mudrā"
"30","nṛṇām","NṚ","ṇām","anṛc","noun-adj","","ṇām","nṛṇām"
"31","procyate","PROC","yate","pravak","verb","pravac","yate","procyate"
"32","//","","","","punct","","","//"
"","</s>","","","","","","",""
"","<s number = ""34"">","","","","","","",""
"1","kapāla","KAPĀL","a","kapāla","noun-adj","","a","kapāla"
"2","kuhare","KUHAR","e","kuhara","noun-adj","","e","kuhare"
"3","jihvā","JIHV","ā","jihvā","noun-adj","","ā","jihvā"
"4","praviṣṭā","PRAVIṢṬ","ā","praviṣṭa","noun-adj","","āḥ","praviṣṭāḥ"
"5","viparīta","VIPARĪT","a","viparīta","noun-adj","","a","viparīta"
"6","gā","","","go","noun-adj","gā","","go"
"7","bhruvoḥ","BHRUV","oḥ","bhruva","noun-adj","","oḥ","bhruvoḥ"
"8","antargatā","ANTARGAT","ā","antargata","noun-adj","","āḥ","antargatāḥ"
"9","dṛṣṭiḥ","DṚṢṬ","iḥ","dṛṣṭi","noun-adj","","iḥ","dṛṣṭiḥ"
"10","mudrā","MUDR","ā","mudrā","noun-adj","","ā","mudrā"
"11","bhavati","BHAV","ati","bhav","verb","bhū","ati","bhavati"
"12","khecarī","KHECAR","ī","khecarī","noun-adj","","ī","khecarī"
"13","//","","","","punct","","","//"
"","</s>","","","","","","",""
"","<s number = ""35"">","","","","","","",""
"1","ūrdhvam","ŪRDHV","am","ūrdhva","noun-adj","","am","ūrdhvam"
"2","meḍhrāt","MEḌHR","āt","meḍhra","","","āt","meḍhrāt"
"3","adhas","ADH","as","adha","noun-adj","","aḥ","adhaḥ"
"4","nābheḥ","NĀBH","eḥ","nābhi","noun-adj","","eḥ","nābheḥ"
"5","uḍḍiyānam","UḌḌIYĀN","am","uḍḍiyāna","","","am","uḍḍiyānam"
"6","pracakṣate","PRACAKṢ","ate","pracakṣ","verb","pracakṣ","ate","pracakṣate"
"7","uḍḍiyāna","UḌḌIYĀN","a","uḍḍiyāna","","","a","uḍḍiyāna"
"8","jayaḥ","JAY","aḥ","jaya","noun-adj","","aḥ","jayaḥ"
"9","bandho","BANDH","o","bandha","noun-adj","","aḥ","bandhaḥ"
"10","mṛtyu","MṚTY","u","mṛtyu","noun-adj","","u","mṛtyu"
"11","mātaṅga","MĀTAṂG","a","mātaṃga","noun-adj","","a","mātaṃga"
"12","kesarī","KESAR","ī","kesarin","noun-adj","","ī","kesarī"
"13","//","","","","punct","","","//"
"","</s>","","","","","","",""
"","<s number = ""36"">","","","","","","",""
"1","jālandhare","JĀLANDHAR","e","jālandhara","noun-adj","","e","jālandhare"
"2","kṛte","KṚT","e","kṛta","noun-adj","","e","kṛte"
"3","bandhe","BANDH","e","bandha","noun-adj","","e","bandhe"
"4","kaṇṭha","KAṆṬH","a","kaṇṭha","noun-adj","","a","kaṇṭha"
"5","saṅkoca","SAṂKOC","a","saṃkoca","noun-adj","","a","saṃkoca"
"6","lakṣaṇe","LAKṢAṆ","e","lakṣaṇa","noun-adj","","e","lakṣaṇe"
"7","na","","","na","ind","","","na"
"8","pīyūṣam","PĪYŪṢ","am","pīyūṣa","noun-adj","","am","pīyūṣam"
"9","patati","PAT","ati","pat","verb","pat","ati","patati"
"10","agnau","AGN","au","agni","noun-adj","","au","agnau"
"11","na","","","na","ind","","","na"
"12","ca","","","ca","ind","","","ca"
"13","vāyuḥ","VĀY","uḥ","vāyu","noun-adj","","uḥ","vāyuḥ"
"14","prakupyati","PRAKUP","yati","prakup","verb","prakup","yati","prakupyati"
"15","//","","","","punct","","","//"
"","</s>","","","","","","",""
"","<s number = ""37"">","","","","","","",""
"1","pārṣṇi","PĀRṢṆ","i","pārṣṇi","noun-adj","","i","pārṣṇi"
"2","bhāgena","BHĀG","ena","bhāga","noun-adj","","ena","bhāgena"
"3","sampīḍya","SAMPĪḌY","a","saṃpīḍya","","","a","sampīḍya"
"4","yonim","YON","im","yoni","noun-adj","","im","yonim"
"5","ākuñcayet","ĀKUÑC","ayet","ākuñc","verb","","yet","ākuñcyet"
"6","gudam","GUD","am","guda","","","am","gudam"
"7","apānam","APĀN","am","apāna","noun-adj","","am","apānam"
"8","ūrdhvam","ŪRDHV","am","ūrdhva","noun-adj","","am","ūrdhvam"
"9","ākṛṣya","ĀKṚṢ","ya","ākṛṣ","verb","","ya","ākṛṣya"
"10","mūlabandhaḥ","MŪLABANDH","aḥ","mūlabandha","","","aḥ","mūlabandhaḥ"
"11","nigadyate","NIGAD","yate","nigad","verb","nigad","yate","nigadyate"
"12","//","","","","punct","","","//"
"","</s>","","","","","","",""
"","<s number = ""38"">","","","","","","",""
"1","yatas","","","yatas","ind","","","yatas"
"2","kāla","KĀL","a","kāla","noun-adj","","a","kāla"
"3","bhayāt","BHAY","āt","bhaya","noun-adj","","āt","bhayāt"
"4","brahmā","BRAHM","ā","brahman","noun-adj","","ā","brahmā"
"5","prāṇāyāma","PRĀṆĀYĀM","a","prāṇāyāma","noun-adj","","a","prāṇāyāma"
"6","parāyaṇaḥ","PARĀYAṆ","aḥ","parāyaṇa","noun-adj","","aḥ","parāyaṇaḥ"
"7","yoginaḥ","YOG","inaḥ","yogin","noun-adj","","inaḥ","yoginaḥ"
"8","munayaḥ","MUN","ayaḥ","muni","noun-adj","","ayaḥ","munayaḥ"
"9","ca","","","ca","ind","","","ca"
"10","eva","","","eva","ind","","","eva"
"11","tatas","","","tatas","ind","","","tatas"
"12","prāṇam","PRĀṆ","am","prāṇa","noun-adj","","am","prāṇam"
"13","nibandhayet","NIBANDH","ayet","nibandh","verb","nibandh","yet","nibandhyet"
"14","//","","","","punct","","","//"
"","</s>","","","","","","",""
"","<s number = ""39"">","","","","","","",""
"1","cale","CAL","e","cala","noun-adj","","e","cale"
"2","vāte","","","vāta","ind","","","vāta"
"3","calam","CAL","am","cala","noun-adj","","am","calam"
"4","sarvam","SARV","am","sarva","noun-adj","","am","sarvam"
"5","niścale","NIŚCAL","e","niścala","noun-adj","","e","niścale"
"6","niścalam","NIŚCAL","am","niścala","noun-adj","","am","niścalam"
"7","bhavet","BHAV","et","bhav","verb","bhū","et","bhavet"
"8","yogī","YOG","ī","yogin","noun-adj","","ī","yogī"
"9","sthāṇu","STHĀṆ","u","sthāṇu","noun-adj","","u","sthāṇu"
"10","tvam","","","tvat","pron","","","tvat"
"11","āpnoti","APN","oti","āpn","verb","āp","ati","apnati"
"12","tatas","","","tatas","ind","","","tatas"
"13","vāyum","VĀY","um","vāyu","noun-adj","","um","vāyum"
"14","nibandhayet","NIBANDH","ayet","nibandh","verb","nibandh","yet","nibandhyet"
"15","//","","","","punct","","","//"
"","</s>","","","","","","",""
"","<s number = ""40"">","","","","","","",""
"1","ṣaṭ","ṢAṬ","","ṣaṭ","","","","ṣaṭ"
"2","triṃśat","TRIṂŚ","at","triṃśat","","","at","triṃśat"
"3","aṅgulam","AṄGUL","am","aṅgula","noun-adj","","am","aṅgulam"
"4","haṃsaḥ","HAṂS","aḥ","haṃsa","noun-adj","","aḥ","haṃsaḥ"
"5","prayāṇam","PRAYĀṆ","am","prayāṇa","noun-adj","","am","prayāṇam"
"6","kurute","KUR","ute","kar","verb","kṛ","ute","kurute"
"7","bahis","BAH","is","bahis","noun-adj","","is","bahis"
"8","vāma","VĀM","a","vāma","noun-adj","","a","vāma"
"9","dakṣiṇa","DAKṢIṆ","a","dakṣiṇa","noun-adj","","a","dakṣiṇa"
"10","mārgeṇa","MĀRG","eṇa","mārga","noun-adj","","ena","mārgena"
"11","tatas","","","tatas","ind","","","tatas"
"12","prāṇaḥ","PRĀṆ","aḥ","prāṇa","noun-adj","","aḥ","prāṇaḥ"
"13","bhidhīyate","BHIDHĪ","yate","abhidadh","verb","abhidhā","yate","bhidhīyate"
"14","//","","","","punct","","","//"
"","</s>","","","","","","",""
"","<s number = ""41"">","","","","","","",""
"1","baddha","BADDH","a","baddha","noun-adj","","a","baddha"
"2","padmāsanaḥ","PADMĀSAN","aḥ","padmāsana","","","aḥ","padmāsanaḥ"
"3","yogī","YOG","ī","yogin","noun-adj","","ī","yogī"
"4","namaskṛtya","NAMASKṚT","ya","namaskar","verb","namaskṛ","ya","namaskṛtya"
"5","gurum","GURUM","","gurumat","noun-adj","","","gurum"
"6","śivam","ŚIV","am","śiva","noun-adj","","am","śivam"
"7","nāsā","NĀS","ā","nāsā","noun-adj","","ā","nāsā"
"8","agra","AGR","a","agra","noun-adj","","a","agra"
"9","dṛṣṭiḥ","DṚṢṬ","iḥ","dṛṣṭi","noun-adj","","iḥ","dṛṣṭiḥ"
"10","ekākī","EKĀK","ī","ekākin","noun-adj","","ī","ekākī"
"11","prāṇāyāmam","PRĀṆĀYĀM","am","prāṇāyāma","noun-adj","","am","prāṇāyāmam"
"12","samabhyaset","SAMABHYAS","et","samabhyas","verb","","et","samabhyaset"
"13","//","","","","punct","","","//"
"","</s>","","","","","","",""
"","<s number = ""42"">","","","","","","",""
"1","prāṇaḥ","PRĀṆ","aḥ","prāṇa","noun-adj","","aḥ","prāṇaḥ"
"2","deha","DEH","a","deha","noun-adj","","a","deha"
"3","sthitaḥ","STHIT","aḥ","sthita","noun-adj","","aḥ","sthitaḥ"
"4","vāyuḥ","VĀY","uḥ","vāyu","noun-adj","","uḥ","vāyuḥ"
"5","āyāmaḥ","ĀYĀM","aḥ","āyāma","noun-adj","","aḥ","āyāmaḥ"
"6","tad","TAD","","tad","pron","","","tad"
"7","nibandhanam","NIBANDHAN","am","nibandhana","noun-adj","","am","nibandhanam"
"8","eka","EK","a","eka","noun-adj","","a","eka"
"9","śvāsa","ŚVĀS","a","śvāsa","noun-adj","","a","śvāsa"
"10","mayī","MAY","ī","mayī","noun-adj","","ī","mayī"
"11","mātrā","MĀTR","ā","mātra","noun-adj","","āḥ","mātrāḥ"
"12","tat","TAT","","tad","pron","","","tat"
"13","yogī","YOG","ī","yogin","noun-adj","","ī","yogī"
"14","gaganāyate","GAGANĀY","ate","gaganā","verb","","ate","gaganāyate"
"15","//","","","","punct","","","//"
"","</s>","","","","","","",""
"","<s number = ""43"">","","","","","","",""
"1","baddha","BADDH","a","baddha","noun-adj","","a","baddha"
"2","padmāsanaḥ","PADMĀSAN","aḥ","padmāsana","","","aḥ","padmāsanaḥ"
"3","yogī","YOG","ī","yogin","noun-adj","","ī","yogī"
"4","prāṇam","PRĀṆ","am","prāṇa","noun-adj","","am","prāṇam"
"5","candreṇa","CANDR","eṇa","candra","noun-adj","","ena","candrena"
"6","pūrayet","PŪRAY","et","pṛ","verb","pṛ","et","pūrayet"
"7","dhārayitvā","DHĀRAY","itvā","dhar","verb","dhṛ","tvā","dhāraytvā"
"8","yathāśakti","YATHĀŚAKT","i","yathāśakti","noun-adj","","i","yathāśakti"
"9","bhūyas","BHŪY","as","bhūyas","noun-adj","","aḥ","bhūyaḥ"
"10","sūryeṇa","SŪRY","eṇa","sūrya","noun-adj","","ena","sūryena"
"11","recayet","RECAY","et","rec","verb","","et","recayet"
"12","//","","","","punct","","","//"
"","</s>","","","","","","",""
"","<s number = ""44"">","","","","","","",""
"1","amṛta","AMṚT","a","amṛta","noun-adj","","a","amṛta"
"2","udadhi","UDADH","i","udadhi","noun-adj","","i","udadhi"
"3","saṅkāśam","SAṂKĀŚ","am","saṃkāśa","noun-adj","","am","saṃkāśam"
"4","kṣīroda","KṢĪROD","a","kṣīroda","noun-adj","","a","kṣīroda"
"5","dhavala","DHAVAL","a","dhavala","noun-adj","","a","dhavala"
"6","prabham","PRABH","am","prabha","noun-adj","","am","prabham"
"7","dhyātvā","DHYĀTV","ā","dhyāy","verb","dhyai","ā","dhyātvā"
"8","candra","CANDR","a","candra","noun-adj","","a","candra"
"9","mayam","MAY","am","maya","noun-adj","","am","mayam"
"10","bimbam","BIMBA","m","bimba","noun-adj","","m","bimbam"
"11","prāṇāyāme","PRĀṆĀYĀM","e","prāṇāyāma","noun-adj","","e","prāṇāyāme"
"12","sukhī","SUKH","ī","sukhī","noun-adj","","ī","sukhī"
"13","bhavet","BHAV","et","bhav","verb","bhū","et","bhavet"
"14","//","","","","punct","","","//"
"","</s>","","","","","","",""
"","<s number = ""45"">","","","","","","",""
"1","prāṇam","PRĀṆ","am","prāṇa","noun-adj","","am","prāṇam"
"2","sūryeṇa","SŪRY","eṇa","sūrya","noun-adj","","ena","sūryena"
"3","ca","","","ca","ind","","","ca"
"4","ākṛṣya","ĀKṚṢ","ya","ākṛṣ","verb","","ya","ākṛṣya"
"5","pūrayet","PŪRAY","et","pṛ","verb","pṛ","et","pūrayet"
"6","udaram","UDAR","am","udara","noun-adj","","am","udaram"
"7","śanais","ŚAN","ais","śani","noun-adj","","ais","śanais"
"8","kumbhayitvā","KUMBHA","ayitvā","kumbha","","","tvā","kumbhatvā"
"9","vidhānena","VIDHĀN","ena","vidhāna","noun-adj","","ena","vidhānena"
"10","bhūyas","BHŪY","as","bhūyas","noun-adj","","aḥ","bhūyaḥ"
"11","candreṇa","CANDR","eṇa","candra","noun-adj","","ena","candrena"
"12","recayet","RECAY","et","rec","verb","","et","recayet"
"13","//","","","","punct","","","//"
"","</s>","","","","","","",""
"","<s number = ""46"">","","","","","","",""
"1","prajvalat","PRAJVAL","at","prajval","noun-adj","","at","prajvalat"
"2","jvalana","JVALAN","a","jvalana","noun-adj","","a","jvalana"
"3","jvālā","JVĀL","ā","jvālā","noun-adj","","ā","jvālā"
"4","puñjam","PUÑJ","am","puñja","noun-adj","","am","puñjam"
"5","āditya","ĀDITY","a","āditya","noun-adj","","a","āditya"
"6","maṇḍalam","MAṆḌAL","am","maṇḍala","noun-adj","","am","maṇḍalam"
"7","dhyātvā","DHYĀTV","ā","dhyāy","verb","dhyai","ā","dhyātvā"
"8","nābhi","NĀBH","i","nābhi","noun-adj","","i","nābhi"
"9","sthitam","STHIT","am","sthita","noun-adj","","am","sthitam"
"10","yogī","YOG","ī","yogin","noun-adj","","ī","yogī"
"11","prāṇāyāme","PRĀṆĀYĀM","e","prāṇāyāma","noun-adj","","e","prāṇāyāme"
"12","sukhī","SUKH","ī","sukhī","noun-adj","","ī","sukhī"
"13","bhavet","BHAV","et","bhav","verb","bhū","et","bhavet"
"14","//","","","","punct","","","//"
"","</s>","","","","","","",""
"","<s number = ""47"">","","","","","","",""
"1","recakaḥ","RECAK","aḥ","recaka","noun-adj","","aḥ","recakaḥ"
"2","pūrakaḥ","PŪRAK","aḥ","pūraka","noun-adj","","aḥ","pūrakaḥ"
"3","ca","","","ca","ind","","","ca"
"4","eva","","","eva","ind","","","eva"
"5","kumbhakaḥ","KUMBHAK","aḥ","kumbhaka","","","aḥ","kumbhakaḥ"
"6","praṇava","PRAṆAV","a","praṇava","noun-adj","","a","praṇava"
"7","ātmakaḥ","ĀTM","akaḥ","ātmaka","noun-adj","","akaḥ","ātmakaḥ"
"8","prāṇāyāmaḥ","PRĀṆĀYĀM","aḥ","prāṇāyāma","noun-adj","","aḥ","prāṇāyāmaḥ"
"9","bhavet","BHAV","et","bhav","verb","bhū","et","bhavet"
"10","tredhā","TREDH","ā","tredhā","noun-adj","","ā","tredhā"
"11","mātrā","MĀTR","ā","mātra","noun-adj","","āḥ","mātrāḥ"
"12","dvādaśa","DVĀDAŚ","a","dvādaśa","noun-adj","","a","dvādaśa"
"13","saṃyutaḥ","SAṂYUT","aḥ","saṃyuta","noun-adj","","aḥ","saṃyutaḥ"
"14","//","","","","punct","","","//"
"","</s>","","","","","","",""
"","<s number = ""48"">","","","","","","",""
"1","dvādaśa","DVĀDAŚ","a","dvādaśa","noun-adj","","a","dvādaśa"
"2","adha","","","","","","",""
"3","make","MAK","e","maka","","","e","make"
"4","mātrā","MĀTR","ā","mātra","noun-adj","","āḥ","mātrāḥ"
"5","madhyame","MADHYAM","e","madhyama","noun-adj","","e","madhyame"
"6","dviguṇāḥ","DVIGUṆ","āḥ","dviguṇa","noun-adj","","āḥ","dviguṇāḥ"
"7","tatas","","","tatas","ind","","","tatas"
"8","uttame","UTTAM","e","uttama","noun-adj","","e","uttame"
"9","triguṇāḥ","TRIGUṆ","āḥ","triguṇa","","","āḥ","triguṇāḥ"
"10","mātrāḥ","MĀTR","āḥ","mātra","noun-adj","","āḥ","mātrāḥ"
"11","prāṇāyāmasya","PRĀṆĀYĀM","asya","prāṇāyāma","noun-adj","","asya","prāṇāyāmasya"
"12","nirṇayaḥ","NIRṆAY","aḥ","nirṇaya","noun-adj","","aḥ","nirṇayaḥ"
"13","//","","","","punct","","","//"
"","</s>","","","","","","",""
"","<s number = ""49"">","","","","","","",""
"1","a","","","alpha_privativum","ind","","","alpha_privativum"
"2","dhame","DHAM","e","dhama","noun-adj","","e","dhame"
"3","ca","","","ca","ind","","","ca"
"4","ghanaḥ","GHAN","aḥ","ghana","noun-adj","","aḥ","ghanaḥ"
"5","gharmaḥ","GHARM","aḥ","gharma","noun-adj","","aḥ","gharmaḥ"
"6","kampaḥ","KAMPA","ḥ","kampa","noun-adj","","ḥ","kampaḥ"
"7","bhavati","BHAV","ati","bhav","verb","bhū","ati","bhavati"
"8","madhyame","MADHYAM","e","madhyama","noun-adj","","e","madhyame"
"9","uttiṣṭhati","UTTIṢṬH","ati","uttiṣṭh","verb","utsthā","ati","uttiṣṭhati"
"10","uttame","UTTAM","e","uttama","noun-adj","","e","uttame"
"11","yogī","YOG","ī","yogin","noun-adj","","ī","yogī"
"12","baddha","BADDH","a","baddha","noun-adj","","a","baddha"
"13","padmāsanaḥ","PADMĀSAN","aḥ","padmāsana","","","aḥ","padmāsanaḥ"
"14","muhur","MUH","ur","muhu","noun-adj","","ur","muhur"
"15","//","","","","punct","","","//"
"","</s>","","","","","","",""
"","<s number = ""50"">","","","","","","",""
"1","aṅgānām","AṄG","ānām","aṅga","noun-adj","","ānām","aṅgānām"
"2","mardanam","MARDAN","am","mardana","noun-adj","","am","mardanam"
"3","śastam","ŚAST","am","śasta","noun-adj","","am","śastam"
"4","śrama","ŚRAM","a","śrama","noun-adj","","a","śrama"
"5","saṃjāta","SAṂJĀT","a","saṃjāta","noun-adj","","a","saṃjāta"
"6","vāriṇā","VĀR","iṇā","vāra","noun-adj","","inā","vārinā"
"7","kaṭu","KAṬ","u","kaṭu","noun-adj","","u","kaṭu"
"8","amla","AMLA","","amla","noun-adj","","","amla"
"9","lavaṇa","LAVAṆ","a","lavaṇa","noun-adj","","a","lavaṇa"
"10","tyāgī","TYĀG","ī","tyāgin","noun-adj","","ī","tyāgī"
"11","kṣīra","KṢĪR","a","kṣīra","noun-adj","","a","kṣīra"
"12","bhojanam","BHOJAN","am","bhojana","noun-adj","","am","bhojanam"
"13","ācaret","ĀCAR","et","ācar","verb","ācar","et","ācaret"
"14","//","","","","punct","","","//"
"","</s>","","","","","","",""
"","<s number = ""51"">","","","","","","",""
"1","mandam","MAND","am","manda","noun-adj","","am","mandam"
"2","mandam","MAND","am","manda","noun-adj","","am","mandam"
"3","pibet","PIB","et","pib","verb","pā","et","pibet"
"4","vāyum","VĀY","um","vāyu","noun-adj","","um","vāyum"
"5","mandam","MAND","am","manda","noun-adj","","am","mandam"
"6","mandam","MAND","am","manda","noun-adj","","am","mandam"
"7","viyojayet","VIYOJAY","et","viyuj","verb","viyuj","et","viyojayet"
"8","na","","","na","ind","","","na"
"9","adhikam","ADHIK","am","adhika","noun-adj","","am","adhikam"
"10","stambhayet","STAMBH","et","stambh","verb","","et","stambhet"
"11","vāyum","VĀY","um","vāyu","noun-adj","","um","vāyum"
"12","na","","","na","ind","","","na"
"13","ca","","","ca","ind","","","ca"
"14","śīghram","ŚĪGHR","am","śīghra","noun-adj","","am","śīghram"
"15","vimocayet","VIMOCAY","et","vimuñc","verb","vimuc","et","vimocayet"
"16","//","","","","punct","","","//"
"","</s>","","","","","","",""
"","<s number = ""52"">","","","","","","",""
"1","ūrdhvam","ŪRDHV","am","ūrdhva","noun-adj","","am","ūrdhvam"
"2","ākṛṣya","ĀKṚṢ","ya","ākṛṣ","verb","","ya","ākṛṣya"
"3","ca","","","ca","ind","","","ca"
"4","apānam","APĀN","am","apāna","noun-adj","","am","apānam"
"5","vātam","VĀT","am","vāta","noun-adj","","am","vātam"
"6","prāṇe","PRĀṆ","e","prāṇa","noun-adj","","e","prāṇe"
"7","niyojayet","NIYOJAY","et","niyuj","verb","niyuj","et","niyojayet"
"8","mūrdhānam","MŪRDH","ānam","mūrdha","noun-adj","","ānam","mūrdhānam"
"9","nīyate","NĪ","yate","nay","verb","nī","yate","nīyate"
"10","śaktyā","ŚAKT","yā","śakti","noun-adj","","yāḥ","śaktyāḥ"
"11","sarva","SARV","a","sarva","noun-adj","","a","sarva"
"12","pāpaiḥ","PĀP","aiḥ","pāpa","noun-adj","","air","pāpair"
"13","pramucyate","PRAMUC","yate","pramuñc","verb","pramuc","yate","pramucyate"
"14","//","","","","punct","","","//"
"","</s>","","","","","","",""
"","<s number = ""53"">","","","","","","",""
"1","prāṇāyāmaḥ","PRĀṆĀYĀM","aḥ","prāṇāyāma","noun-adj","","aḥ","prāṇāyāmaḥ"
"2","bhavati","BHAV","ati","bhav","verb","bhū","ati","bhavati"
"3","evam","","","eva","ind","","","eva"
"4","pātaka","PĀTAK","a","pātaka","noun-adj","","a","pātaka"
"5","indhana","INDHAN","a","indhana","noun-adj","","a","indhana"
"6","pātakaḥ","PĀTAK","aḥ","pātaka","noun-adj","","aḥ","pātakaḥ"
"7","enā","","","","ind","","",""
"8","umbudhimahā","UMBĪ","udhimahā","umbī","","","udhimahā","umbīudhimahā"
"9","setuḥ","SET","uḥ","setu","noun-adj","","uḥ","setuḥ"
"10","procyate","PROC","yate","pravak","verb","pravac","yate","procyate"
"11","yogibhiḥ","YOG","ibhiḥ","yogin","noun-adj","","ibhiḥ","yogibhiḥ"
"12","sadā","","","sada","ind","","","sada"
"13","//","","","","punct","","","//"
"","</s>","","","","","","",""
"","<s number = ""54"">","","","","","","",""
"1","āsanena","ĀSAN","ena","āsana","noun-adj","","ena","āsanena"
"2","rujaḥ","RUJ","aḥ","ruja","noun-adj","","aḥ","rujaḥ"
"3","hanti","HAN","ti","han","verb","han","ti","hanti"
"4","prāṇāyāmena","PRĀṆĀYĀM","ena","prāṇāyāma","noun-adj","","ena","prāṇāyāmena"
"5","pātakam","PĀTAK","am","pātaka","noun-adj","","am","pātakam"
"6","vikāram","VIKĀR","am","vikāra","noun-adj","","am","vikāram"
"7","mānasam","MĀNAS","am","mānasa","noun-adj","","am","mānasam"
"8","yogī","YOG","ī","yogin","noun-adj","","ī","yogī"
"9","pratyāhāreṇa","PRATYĀHĀR","eṇa","pratyāhāra","noun-adj","","ena","pratyāhārena"
"10","sarvadā","SARVAD","ā","sarvada","ind","","ā","sarvadā"
"11","//","","","","punct","","","//"
"","</s>","","","","","","",""
"","<s number = ""55"">","","","","","","",""
"1","candra","CANDR","a","candra","noun-adj","","a","candra"
"2","amṛta","AMṚT","a","amṛta","noun-adj","","a","amṛta"
"3","mayīm","MAY","īm","mayī","noun-adj","","īm","mayīm"
"4","dhārām","DHĀR","ām","dhārā","noun-adj","","ām","dhārām"
"5","pratyāhārati","PRATYĀHĀR","ati","pratyāhār","verb","","ati","pratyāhārati"
"6","bhāskaraḥ","BHĀSKAR","aḥ","bhāskara","noun-adj","","aḥ","bhāskaraḥ"
"7","tad","TAD","","tad","pron","","","tad"
"8","pratyāharaṇam","PRATYĀHARAṆ","am","pratyāharaṇa","","","am","pratyāharaṇam"
"9","tasya","","","tad","pron","","","tad"
"10","pratyāhāraḥ","PRATYĀHĀR","aḥ","pratyāhāra","noun-adj","","aḥ","pratyāhāraḥ"
"11","saḥ","","","tad","pron","","","tad"
"12","ucyate","UC","yate","vak","verb","vac","yate","ucyate"
"13","//","","","","punct","","","//"
"","</s>","","","","","","",""
"","<s number = ""56"">","","","","","","",""
"1","ekā","EK","ā","eka","noun-adj","","āḥ","ekāḥ"
"2","strī","STR","ī","strī","noun-adj","","ī","strī"
"3","bhujyate","BHUJ","yate","bhuj","verb","bhuj","yate","bhujyate"
"4","dvābhyām","DV","ābhyām","dva","noun-adj","","ābhyām","dvābhyām"
"5","āgatā","ĀGAT","ā","āgata","noun-adj","","āḥ","āgatāḥ"
"6","soma","SOM","a","soma","noun-adj","","a","soma"
"7","maṇḍalāt","MAṆḌAL","āt","maṇḍala","noun-adj","","āt","maṇḍalāt"
"8","tṛtīyaḥ","TṚTĪY","aḥ","tṛtīya","noun-adj","","aḥ","tṛtīyaḥ"
"9","yaḥ","","","yad","pron","","","yad"
"10","bhavet","BHAV","et","bhav","verb","bhū","et","bhavet"
"11","tābhyām","","","tad","pron","","","tad"
"12","sa","","","tad","pron","","","tad"
"13","bhavati","BHAV","ati","bhav","verb","bhū","ati","bhavati"
"14","a","","","alpha_privativum","ind","","","alpha_privativum"
"15","jara","JAR","a","jara","noun-adj","","a","jara"
"16","a","","","alpha_privativum","ind","","","alpha_privativum"
"17","maraḥ","MAR","aḥ","mara","noun-adj","","aḥ","maraḥ"
"18","//","","","","punct","","","//"
"","</s>","","","","","","",""
"","<s number = ""57"">","","","","","","",""
"1","nābhi","NĀBH","i","nābhi","noun-adj","","i","nābhi"
"2","deśe","DEŚ","e","deśa","noun-adj","","e","deśe"
"3","bhavati","BHAV","ati","bhav","verb","bhū","ati","bhavati"
"4","ekaḥ","EK","aḥ","eka","noun-adj","","aḥ","ekaḥ"
"5","bhāskaraḥ","BHĀSKAR","aḥ","bhāskara","noun-adj","","aḥ","bhāskaraḥ"
"6","dahana","DAHAN","a","dahana","noun-adj","","a","dahana"
"7","ātmakaḥ","ĀTM","akaḥ","ātmaka","noun-adj","","akaḥ","ātmakaḥ"
"8","amṛta","AMṚT","a","amṛta","noun-adj","","a","amṛta"
"9","ātmā","ĀTM","ā","ātman","noun-adj","","ā","ātmā"
"10","sthitaḥ","STHIT","aḥ","sthita","noun-adj","","aḥ","sthitaḥ"
"11","nityam","NITY","am","nitya","noun-adj","","am","nityam"
"12","tālu","TĀL","u","tālu","noun-adj","","u","tālu"
"13","mūle","MŪL","e","mūla","noun-adj","","e","mūle"
"14","ca","","","ca","ind","","","ca"
"15","candramāḥ","CANDRAM","āḥ","candramā","noun-adj","","āḥ","candramāḥ"
"16","//","","","","punct","","","//"
"","</s>","","","","","","",""
"","<s number = ""58"">","","","","","","",""
"1","varṣati","VARṢ","ati","varṣ","verb","","ati","varṣati"
"2","adhomukhaḥ","ADHOMUKH","aḥ","adhomukha","","","aḥ","adhomukhaḥ"
"3","candraḥ","CANDR","aḥ","candra","noun-adj","","aḥ","candraḥ"
"4","grasati","GRASAT","i","grasatī","noun-adj","","i","grasati"
"5","ūrdhva","ŪRDHV","a","ūrdhva","noun-adj","","a","ūrdhva"
"6","mukhaḥ","MUKH","aḥ","mukha","noun-adj","","aḥ","mukhaḥ"
"7","raviḥ","RAV","iḥ","ravi","noun-adj","","iḥ","raviḥ"
"8","jñātavyam","JÑĀ","tavyam","jān","verb","jñā","tavyam","jñātavyam"
"9","karaṇam","KARAṆ","am","karaṇa","noun-adj","","am","karaṇam"
"10","tatra","","","tatra","ind","","","tatra"
"11","yena","","","yad","pron","","","yad"
"12","pīyūṣam","PĪYŪṢ","am","pīyūṣa","noun-adj","","am","pīyūṣam"
"13","āpyate","ĀP","yate","āpn","verb","āp","yate","āpyate"
"14","//","","","","punct","","","//"
"","</s>","","","","","","",""
"","<s number = ""59"">","","","","","","",""
"1","ūrdhva","ŪRDHV","a","ūrdhva","noun-adj","","a","ūrdhva"
"2","nābhiḥ","NĀBH","iḥ","nābhi","noun-adj","","iḥ","nābhiḥ"
"3","adhas","ADH","as","adha","noun-adj","","aḥ","adhaḥ"
"4","tālu","TĀL","u","tālu","noun-adj","","u","tālu"
"5","ūrdhva","ŪRDHV","a","ūrdhva","noun-adj","","a","ūrdhva"
"6","bhānuḥ","BHĀN","uḥ","bhānu","noun-adj","","uḥ","bhānuḥ"
"7","adhas","ADH","as","adha","noun-adj","","aḥ","adhaḥ"
"8","śaśī","ŚAŚ","ī","śaśin","noun-adj","","ī","śaśī"
"9","karaṇam","KARAṆ","am","karaṇa","noun-adj","","am","karaṇam"
"10","viparīta","VIPARĪT","a","viparīta","noun-adj","","a","viparīta"
"11","ākhyam","ĀKHY","am","khyā","verb","","am","ākhyam"
"12","guru","GUR","u","guru","noun-adj","","u","guru"
"13","vaktreṇa","VAKTR","eṇa","vaktra","noun-adj","","ena","vaktrena"
"14","labhyate","LABH","yate","labh","verb","labh","yate","labhyate"
"15","//","","","","punct","","","//"
"","</s>","","","","","","",""
"","<s number = ""60"">","","","","","","",""
"1","tridhā","TRIDH","ā","tridhā","noun-adj","","ā","tridhā"
"2","baddhaḥ","BADDH","aḥ","baddha","noun-adj","","aḥ","baddhaḥ"
"3","vṛṣaḥ","VṚṢ","aḥ","vṛṣa","noun-adj","","aḥ","vṛṣaḥ"
"4","yatra","","","yatra","ind","","","yatra"
"5","rauravī","RAURAV","ī","raurava","","","ī","rauravī"
"6","iti","","","iti","ind","","","iti"
"7","mahā","MAH","ā","mahat","noun-adj","","ā","mahā"
"8","svanam","SVAN","am","svana","noun-adj","","am","svanam"
"9","anāhatam","ANĀHAT","am","anāhata","noun-adj","","am","anāhatam"
"10","ca","","","ca","ind","","","ca"
"11","tat","TAT","","tad","pron","","","tat"
"12","cakram","CAKR","am","cakra","noun-adj","","am","cakram"
"13","hṛdaye","HṚDAY","e","hṛdaya","noun-adj","","e","hṛdaye"
"14","yoginaḥ","YOG","inaḥ","yogin","noun-adj","","inaḥ","yoginaḥ"
"15","viduḥ","VID","uḥ","vidu","noun-adj","","uḥ","viduḥ"
"16","//","","","","punct","","","//"
"","</s>","","","","","","",""
"","<s number = ""61"">","","","","","","",""
"1","anāhatam","ANĀHAT","am","anāhata","noun-adj","","am","anāhatam"
"2","atikramya","ATIKRAM","ya","atikram","verb","atikram","ya","atikramya"
"3","ca","","","ca","ind","","","ca"
"4","ākramya","ĀKRAMY","a","ākramya","noun-adj","","a","ākramya"
"5","maṇipūrakam","MAṆIPŪRAK","am","maṇipūraka","","","am","maṇipūrakam"
"6","prāpte","PRĀPT","e","prāpta","noun-adj","","e","prāpte"
"7","prāṇam","PRĀṆ","am","prāṇa","noun-adj","","am","prāṇam"
"8","mahā","MAH","ā","mahat","noun-adj","","ā","mahā"
"9","padmam","PADM","am","padma","noun-adj","","am","padmam"
"10","yogitvam","YOG","itvam","yogitva","noun-adj","","itvam","yogitvam"
"11","amṛtāyate","AMṚTĀ","yate","amṛtā","verb","","yate","amṛtāyate"
"12","//","","","","punct","","","//"
"","</s>","","","","","","",""
"","<s number = ""62"">","","","","","","",""
"1","vi","","","","","","",""
"2","śabdaḥ","ŚABD","aḥ","śabda","","","aḥ","śabdaḥ"
"3","saṃsmṛtaḥ","SAṂSMṚT","aḥ","saṃsmṛta","noun-adj","","aḥ","saṃsmṛtaḥ"
"4","haṃsaḥ","HAṂS","aḥ","haṃsa","noun-adj","","aḥ","haṃsaḥ"
"5","nirmalaḥ","NIRMAL","aḥ","nirmala","noun-adj","","aḥ","nirmalaḥ"
"6","śuddhaḥ","ŚUDDH","aḥ","śuddha","noun-adj","","aḥ","śuddhaḥ"
"7","ucyate","UC","yate","vak","verb","vac","yate","ucyate"
"8","atas","","","atas","ind","","","atas"
"9","kaṇṭhe","KAṆṬH","e","kaṇṭha","noun-adj","","e","kaṇṭhe"
"10","viśuddha","VIŚUDDH","a","viśuddha","noun-adj","","a","viśuddha"
"11","ākhye","ĀKHY","e","ākhya","noun-adj","","e","ākhye"
"12","cakram","CAKR","am","cakra","noun-adj","","am","cakram"
"13","cakra","CAKR","a","cakra","noun-adj","","a","cakra"
"14","vidaḥ","VID","aḥ","vid","noun-adj","vid","aḥ","vidaḥ"
"15","viduḥ","VID","uḥ","vidu","noun-adj","","uḥ","viduḥ"
"16","//","","","","punct","","","//"
"","</s>","","","","","","",""
"","<s number = ""63"">","","","","","","",""
"1","viśuddhe","VIŚUDDH","e","viśuddha","noun-adj","","e","viśuddhe"
"2","parame","PARAM","e","parama","noun-adj","","e","parame"
"3","cakre","CAKR","e","cakra","noun-adj","","e","cakre"
"4","dhṛtvā","DHṚTV","ā","dhṛtvā","noun-adj","","ā","dhṛtvā"
"5","soma","SOM","a","soma","","","a","soma"
"6","kalā","KAL","ā","kalā","","","ā","kalā"
"7","jalam","JAL","am","jala","noun-adj","","am","jalam"
"8","māsena","MĀS","ena","māsa","noun-adj","","ena","māsena"
"9","na","","","na","ind","","","na"
"10","kṣayam","KṢAY","am","kṣaya","noun-adj","","am","kṣayam"
"11","yāti","","","yā","ind","","","yā"
"12","vañcayitvā","VAÑC","ayitvā","vañc","verb","","tvā","vañctvā"
"13","mukham","MUKH","am","mukha","noun-adj","","am","mukham"
"14","raveḥ","RAV","eḥ","ravi","noun-adj","","eḥ","raveḥ"
"15","//","","","","punct","","","//"
"","</s>","","","","","","",""
"","<s number = ""64"">","","","","","","",""
"1","sampīḍya","SAMPĪḌY","a","saṃpīḍya","","","a","sampīḍya"
"2","rasanā","RASAN","ā","rasanā","noun-adj","","ā","rasanā"
"3","agreṇa","AGREṆ","a","agreṇa","noun-adj","","a","agreṇa"
"4","rājadanta","RĀJADANT","a","rājadanta","","","a","rājadanta"
"5","bilam","BIL","am","bila","noun-adj","","am","bilam"
"6","mahat","MAHAT","","mahat","noun-adj","","","mahat"
"7","dhyātvā","DHYĀTV","ā","dhyāy","verb","dhyai","ā","dhyātvā"
"8","amṛta","AMṚT","a","amṛta","noun-adj","","a","amṛta"
"9","mayīm","MAY","īm","mayī","noun-adj","","īm","mayīm"
"10","devīm","DEV","īm","devī","noun-adj","","īm","devīm"
"11","ṣaṣ","ṢAṢ","","ṣaṣa","noun-adj","","","ṣaṣ"
"12","māsena","MĀS","ena","māsa","noun-adj","","ena","māsena"
"13","kaviḥ","KAV","iḥ","kavi","noun-adj","","iḥ","kaviḥ"
"14","bhavet","BHAV","et","bhav","verb","bhū","et","bhavet"
"15","//","","","","punct","","","//"
"","</s>","","","","","","",""
"","<s number = ""65"">","","","","","","",""
"1","amṛta","AMṚT","a","amṛta","noun-adj","","a","amṛta"
"2","āpūrṇa","APŪRṆ","a","apūrṇa","noun-adj","","a","apūrṇa"
"3","dehasya","DEH","asya","deha","noun-adj","","asya","dehasya"
"4","yoginaḥ","YOG","inaḥ","yogin","noun-adj","","inaḥ","yoginaḥ"
"5","dvi","DV","i","dvi","noun-adj","","i","dvi"
"6","tri","TR","i","tri","noun-adj","","i","tri"
"7","vatsarāt","VATSAR","āt","vatsara","","","āt","vatsarāt"
"8","ūrdhvam","ŪRDHV","am","ūrdhva","noun-adj","","am","ūrdhvam"
"9","pravartate","PRAVART","ate","pravart","verb","pravṛt","ate","pravartate"
"10","retaḥ","RET","aḥ","reta","","","aḥ","retaḥ"
"11","pi","","","api","ind","","","api"
"12","aṇima","AṆIM","a","aṇiman","noun-adj","","a","aṇima"
"13","ādi","ĀD","i","ādi","noun-adj","","i","ādi"
"14","guṇa","GUṆ","a","guṇa","noun-adj","","a","guṇa"
"15","udayaḥ","UDAY","aḥ","udaya","noun-adj","","aḥ","udayaḥ"
"16","//","","","","punct","","","//"
"","</s>","","","","","","",""
"","<s number = ""66"">","","","","","","",""
"1","indhanāni","INDHAN","āni","indhana","noun-adj","","āni","indhanāni"
"2","yathā","","","yathā","ind","","","yathā"
"3","vahniḥ","VAHN","iḥ","vahni","noun-adj","","iḥ","vahniḥ"
"4","taila","TAIL","a","taila","noun-adj","","a","taila"
"5","varti","VART","i","vartin","noun-adj","","i","varti"
"6","ca","","","ca","ind","","","ca"
"7","dīpakaḥ","DĪPAK","aḥ","dīpaka","noun-adj","","aḥ","dīpakaḥ"
"8","tathā","","","tathā","ind","","","tathā"
"9","soma","SOM","a","soma","noun-adj","","a","soma"
"10","kalā","KAL","ā","kalā","noun-adj","","ā","kalā"
"11","pūrṇam","PŪRṆ","am","pūrṇa","noun-adj","","am","pūrṇam"
"12","dehī","DEH","ī","dehin","noun-adj","","ī","dehī"
"13","deham","DEH","am","deha","noun-adj","","am","deham"
"14","na","","","na","ind","","","na"
"15","muñcati","MUÑC","ati","muñc","verb","muc","ati","muñcati"
"16","//","","","","punct","","","//"
"","</s>","","","","","","",""
"","<s number = ""67"">","","","","","","",""
"1","āsanena","ĀSAN","ena","āsana","noun-adj","","ena","āsanena"
"2","samāyuktaḥ","SAMĀYUKT","aḥ","samāyukta","noun-adj","","aḥ","samāyuktaḥ"
"3","prāṇāyāmena","PRĀṆĀYĀM","ena","prāṇāyāma","noun-adj","","ena","prāṇāyāmena"
"4","saṃyutaḥ","SAṂYUT","aḥ","saṃyuta","noun-adj","","aḥ","saṃyutaḥ"
"5","pratyāhāreṇa","PRATYĀHĀR","eṇa","pratyāhāra","noun-adj","","ena","pratyāhārena"
"6","saṃyuktaḥ","SAṂYUKT","aḥ","saṃyukta","noun-adj","","aḥ","saṃyuktaḥ"
"7","dhāraṇām","DHĀRAṆ","ām","dhāraṇā","noun-adj","","ām","dhāraṇām"
"8","ca","","","ca","ind","","","ca"
"9","samabhyaset","SAMABHYAS","et","samabhyas","verb","","et","samabhyaset"
"10","//","","","","punct","","","//"
"","</s>","","","","","","",""
"","<s number = ""68"">","","","","","","",""
"1","hṛdaye","HṚDAY","e","hṛdaya","noun-adj","","e","hṛdaye"
"2","pañca","PAÑC","a","pañca","noun-adj","","a","pañca"
"3","bhūtānām","BHŪT","ānām","bhūta","noun-adj","","ānām","bhūtānām"
"4","dhāraṇām","DHĀRAṆ","ām","dhāraṇā","noun-adj","","ām","dhāraṇām"
"5","ca","","","ca","ind","","","ca"
"6","pṛthak","PṚTHAK","","pṛthak","noun-adj","","","pṛthak"
"7","pṛthak","PṚTHAK","","pṛthak","noun-adj","","","pṛthak"
"8","manasaḥ","MANAS","aḥ","manas","noun-adj","","aḥ","manasaḥ"
"9","niścalatvena","NIŚCAL","atvena","niścalatva","noun-adj","","atvena","niścalatvena"
"10","dhāraṇā","DHĀRAṆ","ā","dhāraṇī","noun-adj","","ā","dhāraṇā"
"11","ca","","","ca","ind","","","ca"
"12","vidhīyate","VIDHĪ","yate","vidadh","verb","vidhā","yate","vidhīyate"
"13","//","","","","punct","","","//"
"","</s>","","","","","","",""
"","<s number = ""69"">","","","","","","",""
"1","yā","","","yad","pron","","","yad"
"2","pṛthvī","PṚTHV","ī","pṛthvī","noun-adj","","ī","pṛthvī"
"3","haritāla","HARITĀL","a","haritāla","noun-adj","","a","haritāla"
"4","deśa","DEŚ","a","deśa","noun-adj","","a","deśa"
"5","rucirā","RUCIR","ā","rucira","noun-adj","","āḥ","rucirāḥ"
"6","pītā","PĪT","ā","pīta","noun-adj","","āḥ","pītāḥ"
"7","lakāra","LAK","āra","lakṛ","noun-adj","","āra","lakāra"
"8","anvitā","ANVIT","ā","anvita","noun-adj","","āḥ","anvitāḥ"
"9","saṃyuktā","SAṂYUKT","ā","saṃyukta","noun-adj","","āḥ","saṃyuktāḥ"
"10","kamalāsanena","KAMALĀSAN","ena","kamalāsana","","","ena","kamalāsanena"
"11","hi","","","hi","ind","","","hi"
"12","catuṣkoṇā","CATUṢKOṆ","ā","catuṣkoṇa","","","āḥ","catuṣkoṇāḥ"
"13","hṛdi","HṚD","i","hṛdi","noun-adj","","i","hṛdi"
"14","sthāyinī","STHĀY","inī","sthāyin","noun-adj","","inī","sthāyinī"
"15","prāṇam","PRĀṆ","am","prāṇa","noun-adj","","am","prāṇam"
"16","tatra","","","tatra","ind","","","tatra"
"17","vinīya","VINĪY","a","vinīya","noun-adj","","a","vinīya"
"18","pañca","PAÑC","a","pañca","noun-adj","","a","pañca"
"19","ghaṭikāḥ","GHAṬIK","āḥ","ghaṭika","noun-adj","","āḥ","ghaṭikāḥ"
"20","citta","CITT","a","citta","noun-adj","","a","citta"
"21","anvitam","ANVIT","am","anvita","noun-adj","","am","anvitam"
"22","dhārayet","DHĀRAY","et","dhar","verb","dhṛ","et","dhārayet"
"23","eṣā","","","tad","pron","","","tad"
"24","stambha","STAMBHA","","stambha","noun-adj","","","stambha"
"25","karī","KAR","ī","karin","noun-adj","","ī","karī"
"26","sadā","","","sada","ind","","","sada"
"27","kṣiti","KṢIT","i","kṣiti","noun-adj","","i","kṣiti"
"28","jayam","JAY","am","jaya","noun-adj","","am","jayam"
"29","kuryāt","KUR","yāt","kar","verb","kṛ","yāt","kuryāt"
"30","bhuvaḥ","BHUV","aḥ","bhuva","noun-adj","","aḥ","bhuvaḥ"
"31","dhāraṇā","DHĀRAṆ","ā","dhāraṇī","noun-adj","","ā","dhāraṇā"
"32","//","","","","punct","","","//"
"","</s>","","","","","","",""
"","<s number = ""70"">","","","","","","",""
"1","ardha","ARDH","a","ardha","noun-adj","","a","ardha"
"2","indu","IND","u","indu","noun-adj","","u","indu"
"3","pratimam","PRATIM","am","pratima","noun-adj","","am","pratimam"
"4","ca","","","ca","ind","","","ca"
"5","kunda","KUND","a","kunda","noun-adj","","a","kunda"
"6","dhavalam","DHAVAL","am","dhavala","noun-adj","","am","dhavalam"
"7","kaṇṭhe","KAṆṬH","e","kaṇṭha","noun-adj","","e","kaṇṭhe"
"8","mbu","","","","ind","","",""
"9","tattavm","","","","","","",""
"10","sthitam","STHIT","am","sthita","noun-adj","","am","sthitam"
"11","yat","","","yad","pron","","","yad"
"12","pīyūṣa","PĪYŪṢ","a","pīyūṣa","noun-adj","","a","pīyūṣa"
"13","vakāra","VAKĀR","a","vakāra","noun-adj","","a","vakāra"
"14","bīja","BĪJ","a","bīja","noun-adj","","a","bīja"
"15","sahitam","SAHIT","am","sahita","noun-adj","","am","sahitam"
"16","yuktam","YUKT","am","yukta","noun-adj","","am","yuktam"
"17","sadā","","","sada","ind","","","sada"
"18","viṣṇunā","VIṢṆ","unā","viṣṇu","noun-adj","","unā","viṣṇunā"
"19","prāṇam","PRĀṆ","am","prāṇa","noun-adj","","am","prāṇam"
"20","tatra","","","tatra","ind","","","tatra"
"21","vinīya","VINĪY","a","vinīya","noun-adj","","a","vinīya"
"22","pañca","PAÑC","a","pañca","noun-adj","","a","pañca"
"23","ghaṭikāḥ","GHAṬIK","āḥ","ghaṭika","noun-adj","","āḥ","ghaṭikāḥ"
"24","citta","CITT","a","citta","noun-adj","","a","citta"
"25","anvitam","ANVIT","am","anvita","noun-adj","","am","anvitam"
"26","dhārayet","DHĀRAY","et","dhar","verb","dhṛ","et","dhārayet"
"27","eṣā","","","tad","pron","","","tad"
"28","dur","","","duru","ind","","","duru"
"29","vaha","VAH","a","vaha","noun-adj","","a","vaha"
"30","kālakūṭa","KĀLAKŪṬ","a","kālakūṭa","noun-adj","","a","kālakūṭa"
"31","jaraṇā","JARAṆ","ā","jaraṇā","","","ā","jaraṇā"
"32","syāt","","","as","verb","as","",""
"33","vāriṇī","VĀR","iṇī","vārin","noun-adj","","inī","vārinī"
"34","dhāraṇā","DHĀRAṆ","ā","dhāraṇī","noun-adj","","ā","dhāraṇā"
"35","//","","","","punct","","","//"
"","</s>","","","","","","",""
"","<s number = ""71"">","","","","","","",""
"1","yat","","","yad","pron","","","yad"
"2","tāla","TĀL","a","tāla","noun-adj","","a","tāla"
"3","sthitam","STHIT","am","sthita","noun-adj","","am","sthitam"
"4","indragopa","INDRAGOP","a","indragopa","noun-adj","","a","indragopa"
"5","sadṛśam","SADṚŚ","am","sadṛśa","noun-adj","","am","sadṛśam"
"6","tattvam","TATTV","am","tattva","noun-adj","","am","tattvam"
"7","trikoṇa","TRIKOṆ","a","trikoṇa","noun-adj","","a","trikoṇa"
"8","ujjvalam","UJJVAL","am","ujjvala","noun-adj","","am","ujjvalam"
"9","tejo","TEJ","o","teja","","","aḥ","tejaḥ"
"10","repha","REPH","a","repha","","","a","repha"
"11","mayam","MAY","am","maya","noun-adj","","am","mayam"
"12","pravāla","PRAVĀL","a","pravāla","noun-adj","","a","pravāla"
"13","ruciram","RUCIR","am","rucira","noun-adj","","am","ruciram"
"14","rudreṇa","RUDR","eṇa","rudra","noun-adj","","ena","rudrena"
"15","yat","","","yad","pron","","","yad"
"16","saṅgatam","SAṂGAT","am","saṃgata","noun-adj","","am","saṃgatam"
"17","prāṇam","PRĀṆ","am","prāṇa","noun-adj","","am","prāṇam"
"18","tatra","","","tatra","ind","","","tatra"
"19","vinīya","VINĪY","a","vinīya","noun-adj","","a","vinīya"
"20","pañca","PAÑC","a","pañca","noun-adj","","a","pañca"
"21","ghaṭikāḥ","GHAṬIK","āḥ","ghaṭika","noun-adj","","āḥ","ghaṭikāḥ"
"22","citta","CITT","a","citta","noun-adj","","a","citta"
"23","anvitam","ANVIT","am","anvita","noun-adj","","am","anvitam"
"24","dhārayet","DHĀRAY","et","dhar","verb","dhṛ","et","dhārayet"
"25","eṣā","","","tad","pron","","","tad"
"26","vahni","VAHN","i","vahni","noun-adj","","i","vahni"
"27","jayam","JAY","am","jaya","noun-adj","","am","jayam"
"28","sadā","","","sada","ind","","","sada"
"29","vidadhate","VIDADH","ate","vidadh","verb","vidhā","ate","vidadhate"
"30","vaiśvānarī","VAIŚVĀNAR","ī","vaiśvānarī","","","ī","vaiśvānarī"
"31","dhāraṇā","DHĀRAṆ","ā","dhāraṇī","noun-adj","","ā","dhāraṇā"
"32","//","","","","punct","","","//"
"","</s>","","","","","","",""
"","<s number = ""72"">","","","","","","",""
"1","yat","","","yad","pron","","","yad"
"2","bhinnāñjana","BHINNĀÑJAN","a","bhinnāñjana","","","a","bhinnāñjana"
"3","puñjasān","PUÑJ","asān","puñja","","","asām","puñjasām"
"4","nibham","NIBH","am","nibha","","","am","nibham"
"5","idam","IDAM","","idam","pron","","","idam"
"6","tattvam","TATTV","am","tattva","noun-adj","","am","tattvam"
"7","bhruvoḥ","BHRUV","oḥ","bhruva","noun-adj","","oḥ","bhruvoḥ"
"8","antare","ANTAR","e","antara","noun-adj","","e","antare"
"9","vṛttam","VṚTT","am","vṛtta","noun-adj","","am","vṛttam"
"10","vāyu","VĀY","u","vāyu","noun-adj","","u","vāyu"
"11","mayam","MAY","am","maya","noun-adj","","am","mayam"
"12","yakāra","YAKĀR","a","yakāra","noun-adj","","a","yakāra"
"13","sahitam","SAHIT","am","sahita","noun-adj","","am","sahitam"
"14","yatra","","","yatra","ind","","","yatra"
"15","īśvaraḥ","ĪŚVAR","aḥ","īśvara","noun-adj","","aḥ","īśvaraḥ"
"16","devatā","DEVAT","ā","devatā","noun-adj","","ā","devatā"
"17","prāṇam","PRĀṆ","am","prāṇa","noun-adj","","am","prāṇam"
"18","tatra","","","tatra","ind","","","tatra"
"19","vinīya","VINĪY","a","vinīya","noun-adj","","a","vinīya"
"20","pañca","PAÑC","a","pañca","noun-adj","","a","pañca"
"21","ghaṭikāḥ","GHAṬIK","āḥ","ghaṭika","noun-adj","","āḥ","ghaṭikāḥ"
"22","citta","CITT","a","citta","noun-adj","","a","citta"
"23","anvitam","ANVIT","am","anvita","noun-adj","","am","anvitam"
"24","dhārayet","DHĀRAY","et","dhar","verb","dhṛ","et","dhārayet"
"25","eṣā","","","tad","pron","","","tad"
"26","khe","","","","ind","","",""
"27","gamanam","GAMAN","am","gamana","noun-adj","","am","gamanam"
"28","karoti","KAR","oti","kar","verb","kṛ","ati","karati"
"29","yaminām","YAM","inām","yamin","","","inām","yaminām"
"30","syāt","","","as","verb","as","",""
"31","vāyavī","VĀYAV","ī","vāyavī","","","ī","vāyavī"
"32","dhāraṇā","DHĀRAṆ","ā","dhāraṇī","noun-adj","","ā","dhāraṇā"
"33","//","","","","punct","","","//"
"","</s>","","","","","","",""
"","<s number = ""73"">","","","","","","",""
"1","ākāśam","ĀKĀŚ","am","ākāśa","noun-adj","","am","ākāśam"
"2","su","","","su","ind","","","su"
"3","viśuddha","VIŚUDDH","a","viśuddha","noun-adj","","a","viśuddha"
"4","vāri","VĀR","i","vāri","noun-adj","","i","vāri"
"5","sadṛśam","SADṚŚ","am","sadṛśa","noun-adj","","am","sadṛśam"
"6","yat","","","yad","pron","","","yad"
"7","brahmarandhre","BRAHMARANDHR","e","brahmarandhra","noun-adj","","e","brahmarandhre"
"8","sthitam","STHIT","am","sthita","noun-adj","","am","sthitam"
"9","tatra","","","tatra","ind","","","tatra"
"10","ādyena","ĀDY","ena","ādya","noun-adj","","ena","ādyena"
"11","sadāśivena","SADĀŚIV","ena","sadāśiva","","","ena","sadāśivena"
"12","sahitam","SAHIT","am","sahita","noun-adj","","am","sahitam"
"13","śāntam","ŚĀNT","am","śānta","noun-adj","","am","śāntam"
"14","hakāra","HAKĀR","a","hakāra","noun-adj","","a","hakāra"
"15","akṣaram","AKṢAR","am","akṣara","noun-adj","","am","akṣaram"
"16","prāṇam","PRĀṆ","am","prāṇa","noun-adj","","am","prāṇam"
"17","tatra","","","tatra","ind","","","tatra"
"18","vinīya","VINĪY","a","vinīya","noun-adj","","a","vinīya"
"19","pañca","PAÑC","a","pañca","noun-adj","","a","pañca"
"20","ghaṭikāḥ","GHAṬIK","āḥ","ghaṭika","noun-adj","","āḥ","ghaṭikāḥ"
"21","citta","CITT","a","citta","noun-adj","","a","citta"
"22","anvitam","ANVIT","am","anvita","noun-adj","","am","anvitam"
"23","dhārayet","DHĀRAY","et","dhar","verb","dhṛ","et","dhārayet"
"24","eṣā","","","tad","pron","","","tad"
"25","mokṣa","MOKṢ","a","mokṣa","noun-adj","","a","mokṣa"
"26","kavāṭa","KAVĀṬ","a","kavāṭa","noun-adj","","a","kavāṭa"
"27","pāṭana","PĀṬAN","a","pāṭana","noun-adj","","a","pāṭana"
"28","paṭuḥ","PAṬ","uḥ","paṭu","noun-adj","","uḥ","paṭuḥ"
"29","proktā","PROKT","ā","prokta","noun-adj","","āḥ","proktāḥ"
"30","nabhaḥ","NABH","aḥ","nabha","noun-adj","","aḥ","nabhaḥ"
"31","dhāraṇā","DHĀRAṆ","ā","dhāraṇī","noun-adj","","ā","dhāraṇā"
"32","//","","","","punct","","","//"
"","</s>","","","","","","",""
"","<s number = ""74"">","","","","","","",""
"1","stambhanī","STAMBHA","ī","stambhanī","noun-adj","","ī","stambhaī"
"2","drāvaṇī","DRĀVAṆ","ī","drāvaṇa","noun-adj","","ī","drāvaṇī"
"3","ca","","","ca","ind","","","ca"
"4","eva","","","eva","ind","","","eva"
"5","dahanī","DAHAN","ī","dahana","noun-adj","","ī","dahanī"
"6","bhrāmaṇī","BHRĀMAṆ","ī","bhrāmaṇī","","","ī","bhrāmaṇī"
"7","tathā","","","tathā","ind","","","tathā"
"8","śoṣaṇī","ŚOṢAṆ","ī","śoṣaṇa","noun-adj","","ī","śoṣaṇī"
"9","ca","","","ca","ind","","","ca"
"10","bhavanti","BHAV","anti","bhav","verb","bhū","anti","bhavanti"
"11","evam","","","eva","ind","","","eva"
"12","bhūtānām","BHŪT","ānām","bhūta","noun-adj","","ānām","bhūtānām"
"13","pañca","PAÑC","a","pañca","noun-adj","","a","pañca"
"14","dhāraṇāḥ","DHĀRAṆ","āḥ","dhāraṇī","noun-adj","","āḥ","dhāraṇāḥ"
"15","//","","","","punct","","","//"
"","</s>","","","","","","",""
"","<s number = ""75"">","","","","","","",""
"1","karmaṇā","KARM","aṇā","karman","noun-adj","","aṇā","karmaṇā"
"2","manasā","MAN","asā","manas","noun-adj","","asā","manasā"
"3","vācā","VĀC","ā","vāc","noun-adj","","ā","vācā"
"4","dhāraṇāḥ","DHĀRAṆ","āḥ","dhāraṇī","noun-adj","","āḥ","dhāraṇāḥ"
"5","pañca","PAÑC","a","pañca","noun-adj","","a","pañca"
"6","durlabhāḥ","DURLABH","āḥ","durlabha","noun-adj","","āḥ","durlabhāḥ"
"7","vidhāya","VIDHĀY","a","vidhāyin","noun-adj","","a","vidhāya"
"8","satatam","SATAT","am","satata","noun-adj","","am","satatam"
"9","yogī","YOG","ī","yogin","noun-adj","","ī","yogī"
"10","sarva","SARV","a","sarva","noun-adj","","a","sarva"
"11","pāpaiḥ","PĀP","aiḥ","pāpa","noun-adj","","air","pāpair"
"12","pramucyate","PRAMUC","yate","pramuñc","verb","pramuc","yate","pramucyate"
"13","//","","","","punct","","","//"
"","</s>","","","","","","",""
"","<s number = ""76"">","","","","","","",""
"1","sarvam","SARV","am","sarva","noun-adj","","am","sarvam"
"2","cintā","CINT","ā","cintā","noun-adj","","ā","cintā"
"3","samāvarti","SAMĀVART","i","samāvartin","noun-adj","","i","samāvarti"
"4","yoginaḥ","YOG","inaḥ","yogin","noun-adj","","inaḥ","yoginaḥ"
"5","hṛdi","HṚD","i","hṛdi","noun-adj","","i","hṛdi"
"6","vartate","VART","ate","vart","verb","vṛt","ate","vartate"
"7","yat","","","yad","pron","","","yad"
"8","tattve","TATTV","e","tattva","noun-adj","","e","tattve"
"9","niścitam","NIŚCIT","am","niścita","noun-adj","","am","niścitam"
"10","cetaḥ","CET","aḥ","cetas","noun-adj","","aḥ","cetaḥ"
"11","tat","TAT","","tad","pron","","","tat"
"12","tu","","","tu","ind","","","tu"
"13","dhyānam","DHYĀN","am","dhyāna","noun-adj","","am","dhyānam"
"14","pracakṣate","PRACAKṢ","ate","pracakṣ","verb","pracakṣ","ate","pracakṣate"
"15","//","","","","punct","","","//"
"","</s>","","","","","","",""
"","<s number = ""77"">","","","","","","",""
"1","dvidhā","DVIDH","ā","dvidhā","noun-adj","","ā","dvidhā"
"2","bhavati","BHAV","ati","bhav","verb","bhū","ati","bhavati"
"3","tat","TAT","","tad","pron","","","tat"
"4","dhyānam","DHYĀN","am","dhyāna","noun-adj","","am","dhyānam"
"5","sa","","","tad","pron","","","tad"
"6","guṇam","GUṆ","am","guṇa","noun-adj","","am","guṇam"
"7","nirguṇam","NIRGUṆ","am","nirguṇa","noun-adj","","am","nirguṇam"
"8","tathā","","","tathā","ind","","","tathā"
"9","sa","","","tad","pron","","","tad"
"10","guṇam","GUṆ","am","guṇa","noun-adj","","am","guṇam"
"11","varṇa","VARṆ","a","varṇa","noun-adj","","a","varṇa"
"12","bhedena","BHED","ena","bheda","noun-adj","","ena","bhedena"
"13","nirguṇam","NIRGUṆ","am","nirguṇa","noun-adj","","am","nirguṇam"
"14","kevalam","KEVAL","am","kevala","noun-adj","","am","kevalam"
"15","viduḥ","VID","uḥ","vidu","noun-adj","","uḥ","viduḥ"
"16","//","","","","punct","","","//"
"","</s>","","","","","","",""
"","<s number = ""78"">","","","","","","",""
"1","ādhāram","ĀDHĀR","am","ādhāra","noun-adj","","am","ādhāram"
"2","prathamam","PRATHAM","am","prathama","noun-adj","","am","prathamam"
"3","cakram","CAKR","am","cakra","noun-adj","","am","cakram"
"4","tapta","TAPT","a","tapta","noun-adj","","a","tapta"
"5","kāñcana","KĀÑCAN","a","kāñcana","noun-adj","","a","kāñcana"
"6","sannibham","SAṂNIBH","am","saṃnibha","noun-adj","","am","saṃnibham"
"7","nāsā","NĀS","ā","nāsā","noun-adj","","ā","nāsā"
"8","agre","AGR","e","agra","noun-adj","","e","agre"
"9","dṛṣṭim","DṚṢṬ","im","dṛṣṭi","noun-adj","","im","dṛṣṭim"
"10","ādāya","ĀDĀY","a","ādāya","noun-adj","","a","ādāya"
"11","dhyātvā","DHYĀTV","ā","dhyāy","verb","dhyai","ā","dhyātvā"
"12","muñcati","MUÑC","ati","muñc","verb","muc","ati","muñcati"
"13","kilbiṣam","KILBIṢ","am","kilbiṣa","noun-adj","","am","kilbiṣam"
"14","//","","","","punct","","","//"
"","</s>","","","","","","",""
"","<s number = ""79"">","","","","","","",""
"1","svādhiṣṭhānam","SVĀDHIṢṬHĀN","am","svādhiṣṭhāna","noun-adj","","am","svādhiṣṭhānam"
"2","dvitīyam","DVITĪY","am","dvitīya","noun-adj","","am","dvitīyam"
"3","tu","","","tu","ind","","","tu"
"4","sat","SAT","","sat","noun-adj","","","sat"
"5","māṇikya","MĀṆIKY","a","māṇikya","noun-adj","","a","māṇikya"
"6","su","","","su","ind","","","su"
"7","śobhanam","ŚOBHAN","am","śobhana","noun-adj","","am","śobhanam"
"8","nāsā","NĀS","ā","nāsā","noun-adj","","ā","nāsā"
"9","agre","AGR","e","agra","noun-adj","","e","agre"
"10","dṛṣṭim","DṚṢṬ","im","dṛṣṭi","noun-adj","","im","dṛṣṭim"
"11","ādāya","ĀDĀY","a","ādāya","noun-adj","","a","ādāya"
"12","dhyātvā","DHYĀTV","ā","dhyāy","verb","dhyai","ā","dhyātvā"
"13","muñcati","MUÑC","ati","muñc","verb","muc","ati","muñcati"
"14","pātakam","PĀTAK","am","pātaka","noun-adj","","am","pātakam"
"15","//","","","","punct","","","//"
"","</s>","","","","","","",""
"","<s number = ""80"">","","","","","","",""
"1","taruṇa","TARUṆ","a","taruṇa","noun-adj","","a","taruṇa"
"2","āditya","ĀDITY","a","āditya","noun-adj","","a","āditya"
"3","saṃkāśam","SAṂKĀŚ","am","saṃkāśa","noun-adj","","am","saṃkāśam"
"4","cakram","CAKR","am","cakra","noun-adj","","am","cakram"
"5","ca","","","ca","ind","","","ca"
"6","maṇipūrakam","MAṆIPŪRAK","am","maṇipūraka","","","am","maṇipūrakam"
"7","nāsā","NĀS","ā","nāsā","noun-adj","","ā","nāsā"
"8","agre","AGR","e","agra","noun-adj","","e","agre"
"9","dṛṣṭim","DṚṢṬ","im","dṛṣṭi","noun-adj","","im","dṛṣṭim"
"10","ādāya","ĀDĀY","a","ādāya","noun-adj","","a","ādāya"
"11","dhyātvā","DHYĀTV","ā","dhyāy","verb","dhyai","ā","dhyātvā"
"12","saṃkṣobhayet","SAṂKṢOBH","ayet","saṃkṣubh","verb","saṃkṣubh","yet","saṃkṣobhyet"
"13","jagat","JAGAT","","jagat","noun-adj","","","jagat"
"14","//","","","","punct","","","//"
"","</s>","","","","","","",""
"","<s number = ""81"">","","","","","","",""
"1","vidyut","VIDYUT","","vidyut","noun-adj","","","vidyut"
"2","prabhāvam","PRABHĀV","am","prabhāva","noun-adj","","am","prabhāvam"
"3","hṛd","HṚD","","hṛdi","noun-adj","","","hṛd"
"4","padme","PADM","e","padma","noun-adj","","e","padme"
"5","prāṇāyāma","PRĀṆĀYĀM","a","prāṇāyāma","noun-adj","","a","prāṇāyāma"
"6","vibhedanaiḥ","VIBHEDAN","aiḥ","vibhedana","","","air","vibhedanair"
"7","nāsā","NĀS","ā","nāsā","noun-adj","","ā","nāsā"
"8","agre","AGR","e","agra","noun-adj","","e","agre"
"9","dṛṣṭim","DṚṢṬ","im","dṛṣṭi","noun-adj","","im","dṛṣṭim"
"10","ādāya","ĀDĀY","a","ādāya","noun-adj","","a","ādāya"
"11","dhyātvā","DHYĀTV","ā","dhyāy","verb","dhyai","ā","dhyātvā"
"12","brahma","BRAHM","a","brahman","noun-adj","","a","brahma"
"13","mayaḥ","MAY","aḥ","maya","noun-adj","","aḥ","mayaḥ"
"14","bhavet","BHAV","et","bhav","verb","bhū","et","bhavet"
"15","//","","","","punct","","","//"
"","</s>","","","","","","",""
"","<s number = ""82"">","","","","","","",""
"1","santatam","SAṂTAT","am","saṃtata","noun-adj","","am","saṃtatam"
"2","ghaṇṭikā","GHAṆṬIK","ā","ghaṇṭikā","noun-adj","","ā","ghaṇṭikā"
"3","madhye","MADHY","e","madhya","noun-adj","","e","madhye"
"4","viśuddham","VIŚUDDH","am","viśuddha","noun-adj","","am","viśuddham"
"5","ca","","","ca","ind","","","ca"
"6","amṛta","AMṚT","a","amṛta","noun-adj","","a","amṛta"
"7","udbhavam","UDBHAV","am","udbhava","noun-adj","","am","udbhavam"
"8","nāsā","NĀS","ā","nāsā","noun-adj","","ā","nāsā"
"9","agre","AGR","e","agra","noun-adj","","e","agre"
"10","dṛṣṭim","DṚṢṬ","im","dṛṣṭi","noun-adj","","im","dṛṣṭim"
"11","ādāya","ĀDĀY","a","ādāya","noun-adj","","a","ādāya"
"12","dhyātvā","DHYĀTV","ā","dhyāy","verb","dhyai","ā","dhyātvā"
"13","brahma","BRAHM","a","brahman","noun-adj","","a","brahma"
"14","mayaḥ","MAY","aḥ","maya","noun-adj","","aḥ","mayaḥ"
"15","bhavet","BHAV","et","bhav","verb","bhū","et","bhavet"
"16","//","","","","punct","","","//"
"","</s>","","","","","","",""
"","<s number = ""83"">","","","","","","",""
"1","bhruvoḥ","BHRUV","oḥ","bhruva","noun-adj","","oḥ","bhruvoḥ"
"2","madhye","MADHY","e","madhya","noun-adj","","e","madhye"
"3","sthitam","STHIT","am","sthita","noun-adj","","am","sthitam"
"4","devam","DEVAM","","deva","noun-adj","","","devam"
"5","snigdha","SNIGDH","a","snigdha","noun-adj","","a","snigdha"
"6","mauktika","MAUKTIK","a","mauktika","noun-adj","","a","mauktika"
"7","sannibham","SAṂNIBH","am","saṃnibha","noun-adj","","am","saṃnibham"
"8","nāsā","NĀS","ā","nāsā","noun-adj","","ā","nāsā"
"9","agre","AGR","e","agra","noun-adj","","e","agre"
"10","dṛṣṭim","DṚṢṬ","im","dṛṣṭi","noun-adj","","im","dṛṣṭim"
"11","ādāya","ĀDĀY","a","ādāya","noun-adj","","a","ādāya"
"12","dhyātvā","DHYĀTV","ā","dhyāy","verb","dhyai","ā","dhyātvā"
"13","nanda","NAND","a","nanda","noun-adj","","a","nanda"
"14","mayaḥ","MAY","aḥ","maya","noun-adj","","aḥ","mayaḥ"
"15","bhavet","BHAV","et","bhav","verb","bhū","et","bhavet"
"16","//","","","","punct","","","//"
"","</s>","","","","","","",""
"","<s number = ""84"">","","","","","","",""
"1","nirguṇam","NIRGUṆ","am","nirguṇa","noun-adj","","am","nirguṇam"
"2","ca","","","ca","ind","","","ca"
"3","śivam","ŚIV","am","śiva","noun-adj","","am","śivam"
"4","śāntam","ŚĀNT","am","śānta","noun-adj","","am","śāntam"
"5","gagane","GAGAN","e","gagana","noun-adj","","e","gagane"
"6","viśvatomukham","VIŚVATOMUKH","am","viśvatomukha","","","am","viśvatomukham"
"7","nāsā","NĀS","ā","nāsā","noun-adj","","ā","nāsā"
"8","agre","AGR","e","agra","noun-adj","","e","agre"
"9","dṛṣṭim","DṚṢṬ","im","dṛṣṭi","noun-adj","","im","dṛṣṭim"
"10","ādāya","ĀDĀY","a","ādāya","noun-adj","","a","ādāya"
"11","dhyātvā","DHYĀTV","ā","dhyāy","verb","dhyai","ā","dhyātvā"
"12","duḥkhāt","DUḤKH","āt","duḥkha","noun-adj","","āt","duḥkhāt"
"13","vimucyate","VIMUC","yate","vimuñc","verb","vimuc","yate","vimucyate"
"14","//","","","","punct","","","//"
"","</s>","","","","","","",""
"","<s number = ""85"">","","","","","","",""
"1","gudam","GUD","am","guda","","","am","gudam"
"2","meḍhram","MEḌHR","am","meḍhra","","","am","meḍhram"
"3","ca","","","ca","ind","","","ca"
"4","nābhim","NĀBH","im","nābhi","noun-adj","","im","nābhim"
"5","ca","","","ca","ind","","","ca"
"6","hṛd","HṚD","","hṛdi","noun-adj","","","hṛd"
"7","padme","PADM","e","padma","noun-adj","","e","padme"
"8","ca","","","ca","ind","","","ca"
"9","tad","TAD","","tad","pron","","","tad"
"10","ūrdhvatas","ŪRDHVAT","as","ūrdhvata","","","aḥ","ūrdhvataḥ"
"11","ghaṇṭikām","GHAṆṬIK","ām","ghaṇṭikā","","","ām","ghaṇṭikām"
"12","lampikā","","","","","","",""
"13","sthānam","STHĀN","am","sthāna","noun-adj","","am","sthānam"
"14","bhrū","BHR","ū","bhrū","noun-adj","","ū","bhrū"
"15","madhye","MADHY","e","madhya","noun-adj","","e","madhye"
"16","parameśvaram","PARAMEŚVAR","am","parameśvara","noun-adj","","am","parameśvaram"
"17","//","","","","punct","","","//"
"","</s>","","","","","","",""
"","<s number = ""86"">","","","","","","",""
"1","nirmalam","NIRMAL","am","nirmala","noun-adj","","am","nirmalam"
"2","gagana","GAGAN","a","gagana","noun-adj","","a","gagana"
"3","ākāram","ĀKĀR","am","ākāra","noun-adj","","am","ākāram"
"4","marīci","MARĪC","i","marīci","noun-adj","","i","marīci"
"5","jala","JAL","a","jala","noun-adj","","a","jala"
"6","sannibham","SAṂNIBH","am","saṃnibha","noun-adj","","am","saṃnibham"
"7","ātmānam","ĀTM","ānam","ātman","noun-adj","","ānam","ātmānam"
"8","sarvagam","SARVAG","am","sarvaga","noun-adj","","am","sarvagam"
"9","dhyātvā","DHYĀTV","ā","dhyāy","verb","dhyai","ā","dhyātvā"
"10","yogī","YOG","ī","yogin","noun-adj","","ī","yogī"
"11","yogam","YOG","am","yoga","noun-adj","","am","yogam"
"12","avāpnuyāt","AVĀPN","uyāt","avāpn","verb","avāp","uyāt","avāpnuyāt"
"13","//","","","","punct","","","//"
"","</s>","","","","","","",""
"","<s number = ""87"">","","","","","","",""
"1","kathitāni","KATHIT","āni","kathita","noun-adj","","āni","kathitāni"
"2","yathā","","","yathā","ind","","","yathā"
"3","etāni","","","tad","pron","","","tad"
"4","dhyāna","DHYĀN","a","dhyāna","noun-adj","","a","dhyāna"
"5","sthānāni","STHĀN","āni","sthāna","noun-adj","","āni","sthānāni"
"6","yoginām","YOG","inām","yogin","noun-adj","","inām","yoginām"
"7","upādhi","UPĀDH","i","upādhi","noun-adj","","i","upādhi"
"8","tattva","TATTV","a","tattva","noun-adj","","a","tattva"
"9","yuktāni","YUKT","āni","yukta","noun-adj","","āni","yuktāni"
"10","kurvanti","KURV","anti","kar","verb","kṛ","anti","kurvanti"
"11","aṣṭa","AṢṬ","a","aṣṭa","","","a","aṣṭa"
"12","guṇa","GUṆ","a","guṇa","","","a","guṇa"
"13","udayam","UDAYAM","","udaya","noun-adj","","","udayam"
"14","//","","","","punct","","","//"
"","</s>","","","","","","",""
"","<s number = ""88"">","","","","","","",""
"1","upādhiḥ","UPĀDH","iḥ","upādhi","noun-adj","","iḥ","upādhiḥ"
"2","ca","","","ca","ind","","","ca"
"3","tathā","","","tathā","ind","","","tathā"
"4","tattvam","TATTV","am","tattva","noun-adj","","am","tattvam"
"5","dvayam","DVAY","am","dvaya","noun-adj","","am","dvayam"
"6","evam","","","eva","ind","","","eva"
"7","udāhṛtam","UDĀHṚT","am","udāhṛta","noun-adj","","am","udāhṛtam"
"8","upādhiḥ","UPĀDH","iḥ","upādhi","noun-adj","","iḥ","upādhiḥ"
"9","procyate","PROC","yate","pravak","verb","pravac","yate","procyate"
"10","varṇaḥ","VARṆ","aḥ","varṇa","noun-adj","","aḥ","varṇaḥ"
"11","tattvam","TATTV","am","tattva","noun-adj","","am","tattvam"
"12","ātmā","ĀTM","ā","ātman","noun-adj","","ā","ātmā"
"13","abhidhīyate","ABHIDHĪ","yate","abhidadh","verb","abhidhā","yate","abhidhīyate"
"14","//","","","","punct","","","//"
"","</s>","","","","","","",""
"","<s number = ""89"">","","","","","","",""
"1","upādhiḥ","UPĀDH","iḥ","upādhi","noun-adj","","iḥ","upādhiḥ"
"2","anyath","","anyath","","","","anyath",""
"3","ājñānam","ĀJÑĀN","am","ājñāna","","","am","ājñānam"
"4","tattvam","TATTV","am","tattva","noun-adj","","am","tattvam"
"5","saṃsthitam","SAṂSTHIT","am","saṃsthita","noun-adj","","am","saṃsthitam"
"6","anyathā","ANYATH","ā","anyathā","ind","","ā","anyathā"
"7","samasta","SAMAST","a","samasta","noun-adj","","a","samasta"
"8","upādhi","UPĀDH","i","upādhi","noun-adj","","i","upādhi"
"9","vidhvaṃsi","VIDHVAṂS","i","vidhvaṃsin","noun-adj","","i","vidhvaṃsi"
"10","sadā","","","sada","ind","","","sada"
"11","abhyāsena","ABHYĀS","ena","abhyāsa","noun-adj","","ena","abhyāsena"
"12","yoginām","YOG","inām","yogin","noun-adj","","inām","yoginām"
"13","//","","","","punct","","","//"
"","</s>","","","","","","",""
"","<s number = ""90"">","","","","","","",""
"1","ātma","ĀTM","a","ātman","noun-adj","","a","ātma"
"2","varṇena","VARṆ","ena","varṇa","noun-adj","","ena","varṇena"
"3","bhedena","BHED","ena","bheda","noun-adj","","ena","bhedena"
"4","dṛśyate","DṚŚ","yate","darś","verb","dṛś","yate","dṛśyate"
"5","sphāṭikaḥ","SPHĀṬIK","aḥ","sphāṭika","noun-adj","","aḥ","sphāṭikaḥ"
"6","maṇiḥ","MAṆ","iḥ","maṇi","noun-adj","","iḥ","maṇiḥ"
"7","muktaḥ","MUKT","aḥ","mukta","noun-adj","","aḥ","muktaḥ"
"8","yaḥ","","","yad","pron","","","yad"
"9","śakti","ŚAKT","i","śakti","noun-adj","","i","śakti"
"10","bhedena","BHED","ena","bheda","noun-adj","","ena","bhedena"
"11","saḥ","","","tad","pron","","","tad"
"12","yam","","","yad","pron","","","yad"
"13","ātmā","ĀTM","ā","ātman","noun-adj","","ā","ātmā"
"14","praśasyate","PRAŚAS","yate","praśas","verb","","yate","praśasyate"
"15","//","","","","punct","","","//"
"","</s>","","","","","","",""
"","<s number = ""91"">","","","","","","",""
"1","nirātaṅkam","NIRĀTAṄK","am","nirātaṅka","","","am","nirātaṅkam"
"2","nirālambam","NIRĀLAM","bam","nirālamba","noun-adj","","bam","nirālambam"
"3","niṣprapañcam","NIṢPRAPAÑC","am","niṣprapañca","noun-adj","","am","niṣprapañcam"
"4","nirāśrayam","NIRĀŚRAY","am","nirāśraya","noun-adj","","am","nirāśrayam"
"5","nirāmayam","NIRĀMAY","am","nirāmaya","noun-adj","","am","nirāmayam"
"6","nirākāram","NIRĀKĀR","am","nirākāra","noun-adj","","am","nirākāram"
"7","tattvam","TATTV","am","tattva","noun-adj","","am","tattvam"
"8","tattva","TATTV","a","tattva","noun-adj","","a","tattva"
"9","vidaḥ","VID","aḥ","vid","noun-adj","vid","aḥ","vidaḥ"
"10","viduḥ","VID","uḥ","vidu","noun-adj","","uḥ","viduḥ"
"11","//","","","","punct","","","//"
"","</s>","","","","","","",""
"","<s number = ""92"">","","","","","","",""
"1","śabda","ŚABD","a","śabda","noun-adj","","a","śabda"
"2","ādyāḥ","ĀD","yāḥ","ādi","noun-adj","","yāḥ","ādyāḥ"
"3","pañca","PAÑC","a","pañca","noun-adj","","a","pañca"
"4","yā","","","yad","pron","","","yad"
"5","mātrā","MĀTR","ā","mātra","noun-adj","","āḥ","mātrāḥ"
"6","yāvat","YĀVAT","","yāvat","ind","","","yāvat"
"7","karṇa","KARṆ","a","karṇa","noun-adj","","a","karṇa"
"8","ādiṣu","ĀD","iṣu","ādi","noun-adj","","iṣu","ādiṣu"
"9","smṛtāḥ","SMṚT","āḥ","smṛta","noun-adj","","āḥ","smṛtāḥ"
"10","tāvat","TĀVAT","","tāvat","ind","","","tāvat"
"11","eva","","","eva","ind","","","eva"
"12","smṛtam","SMṚT","am","smṛta","noun-adj","","am","smṛtam"
"13","dhyānam","DHYĀN","am","dhyāna","noun-adj","","am","dhyānam"
"14","tad","TAD","","tad","pron","","","tad"
"15","samādhiḥ","SAMĀDH","iḥ","samādhi","noun-adj","","iḥ","samādhiḥ"
"16","atas","","","atas","ind","","","atas"
"17","param","PARAM","","parama","noun-adj","","","param"
"18","//","","","","punct","","","//"
"","</s>","","","","","","",""
"","<s number = ""93"">","","","","","","",""
"1","yadā","","","yadā","ind","","","yadā"
"2","saṃkṣīyate","SAṂKṢĪ","yate","saṃkṣi","verb","saṃkṣi","yate","saṃkṣīyate"
"3","prāṇaḥ","PRĀṆ","aḥ","prāṇa","noun-adj","","aḥ","prāṇaḥ"
"4","mānasam","MĀNAS","am","mānasa","noun-adj","","am","mānasam"
"5","ca","","","ca","ind","","","ca"
"6","vilīyate","VILĪ","yate","vilī","verb","vilī","yate","vilīyate"
"7","tadā","","","tadā","ind","","","tadā"
"8","samarasa","SAMAR","asa","samar","verb","","asi","samarasi"
"9","ekatvam","EK","atvam","ekatva","noun-adj","","atvam","ekatvam"
"10","samādhiḥ","SAMĀDH","iḥ","samādhi","noun-adj","","iḥ","samādhiḥ"
"11","abhidhīyate","ABHIDHĪ","yate","abhidadh","verb","abhidhā","yate","abhidhīyate"
"12","//","","","","punct","","","//"
"","</s>","","","","","","",""
"","<s number = ""94"">","","","","","","",""
"1","dhāraṇāḥ","DHĀRAṆ","āḥ","dhāraṇī","noun-adj","","āḥ","dhāraṇāḥ"
"2","pañca","PAÑC","a","pañca","noun-adj","","a","pañca"
"3","nāḍyaḥ","NĀḌY","aḥ","nāḍyā","noun-adj","","aḥ","nāḍyaḥ"
"4","tu","","","tu","ind","","","tu"
"5","dhyānam","DHYĀN","am","dhyāna","noun-adj","","am","dhyānam"
"6","ca","","","ca","ind","","","ca"
"7","ṣaṣṭhi","ṢAṢṬH","i","ṣaṣṭhi","noun-adj","","i","ṣaṣṭhi"
"8","nāḍikāḥ","NĀḌIK","āḥ","nāḍika","noun-adj","","āḥ","nāḍikāḥ"
"9","dina","DIN","a","dina","noun-adj","","a","dina"
"10","dvādaśakena","DVĀDAŚAK","ena","dvādaśaka","","","ena","dvādaśakena"
"11","eva","","","eva","ind","","","eva"
"12","samādhiḥ","SAMĀDH","iḥ","samādhi","noun-adj","","iḥ","samādhiḥ"
"13","prāṇa","PRĀṆ","a","prāṇa","noun-adj","","a","prāṇa"
"14","saṃyamaḥ","SAṂYAM","aḥ","saṃyama","noun-adj","","aḥ","saṃyamaḥ"
"15","//","","","","punct","","","//"
"","</s>","","","","","","",""
"","<s number = ""95"">","","","","","","",""
"1","na","","","na","ind","","","na"
"2","gandham","GANDH","am","gandha","noun-adj","","am","gandham"
"3","na","","","na","ind","","","na"
"4","rasam","RAS","am","rasa","noun-adj","","am","rasam"
"5","rūpam","RŪP","am","rūpa","noun-adj","","am","rūpam"
"6","na","","","na","ind","","","na"
"7","sparśam","SPARŚ","am","sparśa","noun-adj","","am","sparśam"
"8","na","","","na","ind","","","na"
"9","ca","","","ca","ind","","","ca"
"10","niḥsvanam","NIḤSVAN","am","niḥsvana","noun-adj","","am","niḥsvanam"
"11","ātmānam","ĀTM","ānam","ātman","noun-adj","","ānam","ātmānam"
"12","na","","","na","ind","","","na"
"13","param","PARAM","","parama","noun-adj","","","param"
"14","vetti","VET","ti","vid","verb","vid","ti","vetti"
"15","yogī","YOG","ī","yogin","noun-adj","","ī","yogī"
"16","yuktaḥ","YUKT","aḥ","yukta","noun-adj","","aḥ","yuktaḥ"
"17","samādhinā","SAMĀDH","inā","samādhi","noun-adj","","inā","samādhinā"
"18","//","","","","punct","","","//"
"","</s>","","","","","","",""
"","<s number = ""96"">","","","","","","",""
"1","khādyate","KHĀD","yate","khād","verb","khād","yate","khādyate"
"2","na","","","na","ind","","","na"
"3","ca","","","ca","ind","","","ca"
"4","kālena","KĀL","ena","kāla","noun-adj","","ena","kālena"
"5","bādhyate","BĀDH","yate","bādh","verb","bādh","yate","bādhyate"
"6","na","","","na","ind","","","na"
"7","ca","","","ca","ind","","","ca"
"8","karmaṇā","KARM","aṇā","karman","noun-adj","","aṇā","karmaṇā"
"9","sādhyate","SĀDH","yate","sādh","verb","sādh","yate","sādhyate"
"10","na","","","na","ind","","","na"
"11","ca","","","ca","ind","","","ca"
"12","kena","","","kim","pron","","","kim"
"13","api","","","api","ind","","","api"
"14","yogī","YOG","ī","yogin","noun-adj","","ī","yogī"
"15","yuktaḥ","YUKT","aḥ","yukta","noun-adj","","aḥ","yuktaḥ"
"16","samādhinā","SAMĀDH","inā","samādhi","noun-adj","","inā","samādhinā"
"17","//","","","","punct","","","//"
"","</s>","","","","","","",""
"","<s number = ""97"">","","","","","","",""
"1","nirmalam","NIRMAL","am","nirmala","noun-adj","","am","nirmalam"
"2","niścalam","NIŚCAL","am","niścala","noun-adj","","am","niścalam"
"3","nityam","NITY","am","nitya","noun-adj","","am","nityam"
"4","niṣkriyam","NIṢKRIY","am","niṣkriya","noun-adj","","am","niṣkriyam"
"5","nirguṇam","NIRGUṆ","am","nirguṇa","noun-adj","","am","nirguṇam"
"6","mahat","MAHAT","","mahat","noun-adj","","","mahat"
"7","vyoma","VYOM","a","vyoma","noun-adj","","a","vyoma"
"8","vijñānam","VIJÑĀN","am","vijñāna","noun-adj","","am","vijñānam"
"9","ānandam","ĀNAND","am","ānanda","noun-adj","","am","ānandam"
"10","brahma","BRAHM","a","brahman","noun-adj","","a","brahma"
"11","brahma","BRAHM","a","brahman","noun-adj","","a","brahma"
"12","vidaḥ","VID","aḥ","vid","noun-adj","vid","aḥ","vidaḥ"
"13","viduḥ","VID","uḥ","vidu","noun-adj","","uḥ","viduḥ"
"14","//","","","","punct","","","//"
"","</s>","","","","","","",""
"","<s number = ""98"">","","","","","","",""
"1","dugdhe","DUGDH","e","dugdha","noun-adj","","e","dugdhe"
"2","kṣīram","KṢĪR","am","kṣīra","noun-adj","","am","kṣīram"
"3","dhṛte","DHṚT","e","dhṛti","noun-adj","","e","dhṛte"
"4","sarpiḥ","SARP","iḥ","sarpis","noun-adj","","iḥ","sarpiḥ"
"5","agnau","AGN","au","agni","noun-adj","","au","agnau"
"6","vahniḥ","VAHN","iḥ","vahni","noun-adj","","iḥ","vahniḥ"
"7","iva","","","iva","ind","","","iva"
"8","arpitaḥ","ARPIT","aḥ","arpita","noun-adj","","aḥ","arpitaḥ"
"9","advayatvam","","","","","","",""
"10","vrajet","VRAJ","et","vraj","verb","","et","vrajet"
"11","nityam","NITY","am","nitya","noun-adj","","am","nityam"
"12","yoga","YOG","a","yoga","noun-adj","","a","yoga"
"13","vid","VID","","vid","noun-adj","","","vid"
"14","parame","PARAM","e","parama","noun-adj","","e","parame"
"15","pade","PAD","e","pada","noun-adj","","e","pade"
"16","//","","","","punct","","","//"
"","</s>","","","","","","",""
"","<s number = ""99"">","","","","","","",""
"1","bhava","BHAV","a","bhava","noun-adj","","a","bhava"
"2","bhaya","BHAY","a","bhaya","noun-adj","","a","bhaya"
"3","vane","VAN","e","vana","noun-adj","","e","vane"
"4","vahniḥ","VAHN","iḥ","vahni","noun-adj","","iḥ","vahniḥ"
"5","mukti","MUKT","i","mukti","noun-adj","","i","mukti"
"6","sopāna","SOPĀN","a","sopāna","noun-adj","","a","sopāna"
"7","mārgataḥ","MĀRG","ataḥ","mārga","noun-adj","","ataḥ","mārgataḥ"
"8","a","","","alpha_privativum","ind","","","alpha_privativum"
"9","dvayatvam","DVAY","atvam","dvayatva","noun-adj","","atvam","dvayatvam"
"10","vrajet","VRAJ","et","vraj","verb","","et","vrajet"
"11","nityam","NITY","am","nitya","noun-adj","","am","nityam"
"12","yoga","YOG","a","yoga","noun-adj","","a","yoga"
"13","vid","VID","","vid","noun-adj","","","vid"
"14","parame","PARAM","e","parama","noun-adj","","e","parame"
"15","pade","PAD","e","pada","noun-adj","","e","pade"
"16","//","","","","punct","","","//"
"","</s>","","","","","","",""
"","<s number = ""100"">","","","","","","",""
"1","gorakṣa","GORAKṢ","a","gorakṣa","","","a","gorakṣa"
"2","śatakam","ŚATAK","am","śataka","noun-adj","","am","śatakam"
"3","samāptam","SAMĀPT","am","samāpta","noun-adj","","am","samāptam"
