"WordID","word","NormSTEM","suffix","lemma","PoS","Root","NormSuffix","NormWord"
1,"_","_","_","brahman","NC","","_","_"
2,"_","_","_","vak","V","vac","_","_"
1,"ya","_","_","yad","PRL","","_","_"
2,"utpanno","_","_","utpad","PPP","","_","_"
3,"mahān","_","_","mahat","NC","","_","_"
4,"pūrvam","_","_","pūrva","CX","","_","_"
5,"ahaṃkāraḥ","_","_","ahaṃkāra","NC","","_","_"
6,"sa","_","_","tad","PRD","","_","_"
7,"ucyate","_","_","vak","V","vac","_","_"
1,"aham","_","_","mat","PPR","","_","_"
2,"_","_","_","iti","CQT","","_","_"
3,"_","_","_","eva","CEM","","_","_"
4,"sambhūto","_","_","sambhū","PPP","","_","_"
5,"dvitīyaḥ","_","_","dvitīya","JJ","","_","_"
6,"sarga","_","_","sarga","NC","","_","_"
7,"ucyate","_","_","vak","V","vac","_","_"
1,"_","_","_","ahaṃkāra","NC","","_","_"
2,"_","_","_","ca","CCD","","_","_"
3,"bhūtādir","_","_","bhūtādi","NC","","_","_"
4,"vaikārika","_","_","vaikārika","JJ","","_","_"
5,"iti","_","_","iti","CQT","","_","_"
6,"smṛtaḥ","_","_","smṛ","PPP","","_","_"
1,"_","_","_","tejas","NC","","_","_"
2,"_","_","_","cetanā","NC","","_","_"
3,"dhātuḥ","_","_","dhātu","NC","","_","_"
4,"_","_","_","prajā","NC","","_","_"
5,"_","_","_","sarga","NC","","_","_"
6,"prajāpatiḥ","_","_","prajāpati","NC","","_","_"
1,"devānāṃ","_","_","deva","NC","","_","_"
2,"prabhavo","_","_","prabhava","NC","","_","_"
3,"devo","_","_","deva","NC","","_","_"
4,"_","_","_","manas","NC","","_","_"
5,"_","_","_","ca","CCD","","_","_"
6,"_","_","_","tri","NUM","","_","_"
7,"_","_","_","loka","NC","","_","_"
8,"_","_","_","kṛt","JJ","","_","_"
1,"aham","_","_","mat","PPR","","_","_"
2,"_","_","_","iti","CQT","","_","_"
3,"_","_","_","eva","CEM","","_","_"
4,"tat","_","_","tad","PRD","","_","_"
5,"sarvam","_","_","sarva","JQ","","_","_"
6,"abhimantā","_","_","abhimantṛ","JJ","","_","_"
7,"sa","_","_","tad","PRD","","_","_"
8,"ucyate","_","_","vak","V","vac","_","_"
1,"_","_","_","adhyātma","NC","","_","_"
2,"_","_","_","jñāna","NC","","_","_"
3,"_","_","_","nitya","JJ","","_","_"
4,"munīnāṃ","_","_","muni","NC","","_","_"
5,"bhāvitātmanām","_","_","bhāvitātman","JJ","","_","_"
1,"_","_","_","svādhyāya","NC","","_","_"
2,"_","_","_","kratu","NC","","_","_"
3,"_","_","_","sidh","PPP","","_","_"
4,"eṣa","_","_","tad","PRD","","_","_"
5,"lokaḥ","_","_","loka","NC","","_","_"
6,"sanātanaḥ","_","_","sanātana","JJ","","_","_"
1,"_","_","_","ahaṃkāra","NC","","_","_"
2,"_","_","_","āhṛ","KDP","","_","_"
3,"guṇān","_","_","guṇa","NC","","_","_"
4,"imān","_","_","ida","PRD","","_","_"
5,"bhūtādir","_","_","bhūtādi","NC","","_","_"
6,"evaṃ","_","_","eva","CX","","_","_"
7,"sṛjate","_","_","sṛj","V","sṛj","_","_"
8,"sa","_","_","tad","PRD","","_","_"
9,"_","_","_","bhūta","NC","","_","_"
10,"_","_","_","kṛt","JJ","","_","_"
1,"vaikārikaḥ","_","_","vaikārika","JJ","","_","_"
2,"sarvam","_","_","sarva","JQ","","_","_"
3,"idaṃ","_","_","ida","PRD","","_","_"
4,"viceṣṭate","_","_","viceṣṭ","V","viceṣṭ","_","_"
5,"_","_","_","sva","JJ","","_","_"
6,"_","_","_","tejas","NC","","_","_"
7,"rañjayate","_","_","raj","V","raj","_","_"
8,"jagat","_","_","jagat","NC","","_","_"
9,"tathā","_","_","tathā","CX","","_","_"
