"WordID","word","NormSTEM","suffix","lemma","PoS","Root","NormSuffix","NormWord"
1,"janamejaya","_","_","janamejaya","NC","","_","_"
2,"uvāca","_","_","vak","V","vac","_","_"
1,"dṛṣṭvā","_","_","dṛś","CGDA","","_","_"
2,"_","_","_","putra","NC","","_","_"
3,"_","_","_","tathā","CX","","_","_"
4,"pautrān","_","_","pautra","NC","","_","_"
5,"_","_","_","sa_saha","CX","","_","_"
6,"_","_","_","anubandha","NC","","_","_"
7,"_","_","_","janādhipa","NC","","_","_"
1,"dhṛtarāṣṭraḥ","_","_","dhṛtarāṣṭra","NC","","_","_"
2,"kim","_","_","kiṃ","PRQ","","_","_"
3,"akarod","_","_","kar","V","kṛ","_","_"
4,"rājā","_","_","rājan","NC","","_","_"
5,"_","_","_","ca","CCD","","_","_"
6,"_","_","_","eva","CEM","","_","_"
7,"yudhiṣṭhiraḥ","_","_","yudhiṣṭhira","NC","","_","_"
1,"vaiśaṃpāyana","_","_","vaiśampāyana","NC","","_","_"
2,"uvāca","_","_","vak","V","vac","_","_"
1,"tad","_","_","tad","PRD","","_","_"
2,"dṛṣṭvā","_","_","dṛś","CGDA","","_","_"
3,"mahad","_","_","mahat","JJ","","_","_"
4,"āścaryaṃ","_","_","āścarya","NC","","_","_"
5,"putrāṇāṃ","_","_","putra","NC","","_","_"
6,"darśanaṃ","_","_","darśana","NC","","_","_"
7,"punaḥ","_","_","punar","CAD","","_","_"
1,"_","_","_","vī","PPP","","_","_"
2,"_","_","_","śoka","NC","","_","_"
3,"sa","_","_","tad","PRD","","_","_"
4,"_","_","_","rājan","NC","","_","_"
5,"_","_","_","ṛṣi","NC","","_","_"
6,"punar","_","_","punar","CAD","","_","_"
7,"āśramam","_","_","āśrama","NC","","_","_"
8,"āgamat","_","_","āgacch","V","āgam","_","_"
1,"_","_","_","itara","PPX","","_","_"
2,"_","_","_","tu","CCD","","_","_"
3,"janaḥ","_","_","jana","NC","","_","_"
4,"_","_","_","sarva","JQ","","_","_"
5,"_","_","_","tad","PRD","","_","_"
6,"_","_","_","ca","CCD","","_","_"
7,"_","_","_","eva","CEM","","_","_"
8,"_","_","_","parama","JJ","","_","_"
9,"_","_","_","ṛṣi","NC","","_","_"
1,"pratijagmur","_","_","pratigacch","V","pratigam","_","_"
2,"yathākāmaṃ","_","_","yathākāma","JJ","","_","_"
3,"_","_","_","dhṛtarāṣṭra","NC","","_","_"
4,"_","_","_","abhyanujñā","NC","","_","_"
1,"_","_","_","pāṇḍava","NC","","_","_"
2,"_","_","_","tu","CCD","","_","_"
3,"mahātmāno","_","_","mahātman","JJ","","_","_"
4,"_","_","_","laghu","JJ","","_","_"
5,"_","_","_","bhūyiṣṭha","JJ","","_","_"
6,"_","_","_","sainika","NC","","_","_"
1,"anujagmur","_","_","anuga","V","anuga","_","_"
2,"mahātmānaṃ","_","_","mahātman","JJ","","_","_"
3,"_","_","_","sa_saha","CX","","_","_"
4,"_","_","_","dāra","NC","","_","_"
5,"taṃ","_","_","tad","PRD","","_","_"
6,"mahīpatim","_","_","mahīpati","NC","","_","_"
1,"tam","_","_","tad","PRD","","_","_"
2,"_","_","_","āśrama","NC","","_","_"
3,"_","_","_","ga","PPP","","_","_"
4,"dhīmān","_","_","dhīmat","JJ","","_","_"
5,"_","_","_","brahman","NC","","_","_"
6,"_","_","_","ṛṣi","NC","","_","_"
7,"_","_","_","loka","NC","","_","_"
8,"_","_","_","pūjay","PPP","","_","_"
1,"muniḥ","_","_","muni","NC","","_","_"
2,"_","_","_","satyavatī","NC","","_","_"
3,"_","_","_","putra","NC","","_","_"
4,"dhṛtarāṣṭram","_","_","dhṛtarāṣṭra","NC","","_","_"
5,"abhāṣata","_","_","bhāṣ","V","bhāṣ","_","_"
1,"dhṛtarāṣṭra","_","_","dhṛtarāṣṭra","NC","","_","_"
2,"_","_","_","mahat","JJ","","_","_"
3,"_","_","_","bāhu","NC","","_","_"
4,"śṛṇu","_","_","śṛṇ","V","śru","_","_"
5,"_","_","_","kaurava","NC","","_","_"
6,"_","_","_","nandana","NC","","_","_"
1,"śrutaṃ","_","_","śru","PPP","","_","_"
2,"te","_","_","tvat","PPR","","_","_"
3,"_","_","_","jñāna","NC","","_","_"
4,"_","_","_","vṛdh","PPP","","_","_"
5,"ṛṣīṇāṃ","_","_","ṛṣi","NC","","_","_"
6,"_","_","_","puṇya","JJ","","_","_"
7,"_","_","_","karman","NC","","_","_"
1,"_","_","_","ṛdh","PPP","","_","_"
2,"_","_","_","abhijana","NC","","_","_"
3,"_","_","_","vṛdh","PPP","","_","_"
4,"_","_","_","veda","NC","","_","_"
5,"_","_","_","vedāṅga","NC","","_","_"
6,"_","_","_","vedin","JJ","","_","_"
1,"_","_","_","dharma","NC","","_","_"
2,"_","_","_","jña","JJ","","_","_"
3,"purāṇānāṃ","_","_","purāṇa","JJ","","_","_"
4,"vadatāṃ","_","_","vad","KDP","","_","_"
5,"vividhāḥ","_","_","vividha","JJ","","_","_"
6,"kathāḥ","_","_","kathā","NC","","_","_"
1,"mā","_","_","mā","CNG","","_","_"
2,"sma","_","_","sma","CX","","_","_"
3,"śoke","_","_","śoka","NC","","_","_"
4,"manaḥ","_","_","manas","NC","","_","_"
5,"kārṣīr","_","_","kar","V","kṛ","_","_"
6,"diṣṭena","_","_","diṣṭa","NC","","_","_"
7,"vyathate","_","_","vyath","V","vyath","_","_"
8,"budhaḥ","_","_","budha","JJ","","_","_"
1,"śrutaṃ","_","_","śru","PPP","","_","_"
2,"_","_","_","deva","NC","","_","_"
3,"_","_","_","rahasya","NC","","_","_"
4,"te","_","_","tvat","PPR","","_","_"
5,"nāradād","_","_","nārada","NC","","_","_"
6,"devadarśanāt","_","_","devadarśana","NC","","_","_"
1,"_","_","_","ga","PPP","","_","_"
2,"_","_","_","tad","PRD","","_","_"
3,"_","_","_","kṣatra","NC","","_","_"
4,"_","_","_","dharma","NC","","_","_"
5,"_","_","_","śastra","NC","","_","_"
6,"_","_","_","pū","PPP","","_","_"
7,"gatiṃ","_","_","gati","NC","","_","_"
8,"śubhām","_","_","śubha","JJ","","_","_"
1,"yathā","_","_","yathā","CCM","","_","_"
2,"_","_","_","dṛś","PPP","","_","_"
3,"_","_","_","tvat","PPR","","_","_"
4,"putrā","_","_","putra","NC","","_","_"
5,"_","_","_","yathā","CCM","","_","_"
6,"_","_","_","kāma","NC","","_","_"
7,"_","_","_","vihārin","JJ","","_","_"
1,"_","_","_","yudhiṣṭhira","NC","","_","_"
2,"_","_","_","tu","CCD","","_","_"
3,"_","_","_","ida","PRD","","_","_"
4,"dhīmān","_","_","dhīmat","JJ","","_","_"
5,"bhavantam","_","_","bhavat","JJ","","_","_"
6,"anurudhyate","_","_","anurudh","V","anurudh","_","_"
1,"sahito","_","_","sahita","JJ","","_","_"
2,"bhrātṛbhiḥ","_","_","bhrātṛ","NC","","_","_"
3,"sarvaiḥ","_","_","sarva","JQ","","_","_"
4,"_","_","_","sa_saha","CX","","_","_"
5,"_","_","_","dāra","NC","","_","_"
6,"_","_","_","sa_saha","CX","","_","_"
7,"_","_","_","suhṛd","NC","","_","_"
8,"_","_","_","jana","NC","","_","_"
1,"_","_","_","visarjay","V","visarjay","_","_"
2,"_","_","_","a","PRD","","_","_"
3,"_","_","_","yā","V","yā","_","_"
4,"_","_","_","tad","PRD","","_","_"
5,"_","_","_","sva","JJ","","_","_"
6,"_","_","_","rājya","NC","","_","_"
7,"anuśāsatām","_","_","anuśās","KDP","","_","_"
1,"māsaḥ","_","_","māsa","NC","","_","_"
2,"samadhiko","_","_","samadhika","JJ","","_","_"
3,"_","_","_","hi","CX","","_","_"
4,"_","_","_","ida","PRD","","_","_"
5,"atīto","_","_","atī","PPP","","_","_"
6,"vasatāṃ","_","_","vas","KDP","","_","_"
7,"vane","_","_","vana","NC","","_","_"
1,"_","_","_","tad","PRD","","_","_"
2,"_","_","_","hi","CX","","_","_"
3,"nityaṃ","_","_","nitya","CX","","_","_"
4,"yatnena","_","_","yatna","NC","","_","_"
5,"padaṃ","_","_","pada","NC","","_","_"
6,"rakṣyaṃ","_","_","rakṣ","KDG","","_","_"
7,"paraṃtapa","_","_","paraṃtapa","JJ","","_","_"
1,"_","_","_","bahu","JJ","","_","_"
2,"_","_","_","pratyarthika","NC","","_","_"
3,"_","_","_","hi","CX","","_","_"
4,"_","_","_","tad","PRD","","_","_"
5,"rājyaṃ","_","_","rājya","NC","","_","_"
6,"nāma","_","_","nāma","CX","","_","_"
7,"narādhipa","_","_","narādhipa","NC","","_","_"
1,"_","_","_","iti","CQT","","_","_"
2,"_","_","_","vac","PPP","","_","_"
3,"kauravo","_","_","kaurava","NC","","_","_"
4,"rājā","_","_","rājan","NC","","_","_"
5,"_","_","_","vyāsa","NC","","_","_"
6,"_","_","_","amita","JJ","","_","_"
7,"_","_","_","buddhi","NC","","_","_"
1,"yudhiṣṭhiram","_","_","yudhiṣṭhira","NC","","_","_"
2,"_","_","_","atha","CAD","","_","_"
3,"_","_","_","āhvā","CGDA","","_","_"
4,"vāgmī","_","_","vāgmin","JJ","","_","_"
5,"vacanam","_","_","vacana","NC","","_","_"
6,"abravīt","_","_","abravīta","V","brū","_","_"
1,"ajātaśatro","_","_","ajātaśatru","NC","","_","_"
2,"bhadraṃ","_","_","bhadra","NC","","_","_"
3,"te","_","_","tvat","PPR","","_","_"
4,"śṛṇu","_","_","śṛṇ","V","śru","_","_"
5,"me","_","_","mat","PPR","","_","_"
6,"bhrātṛbhiḥ","_","_","bhrātṛ","NC","","_","_"
7,"saha","_","_","saha","CX","","_","_"
1,"_","_","_","tvat","PPR","","_","_"
2,"_","_","_","prasāda","NC","","_","_"
3,"_","_","_","mahīpāla","NC","","_","_"
4,"śoko","_","_","śoka","NC","","_","_"
5,"_","_","_","na","CNG","","_","_"
6,"_","_","_","mat","PPR","","_","_"
7,"prabādhate","_","_","prabādh","V","prabādh","_","_"
1,"rame","_","_","ra","V","ra","_","_"
2,"_","_","_","ca","CCD","","_","_"
3,"_","_","_","mat","PPR","","_","_"
4,"tvayā","_","_","tvat","PPR","","_","_"
5,"putra","_","_","putra","NC","","_","_"
6,"_","_","_","purā","CX","","_","_"
7,"_","_","_","iva","CCM","","_","_"
8,"gajasāhvaye","_","_","gajasāhvaya","NC","","_","_"
1,"_","_","_","nātha","NC","","_","_"
2,"_","_","_","anuga","PPP","","_","_"
3,"vidvan","_","_","vidvas","JJ","","_","_"
4,"priyeṣu","_","_","priya","JJ","","_","_"
5,"parivartinā","_","_","parivartin","JJ","","_","_"
1,"prāptaṃ","_","_","prāp","PPP","","_","_"
2,"_","_","_","putra","NC","","_","_"
3,"_","_","_","phala","NC","","_","_"
4,"tvattaḥ","_","_","tvat","PPR","","_","_"
5,"prītir","_","_","prīti","NC","","_","_"
6,"me","_","_","mat","PPR","","_","_"
7,"vipulā","_","_","vipula","JJ","","_","_"
8,"tvayi","_","_","tvat","PPR","","_","_"
1,"na","_","_","na","CNG","","_","_"
2,"me","_","_","mat","PPR","","_","_"
3,"manyur","_","_","manyu","NC","","_","_"
4,"_","_","_","mahat","JJ","","_","_"
5,"_","_","_","bāhu","NC","","_","_"
6,"gamyatāṃ","_","_","ga","V","ga","_","_"
7,"putra","_","_","putra","NC","","_","_"
8,"māciram","_","_","mācira","CX","","_","_"
1,"bhavantaṃ","_","_","bhavat","JJ","","_","_"
2,"_","_","_","ca","CCD","","_","_"
3,"_","_","_","iha","CAD","","_","_"
4,"samprekṣya","_","_","samprekṣ","CGDA","","_","_"
5,"tapo","_","_","tapas","NC","","_","_"
6,"me","_","_","mat","PPR","","_","_"
7,"parihīyate","_","_","parijah","V","parihā","_","_"
1,"_","_","_","tapas","NC","","_","_"
2,"_","_","_","yuj","PPP","","_","_"
3,"śarīraṃ","_","_","śarīra","NC","","_","_"
4,"ca","_","_","ca","CCD","","_","_"
5,"tvāṃ","_","_","tvat","PPR","","_","_"
6,"dṛṣṭvā","_","_","dṛś","CGDA","","_","_"
7,"dhāritaṃ","_","_","dhāray","PPP","","_","_"
8,"punaḥ","_","_","punar","CAD","","_","_"
1,"mātarau","_","_","mātṛ","NC","","_","_"
2,"te","_","_","tvat","PPR","","_","_"
3,"_","_","_","tathā","CX","","_","_"
4,"_","_","_","eva","CEM","","_","_"
5,"_","_","_","ida","PRD","","_","_"
6,"_","_","_","śṛ","PPP","","_","_"
7,"_","_","_","parṇa","NC","","_","_"
8,"_","_","_","kṛ","PPP","","_","_"
9,"_","_","_","aśana","NC","","_","_"
1,"mama","_","_","mat","PPR","","_","_"
2,"_","_","_","tulya","JJ","","_","_"
3,"_","_","_","vrata","NC","","_","_"
4,"putra","_","_","putra","NC","","_","_"
5,"naciraṃ","_","_","nacira","CX","","_","_"
6,"vartayiṣyataḥ","_","_","vartay","V","vartay","_","_"
1,"_","_","_","duryodhana","NC","","_","_"
2,"_","_","_","prabhṛti","NC","","_","_"
3,"dṛṣṭā","_","_","dṛś","PPP","","_","_"
4,"_","_","_","loka","NC","","_","_"
5,"_","_","_","antara","JJ","","_","_"
6,"gatāḥ","_","_","ga","PPP","","_","_"
1,"vyāsasya","_","_","vyāsa","NC","","_","_"
2,"tapaso","_","_","tapas","NC","","_","_"
3,"vīryād","_","_","vīrya","NC","","_","_"
4,"_","_","_","bhavat","JJ","","_","_"
5,"_","_","_","ca","CCD","","_","_"
6,"samāgamāt","_","_","samāgama","NC","","_","_"
1,"prayojanaṃ","_","_","prayojana","NC","","_","_"
2,"ciraṃ","_","_","cira","CX","","_","_"
3,"vṛttaṃ","_","_","vṛt","PPP","","_","_"
4,"jīvitasya","_","_","jīvita","NC","","_","_"
5,"ca","_","_","ca","CCD","","_","_"
6,"me","_","_","mat","PPR","","_","_"
7,"'nagha","_","_","anagha","JJ","","_","_"
1,"ugraṃ","_","_","ugra","JJ","","_","_"
2,"tapaḥ","_","_","tapas","NC","","_","_"
3,"samāsthāsye","_","_","samātiṣṭh","V","samāsthā","_","_"
4,"tvam","_","_","tvat","PPR","","_","_"
5,"anujñātum","_","_","anujñā","CGDI","","_","_"
6,"arhasi","_","_","arh","V","arh","_","_"
1,"_","_","_","tvat","PPR","","_","_"
2,"_","_","_","adya","CX","","_","_"
3,"piṇḍaḥ","_","_","piṇḍa","NC","","_","_"
4,"_","_","_","kīrti","NC","","_","_"
5,"_","_","_","ca","CCD","","_","_"
6,"kulaṃ","_","_","kula","NC","","_","_"
7,"_","_","_","ca","CCD","","_","_"
8,"_","_","_","ida","PRD","","_","_"
9,"pratiṣṭhitam","_","_","pratiṣṭhā","PPP","","_","_"
1,"śvo","_","_","śvas","CX","","_","_"
2,"_","_","_","vā","CCD","","_","_"
3,"_","_","_","adya","CX","","_","_"
4,"vā","_","_","vā","CCD","","_","_"
5,"_","_","_","mahat","JJ","","_","_"
6,"_","_","_","bāhu","NC","","_","_"
7,"gamyatāṃ","_","_","ga","V","ga","_","_"
8,"putra","_","_","putra","NC","","_","_"
9,"māciram","_","_","mācira","CX","","_","_"
1,"_","_","_","rājan","NC","","_","_"
2,"_","_","_","nīti","NC","","_","_"
3,"_","_","_","su","CAD","","_","_"
4,"_","_","_","bahuśas","CX","","_","_"
5,"śrutā","_","_","śru","PPP","","_","_"
6,"te","_","_","tvat","PPR","","_","_"
7,"_","_","_","bharata","NC","","_","_"
8,"_","_","_","ṛṣabha","NC","","_","_"
1,"saṃdeṣṭavyaṃ","_","_","saṃdiś","KDG","","_","_"
2,"na","_","_","na","CNG","","_","_"
3,"paśyāmi","_","_","paś","V","paś","_","_"
4,"kṛtam","_","_","kṛ","PPP","","_","_"
5,"etāvatā","_","_","etāvat","JJ","","_","_"
6,"vibho","_","_","vibhu","JJ","","_","_"
1,"_","_","_","iti","CQT","","_","_"
2,"_","_","_","vac","PPP","","_","_"
3,"_","_","_","vacana","NC","","_","_"
4,"tāta","_","_","tāta","NC","","_","_"
5,"nṛpo","_","_","nṛpa","NC","","_","_"
6,"rājānam","_","_","rājan","NC","","_","_"
7,"abravīt","_","_","abravīta","V","brū","_","_"
1,"na","_","_","na","CNG","","_","_"
2,"mām","_","_","mat","PPR","","_","_"
3,"arhasi","_","_","arh","V","arh","_","_"
4,"_","_","_","dharma","NC","","_","_"
5,"_","_","_","jña","JJ","","_","_"
6,"parityaktum","_","_","parityaj","CGDI","","_","_"
7,"anāgasam","_","_","anāgas","JJ","","_","_"
1,"kāmaṃ","_","_","kāma","CX","","_","_"
2,"gacchantu","_","_","gacch","V","gam","_","_"
3,"me","_","_","mat","PPR","","_","_"
4,"sarve","_","_","sarva","JQ","","_","_"
5,"bhrātaro","_","_","bhrātṛ","NC","","_","_"
6,"_","_","_","anucara","NC","","_","_"
7,"_","_","_","tathā","CX","","_","_"
1,"bhavantam","_","_","bhavat","JJ","","_","_"
2,"aham","_","_","mat","PPR","","_","_"
3,"anviṣye","_","_","anviṣ","V","anviṣ","_","_"
4,"mātarau","_","_","mātṛ","NC","","_","_"
5,"ca","_","_","ca","CCD","","_","_"
6,"_","_","_","ya","PPP","","_","_"
7,"_","_","_","vrata","NC","","_","_"
1,"tam","_","_","tad","PRD","","_","_"
2,"_","_","_","vak","V","vac","_","_"
3,"_","_","_","atha","CAD","","_","_"
4,"gāndhārī","_","_","gāndhārī","NC","","_","_"
5,"_","_","_","mā","CNG","","_","_"
6,"_","_","_","eva","CX","","_","_"
7,"putra","_","_","putra","NC","","_","_"
8,"śṛṇuṣva","_","_","śṛṇ","V","śru","_","_"
9,"me","_","_","mat","PPR","","_","_"
1,"_","_","_","tvat","PPR","","_","_"
2,"_","_","_","adhīna","JJ","","_","_"
3,"_","_","_","kuru","NC","","_","_"
4,"_","_","_","kula","NC","","_","_"
5,"_","_","_","piṇḍa","NC","","_","_"
6,"_","_","_","ca","CCD","","_","_"
7,"śvaśurasya","_","_","śvaśura","NC","","_","_"
8,"me","_","_","mat","PPR","","_","_"
1,"gamyatāṃ","_","_","ga","V","ga","_","_"
2,"putra","_","_","putra","NC","","_","_"
3,"paryāptam","_","_","paryāp","PPP","","_","_"
4,"etāvat","_","_","etāvat","JJ","","_","_"
5,"pūjitā","_","_","pūjay","PPP","","_","_"
6,"vayam","_","_","mat","PPR","","_","_"
1,"rājā","_","_","rājan","NC","","_","_"
2,"yad","_","_","yad","PRL","","_","_"
3,"āha","_","_","ah","V","ah","_","_"
4,"tat","_","_","tad","PRD","","_","_"
5,"kāryaṃ","_","_","kṛ","KDG","","_","_"
6,"tvayā","_","_","tvat","PPR","","_","_"
7,"putra","_","_","putra","NC","","_","_"
8,"pitur","_","_","pitṛ","NC","","_","_"
9,"vacaḥ","_","_","vacas","NC","","_","_"
1,"_","_","_","iti","CQT","","_","_"
2,"_","_","_","vac","PPP","","_","_"
3,"sa","_","_","tad","PRD","","_","_"
4,"tu","_","_","tu","CCD","","_","_"
5,"gāndhāryā","_","_","gāndhārī","NC","","_","_"
6,"kuntīm","_","_","kuntī","NC","","_","_"
7,"idam","_","_","ida","PRD","","_","_"
8,"uvāca","_","_","vak","V","vac","_","_"
9,"ha","_","_","ha","CEM","","_","_"
1,"_","_","_","sneha","NC","","_","_"
2,"_","_","_","bāṣpa","NC","","_","_"
3,"_","_","_","ākula","JJ","","_","_"
4,"netre","_","_","netra","NC","","_","_"
5,"pramṛjya","_","_","pramṛj","CGDA","","_","_"
6,"rudatīṃ","_","_","rud","KDP","","_","_"
7,"vacaḥ","_","_","vacas","NC","","_","_"
1,"visarjayati","_","_","visarjay","V","visarjay","_","_"
2,"māṃ","_","_","mat","PPR","","_","_"
3,"rājā","_","_","rājan","NC","","_","_"
4,"gāndhārī","_","_","gāndhārī","NC","","_","_"
5,"ca","_","_","ca","CCD","","_","_"
6,"yaśasvinī","_","_","yaśasvin","JJ","","_","_"
1,"bhavatyāṃ","_","_","bhavat","JJ","","_","_"
2,"_","_","_","bandh","PPP","","_","_"
3,"_","_","_","citta","NC","","_","_"
4,"_","_","_","tu","CCD","","_","_"
5,"kathaṃ","_","_","katha","CX","","_","_"
6,"yāsyāmi","_","_","yā","V","yā","_","_"
7,"duḥkhitaḥ","_","_","duḥkhita","JJ","","_","_"
1,"na","_","_","na","CNG","","_","_"
2,"_","_","_","ca","CCD","","_","_"
3,"_","_","_","utsah","V","utsah","_","_"
4,"_","_","_","tapas","NC","","_","_"
5,"_","_","_","vighna","NC","","_","_"
6,"kartuṃ","_","_","kṛ","CGDI","","_","_"
7,"te","_","_","tvat","PPR","","_","_"
8,"_","_","_","dharma","NC","","_","_"
9,"_","_","_","cārin","JJ","","_","_"
1,"tapaso","_","_","tapas","NC","","_","_"
2,"hi","_","_","hi","CX","","_","_"
3,"paraṃ","_","_","para","PPX","","_","_"
4,"_","_","_","na","CNG","","_","_"
5,"_","_","_","as","V","as","_","_"
6,"tapasā","_","_","tapas","NC","","_","_"
7,"vindate","_","_","vid","V","vid","_","_"
8,"mahat","_","_","mahat","JJ","","_","_"
1,"_","_","_","mat","PPR","","_","_"
2,"_","_","_","api","CX","","_","_"
3,"na","_","_","na","CNG","","_","_"
4,"tathā","_","_","tathā","CX","","_","_"
5,"rājñi","_","_","rājñī","NC","","_","_"
6,"rājye","_","_","rājya","NC","","_","_"
7,"buddhir","_","_","buddhi","NC","","_","_"
8,"yathā","_","_","yathā","CCM","","_","_"
9,"purā","_","_","purā","CX","","_","_"
1,"_","_","_","tapas","NC","","_","_"
2,"_","_","_","eva","CEM","","_","_"
3,"_","_","_","anurañj","PPP","","_","_"
4,"me","_","_","mat","PPR","","_","_"
5,"manaḥ","_","_","manas","NC","","_","_"
6,"_","_","_","sarva","JQ","","_","_"
7,"_","_","_","ātman","NC","","_","_"
8,"tathā","_","_","tathā","CX","","_","_"
1,"_","_","_","śūnya","JJ","","_","_"
2,"_","_","_","ida","PRD","","_","_"
3,"ca","_","_","ca","CCD","","_","_"
4,"mahī","_","_","mahī","NC","","_","_"
5,"sarvā","_","_","sarva","JQ","","_","_"
6,"na","_","_","na","CNG","","_","_"
7,"me","_","_","mat","PPR","","_","_"
8,"_","_","_","prīti","NC","","_","_"
9,"_","_","_","kara","JJ","","_","_"
10,"śubhe","_","_","śubha","JJ","","_","_"
1,"bāndhavā","_","_","bāndhava","NC","","_","_"
2,"naḥ","_","_","mat","PPR","","_","_"
3,"parikṣīṇā","_","_","parikṣi","PPP","","_","_"
4,"balaṃ","_","_","bala","NC","","_","_"
5,"no","_","_","mat","PPR","","_","_"
6,"na","_","_","na","CNG","","_","_"
7,"yathā","_","_","yathā","CCM","","_","_"
8,"purā","_","_","purā","CX","","_","_"
1,"pāñcālāḥ","_","_","pāñcāla","NC","","_","_"
2,"_","_","_","su","CAD","","_","_"
3,"_","_","_","bhṛśa","CX","","_","_"
4,"kṣīṇāḥ","_","_","kṣi","PPP","","_","_"
5,"_","_","_","kanyā","NC","","_","_"
6,"_","_","_","mātra","NC","","_","_"
7,"_","_","_","avaśeṣay","PPP","","_","_"
1,"na","_","_","na","CNG","","_","_"
2,"teṣāṃ","_","_","tad","PRD","","_","_"
3,"_","_","_","kula","NC","","_","_"
4,"_","_","_","kartṛ","JJ","","_","_"
5,"kaṃcit","_","_","kiṃcit","PRI","","_","_"
6,"_","_","_","darś","V","dṛś","_","_"
7,"_","_","_","mat","PPR","","_","_"
8,"śubhe","_","_","śubha","JJ","","_","_"
1,"sarve","_","_","sarva","JQ","","_","_"
2,"hi","_","_","hi","CX","","_","_"
3,"_","_","_","bhasmasāt","CX","","_","_"
4,"_","_","_","nī","PPP","","_","_"
5,"_","_","_","droṇa","NC","","_","_"
6,"_","_","_","eka","PPX","","_","_"
7,"saṃyuge","_","_","saṃyuga","NC","","_","_"
1,"_","_","_","avaśeṣa","NC","","_","_"
2,"_","_","_","tu","CCD","","_","_"
3,"nihatā","_","_","nihan","PPP","","_","_"
4,"droṇaputreṇa","_","_","droṇaputra","NC","","_","_"
5,"vai","_","_","vai","CX","","_","_"
6,"niśi","_","_","niś","NC","","_","_"
1,"_","_","_","cedi","NC","","_","_"
2,"_","_","_","ca","CCD","","_","_"
3,"_","_","_","eva","CEM","","_","_"
4,"_","_","_","matsya","NC","","_","_"
5,"_","_","_","ca","CCD","","_","_"
6,"_","_","_","dṛś","PPP","","_","_"
7,"_","_","_","pūrva","PPX","","_","_"
8,"_","_","_","tathā","CX","","_","_"
9,"_","_","_","eva","CEM","","_","_"
10,"naḥ","_","_","mat","PPR","","_","_"
1,"kevalaṃ","_","_","kevala","JJ","","_","_"
2,"_","_","_","vṛṣṇi","NC","","_","_"
3,"_","_","_","cakra","NC","","_","_"
4,"tu","_","_","tu","CCD","","_","_"
5,"_","_","_","vāsudeva","NC","","_","_"
6,"_","_","_","parigraha","NC","","_","_"
1,"yaṃ","_","_","yad","PRL","","_","_"
2,"dṛṣṭvā","_","_","dṛś","CGDA","","_","_"
3,"sthātum","_","_","sthā","CGDI","","_","_"
4,"icchāmi","_","_","iṣ","V","iṣ","_","_"
5,"_","_","_","dharma","NC","","_","_"
6,"_","_","_","artha","NC","","_","_"
7,"_","_","_","na","CNG","","_","_"
8,"_","_","_","anya","PPX","","_","_"
9,"_","_","_","hetuka","JJ","","_","_"
1,"śivena","_","_","śiva","NC","","_","_"
2,"paśya","_","_","paś","V","paś","_","_"
3,"naḥ","_","_","mat","PPR","","_","_"
4,"sarvān","_","_","sarva","JQ","","_","_"
5,"durlabhaṃ","_","_","durlabha","JJ","","_","_"
6,"darśanaṃ","_","_","darśana","NC","","_","_"
7,"tava","_","_","tvat","PPR","","_","_"
1,"bhaviṣyaty","_","_","bhav","V","bhū","_","_"
2,"amba","_","_","ambā","NC","","_","_"
3,"rājā","_","_","rājan","NC","","_","_"
4,"hi","_","_","hi","CX","","_","_"
5,"tīvram","_","_","tīvra","JJ","","_","_"
6,"ārapsyate","_","_","ārabh","V","ārabh","_","_"
7,"tapaḥ","_","_","tapas","NC","","_","_"
1,"_","_","_","tad","PRD","","_","_"
2,"_","_","_","śru","CGDA","","_","_"
3,"_","_","_","mahat","JJ","","_","_"
4,"_","_","_","bāhu","NC","","_","_"
5,"sahadevo","_","_","sahadeva","NC","","_","_"
6,"yudhāṃ","_","_","yudh","NC","","_","_"
7,"patiḥ","_","_","pati","NC","","_","_"
1,"yudhiṣṭhiram","_","_","yudhiṣṭhira","NC","","_","_"
2,"_","_","_","vak","V","vac","_","_"
3,"_","_","_","ida","PRD","","_","_"
4,"_","_","_","bāṣpa","NC","","_","_"
5,"_","_","_","vyākula","JJ","","_","_"
6,"_","_","_","locana","NC","","_","_"
1,"_","_","_","na","CNG","","_","_"
2,"_","_","_","utsah","V","utsah","_","_"
3,"'haṃ","_","_","mat","PPR","","_","_"
4,"parityaktuṃ","_","_","parityaj","CGDI","","_","_"
5,"mātaraṃ","_","_","mātṛ","NC","","_","_"
6,"_","_","_","pārthiva","NC","","_","_"
7,"_","_","_","ṛṣabha","NC","","_","_"
1,"pratiyātu","_","_","pratiyā","V","pratiyā","_","_"
2,"bhavān","_","_","bhavat","JJ","","_","_"
3,"kṣipraṃ","_","_","kṣipra","CX","","_","_"
4,"_","_","_","tapas","NC","","_","_"
5,"_","_","_","tap","V","tap","_","_"
6,"_","_","_","mat","PPR","","_","_"
7,"vane","_","_","vana","NC","","_","_"
1,"_","_","_","iha","CAD","","_","_"
2,"_","_","_","eva","CEM","","_","_"
3,"śoṣayiṣyāmi","_","_","śuṣ","V","śuṣ","_","_"
4,"_","_","_","tapas","NC","","_","_"
5,"_","_","_","mat","PPR","","_","_"
6,"kalevaram","_","_","kalevara","NC","","_","_"
1,"_","_","_","pāda","NC","","_","_"
2,"_","_","_","śuśrūṣaṇa","NC","","_","_"
3,"yukto","_","_","yuj","PPP","","_","_"
4,"rājño","_","_","rājan","NC","","_","_"
5,"_","_","_","mātṛ","NC","","_","_"
6,"_","_","_","tathā","CX","","_","_"
7,"_","_","_","ida","PRD","","_","_"
1,"tam","_","_","tad","PRD","","_","_"
2,"uvāca","_","_","vak","V","vac","_","_"
3,"tataḥ","_","_","tatas","CX","","_","_"
4,"kuntī","_","_","kuntī","NC","","_","_"
5,"pariṣvajya","_","_","pariṣvaj","CGDA","","_","_"
6,"_","_","_","mahat","JJ","","_","_"
7,"_","_","_","bhuja","NC","","_","_"
1,"gamyatāṃ","_","_","ga","V","ga","_","_"
2,"putra","_","_","putra","NC","","_","_"
3,"_","_","_","mā","CNG","","_","_"
4,"_","_","_","eva","CEM","","_","_"
5,"tvaṃ","_","_","tvat","PPR","","_","_"
6,"vocaḥ","_","_","vak","V","vac","_","_"
7,"kuru","_","_","kar","V","kṛ","_","_"
8,"vaco","_","_","vacas","NC","","_","_"
9,"mama","_","_","mat","PPR","","_","_"
1,"āgamā","_","_","āgama","NC","","_","_"
2,"vaḥ","_","_","tvat","PPR","","_","_"
3,"śivāḥ","_","_","śiva","JJ","","_","_"
4,"santu","_","_","as","V","as","_","_"
5,"svasthā","_","_","svastha","JJ","","_","_"
6,"bhavata","_","_","bhav","V","bhū","_","_"
7,"putrakāḥ","_","_","putraka","NC","","_","_"
1,"uparodho","_","_","uparodha","NC","","_","_"
2,"bhaved","_","_","bhav","V","bhū","_","_"
3,"evam","_","_","eva","CX","","_","_"
4,"asmākaṃ","_","_","mat","PPR","","_","_"
5,"tapasaḥ","_","_","tapas","NC","","_","_"
6,"kṛte","_","_","kṛte","CX","","_","_"
1,"_","_","_","tvat","PPR","","_","_"
2,"_","_","_","sneha","NC","","_","_"
3,"_","_","_","pāśa","NC","","_","_"
4,"_","_","_","bandh","PPP","","_","_"
5,"ca","_","_","ca","CCD","","_","_"
6,"hīyeyaṃ","_","_","jah","V","hā","_","_"
7,"tapasaḥ","_","_","tapas","NC","","_","_"
8,"parāt","_","_","para","PPX","","_","_"
1,"tasmāt","_","_","tasmāt","CX","","_","_"
2,"putraka","_","_","putraka","NC","","_","_"
3,"gaccha","_","_","ga","V","ga","_","_"
4,"tvaṃ","_","_","tvat","PPR","","_","_"
5,"śiṣṭam","_","_","śiṣ","PPP","","_","_"
6,"alpaṃ","_","_","alpa","JJ","","_","_"
7,"hi","_","_","hi","CX","","_","_"
8,"naḥ","_","_","mat","PPR","","_","_"
9,"prabho","_","_","prabhu","JJ","","_","_"
1,"evaṃ","_","_","eva","CX","","_","_"
2,"saṃstambhitaṃ","_","_","saṃstambhay","PPP","","_","_"
3,"vākyaiḥ","_","_","vākya","NC","","_","_"
4,"kuntyā","_","_","kuntī","NC","","_","_"
5,"bahuvidhair","_","_","bahuvidha","JJ","","_","_"
6,"manaḥ","_","_","manas","NC","","_","_"
1,"sahadevasya","_","_","sahadeva","NC","","_","_"
2,"_","_","_","rājan","NC","","_","_"
3,"_","_","_","indra","NC","","_","_"
4,"_","_","_","rājan","NC","","_","_"
5,"_","_","_","ca","CCD","","_","_"
6,"_","_","_","eva","CEM","","_","_"
7,"viśeṣataḥ","_","_","viśeṣataḥ","CX","","_","_"
1,"te","_","_","tad","PRD","","_","_"
2,"mātrā","_","_","mātṛ","NC","","_","_"
3,"samanujñātā","_","_","samanujñā","PPP","","_","_"
4,"rājñā","_","_","rājan","NC","","_","_"
5,"ca","_","_","ca","CCD","","_","_"
6,"_","_","_","kuru","NC","","_","_"
7,"_","_","_","puṃgava","NC","","_","_"
1,"abhivādya","_","_","abhivāday","CGDA","","_","_"
2,"_","_","_","kuru","NC","","_","_"
3,"_","_","_","śreṣṭha","JJ","","_","_"
4,"āmantrayitum","_","_","āmantray","CGDI","","_","_"
5,"ārabhan","_","_","ārabh","V","ārabh","_","_"
1,"rājan","_","_","rājan","NC","","_","_"
2,"pratigamiṣyāmaḥ","_","_","pratiga","V","pratiga","_","_"
3,"śivena","_","_","śiva","NC","","_","_"
4,"pratinanditāḥ","_","_","pratinand","PPP","","_","_"
1,"_","_","_","anujñā","PPP","","_","_"
2,"_","_","_","tvat","PPR","","_","_"
3,"rājan","_","_","rājan","NC","","_","_"
4,"gamiṣyāmo","_","_","ga","V","ga","_","_"
5,"vikalmaṣāḥ","_","_","vikalmaṣa","JJ","","_","_"
1,"evam","_","_","eva","CX","","_","_"
2,"uktaḥ","_","_","vac","PPP","","_","_"
3,"sa","_","_","tad","PRD","","_","_"
4,"_","_","_","rājan","NC","","_","_"
5,"_","_","_","ṛṣi","NC","","_","_"
6,"dharmarājñā","_","_","dharmarājan","NC","","_","_"
7,"mahātmanā","_","_","mahātman","JJ","","_","_"
1,"anujajñe","_","_","anujān","V","anujñā","_","_"
2,"_","_","_","jaya","NC","","_","_"
3,"_","_","_","āśis","NC","","_","_"
4,"abhinandya","_","_","abhinand","CGDA","","_","_"
5,"yudhiṣṭhiram","_","_","yudhiṣṭhira","NC","","_","_"
1,"bhīmaṃ","_","_","bhīma","NC","","_","_"
2,"ca","_","_","ca","CCD","","_","_"
3,"balināṃ","_","_","balin","JJ","","_","_"
4,"śreṣṭhaṃ","_","_","śreṣṭha","JJ","","_","_"
5,"sāntvayāmāsa","_","_","sāntvay","V","sāntvay","_","_"
6,"pārthivaḥ","_","_","pārthiva","NC","","_","_"
1,"sa","_","_","tad","PRD","","_","_"
2,"_","_","_","ca","CCD","","_","_"
3,"_","_","_","ida","PRD","","_","_"
4,"samyaṅ","_","_","samyak","CX","","_","_"
5,"medhāvī","_","_","medhāvin","JJ","","_","_"
6,"pratyapadyata","_","_","pratipad","V","pratipad","_","_"
7,"vīryavān","_","_","vīryavat","JJ","","_","_"
1,"arjunaṃ","_","_","arjuna","NC","","_","_"
2,"ca","_","_","ca","CCD","","_","_"
3,"samāśliṣya","_","_","samāśliṣ","CGDA","","_","_"
4,"yamau","_","_","yama","NC","","_","_"
5,"ca","_","_","ca","CCD","","_","_"
6,"_","_","_","puruṣa","NC","","_","_"
7,"_","_","_","ṛṣabha","NC","","_","_"
1,"anujajñe","_","_","anujān","V","anujñā","_","_"
2,"sa","_","_","tad","PRD","","_","_"
3,"kauravyaḥ","_","_","kauravya","NC","","_","_"
4,"_","_","_","pariṣvaj","CGDA","","_","_"
5,"_","_","_","abhinand","CGDA","","_","_"
6,"ca","_","_","ca","CCD","","_","_"
1,"gāndhāryā","_","_","gāndhārī","NC","","_","_"
2,"_","_","_","ca","CCD","","_","_"
3,"_","_","_","abhyanujñā","PPP","","_","_"
4,"_","_","_","kṛ","PPP","","_","_"
5,"_","_","_","pāda","NC","","_","_"
6,"_","_","_","abhivandana","NC","","_","_"
1,"jananyā","_","_","jananī","NC","","_","_"
2,"samupāghrātāḥ","_","_","samupāghrā","PPP","","_","_"
3,"_","_","_","pariṣvaj","PPP","","_","_"
4,"_","_","_","ca","CCD","","_","_"
5,"te","_","_","tad","PRD","","_","_"
6,"nṛpam","_","_","nṛpa","NC","","_","_"
1,"cakruḥ","_","_","kar","V","kṛ","_","_"
2,"pradakṣiṇaṃ","_","_","pradakṣiṇa","JJ","","_","_"
3,"sarve","_","_","sarva","JQ","","_","_"
4,"vatsā","_","_","vatsa","NC","","_","_"
5,"iva","_","_","iva","CCM","","_","_"
6,"nivāraṇe","_","_","nivāraṇa","NC","","_","_"
1,"punaḥ","_","_","punar","CAD","","_","_"
2,"punar","_","_","punar","CAD","","_","_"
3,"nirīkṣantaḥ","_","_","nirīkṣ","KDP","","_","_"
4,"_","_","_","praga","V","praga","_","_"
5,"_","_","_","tad","PRD","","_","_"
6,"pradakṣiṇam","_","_","pradakṣiṇa","JJ","","_","_"
1,"_","_","_","tathā","CX","","_","_"
2,"_","_","_","eva","CEM","","_","_"
3,"draupadī","_","_","draupadī","NC","","_","_"
4,"sādhvī","_","_","sādhu","JJ","","_","_"
5,"sarvāḥ","_","_","sarva","JQ","","_","_"
6,"_","_","_","kaurava","NC","","_","_"
7,"_","_","_","yoṣit","NC","","_","_"
1,"nyāyataḥ","_","_","nyāyatas","CX","","_","_"
2,"śvaśure","_","_","śvaśura","NC","","_","_"
3,"vṛttiṃ","_","_","vṛtti","NC","","_","_"
4,"prayujya","_","_","prayuj","CGDA","","_","_"
5,"_","_","_","prayā","V","prayā","_","_"
6,"_","_","_","tatas","CX","","_","_"
1,"śvaśrūbhyāṃ","_","_","śvaśrū","NC","","_","_"
2,"samanujñātāḥ","_","_","samanujñā","PPP","","_","_"
3,"_","_","_","pariṣvaj","CGDA","","_","_"
4,"_","_","_","abhinand","PPP","","_","_"
1,"_","_","_","saṃdiś","PPP","","_","_"
2,"_","_","_","ca","CCD","","_","_"
3,"_","_","_","iti","CQT","","_","_"
4,"_","_","_","kṛ","KDG","","_","_"
5,"prayayur","_","_","prayā","V","prayā","_","_"
6,"bhartṛbhiḥ","_","_","bhartṛ","NC","","_","_"
7,"saha","_","_","saha","CX","","_","_"
1,"tataḥ","_","_","tatas","CX","","_","_"
2,"prajajñe","_","_","prajan","V","prajan","_","_"
3,"ninadaḥ","_","_","ninada","NC","","_","_"
4,"sūtānāṃ","_","_","sūta","NC","","_","_"
5,"yujyatām","_","_","yuj","V","yuj","_","_"
6,"iti","_","_","iti","CQT","","_","_"
1,"uṣṭrāṇāṃ","_","_","uṣṭra","NC","","_","_"
2,"krośatāṃ","_","_","kruś","KDP","","_","_"
3,"_","_","_","ca","CCD","","_","_"
4,"_","_","_","eva","CEM","","_","_"
5,"hayānāṃ","_","_","haya","NC","","_","_"
6,"heṣatām","_","_","heṣ","KDP","","_","_"
7,"api","_","_","api","CX","","_","_"
1,"tato","_","_","tatas","CX","","_","_"
2,"yudhiṣṭhiro","_","_","yudhiṣṭhira","NC","","_","_"
3,"rājā","_","_","rājan","NC","","_","_"
4,"_","_","_","sa_saha","CX","","_","_"
5,"_","_","_","dāra","NC","","_","_"
6,"_","_","_","saha","CX","","_","_"
7,"_","_","_","sainika","NC","","_","_"
1,"nagaraṃ","_","_","nagara","NC","","_","_"
2,"hāstinapuraṃ","_","_","hāstinapura","NC","","_","_"
3,"punar","_","_","punar","CAD","","_","_"
4,"āyāt","_","_","āyā","V","āyā","_","_"
5,"_","_","_","sa_saha","CX","","_","_"
6,"_","_","_","bāndhava","NC","","_","_"
