"WordID","word","NormSTEM","suffix","lemma","PoS","Root","NormSuffix","NormWord"
1,"sanatsujāta","_","_","sanatsujāta","NC","","_","_"
2,"uvāca","_","_","vak","V","vac","_","_"
1,"yat","_","_","yad","PRL","","_","_"
2,"_","_","_","tad","PRD","","_","_"
3,"_","_","_","śukra","JJ","","_","_"
4,"_","_","_","mahat","JJ","","_","_"
5,"_","_","_","jyotis","NC","","_","_"
6,"dīpyamānaṃ","_","_","dīp","KDP","","_","_"
7,"mahad","_","_","mahat","JJ","","_","_"
8,"yaśaḥ","_","_","yaśas","NC","","_","_"
1,"tad","_","_","tad","PRD","","_","_"
2,"vai","_","_","vai","CX","","_","_"
3,"devā","_","_","deva","NC","","_","_"
4,"upāsante","_","_","upās","V","upās","_","_"
5,"yasmād","_","_","yad","PRL","","_","_"
6,"arko","_","_","arka","NC","","_","_"
7,"virājate","_","_","virājata","V","virāj","_","_"
1,"_","_","_","yogin","NC","","_","_"
2,"_","_","_","tad","PRD","","_","_"
3,"prapaśyanti","_","_","prapaś","V","prapaś","_","_"
4,"bhagavantaṃ","_","_","bhagavat","JJ","","_","_"
5,"sanātanam","_","_","sanātana","JJ","","_","_"
1,"śukrād","_","_","śukra","NC","","_","_"
2,"brahma","_","_","brahman","NC","","_","_"
3,"prabhavati","_","_","prabhav","V","prabhū","_","_"
4,"brahma","_","_","brahman","NC","","_","_"
5,"śukreṇa","_","_","śukra","NC","","_","_"
6,"vardhate","_","_","vṛdh","V","vṛdh","_","_"
1,"_","_","_","tad","PRD","","_","_"
2,"_","_","_","śukra","NC","","_","_"
3,"jyotiṣāṃ","_","_","jyotis","NC","","_","_"
4,"madhye","_","_","madhya","NC","","_","_"
5,"'taptaṃ","_","_","atapta","JJ","","_","_"
6,"tapati","_","_","tap","V","tap","_","_"
7,"tāpanam","_","_","tāpana","JJ","","_","_"
1,"_","_","_","yogin","NC","","_","_"
2,"_","_","_","tad","PRD","","_","_"
3,"prapaśyanti","_","_","prapaś","V","prapaś","_","_"
4,"bhagavantaṃ","_","_","bhagavat","JJ","","_","_"
5,"sanātanam","_","_","sanātana","JJ","","_","_"
1,"āpo","_","_","ap","NC","","_","_"
2,"'tha","_","_","atha","CAD","","_","_"
3,"adbhyaḥ","_","_","ap","NC","","_","_"
4,"salilasya","_","_","salila","NC","","_","_"
5,"madhye","_","_","madhya","NC","","_","_"
6,"ubhau","_","_","ubh","PPX","","_","_"
7,"devau","_","_","deva","NC","","_","_"
8,"śiśriyāte","_","_","śray","V","śri","_","_"
9,"'ntarikṣe","_","_","antarikṣa","NC","","_","_"
1,"sa","_","_","tad","PRD","","_","_"
2,"sadhrīcīḥ","_","_","tad","PRD","","_","_"
3,"sa","_","_","viṣūcī","NC","","_","_"
4,"viṣūcīr","_","_","vas","KDP","","_","_"
5,"vasānā","_","_","ubh","PPX","","_","_"
6,"ubhe","_","_","bhṛ","V","bhṛ","_","_"
7,"bibharti","_","_","pṛthivī","NC","","_","_"
8,"pṛthivīṃ","_","_","div","NC","","_","_"
9,"divaṃ","_","_","ca","CCD","","_","_"
1,"_","_","_","yogin","NC","","_","_"
2,"_","_","_","tad","PRD","","_","_"
3,"prapaśyanti","_","_","prapaś","V","prapaś","_","_"
4,"bhagavantaṃ","_","_","bhagavat","JJ","","_","_"
5,"sanātanam","_","_","sanātana","JJ","","_","_"
1,"ubhau","_","_","ubh","PPX","","_","_"
2,"ca","_","_","ca","CCD","","_","_"
3,"devau","_","_","deva","NC","","_","_"
4,"pṛthivīṃ","_","_","pṛthivī","NC","","_","_"
5,"divaṃ","_","_","div","NC","","_","_"
6,"ca","_","_","ca","CCD","","_","_"
7,"_","_","_","diś","NC","","_","_"
8,"_","_","_","ca","CCD","","_","_"
9,"śukraṃ","_","_","śukra","NC","","_","_"
10,"bhuvanaṃ","_","_","bhuvana","NC","","_","_"
11,"bibharti","_","_","bhṛ","V","bhṛ","_","_"
1,"tasmād","_","_","tad","PRD","","_","_"
2,"diśaḥ","_","_","diś","NC","","_","_"
3,"_","_","_","sarit","NC","","_","_"
4,"_","_","_","ca","CCD","","_","_"
5,"sravanti","_","_","srav","V","sru","_","_"
6,"tasmāt","_","_","tad","PRD","","_","_"
7,"samudrā","_","_","samudra","NC","","_","_"
8,"vihitā","_","_","vidhā","PPP","","_","_"
9,"mahāntaḥ","_","_","mahat","JJ","","_","_"
1,"_","_","_","yogin","NC","","_","_"
2,"_","_","_","tad","PRD","","_","_"
3,"prapaśyanti","_","_","prapaś","V","prapaś","_","_"
4,"bhagavantaṃ","_","_","bhagavat","JJ","","_","_"
5,"sanātanam","_","_","sanātana","JJ","","_","_"
1,"cakre","_","_","cakra","NC","","_","_"
2,"rathasya","_","_","ratha","NC","","_","_"
3,"tiṣṭhantaṃ","_","_","sthā","KDP","","_","_"
4,"_","_","_","dhruva","JJ","","_","_"
5,"_","_","_","avyaya","JJ","","_","_"
6,"_","_","_","karman","NC","","_","_"
1,"ketumantaṃ","_","_","ketumat","NC","","_","_"
2,"_","_","_","vah","V","vah","_","_"
3,"_","_","_","aśva","NC","","_","_"
4,"_","_","_","tad","PRD","","_","_"
5,"divyam","_","_","divya","JJ","","_","_"
6,"ajaraṃ","_","_","ajara","JJ","","_","_"
7,"divi","_","_","div","NC","","_","_"
1,"_","_","_","yogin","NC","","_","_"
2,"_","_","_","tad","PRD","","_","_"
3,"prapaśyanti","_","_","prapaś","V","prapaś","_","_"
4,"bhagavantaṃ","_","_","bhagavat","JJ","","_","_"
5,"sanātanam","_","_","sanātana","JJ","","_","_"
1,"na","_","_","na","CNG","","_","_"
2,"sādṛśye","_","_","sādṛśya","NC","","_","_"
3,"tiṣṭhati","_","_","tiṣṭh","V","sthā","_","_"
4,"rūpam","_","_","rūpa","NC","","_","_"
5,"asya","_","_","ida","PRD","","_","_"
6,"na","_","_","na","CNG","","_","_"
7,"cakṣuṣā","_","_","cakṣus","NC","","_","_"
8,"paśyati","_","_","paś","V","paś","_","_"
9,"kaścid","_","_","kiṃcit","PRI","","_","_"
10,"enam","_","_","a","PRD","","_","_"
1,"_","_","_","manīṣā","NC","","_","_"
2,"_","_","_","atho","CX","","_","_"
3,"manasā","_","_","manas","NC","","_","_"
4,"hṛdā","_","_","hṛd","NC","","_","_"
5,"ca","_","_","ca","CCD","","_","_"
6,"ya","_","_","yad","PRL","","_","_"
7,"evaṃ","_","_","eva","CX","","_","_"
8,"vidur","_","_","vid","V","vid","_","_"
9,"_","_","_","amṛta","JJ","","_","_"
10,"_","_","_","tad","PRD","","_","_"
11,"bhavanti","_","_","bhav","V","bhū","_","_"
1,"_","_","_","yogin","NC","","_","_"
2,"_","_","_","tad","PRD","","_","_"
3,"prapaśyanti","_","_","prapaś","V","prapaś","_","_"
4,"bhagavantaṃ","_","_","bhagavat","JJ","","_","_"
5,"sanātanam","_","_","sanātana","JJ","","_","_"
1,"_","_","_","dvādaśan","NUM","","_","_"
2,"_","_","_","pūga","NC","","_","_"
3,"saritaṃ","_","_","sarit","NC","","_","_"
4,"_","_","_","deva","NC","","_","_"
5,"_","_","_","rakṣ","PPP","","_","_"
1,"madhu","_","_","madhu","NC","","_","_"
2,"īśantas","_","_","tadā","CAD","","_","_"
3,"tadā","_","_","saṃcar","V","saṃcar","_","_"
4,"saṃcaranti","_","_","ghora","JJ","","_","_"
1,"_","_","_","yogin","NC","","_","_"
2,"_","_","_","tad","PRD","","_","_"
3,"prapaśyanti","_","_","prapaś","V","prapaś","_","_"
4,"bhagavantaṃ","_","_","bhagavat","JJ","","_","_"
5,"sanātanam","_","_","sanātana","JJ","","_","_"
1,"tad","_","_","tad","PRD","","_","_"
2,"_","_","_","ardha","NC","","_","_"
3,"_","_","_","māsa","NC","","_","_"
4,"pibati","_","_","pib","V","pā","_","_"
5,"saṃcitya","_","_","saṃci","CGDA","","_","_"
6,"bhramaro","_","_","bhramara","NC","","_","_"
7,"madhu","_","_","madhu","NC","","_","_"
1,"īśānaḥ","_","_","īśāna","NC","","_","_"
2,"_","_","_","sarva","JQ","","_","_"
3,"_","_","_","bhūta","NC","","_","_"
4,"_","_","_","havis","NC","","_","_"
5,"_","_","_","bhū","PPP","","_","_"
6,"akalpayat","_","_","kalpay","V","kalpay","_","_"
1,"_","_","_","yogin","NC","","_","_"
2,"_","_","_","tad","PRD","","_","_"
3,"prapaśyanti","_","_","prapaś","V","prapaś","_","_"
4,"bhagavantaṃ","_","_","bhagavat","JJ","","_","_"
5,"sanātanam","_","_","sanātana","JJ","","_","_"
1,"_","_","_","hiraṇya","NC","","_","_"
2,"_","_","_","parṇa","NC","","_","_"
3,"aśvattham","_","_","aśvattha","NC","","_","_"
4,"abhipatya","_","_","abhipat","CGDA","","_","_"
5,"a","_","_","alpha_privativum","JJ","","_","_"
5,"apakṣakāḥ","_","_","pakṣaka","JJ","","_","_"
1,"te","_","_","tad","PRD","","_","_"
2,"tatra","_","_","tatra","CAD","","_","_"
3,"pakṣiṇo","_","_","pakṣin","NC","","_","_"
4,"bhūtvā","_","_","bhū","CGDA","","_","_"
5,"prapatanti","_","_","prapat","V","prapat","_","_"
6,"yathādiśam","_","_","yathādiśa","CX","","_","_"
1,"_","_","_","yogin","NC","","_","_"
2,"_","_","_","tad","PRD","","_","_"
3,"prapaśyanti","_","_","prapaś","V","prapaś","_","_"
4,"bhagavantaṃ","_","_","bhagavat","JJ","","_","_"
5,"sanātanam","_","_","sanātana","JJ","","_","_"
1,"pūrṇāt","_","_","pūrṇa","JJ","","_","_"
2,"_","_","_","pūrṇa","JJ","","_","_"
3,"_","_","_","uddhar","V","uddhṛ","_","_"
4,"pūrṇāt","_","_","pūrṇa","JJ","","_","_"
5,"pūrṇāni","_","_","pūrṇa","JJ","","_","_"
6,"cakrire","_","_","kar","V","kṛ","_","_"
1,"haranti","_","_","har","V","hṛ","_","_"
2,"pūrṇāt","_","_","pūrṇa","JJ","","_","_"
3,"pūrṇāni","_","_","pūrṇa","JJ","","_","_"
4,"pūrṇam","_","_","pūrṇa","JJ","","_","_"
5,"_","_","_","eva","CEM","","_","_"
6,"_","_","_","avaśiṣ","V","avaśiṣ","_","_"
1,"_","_","_","yogin","NC","","_","_"
2,"_","_","_","tad","PRD","","_","_"
3,"prapaśyanti","_","_","prapaś","V","prapaś","_","_"
4,"bhagavantaṃ","_","_","bhagavat","JJ","","_","_"
5,"sanātanam","_","_","sanātana","JJ","","_","_"
1,"tasmād","_","_","tad","PRD","","_","_"
2,"vai","_","_","vai","CX","","_","_"
3,"vāyur","_","_","vāyu","NC","","_","_"
4,"_","_","_","āyā","PPP","","_","_"
5,"_","_","_","tad","PRD","","_","_"
6,"_","_","_","ca","CCD","","_","_"
7,"prayataḥ","_","_","praya","PPP","","_","_"
8,"sadā","_","_","sadā","CAD","","_","_"
1,"tasmād","_","_","tad","PRD","","_","_"
2,"_","_","_","agni","NC","","_","_"
3,"_","_","_","ca","CCD","","_","_"
4,"_","_","_","soma","NC","","_","_"
5,"_","_","_","ca","CCD","","_","_"
6,"_","_","_","tad","PRD","","_","_"
7,"_","_","_","ca","CCD","","_","_"
8,"prāṇa","_","_","prāṇa","NC","","_","_"
9,"ātataḥ","_","_","ātan","PPP","","_","_"
1,"sarvam","_","_","sarva","JQ","","_","_"
2,"eva","_","_","eva","CEM","","_","_"
3,"tato","_","_","tatas","CX","","_","_"
4,"vidyāt","_","_","vid","V","vid","_","_"
5,"tat","_","_","tad","PRD","","_","_"
6,"tad","_","_","tad","PRD","","_","_"
7,"vaktuṃ","_","_","vac","CGDI","","_","_"
8,"na","_","_","na","CNG","","_","_"
9,"śaknumaḥ","_","_","śakn","V","śak","_","_"
1,"_","_","_","yogin","NC","","_","_"
2,"_","_","_","tad","PRD","","_","_"
3,"prapaśyanti","_","_","prapaś","V","prapaś","_","_"
4,"bhagavantaṃ","_","_","bhagavat","JJ","","_","_"
5,"sanātanam","_","_","sanātana","JJ","","_","_"
1,"apānaṃ","_","_","apāna","NC","","_","_"
2,"girati","_","_","gṝ","V","gṝ","_","_"
3,"prāṇaḥ","_","_","prāṇa","NC","","_","_"
4,"prāṇaṃ","_","_","prāṇa","NC","","_","_"
5,"girati","_","_","gṝ","V","gṝ","_","_"
6,"candramāḥ","_","_","candramas","NC","","_","_"
1,"ādityo","_","_","āditya","NC","","_","_"
2,"girate","_","_","gṛ","V","gṛ","_","_"
3,"candram","_","_","candra","NC","","_","_"
4,"ādityaṃ","_","_","āditya","NC","","_","_"
5,"girate","_","_","gṛ","V","gṛ","_","_"
6,"paraḥ","_","_","para","PPX","","_","_"
1,"_","_","_","yogin","NC","","_","_"
2,"_","_","_","tad","PRD","","_","_"
3,"prapaśyanti","_","_","prapaś","V","prapaś","_","_"
4,"bhagavantaṃ","_","_","bhagavat","JJ","","_","_"
5,"sanātanam","_","_","sanātana","JJ","","_","_"
1,"ekaṃ","_","_","eka","PPX","","_","_"
2,"pādaṃ","_","_","pāda","NC","","_","_"
3,"_","_","_","na","CNG","","_","_"
4,"_","_","_","utkṣip","V","utkṣip","_","_"
5,"_","_","_","salila","NC","","_","_"
6,"_","_","_","haṃsa","NC","","_","_"
7,"uccaran","_","_","uccar","KDP","","_","_"
1,"taṃ","_","_","tad","PRD","","_","_"
2,"cet","_","_","ced","CX","","_","_"
3,"satatam","_","_","satata","CX","","_","_"
4,"ṛtvijaṃ","_","_","ṛtvij","NC","","_","_"
5,"na","_","_","na","CNG","","_","_"
6,"mṛtyur","_","_","mṛtyu","NC","","_","_"
7,"_","_","_","na","CNG","","_","_"
8,"_","_","_","amṛta","NC","","_","_"
9,"bhavet","_","_","bhav","V","bhū","_","_"
1,"_","_","_","yogin","NC","","_","_"
2,"_","_","_","tad","PRD","","_","_"
3,"prapaśyanti","_","_","prapaś","V","prapaś","_","_"
4,"bhagavantaṃ","_","_","bhagavat","JJ","","_","_"
5,"sanātanam","_","_","sanātana","JJ","","_","_"
1,"evaṃ","_","_","eva","CX","","_","_"
2,"devo","_","_","deva","NC","","_","_"
3,"mahātmā","_","_","mahātman","JJ","","_","_"
4,"sa","_","_","tad","PRD","","_","_"
5,"pāvakaṃ","_","_","pāvaka","NC","","_","_"
6,"puruṣo","_","_","puruṣa","NC","","_","_"
7,"giran","_","_","gṛ","KDP","","_","_"
1,"yo","_","_","yad","PRL","","_","_"
2,"vai","_","_","vai","CX","","_","_"
3,"taṃ","_","_","tad","PRD","","_","_"
4,"puruṣaṃ","_","_","puruṣa","NC","","_","_"
5,"veda","_","_","vid","V","vid","_","_"
6,"_","_","_","tad","PRD","","_","_"
7,"_","_","_","iha","CAD","","_","_"
8,"_","_","_","ātman","NC","","_","_"
9,"na","_","_","na","CNG","","_","_"
10,"riṣyate","_","_","riṣ","V","riṣ","_","_"
1,"_","_","_","yogin","NC","","_","_"
2,"_","_","_","tad","PRD","","_","_"
3,"prapaśyanti","_","_","prapaś","V","prapaś","_","_"
4,"bhagavantaṃ","_","_","bhagavat","JJ","","_","_"
5,"sanātanam","_","_","sanātana","JJ","","_","_"
1,"yaḥ","_","_","yad","PRL","","_","_"
2,"sahasraṃ","_","_","sahasra","NUM","","_","_"
3,"sahasrāṇāṃ","_","_","sahasra","NUM","","_","_"
4,"pakṣān","_","_","pakṣa","NC","","_","_"
5,"saṃtatya","_","_","saṃtan","CGDA","","_","_"
6,"saṃpatet","_","_","sampat","V","sampat","_","_"
1,"madhyame","_","_","madhyama","JJ","","_","_"
2,"madhya","_","_","madhya","NC","","_","_"
3,"āgacched","_","_","āgacch","V","āgam","_","_"
4,"api","_","_","api","CX","","_","_"
5,"cet","_","_","ced","CX","","_","_"
6,"_","_","_","as","V","as","_","_"
7,"_","_","_","manojava","JJ","","_","_"
1,"_","_","_","yogin","NC","","_","_"
2,"_","_","_","tad","PRD","","_","_"
3,"prapaśyanti","_","_","prapaś","V","prapaś","_","_"
4,"bhagavantaṃ","_","_","bhagavat","JJ","","_","_"
5,"sanātanam","_","_","sanātana","JJ","","_","_"
1,"na","_","_","na","CNG","","_","_"
2,"darśane","_","_","darśana","NC","","_","_"
3,"tiṣṭhati","_","_","tiṣṭh","V","sthā","_","_"
4,"rūpam","_","_","rūpa","NC","","_","_"
5,"asya","_","_","ida","PRD","","_","_"
6,"paśyanti","_","_","paś","V","paś","_","_"
7,"_","_","_","ca","CCD","","_","_"
8,"_","_","_","a","PRD","","_","_"
9,"_","_","_","su","CAD","","_","_"
10,"_","_","_","viśudh","PPP","","_","_"
11,"_","_","_","sattva","NC","","_","_"
1,"hito","_","_","hita","JJ","","_","_"
2,"manīṣī","_","_","manīṣin","JJ","","_","_"
3,"_","_","_","manas","NC","","_","_"
4,"_","_","_","abhipaś","V","abhipaś","_","_"
5,"ye","_","_","yad","PRL","","_","_"
6,"taṃ","_","_","tad","PRD","","_","_"
7,"śrayeyur","_","_","śray","V","śri","_","_"
8,"_","_","_","amṛta","JJ","","_","_"
9,"_","_","_","tad","PRD","","_","_"
10,"bhavanti","_","_","bhav","V","bhū","_","_"
1,"_","_","_","yogin","NC","","_","_"
2,"_","_","_","tad","PRD","","_","_"
3,"prapaśyanti","_","_","prapaś","V","prapaś","_","_"
4,"bhagavantaṃ","_","_","bhagavat","JJ","","_","_"
5,"sanātanam","_","_","sanātana","JJ","","_","_"
1,"gūhanti","_","_","guh","V","guh","_","_"
2,"sarpā","_","_","sarpa","NC","","_","_"
3,"iva","_","_","iva","CCM","","_","_"
4,"gahvarāṇi","_","_","gahvara","NC","","_","_"
5,"_","_","_","sva","JJ","","_","_"
6,"_","_","_","śikṣā","NC","","_","_"
7,"svena","_","_","sva","JJ","","_","_"
8,"vṛttena","_","_","vṛtta","NC","","_","_"
9,"martyāḥ","_","_","martya","NC","","_","_"
1,"teṣu","_","_","tad","PRD","","_","_"
2,"pramuhyanti","_","_","pramuh","V","pramuh","_","_"
3,"janā","_","_","jana","NC","","_","_"
4,"vimūḍhā","_","_","vimuh","PPP","","_","_"
5,"_","_","_","yathā","CCM","","_","_"
6,"_","_","_","adhvan","NC","","_","_"
7,"mohayante","_","_","mohay","V","mohay","_","_"
8,"bhayāya","_","_","bhaya","NC","","_","_"
1,"_","_","_","yogin","NC","","_","_"
2,"_","_","_","tad","PRD","","_","_"
3,"prapaśyanti","_","_","prapaś","V","prapaś","_","_"
4,"bhagavantaṃ","_","_","bhagavat","JJ","","_","_"
5,"sanātanam","_","_","sanātana","JJ","","_","_"
1,"sadā","_","_","sadā","CAD","","_","_"
2,"_","_","_","sadā","CAD","","_","_"
3,"_","_","_","asatkṛ","PPP","","_","_"
4,"_","_","_","as","V","as","_","_"
5,"_","_","_","na","CNG","","_","_"
6,"mṛtyur","_","_","mṛtyu","NC","","_","_"
7,"amṛtaṃ","_","_","amṛta","NC","","_","_"
8,"kutaḥ","_","_","kutas","CX","","_","_"
1,"_","_","_","satya","NC","","_","_"
2,"_","_","_","anṛta","NC","","_","_"
3,"_","_","_","satya","NC","","_","_"
4,"_","_","_","samāna","JJ","","_","_"
5,"_","_","_","bandhana","NC","","_","_"
6,"_","_","_","as","KDP","","_","_"
7,"_","_","_","ca","CCD","","_","_"
8,"yonir","_","_","yoni","NC","","_","_"
9,"_","_","_","asat","JJ","","_","_"
10,"_","_","_","ca","CCD","","_","_"
11,"_","_","_","eka","PPX","","_","_"
12,"eva","_","_","eva","CEM","","_","_"
1,"_","_","_","yogin","NC","","_","_"
2,"_","_","_","tad","PRD","","_","_"
3,"prapaśyanti","_","_","prapaś","V","prapaś","_","_"
4,"bhagavantaṃ","_","_","bhagavat","JJ","","_","_"
5,"sanātanam","_","_","sanātana","JJ","","_","_"
1,"na","_","_","na","CNG","","_","_"
2,"sādhunā","_","_","sādhu","JJ","","_","_"
3,"_","_","_","na","CNG","","_","_"
4,"_","_","_","uta","CCD","","_","_"
5,"asādhunā","_","_","asādhu","JJ","","_","_"
6,"vā","_","_","vā","CCD","","_","_"
7,"samānam","_","_","samāna","JJ","","_","_"
8,"etad","_","_","tad","PRD","","_","_"
9,"dṛśyate","_","_","darś","V","dṛś","_","_"
10,"mānuṣeṣu","_","_","mānuṣa","NC","","_","_"
1,"samānam","_","_","samāna","JJ","","_","_"
2,"etad","_","_","tad","PRD","","_","_"
3,"amṛtasya","_","_","amṛta","NC","","_","_"
4,"vidyād","_","_","vid","V","vid","_","_"
5,"_","_","_","eva","CX","","_","_"
6,"_","_","_","yuj","PPP","","_","_"
7,"madhu","_","_","madhu","NC","","_","_"
8,"tad","_","_","tad","PRD","","_","_"
9,"vai","_","_","vai","CX","","_","_"
10,"parīpset","_","_","parīps","V","parīps","_","_"
1,"_","_","_","yogin","NC","","_","_"
2,"_","_","_","tad","PRD","","_","_"
3,"prapaśyanti","_","_","prapaś","V","prapaś","_","_"
4,"bhagavantaṃ","_","_","bhagavat","JJ","","_","_"
5,"sanātanam","_","_","sanātana","JJ","","_","_"
1,"_","_","_","na","CNG","","_","_"
2,"_","_","_","ida","PRD","","_","_"
3,"_","_","_","ativāda","NC","","_","_"
4,"hṛdayaṃ","_","_","hṛdaya","NC","","_","_"
5,"tāpayanti","_","_","tāpay","V","tāpay","_","_"
6,"_","_","_","na","CNG","","_","_"
7,"_","_","_","anadhīta","JJ","","_","_"
8,"_","_","_","na","CNG","","_","_"
9,"_","_","_","ahuta","JJ","","_","_"
10,"agnihotram","_","_","agnihotra","NC","","_","_"
1,"mano","_","_","manas","NC","","_","_"
2,"brāhmīṃ","_","_","brāhma","JJ","","_","_"
3,"_","_","_","laghu","JJ","","_","_"
5,"ādadhīta","_","_","ādadh","V","ādhā","_","_"
6,"prajñānam","_","_","prajñāna","NC","","_","_"
7,"asya","_","_","ida","PRD","","_","_"
8,"nāma","_","_","nāma","CX","","_","_"
9,"dhīrā","_","_","dhīra","JJ","","_","_"
10,"labhante","_","_","labh","V","labh","_","_"
1,"_","_","_","yogin","NC","","_","_"
2,"_","_","_","tad","PRD","","_","_"
3,"prapaśyanti","_","_","prapaś","V","prapaś","_","_"
4,"bhagavantaṃ","_","_","bhagavat","JJ","","_","_"
5,"sanātanam","_","_","sanātana","JJ","","_","_"
1,"evaṃ","_","_","eva","CX","","_","_"
2,"yaḥ","_","_","yad","PRL","","_","_"
3,"_","_","_","sarva","JQ","","_","_"
4,"_","_","_","bhūta","NC","","_","_"
5,"ātmānam","_","_","ātman","NC","","_","_"
6,"anupaśyati","_","_","anupaś","V","anupaś","_","_"
1,"_","_","_","anyatra","CX","","_","_"
2,"_","_","_","anyatra","CX","","_","_"
3,"yukteṣu","_","_","yuj","PPP","","_","_"
4,"kiṃ","_","_","kim","CX","","_","_"
5,"sa","_","_","tad","PRD","","_","_"
6,"śocet","_","_","śuc","V","śuc","_","_"
7,"tataḥ","_","_","tatas","CX","","_","_"
8,"param","_","_","para","CX","","_","_"
1,"_","_","_","yathā","CCM","","_","_"
2,"_","_","_","udapāna","NC","","_","_"
3,"mahati","_","_","mahat","JJ","","_","_"
4,"sarvataḥ","_","_","sarvatas","CX","","_","_"
5,"_","_","_","samplu","PPP","","_","_"
6,"_","_","_","udaka","NC","","_","_"
1,"evaṃ","_","_","eva","CX","","_","_"
2,"sarveṣu","_","_","sarva","JQ","","_","_"
3,"vedeṣu","_","_","veda","NC","","_","_"
4,"brāhmaṇasya","_","_","brāhmaṇa","NC","","_","_"
5,"vijānataḥ","_","_","vijñā","KDP","","_","_"
1,"_","_","_","aṅguṣṭha","NC","","_","_"
2,"_","_","_","mātra","NC","","_","_"
3,"puruṣo","_","_","puruṣa","NC","","_","_"
4,"mahātmā","_","_","mahātman","JJ","","_","_"
5,"na","_","_","na","CNG","","_","_"
6,"dṛśyate","_","_","darś","V","dṛś","_","_"
7,"'sau","_","_","adas","PRD","","_","_"
8,"hṛdaye","_","_","hṛdaya","NC","","_","_"
9,"niviṣṭaḥ","_","_","niviś","PPP","","_","_"
1,"_","_","_","aja","JJ","","_","_"
2,"_","_","_","cara","JJ","","_","_"
3,"divārātram","_","_","divārātra","NC","","_","_"
4,"_","_","_","atandrita","JJ","","_","_"
5,"_","_","_","ca","CCD","","_","_"
6,"sa","_","_","tad","PRD","","_","_"
7,"taṃ","_","_","tad","PRD","","_","_"
8,"matvā","_","_","man","CGDA","","_","_"
9,"kavir","_","_","kavi","NC","","_","_"
10,"āste","_","_","ās","V","ās","_","_"
11,"prasannaḥ","_","_","prasad","PPP","","_","_"
1,"aham","_","_","mat","PPR","","_","_"
2,"_","_","_","eva","CEM","","_","_"
3,"_","_","_","as","V","as","_","_"
4,"vo","_","_","tvat","PPR","","_","_"
5,"mātā","_","_","mātṛ","NC","","_","_"
6,"pitā","_","_","pitṛ","NC","","_","_"
7,"putro","_","_","putra","NC","","_","_"
8,"_","_","_","as","V","as","_","_"
9,"_","_","_","mat","PPR","","_","_"
10,"punaḥ","_","_","punar","CAD","","_","_"
1,"_","_","_","ātman","NC","","_","_"
2,"_","_","_","mat","PPR","","_","_"
3,"api","_","_","api","CX","","_","_"
4,"sarvasya","_","_","sarva","JQ","","_","_"
5,"_","_","_","yad","PRL","","_","_"
6,"_","_","_","ca","CCD","","_","_"
7,"_","_","_","na","CNG","","_","_"
8,"_","_","_","as","V","as","_","_"
9,"yad","_","_","yad","PRL","","_","_"
10,"asti","_","_","as","V","as","_","_"
11,"ca","_","_","ca","CCD","","_","_"
1,"pitāmaho","_","_","pitāmaha","NC","","_","_"
2,"'smi","_","_","as","V","as","_","_"
3,"sthaviraḥ","_","_","sthavira","JJ","","_","_"
4,"pitā","_","_","pitṛ","NC","","_","_"
5,"_","_","_","putra","NC","","_","_"
6,"_","_","_","ca","CCD","","_","_"
7,"bhārata","_","_","bhārata","NC","","_","_"
1,"_","_","_","mat","PPR","","_","_"
2,"_","_","_","eva","CEM","","_","_"
3,"yūyam","_","_","tvat","PPR","","_","_"
4,"_","_","_","ātman","NC","","_","_"
5,"_","_","_","stha","JJ","","_","_"
6,"na","_","_","na","CNG","","_","_"
7,"me","_","_","mat","PPR","","_","_"
8,"yūyaṃ","_","_","tvat","PPR","","_","_"
9,"na","_","_","na","CNG","","_","_"
10,"vo","_","_","tvat","PPR","","_","_"
11,"_","_","_","api","CX","","_","_"
12,"_","_","_","mat","PPR","","_","_"
1,"_","_","_","ātman","NC","","_","_"
2,"_","_","_","eva","CEM","","_","_"
3,"sthānaṃ","_","_","sthāna","NC","","_","_"
4,"mama","_","_","mat","PPR","","_","_"
5,"janma","_","_","janman","NC","","_","_"
6,"_","_","_","ca","CCD","","_","_"
7,"_","_","_","ātman","NC","","_","_"
8,"_","_","_","veda","NC","","_","_"
9,"_","_","_","pravac","PPP","","_","_"
10,"'ham","_","_","mat","PPR","","_","_"
11,"_","_","_","ajara","JJ","","_","_"
12,"_","_","_","pratiṣṭhā","NC","","_","_"
1,"aṇor","_","_","aṇu","JJ","","_","_"
2,"aṇīyān","_","_","aṇīyas","JJ","","_","_"
3,"sumanāḥ","_","_","sumanas","JJ","","_","_"
4,"_","_","_","sarva","JQ","","_","_"
5,"_","_","_","bhūta","NC","","_","_"
6,"jāgṛmi","_","_","jāgṛ","V","jāgṛ","_","_"
1,"pitaraṃ","_","_","pitṛ","NC","","_","_"
2,"_","_","_","sarva","JQ","","_","_"
3,"_","_","_","bhūta","NC","","_","_"
4,"puṣkare","_","_","puṣkara","NC","","_","_"
5,"nihitaṃ","_","_","nidhā","PPP","","_","_"
6,"viduḥ","_","_","vid","V","vid","_","_"
