"WordID","word","NormSTEM","suffix","lemma","PoS","Root","NormSuffix","NormWord"
1,"_","_","_","prātar","CX","","_","_"
2,"_","_","_","yuj","JJ","","_","_"
3,"vi","_","_","vi","CADP","","_","_"
4,"_","_","_","bodhay","V","bodhay","_","_"
5,"_","_","_","aśvin","NC","","_","_"
6,"_","_","_","ā","CADP","","_","_"
7,"_","_","_","iha","CAD","","_","_"
8,"gacchatām","_","_","gacch","V","gam","_","_"
1,"asya","_","_","ida","PRD","","_","_"
2,"somasya","_","_","soma","NC","","_","_"
3,"pītaye","_","_","pīti","NC","","_","_"
1,"yā","_","_","yad","PRL","","_","_"
2,"_","_","_","su","CAD","","_","_"
3,"_","_","_","ratha","NC","","_","_"
4,"_","_","_","rathītama","JJ","","_","_"
5,"_","_","_","ubh","PPX","","_","_"
6,"devā","_","_","deva","NC","","_","_"
7,"divispṛśā","_","_","divispṛś","JJ","","_","_"
1,"aśvinā","_","_","aśvin","NC","","_","_"
2,"tā","_","_","tad","PRD","","_","_"
3,"havāmahe","_","_","hvā","V","hvā","_","_"
1,"yā","_","_","yad","PRL","","_","_"
2,"vāṃ","_","_","tvat","PPR","","_","_"
3,"kaśā","_","_","kaśā","NC","","_","_"
4,"madhumaty","_","_","madhumat","JJ","","_","_"
5,"aśvinā","_","_","aśvin","NC","","_","_"
6,"sūnṛtāvatī","_","_","sūnṛtāvat","JJ","","_","_"
1,"tayā","_","_","tad","PRD","","_","_"
2,"yajñam","_","_","yajña","NC","","_","_"
3,"mimikṣatam","_","_","mikṣ","V","mikṣ","_","_"
1,"nahi","_","_","nahi","CX","","_","_"
2,"vām","_","_","tvat","PPR","","_","_"
3,"asti","_","_","as","V","as","_","_"
4,"dūrake","_","_","dūraka","NC","","_","_"
5,"yatrā","_","_","yatra","CX","","_","_"
6,"rathena","_","_","ratha","NC","","_","_"
7,"gacchathaḥ","_","_","ga","V","ga","_","_"
1,"aśvinā","_","_","aśvin","NC","","_","_"
2,"somino","_","_","somin","JJ","","_","_"
3,"gṛham","_","_","gṛha","NC","","_","_"
1,"_","_","_","hiraṇya","NC","","_","_"
2,"_","_","_","pāṇi","NC","","_","_"
3,"ūtaye","_","_","ūti","NC","","_","_"
4,"savitāram","_","_","savitṛ","NC","","_","_"
5,"upa","_","_","upa","CADP","","_","_"
6,"hvaye","_","_","hvā","V","hvā","_","_"
1,"sa","_","_","tad","PRD","","_","_"
2,"cettā","_","_","cit","V","cit","_","_"
3,"devatā","_","_","devatā","NC","","_","_"
4,"padam","_","_","pada","NC","","_","_"
1,"apāṃ","_","_","ap","NC","","_","_"
2,"napātam","_","_","napāt","NC","","_","_"
3,"avase","_","_","av","CGDI","","_","_"
4,"savitāram","_","_","savitṛ","NC","","_","_"
5,"upa","_","_","upa","CADP","","_","_"
6,"stuhi","_","_","stu","V","stu","_","_"
1,"tasya","_","_","tad","PRD","","_","_"
2,"vratāny","_","_","vrata","NC","","_","_"
3,"uśmasi","_","_","vaś","V","vaś","_","_"
1,"vibhaktāraṃ","_","_","vibhaktṛ","JJ","","_","_"
2,"havāmahe","_","_","hvā","V","hvā","_","_"
3,"vasoś","_","_","vasu","NC","","_","_"
4,"citrasya","_","_","citra","JJ","","_","_"
5,"rādhasaḥ","_","_","rādhas","NC","","_","_"
1,"savitāraṃ","_","_","savitṛ","NC","","_","_"
2,"_","_","_","nṛ","NC","","_","_"
3,"_","_","_","cakṣas","NC","","_","_"
1,"sakhāya","_","_","sakhi","NC","","_","_"
2,"ā","_","_","ā","CADP","","_","_"
3,"ni","_","_","ni","CADP","","_","_"
4,"ṣīdata","_","_","sīd","V","sad","_","_"
5,"savitā","_","_","savitṛ","NC","","_","_"
6,"stomyo","_","_","stomya","JJ","","_","_"
7,"nu","_","_","nu","CX","","_","_"
8,"naḥ","_","_","mat","PPR","","_","_"
1,"dātā","_","_","dātṛ","JJ","","_","_"
2,"rādhāṃsi","_","_","rādhas","NC","","_","_"
3,"śumbhati","_","_","śubh","V","śubh","_","_"
1,"agne","_","_","agni","NC","","_","_"
2,"patnīr","_","_","patnī","NC","","_","_"
3,"_","_","_","iha","CAD","","_","_"
4,"_","_","_","ā","CADP","","_","_"
5,"vaha","_","_","vah","V","vah","_","_"
6,"devānām","_","_","deva","NC","","_","_"
7,"uśatīr","_","_","vaś","KDP","","_","_"
8,"upa","_","_","upa","CADP","","_","_"
1,"tvaṣṭāraṃ","_","_","tvaṣṭṛ","NC","","_","_"
2,"_","_","_","soma","NC","","_","_"
3,"_","_","_","pīti","NC","","_","_"
1,"ā","_","_","ā","CADP","","_","_"
2,"gnā","_","_","gnā","NC","","_","_"
3,"agna","_","_","agni","NC","","_","_"
4,"_","_","_","iha","CAD","","_","_"
5,"_","_","_","av","CGDI","","_","_"
6,"hotrāṃ","_","_","hotrā","NC","","_","_"
7,"yaviṣṭha","_","_","yaviṣṭha","JJ","","_","_"
8,"bhāratīm","_","_","bhāratī","NC","","_","_"
1,"varūtrīṃ","_","_","varūtṛ","JJ","","_","_"
2,"dhiṣaṇāṃ","_","_","dhiṣaṇā","NC","","_","_"
3,"vaha","_","_","vah","V","vah","_","_"
1,"abhi","_","_","abhi","CADP","","_","_"
2,"no","_","_","mat","PPR","","_","_"
3,"devīr","_","_","devī","NC","","_","_"
4,"avasā","_","_","avas","NC","","_","_"
5,"mahaḥ","_","_","mah","JJ","","_","_"
6,"śarmaṇā","_","_","śarman","NC","","_","_"
7,"_","_","_","nṛ","NC","","_","_"
8,"_","_","_","patnī","NC","","_","_"
1,"_","_","_","acchinna","JJ","","_","_"
2,"_","_","_","pattra","NC","","_","_"
3,"sacantām","_","_","sac","V","sac","_","_"
1,"_","_","_","iha","CAD","","_","_"
2,"_","_","_","indrāṇī","NC","","_","_"
3,"upa","_","_","upa","CADP","","_","_"
4,"hvaye","_","_","hvā","V","hvā","_","_"
5,"varuṇānīṃ","_","_","varuṇānī","NC","","_","_"
6,"svastaye","_","_","svasti","NC","","_","_"
1,"agnāyīṃ","_","_","agnāyī","NC","","_","_"
2,"_","_","_","soma","NC","","_","_"
3,"_","_","_","pīti","NC","","_","_"
1,"mahī","_","_","mahi","JJ","","_","_"
2,"dyauḥ","_","_","div","NC","","_","_"
3,"pṛthivī","_","_","pṛthivī","NC","","_","_"
4,"ca","_","_","ca","CCD","","_","_"
5,"na","_","_","mat","PPR","","_","_"
6,"imaṃ","_","_","ida","PRD","","_","_"
7,"yajñam","_","_","yajña","NC","","_","_"
8,"mimikṣatām","_","_","mikṣ","V","mikṣ","_","_"
1,"pipṛtāṃ","_","_","pṛ","V","pṛ","_","_"
2,"no","_","_","mat","PPR","","_","_"
3,"bharīmabhiḥ","_","_","bharīman","NC","","_","_"
1,"tayor","_","_","tad","PRD","","_","_"
2,"id","_","_","id","CEM","","_","_"
3,"ghṛtavat","_","_","ghṛtavat","JJ","","_","_"
4,"payo","_","_","payas","NC","","_","_"
5,"viprā","_","_","vipra","NC","","_","_"
6,"rihanti","_","_","rih","V","rih","_","_"
7,"dhītibhiḥ","_","_","dhīti","NC","","_","_"
1,"gandharvasya","_","_","gandharva","NC","","_","_"
2,"dhruve","_","_","dhruva","JJ","","_","_"
3,"pade","_","_","pada","NC","","_","_"
1,"syonā","_","_","syona","JJ","","_","_"
2,"pṛthivi","_","_","pṛthivī","NC","","_","_"
3,"_","_","_","bhav","V","bhū","_","_"
4,"_","_","_","anṛkṣara","JJ","","_","_"
5,"niveśanī","_","_","niveśana","JJ","","_","_"
1,"yacchā","_","_","yacchā","V","ya","_","_"
2,"naḥ","_","_","mat","PPR","","_","_"
3,"śarma","_","_","śarman","NC","","_","_"
4,"saprathaḥ","_","_","saprathas","JJ","","_","_"
1,"ato","_","_","atas","CX","","_","_"
2,"devā","_","_","deva","NC","","_","_"
3,"avantu","_","_","avantu","V","av","_","_"
4,"no","_","_","mat","PPR","","_","_"
5,"yato","_","_","yatas","CX","","_","_"
6,"viṣṇur","_","_","viṣṇu","NC","","_","_"
7,"vicakrame","_","_","vikra","V","vikra","_","_"
1,"pṛthivyāḥ","_","_","pṛthivī","NC","","_","_"
2,"sapta","_","_","saptan","NUM","","_","_"
3,"dhāmabhiḥ","_","_","dhāman","NC","","_","_"
1,"idaṃ","_","_","ida","PRD","","_","_"
2,"viṣṇur","_","_","viṣṇu","NC","","_","_"
3,"vi","_","_","vi","CADP","","_","_"
4,"cakrame","_","_","kra","V","kra","_","_"
5,"tredhā","_","_","tredhā","CX","","_","_"
6,"ni","_","_","ni","CADP","","_","_"
7,"dadhe","_","_","dadh","V","dhā","_","_"
8,"padam","_","_","pada","NC","","_","_"
1,"samūḍham","_","_","saṃvah","PPP","","_","_"
2,"asya","_","_","ida","PRD","","_","_"
3,"pāṃsure","_","_","pāṃsura","NC","","_","_"
1,"trīṇi","_","_","tri","NUM","","_","_"
2,"padā","_","_","pada","NC","","_","_"
3,"vi","_","_","vi","CADP","","_","_"
4,"cakrame","_","_","kra","V","kra","_","_"
5,"viṣṇur","_","_","viṣṇu","NC","","_","_"
6,"gopā","_","_","gopā","NC","","_","_"
7,"adābhyaḥ","_","_","adābhya","JJ","","_","_"
1,"ato","_","_","atas","CX","","_","_"
2,"dharmāṇi","_","_","dharma","NC","","_","_"
3,"dhārayan","_","_","dhāray","KDP","","_","_"
1,"viṣṇoḥ","_","_","viṣṇu","NC","","_","_"
2,"karmāṇi","_","_","karman","NC","","_","_"
3,"paśyata","_","_","paś","V","paś","_","_"
4,"yato","_","_","yatas","CX","","_","_"
5,"vratāni","_","_","vrata","NC","","_","_"
6,"paspaśe","_","_","paś","V","paś","_","_"
1,"indrasya","_","_","indra","NC","","_","_"
2,"yujyaḥ","_","_","yujya","JJ","","_","_"
3,"sakhā","_","_","sakhi","NC","","_","_"
1,"tad","_","_","tad","PRD","","_","_"
2,"viṣṇoḥ","_","_","viṣṇu","NC","","_","_"
3,"paramam","_","_","parama","JJ","","_","_"
4,"padaṃ","_","_","pada","NC","","_","_"
5,"sadā","_","_","sadā","CAD","","_","_"
6,"paśyanti","_","_","paś","V","paś","_","_"
7,"sūrayaḥ","_","_","sūri","NC","","_","_"
1,"_","_","_","div","NC","","_","_"
2,"_","_","_","iva","CCM","","_","_"
3,"cakṣur","_","_","cakṣus","NC","","_","_"
4,"ātatam","_","_","ātan","PPP","","_","_"
1,"tad","_","_","tad","PRD","","_","_"
2,"viprāso","_","_","vipra","NC","","_","_"
3,"vipanyavo","_","_","vipanyu","JJ","","_","_"
4,"jāgṛvāṃsaḥ","_","_","jāgṛ","KDP","","_","_"
5,"sam","_","_","sa","CADP","","_","_"
6,"indhate","_","_","indh","V","indh","_","_"
1,"viṣṇor","_","_","viṣṇu","NC","","_","_"
2,"yat","_","_","yad","PRL","","_","_"
3,"paramam","_","_","parama","JJ","","_","_"
4,"padam","_","_","pada","NC","","_","_"
