"WordID","word","NormSTEM","suffix","lemma","PoS","Root","NormSuffix","NormWord"
1,"yat","_","_","yad","PRL","","_","_"
2,"te","_","_","tvat","PPR","","_","_"
3,"devā","_","_","deva","NC","","_","_"
4,"akṛṇvan","_","_","kar","V","kṛ","_","_"
5,"bhāgadheyam","_","_","bhāgadheya","NC","","_","_"
6,"amāvāsye","_","_","amāvāsyā","NC","","_","_"
7,"saṃvasanto","_","_","saṃvas","KDP","","_","_"
8,"mahitvā","_","_","mahitva","NC","","_","_"
1,"tenā","_","_","tad","PRD","","_","_"
2,"no","_","_","mat","PPR","","_","_"
3,"yajñaṃ","_","_","yajña","NC","","_","_"
4,"pipṛhi","_","_","pṛ","V","pṛ","_","_"
5,"_","_","_","viśva","JQ","","_","_"
6,"_","_","_","vāra","NC","","_","_"
7,"rayiṃ","_","_","rayi","NC","","_","_"
8,"no","_","_","mat","PPR","","_","_"
9,"dhehi","_","_","dadh","V","dhā","_","_"
10,"subhage","_","_","subhaga","JJ","","_","_"
11,"_","_","_","su","CAD","","_","_"
12,"_","_","_","vīra","NC","","_","_"
1,"aham","_","_","mat","PPR","","_","_"
2,"_","_","_","eva","CEM","","_","_"
3,"_","_","_","as","V","as","_","_"
4,"amāvāsyā","_","_","amāvāsyā","NC","","_","_"
5,"mām","_","_","mat","PPR","","_","_"
6,"ā","_","_","ā","CADP","","_","_"
7,"vasanti","_","_","vas","V","vas","_","_"
8,"_","_","_","su","CAD","","_","_"
9,"_","_","_","kṛt","JJ","","_","_"
10,"_","_","_","mat","PPR","","_","_"
11,"_","_","_","ida","PRD","","_","_"
1,"mayi","_","_","mat","PPR","","_","_"
2,"devā","_","_","deva","NC","","_","_"
3,"ubhaye","_","_","ubhaya","JJ","","_","_"
4,"sādhyāś","_","_","sādhya","NC","","_","_"
5,"_","_","_","ca","CCD","","_","_"
6,"_","_","_","indra","NC","","_","_"
7,"_","_","_","jyeṣṭha","JJ","","_","_"
8,"sam","_","_","sa","CADP","","_","_"
9,"agacchanta","_","_","ga","V","ga","_","_"
10,"sarve","_","_","sarva","JQ","","_","_"
1,"āgan","_","_","āga","V","āga","_","_"
2,"rātrī","_","_","rātri","NC","","_","_"
3,"saṃgamanī","_","_","saṃgamana","JJ","","_","_"
4,"vasūnām","_","_","vasu","NC","","_","_"
5,"ūrjaṃ","_","_","ūrj","NC","","_","_"
6,"puṣṭaṃ","_","_","puṣ","PPP","","_","_"
7,"vasv","_","_","vasu","NC","","_","_"
8,"āveśayantī","_","_","āveśay","KDP","","_","_"
1,"amāvāsyāyai","_","_","amāvāsyā","NC","","_","_"
2,"haviṣā","_","_","havis","NC","","_","_"
3,"_","_","_","vidh","V","vidh","_","_"
4,"_","_","_","ūrj","NC","","_","_"
5,"duhānā","_","_","duh","KDP","","_","_"
6,"payasā","_","_","payas","NC","","_","_"
7,"na","_","_","mat","PPR","","_","_"
8,"āgan","_","_","āga","V","āga","_","_"
1,"amāvāsye","_","_","amāvāsyā","NC","","_","_"
2,"na","_","_","na","CNG","","_","_"
3,"tvad","_","_","tvat","PPR","","_","_"
4,"etāny","_","_","tad","PRD","","_","_"
5,"anyo","_","_","anya","PPX","","_","_"
6,"viśvā","_","_","viśva","JQ","","_","_"
7,"rūpāṇi","_","_","rūpa","NC","","_","_"
8,"paribhūr","_","_","paribhū","JJ","","_","_"
9,"jajāna","_","_","jan","V","jan","_","_"
1,"_","_","_","yad","PRL","","_","_"
2,"_","_","_","kāma","NC","","_","_"
3,"te","_","_","tvat","PPR","","_","_"
4,"juhumas","_","_","hu","V","hu","_","_"
5,"tan","_","_","tad","PRD","","_","_"
6,"no","_","_","mat","PPR","","_","_"
7,"astu","_","_","as","V","as","_","_"
8,"vayaṃ","_","_","mat","PPR","","_","_"
9,"syāma","_","_","as","V","as","_","_"
10,"patayo","_","_","pati","NC","","_","_"
11,"rayīṇām","_","_","rayi","NC","","_","_"
