"WordID","word","NormSTEM","suffix","lemma","PoS","Root","NormSuffix","NormWord"
1,"bhīṣma","_","_","bhīṣma","NC","","_","_"
2,"uvāca","_","_","vak","V","vac","_","_"
1,"evam","_","_","eva","CX","","_","_"
2,"uktaḥ","_","_","vac","PPP","","_","_"
3,"pratyuvāca","_","_","prativak","V","prativac","_","_"
4,"taṃ","_","_","tad","PRD","","_","_"
5,"muniṃ","_","_","muni","NC","","_","_"
6,"janamejayaḥ","_","_","janamejaya","NC","","_","_"
1,"garhyaṃ","_","_","garh","KDG","","_","_"
2,"bhavān","_","_","bhavat","JJ","","_","_"
3,"garhayati","_","_","garhay","V","garhay","_","_"
4,"nindyaṃ","_","_","nind","KDG","","_","_"
5,"nindati","_","_","nind","V","nind","_","_"
6,"mā","_","_","mat","PPR","","_","_"
7,"bhavān","_","_","bhavat","JJ","","_","_"
1,"_","_","_","dhik","CX","","_","_"
2,"_","_","_","kārya","NC","","_","_"
3,"mā","_","_","mat","PPR","","_","_"
4,"_","_","_","dhik","CX","","_","_"
5,"_","_","_","kar","V","kṛ","_","_"
6,"tasmāt","_","_","tasmāt","CX","","_","_"
7,"_","_","_","tvat","PPR","","_","_"
8,"_","_","_","mat","PPR","","_","_"
9,"prasādaye","_","_","prasāday","V","prasāday","_","_"
1,"sarvaṃ","_","_","sarva","JQ","","_","_"
2,"_","_","_","hi","CX","","_","_"
3,"_","_","_","ida","PRD","","_","_"
4,"_","_","_","sva","JJ","","_","_"
5,"_","_","_","kṛ","PPP","","_","_"
6,"me","_","_","mat","PPR","","_","_"
7,"_","_","_","jval","V","jval","_","_"
8,"_","_","_","agni","NC","","_","_"
9,"_","_","_","iva","CCM","","_","_"
10,"_","_","_","ādhā","PPP","","_","_"
1,"_","_","_","sva","JJ","","_","_"
2,"_","_","_","karman","NC","","_","_"
3,"_","_","_","abhisaṃdhā","CGDA","","_","_"
4,"_","_","_","na","CNG","","_","_"
5,"_","_","_","abhinand","V","abhinand","_","_"
6,"me","_","_","mat","PPR","","_","_"
7,"manaḥ","_","_","manas","NC","","_","_"
1,"prāptaṃ","_","_","prāp","PPP","","_","_"
2,"nūnaṃ","_","_","nūna","CX","","_","_"
3,"mayā","_","_","mat","PPR","","_","_"
4,"ghoraṃ","_","_","ghora","JJ","","_","_"
5,"bhayaṃ","_","_","bhaya","NC","","_","_"
6,"vaivasvatād","_","_","vaivasvata","NC","","_","_"
7,"api","_","_","api","CX","","_","_"
1,"tat","_","_","tad","PRD","","_","_"
2,"tu","_","_","tu","CCD","","_","_"
3,"śalyam","_","_","śalya","NC","","_","_"
4,"a","_","_","alpha_privativum","CX","","_","_"
4,"anirhṛtya","_","_","nirhṛtya","CX","","_","_"
5,"kathaṃ","_","_","katha","CX","","_","_"
6,"śakṣyāmi","_","_","śakn","V","śak","_","_"
7,"jīvitum","_","_","jīv","CGDI","","_","_"
1,"_","_","_","sarva","JQ","","_","_"
2,"_","_","_","manyu","NC","","_","_"
3,"vinīya","_","_","vinī","CGDA","","_","_"
4,"tvam","_","_","tvat","PPR","","_","_"
5,"abhi","_","_","abhi","CADP","","_","_"
6,"mā","_","_","mat","PPR","","_","_"
7,"vada","_","_","vad","V","vad","_","_"
8,"śaunaka","_","_","śaunaka","NC","","_","_"
1,"mahānasaṃ","_","_","mahānasa","NC","","_","_"
2,"brāhmaṇānāṃ","_","_","brāhmaṇa","NC","","_","_"
3,"_","_","_","bhav","V","bhū","_","_"
4,"_","_","_","arthavat","JJ","","_","_"
5,"punaḥ","_","_","punar","CAD","","_","_"
1,"astu","_","_","as","V","as","_","_"
2,"śeṣaṃ","_","_","śeṣa","NC","","_","_"
3,"_","_","_","kula","NC","","_","_"
4,"_","_","_","ida","PRD","","_","_"
5,"mā","_","_","mā","CNG","","_","_"
6,"parābhūd","_","_","parābhav","V","parābhū","_","_"
7,"idaṃ","_","_","ida","PRD","","_","_"
8,"kulam","_","_","kula","NC","","_","_"
1,"na","_","_","na","CNG","","_","_"
2,"hi","_","_","hi","CX","","_","_"
3,"no","_","_","mat","PPR","","_","_"
4,"_","_","_","brahman","NC","","_","_"
5,"_","_","_","śap","PPP","","_","_"
6,"śeṣo","_","_","śeṣa","NC","","_","_"
7,"bhavitum","_","_","bhū","CGDI","","_","_"
8,"arhati","_","_","arh","V","arh","_","_"
1,"śrutīr","_","_","śruti","NC","","_","_"
2,"alabhamānānāṃ","_","_","alabhamāna","JJ","","_","_"
3,"saṃvidaṃ","_","_","saṃvid","NC","","_","_"
4,"_","_","_","veda","NC","","_","_"
5,"_","_","_","niścaya","NC","","_","_"
1,"nirvidyamānaḥ","_","_","nirvid","KDP","","_","_"
2,"_","_","_","su","CAD","","_","_"
3,"_","_","_","bhṛśa","CX","","_","_"
4,"bhūyo","_","_","bhūyas","CX","","_","_"
5,"vakṣyāmi","_","_","vak","V","vac","_","_"
6,"sāṃpratam","_","_","sāṃprata","CX","","_","_"
1,"bhūyaś","_","_","bhūyas","CX","","_","_"
2,"caivābhinaṅkṣanti","_","_","nirdharma","JJ","","_","_"
3,"nirdharmā","_","_","nirjapa","JJ","","_","_"
4,"nirjapā","_","_","iva","CCM","","_","_"
1,"arvāk","_","_","arvāk","CX","","_","_"
2,"ca","_","_","ca","CCD","","_","_"
3,"pratitiṣṭhanti","_","_","prastha","V","pratiṣṭhā","_","_"
4,"_","_","_","pulinda","NC","","_","_"
5,"_","_","_","śabara","NC","","_","_"
6,"iva","_","_","iva","CCM","","_","_"
1,"na","_","_","na","CNG","","_","_"
2,"_","_","_","hi","CX","","_","_"
3,"_","_","_","ayajña","JJ","","_","_"
4,"amuṃ","_","_","adas","PRD","","_","_"
5,"lokaṃ","_","_","loka","NC","","_","_"
6,"prāpnuvanti","_","_","prāpn","V","prāp","_","_"
7,"kathaṃcana","_","_","kathaṃcana","CX","","_","_"
1,"a","_","_","alpha_privativum","CX","","_","_"
1,"_","_","_","vijñāya","CX","","_","_"
2,"_","_","_","eva","CEM","","_","_"
3,"me","_","_","mat","PPR","","_","_"
4,"prajñāṃ","_","_","prajñā","NC","","_","_"
5,"_","_","_","bāla","NC","","_","_"
6,"_","_","_","iva","CCM","","_","_"
7,"_","_","_","su","CAD","","_","_"
8,"_","_","_","paṇḍita","NC","","_","_"
1,"brahman","_","_","brahman","NC","","_","_"
2,"_","_","_","pitṛ","NC","","_","_"
3,"_","_","_","iva","CCM","","_","_"
4,"putrebhyaḥ","_","_","putra","NC","","_","_"
5,"prati","_","_","prati","CADP","","_","_"
6,"māṃ","_","_","mat","PPR","","_","_"
7,"vāñcha","_","_","vāñch","V","vāñch","_","_"
8,"śaunaka","_","_","śaunaka","NC","","_","_"
1,"śaunaka","_","_","śaunaka","NC","","_","_"
2,"uvāca","_","_","vak","V","vac","_","_"
1,"kim","_","_","kiṃ","PRQ","","_","_"
2,"āścaryaṃ","_","_","āścarya","NC","","_","_"
3,"yataḥ","_","_","yatas","CX","","_","_"
4,"prājño","_","_","prājña","JJ","","_","_"
5,"bahu","_","_","bahu","JJ","","_","_"
6,"_","_","_","kar","V","kṛ","_","_"
7,"_","_","_","hi","CX","","_","_"
8,"sāṃpratam","_","_","sāṃprata","CX","","_","_"
1,"iti","_","_","iti","CQT","","_","_"
2,"vai","_","_","vai","CX","","_","_"
3,"paṇḍito","_","_","paṇḍita","NC","","_","_"
4,"bhūtvā","_","_","bhū","CGDA","","_","_"
5,"bhūtānāṃ","_","_","bhūta","NC","","_","_"
6,"_","_","_","na","CNG","","_","_"
7,"_","_","_","upatap","V","upatap","_","_"
1,"_","_","_","prajñā","NC","","_","_"
2,"_","_","_","prāsāda","NC","","_","_"
3,"āruhya","_","_","āruh","CGDA","","_","_"
4,"aśocyaḥ","_","_","aśocya","JJ","","_","_"
5,"śocate","_","_","śuc","V","śuc","_","_"
6,"janān","_","_","jana","NC","","_","_"
1,"_","_","_","jagatī","NC","","_","_"
2,"_","_","_","stha","JJ","","_","_"
3,"_","_","_","iva","CCM","","_","_"
4,"_","_","_","adri","NC","","_","_"
5,"_","_","_","stha","JJ","","_","_"
6,"prajñayā","_","_","prajñā","NC","","_","_"
7,"pratipaśyati","_","_","pratipaś","V","pratipaś","_","_"
1,"na","_","_","na","CNG","","_","_"
2,"_","_","_","ca","CCD","","_","_"
3,"_","_","_","upalabh","V","upalabh","_","_"
4,"tatra","_","_","tatra","CAD","","_","_"
5,"na","_","_","na","CNG","","_","_"
6,"ca","_","_","ca","CCD","","_","_"
7,"kāryāṇi","_","_","kārya","NC","","_","_"
8,"paśyati","_","_","paś","V","paś","_","_"
1,"_","_","_","nirviṇṇa","JJ","","_","_"
2,"_","_","_","ātman","NC","","_","_"
3,"parokṣo","_","_","parokṣa","JJ","","_","_"
4,"vā","_","_","vā","CCD","","_","_"
5,"dhikkṛtaḥ","_","_","dhikkṛta","JJ","","_","_"
6,"_","_","_","sarva","JQ","","_","_"
7,"_","_","_","sādhu","JJ","","_","_"
1,"_","_","_","vid","CGDA","","_","_"
2,"_","_","_","ubhayatas","CX","","_","_"
3,"vīryaṃ","_","_","vīrya","NC","","_","_"
4,"māhātmyaṃ","_","_","māhātmya","NC","","_","_"
5,"veda","_","_","veda","NC","","_","_"
6,"āgame","_","_","āgama","NC","","_","_"
1,"_","_","_","kar","V","kṛ","_","_"
2,"_","_","_","iha","CAD","","_","_"
3,"_","_","_","mahat","JJ","","_","_"
4,"_","_","_","śānti","NC","","_","_"
5,"brahmā","_","_","brahman","NC","","_","_"
6,"śaraṇam","_","_","śaraṇa","NC","","_","_"
7,"astu","_","_","as","V","as","_","_"
8,"te","_","_","tvat","PPR","","_","_"
1,"tad","_","_","tad","PRD","","_","_"
2,"vai","_","_","vai","CX","","_","_"
3,"pāratrikaṃ","_","_","pāratrika","JJ","","_","_"
4,"cāru","_","_","cāru","JJ","","_","_"
5,"brāhmaṇānām","_","_","brāhmaṇa","NC","","_","_"
6,"akupyatām","_","_","akupyat","JJ","","_","_"
1,"atha","_","_","atha","CAD","","_","_"
2,"cet","_","_","ced","CX","","_","_"
3,"tapyase","_","_","tap","V","tap","_","_"
4,"pāpair","_","_","pāpa","NC","","_","_"
5,"dharmaṃ","_","_","dharma","NC","","_","_"
6,"ced","_","_","ced","CX","","_","_"
7,"anupaśyasi","_","_","anupaś","V","anupaś","_","_"
1,"janamejaya","_","_","janamejaya","NC","","_","_"
2,"uvāca","_","_","vak","V","vac","_","_"
1,"anutapye","_","_","anutap","V","anutap","_","_"
2,"ca","_","_","ca","CCD","","_","_"
3,"pāpena","_","_","pāpa","NC","","_","_"
4,"na","_","_","na","CNG","","_","_"
5,"_","_","_","ca","CCD","","_","_"
6,"_","_","_","adharma","NC","","_","_"
7,"_","_","_","car","V","car","_","_"
8,"_","_","_","mat","PPR","","_","_"
1,"bubhūṣuṃ","_","_","bubhūṣu","JJ","","_","_"
2,"bhajamānaṃ","_","_","bhaj","KDP","","_","_"
3,"ca","_","_","ca","CCD","","_","_"
4,"prativāñchāmi","_","_","prativāñch","V","prativāñch","_","_"
5,"śaunaka","_","_","śaunaka","NC","","_","_"
1,"śaunaka","_","_","śaunaka","NC","","_","_"
2,"uvāca","_","_","vak","V","vac","_","_"
1,"chittvā","_","_","chid","CGDA","","_","_"
2,"stambhaṃ","_","_","stambha","NC","","_","_"
3,"ca","_","_","ca","CCD","","_","_"
4,"mānaṃ","_","_","māna","NC","","_","_"
5,"ca","_","_","ca","CCD","","_","_"
6,"prītim","_","_","prīti","NC","","_","_"
7,"icchāmi","_","_","iṣ","V","iṣ","_","_"
8,"te","_","_","tvat","PPR","","_","_"
9,"nṛpa","_","_","nṛpa","NC","","_","_"
1,"_","_","_","sarva","JQ","","_","_"
2,"_","_","_","bhūta","NC","","_","_"
3,"_","_","_","hita","NC","","_","_"
4,"tiṣṭha","_","_","tiṣṭh","V","sthā","_","_"
5,"dharmaṃ","_","_","dharma","NC","","_","_"
6,"_","_","_","ca","CCD","","_","_"
7,"_","_","_","eva","CEM","","_","_"
8,"pratismara","_","_","pratismar","V","pratismṛ","_","_"
1,"na","_","_","na","CNG","","_","_"
2,"_","_","_","bhaya","NC","","_","_"
3,"_","_","_","na","CNG","","_","_"
4,"ca","_","_","ca","CCD","","_","_"
5,"_","_","_","kārpaṇya","NC","","_","_"
6,"_","_","_","na","CNG","","_","_"
7,"lobhāt","_","_","lobha","NC","","_","_"
8,"tvām","_","_","tvat","PPR","","_","_"
9,"upāhvaye","_","_","upāhvā","V","upāhvā","_","_"
1,"tāṃ","_","_","tad","PRD","","_","_"
2,"me","_","_","mat","PPR","","_","_"
3,"devā","_","_","deva","NC","","_","_"
4,"giraṃ","_","_","gir","NC","","_","_"
5,"satyāṃ","_","_","satya","JJ","","_","_"
6,"śṛṇvantu","_","_","śṛṇ","V","śru","_","_"
7,"brāhmaṇaiḥ","_","_","brāhmaṇa","NC","","_","_"
8,"saha","_","_","saha","CX","","_","_"
1,"so","_","_","tad","PRD","","_","_"
2,"'haṃ","_","_","mat","PPR","","_","_"
3,"na","_","_","na","CNG","","_","_"
4,"_","_","_","kiṃcit","PRI","","_","_"
5,"_","_","_","ca","CCD","","_","_"
6,"_","_","_","arthin","JJ","","_","_"
7,"tvāṃ","_","_","tvat","PPR","","_","_"
8,"ca","_","_","ca","CCD","","_","_"
9,"dharmam","_","_","dharma","NC","","_","_"
10,"upāhvaye","_","_","upāhvā","V","upāhvā","_","_"
1,"krośatāṃ","_","_","kruś","KDP","","_","_"
2,"_","_","_","sarva","JQ","","_","_"
3,"_","_","_","bhūta","NC","","_","_"
4,"aho","_","_","aho","CX","","_","_"
5,"dhig","_","_","dhik","CX","","_","_"
6,"iti","_","_","iti","CQT","","_","_"
7,"kurvatām","_","_","kṛ","KDP","","_","_"
1,"vakṣyanti","_","_","vak","V","vac","_","_"
2,"mām","_","_","mat","PPR","","_","_"
3,"_","_","_","adharma","NC","","_","_"
4,"_","_","_","jña","JJ","","_","_"
5,"_","_","_","vak","V","vac","_","_"
6,"_","_","_","asuhṛd","NC","","_","_"
7,"janāḥ","_","_","jana","NC","","_","_"
1,"_","_","_","vāc","NC","","_","_"
2,"_","_","_","tad","PRD","","_","_"
3,"suhṛdaḥ","_","_","suhṛd","NC","","_","_"
4,"śrutvā","_","_","śru","CGDA","","_","_"
5,"saṃjvariṣyanti","_","_","saṃjvar","V","saṃjvar","_","_"
6,"me","_","_","mat","PPR","","_","_"
7,"bhṛśam","_","_","bhṛśa","CX","","_","_"
1,"kecid","_","_","kiṃcit","PRI","","_","_"
2,"eva","_","_","eva","CEM","","_","_"
3,"_","_","_","mahat","JJ","","_","_"
4,"_","_","_","prājña","JJ","","_","_"
5,"parijñāsyanti","_","_","parijān","V","parijñā","_","_"
6,"_","_","_","kārya","NC","","_","_"
1,"jānīhi","_","_","jān","V","jñā","_","_"
2,"me","_","_","mat","PPR","","_","_"
3,"kṛtaṃ","_","_","kṛ","PPP","","_","_"
4,"tāta","_","_","tāta","NC","","_","_"
5,"brāhmaṇān","_","_","brāhmaṇa","NC","","_","_"
6,"prati","_","_","prati","CADP","","_","_"
7,"bhārata","_","_","bhārata","NC","","_","_"
1,"yathā","_","_","yathā","CCM","","_","_"
2,"te","_","_","tad","PRD","","_","_"
3,"_","_","_","mat","PPR","","_","_"
4,"_","_","_","kṛte","CX","","_","_"
5,"kṣemaṃ","_","_","kṣema","NC","","_","_"
6,"_","_","_","labh","V","labh","_","_"
7,"_","_","_","tad","PRD","","_","_"
8,"tathā","_","_","tathā","CX","","_","_"
9,"kuru","_","_","kar","V","kṛ","_","_"
1,"pratijānīhi","_","_","pratijān","V","pratijñā","_","_"
2,"_","_","_","ca","CCD","","_","_"
3,"_","_","_","adroha","NC","","_","_"
4,"brāhmaṇānāṃ","_","_","brāhmaṇa","NC","","_","_"
5,"narādhipa","_","_","narādhipa","NC","","_","_"
1,"janamejaya","_","_","janamejaya","NC","","_","_"
2,"uvāca","_","_","vak","V","vac","_","_"
1,"_","_","_","na","CNG","","_","_"
2,"_","_","_","eva","CEM","","_","_"
3,"vācā","_","_","vāc","NC","","_","_"
4,"na","_","_","na","CNG","","_","_"
5,"manasā","_","_","manas","NC","","_","_"
6,"na","_","_","na","CNG","","_","_"
7,"punar","_","_","punar","CAD","","_","_"
8,"jātu","_","_","jātu","CX","","_","_"
9,"karmaṇā","_","_","karman","NC","","_","_"
1,"drogdhāsmi","_","_","druh","V","druh","_","_"
2,"brāhmaṇān","_","_","brāhmaṇa","NC","","_","_"
3,"vipra","_","_","vipra","NC","","_","_"
4,"_","_","_","caraṇa","NC","","_","_"
5,"_","_","_","eva","CEM","","_","_"
6,"te","_","_","tvat","PPR","","_","_"
7,"spṛśe","_","_","spṛś","V","spṛś","_","_"
