"WordID","word","NormSTEM","suffix","lemma","PoS","Root","NormSuffix","NormWord"
1,"vaiśampāyana","_","_","vaiśampāyana","NC","","_","_"
2,"uvāca","_","_","vak","V","vac","_","_"
1,"tataḥ","_","_","tatas","CX","","_","_"
2,"_","_","_","sūrya","NC","","_","_"
3,"_","_","_","udaya","NC","","_","_"
4,"dhaumyaḥ","_","_","dhaumya","NC","","_","_"
5,"_","_","_","kṛ","CGDA","","_","_"
6,"_","_","_","āhnika","NC","","_","_"
7,"ariṃdama","_","_","ariṃdama","JJ","","_","_"
1,"ārṣṭiṣeṇena","_","_","ārṣṭiṣeṇa","NC","","_","_"
2,"sahitaḥ","_","_","sahita","JJ","","_","_"
3,"pāṇḍavān","_","_","pāṇḍava","NC","","_","_"
4,"abhyavartata","_","_","abhivart","V","abhivṛt","_","_"
1,"te","_","_","tad","PRD","","_","_"
2,"_","_","_","abhivāday","CGDA","","_","_"
3,"_","_","_","ārṣṭiṣeṇa","NC","","_","_"
4,"pādau","_","_","pāda","NC","","_","_"
5,"dhaumyasya","_","_","dhaumya","NC","","_","_"
6,"_","_","_","ca","CCD","","_","_"
7,"_","_","_","eva","CEM","","_","_"
8,"ha","_","_","ha","CEM","","_","_"
1,"tataḥ","_","_","tatas","CX","","_","_"
2,"prāñjalayaḥ","_","_","prāñjali","JJ","","_","_"
3,"sarve","_","_","sarva","JQ","","_","_"
4,"brāhmaṇāṃs","_","_","brāhmaṇa","NC","","_","_"
5,"tān","_","_","tad","PRD","","_","_"
6,"apūjayan","_","_","pūjay","V","pūjay","_","_"
1,"tato","_","_","tatas","CX","","_","_"
2,"yudhiṣṭhiraṃ","_","_","yudhiṣṭhira","NC","","_","_"
3,"dhaumyo","_","_","dhaumya","NC","","_","_"
4,"gṛhītvā","_","_","grah","CGDA","","_","_"
5,"dakṣiṇe","_","_","dakṣiṇa","JJ","","_","_"
6,"kare","_","_","kara","NC","","_","_"
1,"prācīṃ","_","_","prāñc","JJ","","_","_"
2,"diśam","_","_","diś","NC","","_","_"
3,"abhiprekṣya","_","_","abhiprekṣ","CGDA","","_","_"
4,"_","_","_","mahat","JJ","","_","_"
5,"_","_","_","ṛṣi","NC","","_","_"
6,"idam","_","_","ida","PRD","","_","_"
7,"abravīt","_","_","abravīta","V","brū","_","_"
1,"asau","_","_","adas","PRD","","_","_"
2,"_","_","_","sāgara","NC","","_","_"
3,"_","_","_","paryanta","NC","","_","_"
4,"bhūmim","_","_","bhūmi","NC","","_","_"
5,"āvṛtya","_","_","āvṛ","CGDA","","_","_"
6,"tiṣṭhati","_","_","tiṣṭh","V","sthā","_","_"
1,"_","_","_","śaila","NC","","_","_"
2,"_","_","_","rāja","NC","","_","_"
3,"_","_","_","mahat","JJ","","_","_"
4,"_","_","_","rāja","NC","","_","_"
5,"mandaro","_","_","mandara","NC","","_","_"
6,"'bhivirājate","_","_","abhivirāj","V","abhivirāj","_","_"
1,"_","_","_","indra","NC","","_","_"
2,"_","_","_","vaiśravaṇa","NC","","_","_"
3,"_","_","_","tad","PRD","","_","_"
4,"diśaṃ","_","_","diś","NC","","_","_"
5,"pāṇḍava","_","_","pāṇḍava","NC","","_","_"
6,"rakṣataḥ","_","_","rakṣ","KDP","","_","_"
1,"parvataiś","_","_","parvata","NC","","_","_"
2,"ca","_","_","ca","CCD","","_","_"
3,"vanāntaiś","_","_","vanānta","NC","","_","_"
4,"ca","_","_","ca","CCD","","_","_"
5,"kānanaiś","_","_","kānana","NC","","_","_"
6,"_","_","_","ca","CCD","","_","_"
7,"_","_","_","upaśobhay","PPP","","_","_"
1,"etad","_","_","tad","PRD","","_","_"
2,"āhur","_","_","ah","V","ah","_","_"
3,"_","_","_","mahat","JJ","","_","_"
4,"_","_","_","indra","NC","","_","_"
5,"rājño","_","_","rājan","NC","","_","_"
6,"vaiśravaṇasya","_","_","vaiśravaṇa","NC","","_","_"
7,"ca","_","_","ca","CCD","","_","_"
1,"ṛṣayaḥ","_","_","ṛṣi","NC","","_","_"
2,"_","_","_","sarva","JQ","","_","_"
3,"_","_","_","dharma","NC","","_","_"
4,"_","_","_","jña","JJ","","_","_"
5,"sadma","_","_","sadman","NC","","_","_"
6,"tāta","_","_","tāta","NC","","_","_"
7,"manīṣiṇaḥ","_","_","manīṣin","JJ","","_","_"
1,"ataś","_","_","atas","CX","","_","_"
2,"_","_","_","ca","CCD","","_","_"
3,"_","_","_","udi","KDP","","_","_"
4,"ādityam","_","_","āditya","NC","","_","_"
5,"upatiṣṭhanti","_","_","upatiṣṭh","V","upasthā","_","_"
6,"vai","_","_","vai","CX","","_","_"
7,"prajāḥ","_","_","prajā","NC","","_","_"
1,"ṛṣayaś","_","_","ṛṣi","NC","","_","_"
2,"_","_","_","ca","CCD","","_","_"
3,"_","_","_","api","CX","","_","_"
4,"_","_","_","dharma","NC","","_","_"
5,"_","_","_","jña","JJ","","_","_"
6,"siddhāḥ","_","_","siddha","NC","","_","_"
7,"sādhyāś","_","_","sādhya","NC","","_","_"
8,"ca","_","_","ca","CCD","","_","_"
9,"devatāḥ","_","_","devatā","NC","","_","_"
1,"yamas","_","_","yama","NC","","_","_"
2,"tu","_","_","tu","CCD","","_","_"
3,"rājā","_","_","rājan","NC","","_","_"
4,"_","_","_","dharma","NC","","_","_"
5,"_","_","_","ātman","NC","","_","_"
6,"_","_","_","sarva","JQ","","_","_"
7,"_","_","_","prāṇabhṛt","JJ","","_","_"
8,"prabhuḥ","_","_","prabhu","NC","","_","_"
1,"_","_","_","preta","NC","","_","_"
2,"_","_","_","sattva","NC","","_","_"
3,"_","_","_","gatī","NC","","_","_"
4,"etāṃ","_","_","tad","PRD","","_","_"
5,"dakṣiṇām","_","_","dakṣiṇa","JJ","","_","_"
6,"āśrito","_","_","āśri","PPP","","_","_"
7,"diśam","_","_","diś","NC","","_","_"
1,"etat","_","_","tad","PRD","","_","_"
2,"saṃyamanaṃ","_","_","saṃyamana","NC","","_","_"
3,"puṇyam","_","_","puṇya","JJ","","_","_"
4,"_","_","_","atīva","CX","","_","_"
5,"_","_","_","adbhuta","JJ","","_","_"
6,"_","_","_","darśana","NC","","_","_"
1,"_","_","_","preta","NC","","_","_"
2,"_","_","_","rāja","NC","","_","_"
3,"bhavanam","_","_","bhavana","NC","","_","_"
4,"ṛddhyā","_","_","ṛddhi","NC","","_","_"
5,"paramayā","_","_","parama","JJ","","_","_"
6,"yutam","_","_","yuta","JJ","","_","_"
1,"yaṃ","_","_","yad","PRL","","_","_"
2,"prāpya","_","_","prāp","CGDA","","_","_"
3,"savitā","_","_","savitṛ","NC","","_","_"
4,"rājan","_","_","rājan","NC","","_","_"
5,"satyena","_","_","satya","NC","","_","_"
6,"pratitiṣṭhati","_","_","prastha","V","pratiṣṭhā","_","_"
1,"astaṃ","_","_","asta","NC","","_","_"
2,"_","_","_","parvata","NC","","_","_"
3,"_","_","_","rājan","NC","","_","_"
4,"etam","_","_","tad","PRD","","_","_"
5,"āhur","_","_","ah","V","ah","_","_"
6,"manīṣiṇaḥ","_","_","manīṣin","JJ","","_","_"
1,"etaṃ","_","_","tad","PRD","","_","_"
2,"_","_","_","parvata","NC","","_","_"
3,"_","_","_","rājan","NC","","_","_"
4,"samudraṃ","_","_","samudra","NC","","_","_"
5,"ca","_","_","ca","CCD","","_","_"
6,"_","_","_","mahat","JJ","","_","_"
7,"_","_","_","udadhi","NC","","_","_"
1,"_","_","_","āvas","KDP","","_","_"
2,"_","_","_","varuṇa","NC","","_","_"
3,"rājā","_","_","rājan","NC","","_","_"
4,"bhūtāni","_","_","bhūta","NC","","_","_"
5,"parirakṣati","_","_","parirakṣ","V","parirakṣ","_","_"
1,"udīcīṃ","_","_","udañc","JJ","","_","_"
2,"dīpayann","_","_","dīpay","KDP","","_","_"
3,"eṣa","_","_","tad","PRD","","_","_"
4,"diśaṃ","_","_","diś","NC","","_","_"
5,"tiṣṭhati","_","_","tiṣṭh","V","sthā","_","_"
6,"kīrtimān","_","_","kīrtimat","NC","","_","_"
1,"_","_","_","mahat","JJ","","_","_"
2,"_","_","_","meru","NC","","_","_"
3,"mahābhāga","_","_","mahābhāga","JJ","","_","_"
4,"śivo","_","_","śiva","JJ","","_","_"
5,"_","_","_","brahman","NC","","_","_"
6,"_","_","_","vid","JJ","","_","_"
7,"gatiḥ","_","_","gati","NC","","_","_"
1,"yasmin","_","_","yad","PRL","","_","_"
2,"_","_","_","brahman","NC","","_","_"
3,"_","_","_","sadas","NC","","_","_"
4,"_","_","_","ca","CCD","","_","_"
5,"_","_","_","eva","CEM","","_","_"
6,"tiṣṭhate","_","_","tiṣṭh","V","sthā","_","_"
7,"ca","_","_","ca","CCD","","_","_"
8,"prajāpatiḥ","_","_","prajāpati","NC","","_","_"
1,"bhūtātmā","_","_","bhūtātman","NC","","_","_"
2,"visṛjan","_","_","visṛj","KDP","","_","_"
3,"sarvaṃ","_","_","sarva","JQ","","_","_"
4,"yat","_","_","yad","PRL","","_","_"
5,"_","_","_","kiṃcit","PRI","","_","_"
6,"_","_","_","jaṅgama","JJ","","_","_"
7,"_","_","_","agama","JJ","","_","_"
1,"yān","_","_","yad","PRL","","_","_"
2,"āhur","_","_","ah","V","ah","_","_"
3,"brahmaṇaḥ","_","_","brahman","NC","","_","_"
4,"putrān","_","_","putra","NC","","_","_"
5,"mānasān","_","_","mānasa","JJ","","_","_"
6,"_","_","_","dakṣa","NC","","_","_"
7,"_","_","_","saptama","JJ","","_","_"
1,"teṣām","_","_","tad","PRD","","_","_"
2,"api","_","_","api","CX","","_","_"
3,"_","_","_","mahat","JJ","","_","_"
4,"_","_","_","meru","NC","","_","_"
5,"sthānaṃ","_","_","sthāna","NC","","_","_"
6,"śivam","_","_","śiva","JJ","","_","_"
7,"anāmayam","_","_","anāmaya","JJ","","_","_"
1,"_","_","_","atra","CAD","","_","_"
2,"_","_","_","eva","CEM","","_","_"
3,"pratitiṣṭhanti","_","_","prastha","V","pratiṣṭhā","_","_"
4,"punar","_","_","punar","CAD","","_","_"
5,"_","_","_","atra","CAD","","_","_"
6,"_","_","_","ude","V","udi","_","_"
7,"ca","_","_","ca","CCD","","_","_"
1,"sapta","_","_","saptan","NUM","","_","_"
2,"devarṣayas","_","_","devarṣi","NC","","_","_"
3,"tāta","_","_","tāta","NC","","_","_"
4,"_","_","_","vasiṣṭha","NC","","_","_"
5,"_","_","_","pramukha","JJ","","_","_"
6,"sadā","_","_","sadā","CAD","","_","_"
1,"deśaṃ","_","_","deśa","NC","","_","_"
2,"virajasaṃ","_","_","virajas","JJ","","_","_"
3,"paśya","_","_","paś","V","paś","_","_"
4,"meroḥ","_","_","meru","NC","","_","_"
5,"śikharam","_","_","śikhara","NC","","_","_"
6,"uttamam","_","_","uttama","JJ","","_","_"
1,"_","_","_","yatra","CX","","_","_"
2,"_","_","_","ātman","NC","","_","_"
3,"_","_","_","tṛp","PPP","","_","_"
4,"adhyāste","_","_","ās","V","ās","_","_"
5,"devaiḥ","_","_","deva","NC","","_","_"
6,"saha","_","_","saha","CX","","_","_"
7,"pitāmahaḥ","_","_","pitāmaha","NC","","_","_"
1,"yam","_","_","yad","PRL","","_","_"
2,"āhuḥ","_","_","ah","V","ah","_","_"
3,"_","_","_","sarva","JQ","","_","_"
4,"_","_","_","bhūta","NC","","_","_"
5,"prakṛteḥ","_","_","prakṛti","NC","","_","_"
6,"prakṛtiṃ","_","_","prakṛti","NC","","_","_"
7,"dhruvam","_","_","dhruva","CX","","_","_"
1,"_","_","_","an","CX","","_","_"
2,"_","_","_","ādi","NC","","_","_"
3,"_","_","_","nidhana","NC","","_","_"
4,"devaṃ","_","_","deva","NC","","_","_"
5,"prabhuṃ","_","_","prabhu","JJ","","_","_"
6,"nārāyaṇaṃ","_","_","nārāyaṇa","NC","","_","_"
7,"param","_","_","para","PPX","","_","_"
1,"brahmaṇaḥ","_","_","brahman","NC","","_","_"
2,"sadanāt","_","_","sadana","NC","","_","_"
3,"tasya","_","_","tad","PRD","","_","_"
4,"paraṃ","_","_","para","PPX","","_","_"
5,"sthānaṃ","_","_","sthāna","NC","","_","_"
6,"prakāśate","_","_","prakāś","V","prakāś","_","_"
1,"devāś","_","_","deva","NC","","_","_"
2,"ca","_","_","ca","CCD","","_","_"
3,"yatnāt","_","_","yatna","NC","","_","_"
4,"paśyanti","_","_","paś","V","paś","_","_"
5,"divyaṃ","_","_","divya","JJ","","_","_"
6,"_","_","_","tejas","NC","","_","_"
7,"_","_","_","maya","JJ","","_","_"
8,"śivam","_","_","śiva","JJ","","_","_"
1,"_","_","_","ati","CADP","","_","_"
2,"_","_","_","arka","NC","","_","_"
3,"_","_","_","anala","NC","","_","_"
4,"_","_","_","dīp","PPP","","_","_"
5,"tat","_","_","tad","PRD","","_","_"
6,"sthānaṃ","_","_","sthāna","NC","","_","_"
7,"viṣṇor","_","_","viṣṇu","NC","","_","_"
8,"mahātmanaḥ","_","_","mahātman","NC","","_","_"
1,"_","_","_","sva","JJ","","_","_"
2,"_","_","_","eva","CEM","","_","_"
3,"prabhayā","_","_","prabhā","NC","","_","_"
4,"rājan","_","_","rājan","NC","","_","_"
5,"duṣprekṣyaṃ","_","_","duṣprekṣya","JJ","","_","_"
6,"_","_","_","deva","NC","","_","_"
7,"_","_","_","dānava","NC","","_","_"
1,"tad","_","_","tad","PRD","","_","_"
2,"vai","_","_","vai","CX","","_","_"
3,"jyotīṃṣi","_","_","jyotis","NC","","_","_"
4,"sarvāṇi","_","_","sarva","JQ","","_","_"
5,"prāpya","_","_","prāp","CGDA","","_","_"
6,"bhāsanti","_","_","bhās","V","bhās","_","_"
7,"no","_","_","no","CX","","_","_"
8,"'pi","_","_","api","CX","","_","_"
9,"ca","_","_","ca","CCD","","_","_"
1,"svayaṃ","_","_","svaya","CX","","_","_"
2,"vibhur","_","_","vibhu","JJ","","_","_"
3,"_","_","_","adīna","JJ","","_","_"
4,"_","_","_","ātman","NC","","_","_"
5,"tatra","_","_","tatra","CAD","","_","_"
6,"_","_","_","hi","CX","","_","_"
7,"_","_","_","abhivirāj","V","abhivirāj","_","_"
1,"yatayas","_","_","yati","NC","","_","_"
2,"tatra","_","_","tatra","CAD","","_","_"
3,"gacchanti","_","_","gacch","V","gam","_","_"
4,"bhaktyā","_","_","bhakti","NC","","_","_"
5,"nārāyaṇaṃ","_","_","nārāyaṇa","NC","","_","_"
6,"harim","_","_","hari","NC","","_","_"
1,"pareṇa","_","_","para","PPX","","_","_"
2,"tapasā","_","_","tapas","NC","","_","_"
3,"yuktā","_","_","yuj","PPP","","_","_"
4,"bhāvitāḥ","_","_","bhāvay","PPP","","_","_"
5,"karmabhiḥ","_","_","karman","NC","","_","_"
6,"śubhaiḥ","_","_","śubha","JJ","","_","_"
1,"_","_","_","yoga","NC","","_","_"
2,"_","_","_","siddha","JJ","","_","_"
3,"mahātmānas","_","_","mahātman","JJ","","_","_"
4,"_","_","_","tamas","NC","","_","_"
5,"_","_","_","moha","NC","","_","_"
6,"_","_","_","vivarjay","PPP","","_","_"
1,"tatra","_","_","tatra","CAD","","_","_"
2,"gatvā","_","_","ga","CGDA","","_","_"
3,"punar","_","_","punar","CAD","","_","_"
4,"_","_","_","na","CNG","","_","_"
5,"_","_","_","ida","PRD","","_","_"
6,"lokam","_","_","loka","NC","","_","_"
7,"āyānti","_","_","āyā","V","āyā","_","_"
8,"bhārata","_","_","bhārata","JJ","","_","_"
1,"sthānam","_","_","sthāna","NC","","_","_"
2,"etan","_","_","tad","PRD","","_","_"
3,"mahābhāga","_","_","mahābhāga","JJ","","_","_"
4,"dhruvam","_","_","dhruva","JJ","","_","_"
5,"akṣayam","_","_","akṣaya","JJ","","_","_"
6,"avyayam","_","_","avyaya","JJ","","_","_"
1,"īśvarasya","_","_","īśvara","NC","","_","_"
2,"sadā","_","_","sadā","CAD","","_","_"
3,"_","_","_","hi","CX","","_","_"
4,"_","_","_","tad","PRD","","_","_"
5,"_","_","_","praṇa","V","praṇa","_","_"
6,"_","_","_","atra","CAD","","_","_"
7,"yudhiṣṭhira","_","_","yudhiṣṭhira","NC","","_","_"
1,"etaṃ","_","_","tad","PRD","","_","_"
2,"jyotīṃṣi","_","_","jyotis","NC","","_","_"
3,"sarvāṇi","_","_","sarva","JQ","","_","_"
4,"prakarṣan","_","_","prakṛṣ","KDP","","_","_"
5,"bhagavān","_","_","bhagavat","JJ","","_","_"
6,"api","_","_","api","CX","","_","_"
1,"kurute","_","_","kar","V","kṛ","_","_"
2,"vitamaskarmā","_","_","vitamaskarman","JJ","","_","_"
3,"ādityo","_","_","āditya","NC","","_","_"
4,"'bhipradakṣiṇam","_","_","abhipradakṣiṇa","CX","","_","_"
1,"astaṃ","_","_","asta","NC","","_","_"
2,"prāpya","_","_","prāp","CGDA","","_","_"
3,"tataḥ","_","_","tatas","CX","","_","_"
4,"saṃdhyām","_","_","saṃdhyā","NC","","_","_"
5,"atikramya","_","_","atikra","CGDA","","_","_"
6,"divākaraḥ","_","_","divākara","NC","","_","_"
1,"udīcīṃ","_","_","udañc","JJ","","_","_"
2,"bhajate","_","_","bhaj","V","bhaj","_","_"
3,"kāṣṭhāṃ","_","_","kāṣṭhā","NC","","_","_"
4,"diśam","_","_","diś","NC","","_","_"
5,"eṣa","_","_","tad","PRD","","_","_"
6,"vibhāvasuḥ","_","_","vibhāvasu","NC","","_","_"
1,"sa","_","_","tad","PRD","","_","_"
2,"merum","_","_","meru","NC","","_","_"
3,"anuvṛttaḥ","_","_","anuvṛt","PPP","","_","_"
4,"san","_","_","as","KDP","","_","_"
5,"punar","_","_","punar","CAD","","_","_"
6,"gacchati","_","_","gacch","V","gam","_","_"
7,"pāṇḍava","_","_","pāṇḍava","NC","","_","_"
1,"prāṅmukhaḥ","_","_","prāṅmukha","JJ","","_","_"
2,"savitā","_","_","savitṛ","NC","","_","_"
3,"devaḥ","_","_","deva","NC","","_","_"
4,"_","_","_","sarva","JQ","","_","_"
5,"_","_","_","bhūta","NC","","_","_"
6,"_","_","_","hita","NC","","_","_"
7,"rataḥ","_","_","ra","PPP","","_","_"
1,"sa","_","_","tad","PRD","","_","_"
2,"māsaṃ","_","_","māsa","NC","","_","_"
3,"vibhajan","_","_","vibhaj","KDP","","_","_"
4,"kālaṃ","_","_","kāla","NC","","_","_"
5,"bahudhā","_","_","bahudhā","CX","","_","_"
6,"parvasaṃdhiṣu","_","_","parvasaṃdhi","NC","","_","_"
1,"_","_","_","tathā","CX","","_","_"
2,"_","_","_","eva","CEM","","_","_"
3,"bhagavān","_","_","bhagavat","JJ","","_","_"
4,"somo","_","_","soma","NC","","_","_"
5,"nakṣatraiḥ","_","_","nakṣatra","NC","","_","_"
6,"saha","_","_","saha","CX","","_","_"
7,"gacchati","_","_","gacch","V","gam","_","_"
1,"evam","_","_","eva","CX","","_","_"
2,"eṣa","_","_","tad","PRD","","_","_"
3,"parikramya","_","_","parikra","CGDA","","_","_"
4,"_","_","_","mahat","JJ","","_","_"
5,"_","_","_","meru","NC","","_","_"
6,"atandritaḥ","_","_","atandrita","JJ","","_","_"
1,"bhāvayan","_","_","bhāvay","KDP","","_","_"
2,"_","_","_","sarva","JQ","","_","_"
3,"_","_","_","bhūta","NC","","_","_"
4,"punar","_","_","punar","CAD","","_","_"
5,"gacchati","_","_","gacch","V","gam","_","_"
6,"mandaram","_","_","mandara","NC","","_","_"
1,"tathā","_","_","tathā","CX","","_","_"
2,"tamisrahā","_","_","tamisrahan","NC","","_","_"
3,"devo","_","_","deva","NC","","_","_"
4,"mayūkhair","_","_","mayūkha","NC","","_","_"
5,"_","_","_","bhāvay","KDP","","_","_"
6,"_","_","_","jagat","NC","","_","_"
1,"mārgam","_","_","mārga","NC","","_","_"
2,"etad","_","_","tad","PRD","","_","_"
3,"asaṃbādham","_","_","asaṃbādha","JJ","","_","_"
4,"ādityaḥ","_","_","āditya","NC","","_","_"
5,"parivartate","_","_","parivart","V","parivṛt","_","_"
1,"sisṛkṣuḥ","_","_","sisṛkṣu","JJ","","_","_"
2,"_","_","_","śiśira","NC","","_","_"
3,"_","_","_","tad","PRD","","_","_"
4,"dakṣiṇāṃ","_","_","dakṣiṇa","JJ","","_","_"
5,"bhajate","_","_","bhaj","V","bhaj","_","_"
6,"diśam","_","_","diś","NC","","_","_"
1,"tataḥ","_","_","tatas","CX","","_","_"
2,"sarvāṇi","_","_","sarva","JQ","","_","_"
3,"bhūtāni","_","_","bhūta","NC","","_","_"
4,"kālaḥ","_","_","kāla","NC","","_","_"
5,"śiśiram","_","_","śiśira","NC","","_","_"
6,"ṛcchati","_","_","ṛch","V","ṛch","_","_"
1,"sthāvarāṇāṃ","_","_","sthāvara","JJ","","_","_"
2,"ca","_","_","ca","CCD","","_","_"
3,"bhūtānāṃ","_","_","bhūta","NC","","_","_"
4,"jaṅgamānāṃ","_","_","jaṅgama","JJ","","_","_"
5,"ca","_","_","ca","CCD","","_","_"
6,"tejasā","_","_","tejas","NC","","_","_"
1,"tejāṃsi","_","_","tejas","NC","","_","_"
2,"samupādatte","_","_","samupādā","V","samupādā","_","_"
3,"nivṛttaḥ","_","_","nivṛt","PPP","","_","_"
4,"san","_","_","as","KDP","","_","_"
5,"vibhāvasuḥ","_","_","vibhāvasu","NC","","_","_"
1,"tataḥ","_","_","tatas","CX","","_","_"
2,"svedaḥ","_","_","sveda","NC","","_","_"
3,"klamas","_","_","klama","NC","","_","_"
4,"tandrī","_","_","tandrā","NC","","_","_"
5,"glāniś","_","_","glāni","NC","","_","_"
6,"ca","_","_","ca","CCD","","_","_"
7,"bhajate","_","_","bhaj","V","bhaj","_","_"
8,"narān","_","_","nara","NC","","_","_"
1,"prāṇibhiḥ","_","_","prāṇin","NC","","_","_"
2,"satataṃ","_","_","satata","CX","","_","_"
3,"svapno","_","_","svapna","NC","","_","_"
4,"_","_","_","hi","CX","","_","_"
5,"_","_","_","abhīkṣṇa","CX","","_","_"
6,"ca","_","_","ca","CCD","","_","_"
7,"niṣevyate","_","_","niṣev","V","niṣev","_","_"
1,"evam","_","_","eva","CX","","_","_"
2,"etad","_","_","tad","PRD","","_","_"
3,"anirdeśyaṃ","_","_","anirdeśya","JJ","","_","_"
4,"mārgam","_","_","mārga","NC","","_","_"
5,"āvṛtya","_","_","āvṛt","CGDA","","_","_"
6,"bhānumān","_","_","bhānumat","NC","","_","_"
1,"punaḥ","_","_","punar","CAD","","_","_"
2,"sṛjati","_","_","sṛj","V","sṛj","_","_"
3,"varṣāṇi","_","_","varṣa","NC","","_","_"
4,"bhagavān","_","_","bhagavat","JJ","","_","_"
5,"bhāvayan","_","_","bhāvay","KDP","","_","_"
6,"prajāḥ","_","_","prajā","NC","","_","_"
1,"_","_","_","vṛṣṭi","NC","","_","_"
2,"_","_","_","māruta","NC","","_","_"
3,"_","_","_","saṃtāpa","NC","","_","_"
4,"sukhaiḥ","_","_","sukha","JJ","","_","_"
5,"_","_","_","sthāvara","JJ","","_","_"
6,"_","_","_","jaṅgama","JJ","","_","_"
1,"vardhayan","_","_","vardhay","KDP","","_","_"
2,"_","_","_","su","CAD","","_","_"
3,"_","_","_","mahat","JJ","","_","_"
4,"_","_","_","tejas","NC","","_","_"
5,"punaḥ","_","_","punar","CAD","","_","_"
6,"pratinivartate","_","_","pratinivart","V","pratinivṛt","_","_"
1,"evam","_","_","eva","CX","","_","_"
2,"eṣa","_","_","tad","PRD","","_","_"
3,"caran","_","_","car","KDP","","_","_"
4,"pārtha","_","_","pārtha","NC","","_","_"
5,"kālacakram","_","_","kālacakra","NC","","_","_"
6,"atandritaḥ","_","_","atandrita","JJ","","_","_"
1,"prakarṣan","_","_","prakṛṣ","KDP","","_","_"
2,"_","_","_","sarva","JQ","","_","_"
3,"_","_","_","bhūta","NC","","_","_"
4,"savitā","_","_","savitṛ","NC","","_","_"
5,"parivartate","_","_","parivart","V","parivṛt","_","_"
1,"saṃtatā","_","_","saṃtata","JJ","","_","_"
2,"gatir","_","_","gati","NC","","_","_"
3,"etasya","_","_","tad","PRD","","_","_"
4,"_","_","_","na","CNG","","_","_"
5,"_","_","_","tad","PRD","","_","_"
6,"tiṣṭhati","_","_","tiṣṭh","V","sthā","_","_"
7,"pāṇḍava","_","_","pāṇḍava","NC","","_","_"
1,"_","_","_","ādā","CGDA","","_","_"
2,"_","_","_","eva","CEM","","_","_"
3,"tu","_","_","tu","CCD","","_","_"
4,"bhūtānāṃ","_","_","bhūta","NC","","_","_"
5,"tejo","_","_","tejas","NC","","_","_"
6,"visṛjate","_","_","visṛj","V","visṛj","_","_"
7,"punaḥ","_","_","punar","CAD","","_","_"
1,"vibhajan","_","_","vibhaj","KDP","","_","_"
2,"_","_","_","sarva","JQ","","_","_"
3,"_","_","_","bhūta","NC","","_","_"
4,"āyuḥ","_","_","āyus","NC","","_","_"
5,"karma","_","_","karman","NC","","_","_"
6,"ca","_","_","ca","CCD","","_","_"
7,"bhārata","_","_","bhārata","JJ","","_","_"
1,"_","_","_","ahar","NC","","_","_"
2,"_","_","_","rātra","NC","","_","_"
3,"kalāḥ","_","_","kalā","NC","","_","_"
4,"kāṣṭhāḥ","_","_","kāṣṭhā","NC","","_","_"
5,"_","_","_","sṛj","V","sṛj","_","_"
6,"_","_","_","tad","PRD","","_","_"
7,"sadā","_","_","sadā","CAD","","_","_"
8,"vibhuḥ","_","_","vibhu","JJ","","_","_"
