"WordID","word","NormSTEM","suffix","lemma","PoS","Root","NormSuffix","NormWord"
1,"saṃjaya","_","_","saṃjaya","NC","","_","_"
2,"uvāca","_","_","vak","V","vac","_","_"
1,"tasmin","_","_","tad","PRD","","_","_"
2,"_","_","_","su","CAD","","_","_"
3,"_","_","_","tumula","JJ","","_","_"
4,"yuddhe","_","_","yuddha","NC","","_","_"
5,"vartamāne","_","_","vṛt","KDP","","_","_"
6,"_","_","_","bhaya","NC","","_","_"
7,"_","_","_","āvaha","JJ","","_","_"
1,"dhṛṣṭadyumno","_","_","dhṛṣṭadyumna","NC","","_","_"
2,"_","_","_","mahat","JJ","","_","_"
3,"_","_","_","rāja","NC","","_","_"
4,"droṇam","_","_","droṇa","NC","","_","_"
5,"_","_","_","eva","CEM","","_","_"
6,"_","_","_","abhivart","V","abhivṛt","_","_"
1,"saṃmṛjāno","_","_","sammṛj","KDP","","_","_"
2,"dhanuḥ","_","_","dhanus","NC","","_","_"
3,"śreṣṭhaṃ","_","_","śreṣṭha","JJ","","_","_"
4,"jyāṃ","_","_","jyā","NC","","_","_"
5,"vikarṣan","_","_","vikṛṣ","KDP","","_","_"
6,"punaḥ","_","_","punar","CAD","","_","_"
7,"punaḥ","_","_","punar","CAD","","_","_"
1,"abhyavartata","_","_","abhivart","V","abhivṛt","_","_"
2,"droṇasya","_","_","droṇa","NC","","_","_"
3,"rathaṃ","_","_","ratha","NC","","_","_"
4,"_","_","_","rukma","NC","","_","_"
5,"_","_","_","vibhūṣay","PPP","","_","_"
1,"dhṛṣṭadyumnaṃ","_","_","dhṛṣṭadyumna","NC","","_","_"
2,"_","_","_","tadā","CAD","","_","_"
3,"_","_","_","āyā","KDP","","_","_"
4,"_","_","_","droṇa","NC","","_","_"
5,"_","_","_","anta","NC","","_","_"
6,"_","_","_","cikīrṣā","NC","","_","_"
1,"parivavrur","_","_","parivṛ","V","parivṛ","_","_"
2,"_","_","_","mahat","JJ","","_","_"
3,"_","_","_","rāja","NC","","_","_"
4,"pāñcālāḥ","_","_","pāñcāla","NC","","_","_"
5,"pāṇḍavaiḥ","_","_","pāṇḍava","NC","","_","_"
6,"saha","_","_","saha","CX","","_","_"
1,"tathā","_","_","tathā","CX","","_","_"
2,"parivṛtaṃ","_","_","parivṛ","PPP","","_","_"
3,"dṛṣṭvā","_","_","dṛś","CGDA","","_","_"
4,"droṇam","_","_","droṇa","NC","","_","_"
5,"_","_","_","ācārya","NC","","_","_"
6,"_","_","_","sattama","JJ","","_","_"
1,"_","_","_","putra","NC","","_","_"
2,"_","_","_","tvat","PPR","","_","_"
3,"sarvato","_","_","sarvatas","CX","","_","_"
4,"yattā","_","_","yat","PPP","","_","_"
5,"rarakṣur","_","_","rakṣ","V","rakṣ","_","_"
6,"droṇam","_","_","droṇa","NC","","_","_"
7,"āhave","_","_","āhava","NC","","_","_"
1,"_","_","_","bala","NC","","_","_"
2,"_","_","_","arṇava","NC","","_","_"
3,"_","_","_","tatas","CX","","_","_"
4,"_","_","_","tad","PRD","","_","_"
5,"tu","_","_","tu","CCD","","_","_"
6,"sameyātāṃ","_","_","same","V","same","_","_"
7,"_","_","_","niśā","NC","","_","_"
8,"_","_","_","mukha","NC","","_","_"
1,"_","_","_","vāta","NC","","_","_"
2,"_","_","_","uddhū","PPP","","_","_"
3,"_","_","_","kṣubh","PPP","","_","_"
4,"_","_","_","sattva","NC","","_","_"
5,"bhairavau","_","_","bhairava","JJ","","_","_"
6,"_","_","_","sāgara","NC","","_","_"
7,"_","_","_","iva","CCM","","_","_"
1,"tato","_","_","tatas","CX","","_","_"
2,"droṇaṃ","_","_","droṇa","NC","","_","_"
3,"_","_","_","mahat","JJ","","_","_"
4,"_","_","_","rāja","NC","","_","_"
5,"pāñcālyaḥ","_","_","pāñcālya","JJ","","_","_"
6,"pañcabhiḥ","_","_","pañcan","NUM","","_","_"
7,"śaraiḥ","_","_","śara","NC","","_","_"
1,"vivyādha","_","_","vyadh","V","vyadh","_","_"
2,"hṛdaye","_","_","hṛdaya","NC","","_","_"
3,"tūrṇaṃ","_","_","tūrṇa","CX","","_","_"
4,"siṃhanādaṃ","_","_","siṃhanāda","NC","","_","_"
5,"nanāda","_","_","nad","V","nad","_","_"
6,"ca","_","_","ca","CCD","","_","_"
1,"taṃ","_","_","tad","PRD","","_","_"
2,"droṇaḥ","_","_","droṇa","NC","","_","_"
3,"pañcaviṃśatyā","_","_","pañcaviṃśati","NC","","_","_"
4,"viddhvā","_","_","vyadh","CGDA","","_","_"
5,"bhārata","_","_","bhārata","NC","","_","_"
6,"saṃyuge","_","_","saṃyuga","NC","","_","_"
1,"_","_","_","chid","V","chid","_","_"
2,"_","_","_","anya","PPX","","_","_"
3,"bhallena","_","_","bhalla","NC","","_","_"
4,"dhanur","_","_","dhanus","NC","","_","_"
5,"asya","_","_","ida","PRD","","_","_"
6,"_","_","_","mahat","JJ","","_","_"
7,"_","_","_","prabhā","NC","","_","_"
1,"_","_","_","dhṛṣṭadyumna","NC","","_","_"
2,"_","_","_","tu","CCD","","_","_"
3,"nirviddho","_","_","nirvyadh","PPP","","_","_"
4,"droṇena","_","_","droṇa","NC","","_","_"
5,"_","_","_","bharata","NC","","_","_"
6,"_","_","_","ṛṣabha","NC","","_","_"
1,"utsasarja","_","_","utsasarja","V","utsṛj","_","_"
2,"_","_","_","dhanus","NC","","_","_"
3,"_","_","_","tūrṇa","CX","","_","_"
4,"saṃdaśya","_","_","saṃdaṃś","CGDA","","_","_"
5,"daśanacchadam","_","_","daśanacchada","NC","","_","_"
1,"tataḥ","_","_","tatas","CX","","_","_"
2,"kruddho","_","_","krudh","PPP","","_","_"
3,"_","_","_","mahat","JJ","","_","_"
4,"_","_","_","rāja","NC","","_","_"
5,"dhṛṣṭadyumnaḥ","_","_","dhṛṣṭadyumna","NC","","_","_"
6,"pratāpavān","_","_","pratāpavat","JJ","","_","_"
1,"ādade","_","_","ādad","V","ādā","_","_"
2,"'nyad","_","_","anya","PPX","","_","_"
3,"dhanuḥ","_","_","dhanus","NC","","_","_"
4,"śreṣṭhaṃ","_","_","śreṣṭha","JJ","","_","_"
5,"_","_","_","droṇa","NC","","_","_"
6,"_","_","_","anta","NC","","_","_"
7,"_","_","_","cikīrṣā","NC","","_","_"
1,"vikṛṣya","_","_","vikṛṣ","CGDA","","_","_"
2,"ca","_","_","ca","CCD","","_","_"
3,"_","_","_","dhanus","NC","","_","_"
4,"_","_","_","citra","JJ","","_","_"
5,"ākarṇāt","_","_","ākarṇa","JJ","","_","_"
6,"_","_","_","para","PPX","","_","_"
7,"_","_","_","vīra","NC","","_","_"
8,"_","_","_","han","JJ","","_","_"
1,"_","_","_","droṇa","NC","","_","_"
2,"_","_","_","anta","NC","","_","_"
3,"_","_","_","kara","JJ","","_","_"
4,"ghoraṃ","_","_","ghora","JJ","","_","_"
5,"vyasṛjat","_","_","visṛj","V","visṛj","_","_"
6,"sāyakaṃ","_","_","sāyaka","NC","","_","_"
7,"tataḥ","_","_","tatas","CX","","_","_"
1,"sa","_","_","tad","PRD","","_","_"
2,"visṛṣṭo","_","_","visṛj","PPP","","_","_"
3,"balavatā","_","_","balavat","JJ","","_","_"
4,"śaro","_","_","śara","NC","","_","_"
5,"ghoro","_","_","ghora","JJ","","_","_"
6,"_","_","_","mahat","JJ","","_","_"
7,"_","_","_","mṛdha","NC","","_","_"
1,"bhāsayāmāsa","_","_","bhāsay","V","bhāsay","_","_"
2,"tat","_","_","tad","PRD","","_","_"
3,"sainyaṃ","_","_","sainya","NC","","_","_"
4,"divākara","_","_","divākara","NC","","_","_"
5,"_","_","_","iva","CCM","","_","_"
6,"_","_","_","udi","PPP","","_","_"
1,"taṃ","_","_","tad","PRD","","_","_"
2,"dṛṣṭvā","_","_","dṛś","CGDA","","_","_"
3,"tu","_","_","tu","CCD","","_","_"
4,"śaraṃ","_","_","śara","NC","","_","_"
5,"ghoraṃ","_","_","ghora","JJ","","_","_"
6,"_","_","_","deva","NC","","_","_"
7,"_","_","_","gandharva","NC","","_","_"
8,"_","_","_","mānava","NC","","_","_"
1,"_","_","_","svasti","NC","","_","_"
2,"_","_","_","as","V","as","_","_"
3,"samare","_","_","samara","NC","","_","_"
4,"rājan","_","_","rājan","NC","","_","_"
5,"_","_","_","droṇa","NC","","_","_"
6,"_","_","_","iti","CQT","","_","_"
7,"_","_","_","abravīta","V","brū","_","_"
8,"vacaḥ","_","_","vacas","NC","","_","_"
1,"taṃ","_","_","tad","PRD","","_","_"
2,"tu","_","_","tu","CCD","","_","_"
3,"sāyakam","_","_","sāyaka","NC","","_","_"
4,"aprāptam","_","_","aprāpta","JJ","","_","_"
5,"ācāryasya","_","_","ācārya","NC","","_","_"
6,"rathaṃ","_","_","ratha","NC","","_","_"
7,"prati","_","_","prati","CADP","","_","_"
1,"karṇo","_","_","karṇa","NC","","_","_"
2,"dvādaśadhā","_","_","dvādaśadhā","CX","","_","_"
3,"_","_","_","rājan","NC","","_","_"
4,"_","_","_","chid","V","chid","_","_"
5,"_","_","_","kṛtahasta","JJ","","_","_"
6,"_","_","_","vat","CX","","_","_"
1,"sa","_","_","tad","PRD","","_","_"
2,"chinno","_","_","chid","PPP","","_","_"
3,"bahudhā","_","_","bahudhā","CX","","_","_"
4,"rājan","_","_","rājan","NC","","_","_"
5,"sūtaputreṇa","_","_","sūtaputra","NC","","_","_"
6,"māriṣa","_","_","māriṣa","NC","","_","_"
1,"nipapāta","_","_","nipat","V","nipat","_","_"
2,"_","_","_","śara","NC","","_","_"
3,"_","_","_","tūrṇa","CX","","_","_"
4,"nikṛttaḥ","_","_","nikṛt","PPP","","_","_"
5,"_","_","_","karṇa","NC","","_","_"
6,"_","_","_","sāyaka","NC","","_","_"
1,"chittvā","_","_","chid","CGDA","","_","_"
2,"tu","_","_","tu","CCD","","_","_"
3,"samare","_","_","samara","NC","","_","_"
4,"bāṇaṃ","_","_","bāṇa","NC","","_","_"
5,"śaraiḥ","_","_","śara","NC","","_","_"
6,"_","_","_","saṃna","PPP","","_","_"
7,"_","_","_","parvan","NC","","_","_"
1,"dhṛṣṭadyumnaṃ","_","_","dhṛṣṭadyumna","NC","","_","_"
2,"raṇe","_","_","raṇa","NC","","_","_"
3,"karṇo","_","_","karṇa","NC","","_","_"
4,"vivyādha","_","_","vyadh","V","vyadh","_","_"
5,"daśabhiḥ","_","_","daśan","NUM","","_","_"
6,"śaraiḥ","_","_","śara","NC","","_","_"
1,"pañcabhir","_","_","pañcan","NUM","","_","_"
2,"_","_","_","droṇaputra","NC","","_","_"
3,"_","_","_","tu","CCD","","_","_"
4,"svayaṃ","_","_","svaya","CX","","_","_"
5,"_","_","_","droṇa","NC","","_","_"
6,"_","_","_","ca","CCD","","_","_"
7,"saptabhiḥ","_","_","saptan","NUM","","_","_"
1,"_","_","_","śalya","NC","","_","_"
2,"_","_","_","ca","CCD","","_","_"
3,"navabhir","_","_","navan","NUM","","_","_"
4,"_","_","_","bāṇa","NC","","_","_"
5,"_","_","_","tri","NUM","","_","_"
6,"_","_","_","duḥśāsana","NC","","_","_"
7,"_","_","_","tathā","CX","","_","_"
1,"_","_","_","duryodhana","NC","","_","_"
2,"_","_","_","ca","CCD","","_","_"
3,"viṃśatyā","_","_","viṃśati","NC","","_","_"
4,"_","_","_","śakuni","NC","","_","_"
5,"_","_","_","ca","CCD","","_","_"
6,"_","_","_","api","CX","","_","_"
7,"pañcabhiḥ","_","_","pañcan","NUM","","_","_"
1,"pāñcālyaṃ","_","_","pāñcālya","JJ","","_","_"
2,"_","_","_","tvar","PPP","","_","_"
3,"_","_","_","vyadh","V","vyadh","_","_"
4,"sarva","_","_","sarva","JQ","","_","_"
5,"eva","_","_","eva","CEM","","_","_"
6,"_","_","_","mahat","JJ","","_","_"
7,"_","_","_","ratha","NC","","_","_"
1,"sa","_","_","tad","PRD","","_","_"
2,"viddhaḥ","_","_","vyadh","PPP","","_","_"
3,"saptabhir","_","_","saptan","NUM","","_","_"
4,"vīrair","_","_","vīra","NC","","_","_"
5,"_","_","_","droṇa","NC","","_","_"
6,"_","_","_","trāṇa","NC","","_","_"
7,"_","_","_","artha","NC","","_","_"
8,"āhave","_","_","āhava","NC","","_","_"
1,"sarvān","_","_","sarva","JQ","","_","_"
2,"asaṃbhramād","_","_","asambhrama","NC","","_","_"
3,"rājan","_","_","rājan","NC","","_","_"
4,"pratyavidhyat","_","_","prativyadh","V","prativyadh","_","_"
5,"_","_","_","tri","NUM","","_","_"
6,"_","_","_","tri","NUM","","_","_"
1,"droṇaṃ","_","_","droṇa","NC","","_","_"
2,"drauṇiṃ","_","_","drauṇi","NC","","_","_"
3,"ca","_","_","ca","CCD","","_","_"
4,"karṇaṃ","_","_","karṇa","NC","","_","_"
5,"ca","_","_","ca","CCD","","_","_"
6,"vivyādha","_","_","vyadh","V","vyadh","_","_"
7,"tava","_","_","tvat","PPR","","_","_"
8,"_","_","_","ca","CCD","","_","_"
9,"_","_","_","ātmaja","NC","","_","_"
1,"te","_","_","tad","PRD","","_","_"
2,"viddhvā","_","_","vyadh","CGDA","","_","_"
3,"dhanvinā","_","_","dhanvin","JJ","","_","_"
4,"tena","_","_","tad","PRD","","_","_"
5,"dhṛṣṭadyumnaṃ","_","_","dhṛṣṭadyumna","NC","","_","_"
6,"punar","_","_","punar","CAD","","_","_"
7,"mṛdhe","_","_","mṛdha","NC","","_","_"
1,"vivyadhuḥ","_","_","vyadh","V","vyadh","_","_"
2,"_","_","_","pañcan","NUM","","_","_"
3,"_","_","_","tūrṇa","CX","","_","_"
4,"ekaiko","_","_","ekaika","PRC","","_","_"
5,"rathināṃ","_","_","rathin","NC","","_","_"
6,"varaḥ","_","_","vara","JJ","","_","_"
1,"_","_","_","drumasa","NC","","_","_"
2,"_","_","_","tu","CCD","","_","_"
3,"saṃkruddho","_","_","saṃkrudh","PPP","","_","_"
4,"rājan","_","_","rājan","NC","","_","_"
5,"vivyādha","_","_","vyadh","V","vyadh","_","_"
6,"patriṇā","_","_","pattrin","NC","","_","_"
1,"_","_","_","tri","NUM","","_","_"
2,"_","_","_","ca","CCD","","_","_"
3,"_","_","_","anya","PPX","","_","_"
4,"_","_","_","śara","NC","","_","_"
5,"_","_","_","tūrṇa","CX","","_","_"
6,"tiṣṭha","_","_","tiṣṭh","V","sthā","_","_"
7,"_","_","_","tiṣṭh","V","sthā","_","_"
8,"_","_","_","iti","CQT","","_","_"
9,"_","_","_","ca","CCD","","_","_"
10,"_","_","_","abravīta","V","brū","_","_"
1,"sa","_","_","tad","PRD","","_","_"
2,"tu","_","_","tu","CCD","","_","_"
3,"taṃ","_","_","tad","PRD","","_","_"
4,"prativivyādha","_","_","prativyadh","V","prativyadh","_","_"
5,"_","_","_","tri","NUM","","_","_"
6,"_","_","_","tīkṣṇa","JJ","","_","_"
7,"ajihmagaiḥ","_","_","ajihmaga","NC","","_","_"
1,"_","_","_","svarṇa","NC","","_","_"
2,"_","_","_","puṅkha","NC","","_","_"
3,"_","_","_","śilā","NC","","_","_"
4,"_","_","_","dhāv","PPP","","_","_"
5,"_","_","_","prāṇānta","NC","","_","_"
6,"_","_","_","karaṇa","JJ","","_","_"
7,"yudhi","_","_","yudh","NC","","_","_"
1,"_","_","_","bhalla","NC","","_","_"
2,"_","_","_","anya","PPX","","_","_"
3,"tu","_","_","tu","CCD","","_","_"
4,"punaḥ","_","_","punar","CAD","","_","_"
5,"_","_","_","suvarṇa","NC","","_","_"
6,"_","_","_","ujjvala","JJ","","_","_"
7,"_","_","_","kuṇḍala","NC","","_","_"
1,"unmamātha","_","_","unmath","V","unmath","_","_"
2,"śiraḥ","_","_","śiras","NC","","_","_"
3,"kāyād","_","_","kāya","NC","","_","_"
4,"drumasenasya","_","_","drumasa","NC","","_","_"
5,"vīryavān","_","_","vīryavat","JJ","","_","_"
1,"_","_","_","tad","PRD","","_","_"
2,"_","_","_","śiras","NC","","_","_"
3,"nyapatad","_","_","nipat","V","nipat","_","_"
4,"bhūmau","_","_","bhūmi","NC","","_","_"
5,"_","_","_","saṃdaṃś","PPP","","_","_"
6,"_","_","_","oṣṭha","NC","","_","_"
7,"_","_","_","puṭa","NC","","_","_"
8,"raṇe","_","_","raṇa","NC","","_","_"
1,"_","_","_","mahat","JJ","","_","_"
2,"_","_","_","vāta","NC","","_","_"
3,"_","_","_","samuddhū","PPP","","_","_"
4,"pakvaṃ","_","_","pakva","JJ","","_","_"
5,"_","_","_","tāla","NC","","_","_"
6,"_","_","_","phala","NC","","_","_"
7,"yathā","_","_","yathā","CCM","","_","_"
1,"_","_","_","tad","PRD","","_","_"
2,"_","_","_","ca","CCD","","_","_"
3,"viddhvā","_","_","vyadh","CGDA","","_","_"
4,"punar","_","_","punar","CAD","","_","_"
5,"vīrān","_","_","vīra","NC","","_","_"
6,"vīraḥ","_","_","vīra","NC","","_","_"
7,"_","_","_","su","CAD","","_","_"
8,"_","_","_","niśā","PPP","","_","_"
9,"śaraiḥ","_","_","śara","NC","","_","_"
1,"_","_","_","rādheya","NC","","_","_"
2,"_","_","_","chid","V","chid","_","_"
3,"bhallaiḥ","_","_","bhalla","NC","","_","_"
4,"kārmukaṃ","_","_","kārmuka","NC","","_","_"
5,"_","_","_","citra","JJ","","_","_"
6,"_","_","_","yodhin","JJ","","_","_"
1,"na","_","_","na","CNG","","_","_"
2,"tu","_","_","tu","CCD","","_","_"
3,"_","_","_","tad","PRD","","_","_"
4,"_","_","_","mṛṣ","V","mṛṣ","_","_"
5,"karṇo","_","_","karṇa","NC","","_","_"
6,"_","_","_","dhanus","NC","","_","_"
7,"_","_","_","chedana","NC","","_","_"
8,"tathā","_","_","tathā","CX","","_","_"
1,"nikartanam","_","_","nikartana","NC","","_","_"
2,"_","_","_","iva","CCM","","_","_"
3,"_","_","_","ati","CADP","","_","_"
4,"_","_","_","ugra","JJ","","_","_"
5,"lāṅgūlasya","_","_","lāṅgūla","NC","","_","_"
6,"yathā","_","_","yathā","CCM","","_","_"
7,"hariḥ","_","_","hari","NC","","_","_"
1,"so","_","_","tad","PRD","","_","_"
2,"'nyad","_","_","anya","PPX","","_","_"
3,"dhanuḥ","_","_","dhanus","NC","","_","_"
4,"samādāya","_","_","samādā","CGDA","","_","_"
5,"_","_","_","krodha","NC","","_","_"
6,"_","_","_","rakta","JJ","","_","_"
7,"_","_","_","īkṣaṇa","NC","","_","_"
8,"śvasan","_","_","śvas","KDP","","_","_"
1,"_","_","_","abhivṛṣ","V","abhivṛṣ","_","_"
2,"_","_","_","śara","NC","","_","_"
3,"_","_","_","ogha","NC","","_","_"
4,"_","_","_","tad","PRD","","_","_"
5,"dhṛṣṭadyumnaṃ","_","_","dhṛṣṭadyumna","NC","","_","_"
6,"_","_","_","mahat","JJ","","_","_"
7,"_","_","_","bala","NC","","_","_"
1,"dṛṣṭvā","_","_","dṛś","CGDA","","_","_"
2,"tu","_","_","tu","CCD","","_","_"
3,"karṇaṃ","_","_","karṇa","NC","","_","_"
4,"saṃrabdhaṃ","_","_","saṃrabh","PPP","","_","_"
5,"te","_","_","tad","PRD","","_","_"
6,"vīrāḥ","_","_","vīra","NC","","_","_"
7,"ṣaḍ","_","_","ṣaṣ","NUM","","_","_"
8,"_","_","_","ratha","NC","","_","_"
9,"_","_","_","ṛṣabha","NC","","_","_"
1,"_","_","_","pāñcālya","JJ","","_","_"
2,"_","_","_","putra","NC","","_","_"
3,"tvaritāḥ","_","_","tvar","PPP","","_","_"
4,"parivavrur","_","_","parivṛ","V","parivṛ","_","_"
5,"jighāṃsayā","_","_","jighāṃsā","NC","","_","_"
1,"ṣaṇṇāṃ","_","_","ṣaṣ","NUM","","_","_"
2,"_","_","_","yodha","NC","","_","_"
3,"_","_","_","pravīra","NC","","_","_"
4,"tāvakānāṃ","_","_","tāvaka","JJ","","_","_"
5,"puraskṛtam","_","_","puraskṛ","PPP","","_","_"
1,"mṛtyor","_","_","mṛtyu","NC","","_","_"
2,"āsyam","_","_","āsya","NC","","_","_"
3,"anuprāptaṃ","_","_","anuprāp","PPP","","_","_"
4,"dhṛṣṭadyumnam","_","_","dhṛṣṭadyumna","NC","","_","_"
5,"amaṃsmahi","_","_","man","V","man","_","_"
1,"etasmin","_","_","tad","PRD","","_","_"
2,"eva","_","_","eva","CEM","","_","_"
3,"kāle","_","_","kāla","NC","","_","_"
4,"tu","_","_","tu","CCD","","_","_"
5,"dāśārho","_","_","dāśārha","NC","","_","_"
6,"vikirañ","_","_","vikṛ","KDP","","_","_"
7,"śarān","_","_","śara","NC","","_","_"
1,"dhṛṣṭadyumnaṃ","_","_","dhṛṣṭadyumna","NC","","_","_"
2,"parākrāntaṃ","_","_","parākra","PPP","","_","_"
3,"sātyakiḥ","_","_","sātyaki","NC","","_","_"
4,"pratyapadyata","_","_","pratipad","V","pratipad","_","_"
1,"tam","_","_","tad","PRD","","_","_"
2,"āyāntaṃ","_","_","āyā","KDP","","_","_"
3,"_","_","_","mahat","JJ","","_","_"
4,"_","_","_","iṣvāsa","NC","","_","_"
5,"sātyakiṃ","_","_","sātyaki","NC","","_","_"
6,"_","_","_","yuddha","NC","","_","_"
7,"_","_","_","durmada","JJ","","_","_"
1,"rādheyo","_","_","rādheya","NC","","_","_"
2,"daśabhir","_","_","daśan","NUM","","_","_"
3,"bāṇaiḥ","_","_","bāṇa","NC","","_","_"
4,"pratyavidhyad","_","_","prativyadh","V","prativyadh","_","_"
5,"ajihmagaiḥ","_","_","ajihmaga","NC","","_","_"
1,"taṃ","_","_","tad","PRD","","_","_"
2,"sātyakir","_","_","sātyaki","NC","","_","_"
3,"_","_","_","mahat","JJ","","_","_"
4,"_","_","_","rāja","NC","","_","_"
5,"vivyādha","_","_","vyadh","V","vyadh","_","_"
6,"daśabhiḥ","_","_","daśan","NUM","","_","_"
7,"śaraiḥ","_","_","śara","NC","","_","_"
1,"paśyatāṃ","_","_","dṛś","KDP","","_","_"
2,"_","_","_","sarva","JQ","","_","_"
3,"_","_","_","vīra","NC","","_","_"
4,"mā","_","_","mā","CNG","","_","_"
5,"_","_","_","gā","V","gā","_","_"
6,"_","_","_","tiṣṭh","V","sthā","_","_"
7,"_","_","_","iti","CQT","","_","_"
8,"_","_","_","ca","CCD","","_","_"
9,"_","_","_","abravīta","V","brū","_","_"
1,"sa","_","_","tad","PRD","","_","_"
2,"_","_","_","sātyaki","NC","","_","_"
3,"_","_","_","tu","CCD","","_","_"
4,"balinaḥ","_","_","balin","JJ","","_","_"
5,"karṇasya","_","_","karṇa","NC","","_","_"
6,"ca","_","_","ca","CCD","","_","_"
7,"mahātmanaḥ","_","_","mahātman","JJ","","_","_"
1,"āsīt","_","_","as","V","as","_","_"
2,"samāgamo","_","_","samāgama","NC","","_","_"
3,"ghoro","_","_","ghora","JJ","","_","_"
4,"_","_","_","bali","NC","","_","_"
5,"_","_","_","vāsava","NC","","_","_"
6,"iva","_","_","iva","CCM","","_","_"
1,"_","_","_","trāsay","KDP","","_","_"
2,"_","_","_","tala","NC","","_","_"
3,"_","_","_","ghoṣa","NC","","_","_"
4,"kṣatriyān","_","_","kṣatriya","NC","","_","_"
5,"_","_","_","kṣatriya","NC","","_","_"
6,"_","_","_","ṛṣabha","NC","","_","_"
1,"_","_","_","rājīva","NC","","_","_"
2,"_","_","_","locana","NC","","_","_"
3,"karṇaṃ","_","_","karṇa","NC","","_","_"
4,"sātyakiḥ","_","_","sātyaki","NC","","_","_"
5,"pratyavidhyata","_","_","prativyadh","V","prativyadh","_","_"
1,"kampayann","_","_","kampay","KDP","","_","_"
2,"iva","_","_","iva","CCM","","_","_"
3,"ghoṣeṇa","_","_","ghoṣa","NC","","_","_"
4,"dhanuṣo","_","_","dhanus","NC","","_","_"
5,"vasudhāṃ","_","_","vasudhā","NC","","_","_"
6,"balī","_","_","balin","JJ","","_","_"
1,"sūtaputro","_","_","sūtaputra","NC","","_","_"
2,"_","_","_","mahat","JJ","","_","_"
3,"_","_","_","rāja","NC","","_","_"
4,"sātyakiṃ","_","_","sātyaki","NC","","_","_"
5,"pratyayodhayat","_","_","pratiyodhay","V","pratiyodhay","_","_"
1,"_","_","_","vipāṭha","NC","","_","_"
2,"_","_","_","karṇin","NC","","_","_"
3,"_","_","_","nārāca","NC","","_","_"
4,"vatsadantaiḥ","_","_","vatsadanta","NC","","_","_"
5,"kṣurair","_","_","kṣura","NC","","_","_"
6,"api","_","_","api","CX","","_","_"
1,"karṇaḥ","_","_","karṇa","NC","","_","_"
2,"_","_","_","śara","NC","","_","_"
3,"_","_","_","śata","NUM","","_","_"
4,"_","_","_","ca","CCD","","_","_"
5,"_","_","_","api","CX","","_","_"
6,"śaineyaṃ","_","_","śaineya","NC","","_","_"
7,"pratyavidhyata","_","_","prativyadh","V","prativyadh","_","_"
1,"_","_","_","tathā","CX","","_","_"
2,"_","_","_","eva","CEM","","_","_"
3,"yuyudhāno","_","_","yuyudhāna","NC","","_","_"
4,"'pi","_","_","api","CX","","_","_"
5,"vṛṣṇīnāṃ","_","_","vṛṣṇi","NC","","_","_"
6,"pravaro","_","_","pravara","JJ","","_","_"
7,"rathaḥ","_","_","ratha","NC","","_","_"
1,"_","_","_","abhivṛṣ","V","abhivṛṣ","_","_"
2,"_","_","_","śara","NC","","_","_"
3,"karṇaṃ","_","_","karṇa","NC","","_","_"
4,"tad","_","_","tad","PRD","","_","_"
5,"yuddham","_","_","yuddha","NC","","_","_"
6,"abhavat","_","_","bhav","V","bhū","_","_"
7,"samam","_","_","sama","PPX","","_","_"
1,"_","_","_","tāvaka","JJ","","_","_"
2,"_","_","_","ca","CCD","","_","_"
3,"_","_","_","mahat","JJ","","_","_"
4,"_","_","_","rāja","NC","","_","_"
5,"_","_","_","karṇa","NC","","_","_"
6,"_","_","_","putra","NC","","_","_"
7,"_","_","_","ca","CCD","","_","_"
8,"daṃśitaḥ","_","_","daṃśay","PPP","","_","_"
1,"sātyakiṃ","_","_","sātyaki","NC","","_","_"
2,"_","_","_","vyadh","V","vyadh","_","_"
3,"_","_","_","tūrṇa","CX","","_","_"
4,"_","_","_","samantāt","CX","","_","_"
5,"_","_","_","niśā","PPP","","_","_"
6,"śaraiḥ","_","_","śara","NC","","_","_"
1,"astrair","_","_","astra","NC","","_","_"
2,"astrāṇi","_","_","astra","NC","","_","_"
3,"saṃvārya","_","_","saṃvāray","CGDA","","_","_"
4,"teṣāṃ","_","_","tad","PRD","","_","_"
5,"karṇasya","_","_","karṇa","NC","","_","_"
6,"_","_","_","ca","CCD","","_","_"
7,"_","_","_","abhibhu","JJ","","_","_"
1,"avidhyat","_","_","vyadh","V","vyadh","_","_"
2,"sātyakiḥ","_","_","sātyaki","NC","","_","_"
3,"kruddho","_","_","krudh","PPP","","_","_"
4,"vṛṣasenaṃ","_","_","vṛṣasa","NC","","_","_"
5,"stanāntare","_","_","stanāntara","NC","","_","_"
1,"tena","_","_","tad","PRD","","_","_"
2,"bāṇena","_","_","bāṇa","NC","","_","_"
3,"nirviddho","_","_","nirvyadh","PPP","","_","_"
4,"vṛṣaseno","_","_","vṛṣasa","NC","","_","_"
5,"viśāṃ","_","_","viś","NC","","_","_"
6,"pate","_","_","pati","NC","","_","_"
1,"nyapatat","_","_","nipat","V","nipat","_","_"
2,"sa","_","_","tad","PRD","","_","_"
3,"rathe","_","_","ratha","NC","","_","_"
4,"mūḍho","_","_","muh","PPP","","_","_"
5,"dhanur","_","_","dhanus","NC","","_","_"
6,"utsṛjya","_","_","utsṛj","CGDA","","_","_"
7,"vīryavān","_","_","vīryavat","JJ","","_","_"
1,"tataḥ","_","_","tatas","CX","","_","_"
2,"karṇo","_","_","karṇa","NC","","_","_"
3,"hataṃ","_","_","han","PPP","","_","_"
4,"matvā","_","_","man","CGDA","","_","_"
5,"vṛṣasenaṃ","_","_","vṛṣasa","NC","","_","_"
6,"_","_","_","mahat","JJ","","_","_"
7,"_","_","_","ratha","NC","","_","_"
1,"_","_","_","putra","NC","","_","_"
2,"_","_","_","śoka","NC","","_","_"
3,"_","_","_","abhisaṃtap","PPP","","_","_"
4,"sātyakiṃ","_","_","sātyaki","NC","","_","_"
5,"pratyapīḍayat","_","_","pratipīḍay","V","pratipīḍay","_","_"
1,"_","_","_","pīḍay","KDP","","_","_"
2,"_","_","_","tu","CCD","","_","_"
3,"karṇena","_","_","karṇa","NC","","_","_"
4,"yuyudhāno","_","_","yuyudhāna","NC","","_","_"
5,"_","_","_","mahat","JJ","","_","_"
6,"_","_","_","ratha","NC","","_","_"
1,"vivyādha","_","_","vyadh","V","vyadh","_","_"
2,"bahubhiḥ","_","_","bahu","JJ","","_","_"
3,"karṇaṃ","_","_","karṇa","NC","","_","_"
4,"tvaramāṇaḥ","_","_","tvar","KDP","","_","_"
5,"punaḥ","_","_","punar","CAD","","_","_"
6,"punaḥ","_","_","punar","CAD","","_","_"
1,"sa","_","_","tad","PRD","","_","_"
2,"karṇaṃ","_","_","karṇa","NC","","_","_"
3,"daśabhir","_","_","daśan","NUM","","_","_"
4,"viddhvā","_","_","vyadh","CGDA","","_","_"
5,"vṛṣasenaṃ","_","_","vṛṣasa","NC","","_","_"
6,"ca","_","_","ca","CCD","","_","_"
7,"saptabhiḥ","_","_","saptan","NUM","","_","_"
1,"_","_","_","sa_saha","CX","","_","_"
2,"_","_","_","hasta","NC","","_","_"
3,"_","_","_","āvāpa","NC","","_","_"
4,"_","_","_","dhanus","NC","","_","_"
5,"_","_","_","tad","PRD","","_","_"
6,"_","_","_","chid","V","chid","_","_"
7,"sātvataḥ","_","_","sātvata","NC","","_","_"
1,"_","_","_","tad","PRD","","_","_"
2,"_","_","_","anya","PPX","","_","_"
3,"dhanuṣī","_","_","dhanus","NC","","_","_"
4,"sajye","_","_","sajya","JJ","","_","_"
5,"kṛtvā","_","_","kṛ","CGDA","","_","_"
6,"_","_","_","śatru","NC","","_","_"
7,"_","_","_","bhayaṃkara","JJ","","_","_"
1,"yuyudhānam","_","_","yuyudhāna","NC","","_","_"
2,"avidhyetāṃ","_","_","vyadh","V","vyadh","_","_"
3,"_","_","_","samantāt","CX","","_","_"
4,"_","_","_","niśā","PPP","","_","_"
5,"śaraiḥ","_","_","śara","NC","","_","_"
1,"vartamāne","_","_","vṛt","KDP","","_","_"
2,"tu","_","_","tu","CCD","","_","_"
3,"saṃgrāme","_","_","saṃgrāma","NC","","_","_"
4,"tasmin","_","_","tad","PRD","","_","_"
5,"_","_","_","vīra","NC","","_","_"
6,"_","_","_","vara","JJ","","_","_"
7,"_","_","_","kṣaya","NC","","_","_"
1,"atīva","_","_","atīva","CX","","_","_"
2,"śuśruve","_","_","śṛṇ","V","śru","_","_"
3,"rājan","_","_","rājan","NC","","_","_"
4,"gāṇḍīvasya","_","_","gāṇḍīva","NC","","_","_"
5,"_","_","_","mahat","JJ","","_","_"
6,"_","_","_","svana","NC","","_","_"
1,"śrutvā","_","_","śru","CGDA","","_","_"
2,"tu","_","_","tu","CCD","","_","_"
3,"_","_","_","ratha","NC","","_","_"
4,"_","_","_","nirghoṣa","NC","","_","_"
5,"gāṇḍīvasya","_","_","gāṇḍīva","NC","","_","_"
6,"ca","_","_","ca","CCD","","_","_"
7,"nisvanam","_","_","nisvana","NC","","_","_"
1,"sūtaputro","_","_","sūtaputra","NC","","_","_"
2,"'bravīd","_","_","abravīta","V","brū","_","_"
3,"rājan","_","_","rājan","NC","","_","_"
4,"duryodhanam","_","_","duryodhana","NC","","_","_"
5,"idaṃ","_","_","ida","PRD","","_","_"
6,"vacaḥ","_","_","vacas","NC","","_","_"
1,"eṣa","_","_","tad","PRD","","_","_"
2,"sarvāñ","_","_","sarva","JQ","","_","_"
3,"śibīn","_","_","śibi","NC","","_","_"
4,"hatvā","_","_","han","CGDA","","_","_"
5,"_","_","_","mukhyaśas","CX","","_","_"
6,"_","_","_","ca","CCD","","_","_"
7,"_","_","_","nara","NC","","_","_"
8,"_","_","_","ṛṣabha","NC","","_","_"
1,"_","_","_","paurava","NC","","_","_"
2,"_","_","_","ca","CCD","","_","_"
3,"_","_","_","mahat","JJ","","_","_"
4,"_","_","_","iṣvāsa","NC","","_","_"
5,"_","_","_","gāṇḍīva","NC","","_","_"
6,"_","_","_","ninada","NC","","_","_"
7,"mahān","_","_","mahat","JJ","","_","_"
1,"śrūyate","_","_","śṛṇ","V","śru","_","_"
2,"_","_","_","ratha","NC","","_","_"
3,"_","_","_","ghoṣa","NC","","_","_"
4,"_","_","_","ca","CCD","","_","_"
5,"_","_","_","vāsava","NC","","_","_"
6,"_","_","_","iva","CCM","","_","_"
7,"nardataḥ","_","_","nard","KDP","","_","_"
1,"karoti","_","_","kar","V","kṛ","_","_"
2,"pāṇḍavo","_","_","pāṇḍava","NC","","_","_"
3,"vyaktaṃ","_","_","vyakta","JJ","","_","_"
4,"_","_","_","karman","NC","","_","_"
5,"_","_","_","aupayika","JJ","","_","_"
6,"ātmanaḥ","_","_","ātman","NC","","_","_"
1,"eṣā","_","_","tad","PRD","","_","_"
2,"vidīryate","_","_","vidīr","V","vidṛ","_","_"
3,"rājan","_","_","rājan","NC","","_","_"
4,"bahudhā","_","_","bahudhā","CX","","_","_"
5,"bhāratī","_","_","bhārata","JJ","","_","_"
6,"camūḥ","_","_","camū","NC","","_","_"
1,"_","_","_","viprakṛ","PPP","","_","_"
2,"_","_","_","anīka","NC","","_","_"
3,"_","_","_","na","CNG","","_","_"
4,"_","_","_","avatiṣṭh","V","avasthā","_","_"
5,"karhicit","_","_","karhicit","CX","","_","_"
1,"_","_","_","vāta","NC","","_","_"
2,"_","_","_","iva","CCM","","_","_"
3,"samuddhūtam","_","_","samuddhū","PPP","","_","_"
4,"_","_","_","abhra","NC","","_","_"
5,"_","_","_","jāla","NC","","_","_"
6,"vidīryate","_","_","vidīr","V","vidṛ","_","_"
1,"savyasācinam","_","_","savyasācin","NC","","_","_"
2,"āsādya","_","_","āsāday","CGDA","","_","_"
3,"bhinnā","_","_","bhid","PPP","","_","_"
4,"naur","_","_","nau","NC","","_","_"
5,"iva","_","_","iva","CCM","","_","_"
6,"sāgare","_","_","sāgara","NC","","_","_"
1,"dravatāṃ","_","_","dru","KDP","","_","_"
2,"_","_","_","yodha","NC","","_","_"
3,"_","_","_","mukhya","JJ","","_","_"
4,"_","_","_","gāṇḍīva","NC","","_","_"
5,"_","_","_","preṣay","PPP","","_","_"
6,"śaraiḥ","_","_","śara","NC","","_","_"
1,"viddhānāṃ","_","_","vyadh","PPP","","_","_"
2,"śataśo","_","_","śataśas","CX","","_","_"
3,"rājañ","_","_","rājan","NC","","_","_"
4,"śrūyate","_","_","śṛṇ","V","śru","_","_"
5,"ninado","_","_","ninada","NC","","_","_"
6,"mahān","_","_","mahat","JJ","","_","_"
1,"niśīthe","_","_","niśītha","NC","","_","_"
2,"_","_","_","rājan","NC","","_","_"
3,"_","_","_","śārdūla","NC","","_","_"
4,"stanayitnor","_","_","stanayitnu","NC","","_","_"
5,"_","_","_","iva","CCM","","_","_"
6,"_","_","_","ambara","NC","","_","_"
1,"_","_","_","hāhākāra","NC","","_","_"
2,"_","_","_","rava","NC","","_","_"
3,"_","_","_","ca","CCD","","_","_"
4,"_","_","_","eva","CEM","","_","_"
5,"_","_","_","siṃhanāda","NC","","_","_"
6,"_","_","_","ca","CCD","","_","_"
7,"puṣkalān","_","_","puṣkala","JJ","","_","_"
1,"śṛṇu","_","_","śṛṇ","V","śru","_","_"
2,"śabdān","_","_","śabda","NC","","_","_"
3,"bahuvidhān","_","_","bahuvidha","JJ","","_","_"
4,"arjunasya","_","_","arjuna","NC","","_","_"
5,"rathaṃ","_","_","ratha","NC","","_","_"
6,"prati","_","_","prati","CADP","","_","_"
1,"ayaṃ","_","_","ida","PRD","","_","_"
2,"madhye","_","_","madhya","NC","","_","_"
3,"sthito","_","_","sthā","PPP","","_","_"
4,"'smākaṃ","_","_","mat","PPR","","_","_"
5,"sātyakiḥ","_","_","sātyaki","NC","","_","_"
6,"_","_","_","sātvata","NC","","_","_"
7,"_","_","_","adhama","JJ","","_","_"
1,"iha","_","_","iha","CAD","","_","_"
2,"cel","_","_","ced","CX","","_","_"
3,"labhyate","_","_","labh","V","labh","_","_"
4,"lakṣyaṃ","_","_","lakṣya","NC","","_","_"
5,"kṛtsnāñ","_","_","kṛtsna","JJ","","_","_"
6,"jeṣyāmahe","_","_","jay","V","ji","_","_"
7,"parān","_","_","para","PPX","","_","_"
1,"eṣa","_","_","tad","PRD","","_","_"
2,"_","_","_","pāñcāla","NC","","_","_"
3,"_","_","_","rāja","NC","","_","_"
4,"putro","_","_","putra","NC","","_","_"
5,"droṇena","_","_","droṇa","NC","","_","_"
6,"saṃgataḥ","_","_","saṃga","PPP","","_","_"
1,"sarvataḥ","_","_","sarvatas","CX","","_","_"
2,"saṃvṛto","_","_","saṃvṛ","PPP","","_","_"
3,"yodhai","_","_","yodha","NC","","_","_"
4,"rājan","_","_","rājan","NC","","_","_"
5,"_","_","_","puruṣa","NC","","_","_"
6,"_","_","_","sattama","JJ","","_","_"
1,"sātyakiṃ","_","_","sātyaki","NC","","_","_"
2,"yadi","_","_","yadi","CSB","","_","_"
3,"hanyāmo","_","_","han","V","han","_","_"
4,"dhṛṣṭadyumnaṃ","_","_","dhṛṣṭadyumna","NC","","_","_"
5,"ca","_","_","ca","CCD","","_","_"
6,"pārṣatam","_","_","pārṣata","NC","","_","_"
1,"asaṃśayaṃ","_","_","asaṃśaya","CX","","_","_"
2,"_","_","_","mahat","JJ","","_","_"
3,"_","_","_","rāja","NC","","_","_"
4,"dhruvo","_","_","dhruva","JJ","","_","_"
5,"no","_","_","mat","PPR","","_","_"
6,"vijayo","_","_","vijaya","NC","","_","_"
7,"bhavet","_","_","bhav","V","bhū","_","_"
1,"_","_","_","saubhadra","NC","","_","_"
2,"_","_","_","vat","CX","","_","_"
3,"imau","_","_","ida","PRD","","_","_"
4,"vīrau","_","_","vīra","NC","","_","_"
5,"parivārya","_","_","parivāray","CGDA","","_","_"
6,"_","_","_","mahat","JJ","","_","_"
7,"_","_","_","ratha","NC","","_","_"
1,"prayatāmo","_","_","prayat","V","prayat","_","_"
2,"_","_","_","mahat","JJ","","_","_"
3,"_","_","_","rāja","NC","","_","_"
4,"nihantuṃ","_","_","nihan","CGDI","","_","_"
5,"_","_","_","vṛṣṇi","NC","","_","_"
6,"_","_","_","pārṣata","NC","","_","_"
1,"savyasācī","_","_","savyasācin","NC","","_","_"
2,"puro","_","_","puras","CX","","_","_"
3,"'bhyeti","_","_","abhī","V","abhī","_","_"
4,"_","_","_","droṇa","NC","","_","_"
5,"_","_","_","anīka","NC","","_","_"
6,"bhārata","_","_","bhārata","NC","","_","_"
1,"saṃsaktaṃ","_","_","saṃsañj","PPP","","_","_"
2,"sātyakiṃ","_","_","sātyaki","NC","","_","_"
3,"jñātvā","_","_","jñā","CGDA","","_","_"
4,"bahubhiḥ","_","_","bahu","JJ","","_","_"
5,"_","_","_","kuru","NC","","_","_"
6,"_","_","_","puṃgava","NC","","_","_"
1,"tatra","_","_","tatra","CAD","","_","_"
2,"gacchantu","_","_","gacch","V","gam","_","_"
3,"bahavaḥ","_","_","bahu","JJ","","_","_"
4,"pravarā","_","_","pravara","JJ","","_","_"
5,"_","_","_","ratha","NC","","_","_"
6,"_","_","_","sattama","JJ","","_","_"
1,"yāvat","_","_","yāvat","CX","","_","_"
2,"pārtho","_","_","pārtha","NC","","_","_"
3,"na","_","_","na","CNG","","_","_"
4,"jānāti","_","_","jān","V","jñā","_","_"
5,"sātyakiṃ","_","_","sātyaki","NC","","_","_"
6,"bahubhir","_","_","bahu","JJ","","_","_"
7,"vṛtam","_","_","vṛ","PPP","","_","_"
1,"te","_","_","tad","PRD","","_","_"
2,"tvaradhvaṃ","_","_","tvar","V","tvar","_","_"
3,"yathā","_","_","yathā","CCM","","_","_"
4,"śūrāḥ","_","_","śūra","NC","","_","_"
5,"śarāṇāṃ","_","_","śara","NC","","_","_"
6,"mokṣaṇe","_","_","mokṣaṇa","NC","","_","_"
7,"bhṛśam","_","_","bhṛśa","CX","","_","_"
1,"yathā","_","_","yathā","CCM","","_","_"
2,"tūrṇaṃ","_","_","tūrṇa","CX","","_","_"
3,"_","_","_","vraj","V","vraj","_","_"
4,"_","_","_","tad","PRD","","_","_"
5,"_","_","_","para","PPX","","_","_"
6,"_","_","_","loka","NC","","_","_"
7,"mādhavaḥ","_","_","mādhava","NC","","_","_"
1,"karṇasya","_","_","karṇa","NC","","_","_"
2,"matam","_","_","mata","NC","","_","_"
3,"ājñāya","_","_","ājñā","CGDA","","_","_"
4,"_","_","_","putra","NC","","_","_"
5,"_","_","_","tvat","PPR","","_","_"
6,"prāha","_","_","prāh","V","prāh","_","_"
7,"saubalam","_","_","saubala","NC","","_","_"
1,"_","_","_","yathā","CCM","","_","_"
2,"_","_","_","indra","NC","","_","_"
3,"samare","_","_","samara","NC","","_","_"
4,"rājan","_","_","rājan","NC","","_","_"
5,"prāha","_","_","prāh","V","prāh","_","_"
6,"viṣṇuṃ","_","_","viṣṇu","NC","","_","_"
7,"yaśasvinam","_","_","yaśasvin","JJ","","_","_"
1,"vṛtaḥ","_","_","vṛ","PPP","","_","_"
2,"sahasrair","_","_","sahasra","NUM","","_","_"
3,"daśabhir","_","_","daśan","NUM","","_","_"
4,"gajānām","_","_","gaja","NC","","_","_"
5,"anivartinām","_","_","anivartin","JJ","","_","_"
1,"_","_","_","ratha","NC","","_","_"
2,"_","_","_","ca","CCD","","_","_"
3,"_","_","_","daśan","NUM","","_","_"
4,"_","_","_","sāhasra","JJ","","_","_"
5,"vṛto","_","_","vṛ","PPP","","_","_"
6,"yāhi","_","_","yā","V","yā","_","_"
7,"dhanaṃjayam","_","_","dhanaṃjaya","NC","","_","_"
1,"duḥśāsano","_","_","duḥśāsana","NC","","_","_"
2,"durviṣahaḥ","_","_","durviṣaha","NC","","_","_"
3,"subāhur","_","_","subāhu","NC","","_","_"
4,"duṣpradharṣaṇaḥ","_","_","duṣpradharṣaṇa","NC","","_","_"
1,"ete","_","_","tad","PRD","","_","_"
2,"tvām","_","_","tvat","PPR","","_","_"
3,"anuyāsyanti","_","_","anuyā","V","anuyā","_","_"
4,"pattibhir","_","_","patti","NC","","_","_"
5,"bahubhir","_","_","bahu","JJ","","_","_"
6,"vṛtāḥ","_","_","vṛ","PPP","","_","_"
1,"jahi","_","_","jah","V","hā","_","_"
2,"kṛṣṇau","_","_","kṛṣṇa","NC","","_","_"
3,"_","_","_","mahat","JJ","","_","_"
4,"_","_","_","bāhu","NC","","_","_"
5,"dharmarājaṃ","_","_","dharmarāja","NC","","_","_"
6,"ca","_","_","ca","CCD","","_","_"
7,"mātula","_","_","mātula","NC","","_","_"
1,"nakulaṃ","_","_","nakula","NC","","_","_"
2,"sahadevaṃ","_","_","sahadeva","NC","","_","_"
3,"ca","_","_","ca","CCD","","_","_"
4,"bhīmasenaṃ","_","_","bhīmasa","NC","","_","_"
5,"ca","_","_","ca","CCD","","_","_"
6,"bhārata","_","_","bhārata","NC","","_","_"
1,"devānām","_","_","deva","NC","","_","_"
2,"iva","_","_","iva","CCM","","_","_"
3,"devendre","_","_","devendra","NC","","_","_"
4,"_","_","_","jaya","NC","","_","_"
5,"_","_","_","āśā","NC","","_","_"
6,"me","_","_","mat","PPR","","_","_"
7,"tvayi","_","_","tvat","PPR","","_","_"
8,"sthitā","_","_","sthā","PPP","","_","_"
1,"jahi","_","_","jah","V","hā","_","_"
2,"mātula","_","_","mātula","NC","","_","_"
3,"kaunteyān","_","_","kaunteya","NC","","_","_"
4,"asurān","_","_","asura","NC","","_","_"
5,"iva","_","_","iva","CCM","","_","_"
6,"pāvakiḥ","_","_","pāvaki","NC","","_","_"
1,"evam","_","_","eva","CX","","_","_"
2,"ukto","_","_","vac","PPP","","_","_"
3,"yayau","_","_","yā","V","yā","_","_"
4,"pārthān","_","_","pārtha","NC","","_","_"
5,"putreṇa","_","_","putra","NC","","_","_"
6,"tava","_","_","tvat","PPR","","_","_"
7,"saubalaḥ","_","_","saubala","NC","","_","_"
1,"mahatyā","_","_","mahat","JJ","","_","_"
2,"senayā","_","_","senā","NC","","_","_"
3,"sārdhaṃ","_","_","sārdha","CX","","_","_"
4,"tava","_","_","tvat","PPR","","_","_"
5,"_","_","_","putra","NC","","_","_"
6,"_","_","_","tathā","CX","","_","_"
7,"vibho","_","_","vibhu","JJ","","_","_"
1,"_","_","_","priya","JJ","","_","_"
2,"_","_","_","artha","NC","","_","_"
3,"tava","_","_","tvat","PPR","","_","_"
4,"putrāṇāṃ","_","_","putra","NC","","_","_"
5,"didhakṣuḥ","_","_","didhakṣu","JJ","","_","_"
6,"_","_","_","pāṇḍu","NC","","_","_"
7,"_","_","_","nandana","NC","","_","_"
1,"tataḥ","_","_","tatas","CX","","_","_"
2,"pravavṛte","_","_","pravart","V","pravṛt","_","_"
3,"yuddhaṃ","_","_","yuddha","NC","","_","_"
4,"tāvakānāṃ","_","_","tāvaka","JJ","","_","_"
5,"paraiḥ","_","_","para","PPX","","_","_"
6,"saha","_","_","saha","CX","","_","_"
1,"prayāte","_","_","prayā","PPP","","_","_"
2,"saubale","_","_","saubala","NC","","_","_"
3,"rājan","_","_","rājan","NC","","_","_"
4,"pāṇḍavānām","_","_","pāṇḍava","NC","","_","_"
5,"anīkinīm","_","_","anīkinī","NC","","_","_"
1,"balena","_","_","bala","NC","","_","_"
2,"mahatā","_","_","mahat","JJ","","_","_"
3,"yuktaḥ","_","_","yuj","PPP","","_","_"
4,"_","_","_","sūtaputra","NC","","_","_"
5,"_","_","_","tu","CCD","","_","_"
6,"sātvatam","_","_","sātvat","NC","","_","_"
1,"abhyayāt","_","_","abhiyā","V","abhiyā","_","_"
2,"tvaritaṃ","_","_","tvarita","CX","","_","_"
3,"yuddhe","_","_","yuddha","NC","","_","_"
4,"kirañ","_","_","kṛ","KDP","","_","_"
5,"_","_","_","śara","NC","","_","_"
6,"_","_","_","śata","NUM","","_","_"
7,"bahūn","_","_","bahu","JJ","","_","_"
1,"_","_","_","tathā","CX","","_","_"
2,"_","_","_","eva","CEM","","_","_"
3,"pāṇḍavāḥ","_","_","pāṇḍava","NC","","_","_"
4,"sarve","_","_","sarva","JQ","","_","_"
5,"sātyakiṃ","_","_","sātyaki","NC","","_","_"
6,"paryavārayan","_","_","parivāray","V","parivāray","_","_"
1,"mahad","_","_","mahat","JJ","","_","_"
2,"yuddhaṃ","_","_","yuddha","NC","","_","_"
3,"_","_","_","tadā","CAD","","_","_"
4,"_","_","_","as","V","as","_","_"
5,"tu","_","_","tu","CCD","","_","_"
6,"droṇasya","_","_","droṇa","NC","","_","_"
7,"niśi","_","_","niś","NC","","_","_"
8,"bhārata","_","_","bhārata","NC","","_","_"
1,"dhṛṣṭadyumnena","_","_","dhṛṣṭadyumna","NC","","_","_"
2,"śūreṇa","_","_","śūra","NC","","_","_"
3,"_","_","_","pāñcāla","NC","","_","_"
4,"_","_","_","ca","CCD","","_","_"
5,"mahātmanaḥ","_","_","mahātman","JJ","","_","_"
