"WordID","word","NormSTEM","suffix","lemma","PoS","Root","NormSuffix","NormWord"
"","<s number = ""1"">","","","","","","",""
"1","khṣema","KHṢEM","a","khṣema","","","a","khṣema"
"2","rāja","RĀJ","a","rājan","","","a","rāja"
"3","bhodha","","","","","","",""
"4","vilāsa","VILĀS","a","vilāsa","noun-adj","","a","vilāsa"
"5","om","","","oṃ","ind","","","oṃ"
"6","namaḥ","NAM","aḥ","namas","noun-adj","","aḥ","namaḥ"
"7","netrāya","NETR","āya","netra","noun-adj","","āya","netrāya"
"8","//","","","","punct","","","//"
"","</s>","","","","","","",""
"","<s number = ""2"">","","","","","","",""
"1","namaḥ","NAM","aḥ","namas","noun-adj","","aḥ","namaḥ"
"2","śivāya","ŚIV","āya","śiva","noun-adj","","āya","śivāya"
"3","satatam","SATAT","am","satata","noun-adj","","am","satatam"
"4","pañca","PAÑC","a","pañca","noun-adj","","a","pañca"
"5","kṛtya","KṚTY","a","kṛtya","noun-adj","","a","kṛtya"
"6","vidhāyine","VIDHĀY","ine","vidhāyi","noun-adj","","ine","vidhāyine"
"7","/","","","","punct","","","/"
"8","cit","CIT","","cid","noun-adj","","","cit"
"9","ānanda","ĀNAND","a","ānanda","noun-adj","","a","ānanda"
"10","ghana","GHAN","a","ghana","noun-adj","","a","ghana"
"11","sva","SV","a","sva","noun-adj","","a","sva"
"12","ātma","ĀTM","a","ātman","noun-adj","","a","ātma"
"13","parama","PARAM","a","parama","noun-adj","","a","parama"
"14","artha","ARTH","a","artha","noun-adj","","a","artha"
"15","avabhāsine","AVABHĀS","ine","avabhāsi","","","ine","avabhāsine"
"16","//","","","","punct","","","//"
"","</s>","","","","","","",""
"","<s number = ""3"">","","","","","","",""
"1","//","","","","punct","","","//"
"","</s>","","","","","","",""
"","<s number = ""4"">","","","","","","",""
"1","citiḥ","CIT","iḥ","citi","","","iḥ","citiḥ"
"2","svatantrā","SVATANTR","ā","svatantra","noun-adj","","āḥ","svatantrāḥ"
"3","viśvasya","VIŚV","asya","viśva","noun-adj","","asya","viśvasya"
"4","hetuḥ","HET","uḥ","hetu","noun-adj","","uḥ","hetuḥ"
"5","iti","","","iti","ind","","","iti"
"6","abhidhīyate","ABHIDHĪ","yate","abhidadh","verb","abhidhā","yate","abhidhīyate"
"7","/","","","","punct","","","/"
"8","svātantrya","SVĀTANTRY","a","svātantrya","noun-adj","","a","svātantrya"
"9","rūpā","RŪP","ā","rūpa","noun-adj","","āḥ","rūpāḥ"
"10","jñātā","JÑĀT","ā","jñāta","noun-adj","","āḥ","jñātāḥ"
"11","ca","","","ca","ind","","","ca"
"12","siddhīḥ","SIDDH","īḥ","siddhī","noun-adj","","īḥ","siddhīḥ"
"13","vā","","","vā","ind","","","vā"
"14","saṃ","","","","","","",""
"15","prayacchate","PRAYACCH","ate","prayacch","verb","","ate","prayacchate"
"16","//","","","","punct","","","//"
"","</s>","","","","","","",""
"","<s number = ""5"">","","","","","","",""
"1","//","","","","punct","","","//"
"","</s>","","","","","","",""
"","<s number = ""6"">","","","","","","",""
"1","sā","","","tad","pron","","","tad"
"2","sva","SV","a","sva","noun-adj","","a","sva"
"3","bhittau","BHITT","au","bhitta","noun-adj","","au","bhittau"
"4","sva","SV","a","sva","noun-adj","","a","sva"
"5","icchayā","ICCHAY","ā","icchayā","noun-adj","","ā","icchayā"
"6","eva","","","eva","ind","","","eva"
"7","viśvasya","VIŚV","asya","viśva","noun-adj","","asya","viśvasya"
"8","unmīlanāya","UNMĪLAN","āya","unmīlana","","","āya","unmīlanāya"
"9","ca","","","ca","ind","","","ca"
"10","/","","","","punct","","","/"
"11","nānā","NĀN","ā","nānā","noun-adj","","ā","nānā"
"12","anurūpa","ANURŪP","a","anurūpa","noun-adj","","a","anurūpa"
"13","vaicitryāt","VAICITRY","āt","vaicitrya","noun-adj","","āt","vaicitryāt"
"14","grāhya","GRĀHY","a","grāhya","noun-adj","","a","grāhya"
"15","grāhaka","GRĀH","aka","grāhaka","noun-adj","","aka","grāhaka"
"16","bhedataḥ","BHED","ataḥ","bheda","noun-adj","","ataḥ","bhedataḥ"
"17","//","","","","punct","","","//"
"","</s>","","","","","","",""
"","<s number = ""7"">","","","","","","",""
"1","//","","","","punct","","","//"
"","</s>","","","","","","",""
"","<s number = ""8"">","","","","","","",""
"1","viśvasya","VIŚV","asya","viśva","noun-adj","","asya","viśvasya"
"2","tasya","","","tad","pron","","","tad"
"3","vaicitryam","VAICITRY","am","vaicitrya","noun-adj","","am","vaicitryam"
"4","grāhya","GRĀHY","a","grāhya","noun-adj","","a","grāhya"
"5","bhedena","BHED","ena","bheda","noun-adj","","ena","bhedena"
"6","saṃsthitam","SAṂSTHIT","am","saṃsthita","noun-adj","","am","saṃsthitam"
"7","/","","","","punct","","","/"
"8","nānā","NĀN","ā","nānā","noun-adj","","ā","nānā"
"9","vaicitrya","VAICITRY","a","vaicitrya","noun-adj","","a","vaicitrya"
"10","yogena","YOG","ena","yoga","noun-adj","","ena","yogena"
"11","ca","","","ca","ind","","","ca"
"12","uttama","UTTAM","a","uttama","noun-adj","","a","uttama"
"13","adhama","ADHAM","a","adhama","noun-adj","","a","adhama"
"14","saṅkhyayā","SAṂKHY","ayā","saṃkhyā","noun-adj","","ayā","saṃkhyayā"
"15","//","","","","punct","","","//"
"","</s>","","","","","","",""
"","<s number = ""9"">","","","","","","",""
"1","//","","","","punct","","","//"
"","</s>","","","","","","",""
"","<s number = ""10"">","","","","","","",""
"1","citi","CIT","i","cita","noun-adj","","i","citi"
"2","saṅkocanāt","SAṂKOCAN","āt","saṃkocana","","","āt","saṃkocanāt"
"3","cittam","CITT","am","citta","noun-adj","","am","cittam"
"4","cetanaḥ","CETAN","aḥ","cetana","noun-adj","","aḥ","cetanaḥ"
"5","api","","","api","ind","","","api"
"6","maheśvaraḥ","MAHEŚVAR","aḥ","maheśvara","noun-adj","","aḥ","maheśvaraḥ"
"7","/","","","","punct","","","/"
"8","vaṭa","VAṬ","a","vaṭa","noun-adj","","a","vaṭa"
"9","dhani","DHAN","i","dhanin","","","i","dhani"
"10","kāvat","KĀV","at","kāvat","","","at","kāvat"
"11","tatra","","","tatra","ind","","","tatra"
"12","viśva","VIŚV","a","viśva","noun-adj","","a","viśva"
"13","rūpam","RŪP","am","rūpa","noun-adj","","am","rūpam"
"14","ca","","","ca","ind","","","ca"
"15","tat","TAT","","tad","pron","","","tat"
"16","viduḥ","VID","uḥ","vidu","noun-adj","","uḥ","viduḥ"
"17","//","","","","punct","","","//"
"","</s>","","","","","","",""
"","<s number = ""11"">","","","","","","",""
"1","//","","","","punct","","","//"
"","</s>","","","","","","",""
"","<s number = ""12"">","","","","","","",""
"1","caitanyam","CAITANY","am","caitanya","noun-adj","","am","caitanyam"
"2","ātmanaḥ","ĀTM","anaḥ","ātman","noun-adj","","anaḥ","ātmanaḥ"
"3","rūpam","RŪP","am","rūpa","noun-adj","","am","rūpam"
"4","śuddham","ŚUDDH","am","śuddha","noun-adj","","am","śuddham"
"5","atyanta","ATYANT","a","atyanta","noun-adj","","a","atyanta"
"6","nirmalam","NIRMAL","am","nirmala","noun-adj","","am","nirmalam"
"7","/","","","","punct","","","/"
"8","tat","TAT","","tad","pron","","","tat"
"9","eva","","","eva","ind","","","eva"
"10","niyama","NIYAM","a","niyama","noun-adj","","a","niyama"
"11","āsaktam","ĀSAKT","am","āsakta","noun-adj","","am","āsaktam"
"12","cittam","CITT","am","citta","noun-adj","","am","cittam"
"13","cit","CIT","","cid","noun-adj","","","cit"
"14","abhidhīyate","ABHIDHĪ","yate","abhidadh","verb","abhidhā","yate","abhidhīyate"
"15","//","","","","punct","","","//"
"","</s>","","","","","","",""
"","<s number = ""13"">","","","","","","",""
"1","//","","","","punct","","","//"
"","</s>","","","","","","",""
"","<s number = ""14"">","","","","","","",""
"1","artha","ARTH","a","artha","noun-adj","","a","artha"
"2","unmukha","UNMUKH","a","unmukha","noun-adj","","a","unmukha"
"3","tayā","","","tad","pron","","","tad"
"4","saṃvid","SAṂVID","","saṃvida","noun-adj","","","saṃvid"
"5","citte","CITT","e","citta","noun-adj","","e","citte"
"6","viśrāntim","VIŚRĀNT","im","viśrānti","noun-adj","","im","viśrāntim"
"7","āgatāḥ","ĀGAT","āḥ","āgata","noun-adj","","āḥ","āgatāḥ"
"8","/","","","","punct","","","/"
"9","saṅkoca","SAṂKOC","a","saṃkoca","noun-adj","","a","saṃkoca"
"10","ātma","ĀTM","a","ātman","noun-adj","","a","ātma"
"11","pradhānatvāt","PRADHĀN","atvāt","pradhānatva","noun-adj","","atvāt","pradhānatvāt"
"12","citiḥ","CIT","iḥ","citi","","","iḥ","citiḥ"
"13","cittam","CITT","am","citta","noun-adj","","am","cittam"
"14","viduḥ","VID","uḥ","vidu","noun-adj","","uḥ","viduḥ"
"15","budhāḥ","BUDH","āḥ","budha","noun-adj","","āḥ","budhāḥ"
"16","//","","","","punct","","","//"
"","</s>","","","","","","",""
"","<s number = ""15"">","","","","","","",""
"1","//","","","","punct","","","//"
"","</s>","","","","","","",""
"","<s number = ""16"">","","","","","","",""
"1","māyā","MĀY","ā","māyā","noun-adj","","ā","māyā"
"2","pramātā","PRAMĀT","ā","pramātā","noun-adj","","ā","pramātā"
"3","cit","CIT","","cid","noun-adj","","","cit"
"4","rūpaḥ","RŪP","aḥ","rūpa","noun-adj","","aḥ","rūpaḥ"
"5","tad","TAD","","tad","pron","","","tad"
"6","mayatvena","MAY","atvena","mayatva","noun-adj","","atvena","mayatvena"
"7","dehinām","DEH","inām","dehin","noun-adj","","inām","dehinām"
"8","/","","","","punct","","","/"
"9","vartate","VART","ate","vart","verb","vṛt","ate","vartate"
"10","viṣaya","VIṢAY","a","viṣaya","noun-adj","","a","viṣaya"
"11","āsaktaḥ","ĀSAKT","aḥ","āsakta","noun-adj","","aḥ","āsaktaḥ"
"12","sat","SAT","","sat","noun-adj","","","sat"
"13","viveka","VIVEK","a","viveka","noun-adj","","a","viveka"
"14","vivarjitaḥ","VIVARJIT","aḥ","vivarjita","noun-adj","","aḥ","vivarjitaḥ"
"15","//","","","","punct","","","//"
"","</s>","","","","","","",""
"","<s number = ""17"">","","","","","","",""
"1","//","","","","punct","","","//"
"","</s>","","","","","","",""
"","<s number = ""18"">","","","","","","",""
"1","sadā","","","sada","ind","","","sada"
"2","ekaḥ","EK","aḥ","eka","noun-adj","","aḥ","ekaḥ"
"3","pratithaḥ","PRATITH","aḥ","pratithi","","","aḥ","pratithaḥ"
"4","cittam","CITT","am","citta","noun-adj","","am","cittam"
"5","kalā","KAL","ā","kalā","noun-adj","","ā","kalā"
"6","sattva","SATTV","a","sattva","noun-adj","","a","sattva"
"7","guṇa","GUṆ","a","guṇa","noun-adj","","a","guṇa"
"8","ādibhiḥ","ĀD","ibhiḥ","ādi","noun-adj","","ibhiḥ","ādibhiḥ"
"9","/","","","","punct","","","/"
"10","sapta","SAPT","a","sapta","noun-adj","","a","sapta"
"11","pramatṛkatvena","","","","","","",""
"12","ṣaṭ","ṢAṬ","","ṣaṭ","","","","ṣaṭ"
"13","triṃśat","TRIṂŚ","at","triṃśat","","","at","triṃśat"
"14","tattva","TATTV","a","tattva","noun-adj","","a","tattva"
"15","saṅkhyayā","SAṂKHY","ayā","saṃkhyā","noun-adj","","ayā","saṃkhyayā"
"16","//","","","","punct","","","//"
"","</s>","","","","","","",""
"","<s number = ""19"">","","","","","","",""
"1","//","","","","punct","","","//"
"","</s>","","","","","","",""
"","<s number = ""20"">","","","","","","",""
"1","ekaḥ","EK","aḥ","eka","noun-adj","","aḥ","ekaḥ"
"2","sarva","SARV","a","sarva","noun-adj","","a","sarva"
"3","gataḥ","GAT","aḥ","gata","noun-adj","","aḥ","gataḥ"
"4","śuddhaḥ","ŚUDDH","aḥ","śuddha","noun-adj","","aḥ","śuddhaḥ"
"5","sambodha","SAMBO","dha","sambodha","noun-adj","","dha","sambodha"
"6","ātmā","ĀTM","ā","ātman","noun-adj","","ā","ātmā"
"7","maheśvaraḥ","MAHEŚVAR","aḥ","maheśvara","noun-adj","","aḥ","maheśvaraḥ"
"8","/","","","","punct","","","/"
"9","sā","","","tad","pron","","","tad"
"10","eva","","","eva","ind","","","eva"
"11","āhantā","","","","","","",""
"12","parijñānāt","PARIJÑĀN","āt","parijñāna","noun-adj","","āt","parijñānāt"
"13","muktiḥ","MUKT","iḥ","mukti","noun-adj","","iḥ","muktiḥ"
"14","kara","KAR","a","kara","noun-adj","","a","kara"
"15","tale","TAL","e","tala","noun-adj","","e","tale"
"16","sthitāḥ","STHIT","āḥ","sthita","noun-adj","","āḥ","sthitāḥ"
"17","//","","","","punct","","","//"
"","</s>","","","","","","",""
"","<s number = ""21"">","","","","","","",""
"1","//","","","","punct","","","//"
"","</s>","","","","","","",""
"","<s number = ""22"">","","","","","","",""
"1","pramātṛ","PRAMĀT","ṛ","pramātṛ","noun-adj","","ṛ","pramātṛ"
"2","saptakatvena","SAPTAK","atvena","saptakatva","","","atvena","saptakatvena"
"3","ṣaṭ","ṢAṬ","","ṣaṭ","","","","ṣaṭ"
"4","triṃśat","TRIṂŚ","at","triṃśat","","","at","triṃśat"
"5","tattva","TATTV","a","tattva","noun-adj","","a","tattva"
"6","saṅkhyayā","SAṂKHY","ayā","saṃkhyā","noun-adj","","ayā","saṃkhyayā"
"7","/","","","","punct","","","/"
"8","bhāvitaḥ","BHĀVIT","aḥ","bhāvita","noun-adj","","aḥ","bhāvitaḥ"
"9","sa","","","tad","pron","","","tad"
"10","maheśānaḥ","MAHEŚĀN","aḥ","maheśāna","","","aḥ","maheśānaḥ"
"11","mokṣa","MOKṢ","a","mokṣa","noun-adj","","a","mokṣa"
"12","lakṣmīḥ","LAKṢM","īḥ","lakṣmī","noun-adj","","īḥ","lakṣmīḥ"
"13","pravartate","PRAVART","ate","pravart","verb","pravṛt","ate","pravartate"
"14","//","","","","punct","","","//"
"","</s>","","","","","","",""
"","<s number = ""23"">","","","","","","",""
"1","//","","","","punct","","","//"
"","</s>","","","","","","",""
"","<s number = ""24"">","","","","","","",""
"1","tad","TAD","","tad","pron","","","tad"
"2","bhūmikāḥ","BHŪM","ikāḥ","bhūmika","noun-adj","","ikāḥ","bhūmikāḥ"
"3","darśana","DARŚAN","a","darśana","noun-adj","","a","darśana"
"4","ādyāḥ","ĀD","yāḥ","ādi","noun-adj","","yāḥ","ādyāḥ"
"5","sarvāḥ","SARV","āḥ","sarva","noun-adj","","āḥ","sarvāḥ"
"6","eva","","","eva","ind","","","eva"
"7","na","","","na","ind","","","na"
"8","saṃśayaḥ","SAṂŚAY","aḥ","saṃśaya","noun-adj","","aḥ","saṃśayaḥ"
"9","/","","","","punct","","","/"
"10","bhūmikāḥ","BHŪM","ikāḥ","bhūmika","noun-adj","","ikāḥ","bhūmikāḥ"
"11","kṛtrimā","KṚTRIM","ā","kṛtrimā","noun-adj","","ā","kṛtrimā"
"12","yadvat","","","yadvat","ind","","","yadvat"
"13","naṭaḥ","NAṬ","aḥ","naṭa","noun-adj","","aḥ","naṭaḥ"
"14","gṛhṇāti","GṚHṆ","āti","grah","verb","grah","āti","gṛhṇāti"
"15","sva","SV","a","sva","noun-adj","","a","sva"
"16","icchayā","ICCHAY","ā","icchayā","noun-adj","","ā","icchayā"
"17","//","","","","punct","","","//"
"","</s>","","","","","","",""
"","<s number = ""25"">","","","","","","",""
"1","//","","","","punct","","","//"
"","</s>","","","","","","",""
"","<s number = ""26"">","","","","","","",""
"1","tadvat","","","tadvat","ind","","","tadvat"
"2","eva","","","eva","ind","","","eva"
"3","cit","CIT","","cid","noun-adj","","","cit"
"4","ānanda","ĀNAND","a","ānanda","noun-adj","","a","ānanda"
"5","sva","SV","a","sva","noun-adj","","a","sva"
"6","icchā","ICCH","ā","icchā","noun-adj","","ā","icchā"
"7","ucchalita","UCCHAL","ita","ucchalita","noun-adj","","ita","ucchalita"
"8","bṛṃhitaḥ","BṚṂHIT","aḥ","bṛṃhita","","","aḥ","bṛṃhitaḥ"
"9","/","","","","punct","","","/"
"10","ātmā","ĀTM","ā","ātman","noun-adj","","ā","ātmā"
"11","gṛhṇāti","GṚHṆ","āti","grah","verb","grah","āti","gṛhṇāti"
"12","vipulāḥ","VIPUL","āḥ","vipula","noun-adj","","āḥ","vipulāḥ"
"13","darśana","DARŚAN","a","darśana","noun-adj","","a","darśana"
"14","ādyāḥ","ĀD","yāḥ","ādi","noun-adj","","yāḥ","ādyāḥ"
"15","vibhūtayaḥ","VIBHŪT","ayaḥ","vibhūti","noun-adj","","ayaḥ","vibhūtayaḥ"
"16","//","","","","punct","","","//"
"","</s>","","","","","","",""
"","<s number = ""27"">","","","","","","",""
"1","//","","","","punct","","","//"
"","</s>","","","","","","",""
"","<s number = ""28"">","","","","","","",""
"1","cit","CIT","","cid","noun-adj","","","cit"
"2","ānanda","ĀNAND","a","ānanda","noun-adj","","a","ānanda"
"3","samullāsa","SAMULLĀS","a","samullāsa","","","a","samullāsa"
"4","ullasita","ULLASIT","a","ullasita","","","a","ullasita"
"5","ātmā","ĀTM","ā","ātman","noun-adj","","ā","ātmā"
"6","virājate","VIRĀJAT","e","virājata","noun-adj","virāj","e","virājate"
"7","/","","","","punct","","","/"
"8","ci","","","cid","","","","cid"
"9","dvat","DV","at","dvat","","","at","dvat"
"10","su","","","su","ind","","","su"
"11","a","","","alpha_privativum","ind","","","alpha_privativum"
"12","śakti","ŚAKT","i","śakti","noun-adj","","i","śakti"
"13","saṅkocāt","SAṂKOCA","āt","saṃkoca","","","āt","saṃkocaāt"
"14","saṃsāre","SAṂSĀR","e","saṃsāra","noun-adj","","e","saṃsāre"
"15","malināyate","MALIN","āyate","malin","verb","","yate","malinyate"
"16","//","","","","punct","","","//"
"","</s>","","","","","","",""
"","<s number = ""29"">","","","","","","",""
"1","//","","","","punct","","","//"
"","</s>","","","","","","",""
"","<s number = ""30"">","","","","","","",""
"1","a","","","alpha_privativum","ind","","","alpha_privativum"
"2","pūrṇaḥ","PŪRṆ","aḥ","pūrṇa","noun-adj","","aḥ","pūrṇaḥ"
"3","asmi","","","as","verb","as","",""
"4","iti","","","iti","ind","","","iti"
"5","vividhaiḥ","VIVIDH","aiḥ","vividha","noun-adj","","air","vividhair"
"6","malaiḥ","MAL","aiḥ","mala","noun-adj","","air","malair"
"7","sa","","","tad","pron","","","tad"
"8","malinī","MALIN","ī","malinī","","","ī","malinī"
"9","kṛtaḥ","KṚT","aḥ","kṛta","","","aḥ","kṛtaḥ"
"10","/","","","","punct","","","/"
"11","māyīyāṇava","","","","","","",""
"12","kārma","KĀR","ma","kāra","noun-adj","","mahi","kārmahi"
"13","ākhyaiḥ","ĀKHY","aiḥ","ākhya","noun-adj","","air","ākhyair"
"14","vyāpakaḥ","VYĀP","akaḥ","vyāpaka","noun-adj","","akaḥ","vyāpakaḥ"
"15","api","","","api","ind","","","api"
"16","jagat","JAGAT","","jagat","noun-adj","","","jagat"
"17","vibhuḥ","VIBH","uḥ","vibhu","noun-adj","","uḥ","vibhuḥ"
"18","//","","","","punct","","","//"
"","</s>","","","","","","",""
"","<s number = ""31"">","","","","","","",""
"1","//","","","","punct","","","//"
"","</s>","","","","","","",""
"","<s number = ""32"">","","","","","","",""
"1","vyāpī","VYĀP","ī","vyāpin","noun-adj","","ī","vyāpī"
"2","yadvat","","","yadvat","ind","","","yadvat"
"3","mahādevaḥ","MAHĀDEV","aḥ","mahādeva","noun-adj","","aḥ","mahādevaḥ"
"4","kroti","KR","oti","kr","verb","","ati","krati"
"5","pañca","PAÑC","a","pañca","noun-adj","","a","pañca"
"6","kṛtyatām","KṚTY","atām","kṛtyatā","noun-adj","","atām","kṛtyatām"
"7","/","","","","punct","","","/"
"8","tadvat","","","tadvat","ind","","","tadvat"
"9","eva","","","eva","ind","","","eva"
"10","ayam","AYAM","","idam","pron","","","ayam"
"11","ātmā","ĀTM","ā","ātman","noun-adj","","ā","ātmā"
"12","api","","","api","ind","","","api"
"13","kurute","KUR","ute","kar","verb","kṛ","ute","kurute"
"14","śakti","ŚAKT","i","śakti","noun-adj","","i","śakti"
"15","mohitaḥ","MOHIT","aḥ","mohita","noun-adj","","aḥ","mohitaḥ"
"16","//","","","","punct","","","//"
"","</s>","","","","","","",""
"","<s number = ""33"">","","","","","","",""
"1","//","","","","punct","","","//"
"","</s>","","","","","","",""
"","<s number = ""34"">","","","","","","",""
"1","śaktaḥ","ŚAKT","aḥ","śakta","noun-adj","","aḥ","śaktaḥ"
"2","vikāsāt","VIKĀS","āt","vikāsa","noun-adj","","āt","vikāsāt"
"3","śakti","ŚAKT","i","śakti","noun-adj","","i","śakti"
"4","īśaḥ","ĪŚ","aḥ","īśa","noun-adj","","aḥ","īśaḥ"
"5","gīyate","GĪ","yate","gāy","verb","gai","yate","gīyate"
"6","tattva","TATTV","a","tattva","noun-adj","","a","tattva"
"7","vādibhiḥ","VĀD","ibhiḥ","vādin","noun-adj","","ibhiḥ","vādibhiḥ"
"8","/","","","","punct","","","/"
"9","saṅkocanāt","SAṂKOCAN","āt","saṃkocana","","","āt","saṃkocanāt"
"10","saṅkocitaḥ","SAṄKOCIT","aḥ","saṅkocita","","","aḥ","saṅkocitaḥ"
"11","saṃsārī","SAṂSĀR","ī","saṃsārin","noun-adj","","ī","saṃsārī"
"12","iti","","","iti","ind","","","iti"
"13","abhidhīyate","ABHIDHĪ","yate","abhidadh","verb","abhidhā","yate","abhidhīyate"
"14","//","","","","punct","","","//"
"","</s>","","","","","","",""
"","<s number = ""35"">","","","","","","",""
"1","//","","","","punct","","","//"
"","</s>","","","","","","",""
"","<s number = ""36"">","","","","","","",""
"1","māyā","MĀY","ā","māyā","noun-adj","","ā","māyā"
"2","rūpam","RŪP","am","rūpa","noun-adj","","am","rūpam"
"3","hi","","","hi","ind","","","hi"
"4","yat","","","yad","pron","","","yad"
"5","kiṃcid","","","kimcit","ind","","","kimcit"
"6","ālokayitum","ĀLOKAY","itum","ālok","verb","ālok","tums","ālokaytums"
"7","udyatā","UDYAT","ā","udyata","noun-adj","","ā","udyatā"
"8","/","","","","punct","","","/"
"9","sādhya","SĀDHY","a","sādhya","noun-adj","","a","sādhya"
"10","sṛṣṭim","SṚṢṬ","im","sṛṣṭi","","","im","sṛṣṭim"
"11","vijānīyāt","VIJĀN","īyāt","","noun-adj","","īyāt","vijānīyāt"
"12","anyā","ANY","ā","anyā","noun-adj","","ā","anyā"
"13","śaktiḥ","ŚAKT","iḥ","śakti","noun-adj","","iḥ","śaktiḥ"
"14","sthitiḥ","STHIT","iḥ","sthiti","noun-adj","","iḥ","sthitiḥ"
"15","matā","MAT","ā","mata","noun-adj","","ā","matā"
"16","//","","","","punct","","","//"
"","</s>","","","","","","",""
"","<s number = ""37"">","","","","","","",""
"1","//","","","","punct","","","//"
"","</s>","","","","","","",""
"","<s number = ""38"">","","","","","","",""
"1","saṃhārāt","SAṂHĀR","āt","saṃhāra","noun-adj","","āt","saṃhārāt"
"2","saṃhṛtā","SAṂHṚT","ā","saṃhṛta","noun-adj","","āḥ","saṃhṛtāḥ"
"3","devī","DEV","ī","devī","noun-adj","","ī","devī"
"4","cit","CIT","","cid","noun-adj","","","cit"
"5","aikye","AIKY","e","aikya","noun-adj","","e","aikye"
"6","anugrahaḥ","ANUGRAH","aḥ","anugraha","noun-adj","","aḥ","anugrahaḥ"
"7","mataḥ","MAT","aḥ","mata","noun-adj","","aḥ","mataḥ"
"8","/","","","","punct","","","/"
"9","tad","TAD","","tad","pron","","","tad"
"10","eka","EK","a","eka","noun-adj","","a","eka"
"11","sāra","SĀR","a","sāra","noun-adj","","a","sāra"
"12","a","","","alpha_privativum","ind","","","alpha_privativum"
"13","prathanāt","PRATHAN","āt","prathana","noun-adj","","āt","prathanāt"
"14","tirodhāna","TIRODHĀN","a","tirodhāna","noun-adj","","a","tirodhāna"
"15","abhidhīyate","ABHIDHĪ","yate","abhidadh","verb","abhidhā","yate","abhidhīyate"
"16","//","","","","punct","","","//"
"","</s>","","","","","","",""
"","<s number = ""39"">","","","","","","",""
"1","//","","","","punct","","","//"
"","</s>","","","","","","",""
"","<s number = ""40"">","","","","","","",""
"1","ittham","ITTH","am","ittha","noun-adj","","am","ittham"
"2","sadā","","","sada","ind","","","sada"
"3","saṃnihitaḥ","SAṂNIHIT","aḥ","saṃnihita","noun-adj","","aḥ","saṃnihitaḥ"
"4","pañcavāha","PAÑCAVĀH","a","pañcavāhin","","","a","pañcavāha"
"5","vidhiḥ","VIDH","iḥ","vidhi","noun-adj","","iḥ","vidhiḥ"
"6","kramāt","KRAM","āt","krama","noun-adj","","āt","kramāt"
"7","/","","","","punct","","","/"
"8","jñātaḥ","JÑĀT","aḥ","jñāta","noun-adj","","aḥ","jñātaḥ"
"9","cintāmaṇiḥ","CINTĀMAṆ","iḥ","cintāmaṇi","noun-adj","","iḥ","cintāmaṇiḥ"
"10","asau","","","adas","pron","","","adas"
"11","ajñānāt","AJÑĀN","āt","ajñāna","noun-adj","","āt","ajñānāt"
"12","kāṣṭa","KĀṢ","ṭa","kāṣa","noun-adj","","ṭa","kāṣṭa"
"13","loṣṭavat","LOṢṬ","avat","loṣṭavat","","","avat","loṣṭavat"
"14","//","","","","punct","","","//"
"","</s>","","","","","","",""
"","<s number = ""41"">","","","","","","",""
"1","//","","","","punct","","","//"
"","</s>","","","","","","",""
"","<s number = ""42"">","","","","","","",""
"1","sat","SAT","","sat","noun-adj","","","sat"
"2","vimarśa","VIMARŚ","a","vimarśa","noun-adj","","a","vimarśa"
"3","balena","BAL","ena","bala","noun-adj","","ena","balena"
"4","evam","","","eva","ind","","","eva"
"5","nityam","NITY","am","nitya","noun-adj","","am","nityam"
"6","yaḥ","","","yad","pron","","","yad"
"7","pariśīlate","PARIŚĪL","ate","pariśīl","verb","","ate","pariśīlate"
"8","/","","","","punct","","","/"
"9","sa","","","tad","pron","","","tad"
"10","muktaḥ","MUKT","aḥ","mukta","noun-adj","","aḥ","muktaḥ"
"11","sarva","SARV","a","sarva","noun-adj","","a","sarva"
"12","bandhebhyaḥ","BANDH","ebhyaḥ","bandha","","","ebhyaḥ","bandhebhyaḥ"
"13","nitya","NITY","a","nitya","noun-adj","","a","nitya"
"14","ānanda","ĀNAND","a","ānanda","noun-adj","","a","ānanda"
"15","mayaḥ","MAY","aḥ","maya","noun-adj","","aḥ","mayaḥ"
"16","bhavet","BHAV","et","bhav","verb","bhū","et","bhavet"
"17","//","","","","punct","","","//"
"","</s>","","","","","","",""
"","<s number = ""43"">","","","","","","",""
"1","//","","","","punct","","","//"
"","</s>","","","","","","",""
"","<s number = ""44"">","","","","","","",""
"1","cit","CIT","","cid","noun-adj","","","cit"
"2","vahniḥ","VAHN","iḥ","vahni","noun-adj","","iḥ","vahniḥ"
"3","grasate","GRASAT","e","grasatī","noun-adj","","e","grasate"
"4","saḥ","","","tad","pron","","","tad"
"5","ayam","AYAM","","idam","pron","","","ayam"
"6","suprabuddhaḥ","SUPRABUDDH","aḥ","suprabuddha","noun-adj","","aḥ","suprabuddhaḥ"
"7","asti","","","as","verb","as","",""
"8","asau","","","adas","pron","","","adas"
"9","yadā","","","yadā","ind","","","yadā"
"10","/","","","","punct","","","/"
"11","tadā","","","tadā","ind","","","tadā"
"12","asau","","","adas","pron","","","adas"
"13","vimalaḥ","VIMAL","aḥ","vimala","noun-adj","","aḥ","vimalaḥ"
"14","jñeyaḥ","JÑEY","aḥ","jñeya","noun-adj","","aḥ","jñeyaḥ"
"15","cit","CIT","","cid","noun-adj","","","cit"
"16","vahniḥ","VAHN","iḥ","vahni","noun-adj","","iḥ","vahniḥ"
"17","sarva","SARV","a","sarva","noun-adj","","a","sarva"
"18","bhakṣakaḥ","BHAKṢ","akaḥ","bhakṣaka","noun-adj","","akaḥ","bhakṣakaḥ"
"19","//","","","","punct","","","//"
"","</s>","","","","","","",""
"","<s number = ""45"">","","","","","","",""
"1","//","","","","punct","","","//"
"","</s>","","","","","","",""
"","<s number = ""46"">","","","","","","",""
"1","etat","ETAT","","tad","pron","","","etat"
"2","balena","BAL","ena","bala","noun-adj","","ena","balena"
"3","saṃyuktaḥ","SAṂYUKT","aḥ","saṃyukta","noun-adj","","aḥ","saṃyuktaḥ"
"4","yogī","YOG","ī","yogin","noun-adj","","ī","yogī"
"5","nirvāṇa","NIRVĀṆ","a","nirvāṇa","noun-adj","","a","nirvāṇa"
"6","lakṣaṇaḥ","LAKṢAṆ","aḥ","lakṣaṇa","noun-adj","","aḥ","lakṣaṇaḥ"
"7","/","","","","punct","","","/"
"8","padam","PAD","am","pada","noun-adj","","am","padam"
"9","prāpnoti","PRĀPN","oti","prāpn","verb","prāp","ati","prāpnati"
"10","vimalam","VIMAL","am","vimala","noun-adj","","am","vimalam"
"11","saḥ","","","tad","pron","","","tad"
"12","acirāt","ACIR","āt","acira","noun-adj","","āt","acirāt"
"13","na","","","na","ind","","","na"
"14","atra","","","atra","ind","","","atra"
"15","saṃśayaḥ","SAṂŚAY","aḥ","saṃśaya","noun-adj","","aḥ","saṃśayaḥ"
"16","//","","","","punct","","","//"
"","</s>","","","","","","",""
"","<s number = ""47"">","","","","","","",""
"1","//","","","","punct","","","//"
"","</s>","","","","","","",""
"","<s number = ""48"">","","","","","","",""
"1","cit","CIT","","cid","noun-adj","","","cit"
"2","vahniḥ","VAHN","iḥ","vahni","noun-adj","","iḥ","vahniḥ"
"3","bala","BAL","a","bala","noun-adj","","a","bala"
"4","lābhe","LĀBH","e","lābha","noun-adj","","e","lābhe"
"5","api","","","api","ind","","","api"
"6","viśvam","VIŚV","am","viśva","noun-adj","","am","viśvam"
"7","ābhāti","ĀBHĀT","i","ābhāti","noun-adj","","i","ābhāti"
"8","cit","CIT","","cid","noun-adj","","","cit"
"9","mayam","MAY","am","maya","noun-adj","","am","mayam"
"10","/","","","","punct","","","/"
"11","sva","SV","a","sva","noun-adj","","a","sva"
"12","ānanda","ĀNAND","a","ānanda","noun-adj","","a","ānanda"
"13","amṛta","AMṚT","a","amṛta","noun-adj","","a","amṛta"
"14","kallolam","KALLOL","am","kallola","","","am","kallolam"
"15","etat","ETAT","","tad","pron","","","etat"
"16","ucchalitam","UCCHALIT","am","ucchalita","","","am","ucchalitam"
"17","bahis","BAH","is","bahis","noun-adj","","is","bahis"
"18","//","","","","punct","","","//"
"","</s>","","","","","","",""
"","<s number = ""49"">","","","","","","",""
"1","//","","","","punct","","","//"
"","</s>","","","","","","",""
"","<s number = ""50"">","","","","","","",""
"1","tat","TAT","","tad","pron","","","tat"
"2","eva","","","eva","ind","","","eva"
"3","śyāna","ŚYĀN","a","śyāna","noun-adj","","a","śyāna"
"4","tām","","","tad","pron","","","tad"
"5","yātam","YĀT","am","yāta","","","am","yātam"
"6","bhāva","BHĀV","a","bhāva","noun-adj","","a","bhāva"
"7","rūpaiḥ","RŪP","aiḥ","rūpa","noun-adj","","air","rūpair"
"8","vibhāvyate","VIBHĀV","yate","vibhav","verb","vibhū","yate","vibhāvyate"
"9","/","","","","punct","","","/"
"10","sva","SV","a","sva","noun-adj","","a","sva"
"11","ātmā","ĀTM","ā","ātman","noun-adj","","ā","ātmā"
"12","maheśvaraḥ","MAHEŚVAR","aḥ","maheśvara","noun-adj","","aḥ","maheśvaraḥ"
"13","devaḥ","DEV","aḥ","deva","noun-adj","","aḥ","devaḥ"
"14","krīḍate","KRĪḌ","ate","krīḍ","verb","krīḍ","ate","krīḍate"
"15","parameśvaraḥ","PARAMEŚVAR","aḥ","parameśvara","noun-adj","","aḥ","parameśvaraḥ"
"16","//","","","","punct","","","//"
"","</s>","","","","","","",""
"","<s number = ""51"">","","","","","","",""
"1","//","","","","punct","","","//"
"","</s>","","","","","","",""
"","<s number = ""52"">","","","","","","",""
"1","iti","","","iti","ind","","","iti"
"2","yaḥ","","","yad","pron","","","yad"
"3","satatam","SATAT","am","satata","noun-adj","","am","satatam"
"4","vetti","VET","ti","vid","verb","vid","ti","vetti"
"5","sa","","","tad","pron","","","tad"
"6","muktaḥ","MUKT","aḥ","mukta","noun-adj","","aḥ","muktaḥ"
"7","mocayati","MOC","ayati","muñc","verb","muc","ayati","mocayati"
"8","api","","","api","ind","","","api"
"9","/","","","","punct","","","/"
"10","sattva","SATTV","a","sattva","noun-adj","","a","sattva"
"11","vrātam","VRĀT","am","vrāta","","","am","vrātam"
"12","kṣaṇena","KṢAṆ","ena","kṣaṇa","noun-adj","","ena","kṣaṇena"
"13","eva","","","eva","ind","","","eva"
"14","ghorāt","GHOR","āt","ghora","noun-adj","","āt","ghorāt"
"15","saṃsāra","SAṂSĀR","a","saṃsāra","noun-adj","","a","saṃsāra"
"16","bandhanāt","BANDHAN","āt","bandhana","noun-adj","","āt","bandhanāt"
"17","//","","","","punct","","","//"
"","</s>","","","","","","",""
"","<s number = ""53"">","","","","","","",""
"1","//","","","","punct","","","//"
"","</s>","","","","","","",""
"","<s number = ""54"">","","","","","","",""
"1","yaḥ","","","yad","pron","","","yad"
"2","kaścid","","","kimcit","ind","","","kimcit"
"3","ānanda","ĀNAND","a","ānanda","noun-adj","","a","ānanda"
"4","balaḥ","BAL","aḥ","bala","noun-adj","","aḥ","balaḥ"
"5","sa","","","tad","pron","","","tad"
"6","sva","SV","a","sva","noun-adj","","a","sva"
"7","rūpa","RŪP","a","rūpa","noun-adj","","a","rūpa"
"8","pada","PAD","a","pada","noun-adj","","a","pada"
"9","sthitaḥ","STHIT","aḥ","sthita","noun-adj","","aḥ","sthitaḥ"
"10","/","","","","punct","","","/"
"11","iti","","","iti","ind","","","iti"
"12","yasya","","","yad","pron","","","yad"
"13","samullāsa","SAMULLĀS","a","samullāsa","","","a","samullāsa"
"14","ullāsita","ULLĀSIT","a","ullāsita","","","a","ullāsita"
"15","udaya","UDAY","a","udaya","noun-adj","","a","udaya"
"16","śālinaḥ","ŚĀLIN","aḥ","śālina","noun-adj","","aḥ","śālinaḥ"
"17","//","","","","punct","","","//"
"","</s>","","","","","","",""
"","<s number = ""55"">","","","","","","",""
"1","//","","","","punct","","","//"
"","</s>","","","","","","",""
"","<s number = ""56"">","","","","","","",""
"1","tasya","","","tad","pron","","","tad"
"2","sva","SV","a","sva","noun-adj","","a","sva"
"3","rūpa","RŪP","a","rūpa","noun-adj","","a","rūpa"
"4","niṣṭhasya","NIṢṬH","asya","niṣṭha","noun-adj","","asya","niṣṭhasya"
"5","vyutthāne","VYUTTHĀN","e","vyutthāna","noun-adj","","e","vyutthāne"
"6","api","","","api","ind","","","api"
"7","tat","TAT","","tad","pron","","","tat"
"8","arthyate","ARTH","yate","arth","verb","","yate","arthyate"
"9","/","","","","punct","","","/"
"10","etat","ETAT","","tad","pron","","","etat"
"11","prayatna","PRAYATN","a","prayatna","noun-adj","","a","prayatna"
"12","sām","SĀM","","sāma","","","","sām"
"13","ārthyāt","ĀRTHY","āt","ārthya","","","āt","ārthyāt"
"14","janaiḥ","JAN","aiḥ","jana","noun-adj","","air","janair"
"15","eva","","","eva","ind","","","eva"
"16","adhigamyate","ADHIGAM","yate","adhigacch","verb","adhigam","yate","adhigamyate"
"17","//","","","","punct","","","//"
"","</s>","","","","","","",""
"","<s number = ""57"">","","","","","","",""
"1","//","","","","punct","","","//"
"","</s>","","","","","","",""
"","<s number = ""58"">","","","","","","",""
"1","madhya","MADHY","a","madhya","noun-adj","","a","madhya"
"2","dhāma","DHĀM","a","dhāma","noun-adj","","a","dhāma"
"3","vikāsāt","VIKĀS","āt","vikāsa","noun-adj","","āt","vikāsāt"
"4","ca","","","ca","ind","","","ca"
"5","cit","CIT","","cid","noun-adj","","","cit"
"6","ānandāt","ĀNAND","āt","ānanda","noun-adj","","āt","ānandāt"
"7","prakāśate","PRAKĀŚ","ate","prakāś","verb","prakāś","ate","prakāśate"
"8","/","","","","punct","","","/"
"9","tad","TAD","","tad","pron","","","tad"
"10","prakāśāt","PRAKĀŚ","āt","prakāśa","noun-adj","","āt","prakāśāt"
"11","divya","DIVY","a","divya","noun-adj","","a","divya"
"12","dṛṣṭiḥ","DṚṢṬ","iḥ","dṛṣṭi","noun-adj","","iḥ","dṛṣṭiḥ"
"13","jñāna","JÑĀN","a","jñāna","noun-adj","","a","jñāna"
"14","rūpā","RŪP","ā","rūpa","noun-adj","","āḥ","rūpāḥ"
"15","vibhāvyate","VIBHĀV","yate","vibhav","verb","vibhū","yate","vibhāvyate"
"16","//","","","","punct","","","//"
"","</s>","","","","","","",""
"","<s number = ""59"">","","","","","","",""
"1","//","","","","punct","","","//"
"","</s>","","","","","","",""
"","<s number = ""60"">","","","","","","",""
"1","nirmalā","NIRMAL","ā","nirmala","noun-adj","","āḥ","nirmalāḥ"
"2","suprabhā","SUPRABH","ā","suprabha","noun-adj","","āḥ","suprabhāḥ"
"3","śuddhā","ŚUDDH","ā","śuddha","noun-adj","","āḥ","śuddhāḥ"
"4","nitya","NITY","a","nitya","noun-adj","","a","nitya"
"5","ānanda","ĀNAND","a","ānanda","noun-adj","","a","ānanda"
"6","mayī","MAY","ī","mayī","noun-adj","","ī","mayī"
"7","parā","PAR","ā","para","noun-adj","","ā","parā"
"8","/","","","","punct","","","/"
"9","nir","","","niḥ_privativum","ind","","","niḥ_privativum"
"10","deha","DEH","a","deha","noun-adj","","a","deha"
"11","cheda","CHED","a","cheda","noun-adj","","a","cheda"
"12","jālā","JĀL","ā","jāla","noun-adj","","āḥ","jālāḥ"
"13","api","","","api","ind","","","api"
"14","jñāna","JÑĀN","a","jñāna","noun-adj","","a","jñāna"
"15","dṛṣṭiḥ","DṚṢṬ","iḥ","dṛṣṭi","noun-adj","","iḥ","dṛṣṭiḥ"
"16","vijṛmbhate","VIJṚMBH","ate","vijṛmbh","verb","","ate","vijṛmbhate"
"17","//","","","","punct","","","//"
"","</s>","","","","","","",""
"","<s number = ""61"">","","","","","","",""
"1","//","","","","punct","","","//"
"","</s>","","","","","","",""
"","<s number = ""62"">","","","","","","",""
"1","madhya","MADHY","a","madhya","noun-adj","","a","madhya"
"2","dhāma","DHĀM","a","dhāma","noun-adj","","a","dhāma"
"3","vikāse","VIKĀS","e","vikāsa","noun-adj","","e","vikāse"
"4","tu","","","tu","ind","","","tu"
"5","upāyaḥ","UPĀY","aḥ","upāya","noun-adj","","aḥ","upāyaḥ"
"6","balavat","BAL","avat","balavat","noun-adj","","avat","balavat"
"7","sthitiḥ","STHIT","iḥ","sthiti","noun-adj","","iḥ","sthitiḥ"
"8","/","","","","punct","","","/"
"9","vikalpa","VIKALP","a","vikalpa","noun-adj","","a","vikalpa"
"10","kṣaya","KṢAY","a","kṣaya","noun-adj","","a","kṣaya"
"11","saṅkoca","SAṂKOC","a","saṃkoca","noun-adj","","a","saṃkoca"
"12","vikāsa","VIKĀS","a","vikāsa","noun-adj","","a","vikāsa"
"13","ādyāḥ","ĀD","yāḥ","ādi","noun-adj","","yāḥ","ādyāḥ"
"14","anekaśas","ANEKAŚ","as","anekaśas","","","aḥ","anekaśaḥ"
"15","//","","","","punct","","","//"
"","</s>","","","","","","",""
"","<s number = ""63"">","","","","","","",""
"1","//","","","","punct","","","//"
"","</s>","","","","","","",""
"","<s number = ""64"">","","","","","","",""
"1","a","","","alpha_privativum","ind","","","alpha_privativum"
"2","kiñcit","","","kimcit","ind","","","kimcit"
"3","cintanāt","CINTAN","āt","cintana","noun-adj","","āt","cintanāt"
"4","eva","","","eva","ind","","","eva"
"5","vikalpānām","VIKALP","ānām","vikalpa","noun-adj","","ānām","vikalpānām"
"6","kṣayaḥ","KṢAY","aḥ","kṣaya","noun-adj","","aḥ","kṣayaḥ"
"7","bhavet","BHAV","et","bhav","verb","bhū","et","bhavet"
"8","/","","","","punct","","","/"
"9","cit","CIT","","cid","noun-adj","","","cit"
"10","bodhāt","BODH","āt","bodha","noun-adj","","āt","bodhāt"
"11","vilasat","VILAS","at","vilas","verb","vilas","at","vilasat"
"12","śaktiḥ","ŚAKT","iḥ","śakti","noun-adj","","iḥ","śaktiḥ"
"13","rakta","RAKT","a","rakta","noun-adj","","a","rakta"
"14","asau","","","adas","pron","","","adas"
"15","bhāva","BHĀV","a","bhāva","noun-adj","","a","bhāva"
"16","maṇḍale","MAṆḌAL","e","maṇḍala","noun-adj","","e","maṇḍale"
"17","//","","","","punct","","","//"
"","</s>","","","","","","",""
"","<s number = ""65"">","","","","","","",""
"1","//","","","","punct","","","//"
"","</s>","","","","","","",""
"","<s number = ""66"">","","","","","","",""
"1","tatra","","","tatra","ind","","","tatra"
"2","anuraktā","ANURAKT","ā","anurakta","noun-adj","","āḥ","anuraktāḥ"
"3","divya","DIVY","a","divya","noun-adj","","a","divya"
"4","ogham","OGH","am","ogha","noun-adj","","am","ogham"
"5","paśyate","PAŚ","yate","paś","verb","paś","yate","paśyate"
"6","vimala","VIMAL","a","vimala","noun-adj","","a","vimala"
"7","ātmakam","ĀTM","akam","ātmaka","noun-adj","","akam","ātmakam"
"8","/","","","","punct","","","/"
"9","śakti","ŚAKT","i","śakti","noun-adj","","i","śakti"
"10","saṅkocam","SAṂKOC","am","saṃkoca","noun-adj","","am","saṃkocam"
"11","etat","ETAT","","tad","pron","","","etat"
"12","dhi","","","dhi","ind","","","dhi"
"13","procyate","PROC","yate","pravak","verb","pravac","yate","procyate"
"14","brahma","BRAHM","a","brahman","noun-adj","","a","brahma"
"15","vādibhiḥ","VĀD","ibhiḥ","vādin","noun-adj","","ibhiḥ","vādibhiḥ"
"16","//","","","","punct","","","//"
"","</s>","","","","","","",""
"","<s number = ""67"">","","","","","","",""
"1","//","","","","punct","","","//"
"","</s>","","","","","","",""
"","<s number = ""68"">","","","","","","",""
"1","ādi","ĀD","i","ādi","noun-adj","","i","ādi"
"2","anta","ANT","a","anta","noun-adj","","a","anta"
"3","koṭi","KOṬ","i","koṭi","noun-adj","","i","koṭi"
"4","viśrāma","VIŚRĀM","a","viśrāma","noun-adj","","a","viśrāma"
"5","bindu","BIND","u","bindu","noun-adj","","u","bindu"
"6","nāda","NĀD","a","nāda","noun-adj","","a","nāda"
"7","layāḥ","LAY","āḥ","laya","noun-adj","","āḥ","layāḥ"
"8","tathā","","","tathā","ind","","","tathā"
"9","/","","","","punct","","","/"
"10","a","","","alpha_privativum","ind","","","alpha_privativum"
"11","śaṅkita","ŚAṄKITA","","śaṅkita","noun-adj","","","śaṅkita"
"12","bhaya","BHAY","a","bhaya","noun-adj","","a","bhaya"
"13","krodha","KRODH","a","krodha","noun-adj","","a","krodha"
"14","bībhatsa","BĪBHATS","a","bībhatsa","noun-adj","","a","bībhatsa"
"15","ādi","ĀD","i","ādi","noun-adj","","i","ādi"
"16","parigrahāḥ","PARIGRAH","āḥ","parigraha","noun-adj","","āḥ","parigrahāḥ"
"17","//","","","","punct","","","//"
"","</s>","","","","","","",""
"","<s number = ""69"">","","","","","","",""
"1","//","","","","punct","","","//"
"","</s>","","","","","","",""
"","<s number = ""70"">","","","","","","",""
"1","iti","","","iti","ind","","","iti"
"2","etat","ETAT","","tad","pron","","","etat"
"3","kathitam","KATHIT","am","kathita","noun-adj","","am","kathitam"
"4","devi","DEV","i","devī","noun-adj","","i","devi"
"5","madhya","MADHY","a","madhya","noun-adj","","a","madhya"
"6","dhāma","DHĀM","a","dhāma","noun-adj","","a","dhāma"
"7","vikāsakam","VIKĀSAK","am","vikāsaka","","","am","vikāsakam"
"8","/","","","","punct","","","/"
"9","tatra","","","tatra","ind","","","tatra"
"10","śaktaḥ","ŚAKT","aḥ","śakta","noun-adj","","aḥ","śaktaḥ"
"11","dinaiḥ","DIN","aiḥ","dina","noun-adj","","air","dinair"
"12","evam","","","eva","ind","","","eva"
"13","prapnoti","PRAP","noti","prap","verb","","noti","prapnoti"
"14","para","PAR","a","para","noun-adj","","a","para"
"15","sampadam","SAMPADA","m","sampada","noun-adj","","m","sampadam"
"16","//","","","","punct","","","//"
"","</s>","","","","","","",""
"","<s number = ""71"">","","","","","","",""
"1","//","","","","punct","","","//"
"","</s>","","","","","","",""
"","<s number = ""72"">","","","","","","",""
"1","yaḥ","","","yad","pron","","","yad"
"2","antar","ANTAR","","antara","noun-adj","","","antar"
"3","samādhi","SAMĀDH","i","samādhi","noun-adj","","i","samādhi"
"4","saṃskāram","SAṂSKĀR","am","saṃskāra","noun-adj","","am","saṃskāram"
"5","bhramate","BHRAM","ate","bhram","verb","","ate","bhramate"
"6","vimala","VIMAL","a","vimala","noun-adj","","a","vimala"
"7","tviṣām","TVIṢ","ām","tviṣā","noun-adj","","ām","tviṣām"
"8","/","","","","punct","","","/"
"9","sa","","","tad","pron","","","tad"
"10","visarga","VISARG","a","visarga","noun-adj","","a","visarga"
"11","balāt","BAL","āt","bala","noun-adj","","āt","balāt"
"12","eva","","","eva","ind","","","eva"
"13","vimṛśya","VIMṚŚY","a","vimṛśya","noun-adj","","a","vimṛśya"
"14","ca","","","ca","ind","","","ca"
"15","punar","","","punar","ind","","","punar"
"16","punar","","","punar","ind","","","punar"
"17","//","","","","punct","","","//"
"","</s>","","","","","","",""
"","<s number = ""73"">","","","","","","",""
"1","//","","","","punct","","","//"
"","</s>","","","","","","",""
"","<s number = ""74"">","","","","","","",""
"1","vyutthāne","VYUTTHĀN","e","vyutthāna","noun-adj","","e","vyutthāne"
"2","api","","","api","ind","","","api"
"3","yatas","","","yatas","ind","","","yatas"
"4","tasya","","","tad","pron","","","tad"
"5","svarūpam","SVARŪP","am","svarūpa","noun-adj","","am","svarūpam"
"6","samprakāśate","SAMPRAKĀ","ate","samprakāś","verb","saṃprakāś","ate","samprakāate"
"7","/","","","","punct","","","/"
"8","yoginaḥ","YOG","inaḥ","yogin","noun-adj","","inaḥ","yoginaḥ"
"9","bodha","BODH","a","bodha","noun-adj","","a","bodha"
"10","niṣṭhasya","NIṢṬH","asya","niṣṭha","noun-adj","","asya","niṣṭhasya"
"11","nitya","NITY","a","nitya","noun-adj","","a","nitya"
"12","ānanda","ĀNAND","a","ānanda","noun-adj","","a","ānanda"
"13","rasasya","RAS","asya","rasa","noun-adj","","asya","rasasya"
"14","ca","","","ca","ind","","","ca"
"15","//","","","","punct","","","//"
"","</s>","","","","","","",""
"","<s number = ""75"">","","","","","","",""
"1","//","","","","punct","","","//"
"","</s>","","","","","","",""
"","<s number = ""76"">","","","","","","",""
"1","tat","TAT","","tad","pron","","","tat"
"2","prakāśa","PRAKĀŚ","a","prakāśa","noun-adj","","a","prakāśa"
"3","ānanda","ĀNAND","a","ānanda","noun-adj","","a","ānanda"
"4","mayī","MAY","ī","mayī","noun-adj","","ī","mayī"
"5","mantra","MANTR","a","mantra","noun-adj","","a","mantra"
"6","vīrya","VĪRY","a","vīrya","noun-adj","","a","vīrya"
"7","upabṛṃhitā","UPABṚṂH","itā","upabṛṃhin","","","itā","upabṛṃhitā"
"8","/","","","","punct","","","/"
"9","pūṛnāhantācit","","","","","","",""
"10","iti","","","iti","ind","","","iti"
"11","antar","ANTAR","","antara","noun-adj","","","antar"
"12","samullāsa","SAMULLĀS","a","samullāsa","","","a","samullāsa"
"13","abhiyoginaḥ","ABHIYOG","inaḥ","abhiyogin","","","inaḥ","abhiyoginaḥ"
"14","//","","","","punct","","","//"
"","</s>","","","","","","",""
"","<s number = ""77"">","","","","","","",""
"1","//","","","","punct","","","//"
"","</s>","","","","","","",""
"","<s number = ""78"">","","","","","","",""
"1","tatra","","","tatra","ind","","","tatra"
"2","asau","","","adas","pron","","","adas"
"3","vilasan","VILAS","an","vilasat","noun-adj","","ān","vilasān"
"4","yogī","YOG","ī","yogin","noun-adj","","ī","yogī"
"5","mantreśvara","MANTREŚVAR","a","mantreśvara","","","a","mantreśvara"
"6","pade","PAD","e","pada","noun-adj","","e","pade"
"7","sthitaḥ","STHIT","aḥ","sthita","noun-adj","","aḥ","sthitaḥ"
"8","/","","","","punct","","","/"
"9","tatra","","","tatra","ind","","","tatra"
"10","śaktaḥ","ŚAKT","aḥ","śakta","noun-adj","","aḥ","śaktaḥ"
"11","vibhuḥ","VIBH","uḥ","vibhu","noun-adj","","uḥ","vibhuḥ"
"12","yadvat","","","yadvat","ind","","","yadvat"
"13","krīḍate","KRĪḌ","ate","krīḍ","verb","krīḍ","ate","krīḍate"
"14","śakti","ŚAKT","i","śakti","noun-adj","","i","śakti"
"15","bṛṃhitaḥ","BṚṂHIT","aḥ","bṛṃhita","","","aḥ","bṛṃhitaḥ"
"16","//","","","","punct","","","//"
"","</s>","","","","","","",""
"","<s number = ""79"">","","","","","","",""
"1","//","","","","punct","","","//"
"","</s>","","","","","","",""
"","<s number = ""80"">","","","","","","",""
"1","evam","","","eva","ind","","","eva"
"2","svatantra","SVATANTR","a","svatantra","noun-adj","","a","svatantra"
"3","tā","","","tad","pron","","","tad"
"4","tasya","","","tad","pron","","","tad"
"5","vyāpakasya","VYĀPAK","asya","vyāpaka","noun-adj","","asya","vyāpakasya"
"6","jagat","JAGAT","","jagat","noun-adj","","","jagat"
"7","vibhoḥ","VIBH","oḥ","vibhu","noun-adj","","oḥ","vibhoḥ"
"8","/","","","","punct","","","/"
"9","nānā","NĀN","ā","nānā","noun-adj","","ā","nānā"
"10","bheda","BHED","a","bheda","noun-adj","","a","bheda"
"11","juṣaḥ","JUṢ","aḥ","juṣa","noun-adj","","aḥ","juṣaḥ"
"12","citra","CITR","a","citra","noun-adj","","a","citra"
"13","pada","PAD","a","pada","noun-adj","","a","pada"
"14","sthitasya","STHIT","asya","sthita","noun-adj","","asya","sthitasya"
"15","a","","","alpha_privativum","ind","","","alpha_privativum"
"16","khaṇḍitāḥ","KHAṆḌ","itāḥ","khaṇḍita","noun-adj","","itāḥ","khaṇḍitāḥ"
"17","//","","","","punct","","","//"
"","</s>","","","","","","",""
"","<s number = ""81"">","","","","","","",""
"1","//","","","","punct","","","//"
"","</s>","","","","","","",""
"","<s number = ""82"">","","","","","","",""
"1","etat","ETAT","","tad","pron","","","etat"
"2","advayam","ADVAY","am","advaya","noun-adj","","am","advayam"
"3","iti","","","iti","ind","","","iti"
"4","uktam","UKT","am","ukta","noun-adj","","am","uktam"
"5","jñāna","JÑĀN","a","jñāna","noun-adj","","a","jñāna"
"6","amṛtam","AMṚT","am","amṛta","noun-adj","","am","amṛtam"
"7","anuttamam","ANUTTAM","am","anuttama","noun-adj","","am","anuttamam"
"8","/","","","","punct","","","/"
"9","yaḥ","","","yad","pron","","","yad"
"10","pibet","PIB","et","pib","verb","pā","et","pibet"
"11","śāmyate","ŚĀM","yate","śam","verb","śam","yate","śāmyate"
"12","tasya","","","tad","pron","","","tad"
"13","saṃsāra","SAṂSĀR","a","saṃsāra","noun-adj","","a","saṃsāra"
"14","viṣa","VIṢ","a","viṣa","noun-adj","","a","viṣa"
"15","mūrchanam","MŪRCHAN","am","mūrchana","","","am","mūrchanam"
"16","//","","","","punct","","","//"
"","</s>","","","","","","",""
"","<s number = ""83"">","","","","","","",""
"1","//","","","","punct","","","//"
"","</s>","","","","","","",""
"","<s number = ""84"">","","","","","","",""
"1","bodha","BODH","a","bodha","noun-adj","","a","bodha"
"2","ullāsa","ULLĀS","a","ullāsa","noun-adj","","a","ullāsa"
"3","vidhānā","VIDH","ānā","vidha","noun-adj","","ānām","vidhānām"
"4","iyam","","","idam","pron","","","idam"
"5","śiva","ŚIV","a","śiva","noun-adj","","a","śiva"
"6","prāpyai","PRĀP","yai","","","","yai","prāpyai"
"7","mah","MAH","","mahat","","","","mah"
"8","ātmanām","ĀTMAN","ām","ātmana","","","ām","ātmanām"
"9","/","","","","punct","","","/"
"10","rājñaḥ","RĀJ","ñaḥ","rājan","noun-adj","","naḥ","rājnaḥ"
"11","kṣema","KṢEM","a","kṣema","noun-adj","","a","kṣema"
"12","abhidhānasya","ABHIDHĀN","asya","abhidhāna","noun-adj","","asya","abhidhānasya"
"13","śāstram","ŚĀSTR","am","śāstra","noun-adj","","am","śāstram"
"14","atyanta","ATYANT","a","atyanta","noun-adj","","a","atyanta"
"15","nirmalam","NIRMAL","am","nirmala","noun-adj","","am","nirmalam"
"16","//","","","","punct","","","//"
"","</s>","","","","","","",""
"","<s number = ""85"">","","","","","","",""
"1","//","","","","punct","","","//"
"","</s>","","","","","","",""
"","<s number = ""86"">","","","","","","",""
"1","iti","","","iti","ind","","","iti"
"2","śrī","ŚRĪ","","śrī","noun-adj","","","śrī"
"3","kṣemarāja","KṢEMARĀJ","a","kṣemarāja","","","a","kṣemarāja"
"4","kṛtam","KṚT","am","kṛta","noun-adj","","am","kṛtam"
"5","bodhavilāsa","BODHAVILĀS","a","bodhavilāsa","","","a","bodhavilāsa"
"6","ākhyam","ĀKHY","am","khyā","verb","","am","ākhyam"
"7","yoga","YOG","a","yoga","noun-adj","","a","yoga"
"8","śāstram","ŚĀSTR","am","śāstra","noun-adj","","am","śāstram"
"9","//","","","","punct","","","//"
"","</s>","","","","","","",""
