"WordID","word","NormSTEM","suffix","lemma","PoS","Root","NormSuffix","NormWord"
1,"nirhastaḥ","_","_","nirhasta","JJ","","_","_"
2,"śatrur","_","_","śatru","NC","","_","_"
3,"abhidāsann","_","_","abhidās","KDP","","_","_"
4,"astu","_","_","as","V","as","_","_"
5,"ye","_","_","yad","PRL","","_","_"
6,"senābhir","_","_","senā","NC","","_","_"
7,"yudham","_","_","yudh","NC","","_","_"
8,"āyanty","_","_","e","V","e","_","_"
9,"asmān","_","_","mat","PPR","","_","_"
1,"sam","_","_","sa","CADP","","_","_"
2,"_","_","_","arpay","V","arpay","_","_"
3,"_","_","_","indra","NC","","_","_"
4,"mahatā","_","_","mahat","JJ","","_","_"
5,"vadhena","_","_","vadha","NC","","_","_"
6,"drātv","_","_","drā","V","drā","_","_"
7,"eṣām","_","_","ida","PRD","","_","_"
8,"aghahāro","_","_","aghahāra","NC","","_","_"
9,"vividdhaḥ","_","_","vivyadh","PPP","","_","_"
1,"ātanvānā","_","_","ātan","KDP","","_","_"
2,"āyacchanto","_","_","āya","KDP","","_","_"
3,"'syanto","_","_","as","KDP","","_","_"
4,"ye","_","_","yad","PRL","","_","_"
5,"ca","_","_","ca","CCD","","_","_"
6,"dhāvatha","_","_","dhāv","V","dhāv","_","_"
1,"nirhastāḥ","_","_","nirhasta","JJ","","_","_"
2,"śatravaḥ","_","_","śatru","NC","","_","_"
3,"_","_","_","as","V","as","_","_"
4,"_","_","_","indra","NC","","_","_"
5,"vo","_","_","tvat","PPR","","_","_"
6,"'dya","_","_","adya","CX","","_","_"
7,"parāśarīt","_","_","parāśṛ","V","parāśṛ","_","_"
1,"nirhastāḥ","_","_","nirhasta","JJ","","_","_"
2,"santu","_","_","as","V","as","_","_"
3,"śatravo","_","_","śatru","NC","","_","_"
4,"_","_","_","aṅga","NC","","_","_"
5,"_","_","_","ida","PRD","","_","_"
6,"mlāpayāmasi","_","_","mlāpay","V","mlāpay","_","_"
1,"_","_","_","atha","CAD","","_","_"
2,"_","_","_","ida","PRD","","_","_"
3,"indra","_","_","indra","NC","","_","_"
4,"vedāṃsi","_","_","vedas","NC","","_","_"
5,"śataśo","_","_","śataśas","CX","","_","_"
6,"vi","_","_","vi","CADP","","_","_"
7,"bhajāmahai","_","_","bhaj","V","bhaj","_","_"
