"WordID","word","NormSTEM","suffix","lemma","PoS","Root","NormSuffix","NormWord"
1,"bhīṣma","_","_","bhīṣma","NC","","_","_"
2,"uvāca","_","_","vak","V","vac","_","_"
1,"mṛgayāṃ","_","_","mṛgayā","NC","","_","_"
2,"vicaran","_","_","vicar","KDP","","_","_"
3,"kaścid","_","_","kiṃcit","PRI","","_","_"
4,"vijane","_","_","vijana","NC","","_","_"
5,"_","_","_","janaka","NC","","_","_"
6,"_","_","_","ātmaja","NC","","_","_"
1,"vane","_","_","vana","NC","","_","_"
2,"dadarśa","_","_","darś","V","dṛś","_","_"
3,"_","_","_","vipra","NC","","_","_"
4,"_","_","_","indra","NC","","_","_"
5,"ṛṣiṃ","_","_","ṛṣi","NC","","_","_"
6,"_","_","_","vaṃśa","NC","","_","_"
7,"_","_","_","dhara","JJ","","_","_"
8,"bhṛgoḥ","_","_","bhṛgu","NC","","_","_"
1,"tam","_","_","tad","PRD","","_","_"
2,"āsīnam","_","_","ās","PPP","","_","_"
3,"upāsīnaḥ","_","_","upās","PPP","","_","_"
4,"praṇamya","_","_","praṇa","CGDA","","_","_"
5,"śirasā","_","_","śiras","NC","","_","_"
6,"munim","_","_","muni","NC","","_","_"
1,"paścād","_","_","paścāt","CAD","","_","_"
2,"_","_","_","anuman","PPP","","_","_"
3,"_","_","_","tad","PRD","","_","_"
4,"papraccha","_","_","pṛcch","V","prach","_","_"
5,"vasumān","_","_","vasumat","NC","","_","_"
6,"idam","_","_","ida","PRD","","_","_"
1,"bhagavan","_","_","bhagavat","JJ","","_","_"
2,"kim","_","_","kiṃ","PRQ","","_","_"
3,"idaṃ","_","_","ida","PRD","","_","_"
4,"śreyaḥ","_","_","śreyas","JJ","","_","_"
5,"pretya","_","_","pre","CGDA","","_","_"
6,"_","_","_","vā","CCD","","_","_"
7,"_","_","_","api","CX","","_","_"
8,"_","_","_","iha","CAD","","_","_"
9,"vā","_","_","vā","CCD","","_","_"
10,"bhavet","_","_","bhav","V","bhū","_","_"
1,"_","_","_","puruṣa","NC","","_","_"
2,"_","_","_","adhruva","JJ","","_","_"
3,"dehe","_","_","deha","NC","","_","_"
4,"kāmasya","_","_","kāma","NC","","_","_"
5,"_","_","_","vaśa","NC","","_","_"
6,"_","_","_","vartin","JJ","","_","_"
1,"satkṛtya","_","_","satkṛ","CGDA","","_","_"
2,"paripṛṣṭaḥ","_","_","paripracch","PPP","","_","_"
3,"san","_","_","as","KDP","","_","_"
4,"_","_","_","su","CAD","","_","_"
5,"_","_","_","mahātman","JJ","","_","_"
6,"_","_","_","mahat","JJ","","_","_"
7,"_","_","_","tapas","NC","","_","_"
1,"nijagāda","_","_","nigad","V","nigad","_","_"
2,"_","_","_","tatas","CX","","_","_"
3,"_","_","_","tad","PRD","","_","_"
4,"śreyaskaram","_","_","śreyaskara","JJ","","_","_"
5,"idaṃ","_","_","ida","PRD","","_","_"
6,"vacaḥ","_","_","vacas","NC","","_","_"
1,"manaso","_","_","manas","NC","","_","_"
2,"_","_","_","a","CNG","","_","_"
3,"_","_","_","pratikūla","JJ","","_","_"
4,"pretya","_","_","pre","CGDA","","_","_"
5,"_","_","_","ca","CCD","","_","_"
6,"_","_","_","iha","CAD","","_","_"
7,"ca","_","_","ca","CCD","","_","_"
8,"vāñchasi","_","_","vāñch","V","vāñch","_","_"
1,"bhūtānāṃ","_","_","bhūta","NC","","_","_"
2,"pratikūlebhyo","_","_","pratikūla","JJ","","_","_"
3,"nivartasva","_","_","nivart","V","nivṛt","_","_"
4,"_","_","_","ya","PPP","","_","_"
5,"_","_","_","indriya","NC","","_","_"
1,"dharmaḥ","_","_","dharma","NC","","_","_"
2,"satāṃ","_","_","sat","JJ","","_","_"
3,"hitaḥ","_","_","hita","JJ","","_","_"
4,"puṃsāṃ","_","_","puṃs","NC","","_","_"
5,"_","_","_","dharma","NC","","_","_"
6,"_","_","_","ca","CCD","","_","_"
7,"_","_","_","eva","CEM","","_","_"
8,"_","_","_","āśraya","NC","","_","_"
9,"satām","_","_","sat","JJ","","_","_"
1,"_","_","_","dharma","NC","","_","_"
2,"_","_","_","loka","NC","","_","_"
3,"_","_","_","tri","NUM","","_","_"
4,"_","_","_","tāta","NC","","_","_"
5,"pravṛttāḥ","_","_","pravṛt","PPP","","_","_"
6,"_","_","_","sa_saha","CX","","_","_"
7,"_","_","_","carācara","NC","","_","_"
1,"_","_","_","svādu","JJ","","_","_"
2,"_","_","_","kāmuka","JJ","","_","_"
3,"kāmānāṃ","_","_","kāma","NC","","_","_"
4,"vaitṛṣṇyaṃ","_","_","vaitṛṣṇya","NC","","_","_"
5,"kiṃ","_","_","kim","CX","","_","_"
6,"na","_","_","na","CNG","","_","_"
7,"gacchasi","_","_","gacch","V","gam","_","_"
1,"madhu","_","_","madhu","NC","","_","_"
2,"paśyasi","_","_","paś","V","paś","_","_"
3,"durbuddhe","_","_","durbuddhi","JJ","","_","_"
4,"prapātaṃ","_","_","prapāta","NC","","_","_"
5,"_","_","_","na","CNG","","_","_"
6,"_","_","_","anupaś","V","anupaś","_","_"
1,"yathā","_","_","yathā","CCM","","_","_"
2,"jñāne","_","_","jñāna","NC","","_","_"
3,"paricayaḥ","_","_","paricaya","NC","","_","_"
4,"_","_","_","kṛ","KDG","","_","_"
5,"_","_","_","tad","PRD","","_","_"
6,"_","_","_","phala","NC","","_","_"
7,"_","_","_","arthin","JJ","","_","_"
1,"tathā","_","_","tathā","CX","","_","_"
2,"dharme","_","_","dharma","NC","","_","_"
3,"paricayaḥ","_","_","paricaya","NC","","_","_"
4,"_","_","_","kṛ","KDG","","_","_"
5,"_","_","_","tad","PRD","","_","_"
6,"_","_","_","phala","NC","","_","_"
7,"_","_","_","arthin","JJ","","_","_"
1,"asatā","_","_","asat","JJ","","_","_"
2,"_","_","_","dharma","NC","","_","_"
3,"_","_","_","kāma","NC","","_","_"
4,"viśuddhaṃ","_","_","viśudh","PPP","","_","_"
5,"karma","_","_","karman","NC","","_","_"
6,"duṣkaram","_","_","duṣkara","JJ","","_","_"
1,"satā","_","_","sat","JJ","","_","_"
2,"tu","_","_","tu","CCD","","_","_"
3,"_","_","_","dharma","NC","","_","_"
4,"_","_","_","kāma","NC","","_","_"
5,"sukaraṃ","_","_","sukara","JJ","","_","_"
6,"karma","_","_","karman","NC","","_","_"
7,"duṣkaram","_","_","duṣkara","JJ","","_","_"
1,"vane","_","_","vana","NC","","_","_"
2,"_","_","_","grāmya","JJ","","_","_"
3,"_","_","_","sukha","NC","","_","_"
4,"_","_","_","ācāra","NC","","_","_"
5,"yathā","_","_","yathā","CCM","","_","_"
6,"_","_","_","grāmya","JJ","","_","_"
7,"_","_","_","tathā","CX","","_","_"
8,"_","_","_","eva","CEM","","_","_"
9,"saḥ","_","_","tad","PRD","","_","_"
1,"grāme","_","_","grāma","NC","","_","_"
2,"_","_","_","vana","NC","","_","_"
3,"_","_","_","sukha","NC","","_","_"
4,"_","_","_","ācāra","NC","","_","_"
5,"yathā","_","_","yathā","CCM","","_","_"
6,"_","_","_","vana","NC","","_","_"
7,"_","_","_","cara","JJ","","_","_"
8,"_","_","_","tathā","CX","","_","_"
1,"dharme","_","_","dharma","NC","","_","_"
2,"kuru","_","_","kar","V","kṛ","_","_"
3,"śraddhāṃ","_","_","śraddhā","NC","","_","_"
4,"samāhitaḥ","_","_","samāhita","JJ","","_","_"
1,"nivṛttau","_","_","nivṛtti","NC","","_","_"
2,"vā","_","_","vā","CCD","","_","_"
3,"pravṛttau","_","_","pravṛtti","NC","","_","_"
4,"vā","_","_","vā","CCD","","_","_"
5,"sampradhārya","_","_","sampradhāray","CGDA","","_","_"
6,"_","_","_","guṇa","NC","","_","_"
7,"_","_","_","aguṇa","NC","","_","_"
1,"nityaṃ","_","_","nitya","CX","","_","_"
2,"ca","_","_","ca","CCD","","_","_"
3,"bahu","_","_","bahu","JJ","","_","_"
4,"dātavyaṃ","_","_","dā","KDG","","_","_"
5,"_","_","_","sādhu","JJ","","_","_"
6,"_","_","_","ca","CCD","","_","_"
7,"_","_","_","anasūyat","JJ","","_","_"
1,"prārthitaṃ","_","_","prārthay","PPP","","_","_"
2,"_","_","_","vrata","NC","","_","_"
3,"_","_","_","śauca","NC","","_","_"
4,"satkṛtaṃ","_","_","satkṛ","PPP","","_","_"
5,"_","_","_","deśa","NC","","_","_"
6,"_","_","_","kāla","NC","","_","_"
1,"śubhena","_","_","śubha","JJ","","_","_"
2,"vidhinā","_","_","vidhi","NC","","_","_"
3,"labdham","_","_","labh","PPP","","_","_"
4,"arhāya","_","_","arha","JJ","","_","_"
5,"pratipādayet","_","_","pratipad","V","pratipad","_","_"
1,"krodham","_","_","krodha","NC","","_","_"
2,"utsṛjya","_","_","utsṛj","CGDA","","_","_"
3,"dattvā","_","_","dā","CGDA","","_","_"
4,"ca","_","_","ca","CCD","","_","_"
5,"_","_","_","na","CNG","","_","_"
6,"_","_","_","anutap","V","anutap","_","_"
7,"na","_","_","na","CNG","","_","_"
8,"kīrtayet","_","_","kīrtay","V","kīrtay","_","_"
1,"anṛśaṃsaḥ","_","_","anṛśaṃsa","JJ","","_","_"
2,"śucir","_","_","śuci","JJ","","_","_"
3,"dāntaḥ","_","_","da","PPP","","_","_"
4,"_","_","_","satya","JJ","","_","_"
5,"_","_","_","vāc","NC","","_","_"
6,"ārjave","_","_","ārjava","NC","","_","_"
7,"sthitaḥ","_","_","sthā","PPP","","_","_"
1,"_","_","_","yoni","NC","","_","_"
2,"_","_","_","karman","NC","","_","_"
3,"_","_","_","viśudh","PPP","","_","_"
4,"_","_","_","ca","CCD","","_","_"
5,"pātraṃ","_","_","pātra","NC","","_","_"
6,"syād","_","_","as","V","as","_","_"
7,"_","_","_","veda","NC","","_","_"
8,"_","_","_","vid","JJ","","_","_"
9,"dvijaḥ","_","_","dvija","NC","","_","_"
1,"satkṛtā","_","_","satkṛ","PPP","","_","_"
2,"_","_","_","ca","CCD","","_","_"
3,"_","_","_","ekapatnī","NC","","_","_"
4,"ca","_","_","ca","CCD","","_","_"
5,"jātyā","_","_","jātya","JJ","","_","_"
6,"yonir","_","_","yoni","NC","","_","_"
7,"_","_","_","iha","CAD","","_","_"
8,"_","_","_","iṣ","V","iṣ","_","_"
1,"_","_","_","ṛc","NC","","_","_"
2,"_","_","_","yajus","NC","","_","_"
3,"_","_","_","sāman","NC","","_","_"
4,"_","_","_","ga","JJ","","_","_"
5,"vidvān","_","_","vidvas","JJ","","_","_"
6,"ṣaṭkarmā","_","_","ṣaṭkarman","NC","","_","_"
7,"pātram","_","_","pātra","NC","","_","_"
8,"ucyate","_","_","vak","V","vac","_","_"
1,"sa","_","_","tad","PRD","","_","_"
2,"eva","_","_","eva","CEM","","_","_"
3,"dharmaḥ","_","_","dharma","NC","","_","_"
4,"so","_","_","tad","PRD","","_","_"
5,"_","_","_","adharma","NC","","_","_"
6,"_","_","_","tad","PRD","","_","_"
7,"taṃ","_","_","tad","PRD","","_","_"
8,"_","_","_","prati","CADP","","_","_"
9,"_","_","_","nara","NC","","_","_"
10,"bhavet","_","_","bhav","V","bhū","_","_"
1,"_","_","_","pātra","NC","","_","_"
2,"_","_","_","karman","NC","","_","_"
3,"_","_","_","viśeṣa","NC","","_","_"
4,"_","_","_","deśa","NC","","_","_"
5,"_","_","_","kāla","NC","","_","_"
6,"_","_","_","avekṣ","CGDA","","_","_"
7,"ca","_","_","ca","CCD","","_","_"
1,"_","_","_","līlā","NC","","_","_"
2,"_","_","_","alpa","JJ","","_","_"
3,"yathā","_","_","yathā","CCM","","_","_"
4,"gātrāt","_","_","gātra","NC","","_","_"
5,"pramṛjyād","_","_","pramṛj","V","pramṛj","_","_"
6,"rajasaḥ","_","_","rajas","NC","","_","_"
7,"pumān","_","_","puṃs","NC","","_","_"
1,"_","_","_","bahu","JJ","","_","_"
2,"_","_","_","yatna","NC","","_","_"
3,"mahatā","_","_","mahat","JJ","","_","_"
4,"_","_","_","pāpa","NC","","_","_"
5,"_","_","_","nirharaṇa","NC","","_","_"
6,"tathā","_","_","tathā","CX","","_","_"
1,"viriktasya","_","_","viric","PPP","","_","_"
2,"yathā","_","_","yathā","CCM","","_","_"
3,"samyag","_","_","samyak","CX","","_","_"
4,"ghṛtaṃ","_","_","ghṛta","NC","","_","_"
5,"bhavati","_","_","bhav","V","bhū","_","_"
6,"bheṣajam","_","_","bheṣaja","NC","","_","_"
1,"tathā","_","_","tathā","CX","","_","_"
2,"_","_","_","nirhṛ","PPP","","_","_"
3,"_","_","_","doṣa","NC","","_","_"
4,"_","_","_","pre","CGDA","","_","_"
5,"_","_","_","dharma","NC","","_","_"
6,"_","_","_","sukha","NC","","_","_"
7,"_","_","_","āvaha","JJ","","_","_"
1,"mānasaṃ","_","_","mānasa","NC","","_","_"
2,"_","_","_","sarva","JQ","","_","_"
3,"_","_","_","bhūta","NC","","_","_"
4,"vartate","_","_","vart","V","vṛt","_","_"
5,"vai","_","_","vai","CX","","_","_"
6,"_","_","_","śubha","JJ","","_","_"
7,"_","_","_","aśubha","JJ","","_","_"
1,"aśubhebhyaḥ","_","_","aśubha","JJ","","_","_"
2,"samākṣipya","_","_","samākṣip","CGDA","","_","_"
3,"_","_","_","śubha","JJ","","_","_"
4,"_","_","_","eva","CEM","","_","_"
5,"_","_","_","avatāray","V","avatāray","_","_"
1,"sarvaṃ","_","_","sarva","JQ","","_","_"
2,"sarveṇa","_","_","sarva","JQ","","_","_"
3,"sarvatra","_","_","sarvatra","CX","","_","_"
4,"kriyamāṇaṃ","_","_","kṛ","KDP","","_","_"
5,"ca","_","_","ca","CCD","","_","_"
6,"pūjaya","_","_","pūjay","V","pūjay","_","_"
1,"svadharme","_","_","svadharma","NC","","_","_"
2,"yatra","_","_","yatra","CX","","_","_"
3,"_","_","_","rāga","NC","","_","_"
4,"_","_","_","tvat","PPR","","_","_"
5,"kāmaṃ","_","_","kāma","CX","","_","_"
6,"dharmo","_","_","dharma","NC","","_","_"
7,"vidhīyatām","_","_","vidadh","V","vidhā","_","_"
1,"_","_","_","adhṛta","JJ","","_","_"
2,"_","_","_","ātman","NC","","_","_"
3,"dhṛtau","_","_","dhṛti","NC","","_","_"
4,"tiṣṭha","_","_","tiṣṭh","V","sthā","_","_"
5,"durbuddhe","_","_","durbuddhi","JJ","","_","_"
6,"buddhimān","_","_","buddhimat","JJ","","_","_"
7,"bhava","_","_","bhav","V","bhū","_","_"
1,"a","_","_","alpha_privativum","JJ","","_","_"
1,"apraśānta","_","_","praśānta","JJ","","_","_"
2,"praśāmya","_","_","praśam","V","praśam","_","_"
3,"tvam","_","_","tvat","PPR","","_","_"
4,"aprājña","_","_","aprājña","JJ","","_","_"
5,"_","_","_","prājña","JJ","","_","_"
6,"_","_","_","vat","CX","","_","_"
7,"_","_","_","car","V","car","_","_"
1,"tejasā","_","_","tejas","NC","","_","_"
2,"śakyate","_","_","śakn","V","śak","_","_"
3,"prāptum","_","_","prāp","CGDI","","_","_"
4,"_","_","_","upāya","NC","","_","_"
5,"_","_","_","sahacārin","JJ","","_","_"
1,"iha","_","_","iha","CAD","","_","_"
2,"ca","_","_","ca","CCD","","_","_"
3,"pretya","_","_","pre","CGDA","","_","_"
4,"ca","_","_","ca","CCD","","_","_"
5,"śreyas","_","_","śreyas","NC","","_","_"
6,"tasya","_","_","tad","PRD","","_","_"
7,"mūlaṃ","_","_","mūla","NC","","_","_"
8,"dhṛtiḥ","_","_","dhṛti","NC","","_","_"
9,"parā","_","_","para","PPX","","_","_"
1,"_","_","_","rājan","NC","","_","_"
2,"_","_","_","ṛṣi","NC","","_","_"
3,"adhṛtiḥ","_","_","adhṛti","JJ","","_","_"
4,"svargāt","_","_","svarga","NC","","_","_"
5,"patito","_","_","pat","PPP","","_","_"
6,"hi","_","_","hi","CX","","_","_"
7,"mahābhiṣaḥ","_","_","mahābhiṣa","NC","","_","_"
1,"yayātiḥ","_","_","yayāti","NC","","_","_"
2,"_","_","_","kṣi","PPP","","_","_"
3,"_","_","_","puṇya","NC","","_","_"
4,"_","_","_","ca","CCD","","_","_"
5,"dhṛtyā","_","_","dhṛti","NC","","_","_"
6,"lokān","_","_","loka","NC","","_","_"
7,"avāptavān","_","_","avāp","KDP","","_","_"
1,"tapasvināṃ","_","_","tapasvin","NC","","_","_"
2,"dharmavatāṃ","_","_","dharmavat","JJ","","_","_"
3,"viduṣāṃ","_","_","vidvas","JJ","","_","_"
4,"_","_","_","ca","CCD","","_","_"
5,"_","_","_","upasevana","NC","","_","_"
1,"prāpsyase","_","_","prāpn","V","prāp","_","_"
2,"vipulāṃ","_","_","vipula","JJ","","_","_"
3,"buddhiṃ","_","_","buddhi","NC","","_","_"
4,"tathā","_","_","tathā","CX","","_","_"
5,"śreyo","_","_","śreyas","NC","","_","_"
6,"'bhipatsyase","_","_","abhipad","V","abhipad","_","_"
1,"sa","_","_","tad","PRD","","_","_"
2,"tu","_","_","tu","CCD","","_","_"
3,"_","_","_","svabhāva","NC","","_","_"
4,"_","_","_","sampad","PPP","","_","_"
5,"_","_","_","tad","PRD","","_","_"
6,"_","_","_","śru","CGDA","","_","_"
7,"_","_","_","muni","NC","","_","_"
8,"_","_","_","bhāṣita","NC","","_","_"
1,"vinivartya","_","_","vinivartay","CGDA","","_","_"
2,"manaḥ","_","_","manas","NC","","_","_"
3,"kāmād","_","_","kāma","NC","","_","_"
4,"dharme","_","_","dharma","NC","","_","_"
5,"buddhiṃ","_","_","buddhi","NC","","_","_"
6,"cakāra","_","_","kar","V","kṛ","_","_"
7,"ha","_","_","ha","CEM","","_","_"
