"WordID","word","NormSTEM","suffix","lemma","PoS","Root","NormSuffix","NormWord"
"","<s number = ""1"">","","","","","","",""
"1","om","","","oṃ","ind","","","oṃ"
"2","manaḥ","MAN","aḥ","manas","noun-adj","","aḥ","manaḥ"
"3","hi","","","hi","ind","","","hi"
"4","dvividham","DVIVIDH","am","dvividha","noun-adj","","am","dvividham"
"5","proktam","PROKT","am","prokta","noun-adj","","am","proktam"
"6","śuddham","ŚUDDH","am","śuddha","noun-adj","","am","śuddham"
"7","ca","","","ca","ind","","","ca"
"8","aśuddham","AŚUDDH","am","aśuddha","","","am","aśuddham"
"9","eva","","","eva","ind","","","eva"
"10","ca","","","ca","ind","","","ca"
"11","/","","","","punct","","","/"
"12","a","","","alpha_privativum","ind","","","alpha_privativum"
"13","śuddham","ŚUDDH","am","śuddha","noun-adj","","am","śuddham"
"14","kāma","KĀM","a","kāma","noun-adj","","a","kāma"
"15","saṃkalpam","SAṂKALP","am","saṃkalpa","noun-adj","","am","saṃkalpam"
"16","śuddham","ŚUDDH","am","śuddha","noun-adj","","am","śuddham"
"17","kāma","KĀM","a","kāma","noun-adj","","a","kāma"
"18","vivarjitam","VIVARJIT","am","vivarjita","noun-adj","","am","vivarjitam"
"19","//","","","","punct","","","//"
"","</s>","","","","","","",""
"","<s number = ""2"">","","","","","","",""
"1","//","","","","punct","","","//"
"","</s>","","","","","","",""
"","<s number = ""3"">","","","","","","",""
"1","manaḥ","MAN","aḥ","manas","noun-adj","","aḥ","manaḥ"
"2","eva","","","eva","ind","","","eva"
"3","manuṣyāṇām","MANUṢY","āṇām","manuṣya","noun-adj","","ānām","manuṣyānām"
"4","kāraṇam","KĀRAṆ","am","kāraṇa","noun-adj","","am","kāraṇam"
"5","bandha","BANDH","a","bandha","noun-adj","","a","bandha"
"6","mokṣayoḥ","MOKṢ","ayoḥ","mokṣa","noun-adj","","ayoḥ","mokṣayoḥ"
"7","/","","","","punct","","","/"
"8","bandhāya","BANDH","āya","bandha","noun-adj","","āya","bandhāya"
"9","viṣaya","VIṢAY","a","viṣaya","noun-adj","","a","viṣaya"
"10","āsaktam","ĀSAKT","am","āsakta","noun-adj","","am","āsaktam"
"11","muktyai","MUKT","yai","","noun-adj","","yai","muktyai"
"12","nirviṣayam","NIRVIṢAY","am","nirviṣaya","","","am","nirviṣayam"
"13","smṛtam","SMṚT","am","smṛta","noun-adj","","am","smṛtam"
"14","//","","","","punct","","","//"
"","</s>","","","","","","",""
"","<s number = ""4"">","","","","","","",""
"1","//","","","","punct","","","//"
"","</s>","","","","","","",""
"","<s number = ""5"">","","","","","","",""
"1","yatas","","","yatas","ind","","","yatas"
"2","nir","","","niḥ_privativum","ind","","","niḥ_privativum"
"3","viṣayasya","VIṢAY","asya","viṣaya","noun-adj","","asya","viṣayasya"
"4","asya","","","idam","pron","","","idam"
"5","manasaḥ","MANAS","aḥ","manas","noun-adj","","aḥ","manasaḥ"
"6","muktiḥ","MUKT","iḥ","mukti","noun-adj","","iḥ","muktiḥ"
"7","iṣyate","IṢ","yate","iṣ","verb","iṣ","yate","iṣyate"
"8","/","","","","punct","","","/"
"9","tasmāt","","","tad","pron","","","tad"
"10","nir","","","niḥ_privativum","ind","","","niḥ_privativum"
"11","viṣayam","VIṢAY","am","viṣaya","noun-adj","","am","viṣayam"
"12","nityam","NITY","am","nitya","noun-adj","","am","nityam"
"13","manaḥ","MAN","aḥ","manas","noun-adj","","aḥ","manaḥ"
"14","kāryam","KĀRY","am","kārya","noun-adj","","am","kāryam"
"15","mumukṣuṇā","MUMUKṢ","uṇā","mumukṣu","noun-adj","","unā","mumukṣunā"
"16","//","","","","punct","","","//"
"","</s>","","","","","","",""
"","<s number = ""6"">","","","","","","",""
"1","//","","","","punct","","","//"
"","</s>","","","","","","",""
"","<s number = ""7"">","","","","","","",""
"1","nirasta","NIRAST","a","nirasta","noun-adj","","a","nirasta"
"2","viṣaya","VIṢAY","a","viṣaya","noun-adj","","a","viṣaya"
"3","āsaṅgam","ĀSAṄG","am","asaṅga","noun-adj","","am","āsaṅgam"
"4","saṃniruddham","SAṂNIRUDDH","am","saṃniruddha","noun-adj","","am","saṃniruddham"
"5","manaḥ","MAN","aḥ","manas","noun-adj","","aḥ","manaḥ"
"6","hṛdi","HṚD","i","hṛdi","noun-adj","","i","hṛdi"
"7","/","","","","punct","","","/"
"8","yadā","","","yadā","ind","","","yadā"
"9","yāti","","","yā","ind","","","yā"
"10","unmanībhāvam","UNMANĪBHĀV","am","unmanībhāva","","","am","unmanībhāvam"
"11","tadā","","","tadā","ind","","","tadā"
"12","tat","TAT","","tad","pron","","","tat"
"13","parama","PARAM","a","parama","noun-adj","","a","parama"
"14","madam","MAD","am","mada","noun-adj","","am","madam"
"15","//","","","","punct","","","//"
"","</s>","","","","","","",""
"","<s number = ""8"">","","","","","","",""
"1","//","","","","punct","","","//"
"","</s>","","","","","","",""
"","<s number = ""9"">","","","","","","",""
"1","tāvat","TĀVAT","","tāvat","ind","","","tāvat"
"2","eva","","","eva","ind","","","eva"
"3","nir","","","niḥ_privativum","ind","","","niḥ_privativum"
"4","oddhavyam","UDDHAV","yam","","noun-adj","","yam","uddhavyam"
"5","yāvat","YĀVAT","","yāvat","ind","","","yāvat"
"6","hṛdi","HṚD","i","hṛdi","noun-adj","","i","hṛdi"
"7","gatam","GAT","am","gata","noun-adj","","am","gatam"
"8","kṣayam","KṢAY","am","kṣaya","noun-adj","","am","kṣayam"
"9","/","","","","punct","","","/"
"10","etat","ETAT","","tad","pron","","","etat"
"11","jñānam","JÑĀN","am","jñāna","noun-adj","","am","jñānam"
"12","ca","","","ca","ind","","","ca"
"13","mokṣam","MOKṢ","am","mokṣa","noun-adj","","am","mokṣam"
"14","ca","","","ca","ind","","","ca"
"15","atas","","","atas","ind","","","atas"
"16","anyaḥ","ANY","aḥ","anya","pron","","aḥ","anyaḥ"
"17","grantha","GRANTH","a","grantha","noun-adj","","a","grantha"
"18","vistaraḥ","VISTAR","aḥ","vistara","noun-adj","","aḥ","vistaraḥ"
"19","//","","","","punct","","","//"
"","</s>","","","","","","",""
"","<s number = ""10"">","","","","","","",""
"1","//","","","","punct","","","//"
"","</s>","","","","","","",""
"","<s number = ""11"">","","","","","","",""
"1","na","","","na","ind","","","na"
"2","eva","","","eva","ind","","","eva"
"3","cintyam","CINTY","am","cintya","noun-adj","","am","cintyam"
"4","na","","","na","ind","","","na"
"5","ca","","","ca","ind","","","ca"
"6","acintyam","ACINTY","am","acintya","noun-adj","","am","acintyam"
"7","acintyam","ACINTY","am","acintya","noun-adj","","am","acintyam"
"8","cintyam","CINTY","am","cintya","noun-adj","","am","cintyam"
"9","eva","","","eva","ind","","","eva"
"10","ca","","","ca","ind","","","ca"
"11","/","","","","punct","","","/"
"12","pakṣapāta","PAKṢAPĀT","a","pakṣapāta","noun-adj","","a","pakṣapāta"
"13","vinirmuktam","VINIRMUKT","am","vinirmukta","noun-adj","","am","vinirmuktam"
"14","brahma","BRAHM","a","brahman","noun-adj","","a","brahma"
"15","sampadyate","SAMPAD","yate","sampad","verb","saṃpad","yate","sampadyate"
"16","tadā","","","tadā","ind","","","tadā"
"17","//","","","","punct","","","//"
"","</s>","","","","","","",""
"","<s number = ""12"">","","","","","","",""
"1","//","","","","punct","","","//"
"","</s>","","","","","","",""
"","<s number = ""13"">","","","","","","",""
"1","svareṇa","SVAR","eṇa","svara","noun-adj","","ena","svarena"
"2","saṃdhayet","SAṂDHAY","et","saṃdh","verb","","et","saṃdhayet"
"3","yogam","YOG","am","yoga","noun-adj","","am","yogam"
"4","a","","","alpha_privativum","ind","","","alpha_privativum"
"5","svaram","SVAR","am","svara","noun-adj","","am","svaram"
"6","bhāvayet","BHĀVAY","et","bhav","verb","bhū","et","bhāvayet"
"7","param","PARAM","","parama","noun-adj","","","param"
"8","/","","","","punct","","","/"
"9","a","","","alpha_privativum","ind","","","alpha_privativum"
"10","svareṇa","SVAR","eṇa","svara","noun-adj","","ena","svarena"
"11","hi","","","hi","ind","","","hi"
"12","bhāvena","BHĀV","ena","bhāva","noun-adj","","ena","bhāvena"
"13","bhāvaḥ","BHĀV","aḥ","bhāva","noun-adj","","aḥ","bhāvaḥ"
"14","na","","","na","ind","","","na"
"15","abhāvaḥ","ABHĀV","aḥ","abhāva","noun-adj","","aḥ","abhāvaḥ"
"16","iṣyate","IṢ","yate","iṣ","verb","iṣ","yate","iṣyate"
"17","//","","","","punct","","","//"
"","</s>","","","","","","",""
"","<s number = ""14"">","","","","","","",""
"1","//","","","","punct","","","//"
"","</s>","","","","","","",""
"","<s number = ""15"">","","","","","","",""
"1","tat","TAT","","tad","pron","","","tat"
"2","eva","","","eva","ind","","","eva"
"3","niṣkalam","NIṢKAL","am","niṣkala","","","am","niṣkalam"
"4","brahma","BRAHM","a","brahman","noun-adj","","a","brahma"
"5","nirvikalpam","NIRVIKALP","am","nirvikalpa","noun-adj","","am","nirvikalpam"
"6","nirañjanam","NIRAÑJAN","am","nirañjana","noun-adj","","am","nirañjanam"
"7","/","","","","punct","","","/"
"8","tat","TAT","","tad","pron","","","tat"
"9","brahmā","BRAHM","ā","brahman","noun-adj","","ā","brahmā"
"10","aham","AHAM","","mat","pron","","","aham"
"11","iti","","","iti","ind","","","iti"
"12","jñātvā","JÑĀT","vā","jān","verb","jñā","vāḥ","jñātvāḥ"
"13","brahma","BRAHM","a","brahman","noun-adj","","a","brahma"
"14","sampadyate","SAMPAD","yate","sampad","verb","saṃpad","yate","sampadyate"
"15","dhruvam","DHRUV","am","dhruva","noun-adj","","am","dhruvam"
"16","//","","","","punct","","","//"
"","</s>","","","","","","",""
"","<s number = ""16"">","","","","","","",""
"1","//","","","","punct","","","//"
"","</s>","","","","","","",""
"","<s number = ""17"">","","","","","","",""
"1","nirvikalpam","NIRVIKALP","am","nirvikalpa","noun-adj","","am","nirvikalpam"
"2","anantam","ANANT","am","ananta","noun-adj","","am","anantam"
"3","ca","","","ca","ind","","","ca"
"4","hetu","HET","u","hetu","noun-adj","","u","hetu"
"5","dṛṣṭānta","DṚṢṬĀNT","a","dṛṣṭānta","noun-adj","","a","dṛṣṭānta"
"6","varjitam","VARJIT","am","varjita","noun-adj","","am","varjitam"
"7","/","","","","punct","","","/"
"8","aprameyam","APRAMEY","am","aprameya","noun-adj","","am","aprameyam"
"9","a","","","alpha_privativum","ind","","","alpha_privativum"
"10","nādyam","NĀDY","am","nādya","noun-adj","","am","nādyam"
"11","ca","","","ca","ind","","","ca"
"12","jñātvā","JÑĀT","vā","jān","verb","jñā","vāḥ","jñātvāḥ"
"13","ca","","","ca","ind","","","ca"
"14","paramam","PARAM","am","parama","noun-adj","","am","paramam"
"15","śivam","ŚIV","am","śiva","noun-adj","","am","śivam"
"16","//","","","","punct","","","//"
"","</s>","","","","","","",""
"","<s number = ""18"">","","","","","","",""
"1","//","","","","punct","","","//"
"","</s>","","","","","","",""
"","<s number = ""19"">","","","","","","",""
"1","na","","","na","ind","","","na"
"2","nirodhaḥ","NIRODH","aḥ","nirodha","noun-adj","","aḥ","nirodhaḥ"
"3","na","","","na","ind","","","na"
"4","ca","","","ca","ind","","","ca"
"5","utpattiḥ","UTPATT","iḥ","utpatti","noun-adj","","iḥ","utpattiḥ"
"6","na","","","na","ind","","","na"
"7","vandyaḥ","VANDY","aḥ","vandya","noun-adj","","aḥ","vandyaḥ"
"8","na","","","na","ind","","","na"
"9","ca","","","ca","ind","","","ca"
"10","śāsanam","ŚĀSAN","am","śāsana","noun-adj","","am","śāsanam"
"11","/","","","","punct","","","/"
"12","na","","","na","ind","","","na"
"13","mumukṣā","MUMUKṢ","ā","mumukṣā","noun-adj","","ā","mumukṣā"
"14","na","","","na","ind","","","na"
"15","muktiḥ","MUKT","iḥ","mukti","noun-adj","","iḥ","muktiḥ"
"16","ca","","","ca","ind","","","ca"
"17","iti","","","iti","ind","","","iti"
"18","eṣā","","","tad","pron","","","tad"
"19","paramārtha","PARAMĀRTH","a","paramārtha","noun-adj","","a","paramārtha"
"20","tā","","","tad","pron","","","tad"
"21","//","","","","punct","","","//"
"","</s>","","","","","","",""
"","<s number = ""20"">","","","","","","",""
"1","//","","","","punct","","","//"
"","</s>","","","","","","",""
"","<s number = ""21"">","","","","","","",""
"1","ekaḥ","EK","aḥ","eka","noun-adj","","aḥ","ekaḥ"
"2","eva","","","eva","ind","","","eva"
"3","ātmā","ĀTM","ā","ātman","noun-adj","","ā","ātmā"
"4","mantavyaḥ","MAN","tavyaḥ","man","verb","man","tavyaḥ","mantavyaḥ"
"5","jāgrat","JĀGR","at","jāgṛ","verb","jāgṛ","at","jāgrat"
"6","svapna","SVAPN","a","svapna","noun-adj","","a","svapna"
"7","suṣuptiṣu","SUṢUPT","iṣu","suṣupti","","","iṣu","suṣuptiṣu"
"8","/","","","","punct","","","/"
"9","sthāna","STHĀN","a","sthāna","noun-adj","","a","sthāna"
"10","trayāt","TRAY","āt","tri","noun-adj","","āt","trayāt"
"11","vyatītasya","VYATĪT","asya","vyatīta","noun-adj","","asya","vyatītasya"
"12","punarjanma","PUNARJANM","a","punarjanman","noun-adj","","a","punarjanma"
"13","na","","","na","ind","","","na"
"14","vidyate","VID","yate","vid","verb","vid","yate","vidyate"
"15","//","","","","punct","","","//"
"","</s>","","","","","","",""
"","<s number = ""22"">","","","","","","",""
"1","//","","","","punct","","","//"
"","</s>","","","","","","",""
"","<s number = ""23"">","","","","","","",""
"1","ekaḥ","EK","aḥ","eka","noun-adj","","aḥ","ekaḥ"
"2","eva","","","eva","ind","","","eva"
"3","hi","","","hi","ind","","","hi"
"4","bhūtātmā","BHŪTĀTM","ā","bhūtātman","","","ā","bhūtātmā"
"5","bhūte","BHŪT","e","bhūta","noun-adj","","e","bhūte"
"6","bhūte","BHŪT","e","bhūta","noun-adj","","e","bhūte"
"7","vyavasthitaḥ","VYAVASTHIT","aḥ","vyavasthita","noun-adj","","aḥ","vyavasthitaḥ"
"8","/","","","","punct","","","/"
"9","ekadhā","EKADH","ā","ekadhā","noun-adj","","ā","ekadhā"
"10","bahudhā","BAHUDH","ā","bahudhā","noun-adj","","ā","bahudhā"
"11","ca","","","ca","ind","","","ca"
"12","eva","","","eva","ind","","","eva"
"13","dṛśyate","DṚŚ","yate","darś","verb","dṛś","yate","dṛśyate"
"14","jala","JAL","a","jala","noun-adj","","a","jala"
"15","candravat","CANDR","avat","candravat","noun-adj","","avat","candravat"
"16","//","","","","punct","","","//"
"","</s>","","","","","","",""
"","<s number = ""24"">","","","","","","",""
"1","//","","","","punct","","","//"
"","</s>","","","","","","",""
"","<s number = ""25"">","","","","","","",""
"1","ghaṭa","GHAṬ","a","ghaṭa","noun-adj","","a","ghaṭa"
"2","saṃbhṛtam","SAMBHṚTA","m","sambhṛta","noun-adj","","m","sambhṛtam"
"3","ākāśam","ĀKĀŚ","am","ākāśa","noun-adj","","am","ākāśam"
"4","līyamāne","","","","ind","","",""
"5","ghaṭe","GHAṬ","e","ghaṭa","noun-adj","","e","ghaṭe"
"6","yathā","","","yathā","ind","","","yathā"
"7","/","","","","punct","","","/"
"8","ghaṭaḥ","GHAṬ","aḥ","ghaṭa","noun-adj","","aḥ","ghaṭaḥ"
"9","līyeta","","","","","","",""
"10","na","","","na","ind","","","na"
"11","ākāśam","ĀKĀŚ","am","ākāśa","noun-adj","","am","ākāśam"
"12","tadvat","","","tadvat","ind","","","tadvat"
"13","jīvaḥ","JĪV","aḥ","jīva","noun-adj","","aḥ","jīvaḥ"
"14","ghaṭa","GHAṬ","a","ghaṭa","noun-adj","","a","ghaṭa"
"15","upamaḥ","UPAM","aḥ","upama","noun-adj","","aḥ","upamaḥ"
"16","//","","","","punct","","","//"
"","</s>","","","","","","",""
"","<s number = ""26"">","","","","","","",""
"1","//","","","","punct","","","//"
"","</s>","","","","","","",""
"","<s number = ""27"">","","","","","","",""
"1","ghaṭavat","GHAṬ","avat","ghaṭavat","noun-adj","","avat","ghaṭavat"
"2","vividha","VIVIDH","a","vividha","noun-adj","","a","vividha"
"3","ākāram","ĀKĀR","am","ākāra","noun-adj","","am","ākāram"
"4","bhidyamānam","BHID","yamānam","bhid","verb","bhid","yamānam","bhidyamānam"
"5","punar","","","punar","ind","","","punar"
"6","punar","","","punar","ind","","","punar"
"7","/","","","","punct","","","/"
"8","tad","TAD","","tad","pron","","","tad"
"9","bhagnam","BHAGN","am","bhagna","noun-adj","","am","bhagnam"
"10","na","","","na","ind","","","na"
"11","ca","","","ca","ind","","","ca"
"12","jānāti","JĀN","āti","jān","verb","jñā","āti","jānāti"
"13","sa","","","tad","pron","","","tad"
"14","jānāti","JĀN","āti","jān","verb","jñā","āti","jānāti"
"15","ca","","","ca","ind","","","ca"
"16","nityaśas","NITYAŚ","as","nityaśas","","","aḥ","nityaśaḥ"
"17","//","","","","punct","","","//"
"","</s>","","","","","","",""
"","<s number = ""28"">","","","","","","",""
"1","//","","","","punct","","","//"
"","</s>","","","","","","",""
"","<s number = ""29"">","","","","","","",""
"1","śabda","ŚABD","a","śabda","noun-adj","","a","śabda"
"2","māyā","MĀY","ā","māyā","noun-adj","","ā","māyā"
"3","āvṛtaḥ","ĀVṚT","aḥ","āvṛta","noun-adj","","aḥ","āvṛtaḥ"
"4","yāvat","YĀVAT","","yāvat","ind","","","yāvat"
"5","tāvat","TĀVAT","","tāvat","ind","","","tāvat"
"6","tiṣṭhati","TIṢṬH","ati","tiṣṭh","verb","sthā","ati","tiṣṭhati"
"7","puṣkare","PUṢKAR","e","puṣkara","noun-adj","","e","puṣkare"
"8","/","","","","punct","","","/"
"9","bhinne","BHINN","e","bhinna","noun-adj","","e","bhinne"
"10","tamasi","TAMAS","i","tamas","noun-adj","","i","tamasi"
"11","ca","","","ca","ind","","","ca"
"12","ekatvam","EK","atvam","ekatva","noun-adj","","atvam","ekatvam"
"13","ekam","EK","am","eka","noun-adj","","am","ekam"
"14","eva","","","eva","ind","","","eva"
"15","anupaśyati","ANUPAŚ","yati","anupaś","verb","anupaś","yati","anupaśyati"
"16","//","","","","punct","","","//"
"","</s>","","","","","","",""
"","<s number = ""30"">","","","","","","",""
"1","//","","","","punct","","","//"
"","</s>","","","","","","",""
"","<s number = ""31"">","","","","","","",""
"1","śabda","ŚABD","a","śabda","noun-adj","","a","śabda"
"2","akṣaram","AKṢAR","am","akṣara","noun-adj","","am","akṣaram"
"3","param","PARAM","","parama","noun-adj","","","param"
"4","brahma","BRAHM","a","brahman","noun-adj","","a","brahma"
"5","yasmin","YASMIN","","yad","pron","","","yasmin"
"6","kṣīṇe","KṢĪṆ","e","kṣīṇa","noun-adj","","e","kṣīṇe"
"7","yat","","","yad","pron","","","yad"
"8","akṣaram","AKṢAR","am","akṣara","noun-adj","","am","akṣaram"
"9","/","","","","punct","","","/"
"10","tat","TAT","","tad","pron","","","tat"
"11","vidvān","VIDV","ān","vidvas","noun-adj","","ān","vidvān"
"12","akṣaram","AKṢAR","am","akṣara","noun-adj","","am","akṣaram"
"13","dhyāyet","DHYĀY","et","dhyāy","verb","dhyai","et","dhyāyet"
"14","yadi","","","yadi","ind","","","yadi"
"15","icchet","ICCH","et","iṣ","verb","","et","icchet"
"16","śāntim","ŚĀNT","im","śānti","noun-adj","","im","śāntim"
"17","ātmanaḥ","ĀTM","anaḥ","ātman","noun-adj","","anaḥ","ātmanaḥ"
"18","//","","","","punct","","","//"
"","</s>","","","","","","",""
"","<s number = ""32"">","","","","","","",""
"1","//","","","","punct","","","//"
"","</s>","","","","","","",""
"","<s number = ""33"">","","","","","","",""
"1","dve","DV","e","dva","noun-adj","","e","dve"
"2","vidye","VIDY","e","vidyā","noun-adj","","e","vidye"
"3","veditavye","VED","itavye","vid","verb","vid","itavye","veditavye"
"4","tu","","","tu","ind","","","tu"
"5","śabdabrahma","ŚABDABRAHM","a","śabdabrahman","","","a","śabdabrahma"
"6","param","PARAM","","parama","noun-adj","","","param"
"7","ca","","","ca","ind","","","ca"
"8","yat","","","yad","pron","","","yad"
"9","/","","","","punct","","","/"
"10","śabdabrahmaṇi","ŚABDABRAHM","aṇi","śabdabrahman","","","āni","śabdabrahmāni"
"11","niṣṇātaḥ","NIṢṆĀT","aḥ","niṣṇāta","noun-adj","","aḥ","niṣṇātaḥ"
"12","param","PARAM","","parama","noun-adj","","","param"
"13","brahma","BRAHM","a","brahman","noun-adj","","a","brahma"
"14","adhigacchati","ADHIGACCH","ati","adhigacch","verb","adhigam","ati","adhigacchati"
"15","//","","","","punct","","","//"
"","</s>","","","","","","",""
"","<s number = ""34"">","","","","","","",""
"1","//","","","","punct","","","//"
"","</s>","","","","","","",""
"","<s number = ""35"">","","","","","","",""
"1","grantham","GRANTH","am","grantha","noun-adj","","am","grantham"
"2","abhyasya","ABHYASY","a","abhyas","noun-adj","","a","abhyasya"
"3","medhāvī","MEDHĀV","ī","medhāvin","noun-adj","","ī","medhāvī"
"4","jñāna","JÑĀN","a","jñāna","noun-adj","","a","jñāna"
"5","vijñāna","VIJÑĀN","a","vijñāna","noun-adj","","a","vijñāna"
"6","tattvataḥ","TATTV","ataḥ","tattva","noun-adj","","ataḥ","tattvataḥ"
"7","/","","","","punct","","","/"
"8","palālam","PALĀL","am","palāla","","","am","palālam"
"9","iva","","","iva","ind","","","iva"
"10","dhānya","DHĀNY","a","dhānya","noun-adj","","a","dhānya"
"11","arthī","ARTH","ī","arthin","noun-adj","","ī","arthī"
"12","tyajet","TYAJ","et","tyaj","verb","tyaj","et","tyajet"
"13","grantham","GRANTH","am","grantha","noun-adj","","am","grantham"
"14","a","","","alpha_privativum","ind","","","alpha_privativum"
"15","śeṣatas","ŚEṢ","atas","śeṣa","noun-adj","","ataḥ","śeṣataḥ"
"16","//","","","","punct","","","//"
"","</s>","","","","","","",""
"","<s number = ""36"">","","","","","","",""
"1","//","","","","punct","","","//"
"","</s>","","","","","","",""
"","<s number = ""37"">","","","","","","",""
"1","gavām","GAV","ām","go","noun-adj","","ām","gavām"
"2","aneka","ANEK","a","aneka","noun-adj","","a","aneka"
"3","varṇānām","VARṆ","ānām","varṇa","noun-adj","","ānām","varṇānām"
"4","kṣīrasya","KṢĪRASY","a","kṣīrasya","noun-adj","","a","kṣīrasya"
"5","api","","","api","ind","","","api"
"6","eka","EK","a","eka","noun-adj","","a","eka"
"7","varṇa","VARṆ","a","varṇa","noun-adj","","a","varṇa"
"8","tā","","","tad","pron","","","tad"
"9","/","","","","punct","","","/"
"10","kṣīravat","KṢĪR","avat","kṣīravat","noun-adj","","avat","kṣīravat"
"11","paśyate","PAŚ","yate","paś","verb","paś","yate","paśyate"
"12","jñānam","JÑĀN","am","jñāna","noun-adj","","am","jñānam"
"13","liṅginaḥ","LIṄG","inaḥ","liṅgin","noun-adj","","inaḥ","liṅginaḥ"
"14","tu","","","tu","ind","","","tu"
"15","gavām","GAV","ām","go","noun-adj","","ām","gavām"
"16","yathā","","","yathā","ind","","","yathā"
"17","//","","","","punct","","","//"
"","</s>","","","","","","",""
"","<s number = ""38"">","","","","","","",""
"1","//","","","","punct","","","//"
"","</s>","","","","","","",""
"","<s number = ""39"">","","","","","","",""
"1","ghṛtam","GHṚT","am","ghṛta","noun-adj","","am","ghṛtam"
"2","iva","","","iva","ind","","","iva"
"3","payasi","PAYAS","i","payasa","noun-adj","","i","payasi"
"4","nigūḍham","NIGŪḌH","am","nigūḍha","","","am","nigūḍham"
"5","bhūte","BHŪT","e","bhūta","noun-adj","","e","bhūte"
"6","bhūte","BHŪT","e","bhūta","noun-adj","","e","bhūte"
"7","ca","","","ca","ind","","","ca"
"8","vasati","VASAT","i","vasati","noun-adj","","i","vasati"
"9","vijñānam","VIJÑĀN","am","vijñāna","noun-adj","","am","vijñānam"
"10","/","","","","punct","","","/"
"11","satatam","SATAT","am","satata","noun-adj","","am","satatam"
"12","manthayitavyam","MAN","thayitavyam","man","verb","","thayitavyam","manthayitavyam"
"13","manasā","MAN","asā","manas","noun-adj","","asā","manasā"
"14","manthāna","MANTHĀN","a","manthāna","noun-adj","","a","manthāna"
"15","bhūtena","BHŪT","ena","bhūta","noun-adj","","ena","bhūtena"
"16","//","","","","punct","","","//"
"","</s>","","","","","","",""
"","<s number = ""40"">","","","","","","",""
"1","//","","","","punct","","","//"
"","</s>","","","","","","",""
"","<s number = ""41"">","","","","","","",""
"1","jñāna","JÑĀN","a","jñāna","noun-adj","","a","jñāna"
"2","netram","NETR","am","netra","noun-adj","","am","netram"
"3","samādāya","SAMĀDĀY","a","samādāya","noun-adj","","a","samādāya"
"4","caret","CAR","et","car","verb","car","et","caret"
"5","vahnim","VAHN","im","vahni","noun-adj","","im","vahnim"
"6","atas","","","atas","ind","","","atas"
"7","param","PARAM","","parama","noun-adj","","","param"
"8","/","","","","punct","","","/"
"9","niṣ","","","niḥ_privativum","ind","","","niḥ_privativum"
"10","kalam","KAL","am","kala","noun-adj","","am","kalam"
"11","nirmalam","NIRMAL","am","nirmala","noun-adj","","am","nirmalam"
"12","śāntam","ŚĀNT","am","śānta","noun-adj","","am","śāntam"
"13","tat","TAT","","tad","pron","","","tat"
"14","brahmā","BRAHM","ā","brahman","noun-adj","","ā","brahmā"
"15","aham","AHAM","","mat","pron","","","aham"
"16","iti","","","iti","ind","","","iti"
"17","smṛtam","SMṚT","am","smṛta","noun-adj","","am","smṛtam"
"18","//","","","","punct","","","//"
"","</s>","","","","","","",""
"","<s number = ""42"">","","","","","","",""
"1","//","","","","punct","","","//"
"","</s>","","","","","","",""
"","<s number = ""43"">","","","","","","",""
"1","sarva","SARV","a","sarva","noun-adj","","a","sarva"
"2","bhūta","BHŪT","a","bhūta","noun-adj","","a","bhūta"
"3","adhivāsam","ADHIVĀS","am","adhivāsa","","","am","adhivāsam"
"4","ca","","","ca","ind","","","ca"
"5","yat","","","yad","pron","","","yad"
"6","bhūteṣu","BHŪT","eṣu","bhūta","noun-adj","","eṣu","bhūteṣu"
"7","vasati","VASAT","i","vasati","noun-adj","","i","vasati"
"8","adhi","ADH","i","adhi","noun-adj","","i","adhi"
"9","/","","","","punct","","","/"
"10","sarva","SARV","a","sarva","noun-adj","","a","sarva"
"11","anugrāhakat","ANUGRĀHAK","at","anugrāhaka","","","at","anugrāhakat"
"12","vena","VEN","a","vena","","","a","vena"
"13","tat","TAT","","tad","pron","","","tat"
"14","asmi","","","as","verb","as","",""
"15","aham","AHAM","","mat","pron","","","aham"
"16","vāsudevaḥ","VĀSUDEV","aḥ","vāsudeva","","","aḥ","vāsudevaḥ"
"17","//","","","","punct","","","//"
"","</s>","","","","","","",""
"","<s number = ""44"">","","","","","","",""
"1","//","","","","punct","","","//"
"","</s>","","","","","","",""
