"WordID","word","NormSTEM","suffix","lemma","PoS","Root","NormSuffix","NormWord"
1,"vaiśampāyana","_","_","vaiśampāyana","NC","","_","_"
2,"uvāca","_","_","vak","V","vac","_","_"
1,"tato","_","_","tatas","CX","","_","_"
2,"garbhaḥ","_","_","garbha","NC","","_","_"
3,"samabhavat","_","_","sambhav","V","sambhū","_","_"
4,"pṛthāyāḥ","_","_","pṛthā","NC","","_","_"
5,"pṛthivīpate","_","_","pṛthivīpati","NC","","_","_"
1,"śukle","_","_","śukla","NC","","_","_"
2,"_","_","_","daśan","NUM","","_","_"
3,"_","_","_","uttara","JJ","","_","_"
4,"pakṣe","_","_","pakṣa","NC","","_","_"
5,"tārāpatir","_","_","tārāpati","NC","","_","_"
6,"_","_","_","iva","CCM","","_","_"
7,"_","_","_","ambara","NC","","_","_"
1,"sā","_","_","tad","PRD","","_","_"
2,"_","_","_","bāndhava","NC","","_","_"
3,"_","_","_","bhaya","NC","","_","_"
4,"bālā","_","_","bāla","JJ","","_","_"
5,"taṃ","_","_","tad","PRD","","_","_"
6,"garbhaṃ","_","_","garbha","NC","","_","_"
7,"vinigūhatī","_","_","viniguh","KDP","","_","_"
1,"dhārayāmāsa","_","_","dhāray","V","dhāray","_","_"
2,"suśroṇī","_","_","suśroṇī","NC","","_","_"
3,"na","_","_","na","CNG","","_","_"
4,"_","_","_","ca","CCD","","_","_"
5,"_","_","_","a","PRD","","_","_"
6,"bubudhe","_","_","bodh","V","budh","_","_"
7,"janaḥ","_","_","jana","NC","","_","_"
1,"na","_","_","na","CNG","","_","_"
2,"hi","_","_","hi","CX","","_","_"
3,"tāṃ","_","_","tad","PRD","","_","_"
4,"veda","_","_","vid","V","vid","_","_"
5,"_","_","_","nārī","NC","","_","_"
6,"_","_","_","anya","PPX","","_","_"
7,"kācid","_","_","kiṃcit","PRI","","_","_"
8,"dhātreyikām","_","_","dhātreyikā","NC","","_","_"
9,"ṛte","_","_","ṛte","CX","","_","_"
1,"_","_","_","kanyā","NC","","_","_"
2,"_","_","_","pura","NC","","_","_"
3,"_","_","_","ga","PPP","","_","_"
4,"bālāṃ","_","_","bāla","JJ","","_","_"
5,"nipuṇāṃ","_","_","nipuṇa","JJ","","_","_"
6,"parirakṣaṇe","_","_","parirakṣaṇa","NC","","_","_"
1,"tataḥ","_","_","tatas","CX","","_","_"
2,"kālena","_","_","kāla","NC","","_","_"
3,"sā","_","_","tad","PRD","","_","_"
4,"garbhaṃ","_","_","garbha","NC","","_","_"
5,"suṣuve","_","_","suv","V","sū","_","_"
6,"varavarṇinī","_","_","varavarṇinī","NC","","_","_"
1,"_","_","_","kanyā","NC","","_","_"
2,"_","_","_","eva","CEM","","_","_"
3,"tasya","_","_","tad","PRD","","_","_"
4,"devasya","_","_","deva","NC","","_","_"
5,"prasādād","_","_","prasāda","NC","","_","_"
6,"_","_","_","amara","NC","","_","_"
7,"_","_","_","prabhā","NC","","_","_"
1,"_","_","_","tathā","CX","","_","_"
2,"_","_","_","eva","CEM","","_","_"
3,"_","_","_","bandh","PPP","","_","_"
4,"_","_","_","kavaca","NC","","_","_"
5,"_","_","_","kanaka","NC","","_","_"
6,"_","_","_","ujjvala","JJ","","_","_"
7,"_","_","_","kuṇḍala","NC","","_","_"
1,"_","_","_","hari","JJ","","_","_"
2,"_","_","_","akṣa","NC","","_","_"
3,"_","_","_","vṛṣabha","NC","","_","_"
4,"_","_","_","skandha","NC","","_","_"
5,"_","_","_","yathā","CCM","","_","_"
6,"_","_","_","ida","PRD","","_","_"
7,"pitaraṃ","_","_","pitṛ","NC","","_","_"
8,"tathā","_","_","tathā","CX","","_","_"
1,"_","_","_","jan","PPP","","_","_"
2,"_","_","_","mātra","NC","","_","_"
3,"ca","_","_","ca","CCD","","_","_"
4,"taṃ","_","_","tad","PRD","","_","_"
5,"garbhaṃ","_","_","garbha","NC","","_","_"
6,"dhātryā","_","_","dhātrī","NC","","_","_"
7,"saṃmantrya","_","_","sammantray","CGDA","","_","_"
8,"bhāminī","_","_","bhāminī","NC","","_","_"
1,"mañjūṣāyām","_","_","mañjūṣā","NC","","_","_"
2,"avadadhe","_","_","avadadh","V","avadhā","_","_"
3,"_","_","_","su","CAD","","_","_"
4,"_","_","_","āstṛ","PPP","","_","_"
5,"samantataḥ","_","_","samantataḥ","CX","","_","_"
1,"_","_","_","madhūcchiṣṭa","NC","","_","_"
2,"_","_","_","sthā","PPP","","_","_"
3,"sā","_","_","tad","PRD","","_","_"
4,"sukhāyāṃ","_","_","sukha","JJ","","_","_"
5,"rudatī","_","_","rud","KDP","","_","_"
6,"tathā","_","_","tathā","CX","","_","_"
1,"ślakṣṇāyāṃ","_","_","ślakṣṇa","JJ","","_","_"
2,"supidhānāyām","_","_","supidhāna","JJ","","_","_"
3,"aśvanadyām","_","_","aśvanadī","NC","","_","_"
4,"avāsṛjat","_","_","avasṛj","V","avasṛj","_","_"
1,"jānatī","_","_","jñā","KDP","","_","_"
2,"_","_","_","ca","CCD","","_","_"
3,"_","_","_","api","CX","","_","_"
4,"a","_","_","alpha_privativum","JJ","","_","_"
4,"_","_","_","kartavya","JJ","","_","_"
5,"kanyāyā","_","_","kanyā","NC","","_","_"
6,"_","_","_","garbha","NC","","_","_"
7,"_","_","_","dhāraṇa","NC","","_","_"
1,"_","_","_","putra","NC","","_","_"
2,"_","_","_","sneha","NC","","_","_"
3,"_","_","_","rājan","NC","","_","_"
4,"_","_","_","indra","NC","","_","_"
5,"karuṇaṃ","_","_","karuṇa","JJ","","_","_"
6,"paryadevayat","_","_","paridevay","V","paridevay","_","_"
1,"samutsṛjantī","_","_","samutsṛj","KDP","","_","_"
2,"mañjūṣām","_","_","mañjūṣā","NC","","_","_"
3,"aśvanadyās","_","_","aśvanadī","NC","","_","_"
4,"tadā","_","_","tadā","CAD","","_","_"
5,"jale","_","_","jala","NC","","_","_"
1,"uvāca","_","_","vak","V","vac","_","_"
2,"rudatī","_","_","rud","KDP","","_","_"
3,"kuntī","_","_","kuntī","NC","","_","_"
4,"yāni","_","_","yad","PRL","","_","_"
5,"vākyāni","_","_","vākya","NC","","_","_"
6,"_","_","_","tad","PRD","","_","_"
7,"_","_","_","śṛṇ","V","śru","_","_"
1,"svasti","_","_","svasti","NC","","_","_"
2,"te","_","_","tvat","PPR","","_","_"
3,"_","_","_","as","V","as","_","_"
4,"_","_","_","āntarikṣa","JJ","","_","_"
5,"pārthivebhyaś","_","_","pārthiva","JJ","","_","_"
6,"ca","_","_","ca","CCD","","_","_"
7,"putraka","_","_","putraka","NC","","_","_"
1,"_","_","_","divya","JJ","","_","_"
2,"_","_","_","ca","CCD","","_","_"
3,"_","_","_","eva","CEM","","_","_"
4,"bhūtebhyas","_","_","bhūta","NC","","_","_"
5,"tathā","_","_","tathā","CX","","_","_"
6,"_","_","_","toya","NC","","_","_"
7,"_","_","_","cara","JJ","","_","_"
8,"_","_","_","ca","CCD","","_","_"
9,"ye","_","_","yad","PRL","","_","_"
1,"_","_","_","śiva","JJ","","_","_"
2,"_","_","_","tvat","PPR","","_","_"
3,"santu","_","_","as","V","as","_","_"
4,"panthāno","_","_","pathin","NC","","_","_"
5,"mā","_","_","mā","CNG","","_","_"
6,"ca","_","_","ca","CCD","","_","_"
7,"te","_","_","tvat","PPR","","_","_"
8,"paripanthinaḥ","_","_","paripanthin","JJ","","_","_"
1,"āgamāś","_","_","āgama","NC","","_","_"
2,"ca","_","_","ca","CCD","","_","_"
3,"tathā","_","_","tathā","CX","","_","_"
4,"putra","_","_","putra","NC","","_","_"
5,"_","_","_","bhav","V","bhū","_","_"
6,"_","_","_","adroha","NC","","_","_"
7,"_","_","_","cetas","NC","","_","_"
1,"pātu","_","_","pib","V","pā","_","_"
2,"tvāṃ","_","_","tvat","PPR","","_","_"
3,"varuṇo","_","_","varuṇa","NC","","_","_"
4,"rājā","_","_","rājan","NC","","_","_"
5,"salile","_","_","salila","NC","","_","_"
6,"salileśvaraḥ","_","_","salileśvara","NC","","_","_"
1,"antarikṣe","_","_","antarikṣa","NC","","_","_"
2,"_","_","_","antarikṣa","NC","","_","_"
3,"_","_","_","stha","JJ","","_","_"
4,"pavanaḥ","_","_","pavana","NC","","_","_"
5,"sarvagas","_","_","sarvaga","NC","","_","_"
6,"tathā","_","_","tathā","CX","","_","_"
1,"pitā","_","_","pitṛ","NC","","_","_"
2,"tvāṃ","_","_","tvat","PPR","","_","_"
3,"pātu","_","_","pib","V","pā","_","_"
4,"sarvatra","_","_","sarvatra","CX","","_","_"
5,"tapanas","_","_","tapana","JJ","","_","_"
6,"tapatāṃ","_","_","tap","KDP","","_","_"
7,"varaḥ","_","_","vara","JJ","","_","_"
1,"yena","_","_","yad","PRL","","_","_"
2,"datto","_","_","dā","PPP","","_","_"
3,"'si","_","_","as","V","as","_","_"
4,"me","_","_","mat","PPR","","_","_"
5,"putra","_","_","putra","NC","","_","_"
6,"divyena","_","_","divya","JJ","","_","_"
7,"vidhinā","_","_","vidhi","NC","","_","_"
8,"kila","_","_","kila","CX","","_","_"
1,"ādityā","_","_","āditya","NC","","_","_"
2,"vasavo","_","_","vasu","NC","","_","_"
3,"rudrāḥ","_","_","rudra","NC","","_","_"
4,"sādhyā","_","_","sādhya","NC","","_","_"
5,"viśve","_","_","viśva","JQ","","_","_"
6,"ca","_","_","ca","CCD","","_","_"
7,"devatāḥ","_","_","devatā","NC","","_","_"
1,"marutaś","_","_","marut","NC","","_","_"
2,"ca","_","_","ca","CCD","","_","_"
3,"_","_","_","saha","CX","","_","_"
4,"_","_","_","indra","NC","","_","_"
5,"diśaś","_","_","diś","NC","","_","_"
6,"ca","_","_","ca","CCD","","_","_"
7,"_","_","_","sa_saha","CX","","_","_"
8,"_","_","_","digīśvara","NC","","_","_"
1,"rakṣantu","_","_","rakṣ","V","rakṣ","_","_"
2,"tvāṃ","_","_","tvat","PPR","","_","_"
3,"surāḥ","_","_","sura","NC","","_","_"
4,"sarve","_","_","sarva","JQ","","_","_"
5,"sameṣu","_","_","sama","PPX","","_","_"
6,"viṣameṣu","_","_","viṣama","JJ","","_","_"
7,"ca","_","_","ca","CCD","","_","_"
1,"vetsyāmi","_","_","vid","V","vid","_","_"
2,"tvāṃ","_","_","tvat","PPR","","_","_"
3,"videśe","_","_","videśa","NC","","_","_"
4,"'pi","_","_","api","CX","","_","_"
5,"_","_","_","kavaca","NC","","_","_"
6,"_","_","_","upasūcay","PPP","","_","_"
1,"dhanyas","_","_","dhanya","JJ","","_","_"
2,"te","_","_","tvat","PPR","","_","_"
3,"putra","_","_","putra","NC","","_","_"
4,"janako","_","_","janaka","NC","","_","_"
5,"devo","_","_","deva","NC","","_","_"
6,"bhānur","_","_","bhānu","NC","","_","_"
7,"vibhāvasuḥ","_","_","vibhāvasu","NC","","_","_"
1,"_","_","_","yad","PRL","","_","_"
2,"_","_","_","tvat","PPR","","_","_"
3,"drakṣyati","_","_","darś","V","dṛś","_","_"
4,"divyena","_","_","divya","JJ","","_","_"
5,"cakṣuṣā","_","_","cakṣus","NC","","_","_"
6,"_","_","_","vāhinī","NC","","_","_"
7,"_","_","_","ga","PPP","","_","_"
1,"dhanyā","_","_","dhanya","JJ","","_","_"
2,"sā","_","_","tad","PRD","","_","_"
3,"pramadā","_","_","pramadā","NC","","_","_"
4,"yā","_","_","yad","PRL","","_","_"
5,"tvāṃ","_","_","tvat","PPR","","_","_"
6,"_","_","_","putra","NC","","_","_"
8,"kalpayiṣyati","_","_","kalpay","V","kalpay","_","_"
1,"_","_","_","yad","PRL","","_","_"
2,"_","_","_","tvat","PPR","","_","_"
3,"tṛṣitaḥ","_","_","tṛṣita","JJ","","_","_"
4,"putra","_","_","putra","NC","","_","_"
5,"stanaṃ","_","_","stana","NC","","_","_"
6,"pāsyasi","_","_","pib","V","pā","_","_"
7,"_","_","_","deva","NC","","_","_"
8,"_","_","_","ja","JJ","","_","_"
1,"ko","_","_","kiṃ","PRQ","","_","_"
2,"nu","_","_","nu","CX","","_","_"
3,"_","_","_","svapna","NC","","_","_"
4,"_","_","_","tad","PRD","","_","_"
5,"dṛṣṭo","_","_","dṛś","PPP","","_","_"
6,"yā","_","_","yad","PRL","","_","_"
7,"tvām","_","_","tvat","PPR","","_","_"
8,"_","_","_","āditya","NC","","_","_"
9,"_","_","_","varcas","NC","","_","_"
1,"_","_","_","divya","JJ","","_","_"
2,"_","_","_","varman","NC","","_","_"
3,"_","_","_","samāyuj","PPP","","_","_"
4,"_","_","_","divya","JJ","","_","_"
5,"_","_","_","kuṇḍala","NC","","_","_"
6,"_","_","_","bhūṣay","PPP","","_","_"
1,"_","_","_","padma","NC","","_","_"
2,"_","_","_","āya","PPP","","_","_"
3,"_","_","_","viśāla","JJ","","_","_"
4,"_","_","_","akṣa","NC","","_","_"
5,"_","_","_","padma","NC","","_","_"
6,"_","_","_","tāmra","NC","","_","_"
7,"_","_","_","tala","NC","","_","_"
8,"_","_","_","ujjvala","JJ","","_","_"
1,"_","_","_","su","CAD","","_","_"
2,"_","_","_","lalāṭa","NC","","_","_"
3,"_","_","_","su","CAD","","_","_"
4,"_","_","_","keśānta","NC","","_","_"
5,"_","_","_","putra","NC","","_","_"
7,"kalpayiṣyati","_","_","kalpay","V","kalpay","_","_"
1,"dhanyā","_","_","dhanya","JJ","","_","_"
2,"drakṣyanti","_","_","darś","V","dṛś","_","_"
3,"putra","_","_","putra","NC","","_","_"
4,"tvāṃ","_","_","tvat","PPR","","_","_"
5,"bhūmau","_","_","bhūmi","NC","","_","_"
6,"saṃsarpamāṇakam","_","_","saṃsarpamāṇaka","JJ","","_","_"
1,"_","_","_","avyakta","JJ","","_","_"
2,"_","_","_","kala","JJ","","_","_"
3,"_","_","_","vākya","NC","","_","_"
4,"vadantaṃ","_","_","vad","KDP","","_","_"
5,"_","_","_","reṇu","NC","","_","_"
6,"_","_","_","guṇṭhay","PPP","","_","_"
1,"dhanyā","_","_","dhanya","JJ","","_","_"
2,"drakṣyanti","_","_","darś","V","dṛś","_","_"
3,"putra","_","_","putra","NC","","_","_"
4,"tvāṃ","_","_","tvat","PPR","","_","_"
5,"punar","_","_","punar","CAD","","_","_"
6,"_","_","_","yauvana","NC","","_","_"
7,"_","_","_","ga","JJ","","_","_"
8,"mukhe","_","_","mukha","NC","","_","_"
1,"_","_","_","himavat","NC","","_","_"
2,"_","_","_","vana","NC","","_","_"
3,"_","_","_","sambhū","PPP","","_","_"
4,"siṃhaṃ","_","_","siṃha","NC","","_","_"
5,"kesariṇaṃ","_","_","kesarin","NC","","_","_"
6,"yathā","_","_","yathā","CCM","","_","_"
1,"evaṃ","_","_","eva","CX","","_","_"
2,"bahuvidhaṃ","_","_","bahuvidha","JJ","","_","_"
3,"rājan","_","_","rājan","NC","","_","_"
4,"vilapya","_","_","vilap","CGDA","","_","_"
5,"karuṇaṃ","_","_","karuṇa","JJ","","_","_"
6,"pṛthā","_","_","pṛthā","NC","","_","_"
1,"avāsṛjata","_","_","avasṛj","V","avasṛj","_","_"
2,"mañjūṣām","_","_","mañjūṣā","NC","","_","_"
3,"_","_","_","aśvanadī","NC","","_","_"
4,"_","_","_","tadā","CAD","","_","_"
5,"jale","_","_","jala","NC","","_","_"
1,"rudatī","_","_","rud","KDP","","_","_"
2,"_","_","_","putra","NC","","_","_"
3,"_","_","_","śoka","NC","","_","_"
4,"_","_","_","ārta","JJ","","_","_"
5,"niśīthe","_","_","niśītha","NC","","_","_"
6,"_","_","_","kamala","NC","","_","_"
7,"_","_","_","īkṣaṇa","NC","","_","_"
1,"dhātryā","_","_","dhātrī","NC","","_","_"
2,"saha","_","_","saha","CX","","_","_"
3,"pṛthā","_","_","pṛthā","NC","","_","_"
4,"rājan","_","_","rājan","NC","","_","_"
5,"_","_","_","putra","NC","","_","_"
6,"_","_","_","darśana","NC","","_","_"
7,"_","_","_","lālasa","JJ","","_","_"
1,"visarjayitvā","_","_","visarjay","CGDA","","_","_"
2,"mañjūṣāṃ","_","_","mañjūṣā","NC","","_","_"
3,"_","_","_","sambodhana","NC","","_","_"
4,"_","_","_","bhaya","NC","","_","_"
5,"pituḥ","_","_","pitṛ","NC","","_","_"
1,"viveśa","_","_","viś","V","viś","_","_"
2,"_","_","_","rājan","NC","","_","_"
3,"_","_","_","bhavana","NC","","_","_"
4,"punaḥ","_","_","punar","CAD","","_","_"
5,"_","_","_","śoka","NC","","_","_"
6,"_","_","_","ātura","JJ","","_","_"
7,"tataḥ","_","_","tatas","CX","","_","_"
1,"mañjūṣā","_","_","mañjūṣā","NC","","_","_"
2,"_","_","_","tu","CCD","","_","_"
3,"_","_","_","aśvanadī","NC","","_","_"
4,"sā","_","_","tad","PRD","","_","_"
5,"yayau","_","_","yā","V","yā","_","_"
6,"carmaṇvatīṃ","_","_","carmaṇvatī","NC","","_","_"
7,"nadīm","_","_","nadī","NC","","_","_"
1,"carmaṇvatyāś","_","_","carmaṇvatī","NC","","_","_"
2,"ca","_","_","ca","CCD","","_","_"
3,"yamunāṃ","_","_","yamunā","NC","","_","_"
4,"tato","_","_","tatas","CX","","_","_"
5,"gaṅgāṃ","_","_","gaṅgā","NC","","_","_"
6,"jagāma","_","_","ga","V","ga","_","_"
7,"ha","_","_","ha","CEM","","_","_"
1,"gaṅgāyāḥ","_","_","gaṅgā","NC","","_","_"
2,"_","_","_","sūta","NC","","_","_"
3,"_","_","_","viṣaya","NC","","_","_"
4,"campām","_","_","campā","NC","","_","_"
5,"abhyāyayau","_","_","abhyāyaya","V","abhyāyā","_","_"
6,"purīm","_","_","purī","NC","","_","_"
1,"sa","_","_","tad","PRD","","_","_"
2,"_","_","_","mañjūṣā","NC","","_","_"
3,"_","_","_","ga","PPP","","_","_"
4,"garbhas","_","_","garbha","NC","","_","_"
5,"taraṃgair","_","_","taraṃga","NC","","_","_"
6,"uhyamānakaḥ","_","_","uhyamānaka","JJ","","_","_"
1,"amṛtād","_","_","amṛta","NC","","_","_"
2,"utthitaṃ","_","_","utthā","PPP","","_","_"
3,"divyaṃ","_","_","divya","JJ","","_","_"
4,"tat","_","_","tad","PRD","","_","_"
5,"tu","_","_","tu","CCD","","_","_"
6,"varma","_","_","varman","NC","","_","_"
7,"_","_","_","sa_saha","CX","","_","_"
8,"_","_","_","kuṇḍala","NC","","_","_"
1,"dhārayāmāsa","_","_","dhāray","V","dhāray","_","_"
2,"taṃ","_","_","tad","PRD","","_","_"
3,"garbhaṃ","_","_","garbha","NC","","_","_"
4,"daivaṃ","_","_","daiva","NC","","_","_"
5,"ca","_","_","ca","CCD","","_","_"
6,"_","_","_","vidhi","NC","","_","_"
7,"_","_","_","nirmā","PPP","","_","_"
