"WordID","word","NormSTEM","suffix","lemma","PoS","Root","NormSuffix","NormWord"
1,"yudhiṣṭhira","_","_","yudhiṣṭhira","NC","","_","_"
2,"uvāca","_","_","vak","V","vac","_","_"
1,"pitāmaha","_","_","pitāmaha","NC","","_","_"
2,"_","_","_","mahat","JJ","","_","_"
3,"_","_","_","prājña","JJ","","_","_"
4,"saṃśayo","_","_","saṃśaya","NC","","_","_"
5,"me","_","_","mat","PPR","","_","_"
6,"mahān","_","_","mahat","JJ","","_","_"
7,"ayam","_","_","ida","PRD","","_","_"
1,"sa","_","_","tad","PRD","","_","_"
2,"_","_","_","chid","KDG","","_","_"
3,"_","_","_","tvat","PPR","","_","_"
4,"rājan","_","_","rājan","NC","","_","_"
5,"bhavān","_","_","bhavat","JJ","","_","_"
6,"_","_","_","kula","NC","","_","_"
7,"_","_","_","kara","JJ","","_","_"
8,"hi","_","_","hi","CX","","_","_"
9,"naḥ","_","_","mat","PPR","","_","_"
1,"puruṣāṇām","_","_","puruṣa","NC","","_","_"
2,"ayaṃ","_","_","ida","PRD","","_","_"
3,"tāta","_","_","tāta","NC","","_","_"
4,"durvṛttānāṃ","_","_","durvṛtta","JJ","","_","_"
5,"durātmanām","_","_","durātman","JJ","","_","_"
1,"kathito","_","_","kathay","PPP","","_","_"
2,"_","_","_","vākya","NC","","_","_"
3,"_","_","_","saṃcāra","NC","","_","_"
4,"_","_","_","tatas","CX","","_","_"
5,"vijñāpayāmi","_","_","vijān","V","vijñā","_","_"
6,"te","_","_","tvat","PPR","","_","_"
1,"_","_","_","yad","PRL","","_","_"
2,"_","_","_","hita","JJ","","_","_"
3,"_","_","_","rājya","NC","","_","_"
4,"_","_","_","tantra","NC","","_","_"
5,"kulasya","_","_","kula","NC","","_","_"
6,"ca","_","_","ca","CCD","","_","_"
7,"_","_","_","sukha","NC","","_","_"
8,"_","_","_","udaya","NC","","_","_"
1,"āyatyāṃ","_","_","āyati","NC","","_","_"
2,"ca","_","_","ca","CCD","","_","_"
3,"tadātve","_","_","tadātva","NC","","_","_"
4,"ca","_","_","ca","CCD","","_","_"
5,"_","_","_","kṣema","NC","","_","_"
6,"_","_","_","vṛddhi","NC","","_","_"
7,"_","_","_","kara","JJ","","_","_"
8,"ca","_","_","ca","CCD","","_","_"
9,"yat","_","_","yad","PRL","","_","_"
1,"_","_","_","putra","NC","","_","_"
2,"_","_","_","pautra","NC","","_","_"
3,"_","_","_","abhirāma","JJ","","_","_"
4,"ca","_","_","ca","CCD","","_","_"
5,"_","_","_","rāṣṭra","NC","","_","_"
6,"_","_","_","vṛddhi","NC","","_","_"
7,"_","_","_","kara","JJ","","_","_"
8,"ca","_","_","ca","CCD","","_","_"
9,"yat","_","_","yad","PRL","","_","_"
1,"_","_","_","anna","NC","","_","_"
2,"_","_","_","pāna","NC","","_","_"
3,"śarīre","_","_","śarīra","NC","","_","_"
4,"ca","_","_","ca","CCD","","_","_"
5,"hitaṃ","_","_","hita","JJ","","_","_"
6,"yat","_","_","yad","PRL","","_","_"
7,"tad","_","_","tad","PRD","","_","_"
8,"bravīhi","_","_","abravīta","V","brū","_","_"
9,"me","_","_","mat","PPR","","_","_"
1,"abhiṣikto","_","_","abhiṣic","PPP","","_","_"
2,"hi","_","_","hi","CX","","_","_"
3,"yo","_","_","yad","PRL","","_","_"
4,"rājā","_","_","rājan","NC","","_","_"
5,"_","_","_","rājya","NC","","_","_"
6,"_","_","_","stha","JJ","","_","_"
7,"_","_","_","mitra","NC","","_","_"
8,"_","_","_","saṃvṛ","PPP","","_","_"
1,"asuhṛt","_","_","asuhṛd","NC","","_","_"
2,"samupeto","_","_","samupe","PPP","","_","_"
3,"vā","_","_","vā","CCD","","_","_"
4,"sa","_","_","tad","PRD","","_","_"
5,"kathaṃ","_","_","katha","CX","","_","_"
6,"rañjayet","_","_","raj","V","raj","_","_"
7,"prajāḥ","_","_","prajā","NC","","_","_"
1,"yo","_","_","yad","PRL","","_","_"
2,"_","_","_","hi","CX","","_","_"
3,"_","_","_","asat","JJ","","_","_"
4,"_","_","_","pragraha","NC","","_","_"
5,"_","_","_","rati","NC","","_","_"
6,"_","_","_","sneha","NC","","_","_"
7,"_","_","_","rāga","NC","","_","_"
8,"_","_","_","balātkṛta","JJ","","_","_"
1,"indriyāṇām","_","_","indriya","NC","","_","_"
2,"_","_","_","anīśa","JJ","","_","_"
4,"_","_","_","asat","JJ","","_","_"
5,"_","_","_","jana","NC","","_","_"
6,"_","_","_","bubhūṣaka","JJ","","_","_"
1,"tasya","_","_","tad","PRD","","_","_"
2,"bhṛtyā","_","_","bhṛtya","NC","","_","_"
3,"_","_","_","viguṇa","JJ","","_","_"
5,"yānti","_","_","yā","V","yā","_","_"
6,"sarve","_","_","sarva","JQ","","_","_"
7,"_","_","_","kula","NC","","_","_"
8,"_","_","_","udga","PPP","","_","_"
1,"na","_","_","na","CNG","","_","_"
2,"ca","_","_","ca","CCD","","_","_"
3,"_","_","_","bhṛtya","NC","","_","_"
4,"_","_","_","phala","NC","","_","_"
5,"arthaiḥ","_","_","artha","NC","","_","_"
6,"sa","_","_","tad","PRD","","_","_"
7,"rājā","_","_","rājan","NC","","_","_"
8,"samprayujyate","_","_","samprayuj","V","saṃprayuj","_","_"
1,"_","_","_","tad","PRD","","_","_"
2,"_","_","_","mat","PPR","","_","_"
3,"_","_","_","saṃśaya","NC","","_","_"
4,"_","_","_","stha","JJ","","_","_"
5,"_","_","_","rājan","NC","","_","_"
6,"_","_","_","dharma","NC","","_","_"
7,"_","_","_","su","CAD","","_","_"
8,"_","_","_","durlabha","JJ","","_","_"
1,"_","_","_","bṛhaspati","NC","","_","_"
2,"_","_","_","sama","PPX","","_","_"
3,"buddhyā","_","_","buddhi","NC","","_","_"
4,"bhavāñ","_","_","bhavat","JJ","","_","_"
5,"śaṃsitum","_","_","śaṃs","CGDI","","_","_"
6,"arhati","_","_","arh","V","arh","_","_"
1,"śaṃsitā","_","_","śaṃsitṛ","NC","","_","_"
2,"_","_","_","puruṣa","NC","","_","_"
3,"_","_","_","vyāghra","NC","","_","_"
4,"tvaṃ","_","_","tvat","PPR","","_","_"
5,"naḥ","_","_","mat","PPR","","_","_"
6,"_","_","_","kula","NC","","_","_"
7,"_","_","_","hita","NC","","_","_"
8,"rataḥ","_","_","ra","PPP","","_","_"
1,"kṣattā","_","_","kṣattṛ","NC","","_","_"
2,"_","_","_","ca","CCD","","_","_"
3,"_","_","_","eva","CEM","","_","_"
4,"_","_","_","paṭu","JJ","","_","_"
5,"_","_","_","prajñā","NC","","_","_"
6,"yo","_","_","yad","PRL","","_","_"
7,"naḥ","_","_","mat","PPR","","_","_"
8,"śaṃsati","_","_","śaṃs","V","śaṃs","_","_"
9,"sarvadā","_","_","sarvadā","CX","","_","_"
1,"tvattaḥ","_","_","tvat","PPR","","_","_"
2,"_","_","_","kula","NC","","_","_"
3,"_","_","_","hita","JJ","","_","_"
4,"vākyaṃ","_","_","vākya","NC","","_","_"
5,"śrutvā","_","_","śru","CGDA","","_","_"
6,"_","_","_","rājya","NC","","_","_"
7,"_","_","_","hita","JJ","","_","_"
8,"_","_","_","udaya","NC","","_","_"
1,"_","_","_","amṛta","NC","","_","_"
2,"_","_","_","avyaya","JJ","","_","_"
3,"_","_","_","iva","CCM","","_","_"
4,"tṛptaḥ","_","_","tṛp","PPP","","_","_"
5,"_","_","_","svap","V","svap","_","_"
6,"_","_","_","mat","PPR","","_","_"
7,"sukham","_","_","sukha","CX","","_","_"
1,"kīdṛśāḥ","_","_","kīdṛśa","JJ","","_","_"
2,"_","_","_","saṃnikarṣa","NC","","_","_"
3,"_","_","_","stha","JJ","","_","_"
4,"bhṛtyāḥ","_","_","bhṛtya","NC","","_","_"
5,"syur","_","_","as","V","as","_","_"
6,"vā","_","_","vā","CCD","","_","_"
7,"_","_","_","guṇa","NC","","_","_"
8,"_","_","_","anvita","JJ","","_","_"
1,"kīdṛśaiḥ","_","_","kīdṛśa","JJ","","_","_"
2,"kiṃkulīnair","_","_","kiṃkulīna","JJ","","_","_"
3,"vā","_","_","vā","CCD","","_","_"
4,"saha","_","_","saha","CX","","_","_"
5,"yātrā","_","_","yātrā","NC","","_","_"
6,"vidhīyate","_","_","vidadh","V","vidhā","_","_"
1,"na","_","_","na","CNG","","_","_"
2,"_","_","_","hi","CX","","_","_"
3,"_","_","_","eka","PPX","","_","_"
4,"_","_","_","bhṛtya","NC","","_","_"
5,"_","_","_","rahita","JJ","","_","_"
6,"rājā","_","_","rājan","NC","","_","_"
7,"bhavati","_","_","bhav","V","bhū","_","_"
8,"rakṣitā","_","_","rakṣitṛ","JJ","","_","_"
1,"rājyaṃ","_","_","rājya","NC","","_","_"
2,"_","_","_","ca","CCD","","_","_"
3,"_","_","_","ida","PRD","","_","_"
4,"janaḥ","_","_","jana","NC","","_","_"
5,"_","_","_","sarva","JQ","","_","_"
6,"_","_","_","tad","PRD","","_","_"
7,"kulīno","_","_","kulīna","JJ","","_","_"
8,"'bhiśaṃsati","_","_","abhiśaṃs","V","abhiśaṃs","_","_"
1,"na","_","_","na","CNG","","_","_"
2,"hi","_","_","hi","CX","","_","_"
3,"praśāstuṃ","_","_","praśās","CGDI","","_","_"
4,"rājyaṃ","_","_","rājya","NC","","_","_"
5,"hi","_","_","hi","CX","","_","_"
6,"śakyam","_","_","śakya","JJ","","_","_"
7,"ekena","_","_","eka","PPX","","_","_"
8,"bhārata","_","_","bhārata","NC","","_","_"
1,"asahāyavatā","_","_","asahāyavat","JJ","","_","_"
2,"tāta","_","_","tāta","NC","","_","_"
3,"_","_","_","na","CNG","","_","_"
4,"_","_","_","eva","CEM","","_","_"
5,"_","_","_","artha","NC","","_","_"
6,"kecid","_","_","kiṃcit","PRI","","_","_"
7,"_","_","_","api","CX","","_","_"
8,"_","_","_","uta","CCD","","_","_"
1,"labdhuṃ","_","_","labh","CGDI","","_","_"
2,"labdhvā","_","_","labh","CGDA","","_","_"
3,"_","_","_","ca","CCD","","_","_"
4,"_","_","_","api","CX","","_","_"
5,"sadā","_","_","sadā","CAD","","_","_"
6,"rakṣituṃ","_","_","rakṣ","CGDI","","_","_"
7,"_","_","_","bharata","NC","","_","_"
8,"_","_","_","ṛṣabha","NC","","_","_"
1,"bhīṣma","_","_","bhīṣma","NC","","_","_"
2,"uvāca","_","_","vak","V","vac","_","_"
1,"yasya","_","_","yad","PRL","","_","_"
2,"_","_","_","bhṛtya","NC","","_","_"
3,"_","_","_","jana","NC","","_","_"
4,"sarvo","_","_","sarva","JQ","","_","_"
5,"_","_","_","jñāna","NC","","_","_"
6,"_","_","_","vijñāna","NC","","_","_"
7,"_","_","_","kovida","JJ","","_","_"
1,"_","_","_","hita","NC","","_","_"
2,"_","_","_","eṣin","JJ","","_","_"
3,"_","_","_","kula","NC","","_","_"
4,"_","_","_","ja","JJ","","_","_"
5,"snigdhaḥ","_","_","snigdha","JJ","","_","_"
6,"sa","_","_","sa_saha","CX","","_","_"
7,"_","_","_","rājya","NC","","_","_"
8,"_","_","_","phala","NC","","_","_"
9,"aśnute","_","_","aśn","V","aś","_","_"
1,"mantriṇo","_","_","mantrin","NC","","_","_"
2,"yasya","_","_","yad","PRL","","_","_"
3,"_","_","_","kula","NC","","_","_"
4,"_","_","_","ja","JJ","","_","_"
5,"asaṃhāryāḥ","_","_","asaṃhārya","JJ","","_","_"
6,"_","_","_","saha","CX","","_","_"
7,"_","_","_","vas","PPP","","_","_"
1,"nṛpater","_","_","nṛpati","NC","","_","_"
2,"_","_","_","mati","NC","","_","_"
3,"_","_","_","da","JJ","","_","_"
4,"santi","_","_","as","V","as","_","_"
5,"_","_","_","sambandha","NC","","_","_"
6,"_","_","_","jñāna","NC","","_","_"
7,"_","_","_","kovida","JJ","","_","_"
1,"_","_","_","anāgata","JJ","","_","_"
2,"_","_","_","vidhātṛ","NC","","_","_"
3,"_","_","_","kāla","NC","","_","_"
4,"_","_","_","jñāna","NC","","_","_"
5,"_","_","_","viśārada","JJ","","_","_"
1,"atikrāntam","_","_","atikra","PPP","","_","_"
2,"_","_","_","a","CNG","","_","_"
3,"_","_","_","śuc","KDP","","_","_"
4,"sa","_","_","tad","PRD","","_","_"
5,"_","_","_","rājya","NC","","_","_"
6,"_","_","_","phala","NC","","_","_"
7,"aśnute","_","_","aśn","V","aś","_","_"
1,"_","_","_","sama","PPX","","_","_"
2,"_","_","_","duḥkha","NC","","_","_"
3,"_","_","_","sukha","NC","","_","_"
4,"yasya","_","_","yad","PRL","","_","_"
5,"sahāyāḥ","_","_","sahāya","NC","","_","_"
6,"_","_","_","satya","NC","","_","_"
7,"_","_","_","kārin","JJ","","_","_"
1,"_","_","_","artha","NC","","_","_"
2,"_","_","_","cintā","NC","","_","_"
3,"_","_","_","para","PPX","","_","_"
4,"yasya","_","_","yad","PRL","","_","_"
5,"sa","_","_","tad","PRD","","_","_"
6,"_","_","_","rājya","NC","","_","_"
7,"_","_","_","phala","NC","","_","_"
8,"aśnute","_","_","aśn","V","aś","_","_"
1,"yasya","_","_","yad","PRL","","_","_"
2,"_","_","_","na","CNG","","_","_"
3,"_","_","_","ārta","JJ","","_","_"
4,"janapadaḥ","_","_","janapada","NC","","_","_"
5,"_","_","_","saṃnikarṣa","NC","","_","_"
6,"_","_","_","ga","PPP","","_","_"
7,"sadā","_","_","sadā","CAD","","_","_"
1,"akṣudraḥ","_","_","akṣudra","JJ","","_","_"
2,"_","_","_","sat","JJ","","_","_"
3,"_","_","_","patha","NC","","_","_"
4,"_","_","_","ālambin","JJ","","_","_"
5,"sa","_","_","tad","PRD","","_","_"
6,"_","_","_","rājya","NC","","_","_"
7,"_","_","_","phala","NC","","_","_"
8,"_","_","_","bhāj","JJ","","_","_"
9,"bhavet","_","_","bhav","V","bhū","_","_"
1,"_","_","_","kośa","NC","","_","_"
2,"_","_","_","akṣapaṭala","NC","","_","_"
3,"yasya","_","_","yad","PRL","","_","_"
4,"_","_","_","kośa","NC","","_","_"
5,"_","_","_","vṛddhi","NC","","_","_"
6,"_","_","_","kara","JJ","","_","_"
7,"janaiḥ","_","_","jana","NC","","_","_"
1,"_","_","_","āpta","NC","","_","_"
2,"_","_","_","tuṣ","PPP","","_","_"
3,"_","_","_","ca","CCD","","_","_"
4,"satataṃ","_","_","satata","CX","","_","_"
5,"dhāryate","_","_","dhar","V","dhṛ","_","_"
6,"sa","_","_","tad","PRD","","_","_"
7,"_","_","_","nṛpa","NC","","_","_"
8,"_","_","_","uttama","JJ","","_","_"
1,"koṣṭhāgāram","_","_","koṣṭhāgāra","NC","","_","_"
2,"asaṃhāryair","_","_","asaṃhārya","JJ","","_","_"
3,"āptaiḥ","_","_","āpta","NC","","_","_"
4,"_","_","_","saṃcaya","NC","","_","_"
5,"_","_","_","tatpara","JJ","","_","_"
1,"_","_","_","pātra","NC","","_","_"
2,"_","_","_","bhū","PPP","","_","_"
3,"_","_","_","alubdha","JJ","","_","_"
4,"_","_","_","ca","CCD","","_","_"
5,"pālyamānaṃ","_","_","pālay","KDP","","_","_"
6,"guṇībhavet","_","_","guṇībhū","V","guṇībhū","_","_"
1,"_","_","_","vyavahāra","NC","","_","_"
2,"_","_","_","ca","CCD","","_","_"
3,"nagare","_","_","nagara","NC","","_","_"
4,"yasya","_","_","yad","PRL","","_","_"
5,"_","_","_","karman","NC","","_","_"
6,"_","_","_","phala","NC","","_","_"
7,"_","_","_","udaya","NC","","_","_"
1,"dṛśyate","_","_","darś","V","dṛś","_","_"
2,"śaṅkhalikhitaḥ","_","_","śaṅkhalikhita","JJ","","_","_"
3,"sa","_","_","tad","PRD","","_","_"
4,"_","_","_","dharma","NC","","_","_"
5,"_","_","_","phala","NC","","_","_"
6,"_","_","_","bhāj","JJ","","_","_"
7,"bhavet","_","_","bhav","V","bhū","_","_"
1,"_","_","_","saṃgrah","PPP","","_","_"
2,"_","_","_","manuṣya","NC","","_","_"
3,"_","_","_","ca","CCD","","_","_"
4,"yo","_","_","yad","PRL","","_","_"
5,"rājā","_","_","rājan","NC","","_","_"
6,"_","_","_","rājan","NC","","_","_"
7,"_","_","_","dharma","NC","","_","_"
8,"_","_","_","vid","JJ","","_","_"
1,"ṣaḍvargaṃ","_","_","ṣaḍvarga","NC","","_","_"
2,"pratigṛhṇan","_","_","pratigrah","KDP","","_","_"
3,"sa","_","_","tad","PRD","","_","_"
4,"dharmāt","_","_","dharma","NC","","_","_"
5,"phalam","_","_","phala","NC","","_","_"
6,"upāśnute","_","_","upāśnuta","V","upāś","_","_"
