"WordID","word","NormSTEM","suffix","lemma","PoS","Root","NormSuffix","NormWord"
1,"ṛdhag","_","_","ṛdhak","CX","","_","_"
2,"itthā","_","_","itthā","CX","","_","_"
3,"sa","_","_","tad","PRD","","_","_"
4,"martyaḥ","_","_","martya","NC","","_","_"
5,"śaśame","_","_","śa","V","śa","_","_"
6,"devatātaye","_","_","devatāti","NC","","_","_"
1,"yo","_","_","yad","PRL","","_","_"
2,"nūnam","_","_","nūna","CX","","_","_"
3,"mitrāvaruṇāv","_","_","mitrāvaruṇa","NC","","_","_"
4,"abhiṣṭaya","_","_","abhiṣṭi","NC","","_","_"
5,"ācakre","_","_","ākar","V","ākṛ","_","_"
6,"_","_","_","havya","NC","","_","_"
7,"_","_","_","dāti","NC","","_","_"
1,"_","_","_","varṣiṣṭha","JJ","","_","_"
2,"_","_","_","kṣatra","NC","","_","_"
3,"_","_","_","uru","JJ","","_","_"
4,"_","_","_","cakṣas","NC","","_","_"
5,"narā","_","_","nṛ","NC","","_","_"
6,"rājānā","_","_","rājan","NC","","_","_"
7,"_","_","_","dīrgha","JJ","","_","_"
8,"_","_","_","śruttama","JJ","","_","_"
1,"tā","_","_","tad","PRD","","_","_"
2,"bāhutā","_","_","bāhutā","CX","","_","_"
3,"na","_","_","na","CNG","","_","_"
4,"daṃsanā","_","_","daṃsanā","NC","","_","_"
5,"ratharyataḥ","_","_","rathary","V","rathary","_","_"
6,"sākaṃ","_","_","sāka","CX","","_","_"
7,"sūryasya","_","_","sūrya","NC","","_","_"
8,"raśmibhiḥ","_","_","raśmi","NC","","_","_"
1,"pra","_","_","pra","CADP","","_","_"
2,"yo","_","_","yad","PRL","","_","_"
3,"vām","_","_","tvat","PPR","","_","_"
4,"_","_","_","mitrāvaruṇa","NC","","_","_"
5,"_","_","_","ajira","JJ","","_","_"
6,"dūto","_","_","dūta","NC","","_","_"
7,"adravat","_","_","dru","V","dru","_","_"
1,"_","_","_","ayas","NC","","_","_"
2,"_","_","_","śīrṣan","NC","","_","_"
3,"maderaghuḥ","_","_","maderaghu","JJ","","_","_"
1,"na","_","_","na","CNG","","_","_"
2,"yaḥ","_","_","yad","PRL","","_","_"
3,"saṃpṛcche","_","_","sampracch","CGDI","","_","_"
4,"na","_","_","na","CNG","","_","_"
5,"punar","_","_","punar","CAD","","_","_"
6,"havītave","_","_","hvā","CGDI","","_","_"
7,"na","_","_","na","CNG","","_","_"
8,"saṃvādāya","_","_","saṃvāda","NC","","_","_"
9,"ramate","_","_","ram","V","ram","_","_"
1,"tasmān","_","_","tad","PRD","","_","_"
2,"no","_","_","mat","PPR","","_","_"
3,"adya","_","_","adya","CX","","_","_"
4,"samṛter","_","_","samṛti","NC","","_","_"
5,"uruṣyatam","_","_","uruṣy","V","uruṣy","_","_"
6,"bāhubhyāṃ","_","_","bāhu","NC","","_","_"
7,"na","_","_","mat","PPR","","_","_"
8,"uruṣyatam","_","_","uruṣy","V","uruṣy","_","_"
1,"pra","_","_","pra","CADP","","_","_"
2,"mitrāya","_","_","mitra","NC","","_","_"
3,"_","_","_","pra","CADP","","_","_"
4,"_","_","_","aryaman","NC","","_","_"
5,"sacathyam","_","_","sacathya","JJ","","_","_"
6,"ṛtāvaso","_","_","ṛtāvasu","NC","","_","_"
1,"varūthyaṃ","_","_","varūthya","JJ","","_","_"
2,"varuṇe","_","_","varuṇa","NC","","_","_"
3,"chandyaṃ","_","_","chandya","JJ","","_","_"
4,"vaca","_","_","vacas","NC","","_","_"
5,"stotraṃ","_","_","stotra","NC","","_","_"
6,"rājasu","_","_","rājan","NC","","_","_"
7,"gāyata","_","_","gā","V","gā","_","_"
1,"te","_","_","tad","PRD","","_","_"
2,"hinvire","_","_","hi","V","hi","_","_"
3,"aruṇaṃ","_","_","aruṇa","JJ","","_","_"
4,"jenyaṃ","_","_","jenya","JJ","","_","_"
5,"vasv","_","_","vasu","NC","","_","_"
6,"ekam","_","_","eka","PPX","","_","_"
7,"putraṃ","_","_","putra","NC","","_","_"
8,"tisṝṇām","_","_","tri","NUM","","_","_"
1,"te","_","_","tad","PRD","","_","_"
2,"dhāmāny","_","_","dhāman","NC","","_","_"
3,"amṛtā","_","_","amṛta","JJ","","_","_"
4,"martyānām","_","_","martya","NC","","_","_"
5,"adabdhā","_","_","adabdha","JJ","","_","_"
6,"abhi","_","_","abhi","CADP","","_","_"
7,"cakṣate","_","_","cakṣ","V","cakṣ","_","_"
1,"ā","_","_","ā","CADP","","_","_"
2,"me","_","_","mat","PPR","","_","_"
3,"vacāṃsy","_","_","vacas","NC","","_","_"
4,"udyatā","_","_","udya","PPP","","_","_"
5,"dyumattamāni","_","_","dyumattama","JJ","","_","_"
6,"kartvā","_","_","kṛ","KDG","","_","_"
1,"ubhā","_","_","ubh","PPX","","_","_"
2,"yātaṃ","_","_","yā","V","yā","_","_"
3,"nāsatyā","_","_","nāsatya","NC","","_","_"
4,"sajoṣasā","_","_","sajoṣas","JJ","","_","_"
5,"prati","_","_","prati","CADP","","_","_"
6,"havyāni","_","_","havya","NC","","_","_"
7,"vītaye","_","_","vīti","NC","","_","_"
1,"rātiṃ","_","_","rāti","NC","","_","_"
2,"yad","_","_","yat","CSB","","_","_"
3,"vām","_","_","tvat","PPR","","_","_"
4,"arakṣasaṃ","_","_","arakṣas","JJ","","_","_"
5,"havāmahe","_","_","hvā","V","hvā","_","_"
6,"yuvābhyāṃ","_","_","tvat","PPR","","_","_"
7,"vājinīvasū","_","_","vājinīvasu","JJ","","_","_"
1,"prācīṃ","_","_","prāñc","JJ","","_","_"
2,"hotrām","_","_","hotrā","NC","","_","_"
3,"pratirantāv","_","_","pratṛ","KDP","","_","_"
4,"itaṃ","_","_","e","V","i","_","_"
5,"narā","_","_","nṛ","NC","","_","_"
6,"gṛṇānā","_","_","gṛ","KDP","","_","_"
7,"jamadagninā","_","_","jamadagni","NC","","_","_"
1,"ā","_","_","ā","CADP","","_","_"
2,"no","_","_","mat","PPR","","_","_"
3,"yajñaṃ","_","_","yajña","NC","","_","_"
4,"divispṛśaṃ","_","_","divispṛś","JJ","","_","_"
5,"vāyo","_","_","vāyu","NC","","_","_"
6,"yāhi","_","_","yā","V","yā","_","_"
7,"_","_","_","su","CAD","","_","_"
8,"_","_","_","manman","NC","","_","_"
1,"antaḥ","_","_","antar","CAD","","_","_"
2,"pavitra","_","_","pavitra","JJ","","_","_"
3,"upari","_","_","upari","CX","","_","_"
4,"śrīṇāno","_","_","śrī","KDP","","_","_"
5,"'yaṃ","_","_","ida","PRD","","_","_"
6,"śukro","_","_","śukra","JJ","","_","_"
7,"ayāmi","_","_","ya","V","ya","_","_"
8,"te","_","_","tvat","PPR","","_","_"
1,"vety","_","_","vye","V","vī","_","_"
2,"adhvaryuḥ","_","_","adhvaryu","NC","","_","_"
3,"pathibhī","_","_","pathin","NC","","_","_"
4,"rajiṣṭhaiḥ","_","_","rajiṣṭha","JJ","","_","_"
5,"prati","_","_","prati","CADP","","_","_"
6,"havyāni","_","_","havya","NC","","_","_"
7,"vītaye","_","_","vīti","NC","","_","_"
1,"adhā","_","_","adha","CX","","_","_"
2,"niyutva","_","_","niyutvat","JJ","","_","_"
3,"ubhayasya","_","_","ubhaya","JJ","","_","_"
4,"naḥ","_","_","mat","PPR","","_","_"
5,"piba","_","_","pib","V","pā","_","_"
6,"śuciṃ","_","_","śuci","JJ","","_","_"
7,"somaṃ","_","_","soma","NC","","_","_"
8,"gavāśiram","_","_","gavāśir","JJ","","_","_"
1,"baṇ","_","_","baṭ","CX","","_","_"
2,"mahāṁ","_","_","mahat","JJ","","_","_"
3,"asi","_","_","as","V","as","_","_"
4,"sūrya","_","_","sūrya","NC","","_","_"
5,"baﾱ","_","_","baṭ","CX","","_","_"
6,"āditya","_","_","āditya","NC","","_","_"
7,"mahāṁ","_","_","mahat","JJ","","_","_"
8,"asi","_","_","as","V","as","_","_"
1,"mahas","_","_","mah","JJ","","_","_"
2,"te","_","_","tvat","PPR","","_","_"
3,"sato","_","_","as","KDP","","_","_"
4,"mahimā","_","_","mahiman","NC","","_","_"
5,"panasyate","_","_","panasy","V","panasy","_","_"
6,"'ddhā","_","_","addhā","CX","","_","_"
7,"deva","_","_","deva","NC","","_","_"
8,"mahāṁ","_","_","mahat","JJ","","_","_"
9,"asi","_","_","as","V","as","_","_"
1,"baṭ","_","_","baṭ","CX","","_","_"
2,"sūrya","_","_","sūrya","NC","","_","_"
3,"śravasā","_","_","śravas","NC","","_","_"
4,"mahāṁ","_","_","mahat","JJ","","_","_"
5,"asi","_","_","as","V","as","_","_"
6,"satrā","_","_","satrā","CX","","_","_"
7,"deva","_","_","deva","NC","","_","_"
8,"mahāṁ","_","_","mahat","JJ","","_","_"
9,"asi","_","_","as","V","as","_","_"
1,"mahnā","_","_","mahan","NC","","_","_"
2,"devānām","_","_","deva","NC","","_","_"
3,"asuryaḥ","_","_","asurya","JJ","","_","_"
4,"purohito","_","_","purodhā","PPP","","_","_"
5,"vibhu","_","_","vibhu","JJ","","_","_"
6,"jyotir","_","_","jyotis","NC","","_","_"
7,"adābhyam","_","_","adābhya","JJ","","_","_"
1,"iyaṃ","_","_","ida","PRD","","_","_"
2,"yā","_","_","yad","PRL","","_","_"
3,"nīcy","_","_","nyāñc","JJ","","_","_"
4,"arkiṇī","_","_","arkin","JJ","","_","_"
5,"rūpā","_","_","rūpa","NC","","_","_"
6,"rohiṇyā","_","_","rohin","JJ","","_","_"
7,"kṛtā","_","_","kṛ","PPP","","_","_"
1,"_","_","_","citra","JJ","","_","_"
2,"_","_","_","iva","CCM","","_","_"
3,"praty","_","_","prati","CADP","","_","_"
4,"adarśy","_","_","darś","V","dṛś","_","_"
5,"āyaty","_","_","e","KDP","","_","_"
6,"antar","_","_","antar","CAD","","_","_"
7,"daśasu","_","_","daśan","NUM","","_","_"
8,"bāhuṣu","_","_","bāhu","NC","","_","_"
1,"prajā","_","_","prajā","NC","","_","_"
2,"ha","_","_","ha","CEM","","_","_"
3,"tisro","_","_","tri","NUM","","_","_"
4,"atyāyam","_","_","atyāya","NC","","_","_"
5,"īyur","_","_","e","V","i","_","_"
6,"ny","_","_","ni","CADP","","_","_"
7,"anyā","_","_","anya","PPX","","_","_"
8,"arkam","_","_","arka","NC","","_","_"
9,"abhito","_","_","abhitas","CX","","_","_"
10,"viviśre","_","_","viś","V","viś","_","_"
1,"_","_","_","bṛhat","JJ","","_","_"
2,"_","_","_","ha","CEM","","_","_"
3,"tasthau","_","_","tiṣṭh","V","sthā","_","_"
4,"bhuvaneṣv","_","_","bhuvana","NC","","_","_"
5,"antaḥ","_","_","antar","CAD","","_","_"
6,"pavamāno","_","_","pavamāna","NC","","_","_"
7,"harita","_","_","harit","JJ","","_","_"
8,"ā","_","_","ā","CADP","","_","_"
9,"viveśa","_","_","viś","V","viś","_","_"
1,"mātā","_","_","mātṛ","NC","","_","_"
2,"rudrāṇāṃ","_","_","rudra","NC","","_","_"
3,"duhitā","_","_","duhitṛ","NC","","_","_"
4,"vasūnāṃ","_","_","vasu","NC","","_","_"
5,"_","_","_","svasṛ","NC","","_","_"
6,"_","_","_","āditya","NC","","_","_"
7,"amṛtasya","_","_","amṛta","NC","","_","_"
8,"nābhiḥ","_","_","nābhi","NC","","_","_"
1,"pra","_","_","pra","CADP","","_","_"
2,"nu","_","_","nu","CX","","_","_"
3,"vocaṃ","_","_","vak","V","vac","_","_"
4,"cikituṣe","_","_","cit","KDP","","_","_"
5,"janāya","_","_","jana","NC","","_","_"
6,"mā","_","_","mā","CNG","","_","_"
7,"gām","_","_","go","NC","","_","_"
8,"anāgām","_","_","anāga","JJ","","_","_"
9,"aditiṃ","_","_","aditi","NC","","_","_"
10,"vadhiṣṭa","_","_","vadh","V","vadh","_","_"
1,"_","_","_","vacas","NC","","_","_"
2,"_","_","_","vid","JJ","","_","_"
3,"vācam","_","_","vāc","NC","","_","_"
4,"udīrayantīṃ","_","_","udīray","KDP","","_","_"
5,"viśvābhir","_","_","viśva","JQ","","_","_"
6,"dhībhir","_","_","dhī","NC","","_","_"
7,"upatiṣṭhamānām","_","_","upasthā","KDP","","_","_"
1,"devīṃ","_","_","devī","NC","","_","_"
2,"devebhyaḥ","_","_","deva","NC","","_","_"
3,"pary","_","_","pari","CADP","","_","_"
4,"eyuṣīṃ","_","_","i","KDP","","_","_"
5,"gām","_","_","go","NC","","_","_"
6,"ā","_","_","ā","CADP","","_","_"
7,"_","_","_","mat","PPR","","_","_"
8,"_","_","_","vṛj","V","vṛj","_","_"
9,"martyo","_","_","martya","NC","","_","_"
10,"_","_","_","dabhra","JJ","","_","_"
11,"_","_","_","cetas","NC","","_","_"
