"WordID","word","NormSTEM","suffix","lemma","PoS","Root","NormSuffix","NormWord"
1,"_","_","_","brahman","NC","","_","_"
2,"_","_","_","vak","V","vac","_","_"
1,"avyaktāt","_","_","avyakta","NC","","_","_"
2,"pūrvam","_","_","pūrva","CX","","_","_"
3,"utpanno","_","_","utpad","PPP","","_","_"
4,"mahān","_","_","mahat","NC","","_","_"
5,"ātmā","_","_","ātman","NC","","_","_"
6,"mahāmatiḥ","_","_","mahāmati","JJ","","_","_"
1,"ādir","_","_","ādi","NC","","_","_"
2,"guṇānāṃ","_","_","guṇa","NC","","_","_"
3,"sarveṣāṃ","_","_","sarva","JQ","","_","_"
4,"prathamaḥ","_","_","prathama","JJ","","_","_"
5,"sarga","_","_","sarga","NC","","_","_"
6,"ucyate","_","_","vak","V","vac","_","_"
1,"mahān","_","_","mahat","NC","","_","_"
2,"ātmā","_","_","ātman","NC","","_","_"
3,"matir","_","_","mati","NC","","_","_"
4,"viṣṇur","_","_","viṣṇu","NC","","_","_"
5,"viśvaḥ","_","_","viśva","JQ","","_","_"
6,"_","_","_","śambhu","NC","","_","_"
7,"_","_","_","ca","CCD","","_","_"
8,"vīryavān","_","_","vīryavat","JJ","","_","_"
1,"buddhiḥ","_","_","buddhi","NC","","_","_"
2,"_","_","_","prajñā","NC","","_","_"
3,"_","_","_","upalabdhi","NC","","_","_"
4,"_","_","_","ca","CCD","","_","_"
5,"tathā","_","_","tathā","CX","","_","_"
6,"khyātir","_","_","khyāti","NC","","_","_"
7,"dhṛtiḥ","_","_","dhṛti","NC","","_","_"
8,"smṛtiḥ","_","_","smṛti","NC","","_","_"
1,"_","_","_","paryāya","NC","","_","_"
2,"_","_","_","vācaka","NC","","_","_"
3,"śabdair","_","_","śabda","NC","","_","_"
4,"mahān","_","_","mahat","NC","","_","_"
5,"ātmā","_","_","ātman","NC","","_","_"
6,"vibhāvyate","_","_","vibhav","V","vibhū","_","_"
1,"taṃ","_","_","tad","PRD","","_","_"
2,"jānan","_","_","jñā","KDP","","_","_"
3,"brāhmaṇo","_","_","brāhmaṇa","NC","","_","_"
4,"_","_","_","vidvas","JJ","","_","_"
5,"_","_","_","na","CNG","","_","_"
6,"pramohaṃ","_","_","pramoha","NC","","_","_"
7,"nigacchati","_","_","nigacch","V","nigam","_","_"
1,"_","_","_","sarvatas","CX","","_","_"
2,"_","_","_","pāṇi","NC","","_","_"
3,"_","_","_","pāda","NC","","_","_"
4,"_","_","_","ca","CCD","","_","_"
5,"_","_","_","sarvatas","CX","","_","_"
6,"_","_","_","akṣi","NC","","_","_"
7,"_","_","_","śiras","NC","","_","_"
8,"_","_","_","mukha","NC","","_","_"
1,"_","_","_","sarvatas","CX","","_","_"
2,"_","_","_","śrutimat","JJ","","_","_"
3,"loke","_","_","loka","NC","","_","_"
4,"sarvaṃ","_","_","sarva","JQ","","_","_"
5,"vyāpya","_","_","vyāp","CGDA","","_","_"
6,"sa","_","_","tad","PRD","","_","_"
7,"tiṣṭhati","_","_","tiṣṭh","V","sthā","_","_"
1,"_","_","_","mahat","JJ","","_","_"
2,"_","_","_","prabhā","NC","","_","_"
3,"_","_","_","arcis","NC","","_","_"
4,"puruṣaḥ","_","_","puruṣa","NC","","_","_"
5,"sarvasya","_","_","sarva","JQ","","_","_"
6,"hṛdi","_","_","hṛd","NC","","_","_"
7,"niśritaḥ","_","_","niśri","PPP","","_","_"
1,"aṇimā","_","_","aṇiman","NC","","_","_"
2,"laghimā","_","_","laghiman","NC","","_","_"
3,"prāptir","_","_","prāpti","NC","","_","_"
4,"īśāno","_","_","īśāna","NC","","_","_"
5,"jyotir","_","_","jyotis","NC","","_","_"
6,"avyayaḥ","_","_","avyaya","JJ","","_","_"
1,"tatra","_","_","tatra","CAD","","_","_"
2,"buddhimatāṃ","_","_","buddhimat","JJ","","_","_"
3,"lokāḥ","_","_","loka","NC","","_","_"
4,"_","_","_","saṃnyāsa","NC","","_","_"
5,"_","_","_","nira","PPP","","_","_"
6,"_","_","_","ca","CCD","","_","_"
7,"ye","_","_","yad","PRL","","_","_"
1,"dhyānino","_","_","dhyānin","JJ","","_","_"
2,"_","_","_","nitya","JJ","","_","_"
3,"_","_","_","yoga","NC","","_","_"
4,"_","_","_","ca","CCD","","_","_"
5,"_","_","_","satya","JJ","","_","_"
6,"_","_","_","saṃdhā","NC","","_","_"
7,"_","_","_","ji","PPP","","_","_"
8,"_","_","_","indriya","NC","","_","_"
1,"_","_","_","jñānavat","JJ","","_","_"
2,"_","_","_","ca","CCD","","_","_"
3,"ye","_","_","yad","PRL","","_","_"
4,"kecid","_","_","kiṃcit","PRI","","_","_"
5,"alubdhā","_","_","alubdha","JJ","","_","_"
6,"_","_","_","ji","PPP","","_","_"
7,"_","_","_","manyu","NC","","_","_"
1,"_","_","_","prasad","PPP","","_","_"
2,"_","_","_","manas","NC","","_","_"
3,"dhīrā","_","_","dhīra","JJ","","_","_"
4,"nirmamā","_","_","nirmama","JJ","","_","_"
5,"nirahaṃkṛtāḥ","_","_","nirahaṃkṛta","JJ","","_","_"
1,"vimuktāḥ","_","_","vimuc","PPP","","_","_"
2,"sarva","_","_","sarva","JQ","","_","_"
3,"_","_","_","eva","CEM","","_","_"
4,"_","_","_","tad","PRD","","_","_"
5,"_","_","_","mahat","JJ","","_","_"
7,"upayānti","_","_","upai","V","upe","_","_"
8,"vai","_","_","vai","CX","","_","_"
1,"ātmano","_","_","ātman","NC","","_","_"
2,"mahato","_","_","mahat","NC","","_","_"
3,"veda","_","_","vid","V","vid","_","_"
4,"yaḥ","_","_","yad","PRL","","_","_"
5,"puṇyāṃ","_","_","puṇya","JJ","","_","_"
6,"gatim","_","_","gati","NC","","_","_"
7,"uttamām","_","_","uttama","JJ","","_","_"
1,"sa","_","_","tad","PRD","","_","_"
2,"dhīraḥ","_","_","dhīra","JJ","","_","_"
3,"_","_","_","sarva","JQ","","_","_"
4,"_","_","_","loka","NC","","_","_"
5,"na","_","_","na","CNG","","_","_"
6,"moham","_","_","moha","NC","","_","_"
7,"adhigacchati","_","_","adhigacch","V","adhigam","_","_"
1,"viṣṇur","_","_","viṣṇu","NC","","_","_"
2,"_","_","_","eva","CEM","","_","_"
3,"_","_","_","ādi","NC","","_","_"
4,"_","_","_","sarga","NC","","_","_"
5,"svayaṃbhūr","_","_","svayambhu","NC","","_","_"
6,"bhavati","_","_","bhav","V","bhū","_","_"
7,"prabhuḥ","_","_","prabhu","NC","","_","_"
1,"evaṃ","_","_","eva","CX","","_","_"
2,"hi","_","_","hi","CX","","_","_"
3,"yo","_","_","yad","PRL","","_","_"
4,"veda","_","_","vid","V","vid","_","_"
5,"_","_","_","guhā","NC","","_","_"
6,"_","_","_","āśaya","NC","","_","_"
7,"prabhuṃ","_","_","prabhu","NC","","_","_"
8,"naraḥ","_","_","nara","NC","","_","_"
9,"purāṇaṃ","_","_","purāṇa","JJ","","_","_"
10,"puruṣaṃ","_","_","puruṣa","NC","","_","_"
11,"_","_","_","viśva","JQ","","_","_"
12,"_","_","_","rūpa","NC","","_","_"
1,"hiraṇmayaṃ","_","_","hiraṇmaya","JJ","","_","_"
2,"buddhimatāṃ","_","_","buddhimat","JJ","","_","_"
3,"parāṃ","_","_","para","PPX","","_","_"
4,"gatiṃ","_","_","gati","NC","","_","_"
5,"sa","_","_","tad","PRD","","_","_"
6,"buddhimān","_","_","buddhimat","JJ","","_","_"
7,"buddhim","_","_","buddhi","NC","","_","_"
8,"atītya","_","_","atī","CGDA","","_","_"
9,"tiṣṭhati","_","_","tiṣṭh","V","sthā","_","_"
