"WordID","word","NormSTEM","suffix","lemma","PoS","Root","NormSuffix","NormWord"
1,"oṃ","_","_","oṃ","CX","","_","_"
2,"bhūs","_","_","bhū","NC","","_","_"
3,"tat","_","_","tad","PRD","","_","_"
4,"savituḥ","_","_","savitṛ","NC","","_","_"
5,"śaṃ","_","_","śa","NC","","_","_"
6,"no","_","_","mat","PPR","","_","_"
7,"devīḥ","_","_","devī","NC","","_","_"
8,"śāntā","_","_","śa","PPP","","_","_"
9,"dyauḥ","_","_","div","NC","","_","_"
10,"śaṃ","_","_","śa","NC","","_","_"
11,"na","_","_","mat","PPR","","_","_"
12,"_","_","_","indra","NC","","_","_"
13,"_","_","_","agni","NC","","_","_"
14,"śaṃ","_","_","śa","NC","","_","_"
15,"no","_","_","mat","PPR","","_","_"
16,"vāto","_","_","vāta","NC","","_","_"
17,"vātu","_","_","ve","V","ve","_","_"
18,"uṣā","_","_","uṣas","NC","","_","_"
19,"apa","_","_","apa","CX","","_","_"
20,"svasus","_","_","svasṛ","NC","","_","_"
21,"tama","_","_","tamas","NC","","_","_"
22,"iti","_","_","iti","CQT","","_","_"
23,"_","_","_","śānti","NC","","_","_"
24,"_","_","_","gaṇa","NC","","_","_"
1,"ya","_","_","yad","PRL","","_","_"
2,"āśānām","_","_","āśā","NC","","_","_"
3,"_","_","_","āśā","NC","","_","_"
4,"_","_","_","pāla","NC","","_","_"
5,"agner","_","_","agni","NC","","_","_"
6,"manva","_","_","man","V","man","_","_"
7,"iti","_","_","iti","CQT","","_","_"
8,"sapta","_","_","saptan","NUM","","_","_"
9,"sūktāni","_","_","sūkta","NC","","_","_"
10,"yā","_","_","yad","PRL","","_","_"
11,"oṣadhayaḥ","_","_","oṣadhi","NC","","_","_"
12,"_","_","_","soma","NC","","_","_"
13,"_","_","_","rājñī","NC","","_","_"
14,"vaiśvānaro","_","_","vaiśvānara","NC","","_","_"
15,"na","_","_","mat","PPR","","_","_"
16,"āgamac","_","_","āga","V","āga","_","_"
17,"chumbhanī","_","_","śumbhana","JJ","","_","_"
18,"dyāvāpṛthivī","_","_","dyāvāpṛthivī","NC","","_","_"
19,"yad","_","_","yat","CSB","","_","_"
20,"arvācīnam","_","_","arvācīna","JJ","","_","_"
21,"agniṃ","_","_","agni","NC","","_","_"
22,"brūmo","_","_","abravīta","V","brū","_","_"
23,"vanaspatīn","_","_","vanaspati","NC","","_","_"
24,"iti","_","_","iti","CQT","","_","_"
25,"muñcantu","_","_","muñc","V","muc","_","_"
26,"nā","_","_","nṛ","NC","","_","_"
27,"bhavāśārvā","_","_","yad","PRL","","_","_"
28,"yā","_","_","devī","NC","","_","_"
29,"devīr","_","_","yat","CSB","","_","_"
30,"yan","_","_","mātali","NC","","_","_"
31,"_","_","_","ratha","NC","","_","_"
32,"_","_","_","krī","PPP","","_","_"
33,"rathakrītam","_","_","iti","CQT","","_","_"
34,"ity","_","_","tad","PRD","","_","_"
35,"etāś","_","_","catur","NUM","","_","_"
36,"catasro","_","_","varjay","CGDA","","_","_"
37,"_","_","_","aṃhas","NC","","_","_"
38,"_","_","_","liṅga","NC","","_","_"
39,"_","_","_","gaṇa","NC","","_","_"
