"WordID","word","NormSTEM","suffix","lemma","PoS","Root","NormSuffix","NormWord"
1,"yudhiṣṭhira","_","_","yudhiṣṭhira","NC","","_","_"
2,"uvāca","_","_","vak","V","vac","_","_"
1,"ime","_","_","ida","PRD","","_","_"
2,"vai","_","_","vai","CX","","_","_"
3,"mānavāḥ","_","_","mānava","NC","","_","_"
4,"sarve","_","_","sarva","JQ","","_","_"
5,"dharmaṃ","_","_","dharma","NC","","_","_"
6,"prati","_","_","prati","CADP","","_","_"
7,"viśaṅkitāḥ","_","_","viśaṅk","PPP","","_","_"
1,"ko","_","_","kiṃ","PRQ","","_","_"
2,"'yaṃ","_","_","ida","PRD","","_","_"
3,"dharmaḥ","_","_","dharma","NC","","_","_"
4,"kuto","_","_","kutas","CX","","_","_"
5,"_","_","_","dharma","NC","","_","_"
6,"_","_","_","tad","PRD","","_","_"
7,"_","_","_","mat","PPR","","_","_"
8,"brūhi","_","_","abravīta","V","brū","_","_"
9,"pitāmaha","_","_","pitāmaha","NC","","_","_"
1,"dharmo","_","_","dharma","NC","","_","_"
2,"_","_","_","nu","CX","","_","_"
3,"_","_","_","ida","PRD","","_","_"
4,"_","_","_","iha","CAD","","_","_"
5,"_","_","_","artha","NC","","_","_"
6,"kim","_","_","kim","CX","","_","_"
7,"_","_","_","amutra","CX","","_","_"
8,"_","_","_","artha","NC","","_","_"
9,"'pi","_","_","api","CX","","_","_"
10,"vā","_","_","vā","CCD","","_","_"
11,"bhavet","_","_","bhav","V","bhū","_","_"
1,"_","_","_","ubhaya","JJ","","_","_"
2,"_","_","_","artha","NC","","_","_"
3,"'pi","_","_","api","CX","","_","_"
4,"vā","_","_","vā","CCD","","_","_"
5,"_","_","_","dharma","NC","","_","_"
6,"_","_","_","tad","PRD","","_","_"
7,"_","_","_","mat","PPR","","_","_"
8,"brūhi","_","_","abravīta","V","brū","_","_"
9,"pitāmaha","_","_","pitāmaha","NC","","_","_"
1,"bhīṣma","_","_","bhīṣma","NC","","_","_"
2,"uvāca","_","_","vak","V","vac","_","_"
1,"_","_","_","sat","JJ","","_","_"
2,"_","_","_","ācāra","NC","","_","_"
3,"smṛtir","_","_","smṛti","NC","","_","_"
4,"_","_","_","veda","NC","","_","_"
5,"_","_","_","trividha","JJ","","_","_"
6,"_","_","_","dharma","NC","","_","_"
7,"_","_","_","lakṣaṇa","NC","","_","_"
1,"caturtham","_","_","caturtha","JJ","","_","_"
2,"artham","_","_","artha","NC","","_","_"
3,"_","_","_","iti","CQT","","_","_"
4,"_","_","_","ah","V","ah","_","_"
5,"kavayo","_","_","kavi","NC","","_","_"
6,"_","_","_","dharma","NC","","_","_"
7,"_","_","_","lakṣaṇa","NC","","_","_"
1,"api","_","_","api","CX","","_","_"
2,"_","_","_","hi","CX","","_","_"
3,"_","_","_","vac","PPP","","_","_"
4,"karmāṇi","_","_","karman","NC","","_","_"
5,"_","_","_","vyavasā","V","vyavasā","_","_"
6,"_","_","_","uttara","JJ","","_","_"
7,"_","_","_","avara","JJ","","_","_"
1,"_","_","_","lokayātrā","NC","","_","_"
2,"_","_","_","artha","NC","","_","_"
3,"_","_","_","eva","CEM","","_","_"
4,"_","_","_","iha","CAD","","_","_"
5,"dharmasya","_","_","dharma","NC","","_","_"
6,"niyamaḥ","_","_","niyama","NC","","_","_"
7,"kṛtaḥ","_","_","kṛ","PPP","","_","_"
1,"ubhayatra","_","_","ubhayatra","CX","","_","_"
2,"_","_","_","sukha","NC","","_","_"
3,"_","_","_","udarka","NC","","_","_"
4,"iha","_","_","iha","CAD","","_","_"
5,"_","_","_","ca","CCD","","_","_"
6,"_","_","_","eva","CEM","","_","_"
7,"paratra","_","_","paratra","CX","","_","_"
8,"ca","_","_","ca","CCD","","_","_"
1,"a","_","_","alpha_privativum","CX","","_","_"
1,"alabdhvā","_","_","labdhvā","CX","","_","_"
2,"nipuṇaṃ","_","_","nipuṇa","JJ","","_","_"
3,"dharmaṃ","_","_","dharma","NC","","_","_"
4,"pāpaḥ","_","_","pāpa","JJ","","_","_"
5,"pāpe","_","_","pāpa","NC","","_","_"
6,"prasajati","_","_","prasañj","V","prasañj","_","_"
1,"na","_","_","na","CNG","","_","_"
2,"ca","_","_","ca","CCD","","_","_"
3,"_","_","_","pāpa","NC","","_","_"
4,"_","_","_","kṛt","JJ","","_","_"
5,"_","_","_","pāpa","NC","","_","_"
6,"_","_","_","muñc","V","muc","_","_"
7,"kecid","_","_","kiṃcit","PRI","","_","_"
8,"āpadi","_","_","āpad","NC","","_","_"
1,"_","_","_","apāpa","JJ","","_","_"
2,"_","_","_","vādin","JJ","","_","_"
3,"bhavati","_","_","bhav","V","bhū","_","_"
4,"yadā","_","_","yadā","CSB","","_","_"
5,"bhavati","_","_","bhav","V","bhū","_","_"
6,"_","_","_","dharma","NC","","_","_"
7,"_","_","_","vid","JJ","","_","_"
1,"dharmasya","_","_","dharma","NC","","_","_"
2,"niṣṭhā","_","_","niṣṭhā","NC","","_","_"
3,"_","_","_","su","CAD","","_","_"
4,"_","_","_","ācāra","NC","","_","_"
5,"_","_","_","tad","PRD","","_","_"
6,"_","_","_","eva","CEM","","_","_"
7,"_","_","_","āśri","CGDA","","_","_"
8,"bhotsyase","_","_","bodh","V","budh","_","_"
1,"_","_","_","yadā","CSB","","_","_"
2,"_","_","_","adharma","NC","","_","_"
3,"_","_","_","samāviś","PPP","","_","_"
4,"dhanaṃ","_","_","dhana","NC","","_","_"
5,"gṛhṇāti","_","_","grah","V","grah","_","_"
6,"taskaraḥ","_","_","taskara","NC","","_","_"
1,"ramate","_","_","ram","V","ram","_","_"
2,"nirharan","_","_","nirhṛ","KDP","","_","_"
3,"stenaḥ","_","_","sta","NC","","_","_"
4,"_","_","_","para","PPX","","_","_"
5,"_","_","_","vitta","NC","","_","_"
6,"arājake","_","_","arājaka","NC","","_","_"
1,"_","_","_","yadā","CSB","","_","_"
2,"_","_","_","ida","PRD","","_","_"
3,"_","_","_","tad","PRD","","_","_"
4,"_","_","_","har","V","hṛ","_","_"
5,"_","_","_","anya","PPX","","_","_"
6,"tadā","_","_","tadā","CAD","","_","_"
7,"rājānam","_","_","rājan","NC","","_","_"
8,"icchati","_","_","iṣ","V","iṣ","_","_"
1,"tadā","_","_","tadā","CAD","","_","_"
2,"teṣāṃ","_","_","tad","PRD","","_","_"
3,"spṛhayate","_","_","spṛhay","V","spṛhay","_","_"
4,"ye","_","_","yad","PRL","","_","_"
5,"vai","_","_","vai","CX","","_","_"
6,"tuṣṭāḥ","_","_","tuṣ","PPP","","_","_"
7,"svakair","_","_","svaka","JJ","","_","_"
8,"dhanaiḥ","_","_","dhana","NC","","_","_"
1,"abhītaḥ","_","_","abhīta","JJ","","_","_"
2,"śucir","_","_","śuci","JJ","","_","_"
3,"abhyeti","_","_","abhī","V","abhī","_","_"
4,"_","_","_","rājan","NC","","_","_"
5,"_","_","_","dvāra","NC","","_","_"
6,"aśaṅkitaḥ","_","_","aśaṅkita","JJ","","_","_"
1,"na","_","_","na","CNG","","_","_"
2,"hi","_","_","hi","CX","","_","_"
3,"duścaritaṃ","_","_","duścarita","NC","","_","_"
4,"kiṃcid","_","_","kiṃcit","PRI","","_","_"
5,"antarātmani","_","_","antarātman","NC","","_","_"
6,"paśyati","_","_","paś","V","paś","_","_"
1,"satyasya","_","_","satya","NC","","_","_"
2,"vacanaṃ","_","_","vacana","NC","","_","_"
3,"sādhu","_","_","sādhu","JJ","","_","_"
4,"na","_","_","na","CNG","","_","_"
5,"satyād","_","_","satya","NC","","_","_"
6,"vidyate","_","_","vid","V","vid","_","_"
7,"param","_","_","para","PPX","","_","_"
1,"satyena","_","_","satya","NC","","_","_"
2,"vidhṛtaṃ","_","_","vidhṛ","PPP","","_","_"
3,"sarvaṃ","_","_","sarva","JQ","","_","_"
4,"sarvaṃ","_","_","sarva","JQ","","_","_"
5,"satye","_","_","satya","NC","","_","_"
6,"pratiṣṭhitam","_","_","pratiṣṭhā","PPP","","_","_"
1,"api","_","_","api","CX","","_","_"
2,"_","_","_","pāpa","NC","","_","_"
3,"_","_","_","kṛt","JJ","","_","_"
4,"raudrāḥ","_","_","raudra","JJ","","_","_"
5,"satyaṃ","_","_","satya","NC","","_","_"
6,"kṛtvā","_","_","kṛ","CGDA","","_","_"
7,"pṛthak","_","_","pṛthak","CX","","_","_"
8,"pṛthak","_","_","pṛthak","CX","","_","_"
1,"adroham","_","_","adroha","NC","","_","_"
2,"avisaṃvādaṃ","_","_","avisaṃvāda","NC","","_","_"
3,"pravartante","_","_","pravart","V","pravṛt","_","_"
4,"_","_","_","tad","PRD","","_","_"
5,"_","_","_","āśraya","NC","","_","_"
1,"te","_","_","tad","PRD","","_","_"
2,"_","_","_","ced","CX","","_","_"
3,"_","_","_","mithas","CX","","_","_"
4,"'dhṛtiṃ","_","_","adhṛti","NC","","_","_"
5,"kuryur","_","_","kar","V","kṛ","_","_"
6,"vinaśyeyur","_","_","vinaś","V","vinaś","_","_"
7,"asaṃśayam","_","_","asaṃśaya","CX","","_","_"
1,"na","_","_","na","CNG","","_","_"
2,"hartavyaṃ","_","_","hṛ","KDG","","_","_"
3,"_","_","_","para","PPX","","_","_"
4,"_","_","_","dhana","NC","","_","_"
5,"iti","_","_","iti","CQT","","_","_"
6,"dharmaḥ","_","_","dharma","NC","","_","_"
7,"sanātanaḥ","_","_","sanātana","JJ","","_","_"
1,"manyante","_","_","man","V","man","_","_"
2,"_","_","_","balavat","JJ","","_","_"
3,"_","_","_","tad","PRD","","_","_"
4,"durbalaiḥ","_","_","durbala","JJ","","_","_"
5,"sampravartitam","_","_","sampravartay","PPP","","_","_"
1,"yadā","_","_","yadā","CSB","","_","_"
2,"_","_","_","niyati","NC","","_","_"
3,"_","_","_","daurbalya","NC","","_","_"
4,"_","_","_","atha","CAD","","_","_"
5,"_","_","_","ida","PRD","","_","_"
6,"eva","_","_","eva","CEM","","_","_"
7,"rocate","_","_","roc","V","ruc","_","_"
1,"na","_","_","na","CNG","","_","_"
2,"_","_","_","hi","CX","","_","_"
3,"_","_","_","atyanta","CX","","_","_"
4,"_","_","_","bala","NC","","_","_"
5,"_","_","_","yuta","JJ","","_","_"
6,"bhavanti","_","_","bhav","V","bhū","_","_"
7,"sukhino","_","_","sukhin","JJ","","_","_"
8,"'pi","_","_","api","CX","","_","_"
9,"vā","_","_","vā","CCD","","_","_"
1,"tasmād","_","_","tasmāt","CX","","_","_"
2,"anārjave","_","_","anārjava","NC","","_","_"
3,"buddhir","_","_","buddhi","NC","","_","_"
4,"na","_","_","na","CNG","","_","_"
5,"kāryā","_","_","kṛ","KDG","","_","_"
6,"te","_","_","tvat","PPR","","_","_"
7,"kathaṃcana","_","_","kathaṃcana","CX","","_","_"
1,"asādhubhyo","_","_","asādhu","JJ","","_","_"
2,"'sya","_","_","ida","PRD","","_","_"
3,"na","_","_","na","CNG","","_","_"
4,"bhayaṃ","_","_","bhaya","NC","","_","_"
5,"na","_","_","na","CNG","","_","_"
6,"corebhyo","_","_","cora","NC","","_","_"
7,"na","_","_","na","CNG","","_","_"
8,"rājataḥ","_","_","rājan","NC","","_","_"
1,"na","_","_","na","CNG","","_","_"
2,"kiṃcit","_","_","kiṃcit","PRI","","_","_"
3,"kasyacit","_","_","kiṃcit","PRI","","_","_"
4,"_","_","_","kṛ","KDP","","_","_"
5,"_","_","_","nirbhaya","JJ","","_","_"
6,"śucir","_","_","śuci","JJ","","_","_"
7,"āvaset","_","_","avavas","V","avavas","_","_"
1,"sarvataḥ","_","_","sarvatas","CX","","_","_"
2,"śaṅkate","_","_","śaṅk","V","śaṅk","_","_"
3,"steno","_","_","sta","NC","","_","_"
4,"mṛgo","_","_","mṛga","NC","","_","_"
5,"grāmam","_","_","grāma","NC","","_","_"
6,"_","_","_","iva","CCM","","_","_"
7,"_","_","_","i","KDP","","_","_"
1,"_","_","_","bahudhā","CX","","_","_"
2,"_","_","_","ācar","PPP","","_","_"
3,"pāpam","_","_","pāpa","NC","","_","_"
4,"_","_","_","anyatra","CX","","_","_"
5,"_","_","_","eva","CEM","","_","_"
6,"_","_","_","anupaś","V","anupaś","_","_"
1,"muditaḥ","_","_","mud","PPP","","_","_"
2,"śucir","_","_","śuci","JJ","","_","_"
3,"abhyeti","_","_","abhī","V","abhī","_","_"
4,"sarvato","_","_","sarvatas","CX","","_","_"
5,"nirbhayaḥ","_","_","nirbhaya","JJ","","_","_"
6,"sadā","_","_","sadā","CAD","","_","_"
1,"na","_","_","na","CNG","","_","_"
2,"hi","_","_","hi","CX","","_","_"
3,"duścaritaṃ","_","_","duścarita","NC","","_","_"
4,"kiṃcid","_","_","kiṃcit","PRI","","_","_"
5,"ātmano","_","_","ātman","NC","","_","_"
6,"'nyeṣu","_","_","anya","PPX","","_","_"
7,"paśyati","_","_","paś","V","paś","_","_"
1,"dātavyam","_","_","dā","KDG","","_","_"
2,"_","_","_","iti","CQT","","_","_"
3,"_","_","_","ida","PRD","","_","_"
4,"dharma","_","_","dharma","NC","","_","_"
5,"ukto","_","_","vac","PPP","","_","_"
6,"_","_","_","bhūta","NC","","_","_"
7,"_","_","_","hita","NC","","_","_"
8,"rataiḥ","_","_","ra","PPP","","_","_"
1,"taṃ","_","_","tad","PRD","","_","_"
2,"manyante","_","_","man","V","man","_","_"
3,"_","_","_","dhana","NC","","_","_"
4,"_","_","_","yuta","JJ","","_","_"
5,"kṛpaṇaiḥ","_","_","kṛpaṇa","JJ","","_","_"
6,"sampravartitam","_","_","sampravartay","PPP","","_","_"
1,"yadā","_","_","yadā","CSB","","_","_"
2,"_","_","_","niyati","NC","","_","_"
3,"_","_","_","kārpaṇya","NC","","_","_"
4,"_","_","_","atha","CAD","","_","_"
5,"_","_","_","ida","PRD","","_","_"
6,"eva","_","_","eva","CEM","","_","_"
7,"rocate","_","_","roc","V","ruc","_","_"
1,"na","_","_","na","CNG","","_","_"
2,"_","_","_","hi","CX","","_","_"
3,"_","_","_","atyanta","CX","","_","_"
4,"dhanavanto","_","_","dhanavat","JJ","","_","_"
5,"bhavanti","_","_","bhav","V","bhū","_","_"
6,"sukhino","_","_","sukhin","JJ","","_","_"
7,"'pi","_","_","api","CX","","_","_"
8,"vā","_","_","vā","CCD","","_","_"
1,"yad","_","_","yad","PRL","","_","_"
2,"anyair","_","_","anya","PPX","","_","_"
3,"vihitaṃ","_","_","vidhā","PPP","","_","_"
4,"_","_","_","na","CNG","","_","_"
5,"_","_","_","iṣ","V","iṣ","_","_"
6,"ātmanaḥ","_","_","ātman","NC","","_","_"
7,"karma","_","_","karman","NC","","_","_"
8,"pūruṣaḥ","_","_","pūruṣa","NC","","_","_"
1,"na","_","_","na","CNG","","_","_"
2,"tat","_","_","tad","PRD","","_","_"
3,"pareṣu","_","_","para","PPX","","_","_"
4,"kurvīta","_","_","kar","V","kṛ","_","_"
5,"jānann","_","_","jñā","KDP","","_","_"
6,"apriyam","_","_","apriya","JJ","","_","_"
7,"ātmanaḥ","_","_","ātman","NC","","_","_"
1,"yo","_","_","yad","PRL","","_","_"
2,"'nyasya","_","_","anya","PPX","","_","_"
3,"syād","_","_","as","V","as","_","_"
4,"upapatiḥ","_","_","upapati","NC","","_","_"
5,"sa","_","_","tad","PRD","","_","_"
6,"kaṃ","_","_","kiṃ","PRQ","","_","_"
7,"kiṃ","_","_","kiṃ","PRQ","","_","_"
8,"vaktum","_","_","vac","CGDI","","_","_"
9,"arhati","_","_","arh","V","arh","_","_"
1,"yad","_","_","yad","PRL","","_","_"
2,"_","_","_","anya","PPX","","_","_"
3,"_","_","_","tad","PRD","","_","_"
4,"tat","_","_","tad","PRD","","_","_"
5,"_","_","_","kar","V","kṛ","_","_"
6,"_","_","_","na","CNG","","_","_"
7,"mṛṣyed","_","_","mṛṣ","V","mṛṣ","_","_"
8,"iti","_","_","iti","CQT","","_","_"
9,"me","_","_","mat","PPR","","_","_"
10,"matiḥ","_","_","mati","NC","","_","_"
1,"jīvituṃ","_","_","jīv","CGDI","","_","_"
2,"yaḥ","_","_","yad","PRL","","_","_"
3,"svayaṃ","_","_","svaya","CX","","_","_"
4,"_","_","_","ca","CCD","","_","_"
5,"_","_","_","iṣ","V","iṣ","_","_"
6,"kathaṃ","_","_","katha","CX","","_","_"
7,"so","_","_","tad","PRD","","_","_"
8,"'nyaṃ","_","_","anya","PPX","","_","_"
9,"praghātayet","_","_","praghātay","V","praghātay","_","_"
1,"yad","_","_","yad","PRL","","_","_"
2,"yad","_","_","yad","PRL","","_","_"
3,"ātmana","_","_","ātman","NC","","_","_"
4,"iccheta","_","_","iṣ","V","iṣ","_","_"
5,"tat","_","_","tad","PRD","","_","_"
6,"_","_","_","para","PPX","","_","_"
7,"_","_","_","api","CX","","_","_"
8,"cintayet","_","_","cint","V","cint","_","_"
1,"atiriktaiḥ","_","_","atiric","PPP","","_","_"
2,"saṃvibhajed","_","_","saṃvibhaj","V","saṃvibhaj","_","_"
3,"bhogair","_","_","bhoga","NC","","_","_"
4,"anyān","_","_","anya","PPX","","_","_"
5,"akiṃcanān","_","_","akiñcana","JJ","","_","_"
1,"etasmāt","_","_","tad","PRD","","_","_"
2,"kāraṇād","_","_","kāraṇa","NC","","_","_"
3,"dhātrā","_","_","dhātṛ","NC","","_","_"
4,"kusīdaṃ","_","_","kusīda","NC","","_","_"
5,"sampravartitam","_","_","sampravartay","PPP","","_","_"
1,"_","_","_","yad","PRL","","_","_"
2,"_","_","_","tu","CCD","","_","_"
3,"devāḥ","_","_","deva","NC","","_","_"
4,"samaye","_","_","samaya","NC","","_","_"
5,"_","_","_","saṃtiṣṭh","V","saṃsthā","_","_"
6,"_","_","_","tathā","CX","","_","_"
7,"bhavet","_","_","bhav","V","bhū","_","_"
1,"atha","_","_","atha","CAD","","_","_"
2,"_","_","_","ced","CX","","_","_"
3,"_","_","_","lābha","NC","","_","_"
4,"_","_","_","samaya","NC","","_","_"
5,"sthitir","_","_","sthiti","NC","","_","_"
6,"dharme","_","_","dharma","NC","","_","_"
7,"'pi","_","_","api","CX","","_","_"
8,"śobhanā","_","_","śobhana","JJ","","_","_"
1,"sarvaṃ","_","_","sarva","JQ","","_","_"
2,"_","_","_","priya","JJ","","_","_"
3,"_","_","_","abhyupaga","PPP","","_","_"
4,"dharmam","_","_","dharma","NC","","_","_"
5,"āhur","_","_","ah","V","ah","_","_"
6,"manīṣiṇaḥ","_","_","manīṣin","JJ","","_","_"
1,"_","_","_","paś","V","paś","_","_"
2,"_","_","_","tad","PRD","","_","_"
3,"_","_","_","lakṣaṇa","NC","","_","_"
4,"_","_","_","uddeśa","NC","","_","_"
5,"_","_","_","dharma","NC","","_","_"
6,"_","_","_","adharma","NC","","_","_"
7,"yudhiṣṭhira","_","_","yudhiṣṭhira","NC","","_","_"
1,"_","_","_","loka","NC","","_","_"
2,"_","_","_","saṃgraha","NC","","_","_"
3,"_","_","_","saṃyuj","PPP","","_","_"
4,"vidhātrā","_","_","vidhātṛ","NC","","_","_"
5,"vihitaṃ","_","_","vidhā","PPP","","_","_"
6,"purā","_","_","purā","CX","","_","_"
1,"_","_","_","sūkṣma","JJ","","_","_"
2,"_","_","_","dharma","NC","","_","_"
3,"_","_","_","artha","NC","","_","_"
4,"_","_","_","niya","PPP","","_","_"
5,"satāṃ","_","_","sat","JJ","","_","_"
6,"caritam","_","_","carita","NC","","_","_"
7,"uttamam","_","_","uttama","JJ","","_","_"
1,"_","_","_","dharma","NC","","_","_"
2,"_","_","_","lakṣaṇa","NC","","_","_"
3,"ākhyātam","_","_","ākhyā","PPP","","_","_"
4,"etat","_","_","tad","PRD","","_","_"
5,"te","_","_","tvat","PPR","","_","_"
6,"kurusattama","_","_","kurusattama","NC","","_","_"
1,"tasmād","_","_","tasmāt","CX","","_","_"
2,"anārjave","_","_","anārjava","NC","","_","_"
3,"buddhir","_","_","buddhi","NC","","_","_"
4,"na","_","_","na","CNG","","_","_"
5,"kāryā","_","_","kṛ","KDG","","_","_"
6,"te","_","_","tvat","PPR","","_","_"
7,"kathaṃcana","_","_","kathaṃcana","CX","","_","_"
