"WordID","word","NormSTEM","suffix","lemma","PoS","Root","NormSuffix","NormWord"
1,"agniṃ","_","_","agni","NC","","_","_"
2,"tam","_","_","tad","PRD","","_","_"
3,"manye","_","_","man","V","man","_","_"
4,"yo","_","_","yad","PRL","","_","_"
5,"vasur","_","_","vasu","JJ","","_","_"
6,"astaṃ","_","_","asta","NC","","_","_"
7,"yaṃ","_","_","yad","PRL","","_","_"
8,"yanti","_","_","e","V","i","_","_"
9,"dhenavaḥ","_","_","dhenu","NC","","_","_"
1,"astam","_","_","asta","NC","","_","_"
2,"arvanta","_","_","arvat","NC","","_","_"
3,"āśavo","_","_","āśu","JJ","","_","_"
4,"'staṃ","_","_","asta","NC","","_","_"
5,"nityāso","_","_","nitya","JJ","","_","_"
6,"vājina","_","_","vājin","NC","","_","_"
7,"iṣaṃ","_","_","iṣ","NC","","_","_"
8,"stotṛbhya","_","_","stotṛ","JJ","","_","_"
9,"ā","_","_","ā","CADP","","_","_"
10,"bhara","_","_","bhṛ","V","bhṛ","_","_"
1,"so","_","_","tad","PRD","","_","_"
2,"agnir","_","_","agni","NC","","_","_"
3,"yo","_","_","yad","PRL","","_","_"
4,"vasur","_","_","vasu","JJ","","_","_"
5,"gṛṇe","_","_","gṛ","V","gṛ","_","_"
6,"saṃ","_","_","sa","CADP","","_","_"
7,"yam","_","_","yad","PRL","","_","_"
8,"āyanti","_","_","e","V","e","_","_"
9,"dhenavaḥ","_","_","dhenu","NC","","_","_"
1,"sam","_","_","sa","CADP","","_","_"
2,"arvanto","_","_","arvat","NC","","_","_"
3,"raghudruvaḥ","_","_","raghudru","JJ","","_","_"
4,"saṃ","_","_","sa","CADP","","_","_"
5,"_","_","_","su","CAD","","_","_"
6,"_","_","_","jan","PPP","","_","_"
7,"sūraya","_","_","sūri","NC","","_","_"
8,"iṣaṃ","_","_","iṣ","NC","","_","_"
9,"stotṛbhya","_","_","stotṛ","JJ","","_","_"
10,"ā","_","_","ā","CADP","","_","_"
11,"bhara","_","_","bhṛ","V","bhṛ","_","_"
1,"agnir","_","_","agni","NC","","_","_"
2,"hi","_","_","hi","CX","","_","_"
3,"vājinaṃ","_","_","vājin","NC","","_","_"
4,"viśe","_","_","viś","NC","","_","_"
5,"dadāti","_","_","dad","V","dā","_","_"
6,"viśvacarṣaṇiḥ","_","_","viśvacarṣaṇi","JJ","","_","_"
1,"agnī","_","_","agni","NC","","_","_"
2,"rāye","_","_","rai","NC","","_","_"
3,"_","_","_","su","CAD","","_","_"
4,"_","_","_","ābhū","NC","","_","_"
5,"sa","_","_","tad","PRD","","_","_"
6,"prīto","_","_","prī","PPP","","_","_"
7,"yāti","_","_","yā","V","yā","_","_"
8,"vāryam","_","_","vārya","NC","","_","_"
9,"iṣaṃ","_","_","iṣ","NC","","_","_"
10,"stotṛbhya","_","_","stotṛ","JJ","","_","_"
11,"ā","_","_","ā","CADP","","_","_"
12,"bhara","_","_","bhṛ","V","bhṛ","_","_"
1,"ā","_","_","ā","CADP","","_","_"
2,"te","_","_","tvat","PPR","","_","_"
3,"agna","_","_","agni","NC","","_","_"
4,"idhīmahi","_","_","indh","V","indh","_","_"
5,"dyumantaṃ","_","_","dyumat","JJ","","_","_"
6,"_","_","_","deva","NC","","_","_"
7,"_","_","_","ajara","JJ","","_","_"
1,"_","_","_","yat","CSB","","_","_"
2,"_","_","_","ha","CEM","","_","_"
3,"syā","_","_","tya","PRD","","_","_"
4,"te","_","_","tvat","PPR","","_","_"
5,"panīyasī","_","_","panīyas","JJ","","_","_"
6,"samid","_","_","samidh","NC","","_","_"
7,"dīdayati","_","_","dīdī","V","dīdī","_","_"
8,"_","_","_","div","NC","","_","_"
9,"_","_","_","iṣ","NC","","_","_"
10,"stotṛbhya","_","_","stotṛ","JJ","","_","_"
11,"ā","_","_","ā","CADP","","_","_"
12,"bhara","_","_","bhṛ","V","bhṛ","_","_"
1,"ā","_","_","ā","CADP","","_","_"
2,"te","_","_","tvat","PPR","","_","_"
3,"agna","_","_","agni","NC","","_","_"
4,"ṛcā","_","_","ṛc","NC","","_","_"
5,"haviḥ","_","_","havis","NC","","_","_"
6,"śukrasya","_","_","śukra","JJ","","_","_"
7,"śociṣas","_","_","śocis","NC","","_","_"
8,"pate","_","_","pati","NC","","_","_"
1,"_","_","_","su","CAD","","_","_"
2,"_","_","_","ścandra","JJ","","_","_"
3,"dasma","_","_","dasma","NC","","_","_"
4,"viśpate","_","_","viśpati","NC","","_","_"
5,"havyavāṭ","_","_","havyavah","NC","","_","_"
6,"tubhyaṃ","_","_","tvat","PPR","","_","_"
7,"hūyata","_","_","hu","V","hu","_","_"
8,"iṣaṃ","_","_","iṣ","NC","","_","_"
9,"stotṛbhya","_","_","stotṛ","JJ","","_","_"
10,"ā","_","_","ā","CADP","","_","_"
11,"bhara","_","_","bhṛ","V","bhṛ","_","_"
1,"_","_","_","pra","CADP","","_","_"
2,"_","_","_","u","CEM","","_","_"
3,"tye","_","_","tya","PRD","","_","_"
4,"agnayo","_","_","agni","NC","","_","_"
5,"'gniṣu","_","_","agni","NC","","_","_"
6,"viśvam","_","_","viśva","JQ","","_","_"
7,"puṣyanti","_","_","puṣ","V","puṣ","_","_"
8,"vāryam","_","_","vārya","NC","","_","_"
1,"te","_","_","tad","PRD","","_","_"
2,"hinvire","_","_","hi","V","hi","_","_"
3,"ta","_","_","tad","PRD","","_","_"
4,"invire","_","_","e","V","i","_","_"
5,"ta","_","_","tad","PRD","","_","_"
6,"iṣaṇyanty","_","_","iṣaṇy","V","iṣaṇy","_","_"
7,"ānuṣag","_","_","ānuṣak","CX","","_","_"
8,"iṣaṃ","_","_","iṣ","NC","","_","_"
9,"stotṛbhya","_","_","stotṛ","JJ","","_","_"
10,"ā","_","_","ā","CADP","","_","_"
11,"bhara","_","_","bhṛ","V","bhṛ","_","_"
1,"tava","_","_","tvat","PPR","","_","_"
2,"tye","_","_","tya","PRD","","_","_"
3,"agne","_","_","agni","NC","","_","_"
4,"arcayo","_","_","arci","NC","","_","_"
5,"mahi","_","_","mahi","JJ","","_","_"
6,"vrādhanta","_","_","vrādh","V","vrādh","_","_"
7,"vājinaḥ","_","_","vājin","NC","","_","_"
1,"ye","_","_","yad","PRL","","_","_"
2,"patvabhiḥ","_","_","patvan","NC","","_","_"
3,"śaphānāṃ","_","_","śapha","NC","","_","_"
4,"vrajā","_","_","vraja","NC","","_","_"
5,"bhuranta","_","_","bhur","V","bhur","_","_"
6,"gonām","_","_","go","NC","","_","_"
7,"iṣaṃ","_","_","iṣ","NC","","_","_"
8,"stotṛbhya","_","_","stotṛ","JJ","","_","_"
9,"ā","_","_","ā","CADP","","_","_"
10,"bhara","_","_","bhṛ","V","bhṛ","_","_"
1,"navā","_","_","nava","JJ","","_","_"
2,"no","_","_","mat","PPR","","_","_"
3,"agna","_","_","agni","NC","","_","_"
4,"ā","_","_","ā","CADP","","_","_"
5,"bhara","_","_","bhṛ","V","bhṛ","_","_"
6,"stotṛbhyaḥ","_","_","stotṛ","JJ","","_","_"
7,"_","_","_","su","CAD","","_","_"
8,"_","_","_","kṣiti","NC","","_","_"
9,"iṣaḥ","_","_","iṣ","NC","","_","_"
1,"te","_","_","tad","PRD","","_","_"
2,"syāma","_","_","as","V","as","_","_"
3,"ya","_","_","yad","PRL","","_","_"
4,"ānṛcus","_","_","arc","V","arc","_","_"
5,"tvādūtāso","_","_","tvādūta","JJ","","_","_"
6,"dame","_","_","dama","NC","","_","_"
7,"dama","_","_","dama","NC","","_","_"
8,"iṣaṃ","_","_","iṣ","NC","","_","_"
9,"stotṛbhya","_","_","stotṛ","JJ","","_","_"
10,"ā","_","_","ā","CADP","","_","_"
11,"bhara","_","_","bhṛ","V","bhṛ","_","_"
1,"ubhe","_","_","ubh","PPX","","_","_"
2,"_","_","_","su","CAD","","_","_"
3,"_","_","_","ścandra","JJ","","_","_"
4,"sarpiṣo","_","_","sarpis","NC","","_","_"
5,"darvī","_","_","darvī","NC","","_","_"
6,"śrīṇīṣa","_","_","śrī","V","śrī","_","_"
7,"āsani","_","_","āsan","NC","","_","_"
1,"_","_","_","uta","CCD","","_","_"
2,"_","_","_","u","CEM","","_","_"
3,"na","_","_","mat","PPR","","_","_"
4,"ut","_","_","ud","CADP","","_","_"
5,"pupūryā","_","_","pṛ","V","pṛ","_","_"
6,"uktheṣu","_","_","uktha","NC","","_","_"
7,"śavasas","_","_","śavas","NC","","_","_"
8,"pata","_","_","pati","NC","","_","_"
9,"iṣaṃ","_","_","iṣ","NC","","_","_"
10,"stotṛbhya","_","_","stotṛ","JJ","","_","_"
11,"ā","_","_","ā","CADP","","_","_"
12,"bhara","_","_","bhṛ","V","bhṛ","_","_"
1,"_","_","_","eva","CEM","","_","_"
2,"_","_","_","āṃ","CX","","_","_"
3,"agnim","_","_","agni","NC","","_","_"
4,"ajuryamur","_","_","gir","NC","","_","_"
5,"gīrbhir","_","_","yajña","NC","","_","_"
6,"yajñebhir","_","_","ānuṣak","CX","","_","_"
1,"dadhad","_","_","dadh","V","dhā","_","_"
2,"asme","_","_","mat","PPR","","_","_"
3,"_","_","_","su","CAD","","_","_"
4,"_","_","_","vīrya","NC","","_","_"
5,"uta","_","_","uta","CCD","","_","_"
6,"tyad","_","_","tya","PRD","","_","_"
7,"_","_","_","āśu","JJ","","_","_"
8,"_","_","_","aśvya","NC","","_","_"
9,"iṣaṃ","_","_","iṣ","NC","","_","_"
10,"stotṛbhya","_","_","stotṛ","JJ","","_","_"
11,"ā","_","_","ā","CADP","","_","_"
12,"bhara","_","_","bhṛ","V","bhṛ","_","_"
