"WordID","word","NormSTEM","suffix","lemma","PoS","Root","NormSuffix","NormWord"
1,"_","_","_","dṛś","PPP","","_","_"
2,"_","_","_","yoga","NC","","_","_"
3,"_","_","_","phala","NC","","_","_"
4,"_","_","_","siddhi","NC","","_","_"
5,"_","_","_","da","JJ","","_","_"
6,"dhruvaṃ","_","_","dhruva","CX","","_","_"
7,"pāradasya","_","_","pārada","NC","","_","_"
8,"_","_","_","vara","JJ","","_","_"
9,"_","_","_","jāraṇa","NC","","_","_"
10,"hitam","_","_","hita","JJ","","_","_"
1,"_","_","_","sattva","NC","","_","_"
2,"_","_","_","pātana","NC","","_","_"
3,"_","_","_","aneka","JJ","","_","_"
4,"_","_","_","yoga","NC","","_","_"
5,"dvaṃdvamelam","_","_","dvaṃdvamela","NC","","_","_"
6,"abhiṣekam","_","_","abhiṣeka","NC","","_","_"
7,"āryakam","_","_","āryaka","JJ","","_","_"
1,"_","_","_","mustā","NC","","_","_"
2,"_","_","_","kvātha","NC","","_","_"
3,"_","_","_","saptan","NUM","","_","_"
4,"_","_","_","aha","NC","","_","_"
5,"_","_","_","kar","V","kṛ","_","_"
6,"_","_","_","dhānyābhraka","NC","","_","_"
7,"plutam","_","_","plu","PPP","","_","_"
1,"_","_","_","śigru","NC","","_","_"
2,"_","_","_","sūraṇa","NC","","_","_"
3,"_","_","_","rambhā","NC","","_","_"
4,"_","_","_","kanda","NC","","_","_"
5,"_","_","_","eka","PPX","","_","_"
6,"ca","_","_","ca","CCD","","_","_"
7,"dravaiḥ","_","_","drava","NC","","_","_"
1,"_","_","_","peṭārī","NC","","_","_"
2,"_","_","_","mūla","NC","","_","_"
3,"_","_","_","jambīra","NC","","_","_"
4,"_","_","_","drāva","NC","","_","_"
5,"_","_","_","vāpay","KDG","","_","_"
6,"pariplutam","_","_","pariplu","PPP","","_","_"
1,"itthaṃ","_","_","ittha","CX","","_","_"
2,"_","_","_","plu","PPP","","_","_"
3,"_","_","_","abhraka","NC","","_","_"
4,"_","_","_","pāda","NC","","_","_"
5,"_","_","_","aṃśa","NC","","_","_"
6,"ṭaṃkaṇaṃ","_","_","ṭaṅkaṇa","NC","","_","_"
7,"kṣipet","_","_","kṣip","V","kṣip","_","_"
1,"_","_","_","dina","NC","","_","_"
2,"_","_","_","eka","PPX","","_","_"
3,"_","_","_","marday","V","marday","_","_"
4,"_","_","_","khalva","NC","","_","_"
5,"_","_","_","yuj","PPP","","_","_"
6,"_","_","_","amla","NC","","_","_"
7,"kenacit","_","_","kiṃcit","PRI","","_","_"
1,"_","_","_","guñjā","NC","","_","_"
2,"_","_","_","guggulu","NC","","_","_"
3,"_","_","_","lākṣā","NC","","_","_"
4,"_","_","_","ūrṇā","NC","","_","_"
5,"_","_","_","sarjī","NC","","_","_"
6,"_","_","_","sarja","NC","","_","_"
7,"_","_","_","rasa","NC","","_","_"
8,"guḍam","_","_","guḍa","NC","","_","_"
1,"kṣudramīnaṃ","_","_","kṣudramīna","NC","","_","_"
2,"yavakṣāraṃ","_","_","yavakṣāra","NC","","_","_"
3,"_","_","_","kāca","NC","","_","_"
4,"_","_","_","piṇyāka","NC","","_","_"
5,"_","_","_","sūraṇa","NC","","_","_"
1,"bhūlatā","_","_","bhūlatā","NC","","_","_"
2,"triphalā","_","_","triphalā","NC","","_","_"
3,"vahniḥ","_","_","vahni","NC","","_","_"
4,"kṣīrakandaṃ","_","_","kṣīrakanda","NC","","_","_"
5,"punarnavā","_","_","punarnavā","NC","","_","_"
1,"dhattūro","_","_","dhattūra","NC","","_","_"
2,"lāṅgalī","_","_","lāṅgalī","NC","","_","_"
3,"pāṭhā","_","_","pāṭhā","NC","","_","_"
4,"balā","_","_","balā","NC","","_","_"
5,"_","_","_","gandhaka","NC","","_","_"
6,"_","_","_","tiktakā","NC","","_","_"
1,"_","_","_","go","CX","","_","_"
2,"_","_","_","kṣīra","NC","","_","_"
3,"paṃcalavaṇaṃ","_","_","pañcalavaṇa","NC","","_","_"
4,"_","_","_","sarpa","NC","","_","_"
5,"_","_","_","vṛścika","NC","","_","_"
6,"_","_","_","viṣa","NC","","_","_"
7,"madhu","_","_","madhu","NC","","_","_"
1,"ṣaḍbinduḥ","_","_","ṣaḍbindu","NC","","_","_"
2,"_","_","_","kṣudra","JJ","","_","_"
3,"_","_","_","śambūka","NC","","_","_"
4,"_","_","_","asthi","NC","","_","_"
5,"śaśakasya","_","_","śaśaka","NC","","_","_"
6,"ca","_","_","ca","CCD","","_","_"
1,"_","_","_","pārāvata","NC","","_","_"
2,"_","_","_","mala","NC","","_","_"
3,"tryūṣam","_","_","tryūṣa","NC","","_","_"
4,"iṃdragopaṃ","_","_","indragopa","NC","","_","_"
5,"ca","_","_","ca","CCD","","_","_"
6,"śigrukam","_","_","śigruka","NC","","_","_"
1,"godhūmaṃ","_","_","godhūma","NC","","_","_"
2,"sarṣapaṃ","_","_","sarṣapa","NC","","_","_"
3,"tulyaṃ","_","_","tulya","JJ","","_","_"
4,"_","_","_","chāgā","NC","","_","_"
5,"_","_","_","dugdha","NC","","_","_"
6,"mardayet","_","_","marday","V","marday","_","_"
1,"_","_","_","tad","PRD","","_","_"
2,"_","_","_","vyasta","JJ","","_","_"
3,"samastaṃ","_","_","samasta","JJ","","_","_"
4,"vā","_","_","vā","CCD","","_","_"
5,"_","_","_","yāma","NC","","_","_"
6,"_","_","_","mātra","NC","","_","_"
7,"piṇḍitam","_","_","piṇḍay","PPP","","_","_"
1,"asya","_","_","ida","PRD","","_","_"
2,"piṇḍasya","_","_","piṇḍa","NC","","_","_"
3,"_","_","_","bhāga","NC","","_","_"
4,"_","_","_","eka","PPX","","_","_"
5,"_","_","_","dvi","NUM","","_","_"
6,"_","_","_","bhāga","NC","","_","_"
7,"_","_","_","śodhay","PPP","","_","_"
8,"_","_","_","abhraka","NC","","_","_"
1,"_","_","_","pañcamāhiṣa","NC","","_","_"
2,"_","_","_","bhāga","NC","","_","_"
3,"_","_","_","eka","PPX","","_","_"
4,"_","_","_","sarva","JQ","","_","_"
5,"_","_","_","ekatra","CX","","_","_"
6,"lolayet","_","_","lolay","V","lolay","_","_"
1,"_","_","_","karṣa","NC","","_","_"
2,"_","_","_","aṃśa","NC","","_","_"
3,"vaṭikāḥ","_","_","vaṭikā","NC","","_","_"
4,"kāryāḥ","_","_","kṛ","KDG","","_","_"
5,"_","_","_","kiṃcit","PRI","","_","_"
6,"_","_","_","chāyā","NC","","_","_"
7,"_","_","_","viśoṣay","PPP","","_","_"
1,"_","_","_","khadira","NC","","_","_"
2,"_","_","_","aṅgāra","NC","","_","_"
3,"_","_","_","saṃtap","PPP","","_","_"
4,"koṣṭhīyantre","_","_","koṣṭhīyantra","NC","","_","_"
5,"kṣipan","_","_","kṣip","KDP","","_","_"
6,"kṣipan","_","_","kṣip","KDP","","_","_"
1,"vaṭikāḥ","_","_","vaṭikā","NC","","_","_"
2,"_","_","_","pañcan","NUM","","_","_"
3,"_","_","_","pañcan","NUM","","_","_"
4,"_","_","_","eva","CEM","","_","_"
5,"vaṅkanālena","_","_","vaṅkanāla","NC","","_","_"
6,"saṃdhaman","_","_","saṃdha","KDP","","_","_"
1,"samāptau","_","_","samāpti","NC","","_","_"
2,"_","_","_","kiṭṭa","NC","","_","_"
3,"_","_","_","ādā","CGDA","","_","_"
4,"_","_","_","sphoṭay","V","sphoṭay","_","_"
5,"_","_","_","svāṅgaśītala","JJ","","_","_"
1,"vartulaṃ","_","_","vartula","JJ","","_","_"
2,"_","_","_","sattva","NC","","_","_"
3,"_","_","_","ādā","CGDA","","_","_"
4,"_","_","_","śeṣa","JJ","","_","_"
5,"_","_","_","kiṭṭa","NC","","_","_"
6,"vicūrṇayet","_","_","vicūrṇay","V","vicūrṇay","_","_"
1,"_","_","_","cūrṇa","NC","","_","_"
2,"_","_","_","ardha","NC","","_","_"
3,"_","_","_","pūrva","PPX","","_","_"
4,"_","_","_","piṇḍa","NC","","_","_"
5,"_","_","_","tadvat","CX","","_","_"
6,"_","_","_","māhiṣapañcaka","NC","","_","_"
1,"ekīkṛtya","_","_","ekīkṛ","CGDA","","_","_"
2,"_","_","_","dha","V","dha","_","_"
3,"_","_","_","tadvat","CX","","_","_"
4,"_","_","_","sattva","NC","","_","_"
5,"_","_","_","tad","PRD","","_","_"
6,"_","_","_","tad","PRD","","_","_"
7,"_","_","_","samāhar","V","samāhṛ","_","_"
1,"_","_","_","iti","CQT","","_","_"
2,"_","_","_","eva","CX","","_","_"
3,"ca","_","_","ca","CCD","","_","_"
4,"punaḥ","_","_","punar","CAD","","_","_"
5,"_","_","_","kar","V","kṛ","_","_"
6,"_","_","_","tridhā","CX","","_","_"
7,"sattvaṃ","_","_","sattva","NC","","_","_"
8,"vimuñcati","_","_","vimuñc","V","vimuc","_","_"
1,"anena","_","_","ida","PRD","","_","_"
2,"_","_","_","krama","NC","","_","_"
3,"_","_","_","yoga","NC","","_","_"
4,"_","_","_","kānta","NC","","_","_"
5,"_","_","_","sattva","NC","","_","_"
6,"ca","_","_","ca","CCD","","_","_"
7,"mākṣikam","_","_","mākṣika","NC","","_","_"
1,"_","_","_","kaṭhina","JJ","","_","_"
2,"_","_","_","uparasa","NC","","_","_"
3,"_","_","_","ca","CCD","","_","_"
4,"_","_","_","anya","PPX","","_","_"
5,"śuddhā","_","_","śudh","PPP","","_","_"
6,"_","_","_","bhūnāga","NC","","_","_"
7,"_","_","_","mṛttikā","NC","","_","_"
1,"muñcanti","_","_","muñc","V","muc","_","_"
2,"_","_","_","sattva","NC","","_","_"
3,"_","_","_","saṃghāta","NC","","_","_"
4,"_","_","_","grāhay","V","grāhay","_","_"
5,"_","_","_","tad","PRD","","_","_"
6,"_","_","_","pṛthak","CX","","_","_"
7,"pṛthak","_","_","pṛthak","CX","","_","_"
1,"_","_","_","abhra","NC","","_","_"
2,"_","_","_","sattva","NC","","_","_"
3,"samādāya","_","_","samādā","CGDA","","_","_"
4,"_","_","_","sama","PPX","","_","_"
5,"_","_","_","aṃśa","NC","","_","_"
6,"_","_","_","kāca","NC","","_","_"
7,"_","_","_","ṭaṅkaṇa","NC","","_","_"
1,"dattvā","_","_","dā","CGDA","","_","_"
2,"dattvā","_","_","dā","CGDA","","_","_"
3,"_","_","_","tri","NUM","","_","_"
4,"_","_","_","vāra","NC","","_","_"
5,"tu","_","_","tu","CCD","","_","_"
6,"_","_","_","vajramūṣā","NC","","_","_"
7,"_","_","_","ga","PPP","","_","_"
8,"dhamet","_","_","dham","V","dha","_","_"
1,"amlavargaṃ","_","_","amlavarga","NC","","_","_"
2,"_","_","_","snuhī","NC","","_","_"
3,"_","_","_","pattra","NC","","_","_"
4,"_","_","_","ciñcā","NC","","_","_"
5,"_","_","_","bīja","NC","","_","_"
6,"_","_","_","sa_saha","CX","","_","_"
7,"_","_","_","valkala","NC","","_","_"
1,"_","_","_","kalkay","V","kalkay","_","_"
2,"_","_","_","tatra","CAD","","_","_"
3,"_","_","_","tad","PRD","","_","_"
4,"_","_","_","sattva","NC","","_","_"
5,"_","_","_","saptan","NUM","","_","_"
6,"_","_","_","vāra","NC","","_","_"
7,"niṣecayet","_","_","niṣecay","V","niṣecay","_","_"
1,"_","_","_","mṛdu","JJ","","_","_"
2,"_","_","_","śubhra","JJ","","_","_"
3,"_","_","_","bhav","V","bhū","_","_"
4,"_","_","_","sattva","NC","","_","_"
5,"_","_","_","saptan","NUM","","_","_"
6,"_","_","_","vāra","NC","","_","_"
7,"niṣecayet","_","_","niṣecay","V","niṣecay","_","_"
1,"dhānyābhraṃ","_","_","dhānyābhra","NC","","_","_"
2,"_","_","_","daśan","NUM","","_","_"
3,"_","_","_","bhāga","NC","","_","_"
4,"syāt","_","_","as","V","as","_","_"
5,"_","_","_","śudh","PPP","","_","_"
6,"_","_","_","nāga","NC","","_","_"
7,"_","_","_","tri","NUM","","_","_"
8,"_","_","_","bhāgaka","NC","","_","_"
1,"ṭaṃkaṇaṃ","_","_","ṭaṅkaṇa","NC","","_","_"
2,"mākṣikaṃ","_","_","mākṣika","NC","","_","_"
3,"sūtaṃ","_","_","sūta","NC","","_","_"
4,"_","_","_","bhāga","NC","","_","_"
5,"_","_","_","ekaika","PRC","","_","_"
6,"_","_","_","su","CAD","","_","_"
7,"_","_","_","śodhay","PPP","","_","_"
1,"ūrṇā","_","_","ūrṇā","NC","","_","_"
2,"sarjī","_","_","sarjī","NC","","_","_"
3,"yavakṣāraṃ","_","_","yavakṣāra","NC","","_","_"
4,"bhāgaṃ","_","_","bhāga","NC","","_","_"
5,"bhāgaṃ","_","_","bhāga","NC","","_","_"
6,"vimiśrayet","_","_","vimiśray","V","vimiśray","_","_"
1,"mardyaṃ","_","_","mṛd","KDG","","_","_"
2,"_","_","_","mūtra","NC","","_","_"
3,"_","_","_","amla","NC","","_","_"
4,"_","_","_","varga","NC","","_","_"
5,"yathāprāptaṃ","_","_","yathāprāpta","CX","","_","_"
6,"_","_","_","dina","NC","","_","_"
7,"_","_","_","avadhi","CX","","_","_"
1,"_","_","_","ajā","NC","","_","_"
2,"_","_","_","pañcāṅga","NC","","_","_"
3,"_","_","_","saṃyuj","PPP","","_","_"
4,"_","_","_","pūrvavat","CX","","_","_"
5,"_","_","_","sattva","NC","","_","_"
6,"_","_","_","pātana","NC","","_","_"
1,"_","_","_","kṛ","CGDA","","_","_"
2,"_","_","_","ādā","CGDA","","_","_"
3,"mṛdu","_","_","mṛdu","JJ","","_","_"
4,"_","_","_","sākṣāt","CX","","_","_"
5,"_","_","_","nirmala","JJ","","_","_"
6,"_","_","_","yojay","V","yojay","_","_"
7,"_","_","_","adhas","CX","","_","_"
1,"dolāyaṃtre","_","_","dolāyantra","NC","","_","_"
2,"_","_","_","sa_saha","CX","","_","_"
3,"_","_","_","āranāla","NC","","_","_"
4,"mākṣikaṃ","_","_","mākṣika","NC","","_","_"
5,"_","_","_","sveday","V","sveday","_","_"
6,"_","_","_","dina","NC","","_","_"
1,"cūrṇitaṃ","_","_","cūrṇay","PPP","","_","_"
2,"_","_","_","madhu","NC","","_","_"
3,"_","_","_","sarpis","NC","","_","_"
4,"_","_","_","loha","NC","","_","_"
5,"_","_","_","pātra","NC","","_","_"
6,"dinaṃ","_","_","dina","NC","","_","_"
7,"pacet","_","_","pac","V","pac","_","_"
1,"ādāya","_","_","ādā","CGDA","","_","_"
2,"bhāvayed","_","_","bhav","V","bhū","_","_"
3,"gharme","_","_","gharma","NC","","_","_"
4,"_","_","_","vajrī","NC","","_","_"
5,"_","_","_","kṣīra","NC","","_","_"
6,"_","_","_","dina","NC","","_","_"
7,"_","_","_","avadhi","CX","","_","_"
1,"_","_","_","gṛhadhūma","NC","","_","_"
2,"_","_","_","ghṛta","NC","","_","_"
3,"kṣaudraiḥ","_","_","kṣaudra","NC","","_","_"
4,"saṃyuktaṃ","_","_","saṃyuj","PPP","","_","_"
5,"_","_","_","marday","V","marday","_","_"
6,"_","_","_","dina","NC","","_","_"
1,"_","_","_","andhamūṣā","NC","","_","_"
2,"_","_","_","ga","PPP","","_","_"
3,"dhmātaṃ","_","_","dha","PPP","","_","_"
4,"sattvaṃ","_","_","sattva","NC","","_","_"
5,"_","_","_","guñjā","NC","","_","_"
6,"_","_","_","nibha","JJ","","_","_"
7,"bhavet","_","_","bhav","V","bhū","_","_"
1,"_","_","_","kadala","NC","","_","_"
2,"_","_","_","kanda","NC","","_","_"
3,"_","_","_","toya","NC","","_","_"
4,"mākṣikaṃ","_","_","mākṣika","NC","","_","_"
5,"_","_","_","śatadhā","CX","","_","_"
6,"_","_","_","ātapa","NC","","_","_"
1,"bhāvitaṃ","_","_","bhāvay","PPP","","_","_"
2,"_","_","_","pācay","V","pācay","_","_"
3,"_","_","_","yāma","NC","","_","_"
4,"_","_","_","sa_saha","CX","","_","_"
5,"_","_","_","ājya","NC","","_","_"
6,"_","_","_","vātāri","NC","","_","_"
7,"_","_","_","tailaka","NC","","_","_"
1,"_","_","_","pūrvavat","CX","","_","_"
2,"_","_","_","dhamana","NC","","_","_"
3,"_","_","_","sattva","NC","","_","_"
4,"_","_","_","indragopa","NC","","_","_"
5,"_","_","_","nibha","JJ","","_","_"
6,"bhavet","_","_","bhav","V","bhū","_","_"
1,"_","_","_","snuhī","NC","","_","_"
2,"_","_","_","arka","NC","","_","_"
3,"_","_","_","payas","NC","","_","_"
4,"_","_","_","stanya","NC","","_","_"
5,"_","_","_","mākṣika","NC","","_","_"
6,"_","_","_","marday","V","marday","_","_"
7,"_","_","_","dina","NC","","_","_"
1,"kaṃkuṣṭhaṃ","_","_","kaṅkuṣṭha","NC","","_","_"
2,"ṭaṃkaṇaṃ","_","_","ṭaṅkaṇa","NC","","_","_"
3,"_","_","_","ca","CCD","","_","_"
4,"_","_","_","eva","CEM","","_","_"
5,"_","_","_","pratipāda","NC","","_","_"
6,"_","_","_","aṃśa","NC","","_","_"
7,"_","_","_","miśray","PPP","","_","_"
1,"_","_","_","mūkamūṣā","NC","","_","_"
2,"_","_","_","ga","PPP","","_","_"
3,"dhmātaṃ","_","_","dha","PPP","","_","_"
4,"sattvaṃ","_","_","sattva","NC","","_","_"
5,"_","_","_","maṇi","NC","","_","_"
6,"_","_","_","nibha","JJ","","_","_"
7,"bhavet","_","_","bhav","V","bhū","_","_"
1,"_","_","_","kadala","NC","","_","_"
2,"_","_","_","kanda","NC","","_","_"
3,"_","_","_","tulasī","NC","","_","_"
4,"_","_","_","jambīra","NC","","_","_"
5,"dravaiḥ","_","_","drava","NC","","_","_"
6,"kramāt","_","_","kramāt","CX","","_","_"
1,"_","_","_","bhāvay","V","bhāvay","_","_"
2,"_","_","_","mākṣika","NC","","_","_"
3,"ślakṣṇaṃ","_","_","ślakṣṇa","JJ","","_","_"
4,"pratidrāveṇa","_","_","pratidrāva","NC","","_","_"
5,"saptadhā","_","_","saptadhā","CX","","_","_"
1,"ruddhvā","_","_","rudh","CGDA","","_","_"
2,"dhmāte","_","_","dha","PPP","","_","_"
3,"_","_","_","pat","V","pat","_","_"
4,"_","_","_","sattva","NC","","_","_"
5,"_","_","_","śuka","NC","","_","_"
6,"_","_","_","saṃnibha","JJ","","_","_"
7,"śubham","_","_","śubha","JJ","","_","_"
1,"_","_","_","mūtravarga","NC","","_","_"
2,"_","_","_","amlavarga","NC","","_","_"
3,"_","_","_","ca","CCD","","_","_"
4,"_","_","_","dvi","NUM","","_","_"
5,"_","_","_","saptan","NUM","","_","_"
6,"_","_","_","aha","NC","","_","_"
7,"vibhāvayet","_","_","vibhav","V","vibhū","_","_"
1,"mākṣikaṃ","_","_","mākṣika","NC","","_","_"
2,"_","_","_","tīvra","JJ","","_","_"
3,"_","_","_","gharma","NC","","_","_"
4,"_","_","_","dina","NC","","_","_"
5,"_","_","_","amla","NC","","_","_"
6,"_","_","_","ca","CCD","","_","_"
7,"mardayet","_","_","marday","V","marday","_","_"
1,"_","_","_","mitrapañcaka","NC","","_","_"
2,"_","_","_","saṃyuj","PPP","","_","_"
3,"_","_","_","vaṭī","NC","","_","_"
4,"kṛtvā","_","_","kṛ","CGDA","","_","_"
5,"dhamed","_","_","dham","V","dha","_","_"
6,"dṛḍham","_","_","dṛḍha","CX","","_","_"
1,"_","_","_","vyoman","NC","","_","_"
2,"_","_","_","vat","CX","","_","_"
3,"vaṃkanālena","_","_","vaṅkanāla","NC","","_","_"
4,"sattvaṃ","_","_","sattva","NC","","_","_"
5,"_","_","_","śulba","NC","","_","_"
6,"_","_","_","nibha","JJ","","_","_"
7,"bhavet","_","_","bhav","V","bhū","_","_"
1,"stanyaiḥ","_","_","stanya","NC","","_","_"
2,"_","_","_","kaṅkuṣṭhaka","NC","","_","_"
3,"_","_","_","ca","CCD","","_","_"
4,"_","_","_","eva","CEM","","_","_"
5,"_","_","_","kadala","NC","","_","_"
6,"_","_","_","toya","NC","","_","_"
7,"_","_","_","saṃyuta","JJ","","_","_"
1,"_","_","_","mitrapañcaka","NC","","_","_"
2,"_","_","_","saṃyuj","PPP","","_","_"
3,"_","_","_","mākṣika","NC","","_","_"
4,"_","_","_","dina","NC","","_","_"
5,"_","_","_","saptaka","NC","","_","_"
1,"bhāvitaṃ","_","_","bhāvay","PPP","","_","_"
2,"_","_","_","marday","V","marday","_","_"
3,"_","_","_","yāma","NC","","_","_"
4,"dinaṃ","_","_","dina","NC","","_","_"
5,"_","_","_","vātāri","NC","","_","_"
6,"_","_","_","tailaka","NC","","_","_"
1,"_","_","_","mṛdu","JJ","","_","_"
2,"_","_","_","agni","NC","","_","_"
3,"_","_","_","pac","V","pac","_","_"
4,"_","_","_","yāma","NC","","_","_"
5,"_","_","_","yāvat","CX","","_","_"
6,"_","_","_","bhav","V","bhū","_","_"
7,"golakam","_","_","golaka","NC","","_","_"
1,"sattvaṃ","_","_","sattva","NC","","_","_"
2,"_","_","_","kiṃśuka","NC","","_","_"
3,"_","_","_","puṣpa","NC","","_","_"
4,"_","_","_","ābha","JJ","","_","_"
5,"_","_","_","vyoman","NC","","_","_"
6,"_","_","_","vat","CX","","_","_"
7,"_","_","_","dhamana","NC","","_","_"
8,"bhavet","_","_","bhav","V","bhū","_","_"
1,"vimalānāṃ","_","_","vimalā","NC","","_","_"
2,"ca","_","_","ca","CCD","","_","_"
3,"śuddhānāṃ","_","_","śudh","PPP","","_","_"
4,"_","_","_","samyak","CX","","_","_"
5,"_","_","_","as","V","as","_","_"
6,"_","_","_","tāpya","NC","","_","_"
7,"_","_","_","vat","CX","","_","_"
8,"_","_","_","vidhi","NC","","_","_"
1,"_","_","_","su","CAD","","_","_"
2,"_","_","_","śudh","PPP","","_","_"
3,"mākṣikaṃ","_","_","mākṣika","NC","","_","_"
4,"cūrṇaṃ","_","_","carv","PPP","","_","_"
5,"_","_","_","mṛd","KDG","","_","_"
6,"_","_","_","amla","NC","","_","_"
7,"kenacit","_","_","kiṃcit","PRI","","_","_"
1,"_","_","_","kṣālay","V","kṣālay","_","_"
2,"_","_","_","āranāla","NC","","_","_"
3,"_","_","_","tu","CCD","","_","_"
4,"_","_","_","hi","CX","","_","_"
5,"_","_","_","adhastha","JJ","","_","_"
6,"_","_","_","svarṇa","NC","","_","_"
7,"_","_","_","cūrṇa","NC","","_","_"
8,"_","_","_","vat","CX","","_","_"
1,"jāyate","_","_","jan","V","jan","_","_"
2,"_","_","_","tad","PRD","","_","_"
3,"_","_","_","samuddhṛ","CGDA","","_","_"
4,"_","_","_","dhautasattva","NC","","_","_"
5,"_","_","_","ida","PRD","","_","_"
6,"bhavet","_","_","bhav","V","bhū","_","_"
1,"_","_","_","yojay","V","yojay","_","_"
2,"_","_","_","vāpana","NC","","_","_"
3,"_","_","_","ca","CCD","","_","_"
4,"_","_","_","eva","CEM","","_","_"
5,"bījānāṃ","_","_","bīja","NC","","_","_"
6,"yatra","_","_","yatra","CX","","_","_"
7,"yatra","_","_","yatra","CX","","_","_"
8,"vai","_","_","vai","CX","","_","_"
1,"mākṣikaṃ","_","_","mākṣika","NC","","_","_"
2,"_","_","_","pañcamitra","NC","","_","_"
3,"_","_","_","añj","PPP","","_","_"
4,"_","_","_","saptan","NUM","","_","_"
5,"_","_","_","aha","NC","","_","_"
6,"_","_","_","anta","NC","","_","_"
7,"vaṭīkṛtam","_","_","vaṭīkṛ","PPP","","_","_"
1,"_","_","_","pūrvavat","CX","","_","_"
2,"_","_","_","dhamana","NC","","_","_"
3,"_","_","_","eva","CEM","","_","_"
4,"sattvaṃ","_","_","sattva","NC","","_","_"
5,"_","_","_","lākṣā","NC","","_","_"
6,"_","_","_","nibha","JJ","","_","_"
7,"bhavet","_","_","bhav","V","bhū","_","_"
1,"_","_","_","agastya","NC","","_","_"
2,"_","_","_","śigru","NC","","_","_"
3,"_","_","_","ja","JJ","","_","_"
4,"_","_","_","toya","NC","","_","_"
5,"_","_","_","tri","NUM","","_","_"
6,"_","_","_","aha","NC","","_","_"
7,"bhāvyā","_","_","bhāvay","KDG","","_","_"
8,"manaḥśilā","_","_","manaḥśilā","NC","","_","_"
1,"_","_","_","tālaka","NC","","_","_"
2,"_","_","_","auṣadha","NC","","_","_"
3,"_","_","_","yoga","NC","","_","_"
4,"sattvaṃ","_","_","sattva","NC","","_","_"
5,"_","_","_","heman","NC","","_","_"
6,"_","_","_","nibha","JJ","","_","_"
7,"bhavet","_","_","bhav","V","bhū","_","_"
1,"_","_","_","go","CX","","_","_"
2,"_","_","_","mūtra","NC","","_","_"
3,"_","_","_","mātuluṅga","NC","","_","_"
4,"_","_","_","amla","NC","","_","_"
5,"_","_","_","dina","NC","","_","_"
6,"bhāvyā","_","_","bhāvay","KDG","","_","_"
7,"manaḥśilā","_","_","manaḥśilā","NC","","_","_"
1,"tāṃ","_","_","tad","PRD","","_","_"
2,"_","_","_","rakta","NC","","_","_"
3,"_","_","_","pīta","NC","","_","_"
4,"_","_","_","puṣpa","NC","","_","_"
5,"rasaiḥ","_","_","rasa","NC","","_","_"
6,"_","_","_","pitta","NC","","_","_"
7,"_","_","_","ca","CCD","","_","_"
8,"bhāvayet","_","_","bhav","V","bhū","_","_"
1,"_","_","_","dina","NC","","_","_"
2,"_","_","_","anta","NC","","_","_"
3,"_","_","_","marday","V","marday","_","_"
4,"_","_","_","yāma","NC","","_","_"
5,"_","_","_","mitrapañcaka","NC","","_","_"
6,"_","_","_","saṃyuta","JJ","","_","_"
1,"guṭikāṃ","_","_","guṭikā","NC","","_","_"
2,"_","_","_","kāca","NC","","_","_"
3,"_","_","_","kūpī","NC","","_","_"
4,"_","_","_","antar","CAD","","_","_"
5,"kṣiptvā","_","_","kṣip","CGDA","","_","_"
6,"tāṃ","_","_","tad","PRD","","_","_"
7,"_","_","_","kāca","NC","","_","_"
8,"_","_","_","kūpikā","NC","","_","_"
1,"_","_","_","sarvatas","CX","","_","_"
2,"_","_","_","aṅgula","NC","","_","_"
3,"_","_","_","māna","NC","","_","_"
4,"vastramṛttikayā","_","_","vastramṛttikā","NC","","_","_"
5,"limpet","_","_","lip","V","lip","_","_"
1,"śuṣkāṃ","_","_","śuṣka","JJ","","_","_"
2,"tāṃ","_","_","tad","PRD","","_","_"
3,"vālukāyaṃtre","_","_","vālukāyantra","NC","","_","_"
4,"_","_","_","śanais","CX","","_","_"
5,"_","_","_","mṛdu","JJ","","_","_"
6,"_","_","_","agni","NC","","_","_"
7,"pacet","_","_","pac","V","pac","_","_"
1,"śuṣke","_","_","śuṣka","JJ","","_","_"
2,"drave","_","_","drava","NC","","_","_"
3,"_","_","_","nirudh","CGDA","","_","_"
4,"_","_","_","atha","CAD","","_","_"
5,"samyak","_","_","samyak","CX","","_","_"
6,"_","_","_","mṛllavaṇa","NC","","_","_"
7,"_","_","_","mukha","NC","","_","_"
1,"_","_","_","caṇḍa","JJ","","_","_"
2,"_","_","_","agni","NC","","_","_"
3,"_","_","_","pac","V","pac","_","_"
4,"_","_","_","tāvat","CX","","_","_"
5,"_","_","_","yāvat","CX","","_","_"
6,"_","_","_","dvādaśan","NUM","","_","_"
7,"_","_","_","yāmaka","NC","","_","_"
1,"svāṃgaśītaṃ","_","_","svāṅgaśīta","JJ","","_","_"
2,"samuddhṛtya","_","_","samuddhṛ","CGDA","","_","_"
3,"bhittvā","_","_","bhid","CGDA","","_","_"
4,"kūpīṃ","_","_","kūpī","NC","","_","_"
5,"samāharet","_","_","samāhar","V","samāhṛ","_","_"
1,"_","_","_","ūrdhva","JJ","","_","_"
2,"_","_","_","lag","PPP","","_","_"
3,"_","_","_","śilā","NC","","_","_"
4,"_","_","_","sattva","NC","","_","_"
5,"_","_","_","bāla","JJ","","_","_"
6,"_","_","_","arka","NC","","_","_"
7,"_","_","_","kiraṇa","NC","","_","_"
8,"_","_","_","upama","JJ","","_","_"
1,"bhāgāḥ","_","_","bhāga","NC","","_","_"
2,"ṣoḍaśa","_","_","ṣoḍaśan","JJ","","_","_"
3,"tālasya","_","_","tāla","NC","","_","_"
4,"viṣaṃ","_","_","viṣa","NC","","_","_"
5,"_","_","_","pārada","NC","","_","_"
6,"_","_","_","ṭaṅkaṇa","NC","","_","_"
1,"_","_","_","śveta","JJ","","_","_"
2,"_","_","_","abhra","NC","","_","_"
3,"_","_","_","vaṅga","NC","","_","_"
4,"_","_","_","cūrṇa","NC","","_","_"
5,"pratibhāgaṃ","_","_","pratibhāga","NC","","_","_"
6,"vimiśrayet","_","_","vimiśray","V","vimiśray","_","_"
1,"sarvaṃ","_","_","sarva","JQ","","_","_"
2,"_","_","_","snuhī","NC","","_","_"
3,"_","_","_","arka","NC","","_","_"
4,"_","_","_","payas","NC","","_","_"
5,"_","_","_","marday","V","marday","_","_"
6,"_","_","_","divasa","NC","","_","_"
7,"_","_","_","traya","NC","","_","_"
1,"_","_","_","śilā","NC","","_","_"
2,"_","_","_","vat","CX","","_","_"
3,"_","_","_","grāhay","V","grāhay","_","_"
4,"_","_","_","sattva","NC","","_","_"
5,"_","_","_","tālaka","NC","","_","_"
6,"_","_","_","sphaṭika","NC","","_","_"
7,"_","_","_","upama","JJ","","_","_"
1,"_","_","_","snuh","NC","","_","_"
2,"_","_","_","kṣīra","NC","","_","_"
3,"_","_","_","kaṭutumbī","NC","","_","_"
4,"_","_","_","uttha","JJ","","_","_"
5,"tālaṃ","_","_","tāla","NC","","_","_"
6,"bhāvyaṃ","_","_","bhāvay","KDG","","_","_"
7,"_","_","_","dvi","NUM","","_","_"
8,"_","_","_","saptadhā","CX","","_","_"
1,"_","_","_","tila","NC","","_","_"
2,"_","_","_","sarṣapa","NC","","_","_"
3,"_","_","_","śigru","NC","","_","_"
4,"lavaṇaṃ","_","_","lavaṇa","NC","","_","_"
5,"mitrapaṃcakam","_","_","mitrapañcaka","NC","","_","_"
1,"_","_","_","ida","PRD","","_","_"
2,"_","_","_","tulya","JJ","","_","_"
3,"_","_","_","pūrva","PPX","","_","_"
4,"_","_","_","tāla","NC","","_","_"
5,"_","_","_","dina","NC","","_","_"
6,"_","_","_","eka","PPX","","_","_"
7,"vimardayet","_","_","vimarday","V","vimarday","_","_"
1,"_","_","_","chidramūṣā","NC","","_","_"
2,"_","_","_","ga","PPP","","_","_"
3,"dhmātaṃ","_","_","dha","PPP","","_","_"
4,"bhūdhare","_","_","bhūdhara","NC","","_","_"
5,"_","_","_","sattva","NC","","_","_"
6,"_","_","_","āhar","V","āhṛ","_","_"
1,"lākṣā","_","_","lākṣā","NC","","_","_"
2,"rājī","_","_","rājī","NC","","_","_"
3,"guḍaṃ","_","_","guḍa","NC","","_","_"
4,"_","_","_","śigru","NC","","_","_"
5,"_","_","_","ṭaṅkaṇa","NC","","_","_"
6,"lavaṇaṃ","_","_","lavaṇa","NC","","_","_"
7,"tilāḥ","_","_","tila","NC","","_","_"
1,"_","_","_","ida","PRD","","_","_"
2,"_","_","_","tulya","JJ","","_","_"
3,"_","_","_","śudh","PPP","","_","_"
4,"_","_","_","tāla","NC","","_","_"
5,"_","_","_","marday","V","marday","_","_"
6,"_","_","_","ravi","NC","","_","_"
7,"_","_","_","dugdhaka","NC","","_","_"
1,"dinaṃ","_","_","dina","NC","","_","_"
2,"vā","_","_","vā","CCD","","_","_"
3,"_","_","_","vajriṇī","NC","","_","_"
4,"_","_","_","dugdha","NC","","_","_"
5,"kuṣmāṇḍasya","_","_","kuṣmāṇḍa","NC","","_","_"
6,"_","_","_","drava","NC","","_","_"
7,"_","_","_","tathā","CX","","_","_"
1,"tena","_","_","tad","PRD","","_","_"
2,"kalkena","_","_","kalka","NC","","_","_"
3,"_","_","_","lip","PPP","","_","_"
4,"_","_","_","antar","CAD","","_","_"
5,"_","_","_","chidramūṣā","NC","","_","_"
6,"nirodhayet","_","_","nirrudh","V","nirrudh","_","_"
1,"_","_","_","puṭa","NC","","_","_"
2,"_","_","_","vā","CCD","","_","_"
3,"dhamanād","_","_","dhamana","NC","","_","_"
4,"grāhyaṃ","_","_","grah","KDG","","_","_"
5,"sattvaṃ","_","_","sattva","NC","","_","_"
6,"pātālayantrake","_","_","pātālayantraka","NC","","_","_"
1,"_","_","_","tālaka","NC","","_","_"
2,"_","_","_","aṣṭama","JJ","","_","_"
3,"_","_","_","aṃśa","NC","","_","_"
4,"deyaṃ","_","_","dā","KDG","","_","_"
5,"sūtaṃ","_","_","sūta","NC","","_","_"
6,"ca","_","_","ca","CCD","","_","_"
7,"ṭaṃkaṇam","_","_","ṭaṅkaṇa","NC","","_","_"
1,"kuṣmāṇḍasya","_","_","kuṣmāṇḍa","NC","","_","_"
2,"rasaiḥ","_","_","rasa","NC","","_","_"
3,"snuhyāḥ","_","_","snuhī","NC","","_","_"
4,"_","_","_","kṣīra","NC","","_","_"
5,"_","_","_","mṛd","KDG","","_","_"
6,"_","_","_","dina","NC","","_","_"
7,"_","_","_","traya","NC","","_","_"
1,"_","_","_","tad","PRD","","_","_"
2,"_","_","_","gola","NC","","_","_"
3,"_","_","_","chidramūṣā","NC","","_","_"
4,"_","_","_","antar","CAD","","_","_"
5,"_","_","_","grah","KDG","","_","_"
6,"sattvaṃ","_","_","sattva","NC","","_","_"
7,"ca","_","_","ca","CCD","","_","_"
8,"pūrvavat","_","_","pūrvavat","CX","","_","_"
1,"_","_","_","lākṣā","NC","","_","_"
2,"_","_","_","abhayā","NC","","_","_"
3,"ca","_","_","ca","CCD","","_","_"
4,"bhūnāgaṃ","_","_","bhūnāga","NC","","_","_"
5,"gṛhadhūmaṃ","_","_","gṛhadhūma","NC","","_","_"
6,"_","_","_","jaṭā","NC","","_","_"
7,"_","_","_","kaṇā","NC","","_","_"
1,"_","_","_","niśā","NC","","_","_"
2,"_","_","_","ṭaṅkaṇa","NC","","_","_"
3,"_","_","_","madhu","NC","","_","_"
4,"_","_","_","ājya","NC","","_","_"
5,"_","_","_","ida","PRD","","_","_"
6,"_","_","_","tulya","JJ","","_","_"
7,"ca","_","_","ca","CCD","","_","_"
8,"tutthakam","_","_","tutthaka","NC","","_","_"
1,"sarvaṃ","_","_","sarva","JQ","","_","_"
2,"_","_","_","mṛd","KDG","","_","_"
3,"_","_","_","ajā","NC","","_","_"
4,"_","_","_","kṣīra","NC","","_","_"
5,"_","_","_","andhamūṣā","NC","","_","_"
6,"_","_","_","ga","PPP","","_","_"
7,"dhamet","_","_","dham","V","dha","_","_"
1,"sattvaṃ","_","_","sattva","NC","","_","_"
2,"_","_","_","kiṃśuka","NC","","_","_"
3,"_","_","_","puṣpa","NC","","_","_"
4,"_","_","_","ābha","JJ","","_","_"
5,"jāyate","_","_","jan","V","jan","_","_"
6,"_","_","_","na","CNG","","_","_"
7,"_","_","_","atra","CAD","","_","_"
8,"saṃśayaḥ","_","_","saṃśaya","NC","","_","_"
1,"_","_","_","haridrā","NC","","_","_"
2,"_","_","_","sūraṇa","NC","","_","_"
3,"_","_","_","aṅkolla","NC","","_","_"
4,"taṇḍulī","_","_","taṇḍulī","NC","","_","_"
5,"gaṃdhakaṃ","_","_","gandhaka","NC","","_","_"
6,"guḍam","_","_","guḍa","NC","","_","_"
1,"_","_","_","madhu","NC","","_","_"
2,"_","_","_","ājya","NC","","_","_"
3,"_","_","_","ṭaṅkaṇa","NC","","_","_"
4,"tulyaṃ","_","_","tulya","JJ","","_","_"
5,"_","_","_","tuttha","NC","","_","_"
6,"_","_","_","ida","PRD","","_","_"
7,"samaṃ","_","_","sama","PPX","","_","_"
8,"bhavet","_","_","bhav","V","bhū","_","_"
1,"stanyena","_","_","stanya","NC","","_","_"
2,"_","_","_","marday","V","marday","_","_"
3,"_","_","_","sarva","JQ","","_","_"
4,"chidramūṣāṃ","_","_","chidramūṣā","NC","","_","_"
5,"vilepayet","_","_","vilepay","V","vilepay","_","_"
1,"ruddhvā","_","_","rudh","CGDA","","_","_"
2,"pātālayaṃtreṇa","_","_","pātālayantra","NC","","_","_"
3,"dhmāte","_","_","dha","PPP","","_","_"
4,"sattvaṃ","_","_","sattva","NC","","_","_"
5,"vimuñcati","_","_","vimuñc","V","vimuc","_","_"
1,"tutthasya","_","_","tuttha","NC","","_","_"
2,"ṭaṃkaṇaṃ","_","_","ṭaṅkaṇa","NC","","_","_"
3,"pādaṃ","_","_","pāda","NC","","_","_"
4,"_","_","_","cūrṇay","V","cūrṇay","_","_"
5,"_","_","_","madhu","NC","","_","_"
6,"_","_","_","sarpis","NC","","_","_"
1,"tutthena","_","_","tuttha","NC","","_","_"
2,"miśritaṃ","_","_","miśray","PPP","","_","_"
3,"dhmātaṃ","_","_","dha","PPP","","_","_"
4,"koṣṭhīyantre","_","_","koṣṭhīyantra","NC","","_","_"
5,"_","_","_","dṛḍha","JJ","","_","_"
6,"_","_","_","agni","NC","","_","_"
1,"dhāmite","_","_","dhāmay","PPP","","_","_"
2,"muñcate","_","_","muñc","V","muc","_","_"
3,"sattvaṃ","_","_","sattva","NC","","_","_"
4,"_","_","_","kīra","NC","","_","_"
5,"_","_","_","tuṇḍa","NC","","_","_"
6,"_","_","_","sama","PPX","","_","_"
7,"_","_","_","prabhā","NC","","_","_"
1,"sauvīraṃ","_","_","sauvīra","NC","","_","_"
2,"_","_","_","tīkṣṇa","NC","","_","_"
3,"_","_","_","cūrṇa","NC","","_","_"
4,"ca","_","_","ca","CCD","","_","_"
5,"_","_","_","mūṣā","NC","","_","_"
6,"_","_","_","andhay","V","andhay","_","_"
7,"samam","_","_","sama","CX","","_","_"
1,"haṭhād","_","_","haṭha","NC","","_","_"
2,"dhmāte","_","_","dha","PPP","","_","_"
3,"_","_","_","bhav","V","bhū","_","_"
4,"_","_","_","sattva","NC","","_","_"
5,"varanāgaṃ","_","_","varanāga","NC","","_","_"
6,"_","_","_","tad","PRD","","_","_"
7,"_","_","_","vak","V","vac","_","_"
1,"_","_","_","kṣāra","NC","","_","_"
2,"_","_","_","amla","NC","","_","_"
3,"_","_","_","sneha","NC","","_","_"
4,"_","_","_","pitta","NC","","_","_"
5,"_","_","_","ca","CCD","","_","_"
6,"kramād","_","_","kramāt","CX","","_","_"
7,"bhāvyaṃ","_","_","bhāvay","KDG","","_","_"
8,"dinaṃ","_","_","dina","NC","","_","_"
9,"dinam","_","_","dina","NC","","_","_"
1,"puṣpāṇāṃ","_","_","puṣpa","NC","","_","_"
2,"_","_","_","rakta","NC","","_","_"
3,"_","_","_","pīta","NC","","_","_"
4,"_","_","_","rasa","NC","","_","_"
5,"_","_","_","bhāvay","KDG","","_","_"
6,"_","_","_","dina","NC","","_","_"
7,"_","_","_","dvaya","NC","","_","_"
1,"rasakaṃ","_","_","rasaka","NC","","_","_"
2,"_","_","_","cūrṇay","V","cūrṇay","_","_"
3,"_","_","_","paścāt","CAD","","_","_"
4,"_","_","_","ūrṇā","NC","","_","_"
5,"lākṣā","_","_","lākṣā","NC","","_","_"
6,"_","_","_","niśā","NC","","_","_"
7,"_","_","_","abhayā","NC","","_","_"
1,"ṭaṃkaṇaṃ","_","_","ṭaṅkaṇa","NC","","_","_"
2,"_","_","_","śigru","NC","","_","_"
3,"_","_","_","dhūma","NC","","_","_"
4,"ca","_","_","ca","CCD","","_","_"
5,"bhūnāgaṃ","_","_","bhūnāga","NC","","_","_"
6,"saptamaṃ","_","_","saptama","JJ","","_","_"
7,"bhavet","_","_","bhav","V","bhū","_","_"
1,"ebhiḥ","_","_","ida","PRD","","_","_"
2,"samaṃ","_","_","sama","PPX","","_","_"
3,"tu","_","_","tu","CCD","","_","_"
4,"_","_","_","tad","PRD","","_","_"
5,"_","_","_","cūrṇa","NC","","_","_"
6,"_","_","_","ajā","NC","","_","_"
7,"_","_","_","kṣīra","NC","","_","_"
8,"mardayet","_","_","marday","V","marday","_","_"
1,"_","_","_","yāma","NC","","_","_"
2,"_","_","_","tad","PRD","","_","_"
3,"kalkena","_","_","kalka","NC","","_","_"
4,"lepyā","_","_","lepay","KDG","","_","_"
5,"vārtākamūṣikā","_","_","vārtākamūṣikā","NC","","_","_"
1,"śuṣkā","_","_","śuṣka","JJ","","_","_"
2,"_","_","_","ca","CCD","","_","_"
3,"_","_","_","ardha","NC","","_","_"
4,"_","_","_","mukha","NC","","_","_"
5,"_","_","_","aṅgāra","NC","","_","_"
6,"_","_","_","dha","PPP","","_","_"
7,"sattvaṃ","_","_","sattva","NC","","_","_"
8,"samāharet","_","_","samāhar","V","samāhṛ","_","_"
1,"_","_","_","rasaka","NC","","_","_"
2,"_","_","_","eka","PPX","","_","_"
3,"_","_","_","bhāga","NC","","_","_"
4,"tu","_","_","tu","CCD","","_","_"
5,"_","_","_","triphalā","NC","","_","_"
6,"_","_","_","mitrapañcaka","NC","","_","_"
1,"_","_","_","rajanī","NC","","_","_"
2,"_","_","_","gṛhadhūma","NC","","_","_"
3,"ca","_","_","ca","CCD","","_","_"
4,"_","_","_","daśan","NUM","","_","_"
5,"_","_","_","eka","PPX","","_","_"
6,"_","_","_","bhāgaka","NC","","_","_"
1,"_","_","_","ajā","NC","","_","_"
2,"_","_","_","kṣīra","NC","","_","_"
3,"_","_","_","dina","NC","","_","_"
4,"mardyam","_","_","mṛd","KDG","","_","_"
5,"_","_","_","athavā","CX","","_","_"
6,"_","_","_","amla","NC","","_","_"
7,"kenacit","_","_","kiṃcit","PRI","","_","_"
1,"pūrvavad","_","_","pūrvavat","CX","","_","_"
2,"_","_","_","grāhay","V","grāhay","_","_"
3,"_","_","_","sattva","NC","","_","_"
4,"_","_","_","rasaka","NC","","_","_"
5,"_","_","_","kuṭila","NC","","_","_"
6,"_","_","_","prabhā","NC","","_","_"
1,"_","_","_","vandhyā","NC","","_","_"
2,"_","_","_","cūrṇa","NC","","_","_"
3,"ca","_","_","ca","CCD","","_","_"
4,"vaikrāṃtaṃ","_","_","vaikrānta","NC","","_","_"
5,"chāyāyā","_","_","chāyā","NC","","_","_"
6,"_","_","_","marday","V","marday","_","_"
7,"_","_","_","sama","PPX","","_","_"
1,"_","_","_","ajā","NC","","_","_"
2,"_","_","_","mūtra","NC","","_","_"
3,"_","_","_","dina","NC","","_","_"
4,"_","_","_","eka","PPX","","_","_"
5,"tu","_","_","tu","CCD","","_","_"
6,"sattvaṃ","_","_","sattva","NC","","_","_"
7,"_","_","_","rajata","NC","","_","_"
8,"_","_","_","vat","CX","","_","_"
9,"bhavet","_","_","bhav","V","bhū","_","_"
1,"_","_","_","mokṣa","NC","","_","_"
2,"_","_","_","moraṭa","NC","","_","_"
3,"_","_","_","pālāśa","NC","","_","_"
4,"_","_","_","kṣāra","NC","","_","_"
5,"_","_","_","go","CX","","_","_"
6,"_","_","_","mūtra","NC","","_","_"
7,"_","_","_","gālay","PPP","","_","_"
1,"_","_","_","grah","PPP","","_","_"
2,"_","_","_","ātapa","NC","","_","_"
3,"śuṣkaṃ","_","_","śuṣka","JJ","","_","_"
4,"vajrakandaṃ","_","_","vajrakanda","NC","","_","_"
5,"ca","_","_","ca","CCD","","_","_"
6,"ṭaṃkaṇam","_","_","ṭaṅkaṇa","NC","","_","_"
1,"lākṣā","_","_","lākṣā","NC","","_","_"
2,"_","_","_","śikhin","NC","","_","_"
3,"_","_","_","śikhā","NC","","_","_"
4,"_","_","_","tulya","JJ","","_","_"
5,"vaikrāṃtaṃ","_","_","vaikrānta","NC","","_","_"
6,"_","_","_","sarva","JQ","","_","_"
7,"_","_","_","tulyaka","JJ","","_","_"
1,"_","_","_","meṣaśṛṅgī","NC","","_","_"
2,"_","_","_","drava","NC","","_","_"
3,"mardyam","_","_","mṛd","KDG","","_","_"
4,"_","_","_","tad","PRD","","_","_"
5,"_","_","_","sarva","JQ","","_","_"
6,"_","_","_","dina","NC","","_","_"
7,"_","_","_","avadhi","CX","","_","_"
1,"piṇḍitaṃ","_","_","piṇḍay","PPP","","_","_"
2,"_","_","_","mūkamūṣā","NC","","_","_"
3,"_","_","_","antar","CAD","","_","_"
4,"kṛtvā","_","_","kṛ","CGDA","","_","_"
5,"dhāmyaṃ","_","_","dha","KDG","","_","_"
6,"_","_","_","haṭha","NC","","_","_"
7,"_","_","_","agni","NC","","_","_"
1,"_","_","_","tatra","CAD","","_","_"
2,"_","_","_","eva","CEM","","_","_"
3,"muñcate","_","_","muñc","V","muc","_","_"
4,"sattvaṃ","_","_","sattva","NC","","_","_"
5,"vaikrāṃtaṃ","_","_","vaikrānta","NC","","_","_"
6,"_","_","_","rasa","NC","","_","_"
7,"_","_","_","bandhaka","NC","","_","_"
1,"vaikrāṃtānāṃ","_","_","vaikrānta","NC","","_","_"
2,"_","_","_","pala","NC","","_","_"
3,"_","_","_","eka","PPX","","_","_"
4,"tu","_","_","tu","CCD","","_","_"
5,"_","_","_","karṣa","NC","","_","_"
6,"_","_","_","eka","PPX","","_","_"
7,"ṭaṃkaṇasya","_","_","ṭaṅkaṇa","NC","","_","_"
8,"ca","_","_","ca","CCD","","_","_"
1,"_","_","_","ravi","NC","","_","_"
2,"_","_","_","kṣīra","NC","","_","_"
3,"_","_","_","dina","NC","","_","_"
4,"_","_","_","bhāvay","KDG","","_","_"
5,"_","_","_","atha","CAD","","_","_"
6,"_","_","_","śigru","NC","","_","_"
7,"_","_","_","drava","NC","","_","_"
8,"_","_","_","dina","NC","","_","_"
1,"_","_","_","guñjā","NC","","_","_"
2,"_","_","_","piṇyāka","NC","","_","_"
3,"_","_","_","vahni","NC","","_","_"
4,"pratikarṣaṃ","_","_","pratikarṣa","NC","","_","_"
5,"niyojayet","_","_","niyuj","V","niyuj","_","_"
1,"etena","_","_","tad","PRD","","_","_"
2,"gulikāṃ","_","_","gulikā","NC","","_","_"
3,"kṛtvā","_","_","kṛ","CGDA","","_","_"
4,"koṣṭhīyantre","_","_","koṣṭhīyantra","NC","","_","_"
5,"dhamed","_","_","dham","V","dha","_","_"
6,"dṛḍham","_","_","dṛḍha","CX","","_","_"
1,"_","_","_","śaṅkha","NC","","_","_"
2,"_","_","_","kunda","NC","","_","_"
3,"_","_","_","indu","NC","","_","_"
4,"_","_","_","saṃkāśa","NC","","_","_"
5,"sattvaṃ","_","_","sattva","NC","","_","_"
6,"_","_","_","vaikrānta","NC","","_","_"
7,"_","_","_","ja","JJ","","_","_"
8,"bhavet","_","_","bhav","V","bhū","_","_"
1,"vaikrāṃtaṃ","_","_","vaikrānta","NC","","_","_"
2,"vajrakaṃdaṃ","_","_","vajrakanda","NC","","_","_"
3,"ca","_","_","ca","CCD","","_","_"
4,"samaṃ","_","_","sama","PPX","","_","_"
5,"_","_","_","snuh","NC","","_","_"
6,"_","_","_","payas","NC","","_","_"
7,"samam","_","_","sama","PPX","","_","_"
1,"_","_","_","mahiṣī","NC","","_","_"
2,"_","_","_","navanīta","NC","","_","_"
3,"ca","_","_","ca","CCD","","_","_"
4,"_","_","_","sa_saha","CX","","_","_"
5,"_","_","_","kṣaudra","NC","","_","_"
6,"_","_","_","marday","V","marday","_","_"
7,"_","_","_","dina","NC","","_","_"
1,"_","_","_","pūrvavat","CX","","_","_"
2,"_","_","_","dhamana","NC","","_","_"
3,"sattvam","_","_","sattva","NC","","_","_"
4,"_","_","_","indragopa","NC","","_","_"
5,"_","_","_","nibha","JJ","","_","_"
6,"bhavet","_","_","bhav","V","bhū","_","_"
1,"gairikaṃ","_","_","gairika","NC","","_","_"
2,"raktavargeṇa","_","_","raktavarga","NC","","_","_"
3,"pītavargeṇa","_","_","pītavarga","NC","","_","_"
4,"bhāvitam","_","_","bhāvay","PPP","","_","_"
1,"_","_","_","saptan","NUM","","_","_"
2,"_","_","_","aha","NC","","_","_"
3,"_","_","_","marday","V","marday","_","_"
4,"_","_","_","yāma","NC","","_","_"
5,"_","_","_","mitrapañcaka","NC","","_","_"
6,"_","_","_","saṃyuta","JJ","","_","_"
1,"_","_","_","tad","PRD","","_","_"
2,"_","_","_","vaṭī","NC","","_","_"
3,"koṣṭhikāyaṃtre","_","_","koṣṭhikāyantra","NC","","_","_"
4,"sattvaṃ","_","_","sattva","NC","","_","_"
5,"muñcati","_","_","muñc","V","muc","_","_"
6,"nirmalam","_","_","nirmala","JJ","","_","_"
1,"_","_","_","sita","JJ","","_","_"
2,"_","_","_","asita","JJ","","_","_"
3,"ca","_","_","ca","CCD","","_","_"
4,"saurāṣṭrī","_","_","saurāṣṭrā","NC","","_","_"
5,"_","_","_","go","CX","","_","_"
6,"_","_","_","pitta","NC","","_","_"
7,"_","_","_","bhāvay","V","bhāvay","_","_"
8,"_","_","_","tu","CCD","","_","_"
9,"tām","_","_","tad","PRD","","_","_"
1,"_","_","_","śata","NUM","","_","_"
2,"_","_","_","vāra","NC","","_","_"
3,"prayatnena","_","_","prayatna","NC","","_","_"
4,"_","_","_","mitrapañcaka","NC","","_","_"
5,"_","_","_","saṃyuta","JJ","","_","_"
1,"_","_","_","dhamana","NC","","_","_"
2,"_","_","_","muñc","V","muc","_","_"
3,"sattvaṃ","_","_","sattva","NC","","_","_"
4,"krāmakaṃ","_","_","krāmaka","JJ","","_","_"
5,"koṣṭhiyaṃtrake","_","_","koṣṭhiyantraka","NC","","_","_"
1,"sasyakaṃ","_","_","sasyaka","NC","","_","_"
2,"cūrṇitaṃ","_","_","cūrṇay","PPP","","_","_"
3,"bhāvyaṃ","_","_","bhāvay","KDG","","_","_"
4,"dinaṃ","_","_","dina","NC","","_","_"
5,"_","_","_","śaśaka","NC","","_","_"
6,"_","_","_","raktaka","NC","","_","_"
1,"_","_","_","strī","NC","","_","_"
2,"_","_","_","mūtra","NC","","_","_"
3,"_","_","_","vā","CCD","","_","_"
4,"_","_","_","atha","CAD","","_","_"
5,"_","_","_","go","CX","","_","_"
6,"_","_","_","mūtra","NC","","_","_"
7,"_","_","_","tad","PRD","","_","_"
8,"_","_","_","pāda","NC","","_","_"
9,"_","_","_","aṃśa","NC","","_","_"
10,"niśāṃ","_","_","niśā","NC","","_","_"
11,"kṣipet","_","_","kṣip","V","kṣip","_","_"
1,"mardyaṃ","_","_","mṛd","KDG","","_","_"
2,"_","_","_","karañja","NC","","_","_"
3,"_","_","_","taila","NC","","_","_"
4,"_","_","_","yāma","NC","","_","_"
5,"_","_","_","eka","PPX","","_","_"
6,"golakaṃ","_","_","golaka","NC","","_","_"
7,"ca","_","_","ca","CCD","","_","_"
8,"tat","_","_","tad","PRD","","_","_"
1,"_","_","_","andhamūṣā","NC","","_","_"
2,"_","_","_","ga","PPP","","_","_"
3,"dhāmyaṃ","_","_","dha","KDG","","_","_"
4,"_","_","_","ghaṭikā","NC","","_","_"
5,"_","_","_","ardha","NC","","_","_"
6,"_","_","_","dṛḍha","JJ","","_","_"
7,"_","_","_","agni","NC","","_","_"
1,"_","_","_","indragopaka","NC","","_","_"
2,"_","_","_","saṃkāśa","NC","","_","_"
3,"sattvaṃ","_","_","sattva","NC","","_","_"
4,"muñcati","_","_","muñc","V","muc","_","_"
5,"śobhanam","_","_","śobhana","JJ","","_","_"
1,"caturvidhaṃ","_","_","caturvidha","JJ","","_","_"
2,"tu","_","_","tu","CCD","","_","_"
3,"kāsīsaṃ","_","_","kāsīsa","NC","","_","_"
4,"raktaṃ","_","_","rakta","JJ","","_","_"
5,"pītaṃ","_","_","pīta","JJ","","_","_"
6,"_","_","_","sita","JJ","","_","_"
7,"_","_","_","asita","JJ","","_","_"
1,"mardayet","_","_","marday","V","marday","_","_"
2,"pittavargeṇa","_","_","pittavarga","NC","","_","_"
3,"_","_","_","tiktakośātakī","NC","","_","_"
4,"_","_","_","drava","NC","","_","_"
1,"_","_","_","kāsamarda","NC","","_","_"
2,"_","_","_","drava","NC","","_","_"
3,"_","_","_","ca","CCD","","_","_"
4,"_","_","_","eva","CEM","","_","_"
5,"_","_","_","mitrapañcaka","NC","","_","_"
6,"_","_","_","saṃyuta","JJ","","_","_"
1,"_","_","_","tad","PRD","","_","_"
2,"_","_","_","vaṭī","NC","","_","_"
3,"koṣṭhikāyaṃtre","_","_","koṣṭhikāyantra","NC","","_","_"
4,"dhmāte","_","_","dha","PPP","","_","_"
5,"sattvaṃ","_","_","sattva","NC","","_","_"
6,"vimuñcati","_","_","vimuñc","V","vimuc","_","_"
1,"rājāvartam","_","_","rājāvarta","NC","","_","_"
2,"_","_","_","ayas","NC","","_","_"
3,"_","_","_","pātra","NC","","_","_"
4,"_","_","_","pācay","V","pācay","_","_"
5,"_","_","_","māhiṣa","JJ","","_","_"
6,"_","_","_","ghṛta","NC","","_","_"
1,"_","_","_","payas","NC","","_","_"
2,"_","_","_","ca","CCD","","_","_"
3,"dinaṃ","_","_","dina","NC","","_","_"
4,"_","_","_","pac","V","pac","_","_"
5,"_","_","_","mitrapañcaka","NC","","_","_"
6,"_","_","_","saṃyuta","JJ","","_","_"
1,"rajanyāḥ","_","_","rajanī","NC","","_","_"
2,"pañcagavyena","_","_","pañcagavya","NC","","_","_"
3,"_","_","_","piṇḍī","NC","","_","_"
4,"_","_","_","bandh","PPP","","_","_"
5,"tu","_","_","tu","CCD","","_","_"
6,"kārayet","_","_","kar","V","kṛ","_","_"
1,"_","_","_","khadira","NC","","_","_"
2,"_","_","_","aṅgāra","NC","","_","_"
3,"_","_","_","saṃyoga","NC","","_","_"
4,"koṣṭhyāṃ","_","_","koṣṭhī","NC","","_","_"
5,"sattvaṃ","_","_","sattva","NC","","_","_"
6,"vimuñcati","_","_","vimuñc","V","vimuc","_","_"
1,"_","_","_","valmīka","NC","","_","_"
2,"_","_","_","śikhara","NC","","_","_"
3,"_","_","_","ākāra","NC","","_","_"
4,"bhaṅge","_","_","bhaṅga","NC","","_","_"
5,"_","_","_","nīlotpala","NC","","_","_"
6,"_","_","_","dyuti","NC","","_","_"
1,"gharṣaṇe","_","_","gharṣaṇa","NC","","_","_"
2,"_","_","_","gairika","NC","","_","_"
3,"_","_","_","chāyā","NC","","_","_"
4,"_","_","_","srotoñjana","NC","","_","_"
5,"_","_","_","ida","PRD","","_","_"
6,"bhavet","_","_","bhav","V","bhū","_","_"
1,"_","_","_","rājāvartaka","NC","","_","_"
2,"_","_","_","vat","CX","","_","_"
3,"_","_","_","sattva","NC","","_","_"
4,"grāhyaṃ","_","_","grah","KDG","","_","_"
5,"_","_","_","srotoñjana","NC","","_","_"
6,"_","_","_","api","CX","","_","_"
1,"_","_","_","vyoman","NC","","_","_"
2,"_","_","_","sattva","NC","","_","_"
3,"cūrṇaṃ","_","_","cūrṇa","NC","","_","_"
4,"tu","_","_","tu","CCD","","_","_"
5,"_","_","_","yad","PRL","","_","_"
6,"_","_","_","kiṃcit","PRI","","_","_"
7,"_","_","_","dhātu","NC","","_","_"
8,"_","_","_","cūrṇaka","NC","","_","_"
1,"_","_","_","dvandvamelāpa","NC","","_","_"
2,"_","_","_","lip","PPP","","_","_"
3,"mūṣāyāṃ","_","_","mūṣā","NC","","_","_"
4,"tad","_","_","tad","PRD","","_","_"
5,"dvayaṃ","_","_","dvaya","NC","","_","_"
6,"samam","_","_","sama","PPX","","_","_"
1,"dhmātavyam","_","_","dha","KDG","","_","_"
2,"arivargeṇa","_","_","arivarga","NC","","_","_"
3,"kṣipte","_","_","kṣip","PPP","","_","_"
4,"milati","_","_","mil","V","mil","_","_"
5,"_","_","_","tad","PRD","","_","_"
6,"_","_","_","kṣaṇa","NC","","_","_"
1,"viṣaṃ","_","_","viṣa","NC","","_","_"
2,"_","_","_","ṭaṅkaṇa","NC","","_","_"
3,"_","_","_","guñjā","NC","","_","_"
4,"_","_","_","ca","CCD","","_","_"
5,"khuraṃ","_","_","khura","NC","","_","_"
6,"śṛṅgaṃ","_","_","śṛṅga","NC","","_","_"
7,"ca","_","_","ca","CCD","","_","_"
8,"bheṣajam","_","_","bheṣaja","NC","","_","_"
1,"_","_","_","maṇḍūka","NC","","_","_"
2,"_","_","_","vasā","NC","","_","_"
3,"piṣṭvā","_","_","piṣ","CGDA","","_","_"
4,"_","_","_","mūṣā","NC","","_","_"
5,"_","_","_","lepa","NC","","_","_"
6,"tu","_","_","tu","CCD","","_","_"
7,"kārayet","_","_","kar","V","kṛ","_","_"
1,"tasyāṃ","_","_","tad","PRD","","_","_"
2,"milati","_","_","mil","V","mil","_","_"
3,"sattvāni","_","_","sattva","NC","","_","_"
4,"cūrṇāni","_","_","cūrṇa","NC","","_","_"
5,"vividhāni","_","_","vividha","JJ","","_","_"
6,"ca","_","_","ca","CCD","","_","_"
1,"trikṣāraṃ","_","_","trikṣāra","NC","","_","_"
2,"_","_","_","dhātakī","NC","","_","_"
3,"_","_","_","puṣpa","NC","","_","_"
4,"gugguluṃ","_","_","guggulu","NC","","_","_"
5,"ca","_","_","ca","CCD","","_","_"
6,"samaṃ","_","_","sama","PPX","","_","_"
7,"samam","_","_","sama","PPX","","_","_"
1,"_","_","_","strī","NC","","_","_"
2,"_","_","_","stanya","NC","","_","_"
3,"peṣito","_","_","peṣay","PPP","","_","_"
4,"lepo","_","_","lepa","NC","","_","_"
5,"dvaṃdvamelāpane","_","_","dvaṃdvamelāpana","NC","","_","_"
6,"hitaḥ","_","_","hita","JJ","","_","_"
1,"varṣābhūḥ","_","_","varṣābhū","NC","","_","_"
2,"_","_","_","kadala","NC","","_","_"
3,"_","_","_","kanda","NC","","_","_"
4,"kākamācī","_","_","kākamācī","NC","","_","_"
5,"punarnavā","_","_","punarnavā","NC","","_","_"
1,"guṃjā","_","_","guñjā","NC","","_","_"
2,"_","_","_","nara","NC","","_","_"
3,"_","_","_","kapāla","NC","","_","_"
4,"ca","_","_","ca","CCD","","_","_"
5,"ṭaṃkaṇaṃ","_","_","ṭaṅkaṇa","NC","","_","_"
6,"_","_","_","peṣay","V","peṣay","_","_"
7,"_","_","_","sama","PPX","","_","_"
1,"anena","_","_","ida","PRD","","_","_"
2,"_","_","_","pūrvavat","CX","","_","_"
3,"_","_","_","lepa","NC","","_","_"
4,"_","_","_","heman","NC","","_","_"
5,"_","_","_","abhra","NC","","_","_"
6,"milati","_","_","mil","V","mil","_","_"
7,"kṣaṇāt","_","_","kṣaṇa","NC","","_","_"
1,"tāraṃ","_","_","tāra","NC","","_","_"
2,"ca","_","_","ca","CCD","","_","_"
3,"_","_","_","vyoman","NC","","_","_"
4,"_","_","_","sattva","NC","","_","_"
5,"ca","_","_","ca","CCD","","_","_"
6,"_","_","_","ida","PRD","","_","_"
7,"_","_","_","eva","CEM","","_","_"
8,"tu","_","_","tu","CCD","","_","_"
9,"melayet","_","_","mil","V","mil","_","_"
1,"lāṅgalī","_","_","lāṅgalī","NC","","_","_"
2,"_","_","_","camarī","NC","","_","_"
3,"_","_","_","keśa","NC","","_","_"
4,"_","_","_","kuśa","NC","","_","_"
5,"_","_","_","kārpāsa","NC","","_","_"
6,"phalam","_","_","phala","NC","","_","_"
1,"bhūlatām","_","_","bhūlatā","NC","","_","_"
2,"iṃdragopaṃ","_","_","indragopa","NC","","_","_"
3,"ca","_","_","ca","CCD","","_","_"
4,"pāṣāṇabhedikā","_","_","pāṣāṇabhedikā","NC","","_","_"
5,"samam","_","_","sama","PPX","","_","_"
1,"_","_","_","nārī","NC","","_","_"
2,"_","_","_","stanya","NC","","_","_"
3,"saṃpeṣya","_","_","saṃpeṣay","CGDA","","_","_"
4,"_","_","_","mūṣā","NC","","_","_"
5,"_","_","_","lepa","NC","","_","_"
6,"tu","_","_","tu","CCD","","_","_"
7,"kārayet","_","_","kar","V","kṛ","_","_"
1,"_","_","_","sarva","JQ","","_","_"
2,"_","_","_","loha","NC","","_","_"
3,"sattvāni","_","_","sattva","NC","","_","_"
4,"tathā","_","_","tathā","CX","","_","_"
5,"_","_","_","ca","CCD","","_","_"
6,"_","_","_","eva","CEM","","_","_"
7,"mahārasāḥ","_","_","mahārasa","NC","","_","_"
1,"milanti","_","_","mil","V","mil","_","_"
2,"_","_","_","na","CNG","","_","_"
3,"_","_","_","atra","CAD","","_","_"
4,"saṃdehas","_","_","saṃdeha","NC","","_","_"
5,"_","_","_","tīvra","JJ","","_","_"
6,"_","_","_","dhmāna","NC","","_","_"
7,"_","_","_","anala","NC","","_","_"
8,"tu","_","_","tu","CCD","","_","_"
1,"viṣaṃ","_","_","viṣa","NC","","_","_"
2,"_","_","_","chuchundarī","NC","","_","_"
3,"_","_","_","māṃsa","NC","","_","_"
4,"ṭaṃkaṇaṃ","_","_","ṭaṅkaṇa","NC","","_","_"
5,"_","_","_","sama","PPX","","_","_"
6,"_","_","_","peṣay","PPP","","_","_"
1,"_","_","_","mūṣā","NC","","_","_"
2,"_","_","_","lepa","NC","","_","_"
3,"_","_","_","ida","PRD","","_","_"
4,"_","_","_","eva","CEM","","_","_"
5,"kṛtvā","_","_","kṛ","CGDA","","_","_"
6,"tatra","_","_","tatra","CAD","","_","_"
7,"vinikṣipet","_","_","vinikṣip","V","vinikṣip","_","_"
1,"_","_","_","yad","PRL","","_","_"
2,"_","_","_","kiṃcit","PRI","","_","_"
3,"_","_","_","dvaṃdva","NC","","_","_"
4,"_","_","_","yoga","NC","","_","_"
5,"tu","_","_","tu","CCD","","_","_"
6,"dhamanena","_","_","dhamana","NC","","_","_"
7,"_","_","_","mil","V","mil","_","_"
8,"_","_","_","ala","CX","","_","_"
1,"_","_","_","kaṅguṇī","NC","","_","_"
2,"_","_","_","taila","NC","","_","_"
3,"_","_","_","sampiṣ","PPP","","_","_"
4,"_","_","_","apāmārga","NC","","_","_"
5,"bhasmakam","_","_","bhasmaka","NC","","_","_"
1,"tena","_","_","tad","PRD","","_","_"
2,"praliptāyāṃ","_","_","pralip","PPP","","_","_"
3,"dvaṃdvaṃ","_","_","dvaṃdva","NC","","_","_"
4,"kṣiptvā","_","_","kṣip","CGDA","","_","_"
5,"_","_","_","dha","V","dha","_","_"
6,"_","_","_","haṭha","NC","","_","_"
1,"_","_","_","mil","V","mil","_","_"
2,"_","_","_","eva","CEM","","_","_"
3,"na","_","_","na","CNG","","_","_"
4,"_","_","_","saṃdeha","NC","","_","_"
5,"_","_","_","tad","PRD","","_","_"
6,"_","_","_","tad","PRD","","_","_"
7,"_","_","_","māraka","JJ","","_","_"
8,"_","_","_","vāpana","NC","","_","_"
1,"hemābhraṃ","_","_","hemābhra","NC","","_","_"
2,"_","_","_","nāga","NC","","_","_"
3,"_","_","_","tāpya","NC","","_","_"
4,"śulbābhraṃ","_","_","śulvābhra","NC","","_","_"
5,"gaṃdhakena","_","_","gandhaka","NC","","_","_"
6,"ca","_","_","ca","CCD","","_","_"
1,"_","_","_","sindhūttha","NC","","_","_"
2,"_","_","_","hiṅgula","NC","","_","_"
3,"tu","_","_","tu","CCD","","_","_"
4,"tīkṣṇābhraṃ","_","_","tīkṣṇābhra","NC","","_","_"
5,"dhamanād","_","_","dhamana","NC","","_","_"
6,"dṛḍham","_","_","dṛḍha","CX","","_","_"
1,"nāgābhraṃ","_","_","nāgābhra","NC","","_","_"
2,"śilayā","_","_","śilā","NC","","_","_"
3,"yuktaṃ","_","_","yuj","PPP","","_","_"
4,"vaṅgābhraṃ","_","_","vaṅgābhra","NC","","_","_"
5,"tālakena","_","_","tālaka","NC","","_","_"
6,"ca","_","_","ca","CCD","","_","_"
1,"tārābhraṃ","_","_","tārābhra","NC","","_","_"
2,"_","_","_","vaṅga","NC","","_","_"
3,"_","_","_","tāla","NC","","_","_"
4,"_","_","_","tāla","NC","","_","_"
5,"_","_","_","vat","CX","","_","_"
6,"_","_","_","sarva","JQ","","_","_"
7,"_","_","_","sattvaka","NC","","_","_"
1,"_","_","_","mil","V","mil","_","_"
2,"_","_","_","eva","CEM","","_","_"
3,"na","_","_","na","CNG","","_","_"
4,"saṃdehaḥ","_","_","saṃdeha","NC","","_","_"
5,"_","_","_","pūrva","PPX","","_","_"
6,"_","_","_","mūṣā","NC","","_","_"
7,"_","_","_","ga","PPP","","_","_"
8,"kṣaṇāt","_","_","kṣaṇa","NC","","_","_"
1,"_","_","_","śveta","JJ","","_","_"
2,"_","_","_","abhraka","NC","","_","_"
3,"sattvaṃ","_","_","sattva","NC","","_","_"
4,"tu","_","_","tu","CCD","","_","_"
5,"_","_","_","vaṅga","NC","","_","_"
6,"_","_","_","cūrṇa","NC","","_","_"
7,"samaṃ","_","_","sama","PPX","","_","_"
8,"samam","_","_","sama","PPX","","_","_"
1,"_","_","_","kadala","NC","","_","_"
2,"_","_","_","kanda","NC","","_","_"
3,"_","_","_","toya","NC","","_","_"
4,"_","_","_","marday","V","marday","_","_"
5,"_","_","_","ṭaṅkaṇa","NC","","_","_"
6,"saha","_","_","saha","CX","","_","_"
1,"_","_","_","andhamūṣā","NC","","_","_"
2,"_","_","_","ga","PPP","","_","_"
3,"dhmātaṃ","_","_","dha","PPP","","_","_"
4,"vaṅgābhraṃ","_","_","vaṅgābhra","NC","","_","_"
5,"milati","_","_","mil","V","mil","_","_"
6,"kṣaṇāt","_","_","kṣaṇa","NC","","_","_"
1,"guṃjā","_","_","guñjā","NC","","_","_"
2,"_","_","_","nara","NC","","_","_"
3,"_","_","_","kapāla","NC","","_","_"
4,"ca","_","_","ca","CCD","","_","_"
5,"ṭaṃkaṇaṃ","_","_","ṭaṅkaṇa","NC","","_","_"
6,"_","_","_","vana","NC","","_","_"
7,"_","_","_","śigruka","NC","","_","_"
1,"_","_","_","strī","NC","","_","_"
2,"_","_","_","stanya","NC","","_","_"
3,"samaṃ","_","_","sama","PPX","","_","_"
4,"piṣṭvā","_","_","piṣ","CGDA","","_","_"
5,"_","_","_","mūṣā","NC","","_","_"
6,"_","_","_","lepa","NC","","_","_"
7,"tu","_","_","tu","CCD","","_","_"
8,"kārayet","_","_","kar","V","kṛ","_","_"
1,"baṃgaṃ","_","_","vaṅga","NC","","_","_"
2,"_","_","_","śveta","JJ","","_","_"
3,"_","_","_","abhra","NC","","_","_"
4,"_","_","_","sattva","NC","","_","_"
5,"ca","_","_","ca","CCD","","_","_"
6,"cūrṇitaṃ","_","_","cūrṇay","PPP","","_","_"
7,"tatra","_","_","tatra","CAD","","_","_"
8,"nikṣipet","_","_","nikṣip","V","nikṣip","_","_"
1,"ruddhvā","_","_","rudh","CGDA","","_","_"
2,"dhmāte","_","_","dha","PPP","","_","_"
3,"_","_","_","mil","V","mil","_","_"
4,"_","_","_","eva","CEM","","_","_"
5,"_","_","_","tāra","NC","","_","_"
6,"_","_","_","karman","NC","","_","_"
7,"jārayet","_","_","jar","V","jṛ","_","_"
1,"_","_","_","abhra","NC","","_","_"
2,"_","_","_","sattva","NC","","_","_"
3,"_","_","_","vicūrṇay","CGDA","","_","_"
4,"_","_","_","ādau","CX","","_","_"
5,"_","_","_","tad","PRD","","_","_"
6,"_","_","_","pāda","NC","","_","_"
7,"_","_","_","aṃśa","NC","","_","_"
8,"tu","_","_","tu","CCD","","_","_"
9,"ṭaṃkaṇam","_","_","ṭaṅkaṇa","NC","","_","_"
1,"pāradaṃ","_","_","pārada","NC","","_","_"
2,"_","_","_","ṭaṅkaṇa","NC","","_","_"
3,"_","_","_","aṃśa","NC","","_","_"
4,"ca","_","_","ca","CCD","","_","_"
5,"_","_","_","kākamācī","NC","","_","_"
6,"_","_","_","drava","NC","","_","_"
7,"_","_","_","dina","NC","","_","_"
1,"piṣṭvā","_","_","piṣ","CGDA","","_","_"
2,"tad","_","_","tad","PRD","","_","_"
3,"golakaṃ","_","_","golaka","NC","","_","_"
4,"_","_","_","piṣ","KDG","","_","_"
5,"_","_","_","abhra","NC","","_","_"
6,"_","_","_","aṃśa","NC","","_","_"
7,"_","_","_","vaṅga","NC","","_","_"
8,"_","_","_","pattraka","NC","","_","_"
1,"_","_","_","pūrva","PPX","","_","_"
2,"_","_","_","mūṣā","NC","","_","_"
3,"_","_","_","ga","PPP","","_","_"
4,"dhmātaṃ","_","_","dha","PPP","","_","_"
5,"vaṅgābhraṃ","_","_","vaṅgābhra","NC","","_","_"
6,"milati","_","_","mil","V","mil","_","_"
7,"kṣaṇāt","_","_","kṣaṇa","NC","","_","_"
1,"_","_","_","samyak","CX","","_","_"
2,"_","_","_","āvartay","PPP","","_","_"
3,"nāgaṃ","_","_","nāga","NC","","_","_"
4,"_","_","_","pala","NC","","_","_"
5,"_","_","_","eka","PPX","","_","_"
6,"kāṃjike","_","_","kāñjika","NC","","_","_"
7,"kṣipet","_","_","kṣip","V","kṣip","_","_"
1,"palānāṃ","_","_","pala","NC","","_","_"
2,"_","_","_","śata","NUM","","_","_"
3,"_","_","_","mātra","NC","","_","_"
4,"tu","_","_","tu","CCD","","_","_"
5,"_","_","_","śata","NUM","","_","_"
6,"_","_","_","vāra","NC","","_","_"
7,"drutaṃ","_","_","dru","PPP","","_","_"
8,"drutam","_","_","dru","PPP","","_","_"
1,"anena","_","_","ida","PRD","","_","_"
2,"_","_","_","kāñjika","NC","","_","_"
3,"_","_","_","eva","CEM","","_","_"
4,"_","_","_","śata","NUM","","_","_"
5,"_","_","_","vāra","NC","","_","_"
6,"vibhāvayet","_","_","vibhav","V","vibhū","_","_"
1,"_","_","_","yad","PRL","","_","_"
2,"_","_","_","kiṃcit","PRI","","_","_"
3,"_","_","_","cāraṇa","NC","","_","_"
4,"_","_","_","vastu","NC","","_","_"
5,"_","_","_","tatas","CX","","_","_"
6,"_","_","_","tad","PRD","","_","_"
7,"_","_","_","jāray","V","jāray","_","_"
8,"_","_","_","rasa","NC","","_","_"
1,"abhiṣeko","_","_","abhiṣeka","NC","","_","_"
2,"_","_","_","hi","CX","","_","_"
3,"_","_","_","ida","PRD","","_","_"
4,"khyātaḥ","_","_","khyā","PPP","","_","_"
5,"kathyate","_","_","kath","V","kath","_","_"
6,"tu","_","_","tu","CCD","","_","_"
7,"_","_","_","mata","NC","","_","_"
8,"_","_","_","antara","JJ","","_","_"
1,"trikṣāraṃ","_","_","trikṣāra","NC","","_","_"
2,"paṃcalavaṇaṃ","_","_","pañcalavaṇa","NC","","_","_"
3,"_","_","_","kāṅkṣī","NC","","_","_"
4,"_","_","_","kāsīsa","NC","","_","_"
5,"_","_","_","gandhaka","NC","","_","_"
1,"māhiṣaṃ","_","_","māhiṣa","JJ","","_","_"
2,"_","_","_","kāñjika","NC","","_","_"
3,"_","_","_","yuj","PPP","","_","_"
4,"_","_","_","tāmra","NC","","_","_"
5,"_","_","_","pātra","NC","","_","_"
6,"_","_","_","dina","NC","","_","_"
7,"_","_","_","traya","NC","","_","_"
1,"sthitaṃ","_","_","sthā","PPP","","_","_"
2,"gharme","_","_","gharma","NC","","_","_"
3,"_","_","_","punar","CAD","","_","_"
4,"_","_","_","tad","PRD","","_","_"
5,"drutaṃ","_","_","dru","PPP","","_","_"
6,"nāgaṃ","_","_","nāga","NC","","_","_"
7,"vinikṣipet","_","_","vinikṣip","V","vinikṣip","_","_"
1,"_","_","_","tāra","NC","","_","_"
2,"_","_","_","karman","NC","","_","_"
3,"baṃgaṃ","_","_","vaṅga","NC","","_","_"
4,"vā","_","_","vā","CCD","","_","_"
5,"_","_","_","śata","NUM","","_","_"
6,"_","_","_","vāra","NC","","_","_"
7,"secayet","_","_","secay","V","secay","_","_"
1,"_","_","_","tad","PRD","","_","_"
2,"_","_","_","drava","NC","","_","_"
3,"_","_","_","tāmra","NC","","_","_"
4,"_","_","_","pātra","NC","","_","_"
5,"_","_","_","stha","JJ","","_","_"
6,"abhiṣekaṃ","_","_","abhiṣeka","NC","","_","_"
7,"vidur","_","_","vid","V","vid","_","_"
8,"budhāḥ","_","_","budha","JJ","","_","_"
1,"anena","_","_","ida","PRD","","_","_"
2,"_","_","_","cāraṇa","NC","","_","_"
3,"_","_","_","vastu","NC","","_","_"
4,"_","_","_","śata","NUM","","_","_"
5,"_","_","_","vāra","NC","","_","_"
6,"bhāvayet","_","_","bhav","V","bhū","_","_"
1,"dvaṃdvitaṃ","_","_","dvaṃdvay","PPP","","_","_"
2,"_","_","_","vyoman","NC","","_","_"
3,"_","_","_","sattva","NC","","_","_"
4,"ca","_","_","ca","CCD","","_","_"
5,"bījāni","_","_","bīja","NC","","_","_"
6,"vividhāni","_","_","vividha","JJ","","_","_"
7,"ca","_","_","ca","CCD","","_","_"
1,"dvaṃdvitaṃ","_","_","dvaṃdvay","PPP","","_","_"
2,"_","_","_","vajra","NC","","_","_"
3,"_","_","_","bīja","NC","","_","_"
4,"ca","_","_","ca","CCD","","_","_"
5,"bhāvitaṃ","_","_","bhāvay","PPP","","_","_"
6,"_","_","_","sāray","V","sāray","_","_"
7,"_","_","_","sadā","CAD","","_","_"
1,"_","_","_","svarṇa","NC","","_","_"
2,"_","_","_","ādi","NC","","_","_"
3,"_","_","_","loha","NC","","_","_"
4,"_","_","_","akhila","JJ","","_","_"
5,"_","_","_","kṛ","PPP","","_","_"
6,"_","_","_","śudh","PPP","","_","_"
7,"_","_","_","carv","PPP","","_","_"
8,"yojyaṃ","_","_","yuj","KDG","","_","_"
9,"_","_","_","pṛthak","CX","","_","_"
10,"_","_","_","gagana","NC","","_","_"
11,"_","_","_","sattva","NC","","_","_"
12,"_","_","_","vara","JJ","","_","_"
13,"_","_","_","sama","PPX","","_","_"
14,"_","_","_","aṃśa","NC","","_","_"
1,"_","_","_","tad","PRD","","_","_"
2,"_","_","_","dvaṃdvay","PPP","","_","_"
3,"carati","_","_","car","V","car","_","_"
4,"su","_","_","su","NC","","_","_"
4,"_","_","_","tavara","NC","","_","_"
5,"_","_","_","abhiṣic","PPP","","_","_"
6,"vipro","_","_","vipra","NC","","_","_"
7,"yathā","_","_","yathā","CCM","","_","_"
8,"_","_","_","madhura","JJ","","_","_"
9,"_","_","_","pāyasa","NC","","_","_"
10,"_","_","_","ājya","NC","","_","_"
11,"_","_","_","yuj","PPP","","_","_"
