"WordID","word","NormSTEM","suffix","lemma","PoS","Root","NormSuffix","NormWord"
1,"_","_","_","rājan","NC","","_","_"
2,"_","_","_","putra","NC","","_","_"
3,"uvāca","_","_","vak","V","vac","_","_"
1,"na","_","_","na","CNG","","_","_"
2,"nikṛtyā","_","_","nikṛti","NC","","_","_"
3,"na","_","_","na","CNG","","_","_"
4,"dambhena","_","_","dambha","NC","","_","_"
5,"brahmann","_","_","brahman","NC","","_","_"
6,"icchāmi","_","_","iṣ","V","iṣ","_","_"
7,"jīvitum","_","_","jīv","CGDI","","_","_"
1,"_","_","_","na","CNG","","_","_"
2,"_","_","_","adharma","NC","","_","_"
3,"_","_","_","yuj","PPP","","_","_"
4,"iccheyam","_","_","iṣ","V","iṣ","_","_"
5,"arthān","_","_","artha","NC","","_","_"
6,"_","_","_","su","CAD","","_","_"
7,"_","_","_","mahat","JJ","","_","_"
8,"_","_","_","api","CX","","_","_"
9,"_","_","_","mat","PPR","","_","_"
1,"purastād","_","_","purastāt","CX","","_","_"
2,"eva","_","_","eva","CEM","","_","_"
3,"_","_","_","bhagavat","JJ","","_","_"
4,"_","_","_","mat","PPR","","_","_"
5,"_","_","_","tad","PRD","","_","_"
6,"apavarjitam","_","_","apavarjay","PPP","","_","_"
1,"yena","_","_","yad","PRL","","_","_"
2,"māṃ","_","_","mat","PPR","","_","_"
3,"_","_","_","na","CNG","","_","_"
4,"_","_","_","abhiśaṅk","V","abhiśaṅk","_","_"
5,"yad","_","_","yad","PRL","","_","_"
6,"vā","_","_","vā","CCD","","_","_"
7,"kṛtsnaṃ","_","_","kṛtsna","JJ","","_","_"
8,"hitaṃ","_","_","hita","JJ","","_","_"
9,"bhavet","_","_","bhav","V","bhū","_","_"
1,"ānṛśaṃsyena","_","_","ānṛśaṃsya","NC","","_","_"
2,"dharmeṇa","_","_","dharma","NC","","_","_"
3,"loke","_","_","loka","NC","","_","_"
4,"_","_","_","hi","CX","","_","_"
5,"_","_","_","ida","PRD","","_","_"
6,"jijīviṣuḥ","_","_","jijīviṣu","JJ","","_","_"
1,"_","_","_","na","CNG","","_","_"
2,"_","_","_","mat","PPR","","_","_"
3,"etad","_","_","tad","PRD","","_","_"
4,"alaṃ","_","_","ala","CX","","_","_"
5,"kartuṃ","_","_","kṛ","CGDI","","_","_"
6,"_","_","_","na","CNG","","_","_"
7,"_","_","_","tad","PRD","","_","_"
8,"_","_","_","mat","PPR","","_","_"
9,"_","_","_","upapad","V","upapad","_","_"
1,"munir","_","_","muni","NC","","_","_"
2,"uvāca","_","_","vak","V","vac","_","_"
1,"_","_","_","upapad","PPP","","_","_"
2,"_","_","_","tvat","PPR","","_","_"
3,"etena","_","_","tad","PRD","","_","_"
4,"yathā","_","_","yathā","CCM","","_","_"
5,"kṣatriya","_","_","kṣatriya","NC","","_","_"
6,"bhāṣase","_","_","bhāṣ","V","bhāṣ","_","_"
1,"prakṛtyā","_","_","prakṛti","NC","","_","_"
2,"_","_","_","hi","CX","","_","_"
3,"_","_","_","upapad","PPP","","_","_"
4,"'si","_","_","as","V","as","_","_"
5,"buddhyā","_","_","buddhi","NC","","_","_"
6,"_","_","_","ca","CCD","","_","_"
7,"_","_","_","adbhuta","JJ","","_","_"
8,"_","_","_","darśana","NC","","_","_"
1,"ubhayor","_","_","ubhaya","JJ","","_","_"
2,"eva","_","_","eva","CEM","","_","_"
3,"vām","_","_","tvat","PPR","","_","_"
4,"arthe","_","_","artha","NC","","_","_"
5,"yatiṣye","_","_","yat","V","yat","_","_"
6,"tava","_","_","tvat","PPR","","_","_"
7,"tasya","_","_","tad","PRD","","_","_"
8,"ca","_","_","ca","CCD","","_","_"
1,"saṃśleṣaṃ","_","_","saṃśleṣa","NC","","_","_"
2,"vā","_","_","vā","CCD","","_","_"
3,"kariṣyāmi","_","_","kar","V","kṛ","_","_"
4,"śāśvataṃ","_","_","śāśvata","JJ","","_","_"
5,"_","_","_","hi","CX","","_","_"
6,"_","_","_","anapāyin","JJ","","_","_"
1,"tvādṛśaṃ","_","_","tvādṛś","JJ","","_","_"
2,"hi","_","_","hi","CX","","_","_"
3,"kule","_","_","kula","NC","","_","_"
4,"jātam","_","_","jan","PPP","","_","_"
5,"anṛśaṃsaṃ","_","_","anṛśaṃsa","JJ","","_","_"
6,"_","_","_","bahu","JJ","","_","_"
7,"_","_","_","śruta","NC","","_","_"
1,"amātyaṃ","_","_","amātya","NC","","_","_"
2,"ko","_","_","kiṃ","PRQ","","_","_"
3,"na","_","_","na","CNG","","_","_"
4,"kurvīta","_","_","kar","V","kṛ","_","_"
5,"_","_","_","rājya","NC","","_","_"
6,"_","_","_","praṇaya","NC","","_","_"
7,"_","_","_","kovida","JJ","","_","_"
1,"_","_","_","yad","PRL","","_","_"
2,"_","_","_","tvat","PPR","","_","_"
3,"pravrajito","_","_","pravraj","PPP","","_","_"
4,"rājyād","_","_","rājya","NC","","_","_"
5,"vyasanaṃ","_","_","vyasana","NC","","_","_"
6,"_","_","_","ca","CCD","","_","_"
7,"_","_","_","uttama","JJ","","_","_"
8,"gataḥ","_","_","ga","PPP","","_","_"
1,"ānṛśaṃsyena","_","_","ānṛśaṃsya","JJ","","_","_"
2,"vṛttena","_","_","vṛtta","NC","","_","_"
3,"_","_","_","kṣatriya","NC","","_","_"
4,"_","_","_","iṣ","V","iṣ","_","_"
5,"jīvitum","_","_","jīv","CGDI","","_","_"
1,"āgantā","_","_","āga","V","āga","_","_"
2,"_","_","_","mat","PPR","","_","_"
3,"_","_","_","gṛha","NC","","_","_"
4,"tāta","_","_","tāta","NC","","_","_"
5,"vaidehaḥ","_","_","vaideha","NC","","_","_"
6,"_","_","_","satya","JJ","","_","_"
7,"_","_","_","saṃgara","NC","","_","_"
1,"_","_","_","yathā","CCM","","_","_"
2,"_","_","_","mat","PPR","","_","_"
3,"taṃ","_","_","tad","PRD","","_","_"
4,"niyokṣyāmi","_","_","niyuj","V","niyuj","_","_"
5,"tat","_","_","tad","PRD","","_","_"
6,"_","_","_","kar","V","kṛ","_","_"
7,"_","_","_","asaṃśaya","CX","","_","_"
1,"bhīṣma","_","_","bhīṣma","NC","","_","_"
2,"uvāca","_","_","vak","V","vac","_","_"
1,"tata","_","_","tatas","CX","","_","_"
2,"āhūya","_","_","āhvā","CGDA","","_","_"
3,"vaidehaṃ","_","_","vaideha","NC","","_","_"
4,"munir","_","_","muni","NC","","_","_"
5,"vacanam","_","_","vacana","NC","","_","_"
6,"abravīt","_","_","abravīta","V","brū","_","_"
1,"ayaṃ","_","_","ida","PRD","","_","_"
2,"_","_","_","rājan","NC","","_","_"
3,"_","_","_","kula","NC","","_","_"
4,"jāto","_","_","jan","PPP","","_","_"
5,"_","_","_","vid","PPP","","_","_"
6,"_","_","_","abhyantara","NC","","_","_"
7,"mama","_","_","mat","PPR","","_","_"
1,"ādarśa","_","_","ādarśa","NC","","_","_"
2,"iva","_","_","iva","CCM","","_","_"
3,"_","_","_","śudh","PPP","","_","_"
4,"_","_","_","ātman","NC","","_","_"
5,"_","_","_","śārada","JJ","","_","_"
6,"_","_","_","candramas","NC","","_","_"
7,"iva","_","_","iva","CCM","","_","_"
1,"_","_","_","na","CNG","","_","_"
2,"_","_","_","ida","PRD","","_","_"
3,"paśyāmi","_","_","paś","V","paś","_","_"
4,"vṛjinaṃ","_","_","vṛjina","NC","","_","_"
5,"sarvato","_","_","sarvatas","CX","","_","_"
6,"me","_","_","mat","PPR","","_","_"
7,"parīkṣitaḥ","_","_","parīkṣ","PPP","","_","_"
1,"tena","_","_","tad","PRD","","_","_"
2,"te","_","_","tvat","PPR","","_","_"
3,"saṃdhir","_","_","saṃdhi","NC","","_","_"
4,"_","_","_","eva","CEM","","_","_"
5,"_","_","_","as","V","as","_","_"
6,"_","_","_","viśvas","V","viśvas","_","_"
7,"_","_","_","ida","PRD","","_","_"
8,"yathā","_","_","yathā","CCM","","_","_"
9,"mayi","_","_","mat","PPR","","_","_"
1,"na","_","_","na","CNG","","_","_"
2,"rājyam","_","_","rājya","NC","","_","_"
3,"anamātyena","_","_","anamātya","JJ","","_","_"
4,"śakyaṃ","_","_","śakya","JJ","","_","_"
5,"śāstum","_","_","śās","CGDI","","_","_"
6,"_","_","_","amitra","NC","","_","_"
7,"_","_","_","han","JJ","","_","_"
1,"amātyaḥ","_","_","amātya","NC","","_","_"
2,"śūra","_","_","śūra","NC","","_","_"
3,"eva","_","_","eva","CEM","","_","_"
4,"syād","_","_","as","V","as","_","_"
5,"_","_","_","buddhi","NC","","_","_"
6,"_","_","_","sampad","PPP","","_","_"
7,"eva","_","_","eva","CEM","","_","_"
8,"ca","_","_","ca","CCD","","_","_"
1,"tābhyāṃ","_","_","tad","PRD","","_","_"
2,"_","_","_","ca","CCD","","_","_"
3,"_","_","_","eva","CEM","","_","_"
4,"bhayaṃ","_","_","bhaya","NC","","_","_"
5,"rājñaḥ","_","_","rājan","NC","","_","_"
6,"paśya","_","_","paś","V","paś","_","_"
7,"rājyasya","_","_","rājya","NC","","_","_"
8,"yojanam","_","_","yojana","NC","","_","_"
1,"_","_","_","dharma","NC","","_","_"
2,"_","_","_","ātman","NC","","_","_"
3,"kvacil","_","_","kvacid","CX","","_","_"
4,"loke","_","_","loka","NC","","_","_"
5,"_","_","_","na","CNG","","_","_"
6,"_","_","_","anya","PPX","","_","_"
7,"_","_","_","as","V","as","_","_"
8,"gatir","_","_","gati","NC","","_","_"
9,"īdṛśī","_","_","īdṛśa","JJ","","_","_"
1,"kṛtātmā","_","_","kṛtātman","JJ","","_","_"
2,"_","_","_","rājan","NC","","_","_"
3,"_","_","_","putra","NC","","_","_"
4,"'yaṃ","_","_","ida","PRD","","_","_"
5,"satāṃ","_","_","sat","JJ","","_","_"
6,"mārgam","_","_","mārga","NC","","_","_"
7,"anuṣṭhitaḥ","_","_","anuṣṭhā","PPP","","_","_"
1,"_","_","_","su","CAD","","_","_"
2,"_","_","_","saṃgrah","PPP","","_","_"
3,"_","_","_","tu","CCD","","_","_"
4,"_","_","_","eva","CEM","","_","_"
5,"_","_","_","tad","PRD","","_","_"
6,"tvayā","_","_","tvat","PPR","","_","_"
7,"_","_","_","dharma","NC","","_","_"
8,"_","_","_","purogama","JJ","","_","_"
1,"saṃsevyamānaḥ","_","_","saṃsev","KDP","","_","_"
2,"_","_","_","śatru","NC","","_","_"
3,"_","_","_","tvat","PPR","","_","_"
4,"_","_","_","grah","V","grah","_","_"
5,"_","_","_","mahat","JJ","","_","_"
6,"gaṇān","_","_","gaṇa","NC","","_","_"
1,"_","_","_","yadi","CSB","","_","_"
2,"_","_","_","ida","PRD","","_","_"
3,"pratiyudhyet","_","_","pratiyudh","V","pratiyudh","_","_"
4,"tvāṃ","_","_","tvat","PPR","","_","_"
5,"_","_","_","sva","JJ","","_","_"
6,"_","_","_","karman","NC","","_","_"
7,"kṣatriyasya","_","_","kṣatriya","NC","","_","_"
8,"tat","_","_","tad","PRD","","_","_"
1,"_","_","_","jigīṣ","KDP","","_","_"
2,"_","_","_","tvat","PPR","","_","_"
3,"yuddhe","_","_","yuddha","NC","","_","_"
4,"pitṛpaitāmahe","_","_","pitṛpaitāmaha","JJ","","_","_"
5,"pade","_","_","pada","NC","","_","_"
1,"tvaṃ","_","_","tvat","PPR","","_","_"
2,"_","_","_","ca","CCD","","_","_"
3,"_","_","_","api","CX","","_","_"
4,"pratiyudhyethā","_","_","pratiyudh","V","pratiyudh","_","_"
5,"_","_","_","vijigīṣu","JJ","","_","_"
6,"_","_","_","vrata","NC","","_","_"
7,"sthitaḥ","_","_","sthā","PPP","","_","_"
1,"_","_","_","a","CNG","","_","_"
2,"_","_","_","yudh","CGDA","","_","_"
3,"_","_","_","eva","CEM","","_","_"
4,"_","_","_","niyoga","NC","","_","_"
5,"_","_","_","mat","PPR","","_","_"
6,"vaśe","_","_","vaśa","NC","","_","_"
7,"vaideha","_","_","vaideha","NC","","_","_"
8,"te","_","_","tvat","PPR","","_","_"
9,"sthitaḥ","_","_","sthā","PPP","","_","_"
1,"sa","_","_","tad","PRD","","_","_"
2,"tvaṃ","_","_","tvat","PPR","","_","_"
3,"dharmam","_","_","dharma","NC","","_","_"
4,"avekṣasva","_","_","avekṣ","V","avekṣ","_","_"
5,"_","_","_","tyaj","CGDA","","_","_"
6,"_","_","_","adharma","NC","","_","_"
7,"asāṃpratam","_","_","asāṃprata","JJ","","_","_"
1,"na","_","_","na","CNG","","_","_"
2,"hi","_","_","hi","CX","","_","_"
3,"_","_","_","kāma","NC","","_","_"
4,"_","_","_","na","CNG","","_","_"
5,"ca","_","_","ca","CCD","","_","_"
6,"drohāt","_","_","droha","NC","","_","_"
7,"svadharmaṃ","_","_","svadharma","NC","","_","_"
8,"hātum","_","_","hā","CGDI","","_","_"
9,"arhasi","_","_","arh","V","arh","_","_"
1,"_","_","_","na","CNG","","_","_"
2,"_","_","_","eva","CEM","","_","_"
3,"nityaṃ","_","_","nitya","CX","","_","_"
4,"_","_","_","jaya","NC","","_","_"
5,"_","_","_","tāta","NC","","_","_"
6,"_","_","_","na","CNG","","_","_"
7,"_","_","_","eva","CEM","","_","_"
8,"nityaṃ","_","_","nitya","CX","","_","_"
9,"parājayaḥ","_","_","parājaya","NC","","_","_"
1,"tasmād","_","_","tasmāt","CX","","_","_"
2,"_","_","_","bhojay","KDG","","_","_"
3,"_","_","_","ca","CCD","","_","_"
4,"_","_","_","bhuj","KDG","","_","_"
5,"_","_","_","ca","CCD","","_","_"
6,"paro","_","_","para","PPX","","_","_"
7,"janaḥ","_","_","jana","NC","","_","_"
1,"_","_","_","ātman","NC","","_","_"
2,"_","_","_","eva","CEM","","_","_"
3,"hi","_","_","hi","CX","","_","_"
4,"_","_","_","saṃdṛś","KDG","","_","_"
5,"_","_","_","ubh","PPX","","_","_"
6,"_","_","_","jaya","NC","","_","_"
7,"_","_","_","parājaya","NC","","_","_"
1,"_","_","_","niḥśeṣa","JJ","","_","_"
2,"_","_","_","kārin","JJ","","_","_"
3,"tāta","_","_","tāta","NC","","_","_"
4,"_","_","_","niḥśeṣa","JJ","","_","_"
5,"_","_","_","karaṇa","NC","","_","_"
6,"bhayam","_","_","bhaya","NC","","_","_"
1,"_","_","_","iti","CQT","","_","_"
2,"_","_","_","vac","PPP","","_","_"
3,"_","_","_","prativak","V","prativac","_","_"
4,"_","_","_","ida","PRD","","_","_"
5,"vacanaṃ","_","_","vacana","NC","","_","_"
6,"_","_","_","brāhmaṇa","NC","","_","_"
7,"_","_","_","ṛṣabha","NC","","_","_"
1,"_","_","_","abhipūjay","CGDA","","_","_"
2,"_","_","_","abhisatkṛ","CGDA","","_","_"
3,"_","_","_","pūjā","NC","","_","_"
4,"_","_","_","arha","JJ","","_","_"
5,"anumānya","_","_","anumānay","CGDA","","_","_"
6,"ca","_","_","ca","CCD","","_","_"
1,"yathā","_","_","yathā","CCM","","_","_"
2,"_","_","_","abravīta","V","brū","_","_"
3,"_","_","_","mahat","JJ","","_","_"
4,"_","_","_","prājña","JJ","","_","_"
5,"yathā","_","_","yathā","CCM","","_","_"
6,"brūyād","_","_","abravīta","V","brū","_","_"
7,"_","_","_","bahu","JJ","","_","_"
8,"_","_","_","śruta","NC","","_","_"
1,"śreyaskāmo","_","_","śreyaskāma","JJ","","_","_"
2,"yathā","_","_","yathā","CCM","","_","_"
3,"brūyād","_","_","abravīta","V","brū","_","_"
4,"ubhayor","_","_","ubhaya","JJ","","_","_"
5,"yat","_","_","yad","PRL","","_","_"
6,"kṣamaṃ","_","_","kṣama","JJ","","_","_"
7,"bhavet","_","_","bhav","V","bhū","_","_"
1,"tathā","_","_","tathā","CX","","_","_"
2,"vacanam","_","_","vacana","NC","","_","_"
3,"ukto","_","_","vac","PPP","","_","_"
4,"'smi","_","_","as","V","as","_","_"
5,"kariṣyāmi","_","_","kar","V","kṛ","_","_"
6,"ca","_","_","ca","CCD","","_","_"
7,"tat","_","_","tad","PRD","","_","_"
8,"tathā","_","_","tathā","CX","","_","_"
1,"_","_","_","tad","PRD","","_","_"
2,"_","_","_","hi","CX","","_","_"
3,"paramaṃ","_","_","parama","JJ","","_","_"
4,"śreyo","_","_","śreyas","NC","","_","_"
5,"na","_","_","na","CNG","","_","_"
6,"me","_","_","mat","PPR","","_","_"
7,"_","_","_","atra","CAD","","_","_"
8,"_","_","_","as","V","as","_","_"
9,"vicāraṇā","_","_","vicāraṇā","NC","","_","_"
1,"tataḥ","_","_","tatas","CX","","_","_"
2,"kauśalyam","_","_","kauśalya","NC","","_","_"
3,"āhūya","_","_","āhvā","CGDA","","_","_"
4,"vaideho","_","_","vaideha","NC","","_","_"
5,"vākyam","_","_","vākya","NC","","_","_"
6,"abravīt","_","_","abravīta","V","brū","_","_"
1,"dharmato","_","_","dharma","NC","","_","_"
2,"_","_","_","nīti","NC","","_","_"
3,"_","_","_","ca","CCD","","_","_"
4,"_","_","_","eva","CEM","","_","_"
5,"balena","_","_","bala","NC","","_","_"
6,"ca","_","_","ca","CCD","","_","_"
7,"jito","_","_","ji","PPP","","_","_"
8,"mayā","_","_","mat","PPR","","_","_"
1,"so","_","_","tad","PRD","","_","_"
2,"'haṃ","_","_","mat","PPR","","_","_"
3,"tvayā","_","_","tvat","PPR","","_","_"
4,"_","_","_","tu","CCD","","_","_"
5,"_","_","_","ātman","NC","","_","_"
6,"_","_","_","guṇa","NC","","_","_"
7,"jitaḥ","_","_","ji","PPP","","_","_"
8,"_","_","_","pārthiva","NC","","_","_"
9,"_","_","_","sattama","JJ","","_","_"
1,"ātmānam","_","_","ātman","NC","","_","_"
2,"anavajñāya","_","_","anavajñāya","CX","","_","_"
3,"_","_","_","ji","PPP","","_","_"
4,"_","_","_","vat","CX","","_","_"
5,"vartatāṃ","_","_","vart","V","vṛt","_","_"
6,"bhavān","_","_","bhavat","JJ","","_","_"
1,"_","_","_","na","CNG","","_","_"
2,"_","_","_","avaman","V","avaman","_","_"
3,"ca","_","_","ca","CCD","","_","_"
4,"te","_","_","tvat","PPR","","_","_"
5,"buddhiṃ","_","_","buddhi","NC","","_","_"
6,"_","_","_","na","CNG","","_","_"
7,"_","_","_","avaman","V","avaman","_","_"
8,"ca","_","_","ca","CCD","","_","_"
9,"pauruṣam","_","_","pauruṣa","NC","","_","_"
1,"_","_","_","na","CNG","","_","_"
2,"_","_","_","avaman","V","avaman","_","_"
3,"_","_","_","jay","V","ji","_","_"
4,"_","_","_","iti","CQT","","_","_"
5,"_","_","_","ji","PPP","","_","_"
6,"_","_","_","vat","CX","","_","_"
7,"vartatāṃ","_","_","vart","V","vṛt","_","_"
8,"bhavān","_","_","bhavat","JJ","","_","_"
1,"yathāvat","_","_","yathāvat","CX","","_","_"
2,"pūjito","_","_","pūjay","PPP","","_","_"
3,"rājan","_","_","rājan","NC","","_","_"
4,"gṛhaṃ","_","_","gṛha","NC","","_","_"
5,"gantāsi","_","_","ganta","V","ga","_","_"
6,"me","_","_","mat","PPR","","_","_"
7,"gṛhāt","_","_","gṛha","NC","","_","_"
1,"tataḥ","_","_","tatas","CX","","_","_"
2,"sampūjya","_","_","sampūjay","CGDA","","_","_"
3,"tau","_","_","tad","PRD","","_","_"
4,"vipraṃ","_","_","vipra","NC","","_","_"
5,"viśvastau","_","_","viśvas","PPP","","_","_"
6,"jagmatur","_","_","ga","V","ga","_","_"
7,"gṛhān","_","_","gṛha","NC","","_","_"
1,"_","_","_","vaideha","NC","","_","_"
2,"_","_","_","tu","CCD","","_","_"
3,"_","_","_","atha","CAD","","_","_"
4,"kausalyaṃ","_","_","kausalya","NC","","_","_"
5,"praveśya","_","_","praveśay","CGDA","","_","_"
6,"gṛham","_","_","gṛha","NC","","_","_"
7,"añjasā","_","_","añjasā","CX","","_","_"
1,"_","_","_","pādya","NC","","_","_"
2,"_","_","_","arghya","NC","","_","_"
3,"_","_","_","madhuparka","NC","","_","_"
4,"_","_","_","tad","PRD","","_","_"
5,"_","_","_","pūjā","NC","","_","_"
6,"_","_","_","arha","JJ","","_","_"
7,"pratyapūjayat","_","_","pratipūjay","V","pratipūjay","_","_"
1,"dadau","_","_","dad","V","dā","_","_"
2,"duhitaraṃ","_","_","duhitṛ","NC","","_","_"
3,"_","_","_","ca","CCD","","_","_"
4,"_","_","_","ida","PRD","","_","_"
5,"ratnāni","_","_","ratna","NC","","_","_"
6,"vividhāni","_","_","vividha","JJ","","_","_"
7,"ca","_","_","ca","CCD","","_","_"
1,"eṣa","_","_","tad","PRD","","_","_"
2,"rājñāṃ","_","_","rājan","NC","","_","_"
3,"paro","_","_","para","PPX","","_","_"
4,"dharmaḥ","_","_","dharma","NC","","_","_"
5,"sahyau","_","_","sah","KDG","","_","_"
6,"_","_","_","jaya","NC","","_","_"
7,"_","_","_","parājaya","NC","","_","_"
