"WordID","word","NormSTEM","suffix","lemma","PoS","Root","NormSuffix","NormWord"
1,"sa","_","_","tad","PRD","","_","_"
2,"ā","_","_","ā","CADP","","_","_"
3,"gamad","_","_","gacch","V","gam","_","_"
4,"indro","_","_","indra","NC","","_","_"
5,"yo","_","_","yad","PRL","","_","_"
6,"vasūnāṃ","_","_","vasu","NC","","_","_"
7,"ciketad","_","_","cit","V","cit","_","_"
8,"dātuṃ","_","_","dā","CGDI","","_","_"
9,"dāmano","_","_","dāman","NC","","_","_"
10,"rayīṇām","_","_","rayi","NC","","_","_"
1,"_","_","_","dhanvan","NC","","_","_"
2,"_","_","_","cara","JJ","","_","_"
3,"na","_","_","na","CNG","","_","_"
4,"vaṃsagas","_","_","vaṃsaga","NC","","_","_"
5,"tṛṣāṇaś","_","_","tṛṣ","KDP","","_","_"
6,"cakamānaḥ","_","_","ka","KDP","","_","_"
7,"pibatu","_","_","pib","V","pā","_","_"
8,"dugdham","_","_","duh","PPP","","_","_"
9,"aṃśum","_","_","aṃśu","NC","","_","_"
1,"ā","_","_","ā","CADP","","_","_"
2,"te","_","_","tvat","PPR","","_","_"
3,"hanū","_","_","hanu","NC","","_","_"
4,"harivaḥ","_","_","harivat","JJ","","_","_"
5,"śūra","_","_","śūra","NC","","_","_"
6,"śipre","_","_","śiprā","NC","","_","_"
7,"ruhat","_","_","roh","V","ruh","_","_"
8,"somo","_","_","soma","NC","","_","_"
9,"na","_","_","na","CNG","","_","_"
10,"parvatasya","_","_","parvata","NC","","_","_"
11,"pṛṣṭhe","_","_","pṛṣṭha","NC","","_","_"
1,"anu","_","_","anu","CADP","","_","_"
2,"tvā","_","_","tvat","PPR","","_","_"
3,"rājann","_","_","rājan","NC","","_","_"
4,"arvato","_","_","arvat","NC","","_","_"
5,"na","_","_","na","CNG","","_","_"
6,"hinvan","_","_","hi","V","hi","_","_"
7,"gīrbhir","_","_","gir","NC","","_","_"
8,"madema","_","_","mand","V","mand","_","_"
9,"puruhūta","_","_","puruhūta","NC","","_","_"
10,"viśve","_","_","viśva","JQ","","_","_"
1,"cakraṃ","_","_","cakra","NC","","_","_"
2,"na","_","_","na","CNG","","_","_"
3,"vṛttam","_","_","vṛt","PPP","","_","_"
4,"puruhūta","_","_","puruhūta","NC","","_","_"
5,"vepate","_","_","vip","V","vip","_","_"
6,"mano","_","_","manas","NC","","_","_"
7,"bhiyā","_","_","bhī","NC","","_","_"
8,"me","_","_","mat","PPR","","_","_"
9,"amater","_","_","amati","NC","","_","_"
10,"id","_","_","id","CEM","","_","_"
11,"adrivaḥ","_","_","adrivat","JJ","","_","_"
1,"rathād","_","_","ratha","NC","","_","_"
2,"adhi","_","_","adhi","CADP","","_","_"
3,"tvā","_","_","tvat","PPR","","_","_"
4,"jaritā","_","_","jaritṛ","NC","","_","_"
5,"sadāvṛdha","_","_","sadāvṛdha","JJ","","_","_"
6,"kuvin","_","_","kuvid","CX","","_","_"
7,"nu","_","_","nu","CX","","_","_"
8,"stoṣan","_","_","stu","V","stu","_","_"
9,"maghavan","_","_","maghavan","NC","","_","_"
10,"purūvasuḥ","_","_","purūvasu","JJ","","_","_"
1,"eṣa","_","_","tad","PRD","","_","_"
2,"_","_","_","grāvan","NC","","_","_"
3,"_","_","_","iva","CCM","","_","_"
4,"jaritā","_","_","jaritṛ","NC","","_","_"
5,"ta","_","_","tvat","PPR","","_","_"
6,"_","_","_","indra","NC","","_","_"
7,"_","_","_","ṛch","V","ṛch","_","_"
8,"vācam","_","_","vāc","NC","","_","_"
9,"bṛhad","_","_","bṛhat","JJ","","_","_"
10,"āśuṣāṇaḥ","_","_","āśuṣ","KDP","","_","_"
1,"pra","_","_","pra","CADP","","_","_"
2,"savyena","_","_","savya","JJ","","_","_"
3,"maghavan","_","_","maghavan","NC","","_","_"
4,"yaṃsi","_","_","ya","V","ya","_","_"
5,"rāyaḥ","_","_","rai","NC","","_","_"
6,"pra","_","_","pra","CADP","","_","_"
7,"_","_","_","dakṣiṇit","CX","","_","_"
8,"_","_","_","harivat","JJ","","_","_"
9,"mā","_","_","mā","CNG","","_","_"
10,"vi","_","_","vi","CADP","","_","_"
11,"venaḥ","_","_","ven","V","ven","_","_"
1,"vṛṣā","_","_","vṛṣan","JJ","","_","_"
2,"tvā","_","_","tvat","PPR","","_","_"
3,"vṛṣaṇaṃ","_","_","vṛṣan","NC","","_","_"
4,"vardhatu","_","_","vṛdh","V","vṛdh","_","_"
5,"dyaur","_","_","div","NC","","_","_"
6,"vṛṣā","_","_","vṛṣan","NC","","_","_"
7,"vṛṣabhyāṃ","_","_","vṛṣan","JJ","","_","_"
8,"vahase","_","_","vah","V","vah","_","_"
9,"haribhyām","_","_","hari","NC","","_","_"
1,"sa","_","_","tad","PRD","","_","_"
2,"no","_","_","mat","PPR","","_","_"
3,"vṛṣā","_","_","vṛṣan","NC","","_","_"
4,"_","_","_","vṛṣan","NC","","_","_"
5,"_","_","_","ratha","NC","","_","_"
6,"_","_","_","su","CAD","","_","_"
7,"_","_","_","śiprā","NC","","_","_"
8,"_","_","_","vṛṣan","NC","","_","_"
9,"_","_","_","kratu","NC","","_","_"
10,"vṛṣā","_","_","vṛṣa","NC","","_","_"
11,"vajrin","_","_","vajrin","NC","","_","_"
12,"bhare","_","_","bhara","NC","","_","_"
13,"dhāḥ","_","_","dadh","V","dhā","_","_"
1,"yo","_","_","yad","PRL","","_","_"
2,"rohitau","_","_","rohita","JJ","","_","_"
3,"vājinau","_","_","vājin","NC","","_","_"
4,"vājinīvān","_","_","vājinīvat","JJ","","_","_"
5,"tribhiḥ","_","_","tri","NUM","","_","_"
6,"śataiḥ","_","_","śata","NUM","","_","_"
7,"sacamānāv","_","_","sac","KDP","","_","_"
8,"adiṣṭa","_","_","diś","V","diś","_","_"
1,"yūne","_","_","yuvan","NC","","_","_"
2,"sam","_","_","sa","CADP","","_","_"
3,"asmai","_","_","ida","PRD","","_","_"
4,"kṣitayo","_","_","kṣiti","NC","","_","_"
5,"namantāṃ","_","_","na","V","na","_","_"
6,"_","_","_","śru","PPP","","_","_"
7,"_","_","_","ratha","NC","","_","_"
8,"maruto","_","_","marut","NC","","_","_"
9,"duvoyā","_","_","duvoyā","NC","","_","_"
