"WordID","word","NormSTEM","suffix","lemma","PoS","Root","NormSuffix","NormWord"
1,"vaiśaṃpāyana","_","_","vaiśampāyana","NC","","_","_"
2,"uvāca","_","_","vak","V","vac","_","_"
1,"_","_","_","viśeṣa","NC","","_","_"
2,"_","_","_","arthin","JJ","","_","_"
3,"tato","_","_","tatas","CX","","_","_"
4,"bhīṣmaḥ","_","_","bhīṣma","NC","","_","_"
5,"pautrāṇāṃ","_","_","pautra","NC","","_","_"
6,"_","_","_","vinaya","NC","","_","_"
7,"_","_","_","īpsā","NC","","_","_"
1,"_","_","_","iṣu","NC","","_","_"
2,"_","_","_","astra","NC","","_","_"
3,"_","_","_","jña","JJ","","_","_"
4,"paryapṛcchad","_","_","paripracch","V","paripracch","_","_"
5,"ācāryān","_","_","ācārya","NC","","_","_"
6,"_","_","_","vīrya","NC","","_","_"
7,"_","_","_","samman","PPP","","_","_"
1,"_","_","_","na","CNG","","_","_"
2,"_","_","_","alpa","JJ","","_","_"
3,"_","_","_","dhī","NC","","_","_"
4,"_","_","_","na","CNG","","_","_"
5,"a","_","_","alpha_privativum","JJ","","_","_"
5,"_","_","_","mahābhāga","JJ","","_","_"
6,"_","_","_","tathā","CX","","_","_"
7,"_","_","_","nānā","CX","","_","_"
8,"_","_","_","astra","NC","","_","_"
9,"_","_","_","kovida","JJ","","_","_"
1,"_","_","_","na","CNG","","_","_"
2,"_","_","_","adeva","NC","","_","_"
3,"_","_","_","sattva","NC","","_","_"
4,"vinayet","_","_","vinay","V","vinī","_","_"
5,"kurūn","_","_","kuru","NC","","_","_"
6,"astre","_","_","astra","NC","","_","_"
7,"_","_","_","mahat","JJ","","_","_"
8,"_","_","_","bala","NC","","_","_"
1,"iti","_","_","iti","CQT","","_","_"
2,"saṃcintya","_","_","saṃcintay","CGDA","","_","_"
3,"_","_","_","gāṅgeya","NC","","_","_"
4,"_","_","_","tadā","CAD","","_","_"
5,"_","_","_","bharata","NC","","_","_"
6,"_","_","_","sattama","JJ","","_","_"
1,"droṇāya","_","_","droṇa","NC","","_","_"
2,"_","_","_","veda","NC","","_","_"
3,"_","_","_","vidvas","JJ","","_","_"
4,"bhāradvājāya","_","_","bhāradvāja","NC","","_","_"
5,"dhīmate","_","_","dhīmat","JJ","","_","_"
1,"pāṇḍavān","_","_","pāṇḍava","NC","","_","_"
2,"_","_","_","kaurava","NC","","_","_"
3,"_","_","_","ca","CCD","","_","_"
4,"_","_","_","eva","CEM","","_","_"
5,"dadau","_","_","dad","V","dā","_","_"
6,"śiṣyān","_","_","śiṣya","NC","","_","_"
7,"_","_","_","nara","NC","","_","_"
8,"_","_","_","ṛṣabha","NC","","_","_"
1,"śāstrataḥ","_","_","śāstra","NC","","_","_"
2,"_","_","_","pūjay","PPP","","_","_"
3,"_","_","_","ca","CCD","","_","_"
4,"_","_","_","eva","CEM","","_","_"
5,"samyak","_","_","samyak","CX","","_","_"
6,"tena","_","_","tad","PRD","","_","_"
7,"mahātmanā","_","_","mahātman","JJ","","_","_"
1,"sa","_","_","tad","PRD","","_","_"
2,"bhīṣmeṇa","_","_","bhīṣma","NC","","_","_"
3,"_","_","_","mahābhāga","JJ","","_","_"
4,"_","_","_","tuṣ","PPP","","_","_"
5,"_","_","_","astra","NC","","_","_"
6,"_","_","_","vidvas","JJ","","_","_"
7,"varaḥ","_","_","vara","JJ","","_","_"
1,"pratijagrāha","_","_","pratigrah","V","pratigrah","_","_"
2,"tān","_","_","tad","PRD","","_","_"
3,"sarvāñ","_","_","sarva","JQ","","_","_"
4,"_","_","_","śiṣya","NC","","_","_"
6,"_","_","_","mahat","JJ","","_","_"
7,"_","_","_","yaśas","NC","","_","_"
1,"śikṣayāmāsa","_","_","śikṣay","V","śikṣay","_","_"
2,"ca","_","_","ca","CCD","","_","_"
3,"droṇo","_","_","droṇa","NC","","_","_"
4,"dhanurvedam","_","_","dhanurveda","NC","","_","_"
5,"aśeṣataḥ","_","_","aśeṣa","NC","","_","_"
1,"te","_","_","tad","PRD","","_","_"
2,"_","_","_","acira","JJ","","_","_"
3,"_","_","_","eva","CEM","","_","_"
4,"kālena","_","_","kāla","NC","","_","_"
5,"_","_","_","sarva","JQ","","_","_"
6,"_","_","_","śastra","NC","","_","_"
7,"_","_","_","viśārada","JJ","","_","_"
1,"babhūvuḥ","_","_","bhav","V","bhū","_","_"
2,"kauravā","_","_","kaurava","NC","","_","_"
3,"rājan","_","_","rājan","NC","","_","_"
4,"_","_","_","pāṇḍava","NC","","_","_"
5,"_","_","_","ca","CCD","","_","_"
6,"_","_","_","amita","JJ","","_","_"
7,"_","_","_","ojas","NC","","_","_"
1,"janamejaya","_","_","janamejaya","NC","","_","_"
2,"uvāca","_","_","vak","V","vac","_","_"
1,"vaiśaṃpāyana","_","_","vaiśampāyana","NC","","_","_"
2,"uvāca","_","_","vak","V","vac","_","_"
1,"kathaṃ","_","_","katha","CX","","_","_"
2,"samabhavad","_","_","sambhav","V","sambhū","_","_"
3,"droṇaḥ","_","_","droṇa","NC","","_","_"
4,"kathaṃ","_","_","katha","CX","","_","_"
5,"_","_","_","ca","CCD","","_","_"
6,"_","_","_","astra","NC","","_","_"
7,"_","_","_","avāp","KDP","","_","_"
1,"kathaṃ","_","_","katha","CX","","_","_"
2,"_","_","_","ca","CCD","","_","_"
3,"_","_","_","gā","V","gā","_","_"
4,"kurūn","_","_","kuru","NC","","_","_"
5,"brahman","_","_","brahman","NC","","_","_"
6,"kasya","_","_","kiṃ","PRQ","","_","_"
7,"putraḥ","_","_","putra","NC","","_","_"
8,"sa","_","_","tad","PRD","","_","_"
9,"vīryavān","_","_","vīryavat","JJ","","_","_"
1,"kathaṃ","_","_","katha","CX","","_","_"
2,"_","_","_","ca","CCD","","_","_"
3,"_","_","_","ida","PRD","","_","_"
4,"suto","_","_","suta","NC","","_","_"
5,"jātaḥ","_","_","jan","PPP","","_","_"
6,"so","_","_","tad","PRD","","_","_"
7,"_","_","_","aśvatthāman","NC","","_","_"
8,"_","_","_","astra","NC","","_","_"
9,"_","_","_","vittama","JJ","","_","_"
1,"etad","_","_","tad","PRD","","_","_"
2,"_","_","_","iṣ","V","iṣ","_","_"
3,"_","_","_","mat","PPR","","_","_"
4,"śrotuṃ","_","_","śru","CGDI","","_","_"
5,"vistareṇa","_","_","vistara","NC","","_","_"
6,"prakīrtaya","_","_","prakīrtay","V","prakīrtay","_","_"
1,"gaṅgādvāraṃ","_","_","gaṅgādvāra","NC","","_","_"
2,"prati","_","_","prati","CADP","","_","_"
3,"mahān","_","_","mahat","JJ","","_","_"
4,"babhūva","_","_","bhav","V","bhū","_","_"
5,"bhagavān","_","_","bhagavat","JJ","","_","_"
6,"ṛṣiḥ","_","_","ṛṣi","NC","","_","_"
1,"bharadvāja","_","_","bharadvāja","NC","","_","_"
2,"iti","_","_","iti","CQT","","_","_"
3,"khyātaḥ","_","_","khyā","PPP","","_","_"
4,"satataṃ","_","_","satata","CX","","_","_"
5,"_","_","_","saṃśita","JJ","","_","_"
6,"_","_","_","vrata","NC","","_","_"
1,"so","_","_","tad","PRD","","_","_"
2,"'bhiṣektuṃ","_","_","abhiṣic","CGDI","","_","_"
3,"tato","_","_","tatas","CX","","_","_"
4,"gaṅgāṃ","_","_","gaṅgā","NC","","_","_"
5,"pūrvam","_","_","pūrva","CX","","_","_"
6,"_","_","_","eva","CEM","","_","_"
7,"_","_","_","ga","V","ga","_","_"
8,"nadīm","_","_","nadī","NC","","_","_"
1,"_","_","_","mahat","JJ","","_","_"
2,"_","_","_","ṛṣi","NC","","_","_"
3,"_","_","_","tu","CCD","","_","_"
4,"bharadvājo","_","_","bharadvāja","NC","","_","_"
5,"havirdhāne","_","_","havirdhāna","NC","","_","_"
6,"caran","_","_","car","KDP","","_","_"
7,"purā","_","_","purā","CX","","_","_"
1,"_","_","_","darś","V","dṛś","_","_"
2,"_","_","_","apsaras","NC","","_","_"
3,"sākṣād","_","_","sākṣāt","CX","","_","_"
4,"ghṛtācīm","_","_","ghṛtācī","NC","","_","_"
5,"āplutām","_","_","āplu","PPP","","_","_"
6,"ṛṣiḥ","_","_","ṛṣi","NC","","_","_"
1,"_","_","_","rūpa","NC","","_","_"
2,"_","_","_","yauvana","NC","","_","_"
3,"_","_","_","sampad","PPP","","_","_"
4,"_","_","_","mada","NC","","_","_"
5,"_","_","_","dṛp","PPP","","_","_"
6,"_","_","_","mada","NC","","_","_"
7,"_","_","_","alasa","JJ","","_","_"
1,"tasyā","_","_","tad","PRD","","_","_"
2,"vāyuḥ","_","_","vāyu","NC","","_","_"
3,"samuddhūto","_","_","samuddhū","PPP","","_","_"
4,"vasanaṃ","_","_","vasana","NC","","_","_"
5,"vyapakarṣata","_","_","vyapakṛṣ","V","vyapakṛṣ","_","_"
1,"_","_","_","tad","PRD","","_","_"
2,"_","_","_","guhya","NC","","_","_"
3,"_","_","_","darśana","NC","","_","_"
4,"asyā","_","_","ida","PRD","","_","_"
5,"rāgo","_","_","rāga","NC","","_","_"
6,"'jāyata","_","_","jan","V","jan","_","_"
7,"cetasi","_","_","cetas","NC","","_","_"
1,"tato","_","_","tatas","CX","","_","_"
2,"'sya","_","_","ida","PRD","","_","_"
3,"_","_","_","retas","NC","","_","_"
4,"_","_","_","skand","V","skand","_","_"
5,"tad","_","_","tad","PRD","","_","_"
6,"ṛṣir","_","_","ṛṣi","NC","","_","_"
7,"droṇa","_","_","droṇa","NC","","_","_"
8,"ādadhe","_","_","ādadh","V","ādhā","_","_"
1,"_","_","_","vyapakṛṣ","PPP","","_","_"
2,"_","_","_","ambara","NC","","_","_"
3,"dṛṣṭvā","_","_","dṛś","CGDA","","_","_"
4,"tām","_","_","tad","PRD","","_","_"
5,"_","_","_","ṛṣi","NC","","_","_"
6,"_","_","_","ka","V","ka","_","_"
7,"tataḥ","_","_","tatas","CX","","_","_"
1,"tatra","_","_","tatra","CAD","","_","_"
2,"_","_","_","saṃsañj","PPP","","_","_"
3,"_","_","_","manas","NC","","_","_"
4,"bharadvājasya","_","_","bharadvāja","NC","","_","_"
5,"dhīmataḥ","_","_","dhīmat","JJ","","_","_"
1,"_","_","_","ramya","JJ","","_","_"
2,"_","_","_","guhya","NC","","_","_"
3,"_","_","_","sthala","NC","","_","_"
4,"nṛpa","_","_","nṛpa","NC","","_","_"
1,"_","_","_","pīna","JJ","","_","_"
2,"_","_","_","uttuṅga","JJ","","_","_"
3,"_","_","_","kuca","NC","","_","_"
4,"dṛṣṭvā","_","_","dṛś","CGDA","","_","_"
1,"tasmin","_","_","tad","PRD","","_","_"
2,"samabhavad","_","_","sambhav","V","sambhū","_","_"
3,"droṇaḥ","_","_","droṇa","NC","","_","_"
4,"kalaśe","_","_","kalaśa","NC","","_","_"
5,"tasya","_","_","tad","PRD","","_","_"
6,"dhīmataḥ","_","_","dhīmat","JJ","","_","_"
1,"adhyagīṣṭa","_","_","adhigā","V","adhigā","_","_"
2,"sa","_","_","tad","PRD","","_","_"
3,"_","_","_","veda","NC","","_","_"
4,"_","_","_","ca","CCD","","_","_"
5,"vedāṅgāni","_","_","vedāṅga","NC","","_","_"
6,"ca","_","_","ca","CCD","","_","_"
7,"sarvaśaḥ","_","_","sarvaśas","CX","","_","_"
1,"agner","_","_","agni","NC","","_","_"
2,"astram","_","_","astra","NC","","_","_"
3,"upādāya","_","_","upādā","CGDA","","_","_"
4,"yad","_","_","yat","CSB","","_","_"
5,"ṛṣir","_","_","ṛṣi","NC","","_","_"
6,"veda","_","_","vid","V","vid","_","_"
7,"kāśyapaḥ","_","_","kāśyapa","NC","","_","_"
1,"adhyagacchad","_","_","adhiga","V","adhiga","_","_"
2,"_","_","_","bharadvāja","NC","","_","_"
3,"_","_","_","tad","PRD","","_","_"
4,"astraṃ","_","_","astra","NC","","_","_"
5,"_","_","_","deva","NC","","_","_"
6,"_","_","_","kāray","PPP","","_","_"
1,"agniveśyaṃ","_","_","agniveśya","NC","","_","_"
2,"mahābhāgaṃ","_","_","mahābhāga","JJ","","_","_"
3,"bharadvājaḥ","_","_","bharadvāja","NC","","_","_"
4,"pratāpavān","_","_","pratāpavat","JJ","","_","_"
1,"pratyapādayad","_","_","pratipāday","V","pratipāday","_","_"
2,"āgneyam","_","_","āgneya","JJ","","_","_"
3,"astraṃ","_","_","astra","NC","","_","_"
4,"_","_","_","dharma","NC","","_","_"
5,"_","_","_","bhṛt","JJ","","_","_"
6,"varaḥ","_","_","vara","JJ","","_","_"
1,"_","_","_","agniṣṭut","NC","","_","_"
2,"_","_","_","jan","PPP","","_","_"
3,"sa","_","_","tad","PRD","","_","_"
4,"_","_","_","muni","NC","","_","_"
5,"_","_","_","tatas","CX","","_","_"
6,"_","_","_","bharata","NC","","_","_"
7,"_","_","_","sattama","JJ","","_","_"
1,"bhrātā","_","_","bhrātṛ","NC","","_","_"
2,"bhrātaram","_","_","bhrātṛ","NC","","_","_"
3,"antike","_","_","antika","NC","","_","_"
1,"_","_","_","agniveśya","NC","","_","_"
2,"_","_","_","tadā","CAD","","_","_"
1,"bhāradvājaṃ","_","_","bhāradvāja","NC","","_","_"
2,"_","_","_","tad","PRD","","_","_"
3,"_","_","_","āgneya","JJ","","_","_"
4,"_","_","_","mahat","JJ","","_","_"
5,"_","_","_","astra","NC","","_","_"
6,"pratyapādayat","_","_","pratipāday","V","pratipāday","_","_"
1,"sa","_","_","tad","PRD","","_","_"
2,"vai","_","_","vai","CX","","_","_"
3,"yukto","_","_","yuj","PPP","","_","_"
4,"gurur","_","_","guru","NC","","_","_"
5,"iha","_","_","iha","CAD","","_","_"
6,"_","_","_","yadi","CSB","","_","_"
7,"_","_","_","iṣ","V","iṣ","_","_"
8,"kṛpaṇaḥ","_","_","kṛpaṇa","JJ","","_","_"
9,"sukham","_","_","sukha","NC","","_","_"
1,"bhīṣmo","_","_","bhīṣma","NC","","_","_"
2,"_","_","_","api","CX","","_","_"
3,"_","_","_","lap","V","lap","_","_"
4,"evaṃ","_","_","eva","CX","","_","_"
5,"sa","_","_","tad","PRD","","_","_"
6,"_","_","_","bhāradvāja","NC","","_","_"
7,"_","_","_","parīpsā","NC","","_","_"
1,"_","_","_","bharadvāja","NC","","_","_"
2,"_","_","_","sakhi","NC","","_","_"
3,"_","_","_","ca","CCD","","_","_"
4,"_","_","_","as","V","as","_","_"
5,"pṛṣato","_","_","pṛṣata","NC","","_","_"
6,"nāma","_","_","nāma","CX","","_","_"
7,"pārthivaḥ","_","_","pārthiva","NC","","_","_"
1,"_","_","_","tad","PRD","","_","_"
2,"_","_","_","api","CX","","_","_"
3,"drupado","_","_","drupada","NC","","_","_"
4,"nāma","_","_","nāma","CX","","_","_"
5,"tadā","_","_","tadā","CAD","","_","_"
6,"samabhavat","_","_","sambhav","V","sambhū","_","_"
7,"sutaḥ","_","_","suta","NC","","_","_"
1,"sa","_","_","tad","PRD","","_","_"
2,"nityam","_","_","nitya","CX","","_","_"
3,"āśramaṃ","_","_","āśrama","NC","","_","_"
4,"gatvā","_","_","ga","CGDA","","_","_"
5,"droṇena","_","_","droṇa","NC","","_","_"
6,"saha","_","_","saha","CX","","_","_"
7,"pārṣataḥ","_","_","pārṣata","NC","","_","_"
1,"_","_","_","krīḍ","V","krīḍ","_","_"
2,"_","_","_","adhyayana","NC","","_","_"
3,"_","_","_","ca","CCD","","_","_"
4,"_","_","_","eva","CEM","","_","_"
5,"cakāra","_","_","kar","V","kṛ","_","_"
6,"_","_","_","kṣatriya","NC","","_","_"
7,"_","_","_","ṛṣabha","NC","","_","_"
1,"tato","_","_","tatas","CX","","_","_"
2,"vyatīte","_","_","vyatī","PPP","","_","_"
3,"pṛṣate","_","_","pṛṣata","NC","","_","_"
4,"sa","_","_","tad","PRD","","_","_"
5,"rājā","_","_","rājan","NC","","_","_"
6,"drupado","_","_","drupada","NC","","_","_"
7,"'bhavat","_","_","bhav","V","bhū","_","_"
1,"pāñcāleṣu","_","_","pāñcāla","NC","","_","_"
2,"_","_","_","mahat","JJ","","_","_"
3,"_","_","_","bāhu","NC","","_","_"
4,"uttareṣu","_","_","uttara","JJ","","_","_"
5,"nareśvaraḥ","_","_","nareśvara","NC","","_","_"
1,"bharadvājo","_","_","bharadvāja","NC","","_","_"
2,"'pi","_","_","api","CX","","_","_"
3,"bhagavān","_","_","bhagavat","JJ","","_","_"
4,"āruroha","_","_","āroh","V","āruh","_","_"
5,"divaṃ","_","_","div","NC","","_","_"
6,"tadā","_","_","tadā","CAD","","_","_"
1,"_","_","_","tatra","CAD","","_","_"
2,"_","_","_","eva","CEM","","_","_"
3,"ca","_","_","ca","CCD","","_","_"
4,"vasan","_","_","vas","KDP","","_","_"
5,"_","_","_","droṇa","NC","","_","_"
6,"_","_","_","tapas","NC","","_","_"
7,"_","_","_","tap","V","tap","_","_"
8,"_","_","_","mahat","JJ","","_","_"
9,"_","_","_","tapas","NC","","_","_"
1,"_","_","_","veda","NC","","_","_"
2,"_","_","_","vedāṅga","NC","","_","_"
3,"_","_","_","vidvas","JJ","","_","_"
4,"sa","_","_","tad","PRD","","_","_"
5,"tapasā","_","_","tapas","NC","","_","_"
6,"_","_","_","dah","PPP","","_","_"
7,"_","_","_","kilbiṣa","NC","","_","_"
1,"tataḥ","_","_","tatas","CX","","_","_"
2,"_","_","_","pitṛ","NC","","_","_"
3,"_","_","_","niyuj","PPP","","_","_"
4,"_","_","_","ātman","NC","","_","_"
5,"_","_","_","putra","NC","","_","_"
6,"_","_","_","lobha","NC","","_","_"
7,"_","_","_","mahat","JJ","","_","_"
8,"_","_","_","yaśas","NC","","_","_"
1,"śāradvatīṃ","_","_","śāradvatī","NC","","_","_"
2,"tato","_","_","tatas","CX","","_","_"
3,"droṇaḥ","_","_","droṇa","NC","","_","_"
4,"kṛpīṃ","_","_","kṛpa","NC","","_","_"
5,"bhāryām","_","_","bhāryā","NC","","_","_"
6,"avindata","_","_","vid","V","vid","_","_"
1,"agnihotre","_","_","agnihotra","NC","","_","_"
2,"ca","_","_","ca","CCD","","_","_"
3,"dharme","_","_","dharma","NC","","_","_"
4,"ca","_","_","ca","CCD","","_","_"
5,"dame","_","_","dama","NC","","_","_"
6,"ca","_","_","ca","CCD","","_","_"
7,"satataṃ","_","_","satata","CX","","_","_"
8,"ratā","_","_","ra","PPP","","_","_"
1,"alabhad","_","_","labh","V","labh","_","_"
2,"gautamī","_","_","gautamī","NC","","_","_"
3,"putram","_","_","putra","NC","","_","_"
4,"aśvatthāmānam","_","_","aśvatthāman","NC","","_","_"
5,"eva","_","_","eva","CEM","","_","_"
6,"ca","_","_","ca","CCD","","_","_"
1,"sa","_","_","tad","PRD","","_","_"
2,"_","_","_","jan","PPP","","_","_"
3,"_","_","_","mātra","NC","","_","_"
4,"vyanadad","_","_","vinad","V","vinad","_","_"
5,"_","_","_","yathā","CCM","","_","_"
6,"_","_","_","eva","CEM","","_","_"
7,"_","_","_","uccaiḥśravas","NC","","_","_"
8,"hayaḥ","_","_","haya","NC","","_","_"
1,"_","_","_","tad","PRD","","_","_"
2,"_","_","_","śru","CGDA","","_","_"
3,"_","_","_","antardhā","PPP","","_","_"
4,"bhūtam","_","_","bhūta","NC","","_","_"
5,"_","_","_","antarikṣa","NC","","_","_"
6,"_","_","_","stha","JJ","","_","_"
7,"abravīt","_","_","abravīta","V","brū","_","_"
1,"_","_","_","aśva","NC","","_","_"
2,"_","_","_","iva","CCM","","_","_"
3,"_","_","_","ida","PRD","","_","_"
4,"yat","_","_","yat","CSB","","_","_"
5,"sthāma","_","_","sthāman","NC","","_","_"
6,"nadataḥ","_","_","nad","KDP","","_","_"
7,"pradiśo","_","_","pradiś","NC","","_","_"
8,"gatam","_","_","ga","PPP","","_","_"
1,"_","_","_","aśvatthāman","NC","","_","_"
2,"_","_","_","eva","CEM","","_","_"
3,"bālo","_","_","bāla","NC","","_","_"
4,"'yaṃ","_","_","ida","PRD","","_","_"
5,"tasmān","_","_","tad","PRD","","_","_"
6,"nāmnā","_","_","nāman","NC","","_","_"
7,"bhaviṣyati","_","_","bhav","V","bhū","_","_"
1,"sutena","_","_","suta","NC","","_","_"
2,"tena","_","_","tad","PRD","","_","_"
3,"_","_","_","su","CAD","","_","_"
4,"_","_","_","prī","PPP","","_","_"
5,"_","_","_","bhāradvāja","NC","","_","_"
6,"_","_","_","tatas","CX","","_","_"
7,"'bhavat","_","_","bhav","V","bhū","_","_"
1,"_","_","_","tatra","CAD","","_","_"
2,"_","_","_","eva","CEM","","_","_"
3,"ca","_","_","ca","CCD","","_","_"
4,"vasan","_","_","vas","KDP","","_","_"
5,"dhīmān","_","_","dhīmat","JJ","","_","_"
6,"_","_","_","dhanurveda","NC","","_","_"
7,"_","_","_","para","PPX","","_","_"
8,"'bhavat","_","_","bhav","V","bhū","_","_"
1,"sa","_","_","tad","PRD","","_","_"
2,"śuśrāva","_","_","śṛṇ","V","śru","_","_"
3,"mahātmānaṃ","_","_","mahātman","JJ","","_","_"
4,"jāmadagnyaṃ","_","_","jāmadagnya","NC","","_","_"
5,"paraṃtapam","_","_","paraṃtapa","JJ","","_","_"
1,"_","_","_","sarva","JQ","","_","_"
2,"_","_","_","jñāna","NC","","_","_"
3,"_","_","_","vid","JJ","","_","_"
4,"vipraṃ","_","_","vipra","NC","","_","_"
5,"_","_","_","sarva","JQ","","_","_"
6,"_","_","_","śastra","NC","","_","_"
7,"_","_","_","bhṛt","JJ","","_","_"
8,"varam","_","_","vara","JJ","","_","_"
1,"_","_","_","brāhmaṇa","NC","","_","_"
2,"_","_","_","tadā","CAD","","_","_"
3,"rājan","_","_","rājan","NC","","_","_"
4,"ditsantaṃ","_","_","dits","KDP","","_","_"
5,"vasu","_","_","vasu","NC","","_","_"
6,"sarvaśaḥ","_","_","sarvaśas","CX","","_","_"
1,"sa","_","_","tad","PRD","","_","_"
2,"rāmasya","_","_","rāma","NC","","_","_"
3,"dhanurvedaṃ","_","_","dhanurveda","NC","","_","_"
4,"_","_","_","divya","JJ","","_","_"
5,"_","_","_","astra","NC","","_","_"
6,"_","_","_","ca","CCD","","_","_"
7,"_","_","_","eva","CEM","","_","_"
8,"ha","_","_","ha","CEM","","_","_"
1,"śrutvā","_","_","śru","CGDA","","_","_"
2,"teṣu","_","_","tad","PRD","","_","_"
3,"_","_","_","manas","NC","","_","_"
4,"_","_","_","kar","V","kṛ","_","_"
5,"_","_","_","nīti","NC","","_","_"
6,"_","_","_","śāstra","NC","","_","_"
7,"_","_","_","tathā","CX","","_","_"
8,"_","_","_","eva","CEM","","_","_"
9,"ca","_","_","ca","CCD","","_","_"
1,"tataḥ","_","_","tatas","CX","","_","_"
2,"sa","_","_","tad","PRD","","_","_"
3,"vratibhiḥ","_","_","vratin","JJ","","_","_"
4,"_","_","_","śiṣya","NC","","_","_"
5,"_","_","_","tapas","NC","","_","_"
6,"_","_","_","yuj","PPP","","_","_"
7,"_","_","_","mahat","JJ","","_","_"
8,"_","_","_","tapas","NC","","_","_"
1,"vṛtaḥ","_","_","vṛ","PPP","","_","_"
2,"prāyān","_","_","prayā","V","prayā","_","_"
3,"_","_","_","mahat","JJ","","_","_"
4,"_","_","_","bāhu","NC","","_","_"
5,"mahendraṃ","_","_","mahendra","NC","","_","_"
6,"_","_","_","parvata","NC","","_","_"
7,"_","_","_","uttama","JJ","","_","_"
1,"tato","_","_","tatas","CX","","_","_"
2,"mahendram","_","_","mahendra","NC","","_","_"
3,"āsādya","_","_","āsāday","CGDA","","_","_"
4,"bhāradvājo","_","_","bhāradvāja","NC","","_","_"
5,"_","_","_","mahat","JJ","","_","_"
6,"_","_","_","tapas","NC","","_","_"
1,"kṣāntaṃ","_","_","kṣa","PPP","","_","_"
2,"dāntam","_","_","da","PPP","","_","_"
3,"_","_","_","amitra","NC","","_","_"
4,"_","_","_","ghna","JJ","","_","_"
5,"apaśyad","_","_","paś","V","paś","_","_"
6,"bhṛgunandanam","_","_","bhṛgunandana","NC","","_","_"
1,"tato","_","_","tatas","CX","","_","_"
2,"droṇo","_","_","droṇa","NC","","_","_"
3,"vṛtaḥ","_","_","vṛ","PPP","","_","_"
4,"śiṣyair","_","_","śiṣya","NC","","_","_"
5,"upagamya","_","_","upaga","CGDA","","_","_"
6,"_","_","_","bhṛgu","NC","","_","_"
7,"_","_","_","udvaha","NC","","_","_"
1,"_","_","_","ākhyā","V","ākhyā","_","_"
2,"_","_","_","ātman","NC","","_","_"
3,"nāma","_","_","nāman","NC","","_","_"
4,"janma","_","_","janman","NC","","_","_"
5,"_","_","_","ca","CCD","","_","_"
6,"_","_","_","aṅgiras","NC","","_","_"
7,"kule","_","_","kula","NC","","_","_"
1,"nivedya","_","_","niveday","CGDA","","_","_"
2,"śirasā","_","_","śiras","NC","","_","_"
3,"bhūmau","_","_","bhūmi","NC","","_","_"
4,"pādau","_","_","pāda","NC","","_","_"
5,"_","_","_","ca","CCD","","_","_"
6,"_","_","_","eva","CEM","","_","_"
7,"_","_","_","abhivāday","V","abhivāday","_","_"
1,"_","_","_","tatas","CX","","_","_"
2,"_","_","_","tad","PRD","","_","_"
3,"sarvam","_","_","sarva","JQ","","_","_"
4,"utsṛjya","_","_","utsṛj","CGDA","","_","_"
5,"vanaṃ","_","_","vana","NC","","_","_"
6,"jigamiṣuṃ","_","_","jigamiṣu","JJ","","_","_"
7,"tadā","_","_","tadā","CAD","","_","_"
1,"_","_","_","śastra","NC","","_","_"
2,"_","_","_","astra","NC","","_","_"
3,"ca","_","_","ca","CCD","","_","_"
4,"niṣṇātaṃ","_","_","niṣṇāta","JJ","","_","_"
5,"śrutvā","_","_","śru","CGDA","","_","_"
6,"tatra","_","_","tatra","CAD","","_","_"
7,"samāgatam","_","_","samāga","PPP","","_","_"
1,"tam","_","_","tad","PRD","","_","_"
2,"abravīn","_","_","abravīta","V","brū","_","_"
3,"mahātmā","_","_","mahātman","JJ","","_","_"
4,"sa","_","_","tad","PRD","","_","_"
5,"_","_","_","sarva","JQ","","_","_"
6,"_","_","_","kṣatriya","NC","","_","_"
7,"_","_","_","mardana","JJ","","_","_"
1,"svāgataṃ","_","_","svāgata","NC","","_","_"
2,"te","_","_","tvat","PPR","","_","_"
3,"dvijaśreṣṭha","_","_","dvijaśreṣṭha","NC","","_","_"
4,"yad","_","_","yad","PRL","","_","_"
5,"icchasi","_","_","iṣ","V","iṣ","_","_"
6,"vadasva","_","_","vad","V","vad","_","_"
7,"me","_","_","mat","PPR","","_","_"
1,"evam","_","_","eva","CX","","_","_"
2,"_","_","_","vac","PPP","","_","_"
3,"_","_","_","tu","CCD","","_","_"
4,"rāmeṇa","_","_","rāma","NC","","_","_"
5,"bhāradvājo","_","_","bhāradvāja","NC","","_","_"
6,"'bravīd","_","_","abravīta","V","brū","_","_"
7,"vacaḥ","_","_","vacas","NC","","_","_"
1,"vanaṃ","_","_","vana","NC","","_","_"
2,"tu","_","_","tu","CCD","","_","_"
3,"prasthitaṃ","_","_","prasthā","PPP","","_","_"
4,"rāmaṃ","_","_","rāma","NC","","_","_"
5,"_","_","_","bhāradvāja","NC","","_","_"
6,"_","_","_","tadā","CAD","","_","_"
7,"_","_","_","abravīta","V","brū","_","_"
1,"bharadvājāt","_","_","bharadvāja","NC","","_","_"
2,"samutpannaṃ","_","_","samutpad","PPP","","_","_"
3,"tathā","_","_","tathā","CX","","_","_"
4,"tvaṃ","_","_","tvat","PPR","","_","_"
5,"mām","_","_","mat","PPR","","_","_"
6,"ayonijam","_","_","ayonija","JJ","","_","_"
1,"āgataṃ","_","_","āga","PPP","","_","_"
2,"_","_","_","vitta","NC","","_","_"
3,"_","_","_","kāma","NC","","_","_"
4,"māṃ","_","_","mat","PPR","","_","_"
5,"viddhi","_","_","vid","V","vid","_","_"
6,"droṇaṃ","_","_","droṇa","NC","","_","_"
7,"dvijarṣabham","_","_","dvijarṣabha","NC","","_","_"
1,"rāmaṃ","_","_","rāma","NC","","_","_"
2,"praharatāṃ","_","_","prahṛ","KDP","","_","_"
3,"śreṣṭhaṃ","_","_","śreṣṭha","JJ","","_","_"
4,"ditsantaṃ","_","_","dits","KDP","","_","_"
5,"vividhaṃ","_","_","vividha","JJ","","_","_"
6,"vasu","_","_","vasu","NC","","_","_"
1,"ahaṃ","_","_","mat","PPR","","_","_"
2,"dhanam","_","_","dhana","NC","","_","_"
3,"anantaṃ","_","_","ananta","JJ","","_","_"
4,"hi","_","_","hi","CX","","_","_"
5,"prārthaye","_","_","prārthaya","V","prārthay","_","_"
6,"_","_","_","vipula","JJ","","_","_"
7,"_","_","_","vrata","NC","","_","_"
1,"rāma","_","_","rāma","NC","","_","_"
2,"uvāca","_","_","vak","V","vac","_","_"
1,"hiraṇyaṃ","_","_","hiraṇya","NC","","_","_"
2,"mama","_","_","mat","PPR","","_","_"
3,"_","_","_","yad","PRL","","_","_"
4,"_","_","_","ca","CCD","","_","_"
5,"_","_","_","anya","PPX","","_","_"
6,"vasu","_","_","vasu","NC","","_","_"
7,"kiṃcana","_","_","kaścana","PRI","","_","_"
8,"vidyate","_","_","vid","V","vid","_","_"
1,"brāhmaṇebhyo","_","_","brāhmaṇa","NC","","_","_"
2,"mayā","_","_","mat","PPR","","_","_"
3,"dattaṃ","_","_","dā","PPP","","_","_"
4,"sarvam","_","_","sarva","JQ","","_","_"
5,"eva","_","_","eva","CEM","","_","_"
6,"tapodhana","_","_","tapodhana","JJ","","_","_"
1,"_","_","_","tathā","CX","","_","_"
2,"_","_","_","eva","CEM","","_","_"
3,"_","_","_","ida","PRD","","_","_"
4,"dharā","_","_","dharā","NC","","_","_"
5,"devī","_","_","devī","NC","","_","_"
6,"_","_","_","sāgara","NC","","_","_"
7,"_","_","_","anta","NC","","_","_"
8,"_","_","_","sa_saha","CX","","_","_"
9,"_","_","_","pattana","NC","","_","_"
1,"kaśyapāya","_","_","kaśyapa","NC","","_","_"
2,"mayā","_","_","mat","PPR","","_","_"
3,"dattā","_","_","dā","PPP","","_","_"
4,"kṛtsnā","_","_","kṛtsna","JJ","","_","_"
5,"_","_","_","nagara","NC","","_","_"
6,"_","_","_","mālin","JJ","","_","_"
1,"_","_","_","śarīra","NC","","_","_"
2,"_","_","_","mātra","NC","","_","_"
3,"_","_","_","eva","CEM","","_","_"
4,"_","_","_","adya","CX","","_","_"
5,"_","_","_","mat","PPR","","_","_"
6,"_","_","_","ida","PRD","","_","_"
7,"avaśeṣitam","_","_","avaśeṣay","PPP","","_","_"
1,"astrāṇi","_","_","astra","NC","","_","_"
2,"ca","_","_","ca","CCD","","_","_"
3,"mahārhāṇi","_","_","mahārha","JJ","","_","_"
4,"śastrāṇi","_","_","śastra","NC","","_","_"
5,"vividhāni","_","_","vividha","JJ","","_","_"
6,"ca","_","_","ca","CCD","","_","_"
1,"astrāṇi","_","_","astra","NC","","_","_"
2,"vā","_","_","vā","CCD","","_","_"
3,"śarīraṃ","_","_","śarīra","NC","","_","_"
4,"vā","_","_","vā","CCD","","_","_"
5,"_","_","_","varay","V","varay","_","_"
6,"_","_","_","tad","PRD","","_","_"
7,"_","_","_","mat","PPR","","_","_"
8,"_","_","_","udya","PPP","","_","_"
1,"vṛṇīṣva","_","_","vṛ","V","vṛ","_","_"
2,"kiṃ","_","_","kiṃ","PRQ","","_","_"
3,"prayacchāmi","_","_","praya","V","praya","_","_"
4,"tubhyaṃ","_","_","tvat","PPR","","_","_"
5,"droṇa","_","_","droṇa","NC","","_","_"
6,"_","_","_","vad","V","vad","_","_"
7,"_","_","_","āśu","JJ","","_","_"
8,"tat","_","_","tad","PRD","","_","_"
1,"droṇa","_","_","droṇa","NC","","_","_"
2,"uvāca","_","_","vak","V","vac","_","_"
1,"astrāṇi","_","_","astra","NC","","_","_"
2,"me","_","_","mat","PPR","","_","_"
3,"samagrāṇi","_","_","samagra","JJ","","_","_"
4,"_","_","_","sa_saha","CX","","_","_"
5,"_","_","_","saṃhāra","NC","","_","_"
6,"bhārgava","_","_","bhārgava","NC","","_","_"
1,"saprayogarahasyāni","_","_","saprayogarahasya","JJ","","_","_"
2,"dātum","_","_","dā","CGDI","","_","_"
3,"_","_","_","arh","V","arh","_","_"
4,"_","_","_","aśeṣatas","CX","","_","_"
1,"etad","_","_","tad","PRD","","_","_"
2,"vasu","_","_","vasu","NC","","_","_"
3,"vasūnāṃ","_","_","vasu","NC","","_","_"
4,"hi","_","_","hi","CX","","_","_"
5,"sarveṣāṃ","_","_","sarva","JQ","","_","_"
6,"_","_","_","vipra","NC","","_","_"
7,"_","_","_","sattama","JJ","","_","_"
1,"rāma","_","_","rāma","NC","","_","_"
2,"uvāca","_","_","vak","V","vac","_","_"
1,"prayaccha","_","_","prayaccha","V","praya","_","_"
2,"bhagavan","_","_","bhagavat","NC","","_","_"
3,"mahyaṃ","_","_","mat","PPR","","_","_"
4,"varam","_","_","vara","NC","","_","_"
5,"etan","_","_","tad","PRD","","_","_"
6,"mayā","_","_","mat","PPR","","_","_"
7,"vṛtam","_","_","vṛ","PPP","","_","_"
1,"kṛtārthaṃ","_","_","kṛtārtha","JJ","","_","_"
2,"ca","_","_","ca","CCD","","_","_"
3,"bhaviṣyāmi","_","_","bhav","V","bhū","_","_"
4,"varaṃ","_","_","vara","NC","","_","_"
5,"labdhvā","_","_","labh","CGDA","","_","_"
6,"dvijottama","_","_","dvijottama","NC","","_","_"
1,"pratigṛhṇīṣva","_","_","pratigrah","V","pratigrah","_","_"
2,"_","_","_","vipra","NC","","_","_"
3,"_","_","_","indra","NC","","_","_"
4,"droṇa","_","_","droṇa","NC","","_","_"
5,"matto","_","_","mat","PPR","","_","_"
6,"_","_","_","yadi","CSB","","_","_"
7,"_","_","_","iṣ","V","iṣ","_","_"
1,"varaṃ","_","_","vara","NC","","_","_"
2,"tava","_","_","tvat","PPR","","_","_"
3,"_","_","_","dad","V","dā","_","_"
4,"_","_","_","adya","CX","","_","_"
5,"yad","_","_","yad","PRL","","_","_"
6,"uktaṃ","_","_","vac","PPP","","_","_"
7,"te","_","_","tvat","PPR","","_","_"
8,"dvijottama","_","_","dvijottama","NC","","_","_"
1,"_","_","_","grah","V","grah","_","_"
2,"_","_","_","astra","NC","","_","_"
3,"divyāni","_","_","divya","JJ","","_","_"
4,"dhanurvedaṃ","_","_","dhanurveda","NC","","_","_"
5,"ca","_","_","ca","CCD","","_","_"
6,"māmakam","_","_","māmaka","JJ","","_","_"
1,"_","_","_","sa_saha","CX","","_","_"
2,"_","_","_","putra","NC","","_","_"
3,"_","_","_","dad","V","dā","_","_"
4,"_","_","_","tad","PRD","","_","_"
5,"tava","_","_","tvat","PPR","","_","_"
6,"droṇa","_","_","droṇa","NC","","_","_"
7,"mahad","_","_","mahat","JJ","","_","_"
8,"varam","_","_","vara","NC","","_","_"
1,"kṛtārtho","_","_","kṛtārtha","JJ","","_","_"
2,"gaccha","_","_","ga","V","ga","_","_"
3,"_","_","_","vipra","NC","","_","_"
4,"_","_","_","indra","NC","","_","_"
5,"gaccha","_","_","ga","V","ga","_","_"
6,"_","_","_","ca","CCD","","_","_"
7,"_","_","_","eva","CEM","","_","_"
8,"yathāgatam","_","_","yathāgata","JJ","","_","_"
1,"_","_","_","kṛtāstra","JJ","","_","_"
2,"_","_","_","ca","CCD","","_","_"
3,"_","_","_","eva","CEM","","_","_"
4,"_","_","_","śūra","NC","","_","_"
5,"_","_","_","ca","CCD","","_","_"
6,"_","_","_","sarva","JQ","","_","_"
7,"_","_","_","śāstra","NC","","_","_"
8,"_","_","_","viśārada","JJ","","_","_"
1,"_","_","_","aśvatthāman","NC","","_","_"
2,"_","_","_","iti","CQT","","_","_"
3,"vikhyāto","_","_","vikhyā","PPP","","_","_"
4,"bhaviṣyati","_","_","bhav","V","bhū","_","_"
5,"_","_","_","mahat","JJ","","_","_"
6,"_","_","_","ratha","NC","","_","_"
1,"vaiśaṃpāyana","_","_","vaiśampāyana","NC","","_","_"
2,"uvāca","_","_","vak","V","vac","_","_"
1,"_","_","_","tathā","CX","","_","_"
2,"_","_","_","iti","CQT","","_","_"
3,"_","_","_","vac","CGDA","","_","_"
4,"_","_","_","tatas","CX","","_","_"
5,"_","_","_","tad","PRD","","_","_"
6,"prādād","_","_","pradad","V","pradā","_","_"
7,"astrāṇi","_","_","astra","NC","","_","_"
8,"bhārgavaḥ","_","_","bhārgava","NC","","_","_"
1,"_","_","_","sa_saha","CX","","_","_"
2,"_","_","_","rahasyavrata","NC","","_","_"
3,"_","_","_","ca","CCD","","_","_"
4,"_","_","_","eva","CEM","","_","_"
5,"dhanurvedam","_","_","dhanurveda","NC","","_","_"
6,"aśeṣataḥ","_","_","aśeṣatas","CX","","_","_"
1,"pratigṛhya","_","_","pratigrah","CGDA","","_","_"
2,"tu","_","_","tu","CCD","","_","_"
3,"tat","_","_","tad","PRD","","_","_"
4,"sarvaṃ","_","_","sarva","JQ","","_","_"
5,"kṛtāstro","_","_","kṛtāstra","JJ","","_","_"
6,"dvijasattamaḥ","_","_","dvijasattama","NC","","_","_"
1,"priyaṃ","_","_","priya","JJ","","_","_"
2,"sakhāyaṃ","_","_","sakhi","NC","","_","_"
3,"_","_","_","su","CAD","","_","_"
4,"_","_","_","prī","PPP","","_","_"
5,"jagāma","_","_","ga","V","ga","_","_"
6,"drupadaṃ","_","_","drupada","NC","","_","_"
7,"prati","_","_","prati","CADP","","_","_"
