"WordID","word","NormSTEM","suffix","lemma","PoS","Root","NormSuffix","NormWord"
1,"yudhiṣṭhira","_","_","yudhiṣṭhira","NC","","_","_"
2,"uvāca","_","_","vak","V","vac","_","_"
1,"vidyā","_","_","vidyā","NC","","_","_"
2,"_","_","_","tapas","NC","","_","_"
3,"_","_","_","ca","CCD","","_","_"
4,"dānaṃ","_","_","dāna","NC","","_","_"
5,"ca","_","_","ca","CCD","","_","_"
6,"kim","_","_","kiṃ","PRQ","","_","_"
7,"eteṣāṃ","_","_","tad","PRD","","_","_"
8,"viśiṣyate","_","_","viśās","V","viśās","_","_"
1,"pṛcchāmi","_","_","pṛcch","V","prach","_","_"
2,"tvā","_","_","tvat","PPR","","_","_"
3,"satāṃ","_","_","sat","JJ","","_","_"
4,"śreṣṭha","_","_","śreṣṭha","JJ","","_","_"
5,"_","_","_","tad","PRD","","_","_"
6,"_","_","_","mat","PPR","","_","_"
7,"brūhi","_","_","abravīta","V","brū","_","_"
8,"pitāmaha","_","_","pitāmaha","NC","","_","_"
1,"bhīṣma","_","_","bhīṣma","NC","","_","_"
2,"uvāca","_","_","vak","V","vac","_","_"
1,"_","_","_","atra","CAD","","_","_"
2,"_","_","_","api","CX","","_","_"
3,"_","_","_","udāhṛ","V","udāhṛ","_","_"
4,"_","_","_","ida","PRD","","_","_"
5,"itihāsaṃ","_","_","itihāsa","NC","","_","_"
6,"purātanam","_","_","purātana","JJ","","_","_"
1,"maitreyasya","_","_","maitreya","NC","","_","_"
2,"ca","_","_","ca","CCD","","_","_"
3,"saṃvādaṃ","_","_","saṃvāda","NC","","_","_"
4,"kṛṣṇadvaipāyanasya","_","_","kṛṣṇadvaipāyana","NC","","_","_"
5,"ca","_","_","ca","CCD","","_","_"
1,"kṛṣṇadvaipāyano","_","_","kṛṣṇadvaipāyana","NC","","_","_"
2,"rājann","_","_","rājan","NC","","_","_"
3,"_","_","_","ajñāta","JJ","","_","_"
4,"_","_","_","carita","NC","","_","_"
5,"caran","_","_","car","KDP","","_","_"
1,"vārāṇasyām","_","_","vārāṇasī","NC","","_","_"
2,"_","_","_","upatiṣṭh","V","upasthā","_","_"
3,"_","_","_","maitreya","NC","","_","_"
4,"_","_","_","svairiṇī","NC","","_","_"
5,"_","_","_","kula","NC","","_","_"
1,"tam","_","_","tad","PRD","","_","_"
2,"upasthitam","_","_","upasthā","PPP","","_","_"
3,"āsīnaṃ","_","_","ās","PPP","","_","_"
4,"jñātvā","_","_","jñā","CGDA","","_","_"
5,"sa","_","_","tad","PRD","","_","_"
6,"_","_","_","muni","NC","","_","_"
7,"_","_","_","sattama","JJ","","_","_"
1,"arcitvā","_","_","arc","CGDA","","_","_"
2,"bhojayāmāsa","_","_","bhojay","V","bhojay","_","_"
3,"maitreyo","_","_","maitreya","NC","","_","_"
4,"'śanam","_","_","aśana","NC","","_","_"
5,"uttamam","_","_","uttama","JJ","","_","_"
1,"tad","_","_","tad","PRD","","_","_"
2,"annam","_","_","anna","NC","","_","_"
3,"uttamaṃ","_","_","uttama","JJ","","_","_"
4,"bhuktvā","_","_","bhuj","CGDA","","_","_"
5,"guṇavat","_","_","guṇavat","JJ","","_","_"
6,"sārvakāmikam","_","_","sārvakāmika","JJ","","_","_"
1,"pratiṣṭhamāno","_","_","prasthā","KDP","","_","_"
2,"'smayata","_","_","smi","V","smi","_","_"
3,"prītaḥ","_","_","prī","PPP","","_","_"
4,"kṛṣṇo","_","_","kṛṣṇa","NC","","_","_"
5,"_","_","_","mahat","JJ","","_","_"
6,"_","_","_","manas","NC","","_","_"
1,"tam","_","_","tad","PRD","","_","_"
2,"utsmayantaṃ","_","_","utsmi","KDP","","_","_"
3,"samprekṣya","_","_","samprekṣ","CGDA","","_","_"
4,"maitreyaḥ","_","_","maitreya","NC","","_","_"
5,"kṛṣṇam","_","_","kṛṣṇa","NC","","_","_"
6,"abravīt","_","_","abravīta","V","brū","_","_"
1,"kāraṇaṃ","_","_","kāraṇa","NC","","_","_"
2,"brūhi","_","_","abravīta","V","brū","_","_"
3,"_","_","_","dharma","NC","","_","_"
4,"_","_","_","ātman","NC","","_","_"
5,"yo","_","_","yad","PRL","","_","_"
6,"'smayiṣṭhāḥ","_","_","smi","V","smi","_","_"
7,"_","_","_","kutas","CX","","_","_"
8,"_","_","_","ca","CCD","","_","_"
9,"te","_","_","tvat","PPR","","_","_"
1,"tapasvino","_","_","tapasvin","NC","","_","_"
2,"dhṛtimataḥ","_","_","dhṛtimat","JJ","","_","_"
3,"pramodaḥ","_","_","pramoda","NC","","_","_"
4,"samupāgataḥ","_","_","samupāga","PPP","","_","_"
1,"etat","_","_","tad","PRD","","_","_"
2,"pṛcchāmi","_","_","pṛcch","V","prach","_","_"
3,"te","_","_","tvat","PPR","","_","_"
4,"vidvann","_","_","vidvas","JJ","","_","_"
5,"abhivādya","_","_","abhivāday","CGDA","","_","_"
6,"praṇamya","_","_","praṇa","CGDA","","_","_"
7,"ca","_","_","ca","CCD","","_","_"
1,"_","_","_","ātman","NC","","_","_"
2,"_","_","_","ca","CCD","","_","_"
3,"_","_","_","tapas","NC","","_","_"
4,"_","_","_","bhāgya","NC","","_","_"
5,"_","_","_","mahat","JJ","","_","_"
6,"_","_","_","bhāgya","NC","","_","_"
7,"_","_","_","tathā","CX","","_","_"
8,"_","_","_","eva","CEM","","_","_"
9,"ca","_","_","ca","CCD","","_","_"
1,"pṛthag","_","_","pṛthak","CX","","_","_"
2,"_","_","_","ācar","KDP","","_","_"
3,"_","_","_","tāta","NC","","_","_"
4,"pṛthag","_","_","pṛthak","CX","","_","_"
5,"ātmani","_","_","ātman","NC","","_","_"
6,"_","_","_","ca","CCD","","_","_"
7,"_","_","_","ātman","NC","","_","_"
1,"_","_","_","alpa","JJ","","_","_"
2,"_","_","_","antara","NC","","_","_"
3,"ahaṃ","_","_","mat","PPR","","_","_"
4,"manye","_","_","man","V","man","_","_"
5,"viśiṣṭam","_","_","viśiṣ","PPP","","_","_"
6,"api","_","_","api","CX","","_","_"
7,"vā","_","_","vā","CCD","","_","_"
8,"tvayā","_","_","tvat","PPR","","_","_"
1,"vyāsa","_","_","vyāsa","NC","","_","_"
2,"uvāca","_","_","vak","V","vac","_","_"
1,"_","_","_","aticheda","NC","","_","_"
2,"_","_","_","ativāda","NC","","_","_"
3,"smayo","_","_","smaya","NC","","_","_"
4,"'yaṃ","_","_","ida","PRD","","_","_"
5,"samupāgataḥ","_","_","samupāga","PPP","","_","_"
1,"asatyaṃ","_","_","asatya","JJ","","_","_"
2,"_","_","_","veda","NC","","_","_"
3,"_","_","_","vacana","NC","","_","_"
4,"kasmād","_","_","kasmāt","CX","","_","_"
5,"vedo","_","_","veda","NC","","_","_"
6,"'nṛtaṃ","_","_","anṛta","NC","","_","_"
7,"vadet","_","_","vad","V","vad","_","_"
1,"_","_","_","tri","NUM","","_","_"
2,"_","_","_","eva","CEM","","_","_"
3,"tu","_","_","tu","CCD","","_","_"
4,"_","_","_","pada","NC","","_","_"
5,"_","_","_","ah","V","ah","_","_"
6,"_","_","_","puruṣa","NC","","_","_"
7,"_","_","_","uttama","JJ","","_","_"
8,"vratam","_","_","vrata","NC","","_","_"
1,"na","_","_","na","CNG","","_","_"
2,"_","_","_","druh","V","druh","_","_"
3,"_","_","_","ca","CCD","","_","_"
4,"_","_","_","eva","CEM","","_","_"
5,"_","_","_","dad","V","dā","_","_"
6,"_","_","_","ca","CCD","","_","_"
7,"satyaṃ","_","_","satya","NC","","_","_"
8,"_","_","_","ca","CCD","","_","_"
9,"_","_","_","eva","CEM","","_","_"
10,"paraṃ","_","_","para","PPX","","_","_"
11,"vadet","_","_","vad","V","vad","_","_"
1,"idānīṃ","_","_","idānīm","CX","","_","_"
2,"_","_","_","ca","CCD","","_","_"
3,"_","_","_","eva","CEM","","_","_"
4,"naḥ","_","_","mat","PPR","","_","_"
5,"kṛtyaṃ","_","_","kṛtya","NC","","_","_"
6,"_","_","_","purastāt","CX","","_","_"
7,"_","_","_","ca","CCD","","_","_"
8,"paraṃ","_","_","para","PPX","","_","_"
9,"smṛtam","_","_","smṛ","PPP","","_","_"
1,"alpo","_","_","alpa","JJ","","_","_"
2,"'pi","_","_","api","CX","","_","_"
3,"tādṛśo","_","_","tādṛśa","JJ","","_","_"
4,"dāyo","_","_","dāya","NC","","_","_"
5,"_","_","_","bhav","V","bhū","_","_"
6,"_","_","_","uta","CCD","","_","_"
7,"_","_","_","mahat","JJ","","_","_"
8,"_","_","_","phala","NC","","_","_"
1,"tṛṣitāya","_","_","tṛṣita","JJ","","_","_"
2,"ca","_","_","ca","CCD","","_","_"
3,"yad","_","_","yad","PRL","","_","_"
4,"dattaṃ","_","_","dā","PPP","","_","_"
5,"_","_","_","hṛdaya","NC","","_","_"
6,"_","_","_","anasūyat","JJ","","_","_"
1,"_","_","_","tṛṣita","JJ","","_","_"
2,"_","_","_","tṛṣita","JJ","","_","_"
3,"tvaṃ","_","_","tvat","PPR","","_","_"
4,"_","_","_","dā","CGDA","","_","_"
5,"_","_","_","tad","PRD","","_","_"
6,"aśanaṃ","_","_","aśana","NC","","_","_"
7,"mama","_","_","mat","PPR","","_","_"
1,"ajaiṣīr","_","_","jay","V","ji","_","_"
2,"mahato","_","_","mahat","JJ","","_","_"
3,"_","_","_","loka","NC","","_","_"
4,"_","_","_","mahat","JJ","","_","_"
5,"_","_","_","yajña","NC","","_","_"
6,"_","_","_","iva","CCM","","_","_"
7,"_","_","_","abhibhu","JJ","","_","_"
1,"ato","_","_","atas","CX","","_","_"
2,"_","_","_","dāna","NC","","_","_"
3,"_","_","_","pavitra","NC","","_","_"
4,"prīto","_","_","prī","PPP","","_","_"
5,"'smi","_","_","as","V","as","_","_"
6,"_","_","_","tapas","NC","","_","_"
7,"_","_","_","eva","CEM","","_","_"
8,"ca","_","_","ca","CCD","","_","_"
1,"_","_","_","puṇya","JJ","","_","_"
2,"_","_","_","eva","CEM","","_","_"
3,"hi","_","_","hi","CX","","_","_"
4,"te","_","_","tvat","PPR","","_","_"
5,"gandhaḥ","_","_","gandha","NC","","_","_"
6,"_","_","_","puṇya","JJ","","_","_"
7,"_","_","_","eva","CEM","","_","_"
8,"ca","_","_","ca","CCD","","_","_"
9,"darśanam","_","_","darśana","NC","","_","_"
1,"_","_","_","puṇya","JJ","","_","_"
2,"_","_","_","ca","CCD","","_","_"
3,"vāti","_","_","śṛṇ","V","vā","_","_"
4,"_","_","_","gandha","NC","","_","_"
5,"_","_","_","tvat","PPR","","_","_"
6,"manye","_","_","man","V","man","_","_"
7,"_","_","_","karman","NC","","_","_"
8,"_","_","_","vidhāna","NC","","_","_"
1,"adhikaṃ","_","_","adhika","JJ","","_","_"
2,"mārjanāt","_","_","mārjana","NC","","_","_"
3,"tāta","_","_","tāta","NC","","_","_"
4,"_","_","_","tathā","CX","","_","_"
5,"_","_","_","eva","CEM","","_","_"
6,"_","_","_","api","CX","","_","_"
7,"_","_","_","anulepana","NC","","_","_"
1,"śubhaṃ","_","_","śubha","JJ","","_","_"
2,"_","_","_","sarva","JQ","","_","_"
3,"_","_","_","pavitra","NC","","_","_"
4,"dānam","_","_","dāna","NC","","_","_"
5,"eva","_","_","eva","CEM","","_","_"
6,"paraṃ","_","_","para","PPX","","_","_"
7,"bhavet","_","_","bhav","V","bhū","_","_"
1,"_","_","_","yad","PRL","","_","_"
2,"_","_","_","ida","PRD","","_","_"
3,"_","_","_","uttama","JJ","","_","_"
4,"_","_","_","iha","CAD","","_","_"
5,"_","_","_","veda","NC","","_","_"
6,"_","_","_","vac","PPP","","_","_"
7,"praśaṃsasi","_","_","praśaṃs","V","praśaṃs","_","_"
1,"teṣāṃ","_","_","tad","PRD","","_","_"
2,"śreṣṭhatamaṃ","_","_","śreṣṭhatama","JJ","","_","_"
3,"dānam","_","_","dāna","NC","","_","_"
4,"iti","_","_","iti","CQT","","_","_"
5,"me","_","_","mat","PPR","","_","_"
6,"_","_","_","na","CNG","","_","_"
7,"_","_","_","as","V","as","_","_"
8,"saṃśayaḥ","_","_","saṃśaya","NC","","_","_"
1,"_","_","_","dāna","NC","","_","_"
2,"_","_","_","kṛt","JJ","","_","_"
3,"kṛtaḥ","_","_","kṛ","PPP","","_","_"
4,"panthā","_","_","pathin","NC","","_","_"
5,"yena","_","_","yad","PRL","","_","_"
6,"yānti","_","_","yā","V","yā","_","_"
7,"manīṣiṇaḥ","_","_","manīṣin","JJ","","_","_"
1,"te","_","_","tad","PRD","","_","_"
2,"hi","_","_","hi","CX","","_","_"
3,"prāṇasya","_","_","prāṇa","NC","","_","_"
4,"_","_","_","dātṛ","JJ","","_","_"
5,"_","_","_","tad","PRD","","_","_"
6,"dharmaḥ","_","_","dharma","NC","","_","_"
7,"pratiṣṭhitaḥ","_","_","pratiṣṭhā","PPP","","_","_"
1,"yathā","_","_","yathā","CCM","","_","_"
2,"vedāḥ","_","_","veda","NC","","_","_"
3,"_","_","_","su","CAD","","_","_"
4,"a","_","_","alpha_privativum","PPP","","_","_"
4,"_","_","_","dhī","PPP","","_","_"
5,"_","_","_","ca","CCD","","_","_"
6,"yathā","_","_","yathā","CCM","","_","_"
7,"_","_","_","ca","CCD","","_","_"
8,"_","_","_","indriya","NC","","_","_"
9,"_","_","_","saṃyama","NC","","_","_"
1,"_","_","_","sarva","JQ","","_","_"
2,"_","_","_","tyāga","NC","","_","_"
3,"yathā","_","_","yathā","CCM","","_","_"
4,"_","_","_","ca","CCD","","_","_"
5,"_","_","_","iha","CAD","","_","_"
6,"tathā","_","_","tathā","CX","","_","_"
7,"dānam","_","_","dāna","NC","","_","_"
8,"anuttamam","_","_","anuttama","JJ","","_","_"
1,"tvaṃ","_","_","tvat","PPR","","_","_"
2,"hi","_","_","hi","CX","","_","_"
3,"tāta","_","_","tāta","NC","","_","_"
4,"sukhād","_","_","sukha","NC","","_","_"
5,"eva","_","_","eva","CEM","","_","_"
6,"sukham","_","_","sukha","NC","","_","_"
7,"eṣyasi","_","_","e","V","i","_","_"
8,"śobhanam","_","_","śobhana","JJ","","_","_"
1,"sukhāt","_","_","sukha","JJ","","_","_"
2,"_","_","_","sukhatara","JJ","","_","_"
3,"_","_","_","prāpti","NC","","_","_"
4,"āpnute","_","_","āpn","V","āp","_","_"
5,"_","_","_","matimat","JJ","","_","_"
6,"_","_","_","nara","NC","","_","_"
1,"_","_","_","tad","PRD","","_","_"
2,"_","_","_","mat","PPR","","_","_"
3,"pratyakṣam","_","_","pratyakṣa","JJ","","_","_"
4,"_","_","_","eva","CEM","","_","_"
5,"_","_","_","ida","PRD","","_","_"
6,"upalabdham","_","_","upalabh","PPP","","_","_"
7,"asaṃśayam","_","_","asaṃśaya","CX","","_","_"
1,"śrīmantam","_","_","śrīmat","JJ","","_","_"
2,"_","_","_","āpn","V","āp","_","_"
3,"_","_","_","artha","NC","","_","_"
4,"dānaṃ","_","_","dāna","NC","","_","_"
5,"_","_","_","yajña","NC","","_","_"
6,"_","_","_","tathā","CX","","_","_"
7,"sukham","_","_","sukha","NC","","_","_"
1,"sukhād","_","_","sukha","NC","","_","_"
2,"eva","_","_","eva","CEM","","_","_"
3,"paraṃ","_","_","para","PPX","","_","_"
4,"duḥkhaṃ","_","_","duḥkha","NC","","_","_"
5,"duḥkhād","_","_","duḥkha","NC","","_","_"
6,"anyat","_","_","anya","PPX","","_","_"
7,"paraṃ","_","_","para","PPX","","_","_"
8,"sukham","_","_","sukha","NC","","_","_"
1,"dṛśyate","_","_","darś","V","dṛś","_","_"
2,"hi","_","_","hi","CX","","_","_"
3,"_","_","_","mahat","JJ","","_","_"
4,"_","_","_","prājña","JJ","","_","_"
5,"niyataṃ","_","_","niyata","CX","","_","_"
6,"vai","_","_","vai","CX","","_","_"
7,"svabhāvataḥ","_","_","svabhāva","NC","","_","_"
1,"_","_","_","trividha","JJ","","_","_"
2,"_","_","_","iha","CAD","","_","_"
3,"vṛttāni","_","_","vṛtta","NC","","_","_"
4,"_","_","_","nara","NC","","_","_"
5,"_","_","_","ah","V","ah","_","_"
6,"manīṣiṇaḥ","_","_","manīṣin","JJ","","_","_"
1,"puṇyam","_","_","puṇya","JJ","","_","_"
2,"anyat","_","_","anya","PPX","","_","_"
3,"pāpam","_","_","pāpa","JJ","","_","_"
4,"_","_","_","anya","PPX","","_","_"
5,"_","_","_","na","CNG","","_","_"
6,"puṇyaṃ","_","_","puṇya","JJ","","_","_"
7,"na","_","_","na","CNG","","_","_"
8,"ca","_","_","ca","CCD","","_","_"
9,"pāpakam","_","_","pāpaka","JJ","","_","_"
1,"na","_","_","na","CNG","","_","_"
2,"vṛttaṃ","_","_","vṛtta","NC","","_","_"
3,"manyate","_","_","man","V","man","_","_"
4,"'nyasya","_","_","anya","PPX","","_","_"
5,"manyate","_","_","man","V","man","_","_"
6,"'nyasya","_","_","anya","PPX","","_","_"
7,"pāpakam","_","_","pāpaka","JJ","","_","_"
1,"tathā","_","_","tathā","CX","","_","_"
2,"_","_","_","sva","JJ","","_","_"
3,"_","_","_","karman","NC","","_","_"
4,"_","_","_","nirvṛt","PPP","","_","_"
5,"na","_","_","na","CNG","","_","_"
6,"puṇyaṃ","_","_","puṇya","JJ","","_","_"
7,"na","_","_","na","CNG","","_","_"
8,"ca","_","_","ca","CCD","","_","_"
9,"pāpakam","_","_","pāpaka","JJ","","_","_"
1,"_","_","_","ra","V","ra","_","_"
2,"_","_","_","edh","V","edh","_","_"
3,"modasva","_","_","mod","V","mud","_","_"
4,"dehi","_","_","dad","V","dā","_","_"
5,"_","_","_","ca","CCD","","_","_"
6,"_","_","_","eva","CEM","","_","_"
7,"yajasva","_","_","yaj","V","yaj","_","_"
8,"ca","_","_","ca","CCD","","_","_"
1,"na","_","_","na","CNG","","_","_"
2,"tvām","_","_","tvat","PPR","","_","_"
3,"abhibhaviṣyanti","_","_","abhibhav","V","abhibhū","_","_"
4,"vaidyā","_","_","vaidya","NC","","_","_"
5,"na","_","_","na","CNG","","_","_"
6,"ca","_","_","ca","CCD","","_","_"
7,"tapasvinaḥ","_","_","tapasvin","NC","","_","_"
