"WordID","word","NormSTEM","suffix","lemma","PoS","Root","NormSuffix","NormWord"
1,"agne","_","_","agni","NC","","_","_"
2,"yat","_","_","yad","PRL","","_","_"
3,"te","_","_","tvat","PPR","","_","_"
4,"tapas","_","_","tapas","NC","","_","_"
5,"tena","_","_","tad","PRD","","_","_"
6,"taṃ","_","_","tad","PRD","","_","_"
7,"prati","_","_","prati","CADP","","_","_"
8,"tapa","_","_","tap","V","tap","_","_"
9,"yo","_","_","yad","PRL","","_","_"
10,"'smān","_","_","mat","PPR","","_","_"
11,"dveṣṭi","_","_","dviṣ","V","dviṣ","_","_"
12,"yaṃ","_","_","yad","PRL","","_","_"
13,"vayaṃ","_","_","mat","PPR","","_","_"
14,"dviṣmaḥ","_","_","dviṣ","V","dviṣ","_","_"
1,"agne","_","_","agni","NC","","_","_"
2,"yat","_","_","yad","PRL","","_","_"
3,"te","_","_","tvat","PPR","","_","_"
4,"haras","_","_","haras","NC","","_","_"
5,"tena","_","_","tad","PRD","","_","_"
6,"taṃ","_","_","tad","PRD","","_","_"
7,"prati","_","_","prati","CADP","","_","_"
8,"hara","_","_","har","V","hṛ","_","_"
9,"yo","_","_","yad","PRL","","_","_"
10,"'smān","_","_","mat","PPR","","_","_"
11,"dveṣṭi","_","_","dviṣ","V","dviṣ","_","_"
12,"yaṃ","_","_","yad","PRL","","_","_"
13,"vayaṃ","_","_","mat","PPR","","_","_"
14,"dviṣmaḥ","_","_","dviṣ","V","dviṣ","_","_"
1,"agne","_","_","agni","NC","","_","_"
2,"yat","_","_","yad","PRL","","_","_"
3,"te","_","_","tvat","PPR","","_","_"
4,"'rcis","_","_","arcis","NC","","_","_"
5,"tena","_","_","tad","PRD","","_","_"
6,"taṃ","_","_","tad","PRD","","_","_"
7,"praty","_","_","prati","CADP","","_","_"
8,"arca","_","_","arc","V","arc","_","_"
9,"yo","_","_","yad","PRL","","_","_"
10,"'smān","_","_","mat","PPR","","_","_"
11,"dveṣṭi","_","_","dviṣ","V","dviṣ","_","_"
12,"yaṃ","_","_","yad","PRL","","_","_"
13,"vayaṃ","_","_","mat","PPR","","_","_"
14,"dviṣmaḥ","_","_","dviṣ","V","dviṣ","_","_"
1,"agne","_","_","agni","NC","","_","_"
2,"yat","_","_","yad","PRL","","_","_"
3,"te","_","_","tvat","PPR","","_","_"
4,"śocis","_","_","śocis","NC","","_","_"
5,"tena","_","_","tad","PRD","","_","_"
6,"taṃ","_","_","tad","PRD","","_","_"
7,"prati","_","_","prati","CADP","","_","_"
8,"śoca","_","_","śuc","V","śuc","_","_"
9,"yo","_","_","yad","PRL","","_","_"
10,"'smān","_","_","mat","PPR","","_","_"
11,"dveṣṭi","_","_","dviṣ","V","dviṣ","_","_"
12,"yaṃ","_","_","yad","PRL","","_","_"
13,"vayaṃ","_","_","mat","PPR","","_","_"
14,"dviṣmaḥ","_","_","dviṣ","V","dviṣ","_","_"
1,"agne","_","_","agni","NC","","_","_"
2,"yat","_","_","yad","PRL","","_","_"
3,"te","_","_","tvat","PPR","","_","_"
4,"tejas","_","_","tejas","NC","","_","_"
5,"tena","_","_","tad","PRD","","_","_"
6,"tam","_","_","tad","PRD","","_","_"
7,"atejasaṃ","_","_","atejas","JJ","","_","_"
8,"kṛṇu","_","_","kar","V","kṛ","_","_"
9,"yo","_","_","yad","PRL","","_","_"
10,"'smān","_","_","mat","PPR","","_","_"
11,"dveṣṭi","_","_","dviṣ","V","dviṣ","_","_"
12,"yaṃ","_","_","yad","PRL","","_","_"
13,"vayaṃ","_","_","mat","PPR","","_","_"
14,"dviṣmaḥ","_","_","dviṣ","V","dviṣ","_","_"
