"WordID","word","NormSTEM","suffix","lemma","PoS","Root","NormSuffix","NormWord"
1,"vihi","_","_","vye","V","vī","_","_"
2,"hotrā","_","_","hotra","NC","","_","_"
3,"_","_","_","a","CNG","","_","_"
4,"_","_","_","vī","PPP","","_","_"
5,"vipo","_","_","vip","NC","","_","_"
6,"na","_","_","na","CNG","","_","_"
7,"rāyo","_","_","rai","NC","","_","_"
8,"aryaḥ","_","_","ari","JJ","","_","_"
1,"vāyav","_","_","vāyu","NC","","_","_"
2,"ā","_","_","ā","CADP","","_","_"
3,"candreṇa","_","_","candra","JJ","","_","_"
4,"rathena","_","_","ratha","NC","","_","_"
5,"yāhi","_","_","yā","V","yā","_","_"
6,"sutasya","_","_","suta","NC","","_","_"
7,"pītaye","_","_","pīti","NC","","_","_"
1,"niryuvāṇo","_","_","niryu","KDP","","_","_"
2,"aśastīr","_","_","aśasti","NC","","_","_"
3,"niyutvāṁ","_","_","niyutvat","JJ","","_","_"
4,"_","_","_","indra","NC","","_","_"
5,"_","_","_","sārathi","NC","","_","_"
1,"vāyav","_","_","vāyu","NC","","_","_"
2,"ā","_","_","ā","CADP","","_","_"
3,"candreṇa","_","_","candra","JJ","","_","_"
4,"rathena","_","_","ratha","NC","","_","_"
5,"yāhi","_","_","yā","V","yā","_","_"
6,"sutasya","_","_","suta","NC","","_","_"
7,"pītaye","_","_","pīti","NC","","_","_"
1,"anu","_","_","anu","CADP","","_","_"
2,"kṛṣṇe","_","_","kṛṣṇa","JJ","","_","_"
3,"_","_","_","vasu","NC","","_","_"
4,"_","_","_","dhiti","NC","","_","_"
5,"yemāte","_","_","ya","V","ya","_","_"
6,"_","_","_","viśva","JQ","","_","_"
7,"_","_","_","peśas","NC","","_","_"
1,"vāyav","_","_","vāyu","NC","","_","_"
2,"ā","_","_","ā","CADP","","_","_"
3,"candreṇa","_","_","candra","JJ","","_","_"
4,"rathena","_","_","ratha","NC","","_","_"
5,"yāhi","_","_","yā","V","yā","_","_"
6,"sutasya","_","_","suta","NC","","_","_"
7,"pītaye","_","_","pīti","NC","","_","_"
1,"vahantu","_","_","vah","V","vah","_","_"
2,"tvā","_","_","tvat","PPR","","_","_"
3,"_","_","_","manas","NC","","_","_"
4,"_","_","_","yuj","JJ","","_","_"
5,"yuktāso","_","_","yuj","PPP","","_","_"
6,"navatir","_","_","navati","NC","","_","_"
7,"nava","_","_","navan","NUM","","_","_"
1,"vāyav","_","_","vāyu","NC","","_","_"
2,"ā","_","_","ā","CADP","","_","_"
3,"candreṇa","_","_","candra","JJ","","_","_"
4,"rathena","_","_","ratha","NC","","_","_"
5,"yāhi","_","_","yā","V","yā","_","_"
6,"sutasya","_","_","suta","NC","","_","_"
7,"pītaye","_","_","pīti","NC","","_","_"
1,"vāyo","_","_","vāyu","NC","","_","_"
2,"śataṃ","_","_","śata","NUM","","_","_"
3,"harīṇāṃ","_","_","hari","NC","","_","_"
4,"yuvasva","_","_","yu","V","yu","_","_"
5,"poṣyāṇām","_","_","puṣ","KDG","","_","_"
1,"uta","_","_","uta","CCD","","_","_"
2,"vā","_","_","vā","CCD","","_","_"
3,"te","_","_","tvat","PPR","","_","_"
4,"sahasriṇo","_","_","sahasrin","JJ","","_","_"
5,"ratha","_","_","ratha","NC","","_","_"
6,"ā","_","_","ā","CADP","","_","_"
7,"yātu","_","_","yā","V","yā","_","_"
8,"pājasā","_","_","pājas","NC","","_","_"
