"WordID","word","NormSTEM","suffix","lemma","PoS","Root","NormSuffix","NormWord"
1,"_","_","_","damayantī","NC","","_","_"
2,"_","_","_","vak","V","vac","_","_"
1,"māṃ","_","_","mat","PPR","","_","_"
2,"ced","_","_","ced","CX","","_","_"
3,"icchasi","_","_","iṣ","V","iṣ","_","_"
4,"jīvantīṃ","_","_","jīv","KDP","","_","_"
5,"mātaḥ","_","_","mātṛ","NC","","_","_"
6,"satyaṃ","_","_","satya","NC","","_","_"
7,"bravīmi","_","_","abravīta","V","brū","_","_"
8,"te","_","_","tvat","PPR","","_","_"
1,"_","_","_","nara","NC","","_","_"
2,"_","_","_","vīra","NC","","_","_"
3,"vai","_","_","vai","CX","","_","_"
4,"tasya","_","_","tad","PRD","","_","_"
5,"_","_","_","nala","NC","","_","_"
6,"_","_","_","ānayana","NC","","_","_"
7,"yata","_","_","yat","V","yat","_","_"
1,"bṛhadaśva","_","_","bṛhadaśva","NC","","_","_"
2,"uvāca","_","_","vak","V","vac","_","_"
1,"damayantyā","_","_","damayantī","NC","","_","_"
2,"_","_","_","tathā","CX","","_","_"
3,"_","_","_","vac","PPP","","_","_"
4,"tu","_","_","tu","CCD","","_","_"
5,"sā","_","_","tad","PRD","","_","_"
6,"devī","_","_","devī","NC","","_","_"
7,"_","_","_","bhṛśa","JJ","","_","_"
8,"_","_","_","duḥkhita","JJ","","_","_"
1,"bāṣpeṇa","_","_","bāṣpa","NC","","_","_"
2,"pihitā","_","_","pidhā","PPP","","_","_"
3,"rājan","_","_","rājan","NC","","_","_"
4,"_","_","_","na","CNG","","_","_"
5,"_","_","_","uttara","NC","","_","_"
6,"kiṃcid","_","_","kiṃcit","PRI","","_","_"
7,"abravīt","_","_","abravīta","V","brū","_","_"
1,"_","_","_","tad","PRD","","_","_"
2,"_","_","_","avasthā","NC","","_","_"
3,"tu","_","_","tu","CCD","","_","_"
4,"tāṃ","_","_","tad","PRD","","_","_"
5,"dṛṣṭvā","_","_","dṛś","CGDA","","_","_"
6,"sarvam","_","_","sarva","JQ","","_","_"
7,"antaḥpuraṃ","_","_","antaḥpura","NC","","_","_"
8,"tadā","_","_","tadā","CAD","","_","_"
1,"_","_","_","hāhā","NC","","_","_"
2,"_","_","_","bhū","PPP","","_","_"
3,"_","_","_","atīva","CX","","_","_"
4,"_","_","_","as","V","as","_","_"
5,"bhṛśaṃ","_","_","bhṛśa","CX","","_","_"
6,"ca","_","_","ca","CCD","","_","_"
7,"praruroda","_","_","prarod","V","prarud","_","_"
8,"ha","_","_","ha","CEM","","_","_"
1,"tato","_","_","tatas","CX","","_","_"
2,"bhīmaṃ","_","_","bhīma","NC","","_","_"
3,"_","_","_","mahat","JJ","","_","_"
4,"_","_","_","rāja","NC","","_","_"
5,"bhāryā","_","_","bhāryā","NC","","_","_"
6,"vacanam","_","_","vacana","NC","","_","_"
7,"abravīt","_","_","abravīta","V","brū","_","_"
1,"damayantī","_","_","damayantī","NC","","_","_"
2,"tava","_","_","tvat","PPR","","_","_"
3,"sutā","_","_","sutā","NC","","_","_"
4,"bhartāram","_","_","bhartṛ","NC","","_","_"
5,"anuśocati","_","_","anuśuc","V","anuśuc","_","_"
1,"apakṛṣya","_","_","apakṛṣ","CGDA","","_","_"
2,"ca","_","_","ca","CCD","","_","_"
3,"lajjāṃ","_","_","lajjā","NC","","_","_"
4,"māṃ","_","_","mat","PPR","","_","_"
5,"svayam","_","_","svaya","CX","","_","_"
6,"uktavatī","_","_","vac","KDP","","_","_"
7,"nṛpa","_","_","nṛpa","NC","","_","_"
1,"prayatantu","_","_","prayat","V","prayat","_","_"
2,"tava","_","_","tvat","PPR","","_","_"
3,"preṣyāḥ","_","_","preṣya","NC","","_","_"
4,"puṇyaślokasya","_","_","puṇyaśloka","NC","","_","_"
5,"darśane","_","_","darśana","NC","","_","_"
1,"tayā","_","_","tad","PRD","","_","_"
2,"pracodito","_","_","pracoday","PPP","","_","_"
3,"rājā","_","_","rājan","NC","","_","_"
4,"brāhmaṇān","_","_","brāhmaṇa","NC","","_","_"
5,"_","_","_","vaśa","NC","","_","_"
6,"_","_","_","vartin","JJ","","_","_"
1,"prāsthāpayad","_","_","prasthāpay","V","prasthāpay","_","_"
2,"diśaḥ","_","_","diś","NC","","_","_"
3,"sarvā","_","_","sarva","JQ","","_","_"
4,"yatadhvaṃ","_","_","yat","V","yat","_","_"
5,"_","_","_","nala","NC","","_","_"
6,"_","_","_","darśana","NC","","_","_"
1,"tato","_","_","tatas","CX","","_","_"
2,"_","_","_","vidarbha","NC","","_","_"
3,"_","_","_","adhipati","NC","","_","_"
4,"niyogād","_","_","niyoga","NC","","_","_"
5,"_","_","_","brāhmaṇa","NC","","_","_"
6,"_","_","_","ṛṣabha","NC","","_","_"
1,"damayantīm","_","_","damayantī","NC","","_","_"
2,"atho","_","_","atho","CX","","_","_"
3,"dṛṣṭvā","_","_","dṛś","CGDA","","_","_"
4,"prasthitāḥ","_","_","prasthā","PPP","","_","_"
5,"_","_","_","sma","CX","","_","_"
6,"_","_","_","iti","CQT","","_","_"
7,"_","_","_","atha","CAD","","_","_"
8,"_","_","_","abravīta","V","brū","_","_"
1,"atha","_","_","atha","CAD","","_","_"
2,"tān","_","_","tad","PRD","","_","_"
3,"abravīd","_","_","abravīta","V","brū","_","_"
4,"bhaimī","_","_","bhaimī","NC","","_","_"
5,"_","_","_","sarva","JQ","","_","_"
6,"_","_","_","rāṣṭra","NC","","_","_"
7,"_","_","_","ida","PRD","","_","_"
8,"vacaḥ","_","_","vacas","NC","","_","_"
1,"bruvadhvaṃ","_","_","abravīta","V","brū","_","_"
2,"janasaṃsatsu","_","_","tatra","CAD","","_","_"
3,"tatra","_","_","tatra","CAD","","_","_"
4,"tatra","_","_","punar","CAD","","_","_"
5,"punaḥ","_","_","punar","CAD","","_","_"
1,"kva","_","_","kva","CX","","_","_"
2,"nu","_","_","nu","CX","","_","_"
3,"tvaṃ","_","_","tvat","PPR","","_","_"
4,"kitava","_","_","kitava","NC","","_","_"
5,"chittvā","_","_","chid","CGDA","","_","_"
6,"_","_","_","vastra","NC","","_","_"
7,"_","_","_","ardha","NC","","_","_"
8,"prasthito","_","_","prasthā","PPP","","_","_"
9,"mama","_","_","mat","PPR","","_","_"
1,"utsṛjya","_","_","utsṛj","CGDA","","_","_"
2,"vipine","_","_","vipina","NC","","_","_"
3,"suptām","_","_","svap","PPP","","_","_"
4,"anuraktāṃ","_","_","anurañj","PPP","","_","_"
5,"priyāṃ","_","_","priya","JJ","","_","_"
6,"priya","_","_","priya","JJ","","_","_"
1,"sā","_","_","tad","PRD","","_","_"
2,"vai","_","_","vai","CX","","_","_"
3,"yathā","_","_","yathā","CCM","","_","_"
4,"samādiṣṭā","_","_","samādis","PPP","","_","_"
5,"_","_","_","tatra","CAD","","_","_"
6,"_","_","_","ās","V","ās","_","_"
7,"_","_","_","tvat","PPR","","_","_"
8,"_","_","_","pratīkṣin","JJ","","_","_"
1,"dahyamānā","_","_","dah","KDP","","_","_"
2,"bhṛśaṃ","_","_","bhṛśa","CX","","_","_"
3,"bālā","_","_","bāla","JJ","","_","_"
4,"_","_","_","vastra","NC","","_","_"
5,"_","_","_","ardha","NC","","_","_"
6,"_","_","_","abhisaṃvṛ","PPP","","_","_"
1,"tasyā","_","_","tad","PRD","","_","_"
2,"rudantyāḥ","_","_","rud","KDP","","_","_"
3,"satataṃ","_","_","satata","CX","","_","_"
4,"tena","_","_","tad","PRD","","_","_"
5,"śokena","_","_","śoka","NC","","_","_"
6,"pārthiva","_","_","pārthiva","NC","","_","_"
1,"prasādaṃ","_","_","prasāda","NC","","_","_"
2,"kuru","_","_","kar","V","kṛ","_","_"
3,"vai","_","_","vai","CX","","_","_"
4,"vīra","_","_","vīra","NC","","_","_"
5,"prativākyaṃ","_","_","prativākya","NC","","_","_"
6,"dadasva","_","_","dad","V","dā","_","_"
7,"ca","_","_","ca","CCD","","_","_"
1,"etad","_","_","tad","PRD","","_","_"
2,"_","_","_","anya","PPX","","_","_"
3,"_","_","_","ca","CCD","","_","_"
4,"vaktavyaṃ","_","_","vac","KDG","","_","_"
5,"kṛpāṃ","_","_","kṛpā","NC","","_","_"
6,"kuryād","_","_","kar","V","kṛ","_","_"
7,"yathā","_","_","yathā","CCM","","_","_"
8,"mayi","_","_","mat","PPR","","_","_"
1,"vāyunā","_","_","vāyu","NC","","_","_"
2,"dhūyamāno","_","_","dhū","KDP","","_","_"
3,"hi","_","_","hi","CX","","_","_"
4,"vanaṃ","_","_","vana","NC","","_","_"
5,"dahati","_","_","dah","V","dah","_","_"
6,"pāvakaḥ","_","_","pāvaka","NC","","_","_"
1,"bhartavyā","_","_","bhṛ","KDG","","_","_"
2,"rakṣaṇīyā","_","_","rakṣ","KDG","","_","_"
3,"ca","_","_","ca","CCD","","_","_"
4,"patnī","_","_","patnī","NC","","_","_"
5,"hi","_","_","hi","CX","","_","_"
6,"patinā","_","_","pati","NC","","_","_"
7,"sadā","_","_","sadā","CAD","","_","_"
1,"tan","_","_","tad","PRD","","_","_"
2,"naṣṭam","_","_","naś","PPP","","_","_"
3,"ubhayaṃ","_","_","ubhaya","JJ","","_","_"
4,"kasmād","_","_","kiṃ","PRQ","","_","_"
5,"_","_","_","dharma","NC","","_","_"
6,"_","_","_","jña","JJ","","_","_"
7,"satas","_","_","as","KDP","","_","_"
8,"tava","_","_","tvat","PPR","","_","_"
1,"khyātaḥ","_","_","khyā","PPP","","_","_"
2,"prājñaḥ","_","_","prājña","JJ","","_","_"
3,"kulīnaś","_","_","kulīna","JJ","","_","_"
4,"ca","_","_","ca","CCD","","_","_"
5,"_","_","_","sa_saha","CX","","_","_"
6,"_","_","_","anukrośa","NC","","_","_"
7,"ca","_","_","ca","CCD","","_","_"
8,"tvaṃ","_","_","tvat","PPR","","_","_"
9,"sadā","_","_","sadā","CAD","","_","_"
1,"saṃvṛtto","_","_","saṃvṛt","PPP","","_","_"
2,"niranukrośaḥ","_","_","niranukrośa","JJ","","_","_"
3,"śaṅke","_","_","śaṅk","V","śaṅk","_","_"
4,"_","_","_","mat","PPR","","_","_"
5,"_","_","_","bhāgya","NC","","_","_"
6,"_","_","_","saṃkṣaya","NC","","_","_"
1,"sa","_","_","tad","PRD","","_","_"
2,"kuruṣva","_","_","kar","V","kṛ","_","_"
3,"_","_","_","mahat","JJ","","_","_"
4,"_","_","_","iṣvāsa","NC","","_","_"
5,"dayāṃ","_","_","dayā","NC","","_","_"
6,"mayi","_","_","mat","PPR","","_","_"
7,"_","_","_","nara","NC","","_","_"
8,"_","_","_","ṛṣabha","NC","","_","_"
1,"ānṛśaṃsyaṃ","_","_","ānṛśaṃsya","NC","","_","_"
2,"paro","_","_","para","PPX","","_","_"
3,"dharmas","_","_","dharma","NC","","_","_"
4,"tvatta","_","_","tvat","PPR","","_","_"
5,"eva","_","_","eva","CEM","","_","_"
6,"hi","_","_","hi","CX","","_","_"
7,"me","_","_","mat","PPR","","_","_"
8,"śrutam","_","_","śru","PPP","","_","_"
1,"evaṃ","_","_","eva","CX","","_","_"
2,"bruvāṇān","_","_","brū","KDP","","_","_"
3,"yadi","_","_","yadi","CSB","","_","_"
4,"vaḥ","_","_","tvat","PPR","","_","_"
5,"_","_","_","pratibrū","V","pratibrū","_","_"
6,"_","_","_","hi","CX","","_","_"
7,"kaścana","_","_","kaścana","PRI","","_","_"
1,"sa","_","_","tad","PRD","","_","_"
2,"naraḥ","_","_","nara","NC","","_","_"
3,"sarvathā","_","_","sarvathā","CX","","_","_"
4,"jñeyaḥ","_","_","jñā","KDG","","_","_"
5,"_","_","_","kiṃ","PRQ","","_","_"
6,"_","_","_","ca","CCD","","_","_"
7,"_","_","_","adas","PRD","","_","_"
8,"kva","_","_","kva","CX","","_","_"
9,"ca","_","_","ca","CCD","","_","_"
10,"vartate","_","_","vart","V","vṛt","_","_"
1,"_","_","_","yad","PRL","","_","_"
2,"_","_","_","ca","CCD","","_","_"
3,"vo","_","_","tvat","PPR","","_","_"
4,"vacanaṃ","_","_","vacana","NC","","_","_"
5,"śrutvā","_","_","śru","CGDA","","_","_"
6,"brūyāt","_","_","abravīta","V","brū","_","_"
7,"prativaco","_","_","prativacas","NC","","_","_"
8,"naraḥ","_","_","nara","NC","","_","_"
1,"tad","_","_","tad","PRD","","_","_"
2,"ādāya","_","_","ādā","CGDA","","_","_"
3,"vacaḥ","_","_","vacas","NC","","_","_"
4,"kṣipraṃ","_","_","kṣipra","CX","","_","_"
5,"_","_","_","mat","PPR","","_","_"
6,"_","_","_","āveday","KDG","","_","_"
7,"_","_","_","dvija","NC","","_","_"
8,"_","_","_","uttama","JJ","","_","_"
1,"yathā","_","_","yathā","CCM","","_","_"
2,"ca","_","_","ca","CCD","","_","_"
3,"vo","_","_","tvat","PPR","","_","_"
4,"na","_","_","na","CNG","","_","_"
5,"_","_","_","jān","V","jñā","_","_"
6,"_","_","_","car","KDP","","_","_"
7,"_","_","_","bhīma","NC","","_","_"
8,"_","_","_","śāsana","NC","","_","_"
1,"punarāgamanaṃ","_","_","punarāgamana","NC","","_","_"
2,"_","_","_","ca","CCD","","_","_"
3,"_","_","_","eva","CEM","","_","_"
4,"tathā","_","_","tathā","CX","","_","_"
5,"kāryam","_","_","kṛ","KDG","","_","_"
6,"atandritaiḥ","_","_","atandrita","JJ","","_","_"
1,"yadi","_","_","yadi","CSB","","_","_"
2,"_","_","_","vā","CCD","","_","_"
3,"_","_","_","adas","PRD","","_","_"
4,"samṛddhaḥ","_","_","samṛdh","PPP","","_","_"
5,"syād","_","_","as","V","as","_","_"
6,"yadi","_","_","yadi","CSB","","_","_"
7,"_","_","_","vā","CCD","","_","_"
8,"_","_","_","api","CX","","_","_"
9,"_","_","_","adhana","JJ","","_","_"
10,"bhavet","_","_","bhav","V","bhū","_","_"
1,"yadi","_","_","yadi","CSB","","_","_"
2,"_","_","_","vā","CCD","","_","_"
3,"_","_","_","api","CX","","_","_"
4,"_","_","_","artha","NC","","_","_"
5,"_","_","_","kāma","NC","","_","_"
6,"_","_","_","as","V","as","_","_"
7,"_","_","_","jñā","KDG","","_","_"
8,"asya","_","_","ida","PRD","","_","_"
9,"cikīrṣitam","_","_","cikīrṣita","NC","","_","_"
1,"evam","_","_","eva","CX","","_","_"
2,"uktās","_","_","vac","PPP","","_","_"
3,"_","_","_","tu","CCD","","_","_"
4,"_","_","_","ga","V","ga","_","_"
5,"te","_","_","tad","PRD","","_","_"
6,"brāhmaṇāḥ","_","_","brāhmaṇa","NC","","_","_"
7,"sarvatodiśam","_","_","sarvatodiśa","CX","","_","_"
1,"nalaṃ","_","_","nala","NC","","_","_"
2,"mṛgayituṃ","_","_","mṛgay","CGDI","","_","_"
3,"rājaṃs","_","_","rājan","NC","","_","_"
4,"tathā","_","_","tathā","CX","","_","_"
5,"vyasaninaṃ","_","_","vyasanin","JJ","","_","_"
6,"tadā","_","_","tadā","CAD","","_","_"
1,"te","_","_","tad","PRD","","_","_"
2,"purāṇi","_","_","pura","NC","","_","_"
3,"sarāṣṭrāṇi","_","_","sarāṣṭra","JJ","","_","_"
4,"grāmān","_","_","grāma","NC","","_","_"
5,"ghoṣāṃs","_","_","ghoṣa","NC","","_","_"
6,"_","_","_","tathā","CX","","_","_"
7,"_","_","_","āśrama","NC","","_","_"
1,"anveṣanto","_","_","anviṣ","KDP","","_","_"
2,"nalaṃ","_","_","nala","NC","","_","_"
3,"rājan","_","_","rājan","NC","","_","_"
4,"_","_","_","na","CNG","","_","_"
5,"_","_","_","adhiga","V","adhiga","_","_"
6,"dvijātayaḥ","_","_","dvijāti","NC","","_","_"
1,"_","_","_","tad","PRD","","_","_"
2,"_","_","_","ca","CCD","","_","_"
3,"vākyaṃ","_","_","vākya","NC","","_","_"
4,"tathā","_","_","tathā","CX","","_","_"
5,"sarve","_","_","sarva","JQ","","_","_"
6,"tatra","_","_","tatra","CAD","","_","_"
7,"tatra","_","_","tatra","CAD","","_","_"
8,"viśāṃ","_","_","viś","NC","","_","_"
9,"pate","_","_","pati","NC","","_","_"
1,"śrāvayāṃcakrire","_","_","śrāvay","V","śrāvay","_","_"
2,"viprā","_","_","vipra","NC","","_","_"
3,"damayantyā","_","_","damayantī","NC","","_","_"
4,"_","_","_","yathā","CCM","","_","_"
5,"_","_","_","īray","PPP","","_","_"
