"WordID","word","NormSTEM","suffix","lemma","PoS","Root","NormSuffix","NormWord"
1,"_","_","_","yat","CSB","","_","_"
2,"_","_","_","cit","CEM","","_","_"
3,"_","_","_","hi","CX","","_","_"
4,"satya","_","_","satya","JJ","","_","_"
5,"_","_","_","soma","NC","","_","_"
6,"_","_","_","pā","JJ","","_","_"
7,"_","_","_","an","CX","","_","_"
8,"_","_","_","āśaṃs","PPP","","_","_"
9,"iva","_","_","iva","CCM","","_","_"
10,"smasi","_","_","as","V","as","_","_"
1,"ā","_","_","ā","CADP","","_","_"
2,"tū","_","_","tu","CCD","","_","_"
3,"na","_","_","mat","PPR","","_","_"
4,"indra","_","_","indra","NC","","_","_"
5,"śaṃsaya","_","_","śaṃsay","V","śaṃsay","_","_"
6,"goṣv","_","_","go","NC","","_","_"
7,"aśveṣu","_","_","aśva","NC","","_","_"
8,"śubhriṣu","_","_","śubhri","JJ","","_","_"
9,"sahasreṣu","_","_","sahasra","NUM","","_","_"
10,"tuvīmagha","_","_","tuvīmagha","JJ","","_","_"
1,"śiprin","_","_","śiprin","JJ","","_","_"
2,"vājānām","_","_","vāja","NC","","_","_"
3,"pate","_","_","pati","NC","","_","_"
4,"śacīvas","_","_","śacīvat","JJ","","_","_"
5,"tava","_","_","tvat","PPR","","_","_"
6,"daṃsanā","_","_","daṃsanā","NC","","_","_"
1,"ā","_","_","ā","CADP","","_","_"
2,"tū","_","_","tu","CCD","","_","_"
3,"na","_","_","mat","PPR","","_","_"
4,"indra","_","_","indra","NC","","_","_"
5,"śaṃsaya","_","_","śaṃsay","V","śaṃsay","_","_"
6,"goṣv","_","_","go","NC","","_","_"
7,"aśveṣu","_","_","aśva","NC","","_","_"
8,"śubhriṣu","_","_","śubhri","JJ","","_","_"
9,"sahasreṣu","_","_","sahasra","NUM","","_","_"
10,"tuvīmagha","_","_","tuvīmagha","JJ","","_","_"
1,"ni","_","_","ni","CADP","","_","_"
2,"ṣvāpayā","_","_","svāpay","V","svāpay","_","_"
3,"mithūdṛśā","_","_","mithūdṛś","JJ","","_","_"
4,"sastām","_","_","sas","V","sas","_","_"
5,"_","_","_","a","CNG","","_","_"
6,"_","_","_","budh","KDP","","_","_"
1,"ā","_","_","ā","CADP","","_","_"
2,"tū","_","_","tu","CCD","","_","_"
3,"na","_","_","mat","PPR","","_","_"
4,"indra","_","_","indra","NC","","_","_"
5,"śaṃsaya","_","_","śaṃsay","V","śaṃsay","_","_"
6,"goṣv","_","_","go","NC","","_","_"
7,"aśveṣu","_","_","aśva","NC","","_","_"
8,"śubhriṣu","_","_","śubhri","JJ","","_","_"
9,"sahasreṣu","_","_","sahasra","NUM","","_","_"
10,"tuvīmagha","_","_","tuvīmagha","JJ","","_","_"
1,"sasantu","_","_","sas","V","sas","_","_"
2,"tyā","_","_","tya","PRD","","_","_"
3,"arātayo","_","_","arāti","NC","","_","_"
4,"bodhantu","_","_","bodh","V","budh","_","_"
5,"śūra","_","_","śūra","NC","","_","_"
6,"rātayaḥ","_","_","rāti","NC","","_","_"
1,"ā","_","_","ā","CADP","","_","_"
2,"tū","_","_","tu","CCD","","_","_"
3,"na","_","_","mat","PPR","","_","_"
4,"indra","_","_","indra","NC","","_","_"
5,"śaṃsaya","_","_","śaṃsay","V","śaṃsay","_","_"
6,"goṣv","_","_","go","NC","","_","_"
7,"aśveṣu","_","_","aśva","NC","","_","_"
8,"śubhriṣu","_","_","śubhri","JJ","","_","_"
9,"sahasreṣu","_","_","sahasra","NUM","","_","_"
10,"tuvīmagha","_","_","tuvīmagha","JJ","","_","_"
1,"sam","_","_","sa","CADP","","_","_"
2,"indra","_","_","indra","NC","","_","_"
3,"gardabham","_","_","gardabha","NC","","_","_"
4,"mṛṇa","_","_","mṛṇ","V","mṛṇ","_","_"
5,"nuvantam","_","_","nū","KDP","","_","_"
6,"_","_","_","pāpa","JJ","","_","_"
7,"_","_","_","adas","PRD","","_","_"
1,"ā","_","_","ā","CADP","","_","_"
2,"tū","_","_","tu","CCD","","_","_"
3,"na","_","_","mat","PPR","","_","_"
4,"indra","_","_","indra","NC","","_","_"
5,"śaṃsaya","_","_","śaṃsay","V","śaṃsay","_","_"
6,"goṣv","_","_","go","NC","","_","_"
7,"aśveṣu","_","_","aśva","NC","","_","_"
8,"śubhriṣu","_","_","śubhri","JJ","","_","_"
9,"sahasreṣu","_","_","sahasra","NUM","","_","_"
10,"tuvīmagha","_","_","tuvīmagha","JJ","","_","_"
1,"patāti","_","_","pat","V","pat","_","_"
2,"kuṇḍṛṇācyā","_","_","kuṇḍṛṇācī","NC","","_","_"
3,"dūraṃ","_","_","dūra","CX","","_","_"
4,"vāto","_","_","vāta","NC","","_","_"
5,"vanād","_","_","vana","NC","","_","_"
6,"adhi","_","_","adhi","CADP","","_","_"
1,"ā","_","_","ā","CADP","","_","_"
2,"tū","_","_","tu","CCD","","_","_"
3,"na","_","_","mat","PPR","","_","_"
4,"indra","_","_","indra","NC","","_","_"
5,"śaṃsaya","_","_","śaṃsay","V","śaṃsay","_","_"
6,"goṣv","_","_","go","NC","","_","_"
7,"aśveṣu","_","_","aśva","NC","","_","_"
8,"śubhriṣu","_","_","śubhri","JJ","","_","_"
9,"sahasreṣu","_","_","sahasra","NUM","","_","_"
10,"tuvīmagha","_","_","tuvīmagha","JJ","","_","_"
1,"sarvam","_","_","sarva","JQ","","_","_"
2,"parikrośaṃ","_","_","parikrośa","NC","","_","_"
3,"jahi","_","_","han","V","han","_","_"
4,"jambhayā","_","_","jambhay","V","jambhay","_","_"
5,"kṛkadāśvam","_","_","kṛkadāśū","NC","","_","_"
1,"ā","_","_","ā","CADP","","_","_"
2,"tū","_","_","tu","CCD","","_","_"
3,"na","_","_","mat","PPR","","_","_"
4,"indra","_","_","indra","NC","","_","_"
5,"śaṃsaya","_","_","śaṃsay","V","śaṃsay","_","_"
6,"goṣv","_","_","go","NC","","_","_"
7,"aśveṣu","_","_","aśva","NC","","_","_"
8,"śubhriṣu","_","_","śubhri","JJ","","_","_"
9,"sahasreṣu","_","_","sahasra","NUM","","_","_"
10,"tuvīmagha","_","_","tuvīmagha","JJ","","_","_"
