"WordID","word","NormSTEM","suffix","lemma","PoS","Root","NormSuffix","NormWord"
1,"indra","_","_","indra","NC","","_","_"
2,"uvāca","_","_","vak","V","vac","_","_"
1,"jānan","_","_","jñā","KDP","","_","_"
2,"yo","_","_","yad","PRL","","_","_"
3,"gām","_","_","go","NC","","_","_"
4,"apahared","_","_","apahar","V","apahṛ","_","_"
5,"vikrīyād","_","_","vikrī","V","vikrī","_","_"
6,"_","_","_","vā","CCD","","_","_"
7,"_","_","_","artha","NC","","_","_"
8,"_","_","_","kāraṇa","NC","","_","_"
1,"etad","_","_","tad","PRD","","_","_"
2,"vijñātum","_","_","vijñā","CGDI","","_","_"
3,"icchāmi","_","_","iṣ","V","iṣ","_","_"
4,"kā","_","_","kiṃ","PRQ","","_","_"
5,"nu","_","_","nu","CX","","_","_"
6,"tasya","_","_","tad","PRD","","_","_"
7,"gatir","_","_","gati","NC","","_","_"
8,"bhavet","_","_","bhav","V","bhū","_","_"
1,"_","_","_","brahman","NC","","_","_"
2,"_","_","_","vak","V","vac","_","_"
1,"_","_","_","bhakṣa","NC","","_","_"
2,"_","_","_","artha","NC","","_","_"
3,"_","_","_","vikraya","NC","","_","_"
4,"_","_","_","artha","NC","","_","_"
5,"vā","_","_","vā","CCD","","_","_"
6,"ye","_","_","yad","PRL","","_","_"
7,"'pahāraṃ","_","_","apahāra","NC","","_","_"
8,"hi","_","_","hi","CX","","_","_"
9,"kurvate","_","_","kar","V","kṛ","_","_"
1,"_","_","_","dāna","NC","","_","_"
2,"_","_","_","artha","NC","","_","_"
3,"vā","_","_","vā","CCD","","_","_"
4,"brāhmaṇāya","_","_","brāhmaṇa","NC","","_","_"
5,"_","_","_","tatra","CAD","","_","_"
6,"_","_","_","ida","PRD","","_","_"
7,"śrūyatāṃ","_","_","śṛṇ","V","śru","_","_"
8,"phalam","_","_","phala","NC","","_","_"
1,"_","_","_","vikraya","NC","","_","_"
2,"_","_","_","artha","NC","","_","_"
3,"hi","_","_","hi","CX","","_","_"
4,"yo","_","_","yad","PRL","","_","_"
5,"hiṃsyād","_","_","hiṃs","V","hiṃs","_","_"
6,"bhakṣayed","_","_","bhakṣay","V","bhakṣay","_","_"
7,"vā","_","_","vā","CCD","","_","_"
8,"niraṅkuśaḥ","_","_","niraṅkuśa","JJ","","_","_"
1,"ghātayānaṃ","_","_","ghātay","KDP","","_","_"
2,"hi","_","_","hi","CX","","_","_"
3,"puruṣaṃ","_","_","puruṣa","NC","","_","_"
4,"ye","_","_","yad","PRL","","_","_"
5,"'numanyeyur","_","_","anuman","V","anuman","_","_"
6,"arthinaḥ","_","_","arthin","JJ","","_","_"
1,"ghātakaḥ","_","_","ghātaka","JJ","","_","_"
2,"khādako","_","_","khādaka","NC","","_","_"
3,"_","_","_","vā","CCD","","_","_"
4,"_","_","_","api","CX","","_","_"
5,"tathā","_","_","tathā","CX","","_","_"
6,"_","_","_","yad","PRL","","_","_"
7,"_","_","_","ca","CCD","","_","_"
8,"_","_","_","anuman","V","anuman","_","_"
1,"yāvanti","_","_","yāvat","JJ","","_","_"
2,"tasyā","_","_","tad","PRD","","_","_"
3,"lomāni","_","_","loman","NC","","_","_"
4,"tāvad","_","_","tāvat","CX","","_","_"
5,"varṣāṇi","_","_","varṣa","NC","","_","_"
6,"majjati","_","_","majj","V","majj","_","_"
1,"ye","_","_","yad","PRL","","_","_"
2,"doṣā","_","_","doṣa","NC","","_","_"
3,"_","_","_","yādṛśa","JJ","","_","_"
4,"_","_","_","ca","CCD","","_","_"
5,"_","_","_","eva","CEM","","_","_"
6,"_","_","_","dvija","NC","","_","_"
7,"_","_","_","yajña","NC","","_","_"
8,"_","_","_","upaghātaka","JJ","","_","_"
1,"vikraye","_","_","vikraya","NC","","_","_"
2,"_","_","_","ca","CCD","","_","_"
3,"_","_","_","apahāra","NC","","_","_"
4,"ca","_","_","ca","CCD","","_","_"
5,"te","_","_","tad","PRD","","_","_"
6,"doṣā","_","_","doṣa","NC","","_","_"
7,"vai","_","_","vai","CX","","_","_"
8,"smṛtāḥ","_","_","smṛ","PPP","","_","_"
9,"prabho","_","_","prabhu","NC","","_","_"
1,"apahṛtya","_","_","apahṛ","CGDA","","_","_"
2,"tu","_","_","tu","CCD","","_","_"
3,"yo","_","_","yad","PRL","","_","_"
4,"gāṃ","_","_","go","NC","","_","_"
5,"vai","_","_","vai","CX","","_","_"
6,"brāhmaṇāya","_","_","brāhmaṇa","NC","","_","_"
7,"prayacchati","_","_","praya","V","praya","_","_"
1,"yāvad","_","_","yāvat","CX","","_","_"
2,"dāne","_","_","dāna","NC","","_","_"
3,"phalaṃ","_","_","phala","NC","","_","_"
4,"_","_","_","tad","PRD","","_","_"
5,"_","_","_","tāvat","CX","","_","_"
6,"_","_","_","niraya","NC","","_","_"
7,"ṛcchati","_","_","ṛch","V","ṛch","_","_"
1,"suvarṇaṃ","_","_","suvarṇa","NC","","_","_"
2,"dakṣiṇām","_","_","dakṣiṇā","NC","","_","_"
3,"āhur","_","_","ah","V","ah","_","_"
4,"_","_","_","go","CX","","_","_"
5,"_","_","_","pradāna","NC","","_","_"
6,"_","_","_","mahat","JJ","","_","_"
7,"_","_","_","dyuti","NC","","_","_"
1,"suvarṇaṃ","_","_","suvarṇa","NC","","_","_"
2,"paramaṃ","_","_","parama","JJ","","_","_"
3,"_","_","_","hi","CX","","_","_"
4,"_","_","_","vac","PPP","","_","_"
5,"_","_","_","dakṣiṇā","NC","","_","_"
6,"_","_","_","artha","NC","","_","_"
7,"asaṃśayam","_","_","asaṃśaya","CX","","_","_"
1,"_","_","_","go","CX","","_","_"
2,"_","_","_","pradāna","NC","","_","_"
3,"tārayate","_","_","tar","V","tṛ","_","_"
4,"sapta","_","_","saptan","NUM","","_","_"
5,"_","_","_","pūrva","PPX","","_","_"
6,"_","_","_","tathā","CX","","_","_"
7,"parān","_","_","para","PPX","","_","_"
1,"suvarṇaṃ","_","_","suvarṇa","NC","","_","_"
2,"dakṣiṇāṃ","_","_","dakṣiṇā","NC","","_","_"
3,"dattvā","_","_","dā","CGDA","","_","_"
4,"tāvad","_","_","tāvat","CX","","_","_"
5,"dviguṇam","_","_","dviguṇa","JJ","","_","_"
6,"ucyate","_","_","vak","V","vac","_","_"
1,"suvarṇaṃ","_","_","suvarṇa","NC","","_","_"
2,"paramaṃ","_","_","parama","JJ","","_","_"
3,"dānaṃ","_","_","dāna","NC","","_","_"
4,"suvarṇaṃ","_","_","suvarṇa","NC","","_","_"
5,"dakṣiṇā","_","_","dakṣiṇā","NC","","_","_"
6,"parā","_","_","para","PPX","","_","_"
1,"suvarṇaṃ","_","_","suvarṇa","NC","","_","_"
2,"pāvanaṃ","_","_","pāvana","JJ","","_","_"
3,"śakra","_","_","śakra","NC","","_","_"
4,"pāvanānāṃ","_","_","pāvana","NC","","_","_"
5,"paraṃ","_","_","para","PPX","","_","_"
6,"smṛtam","_","_","smṛ","PPP","","_","_"
1,"kulānāṃ","_","_","kula","NC","","_","_"
2,"pāvanaṃ","_","_","pāvana","JJ","","_","_"
3,"prāhur","_","_","prāh","V","prāh","_","_"
4,"jātarūpaṃ","_","_","jātarūpa","NC","","_","_"
5,"śatakrato","_","_","śatakratu","NC","","_","_"
1,"eṣā","_","_","tad","PRD","","_","_"
2,"me","_","_","mat","PPR","","_","_"
3,"dakṣiṇā","_","_","dakṣiṇā","NC","","_","_"
4,"proktā","_","_","pravac","PPP","","_","_"
5,"samāsena","_","_","samāsa","CX","","_","_"
6,"_","_","_","mahat","JJ","","_","_"
7,"_","_","_","dyuti","NC","","_","_"
1,"bhīṣma","_","_","bhīṣma","NC","","_","_"
2,"uvāca","_","_","vak","V","vac","_","_"
1,"etat","_","_","tad","PRD","","_","_"
2,"_","_","_","pitāmaha","NC","","_","_"
3,"_","_","_","vac","PPP","","_","_"
4,"indrāya","_","_","indra","NC","","_","_"
5,"_","_","_","bharata","NC","","_","_"
6,"_","_","_","ṛṣabha","NC","","_","_"
1,"indro","_","_","indra","NC","","_","_"
2,"_","_","_","daśaratha","NC","","_","_"
3,"_","_","_","ah","V","ah","_","_"
4,"_","_","_","rāma","NC","","_","_"
5,"_","_","_","ah","V","ah","_","_"
6,"pitā","_","_","pitṛ","NC","","_","_"
7,"tathā","_","_","tathā","CX","","_","_"
1,"rāghavo","_","_","rāghava","NC","","_","_"
2,"'pi","_","_","api","CX","","_","_"
3,"_","_","_","priya","JJ","","_","_"
4,"_","_","_","bhrātṛ","NC","","_","_"
5,"lakṣmaṇāya","_","_","lakṣmaṇa","NC","","_","_"
6,"yaśasvine","_","_","yaśasvin","JJ","","_","_"
1,"ṛṣibhyo","_","_","ṛṣi","NC","","_","_"
2,"_","_","_","lakṣmaṇa","NC","","_","_"
3,"_","_","_","vac","PPP","","_","_"
4,"araṇye","_","_","araṇya","NC","","_","_"
5,"vasatā","_","_","vas","KDP","","_","_"
6,"vibho","_","_","vibhu","JJ","","_","_"
1,"_","_","_","pāramparya","NC","","_","_"
2,"_","_","_","āga","PPP","","_","_"
3,"_","_","_","ca","CCD","","_","_"
4,"_","_","_","ida","PRD","","_","_"
5,"ṛṣayaḥ","_","_","ṛṣi","NC","","_","_"
6,"_","_","_","saṃśita","JJ","","_","_"
7,"_","_","_","vrata","NC","","_","_"
1,"durdharaṃ","_","_","durdhara","JJ","","_","_"
2,"dhārayāmāsū","_","_","dhāray","V","dhāray","_","_"
3,"_","_","_","rājan","NC","","_","_"
4,"_","_","_","ca","CCD","","_","_"
5,"_","_","_","eva","CEM","","_","_"
6,"dhārmikāḥ","_","_","dhārmika","JJ","","_","_"
1,"upādhyāyena","_","_","upādhyāya","NC","","_","_"
2,"gaditaṃ","_","_","gad","PPP","","_","_"
3,"mama","_","_","mat","PPR","","_","_"
4,"_","_","_","ca","CCD","","_","_"
5,"_","_","_","ida","PRD","","_","_"
6,"yudhiṣṭhira","_","_","yudhiṣṭhira","NC","","_","_"
1,"ya","_","_","yad","PRL","","_","_"
2,"idaṃ","_","_","ida","PRD","","_","_"
3,"brāhmaṇo","_","_","brāhmaṇa","NC","","_","_"
4,"nityaṃ","_","_","nitya","CX","","_","_"
5,"vaded","_","_","vad","V","vad","_","_"
6,"_","_","_","brāhmaṇa","NC","","_","_"
7,"_","_","_","saṃsad","NC","","_","_"
1,"yajñeṣu","_","_","yajña","NC","","_","_"
2,"_","_","_","go","CX","","_","_"
3,"_","_","_","pradāna","NC","","_","_"
4,"dvayor","_","_","dvi","NUM","","_","_"
5,"api","_","_","api","CX","","_","_"
6,"samāgame","_","_","samāgama","NC","","_","_"
1,"tasya","_","_","tad","PRD","","_","_"
2,"lokāḥ","_","_","loka","NC","","_","_"
3,"_","_","_","kila","CX","","_","_"
4,"_","_","_","akṣayya","JJ","","_","_"
5,"daivataiḥ","_","_","daivata","NC","","_","_"
6,"saha","_","_","saha","CX","","_","_"
7,"nityadā","_","_","nityadā","CX","","_","_"
1,"iti","_","_","iti","CQT","","_","_"
2,"brahmā","_","_","brahman","NC","","_","_"
3,"sa","_","_","tad","PRD","","_","_"
4,"bhagavān","_","_","bhagavat","JJ","","_","_"
5,"uvāca","_","_","vak","V","vac","_","_"
6,"parameśvaraḥ","_","_","parameśvara","NC","","_","_"
