"WordID","word","NormSTEM","suffix","lemma","PoS","Root","NormSuffix","NormWord"
1,"somā","_","_","soma","NC","","_","_"
2,"asṛgram","_","_","sṛj","V","sṛj","_","_"
3,"indavaḥ","_","_","indu","NC","","_","_"
4,"sutā","_","_","su","PPP","","_","_"
5,"ṛtasya","_","_","ṛta","NC","","_","_"
6,"sādane","_","_","sādana","NC","","_","_"
1,"indrāya","_","_","indra","NC","","_","_"
2,"madhumattamāḥ","_","_","madhumattama","JJ","","_","_"
1,"abhi","_","_","abhi","CADP","","_","_"
2,"viprā","_","_","vipra","NC","","_","_"
3,"anūṣata","_","_","nū","V","nū","_","_"
4,"gāvo","_","_","go","NC","","_","_"
5,"vatsaṃ","_","_","vatsa","NC","","_","_"
6,"na","_","_","na","CNG","","_","_"
7,"mātaraḥ","_","_","mātṛ","NC","","_","_"
1,"indraṃ","_","_","indra","NC","","_","_"
2,"somasya","_","_","soma","NC","","_","_"
3,"pītaye","_","_","pā","CGDI","","_","_"
1,"madacyut","_","_","madacyut","JJ","","_","_"
2,"kṣeti","_","_","kṣi","V","kṣi","_","_"
3,"sādane","_","_","sādana","NC","","_","_"
4,"sindhor","_","_","sindhu","NC","","_","_"
5,"ūrmā","_","_","ūrmi","NC","","_","_"
6,"vipaścit","_","_","vipaścit","JJ","","_","_"
1,"somo","_","_","soma","NC","","_","_"
2,"gaurī","_","_","adhi","CADP","","_","_"
3,"adhi","_","_","śri","PPP","","_","_"
1,"divo","_","_","div","NC","","_","_"
2,"nābhā","_","_","nābhi","NC","","_","_"
3,"vicakṣaṇo","_","_","vicakṣaṇa","JJ","","_","_"
4,"'vyo","_","_","avya","JJ","","_","_"
5,"vāre","_","_","vāra","NC","","_","_"
6,"mahīyate","_","_","mahīy","V","mahīy","_","_"
1,"somo","_","_","soma","NC","","_","_"
2,"yaḥ","_","_","yad","PRL","","_","_"
3,"_","_","_","su","CAD","","_","_"
4,"_","_","_","kratu","NC","","_","_"
5,"kaviḥ","_","_","kavi","NC","","_","_"
1,"yaḥ","_","_","yad","PRL","","_","_"
2,"somaḥ","_","_","soma","NC","","_","_"
3,"kalaśeṣv","_","_","kalaśa","NC","","_","_"
4,"āṃ","_","_","āṃ","CX","","_","_"
5,"antaḥ","_","_","antar","CAD","","_","_"
6,"pavitra","_","_","pavitra","NC","","_","_"
7,"āhitaḥ","_","_","ādhā","PPP","","_","_"
1,"tam","_","_","tad","PRD","","_","_"
2,"induḥ","_","_","indu","NC","","_","_"
3,"pari","_","_","pari","CADP","","_","_"
4,"ṣasvaje","_","_","svaj","V","svaj","_","_"
1,"pra","_","_","pra","CADP","","_","_"
2,"vācam","_","_","vāc","NC","","_","_"
3,"indur","_","_","indu","NC","","_","_"
4,"iṣyati","_","_","iṣ","V","iṣ","_","_"
5,"_","_","_","samudra","NC","","_","_"
6,"_","_","_","adhi","CADP","","_","_"
7,"viṣṭapi","_","_","viṣṭap","NC","","_","_"
1,"jinvan","_","_","jinv","KDP","","_","_"
2,"kośam","_","_","kośa","NC","","_","_"
3,"madhuścutam","_","_","madhuścut","JJ","","_","_"
1,"_","_","_","nitya","JJ","","_","_"
2,"_","_","_","stotra","NC","","_","_"
3,"vanaspatir","_","_","vanaspati","NC","","_","_"
4,"dhīnām","_","_","dhī","NC","","_","_"
5,"antaḥ","_","_","antar","CAD","","_","_"
6,"sabardughaḥ","_","_","sabardugha","JJ","","_","_"
1,"hinvāno","_","_","hi","KDP","","_","_"
2,"mānuṣā","_","_","mānuṣa","JJ","","_","_"
3,"yugā","_","_","yuga","NC","","_","_"
1,"abhi","_","_","abhi","CADP","","_","_"
2,"priyā","_","_","priya","JJ","","_","_"
3,"divas","_","_","div","NC","","_","_"
4,"padā","_","_","pada","NC","","_","_"
5,"somo","_","_","soma","NC","","_","_"
6,"hinvāno","_","_","hi","KDP","","_","_"
7,"arṣati","_","_","ṛṣ","V","ṛṣ","_","_"
1,"viprasya","_","_","vipra","NC","","_","_"
2,"dhārayā","_","_","dhārā","NC","","_","_"
3,"kaviḥ","_","_","kavi","NC","","_","_"
1,"ā","_","_","ā","CADP","","_","_"
2,"pavamāna","_","_","pū","KDP","","_","_"
3,"dhāraya","_","_","dhāray","V","dhāray","_","_"
4,"rayiṃ","_","_","rayi","NC","","_","_"
5,"_","_","_","sahasra","NUM","","_","_"
6,"_","_","_","varcas","NC","","_","_"
1,"asme","_","_","mat","PPR","","_","_"
2,"indo","_","_","indu","NC","","_","_"
3,"_","_","_","su","CAD","","_","_"
4,"_","_","_","ābhū","NC","","_","_"
