"WordID","word","NormSTEM","suffix","lemma","PoS","Root","NormSuffix","NormWord"
1,"sudeva","_","_","sudeva","NC","","_","_"
2,"uvāca","_","_","vak","V","vac","_","_"
1,"_","_","_","vidarbha","NC","","_","_"
2,"_","_","_","rāja","NC","","_","_"
3,"_","_","_","dharma","NC","","_","_"
4,"_","_","_","ātman","NC","","_","_"
5,"bhīmo","_","_","bhīma","NC","","_","_"
6,"_","_","_","bhīma","JJ","","_","_"
7,"_","_","_","parākrama","NC","","_","_"
1,"_","_","_","sutā","NC","","_","_"
2,"_","_","_","ida","PRD","","_","_"
3,"tasya","_","_","tad","PRD","","_","_"
4,"kalyāṇī","_","_","kalyāṇa","JJ","","_","_"
5,"_","_","_","damayantī","NC","","_","_"
6,"_","_","_","iti","CQT","","_","_"
7,"viśrutā","_","_","viśru","PPP","","_","_"
1,"rājā","_","_","rājan","NC","","_","_"
2,"tu","_","_","tu","CCD","","_","_"
3,"naiṣadho","_","_","naiṣadha","NC","","_","_"
4,"nāma","_","_","nāma","CX","","_","_"
5,"_","_","_","vīrasa","NC","","_","_"
6,"_","_","_","suta","NC","","_","_"
7,"nalaḥ","_","_","nala","NC","","_","_"
1,"_","_","_","bhāryā","NC","","_","_"
2,"_","_","_","ida","PRD","","_","_"
3,"tasya","_","_","tad","PRD","","_","_"
4,"kalyāṇī","_","_","kalyāṇa","JJ","","_","_"
5,"puṇyaślokasya","_","_","puṇyaśloka","NC","","_","_"
6,"dhīmataḥ","_","_","dhīmat","JJ","","_","_"
1,"sa","_","_","tad","PRD","","_","_"
2,"vai","_","_","vai","CX","","_","_"
3,"dyūte","_","_","dyūta","NC","","_","_"
4,"jito","_","_","ji","PPP","","_","_"
5,"bhrātrā","_","_","bhrātṛ","NC","","_","_"
6,"_","_","_","hṛ","PPP","","_","_"
7,"_","_","_","rājya","NC","","_","_"
8,"mahīpatiḥ","_","_","mahīpati","NC","","_","_"
1,"damayantyā","_","_","damayantī","NC","","_","_"
2,"gataḥ","_","_","ga","PPP","","_","_"
3,"sārdhaṃ","_","_","sārdha","CX","","_","_"
4,"na","_","_","na","CNG","","_","_"
5,"prajñāyata","_","_","prajān","V","prajñā","_","_"
6,"karhicit","_","_","karhicit","CX","","_","_"
1,"te","_","_","tad","PRD","","_","_"
2,"vayaṃ","_","_","mat","PPR","","_","_"
3,"_","_","_","damayantī","NC","","_","_"
4,"_","_","_","artha","NC","","_","_"
5,"carāmaḥ","_","_","car","V","car","_","_"
6,"pṛthivīm","_","_","pṛthivī","NC","","_","_"
7,"imām","_","_","ida","PRD","","_","_"
1,"_","_","_","tad","PRD","","_","_"
2,"_","_","_","ida","PRD","","_","_"
3,"āsāditā","_","_","āsāday","PPP","","_","_"
4,"bālā","_","_","bāla","JJ","","_","_"
5,"tava","_","_","tvat","PPR","","_","_"
6,"_","_","_","putra","NC","","_","_"
7,"_","_","_","niveśana","NC","","_","_"
1,"asyā","_","_","ida","PRD","","_","_"
2,"rūpeṇa","_","_","rūpa","NC","","_","_"
3,"sadṛśī","_","_","sadṛśa","JJ","","_","_"
4,"mānuṣī","_","_","mānuṣī","NC","","_","_"
5,"_","_","_","na","CNG","","_","_"
6,"_","_","_","iha","CAD","","_","_"
7,"vidyate","_","_","vid","V","vid","_","_"
1,"asyāś","_","_","ida","PRD","","_","_"
2,"_","_","_","ca","CCD","","_","_"
3,"_","_","_","eva","CEM","","_","_"
4,"bhruvor","_","_","bhrū","NC","","_","_"
5,"madhye","_","_","madhya","NC","","_","_"
6,"sahajaḥ","_","_","sahaja","JJ","","_","_"
7,"piplur","_","_","piplu","NC","","_","_"
8,"uttamaḥ","_","_","uttama","JJ","","_","_"
1,"śyāmāyāḥ","_","_","śyāmā","NC","","_","_"
2,"_","_","_","padma","NC","","_","_"
3,"_","_","_","saṃkāśa","NC","","_","_"
4,"lakṣito","_","_","lakṣay","PPP","","_","_"
5,"'ntarhito","_","_","antardhā","PPP","","_","_"
6,"mayā","_","_","mat","PPR","","_","_"
1,"malena","_","_","mala","NC","","_","_"
2,"saṃvṛto","_","_","saṃvṛ","PPP","","_","_"
3,"_","_","_","hi","CX","","_","_"
4,"_","_","_","ida","PRD","","_","_"
5,"_","_","_","tanu","JJ","","_","_"
6,"_","_","_","abhra","NC","","_","_"
7,"_","_","_","iva","CCM","","_","_"
8,"candramāḥ","_","_","candramas","NC","","_","_"
1,"_","_","_","cihna","NC","","_","_"
2,"_","_","_","bhū","PPP","","_","_"
3,"_","_","_","vibhūti","NC","","_","_"
4,"_","_","_","artha","NC","","_","_"
5,"ayaṃ","_","_","ida","PRD","","_","_"
6,"dhātrā","_","_","dhātṛ","NC","","_","_"
7,"vinirmitaḥ","_","_","vinirmā","PPP","","_","_"
1,"_","_","_","pratipad","NC","","_","_"
2,"_","_","_","kaluṣa","JJ","","_","_"
3,"_","_","_","iva","CCM","","_","_"
4,"_","_","_","indu","NC","","_","_"
5,"lekhā","_","_","lekhā","NC","","_","_"
6,"_","_","_","na","CNG","","_","_"
7,"_","_","_","ati","CADP","","_","_"
8,"virājate","_","_","virājata","V","virāj","_","_"
1,"na","_","_","na","CNG","","_","_"
2,"_","_","_","ca","CCD","","_","_"
3,"_","_","_","ida","PRD","","_","_"
4,"naśyate","_","_","naś","V","naś","_","_"
5,"rūpaṃ","_","_","rūpa","NC","","_","_"
6,"vapur","_","_","vapus","NC","","_","_"
7,"_","_","_","mala","NC","","_","_"
8,"_","_","_","samāci","PPP","","_","_"
1,"asaṃskṛtam","_","_","asaṃskṛta","JJ","","_","_"
2,"api","_","_","api","CX","","_","_"
3,"vyaktaṃ","_","_","vyakta","JJ","","_","_"
4,"bhāti","_","_","bhā","V","bhā","_","_"
5,"_","_","_","kāñcana","NC","","_","_"
6,"_","_","_","saṃnibha","JJ","","_","_"
1,"anena","_","_","ida","PRD","","_","_"
2,"vapuṣā","_","_","vapus","NC","","_","_"
3,"bālā","_","_","bāla","JJ","","_","_"
4,"_","_","_","piplu","NC","","_","_"
5,"_","_","_","ida","PRD","","_","_"
6,"_","_","_","ca","CCD","","_","_"
7,"_","_","_","eva","CEM","","_","_"
8,"ha","_","_","ha","CEM","","_","_"
1,"_","_","_","lakṣay","PPP","","_","_"
2,"_","_","_","ida","PRD","","_","_"
3,"mayā","_","_","mat","PPR","","_","_"
4,"devī","_","_","devī","NC","","_","_"
5,"pihito","_","_","pidhā","PPP","","_","_"
6,"'gnir","_","_","agni","NC","","_","_"
7,"_","_","_","iva","CCM","","_","_"
8,"_","_","_","ūṣman","NC","","_","_"
1,"bṛhadaśva","_","_","bṛhadaśva","NC","","_","_"
2,"uvāca","_","_","vak","V","vac","_","_"
1,"_","_","_","tad","PRD","","_","_"
2,"_","_","_","śru","CGDA","","_","_"
3,"vacanaṃ","_","_","vacana","NC","","_","_"
4,"tasya","_","_","tad","PRD","","_","_"
5,"sudevasya","_","_","sudeva","NC","","_","_"
6,"viśāṃ","_","_","viś","NC","","_","_"
7,"pate","_","_","pati","NC","","_","_"
1,"sunandā","_","_","sunandā","NC","","_","_"
2,"śodhayāmāsa","_","_","śodhay","V","śodhay","_","_"
3,"_","_","_","piplu","NC","","_","_"
4,"_","_","_","pracchādana","JJ","","_","_"
5,"malam","_","_","mala","NC","","_","_"
1,"sa","_","_","tad","PRD","","_","_"
2,"_","_","_","mala","NC","","_","_"
3,"_","_","_","apakṛṣ","PPP","","_","_"
4,"piplus","_","_","piplu","NC","","_","_"
5,"tasyā","_","_","tad","PRD","","_","_"
6,"vyarocata","_","_","viroc","V","viruc","_","_"
1,"damayantyās","_","_","damayantī","NC","","_","_"
2,"tadā","_","_","tadā","CAD","","_","_"
3,"vyabhre","_","_","vyabhra","JJ","","_","_"
4,"_","_","_","nabhas","NC","","_","_"
5,"_","_","_","iva","CCM","","_","_"
6,"niśākaraḥ","_","_","niśākara","NC","","_","_"
1,"pipluṃ","_","_","piplu","NC","","_","_"
2,"dṛṣṭvā","_","_","dṛś","CGDA","","_","_"
3,"sunandā","_","_","sunandā","NC","","_","_"
4,"ca","_","_","ca","CCD","","_","_"
5,"_","_","_","rājan","NC","","_","_"
6,"_","_","_","mātṛ","NC","","_","_"
7,"ca","_","_","ca","CCD","","_","_"
8,"bhārata","_","_","bhārata","JJ","","_","_"
1,"rudantyau","_","_","rud","KDP","","_","_"
2,"tāṃ","_","_","tad","PRD","","_","_"
3,"pariṣvajya","_","_","pariṣvaj","CGDA","","_","_"
4,"muhūrtam","_","_","muhūrta","NC","","_","_"
5,"iva","_","_","iva","CCM","","_","_"
6,"tasthatuḥ","_","_","tiṣṭh","V","sthā","_","_"
1,"utsṛjya","_","_","utsṛj","CGDA","","_","_"
2,"bāṣpaṃ","_","_","bāṣpa","NC","","_","_"
3,"_","_","_","rājan","NC","","_","_"
4,"_","_","_","mātṛ","NC","","_","_"
5,"_","_","_","ida","PRD","","_","_"
6,"rājamātedam","_","_","abravīta","V","brū","_","_"
1,"bhaginyā","_","_","bhaginī","NC","","_","_"
2,"duhitā","_","_","duhitṛ","NC","","_","_"
3,"me","_","_","mat","PPR","","_","_"
4,"'si","_","_","as","V","as","_","_"
5,"_","_","_","piplu","NC","","_","_"
6,"_","_","_","ida","PRD","","_","_"
7,"sūcitā","_","_","sūcay","PPP","","_","_"
1,"ahaṃ","_","_","mat","PPR","","_","_"
2,"ca","_","_","ca","CCD","","_","_"
3,"tava","_","_","tvat","PPR","","_","_"
4,"mātā","_","_","mātṛ","NC","","_","_"
5,"ca","_","_","ca","CCD","","_","_"
6,"rājanyasya","_","_","rājanya","NC","","_","_"
7,"mahātmanaḥ","_","_","mahātman","JJ","","_","_"
1,"sute","_","_","suta","NC","","_","_"
2,"_","_","_","daśārṇa","NC","","_","_"
3,"_","_","_","adhipati","NC","","_","_"
4,"sudāmnaś","_","_","sudāman","NC","","_","_"
5,"_","_","_","cāru","JJ","","_","_"
6,"_","_","_","darśana","NC","","_","_"
1,"bhīmasya","_","_","bhīma","NC","","_","_"
2,"rājñaḥ","_","_","rājan","NC","","_","_"
3,"sā","_","_","tad","PRD","","_","_"
4,"dattā","_","_","dā","PPP","","_","_"
5,"vīrabāhor","_","_","vīrabāhu","NC","","_","_"
6,"ahaṃ","_","_","mat","PPR","","_","_"
7,"punaḥ","_","_","punar","CAD","","_","_"
1,"tvaṃ","_","_","tvat","PPR","","_","_"
2,"tu","_","_","tu","CCD","","_","_"
3,"jātā","_","_","jan","PPP","","_","_"
4,"mayā","_","_","mat","PPR","","_","_"
5,"dṛṣṭā","_","_","dṛś","PPP","","_","_"
6,"daśārṇeṣu","_","_","daśārṇa","NC","","_","_"
7,"pitur","_","_","pitṛ","NC","","_","_"
8,"gṛhe","_","_","gṛha","NC","","_","_"
1,"_","_","_","yathā","CCM","","_","_"
2,"_","_","_","eva","CEM","","_","_"
3,"te","_","_","tvat","PPR","","_","_"
4,"pitur","_","_","pitṛ","NC","","_","_"
5,"gehaṃ","_","_","geha","NC","","_","_"
6,"_","_","_","tathā","CX","","_","_"
7,"_","_","_","ida","PRD","","_","_"
8,"api","_","_","api","CX","","_","_"
9,"bhāmini","_","_","bhāminī","NC","","_","_"
1,"_","_","_","yathā","CCM","","_","_"
2,"_","_","_","eva","CEM","","_","_"
3,"hi","_","_","hi","CX","","_","_"
4,"_","_","_","mat","PPR","","_","_"
5,"_","_","_","aiśvarya","NC","","_","_"
6,"damayanti","_","_","damayantī","NC","","_","_"
7,"tathā","_","_","tathā","CX","","_","_"
8,"tava","_","_","tvat","PPR","","_","_"
1,"tāṃ","_","_","tad","PRD","","_","_"
2,"prahṛṣṭena","_","_","prahṛṣ","PPP","","_","_"
3,"manasā","_","_","manas","NC","","_","_"
4,"damayantī","_","_","damayantī","NC","","_","_"
5,"viśāṃ","_","_","viś","NC","","_","_"
6,"pate","_","_","pati","NC","","_","_"
1,"abhivādya","_","_","abhivāday","CGDA","","_","_"
2,"mātur","_","_","mātṛ","NC","","_","_"
3,"bhaginīm","_","_","bhaginī","NC","","_","_"
4,"idaṃ","_","_","ida","PRD","","_","_"
5,"vacanam","_","_","vacana","NC","","_","_"
6,"abravīt","_","_","abravīta","V","brū","_","_"
1,"_","_","_","ajñāyamāna","JJ","","_","_"
2,"_","_","_","api","CX","","_","_"
3,"satī","_","_","as","KDP","","_","_"
4,"sukham","_","_","sukha","NC","","_","_"
5,"_","_","_","as","V","as","_","_"
6,"_","_","_","vas","PPP","","_","_"
7,"_","_","_","iha","CAD","","_","_"
8,"vai","_","_","vai","CX","","_","_"
1,"_","_","_","sarva","JQ","","_","_"
2,"_","_","_","kāma","NC","","_","_"
3,"_","_","_","su","CAD","","_","_"
4,"_","_","_","vidhā","PPP","","_","_"
5,"rakṣyamāṇā","_","_","rakṣ","KDP","","_","_"
6,"sadā","_","_","sadā","CAD","","_","_"
7,"tvayā","_","_","tvat","PPR","","_","_"
1,"sukhāt","_","_","sukha","JJ","","_","_"
2,"sukhataro","_","_","sukhatara","JJ","","_","_"
3,"vāso","_","_","vāsa","NC","","_","_"
4,"bhaviṣyati","_","_","bhav","V","bhū","_","_"
5,"na","_","_","na","CNG","","_","_"
6,"saṃśayaḥ","_","_","saṃśaya","NC","","_","_"
1,"_","_","_","cira","JJ","","_","_"
2,"_","_","_","vipravas","PPP","","_","_"
3,"mātar","_","_","mat","PPR","","_","_"
4,"mām","_","_","anujñā","CGDI","","_","_"
5,"anujñātum","_","_","arh","V","arh","_","_"
1,"dārakau","_","_","dāraka","NC","","_","_"
2,"ca","_","_","ca","CCD","","_","_"
3,"hi","_","_","hi","CX","","_","_"
4,"me","_","_","mat","PPR","","_","_"
5,"nītau","_","_","nī","PPP","","_","_"
6,"vasatas","_","_","vas","V","vas","_","_"
7,"tatra","_","_","tatra","CAD","","_","_"
8,"bālakau","_","_","bālaka","NC","","_","_"
1,"pitrā","_","_","pitṛ","NC","","_","_"
2,"vihīnau","_","_","vihā","PPP","","_","_"
3,"_","_","_","śoka","NC","","_","_"
4,"_","_","_","ārta","JJ","","_","_"
5,"mayā","_","_","mat","PPR","","_","_"
6,"_","_","_","ca","CCD","","_","_"
7,"_","_","_","eva","CEM","","_","_"
8,"kathaṃ","_","_","katha","CX","","_","_"
9,"nu","_","_","nu","CX","","_","_"
10,"tau","_","_","tad","PRD","","_","_"
1,"yadi","_","_","yadi","CSB","","_","_"
2,"_","_","_","ca","CCD","","_","_"
3,"_","_","_","api","CX","","_","_"
4,"priyaṃ","_","_","priya","JJ","","_","_"
5,"_","_","_","kiṃcit","PRI","","_","_"
6,"_","_","_","mat","PPR","","_","_"
7,"kartum","_","_","kṛ","CGDI","","_","_"
8,"_","_","_","iha","CAD","","_","_"
9,"_","_","_","iṣ","V","iṣ","_","_"
1,"vidarbhān","_","_","vidarbha","NC","","_","_"
2,"yātum","_","_","yā","CGDI","","_","_"
3,"icchāmi","_","_","iṣ","V","iṣ","_","_"
4,"śīghraṃ","_","_","śīghra","JJ","","_","_"
5,"me","_","_","mat","PPR","","_","_"
6,"yānam","_","_","yāna","NC","","_","_"
7,"ādiśa","_","_","ādiś","V","ādiś","_","_"
1,"bāḍham","_","_","bāḍha","JJ","","_","_"
2,"ity","_","_","iti","CQT","","_","_"
3,"eva","_","_","eva","CEM","","_","_"
4,"tām","_","_","tad","PRD","","_","_"
5,"uktvā","_","_","vac","CGDA","","_","_"
6,"hṛṣṭā","_","_","hṛṣ","PPP","","_","_"
7,"mātṛṣvasā","_","_","mātṛṣvasṛ","NC","","_","_"
8,"nṛpa","_","_","nṛpa","NC","","_","_"
1,"guptāṃ","_","_","gup","PPP","","_","_"
2,"balena","_","_","bala","NC","","_","_"
3,"mahatā","_","_","mahat","JJ","","_","_"
4,"_","_","_","putra","NC","","_","_"
5,"_","_","_","anumata","NC","","_","_"
6,"tataḥ","_","_","tatas","CX","","_","_"
1,"prasthāpayad","_","_","prasthāpay","V","prasthāpay","_","_"
2,"_","_","_","rājan","NC","","_","_"
3,"_","_","_","mātṛ","NC","","_","_"
4,"śrīmatā","_","_","śrīmat","JJ","","_","_"
5,"_","_","_","nara","NC","","_","_"
6,"_","_","_","vāhin","JJ","","_","_"
1,"yānena","_","_","yāna","NC","","_","_"
2,"_","_","_","bharata","NC","","_","_"
3,"_","_","_","śreṣṭha","JJ","","_","_"
4,"_","_","_","svanna","NC","","_","_"
5,"_","_","_","pāna","NC","","_","_"
6,"_","_","_","paricchada","NC","","_","_"
1,"tataḥ","_","_","tatas","CX","","_","_"
2,"sā","_","_","tad","PRD","","_","_"
3,"nacirād","_","_","nacira","JJ","","_","_"
4,"eva","_","_","eva","CEM","","_","_"
5,"vidarbhān","_","_","vidarbha","NC","","_","_"
6,"_","_","_","ga","V","ga","_","_"
7,"_","_","_","śubha","JJ","","_","_"
1,"tāṃ","_","_","tad","PRD","","_","_"
2,"tu","_","_","tu","CCD","","_","_"
3,"_","_","_","bandhu","NC","","_","_"
4,"_","_","_","jana","NC","","_","_"
5,"sarvaḥ","_","_","sarva","JQ","","_","_"
6,"prahṛṣṭaḥ","_","_","prahṛṣ","PPP","","_","_"
7,"pratyapūjayat","_","_","pratipūjay","V","pratipūjay","_","_"
1,"sarvān","_","_","sarva","JQ","","_","_"
2,"kuśalino","_","_","kuśalin","JJ","","_","_"
3,"dṛṣṭvā","_","_","dṛś","CGDA","","_","_"
4,"bāndhavān","_","_","bāndhava","NC","","_","_"
5,"dārakau","_","_","dāraka","NC","","_","_"
6,"ca","_","_","ca","CCD","","_","_"
7,"tau","_","_","tad","PRD","","_","_"
1,"mātaraṃ","_","_","mātṛ","NC","","_","_"
2,"pitaraṃ","_","_","pitṛ","NC","","_","_"
3,"_","_","_","ca","CCD","","_","_"
4,"_","_","_","eva","CEM","","_","_"
5,"sarvaṃ","_","_","sarva","JQ","","_","_"
6,"_","_","_","ca","CCD","","_","_"
7,"_","_","_","eva","CEM","","_","_"
8,"_","_","_","sakhī","NC","","_","_"
9,"_","_","_","jana","NC","","_","_"
1,"devatāḥ","_","_","devatā","NC","","_","_"
2,"pūjayāmāsa","_","_","pūjay","V","pūjay","_","_"
3,"brāhmaṇāṃś","_","_","brāhmaṇa","NC","","_","_"
4,"ca","_","_","ca","CCD","","_","_"
5,"yaśasvinī","_","_","yaśasvin","JJ","","_","_"
1,"vidhinā","_","_","vidhi","NC","","_","_"
2,"pareṇa","_","_","para","PPX","","_","_"
3,"kalyāṇī","_","_","kalyāṇa","JJ","","_","_"
4,"damayantī","_","_","damayantī","NC","","_","_"
5,"viśāṃ","_","_","viś","NC","","_","_"
6,"pate","_","_","pati","NC","","_","_"
1,"atarpayat","_","_","tarpay","V","tarpay","_","_"
2,"sudevaṃ","_","_","sudeva","NC","","_","_"
3,"ca","_","_","ca","CCD","","_","_"
4,"_","_","_","go","CX","","_","_"
5,"_","_","_","sahasra","NUM","","_","_"
6,"pārthivaḥ","_","_","pārthiva","NC","","_","_"
1,"prīto","_","_","prī","PPP","","_","_"
2,"_","_","_","dṛś","CGDA","","_","_"
3,"_","_","_","eva","CEM","","_","_"
4,"tanayāṃ","_","_","tanayā","NC","","_","_"
5,"grāmeṇa","_","_","grāma","NC","","_","_"
6,"draviṇena","_","_","draviṇa","NC","","_","_"
7,"ca","_","_","ca","CCD","","_","_"
1,"sā","_","_","tad","PRD","","_","_"
2,"vyuṣṭā","_","_","vivas","PPP","","_","_"
3,"rajanīṃ","_","_","rajanī","NC","","_","_"
4,"tatra","_","_","tatra","CAD","","_","_"
5,"pitur","_","_","pitṛ","NC","","_","_"
6,"veśmani","_","_","veśman","NC","","_","_"
7,"bhāminī","_","_","bhāminī","NC","","_","_"
1,"viśrāntā","_","_","viśra","PPP","","_","_"
2,"mātaraṃ","_","_","mātṛ","NC","","_","_"
3,"rājann","_","_","rājan","NC","","_","_"
4,"idaṃ","_","_","ida","PRD","","_","_"
5,"vacanam","_","_","vacana","NC","","_","_"
6,"abravīt","_","_","abravīta","V","brū","_","_"
