"WordID","word","NormSTEM","suffix","lemma","PoS","Root","NormSuffix","NormWord"
1,"_","_","_","mā","CNG","","_","_"
2,"_","_","_","u","CEM","","_","_"
3,"ṣu","_","_","su","CAD","","_","_"
4,"tvā","_","_","tvat","PPR","","_","_"
5,"vāghataś","_","_","vāghat","NC","","_","_"
6,"_","_","_","cana","CX","","_","_"
7,"_","_","_","āre","CX","","_","_"
8,"asman","_","_","mat","PPR","","_","_"
9,"ni","_","_","ni","CADP","","_","_"
10,"rīraman","_","_","ra","V","ra","_","_"
1,"ārāttāc","_","_","ārāttāt","CX","","_","_"
2,"cit","_","_","cit","CEM","","_","_"
3,"sadhamādaṃ","_","_","sadhamāda","NC","","_","_"
4,"na","_","_","mat","PPR","","_","_"
5,"ā","_","_","ā","CADP","","_","_"
6,"_","_","_","ga","V","ga","_","_"
7,"_","_","_","iha","CAD","","_","_"
8,"vā","_","_","vā","CCD","","_","_"
9,"sann","_","_","as","KDP","","_","_"
10,"upa","_","_","upa","CADP","","_","_"
11,"śrudhi","_","_","śṛṇ","V","śru","_","_"
1,"ime","_","_","ida","PRD","","_","_"
2,"hi","_","_","hi","CX","","_","_"
3,"te","_","_","tvat","PPR","","_","_"
4,"_","_","_","brahman","NC","","_","_"
5,"_","_","_","kṛt","JJ","","_","_"
6,"sute","_","_","suta","NC","","_","_"
7,"sacā","_","_","sacā","CX","","_","_"
8,"madhau","_","_","madhu","NC","","_","_"
9,"na","_","_","na","CNG","","_","_"
10,"makṣa","_","_","makṣ","NC","","_","_"
11,"āsate","_","_","ās","V","ās","_","_"
1,"indre","_","_","indra","NC","","_","_"
2,"kāmaṃ","_","_","kāma","NC","","_","_"
3,"jaritāro","_","_","jaritṛ","NC","","_","_"
4,"vasūyavo","_","_","vasūyu","JJ","","_","_"
5,"rathe","_","_","ratha","NC","","_","_"
6,"na","_","_","na","CNG","","_","_"
7,"pādam","_","_","pāda","NC","","_","_"
8,"ā","_","_","ā","CADP","","_","_"
1,"rāyaskāmo","_","_","rāyaskāma","JJ","","_","_"
2,"vajrahastaṃ","_","_","vajrahasta","NC","","_","_"
3,"_","_","_","su","CAD","","_","_"
4,"_","_","_","dakṣiṇa","JJ","","_","_"
5,"putro","_","_","putra","NC","","_","_"
6,"na","_","_","na","CNG","","_","_"
7,"pitaraṃ","_","_","pitṛ","NC","","_","_"
8,"huve","_","_","hvā","V","hvā","_","_"
1,"ima","_","_","ida","PRD","","_","_"
2,"indrāya","_","_","indra","NC","","_","_"
3,"sunvire","_","_","su","V","su","_","_"
4,"somāso","_","_","soma","NC","","_","_"
5,"_","_","_","dadhi","NC","","_","_"
6,"_","_","_","āśir","NC","","_","_"
1,"tāṁ","_","_","tad","PRD","","_","_"
2,"ā","_","_","ā","CADP","","_","_"
3,"madāya","_","_","mada","NC","","_","_"
4,"vajrahasta","_","_","vajrahasta","NC","","_","_"
5,"pītaye","_","_","pīti","NC","","_","_"
6,"haribhyāṃ","_","_","hari","NC","","_","_"
7,"yāhy","_","_","yā","V","yā","_","_"
8,"oka","_","_","oka","NC","","_","_"
9,"ā","_","_","ā","CADP","","_","_"
1,"śravac","_","_","śṛṇ","V","śru","_","_"
2,"chrutkarṇa","_","_","śrutkarṇa","JJ","","_","_"
3,"īyate","_","_","e","V","i","_","_"
4,"vasūnāṃ","_","_","vasu","NC","","_","_"
5,"nū","_","_","nu","CX","","_","_"
6,"cin","_","_","cit","CEM","","_","_"
7,"no","_","_","mat","PPR","","_","_"
8,"mardhiṣad","_","_","mṛdh","V","mṛdh","_","_"
9,"giraḥ","_","_","gir","NC","","_","_"
1,"sadyaś","_","_","sadyas","CAD","","_","_"
2,"cid","_","_","cit","CEM","","_","_"
3,"yaḥ","_","_","yad","PRL","","_","_"
4,"sahasrāṇi","_","_","sahasra","NUM","","_","_"
5,"śatā","_","_","śata","NUM","","_","_"
6,"dadan","_","_","dad","V","dā","_","_"
7,"nakir","_","_","nakir","CX","","_","_"
8,"ditsantam","_","_","dits","KDP","","_","_"
9,"ā","_","_","ā","CADP","","_","_"
10,"minat","_","_","mī","V","mī","_","_"
1,"sa","_","_","tad","PRD","","_","_"
2,"vīro","_","_","vīra","NC","","_","_"
3,"apratiṣkuta","_","_","apratiṣkuta","JJ","","_","_"
4,"indreṇa","_","_","indra","NC","","_","_"
5,"śūśuve","_","_","śvi","V","śvi","_","_"
6,"nṛbhiḥ","_","_","nṛ","NC","","_","_"
1,"yas","_","_","yad","PRL","","_","_"
2,"te","_","_","tvat","PPR","","_","_"
3,"gabhīrā","_","_","gabhīra","JJ","","_","_"
4,"savanāni","_","_","savana","NC","","_","_"
5,"vṛtrahan","_","_","vṛtrahan","NC","","_","_"
6,"sunoty","_","_","su","V","su","_","_"
7,"ā","_","_","ā","CADP","","_","_"
8,"ca","_","_","ca","CCD","","_","_"
9,"dhāvati","_","_","dhāv","V","dhāv","_","_"
1,"bhavā","_","_","bhav","V","bhū","_","_"
2,"varūtham","_","_","varūtha","NC","","_","_"
3,"maghavan","_","_","maghavan","NC","","_","_"
4,"maghonāṃ","_","_","maghavan","JJ","","_","_"
5,"yat","_","_","yat","CSB","","_","_"
6,"samajāsi","_","_","samaj","V","samaj","_","_"
7,"śardhataḥ","_","_","śṛdh","KDP","","_","_"
1,"vi","_","_","vi","CADP","","_","_"
2,"_","_","_","tvat","PPR","","_","_"
3,"_","_","_","han","PPP","","_","_"
4,"vedanam","_","_","vedana","NC","","_","_"
5,"bhajemahy","_","_","bhaj","V","bhaj","_","_"
6,"ā","_","_","ā","CADP","","_","_"
7,"dūṇāśo","_","_","dūḍāś","JJ","","_","_"
8,"bharā","_","_","bhṛ","V","bhṛ","_","_"
9,"gayam","_","_","gaya","NC","","_","_"
1,"sunotā","_","_","su","V","su","_","_"
2,"_","_","_","soma","NC","","_","_"
3,"_","_","_","pāvan","JJ","","_","_"
4,"somam","_","_","soma","NC","","_","_"
5,"indrāya","_","_","indra","NC","","_","_"
6,"vajriṇe","_","_","vajrin","NC","","_","_"
1,"pacatā","_","_","pac","V","pac","_","_"
2,"paktīr","_","_","pakti","NC","","_","_"
3,"avase","_","_","av","CGDI","","_","_"
4,"kṛṇudhvam","_","_","kar","V","kṛ","_","_"
5,"it","_","_","id","CEM","","_","_"
6,"pṛṇann","_","_","pṛṇ","KDP","","_","_"
7,"it","_","_","id","CEM","","_","_"
8,"pṛṇate","_","_","pṛ","KDP","","_","_"
9,"mayaḥ","_","_","mayas","NC","","_","_"
1,"mā","_","_","mā","CNG","","_","_"
2,"sredhata","_","_","sridh","V","sridh","_","_"
3,"somino","_","_","somin","JJ","","_","_"
4,"dakṣatā","_","_","dakṣ","V","dakṣ","_","_"
5,"mahe","_","_","mah","JJ","","_","_"
6,"kṛṇudhvaṃ","_","_","kar","V","kṛ","_","_"
7,"rāya","_","_","rai","NC","","_","_"
8,"ātuje","_","_","ātuj","CGDI","","_","_"
1,"taraṇir","_","_","taraṇi","JJ","","_","_"
2,"ij","_","_","id","CEM","","_","_"
3,"jayati","_","_","jay","V","ji","_","_"
4,"kṣeti","_","_","kṣi","V","kṣi","_","_"
5,"puṣyati","_","_","puṣ","V","puṣ","_","_"
6,"na","_","_","na","CNG","","_","_"
7,"devāsaḥ","_","_","deva","NC","","_","_"
8,"kavatnave","_","_","kavatnu","JJ","","_","_"
1,"nakiḥ","_","_","nakir","CX","","_","_"
2,"sudāso","_","_","sudās","NC","","_","_"
3,"ratham","_","_","ratha","NC","","_","_"
4,"pary","_","_","pari","CADP","","_","_"
5,"āsa","_","_","as","V","as","_","_"
6,"na","_","_","na","CNG","","_","_"
7,"rīramat","_","_","ra","V","ra","_","_"
1,"indro","_","_","indra","NC","","_","_"
2,"_","_","_","yad","PRL","","_","_"
3,"_","_","_","av","V","av","_","_"
4,"yasya","_","_","yad","PRL","","_","_"
5,"maruto","_","_","marut","NC","","_","_"
6,"gamat","_","_","gacch","V","gam","_","_"
7,"sa","_","_","tad","PRD","","_","_"
8,"gomati","_","_","gomat","JJ","","_","_"
9,"vraje","_","_","vraja","NC","","_","_"
1,"gamad","_","_","gacch","V","gam","_","_"
2,"vājaṃ","_","_","vāja","NC","","_","_"
3,"vājayann","_","_","vājay","KDP","","_","_"
4,"indra","_","_","indra","NC","","_","_"
5,"martyo","_","_","martya","NC","","_","_"
6,"yasya","_","_","yad","PRL","","_","_"
7,"tvam","_","_","tvat","PPR","","_","_"
8,"avitā","_","_","av","V","av","_","_"
9,"bhuvaḥ","_","_","bhav","V","bhū","_","_"
1,"asmākam","_","_","mat","PPR","","_","_"
2,"bodhy","_","_","bhav","V","bhū","_","_"
3,"avitā","_","_","av","V","av","_","_"
4,"rathānām","_","_","ratha","NC","","_","_"
5,"asmākaṃ","_","_","mat","PPR","","_","_"
6,"śūra","_","_","śūra","NC","","_","_"
7,"nṛṇām","_","_","nṛ","NC","","_","_"
1,"ud","_","_","ud","CADP","","_","_"
2,"in","_","_","id","CEM","","_","_"
3,"nv","_","_","nu","CX","","_","_"
4,"asya","_","_","ida","PRD","","_","_"
5,"ricyate","_","_","ric","V","ric","_","_"
6,"'ṃśo","_","_","aṃśa","NC","","_","_"
7,"dhanaṃ","_","_","dhana","NC","","_","_"
8,"na","_","_","na","CNG","","_","_"
9,"jigyuṣaḥ","_","_","ji","KDP","","_","_"
1,"ya","_","_","yad","PRL","","_","_"
2,"indro","_","_","indra","NC","","_","_"
3,"harivān","_","_","harivat","JJ","","_","_"
4,"na","_","_","na","CNG","","_","_"
5,"dabhanti","_","_","dabh","V","dabh","_","_"
6,"taṃ","_","_","tad","PRD","","_","_"
7,"ripo","_","_","rip","NC","","_","_"
8,"dakṣaṃ","_","_","dakṣa","NC","","_","_"
9,"dadhāti","_","_","dadh","V","dhā","_","_"
10,"somini","_","_","somin","JJ","","_","_"
1,"mantram","_","_","mantra","NC","","_","_"
2,"akharvaṃ","_","_","akharva","JJ","","_","_"
3,"sudhitaṃ","_","_","sudhita","JJ","","_","_"
4,"supeśasaṃ","_","_","supeśas","JJ","","_","_"
5,"dadhāta","_","_","dadh","V","dhā","_","_"
6,"yajñiyeṣv","_","_","yajñiya","JJ","","_","_"
7,"ā","_","_","ā","CADP","","_","_"
1,"pūrvīś","_","_","puru","JJ","","_","_"
2,"cana","_","_","cana","CX","","_","_"
3,"prasitayas","_","_","prasiti","NC","","_","_"
4,"taranti","_","_","tar","V","tṛ","_","_"
5,"taṃ","_","_","tad","PRD","","_","_"
6,"ya","_","_","yad","PRL","","_","_"
7,"indre","_","_","indra","NC","","_","_"
8,"karmaṇā","_","_","karman","NC","","_","_"
9,"bhuvat","_","_","bhav","V","bhū","_","_"
1,"kas","_","_","kiṃ","PRQ","","_","_"
2,"tam","_","_","tad","PRD","","_","_"
3,"indra","_","_","indra","NC","","_","_"
4,"tvāvasum","_","_","tvāvasu","JJ","","_","_"
5,"ā","_","_","ā","CADP","","_","_"
6,"martyo","_","_","martya","NC","","_","_"
7,"dadharṣati","_","_","dhṛṣ","V","dhṛṣ","_","_"
1,"śraddhā","_","_","śraddhā","NC","","_","_"
2,"it","_","_","id","CEM","","_","_"
3,"te","_","_","tvat","PPR","","_","_"
4,"maghavan","_","_","maghavan","NC","","_","_"
5,"pārye","_","_","pārya","JJ","","_","_"
6,"divi","_","_","div","NC","","_","_"
7,"vājī","_","_","vājin","NC","","_","_"
8,"vājaṃ","_","_","vāja","NC","","_","_"
9,"siṣāsati","_","_","siṣās","V","siṣās","_","_"
1,"maghonaḥ","_","_","maghavan","JJ","","_","_"
2,"sma","_","_","sma","CX","","_","_"
3,"_","_","_","vṛtra","NC","","_","_"
4,"_","_","_","hatya","NC","","_","_"
5,"codaya","_","_","codaya","V","coday","_","_"
6,"ye","_","_","yad","PRL","","_","_"
7,"dadati","_","_","dad","V","dā","_","_"
8,"priyā","_","_","priya","JJ","","_","_"
9,"vasu","_","_","vasu","NC","","_","_"
1,"tava","_","_","tvat","PPR","","_","_"
2,"praṇītī","_","_","praṇīti","NC","","_","_"
3,"haryaśva","_","_","haryaśva","NC","","_","_"
4,"sūribhir","_","_","sūri","NC","","_","_"
5,"viśvā","_","_","viśva","JQ","","_","_"
6,"tarema","_","_","tar","V","tṛ","_","_"
7,"duritā","_","_","durita","NC","","_","_"
1,"_","_","_","tvat","PPR","","_","_"
2,"_","_","_","id","CEM","","_","_"
3,"_","_","_","indra","NC","","_","_"
4,"_","_","_","avama","JJ","","_","_"
5,"vasu","_","_","vasu","NC","","_","_"
6,"tvam","_","_","tvat","PPR","","_","_"
7,"puṣyasi","_","_","puṣ","V","puṣ","_","_"
8,"madhyamam","_","_","madhyama","JJ","","_","_"
1,"satrā","_","_","satrā","CX","","_","_"
2,"viśvasya","_","_","viśva","JQ","","_","_"
3,"paramasya","_","_","parama","JJ","","_","_"
4,"rājasi","_","_","rāj","V","rāj","_","_"
5,"nakiṣ","_","_","nakir","CX","","_","_"
6,"ṭvā","_","_","tvat","PPR","","_","_"
7,"goṣu","_","_","go","NC","","_","_"
8,"vṛṇvate","_","_","vṛ","V","vṛ","_","_"
1,"tvaṃ","_","_","tvat","PPR","","_","_"
2,"viśvasya","_","_","viśva","JQ","","_","_"
3,"_","_","_","dhana","NC","","_","_"
4,"_","_","_","dā","JJ","","_","_"
5,"asi","_","_","as","V","as","_","_"
6,"śruto","_","_","śru","PPP","","_","_"
7,"ya","_","_","yad","PRL","","_","_"
8,"īm","_","_","īṃ","CX","","_","_"
9,"bhavanty","_","_","bhav","V","bhū","_","_"
10,"ājayaḥ","_","_","āji","NC","","_","_"
1,"_","_","_","tvat","PPR","","_","_"
2,"_","_","_","ida","PRD","","_","_"
3,"viśvaḥ","_","_","viśva","JQ","","_","_"
4,"puruhūta","_","_","puruhūta","NC","","_","_"
5,"pārthivo","_","_","pārthiva","NC","","_","_"
6,"'vasyur","_","_","avasyu","JJ","","_","_"
7,"nāma","_","_","nāman","NC","","_","_"
8,"bhikṣate","_","_","bhikṣ","V","bhikṣ","_","_"
1,"yad","_","_","yat","CSB","","_","_"
2,"indra","_","_","indra","NC","","_","_"
3,"yāvatas","_","_","yāvat","JJ","","_","_"
4,"tvam","_","_","tvat","PPR","","_","_"
5,"etāvad","_","_","etāvat","JJ","","_","_"
6,"aham","_","_","mat","PPR","","_","_"
7,"īśīya","_","_","īś","V","īś","_","_"
1,"stotāram","_","_","stotṛ","JJ","","_","_"
2,"id","_","_","id","CEM","","_","_"
3,"didhiṣeya","_","_","didhiṣ","V","didhiṣ","_","_"
4,"radāvaso","_","_","radāvasu","JJ","","_","_"
5,"na","_","_","na","CNG","","_","_"
6,"pāpatvāya","_","_","pāpatva","NC","","_","_"
7,"rāsīya","_","_","rā","V","rā","_","_"
1,"śikṣeyam","_","_","śikṣ","V","śikṣ","_","_"
2,"in","_","_","id","CEM","","_","_"
3,"mahayate","_","_","mahay","KDP","","_","_"
4,"dive","_","_","diva","NC","","_","_"
5,"dive","_","_","diva","NC","","_","_"
6,"rāya","_","_","rai","NC","","_","_"
7,"ā","_","_","ā","CADP","","_","_"
8,"_","_","_","kuhacid","CX","","_","_"
9,"_","_","_","vid","CGDI","","_","_"
1,"nahi","_","_","nahi","CX","","_","_"
2,"tvad","_","_","tvat","PPR","","_","_"
3,"anyan","_","_","anya","PPX","","_","_"
4,"maghavan","_","_","maghavan","NC","","_","_"
5,"na","_","_","mat","PPR","","_","_"
6,"āpyaṃ","_","_","āpya","NC","","_","_"
7,"vasyo","_","_","vasyas","JJ","","_","_"
8,"asti","_","_","as","V","as","_","_"
9,"pitā","_","_","pitṛ","NC","","_","_"
10,"cana","_","_","cana","CX","","_","_"
1,"taraṇir","_","_","taraṇi","JJ","","_","_"
2,"it","_","_","id","CEM","","_","_"
3,"siṣāsati","_","_","siṣās","V","siṣās","_","_"
4,"vājam","_","_","vāja","NC","","_","_"
5,"purandhyā","_","_","puraṃdhi","NC","","_","_"
6,"yujā","_","_","yuj","NC","","_","_"
1,"ā","_","_","ā","CADP","","_","_"
2,"va","_","_","tvat","PPR","","_","_"
3,"indram","_","_","indra","NC","","_","_"
4,"puruhūtaṃ","_","_","puruhūta","NC","","_","_"
5,"name","_","_","nama","V","na","_","_"
6,"girā","_","_","gir","NC","","_","_"
7,"nemiṃ","_","_","nemi","NC","","_","_"
8,"_","_","_","taṣṭṛ","NC","","_","_"
9,"_","_","_","iva","CCM","","_","_"
10,"_","_","_","su","CAD","","_","_"
11,"_","_","_","dru","NC","","_","_"
1,"na","_","_","na","CNG","","_","_"
2,"duṣṭutī","_","_","duṣṭuti","NC","","_","_"
3,"martyo","_","_","martya","NC","","_","_"
4,"vindate","_","_","vid","V","vid","_","_"
5,"vasu","_","_","vasu","NC","","_","_"
6,"na","_","_","na","CNG","","_","_"
7,"sredhantaṃ","_","_","sridh","KDP","","_","_"
8,"rayir","_","_","rayi","NC","","_","_"
9,"naśat","_","_","naś","V","naś","_","_"
1,"_","_","_","su","CAD","","_","_"
2,"_","_","_","śakti","NC","","_","_"
3,"in","_","_","id","CEM","","_","_"
4,"maghavan","_","_","maghavan","NC","","_","_"
5,"tubhyam","_","_","tvat","PPR","","_","_"
6,"māvate","_","_","māvat","JJ","","_","_"
7,"deṣṇaṃ","_","_","deṣṇa","NC","","_","_"
8,"yat","_","_","yad","PRL","","_","_"
9,"pārye","_","_","pārya","JJ","","_","_"
10,"divi","_","_","div","NC","","_","_"
1,"abhi","_","_","abhi","CADP","","_","_"
2,"tvā","_","_","tvat","PPR","","_","_"
3,"śūra","_","_","śūra","NC","","_","_"
4,"nonumo","_","_","nonāv","V","nonāv","_","_"
5,"'dugdhā","_","_","adugdha","JJ","","_","_"
6,"iva","_","_","iva","CCM","","_","_"
7,"dhenavaḥ","_","_","dhenu","NC","","_","_"
1,"īśānam","_","_","īś","KDP","","_","_"
2,"asya","_","_","ida","PRD","","_","_"
3,"jagataḥ","_","_","jagat","NC","","_","_"
4,"_","_","_","svar","CX","","_","_"
5,"_","_","_","dṛś","NC","","_","_"
6,"īśānam","_","_","īś","KDP","","_","_"
7,"indra","_","_","indra","NC","","_","_"
8,"tasthuṣaḥ","_","_","sthā","KDP","","_","_"
1,"na","_","_","na","CNG","","_","_"
2,"tvāvāṁ","_","_","tvāvat","JJ","","_","_"
3,"anyo","_","_","anya","PPX","","_","_"
4,"divyo","_","_","divya","JJ","","_","_"
5,"na","_","_","na","CNG","","_","_"
6,"pārthivo","_","_","pārthiva","JJ","","_","_"
7,"na","_","_","na","CNG","","_","_"
8,"jāto","_","_","jan","PPP","","_","_"
9,"na","_","_","na","CNG","","_","_"
10,"janiṣyate","_","_","jan","V","jan","_","_"
1,"aśvāyanto","_","_","aśvāyat","JJ","","_","_"
2,"maghavann","_","_","maghavan","NC","","_","_"
3,"indra","_","_","indra","NC","","_","_"
4,"vājino","_","_","vājin","NC","","_","_"
5,"gavyantas","_","_","gavyat","JJ","","_","_"
6,"tvā","_","_","tvat","PPR","","_","_"
7,"havāmahe","_","_","hvā","V","hvā","_","_"
1,"abhī","_","_","abhi","CADP","","_","_"
2,"ṣatas","_","_","as","KDP","","_","_"
3,"tad","_","_","tad","PRD","","_","_"
4,"ā","_","_","ā","CADP","","_","_"
5,"_","_","_","bhṛ","V","bhṛ","_","_"
6,"_","_","_","indra","NC","","_","_"
7,"jyāyaḥ","_","_","jyāyas","JJ","","_","_"
8,"kanīyasaḥ","_","_","kanīyas","JJ","","_","_"
1,"purūvasur","_","_","purūvasu","JJ","","_","_"
2,"hi","_","_","hi","CX","","_","_"
3,"maghavan","_","_","maghavan","NC","","_","_"
4,"sanād","_","_","sanāt","CX","","_","_"
5,"asi","_","_","as","V","as","_","_"
6,"bhare","_","_","bhara","NC","","_","_"
7,"bhare","_","_","bhara","NC","","_","_"
8,"ca","_","_","ca","CCD","","_","_"
9,"havyaḥ","_","_","hvā","KDG","","_","_"
1,"parā","_","_","parā","CADP","","_","_"
2,"ṇudasva","_","_","nud","V","nud","_","_"
3,"maghavann","_","_","maghavan","NC","","_","_"
4,"amitrān","_","_","amitra","NC","","_","_"
5,"_","_","_","su","CAD","","_","_"
6,"_","_","_","veda","NC","","_","_"
7,"no","_","_","mat","PPR","","_","_"
8,"vasū","_","_","vasu","NC","","_","_"
9,"kṛdhi","_","_","kar","V","kṛ","_","_"
1,"asmākam","_","_","mat","PPR","","_","_"
2,"bodhy","_","_","bhav","V","bhū","_","_"
3,"avitā","_","_","av","V","av","_","_"
4,"mahādhane","_","_","mahādhana","NC","","_","_"
5,"bhavā","_","_","bhav","V","bhū","_","_"
6,"vṛdhaḥ","_","_","vṛdha","JJ","","_","_"
7,"sakhīnām","_","_","sakhi","NC","","_","_"
1,"indra","_","_","indra","NC","","_","_"
2,"kratuṃ","_","_","kratu","NC","","_","_"
3,"na","_","_","mat","PPR","","_","_"
4,"ā","_","_","ā","CADP","","_","_"
5,"bhara","_","_","bhṛ","V","bhṛ","_","_"
6,"pitā","_","_","pitṛ","NC","","_","_"
7,"putrebhyo","_","_","putra","NC","","_","_"
8,"yathā","_","_","yathā","CCM","","_","_"
1,"śikṣā","_","_","śikṣ","V","śikṣ","_","_"
2,"ṇo","_","_","mat","PPR","","_","_"
3,"asmin","_","_","ida","PRD","","_","_"
4,"puruhūta","_","_","puruhūta","NC","","_","_"
5,"yāmani","_","_","yāman","NC","","_","_"
6,"jīvā","_","_","jīva","JJ","","_","_"
7,"jyotir","_","_","jyotis","NC","","_","_"
8,"aśīmahi","_","_","aś","V","aś","_","_"
1,"mā","_","_","mā","CNG","","_","_"
2,"no","_","_","mat","PPR","","_","_"
3,"ajñātā","_","_","ajñāta","JJ","","_","_"
4,"vṛjanā","_","_","vṛjana","NC","","_","_"
5,"durādhyo","_","_","durādhī","JJ","","_","_"
6,"_","_","_","mā","CNG","","_","_"
7,"_","_","_","aśiva","JJ","","_","_"
8,"ava","_","_","ava","CX","","_","_"
9,"kramuḥ","_","_","kra","V","kra","_","_"
1,"tvayā","_","_","tvat","PPR","","_","_"
2,"vayam","_","_","mat","PPR","","_","_"
3,"pravataḥ","_","_","pravat","NC","","_","_"
4,"śaśvatīr","_","_","śaśvat","JJ","","_","_"
5,"apo","_","_","ap","NC","","_","_"
6,"'ti","_","_","ati","CADP","","_","_"
7,"śūra","_","_","śūra","NC","","_","_"
8,"tarāmasi","_","_","tar","V","tṛ","_","_"
