"WordID","word","NormSTEM","suffix","lemma","PoS","Root","NormSuffix","NormWord"
1,"saṃjaya","_","_","saṃjaya","NC","","_","_"
2,"uvāca","_","_","vak","V","vac","_","_"
1,"sahadevam","_","_","sahadeva","NC","","_","_"
2,"_","_","_","atha","CAD","","_","_"
3,"_","_","_","āyā","KDP","","_","_"
4,"_","_","_","droṇa","NC","","_","_"
5,"_","_","_","prepsu","JJ","","_","_"
6,"viśāṃ","_","_","viś","NC","","_","_"
7,"pate","_","_","pati","NC","","_","_"
1,"karṇo","_","_","karṇa","NC","","_","_"
2,"vaikartano","_","_","vaikartana","NC","","_","_"
3,"yuddhe","_","_","yuddha","NC","","_","_"
4,"vārayāmāsa","_","_","vāray","V","vāray","_","_"
5,"bhārata","_","_","bhārata","NC","","_","_"
1,"_","_","_","sahadeva","NC","","_","_"
2,"_","_","_","tu","CCD","","_","_"
3,"rādheyaṃ","_","_","rādheya","NC","","_","_"
4,"viddhvā","_","_","vyadh","CGDA","","_","_"
5,"navabhir","_","_","navan","NUM","","_","_"
6,"āśugaiḥ","_","_","āśuga","NC","","_","_"
1,"punar","_","_","punar","CAD","","_","_"
2,"vivyādha","_","_","vyadh","V","vyadh","_","_"
3,"daśabhir","_","_","daśan","NUM","","_","_"
4,"niśitair","_","_","niśā","PPP","","_","_"
5,"_","_","_","na","PPP","","_","_"
6,"_","_","_","parvan","NC","","_","_"
1,"taṃ","_","_","tad","PRD","","_","_"
2,"karṇaḥ","_","_","karṇa","NC","","_","_"
3,"prativivyādha","_","_","prativyadh","V","prativyadh","_","_"
4,"śatena","_","_","śata","NUM","","_","_"
5,"_","_","_","na","PPP","","_","_"
6,"_","_","_","parvan","NC","","_","_"
1,"_","_","_","sa_saha","CX","","_","_"
2,"_","_","_","jyā","NC","","_","_"
3,"_","_","_","ca","CCD","","_","_"
4,"_","_","_","ida","PRD","","_","_"
5,"dhanuḥ","_","_","dhanus","NC","","_","_"
6,"śīghraṃ","_","_","śīghra","CX","","_","_"
7,"cicheda","_","_","chid","V","chid","_","_"
8,"_","_","_","laghu","JJ","","_","_"
9,"_","_","_","hasta","NC","","_","_"
10,"_","_","_","vat","CX","","_","_"
1,"tato","_","_","tatas","CX","","_","_"
2,"'nyad","_","_","anya","PPX","","_","_"
3,"dhanur","_","_","dhanus","NC","","_","_"
4,"ādāya","_","_","ādā","CGDA","","_","_"
5,"_","_","_","mādrī","NC","","_","_"
6,"_","_","_","putra","NC","","_","_"
7,"pratāpavān","_","_","pratāpavat","JJ","","_","_"
1,"karṇaṃ","_","_","karṇa","NC","","_","_"
2,"vivyādha","_","_","vyadh","V","vyadh","_","_"
3,"viṃśatyā","_","_","viṃśati","NC","","_","_"
4,"tad","_","_","tad","PRD","","_","_"
5,"adbhutam","_","_","adbhuta","NC","","_","_"
6,"_","_","_","iva","CCM","","_","_"
7,"_","_","_","bhav","V","bhū","_","_"
1,"tasya","_","_","tad","PRD","","_","_"
2,"karṇo","_","_","karṇa","NC","","_","_"
3,"hayān","_","_","haya","NC","","_","_"
4,"hatvā","_","_","han","CGDA","","_","_"
5,"śaraiḥ","_","_","śara","NC","","_","_"
6,"_","_","_","saṃna","PPP","","_","_"
7,"_","_","_","parvan","NC","","_","_"
1,"sārathiṃ","_","_","sārathi","NC","","_","_"
2,"_","_","_","ca","CCD","","_","_"
3,"_","_","_","ida","PRD","","_","_"
4,"bhallena","_","_","bhalla","NC","","_","_"
5,"drutaṃ","_","_","druta","CX","","_","_"
6,"ninye","_","_","nay","V","nī","_","_"
7,"_","_","_","yama","NC","","_","_"
8,"_","_","_","kṣaya","NC","","_","_"
1,"virathaḥ","_","_","viratha","JJ","","_","_"
2,"_","_","_","sahadeva","NC","","_","_"
3,"_","_","_","tu","CCD","","_","_"
4,"khaḍgaṃ","_","_","khaḍga","NC","","_","_"
5,"carma","_","_","carman","NC","","_","_"
6,"samādade","_","_","samādad","V","samādā","_","_"
1,"tad","_","_","tad","PRD","","_","_"
2,"_","_","_","api","CX","","_","_"
3,"_","_","_","ida","PRD","","_","_"
4,"śaraiḥ","_","_","śara","NC","","_","_"
5,"karṇo","_","_","karṇa","NC","","_","_"
6,"vyadhamat","_","_","vidha","V","vidha","_","_"
7,"prahasann","_","_","prahas","KDP","","_","_"
8,"iva","_","_","iva","CCM","","_","_"
1,"tato","_","_","tatas","CX","","_","_"
2,"gurvīṃ","_","_","guru","JJ","","_","_"
3,"_","_","_","mahat","JJ","","_","_"
4,"_","_","_","ghora","JJ","","_","_"
5,"_","_","_","heman","NC","","_","_"
6,"_","_","_","citra","JJ","","_","_"
7,"_","_","_","mahat","JJ","","_","_"
8,"_","_","_","gadā","NC","","_","_"
1,"preṣayāmāsa","_","_","preṣay","V","preṣay","_","_"
2,"samare","_","_","samara","NC","","_","_"
3,"_","_","_","vaikartana","NC","","_","_"
4,"_","_","_","ratha","NC","","_","_"
5,"prati","_","_","prati","CADP","","_","_"
1,"tām","_","_","tad","PRD","","_","_"
2,"āpatantīṃ","_","_","āpat","KDP","","_","_"
3,"sahasā","_","_","sahas","NC","","_","_"
4,"_","_","_","sahadeva","NC","","_","_"
5,"_","_","_","praverita","JJ","","_","_"
1,"_","_","_","viṣṭambhay","V","viṣṭambhay","_","_"
2,"_","_","_","śara","NC","","_","_"
3,"karṇo","_","_","karṇa","NC","","_","_"
4,"bhūmau","_","_","bhūmi","NC","","_","_"
5,"_","_","_","ca","CCD","","_","_"
6,"_","_","_","a","PRD","","_","_"
7,"apātayat","_","_","pātay","V","pātay","_","_"
1,"gadāṃ","_","_","gadā","NC","","_","_"
2,"vinihatāṃ","_","_","vinihan","PPP","","_","_"
3,"dṛṣṭvā","_","_","dṛś","CGDA","","_","_"
4,"_","_","_","sahadeva","NC","","_","_"
5,"_","_","_","tvarā","NC","","_","_"
6,"_","_","_","anvita","JJ","","_","_"
1,"śaktiṃ","_","_","śakti","NC","","_","_"
2,"cikṣepa","_","_","kṣip","V","kṣip","_","_"
3,"karṇāya","_","_","karṇa","NC","","_","_"
4,"tām","_","_","tad","PRD","","_","_"
5,"_","_","_","api","CX","","_","_"
6,"_","_","_","ida","PRD","","_","_"
7,"_","_","_","ācchid","V","ācchid","_","_"
8,"_","_","_","śara","NC","","_","_"
1,"_","_","_","sa_saha","CX","","_","_"
2,"_","_","_","sambhrama","NC","","_","_"
3,"_","_","_","tatas","CX","","_","_"
4,"_","_","_","tūrṇa","CX","","_","_"
5,"avaplutya","_","_","avaplu","CGDA","","_","_"
6,"_","_","_","ratha","NC","","_","_"
7,"_","_","_","uttama","JJ","","_","_"
1,"sahadevo","_","_","sahadeva","NC","","_","_"
2,"_","_","_","mahat","JJ","","_","_"
3,"_","_","_","rāja","NC","","_","_"
4,"dṛṣṭvā","_","_","dṛś","CGDA","","_","_"
5,"karṇaṃ","_","_","karṇa","NC","","_","_"
6,"vyavasthitam","_","_","vyavasthā","PPP","","_","_"
1,"_","_","_","ratha","NC","","_","_"
2,"_","_","_","cakra","NC","","_","_"
3,"tato","_","_","tatas","CX","","_","_"
4,"gṛhya","_","_","grah","CGDA","","_","_"
5,"_","_","_","muñc","V","muc","_","_"
6,"_","_","_","ādhirathi","NC","","_","_"
7,"prati","_","_","prati","CADP","","_","_"
1,"tam","_","_","tad","PRD","","_","_"
2,"āpatantaṃ","_","_","āpat","KDP","","_","_"
3,"sahasā","_","_","sahas","NC","","_","_"
4,"kālacakram","_","_","kālacakra","NC","","_","_"
5,"_","_","_","iva","CCM","","_","_"
6,"_","_","_","udya","PPP","","_","_"
1,"śarair","_","_","śara","NC","","_","_"
2,"_","_","_","aneka","JJ","","_","_"
3,"_","_","_","sāhasra","JJ","","_","_"
4,"achinat","_","_","chid","V","chid","_","_"
5,"sūtanandanaḥ","_","_","sūtanandana","NC","","_","_"
1,"_","_","_","tad","PRD","","_","_"
2,"_","_","_","tu","CCD","","_","_"
3,"vitathe","_","_","vitatha","JJ","","_","_"
4,"cakre","_","_","cakra","NC","","_","_"
5,"kṛte","_","_","kṛ","PPP","","_","_"
6,"tena","_","_","tad","PRD","","_","_"
7,"mahātmanā","_","_","mahātman","JJ","","_","_"
1,"_","_","_","vāray","KDP","","_","_"
2,"_","_","_","ca","CCD","","_","_"
3,"viśikhaiḥ","_","_","viśikha","NC","","_","_"
4,"sahadevo","_","_","sahadeva","NC","","_","_"
5,"raṇaṃ","_","_","raṇa","NC","","_","_"
6,"jahau","_","_","jah","V","hā","_","_"
1,"tam","_","_","tad","PRD","","_","_"
2,"abhidrutya","_","_","abhidru","CGDA","","_","_"
3,"rādheyo","_","_","rādheya","NC","","_","_"
4,"muhūrtād","_","_","muhūrta","NC","","_","_"
5,"_","_","_","bharata","NC","","_","_"
6,"_","_","_","ṛṣabha","NC","","_","_"
1,"abravīt","_","_","abravīta","V","brū","_","_"
2,"prahasan","_","_","prahas","KDP","","_","_"
3,"vākyaṃ","_","_","vākya","NC","","_","_"
4,"sahadevaṃ","_","_","sahadeva","NC","","_","_"
5,"viśāṃ","_","_","viś","NC","","_","_"
6,"pate","_","_","pati","NC","","_","_"
1,"mā","_","_","mā","CNG","","_","_"
2,"yudhyasva","_","_","yudh","V","yudh","_","_"
3,"raṇe","_","_","raṇa","NC","","_","_"
4,"vīra","_","_","vīra","NC","","_","_"
5,"viśiṣṭai","_","_","viśiṣ","PPP","","_","_"
6,"rathibhiḥ","_","_","rathin","NC","","_","_"
7,"saha","_","_","saha","CX","","_","_"
1,"sadṛśair","_","_","sadṛśa","JJ","","_","_"
2,"yudhya","_","_","yudh","V","yudh","_","_"
3,"mādreya","_","_","mādreya","NC","","_","_"
4,"vaco","_","_","vacas","NC","","_","_"
5,"me","_","_","mat","PPR","","_","_"
6,"mā","_","_","mā","CNG","","_","_"
7,"viśaṅkithāḥ","_","_","viśaṅk","V","viśaṅk","_","_"
1,"_","_","_","atha","CAD","","_","_"
2,"_","_","_","a","PRD","","_","_"
3,"dhanuṣo","_","_","dhanus","NC","","_","_"
4,"'greṇa","_","_","agra","NC","","_","_"
5,"tudan","_","_","tud","KDP","","_","_"
6,"bhūyo","_","_","bhūyas","CX","","_","_"
7,"'bravīd","_","_","abravīta","V","brū","_","_"
8,"vacaḥ","_","_","vacas","NC","","_","_"
1,"eṣo","_","_","tad","PRD","","_","_"
2,"'rjuno","_","_","arjuna","NC","","_","_"
3,"raṇe","_","_","raṇa","NC","","_","_"
4,"yatto","_","_","yat","PPP","","_","_"
5,"yudhyate","_","_","yudh","V","yudh","_","_"
6,"kurubhiḥ","_","_","kuru","NC","","_","_"
7,"saha","_","_","saha","CX","","_","_"
1,"tatra","_","_","tatra","CAD","","_","_"
2,"gacchasva","_","_","gacch","V","gam","_","_"
3,"mādreya","_","_","mādreya","NC","","_","_"
4,"gṛhaṃ","_","_","gṛha","NC","","_","_"
5,"vā","_","_","vā","CCD","","_","_"
6,"yadi","_","_","yadi","CSB","","_","_"
7,"manyase","_","_","man","V","man","_","_"
1,"evam","_","_","eva","CX","","_","_"
2,"uktvā","_","_","vac","CGDA","","_","_"
3,"tu","_","_","tu","CCD","","_","_"
4,"taṃ","_","_","tad","PRD","","_","_"
5,"karṇo","_","_","karṇa","NC","","_","_"
6,"rathena","_","_","ratha","NC","","_","_"
7,"rathināṃ","_","_","rathin","NC","","_","_"
8,"varaḥ","_","_","vara","JJ","","_","_"
1,"prāyāt","_","_","prayā","V","prayā","_","_"
2,"_","_","_","pāñcāla","NC","","_","_"
3,"_","_","_","pāṇḍu","NC","","_","_"
4,"sainyāni","_","_","sainya","NC","","_","_"
5,"prahasann","_","_","prahas","KDP","","_","_"
6,"iva","_","_","iva","CCM","","_","_"
1,"_","_","_","vadha","NC","","_","_"
2,"_","_","_","prāp","PPP","","_","_"
3,"tu","_","_","tu","CCD","","_","_"
4,"mādreyaṃ","_","_","mādreya","NC","","_","_"
5,"_","_","_","na","CNG","","_","_"
6,"_","_","_","vadh","V","vadh","_","_"
7,"samare","_","_","samara","NC","","_","_"
8,"_","_","_","ari","NC","","_","_"
9,"_","_","_","han","JJ","","_","_"
1,"kuntyāḥ","_","_","kuntī","NC","","_","_"
2,"smṛtvā","_","_","smṛ","CGDA","","_","_"
3,"vaco","_","_","vacas","NC","","_","_"
4,"rājan","_","_","rājan","NC","","_","_"
5,"_","_","_","satya","JJ","","_","_"
6,"_","_","_","saṃdhā","NC","","_","_"
7,"_","_","_","mahat","JJ","","_","_"
8,"_","_","_","ratha","NC","","_","_"
1,"_","_","_","sahadeva","NC","","_","_"
2,"_","_","_","tatas","CX","","_","_"
3,"rājan","_","_","rājan","NC","","_","_"
4,"vimanāḥ","_","_","vimanas","JJ","","_","_"
5,"_","_","_","śara","NC","","_","_"
6,"_","_","_","pīḍay","PPP","","_","_"
1,"_","_","_","karṇa","NC","","_","_"
2,"_","_","_","vāc","NC","","_","_"
3,"_","_","_","śalya","NC","","_","_"
4,"_","_","_","tap","PPP","","_","_"
5,"_","_","_","ca","CCD","","_","_"
6,"_","_","_","jīvita","NC","","_","_"
7,"_","_","_","nirvid","V","nirvid","_","_"
1,"āruroha","_","_","āroh","V","āruh","_","_"
2,"rathaṃ","_","_","ratha","NC","","_","_"
3,"_","_","_","ca","CCD","","_","_"
4,"_","_","_","api","CX","","_","_"
5,"pāñcālyasya","_","_","pāñcālya","JJ","","_","_"
6,"mahātmanaḥ","_","_","mahātman","JJ","","_","_"
1,"janamejayasya","_","_","janamejaya","NC","","_","_"
2,"samare","_","_","samara","NC","","_","_"
3,"_","_","_","tvarā","NC","","_","_"
4,"_","_","_","yuj","PPP","","_","_"
5,"_","_","_","mahat","JJ","","_","_"
6,"_","_","_","ratha","NC","","_","_"
1,"virāṭaṃ","_","_","virāṭa","NC","","_","_"
2,"_","_","_","saha","CX","","_","_"
3,"_","_","_","senā","NC","","_","_"
4,"tu","_","_","tu","CCD","","_","_"
5,"_","_","_","droṇa","NC","","_","_"
6,"_","_","_","artha","NC","","_","_"
7,"drutam","_","_","druta","CX","","_","_"
8,"āgatam","_","_","āga","PPP","","_","_"
1,"_","_","_","madra","NC","","_","_"
2,"_","_","_","rāja","NC","","_","_"
3,"_","_","_","śara","NC","","_","_"
4,"_","_","_","ogha","NC","","_","_"
5,"chādayāmāsa","_","_","chāday","V","chāday","_","_"
6,"dhanvinam","_","_","dhanvin","JJ","","_","_"
1,"tayoḥ","_","_","tad","PRD","","_","_"
2,"samabhavad","_","_","sambhav","V","sambhū","_","_"
3,"yuddhaṃ","_","_","yuddha","NC","","_","_"
4,"samare","_","_","samara","NC","","_","_"
5,"_","_","_","dṛḍha","JJ","","_","_"
6,"_","_","_","dhanvin","JJ","","_","_"
1,"yādṛśaṃ","_","_","yādṛśa","JJ","","_","_"
2,"_","_","_","hi","CX","","_","_"
3,"_","_","_","bhav","V","bhū","_","_"
4,"rājañ","_","_","rājan","NC","","_","_"
5,"_","_","_","jambha","NC","","_","_"
6,"_","_","_","vāsava","NC","","_","_"
7,"purā","_","_","purā","CX","","_","_"
1,"_","_","_","madra","NC","","_","_"
2,"_","_","_","rāja","NC","","_","_"
3,"_","_","_","mahat","JJ","","_","_"
4,"_","_","_","rāja","NC","","_","_"
5,"virāṭaṃ","_","_","virāṭa","NC","","_","_"
6,"vāhinīpatim","_","_","vāhinīpati","NC","","_","_"
1,"ājaghne","_","_","āhan","V","āhan","_","_"
2,"tvaritaṃ","_","_","tvarita","CX","","_","_"
3,"tīkṣṇaiḥ","_","_","tīkṣṇa","JJ","","_","_"
4,"śatena","_","_","śata","NUM","","_","_"
5,"_","_","_","na","PPP","","_","_"
6,"_","_","_","parvan","NC","","_","_"
1,"prativivyādha","_","_","prativyadh","V","prativyadh","_","_"
2,"taṃ","_","_","tad","PRD","","_","_"
3,"rājā","_","_","rājan","NC","","_","_"
4,"navabhir","_","_","navan","NUM","","_","_"
5,"niśitaiḥ","_","_","niśā","PPP","","_","_"
6,"śaraiḥ","_","_","śara","NC","","_","_"
1,"_","_","_","punar","CAD","","_","_"
2,"_","_","_","ca","CCD","","_","_"
3,"_","_","_","eva","CEM","","_","_"
4,"trisaptatyā","_","_","trisaptati","NC","","_","_"
5,"_","_","_","bhūyas","CX","","_","_"
6,"_","_","_","ca","CCD","","_","_"
7,"_","_","_","eva","CEM","","_","_"
8,"śatena","_","_","śata","NUM","","_","_"
9,"ha","_","_","ha","CEM","","_","_"
1,"tasya","_","_","tad","PRD","","_","_"
2,"_","_","_","madra","NC","","_","_"
3,"_","_","_","adhipa","NC","","_","_"
4,"hatvā","_","_","han","CGDA","","_","_"
5,"caturo","_","_","catur","NUM","","_","_"
6,"_","_","_","ratha","NC","","_","_"
7,"_","_","_","vājin","NC","","_","_"
1,"sūtaṃ","_","_","sūta","NC","","_","_"
2,"dhvajaṃ","_","_","dhvaja","NC","","_","_"
3,"ca","_","_","ca","CCD","","_","_"
4,"samare","_","_","samara","NC","","_","_"
5,"rathopasthād","_","_","rathopastha","NC","","_","_"
6,"apātayat","_","_","pātay","V","pātay","_","_"
1,"_","_","_","han","PPP","","_","_"
2,"_","_","_","aśva","NC","","_","_"
3,"tu","_","_","tu","CCD","","_","_"
4,"rathāt","_","_","ratha","NC","","_","_"
5,"tūrṇam","_","_","tūrṇa","CX","","_","_"
6,"avaplutya","_","_","avaplu","CGDA","","_","_"
7,"_","_","_","mahat","JJ","","_","_"
8,"_","_","_","ratha","NC","","_","_"
1,"tasthau","_","_","tiṣṭh","V","sthā","_","_"
2,"_","_","_","visphāray","KDP","","_","_"
3,"_","_","_","cāpa","NC","","_","_"
4,"_","_","_","vimuc","KDP","","_","_"
5,"_","_","_","ca","CCD","","_","_"
6,"śitāñ","_","_","śā","PPP","","_","_"
7,"śarān","_","_","śara","NC","","_","_"
1,"_","_","_","śatānīka","NC","","_","_"
2,"_","_","_","tatas","CX","","_","_"
3,"dṛṣṭvā","_","_","dṛś","CGDA","","_","_"
4,"bhrātaraṃ","_","_","bhrātṛ","NC","","_","_"
5,"_","_","_","han","PPP","","_","_"
6,"_","_","_","vāhana","NC","","_","_"
1,"_","_","_","ratha","NC","","_","_"
2,"_","_","_","abhipat","V","abhipat","_","_"
3,"tūrṇaṃ","_","_","tūrṇa","CX","","_","_"
4,"_","_","_","sarva","JQ","","_","_"
5,"_","_","_","loka","NC","","_","_"
6,"paśyataḥ","_","_","dṛś","KDP","","_","_"
1,"śatānīkam","_","_","śatānīka","NC","","_","_"
2,"_","_","_","atha","CAD","","_","_"
3,"_","_","_","āyā","KDP","","_","_"
4,"_","_","_","madra","NC","","_","_"
5,"_","_","_","rāja","NC","","_","_"
6,"_","_","_","mahat","JJ","","_","_"
7,"_","_","_","mṛdha","NC","","_","_"
1,"viśikhair","_","_","viśikha","NC","","_","_"
2,"bahubhir","_","_","bahu","JJ","","_","_"
3,"viddhvā","_","_","vyadh","CGDA","","_","_"
4,"tato","_","_","tatas","CX","","_","_"
5,"ninye","_","_","nay","V","nī","_","_"
6,"_","_","_","yama","NC","","_","_"
7,"_","_","_","kṣaya","NC","","_","_"
1,"_","_","_","tad","PRD","","_","_"
2,"_","_","_","tu","CCD","","_","_"
3,"nihate","_","_","nihan","PPP","","_","_"
4,"vīre","_","_","vīra","NC","","_","_"
5,"virāṭo","_","_","virāṭa","NC","","_","_"
6,"_","_","_","ratha","NC","","_","_"
7,"_","_","_","sattama","JJ","","_","_"
1,"āruroha","_","_","āroh","V","āruh","_","_"
2,"rathaṃ","_","_","ratha","NC","","_","_"
3,"tūrṇaṃ","_","_","tūrṇa","CX","","_","_"
4,"tam","_","_","tad","PRD","","_","_"
5,"eva","_","_","eva","CEM","","_","_"
6,"_","_","_","dhvaja","NC","","_","_"
7,"_","_","_","mālin","JJ","","_","_"
1,"tato","_","_","tatas","CX","","_","_"
2,"visphārya","_","_","visphāray","CGDA","","_","_"
3,"nayane","_","_","nayana","NC","","_","_"
4,"krodhād","_","_","krodha","NC","","_","_"
5,"_","_","_","dviguṇa","JJ","","_","_"
6,"_","_","_","vikrama","NC","","_","_"
1,"_","_","_","madra","NC","","_","_"
2,"_","_","_","rājan","NC","","_","_"
3,"_","_","_","ratha","NC","","_","_"
4,"tūrṇaṃ","_","_","tūrṇa","CX","","_","_"
5,"chādayāmāsa","_","_","chāday","V","chāday","_","_"
6,"patribhiḥ","_","_","pattrin","NC","","_","_"
1,"tato","_","_","tatas","CX","","_","_"
2,"_","_","_","madra","NC","","_","_"
3,"_","_","_","adhipa","NC","","_","_"
4,"kruddhaḥ","_","_","krudh","PPP","","_","_"
5,"śatena","_","_","śata","NUM","","_","_"
6,"_","_","_","na","PPP","","_","_"
7,"_","_","_","parvan","NC","","_","_"
1,"_","_","_","āhan","V","āhan","_","_"
2,"_","_","_","uras","NC","","_","_"
3,"dṛḍhaṃ","_","_","dṛḍha","CX","","_","_"
4,"virāṭaṃ","_","_","virāṭa","NC","","_","_"
5,"vāhinīpatim","_","_","vāhinīpati","NC","","_","_"
1,"so","_","_","tad","PRD","","_","_"
2,"'tividdho","_","_","ativyadh","PPP","","_","_"
3,"_","_","_","mahat","JJ","","_","_"
4,"_","_","_","rāja","NC","","_","_"
5,"rathopastha","_","_","rathopastha","NC","","_","_"
6,"upāviśat","_","_","upaviś","V","upaviś","_","_"
1,"kaśmalaṃ","_","_","kaśmala","NC","","_","_"
2,"_","_","_","ca","CCD","","_","_"
3,"_","_","_","viś","V","viś","_","_"
4,"tīvraṃ","_","_","tīvra","JJ","","_","_"
5,"virāṭo","_","_","virāṭa","NC","","_","_"
6,"_","_","_","bharata","NC","","_","_"
7,"_","_","_","ṛṣabha","NC","","_","_"
1,"_","_","_","sārathi","NC","","_","_"
2,"_","_","_","tad","PRD","","_","_"
3,"apovāha","_","_","apavah","V","apavah","_","_"
4,"samare","_","_","samara","NC","","_","_"
5,"_","_","_","śara","NC","","_","_"
6,"_","_","_","vikṣan","PPP","","_","_"
1,"tataḥ","_","_","tatas","CX","","_","_"
2,"sā","_","_","tad","PRD","","_","_"
3,"mahatī","_","_","mahat","JJ","","_","_"
4,"senā","_","_","senā","NC","","_","_"
5,"_","_","_","pradru","V","pradru","_","_"
6,"_","_","_","niś","NC","","_","_"
7,"bhārata","_","_","bhārata","NC","","_","_"
1,"vadhyamānā","_","_","vadh","KDP","","_","_"
2,"_","_","_","śara","NC","","_","_"
3,"_","_","_","śata","NUM","","_","_"
4,"_","_","_","śalya","NC","","_","_"
5,"_","_","_","āhava","NC","","_","_"
6,"_","_","_","śobhin","JJ","","_","_"
1,"tāṃ","_","_","tad","PRD","","_","_"
2,"dṛṣṭvā","_","_","dṛś","CGDA","","_","_"
3,"vidrutāṃ","_","_","vidru","PPP","","_","_"
4,"senāṃ","_","_","senā","NC","","_","_"
5,"_","_","_","vāsudeva","NC","","_","_"
6,"_","_","_","dhanaṃjaya","NC","","_","_"
1,"prāyātāṃ","_","_","prayā","V","prayā","_","_"
2,"tatra","_","_","tatra","CAD","","_","_"
3,"_","_","_","rājan","NC","","_","_"
4,"_","_","_","indra","NC","","_","_"
5,"yatra","_","_","yatra","CX","","_","_"
6,"śalyo","_","_","śalya","NC","","_","_"
7,"vyavasthitaḥ","_","_","vyavasthā","PPP","","_","_"
1,"tau","_","_","tad","PRD","","_","_"
2,"tu","_","_","tu","CCD","","_","_"
3,"pratyudyayau","_","_","pratyudyā","V","pratyudyā","_","_"
4,"rājan","_","_","rājan","NC","","_","_"
5,"_","_","_","rākṣasa","NC","","_","_"
6,"_","_","_","indra","NC","","_","_"
7,"_","_","_","hi","CX","","_","_"
8,"_","_","_","alambuṣa","NC","","_","_"
1,"_","_","_","aṣṭan","NUM","","_","_"
2,"_","_","_","cakra","NC","","_","_"
3,"_","_","_","samāyuj","PPP","","_","_"
4,"āsthāya","_","_","āsthā","CGDA","","_","_"
5,"pravaraṃ","_","_","pravara","JJ","","_","_"
6,"ratham","_","_","ratha","NC","","_","_"
1,"_","_","_","turaṃgama","NC","","_","_"
2,"_","_","_","mukha","NC","","_","_"
3,"yuktaṃ","_","_","yuj","PPP","","_","_"
4,"piśācair","_","_","piśāca","NC","","_","_"
5,"_","_","_","ghora","JJ","","_","_"
6,"_","_","_","darśana","NC","","_","_"
1,"_","_","_","lohita","NC","","_","_"
2,"_","_","_","ārdra","JJ","","_","_"
3,"_","_","_","patākā","NC","","_","_"
4,"taṃ","_","_","tad","PRD","","_","_"
5,"_","_","_","rakta","JJ","","_","_"
6,"_","_","_","mālya","NC","","_","_"
7,"_","_","_","vibhūṣay","PPP","","_","_"
1,"_","_","_","kārṣṇāyasa","NC","","_","_"
2,"_","_","_","maya","JJ","","_","_"
3,"ghoram","_","_","ghora","JJ","","_","_"
4,"_","_","_","ṛkṣa","NC","","_","_"
5,"_","_","_","carman","NC","","_","_"
6,"_","_","_","āvṛ","PPP","","_","_"
7,"mahat","_","_","mahat","JJ","","_","_"
1,"raudreṇa","_","_","raudra","JJ","","_","_"
2,"_","_","_","citra","JJ","","_","_"
3,"_","_","_","pakṣa","NC","","_","_"
4,"_","_","_","vivṛ","PPP","","_","_"
5,"_","_","_","akṣa","NC","","_","_"
6,"kūjatā","_","_","kūj","KDP","","_","_"
1,"_","_","_","dhvaja","NC","","_","_"
2,"_","_","_","ucchri","PPP","","_","_"
3,"_","_","_","tuṇḍa","NC","","_","_"
4,"_","_","_","gṛdhra","NC","","_","_"
5,"_","_","_","rāja","NC","","_","_"
6,"rājatā","_","_","rāj","KDP","","_","_"
1,"sa","_","_","tad","PRD","","_","_"
2,"babhau","_","_","bhā","V","bhā","_","_"
3,"rākṣaso","_","_","rākṣasa","NC","","_","_"
4,"rājan","_","_","rājan","NC","","_","_"
5,"_","_","_","bhinnāñjana","NC","","_","_"
6,"_","_","_","caya","NC","","_","_"
7,"_","_","_","upama","JJ","","_","_"
1,"_","_","_","rudh","V","rudh","_","_"
2,"_","_","_","arjuna","NC","","_","_"
3,"āyāntaṃ","_","_","āyā","KDP","","_","_"
4,"prabhañjanam","_","_","prabhañjana","NC","","_","_"
5,"_","_","_","iva","CCM","","_","_"
6,"_","_","_","adrirāj","NC","","_","_"
1,"kiran","_","_","kṛ","KDP","","_","_"
2,"_","_","_","bāṇa","NC","","_","_"
3,"_","_","_","gaṇa","NC","","_","_"
4,"rājañ","_","_","rājan","NC","","_","_"
5,"śataśo","_","_","śataśas","CX","","_","_"
6,"_","_","_","arjuna","NC","","_","_"
7,"_","_","_","mūrdhan","NC","","_","_"
1,"_","_","_","ati","CADP","","_","_"
2,"_","_","_","tīvra","JJ","","_","_"
3,"abhūd","_","_","bhav","V","bhū","_","_"
4,"yuddhaṃ","_","_","yuddha","NC","","_","_"
5,"_","_","_","nara","NC","","_","_"
6,"_","_","_","rākṣasa","NC","","_","_"
7,"mṛdhe","_","_","mṛdha","NC","","_","_"
1,"draṣṭṝṇāṃ","_","_","draṣṭṛ","JJ","","_","_"
2,"_","_","_","prīti","NC","","_","_"
3,"_","_","_","janana","JJ","","_","_"
4,"sarveṣāṃ","_","_","sarva","JQ","","_","_"
5,"_","_","_","bharata","NC","","_","_"
6,"_","_","_","ṛṣabha","NC","","_","_"
1,"tam","_","_","tad","PRD","","_","_"
2,"arjunaḥ","_","_","arjuna","NC","","_","_"
3,"_","_","_","śata","NUM","","_","_"
4,"_","_","_","eva","CEM","","_","_"
5,"patriṇām","_","_","pattrin","NC","","_","_"
6,"abhyatāḍayat","_","_","abhitāḍay","V","abhitāḍay","_","_"
1,"_","_","_","navan","NUM","","_","_"
2,"_","_","_","ca","CCD","","_","_"
3,"śitair","_","_","śā","PPP","","_","_"
4,"_","_","_","bāṇa","NC","","_","_"
5,"_","_","_","chid","V","chid","_","_"
6,"dhvajam","_","_","dhvaja","NC","","_","_"
7,"ucchritam","_","_","ucchri","PPP","","_","_"
1,"sārathiṃ","_","_","sārathi","NC","","_","_"
2,"ca","_","_","ca","CCD","","_","_"
3,"tribhir","_","_","tri","NUM","","_","_"
4,"_","_","_","bāṇa","NC","","_","_"
5,"_","_","_","tri","NUM","","_","_"
6,"eva","_","_","eva","CEM","","_","_"
7,"triveṇukam","_","_","triveṇuka","NC","","_","_"
1,"dhanur","_","_","dhanus","NC","","_","_"
2,"ekena","_","_","eka","PPX","","_","_"
3,"cicheda","_","_","chid","V","chid","_","_"
4,"_","_","_","catur","NUM","","_","_"
5,"_","_","_","catur","NUM","","_","_"
6,"hayān","_","_","haya","NC","","_","_"
1,"_","_","_","viratha","JJ","","_","_"
2,"_","_","_","udya","PPP","","_","_"
3,"khaḍgaṃ","_","_","khaḍga","NC","","_","_"
4,"_","_","_","śara","NC","","_","_"
5,"_","_","_","ida","PRD","","_","_"
6,"_","_","_","dvidhā","CX","","_","_"
7,"_","_","_","ācchid","V","ācchid","_","_"
1,"_","_","_","atha","CAD","","_","_"
2,"_","_","_","a","PRD","","_","_"
3,"niśitair","_","_","niśā","PPP","","_","_"
4,"_","_","_","bāṇa","NC","","_","_"
5,"_","_","_","catur","NUM","","_","_"
6,"_","_","_","bharata","NC","","_","_"
7,"_","_","_","ṛṣabha","NC","","_","_"
1,"pārtho","_","_","pārtha","NC","","_","_"
2,"'rdayad","_","_","arday","V","arday","_","_"
3,"_","_","_","rākṣasa","NC","","_","_"
4,"_","_","_","indra","NC","","_","_"
5,"sa","_","_","tad","PRD","","_","_"
6,"viddhaḥ","_","_","vyadh","PPP","","_","_"
7,"prādravad","_","_","pradru","V","pradru","_","_"
8,"bhayāt","_","_","bhaya","NC","","_","_"
1,"taṃ","_","_","tad","PRD","","_","_"
2,"_","_","_","viji","CGDA","","_","_"
3,"_","_","_","arjuna","NC","","_","_"
4,"_","_","_","tūrṇa","CX","","_","_"
5,"_","_","_","droṇa","NC","","_","_"
6,"_","_","_","antika","NC","","_","_"
7,"upāyayau","_","_","upāyā","V","upāyā","_","_"
1,"kirañ","_","_","kṛ","KDP","","_","_"
2,"_","_","_","śara","NC","","_","_"
3,"_","_","_","gaṇa","NC","","_","_"
4,"_","_","_","rājan","NC","","_","_"
5,"_","_","_","nara","NC","","_","_"
6,"_","_","_","vāraṇa","NC","","_","_"
7,"_","_","_","vājin","NC","","_","_"
1,"vadhyamānā","_","_","vadh","KDP","","_","_"
2,"_","_","_","mahat","JJ","","_","_"
3,"_","_","_","rāja","NC","","_","_"
4,"pāṇḍavena","_","_","pāṇḍava","NC","","_","_"
5,"yaśasvinā","_","_","yaśasvin","JJ","","_","_"
1,"sainikā","_","_","sainika","NC","","_","_"
2,"nyapatann","_","_","nipat","V","nipat","_","_"
3,"urvyāṃ","_","_","urvī","NC","","_","_"
4,"_","_","_","vāta","NC","","_","_"
5,"_","_","_","nud","PPP","","_","_"
6,"iva","_","_","iva","CCM","","_","_"
7,"drumāḥ","_","_","druma","NC","","_","_"
1,"teṣu","_","_","tad","PRD","","_","_"
2,"_","_","_","tu","CCD","","_","_"
3,"_","_","_","utsāday","KDP","","_","_"
4,"phalgunena","_","_","phalguna","NC","","_","_"
5,"mahātmanā","_","_","mahātman","JJ","","_","_"
1,"samprādravad","_","_","sampradru","V","sampradru","_","_"
2,"balaṃ","_","_","bala","NC","","_","_"
3,"sarvaṃ","_","_","sarva","JQ","","_","_"
4,"putrāṇāṃ","_","_","putra","NC","","_","_"
5,"te","_","_","tvat","PPR","","_","_"
6,"viśāṃ","_","_","viś","NC","","_","_"
7,"pate","_","_","pati","NC","","_","_"
