"WordID","word","NormSTEM","suffix","lemma","PoS","Root","NormSuffix","NormWord"
1,"vaiśaṃpāyana","_","_","vaiśampāyana","NC","","_","_"
2,"uvāca","_","_","vak","V","vac","_","_"
1,"vyuṣitāyāṃ","_","_","vivas","PPP","","_","_"
2,"rajanyāṃ","_","_","rajanī","NC","","_","_"
3,"tu","_","_","tu","CCD","","_","_"
4,"rājā","_","_","rājan","NC","","_","_"
5,"_","_","_","duryodhana","NC","","_","_"
6,"_","_","_","tatas","CX","","_","_"
1,"vyabhajat","_","_","vibhaj","V","vibhaj","_","_"
2,"_","_","_","tad","PRD","","_","_"
3,"_","_","_","anīka","NC","","_","_"
4,"daśa","_","_","daśan","NUM","","_","_"
5,"_","_","_","ca","CCD","","_","_"
6,"_","_","_","eka","PPX","","_","_"
7,"ca","_","_","ca","CCD","","_","_"
8,"bhārata","_","_","bhārata","NC","","_","_"
1,"_","_","_","nara","NC","","_","_"
2,"_","_","_","hastin","NC","","_","_"
3,"_","_","_","ratha","NC","","_","_"
4,"_","_","_","aśva","NC","","_","_"
5,"sāraṃ","_","_","sāra","NC","","_","_"
6,"madhyaṃ","_","_","madhya","JJ","","_","_"
7,"ca","_","_","ca","CCD","","_","_"
8,"phalgu","_","_","phalgu","JJ","","_","_"
9,"ca","_","_","ca","CCD","","_","_"
1,"_","_","_","sarva","JQ","","_","_"
2,"_","_","_","tad","PRD","","_","_"
3,"_","_","_","anīka","NC","","_","_"
4,"saṃdideśa","_","_","saṃdiś","V","saṃdiś","_","_"
5,"mahīpatiḥ","_","_","mahīpati","NC","","_","_"
1,"_","_","_","sa_saha","CX","","_","_"
2,"_","_","_","anukarṣa","NC","","_","_"
3,"_","_","_","sa_saha","CX","","_","_"
4,"_","_","_","tūṇīra","NC","","_","_"
5,"_","_","_","sa_saha","CX","","_","_"
6,"_","_","_","varūtha","NC","","_","_"
7,"_","_","_","sa_saha","CX","","_","_"
8,"_","_","_","tomara","NC","","_","_"
1,"_","_","_","sa_saha","CX","","_","_"
2,"_","_","_","upāsaṅga","NC","","_","_"
3,"_","_","_","sa_saha","CX","","_","_"
4,"_","_","_","śaktīka","NC","","_","_"
5,"_","_","_","sa_saha","CX","","_","_"
6,"_","_","_","niṣaṅga","NC","","_","_"
7,"_","_","_","sa_saha","CX","","_","_"
8,"_","_","_","pothika","NC","","_","_"
1,"_","_","_","sa_saha","CX","","_","_"
2,"_","_","_","dhvaja","NC","","_","_"
3,"_","_","_","sa_saha","CX","","_","_"
4,"_","_","_","patākā","NC","","_","_"
5,"_","_","_","ca","CCD","","_","_"
6,"_","_","_","sa_saha","CX","","_","_"
7,"_","_","_","śarāsana","NC","","_","_"
8,"_","_","_","tomara","NC","","_","_"
1,"_","_","_","rajju","NC","","_","_"
2,"_","_","_","ca","CCD","","_","_"
3,"vicitrābhiḥ","_","_","vicitra","JJ","","_","_"
4,"_","_","_","sa_saha","CX","","_","_"
5,"_","_","_","pāśa","NC","","_","_"
6,"_","_","_","sa_saha","CX","","_","_"
7,"_","_","_","paristara","NC","","_","_"
1,"_","_","_","sa_saha","CX","","_","_"
2,"_","_","_","kaca","NC","","_","_"
3,"_","_","_","graha","NC","","_","_"
4,"_","_","_","vikṣepa","NC","","_","_"
5,"_","_","_","sa_saha","CX","","_","_"
6,"_","_","_","taila","NC","","_","_"
7,"_","_","_","guḍa","NC","","_","_"
8,"_","_","_","vālukā","NC","","_","_"
1,"_","_","_","sa_saha","CX","","_","_"
2,"_","_","_","āśīviṣa","NC","","_","_"
3,"_","_","_","ghaṭa","NC","","_","_"
4,"sarve","_","_","sarva","JQ","","_","_"
5,"_","_","_","sa_saha","CX","","_","_"
6,"_","_","_","sarjarasa","NC","","_","_"
7,"_","_","_","pāṃsu","NC","","_","_"
1,"_","_","_","sa_saha","CX","","_","_"
2,"_","_","_","ghaṇṭā","NC","","_","_"
3,"_","_","_","phalaka","NC","","_","_"
4,"sarve","_","_","sarva","JQ","","_","_"
5,"_","_","_","vāsi","NC","","_","_"
6,"_","_","_","vṛkṣādana","NC","","_","_"
7,"_","_","_","anvita","JJ","","_","_"
1,"_","_","_","vyāghra","NC","","_","_"
2,"_","_","_","carman","NC","","_","_"
3,"_","_","_","parīvāra","NC","","_","_"
4,"_","_","_","vṛ","PPP","","_","_"
5,"_","_","_","ca","CCD","","_","_"
6,"_","_","_","dvīpin","NC","","_","_"
7,"_","_","_","carman","NC","","_","_"
1,"_","_","_","sa_saha","CX","","_","_"
2,"_","_","_","vasti","NC","","_","_"
3,"_","_","_","sa_saha","CX","","_","_"
4,"_","_","_","śṛṅga","NC","","_","_"
5,"_","_","_","ca","CCD","","_","_"
6,"_","_","_","sa_saha","CX","","_","_"
7,"_","_","_","prāsa","NC","","_","_"
8,"_","_","_","vividha","JJ","","_","_"
9,"_","_","_","āyudha","NC","","_","_"
1,"_","_","_","sa_saha","CX","","_","_"
2,"_","_","_","kuṭhāra","NC","","_","_"
3,"_","_","_","sa_saha","CX","","_","_"
4,"_","_","_","kuddāla","NC","","_","_"
5,"_","_","_","sa_saha","CX","","_","_"
6,"_","_","_","taila","NC","","_","_"
7,"_","_","_","kṣauma","NC","","_","_"
8,"_","_","_","sarpis","NC","","_","_"
1,"_","_","_","citra","JJ","","_","_"
2,"_","_","_","anīka","NC","","_","_"
3,"_","_","_","su","CAD","","_","_"
4,"_","_","_","vapus","NC","","_","_"
5,"jvalitā","_","_","jval","PPP","","_","_"
6,"iva","_","_","iva","CCM","","_","_"
7,"pāvakāḥ","_","_","pāvaka","NC","","_","_"
1,"tathā","_","_","tathā","CX","","_","_"
2,"kavacinaḥ","_","_","kavacin","JJ","","_","_"
3,"śūrāḥ","_","_","śūra","NC","","_","_"
4,"śastreṣu","_","_","śastra","NC","","_","_"
5,"_","_","_","kṛ","PPP","","_","_"
6,"_","_","_","niśrama","NC","","_","_"
1,"kulīnā","_","_","kulīna","JJ","","_","_"
2,"_","_","_","haya","NC","","_","_"
3,"_","_","_","yoni","NC","","_","_"
4,"_","_","_","jña","JJ","","_","_"
5,"sārathye","_","_","sārathya","NC","","_","_"
6,"viniveśitāḥ","_","_","viniveśay","PPP","","_","_"
1,"_","_","_","bandh","PPP","","_","_"
2,"a","_","_","alpha_privativum","NC","","_","_"
2,"_","_","_","riṣṭa","NC","","_","_"
3,"_","_","_","bandh","PPP","","_","_"
4,"_","_","_","kakṣyā","NC","","_","_"
5,"_","_","_","bandh","PPP","","_","_"
6,"_","_","_","dhvaja","NC","","_","_"
7,"_","_","_","patākin","JJ","","_","_"
1,"_","_","_","catur","NUM","","_","_"
2,"_","_","_","yuj","NC","","_","_"
3,"rathāḥ","_","_","ratha","NC","","_","_"
4,"sarve","_","_","sarva","JQ","","_","_"
5,"sarve","_","_","sarva","JQ","","_","_"
6,"_","_","_","śastra","NC","","_","_"
7,"_","_","_","samāyuta","JJ","","_","_"
1,"_","_","_","saṃhṛṣ","PPP","","_","_"
2,"_","_","_","vāhana","NC","","_","_"
3,"sarve","_","_","sarva","JQ","","_","_"
4,"sarve","_","_","sarva","JQ","","_","_"
5,"_","_","_","śata","NUM","","_","_"
6,"_","_","_","śarāsana","NC","","_","_"
1,"dhuryayor","_","_","dhurya","NC","","_","_"
2,"hayayor","_","_","haya","NC","","_","_"
3,"_","_","_","eka","PPX","","_","_"
4,"_","_","_","tathā","CX","","_","_"
5,"_","_","_","anya","PPX","","_","_"
6,"pārṣṇisārathī","_","_","pārṣṇisārathi","NC","","_","_"
1,"tau","_","_","tad","PRD","","_","_"
2,"_","_","_","ca","CCD","","_","_"
3,"_","_","_","api","CX","","_","_"
4,"rathināṃ","_","_","rathin","NC","","_","_"
5,"śreṣṭhau","_","_","śreṣṭha","JJ","","_","_"
6,"rathī","_","_","rathin","NC","","_","_"
7,"ca","_","_","ca","CCD","","_","_"
8,"_","_","_","haya","NC","","_","_"
9,"_","_","_","vid","JJ","","_","_"
10,"tathā","_","_","tathā","CX","","_","_"
1,"_","_","_","nagara","NC","","_","_"
2,"_","_","_","iva","CCM","","_","_"
3,"guptāni","_","_","gup","PPP","","_","_"
4,"durādeyāni","_","_","durādeya","JJ","","_","_"
5,"śatrubhiḥ","_","_","śatru","NC","","_","_"
1,"āsan","_","_","as","V","as","_","_"
2,"_","_","_","ratha","NC","","_","_"
3,"_","_","_","sahasra","NUM","","_","_"
4,"_","_","_","heman","NC","","_","_"
5,"_","_","_","mālin","JJ","","_","_"
6,"sarvaśaḥ","_","_","sarvaśas","CX","","_","_"
1,"yathā","_","_","yathā","CCM","","_","_"
2,"_","_","_","ratha","NC","","_","_"
3,"_","_","_","tathā","CX","","_","_"
4,"nāgā","_","_","nāga","NC","","_","_"
5,"_","_","_","bandh","PPP","","_","_"
6,"_","_","_","kakṣyā","NC","","_","_"
7,"_","_","_","su","CAD","","_","_"
8,"_","_","_","alaṃkṛ","PPP","","_","_"
1,"babhūvuḥ","_","_","bhav","V","bhū","_","_"
2,"sapta","_","_","saptan","NUM","","_","_"
3,"puruṣā","_","_","puruṣa","NC","","_","_"
4,"ratnavanta","_","_","ratnavat","JJ","","_","_"
5,"_","_","_","iva","CCM","","_","_"
6,"_","_","_","adri","NC","","_","_"
1,"_","_","_","dvi","NUM","","_","_"
2,"_","_","_","aṅkuśa","NC","","_","_"
3,"_","_","_","dhara","JJ","","_","_"
4,"teṣu","_","_","tad","PRD","","_","_"
5,"_","_","_","dvi","NUM","","_","_"
6,"_","_","_","uttama","JJ","","_","_"
7,"_","_","_","dhanurdhara","NC","","_","_"
1,"dvau","_","_","dvi","NUM","","_","_"
2,"_","_","_","vara","JJ","","_","_"
3,"_","_","_","asi","NC","","_","_"
4,"_","_","_","dhara","JJ","","_","_"
5,"rājann","_","_","rājan","NC","","_","_"
6,"ekaḥ","_","_","eka","PPX","","_","_"
1,"gajair","_","_","gaja","NC","","_","_"
2,"mattaiḥ","_","_","mat","PPP","","_","_"
3,"samākīrṇaṃ","_","_","samākṛ","PPP","","_","_"
4,"_","_","_","sa_saha","CX","","_","_"
5,"_","_","_","varman","NC","","_","_"
6,"_","_","_","āyudha","NC","","_","_"
7,"_","_","_","kośaka","NC","","_","_"
1,"tad","_","_","tad","PRD","","_","_"
2,"babhūva","_","_","bhav","V","bhū","_","_"
3,"balaṃ","_","_","bala","NC","","_","_"
4,"rājan","_","_","rājan","NC","","_","_"
5,"kauravyasya","_","_","kauravya","NC","","_","_"
6,"sahasraśaḥ","_","_","sahasraśas","CX","","_","_"
1,"_","_","_","vicitra","JJ","","_","_"
2,"_","_","_","kavaca","NC","","_","_"
3,"_","_","_","āmuc","PPP","","_","_"
4,"_","_","_","sa_saha","CX","","_","_"
5,"_","_","_","patākā","NC","","_","_"
6,"_","_","_","su","CAD","","_","_"
7,"_","_","_","alaṃkṛ","PPP","","_","_"
1,"_","_","_","sādin","NC","","_","_"
2,"_","_","_","ca","CCD","","_","_"
3,"_","_","_","upasaṃpad","PPP","","_","_"
4,"āsann","_","_","as","V","as","_","_"
5,"ayutaśo","_","_","ayutaśas","CX","","_","_"
6,"hayāḥ","_","_","haya","NC","","_","_"
1,"_","_","_","su","CAD","","_","_"
2,"_","_","_","saṃgrāha","NC","","_","_"
3,"_","_","_","su","CAD","","_","_"
4,"_","_","_","saṃtoṣa","NC","","_","_"
5,"_","_","_","heman","NC","","_","_"
6,"_","_","_","bhāṇḍa","NC","","_","_"
7,"_","_","_","paricchada","NC","","_","_"
1,"_","_","_","aneka","JJ","","_","_"
2,"_","_","_","śata","NUM","","_","_"
3,"_","_","_","sāhasra","JJ","","_","_"
4,"_","_","_","tad","PRD","","_","_"
5,"ca","_","_","ca","CCD","","_","_"
6,"_","_","_","sādin","NC","","_","_"
7,"_","_","_","vaśa","NC","","_","_"
8,"sthitāḥ","_","_","sthā","PPP","","_","_"
1,"_","_","_","nānā","CX","","_","_"
2,"_","_","_","rūpa","NC","","_","_"
3,"_","_","_","vikāra","NC","","_","_"
4,"_","_","_","ca","CCD","","_","_"
5,"_","_","_","nānā","CX","","_","_"
6,"_","_","_","kavaca","NC","","_","_"
7,"_","_","_","śastrin","JJ","","_","_"
1,"padātino","_","_","padātin","NC","","_","_"
2,"_","_","_","nara","NC","","_","_"
3,"_","_","_","tatra","CAD","","_","_"
4,"babhūvur","_","_","bhav","V","bhū","_","_"
5,"_","_","_","heman","NC","","_","_"
6,"_","_","_","mālin","JJ","","_","_"
1,"_","_","_","ratha","NC","","_","_"
2,"_","_","_","as","V","as","_","_"
3,"daśa","_","_","daśan","NUM","","_","_"
4,"gajā","_","_","gaja","NC","","_","_"
5,"gajasya","_","_","gaja","NC","","_","_"
6,"daśa","_","_","daśan","NUM","","_","_"
7,"vājinaḥ","_","_","vājin","NC","","_","_"
1,"narā","_","_","nara","NC","","_","_"
2,"daśa","_","_","daśan","NUM","","_","_"
3,"_","_","_","haya","NC","","_","_"
4,"_","_","_","as","V","as","_","_"
5,"pādarakṣāḥ","_","_","pādarakṣa","NC","","_","_"
6,"samantataḥ","_","_","samantataḥ","CX","","_","_"
1,"rathasya","_","_","ratha","NC","","_","_"
2,"nāgāḥ","_","_","nāga","NC","","_","_"
3,"_","_","_","pañcāśat","NC","","_","_"
4,"_","_","_","nāga","NC","","_","_"
5,"_","_","_","as","V","as","_","_"
6,"śataṃ","_","_","śata","NUM","","_","_"
7,"hayāḥ","_","_","haya","NC","","_","_"
1,"hayasya","_","_","haya","NC","","_","_"
2,"puruṣāḥ","_","_","puruṣa","NC","","_","_"
3,"sapta","_","_","saptan","NUM","","_","_"
4,"_","_","_","bhid","PPP","","_","_"
5,"_","_","_","saṃdhāna","NC","","_","_"
6,"_","_","_","kārin","JJ","","_","_"
1,"senā","_","_","senā","NC","","_","_"
2,"_","_","_","pañcan","NUM","","_","_"
3,"_","_","_","śata","NUM","","_","_"
4,"nāgā","_","_","nāga","NC","","_","_"
5,"_","_","_","ratha","NC","","_","_"
6,"_","_","_","tāvat","JJ","","_","_"
7,"eva","_","_","eva","CEM","","_","_"
8,"ca","_","_","ca","CCD","","_","_"
1,"_","_","_","daśan","NUM","","_","_"
2,"_","_","_","senā","NC","","_","_"
3,"ca","_","_","ca","CCD","","_","_"
4,"pṛtanā","_","_","pṛtanā","NC","","_","_"
5,"pṛtanā","_","_","pṛtanā","NC","","_","_"
6,"_","_","_","daśan","NUM","","_","_"
7,"_","_","_","vāhinī","NC","","_","_"
1,"vāhinī","_","_","vāhinī","NC","","_","_"
2,"pṛtanā","_","_","pṛtanā","NC","","_","_"
3,"senā","_","_","senā","NC","","_","_"
4,"dhvajinī","_","_","dhvajinī","NC","","_","_"
5,"sādinī","_","_","sādin","JJ","","_","_"
6,"camūḥ","_","_","camū","NC","","_","_"
1,"_","_","_","akṣauhiṇī","NC","","_","_"
2,"_","_","_","iti","CQT","","_","_"
3,"paryāyair","_","_","paryāya","NC","","_","_"
4,"_","_","_","nirvac","PPP","","_","_"
5,"_","_","_","atha","CAD","","_","_"
6,"varūthinī","_","_","varūthinī","NC","","_","_"
1,"evaṃ","_","_","eva","CX","","_","_"
2,"_","_","_","vyūh","PPP","","_","_"
3,"_","_","_","anīka","NC","","_","_"
4,"kauraveyeṇa","_","_","kauraveya","NC","","_","_"
5,"dhīmatā","_","_","dhīmat","JJ","","_","_"
1,"akṣauhiṇyo","_","_","akṣauhiṇī","NC","","_","_"
2,"_","_","_","daśan","NUM","","_","_"
3,"_","_","_","eka","PPX","","_","_"
4,"ca","_","_","ca","CCD","","_","_"
5,"saṃkhyātāḥ","_","_","saṃkhyā","PPP","","_","_"
6,"sapta","_","_","saptan","NUM","","_","_"
7,"_","_","_","ca","CCD","","_","_"
8,"_","_","_","eva","CEM","","_","_"
9,"ha","_","_","ha","CEM","","_","_"
1,"_","_","_","akṣauhiṇī","NC","","_","_"
2,"_","_","_","tu","CCD","","_","_"
3,"_","_","_","saptan","NUM","","_","_"
4,"_","_","_","eva","CEM","","_","_"
5,"pāṇḍavānām","_","_","pāṇḍava","NC","","_","_"
6,"abhūd","_","_","bhav","V","bhū","_","_"
7,"balam","_","_","bala","NC","","_","_"
1,"akṣauhiṇyo","_","_","akṣauhiṇī","NC","","_","_"
2,"_","_","_","daśan","NUM","","_","_"
3,"_","_","_","eka","PPX","","_","_"
4,"ca","_","_","ca","CCD","","_","_"
5,"kauravāṇām","_","_","kaurava","NC","","_","_"
6,"abhūd","_","_","bhav","V","bhū","_","_"
7,"balam","_","_","bala","NC","","_","_"
1,"narāṇāṃ","_","_","nara","NC","","_","_"
2,"_","_","_","pañcan","NUM","","_","_"
3,"_","_","_","pañcāśat","NC","","_","_"
4,"eṣā","_","_","tad","PRD","","_","_"
5,"pattir","_","_","patti","NC","","_","_"
6,"vidhīyate","_","_","vidadh","V","vidhā","_","_"
1,"_","_","_","senā","NC","","_","_"
2,"_","_","_","mukha","NC","","_","_"
3,"ca","_","_","ca","CCD","","_","_"
4,"_","_","_","tri","NUM","","_","_"
5,"_","_","_","tad","PRD","","_","_"
6,"gulma","_","_","gulma","NC","","_","_"
7,"_","_","_","iti","CQT","","_","_"
8,"_","_","_","abhisaṃjñita","JJ","","_","_"
1,"daśa","_","_","daśan","NUM","","_","_"
2,"gulmā","_","_","gulma","NC","","_","_"
3,"_","_","_","gaṇa","NC","","_","_"
4,"_","_","_","tu","CCD","","_","_"
5,"_","_","_","as","V","as","_","_"
6,"_","_","_","gaṇa","NC","","_","_"
7,"_","_","_","tu","CCD","","_","_"
8,"_","_","_","ayutaśas","CX","","_","_"
9,"'bhavan","_","_","bhav","V","bhū","_","_"
1,"duryodhanasya","_","_","duryodhana","NC","","_","_"
2,"senāsu","_","_","senā","NC","","_","_"
3,"yotsyamānāḥ","_","_","yudh","KDP","","_","_"
4,"prahāriṇaḥ","_","_","prahārin","JJ","","_","_"
1,"tatra","_","_","tatra","CAD","","_","_"
2,"duryodhano","_","_","duryodhana","NC","","_","_"
3,"rājā","_","_","rājan","NC","","_","_"
4,"śūrān","_","_","śūra","NC","","_","_"
5,"buddhimato","_","_","buddhimat","JJ","","_","_"
6,"narān","_","_","nara","NC","","_","_"
1,"prasamīkṣya","_","_","prasamīkṣ","CGDA","","_","_"
2,"_","_","_","mahat","JJ","","_","_"
3,"_","_","_","bāhu","NC","","_","_"
4,"_","_","_","kar","V","kṛ","_","_"
5,"_","_","_","senāpati","NC","","_","_"
6,"_","_","_","tadā","CAD","","_","_"
1,"pṛthag","_","_","pṛthak","CX","","_","_"
2,"akṣauhiṇīnāṃ","_","_","akṣauhiṇī","NC","","_","_"
3,"ca","_","_","ca","CCD","","_","_"
4,"_","_","_","praṇetṛ","NC","","_","_"
5,"_","_","_","nara","NC","","_","_"
6,"_","_","_","sattama","JJ","","_","_"
1,"_","_","_","vidhi","NC","","_","_"
2,"_","_","_","pūrva","CX","","_","_"
3,"samānīya","_","_","samānī","CGDA","","_","_"
4,"pārthivān","_","_","pārthiva","NC","","_","_"
5,"abhyaṣecayat","_","_","abhiṣecay","V","abhiṣecay","_","_"
1,"kṛpaṃ","_","_","kṛpa","NC","","_","_"
2,"droṇaṃ","_","_","droṇa","NC","","_","_"
3,"ca","_","_","ca","CCD","","_","_"
4,"śalyaṃ","_","_","śalya","NC","","_","_"
5,"ca","_","_","ca","CCD","","_","_"
6,"saindhavaṃ","_","_","saindhava","NC","","_","_"
7,"ca","_","_","ca","CCD","","_","_"
8,"_","_","_","mahat","JJ","","_","_"
9,"_","_","_","ratha","NC","","_","_"
1,"sudakṣiṇaṃ","_","_","sudakṣiṇa","NC","","_","_"
2,"ca","_","_","ca","CCD","","_","_"
3,"kāmbojaṃ","_","_","kāmboja","NC","","_","_"
4,"kṛtavarmāṇam","_","_","kṛtavarman","NC","","_","_"
5,"eva","_","_","eva","CEM","","_","_"
6,"ca","_","_","ca","CCD","","_","_"
1,"droṇaputraṃ","_","_","droṇaputra","NC","","_","_"
2,"ca","_","_","ca","CCD","","_","_"
3,"karṇaṃ","_","_","karṇa","NC","","_","_"
4,"ca","_","_","ca","CCD","","_","_"
5,"bhūriśravasam","_","_","bhūriśravas","NC","","_","_"
6,"eva","_","_","eva","CEM","","_","_"
7,"ca","_","_","ca","CCD","","_","_"
1,"śakuniṃ","_","_","śakuni","NC","","_","_"
2,"saubalaṃ","_","_","saubala","NC","","_","_"
3,"_","_","_","ca","CCD","","_","_"
4,"_","_","_","eva","CEM","","_","_"
5,"bāhlīkaṃ","_","_","vāhlīka","NC","","_","_"
6,"ca","_","_","ca","CCD","","_","_"
7,"_","_","_","mahat","JJ","","_","_"
8,"_","_","_","ratha","NC","","_","_"
1,"divase","_","_","divasa","NC","","_","_"
2,"divase","_","_","divasa","NC","","_","_"
3,"teṣāṃ","_","_","tad","PRD","","_","_"
4,"prativelaṃ","_","_","prativela","CX","","_","_"
5,"ca","_","_","ca","CCD","","_","_"
6,"bhārata","_","_","bhārata","NC","","_","_"
1,"cakre","_","_","kar","V","kṛ","_","_"
2,"sa","_","_","tad","PRD","","_","_"
3,"vividhāḥ","_","_","vividha","JJ","","_","_"
4,"saṃjñāḥ","_","_","saṃjñā","NC","","_","_"
5,"pratyakṣaṃ","_","_","pratyakṣa","JJ","","_","_"
6,"ca","_","_","ca","CCD","","_","_"
7,"punaḥ","_","_","punar","CAD","","_","_"
8,"punaḥ","_","_","punar","CAD","","_","_"
1,"tathā","_","_","tathā","CX","","_","_"
2,"viniyatāḥ","_","_","viniya","PPP","","_","_"
3,"sarve","_","_","sarva","JQ","","_","_"
4,"ye","_","_","yad","PRL","","_","_"
5,"ca","_","_","ca","CCD","","_","_"
6,"teṣāṃ","_","_","tad","PRD","","_","_"
7,"padānugāḥ","_","_","padānuga","JJ","","_","_"
1,"babhūvuḥ","_","_","bhav","V","bhū","_","_"
2,"sainikā","_","_","sainika","NC","","_","_"
3,"rājan","_","_","rājan","NC","","_","_"
4,"rājñaḥ","_","_","rājan","NC","","_","_"
5,"_","_","_","priya","JJ","","_","_"
6,"_","_","_","cikīrṣu","JJ","","_","_"
