"WordID","word","NormSTEM","suffix","lemma","PoS","Root","NormSuffix","NormWord"
1,"dhṛtarāṣṭra","_","_","dhṛtarāṣṭra","NC","","_","_"
2,"uvāca","_","_","vak","V","vac","_","_"
1,"_","_","_","dharma","NC","","_","_"
2,"_","_","_","kṣetra","NC","","_","_"
3,"kurukṣetre","_","_","kurukṣetra","NC","","_","_"
4,"samavetā","_","_","samave","PPP","","_","_"
5,"yuyutsavaḥ","_","_","yuyutsu","JJ","","_","_"
1,"māmakāḥ","_","_","māmaka","JJ","","_","_"
2,"_","_","_","pāṇḍava","NC","","_","_"
3,"_","_","_","ca","CCD","","_","_"
4,"_","_","_","eva","CEM","","_","_"
5,"_","_","_","kiṃ","PRQ","","_","_"
6,"_","_","_","kar","V","kṛ","_","_"
7,"saṃjaya","_","_","saṃjaya","NC","","_","_"
1,"saṃjaya","_","_","saṃjaya","NC","","_","_"
2,"uvāca","_","_","vak","V","vac","_","_"
1,"dṛṣṭvā","_","_","dṛś","CGDA","","_","_"
2,"tu","_","_","tu","CCD","","_","_"
3,"_","_","_","pāṇḍava","NC","","_","_"
4,"_","_","_","anīka","NC","","_","_"
5,"vyūḍhaṃ","_","_","vyūh","PPP","","_","_"
6,"_","_","_","duryodhana","NC","","_","_"
7,"_","_","_","tadā","CAD","","_","_"
1,"_","_","_","ācārya","NC","","_","_"
2,"_","_","_","upasaṃga","CGDA","","_","_"
3,"rājā","_","_","rājan","NC","","_","_"
4,"_","_","_","vacana","NC","","_","_"
5,"_","_","_","abravīta","V","brū","_","_"
1,"_","_","_","paś","V","paś","_","_"
2,"_","_","_","tad","PRD","","_","_"
3,"_","_","_","pāṇḍu","NC","","_","_"
4,"_","_","_","putra","NC","","_","_"
5,"_","_","_","ācārya","NC","","_","_"
6,"mahatīṃ","_","_","mahat","JJ","","_","_"
7,"camūm","_","_","camū","NC","","_","_"
1,"vyūḍhāṃ","_","_","vyūh","PPP","","_","_"
2,"_","_","_","drupada","NC","","_","_"
3,"_","_","_","putra","NC","","_","_"
4,"tava","_","_","tvat","PPR","","_","_"
5,"śiṣyeṇa","_","_","śiṣya","NC","","_","_"
6,"dhīmatā","_","_","dhīmat","JJ","","_","_"
1,"atra","_","_","atra","CAD","","_","_"
2,"śūrā","_","_","śūra","NC","","_","_"
3,"_","_","_","mahat","JJ","","_","_"
4,"_","_","_","iṣvāsa","NC","","_","_"
5,"_","_","_","bhīma","NC","","_","_"
6,"_","_","_","arjuna","NC","","_","_"
7,"_","_","_","sama","PPX","","_","_"
8,"yudhi","_","_","yudh","NC","","_","_"
1,"yuyudhāno","_","_","yuyudhāna","NC","","_","_"
2,"_","_","_","virāṭa","NC","","_","_"
3,"_","_","_","ca","CCD","","_","_"
4,"_","_","_","drupada","NC","","_","_"
5,"_","_","_","ca","CCD","","_","_"
6,"_","_","_","mahat","JJ","","_","_"
7,"_","_","_","ratha","NC","","_","_"
1,"_","_","_","dhṛṣṭaketu","NC","","_","_"
2,"_","_","_","cekitāna","NC","","_","_"
3,"_","_","_","kāśi","NC","","_","_"
4,"_","_","_","rāja","NC","","_","_"
5,"_","_","_","ca","CCD","","_","_"
6,"vīryavān","_","_","vīryavat","JJ","","_","_"
1,"_","_","_","purujit","NC","","_","_"
2,"_","_","_","kuntibhoja","NC","","_","_"
3,"_","_","_","ca","CCD","","_","_"
4,"_","_","_","śaibya","NC","","_","_"
5,"_","_","_","ca","CCD","","_","_"
6,"_","_","_","nara","NC","","_","_"
7,"_","_","_","puṃgava","NC","","_","_"
1,"_","_","_","yudhāmanyu","NC","","_","_"
2,"_","_","_","ca","CCD","","_","_"
3,"vikrānta","_","_","vikra","PPP","","_","_"
4,"_","_","_","uttamaujas","NC","","_","_"
5,"_","_","_","ca","CCD","","_","_"
6,"vīryavān","_","_","vīryavat","JJ","","_","_"
1,"saubhadro","_","_","saubhadra","NC","","_","_"
2,"_","_","_","draupadeya","NC","","_","_"
3,"_","_","_","ca","CCD","","_","_"
4,"sarva","_","_","sarva","JQ","","_","_"
5,"eva","_","_","eva","CEM","","_","_"
6,"_","_","_","mahat","JJ","","_","_"
7,"_","_","_","ratha","NC","","_","_"
1,"asmākaṃ","_","_","mat","PPR","","_","_"
2,"tu","_","_","tu","CCD","","_","_"
3,"viśiṣṭā","_","_","viśiṣ","PPP","","_","_"
4,"ye","_","_","yad","PRL","","_","_"
5,"_","_","_","tad","PRD","","_","_"
6,"_","_","_","nibodh","V","nibudh","_","_"
7,"dvijottama","_","_","dvijottama","NC","","_","_"
1,"nāyakā","_","_","nāyaka","NC","","_","_"
2,"mama","_","_","mat","PPR","","_","_"
3,"sainyasya","_","_","sainya","NC","","_","_"
4,"_","_","_","saṃjñā","NC","","_","_"
5,"_","_","_","artha","NC","","_","_"
6,"_","_","_","tad","PRD","","_","_"
7,"_","_","_","abravīta","V","brū","_","_"
8,"te","_","_","tvat","PPR","","_","_"
1,"_","_","_","bhavat","JJ","","_","_"
2,"_","_","_","bhīṣma","NC","","_","_"
3,"_","_","_","ca","CCD","","_","_"
4,"_","_","_","karṇa","NC","","_","_"
5,"_","_","_","ca","CCD","","_","_"
6,"_","_","_","kṛpa","NC","","_","_"
7,"_","_","_","ca","CCD","","_","_"
8,"samitiṃjayaḥ","_","_","samitiṃjaya","JJ","","_","_"
1,"aśvatthāmā","_","_","aśvatthāman","NC","","_","_"
2,"_","_","_","vikarṇa","NC","","_","_"
3,"_","_","_","ca","CCD","","_","_"
4,"_","_","_","saumadatti","NC","","_","_"
5,"_","_","_","tathā","CX","","_","_"
6,"_","_","_","eva","CEM","","_","_"
7,"ca","_","_","ca","CCD","","_","_"
1,"anye","_","_","anya","PPX","","_","_"
2,"ca","_","_","ca","CCD","","_","_"
3,"bahavaḥ","_","_","bahu","JJ","","_","_"
4,"śūrā","_","_","śūra","NC","","_","_"
5,"_","_","_","mat","PPR","","_","_"
6,"_","_","_","artha","NC","","_","_"
7,"_","_","_","tyaj","PPP","","_","_"
8,"_","_","_","jīvita","NC","","_","_"
1,"_","_","_","nānā","CX","","_","_"
2,"_","_","_","śastra","NC","","_","_"
3,"_","_","_","praharaṇa","NC","","_","_"
4,"sarve","_","_","sarva","JQ","","_","_"
5,"_","_","_","yuddha","NC","","_","_"
6,"_","_","_","viśārada","JJ","","_","_"
1,"aparyāptaṃ","_","_","aparyāpta","JJ","","_","_"
2,"_","_","_","tad","PRD","","_","_"
3,"_","_","_","mat","PPR","","_","_"
4,"balaṃ","_","_","bala","NC","","_","_"
5,"_","_","_","bhīṣma","NC","","_","_"
6,"_","_","_","abhirakṣ","PPP","","_","_"
1,"paryāptaṃ","_","_","paryāp","PPP","","_","_"
2,"_","_","_","tu","CCD","","_","_"
3,"_","_","_","ida","PRD","","_","_"
4,"_","_","_","tad","PRD","","_","_"
5,"balaṃ","_","_","bala","NC","","_","_"
6,"_","_","_","bhīma","NC","","_","_"
7,"_","_","_","abhirakṣ","PPP","","_","_"
1,"ayaneṣu","_","_","ayana","NC","","_","_"
2,"ca","_","_","ca","CCD","","_","_"
3,"sarveṣu","_","_","sarva","JQ","","_","_"
4,"_","_","_","yathābhāga","CX","","_","_"
5,"_","_","_","avasthā","PPP","","_","_"
1,"_","_","_","bhīṣma","NC","","_","_"
2,"_","_","_","eva","CEM","","_","_"
3,"_","_","_","abhirakṣ","V","abhirakṣ","_","_"
4,"bhavantaḥ","_","_","bhavat","JJ","","_","_"
5,"sarva","_","_","sarva","JQ","","_","_"
6,"eva","_","_","eva","CEM","","_","_"
7,"hi","_","_","hi","CX","","_","_"
1,"tasya","_","_","tad","PRD","","_","_"
2,"_","_","_","saṃjanay","KDP","","_","_"
3,"_","_","_","harṣa","NC","","_","_"
4,"kuruvṛddhaḥ","_","_","kuruvṛddha","NC","","_","_"
5,"pitāmahaḥ","_","_","pitāmaha","NC","","_","_"
1,"siṃhanādaṃ","_","_","siṃhanāda","NC","","_","_"
2,"_","_","_","vinad","CGDA","","_","_"
3,"_","_","_","uccais","CX","","_","_"
4,"śaṅkhaṃ","_","_","śaṅkha","NC","","_","_"
5,"dadhmau","_","_","dha","V","dha","_","_"
6,"pratāpavān","_","_","pratāpavat","JJ","","_","_"
1,"tataḥ","_","_","tatas","CX","","_","_"
2,"_","_","_","śaṅkha","NC","","_","_"
3,"_","_","_","ca","CCD","","_","_"
4,"_","_","_","bherī","NC","","_","_"
5,"_","_","_","ca","CCD","","_","_"
6,"_","_","_","paṇava","NC","","_","_"
7,"_","_","_","ānaka","NC","","_","_"
8,"_","_","_","gomukha","NC","","_","_"
1,"_","_","_","sahasā","CX","","_","_"
2,"_","_","_","eva","CEM","","_","_"
3,"_","_","_","abhihan","V","abhihan","_","_"
4,"sa","_","_","tad","PRD","","_","_"
5,"_","_","_","śabda","NC","","_","_"
6,"_","_","_","tumula","JJ","","_","_"
7,"'bhavat","_","_","bhav","V","bhū","_","_"
1,"tataḥ","_","_","tatas","CX","","_","_"
2,"_","_","_","śveta","JJ","","_","_"
3,"_","_","_","haya","NC","","_","_"
4,"_","_","_","yuj","PPP","","_","_"
5,"mahati","_","_","mahat","JJ","","_","_"
6,"syandane","_","_","syandana","NC","","_","_"
7,"sthitau","_","_","sthā","PPP","","_","_"
1,"mādhavaḥ","_","_","mādhava","NC","","_","_"
2,"_","_","_","pāṇḍava","NC","","_","_"
3,"_","_","_","ca","CCD","","_","_"
4,"_","_","_","eva","CEM","","_","_"
5,"divyau","_","_","divya","JJ","","_","_"
6,"śaṅkhau","_","_","śaṅkha","NC","","_","_"
7,"pradadhmatuḥ","_","_","pradha","V","pradha","_","_"
1,"pāñcajanyaṃ","_","_","pāñcajanya","NC","","_","_"
2,"hṛṣīkeśo","_","_","hṛṣīkeśa","NC","","_","_"
3,"devadattaṃ","_","_","devadatta","NC","","_","_"
4,"dhanaṃjayaḥ","_","_","dhanaṃjaya","NC","","_","_"
1,"pauṇḍraṃ","_","_","pauṇḍra","NC","","_","_"
2,"dadhmau","_","_","dha","V","dha","_","_"
3,"_","_","_","mahat","JJ","","_","_"
4,"_","_","_","śaṅkha","NC","","_","_"
5,"_","_","_","bhīma","JJ","","_","_"
6,"_","_","_","karman","NC","","_","_"
7,"vṛkodaraḥ","_","_","vṛkodara","NC","","_","_"
1,"anantavijayaṃ","_","_","anantavijaya","NC","","_","_"
2,"rājā","_","_","rājan","NC","","_","_"
3,"_","_","_","kuntī","NC","","_","_"
4,"_","_","_","putra","NC","","_","_"
5,"yudhiṣṭhiraḥ","_","_","yudhiṣṭhira","NC","","_","_"
1,"nakulaḥ","_","_","nakula","NC","","_","_"
2,"_","_","_","sahadeva","NC","","_","_"
3,"_","_","_","ca","CCD","","_","_"
4,"_","_","_","sughoṣa","NC","","_","_"
5,"_","_","_","maṇipuṣpaka","NC","","_","_"
1,"_","_","_","kāśya","NC","","_","_"
2,"_","_","_","ca","CCD","","_","_"
3,"_","_","_","parama","JJ","","_","_"
4,"_","_","_","iṣvāsa","NC","","_","_"
5,"śikhaṇḍī","_","_","śikhaṇḍin","NC","","_","_"
6,"ca","_","_","ca","CCD","","_","_"
7,"_","_","_","mahat","JJ","","_","_"
8,"_","_","_","ratha","NC","","_","_"
1,"dhṛṣṭadyumno","_","_","dhṛṣṭadyumna","NC","","_","_"
2,"_","_","_","virāṭa","NC","","_","_"
3,"_","_","_","ca","CCD","","_","_"
4,"_","_","_","sātyaki","NC","","_","_"
5,"_","_","_","ca","CCD","","_","_"
6,"_","_","_","aparājita","JJ","","_","_"
1,"drupado","_","_","drupada","NC","","_","_"
2,"_","_","_","draupadeya","NC","","_","_"
3,"_","_","_","ca","CCD","","_","_"
4,"sarvaśaḥ","_","_","sarvaśas","CX","","_","_"
5,"pṛthivīpate","_","_","pṛthivīpati","NC","","_","_"
1,"_","_","_","saubhadra","NC","","_","_"
2,"_","_","_","ca","CCD","","_","_"
3,"_","_","_","mahat","JJ","","_","_"
4,"_","_","_","bāhu","NC","","_","_"
5,"_","_","_","śaṅkha","NC","","_","_"
6,"_","_","_","dha","V","dha","_","_"
7,"_","_","_","pṛthak","CX","","_","_"
8,"_","_","_","pṛthak","CX","","_","_"
1,"sa","_","_","tad","PRD","","_","_"
2,"ghoṣo","_","_","ghoṣa","NC","","_","_"
3,"dhārtarāṣṭrāṇāṃ","_","_","dhārtarāṣṭra","NC","","_","_"
4,"hṛdayāni","_","_","hṛdaya","NC","","_","_"
5,"vyadārayat","_","_","vidāray","V","vidāray","_","_"
1,"_","_","_","nabhas","NC","","_","_"
2,"_","_","_","ca","CCD","","_","_"
3,"pṛthivīṃ","_","_","pṛthivī","NC","","_","_"
4,"_","_","_","ca","CCD","","_","_"
5,"_","_","_","eva","CEM","","_","_"
6,"tumulo","_","_","tumula","JJ","","_","_"
7,"vyanunādayan","_","_","vyanunāday","KDP","","_","_"
1,"atha","_","_","atha","CAD","","_","_"
2,"_","_","_","vyavasthā","PPP","","_","_"
3,"_","_","_","dṛś","CGDA","","_","_"
4,"_","_","_","dhārtarāṣṭra","NC","","_","_"
5,"_","_","_","kapidhvaja","NC","","_","_"
1,"pravṛtte","_","_","pravṛt","PPP","","_","_"
2,"_","_","_","śastra","NC","","_","_"
3,"_","_","_","sampāta","NC","","_","_"
4,"_","_","_","dhanus","NC","","_","_"
5,"_","_","_","udya","CGDA","","_","_"
6,"pāṇḍavaḥ","_","_","pāṇḍava","NC","","_","_"
1,"hṛṣīkeśaṃ","_","_","hṛṣīkeśa","NC","","_","_"
2,"tadā","_","_","tadā","CAD","","_","_"
3,"_","_","_","vākya","NC","","_","_"
4,"_","_","_","ida","PRD","","_","_"
5,"_","_","_","ah","V","ah","_","_"
6,"mahīpate","_","_","mahīpati","NC","","_","_"
1,"_","_","_","senā","NC","","_","_"
2,"_","_","_","ubhaya","JJ","","_","_"
3,"_","_","_","madhya","NC","","_","_"
4,"rathaṃ","_","_","ratha","NC","","_","_"
5,"sthāpaya","_","_","sthāpa","V","sthāpay","_","_"
6,"me","_","_","mat","PPR","","_","_"
7,"'cyuta","_","_","acyuta","NC","","_","_"
1,"_","_","_","yāvat","CX","","_","_"
2,"_","_","_","tad","PRD","","_","_"
3,"_","_","_","nirīkṣ","V","nirīkṣ","_","_"
4,"'haṃ","_","_","mat","PPR","","_","_"
5,"_","_","_","yoddhu","NC","","_","_"
6,"_","_","_","kāma","NC","","_","_"
7,"_","_","_","avasthā","PPP","","_","_"
1,"_","_","_","kiṃ","PRQ","","_","_"
2,"_","_","_","mat","PPR","","_","_"
3,"saha","_","_","saha","CX","","_","_"
4,"_","_","_","yudh","KDG","","_","_"
5,"_","_","_","ida","PRD","","_","_"
6,"_","_","_","raṇa","NC","","_","_"
7,"_","_","_","samudyama","NC","","_","_"
1,"_","_","_","yudh","KDP","","_","_"
2,"_","_","_","avekṣ","V","avekṣ","_","_"
3,"'haṃ","_","_","mat","PPR","","_","_"
4,"ya","_","_","yad","PRL","","_","_"
5,"ete","_","_","tad","PRD","","_","_"
6,"'tra","_","_","atra","CAD","","_","_"
7,"samāgatāḥ","_","_","samāga","PPP","","_","_"
1,"dhārtarāṣṭrasya","_","_","dhārtarāṣṭra","NC","","_","_"
2,"_","_","_","durbuddhi","JJ","","_","_"
3,"_","_","_","yuddha","NC","","_","_"
4,"_","_","_","priya","JJ","","_","_"
5,"_","_","_","cikīrṣu","JJ","","_","_"
1,"_","_","_","eva","CX","","_","_"
2,"_","_","_","vac","PPP","","_","_"
3,"hṛṣīkeśo","_","_","hṛṣīkeśa","NC","","_","_"
4,"guḍākeśena","_","_","guḍākeśa","NC","","_","_"
5,"bhārata","_","_","bhārata","NC","","_","_"
1,"_","_","_","senā","NC","","_","_"
2,"_","_","_","ubhaya","JJ","","_","_"
3,"_","_","_","madhya","NC","","_","_"
4,"sthāpayitvā","_","_","sthāpay","CGDA","","_","_"
5,"_","_","_","ratha","NC","","_","_"
6,"_","_","_","uttama","JJ","","_","_"
1,"_","_","_","bhīṣma","NC","","_","_"
2,"_","_","_","droṇa","NC","","_","_"
3,"_","_","_","pramukhatas","CX","","_","_"
4,"sarveṣāṃ","_","_","sarva","JQ","","_","_"
5,"ca","_","_","ca","CCD","","_","_"
6,"mahīkṣitām","_","_","mahīkṣit","NC","","_","_"
1,"uvāca","_","_","vak","V","vac","_","_"
2,"pārtha","_","_","pārtha","NC","","_","_"
3,"_","_","_","paś","V","paś","_","_"
4,"_","_","_","tad","PRD","","_","_"
5,"_","_","_","samave","PPP","","_","_"
6,"_","_","_","kuru","NC","","_","_"
7,"_","_","_","iti","CQT","","_","_"
1,"_","_","_","tatra","CAD","","_","_"
2,"_","_","_","paś","V","paś","_","_"
3,"_","_","_","sthā","PPP","","_","_"
4,"_","_","_","pārtha","NC","","_","_"
5,"_","_","_","pitṛ","NC","","_","_"
6,"_","_","_","atha","CAD","","_","_"
7,"pitāmahān","_","_","pitāmaha","NC","","_","_"
1,"_","_","_","ācārya","NC","","_","_"
2,"_","_","_","mātula","NC","","_","_"
3,"_","_","_","bhrātṛ","NC","","_","_"
4,"_","_","_","putra","NC","","_","_"
5,"_","_","_","pautra","NC","","_","_"
6,"_","_","_","sakhi","NC","","_","_"
7,"_","_","_","tathā","CX","","_","_"
1,"_","_","_","śvaśura","NC","","_","_"
2,"_","_","_","suhṛd","NC","","_","_"
3,"_","_","_","ca","CCD","","_","_"
4,"_","_","_","eva","CEM","","_","_"
5,"_","_","_","senā","NC","","_","_"
6,"_","_","_","ubhaya","JJ","","_","_"
7,"_","_","_","api","CX","","_","_"
1,"_","_","_","tad","PRD","","_","_"
2,"_","_","_","samīkṣ","CGDA","","_","_"
3,"sa","_","_","tad","PRD","","_","_"
4,"kaunteyaḥ","_","_","kaunteya","NC","","_","_"
5,"_","_","_","sarva","JQ","","_","_"
6,"_","_","_","bandhu","NC","","_","_"
7,"_","_","_","avasthā","PPP","","_","_"
1,"kṛpayā","_","_","kṛpā","NC","","_","_"
2,"_","_","_","para","PPX","","_","_"
3,"_","_","_","āviś","PPP","","_","_"
4,"_","_","_","viṣad","KDP","","_","_"
5,"_","_","_","ida","PRD","","_","_"
6,"_","_","_","abravīta","V","brū","_","_"
1,"_","_","_","dṛś","CGDA","","_","_"
2,"_","_","_","ida","PRD","","_","_"
3,"_","_","_","sva","JJ","","_","_"
4,"_","_","_","jana","NC","","_","_"
5,"_","_","_","kṛṣṇa","NC","","_","_"
6,"_","_","_","yuyutsu","JJ","","_","_"
7,"_","_","_","samavasthā","PPP","","_","_"
1,"sīdanti","_","_","sīd","V","sad","_","_"
2,"mama","_","_","mat","PPR","","_","_"
3,"gātrāṇi","_","_","gātra","NC","","_","_"
4,"mukhaṃ","_","_","mukha","NC","","_","_"
5,"ca","_","_","ca","CCD","","_","_"
6,"pariśuṣyati","_","_","pariśuṣ","V","pariśuṣ","_","_"
1,"_","_","_","vepathu","NC","","_","_"
2,"_","_","_","ca","CCD","","_","_"
3,"śarīre","_","_","śarīra","NC","","_","_"
4,"me","_","_","mat","PPR","","_","_"
5,"_","_","_","romaharṣa","NC","","_","_"
6,"_","_","_","ca","CCD","","_","_"
7,"jāyate","_","_","jan","V","jan","_","_"
1,"gāṇḍīvaṃ","_","_","gāṇḍīva","NC","","_","_"
2,"sraṃsate","_","_","sraṃs","V","sraṃs","_","_"
3,"_","_","_","hasta","NC","","_","_"
4,"_","_","_","tvac","NC","","_","_"
5,"_","_","_","ca","CCD","","_","_"
6,"_","_","_","eva","CEM","","_","_"
7,"paridahyate","_","_","paridah","V","paridah","_","_"
1,"na","_","_","na","CNG","","_","_"
2,"ca","_","_","ca","CCD","","_","_"
3,"_","_","_","śakn","V","śak","_","_"
4,"_","_","_","avasthā","CGDI","","_","_"
5,"_","_","_","bhra","V","bhra","_","_"
6,"_","_","_","iva","CCM","","_","_"
7,"ca","_","_","ca","CCD","","_","_"
8,"me","_","_","mat","PPR","","_","_"
9,"manaḥ","_","_","manas","NC","","_","_"
1,"nimittāni","_","_","nimitta","NC","","_","_"
2,"ca","_","_","ca","CCD","","_","_"
3,"paśyāmi","_","_","paś","V","paś","_","_"
4,"viparītāni","_","_","viparīta","JJ","","_","_"
5,"keśava","_","_","keśava","NC","","_","_"
1,"na","_","_","na","CNG","","_","_"
2,"ca","_","_","ca","CCD","","_","_"
3,"śreyo","_","_","śreyas","NC","","_","_"
4,"'nupaśyāmi","_","_","anupaś","V","anupaś","_","_"
5,"hatvā","_","_","han","CGDA","","_","_"
6,"_","_","_","sva","JJ","","_","_"
7,"_","_","_","jana","NC","","_","_"
8,"_","_","_","āhava","NC","","_","_"
1,"na","_","_","na","CNG","","_","_"
2,"kāṅkṣe","_","_","kāṅkṣ","V","kāṅkṣ","_","_"
3,"vijayaṃ","_","_","vijaya","NC","","_","_"
4,"kṛṣṇa","_","_","kṛṣṇa","NC","","_","_"
5,"na","_","_","na","CNG","","_","_"
6,"ca","_","_","ca","CCD","","_","_"
7,"rājyaṃ","_","_","rājya","NC","","_","_"
8,"sukhāni","_","_","sukha","NC","","_","_"
9,"ca","_","_","ca","CCD","","_","_"
1,"kiṃ","_","_","kiṃ","PRQ","","_","_"
2,"no","_","_","mat","PPR","","_","_"
3,"rājyena","_","_","rājya","NC","","_","_"
4,"govinda","_","_","govinda","NC","","_","_"
5,"kiṃ","_","_","kiṃ","PRQ","","_","_"
6,"_","_","_","bhoga","NC","","_","_"
7,"_","_","_","jīvita","NC","","_","_"
8,"vā","_","_","vā","CCD","","_","_"
1,"_","_","_","yad","PRL","","_","_"
2,"_","_","_","artha","NC","","_","_"
3,"kāṅkṣitaṃ","_","_","kāṅkṣ","PPP","","_","_"
4,"no","_","_","mat","PPR","","_","_"
5,"rājyaṃ","_","_","rājya","NC","","_","_"
6,"bhogāḥ","_","_","bhoga","NC","","_","_"
7,"sukhāni","_","_","sukha","NC","","_","_"
8,"ca","_","_","ca","CCD","","_","_"
1,"ta","_","_","tad","PRD","","_","_"
2,"ime","_","_","ida","PRD","","_","_"
3,"'vasthitā","_","_","avasthā","PPP","","_","_"
4,"yuddhe","_","_","yuddha","NC","","_","_"
5,"_","_","_","prāṇa","NC","","_","_"
6,"_","_","_","tyaj","CGDA","","_","_"
7,"dhanāni","_","_","dhana","NC","","_","_"
8,"ca","_","_","ca","CCD","","_","_"
1,"ācāryāḥ","_","_","ācārya","NC","","_","_"
2,"pitaraḥ","_","_","pitṛ","NC","","_","_"
3,"_","_","_","putra","NC","","_","_"
4,"_","_","_","tathā","CX","","_","_"
5,"_","_","_","eva","CEM","","_","_"
6,"ca","_","_","ca","CCD","","_","_"
7,"pitāmahāḥ","_","_","pitāmaha","NC","","_","_"
1,"mātulāḥ","_","_","mātula","NC","","_","_"
2,"śvaśurāḥ","_","_","śvaśura","NC","","_","_"
3,"pautrāḥ","_","_","pautra","NC","","_","_"
4,"syālāḥ","_","_","syāla","NC","","_","_"
5,"_","_","_","sambandhin","JJ","","_","_"
6,"_","_","_","tathā","CX","","_","_"
1,"_","_","_","tad","PRD","","_","_"
2,"_","_","_","na","CNG","","_","_"
3,"_","_","_","han","CGDI","","_","_"
4,"_","_","_","iṣ","V","iṣ","_","_"
5,"ghnato","_","_","han","KDP","","_","_"
6,"'pi","_","_","api","CX","","_","_"
7,"madhusūdana","_","_","madhusūdana","NC","","_","_"
1,"api","_","_","api","CX","","_","_"
2,"_","_","_","trailokya","NC","","_","_"
3,"_","_","_","rājya","NC","","_","_"
4,"hetoḥ","_","_","hetu","NC","","_","_"
5,"kiṃ","_","_","kiṃ","PRQ","","_","_"
6,"nu","_","_","nu","CX","","_","_"
7,"_","_","_","mahī","NC","","_","_"
8,"_","_","_","kṛte","CX","","_","_"
1,"nihatya","_","_","nihan","CGDA","","_","_"
2,"_","_","_","dhārtarāṣṭra","NC","","_","_"
3,"_","_","_","mat","PPR","","_","_"
4,"kā","_","_","kiṃ","PRQ","","_","_"
5,"prītiḥ","_","_","prīti","NC","","_","_"
6,"_","_","_","as","V","as","_","_"
7,"_","_","_","janārdana","NC","","_","_"
1,"_","_","_","pāpa","NC","","_","_"
2,"_","_","_","eva","CEM","","_","_"
3,"_","_","_","āśray","V","āśri","_","_"
4,"_","_","_","mat","PPR","","_","_"
5,"_","_","_","han","CGDA","","_","_"
6,"_","_","_","tad","PRD","","_","_"
7,"_","_","_","ātatāyin","JJ","","_","_"
1,"_","_","_","tasmāt","CX","","_","_"
2,"_","_","_","na","CNG","","_","_"
3,"_","_","_","arha","JJ","","_","_"
4,"vayaṃ","_","_","mat","PPR","","_","_"
5,"hantuṃ","_","_","han","CGDI","","_","_"
6,"_","_","_","dhārtarāṣṭra","NC","","_","_"
7,"_","_","_","sa_saha","CX","","_","_"
8,"_","_","_","bāndhava","NC","","_","_"
1,"_","_","_","sva","JJ","","_","_"
2,"_","_","_","jana","NC","","_","_"
3,"hi","_","_","hi","CX","","_","_"
4,"kathaṃ","_","_","katha","CX","","_","_"
5,"hatvā","_","_","han","CGDA","","_","_"
6,"sukhinaḥ","_","_","sukhin","JJ","","_","_"
7,"syāma","_","_","as","V","as","_","_"
8,"mādhava","_","_","mādhava","NC","","_","_"
1,"_","_","_","yadi","CSB","","_","_"
2,"_","_","_","api","CX","","_","_"
3,"_","_","_","tad","PRD","","_","_"
4,"na","_","_","na","CNG","","_","_"
5,"paśyanti","_","_","paś","V","paś","_","_"
6,"_","_","_","lobha","NC","","_","_"
7,"_","_","_","upahan","PPP","","_","_"
8,"_","_","_","cetas","NC","","_","_"
1,"_","_","_","kula","NC","","_","_"
2,"_","_","_","kṣaya","NC","","_","_"
3,"_","_","_","kṛ","PPP","","_","_"
4,"doṣaṃ","_","_","doṣa","NC","","_","_"
5,"_","_","_","mitra","NC","","_","_"
6,"_","_","_","droha","NC","","_","_"
7,"ca","_","_","ca","CCD","","_","_"
8,"pātakam","_","_","pātaka","NC","","_","_"
1,"kathaṃ","_","_","katha","CX","","_","_"
2,"na","_","_","na","CNG","","_","_"
3,"_","_","_","jñā","KDG","","_","_"
4,"_","_","_","mat","PPR","","_","_"
5,"_","_","_","pāpa","NC","","_","_"
6,"_","_","_","ida","PRD","","_","_"
7,"_","_","_","nivṛt","CGDI","","_","_"
1,"_","_","_","kula","NC","","_","_"
2,"_","_","_","kṣaya","NC","","_","_"
3,"_","_","_","kṛ","PPP","","_","_"
4,"doṣaṃ","_","_","doṣa","NC","","_","_"
5,"_","_","_","prapaś","KDP","","_","_"
6,"_","_","_","janārdana","NC","","_","_"
1,"_","_","_","kula","NC","","_","_"
2,"_","_","_","kṣaya","NC","","_","_"
3,"praṇaśyanti","_","_","praṇaś","V","praṇaś","_","_"
4,"_","_","_","kula","NC","","_","_"
5,"_","_","_","dharma","NC","","_","_"
6,"sanātanāḥ","_","_","sanātana","JJ","","_","_"
1,"dharme","_","_","dharma","NC","","_","_"
2,"naṣṭe","_","_","naś","PPP","","_","_"
3,"kulaṃ","_","_","kula","NC","","_","_"
4,"_","_","_","kṛtsna","JJ","","_","_"
5,"_","_","_","adharma","NC","","_","_"
6,"_","_","_","abhibhav","V","abhibhū","_","_"
7,"_","_","_","uta","CCD","","_","_"
1,"_","_","_","adharma","NC","","_","_"
2,"_","_","_","abhibhava","NC","","_","_"
3,"_","_","_","kṛṣṇa","NC","","_","_"
4,"praduṣyanti","_","_","praduṣ","V","praduṣ","_","_"
5,"_","_","_","kula","NC","","_","_"
6,"_","_","_","strī","NC","","_","_"
1,"strīṣu","_","_","strī","NC","","_","_"
2,"duṣṭāsu","_","_","duṣ","PPP","","_","_"
3,"vārṣṇeya","_","_","vārṣṇeya","NC","","_","_"
4,"jāyate","_","_","jan","V","jan","_","_"
5,"_","_","_","varṇa","NC","","_","_"
6,"_","_","_","saṃkara","NC","","_","_"
1,"saṃkaro","_","_","saṃkara","NC","","_","_"
2,"_","_","_","naraka","NC","","_","_"
3,"_","_","_","eva","CEM","","_","_"
4,"_","_","_","kula","NC","","_","_"
5,"_","_","_","ghna","JJ","","_","_"
6,"kulasya","_","_","kula","NC","","_","_"
7,"ca","_","_","ca","CCD","","_","_"
1,"patanti","_","_","pat","V","pat","_","_"
2,"pitaro","_","_","pitṛ","NC","","_","_"
3,"_","_","_","hi","CX","","_","_"
4,"_","_","_","ida","PRD","","_","_"
5,"_","_","_","lup","PPP","","_","_"
6,"_","_","_","piṇḍa","NC","","_","_"
7,"_","_","_","udaka","NC","","_","_"
8,"_","_","_","kriyā","NC","","_","_"
1,"_","_","_","doṣa","NC","","_","_"
2,"_","_","_","tad","PRD","","_","_"
3,"_","_","_","kula","NC","","_","_"
4,"_","_","_","ghna","JJ","","_","_"
5,"_","_","_","varṇa","NC","","_","_"
6,"_","_","_","saṃkara","NC","","_","_"
7,"_","_","_","kāraka","JJ","","_","_"
1,"utsādyante","_","_","utsāday","V","utsāday","_","_"
2,"_","_","_","jāti","NC","","_","_"
3,"_","_","_","dharma","NC","","_","_"
4,"_","_","_","kula","NC","","_","_"
5,"_","_","_","dharma","NC","","_","_"
6,"_","_","_","ca","CCD","","_","_"
7,"śāśvatāḥ","_","_","śāśvata","JJ","","_","_"
1,"_","_","_","utsad","PPP","","_","_"
2,"_","_","_","kula","NC","","_","_"
3,"_","_","_","dharma","NC","","_","_"
4,"manuṣyāṇāṃ","_","_","manuṣya","NC","","_","_"
5,"janārdana","_","_","janārdana","NC","","_","_"
1,"narake","_","_","naraka","NC","","_","_"
2,"niyataṃ","_","_","niyata","CX","","_","_"
3,"vāso","_","_","vāsa","NC","","_","_"
4,"_","_","_","bhav","V","bhū","_","_"
5,"_","_","_","iti","CQT","","_","_"
6,"_","_","_","anuśṛṇ","V","anuśru","_","_"
1,"aho","_","_","aho","CX","","_","_"
2,"bata","_","_","bata","CX","","_","_"
3,"_","_","_","mahat","JJ","","_","_"
4,"_","_","_","pāpa","NC","","_","_"
5,"kartuṃ","_","_","kṛ","CGDI","","_","_"
6,"vyavasitā","_","_","vyavasā","PPP","","_","_"
7,"vayam","_","_","mat","PPR","","_","_"
1,"_","_","_","yat","CSB","","_","_"
2,"_","_","_","rājya","NC","","_","_"
3,"_","_","_","sukha","NC","","_","_"
4,"_","_","_","lobha","NC","","_","_"
5,"hantuṃ","_","_","han","CGDI","","_","_"
6,"_","_","_","sva","JJ","","_","_"
7,"_","_","_","jana","NC","","_","_"
8,"_","_","_","udya","PPP","","_","_"
1,"yadi","_","_","yadi","CSB","","_","_"
2,"_","_","_","mat","PPR","","_","_"
3,"_","_","_","apratīkāra","JJ","","_","_"
4,"_","_","_","aśastra","JJ","","_","_"
5,"_","_","_","śastra","NC","","_","_"
6,"_","_","_","pāṇi","NC","","_","_"
1,"dhārtarāṣṭrā","_","_","dhārtarāṣṭra","NC","","_","_"
2,"raṇe","_","_","raṇa","NC","","_","_"
3,"_","_","_","han","V","han","_","_"
4,"_","_","_","tad","PRD","","_","_"
5,"_","_","_","mat","PPR","","_","_"
6,"kṣemataraṃ","_","_","kṣematara","JJ","","_","_"
7,"bhavet","_","_","bhav","V","bhū","_","_"
1,"_","_","_","eva","CX","","_","_"
2,"_","_","_","vac","CGDA","","_","_"
3,"_","_","_","arjuna","NC","","_","_"
4,"saṃkhye","_","_","saṃkhya","NC","","_","_"
5,"rathopastha","_","_","rathopastha","NC","","_","_"
6,"upāviśat","_","_","upaviś","V","upaviś","_","_"
1,"visṛjya","_","_","visṛj","CGDA","","_","_"
2,"_","_","_","sa_saha","CX","","_","_"
3,"_","_","_","śara","NC","","_","_"
4,"cāpaṃ","_","_","cāpa","NC","","_","_"
5,"_","_","_","śoka","NC","","_","_"
6,"_","_","_","saṃvij","PPP","","_","_"
7,"_","_","_","mānasa","NC","","_","_"
