"WordID","word","NormSTEM","suffix","lemma","PoS","Root","NormSuffix","NormWord"
1,"pra","_","_","pra","CADP","","_","_"
2,"mandine","_","_","mandin","JJ","","_","_"
3,"pitumad","_","_","pitumat","JJ","","_","_"
4,"arcatā","_","_","arc","V","arc","_","_"
5,"vaco","_","_","vacas","NC","","_","_"
6,"yaḥ","_","_","yad","PRL","","_","_"
7,"_","_","_","kṛṣṇa","JJ","","_","_"
8,"_","_","_","garbha","NC","","_","_"
9,"nirahann","_","_","nirhan","V","nirhan","_","_"
10,"ṛjiśvanā","_","_","ṛjiśvan","NC","","_","_"
1,"avasyavo","_","_","avasyu","JJ","","_","_"
2,"vṛṣaṇaṃ","_","_","vṛṣan","NC","","_","_"
3,"_","_","_","vajra","NC","","_","_"
4,"_","_","_","dakṣiṇa","JJ","","_","_"
5,"marutvantaṃ","_","_","marutvat","NC","","_","_"
6,"sakhyāya","_","_","sakhya","NC","","_","_"
7,"havāmahe","_","_","hvā","V","hvā","_","_"
1,"yo","_","_","yad","PRL","","_","_"
2,"vyaṃsaṃ","_","_","vyaṃsa","NC","","_","_"
3,"jāhṛṣāṇena","_","_","hṛṣ","KDP","","_","_"
4,"manyunā","_","_","manyu","NC","","_","_"
5,"yaḥ","_","_","yad","PRL","","_","_"
6,"śambaraṃ","_","_","śambara","NC","","_","_"
7,"yo","_","_","yad","PRL","","_","_"
8,"ahan","_","_","han","V","han","_","_"
9,"piprum","_","_","pipru","NC","","_","_"
10,"avratam","_","_","avrata","JJ","","_","_"
1,"indro","_","_","indra","NC","","_","_"
2,"yaḥ","_","_","yad","PRL","","_","_"
3,"śuṣṇam","_","_","śuṣṇa","NC","","_","_"
4,"aśuṣaṃ","_","_","aśuṣa","JJ","","_","_"
5,"ny","_","_","ni","CADP","","_","_"
6,"āvṛṇaṅ","_","_","āvṛj","V","āvṛj","_","_"
7,"marutvantaṃ","_","_","marutvat","NC","","_","_"
8,"sakhyāya","_","_","sakhya","NC","","_","_"
9,"havāmahe","_","_","hvā","V","hvā","_","_"
1,"yasya","_","_","yad","PRL","","_","_"
2,"dyāvāpṛthivī","_","_","dyāvāpṛthivī","NC","","_","_"
3,"pauṃsyam","_","_","pauṃsya","NC","","_","_"
4,"mahad","_","_","mahat","JJ","","_","_"
5,"yasya","_","_","yad","PRL","","_","_"
6,"vrate","_","_","vrata","NC","","_","_"
7,"varuṇo","_","_","varuṇa","NC","","_","_"
8,"yasya","_","_","yad","PRL","","_","_"
9,"sūryaḥ","_","_","sūrya","NC","","_","_"
1,"_","_","_","yad","PRL","","_","_"
2,"_","_","_","indra","NC","","_","_"
3,"sindhavaḥ","_","_","sindhu","NC","","_","_"
4,"saścati","_","_","sac","V","sac","_","_"
5,"vratam","_","_","vrata","NC","","_","_"
6,"marutvantaṃ","_","_","marutvat","NC","","_","_"
7,"sakhyāya","_","_","sakhya","NC","","_","_"
8,"havāmahe","_","_","hvā","V","hvā","_","_"
1,"yo","_","_","yad","PRL","","_","_"
2,"aśvānāṃ","_","_","aśva","NC","","_","_"
3,"yo","_","_","yad","PRL","","_","_"
4,"gavāṃ","_","_","go","NC","","_","_"
5,"gopatir","_","_","gopati","NC","","_","_"
6,"vaśī","_","_","vaśin","JJ","","_","_"
7,"ya","_","_","yad","PRL","","_","_"
8,"āritaḥ","_","_","ār","PPP","","_","_"
9,"karmaṇi","_","_","karman","NC","","_","_"
10,"karmaṇi","_","_","karman","NC","","_","_"
11,"sthiraḥ","_","_","sthira","JJ","","_","_"
1,"vīﾱoś","_","_","vīḍu","JJ","","_","_"
2,"cid","_","_","cit","CEM","","_","_"
3,"indro","_","_","indra","NC","","_","_"
4,"yo","_","_","yad","PRL","","_","_"
5,"_","_","_","a","CNG","","_","_"
6,"_","_","_","su","KDP","","_","_"
7,"vadho","_","_","vadha","NC","","_","_"
8,"marutvantaṃ","_","_","marutvat","NC","","_","_"
9,"sakhyāya","_","_","sakhya","NC","","_","_"
10,"havāmahe","_","_","hvā","V","hvā","_","_"
1,"yo","_","_","yad","PRL","","_","_"
2,"viśvasya","_","_","viśva","JQ","","_","_"
3,"jagataḥ","_","_","jagat","NC","","_","_"
4,"prāṇatas","_","_","prāṇ","KDP","","_","_"
5,"patir","_","_","pati","NC","","_","_"
6,"yo","_","_","yad","PRL","","_","_"
7,"brahmaṇe","_","_","brahman","NC","","_","_"
8,"prathamo","_","_","prathama","JJ","","_","_"
9,"gā","_","_","go","NC","","_","_"
10,"avindat","_","_","vid","V","vid","_","_"
1,"indro","_","_","indra","NC","","_","_"
2,"yo","_","_","yad","PRL","","_","_"
3,"dasyūṃr","_","_","dasyu","NC","","_","_"
4,"adharāṁ","_","_","adhara","JJ","","_","_"
5,"avātiran","_","_","avatar","V","avatṛ","_","_"
6,"marutvantaṃ","_","_","marutvat","NC","","_","_"
7,"sakhyāya","_","_","sakhya","NC","","_","_"
8,"havāmahe","_","_","hvā","V","hvā","_","_"
1,"yaḥ","_","_","yad","PRL","","_","_"
2,"śūrebhir","_","_","śūra","JJ","","_","_"
3,"havyo","_","_","hvā","KDG","","_","_"
4,"yaś","_","_","yad","PRL","","_","_"
5,"ca","_","_","ca","CCD","","_","_"
6,"bhīrubhir","_","_","bhīru","JJ","","_","_"
7,"yo","_","_","yad","PRL","","_","_"
8,"dhāvadbhir","_","_","dhāv","KDP","","_","_"
9,"hūyate","_","_","hve","V","hve","_","_"
10,"yaś","_","_","yad","PRL","","_","_"
11,"ca","_","_","ca","CCD","","_","_"
12,"jigyubhiḥ","_","_","jigyu","JJ","","_","_"
1,"indraṃ","_","_","indra","NC","","_","_"
2,"yaṃ","_","_","yad","PRL","","_","_"
3,"viśvā","_","_","viśva","JQ","","_","_"
4,"_","_","_","bhuvana","NC","","_","_"
5,"_","_","_","abhi","CADP","","_","_"
6,"saṃdadhur","_","_","saṃdadh","V","saṃdhā","_","_"
7,"marutvantaṃ","_","_","marutvat","NC","","_","_"
8,"sakhyāya","_","_","sakhya","NC","","_","_"
9,"havāmahe","_","_","hvā","V","hvā","_","_"
1,"rudrāṇām","_","_","rudra","NC","","_","_"
2,"eti","_","_","e","V","i","_","_"
3,"pradiśā","_","_","pradiś","NC","","_","_"
4,"vicakṣaṇo","_","_","vicakṣaṇa","JJ","","_","_"
5,"rudrebhir","_","_","rudra","NC","","_","_"
6,"yoṣā","_","_","yoṣā","NC","","_","_"
7,"tanute","_","_","tan","V","tan","_","_"
8,"pṛthu","_","_","pṛthu","JJ","","_","_"
9,"jrayaḥ","_","_","jrayas","NC","","_","_"
1,"indram","_","_","indra","NC","","_","_"
2,"manīṣā","_","_","manīṣā","NC","","_","_"
3,"abhy","_","_","abhi","CADP","","_","_"
4,"arcati","_","_","ṛc","V","ṛc","_","_"
5,"śrutam","_","_","śru","PPP","","_","_"
6,"marutvantaṃ","_","_","marutvat","NC","","_","_"
7,"sakhyāya","_","_","sakhya","NC","","_","_"
8,"havāmahe","_","_","hvā","V","hvā","_","_"
1,"yad","_","_","yat","CSB","","_","_"
2,"vā","_","_","vā","CCD","","_","_"
3,"marutvaḥ","_","_","marutvat","JJ","","_","_"
4,"parame","_","_","parama","JJ","","_","_"
5,"sadhasthe","_","_","sadhastha","NC","","_","_"
6,"yad","_","_","yat","CSB","","_","_"
7,"_","_","_","vā","CCD","","_","_"
8,"_","_","_","avama","JJ","","_","_"
9,"vṛjane","_","_","vṛjana","NC","","_","_"
10,"mādayāse","_","_","māday","V","māday","_","_"
1,"ata","_","_","atas","CX","","_","_"
2,"ā","_","_","ā","CADP","","_","_"
3,"yāhy","_","_","yā","V","yā","_","_"
4,"adhvaraṃ","_","_","adhvara","NC","","_","_"
5,"no","_","_","mat","PPR","","_","_"
6,"acchā","_","_","acchā","CADP","","_","_"
7,"tvāyā","_","_","tvāyā","CX","","_","_"
8,"haviś","_","_","havis","NC","","_","_"
9,"cakṛmā","_","_","kar","V","kṛ","_","_"
10,"_","_","_","satya","JJ","","_","_"
11,"_","_","_","rādhas","NC","","_","_"
1,"_","_","_","tvāyā","CX","","_","_"
2,"_","_","_","indra","NC","","_","_"
3,"somaṃ","_","_","soma","NC","","_","_"
4,"suṣumā","_","_","su","V","su","_","_"
5,"_","_","_","su","CAD","","_","_"
6,"_","_","_","dakṣa","JJ","","_","_"
7,"tvāyā","_","_","tvāyā","CX","","_","_"
8,"haviś","_","_","havis","NC","","_","_"
9,"cakṛmā","_","_","kar","V","kṛ","_","_"
10,"_","_","_","brahman","NC","","_","_"
11,"_","_","_","vāhas","JJ","","_","_"
1,"adhā","_","_","adha","CX","","_","_"
2,"niyutvaḥ","_","_","niyutvat","JJ","","_","_"
3,"_","_","_","sa_saha","CX","","_","_"
4,"_","_","_","gaṇa","NC","","_","_"
5,"marudbhir","_","_","marut","NC","","_","_"
6,"asmin","_","_","ida","PRD","","_","_"
7,"yajñe","_","_","yajña","NC","","_","_"
8,"barhiṣi","_","_","barhis","NC","","_","_"
9,"mādayasva","_","_","māday","V","māday","_","_"
1,"mādayasva","_","_","māday","V","māday","_","_"
2,"haribhir","_","_","hari","NC","","_","_"
3,"ye","_","_","yad","PRL","","_","_"
4,"ta","_","_","tvat","PPR","","_","_"
5,"indra","_","_","indra","NC","","_","_"
6,"vi","_","_","vi","CADP","","_","_"
7,"ṣyasva","_","_","sā","V","sā","_","_"
8,"śipre","_","_","śiprā","NC","","_","_"
9,"vi","_","_","vi","CADP","","_","_"
10,"sṛjasva","_","_","sṛj","V","sṛj","_","_"
11,"dhene","_","_","dhenā","NC","","_","_"
1,"ā","_","_","ā","CADP","","_","_"
2,"tvā","_","_","tvat","PPR","","_","_"
3,"_","_","_","su","CAD","","_","_"
4,"_","_","_","śiprā","NC","","_","_"
5,"harayo","_","_","hari","NC","","_","_"
6,"_","_","_","vah","V","vah","_","_"
7,"_","_","_","vaś","KDP","","_","_"
8,"havyāni","_","_","havya","NC","","_","_"
9,"prati","_","_","prati","CADP","","_","_"
10,"no","_","_","mat","PPR","","_","_"
11,"juṣasva","_","_","juṣ","V","juṣ","_","_"
1,"_","_","_","marut","NC","","_","_"
2,"_","_","_","stotra","NC","","_","_"
3,"vṛjanasya","_","_","vṛjana","NC","","_","_"
4,"gopā","_","_","gopā","NC","","_","_"
5,"vayam","_","_","mat","PPR","","_","_"
6,"indreṇa","_","_","indra","NC","","_","_"
7,"sanuyāma","_","_","san","V","san","_","_"
8,"vājam","_","_","vāja","NC","","_","_"
1,"tan","_","_","tad","PRD","","_","_"
2,"no","_","_","mat","PPR","","_","_"
3,"mitro","_","_","mitra","NC","","_","_"
4,"varuṇo","_","_","varuṇa","NC","","_","_"
5,"māmahantām","_","_","mah","V","mah","_","_"
6,"aditiḥ","_","_","aditi","NC","","_","_"
7,"sindhuḥ","_","_","sindhu","NC","","_","_"
8,"pṛthivī","_","_","pṛthivī","NC","","_","_"
9,"uta","_","_","uta","CCD","","_","_"
10,"dyauḥ","_","_","div","NC","","_","_"
