"WordID","word","NormSTEM","suffix","lemma","PoS","Root","NormSuffix","NormWord"
NA,"<doc textid = ""mahamayasadhanopayika"" genre = ""tantra"" title = ""mahāmāyāsādhanopāyikā"" author = ""kukkuripāda"" discourse = ""tantra"" tradition = ""tantra"" period = ""commentarial"" source = ""dsbc accessed aug 2021"" date_range = ""after 9. ce"" notes = ""a sādhana ritual attributed to the mahāsiddha kukkurīpāda. text contains a prakrit verse."" religion = ""buddh"" edition = ""based on ? ?"" digitization = ""input by ?"" segmentation_lemmatization = ""ligeia lugli & buddhist translators workbench team"" metadata_enrichment = ""bruno galasek-hul & buddhist translators workbench team"" proofreader = """" permission = """" reconstructions = ""none"">","","","","","","",""
NA,"<s number=""1"">","","","","","","",""
1,"mahāmāy","MAHĀMĀY","a","mahāmāya","noun-adj","","a","mahāmāya"
2,"^āsādhan","ĀSĀDHAN","a","āsādhana","noun-adj","","a","āsādhana"
3,"^opāyikā","UPĀYIK","ā","upāyikā","noun-adj","","ā","upāyikā"
NA,"</s>","","","","","","",""
NA,"<s number=""2"">","","","","","","",""
1,"kuk","KUK","","kuka","noun-adj","","","kuk"
2,"kurī","KUR","ī","kar","verb","kṛ","ī","kurī"
3,"pādānām","PĀD","ānām","pāda","noun-adj","","ānām","pādānām"
4,"namo","NAM","o","namas","noun-adj","","aḥ","namaḥ"
5,"vajraḍākāya","VAJRAḌĀK","āya","vajraḍāka","noun-adj","","āya","vajraḍākāya"
6,"/","","","","punct","","","/"
NA,"</s>","","","","","","",""
NA,"<s number=""3"">","","","","","","",""
1,"prathamaṃ","PRATHAM","aṃ","prathama","noun-adj","","am","prathamam"
2,"mukha","MUKH","a","mukha","noun-adj","","a","mukha"
3,"śauc","ŚAUC","a","śauca","noun-adj","","a","śauca"
4,"^ādikaṃ","ĀDIK","aṃ","ādika","noun-adj","","am","ādikam"
5,"kṛtvā","KṚTV","ā","kṛtvā","noun-adj","","ā","kṛtvā"
6,"mṛdu","MṚD","u","mṛdu","noun-adj","","u","mṛdu"
7,"viṣṭa","VIṢṬ","a","viṣṭa","noun-adj","","a","viṣṭa"
8,"ropa","ROP","a","ropa","noun-adj","","a","ropa"
9,"viṣṭaḥ","VIṢṬ","aḥ","viṣṭa","noun-adj","","aḥ","viṣṭaḥ"
10,"sva","SV","a","sva","noun-adj","","a","sva"
11,"hṛdi","HṚD","i","hṛdi","noun-adj","","i","hṛdi"
12,"sūryamaṇḍale","SŪRYAMAṆḌAL","e","sūryamaṇḍala","noun-adj","","e","sūryamaṇḍale"
13,"huṃkāra","HUṂKĀR","a","huṃkāra","noun-adj","","a","huṃkāra"
14,"bījaṃ","BĪJ","aṃ","bīja","noun-adj","","am","bījam"
15,"dṛṣṭvā","DṚṢṬV","ā","dṛṣṭvā","noun-adj","","ā","dṛṣṭvā"
16,"purataḥ","PUR","ataḥ","pura","noun-adj","","ataḥ","purataḥ"
17,"karuṇ","KARUṆ","a","karuṇa","noun-adj","","a","karuṇa"
18,"^ācala","ĀCAL","a","ācal","noun-adj","","a","ācala"
19,"vajraṃ","VAJR","aṃ","vajra","noun-adj","","am","vajram"
20,"vakṣyamāṇa","VAKṢ","yamāṇa","vak","verb","vac","yamāṇa","vakṣyamāṇa"
21,"ka","","","kim","pron","","","kim"
22,"varṇa","VARṆ","a","varṇa","noun-adj","","a","varṇa"
23,"bhuj","BHUJ","a","bhuja","noun-adj","","a","bhuja"
24,"^āyudhaṃ","ĀYUDH","aṃ","āyudha","noun-adj","","am","āyudham"
25,"vicintya","VICINTY","a","vicintya","noun-adj","","a","vicintya"
26,"pūjā","PŪJ","ā","pūjā","noun-adj","","ā","pūjā"
27,"pāpa","PĀP","a","pāpa","noun-adj","","a","pāpa"
28,"deśanā","DEŚAN","ā","deśanā","noun-adj","","ā","deśanā"
29,"puṇy","PUṆY","a","puṇya","noun-adj","","a","puṇya"
30,"^ānumodanā","ANUMODAN","ā","anumodanā","noun-adj","","ā","anumodanā"
31,"puṇya","PUṆY","a","puṇya","noun-adj","","a","puṇya"
32,"pariṇāmanā","PARIṆĀMAN","ā","pariṇāmana","noun-adj","","āḥ","pariṇāmanāḥ"
33,"triśaraṇa","TRIŚARAṆ","a","triśaraṇa","noun-adj","","a","triśaraṇa"
34,"gaman","GAMAN","a","gamana","noun-adj","","a","gamana"
35,"^ādi","ĀD","i","ādi","noun-adj","","i","ādi"
36,"praṇidhiṃ","PRAṆIDH","iṃ","praṇidhi","noun-adj","","im","praṇidhim"
37,"ca","","","ca","ind","","","ca"
38,"kṛtvā","KṚTV","ā","kṛtvā","noun-adj","","ā","kṛtvā"
39,"sva","SV","a","sva","noun-adj","","a","sva"
40,"kāyavāk","KĀYAVĀK","","kāyavāka","noun-adj","","","kāyavāk"
41,"cite","CIT","e","cita","noun-adj","","e","cite"
42,"nām","NĀM","a","nāman","noun-adj","","a","nāma"
43,"^ākṣaraṃ","AKṢAR","aṃ","akṣara","noun-adj","","am","akṣaram"
44,"—","","","","punct","","","—"
45,"he","","","","ind","","",""
46,"iti","","","iti","ind","","","iti"
47,"hetv","HET","v","hetu","noun-adj","","v","hetv"
48,"apagatāḥ","APAGAT","āḥ","apagata","noun-adj","","āḥ","apagatāḥ"
49,"sarvadharmāḥ","SARVADHARM","āḥ","sarvadharman","noun-adj","","āḥ","sarvadharmāḥ"
50,";","","","","punct","","",";"
51,"ha","","","ha","ind","","","ha"
52,"iti","","","iti","ind","","","iti"
53,"hāny","HĀN","y","hāni","noun-adj","","i","hāni"
54,"utpāditāḥ","UTPĀD","itāḥ","utpādita","noun-adj","","itāḥ","utpāditāḥ"
55,"sarvadharmāḥ","SARVADHARM","āḥ","sarvadharman","noun-adj","","āḥ","sarvadharmāḥ"
56,";","","","","punct","","",";"
57,"e","","","","ind","","",""
58,"iti","","","iti","ind","","","iti"
59,"paryeṣaṇa","PARYEṢAṆ","a","paryeṣaṇa","noun-adj","","a","paryeṣaṇa"
60,"vimuktāḥ","VIMUKT","āḥ","vimukta","noun-adj","","āḥ","vimuktāḥ"
61,"sarvadharmāḥ","SARVADHARM","āḥ","sarvadharman","noun-adj","","āḥ","sarvadharmāḥ"
62,";","","","","punct","","",";"
63,"ru","","","ru","ind","","","ru"
64,"iti","","","iti","ind","","","iti"
65,"pratiśrutk","PRATIŚRUTK","a","pratiśrutkā","noun-adj","","a","pratiśrutkā"
66,"^opamāḥ","UPAM","āḥ","upama","noun-adj","","āḥ","upamāḥ"
67,"sarvadharmāḥ","SARVADHARM","āḥ","sarvadharman","noun-adj","","āḥ","sarvadharmāḥ"
68,";","","","","punct","","",";"
69,"ra","","","ra","ind","","","ra"
70,"iti","","","iti","ind","","","iti"
71,"rati","RAT","i","rati","noun-adj","","i","rati"
72,"samāyuktāḥ","SAMĀYUKT","āḥ","samāyukta","noun-adj","","āḥ","samāyuktāḥ"
73,"sarvadharmāḥ","SARVADHARM","āḥ","sarvadharman","noun-adj","","āḥ","sarvadharmāḥ"
74,";","","","","punct","","",";"
75,"u","","","","ind","","",""
76,"iti","","","iti","ind","","","iti"
77,"utpāda","UTPĀD","a","utpāda","noun-adj","","a","utpāda"
78,"vyaya","VYAY","a","vyaya","noun-adj","","a","vyaya"
79,"dharmiṇaḥ","DHARM","iṇaḥ","dharmin","noun-adj","","inaḥ","dharminaḥ"
80,"sarvadharmāḥ","SARVADHARM","āḥ","sarvadharman","noun-adj","","āḥ","sarvadharmāḥ"
81,";","","","","punct","","",";"
82,"ka","","","kim","pron","","","kim"
83,"iti","","","iti","ind","","","iti"
84,"sarva","SARV","a","sarva","noun-adj","","a","sarva"
85,"saukhya","SAUKHY","a","saukhya","noun-adj","","a","saukhya"
86,"samāyuktāḥ","SAMĀYUKT","āḥ","samāyukta","noun-adj","","āḥ","samāyuktāḥ"
87,"sarvadharmāḥ","SARVADHARM","āḥ","sarvadharman","noun-adj","","āḥ","sarvadharmāḥ"
88,";","","","","punct","","",";"
89,"a","","","alpha_privativum","ind","","","alpha_privativum"
90,"iti","","","iti","ind","","","iti"
91,"a","","","alpha_privativum","ind","","","alpha_privativum"
92,"kāro","KĀR","o","kāra","noun-adj","","aḥ","kāraḥ"
93,"mukhaṃ","MUKH","aṃ","mukha","noun-adj","","am","mukham"
94,"sarvadharmāṇām","SARVADHARM","āṇām","sarvadharman","noun-adj","","ānām","sarvadharmānām"
95,"ādy","ĀD","y","ādi","noun-adj","","i","ādi"
96,"an","","","alpha_privativum","ind","","","alpha_privativum"
97,"utpannatvāt","UTPANN","atvāt","utpannatva","noun-adj","","atvāt","utpannatvāt"
98,"/","","","","punct","","","/"
NA,"</s>","","","","","","",""
NA,"<s number=""4"">","","","","","","",""
1,"iti","","","iti","ind","","","iti"
2,"kṛtvā","KṚTV","ā","kṛtvā","noun-adj","","ā","kṛtvā"
3,"śūnyatāṃ","ŚŪNYAT","āṃ","śūnyatā","noun-adj","","ām","śūnyatām"
4,"vibhāvya","VIBHĀVY","a","vibhāvya","noun-adj","","a","vibhāvya"
5,"mantram","MANTR","am","mantra","noun-adj","","am","mantram"
6,"uccārayet","UCCĀR","ayet","uccār","verb","","yet","uccāryet"
7,"—","","","","punct","","","—"
8,"oṃ","","","oṃ","ind","","","oṃ"
9,"śūnyatā","ŚŪNYAT","ā","śūnyatā","noun-adj","","ā","śūnyatā"
10,"jñāna","JÑĀN","a","jñāna","noun-adj","","a","jñāna"
11,"vajra","VAJR","a","vajra","noun-adj","","a","vajra"
12,"svabhāv","SVABHĀV","a","svabhāva","noun-adj","","a","svabhāva"
13,"^ātmako","ĀTMAK","o","ātmaka","noun-adj","","aḥ","ātmakaḥ"
14,"aham","","","mat","pron","","","mat"
15,"/","","","","punct","","","/"
NA,"</s>","","","","","","",""
NA,"<s number=""5"">","","","","","","",""
1,"huṃkāreṇa","HUṂKĀR","eṇa","huṃkāra","noun-adj","","ena","huṃkārena"
2,"vighnam","VIGHN","am","vighna","noun-adj","","am","vighnam"
3,"utsārya","UTSĀRY","a","utsārya","noun-adj","","a","utsārya"
4,"vajra","VAJR","a","vajra","noun-adj","","a","vajra"
5,"pañjaraṃ","PAÑJAR","aṃ","pañjara","noun-adj","","am","pañjaram"
6,"vibhāvya","VIBHĀVY","a","vibhāvya","noun-adj","","a","vibhāvya"
7,"śmaśān","ŚMAŚĀN","a","śmaśāna","noun-adj","","a","śmaśāna"
8,"^āṣṭaka","AṢṬ","aka","aṣṭaka","noun-adj","","aka","aṣṭaka"
9,"madhye","MADHY","e","madhya","noun-adj","","e","madhye"
10,"rakta","RAKT","a","rakta","noun-adj","","a","rakta"
11,"catur","CAT","ur","catur","noun-adj","","ur","catur"
12,"dala","DAL","a","dala","noun-adj","","a","dala"
13,"kamala","KAMAL","a","kamala","noun-adj","","a","kamala"
14,"padma","PADM","a","padma","noun-adj","","a","padma"
15,"varaṭaka","VARAṬAK","a","varaṭaka","noun-adj","","a","varaṭaka"
16,"sūrya","SŪRY","a","sūrya","noun-adj","","a","sūrya"
17,"maṇḍale","MAṆḌAL","e","maṇḍala","noun-adj","","e","maṇḍale"
18,"huṃkāra","HUṂKĀR","a","huṃkāra","noun-adj","","a","huṃkāra"
19,"bījaṃ","BĪJ","aṃ","bīja","noun-adj","","am","bījam"
20,"dṛṣṭvā","DṚṢṬV","ā","dṛṣṭvā","noun-adj","","ā","dṛṣṭvā"
21,"maitrīkaruṇāmudit","MAITRĪKARUṆĀMUDIT","a","maitrīkaruṇāmudita","noun-adj","","a","maitrīkaruṇāmudita"
22,"^opekṣā","UPEKṢ","ā","upekṣā","noun-adj","","ā","upekṣā"
23,"svabhāv","SVABHĀV","a","svabhāva","noun-adj","","a","svabhāva"
24,"^ātmikāś","ĀTM","ikāś","ātmika","noun-adj","","ikāś","ātmikāś"
25,"catur","CAT","ur","catur","noun-adj","","ur","catur"
26,"devyaḥ","DEVY","aḥ","devya","noun-adj","","aḥ","devyaḥ"
27,"sañc","SAÑC","a","sañca","noun-adj","","a","sañca"
28,"^odayanti","UD","ayanti","ude","verb","udi","ayanti","udayanti"
29,"śrī","ŚRĪ","","śrī","noun-adj","","","śrī"
30,"vajra","VAJR","a","vajra","noun-adj","","a","vajra"
31,"gītyā","GĪT","yā","gīti","noun-adj","","yāḥ","gītyāḥ"
32,"abhyantara","ABHYANTAR","a","abhyantara","noun-adj","","a","abhyantara"
33,"sādhane","SĀDHAN","e","sādhana","noun-adj","","e","sādhane"
34,"—","","","","punct","","","—"
35,"hale","HAL","e","hala","noun-adj","","e","hale"
36,"sahi","SAH","i","sahi","noun-adj","","i","sahi"
37,"viasia","","","","ind","","",""
38,"kamalu","KAMAL","u","kamala","noun-adj","","u","kamalu"
39,"pabohiu","","","","ind","","",""
40,"vajjeṃ","","","","ind","","",""
41,"/","","","","punct","","","/"
42,"alala","","","","ind","","",""
43,"lalaho","","","lalaha","ind","","","lalaha"
44,"mahā","","","mahat","ind","","","mahat"
45,"suheṇa","SUH","eṇa","suha","noun-adj","","ena","suhena"
46,"āro","","","āra","ind","","","āra"
47,"hi","","","hi","ind","","","hi"
48,"unṛtyeṃ","","","","ind","","",""
49,"//","","","","punct","","","//"
NA,"</s>","","","","","","",""
NA,"<s number=""6"">","","","","","","",""
1,"ravikiraṇeṇa","RAVIKIRAṆ","eṇa","ravikiraṇa","noun-adj","","ena","ravikiraṇena"
2,"pa","","","pa","ind","","","pa"
3,"phullia","","","","ind","","",""
4,"kamalu","KAMAL","u","kamala","noun-adj","","u","kamalu"
5,"mahā","MAH","ā","mahat","noun-adj","","ā","mahā"
6,"suheṇa","SUH","eṇa","suha","noun-adj","","ena","suhena"
7,"/","","","","punct","","","/"
8,"a","","","alpha_privativum","ind","","","alpha_privativum"
9,"lala","LAL","a","lala","noun-adj","","a","lala"
10,"lalaho","LALAH","o","lalaha","noun-adj","","aḥ","lalahaḥ"
11,"mahā","MAH","ā","mahat","noun-adj","","ā","mahā"
12,"suṇeha","SUN","eha","suna","noun-adj","","eha","suneha"
13,"āro","","","āra","ind","","","āra"
14,"hi","","","hi","ind","","","hi"
15,"unṛtyeṃ","","","","ind","","",""
16,"//","","","","punct","","","//"
NA,"</s>","","","","","","",""
NA,"<s number=""7"">","","","","","","",""
1,"vajraḍākinī","VAJRAḌĀK","inī","vajraḍākin","noun-adj","","inī","vajraḍākinī"
2,"nṛtyena","NṚTY","ena","nṛtya","noun-adj","","ena","nṛtyena"
3,"vajra","VAJR","a","vajra","noun-adj","","a","vajra"
4,"sattvaṃ","SATTV","aṃ","sattva","noun-adj","","am","sattvam"
5,"niveśayet","NIVEŚAY","et","niviś","verb","niviś","et","niveśayet"
6,"//","","","","punct","","","//"
NA,"</s>","","","","","","",""
NA,"<s number=""8"">","","","","","","",""
1,"iti","","","iti","ind","","","iti"
2,"gīti","GĪT","i","gīti","noun-adj","","i","gīti"
3,"samanantaraṃ","SAMANANTAR","aṃ","samanantara","noun-adj","","am","samanantaram"
4,"māyā","MĀY","ā","māyā","noun-adj","","ā","māyā"
5,"baddhav","BADDH","av","baddha","noun-adj","","au","baddhau"
6,"astu","","","as","verb","as","",""
7,"saṃvittyā","SAṂVITT","yā","saṃvitti","noun-adj","","yāḥ","saṃvittyāḥ"
8,"manasā","MANAS","ā","manas","noun-adj","","ā","manasā"
9,"huṃkār","HUṂKĀR","a","huṃkāra","noun-adj","","a","huṃkāra"
10,"^odbhūtaṃ","UDBHŪT","aṃ","udbhūta","noun-adj","","am","udbhūtam"
11,"karuṇ","KARUṆ","a","karuṇa","noun-adj","","a","karuṇa"
12,"^ācala","ĀCAL","a","ācal","noun-adj","","a","ācala"
13,"vajraṃ","VAJR","aṃ","vajra","noun-adj","","am","vajram"
14,"nīlapīta","NĪLAPĪT","a","nīlapīta","noun-adj","","a","nīlapīta"
15,"sita","SIT","a","sita","noun-adj","","a","sita"
16,"śyāma","ŚYĀM","a","śyāma","noun-adj","","a","śyāma"
17,"caturmukhaṃ","CATURMUKH","aṃ","caturmukha","noun-adj","","am","caturmukham"
18,"caturbhujaṃ","CATURBHUJ","aṃ","caturbhuja","noun-adj","","am","caturbhujam"
19,"dakṣiṇe","DAKṢIṆ","e","dakṣiṇa","noun-adj","","e","dakṣiṇe"
20,"bhuje","BHUJ","e","bhuja","noun-adj","","e","bhuje"
21,"kapāla","KAPĀL","a","kapāla","noun-adj","","a","kapāla"
22,"śara","ŚAR","a","śara","noun-adj","","a","śara"
23,"dharaṃ","DHAR","aṃ","dhara","noun-adj","","am","dharam"
24,"vāme","VĀM","e","vāma","noun-adj","","e","vāme"
25,"khaṭv","KHAṬV","a","khaṭvā","noun-adj","","a","khaṭvā"
26,"^āṅga","ĀṄG","a","āṅga","noun-adj","","a","āṅga"
27,"dhanur","DHAN","ur","dhanu","noun-adj","","ur","dhanur"
28,"dharaṃ","DHAR","aṃ","dhara","noun-adj","","am","dharam"
29,"raudr","RAUDR","a","raudra","noun-adj","","a","raudra"
30,"^āsanasthaṃ","ĀSANASTH","aṃ","āsanastha","noun-adj","","am","āsanastham"
31,"trinetraṃ","TRINETR","aṃ","trinetra","noun-adj","","am","trinetram"
32,"sārdra","SĀRDR","a","sārdra","noun-adj","","a","sārdra"
33,"muṇḍa","MUṆḌ","a","muṇḍa","noun-adj","","a","muṇḍa"
34,"srag","SRAG","","sraga","noun-adj","","","srag"
35,"dāma","DĀM","a","dāma","noun-adj","","a","dāma"
36,"mālinaṃ","MĀL","inaṃ","mālin","noun-adj","","inam","mālinam"
37,"kapālamālābhiḥ","KAPĀLAMĀL","ābhiḥ","kapālamālā","noun-adj","","ābhiḥ","kapālamālābhiḥ"
38,"śirasi","ŚIRAS","i","śiras","noun-adj","","i","śirasi"
39,"bhūṣitam","BHŪṢIT","am","bhūṣita","noun-adj","","am","bhūṣitam"
40,"asthya","ASTH","ya","","noun-adj","","ya","asthya"
41,"laṅkāra","LAṄKĀR","a","laṅkāri","noun-adj","","a","laṅkāra"
42,"vibhūṣitam","VIBHŪṢIT","am","vibhūṣita","noun-adj","","am","vibhūṣitam"
43,"īṣad","ĪṢAD","","īṣat","noun-adj","","","īṣad"
44,"daṃṣṭrā","DAṂṢṬR","ā","daṃṣṭra","noun-adj","","āḥ","daṃṣṭrāḥ"
45,"karālavadanaṃ","KARĀLAVADAN","aṃ","karālavadana","noun-adj","","am","karālavadanam"
46,"piṅgal","PIṄGAL","a","piṅgala","noun-adj","","a","piṅgala"
47,"^ordhva","ŪRDHV","a","ūrdhva","noun-adj","","a","ūrdhva"
48,"keśam","KEŚ","am","keśa","noun-adj","","am","keśam"
49,"kāye","KĀY","e","kāya","noun-adj","","e","kāye"
50,"c","","","ca","ind","","","ca"
51,"īkāraṃ","ĪKĀR","aṃ","īkāra","noun-adj","","am","īkāram"
52,"pītaṃ","PĪT","aṃ","pīta","noun-adj","","am","pītam"
53,"cakṣuṣoḥ","CAKṢUṢ","oḥ","cakṣuṣa","noun-adj","","oḥ","cakṣuṣoḥ"
54,"oṃkāraṃ","OṂKĀR","aṃ","oṃkāra","noun-adj","","am","oṃkāram"
55,"sitaṃ","SIT","aṃ","sita","noun-adj","","am","sitam"
56,"śrotrayoḥ","ŚROTR","ayoḥ","śrotra","noun-adj","","ayoḥ","śrotrayoḥ"
57,"huṃkāraṃ","HUṂKĀR","aṃ","huṃkāra","noun-adj","","am","huṃkāram"
58,"raktaṃ","RAKT","aṃ","rakta","noun-adj","","am","raktam"
59,"nāsikāyāṃ","NĀSIK","āyāṃ","nāsikā","noun-adj","","āyām","nāsikāyām"
60,"khakāraṃ","KHAKĀR","aṃ","khakāra","noun-adj","","am","khakāram"
61,"sitaṃ","SIT","aṃ","sita","noun-adj","","am","sitam"
62,"kaṇṭhe","KAṆṬH","e","kaṇṭha","noun-adj","","e","kaṇṭhe"
63,"āḥkāraṃ","ĀḤKĀR","aṃ","āḥkāra","noun-adj","","am","āḥkāram"
64,"sitaṃ","SIT","aṃ","sita","noun-adj","","am","sitam"
65,"hṛdaye","HṚDAY","e","hṛdaya","noun-adj","","e","hṛdaye"
66,"rephaṃ","REPH","aṃ","repha","noun-adj","","am","repham"
67,"raktaṃ","RAKT","aṃ","rakta","noun-adj","","am","raktam"
68,"ṣaḍ","ṢAḌ","","ṣaḍi","noun-adj","","","ṣaḍ"
69,"aṅganyāsa","AṄGANYĀS","a","aṅganyāsa","noun-adj","","a","aṅganyāsa"
70,"lakṣitaṃ","LAKṢIT","aṃ","lakṣita","noun-adj","","am","lakṣitam"
71,"svābha","SVĀBH","a","svābhū","noun-adj","","a","svābha"
72,"prajñ","PRAJÑ","a","prajñā","noun-adj","","a","prajñā"
73,"^āliṅgitaṃ","ĀLIṄGIT","aṃ","āliṅgita","noun-adj","","am","āliṅgitam"
74,"vyom","VYOM","a","vyoma","noun-adj","","a","vyoma"
75,"^āvakāśinaṃ","AVAKĀŚ","inaṃ","avakāśin","noun-adj","","inam","avakāśinam"
76,"vajradharā","VAJRADHAR","ā","vajradhara","noun-adj","","āḥ","vajradharāḥ"
77,"viśe","VIŚ","e","viśa","noun-adj","","e","viśe"
78,"bhiṣe","ABHIṢ","e","abhiṣa","noun-adj","","e","abhiṣe"
79,"kin","","","kim","pron","","","kim"
80,"aṃ","","","","ind","","",""
81,"kāyavāk","KĀYAVĀK","","kāyavāka","noun-adj","","","kāyavāk"
82,"citt","CITT","a","citta","noun-adj","","a","citta"
83,"^ādhiṣṭhitaṃ","ADHIṢṬHIT","aṃ","adhiṣṭhita","noun-adj","","am","adhiṣṭhitam"
84,"suviśuddha","SUVIŚUDDH","a","suviśuddha","noun-adj","","a","suviśuddha"
85,"dharmadhātu","DHARMADHĀT","u","dharmadhātu","noun-adj","","u","dharmadhātu"
86,"jñāna","JÑĀN","a","jñāna","noun-adj","","a","jñāna"
87,"svabhāvam","SVABHĀV","am","svabhāva","noun-adj","","am","svabhāvam"
88,"ātmānaṃ","ĀTM","ānaṃ","ātman","noun-adj","","ānaṃ","ātmānaṃ"
89,"vibhāvya","VIBHĀVY","a","vibhāvya","noun-adj","","a","vibhāvya"
90,"tatra","","","tatra","ind","","","tatra"
91,"pūrva","PŪRV","a","pūrva","noun-adj","","a","pūrva"
92,"dale","DAL","e","dala","noun-adj","","e","dale"
93,"vajraḍākinī","VAJRAḌĀK","inī","vajraḍākin","noun-adj","","inī","vajraḍākinī"
94,"nīla","NĪL","a","nīla","noun-adj","","a","nīla"
95,"varṇā","VARṆ","ā","varṇa","noun-adj","","āḥ","varṇāḥ"
96,"nīlapīta","NĪLAPĪT","a","nīlapīta","noun-adj","","a","nīlapīta"
97,"raktaśyāma","RAKTAŚYĀM","a","raktaśyāma","noun-adj","","a","raktaśyāma"
98,"caturmukhā","CATURMUKH","ā","caturmukha","noun-adj","","āḥ","caturmukhāḥ"
99,"caturbhujā","CATURBHUJ","ā","caturbhuja","noun-adj","","āḥ","caturbhujāḥ"
100,"vāma","VĀM","a","vāma","noun-adj","","a","vāma"
101,"bhuje","BHUJ","e","bhuja","noun-adj","","e","bhuje"
102,"khaṭv","KHAṬV","a","khaṭvā","noun-adj","","a","khaṭvā"
103,"^āṅga","ĀṄG","a","āṅga","noun-adj","","a","āṅga"
104,"ghaṇṭāṃ","GHAṆṬ","āṃ","ghaṇṭā","noun-adj","","ām","ghaṇṭām"
105,"dakṣiṇe","DAKṢIṆ","e","dakṣiṇa","noun-adj","","e","dakṣiṇe"
106,"vajra","VAJR","a","vajra","noun-adj","","a","vajra"
107,"kapāla","KAPĀL","a","kapāla","noun-adj","","a","kapāla"
108,"hastā","HAST","ā","hastā","noun-adj","","ā","hastā"
109,"pṛthivī","PṚTHIV","ī","pṛthivī","noun-adj","","ī","pṛthivī"
110,"dhātv","DHĀT","v","dhātu","noun-adj","","v","dhātv"
111,"ādarśa","ĀDARŚ","a","ādarśa","noun-adj","","a","ādarśa"
112,"jñāna","JÑĀN","a","jñāna","noun-adj","","a","jñāna"
113,"svabhāvā","SVABHĀV","ā","svabhāva","noun-adj","","ā","svabhāvā"
114,";","","","","punct","","",";"
115,"dakṣiṇa","DAKṢIṆ","a","dakṣiṇa","noun-adj","","a","dakṣiṇa"
116,"dale","DAL","e","dala","noun-adj","","e","dale"
117,"ratna","RATN","a","ratna","noun-adj","","a","ratna"
118,"ḍākinī","ḌĀKIN","ī","ḍākinī","noun-adj","","ī","ḍākinī"
119,"pītavarṇā","PĪTAVARṆ","ā","pītavarṇa","noun-adj","","āḥ","pītavarṇāḥ"
120,"pītanīla","PĪTANĪL","a","pītanīla","noun-adj","","a","pītanīla"
121,"raktaśyāma","RAKTAŚYĀM","a","raktaśyāma","noun-adj","","a","raktaśyāma"
122,"caturmukhā","CATURMUKH","ā","caturmukha","noun-adj","","āḥ","caturmukhāḥ"
123,"caturbhujā","CATURBHUJ","ā","caturbhuja","noun-adj","","āḥ","caturbhujāḥ"
124,"vāma","VĀM","a","vāma","noun-adj","","a","vāma"
125,"bhuje","BHUJ","e","bhuja","noun-adj","","e","bhuje"
126,"patākāṃ","PATĀK","āṃ","patākā","noun-adj","","ām","patākām"
127,"kañcukaṃ","KAÑCUK","aṃ","kañcuka","noun-adj","","am","kañcukam"
128,"ca","","","ca","ind","","","ca"
129,"dakṣiṇe","DAKṢIṆ","e","dakṣiṇa","noun-adj","","e","dakṣiṇe"
130,"triśūla","TRIŚŪL","a","triśūla","noun-adj","","a","triśūla"
131,"ratnahastā","RATNAHAST","ā","ratnahasta","noun-adj","","āḥ","ratnahastāḥ"
132,"abdhātu","ABDHĀT","u","abdhātu","noun-adj","","u","abdhātu"
133,"samatā","SAMAT","ā","samatā","noun-adj","","ā","samatā"
134,"jñāna","JÑĀN","a","jñāna","noun-adj","","a","jñāna"
135,"svabhāvā","SVABHĀV","ā","svabhāva","noun-adj","","ā","svabhāvā"
136,";","","","","punct","","",";"
137,"paścima","PAŚCIM","a","paścima","noun-adj","","a","paścima"
138,"dale","DAL","e","dala","noun-adj","","e","dale"
139,"padma","PADM","a","padma","noun-adj","","a","padma"
140,"ḍākinī","ḌĀKIN","ī","ḍākinī","noun-adj","","ī","ḍākinī"
141,"sit","SIT","a","sita","noun-adj","","a","sita"
142,"^āruṇa","ĀRUṆ","a","āruṇa","noun-adj","","a","āruṇa"
143,"varṇā","VARṆ","ā","varṇa","noun-adj","","āḥ","varṇāḥ"
144,"rakta","RAKT","a","rakta","noun-adj","","a","rakta"
145,"pītanīla","PĪTANĪL","a","pītanīla","noun-adj","","a","pītanīla"
146,"śyāma","ŚYĀM","a","śyāma","noun-adj","","a","śyāma"
147,"caturmukhā","CATURMUKH","ā","caturmukha","noun-adj","","āḥ","caturmukhāḥ"
148,"caturbhujā","CATURBHUJ","ā","caturbhuja","noun-adj","","āḥ","caturbhujāḥ"
149,"vāma","VĀM","a","vāma","noun-adj","","a","vāma"
150,"bhuje","BHUJ","e","bhuja","noun-adj","","e","bhuje"
151,"dhanuḥ","DHAN","uḥ","dhanu","noun-adj","","uḥ","dhanuḥ"
152,"kapālaṃ","KAPĀL","aṃ","kapāla","noun-adj","","am","kapālam"
153,"dakṣiṇe","DAKṢIṆ","e","dakṣiṇa","noun-adj","","e","dakṣiṇe"
154,"śara","ŚAR","a","śara","noun-adj","","a","śara"
155,"viśva","VIŚV","a","viśva","noun-adj","","a","viśva"
156,"padmahastā","PADMAHAST","ā","padmahasta","noun-adj","","āḥ","padmahastāḥ"
157,"tejodhātu","TEJODHĀT","u","tejodhātu","noun-adj","","u","tejodhātu"
158,"pratyavekṣaṇā","PRATYAVEKṢAṆ","ā","pratyavekṣaṇā","noun-adj","","ā","pratyavekṣaṇā"
159,"jñāna","JÑĀN","a","jñāna","noun-adj","","a","jñāna"
160,"svabhāvā","SVABHĀV","ā","svabhāva","noun-adj","","ā","svabhāvā"
161,";","","","","punct","","",";"
162,"uttara","UTTAR","a","uttara","noun-adj","","a","uttara"
163,"dale","DAL","e","dala","noun-adj","","e","dale"
164,"viśva","VIŚV","a","viśva","noun-adj","","a","viśva"
165,"ḍākinī","ḌĀKIN","ī","ḍākinī","noun-adj","","ī","ḍākinī"
166,"śyāmavarṇā","ŚYĀMAVARṆ","ā","śyāmavarṇa","noun-adj","","āḥ","śyāmavarṇāḥ"
167,"śyāma","ŚYĀM","a","śyāma","noun-adj","","a","śyāma"
168,"pītarakta","PĪTARAKT","a","pītarakta","noun-adj","","a","pītarakta"
169,"nīla","NĪL","a","nīla","noun-adj","","a","nīla"
170,"caturmukhā","CATURMUKH","ā","caturmukha","noun-adj","","āḥ","caturmukhāḥ"
171,"caturbhujā","CATURBHUJ","ā","caturbhuja","noun-adj","","āḥ","caturbhujāḥ"
172,"vāma","VĀM","a","vāma","noun-adj","","a","vāma"
173,"bhuje","BHUJ","e","bhuja","noun-adj","","e","bhuje"
174,"pāśa","PĀŚ","a","pāśa","noun-adj","","a","pāśa"
175,"kapālaṃ","KAPĀL","aṃ","kapāla","noun-adj","","am","kapālam"
176,"dakṣiṇe","DAKṢIṆ","e","dakṣiṇa","noun-adj","","e","dakṣiṇe"
177,"khaṭv","KHAṬV","a","khaṭvā","noun-adj","","a","khaṭvā"
178,"^āṅga","ĀṄG","a","āṅga","noun-adj","","a","āṅga"
179,"ḍamaru","ḌAMAR","u","ḍamaru","noun-adj","","u","ḍamaru"
180,"hastā","HAST","ā","hastā","noun-adj","","ā","hastā"
181,"vāyudhātu","VĀYUDHĀT","u","vāyudhātu","noun-adj","","u","vāyudhātu"
182,"kṛty","KṚTY","a","kṛtya","noun-adj","","a","kṛtya"
183,"^ānuṣṭhāna","ANUṢṬHĀN","a","anuṣṭhāna","noun-adj","","a","anuṣṭhāna"
184,"svabhāvā","SVABHĀV","ā","svabhāva","noun-adj","","ā","svabhāvā"
185,"/","","","","punct","","","/"
NA,"</s>","","","","","","",""
NA,"<s number=""9"">","","","","","","",""
1,"devyaḥ","DEVY","aḥ","devya","noun-adj","","aḥ","devyaḥ"
2,"sarvā","SARV","ā","sarva","noun-adj","","āḥ","sarvāḥ"
3,"raudr","RAUDR","a","raudra","noun-adj","","a","raudra"
4,"^āsanasthāḥ","ĀSANASTH","āḥ","āsanastha","noun-adj","","āḥ","āsanasthāḥ"
5,"kapālamālābhiḥ","KAPĀLAMĀL","ābhiḥ","kapālamālā","noun-adj","","ābhiḥ","kapālamālābhiḥ"
6,"śirasi","ŚIRAS","i","śiras","noun-adj","","i","śirasi"
7,"vibhūṣitāḥ","VIBHŪṢIT","āḥ","vibhūṣita","noun-adj","","āḥ","vibhūṣitāḥ"
8,"sārdra","SĀRDR","a","sārdra","noun-adj","","a","sārdra"
9,"muṇḍa","MUṆḌ","a","muṇḍa","noun-adj","","a","muṇḍa"
10,"srag","SRAG","","sraga","noun-adj","","","srag"
11,"dāma","DĀM","a","dāma","noun-adj","","a","dāma"
12,"mālinyas","MĀLINY","as","mālinya","noun-adj","","aḥ","mālinyaḥ"
13,"trinetrā","TRINETR","ā","trinetrā","noun-adj","","ā","trinetrā"
14,"īṣad","ĪṢAD","","īṣat","noun-adj","","","īṣad"
15,"daṃṣṭrā","DAṂṢṬR","ā","daṃṣṭra","noun-adj","","āḥ","daṃṣṭrāḥ"
16,"karālavadanā","KARĀLAVADAN","ā","karālavadana","noun-adj","","āḥ","karālavadanāḥ"
17,"jvalit","JVALIT","a","jvalita","noun-adj","","a","jvalita"
18,"^ordhva","ŪRDHV","a","ūrdhva","noun-adj","","a","ūrdhva"
19,"piṅgala","PIṄGAL","a","piṅgala","noun-adj","","a","piṅgala"
20,"keśāḥ","KEŚ","āḥ","keśa","noun-adj","","āḥ","keśāḥ"
21,"sphurad","SPHUR","ad","sphurat","noun-adj","","at","sphurat"
22,"raśmi","RAŚM","i","raśmi","noun-adj","","i","raśmi"
23,"mālinyaḥ","MĀLINY","aḥ","mālinya","noun-adj","","aḥ","mālinyaḥ"
24,"/","","","","punct","","","/"
NA,"</s>","","","","","","",""
NA,"<s number=""10"">","","","","","","",""
1,"evaṃ","","","eva","ind","","","eva"
2,"catur","CATUR","","catur","noun-adj","","","catur"
3,"devī","DEV","ī","devī","noun-adj","","ī","devī"
4,"samāvṛtam","SAMĀVṚT","am","samāvṛta","noun-adj","","am","samāvṛtam"
5,"ātmānaṃ","ĀTM","ānaṃ","ātman","noun-adj","","ānaṃ","ātmānaṃ"
6,"karuṇ","KARUṆ","a","karuṇa","noun-adj","","a","karuṇa"
7,"^ācala","ĀCAL","a","ācal","noun-adj","","a","ācala"
8,"vajraṃ","VAJR","aṃ","vajra","noun-adj","","am","vajram"
9,"dhyātvā","DHYĀTV","ā","dhyāy","verb","dhyai","ā","dhyātvā"
10,"śirasi","ŚIRAS","i","śiras","noun-adj","","i","śirasi"
11,"hṛdi","HṚD","i","hṛdi","noun-adj","","i","hṛdi"
12,"nābhau","NĀBH","au","nābha","noun-adj","","au","nābhau"
13,"guhye","GUHY","e","guhya","noun-adj","","e","guhye"
14,"vāyu","VĀY","u","vāyu","noun-adj","","u","vāyu"
15,"māh","MĀH","a","māhā","noun-adj","","a","māhā"
16,"^endra","INDR","a","indra","noun-adj","","a","indra"
17,"varuṇ","VARUṆ","a","varuṇa","noun-adj","","a","varuṇa"
18,"^āgni","AGN","i","agni","noun-adj","","i","agni"
19,"maṇḍaleṣu","MAṆḌAL","eṣu","maṇḍala","noun-adj","","eṣu","maṇḍaleṣu"
20,"yath","","","yathā","ind","","","yathā"
21,"opadeśaṃ","UPADEŚ","aṃ","upadeśa","noun-adj","","am","upadeśam"
22,"vibhāvya","VIBHĀVY","a","vibhāvya","noun-adj","","a","vibhāvya"
23,"napuṃsaka","NAPUṂSAK","a","napuṃsaka","noun-adj","","a","napuṃsaka"
24,"jāpaṃ","JĀP","aṃ","jāpa","noun-adj","","am","jāpam"
25,"kuryād","KUR","yād","kar","verb","kṛ","yād","kuryād"
26,"mantrī","MANTR","ī","mantrin","noun-adj","","ī","mantrī"
27,"/","","","","punct","","","/"
NA,"</s>","","","","","","",""
NA,"<s number=""11"">","","","","","","",""
1,"khinne","KHINN","e","khinna","noun-adj","","e","khinne"
2,"sati","SAT","i","sat","noun-adj","","i","sati"
3,"mantra","MANTR","a","mantra","noun-adj","","a","mantra"
4,"jāpaṃ","JĀP","aṃ","jāpa","noun-adj","","am","jāpam"
5,"kṛtvā","KṚTV","ā","kṛtvā","noun-adj","","ā","kṛtvā"
6,"oṃ","","","oṃ","ind","","","oṃ"
7,"āḥ","","","","ind","","",""
8,"hrīṃ","HR","īṃ","hrī","noun-adj","","īm","hrīm"
9,"huṃ","","","","ind","","",""
10,"phaṭ","PHAṬ","","phaṭa","noun-adj","","","phaṭ"
11,"evaṃ","","","eva","ind","","","eva"
12,"bhava","BHAV","a","bhava","noun-adj","","a","bhava"
13,"sama","SAM","a","sama","noun-adj","","a","sama"
14,"sarva","SARV","a","sarva","noun-adj","","a","sarva"
15,"bhāva","BHĀV","a","bhāva","noun-adj","","a","bhāva"
16,"svabhāva","SVABHĀV","a","svabhāva","noun-adj","","a","svabhāva"
17,"mantra","MANTR","a","mantra","noun-adj","","a","mantra"
18,"saṃsthāna","SAṂSTHĀN","a","saṃsthāna","noun-adj","","a","saṃsthāna"
19,"dharm","DHARM","a","dharma","noun-adj","","a","dharma"
20,"^ātmā","ĀTM","ā","ātman","noun-adj","","ā","ātmā"
21,"yogī","YOG","ī","yogin","noun-adj","","ī","yogī"
22,"sarvaviṣay","SARVAVIṢAY","a","sarvaviṣaya","noun-adj","","a","sarvaviṣaya"
23,"^ādi","ĀD","i","ādi","noun-adj","","i","ādi"
24,"kṛtyaṃ","KṚTY","aṃ","kṛtya","noun-adj","","am","kṛtyam"
25,"kuryāt","KUR","yāt","kar","verb","kṛ","yāt","kuryāt"
26,"prākṛta","PRĀKṚT","a","prākṛta","noun-adj","","a","prākṛta"
27,"kalpa","KALP","a","kalpa","noun-adj","","a","kalpa"
28,"muktaye","MUKT","aye","mukti","noun-adj","","aye","muktaye"
29,"iti","","","iti","ind","","","iti"
30,"/","","","","punct","","","/"
NA,"</s>","","","","","","",""
NA,"<s number=""12"">","","","","","","",""
1,"//","","","","punct","","","//"
2,"mahāmāy","MAHĀMĀY","a","mahāmāya","noun-adj","","a","mahāmāya"
3,"^āsādhan","ĀSĀDHAN","a","āsādhana","noun-adj","","a","āsādhana"
4,"^opāyikā","UPĀYIK","ā","upāyikā","noun-adj","","ā","upāyikā"
5,"samāptā","SAMĀPT","ā","samāpta","noun-adj","","ā","samāptā"
6,"//","","","","punct","","","//"
NA,"</s>","","","","","","",""
NA,"<s number=""13"">","","","","","","",""
1,"kṛtir","KṚT","ir","kṛti","noun-adj","","iḥ","kṛtiḥ"
2,"iyaṃ","","","idam","pron","","","idam"
3,"kukkuri","KUKKUR","i","kukkuri","noun-adj","","i","kukkuri"
4,"pādānām","PĀD","ānām","pāda","noun-adj","","ānām","pādānām"
5,"iti","","","iti","ind","","","iti"
6,"/","","","","punct","","","/"
NA,"</s>","","","","","","",""
NA,"</doc>","","","","","","",""
