"WordID","word","NormSTEM","suffix","lemma","PoS","Root","NormSuffix","NormWord"
1,"vaiśaṃpāyana","_","_","vaiśampāyana","NC","","_","_"
2,"uvāca","_","_","vak","V","vac","_","_"
1,"evaṃ","_","_","eva","CX","","_","_"
2,"bahuvidhair","_","_","bahuvidha","JJ","","_","_"
3,"vākyair","_","_","vākya","NC","","_","_"
4,"_","_","_","muni","NC","","_","_"
5,"_","_","_","tad","PRD","","_","_"
6,"_","_","_","tapodhana","JJ","","_","_"
1,"samāśvasyata","_","_","samāśvas","V","samāśvas","_","_"
2,"rājarṣir","_","_","rājarṣi","NC","","_","_"
3,"_","_","_","han","PPP","","_","_"
4,"_","_","_","bandhu","NC","","_","_"
5,"yudhiṣṭhiraḥ","_","_","yudhiṣṭhira","NC","","_","_"
1,"so","_","_","tad","PRD","","_","_"
2,"'nunīto","_","_","anunī","PPP","","_","_"
3,"bhagavatā","_","_","bhagavat","NC","","_","_"
4,"viṣṭaraśravasā","_","_","viṣṭaraśravas","NC","","_","_"
5,"svayam","_","_","svaya","CX","","_","_"
1,"dvaipāyanena","_","_","dvaipāyana","NC","","_","_"
2,"kṛṣṇena","_","_","kṛṣṇa","NC","","_","_"
3,"devasthānena","_","_","devasthāna","NC","","_","_"
1,"_","_","_","nārada","NC","","_","_"
2,"_","_","_","atha","CAD","","_","_"
3,"bhīmena","_","_","bhīma","NC","","_","_"
4,"nakulena","_","_","nakula","NC","","_","_"
5,"ca","_","_","ca","CCD","","_","_"
6,"pārthivaḥ","_","_","pārthiva","NC","","_","_"
1,"kṛṣṇayā","_","_","kṛṣṇā","NC","","_","_"
2,"sahadevena","_","_","sahadeva","NC","","_","_"
3,"vijayena","_","_","vijaya","NC","","_","_"
4,"ca","_","_","ca","CCD","","_","_"
5,"dhīmatā","_","_","dhīmat","JJ","","_","_"
1,"_","_","_","anya","PPX","","_","_"
2,"_","_","_","ca","CCD","","_","_"
3,"_","_","_","puruṣa","NC","","_","_"
4,"_","_","_","vyāghra","NC","","_","_"
5,"brāhmaṇaiḥ","_","_","brāhmaṇa","NC","","_","_"
6,"_","_","_","śāstra","NC","","_","_"
7,"_","_","_","dṛṣṭin","JJ","","_","_"
1,"_","_","_","vijah","V","vihā","_","_"
2,"_","_","_","śoka","NC","","_","_"
3,"_","_","_","ja","JJ","","_","_"
4,"duḥkhaṃ","_","_","duḥkha","NC","","_","_"
5,"saṃtāpaṃ","_","_","saṃtāpa","NC","","_","_"
6,"_","_","_","ca","CCD","","_","_"
7,"_","_","_","eva","CEM","","_","_"
8,"mānasam","_","_","mānasa","JJ","","_","_"
1,"arcayāmāsa","_","_","arcay","V","arcay","_","_"
2,"_","_","_","deva","NC","","_","_"
3,"_","_","_","ca","CCD","","_","_"
4,"_","_","_","brāhmaṇa","NC","","_","_"
5,"_","_","_","ca","CCD","","_","_"
6,"yudhiṣṭhiraḥ","_","_","yudhiṣṭhira","NC","","_","_"
1,"_","_","_","kṛ","CGDA","","_","_"
2,"_","_","_","atha","CAD","","_","_"
3,"pretakāryāṇi","_","_","pretakārya","NC","","_","_"
4,"bandhūnāṃ","_","_","bandhu","NC","","_","_"
5,"sa","_","_","tad","PRD","","_","_"
6,"punar","_","_","punar","CAD","","_","_"
7,"nṛpaḥ","_","_","nṛpa","NC","","_","_"
1,"anvaśāsata","_","_","anuśās","V","anuśās","_","_"
2,"_","_","_","dharma","NC","","_","_"
3,"_","_","_","ātman","NC","","_","_"
4,"pṛthivīṃ","_","_","pṛthivī","NC","","_","_"
5,"sāgarāmbarām","_","_","sāgarāmbarā","NC","","_","_"
1,"_","_","_","praśa","PPP","","_","_"
2,"_","_","_","cetas","NC","","_","_"
3,"kauravyaḥ","_","_","kauravya","NC","","_","_"
4,"_","_","_","sva","JJ","","_","_"
5,"_","_","_","rājya","NC","","_","_"
6,"prāpya","_","_","prāp","CGDA","","_","_"
7,"kevalam","_","_","kevala","JJ","","_","_"
1,"vyāsaṃ","_","_","vyāsa","NC","","_","_"
2,"ca","_","_","ca","CCD","","_","_"
3,"nāradaṃ","_","_","nārada","NC","","_","_"
4,"_","_","_","ca","CCD","","_","_"
5,"_","_","_","eva","CEM","","_","_"
6,"_","_","_","tad","PRD","","_","_"
7,"_","_","_","ca","CCD","","_","_"
8,"_","_","_","anya","PPX","","_","_"
9,"_","_","_","abravīta","V","brū","_","_"
10,"_","_","_","nṛpa","NC","","_","_"
1,"āśvāsito","_","_","āśvāsay","PPP","","_","_"
2,"'haṃ","_","_","mat","PPR","","_","_"
3,"prāg","_","_","prāk","CX","","_","_"
4,"vṛddhair","_","_","vṛddha","JJ","","_","_"
5,"bhavadbhir","_","_","bhavat","JJ","","_","_"
6,"_","_","_","muni","NC","","_","_"
7,"_","_","_","puṃgava","NC","","_","_"
1,"na","_","_","na","CNG","","_","_"
2,"sūkṣmam","_","_","sūkṣma","JJ","","_","_"
3,"api","_","_","api","CX","","_","_"
4,"me","_","_","mat","PPR","","_","_"
5,"kiṃcid","_","_","kiṃcit","PRI","","_","_"
6,"vyalīkam","_","_","vyalīka","NC","","_","_"
7,"iha","_","_","iha","CAD","","_","_"
8,"vidyate","_","_","vid","V","vid","_","_"
1,"_","_","_","artha","NC","","_","_"
2,"_","_","_","ca","CCD","","_","_"
3,"_","_","_","su","CAD","","_","_"
4,"_","_","_","mahat","JJ","","_","_"
5,"prāpto","_","_","prāp","PPP","","_","_"
6,"yena","_","_","yad","PRL","","_","_"
7,"yakṣyāmi","_","_","yaj","V","yaj","_","_"
8,"devatāḥ","_","_","devatā","NC","","_","_"
1,"_","_","_","puraskṛ","CGDA","","_","_"
2,"_","_","_","iha","CAD","","_","_"
3,"bhavataḥ","_","_","bhavat","JJ","","_","_"
4,"samāneṣyāmahe","_","_","samānay","V","samānī","_","_"
5,"makham","_","_","makha","NC","","_","_"
1,"himavantaṃ","_","_","himavat","NC","","_","_"
2,"tvayā","_","_","tvat","PPR","","_","_"
3,"guptā","_","_","gup","PPP","","_","_"
4,"gamiṣyāmaḥ","_","_","gacch","V","gam","_","_"
5,"pitāmaha","_","_","pitāmaha","NC","","_","_"
1,"_","_","_","bahu","JJ","","_","_"
2,"_","_","_","āścarya","NC","","_","_"
3,"hi","_","_","hi","CX","","_","_"
4,"deśaḥ","_","_","deśa","NC","","_","_"
5,"sa","_","_","tad","PRD","","_","_"
6,"śrūyate","_","_","śṛṇ","V","śru","_","_"
7,"dvijasattama","_","_","dvijasattama","NC","","_","_"
1,"tathā","_","_","tathā","CX","","_","_"
2,"bhagavatā","_","_","bhagavat","NC","","_","_"
3,"citraṃ","_","_","citra","JJ","","_","_"
4,"kalyāṇaṃ","_","_","kalyāṇa","JJ","","_","_"
5,"bahu","_","_","bahu","JJ","","_","_"
6,"bhāṣitam","_","_","bhāṣ","PPP","","_","_"
1,"_","_","_","deva","NC","","_","_"
2,"_","_","_","ṛṣi","NC","","_","_"
3,"nāradena","_","_","nārada","NC","","_","_"
4,"devasthānena","_","_","devasthāna","NC","","_","_"
5,"_","_","_","ca","CCD","","_","_"
6,"_","_","_","eva","CEM","","_","_"
7,"ha","_","_","ha","CEM","","_","_"
1,"_","_","_","na","CNG","","_","_"
2,"_","_","_","abhāgadheya","JJ","","_","_"
3,"puruṣaḥ","_","_","puruṣa","NC","","_","_"
4,"kaścid","_","_","kiṃcit","PRI","","_","_"
5,"evaṃvidhān","_","_","evaṃvidha","JJ","","_","_"
6,"gurūn","_","_","guru","NC","","_","_"
1,"labhate","_","_","labh","V","labh","_","_"
2,"vyasanaṃ","_","_","vyasana","NC","","_","_"
3,"prāpya","_","_","prāp","CGDA","","_","_"
4,"suhṛdaḥ","_","_","suhṛd","NC","","_","_"
5,"_","_","_","sādhu","JJ","","_","_"
6,"_","_","_","samman","PPP","","_","_"
1,"evam","_","_","eva","CX","","_","_"
2,"_","_","_","vac","PPP","","_","_"
3,"_","_","_","tu","CCD","","_","_"
4,"te","_","_","tad","PRD","","_","_"
5,"rājñā","_","_","rājan","NC","","_","_"
6,"sarva","_","_","sarva","JQ","","_","_"
7,"eva","_","_","eva","CEM","","_","_"
8,"_","_","_","mahat","JJ","","_","_"
9,"_","_","_","ṛṣi","NC","","_","_"
1,"abhyanujñāpya","_","_","abhyanujñāpay","CGDA","","_","_"
2,"rājānaṃ","_","_","rājan","NC","","_","_"
3,"_","_","_","tathā","CX","","_","_"
4,"_","_","_","ubh","PPX","","_","_"
5,"_","_","_","kṛṣṇa","NC","","_","_"
6,"_","_","_","phalguna","NC","","_","_"
1,"paśyatām","_","_","dṛś","KDP","","_","_"
2,"eva","_","_","eva","CEM","","_","_"
3,"sarveṣāṃ","_","_","sarva","JQ","","_","_"
4,"_","_","_","tatra","CAD","","_","_"
5,"_","_","_","eva","CEM","","_","_"
6,"_","_","_","adarśana","NC","","_","_"
7,"yayuḥ","_","_","yā","V","yā","_","_"
1,"tato","_","_","tatas","CX","","_","_"
2,"dharmasuto","_","_","dharmasuta","NC","","_","_"
3,"rājā","_","_","rājan","NC","","_","_"
4,"_","_","_","tatra","CAD","","_","_"
5,"_","_","_","eva","CEM","","_","_"
6,"_","_","_","upaviś","V","upaviś","_","_"
7,"prabhuḥ","_","_","prabhu","JJ","","_","_"
1,"evaṃ","_","_","eva","CX","","_","_"
2,"_","_","_","na","CNG","","_","_"
3,"_","_","_","ati","CADP","","_","_"
4,"_","_","_","mahat","JJ","","_","_"
5,"kālaḥ","_","_","kāla","NC","","_","_"
6,"sa","_","_","tad","PRD","","_","_"
7,"teṣām","_","_","tad","PRD","","_","_"
8,"abhyavartata","_","_","abhivart","V","abhivṛt","_","_"
1,"kurvatāṃ","_","_","kṛ","KDP","","_","_"
2,"_","_","_","śauca","NC","","_","_"
3,"_","_","_","karman","NC","","_","_"
4,"bhīṣmasya","_","_","bhīṣma","NC","","_","_"
5,"nidhane","_","_","nidhana","NC","","_","_"
6,"tadā","_","_","tadā","CAD","","_","_"
1,"_","_","_","mahat","JJ","","_","_"
2,"_","_","_","dāna","NC","","_","_"
3,"viprebhyo","_","_","vipra","NC","","_","_"
4,"dadatām","_","_","dā","KDP","","_","_"
5,"aurdhvadaihikam","_","_","aurdhvadaihika","JJ","","_","_"
1,"_","_","_","bhīṣma","NC","","_","_"
2,"_","_","_","karṇa","NC","","_","_"
3,"_","_","_","puroga","JJ","","_","_"
4,"kurūṇāṃ","_","_","kuru","NC","","_","_"
5,"_","_","_","kuru","NC","","_","_"
6,"_","_","_","nandana","NC","","_","_"
1,"sahito","_","_","sahita","JJ","","_","_"
2,"dhṛtarāṣṭreṇa","_","_","dhṛtarāṣṭra","NC","","_","_"
3,"_","_","_","pradad","V","pradā","_","_"
4,"_","_","_","aurdhvadaihika","JJ","","_","_"
1,"tato","_","_","tatas","CX","","_","_"
2,"dattvā","_","_","dā","CGDA","","_","_"
3,"bahu","_","_","bahu","JJ","","_","_"
4,"dhanaṃ","_","_","dhana","NC","","_","_"
5,"viprebhyaḥ","_","_","vipra","NC","","_","_"
6,"_","_","_","pāṇḍava","NC","","_","_"
7,"_","_","_","ṛṣabha","NC","","_","_"
1,"dhṛtarāṣṭraṃ","_","_","dhṛtarāṣṭra","NC","","_","_"
2,"puraskṛtya","_","_","puraskṛ","CGDA","","_","_"
3,"viveśa","_","_","viś","V","viś","_","_"
4,"gajasāhvayam","_","_","gajasāhvaya","NC","","_","_"
1,"sa","_","_","tad","PRD","","_","_"
2,"samāśvāsya","_","_","samāśvāsay","CGDA","","_","_"
3,"pitaraṃ","_","_","pitṛ","NC","","_","_"
4,"prajñācakṣuṣam","_","_","prajñācakṣus","NC","","_","_"
5,"īśvaram","_","_","īśvara","NC","","_","_"
1,"anvaśād","_","_","anuśās","V","anuśās","_","_"
2,"vai","_","_","vai","CX","","_","_"
3,"sa","_","_","tad","PRD","","_","_"
4,"_","_","_","dharma","NC","","_","_"
5,"_","_","_","ātman","NC","","_","_"
6,"pṛthivīṃ","_","_","pṛthivī","NC","","_","_"
7,"bhrātṛbhiḥ","_","_","bhrātṛ","NC","","_","_"
8,"saha","_","_","saha","CX","","_","_"
