"WordID","word","NormSTEM","suffix","lemma","PoS","Root","NormSuffix","NormWord"
1,"vaiśaṃpāyana","_","_","vaiśampāyana","NC","","_","_"
2,"uvāca","_","_","vak","V","vac","_","_"
1,"tataḥ","_","_","tatas","CX","","_","_"
2,"śāṃtanavaṃ","_","_","śāṃtanava","NC","","_","_"
3,"bhīṣmaṃ","_","_","bhīṣma","NC","","_","_"
4,"prāñjalir","_","_","prāñjali","JJ","","_","_"
5,"_","_","_","dhṛtarāṣṭra","NC","","_","_"
6,"_","_","_","ja","JJ","","_","_"
1,"saha","_","_","saha","CX","","_","_"
2,"sarvair","_","_","sarva","JQ","","_","_"
3,"mahīpālair","_","_","mahīpāla","NC","","_","_"
4,"idaṃ","_","_","ida","PRD","","_","_"
5,"vacanam","_","_","vacana","NC","","_","_"
6,"abravīt","_","_","abravīta","V","brū","_","_"
1,"ṛte","_","_","ṛte","CX","","_","_"
2,"_","_","_","senā","NC","","_","_"
3,"_","_","_","praṇetṛ","NC","","_","_"
4,"pṛtanā","_","_","pṛtanā","NC","","_","_"
5,"_","_","_","su","CAD","","_","_"
6,"_","_","_","mahat","JJ","","_","_"
7,"_","_","_","api","CX","","_","_"
1,"dīryate","_","_","dṛ","V","dṛ","_","_"
2,"yuddham","_","_","yuddha","NC","","_","_"
3,"āsādya","_","_","āsāday","CGDA","","_","_"
4,"_","_","_","pipīlika","NC","","_","_"
5,"_","_","_","puṭa","NC","","_","_"
6,"yathā","_","_","yathā","CCM","","_","_"
1,"na","_","_","na","CNG","","_","_"
2,"hi","_","_","hi","CX","","_","_"
3,"jātu","_","_","jātu","CX","","_","_"
4,"dvayor","_","_","dvi","NUM","","_","_"
5,"buddhiḥ","_","_","buddhi","NC","","_","_"
6,"samā","_","_","sama","PPX","","_","_"
7,"bhavati","_","_","bhav","V","bhū","_","_"
8,"karhicit","_","_","karhicit","CX","","_","_"
1,"śauryaṃ","_","_","śaurya","NC","","_","_"
2,"ca","_","_","ca","CCD","","_","_"
3,"nāma","_","_","nāma","CX","","_","_"
4,"netṝṇāṃ","_","_","netṛ","NC","","_","_"
5,"spardhate","_","_","spardh","V","spṛdh","_","_"
6,"ca","_","_","ca","CCD","","_","_"
7,"parasparam","_","_","paraspara","PRC","","_","_"
1,"śrūyate","_","_","śṛṇ","V","śru","_","_"
2,"ca","_","_","ca","CCD","","_","_"
3,"_","_","_","mahat","JJ","","_","_"
4,"_","_","_","prājña","JJ","","_","_"
5,"haihayān","_","_","haihaya","NC","","_","_"
6,"_","_","_","amita","JJ","","_","_"
7,"_","_","_","ojas","NC","","_","_"
1,"abhyayur","_","_","abhiyā","V","abhiyā","_","_"
2,"brāhmaṇāḥ","_","_","brāhmaṇa","NC","","_","_"
3,"sarve","_","_","sarva","JQ","","_","_"
4,"_","_","_","samucchri","PPP","","_","_"
5,"_","_","_","kuśa","NC","","_","_"
6,"_","_","_","dhvaja","NC","","_","_"
1,"tān","_","_","tad","PRD","","_","_"
2,"_","_","_","anuyā","V","anuyā","_","_"
3,"_","_","_","tadā","CAD","","_","_"
4,"vaiśyāḥ","_","_","vaiśya","NC","","_","_"
5,"_","_","_","śūdra","NC","","_","_"
6,"_","_","_","ca","CCD","","_","_"
7,"_","_","_","eva","CEM","","_","_"
8,"pitāmaha","_","_","pitāmaha","NC","","_","_"
1,"_","_","_","ekatas","CX","","_","_"
2,"_","_","_","tu","CCD","","_","_"
3,"trayo","_","_","tri","NUM","","_","_"
4,"varṇā","_","_","varṇa","NC","","_","_"
5,"ekataḥ","_","_","ekatas","CX","","_","_"
6,"_","_","_","kṣatriya","NC","","_","_"
7,"_","_","_","ṛṣabha","NC","","_","_"
1,"te","_","_","tad","PRD","","_","_"
2,"sma","_","_","sma","CX","","_","_"
3,"_","_","_","yuddha","NC","","_","_"
4,"_","_","_","bhañj","V","bhañj","_","_"
5,"trayo","_","_","tri","NUM","","_","_"
6,"varṇāḥ","_","_","varṇa","NC","","_","_"
7,"punaḥ","_","_","punar","CAD","","_","_"
8,"punaḥ","_","_","punar","CAD","","_","_"
1,"_","_","_","kṣatriya","NC","","_","_"
2,"_","_","_","tu","CCD","","_","_"
3,"_","_","_","jay","V","ji","_","_"
4,"_","_","_","eva","CEM","","_","_"
5,"bahulaṃ","_","_","bahula","JJ","","_","_"
6,"_","_","_","ca","CCD","","_","_"
7,"_","_","_","ekatas","CX","","_","_"
8,"balam","_","_","bala","NC","","_","_"
1,"_","_","_","tatas","CX","","_","_"
2,"_","_","_","tad","PRD","","_","_"
3,"kṣatriyān","_","_","kṣatriya","NC","","_","_"
4,"eva","_","_","eva","CEM","","_","_"
5,"papracchur","_","_","pṛcch","V","prach","_","_"
6,"dvijasattamāḥ","_","_","dvijasattama","NC","","_","_"
1,"tebhyaḥ","_","_","tad","PRD","","_","_"
2,"śaśaṃsur","_","_","śaṃs","V","śaṃs","_","_"
3,"_","_","_","dharma","NC","","_","_"
4,"_","_","_","jña","JJ","","_","_"
5,"yāthātathyaṃ","_","_","yāthātathya","NC","","_","_"
6,"pitāmaha","_","_","pitāmaha","NC","","_","_"
1,"vayam","_","_","mat","PPR","","_","_"
2,"ekasya","_","_","eka","PPX","","_","_"
3,"śṛṇumo","_","_","śṛṇ","V","śru","_","_"
4,"_","_","_","mahat","JJ","","_","_"
5,"_","_","_","buddhimat","JJ","","_","_"
6,"raṇe","_","_","raṇa","NC","","_","_"
1,"_","_","_","bhavat","JJ","","_","_"
2,"_","_","_","tu","CCD","","_","_"
3,"pṛthak","_","_","pṛthak","CX","","_","_"
4,"sarve","_","_","sarva","JQ","","_","_"
5,"_","_","_","sva","JJ","","_","_"
6,"_","_","_","buddhi","NC","","_","_"
7,"_","_","_","vaśa","NC","","_","_"
8,"_","_","_","vartin","JJ","","_","_"
1,"_","_","_","tatas","CX","","_","_"
2,"_","_","_","tad","PRD","","_","_"
3,"_","_","_","brāhmaṇa","NC","","_","_"
4,"_","_","_","kar","V","kṛ","_","_"
5,"ekaṃ","_","_","eka","PPX","","_","_"
6,"senāpatiṃ","_","_","senāpati","NC","","_","_"
7,"dvijam","_","_","dvija","NC","","_","_"
1,"nayeṣu","_","_","naya","NC","","_","_"
2,"kuśalaṃ","_","_","kuśala","JJ","","_","_"
3,"śūram","_","_","śūra","NC","","_","_"
4,"ajayan","_","_","jay","V","ji","_","_"
5,"_","_","_","kṣatriya","NC","","_","_"
6,"_","_","_","tatas","CX","","_","_"
1,"evaṃ","_","_","eva","CX","","_","_"
2,"ye","_","_","yad","PRL","","_","_"
3,"kuśalaṃ","_","_","kuśala","JJ","","_","_"
4,"śūraṃ","_","_","śūra","NC","","_","_"
5,"hite","_","_","hita","NC","","_","_"
6,"sthitam","_","_","sthā","PPP","","_","_"
7,"akalmaṣam","_","_","akalmaṣa","JJ","","_","_"
1,"senāpatiṃ","_","_","senāpati","NC","","_","_"
2,"prakurvanti","_","_","prakar","V","prakṛ","_","_"
3,"te","_","_","tad","PRD","","_","_"
4,"jayanti","_","_","jay","V","ji","_","_"
5,"raṇe","_","_","raṇa","NC","","_","_"
6,"ripūn","_","_","ripu","NC","","_","_"
1,"bhavān","_","_","bhavat","JJ","","_","_"
2,"uśanasā","_","_","uśanas","NC","","_","_"
3,"tulyo","_","_","tulya","JJ","","_","_"
4,"_","_","_","hita","NC","","_","_"
5,"_","_","_","eṣin","JJ","","_","_"
6,"ca","_","_","ca","CCD","","_","_"
7,"sadā","_","_","sadā","CAD","","_","_"
8,"mama","_","_","mat","PPR","","_","_"
1,"asaṃhāryaḥ","_","_","asaṃhārya","JJ","","_","_"
2,"sthito","_","_","sthā","PPP","","_","_"
3,"dharme","_","_","dharma","NC","","_","_"
4,"sa","_","_","tad","PRD","","_","_"
5,"naḥ","_","_","mat","PPR","","_","_"
6,"senāpatir","_","_","senāpati","NC","","_","_"
7,"bhava","_","_","bhav","V","bhū","_","_"
1,"raśmīvatām","_","_","raśmīvat","JJ","","_","_"
2,"_","_","_","iva","CCM","","_","_"
3,"_","_","_","āditya","NC","","_","_"
4,"vīrudhām","_","_","vīrudh","NC","","_","_"
5,"iva","_","_","iva","CCM","","_","_"
6,"candramāḥ","_","_","candramas","NC","","_","_"
1,"kubera","_","_","kubera","NC","","_","_"
2,"iva","_","_","iva","CCM","","_","_"
3,"yakṣāṇāṃ","_","_","yakṣa","NC","","_","_"
4,"marutām","_","_","marut","NC","","_","_"
5,"iva","_","_","iva","CCM","","_","_"
6,"vāsavaḥ","_","_","vāsava","NC","","_","_"
1,"parvatānāṃ","_","_","parvata","NC","","_","_"
2,"yathā","_","_","yathā","CCM","","_","_"
3,"meruḥ","_","_","meru","NC","","_","_"
4,"suparṇaḥ","_","_","suparṇa","NC","","_","_"
5,"patatām","_","_","pat","KDP","","_","_"
6,"iva","_","_","iva","CCM","","_","_"
1,"kumāra","_","_","kumāra","NC","","_","_"
2,"iva","_","_","iva","CCM","","_","_"
3,"bhūtānāṃ","_","_","bhūta","NC","","_","_"
4,"vasūnām","_","_","vasu","NC","","_","_"
5,"iva","_","_","iva","CCM","","_","_"
6,"havyavāṭ","_","_","havyavah","NC","","_","_"
1,"bhavatā","_","_","bhavat","JJ","","_","_"
2,"hi","_","_","hi","CX","","_","_"
3,"vayaṃ","_","_","mat","PPR","","_","_"
4,"guptāḥ","_","_","gup","PPP","","_","_"
5,"_","_","_","śakra","NC","","_","_"
6,"_","_","_","iva","CCM","","_","_"
7,"divaukasaḥ","_","_","divaukas","NC","","_","_"
1,"anādhṛṣyā","_","_","anādhṛṣya","JJ","","_","_"
2,"_","_","_","bhav","V","bhū","_","_"
3,"_","_","_","tridaśa","NC","","_","_"
4,"api","_","_","api","CX","","_","_"
5,"dhruvam","_","_","dhruva","CX","","_","_"
1,"prayātu","_","_","prayā","V","prayā","_","_"
2,"no","_","_","mat","PPR","","_","_"
3,"bhavān","_","_","bhavat","JJ","","_","_"
4,"agre","_","_","agra","NC","","_","_"
5,"devānām","_","_","deva","NC","","_","_"
6,"iva","_","_","iva","CCM","","_","_"
7,"pāvakiḥ","_","_","pāvaki","NC","","_","_"
1,"vayaṃ","_","_","mat","PPR","","_","_"
2,"tvām","_","_","tvat","PPR","","_","_"
3,"anuyāsyāmaḥ","_","_","anuyā","V","anuyā","_","_"
4,"saurabheyā","_","_","saurabheya","NC","","_","_"
5,"_","_","_","iva","CCM","","_","_"
6,"_","_","_","ṛṣabha","NC","","_","_"
1,"bhīṣma","_","_","bhīṣma","NC","","_","_"
2,"uvāca","_","_","vak","V","vac","_","_"
1,"evam","_","_","eva","CX","","_","_"
2,"_","_","_","tad","PRD","","_","_"
3,"_","_","_","mahat","JJ","","_","_"
4,"_","_","_","bāhu","NC","","_","_"
5,"yathā","_","_","yathā","CCM","","_","_"
6,"vadasi","_","_","vad","V","vad","_","_"
7,"bhārata","_","_","bhārata","NC","","_","_"
1,"_","_","_","yathā","CCM","","_","_"
2,"_","_","_","eva","CEM","","_","_"
3,"hi","_","_","hi","CX","","_","_"
4,"bhavanto","_","_","bhavat","JJ","","_","_"
5,"me","_","_","mat","PPR","","_","_"
6,"_","_","_","tathā","CX","","_","_"
7,"_","_","_","eva","CEM","","_","_"
8,"mama","_","_","mat","PPR","","_","_"
9,"pāṇḍavāḥ","_","_","pāṇḍava","NC","","_","_"
1,"api","_","_","api","CX","","_","_"
2,"_","_","_","ca","CCD","","_","_"
3,"_","_","_","eva","CEM","","_","_"
4,"maya","_","_","śreyas","NC","","_","_"
5,"śreyo","_","_","vac","KDG","","_","_"
6,"vācyaṃ","_","_","tad","PRD","","_","_"
7,"teṣāṃ","_","_","narādhipa","NC","","_","_"
1,"yoddhavyaṃ","_","_","yudh","KDG","","_","_"
2,"tu","_","_","tu","CCD","","_","_"
3,"_","_","_","tvat","PPR","","_","_"
4,"_","_","_","artha","NC","","_","_"
5,"yathā","_","_","yathā","CCM","","_","_"
6,"sa","_","_","tad","PRD","","_","_"
7,"samayaḥ","_","_","samaya","NC","","_","_"
8,"kṛtaḥ","_","_","kṛ","PPP","","_","_"
1,"na","_","_","na","CNG","","_","_"
2,"tu","_","_","tu","CCD","","_","_"
3,"paśyāmi","_","_","paś","V","paś","_","_"
4,"yoddhāram","_","_","yoddhṛ","NC","","_","_"
5,"ātmanaḥ","_","_","ātman","NC","","_","_"
6,"sadṛśaṃ","_","_","sadṛśa","JJ","","_","_"
7,"bhuvi","_","_","bhū","NC","","_","_"
1,"ṛte","_","_","ṛte","CX","","_","_"
2,"_","_","_","tad","PRD","","_","_"
3,"_","_","_","nara","NC","","_","_"
4,"_","_","_","vyāghra","NC","","_","_"
5,"_","_","_","kuntī","NC","","_","_"
6,"_","_","_","putra","NC","","_","_"
7,"dhanaṃjayāt","_","_","dhanaṃjaya","NC","","_","_"
1,"sa","_","_","tad","PRD","","_","_"
2,"hi","_","_","hi","CX","","_","_"
3,"veda","_","_","vid","V","vid","_","_"
4,"_","_","_","mahat","JJ","","_","_"
5,"_","_","_","bāhu","NC","","_","_"
6,"_","_","_","divya","JJ","","_","_"
7,"_","_","_","astra","NC","","_","_"
8,"sarvaśaḥ","_","_","sarvaśas","CX","","_","_"
1,"na","_","_","na","CNG","","_","_"
2,"tu","_","_","tu","CCD","","_","_"
3,"māṃ","_","_","mat","PPR","","_","_"
4,"vivṛto","_","_","vivṛ","PPP","","_","_"
5,"yuddhe","_","_","yuddha","NC","","_","_"
6,"jātu","_","_","jātu","CX","","_","_"
7,"yudhyeta","_","_","yudh","V","yudh","_","_"
8,"pāṇḍavaḥ","_","_","pāṇḍava","NC","","_","_"
1,"ahaṃ","_","_","mat","PPR","","_","_"
2,"sa","_","_","tad","PRD","","_","_"
3,"ca","_","_","ca","CCD","","_","_"
4,"_","_","_","kṣaṇa","NC","","_","_"
5,"_","_","_","eva","CEM","","_","_"
6,"nirmanuṣyam","_","_","nirmanuṣya","JJ","","_","_"
7,"idaṃ","_","_","ida","PRD","","_","_"
8,"jagat","_","_","jagat","NC","","_","_"
1,"kuryāṃ","_","_","kar","V","kṛ","_","_"
2,"_","_","_","śastra","NC","","_","_"
3,"_","_","_","bala","NC","","_","_"
4,"_","_","_","eva","CEM","","_","_"
5,"_","_","_","sa_saha","CX","","_","_"
6,"_","_","_","sura","NC","","_","_"
7,"_","_","_","asura","NC","","_","_"
8,"_","_","_","rākṣasa","NC","","_","_"
1,"na","_","_","na","CNG","","_","_"
2,"_","_","_","tu","CCD","","_","_"
3,"_","_","_","eva","CEM","","_","_"
4,"_","_","_","utsāday","KDG","","_","_"
5,"me","_","_","mat","PPR","","_","_"
6,"pāṇḍoḥ","_","_","pāṇḍu","NC","","_","_"
7,"putrā","_","_","putra","NC","","_","_"
8,"narādhipa","_","_","narādhipa","NC","","_","_"
1,"tasmād","_","_","tasmāt","CX","","_","_"
2,"yodhān","_","_","yodha","NC","","_","_"
3,"haniṣyāmi","_","_","han","V","han","_","_"
4,"_","_","_","prayoga","NC","","_","_"
5,"_","_","_","ayuta","NC","","_","_"
6,"sadā","_","_","sadā","CAD","","_","_"
1,"evam","_","_","eva","CX","","_","_"
2,"eṣāṃ","_","_","ida","PRD","","_","_"
3,"kariṣyāmi","_","_","kar","V","kṛ","_","_"
4,"nidhanaṃ","_","_","nidhana","NC","","_","_"
5,"_","_","_","kuru","NC","","_","_"
6,"_","_","_","nandana","NC","","_","_"
1,"na","_","_","na","CNG","","_","_"
2,"cet","_","_","ced","CX","","_","_"
3,"te","_","_","tad","PRD","","_","_"
4,"māṃ","_","_","mat","PPR","","_","_"
5,"haniṣyanti","_","_","han","V","han","_","_"
6,"pūrvam","_","_","pūrva","CX","","_","_"
7,"eva","_","_","eva","CEM","","_","_"
8,"samāgame","_","_","samāgama","NC","","_","_"
1,"_","_","_","senāpati","NC","","_","_"
2,"_","_","_","tu","CCD","","_","_"
3,"_","_","_","mat","PPR","","_","_"
4,"rājan","_","_","rājan","NC","","_","_"
5,"_","_","_","samaya","NC","","_","_"
6,"_","_","_","apara","PPX","","_","_"
7,"te","_","_","tvat","PPR","","_","_"
1,"bhaviṣyāmi","_","_","bhav","V","bhū","_","_"
2,"yathākāmaṃ","_","_","yathākāma","JJ","","_","_"
3,"_","_","_","tad","PRD","","_","_"
4,"_","_","_","mat","PPR","","_","_"
5,"śrotum","_","_","śru","CGDI","","_","_"
6,"_","_","_","iha","CAD","","_","_"
7,"_","_","_","arh","V","arh","_","_"
1,"karṇo","_","_","karṇa","NC","","_","_"
2,"vā","_","_","vā","CCD","","_","_"
3,"yudhyatāṃ","_","_","yudh","V","yudh","_","_"
4,"pūrvam","_","_","pūrva","CX","","_","_"
5,"ahaṃ","_","_","mat","PPR","","_","_"
6,"vā","_","_","vā","CCD","","_","_"
7,"pṛthivīpate","_","_","pṛthivīpati","NC","","_","_"
1,"spardhate","_","_","spardh","V","spṛdh","_","_"
2,"hi","_","_","hi","CX","","_","_"
3,"_","_","_","sadā","CAD","","_","_"
4,"_","_","_","atyartha","CX","","_","_"
5,"sūtaputro","_","_","sūtaputra","NC","","_","_"
6,"mayā","_","_","mat","PPR","","_","_"
7,"raṇe","_","_","raṇa","NC","","_","_"
1,"karṇa","_","_","karṇa","NC","","_","_"
2,"uvāca","_","_","vak","V","vac","_","_"
1,"_","_","_","na","CNG","","_","_"
2,"_","_","_","mat","PPR","","_","_"
3,"jīvati","_","_","jīv","KDP","","_","_"
4,"gāṅgeye","_","_","gāṅgeya","NC","","_","_"
5,"yotsye","_","_","yudh","V","yudh","_","_"
6,"rājan","_","_","rājan","NC","","_","_"
7,"kathaṃcana","_","_","kathaṃcana","CX","","_","_"
1,"hate","_","_","han","PPP","","_","_"
2,"bhīṣme","_","_","bhīṣma","NC","","_","_"
3,"tu","_","_","tu","CCD","","_","_"
4,"yotsyāmi","_","_","yudh","V","yudh","_","_"
5,"saha","_","_","saha","CX","","_","_"
6,"gāṇḍīvadhanvanā","_","_","gāṇḍīvadhanvan","NC","","_","_"
1,"vaiśaṃpāyana","_","_","vaiśampāyana","NC","","_","_"
2,"uvāca","_","_","vak","V","vac","_","_"
1,"tataḥ","_","_","tatas","CX","","_","_"
2,"senāpatiṃ","_","_","senāpati","NC","","_","_"
3,"cakre","_","_","kar","V","kṛ","_","_"
4,"vidhivad","_","_","vidhivat","CX","","_","_"
5,"_","_","_","bhūri","JQ","","_","_"
6,"_","_","_","dakṣiṇā","NC","","_","_"
1,"_","_","_","dhṛtarāṣṭra","NC","","_","_"
2,"_","_","_","ātmaja","NC","","_","_"
3,"bhīṣmaṃ","_","_","bhīṣma","NC","","_","_"
4,"so","_","_","tad","PRD","","_","_"
5,"'bhiṣikto","_","_","abhiṣic","PPP","","_","_"
6,"vyarocata","_","_","viroc","V","viruc","_","_"
1,"tato","_","_","tatas","CX","","_","_"
2,"_","_","_","bherī","NC","","_","_"
3,"_","_","_","ca","CCD","","_","_"
4,"_","_","_","śaṅkha","NC","","_","_"
5,"_","_","_","ca","CCD","","_","_"
6,"_","_","_","śataśas","CX","","_","_"
7,"_","_","_","ca","CCD","","_","_"
8,"_","_","_","eva","CEM","","_","_"
9,"puṣkarān","_","_","puṣkara","NC","","_","_"
1,"vādayāmāsur","_","_","vāday","V","vāday","_","_"
2,"avyagrāḥ","_","_","avyagra","JJ","","_","_"
3,"puruṣā","_","_","puruṣa","NC","","_","_"
4,"_","_","_","rājan","NC","","_","_"
5,"_","_","_","śāsana","NC","","_","_"
1,"_","_","_","siṃhanāda","NC","","_","_"
2,"_","_","_","ca","CCD","","_","_"
3,"vividhā","_","_","vividha","JJ","","_","_"
4,"vāhanānāṃ","_","_","vāhana","NC","","_","_"
5,"ca","_","_","ca","CCD","","_","_"
6,"nisvanāḥ","_","_","nisvana","NC","","_","_"
1,"prādurāsann","_","_","prāduras","V","prāduras","_","_"
2,"anabhre","_","_","anabhra","JJ","","_","_"
3,"ca","_","_","ca","CCD","","_","_"
4,"varṣaṃ","_","_","varṣa","NC","","_","_"
5,"_","_","_","rudhira","NC","","_","_"
6,"_","_","_","kardama","JJ","","_","_"
1,"nirghātāḥ","_","_","nirghāta","NC","","_","_"
2,"_","_","_","pṛthivī","NC","","_","_"
3,"_","_","_","kampa","NC","","_","_"
4,"_","_","_","gaja","NC","","_","_"
5,"_","_","_","bṛṃhita","NC","","_","_"
6,"_","_","_","nisvana","NC","","_","_"
1,"_","_","_","as","V","as","_","_"
2,"_","_","_","ca","CCD","","_","_"
3,"_","_","_","sarva","JQ","","_","_"
4,"_","_","_","yodha","NC","","_","_"
5,"pātayanto","_","_","pātay","KDP","","_","_"
6,"_","_","_","manas","NC","","_","_"
7,"_","_","_","uta","CCD","","_","_"
1,"_","_","_","vāc","NC","","_","_"
2,"_","_","_","ca","CCD","","_","_"
3,"_","_","_","api","CX","","_","_"
4,"_","_","_","aśarīrin","JJ","","_","_"
5,"_","_","_","div","NC","","_","_"
6,"_","_","_","ca","CCD","","_","_"
7,"_","_","_","ulkā","NC","","_","_"
8,"prapedire","_","_","prapad","V","prapad","_","_"
1,"_","_","_","śivā","NC","","_","_"
2,"_","_","_","ca","CCD","","_","_"
3,"_","_","_","bhaya","NC","","_","_"
4,"_","_","_","vedin","JJ","","_","_"
5,"nedur","_","_","nad","V","nad","_","_"
6,"_","_","_","dīp","PPP","","_","_"
7,"_","_","_","svara","NC","","_","_"
8,"bhṛśam","_","_","bhṛśa","CX","","_","_"
1,"senāpatye","_","_","senāpatya","NC","","_","_"
2,"yadā","_","_","yadā","CSB","","_","_"
3,"rājā","_","_","rājan","NC","","_","_"
4,"gāṅgeyam","_","_","gāṅgeya","NC","","_","_"
5,"abhiṣiktavān","_","_","abhiṣic","KDP","","_","_"
1,"_","_","_","tadā","CAD","","_","_"
2,"_","_","_","tad","PRD","","_","_"
3,"_","_","_","ugra","JJ","","_","_"
4,"_","_","_","rūpa","NC","","_","_"
5,"abhavañ","_","_","bhav","V","bhū","_","_"
6,"śataśo","_","_","śataśas","CX","","_","_"
7,"nṛpa","_","_","nṛpa","NC","","_","_"
1,"tataḥ","_","_","tatas","CX","","_","_"
2,"senāpatiṃ","_","_","senāpati","NC","","_","_"
3,"kṛtvā","_","_","kṛ","CGDA","","_","_"
4,"bhīṣmaṃ","_","_","bhīṣma","NC","","_","_"
5,"_","_","_","para","PPX","","_","_"
6,"_","_","_","bala","NC","","_","_"
7,"_","_","_","ardana","JJ","","_","_"
1,"vācayitvā","_","_","vācay","CGDA","","_","_"
2,"_","_","_","dvijaśreṣṭha","NC","","_","_"
3,"_","_","_","niṣka","NC","","_","_"
4,"_","_","_","go","NC","","_","_"
5,"_","_","_","ca","CCD","","_","_"
6,"bhūriśaḥ","_","_","bhūriśas","CX","","_","_"
1,"vardhamāno","_","_","vṛdh","KDP","","_","_"
2,"_","_","_","jaya","NC","","_","_"
3,"_","_","_","āśis","NC","","_","_"
4,"niryayau","_","_","niryā","V","niryā","_","_"
5,"sainikair","_","_","sainika","NC","","_","_"
6,"vṛtaḥ","_","_","vṛ","PPP","","_","_"
1,"āpageyaṃ","_","_","āpageya","NC","","_","_"
2,"puraskṛtya","_","_","puraskṛ","CGDA","","_","_"
3,"bhrātṛbhiḥ","_","_","bhrātṛ","NC","","_","_"
4,"_","_","_","sahita","JJ","","_","_"
5,"_","_","_","tadā","CAD","","_","_"
1,"skandhāvāreṇa","_","_","skandhāvāra","NC","","_","_"
2,"mahatā","_","_","mahat","JJ","","_","_"
3,"kurukṣetraṃ","_","_","kurukṣetra","NC","","_","_"
4,"jagāma","_","_","ga","V","ga","_","_"
5,"ha","_","_","ha","CEM","","_","_"
1,"parikramya","_","_","parikra","CGDA","","_","_"
2,"kurukṣetraṃ","_","_","kurukṣetra","NC","","_","_"
3,"karṇena","_","_","karṇa","NC","","_","_"
4,"saha","_","_","saha","CX","","_","_"
5,"kauravaḥ","_","_","kaurava","NC","","_","_"
1,"śibiraṃ","_","_","śibira","NC","","_","_"
2,"māpayāmāsa","_","_","māpay","V","māpay","_","_"
3,"same","_","_","sama","PPX","","_","_"
4,"deśe","_","_","deśa","NC","","_","_"
5,"narādhipaḥ","_","_","narādhipa","NC","","_","_"
1,"_","_","_","madhura","JJ","","_","_"
2,"_","_","_","anūṣara","JJ","","_","_"
3,"deśe","_","_","deśa","NC","","_","_"
4,"_","_","_","prabhūta","JJ","","_","_"
5,"_","_","_","yavasa","NC","","_","_"
6,"_","_","_","indhana","NC","","_","_"
1,"_","_","_","yathā","CCM","","_","_"
2,"_","_","_","eva","CEM","","_","_"
3,"hāstinapuraṃ","_","_","hāstinapura","NC","","_","_"
4,"_","_","_","tadvat","CX","","_","_"
5,"_","_","_","śibira","NC","","_","_"
6,"ābabhau","_","_","ābhā","V","ābhā","_","_"
