"WordID","word","NormSTEM","suffix","lemma","PoS","Root","NormSuffix","NormWord"
1,"dhṛtarāṣṭra","_","_","dhṛtarāṣṭra","NC","","_","_"
2,"uvāca","_","_","vak","V","vac","_","_"
1,"irāvantaṃ","_","_","irāvat","NC","","_","_"
2,"tu","_","_","tu","CCD","","_","_"
3,"nihataṃ","_","_","nihan","PPP","","_","_"
4,"dṛṣṭvā","_","_","dṛś","CGDA","","_","_"
5,"pārthā","_","_","pārtha","NC","","_","_"
6,"_","_","_","mahat","JJ","","_","_"
7,"_","_","_","ratha","NC","","_","_"
1,"saṃgrāme","_","_","saṃgrāma","NC","","_","_"
2,"kim","_","_","kiṃ","PRQ","","_","_"
3,"akurvanta","_","_","kar","V","kṛ","_","_"
4,"_","_","_","tad","PRD","","_","_"
5,"_","_","_","mat","PPR","","_","_"
6,"_","_","_","ācakṣ","V","ācakṣ","_","_"
7,"saṃjaya","_","_","saṃjaya","NC","","_","_"
1,"saṃjaya","_","_","saṃjaya","NC","","_","_"
2,"uvāca","_","_","vak","V","vac","_","_"
1,"irāvantaṃ","_","_","irāvat","NC","","_","_"
2,"tu","_","_","tu","CCD","","_","_"
3,"nihataṃ","_","_","nihan","PPP","","_","_"
4,"saṃgrāme","_","_","saṃgrāma","NC","","_","_"
5,"vīkṣya","_","_","vīkṣ","CGDA","","_","_"
6,"rākṣasaḥ","_","_","rākṣasa","NC","","_","_"
1,"vyanadat","_","_","vinad","V","vinad","_","_"
2,"_","_","_","su","CAD","","_","_"
3,"_","_","_","mahat","JJ","","_","_"
4,"_","_","_","nāda","NC","","_","_"
5,"bhaimasenir","_","_","bhaimaseni","NC","","_","_"
6,"ghaṭotkacaḥ","_","_","ghaṭotkaca","NC","","_","_"
1,"_","_","_","nad","KDP","","_","_"
2,"_","_","_","tad","PRD","","_","_"
3,"śabdena","_","_","śabda","NC","","_","_"
4,"pṛthivī","_","_","pṛthivī","NC","","_","_"
5,"sāgarāmbarā","_","_","sāgarāmbarā","NC","","_","_"
1,"_","_","_","sa_saha","CX","","_","_"
2,"_","_","_","parvata","NC","","_","_"
3,"_","_","_","vana","NC","","_","_"
4,"_","_","_","rājan","NC","","_","_"
5,"_","_","_","cal","V","cal","_","_"
6,"_","_","_","su","CAD","","_","_"
7,"_","_","_","bhṛśa","CX","","_","_"
8,"tadā","_","_","tadā","CAD","","_","_"
1,"antarikṣaṃ","_","_","antarikṣa","NC","","_","_"
2,"_","_","_","diś","NC","","_","_"
3,"_","_","_","ca","CCD","","_","_"
4,"_","_","_","eva","CEM","","_","_"
5,"_","_","_","sarva","JQ","","_","_"
6,"_","_","_","ca","CCD","","_","_"
7,"_","_","_","pradiś","NC","","_","_"
8,"_","_","_","tathā","CX","","_","_"
1,"taṃ","_","_","tad","PRD","","_","_"
2,"śrutvā","_","_","śru","CGDA","","_","_"
3,"_","_","_","su","CAD","","_","_"
4,"_","_","_","mahat","JJ","","_","_"
5,"_","_","_","nāda","NC","","_","_"
6,"tava","_","_","tvat","PPR","","_","_"
7,"sainyasya","_","_","sainya","NC","","_","_"
8,"bhārata","_","_","bhārata","NC","","_","_"
1,"ūrustambhaḥ","_","_","ūrustambha","NC","","_","_"
2,"samabhavad","_","_","sambhav","V","sambhū","_","_"
3,"vepathuḥ","_","_","vepathu","NC","","_","_"
4,"sveda","_","_","sveda","NC","","_","_"
5,"eva","_","_","eva","CEM","","_","_"
6,"ca","_","_","ca","CCD","","_","_"
1,"sarva","_","_","sarva","JQ","","_","_"
2,"eva","_","_","eva","CEM","","_","_"
3,"ca","_","_","ca","CCD","","_","_"
4,"_","_","_","rājan","NC","","_","_"
5,"_","_","_","indra","NC","","_","_"
6,"tāvakā","_","_","tāvaka","JJ","","_","_"
7,"_","_","_","dīna","JJ","","_","_"
8,"_","_","_","cetas","NC","","_","_"
1,"_","_","_","sarpa","NC","","_","_"
2,"_","_","_","vat","CX","","_","_"
3,"samaveṣṭanta","_","_","saṃveṣṭ","V","saṃveṣṭ","_","_"
4,"_","_","_","siṃha","NC","","_","_"
5,"_","_","_","bhī","PPP","","_","_"
6,"gajā","_","_","gaja","NC","","_","_"
7,"iva","_","_","iva","CCM","","_","_"
1,"ninadat","_","_","ninad","V","ninad","_","_"
2,"_","_","_","su","CAD","","_","_"
3,"_","_","_","mahat","JJ","","_","_"
4,"_","_","_","nāda","NC","","_","_"
5,"nirghātam","_","_","nirghāta","NC","","_","_"
6,"iva","_","_","iva","CCM","","_","_"
7,"rākṣasaḥ","_","_","rākṣasa","NC","","_","_"
1,"jvalitaṃ","_","_","jval","PPP","","_","_"
2,"śūlam","_","_","śūla","NC","","_","_"
3,"udyamya","_","_","udya","CGDA","","_","_"
4,"rūpaṃ","_","_","rūpa","NC","","_","_"
5,"kṛtvā","_","_","kṛ","CGDA","","_","_"
6,"vibhīṣaṇam","_","_","vibhīṣaṇa","JJ","","_","_"
1,"_","_","_","nānā","CX","","_","_"
2,"_","_","_","praharaṇa","NC","","_","_"
3,"ghorair","_","_","ghora","JJ","","_","_"
4,"vṛto","_","_","vṛ","PPP","","_","_"
5,"_","_","_","rākṣasa","NC","","_","_"
6,"_","_","_","puṃgava","NC","","_","_"
1,"ājagāma","_","_","āgacch","V","āgam","_","_"
2,"_","_","_","su","CAD","","_","_"
3,"_","_","_","saṃkrudh","PPP","","_","_"
4,"_","_","_","kāla","NC","","_","_"
5,"_","_","_","antaka","NC","","_","_"
6,"_","_","_","yama","NC","","_","_"
7,"_","_","_","upama","JJ","","_","_"
1,"tam","_","_","tad","PRD","","_","_"
2,"āpatantaṃ","_","_","āpat","KDP","","_","_"
3,"samprekṣya","_","_","samprekṣ","CGDA","","_","_"
4,"saṃkruddhaṃ","_","_","saṃkrudh","PPP","","_","_"
5,"_","_","_","bhīma","JJ","","_","_"
6,"_","_","_","darśana","NC","","_","_"
1,"_","_","_","sva","JJ","","_","_"
2,"_","_","_","bala","NC","","_","_"
3,"ca","_","_","ca","CCD","","_","_"
4,"bhayāt","_","_","bhaya","NC","","_","_"
5,"tasya","_","_","tad","PRD","","_","_"
6,"prāyaśo","_","_","prāyaśas","CX","","_","_"
7,"vimukhīkṛtam","_","_","vimukhīkṛ","PPP","","_","_"
1,"tato","_","_","tatas","CX","","_","_"
2,"duryodhano","_","_","duryodhana","NC","","_","_"
3,"rājā","_","_","rājan","NC","","_","_"
4,"ghaṭotkacam","_","_","ghaṭotkaca","NC","","_","_"
5,"upādravat","_","_","upadru","V","upadru","_","_"
1,"pragṛhya","_","_","pragrah","CGDA","","_","_"
2,"vipulaṃ","_","_","vipula","JJ","","_","_"
3,"cāpaṃ","_","_","cāpa","NC","","_","_"
4,"_","_","_","siṃha","NC","","_","_"
5,"_","_","_","vat","CX","","_","_"
6,"_","_","_","vinad","KDP","","_","_"
7,"_","_","_","muhur","CX","","_","_"
1,"pṛṣṭhato","_","_","pṛṣṭhatas","CX","","_","_"
2,"'nuyayau","_","_","anuyā","V","anuyā","_","_"
3,"_","_","_","ca","CCD","","_","_"
4,"_","_","_","a","PRD","","_","_"
5,"sravadbhiḥ","_","_","sru","KDP","","_","_"
6,"_","_","_","parvata","NC","","_","_"
7,"_","_","_","upama","JJ","","_","_"
1,"kuñjarair","_","_","kuñjara","NC","","_","_"
2,"_","_","_","daśan","NUM","","_","_"
3,"_","_","_","sāhasra","JJ","","_","_"
4,"vaṅgānām","_","_","vaṅga","NC","","_","_"
5,"adhipaḥ","_","_","adhipa","NC","","_","_"
6,"svayam","_","_","svaya","CX","","_","_"
1,"tam","_","_","tad","PRD","","_","_"
2,"āpatantaṃ","_","_","āpat","KDP","","_","_"
3,"samprekṣya","_","_","samprekṣ","CGDA","","_","_"
4,"_","_","_","gaja","NC","","_","_"
5,"_","_","_","anīka","NC","","_","_"
6,"saṃvṛtam","_","_","saṃvṛ","PPP","","_","_"
1,"putraṃ","_","_","putra","NC","","_","_"
2,"tava","_","_","tvat","PPR","","_","_"
3,"_","_","_","mahat","JJ","","_","_"
4,"_","_","_","rāja","NC","","_","_"
5,"cukopa","_","_","kup","V","kup","_","_"
6,"sa","_","_","tad","PRD","","_","_"
7,"niśācaraḥ","_","_","niśācara","NC","","_","_"
1,"tataḥ","_","_","tatas","CX","","_","_"
2,"pravavṛte","_","_","pravart","V","pravṛt","_","_"
3,"yuddhaṃ","_","_","yuddha","NC","","_","_"
4,"tumulaṃ","_","_","tumula","JJ","","_","_"
5,"_","_","_","loman","NC","","_","_"
6,"_","_","_","harṣaṇa","JJ","","_","_"
1,"rākṣasānāṃ","_","_","rākṣasa","NC","","_","_"
2,"ca","_","_","ca","CCD","","_","_"
3,"_","_","_","rājan","NC","","_","_"
4,"_","_","_","indra","NC","","_","_"
5,"_","_","_","duryodhana","NC","","_","_"
6,"_","_","_","bala","NC","","_","_"
7,"ca","_","_","ca","CCD","","_","_"
1,"_","_","_","gaja","NC","","_","_"
2,"_","_","_","anīka","NC","","_","_"
3,"ca","_","_","ca","CCD","","_","_"
4,"samprekṣya","_","_","samprekṣ","CGDA","","_","_"
5,"_","_","_","megha","NC","","_","_"
6,"_","_","_","vṛnda","NC","","_","_"
7,"_","_","_","iva","CCM","","_","_"
8,"_","_","_","udya","PPP","","_","_"
1,"abhyadhāvanta","_","_","abhidhāv","V","abhidhāv","_","_"
2,"saṃkruddhā","_","_","saṃkrudh","PPP","","_","_"
3,"rākṣasāḥ","_","_","rākṣasa","NC","","_","_"
4,"_","_","_","śastra","NC","","_","_"
5,"_","_","_","pāṇi","NC","","_","_"
1,"nadanto","_","_","nad","KDP","","_","_"
2,"_","_","_","vividha","JJ","","_","_"
3,"_","_","_","nāda","NC","","_","_"
4,"_","_","_","megha","NC","","_","_"
5,"iva","_","_","iva","CCM","","_","_"
6,"_","_","_","sa_saha","CX","","_","_"
7,"_","_","_","vidyut","NC","","_","_"
1,"_","_","_","śara","NC","","_","_"
2,"_","_","_","śakti","NC","","_","_"
3,"_","_","_","ṛṣṭi","NC","","_","_"
4,"_","_","_","nārāca","NC","","_","_"
5,"nighnanto","_","_","nihan","KDP","","_","_"
6,"_","_","_","gaja","NC","","_","_"
7,"_","_","_","yodhin","NC","","_","_"
1,"_","_","_","bhindipāla","NC","","_","_"
2,"_","_","_","tathā","CX","","_","_"
3,"śūlair","_","_","śūla","NC","","_","_"
4,"mudgaraiḥ","_","_","mudgara","NC","","_","_"
5,"_","_","_","sa_saha","CX","","_","_"
6,"_","_","_","paraśvadha","NC","","_","_"
1,"_","_","_","parvata","NC","","_","_"
2,"_","_","_","agra","NC","","_","_"
3,"_","_","_","ca","CCD","","_","_"
4,"_","_","_","vṛkṣa","NC","","_","_"
5,"_","_","_","ca","CCD","","_","_"
6,"_","_","_","nihan","V","nihan","_","_"
7,"_","_","_","tad","PRD","","_","_"
8,"_","_","_","mahat","JJ","","_","_"
9,"_","_","_","gaja","NC","","_","_"
1,"_","_","_","bhid","PPP","","_","_"
2,"_","_","_","kumbha","NC","","_","_"
3,"virudhirān","_","_","virudhira","JJ","","_","_"
4,"_","_","_","bhid","PPP","","_","_"
5,"_","_","_","gātra","NC","","_","_"
6,"_","_","_","ca","CCD","","_","_"
7,"vāraṇān","_","_","vāraṇa","NC","","_","_"
1,"apaśyāma","_","_","paś","V","paś","_","_"
2,"_","_","_","mahat","JJ","","_","_"
3,"_","_","_","rāja","NC","","_","_"
4,"_","_","_","vadh","KDP","","_","_"
5,"_","_","_","niśācara","NC","","_","_"
1,"teṣu","_","_","tad","PRD","","_","_"
2,"prakṣīyamāṇeṣu","_","_","prakṣi","KDP","","_","_"
3,"bhagneṣu","_","_","bhañj","PPP","","_","_"
4,"_","_","_","gaja","NC","","_","_"
5,"_","_","_","yodhin","NC","","_","_"
1,"duryodhano","_","_","duryodhana","NC","","_","_"
2,"_","_","_","mahat","JJ","","_","_"
3,"_","_","_","rāja","NC","","_","_"
4,"rākṣasān","_","_","rākṣasa","NC","","_","_"
5,"samupādravat","_","_","samupadru","V","samupadru","_","_"
1,"_","_","_","amarṣa","NC","","_","_"
2,"_","_","_","vaśa","NC","","_","_"
3,"_","_","_","āpad","PPP","","_","_"
4,"_","_","_","tyaj","CGDA","","_","_"
5,"jīvitam","_","_","jīvita","NC","","_","_"
6,"ātmanaḥ","_","_","ātman","NC","","_","_"
1,"mumoca","_","_","muñc","V","muc","_","_"
2,"niśitān","_","_","niśā","PPP","","_","_"
3,"bāṇān","_","_","bāṇa","NC","","_","_"
4,"rākṣaseṣu","_","_","rākṣasa","NC","","_","_"
5,"_","_","_","mahat","JJ","","_","_"
6,"_","_","_","bala","NC","","_","_"
1,"jaghāna","_","_","han","V","han","_","_"
2,"ca","_","_","ca","CCD","","_","_"
3,"_","_","_","mahat","JJ","","_","_"
4,"_","_","_","iṣvāsa","NC","","_","_"
5,"_","_","_","pradhāna","JJ","","_","_"
6,"_","_","_","tatra","CAD","","_","_"
7,"rākṣasān","_","_","rākṣasa","NC","","_","_"
1,"saṃkruddho","_","_","saṃkrudh","PPP","","_","_"
2,"_","_","_","bharata","NC","","_","_"
3,"_","_","_","śreṣṭha","JJ","","_","_"
4,"putro","_","_","putra","NC","","_","_"
5,"_","_","_","duryodhana","NC","","_","_"
6,"_","_","_","tvat","PPR","","_","_"
1,"vegavantaṃ","_","_","vegavat","NC","","_","_"
2,"mahāraudraṃ","_","_","mahāraudra","NC","","_","_"
3,"vidyujjihvaṃ","_","_","vidyujjihva","NC","","_","_"
4,"pramāthinam","_","_","pramāthin","NC","","_","_"
1,"_","_","_","śara","NC","","_","_"
2,"_","_","_","catur","NUM","","_","_"
3,"_","_","_","catur","NUM","","_","_"
4,"nijaghāna","_","_","nihan","V","nihan","_","_"
5,"_","_","_","mahat","JJ","","_","_"
6,"_","_","_","ratha","NC","","_","_"
1,"tataḥ","_","_","tatas","CX","","_","_"
2,"punar","_","_","punar","CAD","","_","_"
3,"_","_","_","ameya","JJ","","_","_"
4,"_","_","_","ātman","NC","","_","_"
5,"_","_","_","śara","NC","","_","_"
6,"_","_","_","varṣa","NC","","_","_"
7,"durāsadam","_","_","durāsada","JJ","","_","_"
1,"mumoca","_","_","muñc","V","muc","_","_"
2,"_","_","_","bharata","NC","","_","_"
3,"_","_","_","śreṣṭha","JJ","","_","_"
4,"_","_","_","niśācara","NC","","_","_"
5,"_","_","_","bala","NC","","_","_"
6,"prati","_","_","prati","CADP","","_","_"
1,"tat","_","_","tad","PRD","","_","_"
2,"tu","_","_","tu","CCD","","_","_"
3,"dṛṣṭvā","_","_","dṛś","CGDA","","_","_"
4,"mahat","_","_","mahat","JJ","","_","_"
5,"karma","_","_","karman","NC","","_","_"
6,"putrasya","_","_","putra","NC","","_","_"
7,"tava","_","_","tvat","PPR","","_","_"
8,"māriṣa","_","_","māriṣa","NC","","_","_"
1,"_","_","_","krodha","NC","","_","_"
2,"_","_","_","abhiprajval","V","abhiprajval","_","_"
3,"bhaimasenir","_","_","bhaimaseni","NC","","_","_"
4,"_","_","_","mahat","JJ","","_","_"
5,"_","_","_","bala","NC","","_","_"
1,"visphārya","_","_","visphāray","CGDA","","_","_"
2,"ca","_","_","ca","CCD","","_","_"
3,"_","_","_","mahat","JJ","","_","_"
4,"_","_","_","cāpa","NC","","_","_"
5,"_","_","_","indra","NC","","_","_"
6,"_","_","_","aśani","NC","","_","_"
7,"_","_","_","sama","PPX","","_","_"
8,"_","_","_","svana","NC","","_","_"
1,"abhidudrāva","_","_","abhidru","V","abhidru","_","_"
2,"vegena","_","_","vega","NC","","_","_"
3,"duryodhanam","_","_","duryodhana","NC","","_","_"
4,"ariṃdamam","_","_","ariṃdama","JJ","","_","_"
1,"tam","_","_","tad","PRD","","_","_"
2,"āpatantam","_","_","āpat","KDP","","_","_"
3,"udvīkṣya","_","_","udvīkṣ","CGDA","","_","_"
4,"_","_","_","kāla","NC","","_","_"
5,"_","_","_","sṛj","PPP","","_","_"
6,"_","_","_","iva","CCM","","_","_"
7,"_","_","_","antaka","NC","","_","_"
1,"na","_","_","na","CNG","","_","_"
2,"vivyathe","_","_","vyath","V","vyath","_","_"
3,"_","_","_","mahat","JJ","","_","_"
4,"_","_","_","rāja","NC","","_","_"
5,"putro","_","_","putra","NC","","_","_"
6,"_","_","_","duryodhana","NC","","_","_"
7,"_","_","_","tvat","PPR","","_","_"
1,"_","_","_","atha","CAD","","_","_"
2,"_","_","_","a","PRD","","_","_"
3,"abravīt","_","_","abravīta","V","brū","_","_"
4,"kruddhaḥ","_","_","krudh","PPP","","_","_"
5,"krūraḥ","_","_","krūra","JJ","","_","_"
6,"_","_","_","saṃrañj","PPP","","_","_"
7,"_","_","_","locana","NC","","_","_"
1,"ye","_","_","yad","PRL","","_","_"
2,"tvayā","_","_","tvat","PPR","","_","_"
3,"_","_","_","su","CAD","","_","_"
4,"_","_","_","nṛśaṃsa","JJ","","_","_"
5,"_","_","_","dīrgha","JJ","","_","_"
6,"_","_","_","kāla","NC","","_","_"
7,"pravāsitāḥ","_","_","pravāsay","PPP","","_","_"
1,"_","_","_","yat","CSB","","_","_"
2,"_","_","_","ca","CCD","","_","_"
3,"te","_","_","tad","PRD","","_","_"
4,"pāṇḍavā","_","_","pāṇḍava","NC","","_","_"
5,"_","_","_","rājan","NC","","_","_"
6,"_","_","_","chala","NC","","_","_"
7,"_","_","_","dyūta","NC","","_","_"
8,"parājitāḥ","_","_","parāji","PPP","","_","_"
1,"_","_","_","yat","CSB","","_","_"
2,"_","_","_","ca","CCD","","_","_"
3,"_","_","_","eva","CEM","","_","_"
4,"draupadī","_","_","draupadī","NC","","_","_"
5,"kṛṣṇā","_","_","kṛṣṇā","NC","","_","_"
6,"_","_","_","eka","PPX","","_","_"
7,"_","_","_","vastra","NC","","_","_"
8,"rajasvalā","_","_","rajasvala","JJ","","_","_"
1,"sabhām","_","_","sabhā","NC","","_","_"
2,"ānīya","_","_","ānī","CGDA","","_","_"
3,"durbuddhe","_","_","durbuddhi","JJ","","_","_"
4,"bahudhā","_","_","bahudhā","CX","","_","_"
5,"kleśitā","_","_","kleśay","PPP","","_","_"
6,"tvayā","_","_","tvat","PPR","","_","_"
1,"tava","_","_","tvat","PPR","","_","_"
2,"ca","_","_","ca","CCD","","_","_"
3,"_","_","_","priya","JJ","","_","_"
4,"_","_","_","kāma","NC","","_","_"
5,"_","_","_","āśrama","NC","","_","_"
6,"_","_","_","stha","JJ","","_","_"
7,"durātmanā","_","_","durātman","JJ","","_","_"
1,"saindhavena","_","_","saindhava","NC","","_","_"
2,"parikliṣṭā","_","_","parikliś","PPP","","_","_"
3,"paribhūya","_","_","paribhū","CGDA","","_","_"
4,"_","_","_","pitṛ","NC","","_","_"
5,"_","_","_","mat","PPR","","_","_"
1,"eteṣām","_","_","tad","PRD","","_","_"
2,"avamānānām","_","_","avamāna","NC","","_","_"
3,"anyeṣāṃ","_","_","anya","PPX","","_","_"
4,"ca","_","_","ca","CCD","","_","_"
5,"_","_","_","kula","NC","","_","_"
6,"_","_","_","adhama","JJ","","_","_"
1,"antam","_","_","anta","NC","","_","_"
2,"adya","_","_","adya","CX","","_","_"
3,"gamiṣyāmi","_","_","gacch","V","gam","_","_"
4,"yadi","_","_","yadi","CSB","","_","_"
5,"_","_","_","na","CNG","","_","_"
6,"_","_","_","utsṛj","V","utsṛj","_","_"
7,"raṇam","_","_","raṇa","NC","","_","_"
1,"evam","_","_","eva","CX","","_","_"
2,"uktvā","_","_","vac","CGDA","","_","_"
3,"tu","_","_","tu","CCD","","_","_"
4,"haiḍimbo","_","_","haiḍimba","NC","","_","_"
5,"mahad","_","_","mahat","JJ","","_","_"
6,"visphārya","_","_","visphāray","CGDA","","_","_"
7,"kārmukam","_","_","kārmuka","NC","","_","_"
1,"saṃdaśya","_","_","saṃdaṃś","CGDA","","_","_"
2,"daśanair","_","_","daśana","NC","","_","_"
3,"oṣṭhaṃ","_","_","oṣṭha","NC","","_","_"
4,"sṛkkiṇī","_","_","parisaṃlih","KDP","","_","_"
1,"_","_","_","śara","NC","","_","_"
2,"_","_","_","varṣa","NC","","_","_"
3,"mahatā","_","_","mahat","JJ","","_","_"
4,"duryodhanam","_","_","duryodhana","NC","","_","_"
5,"avākirat","_","_","avakṛ","V","avakṛ","_","_"
1,"parvataṃ","_","_","parvata","NC","","_","_"
2,"_","_","_","vāri","NC","","_","_"
3,"_","_","_","dhārā","NC","","_","_"
4,"_","_","_","prāvṛṣ","NC","","_","_"
5,"_","_","_","iva","CCM","","_","_"
6,"balāhakaḥ","_","_","balāhaka","NC","","_","_"
