"WordID","word","NormSTEM","suffix","lemma","PoS","Root","NormSuffix","NormWord"
1,"taṃ","_","_","tad","PRD","","_","_"
2,"yuñjāthām","_","_","yuj","V","yuj","_","_"
3,"manaso","_","_","manas","NC","","_","_"
4,"yo","_","_","yad","PRL","","_","_"
5,"javīyān","_","_","javīyas","JJ","","_","_"
6,"_","_","_","tri","NUM","","_","_"
7,"_","_","_","vandhura","NC","","_","_"
8,"vṛṣaṇā","_","_","vṛṣan","NC","","_","_"
9,"yas","_","_","yad","PRL","","_","_"
10,"_","_","_","tri","NUM","","_","_"
11,"_","_","_","cakra","NC","","_","_"
1,"_","_","_","yad","PRL","","_","_"
2,"_","_","_","upayā","V","upayā","_","_"
3,"_","_","_","su","CAD","","_","_"
4,"_","_","_","kṛt","JJ","","_","_"
5,"duroṇaṃ","_","_","duroṇa","NC","","_","_"
6,"_","_","_","tri","NUM","","_","_"
7,"_","_","_","dhātu","NC","","_","_"
8,"patatho","_","_","pat","V","pat","_","_"
9,"vir","_","_","vi","NC","","_","_"
10,"na","_","_","na","CNG","","_","_"
11,"parṇaiḥ","_","_","parṇa","NC","","_","_"
1,"suvṛd","_","_","suvṛt","JJ","","_","_"
2,"ratho","_","_","ratha","NC","","_","_"
3,"vartate","_","_","vart","V","vṛt","_","_"
4,"yann","_","_","i","KDP","","_","_"
5,"abhi","_","_","abhi","CADP","","_","_"
6,"kṣāṃ","_","_","kṣā","NC","","_","_"
7,"yat","_","_","yat","CSB","","_","_"
8,"tiṣṭhathaḥ","_","_","tiṣṭh","V","sthā","_","_"
9,"_","_","_","kratumat","JJ","","_","_"
10,"_","_","_","anu","CADP","","_","_"
11,"pṛkṣe","_","_","pṛkṣ","NC","","_","_"
1,"vapur","_","_","vapus","NC","","_","_"
2,"vapuṣyā","_","_","vapuṣyā","NC","","_","_"
3,"sacatām","_","_","sac","V","sac","_","_"
4,"iyaṃ","_","_","ida","PRD","","_","_"
5,"gīr","_","_","gir","NC","","_","_"
6,"divo","_","_","div","NC","","_","_"
7,"_","_","_","duhitṛ","NC","","_","_"
8,"_","_","_","uṣas","NC","","_","_"
9,"sacethe","_","_","sac","V","sac","_","_"
1,"ā","_","_","ā","CADP","","_","_"
2,"tiṣṭhataṃ","_","_","tiṣṭh","V","sthā","_","_"
3,"suvṛtaṃ","_","_","suvṛt","JJ","","_","_"
4,"yo","_","_","yad","PRL","","_","_"
5,"ratho","_","_","ratha","NC","","_","_"
6,"vām","_","_","tvat","PPR","","_","_"
7,"anu","_","_","anu","CADP","","_","_"
8,"vratāni","_","_","vrata","NC","","_","_"
9,"vartate","_","_","vart","V","vṛt","_","_"
10,"haviṣmān","_","_","haviṣmat","JJ","","_","_"
1,"yena","_","_","yad","PRL","","_","_"
2,"narā","_","_","nṛ","NC","","_","_"
3,"_","_","_","nāsatya","NC","","_","_"
4,"_","_","_","iṣay","CGDI","","_","_"
5,"vartir","_","_","vartis","NC","","_","_"
6,"yāthas","_","_","yā","V","yā","_","_"
7,"tanayāya","_","_","tanaya","NC","","_","_"
8,"tmane","_","_","tman","NC","","_","_"
9,"ca","_","_","ca","CCD","","_","_"
1,"mā","_","_","mā","CNG","","_","_"
2,"vāṃ","_","_","tvat","PPR","","_","_"
3,"vṛko","_","_","vṛka","NC","","_","_"
4,"mā","_","_","mā","CNG","","_","_"
5,"vṛkīr","_","_","vṛkī","NC","","_","_"
6,"ā","_","_","ā","CADP","","_","_"
7,"dadharṣīn","_","_","dhṛṣ","V","dhṛṣ","_","_"
8,"mā","_","_","mā","CNG","","_","_"
9,"pari","_","_","pari","CADP","","_","_"
10,"varktam","_","_","vṛj","V","vṛj","_","_"
11,"uta","_","_","uta","CCD","","_","_"
12,"_","_","_","mā","CNG","","_","_"
13,"_","_","_","ati","CADP","","_","_"
14,"dhaktam","_","_","dagh","V","dagh","_","_"
1,"ayaṃ","_","_","ida","PRD","","_","_"
2,"vām","_","_","tvat","PPR","","_","_"
3,"bhāgo","_","_","bhāga","NC","","_","_"
4,"nihita","_","_","nidhā","PPP","","_","_"
5,"iyaṃ","_","_","ida","PRD","","_","_"
6,"gīr","_","_","gir","NC","","_","_"
7,"dasrāv","_","_","dasra","NC","","_","_"
8,"ime","_","_","ida","PRD","","_","_"
9,"vāṃ","_","_","tvat","PPR","","_","_"
10,"nidhayo","_","_","nidhi","NC","","_","_"
11,"madhūnām","_","_","madhu","NC","","_","_"
1,"yuvāṃ","_","_","tvat","PPR","","_","_"
2,"gotamaḥ","_","_","gotama","NC","","_","_"
3,"purumīﾱho","_","_","purumīḍha","NC","","_","_"
4,"atrir","_","_","atri","NC","","_","_"
5,"dasrā","_","_","dasra","NC","","_","_"
6,"havate","_","_","hvā","V","hvā","_","_"
7,"'vase","_","_","av","CGDI","","_","_"
8,"haviṣmān","_","_","haviṣmat","JJ","","_","_"
1,"diśaṃ","_","_","diś","NC","","_","_"
2,"na","_","_","na","CNG","","_","_"
3,"diṣṭām","_","_","diś","PPP","","_","_"
4,"_","_","_","ṛjūyā","CX","","_","_"
5,"_","_","_","iva","CCM","","_","_"
6,"yantā","_","_","i","KDP","","_","_"
7,"me","_","_","mat","PPR","","_","_"
8,"havaṃ","_","_","hava","NC","","_","_"
9,"_","_","_","nāsatya","NC","","_","_"
10,"_","_","_","upa","CADP","","_","_"
11,"yātam","_","_","yā","V","yā","_","_"
1,"atāriṣma","_","_","tar","V","tṛ","_","_"
2,"tamasas","_","_","tamas","NC","","_","_"
3,"pāram","_","_","pāra","NC","","_","_"
4,"asya","_","_","ida","PRD","","_","_"
5,"prati","_","_","prati","CADP","","_","_"
6,"vāṃ","_","_","tvat","PPR","","_","_"
7,"stomo","_","_","stoma","NC","","_","_"
8,"aśvināv","_","_","aśvin","NC","","_","_"
9,"adhāyi","_","_","dadh","V","dhā","_","_"
1,"_","_","_","ā","CADP","","_","_"
2,"_","_","_","iha","CAD","","_","_"
3,"yātam","_","_","yā","V","yā","_","_"
4,"pathibhir","_","_","pathin","NC","","_","_"
5,"_","_","_","deva","NC","","_","_"
6,"_","_","_","yāna","NC","","_","_"
7,"_","_","_","vid","V","vid","_","_"
8,"_","_","_","iṣa","JJ","","_","_"
9,"vṛjanaṃ","_","_","vṛjana","NC","","_","_"
10,"_","_","_","jīra","JJ","","_","_"
11,"_","_","_","dānu","NC","","_","_"
