"WordID","word","NormSTEM","suffix","lemma","PoS","Root","NormSuffix","NormWord"
1,"nakula","_","_","nakula","NC","","_","_"
2,"uvāca","_","_","vak","V","vac","_","_"
1,"hanta","_","_","hanta","CX","","_","_"
2,"vo","_","_","tvat","PPR","","_","_"
3,"vartayiṣyāmi","_","_","vart","V","vṛt","_","_"
4,"dānasya","_","_","dāna","NC","","_","_"
5,"paramaṃ","_","_","parama","JJ","","_","_"
6,"phalam","_","_","phala","NC","","_","_"
1,"_","_","_","nyāya","NC","","_","_"
2,"_","_","_","labh","PPP","","_","_"
3,"sūkṣmasya","_","_","sūkṣma","JJ","","_","_"
4,"_","_","_","vipra","NC","","_","_"
5,"_","_","_","dā","PPP","","_","_"
6,"yad","_","_","yad","PRL","","_","_"
7,"dvijāḥ","_","_","dvija","NC","","_","_"
1,"_","_","_","dharma","NC","","_","_"
2,"_","_","_","kṣetra","NC","","_","_"
3,"kurukṣetre","_","_","kurukṣetra","NC","","_","_"
4,"_","_","_","dharma","NC","","_","_"
5,"_","_","_","jña","JJ","","_","_"
6,"bahubhir","_","_","bahu","JJ","","_","_"
7,"vṛte","_","_","vṛ","PPP","","_","_"
1,"_","_","_","uñcha","NC","","_","_"
2,"_","_","_","vṛtti","NC","","_","_"
3,"dvijaḥ","_","_","dvija","NC","","_","_"
4,"kaścit","_","_","kiṃcit","PRI","","_","_"
5,"kāpotir","_","_","kāpoti","NC","","_","_"
6,"abhavat","_","_","bhav","V","bhū","_","_"
7,"purā","_","_","purā","CX","","_","_"
1,"_","_","_","sa_saha","CX","","_","_"
2,"_","_","_","bhāryā","NC","","_","_"
3,"saha","_","_","saha","CX","","_","_"
4,"putreṇa","_","_","putra","NC","","_","_"
5,"_","_","_","sa_saha","CX","","_","_"
6,"_","_","_","snuṣā","NC","","_","_"
7,"_","_","_","tapas","NC","","_","_"
8,"sthitaḥ","_","_","sthā","PPP","","_","_"
1,"_","_","_","vadhū","NC","","_","_"
2,"_","_","_","caturtha","JJ","","_","_"
3,"vṛddhaḥ","_","_","vṛddha","JJ","","_","_"
4,"sa","_","_","tad","PRD","","_","_"
5,"_","_","_","dharma","NC","","_","_"
6,"_","_","_","ātman","NC","","_","_"
7,"_","_","_","niya","PPP","","_","_"
8,"_","_","_","indriya","NC","","_","_"
1,"ṣaṣṭhe","_","_","ṣaṣṭha","JJ","","_","_"
2,"kāle","_","_","kāla","NC","","_","_"
3,"tadā","_","_","tadā","CAD","","_","_"
4,"vipro","_","_","vipra","NC","","_","_"
5,"bhuṅkte","_","_","bhuj","V","bhuj","_","_"
6,"taiḥ","_","_","tad","PRD","","_","_"
7,"saha","_","_","saha","CX","","_","_"
8,"_","_","_","su","CAD","","_","_"
9,"_","_","_","vrata","NC","","_","_"
1,"ṣaṣṭhe","_","_","ṣaṣṭha","JJ","","_","_"
2,"kāle","_","_","kāla","NC","","_","_"
3,"_","_","_","kadācid","CX","","_","_"
4,"_","_","_","ca","CCD","","_","_"
5,"_","_","_","tad","PRD","","_","_"
6,"_","_","_","āhāra","NC","","_","_"
7,"na","_","_","na","CNG","","_","_"
8,"vidyate","_","_","vid","V","vid","_","_"
1,"bhuṅkte","_","_","bhuj","V","bhuj","_","_"
2,"'nyasmin","_","_","anya","PPX","","_","_"
3,"kadācit","_","_","kadācid","CX","","_","_"
4,"sa","_","_","tad","PRD","","_","_"
5,"ṣaṣṭhe","_","_","ṣaṣṭha","JJ","","_","_"
6,"kāle","_","_","kāla","NC","","_","_"
7,"dvijottamaḥ","_","_","dvijottama","NC","","_","_"
1,"_","_","_","kapota","NC","","_","_"
2,"_","_","_","dharmin","JJ","","_","_"
3,"_","_","_","tad","PRD","","_","_"
4,"durbhikṣe","_","_","durbhikṣa","NC","","_","_"
5,"sati","_","_","as","KDP","","_","_"
6,"dāruṇe","_","_","dāruṇa","JJ","","_","_"
1,"_","_","_","na","CNG","","_","_"
2,"_","_","_","vid","V","vid","_","_"
3,"tadā","_","_","tadā","CAD","","_","_"
4,"viprāḥ","_","_","vipra","NC","","_","_"
5,"_","_","_","saṃcaya","NC","","_","_"
6,"_","_","_","tad","PRD","","_","_"
7,"_","_","_","nibodh","V","nibudh","_","_"
1,"_","_","_","kṣi","PPP","","_","_"
2,"_","_","_","oṣadhi","NC","","_","_"
3,"_","_","_","samāvāya","NC","","_","_"
4,"_","_","_","dravya","NC","","_","_"
5,"_","_","_","hā","PPP","","_","_"
6,"'bhavat","_","_","bhav","V","bhū","_","_"
7,"tadā","_","_","tadā","CAD","","_","_"
1,"kāle","_","_","kāla","NC","","_","_"
2,"kāle","_","_","kāla","NC","","_","_"
3,"'sya","_","_","ida","PRD","","_","_"
4,"samprāpte","_","_","samprāp","PPP","","_","_"
5,"_","_","_","na","CNG","","_","_"
6,"_","_","_","eva","CEM","","_","_"
7,"vidyeta","_","_","vid","V","vid","_","_"
8,"bhojanam","_","_","bhojana","NC","","_","_"
1,"_","_","_","kṣudhā","NC","","_","_"
2,"_","_","_","pariga","PPP","","_","_"
3,"sarve","_","_","sarva","JQ","","_","_"
4,"prātiṣṭhanta","_","_","pratiṣṭh","V","prasthā","_","_"
5,"tadā","_","_","tadā","CAD","","_","_"
6,"tu","_","_","tu","CCD","","_","_"
7,"te","_","_","tad","PRD","","_","_"
1,"_","_","_","uñch","KDP","","_","_"
2,"_","_","_","tadā","CAD","","_","_"
3,"_","_","_","śukla","NC","","_","_"
4,"_","_","_","pakṣa","NC","","_","_"
5,"madhyaṃ","_","_","madhya","NC","","_","_"
6,"tapati","_","_","tap","KDP","","_","_"
7,"bhāskare","_","_","bhāskara","NC","","_","_"
1,"_","_","_","uṣṇa","NC","","_","_"
2,"_","_","_","ārta","JJ","","_","_"
3,"_","_","_","ca","CCD","","_","_"
4,"_","_","_","kṣudhā","NC","","_","_"
5,"_","_","_","ārta","JJ","","_","_"
6,"_","_","_","ca","CCD","","_","_"
7,"sa","_","_","tad","PRD","","_","_"
8,"_","_","_","vipra","NC","","_","_"
9,"_","_","_","tapas","NC","","_","_"
10,"sthitaḥ","_","_","sthā","PPP","","_","_"
1,"uñcham","_","_","uñcha","NC","","_","_"
2,"a","_","_","alpha_privativum","JJ","","_","_"
2,"aprāptavān","_","_","prāptavat","JJ","","_","_"
3,"eva","_","_","eva","CEM","","_","_"
4,"sārdhaṃ","_","_","sārdha","CX","","_","_"
5,"parijanena","_","_","parijana","NC","","_","_"
6,"ha","_","_","ha","CEM","","_","_"
1,"sa","_","_","tad","PRD","","_","_"
2,"_","_","_","tathā","CX","","_","_"
3,"_","_","_","eva","CEM","","_","_"
4,"_","_","_","kṣudhā","NC","","_","_"
5,"_","_","_","āviś","PPP","","_","_"
6,"spṛṣṭvā","_","_","spṛś","CGDA","","_","_"
7,"toyaṃ","_","_","toya","NC","","_","_"
8,"yathāvidhi","_","_","yathāvidhi","CX","","_","_"
1,"kṣapayāmāsa","_","_","kṣapay","V","kṣapay","_","_"
2,"taṃ","_","_","tad","PRD","","_","_"
3,"kālaṃ","_","_","kāla","NC","","_","_"
4,"_","_","_","kṛcchra","JJ","","_","_"
5,"_","_","_","prāṇa","NC","","_","_"
6,"dvijottamaḥ","_","_","dvijottama","NC","","_","_"
1,"atha","_","_","atha","CAD","","_","_"
2,"ṣaṣṭhe","_","_","ṣaṣṭha","JJ","","_","_"
3,"gate","_","_","ga","PPP","","_","_"
4,"kāle","_","_","kāla","NC","","_","_"
5,"_","_","_","yava","NC","","_","_"
6,"_","_","_","prastha","NC","","_","_"
7,"upārjayat","_","_","upārjay","V","upārjay","_","_"
1,"_","_","_","yava","NC","","_","_"
2,"_","_","_","prastha","NC","","_","_"
3,"ca","_","_","ca","CCD","","_","_"
4,"te","_","_","tad","PRD","","_","_"
5,"saktūn","_","_","saktu","NC","","_","_"
6,"akurvanta","_","_","kar","V","kṛ","_","_"
7,"tapasvinaḥ","_","_","tapasvin","NC","","_","_"
1,"tu","_","_","tu","CCD","","_","_"
2,"hutvā","_","_","hu","CGDA","","_","_"
3,"vahniṃ","_","_","vahni","NC","","_","_"
4,"yathāvidhi","_","_","yathāvidhi","CX","","_","_"
1,"kuḍavaṃ","_","_","kuḍava","NC","","_","_"
2,"kuḍavaṃ","_","_","kuḍava","NC","","_","_"
3,"sarve","_","_","sarva","JQ","","_","_"
4,"vyabhajanta","_","_","vibhaj","V","vibhaj","_","_"
5,"tapasvinaḥ","_","_","tapasvin","NC","","_","_"
1,"_","_","_","atha","CAD","","_","_"
2,"_","_","_","ga","V","ga","_","_"
3,"dvijaḥ","_","_","dvija","NC","","_","_"
4,"kaścid","_","_","kiṃcit","PRI","","_","_"
5,"atithir","_","_","atithi","NC","","_","_"
6,"bhuñjatāṃ","_","_","bhuj","KDP","","_","_"
7,"tadā","_","_","tadā","CAD","","_","_"
1,"te","_","_","tad","PRD","","_","_"
2,"taṃ","_","_","tad","PRD","","_","_"
3,"_","_","_","dṛś","CGDA","","_","_"
4,"_","_","_","atithi","NC","","_","_"
5,"tatra","_","_","tatra","CAD","","_","_"
6,"_","_","_","prahṛṣ","PPP","","_","_"
7,"_","_","_","manas","NC","","_","_"
8,"'bhavan","_","_","bhav","V","bhū","_","_"
1,"te","_","_","tad","PRD","","_","_"
2,"'bhivādya","_","_","abhivāday","CGDA","","_","_"
3,"_","_","_","sukha","NC","","_","_"
4,"_","_","_","praśna","NC","","_","_"
5,"pṛṣṭvā","_","_","pracch","CGDA","","_","_"
6,"tam","_","_","tad","PRD","","_","_"
7,"atithiṃ","_","_","atithi","NC","","_","_"
8,"tadā","_","_","tadā","CAD","","_","_"
1,"_","_","_","viśudh","PPP","","_","_"
2,"_","_","_","manas","NC","","_","_"
3,"dāntāḥ","_","_","da","PPP","","_","_"
4,"_","_","_","śraddhā","NC","","_","_"
5,"_","_","_","dama","NC","","_","_"
6,"_","_","_","samanvita","JJ","","_","_"
1,"anasūyavo","_","_","anasūyu","JJ","","_","_"
2,"_","_","_","ga","PPP","","_","_"
3,"_","_","_","krodha","NC","","_","_"
4,"sādhavo","_","_","sādhu","JJ","","_","_"
5,"_","_","_","ga","PPP","","_","_"
6,"_","_","_","matsara","NC","","_","_"
1,"_","_","_","tyaj","PPP","","_","_"
2,"_","_","_","māna","NC","","_","_"
3,"_","_","_","ji","PPP","","_","_"
4,"_","_","_","krodha","NC","","_","_"
5,"_","_","_","dharma","NC","","_","_"
6,"_","_","_","jña","JJ","","_","_"
7,"dvijasattamāḥ","_","_","dvijasattama","NC","","_","_"
1,"_","_","_","sa_saha","CX","","_","_"
2,"_","_","_","brahmacarya","NC","","_","_"
3,"svaṃ","_","_","sva","JJ","","_","_"
4,"gotraṃ","_","_","gotra","NC","","_","_"
5,"samākhyāya","_","_","samākhyā","CGDA","","_","_"
6,"parasparam","_","_","paraspara","PRC","","_","_"
1,"kuṭīṃ","_","_","kuṭī","NC","","_","_"
2,"praveśayāmāsuḥ","_","_","praveśay","V","praveśay","_","_"
3,"_","_","_","kṣudhā","NC","","_","_"
4,"_","_","_","ārta","JJ","","_","_"
5,"atithiṃ","_","_","atithi","NC","","_","_"
6,"tadā","_","_","tadā","CAD","","_","_"
1,"idam","_","_","ida","PRD","","_","_"
2,"arghyaṃ","_","_","arghya","NC","","_","_"
3,"ca","_","_","ca","CCD","","_","_"
4,"pādyaṃ","_","_","pādya","NC","","_","_"
5,"ca","_","_","ca","CCD","","_","_"
6,"bṛsī","_","_","bṛsī","NC","","_","_"
7,"_","_","_","ca","CCD","","_","_"
8,"_","_","_","ida","PRD","","_","_"
9,"_","_","_","tvat","PPR","","_","_"
10,"_","_","_","anagha","JJ","","_","_"
1,"śucayaḥ","_","_","śuci","JJ","","_","_"
2,"_","_","_","saktu","NC","","_","_"
3,"_","_","_","ca","CCD","","_","_"
4,"_","_","_","ida","PRD","","_","_"
5,"_","_","_","niyama","NC","","_","_"
6,"_","_","_","upārjay","PPP","","_","_"
7,"prabho","_","_","prabhu","JJ","","_","_"
1,"pratigṛhṇīṣva","_","_","pratigrah","V","pratigrah","_","_"
2,"bhadraṃ","_","_","bhadra","NC","","_","_"
3,"te","_","_","tvat","PPR","","_","_"
4,"mayā","_","_","mat","PPR","","_","_"
5,"dattā","_","_","dā","PPP","","_","_"
6,"dvijottama","_","_","dvijottama","NC","","_","_"
1,"_","_","_","iti","CQT","","_","_"
2,"_","_","_","vac","PPP","","_","_"
3,"_","_","_","pratigrah","CGDA","","_","_"
4,"_","_","_","atha","CAD","","_","_"
5,"saktūnāṃ","_","_","saktu","NC","","_","_"
6,"kuḍavaṃ","_","_","kuḍava","NC","","_","_"
7,"dvijaḥ","_","_","dvija","NC","","_","_"
1,"bhakṣayāmāsa","_","_","bhakṣay","V","bhakṣay","_","_"
2,"_","_","_","rājan","NC","","_","_"
3,"_","_","_","indra","NC","","_","_"
4,"na","_","_","na","CNG","","_","_"
5,"ca","_","_","ca","CCD","","_","_"
6,"tuṣṭiṃ","_","_","tuṣṭi","NC","","_","_"
7,"jagāma","_","_","ga","V","ga","_","_"
8,"saḥ","_","_","tad","PRD","","_","_"
1,"sa","_","_","tad","PRD","","_","_"
2,"_","_","_","uñcha","NC","","_","_"
3,"_","_","_","vṛtti","NC","","_","_"
4,"taṃ","_","_","tad","PRD","","_","_"
5,"prekṣya","_","_","prekṣ","CGDA","","_","_"
6,"_","_","_","kṣudhā","NC","","_","_"
7,"_","_","_","pariga","PPP","","_","_"
8,"dvijam","_","_","dvija","NC","","_","_"
1,"āhāraṃ","_","_","āhāra","NC","","_","_"
2,"cintayāmāsa","_","_","cintay","V","cintay","_","_"
3,"kathaṃ","_","_","katha","CX","","_","_"
4,"tuṣṭo","_","_","tuṣ","PPP","","_","_"
5,"bhaved","_","_","bhav","V","bhū","_","_"
6,"iti","_","_","iti","CQT","","_","_"
1,"tasya","_","_","tad","PRD","","_","_"
2,"_","_","_","bhāryā","NC","","_","_"
3,"_","_","_","abravīta","V","brū","_","_"
4,"_","_","_","rājan","NC","","_","_"
5,"_","_","_","mat","PPR","","_","_"
6,"_","_","_","bhāga","NC","","_","_"
7,"dīyatām","_","_","dad","V","dā","_","_"
8,"iti","_","_","iti","CQT","","_","_"
1,"_","_","_","ga","V","ga","_","_"
2,"_","_","_","tad","PRD","","_","_"
3,"yathākāmaṃ","_","_","yathākāma","JJ","","_","_"
4,"saṃtuṣṭo","_","_","saṃtuṣ","PPP","","_","_"
5,"dvijasattamaḥ","_","_","dvijasattama","NC","","_","_"
1,"iti","_","_","iti","CQT","","_","_"
2,"bruvantīṃ","_","_","brū","KDP","","_","_"
3,"tāṃ","_","_","tad","PRD","","_","_"
4,"sādhvīṃ","_","_","sādhu","JJ","","_","_"
5,"_","_","_","dharma","NC","","_","_"
6,"_","_","_","ātman","NC","","_","_"
7,"sa","_","_","tad","PRD","","_","_"
8,"dvijarṣabhaḥ","_","_","dvijarṣabha","NC","","_","_"
1,"_","_","_","kṣudhā","NC","","_","_"
2,"_","_","_","pariga","PPP","","_","_"
3,"jñātvā","_","_","jñā","CGDA","","_","_"
4,"_","_","_","saktu","NC","","_","_"
5,"_","_","_","tad","PRD","","_","_"
6,"_","_","_","na","CNG","","_","_"
7,"_","_","_","abhinand","V","abhinand","_","_"
1,"jānan","_","_","jñā","KDP","","_","_"
2,"vṛddhāṃ","_","_","vṛddha","JJ","","_","_"
3,"_","_","_","kṣudhā","NC","","_","_"
4,"_","_","_","ārta","JJ","","_","_"
5,"ca","_","_","ca","CCD","","_","_"
6,"śrāntāṃ","_","_","śra","PPP","","_","_"
7,"glānāṃ","_","_","glā","PPP","","_","_"
8,"tapasvinīm","_","_","tapasvinī","NC","","_","_"
1,"_","_","_","tvac","NC","","_","_"
2,"_","_","_","asthi","NC","","_","_"
3,"_","_","_","bhū","PPP","","_","_"
4,"vepantīṃ","_","_","vip","KDP","","_","_"
5,"tato","_","_","tatas","CX","","_","_"
6,"bhāryām","_","_","bhāryā","NC","","_","_"
7,"uvāca","_","_","vak","V","vac","_","_"
8,"tām","_","_","tad","PRD","","_","_"
1,"api","_","_","api","CX","","_","_"
2,"_","_","_","kīṭa","NC","","_","_"
3,"_","_","_","pataṃga","NC","","_","_"
4,"mṛgāṇāṃ","_","_","mṛga","NC","","_","_"
5,"_","_","_","ca","CCD","","_","_"
6,"_","_","_","eva","CEM","","_","_"
7,"śobhane","_","_","śobhana","JJ","","_","_"
1,"striyo","_","_","strī","NC","","_","_"
2,"_","_","_","rakṣ","KDG","","_","_"
3,"_","_","_","ca","CCD","","_","_"
4,"_","_","_","puṣ","KDG","","_","_"
5,"_","_","_","ca","CCD","","_","_"
6,"_","_","_","na","CNG","","_","_"
7,"_","_","_","eva","CX","","_","_"
8,"tvaṃ","_","_","tvat","PPR","","_","_"
9,"vaktum","_","_","vac","CGDI","","_","_"
10,"arhasi","_","_","arh","V","arh","_","_"
1,"anukampito","_","_","anukamp","PPP","","_","_"
2,"naro","_","_","nara","NC","","_","_"
3,"nāryā","_","_","nārī","NC","","_","_"
4,"puṣṭo","_","_","puṣ","PPP","","_","_"
5,"rakṣita","_","_","rakṣ","PPP","","_","_"
6,"eva","_","_","eva","CEM","","_","_"
7,"ca","_","_","ca","CCD","","_","_"
1,"prapated","_","_","prapat","V","prapat","_","_"
2,"yaśaso","_","_","yaśas","NC","","_","_"
3,"_","_","_","dīp","PPP","","_","_"
4,"_","_","_","na","CNG","","_","_"
5,"ca","_","_","ca","CCD","","_","_"
6,"lokān","_","_","loka","NC","","_","_"
7,"avāpnuyāt","_","_","avāpn","V","avāp","_","_"
1,"_","_","_","iti","CQT","","_","_"
2,"_","_","_","vac","PPP","","_","_"
3,"sā","_","_","tad","PRD","","_","_"
4,"tataḥ","_","_","tatas","CX","","_","_"
5,"prāha","_","_","prāh","V","prāh","_","_"
6,"_","_","_","dharma","NC","","_","_"
7,"_","_","_","artha","NC","","_","_"
8,"nau","_","_","mat","PPR","","_","_"
9,"samau","_","_","sama","PPX","","_","_"
10,"dvija","_","_","dvija","NC","","_","_"
1,"_","_","_","saktu","NC","","_","_"
2,"_","_","_","prastha","NC","","_","_"
3,"_","_","_","catur","NUM","","_","_"
4,"_","_","_","bhāga","NC","","_","_"
5,"_","_","_","grah","V","grah","_","_"
6,"_","_","_","ida","PRD","","_","_"
7,"prasīda","_","_","prasīd","V","prasad","_","_"
8,"me","_","_","mat","PPR","","_","_"
1,"satyaṃ","_","_","satya","NC","","_","_"
2,"_","_","_","rati","NC","","_","_"
3,"_","_","_","ca","CCD","","_","_"
4,"_","_","_","dharma","NC","","_","_"
5,"_","_","_","ca","CCD","","_","_"
6,"_","_","_","svarga","NC","","_","_"
7,"_","_","_","ca","CCD","","_","_"
8,"_","_","_","guṇa","NC","","_","_"
9,"_","_","_","nirji","PPP","","_","_"
1,"strīṇāṃ","_","_","strī","NC","","_","_"
2,"_","_","_","pati","NC","","_","_"
3,"_","_","_","sama","PPX","","_","_"
4,"_","_","_","adhīna","JJ","","_","_"
5,"kāṅkṣitaṃ","_","_","kāṅkṣ","PPP","","_","_"
6,"ca","_","_","ca","CCD","","_","_"
7,"dvijottama","_","_","dvijottama","NC","","_","_"
1,"ṛtur","_","_","ṛtu","NC","","_","_"
2,"mātuḥ","_","_","mātṛ","NC","","_","_"
3,"pitur","_","_","pitṛ","NC","","_","_"
4,"bījaṃ","_","_","bīja","NC","","_","_"
5,"daivataṃ","_","_","daivata","NC","","_","_"
6,"paramaṃ","_","_","parama","JJ","","_","_"
7,"patiḥ","_","_","pati","NC","","_","_"
1,"bhartuḥ","_","_","bhartṛ","NC","","_","_"
2,"prasādāt","_","_","prasāda","NC","","_","_"
3,"strīṇāṃ","_","_","strī","NC","","_","_"
4,"vai","_","_","vai","CX","","_","_"
5,"ratiḥ","_","_","rati","NC","","_","_"
6,"_","_","_","putra","NC","","_","_"
7,"_","_","_","phala","NC","","_","_"
8,"tathā","_","_","tathā","CX","","_","_"
1,"_","_","_","pālana","NC","","_","_"
2,"_","_","_","hi","CX","","_","_"
3,"_","_","_","pati","NC","","_","_"
4,"_","_","_","tvat","PPR","","_","_"
5,"me","_","_","mat","PPR","","_","_"
6,"_","_","_","bhartṛ","NC","","_","_"
7,"_","_","_","as","V","as","_","_"
8,"_","_","_","bharaṇa","NC","","_","_"
9,"_","_","_","mat","PPR","","_","_"
1,"_","_","_","putra","NC","","_","_"
2,"_","_","_","pradāna","NC","","_","_"
3,"_","_","_","vara","NC","","_","_"
4,"_","_","_","da","JJ","","_","_"
5,"_","_","_","tasmāt","CX","","_","_"
6,"saktūn","_","_","saktu","NC","","_","_"
7,"gṛhāṇa","_","_","grah","V","grah","_","_"
8,"me","_","_","mat","PPR","","_","_"
1,"_","_","_","jarā","NC","","_","_"
2,"_","_","_","pariga","PPP","","_","_"
3,"vṛddhaḥ","_","_","vṛddha","JJ","","_","_"
4,"_","_","_","kṣudhā","NC","","_","_"
5,"_","_","_","ārta","JJ","","_","_"
6,"durbalo","_","_","durbala","JJ","","_","_"
7,"bhṛśam","_","_","bhṛśa","CX","","_","_"
1,"_","_","_","upavāsa","NC","","_","_"
2,"_","_","_","pariśra","PPP","","_","_"
3,"yadā","_","_","yadā","CSB","","_","_"
4,"tvam","_","_","tvat","PPR","","_","_"
5,"api","_","_","api","CX","","_","_"
6,"karśitaḥ","_","_","karśay","PPP","","_","_"
1,"_","_","_","iti","CQT","","_","_"
2,"_","_","_","vac","PPP","","_","_"
3,"sa","_","_","tad","PRD","","_","_"
4,"tayā","_","_","tad","PRD","","_","_"
5,"saktūn","_","_","saktu","NC","","_","_"
6,"_","_","_","pragrah","CGDA","","_","_"
7,"_","_","_","ida","PRD","","_","_"
8,"vaco","_","_","vacas","NC","","_","_"
9,"'bravīt","_","_","abravīta","V","brū","_","_"
1,"dvija","_","_","dvija","NC","","_","_"
2,"saktūn","_","_","saktu","NC","","_","_"
3,"imān","_","_","ida","PRD","","_","_"
4,"bhūyaḥ","_","_","bhūyas","CX","","_","_"
5,"pratigṛhṇīṣva","_","_","pratigrah","V","pratigrah","_","_"
6,"sattama","_","_","sattama","JJ","","_","_"
1,"sa","_","_","tad","PRD","","_","_"
2,"tān","_","_","tad","PRD","","_","_"
3,"pragṛhya","_","_","pragrah","CGDA","","_","_"
4,"bhuktvā","_","_","bhuj","CGDA","","_","_"
5,"ca","_","_","ca","CCD","","_","_"
6,"na","_","_","na","CNG","","_","_"
7,"tuṣṭim","_","_","tuṣṭi","NC","","_","_"
8,"agamad","_","_","ga","V","ga","_","_"
9,"dvijaḥ","_","_","dvija","NC","","_","_"
1,"tam","_","_","tad","PRD","","_","_"
2,"_","_","_","uñcha","NC","","_","_"
3,"_","_","_","vṛtti","NC","","_","_"
4,"ālakṣya","_","_","ālakṣay","CGDA","","_","_"
5,"_","_","_","tatas","CX","","_","_"
6,"_","_","_","cintā","NC","","_","_"
7,"_","_","_","para","PPX","","_","_"
8,"'bhavat","_","_","bhav","V","bhū","_","_"
1,"putra","_","_","putra","NC","","_","_"
2,"uvāca","_","_","vak","V","vac","_","_"
1,"saktūn","_","_","saktu","NC","","_","_"
2,"imān","_","_","ida","PRD","","_","_"
3,"pragṛhya","_","_","pragrah","CGDA","","_","_"
4,"tvaṃ","_","_","tvat","PPR","","_","_"
5,"dehi","_","_","dad","V","dā","_","_"
6,"viprāya","_","_","vipra","NC","","_","_"
7,"sattama","_","_","sattama","JJ","","_","_"
1,"_","_","_","iti","CQT","","_","_"
2,"_","_","_","eva","CX","","_","_"
3,"_","_","_","su","CAD","","_","_"
4,"_","_","_","kṛ","PPP","","_","_"
5,"manye","_","_","man","V","man","_","_"
6,"tasmād","_","_","tasmāt","CX","","_","_"
7,"etat","_","_","tad","PRD","","_","_"
8,"_","_","_","kar","V","kṛ","_","_"
9,"_","_","_","mat","PPR","","_","_"
1,"bhavān","_","_","bhavat","JJ","","_","_"
2,"hi","_","_","hi","CX","","_","_"
3,"paripālyo","_","_","paripālay","KDG","","_","_"
4,"me","_","_","mat","PPR","","_","_"
5,"_","_","_","sarva","JQ","","_","_"
6,"_","_","_","yatna","NC","","_","_"
7,"dvijottama","_","_","dvijottama","NC","","_","_"
1,"sādhūnāṃ","_","_","sādhu","JJ","","_","_"
2,"kāṅkṣitaṃ","_","_","kāṅkṣ","PPP","","_","_"
3,"_","_","_","hi","CX","","_","_"
4,"_","_","_","tad","PRD","","_","_"
5,"pitur","_","_","pitṛ","NC","","_","_"
6,"vṛddhasya","_","_","vṛddha","JJ","","_","_"
7,"poṣaṇam","_","_","poṣaṇa","NC","","_","_"
1,"_","_","_","putra","NC","","_","_"
2,"_","_","_","artha","NC","","_","_"
3,"vihito","_","_","vidhā","PPP","","_","_"
4,"_","_","_","hi","CX","","_","_"
5,"_","_","_","tad","PRD","","_","_"
6,"sthāvirye","_","_","sthāvirya","NC","","_","_"
7,"paripālanam","_","_","paripālana","NC","","_","_"
1,"śrutir","_","_","śruti","NC","","_","_"
2,"eṣā","_","_","tad","PRD","","_","_"
3,"hi","_","_","hi","CX","","_","_"
4,"_","_","_","vipra","NC","","_","_"
5,"_","_","_","ṛṣi","NC","","_","_"
6,"triṣu","_","_","tri","NUM","","_","_"
7,"lokeṣu","_","_","loka","NC","","_","_"
8,"viśrutā","_","_","viśru","PPP","","_","_"
1,"_","_","_","prāṇa","NC","","_","_"
2,"_","_","_","dhāraṇa","NC","","_","_"
3,"_","_","_","mātra","NC","","_","_"
4,"śakyaṃ","_","_","śakya","JJ","","_","_"
5,"kartuṃ","_","_","kṛ","CGDI","","_","_"
6,"_","_","_","tapas","NC","","_","_"
7,"_","_","_","tvat","PPR","","_","_"
1,"prāṇo","_","_","prāṇa","NC","","_","_"
2,"hi","_","_","hi","CX","","_","_"
3,"paramo","_","_","parama","JJ","","_","_"
4,"dharmaḥ","_","_","dharma","NC","","_","_"
5,"sthito","_","_","sthā","PPP","","_","_"
6,"deheṣu","_","_","deha","NC","","_","_"
7,"dehinām","_","_","dehin","NC","","_","_"
1,"_","_","_","pitṛ","NC","","_","_"
2,"_","_","_","vak","V","vac","_","_"
1,"api","_","_","api","CX","","_","_"
2,"_","_","_","varṣa","NC","","_","_"
3,"_","_","_","sahasrin","JJ","","_","_"
4,"tvaṃ","_","_","tvat","PPR","","_","_"
5,"bāla","_","_","bāla","NC","","_","_"
6,"eva","_","_","eva","CEM","","_","_"
7,"mato","_","_","man","PPP","","_","_"
8,"mama","_","_","mat","PPR","","_","_"
1,"utpādya","_","_","utpāday","CGDA","","_","_"
2,"putraṃ","_","_","putra","NC","","_","_"
3,"hi","_","_","hi","CX","","_","_"
4,"pitā","_","_","pitṛ","NC","","_","_"
5,"kṛtakṛtyo","_","_","kṛtakṛtya","JJ","","_","_"
6,"_","_","_","bhav","V","bhū","_","_"
7,"_","_","_","uta","CCD","","_","_"
1,"bālānāṃ","_","_","bāla","NC","","_","_"
2,"kṣud","_","_","kṣudh","NC","","_","_"
3,"balavatī","_","_","balavat","JJ","","_","_"
4,"_","_","_","jān","V","jñā","_","_"
5,"_","_","_","tad","PRD","","_","_"
6,"ahaṃ","_","_","mat","PPR","","_","_"
7,"vibho","_","_","vibhu","JJ","","_","_"
1,"vṛddho","_","_","vṛddha","JJ","","_","_"
2,"'haṃ","_","_","mat","PPR","","_","_"
3,"dhārayiṣyāmi","_","_","dhar","V","dhṛ","_","_"
4,"tvaṃ","_","_","tvat","PPR","","_","_"
5,"balī","_","_","balin","JJ","","_","_"
6,"bhava","_","_","bhav","V","bhū","_","_"
7,"putraka","_","_","putraka","NC","","_","_"
1,"jīrṇena","_","_","jṛ","PPP","","_","_"
2,"vayasā","_","_","vayas","NC","","_","_"
3,"putra","_","_","putra","NC","","_","_"
4,"na","_","_","na","CNG","","_","_"
5,"mā","_","_","mat","PPR","","_","_"
6,"kṣud","_","_","kṣudh","NC","","_","_"
7,"bādhate","_","_","bādh","V","bādh","_","_"
8,"'pi","_","_","api","CX","","_","_"
9,"ca","_","_","ca","CCD","","_","_"
1,"_","_","_","dīrgha","JJ","","_","_"
2,"_","_","_","kāla","NC","","_","_"
3,"_","_","_","tapas","NC","","_","_"
4,"_","_","_","tap","PPP","","_","_"
5,"na","_","_","na","CNG","","_","_"
6,"me","_","_","mat","PPR","","_","_"
7,"maraṇato","_","_","maraṇa","NC","","_","_"
8,"bhayam","_","_","bhaya","NC","","_","_"
1,"putra","_","_","putra","NC","","_","_"
2,"uvāca","_","_","vak","V","vac","_","_"
1,"apatyam","_","_","apatya","NC","","_","_"
2,"asmi","_","_","as","V","as","_","_"
3,"te","_","_","tvat","PPR","","_","_"
4,"_","_","_","putra","NC","","_","_"
5,"_","_","_","trāṇa","NC","","_","_"
6,"putro","_","_","putra","NC","","_","_"
7,"hi","_","_","hi","CX","","_","_"
8,"viśrutaḥ","_","_","viśru","PPP","","_","_"
1,"ātmā","_","_","ātman","NC","","_","_"
2,"putraḥ","_","_","putra","NC","","_","_"
3,"_","_","_","smṛ","PPP","","_","_"
4,"_","_","_","tasmāt","CX","","_","_"
5,"_","_","_","trā","V","trā","_","_"
6,"_","_","_","ātman","NC","","_","_"
7,"_","_","_","iha","CAD","","_","_"
8,"_","_","_","ātman","NC","","_","_"
1,"_","_","_","pitṛ","NC","","_","_"
2,"_","_","_","vak","V","vac","_","_"
1,"rūpeṇa","_","_","rūpa","NC","","_","_"
2,"_","_","_","sadṛśa","JJ","","_","_"
3,"_","_","_","tvat","PPR","","_","_"
4,"me","_","_","mat","PPR","","_","_"
5,"śīlena","_","_","śīla","NC","","_","_"
6,"ca","_","_","ca","CCD","","_","_"
7,"damena","_","_","dama","NC","","_","_"
8,"ca","_","_","ca","CCD","","_","_"
1,"_","_","_","parīkṣ","PPP","","_","_"
2,"_","_","_","ca","CCD","","_","_"
3,"bahudhā","_","_","bahudhā","CX","","_","_"
4,"saktūn","_","_","saktu","NC","","_","_"
5,"ādadmi","_","_","ādad","V","ādā","_","_"
6,"te","_","_","tvat","PPR","","_","_"
7,"tataḥ","_","_","tatas","CX","","_","_"
1,"_","_","_","iti","CQT","","_","_"
2,"_","_","_","vac","CGDA","","_","_"
3,"_","_","_","ādā","CGDA","","_","_"
4,"tān","_","_","tad","PRD","","_","_"
5,"saktūn","_","_","saktu","NC","","_","_"
6,"_","_","_","prī","PPP","","_","_"
7,"_","_","_","ātman","NC","","_","_"
8,"dvijasattamaḥ","_","_","dvijasattama","NC","","_","_"
1,"prahasann","_","_","prahas","KDP","","_","_"
2,"iva","_","_","iva","CCM","","_","_"
3,"viprāya","_","_","vipra","NC","","_","_"
4,"sa","_","_","tad","PRD","","_","_"
5,"tasmai","_","_","tad","PRD","","_","_"
6,"pradadau","_","_","pradad","V","pradā","_","_"
7,"tadā","_","_","tadā","CAD","","_","_"
1,"bhuktvā","_","_","bhuj","CGDA","","_","_"
2,"tān","_","_","tad","PRD","","_","_"
3,"api","_","_","api","CX","","_","_"
4,"saktūn","_","_","saktu","NC","","_","_"
5,"sa","_","_","sa_saha","CX","","_","_"
6,"_","_","_","na","CNG","","_","_"
7,"_","_","_","eva","CEM","","_","_"
8,"tuṣṭo","_","_","tuṣ","PPP","","_","_"
9,"babhūva","_","_","bhav","V","bhū","_","_"
10,"ha","_","_","ha","CEM","","_","_"
1,"_","_","_","uñcha","NC","","_","_"
2,"_","_","_","vṛtti","NC","","_","_"
3,"_","_","_","tu","CCD","","_","_"
4,"_","_","_","sa_saha","CX","","_","_"
5,"_","_","_","vrīḍā","NC","","_","_"
6,"babhūva","_","_","bhav","V","bhū","_","_"
7,"dvijasattamaḥ","_","_","dvijasattama","NC","","_","_"
1,"taṃ","_","_","tad","PRD","","_","_"
2,"vai","_","_","vai","CX","","_","_"
3,"vadhūḥ","_","_","vadhū","NC","","_","_"
4,"sthitā","_","_","sthā","PPP","","_","_"
5,"sādhvī","_","_","sādhu","JJ","","_","_"
6,"_","_","_","brāhmaṇa","NC","","_","_"
7,"_","_","_","priya","JJ","","_","_"
8,"_","_","_","kāmyā","NC","","_","_"
1,"saktūn","_","_","saktu","NC","","_","_"
2,"ādāya","_","_","ādā","CGDA","","_","_"
3,"saṃhṛṣṭā","_","_","saṃhṛṣ","PPP","","_","_"
4,"guruṃ","_","_","guru","NC","","_","_"
5,"taṃ","_","_","tad","PRD","","_","_"
6,"vākyam","_","_","vākya","NC","","_","_"
7,"abravīt","_","_","abravīta","V","brū","_","_"
1,"saṃtānāt","_","_","saṃtāna","NC","","_","_"
2,"tava","_","_","tvat","PPR","","_","_"
3,"saṃtānaṃ","_","_","saṃtāna","NC","","_","_"
4,"mama","_","_","mat","PPR","","_","_"
5,"vipra","_","_","vipra","NC","","_","_"
6,"bhaviṣyati","_","_","bhav","V","bhū","_","_"
1,"saktūn","_","_","saktu","NC","","_","_"
2,"imān","_","_","ida","PRD","","_","_"
3,"atithaye","_","_","atithi","NC","","_","_"
4,"gṛhītvātā","_","_","grah","CGDA","","_","_"
6,"prayaccha","_","_","prayaccha","V","praya","_","_"
7,"me","_","_","mat","PPR","","_","_"
1,"tava","_","_","tvat","PPR","","_","_"
2,"_","_","_","prasava","NC","","_","_"
3,"_","_","_","nirvṛti","NC","","_","_"
4,"mama","_","_","mat","PPR","","_","_"
5,"lokāḥ","_","_","loka","NC","","_","_"
6,"_","_","_","kila","CX","","_","_"
7,"_","_","_","akṣaya","JJ","","_","_"
1,"pautreṇa","_","_","pautra","NC","","_","_"
2,"tān","_","_","tad","PRD","","_","_"
3,"avāpnoti","_","_","avāpn","V","avāp","_","_"
4,"yatra","_","_","yatra","CX","","_","_"
5,"gatvā","_","_","ga","CGDA","","_","_"
6,"na","_","_","na","CNG","","_","_"
7,"śocati","_","_","śuc","V","śuc","_","_"
1,"_","_","_","dharma","NC","","_","_"
2,"_","_","_","ādya","JJ","","_","_"
3,"hi","_","_","hi","CX","","_","_"
4,"yathā","_","_","yathā","CCM","","_","_"
5,"tretā","_","_","tretā","NC","","_","_"
6,"_","_","_","vahni","NC","","_","_"
7,"_","_","_","tretā","NC","","_","_"
8,"_","_","_","tathā","CX","","_","_"
9,"_","_","_","eva","CEM","","_","_"
10,"ca","_","_","ca","CCD","","_","_"
1,"_","_","_","tathā","CX","","_","_"
2,"_","_","_","eva","CEM","","_","_"
3,"_","_","_","putra","NC","","_","_"
4,"_","_","_","pautra","NC","","_","_"
5,"svarge","_","_","svarga","NC","","_","_"
6,"tretā","_","_","tretā","NC","","_","_"
7,"_","_","_","kila","CX","","_","_"
8,"_","_","_","akṣaya","JJ","","_","_"
1,"_","_","_","pitṛ","NC","","_","_"
2,"_","_","_","trāṇa","NC","","_","_"
3,"tārayati","_","_","tar","V","tṛ","_","_"
4,"putra","_","_","putra","NC","","_","_"
5,"_","_","_","iti","CQT","","_","_"
6,"_","_","_","anuśṛṇ","V","anuśru","_","_"
1,"_","_","_","putra","NC","","_","_"
2,"_","_","_","pautra","NC","","_","_"
3,"_","_","_","ca","CCD","","_","_"
4,"niyataṃ","_","_","niya","PPP","","_","_"
5,"_","_","_","sādhu","JJ","","_","_"
6,"_","_","_","loka","NC","","_","_"
7,"upāśnute","_","_","upāśnuta","V","upāś","_","_"
1,"śvaśura","_","_","śvaśura","NC","","_","_"
2,"uvāca","_","_","vak","V","vac","_","_"
1,"_","_","_","vāta","NC","","_","_"
2,"_","_","_","ātapa","NC","","_","_"
3,"_","_","_","viśṛ","PPP","","_","_"
4,"_","_","_","aṅga","JJ","","_","_"
5,"tvāṃ","_","_","tvat","PPR","","_","_"
6,"vivarṇāṃ","_","_","vivarṇa","JJ","","_","_"
7,"nirīkṣya","_","_","nirīkṣ","CGDA","","_","_"
8,"vai","_","_","vai","CX","","_","_"
1,"karśitāṃ","_","_","karśay","PPP","","_","_"
2,"_","_","_","su","CAD","","_","_"
3,"_","_","_","vrata","NC","","_","_"
4,"_","_","_","ācāra","NC","","_","_"
5,"_","_","_","kṣudhā","NC","","_","_"
6,"_","_","_","vihvala","JJ","","_","_"
7,"_","_","_","cetas","NC","","_","_"
1,"kathaṃ","_","_","katha","CX","","_","_"
2,"saktūn","_","_","saktu","NC","","_","_"
3,"grahīṣyāmi","_","_","grah","V","grah","_","_"
4,"bhūtvā","_","_","bhū","CGDA","","_","_"
5,"_","_","_","dharma","NC","","_","_"
6,"_","_","_","upaghātaka","JJ","","_","_"
1,"_","_","_","kalyāṇa","JJ","","_","_"
2,"_","_","_","vṛtta","NC","","_","_"
3,"kalyāṇi","_","_","kalyāṇa","JJ","","_","_"
4,"_","_","_","na","CNG","","_","_"
5,"_","_","_","eva","CX","","_","_"
6,"tvaṃ","_","_","tvat","PPR","","_","_"
7,"vaktum","_","_","vac","CGDI","","_","_"
8,"arhasi","_","_","arh","V","arh","_","_"
1,"ṣaṣṭhe","_","_","ṣaṣṭha","JJ","","_","_"
2,"kāle","_","_","kāla","NC","","_","_"
3,"vratavatīṃ","_","_","vratavat","JJ","","_","_"
4,"_","_","_","śīla","NC","","_","_"
5,"_","_","_","śauca","NC","","_","_"
6,"_","_","_","samanvita","JJ","","_","_"
1,"_","_","_","kṛcchra","NC","","_","_"
2,"_","_","_","vṛtti","NC","","_","_"
3,"nirāhārāṃ","_","_","nirāhāra","JJ","","_","_"
4,"drakṣyāmi","_","_","darś","V","dṛś","_","_"
5,"tvāṃ","_","_","tvat","PPR","","_","_"
6,"kathaṃ","_","_","katha","CX","","_","_"
7,"_","_","_","nu","CX","","_","_"
8,"_","_","_","mat","PPR","","_","_"
1,"bālā","_","_","bāla","JJ","","_","_"
2,"_","_","_","kṣudh","NC","","_","_"
3,"_","_","_","ārta","JJ","","_","_"
4,"nārī","_","_","nārī","NC","","_","_"
5,"ca","_","_","ca","CCD","","_","_"
6,"rakṣyā","_","_","rakṣ","KDG","","_","_"
7,"tvaṃ","_","_","tvat","PPR","","_","_"
8,"satataṃ","_","_","satata","CX","","_","_"
9,"mayā","_","_","mat","PPR","","_","_"
1,"_","_","_","upavāsa","NC","","_","_"
2,"_","_","_","pariśra","PPP","","_","_"
3,"tvaṃ","_","_","tvat","PPR","","_","_"
4,"hi","_","_","hi","CX","","_","_"
5,"_","_","_","bāndhava","NC","","_","_"
6,"_","_","_","nandin","JJ","","_","_"
1,"_","_","_","snuṣā","NC","","_","_"
2,"_","_","_","vak","V","vac","_","_"
1,"guror","_","_","guru","NC","","_","_"
2,"mama","_","_","mat","PPR","","_","_"
3,"_","_","_","guru","NC","","_","_"
4,"_","_","_","tvat","PPR","","_","_"
5,"vai","_","_","vai","CX","","_","_"
6,"yato","_","_","yatas","CX","","_","_"
7,"_","_","_","daivata","NC","","_","_"
8,"_","_","_","daivata","NC","","_","_"
1,"_","_","_","deva","NC","","_","_"
2,"_","_","_","atideva","NC","","_","_"
3,"_","_","_","tasmāt","CX","","_","_"
4,"tvaṃ","_","_","tvat","PPR","","_","_"
5,"saktūn","_","_","saktu","NC","","_","_"
6,"ādatsva","_","_","ādad","V","ādā","_","_"
7,"me","_","_","mat","PPR","","_","_"
8,"vibho","_","_","vibhu","JJ","","_","_"
1,"dehaḥ","_","_","deha","NC","","_","_"
2,"_","_","_","prāṇa","NC","","_","_"
3,"_","_","_","ca","CCD","","_","_"
4,"_","_","_","dharma","NC","","_","_"
5,"_","_","_","ca","CCD","","_","_"
6,"_","_","_","śuśrūṣā","NC","","_","_"
7,"_","_","_","artha","NC","","_","_"
8,"idaṃ","_","_","ida","PRD","","_","_"
9,"guroḥ","_","_","guru","NC","","_","_"
1,"tava","_","_","tvat","PPR","","_","_"
2,"vipra","_","_","vipra","NC","","_","_"
3,"prasādena","_","_","prasāda","NC","","_","_"
4,"lokān","_","_","loka","NC","","_","_"
5,"_","_","_","prāpn","V","prāp","_","_"
6,"_","_","_","abhīps","PPP","","_","_"
1,"avekṣyā","_","_","avekṣ","KDG","","_","_"
2,"iti","_","_","iti","CQT","","_","_"
3,"kṛtvā","_","_","kṛ","CGDA","","_","_"
4,"tvaṃ","_","_","tvat","PPR","","_","_"
5,"_","_","_","dṛḍha","JJ","","_","_"
6,"_","_","_","bhakti","NC","","_","_"
7,"_","_","_","iti","CQT","","_","_"
8,"vā","_","_","vā","CCD","","_","_"
9,"dvija","_","_","dvija","NC","","_","_"
1,"cintyā","_","_","cintay","KDG","","_","_"
2,"_","_","_","mat","PPR","","_","_"
3,"_","_","_","ida","PRD","","_","_"
4,"iti","_","_","iti","CQT","","_","_"
5,"vā","_","_","vā","CCD","","_","_"
6,"saktūn","_","_","saktu","NC","","_","_"
7,"ādātum","_","_","ādā","CGDI","","_","_"
8,"arhasi","_","_","arh","V","arh","_","_"
1,"śvaśura","_","_","śvaśura","NC","","_","_"
2,"uvāca","_","_","vak","V","vac","_","_"
1,"anena","_","_","ida","PRD","","_","_"
2,"nityaṃ","_","_","nitya","CX","","_","_"
3,"sādhvī","_","_","sādhu","JJ","","_","_"
4,"tvaṃ","_","_","tvat","PPR","","_","_"
5,"_","_","_","śīla","NC","","_","_"
6,"_","_","_","vṛtta","NC","","_","_"
7,"śobhase","_","_","śubh","V","śubh","_","_"
1,"yā","_","_","yad","PRL","","_","_"
2,"tvaṃ","_","_","tvat","PPR","","_","_"
3,"_","_","_","dharma","NC","","_","_"
4,"_","_","_","vrata","NC","","_","_"
5,"_","_","_","upe","PPP","","_","_"
6,"_","_","_","guru","NC","","_","_"
7,"_","_","_","vṛtti","NC","","_","_"
8,"avekṣase","_","_","avekṣ","V","avekṣ","_","_"
1,"tasmāt","_","_","tasmāt","CX","","_","_"
2,"saktūn","_","_","saktu","NC","","_","_"
3,"grahīṣyāmi","_","_","grah","V","grah","_","_"
4,"vadhūr","_","_","vadhū","NC","","_","_"
5,"_","_","_","na","CNG","","_","_"
6,"_","_","_","arh","V","arh","_","_"
7,"vañcanām","_","_","vañcana","NC","","_","_"
1,"gaṇayitvā","_","_","gaṇay","CGDA","","_","_"
2,"mahābhāge","_","_","mahābhāga","JJ","","_","_"
3,"tvaṃ","_","_","tvat","PPR","","_","_"
4,"hi","_","_","hi","CX","","_","_"
5,"_","_","_","dharma","NC","","_","_"
6,"_","_","_","bhṛt","JJ","","_","_"
7,"varā","_","_","vara","JJ","","_","_"
1,"_","_","_","iti","CQT","","_","_"
2,"_","_","_","vac","CGDA","","_","_"
3,"tān","_","_","tad","PRD","","_","_"
4,"upādāya","_","_","upādā","CGDA","","_","_"
5,"saktūn","_","_","saktu","NC","","_","_"
6,"prādād","_","_","pradad","V","pradā","_","_"
7,"dvijātaye","_","_","dvijāti","NC","","_","_"
1,"_","_","_","tatas","CX","","_","_"
2,"_","_","_","tuṣ","PPP","","_","_"
3,"'bhavad","_","_","bhav","V","bhū","_","_"
4,"_","_","_","vipra","NC","","_","_"
5,"_","_","_","tad","PRD","","_","_"
6,"sādhor","_","_","sādhu","JJ","","_","_"
7,"mahātmanaḥ","_","_","mahātman","JJ","","_","_"
1,"_","_","_","prī","PPP","","_","_"
2,"_","_","_","ātman","NC","","_","_"
3,"sa","_","_","tad","PRD","","_","_"
4,"tu","_","_","tu","CCD","","_","_"
5,"taṃ","_","_","tad","PRD","","_","_"
6,"vākyam","_","_","vākya","NC","","_","_"
7,"idam","_","_","ida","PRD","","_","_"
8,"āha","_","_","ah","V","ah","_","_"
9,"dvijarṣabham","_","_","dvijarṣabha","NC","","_","_"
1,"vāgmī","_","_","vāgmin","JJ","","_","_"
2,"tadā","_","_","tadā","CAD","","_","_"
3,"dvijaśreṣṭho","_","_","dvijaśreṣṭha","NC","","_","_"
4,"dharmaḥ","_","_","dharma","NC","","_","_"
5,"_","_","_","puruṣa","NC","","_","_"
6,"_","_","_","vigraha","NC","","_","_"
1,"śuddhena","_","_","śudh","PPP","","_","_"
2,"tava","_","_","tvat","PPR","","_","_"
3,"dānena","_","_","dāna","NC","","_","_"
4,"_","_","_","nyāya","NC","","_","_"
5,"_","_","_","upadā","PPP","","_","_"
6,"yatnataḥ","_","_","yatna","NC","","_","_"
1,"yathāśakti","_","_","yathāśakti","CX","","_","_"
2,"vimuktena","_","_","vimuc","PPP","","_","_"
3,"prīto","_","_","prī","PPP","","_","_"
4,"'smi","_","_","as","V","as","_","_"
5,"dvijasattama","_","_","dvijasattama","NC","","_","_"
1,"aho","_","_","aho","CX","","_","_"
2,"dānaṃ","_","_","dāna","NC","","_","_"
3,"ghuṣyate","_","_","ghoṣ","V","ghuṣ","_","_"
4,"te","_","_","tvat","PPR","","_","_"
5,"svarge","_","_","svarga","NC","","_","_"
6,"_","_","_","svarga","NC","","_","_"
7,"_","_","_","nivāsin","JJ","","_","_"
1,"gaganāt","_","_","gagana","NC","","_","_"
2,"_","_","_","puṣpa","NC","","_","_"
3,"_","_","_","varṣa","NC","","_","_"
4,"ca","_","_","ca","CCD","","_","_"
5,"paśyasva","_","_","paś","V","paś","_","_"
6,"patitaṃ","_","_","pat","PPP","","_","_"
7,"bhuvi","_","_","bhū","NC","","_","_"
1,"_","_","_","sura","NC","","_","_"
2,"_","_","_","ṛṣi","NC","","_","_"
3,"_","_","_","deva","NC","","_","_"
4,"_","_","_","gandharva","NC","","_","_"
5,"ye","_","_","yad","PRL","","_","_"
6,"ca","_","_","ca","CCD","","_","_"
7,"_","_","_","deva","NC","","_","_"
8,"_","_","_","puraḥsara","JJ","","_","_"
1,"stuvanto","_","_","stu","KDP","","_","_"
2,"_","_","_","deva","NC","","_","_"
3,"_","_","_","dūta","NC","","_","_"
4,"_","_","_","ca","CCD","","_","_"
5,"sthitā","_","_","sthā","PPP","","_","_"
6,"dānena","_","_","dāna","NC","","_","_"
7,"vismitāḥ","_","_","vismi","PPP","","_","_"
1,"brahmarṣayo","_","_","brahmarṣi","NC","","_","_"
2,"_","_","_","vimāna","NC","","_","_"
3,"_","_","_","stha","JJ","","_","_"
4,"_","_","_","brahman","NC","","_","_"
5,"_","_","_","loka","NC","","_","_"
6,"_","_","_","ga","PPP","","_","_"
7,"_","_","_","ca","CCD","","_","_"
8,"ye","_","_","yad","PRL","","_","_"
1,"kāṅkṣante","_","_","kāṅkṣ","V","kāṅkṣ","_","_"
2,"darśanaṃ","_","_","darśana","NC","","_","_"
3,"tubhyaṃ","_","_","tvat","PPR","","_","_"
4,"divaṃ","_","_","div","NC","","_","_"
5,"gaccha","_","_","ga","V","ga","_","_"
6,"dvijarṣabha","_","_","dvijarṣabha","NC","","_","_"
1,"_","_","_","pitṛ","NC","","_","_"
2,"_","_","_","loka","NC","","_","_"
3,"_","_","_","ga","PPP","","_","_"
4,"sarve","_","_","sarva","JQ","","_","_"
5,"tāritāḥ","_","_","tāray","PPP","","_","_"
6,"_","_","_","pitṛ","NC","","_","_"
7,"_","_","_","tvat","PPR","","_","_"
1,"_","_","_","anāgata","JJ","","_","_"
2,"_","_","_","ca","CCD","","_","_"
3,"bahavaḥ","_","_","bahu","JJ","","_","_"
4,"_","_","_","su","CAD","","_","_"
5,"_","_","_","bahu","JJ","","_","_"
6,"yugāni","_","_","yuga","NC","","_","_"
7,"ca","_","_","ca","CCD","","_","_"
1,"brahmacaryeṇa","_","_","brahmacarya","NC","","_","_"
2,"yajñena","_","_","yajña","NC","","_","_"
3,"dānena","_","_","dāna","NC","","_","_"
4,"tapasā","_","_","tapas","NC","","_","_"
5,"tathā","_","_","tathā","CX","","_","_"
1,"a","_","_","alpha_privativum","JJ","","_","_"
1,"agahvareṇa","_","_","gahvara","JJ","","_","_"
2,"dharmeṇa","_","_","dharma","NC","","_","_"
3,"tasmād","_","_","tasmāt","CX","","_","_"
4,"gaccha","_","_","ga","V","ga","_","_"
5,"divaṃ","_","_","div","NC","","_","_"
6,"dvija","_","_","dvija","NC","","_","_"
1,"śraddhayā","_","_","śraddhā","NC","","_","_"
2,"parayā","_","_","para","PPX","","_","_"
3,"_","_","_","yad","PRL","","_","_"
4,"_","_","_","tvat","PPR","","_","_"
5,"_","_","_","tapas","NC","","_","_"
6,"_","_","_","car","V","car","_","_"
7,"suvrata","_","_","suvrata","JJ","","_","_"
1,"tasmād","_","_","tasmāt","CX","","_","_"
2,"_","_","_","deva","NC","","_","_"
3,"_","_","_","tvat","PPR","","_","_"
4,"_","_","_","ida","PRD","","_","_"
5,"prītā","_","_","prī","PPP","","_","_"
6,"_","_","_","dvijavara","NC","","_","_"
7,"_","_","_","uttama","JJ","","_","_"
1,"_","_","_","sarva","JQ","","_","_"
2,"_","_","_","sva","NC","","_","_"
3,"etad","_","_","tad","PRD","","_","_"
4,"yasmāt","_","_","yasmāt","CX","","_","_"
5,"te","_","_","tvat","PPR","","_","_"
6,"tyaktaṃ","_","_","tyaj","PPP","","_","_"
7,"śuddhena","_","_","śuddha","JJ","","_","_"
8,"cetasā","_","_","cetas","NC","","_","_"
1,"_","_","_","kṛcchra","NC","","_","_"
2,"_","_","_","kāla","NC","","_","_"
3,"tataḥ","_","_","tatas","CX","","_","_"
4,"svargo","_","_","svarga","NC","","_","_"
5,"jito","_","_","ji","PPP","","_","_"
6,"'yaṃ","_","_","ida","PRD","","_","_"
7,"tava","_","_","tvat","PPR","","_","_"
8,"karmaṇā","_","_","karman","NC","","_","_"
1,"kṣudhā","_","_","kṣudhā","NC","","_","_"
2,"nirṇudati","_","_","nirṇud","V","nirṇud","_","_"
3,"prajñāṃ","_","_","prajñā","NC","","_","_"
4,"dharmyāṃ","_","_","dharmya","JJ","","_","_"
5,"buddhiṃ","_","_","buddhi","NC","","_","_"
6,"vyapohati","_","_","vyapoh","V","vyapoh","_","_"
1,"_","_","_","kṣudhā","NC","","_","_"
2,"_","_","_","pariga","PPP","","_","_"
3,"_","_","_","jñāna","NC","","_","_"
4,"dhṛtiṃ","_","_","dhṛti","NC","","_","_"
5,"tyajati","_","_","tyaj","V","tyaj","_","_"
6,"_","_","_","ca","CCD","","_","_"
7,"_","_","_","eva","CEM","","_","_"
8,"ha","_","_","ha","CEM","","_","_"
1,"bubhukṣāṃ","_","_","bubhukṣā","NC","","_","_"
2,"jayate","_","_","jay","V","ji","_","_"
3,"_","_","_","yad","PRL","","_","_"
4,"_","_","_","tu","CCD","","_","_"
5,"sa","_","_","tad","PRD","","_","_"
6,"svargaṃ","_","_","svarga","NC","","_","_"
7,"jayate","_","_","jay","V","ji","_","_"
8,"dhruvam","_","_","dhruva","CX","","_","_"
1,"yadā","_","_","yadā","CSB","","_","_"
2,"_","_","_","dāna","NC","","_","_"
3,"_","_","_","ruci","NC","","_","_"
4,"bhavati","_","_","bhav","V","bhū","_","_"
5,"tadā","_","_","tadā","CAD","","_","_"
6,"dharmo","_","_","dharma","NC","","_","_"
7,"na","_","_","na","CNG","","_","_"
8,"sīdati","_","_","sīd","V","sad","_","_"
1,"anavekṣya","_","_","anavekṣya","CX","","_","_"
2,"_","_","_","suta","NC","","_","_"
3,"_","_","_","sneha","NC","","_","_"
4,"_","_","_","kalatra","NC","","_","_"
5,"_","_","_","sneha","NC","","_","_"
6,"eva","_","_","eva","CEM","","_","_"
7,"ca","_","_","ca","CCD","","_","_"
1,"dharmam","_","_","dharma","NC","","_","_"
2,"eva","_","_","eva","CEM","","_","_"
3,"guruṃ","_","_","guru","NC","","_","_"
4,"jñātvā","_","_","jñā","CGDA","","_","_"
5,"tṛṣṇā","_","_","tṛṣṇā","NC","","_","_"
6,"na","_","_","na","CNG","","_","_"
7,"gaṇitā","_","_","gaṇay","PPP","","_","_"
8,"tvayā","_","_","tvat","PPR","","_","_"
1,"_","_","_","dravya","NC","","_","_"
2,"_","_","_","āgama","NC","","_","_"
3,"nṛṇāṃ","_","_","nṛ","NC","","_","_"
4,"sūkṣmaḥ","_","_","sūkṣma","JJ","","_","_"
5,"pātre","_","_","pātra","NC","","_","_"
6,"dānaṃ","_","_","dāna","NC","","_","_"
7,"tataḥ","_","_","tatas","CX","","_","_"
8,"param","_","_","para","PPX","","_","_"
1,"kālaḥ","_","_","kāla","NC","","_","_"
2,"parataro","_","_","paratara","JJ","","_","_"
3,"_","_","_","dāna","NC","","_","_"
4,"_","_","_","śraddhā","NC","","_","_"
5,"_","_","_","ca","CCD","","_","_"
6,"_","_","_","api","CX","","_","_"
7,"tataḥ","_","_","tatas","CX","","_","_"
8,"parā","_","_","para","PPX","","_","_"
1,"_","_","_","svarga","NC","","_","_"
2,"_","_","_","dvāra","NC","","_","_"
3,"_","_","_","su","CAD","","_","_"
4,"_","_","_","sūkṣma","JJ","","_","_"
5,"hi","_","_","hi","CX","","_","_"
6,"narair","_","_","nara","NC","","_","_"
7,"_","_","_","moha","NC","","_","_"
8,"_","_","_","na","CNG","","_","_"
9,"dṛśyate","_","_","darś","V","dṛś","_","_"
1,"_","_","_","svarga","NC","","_","_"
2,"_","_","_","argala","NC","","_","_"
3,"_","_","_","lobha","NC","","_","_"
4,"_","_","_","bīja","NC","","_","_"
5,"_","_","_","rāga","NC","","_","_"
6,"_","_","_","gup","PPP","","_","_"
7,"durāsadam","_","_","durāsada","JJ","","_","_"
1,"tat","_","_","tad","PRD","","_","_"
2,"tu","_","_","tu","CCD","","_","_"
3,"paśyanti","_","_","paś","V","paś","_","_"
4,"puruṣā","_","_","puruṣa","NC","","_","_"
5,"_","_","_","ji","PPP","","_","_"
6,"_","_","_","krodha","NC","","_","_"
7,"_","_","_","ji","PPP","","_","_"
8,"_","_","_","indriya","NC","","_","_"
1,"_","_","_","brāhmaṇa","NC","","_","_"
2,"_","_","_","tapas","NC","","_","_"
3,"yuktā","_","_","yuj","PPP","","_","_"
4,"_","_","_","yathāśakti","CX","","_","_"
5,"_","_","_","pradāyin","JJ","","_","_"
1,"_","_","_","sahasra","NUM","","_","_"
2,"_","_","_","śakti","NC","","_","_"
3,"_","_","_","ca","CCD","","_","_"
4,"śataṃ","_","_","śata","NUM","","_","_"
5,"_","_","_","śata","NUM","","_","_"
6,"_","_","_","śakti","NC","","_","_"
7,"_","_","_","daśan","NUM","","_","_"
8,"_","_","_","api","CX","","_","_"
9,"ca","_","_","ca","CCD","","_","_"
1,"dadyād","_","_","dad","V","dā","_","_"
2,"_","_","_","ap","NC","","_","_"
3,"_","_","_","ca","CCD","","_","_"
4,"yaḥ","_","_","yad","PRL","","_","_"
5,"śaktyā","_","_","śakti","NC","","_","_"
6,"sarve","_","_","sarva","JQ","","_","_"
7,"_","_","_","tulya","JJ","","_","_"
8,"_","_","_","phala","NC","","_","_"
9,"smṛtāḥ","_","_","smṛ","PPP","","_","_"
1,"rantidevo","_","_","rantideva","NC","","_","_"
2,"hi","_","_","hi","CX","","_","_"
3,"nṛpatir","_","_","nṛpati","NC","","_","_"
4,"apaḥ","_","_","ap","NC","","_","_"
5,"prādād","_","_","pradad","V","pradā","_","_"
6,"akiṃcanaḥ","_","_","akiñcana","JJ","","_","_"
1,"śuddhena","_","_","śudh","PPP","","_","_"
2,"manasā","_","_","manas","NC","","_","_"
3,"vipra","_","_","vipra","NC","","_","_"
4,"_","_","_","nāka","NC","","_","_"
5,"_","_","_","pṛṣṭha","NC","","_","_"
6,"tato","_","_","tatas","CX","","_","_"
7,"gataḥ","_","_","ga","PPP","","_","_"
1,"na","_","_","na","CNG","","_","_"
2,"dharmaḥ","_","_","dharma","NC","","_","_"
3,"prīyate","_","_","prai","V","prai","_","_"
4,"tāta","_","_","tāta","NC","","_","_"
5,"dānair","_","_","dāna","NC","","_","_"
6,"dattair","_","_","dā","PPP","","_","_"
7,"_","_","_","mahat","JJ","","_","_"
8,"_","_","_","phala","NC","","_","_"
1,"_","_","_","nyāya","NC","","_","_"
2,"_","_","_","labh","PPP","","_","_"
3,"yathā","_","_","yathā","CCM","","_","_"
4,"sūkṣmaiḥ","_","_","sūkṣma","JJ","","_","_"
5,"_","_","_","śraddhā","NC","","_","_"
6,"_","_","_","pū","PPP","","_","_"
7,"sa","_","_","tad","PRD","","_","_"
8,"tuṣyati","_","_","tuṣ","V","tuṣ","_","_"
1,"_","_","_","go","CX","","_","_"
2,"_","_","_","pradāna","NC","","_","_"
3,"_","_","_","sahasra","NUM","","_","_"
4,"dvijebhyo","_","_","dvija","NC","","_","_"
5,"_","_","_","dad","V","dā","_","_"
6,"_","_","_","nṛga","NC","","_","_"
7,"nṛpaḥ","_","_","nṛpa","NC","","_","_"
1,"ekāṃ","_","_","eka","PPX","","_","_"
2,"dattvā","_","_","dā","CGDA","","_","_"
3,"sa","_","_","tad","PRD","","_","_"
4,"pārakyāṃ","_","_","pārakya","JJ","","_","_"
5,"narakaṃ","_","_","naraka","NC","","_","_"
6,"samavāptavān","_","_","samavāp","KDP","","_","_"
1,"_","_","_","ātman","NC","","_","_"
2,"_","_","_","māṃsa","NC","","_","_"
3,"_","_","_","pradāna","NC","","_","_"
4,"śibir","_","_","śibi","NC","","_","_"
5,"auśīnaro","_","_","auśīnara","JJ","","_","_"
6,"nṛpaḥ","_","_","nṛpa","NC","","_","_"
1,"prāpya","_","_","prāp","CGDA","","_","_"
2,"_","_","_","puṇya","JJ","","_","_"
3,"_","_","_","kṛ","PPP","","_","_"
4,"_","_","_","loka","NC","","_","_"
5,"_","_","_","mod","V","mud","_","_"
6,"divi","_","_","div","NC","","_","_"
7,"suvrataḥ","_","_","suvrata","JJ","","_","_"
1,"vibhave","_","_","vibhava","NC","","_","_"
2,"na","_","_","na","CNG","","_","_"
3,"nṛṇāṃ","_","_","nṛ","NC","","_","_"
4,"puṇyaṃ","_","_","puṇya","JJ","","_","_"
5,"_","_","_","sva","JJ","","_","_"
6,"_","_","_","śakti","NC","","_","_"
7,"_","_","_","su","CAD","","_","_"
8,"_","_","_","arjay","PPP","","_","_"
9,"satām","_","_","sat","JJ","","_","_"
1,"na","_","_","na","CNG","","_","_"
2,"yajñair","_","_","yajña","NC","","_","_"
3,"vividhair","_","_","vividha","JJ","","_","_"
4,"vipra","_","_","vipra","NC","","_","_"
5,"_","_","_","yathā","CCM","","_","_"
6,"_","_","_","nyāya","NC","","_","_"
7,"saṃcitaiḥ","_","_","saṃci","PPP","","_","_"
1,"krodho","_","_","krodha","NC","","_","_"
2,"_","_","_","dāna","NC","","_","_"
3,"_","_","_","phala","NC","","_","_"
4,"hanti","_","_","han","V","han","_","_"
5,"lobhāt","_","_","lobha","NC","","_","_"
6,"svargaṃ","_","_","svarga","NC","","_","_"
7,"na","_","_","na","CNG","","_","_"
8,"gacchati","_","_","gacch","V","gam","_","_"
1,"_","_","_","nyāya","NC","","_","_"
2,"_","_","_","vṛtti","NC","","_","_"
3,"hi","_","_","hi","CX","","_","_"
4,"tapasā","_","_","tapas","NC","","_","_"
5,"_","_","_","dāna","NC","","_","_"
6,"_","_","_","vid","JJ","","_","_"
7,"svargam","_","_","svarga","NC","","_","_"
8,"aśnute","_","_","aśn","V","aś","_","_"
1,"na","_","_","na","CNG","","_","_"
2,"rājasūyair","_","_","rājasūya","NC","","_","_"
3,"bahubhir","_","_","bahu","JJ","","_","_"
4,"iṣṭvā","_","_","yaj","CGDA","","_","_"
5,"_","_","_","vipula","JJ","","_","_"
6,"_","_","_","dakṣiṇā","NC","","_","_"
1,"na","_","_","na","CNG","","_","_"
2,"_","_","_","ca","CCD","","_","_"
3,"_","_","_","aśvamedha","NC","","_","_"
4,"bahubhiḥ","_","_","bahu","JJ","","_","_"
5,"phalaṃ","_","_","phala","NC","","_","_"
6,"samam","_","_","sama","PPX","","_","_"
7,"idaṃ","_","_","ida","PRD","","_","_"
8,"tava","_","_","tvat","PPR","","_","_"
1,"_","_","_","saktu","NC","","_","_"
2,"_","_","_","prastha","NC","","_","_"
3,"hi","_","_","hi","CX","","_","_"
4,"jito","_","_","ji","PPP","","_","_"
5,"_","_","_","brahman","NC","","_","_"
6,"_","_","_","loka","NC","","_","_"
7,"_","_","_","tvat","PPR","","_","_"
8,"_","_","_","anagha","JJ","","_","_"
1,"virajo","_","_","virajas","JJ","","_","_"
2,"_","_","_","brahman","NC","","_","_"
3,"_","_","_","bhavana","NC","","_","_"
4,"gaccha","_","_","ga","V","ga","_","_"
5,"vipra","_","_","vipra","NC","","_","_"
6,"yathecchakam","_","_","yathecchaka","JJ","","_","_"
1,"sarveṣāṃ","_","_","sarva","JQ","","_","_"
2,"vo","_","_","tvat","PPR","","_","_"
3,"dvijaśreṣṭha","_","_","dvijaśreṣṭha","NC","","_","_"
4,"divyaṃ","_","_","divya","JJ","","_","_"
5,"yānam","_","_","yāna","NC","","_","_"
6,"upasthitam","_","_","upasthā","PPP","","_","_"
1,"ārohata","_","_","āroh","V","āruh","_","_"
2,"yathākāmaṃ","_","_","yathākāma","JJ","","_","_"
3,"dharmo","_","_","dharma","NC","","_","_"
4,"'smi","_","_","as","V","as","_","_"
5,"dvija","_","_","dvija","NC","","_","_"
6,"paśya","_","_","paś","V","paś","_","_"
7,"mām","_","_","mat","PPR","","_","_"
1,"pāvito","_","_","pāvay","PPP","","_","_"
2,"hi","_","_","hi","CX","","_","_"
3,"tvayā","_","_","tvat","PPR","","_","_"
4,"deho","_","_","deha","NC","","_","_"
5,"loke","_","_","loka","NC","","_","_"
6,"kīrtiḥ","_","_","kīrti","NC","","_","_"
7,"sthirā","_","_","sthira","JJ","","_","_"
8,"ca","_","_","ca","CCD","","_","_"
9,"te","_","_","tvat","PPR","","_","_"
1,"_","_","_","sa_saha","CX","","_","_"
2,"_","_","_","bhāryā","NC","","_","_"
3,"_","_","_","saha","CX","","_","_"
4,"_","_","_","putra","NC","","_","_"
5,"_","_","_","ca","CCD","","_","_"
6,"_","_","_","sa_saha","CX","","_","_"
7,"_","_","_","snuṣā","NC","","_","_"
8,"_","_","_","ca","CCD","","_","_"
9,"divaṃ","_","_","div","NC","","_","_"
10,"vraja","_","_","vraj","V","vraj","_","_"
1,"_","_","_","iti","CQT","","_","_"
2,"_","_","_","vac","PPP","","_","_"
3,"_","_","_","vākya","NC","","_","_"
4,"dharmeṇa","_","_","dharma","NC","","_","_"
5,"yānam","_","_","yāna","NC","","_","_"
6,"āruhya","_","_","āruh","CGDA","","_","_"
7,"sa","_","_","tad","PRD","","_","_"
8,"dvijaḥ","_","_","dvija","NC","","_","_"
1,"_","_","_","sa_saha","CX","","_","_"
2,"_","_","_","bhāryā","NC","","_","_"
3,"_","_","_","sa_saha","CX","","_","_"
4,"_","_","_","suta","NC","","_","_"
5,"_","_","_","ca","CCD","","_","_"
6,"_","_","_","api","CX","","_","_"
7,"_","_","_","sa_saha","CX","","_","_"
8,"_","_","_","snuṣā","NC","","_","_"
9,"_","_","_","ca","CCD","","_","_"
10,"divaṃ","_","_","div","NC","","_","_"
11,"yayau","_","_","yā","V","yā","_","_"
1,"tasmin","_","_","tad","PRD","","_","_"
2,"vipre","_","_","vipra","NC","","_","_"
3,"gate","_","_","ga","PPP","","_","_"
4,"svargaṃ","_","_","svarga","NC","","_","_"
5,"_","_","_","sa_saha","CX","","_","_"
6,"_","_","_","suta","NC","","_","_"
7,"_","_","_","sa_saha","CX","","_","_"
8,"_","_","_","snuṣā","NC","","_","_"
9,"tadā","_","_","tadā","CAD","","_","_"
1,"_","_","_","bhāryā","NC","","_","_"
2,"_","_","_","caturtha","JJ","","_","_"
3,"_","_","_","dharma","NC","","_","_"
4,"_","_","_","jña","JJ","","_","_"
5,"tato","_","_","tatas","CX","","_","_"
6,"'haṃ","_","_","mat","PPR","","_","_"
7,"niḥsṛto","_","_","niḥsṛ","PPP","","_","_"
8,"bilāt","_","_","bila","NC","","_","_"
1,"_","_","_","tatas","CX","","_","_"
2,"_","_","_","tu","CCD","","_","_"
3,"_","_","_","saktu","NC","","_","_"
4,"_","_","_","gandha","NC","","_","_"
5,"kledena","_","_","kleda","NC","","_","_"
6,"salilasya","_","_","salila","NC","","_","_"
7,"ca","_","_","ca","CCD","","_","_"
1,"_","_","_","divya","JJ","","_","_"
2,"_","_","_","puṣpa","NC","","_","_"
3,"_","_","_","avamarda","NC","","_","_"
4,"_","_","_","ca","CCD","","_","_"
5,"sādhor","_","_","sādhu","JJ","","_","_"
6,"_","_","_","dāna","NC","","_","_"
7,"_","_","_","lava","NC","","_","_"
8,"_","_","_","ca","CCD","","_","_"
9,"taiḥ","_","_","tad","PRD","","_","_"
1,"viprasya","_","_","vipra","NC","","_","_"
2,"tapasā","_","_","tapas","NC","","_","_"
3,"tasya","_","_","tad","PRD","","_","_"
4,"śiro","_","_","śiras","NC","","_","_"
5,"me","_","_","mat","PPR","","_","_"
6,"kāñcanīkṛtam","_","_","kāñcanīkṛ","PPP","","_","_"
1,"tasya","_","_","tad","PRD","","_","_"
2,"_","_","_","satya","JJ","","_","_"
3,"_","_","_","abhisaṃdhā","NC","","_","_"
4,"_","_","_","sūkṣma","JJ","","_","_"
5,"_","_","_","dāna","NC","","_","_"
6,"_","_","_","ca","CCD","","_","_"
7,"_","_","_","eva","CEM","","_","_"
8,"ha","_","_","ha","CEM","","_","_"
1,"_","_","_","śarīra","NC","","_","_"
2,"_","_","_","ardha","NC","","_","_"
3,"ca","_","_","ca","CCD","","_","_"
4,"me","_","_","mat","PPR","","_","_"
5,"viprāḥ","_","_","vipra","NC","","_","_"
6,"_","_","_","śātakumbha","NC","","_","_"
7,"_","_","_","maya","JJ","","_","_"
8,"kṛtam","_","_","kṛ","PPP","","_","_"
1,"_","_","_","paś","V","paś","_","_"
2,"_","_","_","ida","PRD","","_","_"
3,"_","_","_","su","CAD","","_","_"
4,"_","_","_","vipula","JJ","","_","_"
5,"tapasā","_","_","tapas","NC","","_","_"
6,"tasya","_","_","tad","PRD","","_","_"
7,"dhīmataḥ","_","_","dhīmat","JJ","","_","_"
1,"katham","_","_","katha","CX","","_","_"
2,"evaṃvidhaṃ","_","_","evaṃvidha","JJ","","_","_"
3,"me","_","_","mat","PPR","","_","_"
4,"syād","_","_","as","V","as","_","_"
5,"anyat","_","_","anya","PPX","","_","_"
6,"pārśvam","_","_","pārśva","NC","","_","_"
7,"iti","_","_","iti","CQT","","_","_"
8,"dvijāḥ","_","_","dvija","NC","","_","_"
1,"tapovanāni","_","_","tapovana","NC","","_","_"
2,"_","_","_","yajña","NC","","_","_"
3,"_","_","_","ca","CCD","","_","_"
4,"hṛṣṭo","_","_","hṛṣ","PPP","","_","_"
5,"'bhyemi","_","_","abhī","V","abhī","_","_"
6,"punaḥ","_","_","punar","CAD","","_","_"
7,"punaḥ","_","_","punar","CAD","","_","_"
1,"yajñaṃ","_","_","yajña","NC","","_","_"
2,"_","_","_","tu","CCD","","_","_"
3,"_","_","_","mat","PPR","","_","_"
4,"imaṃ","_","_","ida","PRD","","_","_"
5,"śrutvā","_","_","śru","CGDA","","_","_"
6,"kururājasya","_","_","kururāja","NC","","_","_"
7,"dhīmataḥ","_","_","dhīmat","JJ","","_","_"
1,"āśayā","_","_","āśā","NC","","_","_"
2,"parayā","_","_","para","PPX","","_","_"
3,"prāpto","_","_","prāp","PPP","","_","_"
4,"na","_","_","na","CNG","","_","_"
5,"_","_","_","ca","CCD","","_","_"
6,"_","_","_","mat","PPR","","_","_"
7,"kāñcanīkṛtaḥ","_","_","kāñcanīkṛ","PPP","","_","_"
1,"tato","_","_","tatas","CX","","_","_"
2,"_","_","_","mat","PPR","","_","_"
3,"_","_","_","vac","PPP","","_","_"
4,"tad","_","_","tad","PRD","","_","_"
5,"vākyaṃ","_","_","vākya","NC","","_","_"
6,"prahasya","_","_","prahas","CGDA","","_","_"
7,"dvijasattamāḥ","_","_","dvijasattama","NC","","_","_"
1,"_","_","_","saktu","NC","","_","_"
2,"_","_","_","prastha","NC","","_","_"
3,"yajño","_","_","yajña","NC","","_","_"
4,"'yaṃ","_","_","ida","PRD","","_","_"
5,"saṃmito","_","_","saṃmā","PPP","","_","_"
6,"_","_","_","na","CNG","","_","_"
7,"_","_","_","iti","CQT","","_","_"
8,"sarvathā","_","_","sarvathā","CX","","_","_"
1,"_","_","_","saktu","NC","","_","_"
2,"_","_","_","prastha","NC","","_","_"
3,"_","_","_","lava","NC","","_","_"
4,"_","_","_","tad","PRD","","_","_"
5,"hi","_","_","hi","CX","","_","_"
6,"_","_","_","tadā","CAD","","_","_"
7,"_","_","_","mat","PPR","","_","_"
8,"kāñcanīkṛtaḥ","_","_","kāñcanīkṛ","PPP","","_","_"
1,"na","_","_","na","CNG","","_","_"
2,"hi","_","_","hi","CX","","_","_"
3,"yajño","_","_","yajña","NC","","_","_"
4,"mahān","_","_","mahat","JJ","","_","_"
5,"eṣa","_","_","tad","PRD","","_","_"
6,"_","_","_","sadṛśa","JJ","","_","_"
7,"_","_","_","tad","PRD","","_","_"
8,"mato","_","_","man","PPP","","_","_"
9,"mama","_","_","mat","PPR","","_","_"
1,"vaiśaṃpāyana","_","_","vaiśampāyana","NC","","_","_"
2,"uvāca","_","_","vak","V","vac","_","_"
1,"_","_","_","iti","CQT","","_","_"
2,"_","_","_","vac","CGDA","","_","_"
3,"nakulaḥ","_","_","nakula","NC","","_","_"
4,"sarvān","_","_","sarva","JQ","","_","_"
5,"yajñe","_","_","yajña","NC","","_","_"
6,"_","_","_","dvijavara","NC","","_","_"
7,"_","_","_","tadā","CAD","","_","_"
1,"_","_","_","ga","V","ga","_","_"
2,"_","_","_","adarśana","NC","","_","_"
3,"rājan","_","_","rājan","NC","","_","_"
4,"_","_","_","vipra","NC","","_","_"
5,"_","_","_","tad","PRD","","_","_"
6,"ca","_","_","ca","CCD","","_","_"
7,"yayur","_","_","yā","V","yā","_","_"
8,"gṛhān","_","_","gṛha","NC","","_","_"
1,"etat","_","_","tad","PRD","","_","_"
2,"te","_","_","tvat","PPR","","_","_"
3,"sarvam","_","_","sarva","JQ","","_","_"
4,"ākhyātaṃ","_","_","ākhyā","PPP","","_","_"
5,"mayā","_","_","mat","PPR","","_","_"
6,"parapuraṃjaya","_","_","parapuraṃjaya","JJ","","_","_"
1,"yad","_","_","yad","PRL","","_","_"
2,"āścaryam","_","_","āścarya","NC","","_","_"
3,"abhūt","_","_","bhav","V","bhū","_","_"
4,"tasmin","_","_","tad","PRD","","_","_"
5,"vājimedhe","_","_","vājimedha","NC","","_","_"
6,"_","_","_","mahat","JJ","","_","_"
7,"_","_","_","kratu","NC","","_","_"
1,"na","_","_","na","CNG","","_","_"
2,"_","_","_","vismaya","NC","","_","_"
3,"_","_","_","tvat","PPR","","_","_"
4,"nṛpate","_","_","nṛpati","NC","","_","_"
5,"yajñe","_","_","yajña","NC","","_","_"
6,"kāryaḥ","_","_","kṛ","KDG","","_","_"
7,"kathaṃcana","_","_","kathaṃcana","CX","","_","_"
1,"_","_","_","ṛṣi","NC","","_","_"
2,"_","_","_","koṭi","NC","","_","_"
3,"_","_","_","sahasra","NUM","","_","_"
4,"tapobhir","_","_","tapas","NC","","_","_"
5,"ye","_","_","yad","PRL","","_","_"
6,"divaṃ","_","_","div","NC","","_","_"
7,"gatāḥ","_","_","ga","PPP","","_","_"
1,"adrohaḥ","_","_","adroha","NC","","_","_"
2,"_","_","_","sarva","JQ","","_","_"
3,"_","_","_","bhūta","NC","","_","_"
4,"saṃtoṣaḥ","_","_","saṃtoṣa","NC","","_","_"
5,"śīlam","_","_","śīla","NC","","_","_"
6,"ārjavam","_","_","ārjava","NC","","_","_"
1,"tapo","_","_","tapas","NC","","_","_"
2,"_","_","_","dama","NC","","_","_"
3,"_","_","_","ca","CCD","","_","_"
4,"satyaṃ","_","_","satya","NC","","_","_"
5,"ca","_","_","ca","CCD","","_","_"
6,"dānaṃ","_","_","dāna","NC","","_","_"
7,"_","_","_","ca","CCD","","_","_"
8,"_","_","_","iti","CQT","","_","_"
9,"samaṃ","_","_","sama","PPX","","_","_"
10,"matam","_","_","man","PPP","","_","_"
