"WordID","word","NormSTEM","suffix","lemma","PoS","Root","NormSuffix","NormWord"
1,"ā","_","_","ā","CADP","","_","_"
2,"yāhy","_","_","yā","V","yā","_","_"
3,"adribhiḥ","_","_","adri","NC","","_","_"
4,"sutaṃ","_","_","su","PPP","","_","_"
5,"somaṃ","_","_","soma","NC","","_","_"
6,"_","_","_","soma","NC","","_","_"
7,"_","_","_","pati","NC","","_","_"
8,"piba","_","_","pib","V","pā","_","_"
1,"vṛṣann","_","_","vṛṣan","NC","","_","_"
2,"indra","_","_","indra","NC","","_","_"
3,"vṛṣabhir","_","_","vṛṣan","NC","","_","_"
4,"_","_","_","vṛtra","NC","","_","_"
5,"_","_","_","hantama","JJ","","_","_"
1,"vṛṣā","_","_","vṛṣan","NC","","_","_"
2,"grāvā","_","_","grāvan","NC","","_","_"
3,"vṛṣā","_","_","vṛṣan","NC","","_","_"
4,"mado","_","_","mada","NC","","_","_"
5,"vṛṣā","_","_","vṛṣan","NC","","_","_"
6,"somo","_","_","soma","NC","","_","_"
7,"ayaṃ","_","_","ida","PRD","","_","_"
8,"sutaḥ","_","_","su","PPP","","_","_"
1,"vṛṣann","_","_","vṛṣan","NC","","_","_"
2,"indra","_","_","indra","NC","","_","_"
3,"vṛṣabhir","_","_","vṛṣan","NC","","_","_"
4,"_","_","_","vṛtra","NC","","_","_"
5,"_","_","_","hantama","JJ","","_","_"
1,"vṛṣā","_","_","vṛṣan","NC","","_","_"
2,"tvā","_","_","tvat","PPR","","_","_"
3,"vṛṣaṇaṃ","_","_","vṛṣan","NC","","_","_"
4,"huve","_","_","hvā","V","hvā","_","_"
5,"vajriñ","_","_","vajrin","NC","","_","_"
6,"citrābhir","_","_","citra","JJ","","_","_"
7,"ūtibhiḥ","_","_","ūti","NC","","_","_"
1,"vṛṣann","_","_","vṛṣan","NC","","_","_"
2,"indra","_","_","indra","NC","","_","_"
3,"vṛṣabhir","_","_","vṛṣan","NC","","_","_"
4,"_","_","_","vṛtra","NC","","_","_"
5,"_","_","_","hantama","JJ","","_","_"
1,"ṛjīṣī","_","_","ṛjīṣin","JJ","","_","_"
2,"vajrī","_","_","vajrin","NC","","_","_"
3,"vṛṣabhas","_","_","vṛṣabha","NC","","_","_"
4,"turāṣāṭ","_","_","turāṣāh","NC","","_","_"
5,"chuṣmī","_","_","śuṣmin","JJ","","_","_"
6,"rājā","_","_","rājan","NC","","_","_"
7,"vṛtrahā","_","_","vṛtrahan","NC","","_","_"
8,"_","_","_","soma","NC","","_","_"
9,"_","_","_","pāvan","JJ","","_","_"
1,"yuktvā","_","_","yuj","CGDA","","_","_"
2,"haribhyām","_","_","hari","NC","","_","_"
3,"upa","_","_","upa","CADP","","_","_"
4,"yāsad","_","_","yā","V","yā","_","_"
5,"arvāṅ","_","_","arvāñc","JJ","","_","_"
6,"mādhyandine","_","_","mādhyaṃdina","JJ","","_","_"
7,"savane","_","_","savana","NC","","_","_"
8,"matsad","_","_","mat","V","mat","_","_"
9,"indraḥ","_","_","indra","NC","","_","_"
1,"yat","_","_","yat","CSB","","_","_"
2,"tvā","_","_","tvat","PPR","","_","_"
3,"sūrya","_","_","sūrya","NC","","_","_"
4,"svarbhānus","_","_","svarbhānu","NC","","_","_"
5,"_","_","_","tamas","NC","","_","_"
6,"_","_","_","vyadh","V","vyadh","_","_"
7,"āsuraḥ","_","_","āsura","JJ","","_","_"
1,"_","_","_","a","CNG","","_","_"
2,"_","_","_","kṣetra","NC","","_","_"
3,"_","_","_","vid","JJ","","_","_"
4,"yathā","_","_","yathā","CCM","","_","_"
5,"mugdho","_","_","muh","PPP","","_","_"
6,"bhuvanāny","_","_","bhuvana","NC","","_","_"
7,"adīdhayuḥ","_","_","dhī","V","dhī","_","_"
1,"svarbhānor","_","_","svarbhānu","NC","","_","_"
2,"adha","_","_","adha","CX","","_","_"
3,"yad","_","_","yat","CSB","","_","_"
4,"indra","_","_","indra","NC","","_","_"
5,"māyā","_","_","māyā","NC","","_","_"
6,"avo","_","_","avas","CX","","_","_"
7,"divo","_","_","div","NC","","_","_"
8,"vartamānā","_","_","vṛt","KDP","","_","_"
9,"avāhan","_","_","avahan","V","avahan","_","_"
1,"gūﾱhaṃ","_","_","guh","PPP","","_","_"
2,"sūryaṃ","_","_","sūrya","NC","","_","_"
3,"_","_","_","tamas","NC","","_","_"
4,"_","_","_","apavrata","JJ","","_","_"
5,"turīyeṇa","_","_","turīya","JJ","","_","_"
6,"_","_","_","brahman","NC","","_","_"
7,"_","_","_","vid","V","vid","_","_"
8,"atriḥ","_","_","atri","NC","","_","_"
1,"mā","_","_","mā","CNG","","_","_"
2,"mām","_","_","mat","PPR","","_","_"
3,"imaṃ","_","_","ida","PRD","","_","_"
4,"tava","_","_","tvat","PPR","","_","_"
5,"santam","_","_","as","KDP","","_","_"
6,"atra","_","_","atri","NC","","_","_"
7,"irasyā","_","_","irasyā","NC","","_","_"
8,"drugdho","_","_","druh","PPP","","_","_"
9,"bhiyasā","_","_","bhiyas","NC","","_","_"
10,"ni","_","_","ni","CADP","","_","_"
11,"gārīt","_","_","gṛ","V","gṛ","_","_"
1,"tvam","_","_","tvat","PPR","","_","_"
2,"mitro","_","_","mitra","NC","","_","_"
3,"asi","_","_","as","V","as","_","_"
4,"_","_","_","satya","JJ","","_","_"
5,"_","_","_","rādhas","NC","","_","_"
6,"tau","_","_","tad","PRD","","_","_"
7,"_","_","_","mat","PPR","","_","_"
8,"_","_","_","iha","CAD","","_","_"
9,"_","_","_","av","V","av","_","_"
10,"varuṇaś","_","_","varuṇa","NC","","_","_"
11,"ca","_","_","ca","CCD","","_","_"
12,"rājā","_","_","rājan","NC","","_","_"
1,"grāvṇo","_","_","grāvan","NC","","_","_"
2,"brahmā","_","_","brahman","NC","","_","_"
3,"yuyujānaḥ","_","_","yuj","KDP","","_","_"
4,"saparyan","_","_","sapary","KDP","","_","_"
5,"kīriṇā","_","_","kīrin","JJ","","_","_"
6,"devān","_","_","deva","NC","","_","_"
7,"_","_","_","namas","NC","","_","_"
8,"_","_","_","upaśikṣ","KDP","","_","_"
1,"atriḥ","_","_","atri","NC","","_","_"
2,"sūryasya","_","_","sūrya","NC","","_","_"
3,"divi","_","_","div","NC","","_","_"
4,"cakṣur","_","_","cakṣus","NC","","_","_"
5,"ādhāt","_","_","ādadh","V","ādhā","_","_"
6,"svarbhānor","_","_","svarbhānu","NC","","_","_"
7,"apa","_","_","apa","CX","","_","_"
8,"māyā","_","_","māyā","NC","","_","_"
9,"aghukṣat","_","_","guh","V","guh","_","_"
1,"yaṃ","_","_","yad","PRL","","_","_"
2,"vai","_","_","vai","CX","","_","_"
3,"sūryaṃ","_","_","sūrya","NC","","_","_"
4,"svarbhānus","_","_","svarbhānu","NC","","_","_"
5,"_","_","_","tamas","NC","","_","_"
6,"_","_","_","vyadh","V","vyadh","_","_"
7,"āsuraḥ","_","_","āsura","JJ","","_","_"
1,"atrayas","_","_","atri","NC","","_","_"
2,"tam","_","_","tad","PRD","","_","_"
3,"anv","_","_","anu","CADP","","_","_"
4,"avindan","_","_","vid","V","vid","_","_"
5,"nahy","_","_","nahi","CX","","_","_"
6,"anye","_","_","anya","PPX","","_","_"
7,"aśaknuvan","_","_","śakn","V","śak","_","_"
