"WordID","word","NormSTEM","suffix","lemma","PoS","Root","NormSuffix","NormWord"
1,"_","_","_","atha","CAD","","_","_"
2,"_","_","_","atas","CX","","_","_"
3,"raktapittacikitsitaṃ","_","_","raktapittacikitsita","NC","","_","_"
4,"vyākhyāsyāmaḥ","_","_","vyākhyās","V","vyākhyā","_","_"
1,"iti","_","_","iti","CQT","","_","_"
2,"ha","_","_","ha","CEM","","_","_"
3,"_","_","_","sma","CX","","_","_"
4,"_","_","_","ah","V","ah","_","_"
5,"_","_","_","bhagavat","JJ","","_","_"
6,"_","_","_","ātreya","NC","","_","_"
1,"viharantaṃ","_","_","vihṛ","KDP","","_","_"
2,"_","_","_","ji","PPP","","_","_"
3,"_","_","_","ātman","NC","","_","_"
4,"pañcagaṅge","_","_","pañcagaṅga","NC","","_","_"
5,"punarvasum","_","_","punarvasu","NC","","_","_"
1,"_","_","_","praṇa","CGDA","","_","_"
2,"_","_","_","vak","V","vac","_","_"
3,"_","_","_","nirmoha","JJ","","_","_"
4,"_","_","_","agniveśa","NC","","_","_"
5,"_","_","_","agni","NC","","_","_"
6,"_","_","_","varcas","NC","","_","_"
1,"bhagavan","_","_","bhagavat","JJ","","_","_"
2,"raktapittasya","_","_","raktapitta","NC","","_","_"
3,"_","_","_","hetu","NC","","_","_"
4,"_","_","_","vac","PPP","","_","_"
5,"_","_","_","sa_saha","CX","","_","_"
6,"_","_","_","lakṣaṇa","NC","","_","_"
1,"vaktavyaṃ","_","_","vac","KDG","","_","_"
2,"yat","_","_","yad","PRL","","_","_"
3,"paraṃ","_","_","para","PPX","","_","_"
4,"tasya","_","_","tad","PRD","","_","_"
5,"_","_","_","vac","CGDI","","_","_"
6,"_","_","_","arh","V","arh","_","_"
7,"_","_","_","tad","PRD","","_","_"
8,"_","_","_","guru","NC","","_","_"
1,"_","_","_","guru","NC","","_","_"
2,"_","_","_","vak","V","vac","_","_"
1,"_","_","_","mahat","JJ","","_","_"
2,"_","_","_","gada","NC","","_","_"
3,"_","_","_","mahat","JJ","","_","_"
4,"_","_","_","vega","NC","","_","_"
5,"_","_","_","agni","NC","","_","_"
6,"_","_","_","vat","CX","","_","_"
7,"_","_","_","śīghrakārin","JJ","","_","_"
8,"ca","_","_","ca","CCD","","_","_"
1,"_","_","_","hetu","NC","","_","_"
2,"_","_","_","lakṣaṇa","NC","","_","_"
3,"_","_","_","vid","JJ","","_","_"
4,"_","_","_","śīghra","CX","","_","_"
5,"_","_","_","raktapitta","NC","","_","_"
6,"_","_","_","upācar","V","upācar","_","_"
1,"_","_","_","tad","PRD","","_","_"
2,"_","_","_","uṣṇa","JJ","","_","_"
3,"_","_","_","tīkṣṇa","JJ","","_","_"
4,"_","_","_","amla","JJ","","_","_"
5,"ca","_","_","ca","CCD","","_","_"
6,"kaṭūni","_","_","kaṭu","JJ","","_","_"
7,"lavaṇāni","_","_","lavaṇa","JJ","","_","_"
8,"ca","_","_","ca","CCD","","_","_"
1,"_","_","_","gharma","NC","","_","_"
2,"_","_","_","ca","CCD","","_","_"
3,"_","_","_","anna","NC","","_","_"
4,"_","_","_","vidāha","NC","","_","_"
5,"_","_","_","ca","CCD","","_","_"
6,"hetuḥ","_","_","hetu","NC","","_","_"
7,"pūrvaṃ","_","_","pūrva","CX","","_","_"
8,"nidarśitaḥ","_","_","nidarśay","PPP","","_","_"
1,"_","_","_","tad","PRD","","_","_"
2,"_","_","_","hetu","NC","","_","_"
3,"samutkliṣṭaṃ","_","_","samutkliś","PPP","","_","_"
4,"pittaṃ","_","_","pitta","NC","","_","_"
5,"raktaṃ","_","_","rakta","NC","","_","_"
6,"prapadyate","_","_","prapad","V","prapad","_","_"
1,"_","_","_","tad","PRD","","_","_"
2,"_","_","_","yoni","NC","","_","_"
4,"prapannaṃ","_","_","prapad","PPP","","_","_"
5,"ca","_","_","ca","CCD","","_","_"
6,"vardhate","_","_","vṛdh","V","vṛdh","_","_"
7,"tat","_","_","tad","PRD","","_","_"
8,"pradūṣayat","_","_","pradūṣay","KDP","","_","_"
1,"_","_","_","tad","PRD","","_","_"
2,"_","_","_","ūṣman","NC","","_","_"
3,"dravo","_","_","drava","JJ","","_","_"
4,"_","_","_","dhātu","NC","","_","_"
5,"_","_","_","dhātu","NC","","_","_"
6,"_","_","_","dhātu","NC","","_","_"
7,"prasicyate","_","_","prasic","V","prasic","_","_"
1,"_","_","_","svid","KDP","","_","_"
2,"_","_","_","ta","CX","","_","_"
3,"saṃvṛddhiṃ","_","_","saṃvṛddhi","NC","","_","_"
4,"_","_","_","bhūyas","CX","","_","_"
5,"_","_","_","tad","PRD","","_","_"
6,"_","_","_","adhiga","V","adhiga","_","_"
1,"saṃyogād","_","_","saṃyoga","NC","","_","_"
2,"_","_","_","dūṣaṇa","NC","","_","_"
3,"_","_","_","tad","PRD","","_","_"
4,"_","_","_","tu","CCD","","_","_"
5,"_","_","_","sāmānya","NC","","_","_"
6,"_","_","_","gandha","NC","","_","_"
7,"_","_","_","varṇa","NC","","_","_"
1,"raktasya","_","_","rakta","NC","","_","_"
2,"_","_","_","pitta","NC","","_","_"
3,"_","_","_","ākhyā","PPP","","_","_"
4,"raktapittaṃ","_","_","raktapitta","NC","","_","_"
5,"manīṣibhiḥ","_","_","manīṣin","JJ","","_","_"
1,"plīhānaṃ","_","_","plīhan","NC","","_","_"
2,"ca","_","_","ca","CCD","","_","_"
3,"_","_","_","yakṛt","NC","","_","_"
4,"_","_","_","ca","CCD","","_","_"
5,"_","_","_","eva","CEM","","_","_"
6,"_","_","_","tad","PRD","","_","_"
7,"_","_","_","adhiṣṭhā","CGDA","","_","_"
8,"vartate","_","_","vart","V","vṛt","_","_"
1,"srotāṃsi","_","_","srotas","NC","","_","_"
2,"_","_","_","rakta","NC","","_","_"
3,"_","_","_","vāhin","JJ","","_","_"
4,"_","_","_","tad","PRD","","_","_"
5,"_","_","_","mūla","NC","","_","_"
6,"hi","_","_","hi","CX","","_","_"
7,"dehinām","_","_","dehin","NC","","_","_"
1,"sāndraṃ","_","_","sāndra","JJ","","_","_"
2,"_","_","_","sa_saha","CX","","_","_"
3,"_","_","_","pāṇḍu","NC","","_","_"
4,"_","_","_","sa_saha","CX","","_","_"
5,"_","_","_","sneha","NC","","_","_"
6,"picchilaṃ","_","_","picchila","JJ","","_","_"
7,"ca","_","_","ca","CCD","","_","_"
8,"_","_","_","kapha","NC","","_","_"
9,"_","_","_","anvita","JJ","","_","_"
1,"_","_","_","śyāva","JJ","","_","_"
2,"_","_","_","aruṇa","JJ","","_","_"
3,"_","_","_","sa_saha","CX","","_","_"
4,"_","_","_","pha","NC","","_","_"
5,"ca","_","_","ca","CCD","","_","_"
6,"tanu","_","_","tanu","JJ","","_","_"
7,"rūkṣaṃ","_","_","rūkṣa","JJ","","_","_"
8,"ca","_","_","ca","CCD","","_","_"
9,"vātikam","_","_","vātika","JJ","","_","_"
1,"raktapittaṃ","_","_","raktapitta","NC","","_","_"
2,"_","_","_","kaṣāya","NC","","_","_"
3,"_","_","_","ābha","JJ","","_","_"
4,"kṛṣṇaṃ","_","_","kṛṣṇa","JJ","","_","_"
5,"_","_","_","go","CX","","_","_"
6,"_","_","_","mūtra","NC","","_","_"
7,"_","_","_","saṃnibha","JJ","","_","_"
1,"_","_","_","mecaka","JJ","","_","_"
2,"_","_","_","āgāradhūma","NC","","_","_"
3,"_","_","_","ābha","JJ","","_","_"
4,"_","_","_","añjana","NC","","_","_"
5,"_","_","_","ābha","JJ","","_","_"
6,"ca","_","_","ca","CCD","","_","_"
7,"paittikam","_","_","paittika","JJ","","_","_"
1,"_","_","_","saṃsṛj","PPP","","_","_"
2,"_","_","_","liṅga","NC","","_","_"
3,"_","_","_","saṃsarga","NC","","_","_"
4,"_","_","_","tri","NUM","","_","_"
5,"_","_","_","liṅga","NC","","_","_"
6,"sānnipātikam","_","_","sāṃnipātika","JJ","","_","_"
1,"_","_","_","eka","PPX","","_","_"
2,"_","_","_","doṣa","NC","","_","_"
3,"_","_","_","anuga","JJ","","_","_"
4,"sādhyaṃ","_","_","sādhay","KDG","","_","_"
5,"_","_","_","dvi","NUM","","_","_"
6,"_","_","_","doṣa","NC","","_","_"
7,"_","_","_","yāpay","KDG","","_","_"
8,"_","_","_","vak","V","vac","_","_"
1,"_","_","_","yad","PRL","","_","_"
2,"_","_","_","tri","NUM","","_","_"
3,"_","_","_","doṣa","NC","","_","_"
4,"_","_","_","asādhya","JJ","","_","_"
5,"_","_","_","tad","PRD","","_","_"
6,"_","_","_","manda","JJ","","_","_"
7,"_","_","_","agni","NC","","_","_"
8,"_","_","_","ati","CADP","","_","_"
9,"_","_","_","vegavat","JJ","","_","_"
1,"vyādhibhiḥ","_","_","vyādhi","NC","","_","_"
2,"_","_","_","kṣi","PPP","","_","_"
3,"_","_","_","deha","NC","","_","_"
4,"_","_","_","vṛddha","JJ","","_","_"
5,"_","_","_","an","CX","","_","_"
6,"_","_","_","aś","KDP","","_","_"
7,"_","_","_","ca","CCD","","_","_"
8,"yat","_","_","yat","CSB","","_","_"
1,"_","_","_","gati","NC","","_","_"
2,"_","_","_","ūrdhva","CX","","_","_"
3,"_","_","_","adhas","CX","","_","_"
4,"_","_","_","ca","CCD","","_","_"
5,"_","_","_","eva","CEM","","_","_"
6,"raktapittasya","_","_","raktapitta","NC","","_","_"
7,"darśitā","_","_","darśay","PPP","","_","_"
1,"ūrdhvā","_","_","ūrdhva","JJ","","_","_"
2,"_","_","_","saptavidha","JJ","","_","_"
3,"_","_","_","dvāra","NC","","_","_"
4,"_","_","_","dvi","NUM","","_","_"
5,"_","_","_","dvāra","NC","","_","_"
6,"_","_","_","tu","CCD","","_","_"
7,"_","_","_","adhara","JJ","","_","_"
8,"gatiḥ","_","_","gati","NC","","_","_"
1,"sapta","_","_","saptan","NUM","","_","_"
2,"chidrāṇi","_","_","chidra","NC","","_","_"
3,"śirasi","_","_","śiras","NC","","_","_"
4,"dve","_","_","dvi","NUM","","_","_"
5,"_","_","_","ca","CCD","","_","_"
6,"_","_","_","adhas","CX","","_","_"
7,"_","_","_","sādhay","KDG","","_","_"
8,"_","_","_","ūrdhva","JJ","","_","_"
9,"_","_","_","ga","JJ","","_","_"
1,"yāpyaṃ","_","_","yāpay","KDG","","_","_"
2,"_","_","_","tu","CCD","","_","_"
3,"_","_","_","adhas","CX","","_","_"
4,"_","_","_","ga","JJ","","_","_"
5,"mārgau","_","_","mārga","NC","","_","_"
6,"tu","_","_","tu","CCD","","_","_"
7,"_","_","_","dvi","NUM","","_","_"
8,"_","_","_","asādhya","JJ","","_","_"
9,"prapadyate","_","_","prapad","V","prapad","_","_"
1,"yadā","_","_","yadā","CSB","","_","_"
2,"tu","_","_","tu","CCD","","_","_"
3,"_","_","_","sarva","JQ","","_","_"
4,"_","_","_","chidra","NC","","_","_"
5,"romakūpebhya","_","_","romakūpa","NC","","_","_"
6,"eva","_","_","eva","CEM","","_","_"
7,"ca","_","_","ca","CCD","","_","_"
1,"vartate","_","_","vart","V","vṛt","_","_"
2,"tām","_","_","tad","PRD","","_","_"
3,"asaṃkhyeyāṃ","_","_","asaṃkhyeya","JJ","","_","_"
4,"gatiṃ","_","_","gati","NC","","_","_"
5,"_","_","_","tad","PRD","","_","_"
6,"_","_","_","ah","V","ah","_","_"
7,"āntikīm","_","_","āntika","JJ","","_","_"
1,"_","_","_","yad","PRL","","_","_"
2,"_","_","_","ca","CCD","","_","_"
3,"_","_","_","ubhaya","JJ","","_","_"
4,"_","_","_","mārga","NC","","_","_"
5,"_","_","_","atimātra","CX","","_","_"
6,"pravartate","_","_","pravart","V","pravṛt","_","_"
1,"tulyaṃ","_","_","tulya","JJ","","_","_"
2,"_","_","_","kuṇapa","NC","","_","_"
3,"_","_","_","gandha","NC","","_","_"
4,"raktaṃ","_","_","rakta","NC","","_","_"
5,"_","_","_","kṛṣṇa","JJ","","_","_"
6,"_","_","_","atīva","CX","","_","_"
7,"ca","_","_","ca","CCD","","_","_"
1,"saṃsṛṣṭaṃ","_","_","saṃsṛj","PPP","","_","_"
2,"_","_","_","kapha","NC","","_","_"
3,"_","_","_","vāta","NC","","_","_"
4,"kaṇṭhe","_","_","kaṇṭha","NC","","_","_"
5,"sajati","_","_","sañj","V","sañj","_","_"
6,"_","_","_","ca","CCD","","_","_"
7,"_","_","_","api","CX","","_","_"
8,"yat","_","_","yad","PRL","","_","_"
1,"_","_","_","yad","PRL","","_","_"
2,"_","_","_","ca","CCD","","_","_"
3,"_","_","_","api","CX","","_","_"
4,"_","_","_","upadrava","NC","","_","_"
5,"_","_","_","sarva","JQ","","_","_"
6,"_","_","_","yathā","CCM","","_","_"
7,"_","_","_","vac","PPP","","_","_"
8,"samabhidrutam","_","_","samabhidru","PPP","","_","_"
1,"_","_","_","hāridra","JJ","","_","_"
2,"_","_","_","nīla","JJ","","_","_"
3,"_","_","_","harita","JJ","","_","_"
4,"_","_","_","tāmra","JJ","","_","_"
5,"varṇair","_","_","varṇa","NC","","_","_"
6,"upadrutam","_","_","upadru","PPP","","_","_"
1,"kṣīṇasya","_","_","kṣi","PPP","","_","_"
2,"kāsamānasya","_","_","kās","KDP","","_","_"
3,"_","_","_","yad","PRL","","_","_"
4,"_","_","_","ca","CCD","","_","_"
5,"_","_","_","tad","PRD","","_","_"
6,"_","_","_","ca","CCD","","_","_"
7,"na","_","_","na","CNG","","_","_"
8,"sidhyati","_","_","sidh","V","sidh","_","_"
1,"_","_","_","yad","PRL","","_","_"
2,"_","_","_","dvi","NUM","","_","_"
3,"_","_","_","doṣa","NC","","_","_"
4,"_","_","_","anuga","JJ","","_","_"
5,"_","_","_","yad","PRL","","_","_"
6,"_","_","_","vā","CCD","","_","_"
7,"śāntaṃ","_","_","śa","PPP","","_","_"
8,"śāntaṃ","_","_","śa","PPP","","_","_"
9,"prakupyati","_","_","prakup","V","prakup","_","_"
1,"_","_","_","mārga","NC","","_","_"
2,"_","_","_","mārga","NC","","_","_"
3,"_","_","_","car","V","car","_","_"
4,"_","_","_","yad","PRL","","_","_"
5,"_","_","_","vā","CCD","","_","_"
6,"yāpyaṃ","_","_","yāpay","KDG","","_","_"
7,"_","_","_","pitta","NC","","_","_"
8,"_","_","_","asṛj","NC","","_","_"
9,"ca","_","_","ca","CCD","","_","_"
10,"tat","_","_","tad","PRD","","_","_"
1,"_","_","_","eka","PPX","","_","_"
2,"_","_","_","mārga","NC","","_","_"
3,"balavato","_","_","balavat","JJ","","_","_"
4,"_","_","_","na","CNG","","_","_"
5,"_","_","_","ati","CADP","","_","_"
6,"_","_","_","vega","NC","","_","_"
7,"_","_","_","nava","JJ","","_","_"
8,"_","_","_","utthā","PPP","","_","_"
1,"raktapittaṃ","_","_","raktapitta","NC","","_","_"
2,"sukhe","_","_","sukha","JJ","","_","_"
3,"kāle","_","_","kāla","NC","","_","_"
4,"sādhyaṃ","_","_","sādhay","KDG","","_","_"
5,"_","_","_","as","V","as","_","_"
6,"_","_","_","nirupadrava","JJ","","_","_"
1,"_","_","_","snigdha","JJ","","_","_"
2,"_","_","_","uṣṇa","JJ","","_","_"
3,"_","_","_","uṣṇa","JJ","","_","_"
4,"_","_","_","rūkṣa","JJ","","_","_"
5,"ca","_","_","ca","CCD","","_","_"
6,"raktapittasya","_","_","raktapitta","NC","","_","_"
7,"kāraṇam","_","_","kāraṇa","NC","","_","_"
1,"_","_","_","adhas","CX","","_","_"
2,"_","_","_","ga","JJ","","_","_"
3,"_","_","_","uttara","JJ","","_","_"
4,"prāyaḥ","_","_","prāyas","CX","","_","_"
5,"pūrvaṃ","_","_","pūrva","PPX","","_","_"
6,"_","_","_","as","V","as","_","_"
7,"_","_","_","ūrdhva","JJ","","_","_"
8,"_","_","_","ga","JJ","","_","_"
9,"tu","_","_","tu","CCD","","_","_"
1,"_","_","_","ūrdhva","JJ","","_","_"
2,"_","_","_","ga","JJ","","_","_"
3,"_","_","_","kapha","NC","","_","_"
4,"_","_","_","saṃsṛj","PPP","","_","_"
5,"_","_","_","adhas","CX","","_","_"
6,"_","_","_","ga","JJ","","_","_"
7,"_","_","_","māruta","NC","","_","_"
8,"_","_","_","anuga","JJ","","_","_"
1,"_","_","_","dvi","NUM","","_","_"
2,"_","_","_","mārga","NC","","_","_"
3,"_","_","_","kapha","NC","","_","_"
4,"_","_","_","vāta","NC","","_","_"
5,"_","_","_","ubh","PPX","","_","_"
6,"_","_","_","anubandh","V","anubandh","_","_"
1,"_","_","_","akṣīṇa","JJ","","_","_"
2,"_","_","_","bala","NC","","_","_"
3,"_","_","_","māṃsa","NC","","_","_"
4,"raktapittaṃ","_","_","raktapitta","NC","","_","_"
5,"_","_","_","yad","PRL","","_","_"
6,"_","_","_","aś","KDP","","_","_"
1,"_","_","_","tad","PRD","","_","_"
2,"_","_","_","doṣa","NC","","_","_"
3,"_","_","_","duṣ","PPP","","_","_"
4,"utkliṣṭaṃ","_","_","utkliś","PPP","","_","_"
5,"_","_","_","na","CNG","","_","_"
6,"_","_","_","ādi","NC","","_","_"
7,"_","_","_","stambhana","NC","","_","_"
8,"_","_","_","arh","V","arh","_","_"
1,"galagrahaṃ","_","_","galagraha","NC","","_","_"
2,"pūtinasyaṃ","_","_","pūtinasya","NC","","_","_"
3,"_","_","_","mūrchāya","NC","","_","_"
4,"_","_","_","aruci","NC","","_","_"
5,"jvaram","_","_","jvara","NC","","_","_"
1,"gulmaṃ","_","_","gulma","NC","","_","_"
2,"_","_","_","plīhan","NC","","_","_"
3,"_","_","_","ānāha","NC","","_","_"
4,"kilāsaṃ","_","_","kilāsa","NC","","_","_"
5,"_","_","_","kṛcchra","JJ","","_","_"
6,"_","_","_","mūtra","NC","","_","_"
1,"_","_","_","kuṣṭha","NC","","_","_"
2,"_","_","_","arśas","NC","","_","_"
3,"vīsarpaṃ","_","_","vīsarpa","NC","","_","_"
4,"_","_","_","varṇa","NC","","_","_"
5,"_","_","_","nāśa","NC","","_","_"
6,"bhagandaram","_","_","bhagaṃdara","NC","","_","_"
1,"_","_","_","buddhīndriya","NC","","_","_"
2,"_","_","_","uparodha","NC","","_","_"
3,"ca","_","_","ca","CCD","","_","_"
4,"kuryāt","_","_","kar","V","kṛ","_","_"
5,"sambhitam","_","_","āditas","CX","","_","_"
1,"_","_","_","tasmāt","CX","","_","_"
2,"_","_","_","upekṣ","KDG","","_","_"
3,"balino","_","_","balin","JJ","","_","_"
4,"_","_","_","bala","NC","","_","_"
5,"_","_","_","doṣa","NC","","_","_"
6,"_","_","_","vicārin","JJ","","_","_"
1,"raktapittaṃ","_","_","raktapitta","NC","","_","_"
2,"prathamataḥ","_","_","prathamatas","CX","","_","_"
3,"pravṛddhaṃ","_","_","pravṛdh","PPP","","_","_"
4,"_","_","_","siddhi","NC","","_","_"
5,"_","_","_","iṣ","KDP","","_","_"
1,"prāyeṇa","_","_","prāyeṇa","CX","","_","_"
2,"hi","_","_","hi","CX","","_","_"
3,"_","_","_","samutkliś","PPP","","_","_"
4,"_","_","_","āma","NC","","_","_"
5,"_","_","_","doṣa","NC","","_","_"
6,"_","_","_","śarīrin","NC","","_","_"
1,"vṛddhiṃ","_","_","vṛddhi","NC","","_","_"
2,"prayāti","_","_","prai","V","prai","_","_"
3,"pittāsṛk","_","_","pittāsṛj","NC","","_","_"
4,"_","_","_","tasmāt","CX","","_","_"
5,"_","_","_","tad","PRD","","_","_"
6,"_","_","_","laṅgh","KDG","","_","_"
7,"āditaḥ","_","_","āditas","CX","","_","_"
1,"mārgau","_","_","mārga","NC","","_","_"
2,"_","_","_","doṣa","NC","","_","_"
3,"_","_","_","anubandha","NC","","_","_"
4,"ca","_","_","ca","CCD","","_","_"
5,"nidānaṃ","_","_","nidāna","NC","","_","_"
6,"prasamīkṣya","_","_","prasamīkṣ","CGDA","","_","_"
7,"ca","_","_","ca","CCD","","_","_"
1,"laṅghanaṃ","_","_","laṅghana","NC","","_","_"
2,"_","_","_","raktapitta","NC","","_","_"
3,"_","_","_","ādi","NC","","_","_"
4,"tarpaṇaṃ","_","_","tarpaṇa","NC","","_","_"
5,"vā","_","_","vā","CCD","","_","_"
6,"prayojayet","_","_","prayuj","V","prayuj","_","_"
1,"_","_","_","hrīvera","NC","","_","_"
2,"_","_","_","candana","NC","","_","_"
3,"_","_","_","uśīra","NC","","_","_"
4,"_","_","_","mustā","NC","","_","_"
5,"_","_","_","parpaṭaka","NC","","_","_"
6,"śṛtam","_","_","śrī","PPP","","_","_"
1,"kevalaṃ","_","_","kevala","CX","","_","_"
2,"śṛtaśītaṃ","_","_","śṛtaśīta","JJ","","_","_"
3,"vā","_","_","vā","CCD","","_","_"
4,"_","_","_","dad","V","dā","_","_"
5,"_","_","_","toya","NC","","_","_"
6,"pipāsave","_","_","pipāsu","JJ","","_","_"
1,"_","_","_","ūrdhva","JJ","","_","_"
2,"_","_","_","ga","JJ","","_","_"
3,"tarpaṇaṃ","_","_","tarpaṇa","NC","","_","_"
4,"pūrvaṃ","_","_","pūrva","CX","","_","_"
5,"peyāṃ","_","_","peyā","NC","","_","_"
6,"_","_","_","pūrva","CX","","_","_"
7,"_","_","_","adhas","CX","","_","_"
8,"_","_","_","ga","PPP","","_","_"
1,"_","_","_","kāla","NC","","_","_"
2,"_","_","_","sātmya","NC","","_","_"
3,"_","_","_","anubandha","NC","","_","_"
4,"_","_","_","jña","JJ","","_","_"
5,"dadyāt","_","_","dad","V","dā","_","_"
6,"_","_","_","prakṛti","NC","","_","_"
7,"_","_","_","kalpa","NC","","_","_"
8,"_","_","_","vid","JJ","","_","_"
1,"jalaṃ","_","_","jala","NC","","_","_"
2,"_","_","_","kharjūra","NC","","_","_"
3,"_","_","_","mṛdvīkā","NC","","_","_"
4,"_","_","_","madhūka","NC","","_","_"
5,"_","_","_","sa_saha","CX","","_","_"
6,"_","_","_","parūṣaka","NC","","_","_"
1,"śṛtaśītaṃ","_","_","śṛtaśīta","JJ","","_","_"
2,"prayoktavyaṃ","_","_","prayuj","KDG","","_","_"
3,"_","_","_","tarpaṇa","NC","","_","_"
4,"_","_","_","artha","NC","","_","_"
5,"_","_","_","sa_saha","CX","","_","_"
6,"_","_","_","śarkarā","NC","","_","_"
1,"tarpaṇaṃ","_","_","tarpaṇa","NC","","_","_"
2,"_","_","_","sa_saha","CX","","_","_"
3,"_","_","_","ghṛta","NC","","_","_"
4,"_","_","_","kṣaudra","NC","","_","_"
5,"_","_","_","lāja","NC","","_","_"
6,"_","_","_","cūrṇa","NC","","_","_"
7,"pradāpayet","_","_","pradad","V","pradā","_","_"
1,"_","_","_","ūrdhva","JJ","","_","_"
2,"_","_","_","ga","JJ","","_","_"
3,"raktapittaṃ","_","_","raktapitta","NC","","_","_"
4,"tat","_","_","tad","PRD","","_","_"
5,"pītaṃ","_","_","pā","PPP","","_","_"
6,"kāle","_","_","kāla","NC","","_","_"
7,"vyapohati","_","_","vyapoh","V","vyapoh","_","_"
1,"_","_","_","manda","JJ","","_","_"
2,"_","_","_","agni","NC","","_","_"
3,"_","_","_","amla","JJ","","_","_"
4,"_","_","_","sātmya","NC","","_","_"
5,"tat","_","_","tad","PRD","","_","_"
6,"_","_","_","sa_saha","CX","","_","_"
7,"_","_","_","amla","JJ","","_","_"
8,"_","_","_","api","CX","","_","_"
9,"kalpayet","_","_","kalp","V","kḷp","_","_"
1,"_","_","_","dāḍima","NC","","_","_"
2,"_","_","_","āmalaka","NC","","_","_"
3,"_","_","_","vidvas","JJ","","_","_"
4,"_","_","_","amla","JJ","","_","_"
5,"_","_","_","artha","NC","","_","_"
6,"_","_","_","ca","CCD","","_","_"
7,"_","_","_","anudāpay","V","anudāpay","_","_"
1,"_","_","_","śāli","NC","","_","_"
2,"_","_","_","ṣaṣṭika","NC","","_","_"
3,"_","_","_","nīvāra","NC","","_","_"
4,"_","_","_","koradūṣa","NC","","_","_"
5,"_","_","_","praśāntikā","NC","","_","_"
1,"_","_","_","śyāmāka","NC","","_","_"
2,"_","_","_","ca","CCD","","_","_"
3,"_","_","_","priyaṅgu","NC","","_","_"
4,"_","_","_","ca","CCD","","_","_"
5,"bhojanaṃ","_","_","bhojana","NC","","_","_"
6,"raktapittinām","_","_","raktapittin","JJ","","_","_"
1,"mudgā","_","_","mudga","NC","","_","_"
2,"_","_","_","masūrī","NC","","_","_"
3,"_","_","_","caṇaka","NC","","_","_"
4,"_","_","_","sama","PPX","","_","_"
5,"_","_","_","kuṣṭha","NC","","_","_"
6,"_","_","_","āḍhakī","NC","","_","_"
7,"_","_","_","phala","NC","","_","_"
1,"praśastāḥ","_","_","praśaṃs","PPP","","_","_"
2,"_","_","_","sūpa","NC","","_","_"
3,"_","_","_","yūṣa","NC","","_","_"
4,"_","_","_","artha","NC","","_","_"
5,"kalpitā","_","_","kalpay","PPP","","_","_"
6,"raktapittinām","_","_","raktapittin","JJ","","_","_"
1,"_","_","_","paṭola","NC","","_","_"
2,"_","_","_","nimba","NC","","_","_"
3,"_","_","_","vetra","NC","","_","_"
4,"_","_","_","agra","NC","","_","_"
5,"_","_","_","plakṣa","NC","","_","_"
6,"_","_","_","vetasa","NC","","_","_"
7,"_","_","_","pallava","NC","","_","_"
1,"kirātatiktakaṃ","_","_","kirātatiktaka","NC","","_","_"
2,"śākaṃ","_","_","śāka","NC","","_","_"
3,"gaṇḍīraḥ","_","_","gaṇḍīra","NC","","_","_"
4,"_","_","_","sa_saha","CX","","_","_"
5,"_","_","_","kaṭhillaka","NC","","_","_"
1,"kovidārasya","_","_","kovidāra","NC","","_","_"
2,"puṣpāṇi","_","_","puṣpa","NC","","_","_"
3,"_","_","_","kāśmarya","NC","","_","_"
4,"_","_","_","atha","CAD","","_","_"
5,"śālmaleḥ","_","_","śālmali","NC","","_","_"
1,"annapānavidhau","_","_","annapānavidhi","NC","","_","_"
2,"śākaṃ","_","_","śāka","NC","","_","_"
3,"_","_","_","yad","PRL","","_","_"
4,"_","_","_","ca","CCD","","_","_"
5,"_","_","_","anya","PPX","","_","_"
6,"_","_","_","raktapitta","NC","","_","_"
7,"_","_","_","nud","JJ","","_","_"
1,"_","_","_","śāka","NC","","_","_"
2,"_","_","_","artha","NC","","_","_"
3,"_","_","_","śāka","NC","","_","_"
4,"_","_","_","sātmya","NC","","_","_"
5,"_","_","_","tad","PRD","","_","_"
6,"_","_","_","śaṃs","PPP","","_","_"
7,"raktapittinām","_","_","raktapittin","JJ","","_","_"
1,"svinnaṃ","_","_","svid","PPP","","_","_"
2,"vā","_","_","vā","CCD","","_","_"
3,"sarpiṣā","_","_","sarpis","NC","","_","_"
4,"bhṛṣṭaṃ","_","_","bhṛjj","PPP","","_","_"
5,"_","_","_","yūṣa","NC","","_","_"
6,"_","_","_","vat","CX","","_","_"
7,"_","_","_","vā","CCD","","_","_"
8,"vipācitam","_","_","vipācay","PPP","","_","_"
1,"pārāvatān","_","_","pārāvata","NC","","_","_"
2,"_","_","_","kapota","NC","","_","_"
3,"_","_","_","ca","CCD","","_","_"
4,"lāvān","_","_","lāva","NC","","_","_"
5,"_","_","_","raktākṣa","NC","","_","_"
6,"_","_","_","vartaka","NC","","_","_"
1,"śaśān","_","_","śaśa","NC","","_","_"
2,"_","_","_","kapiñjala","NC","","_","_"
3,"_","_","_","eṇa","NC","","_","_"
4,"_","_","_","hariṇa","NC","","_","_"
5,"_","_","_","kālapucchaka","NC","","_","_"
1,"raktapitte","_","_","raktapitta","NC","","_","_"
2,"hitān","_","_","hita","JJ","","_","_"
3,"_","_","_","vid","V","vid","_","_"
4,"_","_","_","rasa","NC","","_","_"
5,"_","_","_","tad","PRD","","_","_"
6,"prayojayet","_","_","prayuj","V","prayuj","_","_"
1,"_","_","_","īṣat","CX","","_","_"
2,"_","_","_","amla","JJ","","_","_"
3,"_","_","_","anamla","JJ","","_","_"
4,"vā","_","_","vā","CCD","","_","_"
5,"_","_","_","ghṛta","NC","","_","_"
6,"_","_","_","bhṛjj","PPP","","_","_"
7,"_","_","_","sa_saha","CX","","_","_"
8,"_","_","_","śarkarā","NC","","_","_"
1,"_","_","_","kapha","NC","","_","_"
2,"_","_","_","anuga","JJ","","_","_"
3,"_","_","_","yūṣa","NC","","_","_"
4,"_","_","_","śāka","NC","","_","_"
5,"_","_","_","dad","V","dā","_","_"
6,"_","_","_","vāta","NC","","_","_"
7,"_","_","_","anuga","JJ","","_","_"
8,"rasam","_","_","rasa","NC","","_","_"
1,"raktapitte","_","_","raktapitta","NC","","_","_"
2,"_","_","_","yavāgū","NC","","_","_"
3,"_","_","_","atas","CX","","_","_"
4,"kalpaḥ","_","_","kalpa","NC","","_","_"
5,"pravakṣyate","_","_","pravak","V","pravac","_","_"
1,"_","_","_","padma","NC","","_","_"
2,"_","_","_","utpala","NC","","_","_"
3,"kiñjalkaḥ","_","_","kiñjalka","NC","","_","_"
4,"pṛśniparṇī","_","_","pṛśniparṇī","NC","","_","_"
5,"priyaṅgukāḥ","_","_","priyaṅgukā","NC","","_","_"
1,"jale","_","_","jala","NC","","_","_"
2,"sādhyā","_","_","sādhay","KDG","","_","_"
3,"rase","_","_","rasa","NC","","_","_"
4,"tasmin","_","_","tad","PRD","","_","_"
5,"peyā","_","_","peyā","NC","","_","_"
6,"_","_","_","as","V","as","_","_"
7,"_","_","_","raktapittin","JJ","","_","_"
1,"_","_","_","candana","NC","","_","_"
2,"_","_","_","uśīra","NC","","_","_"
3,"_","_","_","lodhra","NC","","_","_"
4,"rase","_","_","rasa","NC","","_","_"
5,"tadvat","_","_","tadvat","CX","","_","_"
6,"_","_","_","sa_saha","CX","","_","_"
7,"_","_","_","nāgara","NC","","_","_"
1,"_","_","_","kirātatiktaka","NC","","_","_"
2,"_","_","_","uśīra","NC","","_","_"
3,"_","_","_","mustā","NC","","_","_"
4,"_","_","_","tadvat","CX","","_","_"
5,"_","_","_","eva","CEM","","_","_"
6,"ca","_","_","ca","CCD","","_","_"
1,"_","_","_","dhātakī","NC","","_","_"
2,"_","_","_","dhanvayāsa","NC","","_","_"
3,"_","_","_","ambu","NC","","_","_"
4,"_","_","_","bilva","NC","","_","_"
5,"vā","_","_","vā","CCD","","_","_"
6,"rase","_","_","rasa","NC","","_","_"
7,"śṛtā","_","_","śrī","PPP","","_","_"
1,"_","_","_","masūrī","NC","","_","_"
2,"_","_","_","pṛśniparṇī","NC","","_","_"
3,"_","_","_","vā","CCD","","_","_"
4,"_","_","_","sthirā","NC","","_","_"
5,"_","_","_","mudga","NC","","_","_"
6,"_","_","_","rasa","NC","","_","_"
7,"'thavā","_","_","athavā","CX","","_","_"
1,"rase","_","_","rasa","NC","","_","_"
2,"hareṇukānāṃ","_","_","hareṇuka","NC","","_","_"
3,"vā","_","_","vā","CCD","","_","_"
4,"_","_","_","sa_saha","CX","","_","_"
5,"_","_","_","ghṛta","NC","","_","_"
6,"_","_","_","sa_saha","CX","","_","_"
7,"_","_","_","balā","NC","","_","_"
8,"_","_","_","rasa","NC","","_","_"
1,"siddhāḥ","_","_","sidh","PPP","","_","_"
2,"_","_","_","pārāvata","NC","","_","_"
3,"_","_","_","ādi","NC","","_","_"
4,"rase","_","_","rasa","NC","","_","_"
5,"vā","_","_","vā","CCD","","_","_"
6,"syuḥ","_","_","as","V","as","_","_"
7,"_","_","_","pṛthak","CX","","_","_"
8,"_","_","_","pṛthak","CX","","_","_"
1,"_","_","_","iti","CQT","","_","_"
2,"_","_","_","vac","PPP","","_","_"
3,"_","_","_","raktapitta","NC","","_","_"
4,"_","_","_","ghna","JJ","","_","_"
5,"śītāḥ","_","_","śīta","JJ","","_","_"
6,"_","_","_","sa_saha","CX","","_","_"
7,"_","_","_","madhu","NC","","_","_"
8,"_","_","_","śarkarā","NC","","_","_"
1,"yavāgvaḥ","_","_","yavāgū","NC","","_","_"
2,"kalpanā","_","_","kalpanā","NC","","_","_"
3,"_","_","_","ca","CCD","","_","_"
4,"_","_","_","tad","PRD","","_","_"
5,"kāryā","_","_","kṛ","KDG","","_","_"
6,"_","_","_","māṃsa","NC","","_","_"
7,"_","_","_","rasa","NC","","_","_"
8,"_","_","_","api","CX","","_","_"
1,"śaśaḥ","_","_","śaśa","NC","","_","_"
2,"_","_","_","sa_saha","CX","","_","_"
3,"_","_","_","vāstuka","NC","","_","_"
4,"śasto","_","_","śaṃs","PPP","","_","_"
5,"vibandhe","_","_","vibandha","NC","","_","_"
6,"raktapittinām","_","_","raktapittin","JJ","","_","_"
1,"_","_","_","vāta","NC","","_","_"
2,"_","_","_","ulbaṇa","JJ","","_","_"
3,"tittiriḥ","_","_","tittiri","NC","","_","_"
4,"_","_","_","as","V","as","_","_"
5,"_","_","_","udumbara","NC","","_","_"
6,"_","_","_","rasa","NC","","_","_"
7,"śṛtaḥ","_","_","śrī","PPP","","_","_"
1,"mayūraḥ","_","_","mayūra","NC","","_","_"
2,"_","_","_","plakṣa","NC","","_","_"
3,"_","_","_","niryūha","NC","","_","_"
4,"nyagrodhasya","_","_","nyagrodha","NC","","_","_"
5,"ca","_","_","ca","CCD","","_","_"
6,"kukkuṭaḥ","_","_","kukkuṭa","NC","","_","_"
1,"rase","_","_","rasa","NC","","_","_"
2,"_","_","_","bilva","NC","","_","_"
3,"_","_","_","utpala","NC","","_","_"
4,"_","_","_","ādi","NC","","_","_"
5,"_","_","_","vartaka","NC","","_","_"
6,"_","_","_","krakara","NC","","_","_"
7,"hitau","_","_","hita","JJ","","_","_"
1,"tṛṣyate","_","_","tṛṣ","V","tṛṣ","_","_"
2,"tiktakaiḥ","_","_","tiktaka","JJ","","_","_"
3,"siddhaṃ","_","_","sidh","PPP","","_","_"
4,"_","_","_","tṛṣṇā","NC","","_","_"
5,"_","_","_","ghna","JJ","","_","_"
6,"vā","_","_","vā","CCD","","_","_"
7,"_","_","_","phala","NC","","_","_"
8,"_","_","_","udaka","NC","","_","_"
1,"siddhaṃ","_","_","sidh","PPP","","_","_"
2,"_","_","_","vidārigandhādya","NC","","_","_"
3,"_","_","_","athavā","CX","","_","_"
4,"_","_","_","śrī","PPP","","_","_"
5,"_","_","_","śītala","JJ","","_","_"
1,"jñātvā","_","_","jñā","CGDA","","_","_"
2,"_","_","_","doṣa","NC","","_","_"
3,"_","_","_","anubala","JJ","","_","_"
4,"_","_","_","bala","NC","","_","_"
5,"_","_","_","āhāra","NC","","_","_"
6,"_","_","_","eva","CEM","","_","_"
7,"ca","_","_","ca","CCD","","_","_"
1,"jalaṃ","_","_","jala","NC","","_","_"
2,"pipāsave","_","_","pipāsu","JJ","","_","_"
3,"_","_","_","dad","V","dā","_","_"
4,"_","_","_","visarga","NC","","_","_"
5,"_","_","_","alpaśas","CX","","_","_"
6,"'pi","_","_","api","CX","","_","_"
7,"vā","_","_","vā","CCD","","_","_"
1,"nidānaṃ","_","_","nidāna","NC","","_","_"
2,"raktapittasya","_","_","raktapitta","NC","","_","_"
3,"_","_","_","yad","PRL","","_","_"
4,"_","_","_","kiṃcit","PRI","","_","_"
5,"saṃprakāśitam","_","_","saṃprakāśay","PPP","","_","_"
1,"_","_","_","jīvita","NC","","_","_"
2,"_","_","_","ārogya","NC","","_","_"
3,"_","_","_","kāma","NC","","_","_"
4,"_","_","_","tad","PRD","","_","_"
5,"_","_","_","na","CNG","","_","_"
6,"sevyaṃ","_","_","sev","KDG","","_","_"
7,"raktapittibhiḥ","_","_","raktapittin","JJ","","_","_"
1,"_","_","_","iti","CQT","","_","_"
2,"_","_","_","anna","NC","","_","_"
3,"_","_","_","pāna","NC","","_","_"
4,"nirdiṣṭaṃ","_","_","nirdiś","PPP","","_","_"
5,"kramaśo","_","_","kramaśas","CX","","_","_"
6,"_","_","_","raktapitta","NC","","_","_"
7,"_","_","_","nud","JJ","","_","_"
1,"vakṣyate","_","_","vak","V","vac","_","_"
2,"_","_","_","bahu","JJ","","_","_"
3,"_","_","_","doṣa","NC","","_","_"
4,"kāryaṃ","_","_","kārya","NC","","_","_"
5,"balavatāṃ","_","_","balavat","JJ","","_","_"
6,"ca","_","_","ca","CCD","","_","_"
7,"yat","_","_","yad","PRL","","_","_"
1,"_","_","_","akṣīṇa","JJ","","_","_"
2,"_","_","_","bala","NC","","_","_"
3,"_","_","_","māṃsa","NC","","_","_"
4,"yasya","_","_","yad","PRL","","_","_"
5,"_","_","_","saṃtarpaṇa","NC","","_","_"
6,"_","_","_","utthā","PPP","","_","_"
1,"_","_","_","bahu","JJ","","_","_"
2,"_","_","_","doṣa","NC","","_","_"
3,"balavato","_","_","balavat","JJ","","_","_"
4,"raktapittaṃ","_","_","raktapitta","NC","","_","_"
5,"śarīriṇaḥ","_","_","śarīrin","NC","","_","_"
1,"kāle","_","_","kāla","NC","","_","_"
2,"_","_","_","saṃśodhana","NC","","_","_"
3,"_","_","_","arha","JJ","","_","_"
4,"_","_","_","tad","PRD","","_","_"
5,"_","_","_","har","V","hṛ","_","_"
6,"_","_","_","nirupadrava","JJ","","_","_"
1,"_","_","_","virecana","NC","","_","_"
2,"_","_","_","ūrdhva","JJ","","_","_"
3,"_","_","_","bhāga","NC","","_","_"
4,"_","_","_","adhas","CX","","_","_"
5,"_","_","_","ga","JJ","","_","_"
6,"vamanena","_","_","vamana","NC","","_","_"
7,"ca","_","_","ca","CCD","","_","_"
1,"_","_","_","trivṛtā","NC","","_","_"
2,"_","_","_","abhayā","NC","","_","_"
3,"prājñaḥ","_","_","prājña","JJ","","_","_"
4,"_","_","_","phala","NC","","_","_"
5,"_","_","_","āragvadha","NC","","_","_"
6,"vā","_","_","vā","CCD","","_","_"
1,"trāyamāṇāṃ","_","_","trāyamāṇā","NC","","_","_"
2,"gavākṣyā","_","_","gavākṣa","NC","","_","_"
3,"vā","_","_","vā","CCD","","_","_"
4,"_","_","_","mūla","NC","","_","_"
5,"_","_","_","āmalaka","NC","","_","_"
6,"vā","_","_","vā","CCD","","_","_"
1,"virecanaṃ","_","_","virecana","NC","","_","_"
2,"prayuñjīta","_","_","prayuj","V","prayuj","_","_"
3,"_","_","_","prabhūta","JJ","","_","_"
4,"_","_","_","madhu","NC","","_","_"
5,"_","_","_","śarkarā","NC","","_","_"
1,"rasaḥ","_","_","rasa","NC","","_","_"
2,"praśasyate","_","_","praśaṃs","V","praśaṃs","_","_"
3,"teṣāṃ","_","_","tad","PRD","","_","_"
4,"raktapitte","_","_","raktapitta","NC","","_","_"
5,"viśeṣataḥ","_","_","viśeṣataḥ","CX","","_","_"
1,"vamanaṃ","_","_","vamana","NC","","_","_"
2,"_","_","_","madana","NC","","_","_"
3,"_","_","_","unmiśra","JJ","","_","_"
4,"manthaḥ","_","_","mantha","NC","","_","_"
5,"_","_","_","sa_saha","CX","","_","_"
6,"_","_","_","kṣaudra","NC","","_","_"
7,"_","_","_","śarkarā","NC","","_","_"
1,"_","_","_","sa_saha","CX","","_","_"
2,"_","_","_","śarkarā","NC","","_","_"
3,"vā","_","_","vā","CCD","","_","_"
4,"_","_","_","salila","NC","","_","_"
5,"_","_","_","ikṣu","NC","","_","_"
6,"rasa","_","_","rasa","NC","","_","_"
7,"eva","_","_","eva","CEM","","_","_"
8,"vā","_","_","vā","CCD","","_","_"
1,"vatsakasya","_","_","vatsaka","NC","","_","_"
2,"phalaṃ","_","_","phala","NC","","_","_"
3,"mustaṃ","_","_","mustā","NC","","_","_"
4,"madanaṃ","_","_","madana","NC","","_","_"
5,"madhukaṃ","_","_","madhuka","NC","","_","_"
6,"madhu","_","_","madhu","NC","","_","_"
1,"_","_","_","adhas","CX","","_","_"
2,"_","_","_","vaha","JJ","","_","_"
3,"raktapitte","_","_","raktapitta","NC","","_","_"
4,"vamanaṃ","_","_","vamana","NC","","_","_"
5,"_","_","_","para","PPX","","_","_"
6,"_","_","_","vak","V","vac","_","_"
1,"_","_","_","ūrdhva","JJ","","_","_"
2,"_","_","_","ga","JJ","","_","_"
3,"_","_","_","śudh","PPP","","_","_"
4,"_","_","_","koṣṭha","NC","","_","_"
5,"_","_","_","tarpaṇa","NC","","_","_"
6,"_","_","_","ādi","NC","","_","_"
7,"kramo","_","_","krama","NC","","_","_"
8,"hitaḥ","_","_","hita","JJ","","_","_"
1,"_","_","_","adhas","CX","","_","_"
2,"_","_","_","ga","PPP","","_","_"
3,"_","_","_","yavāgū","NC","","_","_"
4,"_","_","_","ādi","NC","","_","_"
5,"_","_","_","na","CNG","","_","_"
6,"_","_","_","ced","CX","","_","_"
7,"_","_","_","as","V","as","_","_"
8,"_","_","_","māruta","NC","","_","_"
9,"balī","_","_","balin","JJ","","_","_"
1,"_","_","_","bala","NC","","_","_"
2,"_","_","_","māṃsa","NC","","_","_"
3,"_","_","_","parikṣi","PPP","","_","_"
4,"_","_","_","śoka","NC","","_","_"
5,"_","_","_","bhāra","NC","","_","_"
6,"_","_","_","adhvan","NC","","_","_"
7,"_","_","_","karśay","PPP","","_","_"
1,"_","_","_","jvalana","NC","","_","_"
2,"_","_","_","āditya","NC","","_","_"
3,"_","_","_","saṃtap","PPP","","_","_"
4,"_","_","_","anya","PPX","","_","_"
5,"_","_","_","vā","CCD","","_","_"
6,"_","_","_","kṣi","PPP","","_","_"
7,"_","_","_","āmaya","NC","","_","_"
1,"garbhiṇīṃ","_","_","garbhiṇī","NC","","_","_"
2,"sthaviraṃ","_","_","sthavira","NC","","_","_"
3,"bālaṃ","_","_","bāla","NC","","_","_"
4,"_","_","_","rūkṣa","JJ","","_","_"
5,"_","_","_","alpa","JJ","","_","_"
6,"_","_","_","pramā","PPP","","_","_"
7,"_","_","_","āśin","JJ","","_","_"
1,"a","_","_","alpha_privativum","JJ","","_","_"
1,"_","_","_","vamya","JJ","","_","_"
2,"_","_","_","avirecya","JJ","","_","_"
3,"vā","_","_","vā","CCD","","_","_"
4,"yaṃ","_","_","yad","PRL","","_","_"
5,"_","_","_","paś","V","paś","_","_"
6,"_","_","_","raktapittin","JJ","","_","_"
1,"śoṣeṇa","_","_","śoṣa","NC","","_","_"
2,"_","_","_","sa_saha","CX","","_","_"
3,"_","_","_","anubandha","NC","","_","_"
4,"vā","_","_","vā","CCD","","_","_"
5,"tasya","_","_","tad","PRD","","_","_"
6,"saṃśamanī","_","_","saṃśamana","JJ","","_","_"
7,"kriyā","_","_","kriyā","NC","","_","_"
1,"śasyate","_","_","śaṃs","V","śaṃs","_","_"
2,"raktapittasya","_","_","raktapitta","NC","","_","_"
3,"paraṃ","_","_","para","CX","","_","_"
4,"_","_","_","tad","PRD","","_","_"
5,"_","_","_","atha","CAD","","_","_"
6,"pravakṣyate","_","_","pravak","V","pravac","_","_"
1,"_","_","_","aṭarūṣaka","NC","","_","_"
2,"_","_","_","mṛdvīkā","NC","","_","_"
3,"_","_","_","pathyā","NC","","_","_"
4,"_","_","_","kvātha","NC","","_","_"
5,"_","_","_","sa_saha","CX","","_","_"
6,"_","_","_","śarkarā","NC","","_","_"
1,"_","_","_","madhu","NC","","_","_"
2,"_","_","_","miśra","JJ","","_","_"
3,"_","_","_","śvāsa","NC","","_","_"
4,"_","_","_","kāsa","NC","","_","_"
5,"_","_","_","raktapitta","NC","","_","_"
6,"_","_","_","nibarhaṇa","JJ","","_","_"
1,"_","_","_","aṭarūṣaka","NC","","_","_"
2,"_","_","_","niryūha","NC","","_","_"
3,"priyaṅguṃ","_","_","priyaṅgu","NC","","_","_"
4,"_","_","_","mṛttikā","NC","","_","_"
5,"_","_","_","añjana","NC","","_","_"
1,"vinīya","_","_","vinī","CGDA","","_","_"
2,"lodhraṃ","_","_","lodhra","NC","","_","_"
3,"kṣaudraṃ","_","_","kṣaudra","NC","","_","_"
4,"ca","_","_","ca","CCD","","_","_"
5,"_","_","_","raktapitta","NC","","_","_"
6,"_","_","_","hara","JJ","","_","_"
7,"pibet","_","_","pib","V","pā","_","_"
1,"padmakaṃ","_","_","padmaka","NC","","_","_"
2,"_","_","_","padma","NC","","_","_"
3,"_","_","_","kiñjalka","NC","","_","_"
4,"dūrvāṃ","_","_","dūrvā","NC","","_","_"
5,"_","_","_","vāstūka","NC","","_","_"
6,"_","_","_","utpala","NC","","_","_"
1,"nāgapuṣpaṃ","_","_","nāgapuṣpa","NC","","_","_"
2,"ca","_","_","ca","CCD","","_","_"
3,"lodhraṃ","_","_","lodhra","NC","","_","_"
4,"ca","_","_","ca","CCD","","_","_"
5,"_","_","_","tad","PRD","","_","_"
6,"_","_","_","eva","CEM","","_","_"
7,"vidhinā","_","_","vidhi","NC","","_","_"
8,"pibet","_","_","pib","V","pā","_","_"
1,"prapauṇḍarīkaṃ","_","_","prapauṇḍarīka","NC","","_","_"
2,"madhukaṃ","_","_","madhuka","NC","","_","_"
3,"madhu","_","_","madhu","NC","","_","_"
4,"_","_","_","ca","CCD","","_","_"
5,"_","_","_","aśva","NC","","_","_"
6,"_","_","_","śakṛt","NC","","_","_"
7,"_","_","_","rasa","NC","","_","_"
1,"_","_","_","yavāsa","NC","","_","_"
2,"_","_","_","bhṛṅgaraja","NC","","_","_"
3,"_","_","_","mūla","NC","","_","_"
4,"vā","_","_","vā","CCD","","_","_"
5,"_","_","_","go","CX","","_","_"
6,"_","_","_","śakṛt","NC","","_","_"
7,"_","_","_","rasa","NC","","_","_"
1,"vinīya","_","_","vinī","CGDA","","_","_"
2,"_","_","_","raktapitta","NC","","_","_"
3,"_","_","_","ghna","JJ","","_","_"
4,"peyaṃ","_","_","pā","KDG","","_","_"
5,"_","_","_","as","V","as","_","_"
6,"_","_","_","taṇḍula","NC","","_","_"
7,"_","_","_","ambu","NC","","_","_"
1,"yuktaṃ","_","_","yuj","PPP","","_","_"
2,"vā","_","_","vā","CCD","","_","_"
3,"_","_","_","madhu","NC","","_","_"
4,"_","_","_","sarpis","NC","","_","_"
5,"lihyād","_","_","liha","V","lih","_","_"
6,"_","_","_","go","CX","","_","_"
7,"_","_","_","aśva","NC","","_","_"
8,"_","_","_","śakṛt","NC","","_","_"
9,"_","_","_","rasa","NC","","_","_"
1,"khadirasya","_","_","khadira","NC","","_","_"
2,"priyaṅgūṇāṃ","_","_","priyaṅgu","NC","","_","_"
3,"kovidārasya","_","_","kovidāra","NC","","_","_"
4,"śālmaleḥ","_","_","śālmali","NC","","_","_"
1,"_","_","_","puṣpa","NC","","_","_"
2,"_","_","_","cūrṇa","NC","","_","_"
3,"madhunā","_","_","madhu","NC","","_","_"
4,"_","_","_","liha","V","lih","_","_"
5,"_","_","_","nṛ","NC","","_","_"
6,"raktapittikaḥ","_","_","raktapittika","JJ","","_","_"
1,"śṛṅgāṭakānāṃ","_","_","śṛṅgāṭaka","NC","","_","_"
2,"lājānāṃ","_","_","lāja","NC","","_","_"
3,"_","_","_","mustā","NC","","_","_"
4,"_","_","_","kharjūra","NC","","_","_"
5,"_","_","_","api","CX","","_","_"
1,"_","_","_","liha","V","lih","_","_"
2,"_","_","_","cūrṇa","NC","","_","_"
3,"madhunā","_","_","madhu","NC","","_","_"
4,"padmānāṃ","_","_","padma","NC","","_","_"
5,"keśarasya","_","_","kesara","NC","","_","_"
6,"ca","_","_","ca","CCD","","_","_"
1,"_","_","_","dhanvan","NC","","_","_"
2,"_","_","_","ja","JJ","","_","_"
3,"_","_","_","asṛj","NC","","_","_"
4,"_","_","_","liha","V","lih","_","_"
5,"_","_","_","madhu","NC","","_","_"
6,"_","_","_","mṛga","NC","","_","_"
7,"_","_","_","pakṣin","NC","","_","_"
1,"_","_","_","sa_saha","CX","","_","_"
2,"_","_","_","kṣaudra","NC","","_","_"
3,"grathite","_","_","granth","PPP","","_","_"
4,"rakte","_","_","rakta","NC","","_","_"
5,"lihyāt","_","_","liha","V","lih","_","_"
6,"pārāvataṃ","_","_","pārāvata","JJ","","_","_"
7,"śakṛt","_","_","śakṛt","NC","","_","_"
1,"_","_","_","uśīra","NC","","_","_"
2,"_","_","_","kālīyaka","NC","","_","_"
3,"_","_","_","lodhra","NC","","_","_"
4,"_","_","_","padmaka","NC","","_","_"
5,"_","_","_","priyaṅgukā","NC","","_","_"
6,"_","_","_","kaṭphala","NC","","_","_"
7,"_","_","_","śaṅkha","NC","","_","_"
8,"_","_","_","gairika","NC","","_","_"
1,"pṛthak","_","_","pṛthak","CX","","_","_"
2,"pṛthak","_","_","pṛthak","CX","","_","_"
3,"_","_","_","candana","NC","","_","_"
4,"_","_","_","tulya","JJ","","_","_"
5,"_","_","_","bhāgika","JJ","","_","_"
6,"_","_","_","sa_saha","CX","","_","_"
7,"_","_","_","śarkarā","NC","","_","_"
8,"_","_","_","taṇḍula","NC","","_","_"
9,"_","_","_","dhāvana","NC","","_","_"
10,"_","_","_","āplu","PPP","","_","_"
1,"raktaṃ","_","_","rakta","NC","","_","_"
2,"_","_","_","sa_saha","CX","","_","_"
3,"_","_","_","pitta","NC","","_","_"
4,"tamakaṃ","_","_","tamaka","NC","","_","_"
5,"pipāsāṃ","_","_","pipāsā","NC","","_","_"
6,"dāhaṃ","_","_","dāha","NC","","_","_"
7,"ca","_","_","ca","CCD","","_","_"
8,"pītāḥ","_","_","pā","PPP","","_","_"
9,"śamayanti","_","_","śam","V","śam","_","_"
10,"sadyaḥ","_","_","sadyas","CAD","","_","_"
1,"kirātatiktaṃ","_","_","kirātatikta","NC","","_","_"
2,"kramukaṃ","_","_","kramuka","NC","","_","_"
3,"_","_","_","sa_saha","CX","","_","_"
4,"_","_","_","mustā","NC","","_","_"
5,"prapauṇḍarīkaṃ","_","_","prapauṇḍarīka","NC","","_","_"
6,"_","_","_","kamala","NC","","_","_"
7,"_","_","_","utpala","NC","","_","_"
8,"ca","_","_","ca","CCD","","_","_"
1,"_","_","_","hrīvera","NC","","_","_"
2,"_","_","_","mūla","NC","","_","_"
3,"_","_","_","paṭola","NC","","_","_"
4,"_","_","_","pattra","NC","","_","_"
5,"durālabhā","_","_","durālabhā","NC","","_","_"
6,"parpaṭako","_","_","parpaṭaka","NC","","_","_"
7,"mṛṇālam","_","_","mṛṇāla","NC","","_","_"
1,"_","_","_","dhanaṃjaya","NC","","_","_"
2,"_","_","_","udumbara","NC","","_","_"
3,"_","_","_","vetasa","NC","","_","_"
4,"_","_","_","tvac","NC","","_","_"
5,"_","_","_","nyagrodha","NC","","_","_"
6,"_","_","_","śāleya","NC","","_","_"
7,"_","_","_","yavāsaka","NC","","_","_"
8,"_","_","_","tvac","NC","","_","_"
1,"_","_","_","tugā","NC","","_","_"
2,"_","_","_","latā","NC","","_","_"
3,"_","_","_","vetasa","NC","","_","_"
4,"_","_","_","taṇḍulīya","NC","","_","_"
5,"_","_","_","sa_saha","CX","","_","_"
6,"_","_","_","sārivā","NC","","_","_"
7,"_","_","_","moca","NC","","_","_"
8,"_","_","_","rasa","NC","","_","_"
9,"samaṅgā","_","_","samaṅgā","NC","","_","_"
1,"pṛthak","_","_","pṛthak","CX","","_","_"
2,"pṛthak","_","_","pṛthak","CX","","_","_"
3,"_","_","_","candana","NC","","_","_"
4,"_","_","_","yojay","PPP","","_","_"
5,"_","_","_","tad","PRD","","_","_"
6,"_","_","_","eva","CEM","","_","_"
7,"kalpena","_","_","kalpa","NC","","_","_"
8,"hitāni","_","_","hita","JJ","","_","_"
9,"tatra","_","_","tatra","CAD","","_","_"
1,"niśi","_","_","niś","NC","","_","_"
2,"sthitā","_","_","sthā","PPP","","_","_"
3,"vā","_","_","vā","CCD","","_","_"
4,"svarasīkṛtā","_","_","svarasīkṛ","PPP","","_","_"
5,"vā","_","_","vā","CCD","","_","_"
6,"kalkīkṛtā","_","_","kalkīkṛ","PPP","","_","_"
7,"vā","_","_","vā","CCD","","_","_"
8,"mṛditāḥ","_","_","mṛd","PPP","","_","_"
9,"śṛtā","_","_","śrī","PPP","","_","_"
10,"vā","_","_","vā","CCD","","_","_"
1,"ete","_","_","tad","PRD","","_","_"
2,"samastā","_","_","samasta","JJ","","_","_"
3,"gaṇaśaḥ","_","_","gaṇaśas","CX","","_","_"
4,"_","_","_","pṛthak","CX","","_","_"
5,"_","_","_","vā","CCD","","_","_"
6,"raktaṃ","_","_","rakta","NC","","_","_"
7,"_","_","_","sa_saha","CX","","_","_"
8,"_","_","_","pitta","NC","","_","_"
9,"śamayanti","_","_","śam","V","śam","_","_"
10,"yogāḥ","_","_","yoga","NC","","_","_"
1,"mudgāḥ","_","_","mudga","NC","","_","_"
2,"_","_","_","sa_saha","CX","","_","_"
3,"_","_","_","lāja","NC","","_","_"
4,"_","_","_","sa_saha","CX","","_","_"
5,"_","_","_","yava","NC","","_","_"
6,"_","_","_","sa_saha","CX","","_","_"
7,"_","_","_","kṛṣṇā","NC","","_","_"
8,"_","_","_","sa_saha","CX","","_","_"
9,"_","_","_","uśīra","NC","","_","_"
10,"_","_","_","mustā","NC","","_","_"
11,"saha","_","_","saha","CX","","_","_"
12,"candanena","_","_","candana","NC","","_","_"
1,"_","_","_","balā","NC","","_","_"
2,"_","_","_","jala","NC","","_","_"
3,"paryuṣitāḥ","_","_","paryuṣita","JJ","","_","_"
4,"kaṣāyā","_","_","kaṣāya","NC","","_","_"
5,"raktaṃ","_","_","rakta","NC","","_","_"
6,"_","_","_","sa_saha","CX","","_","_"
7,"_","_","_","pitta","NC","","_","_"
8,"_","_","_","śamay","V","śamay","_","_"
9,"_","_","_","udīr","PPP","","_","_"
1,"_","_","_","vaiḍūrya","NC","","_","_"
2,"_","_","_","muktā","NC","","_","_"
3,"_","_","_","maṇi","NC","","_","_"
4,"_","_","_","gairika","NC","","_","_"
5,"_","_","_","mṛd","NC","","_","_"
6,"_","_","_","śaṅkha","NC","","_","_"
7,"_","_","_","heman","NC","","_","_"
8,"_","_","_","āmalaka","NC","","_","_"
9,"_","_","_","udaka","NC","","_","_"
1,"_","_","_","madhūdaka","NC","","_","_"
2,"_","_","_","ikṣu","NC","","_","_"
3,"_","_","_","rasa","NC","","_","_"
4,"_","_","_","ca","CCD","","_","_"
5,"_","_","_","eva","CEM","","_","_"
6,"_","_","_","pāna","NC","","_","_"
7,"_","_","_","śama","NC","","_","_"
8,"gacchati","_","_","gacch","V","gam","_","_"
9,"raktapittam","_","_","raktapitta","NC","","_","_"
1,"_","_","_","uśīra","NC","","_","_"
2,"_","_","_","padma","NC","","_","_"
3,"_","_","_","utpala","NC","","_","_"
4,"_","_","_","candana","NC","","_","_"
5,"pakvasya","_","_","pakva","JJ","","_","_"
6,"loṣṭasya","_","_","loṣṭa","NC","","_","_"
7,"ca","_","_","ca","CCD","","_","_"
8,"yaḥ","_","_","yad","PRL","","_","_"
9,"prasādaḥ","_","_","prasāda","NC","","_","_"
1,"_","_","_","sa_saha","CX","","_","_"
2,"_","_","_","śarkarā","NC","","_","_"
3,"_","_","_","kṣaudra","NC","","_","_"
4,"_","_","_","yuta","JJ","","_","_"
5,"_","_","_","su","CAD","","_","_"
6,"_","_","_","śīta","JJ","","_","_"
7,"_","_","_","rakta","NC","","_","_"
8,"_","_","_","atiyoga","NC","","_","_"
9,"_","_","_","praśama","NC","","_","_"
10,"deyaḥ","_","_","dā","KDG","","_","_"
1,"_","_","_","priyaṅgukā","NC","","_","_"
2,"_","_","_","candana","NC","","_","_"
3,"_","_","_","lodhra","NC","","_","_"
4,"_","_","_","sārivā","NC","","_","_"
5,"_","_","_","madhūka","NC","","_","_"
6,"_","_","_","mustā","NC","","_","_"
7,"_","_","_","abhayā","NC","","_","_"
8,"_","_","_","dhātakī","NC","","_","_"
9,"_","_","_","jala","NC","","_","_"
1,"_","_","_","sa_saha","CX","","_","_"
2,"_","_","_","mṛd","NC","","_","_"
3,"_","_","_","prasāda","NC","","_","_"
4,"saha","_","_","saha","CX","","_","_"
5,"_","_","_","yaṣṭikā","NC","","_","_"
6,"_","_","_","ambu","NC","","_","_"
7,"_","_","_","sa_saha","CX","","_","_"
8,"_","_","_","śarkarā","NC","","_","_"
9,"_","_","_","rakta","NC","","_","_"
10,"_","_","_","nibarhaṇa","JJ","","_","_"
11,"param","_","_","para","PPX","","_","_"
1,"_","_","_","kaṣāya","NC","","_","_"
2,"_","_","_","yoga","NC","","_","_"
3,"_","_","_","vividha","JJ","","_","_"
4,"_","_","_","yathā","CCM","","_","_"
5,"_","_","_","vac","PPP","","_","_"
6,"_","_","_","dīp","PPP","","_","_"
7,"'nale","_","_","anala","NC","","_","_"
8,"śleṣmaṇi","_","_","śleṣman","NC","","_","_"
9,"nirjite","_","_","nirji","PPP","","_","_"
10,"ca","_","_","ca","CCD","","_","_"
1,"_","_","_","yad","PRL","","_","_"
2,"_","_","_","raktapitta","NC","","_","_"
3,"praśamaṃ","_","_","praśama","NC","","_","_"
4,"na","_","_","na","CNG","","_","_"
5,"yāti","_","_","yā","V","yā","_","_"
6,"_","_","_","tatra","CAD","","_","_"
7,"_","_","_","anila","NC","","_","_"
8,"_","_","_","as","V","as","_","_"
9,"_","_","_","anu","CADP","","_","_"
10,"tatra","_","_","tatra","CAD","","_","_"
11,"kāryam","_","_","kṛ","KDG","","_","_"
1,"chāgaṃ","_","_","chāga","JJ","","_","_"
2,"payaḥ","_","_","payas","NC","","_","_"
3,"syāt","_","_","as","V","as","_","_"
4,"paramaṃ","_","_","parama","JJ","","_","_"
5,"prayoge","_","_","prayoga","NC","","_","_"
6,"gavyaṃ","_","_","gavya","JJ","","_","_"
7,"śṛtaṃ","_","_","śrī","PPP","","_","_"
8,"pañcaguṇe","_","_","pañcaguṇa","JJ","","_","_"
9,"jale","_","_","jala","NC","","_","_"
10,"vā","_","_","vā","CCD","","_","_"
1,"_","_","_","sa_saha","CX","","_","_"
2,"_","_","_","śarkarā","NC","","_","_"
3,"_","_","_","mākṣika","NC","","_","_"
4,"_","_","_","samprayuj","PPP","","_","_"
5,"_","_","_","vidārigandhādi","NC","","_","_"
6,"_","_","_","gaṇa","NC","","_","_"
7,"śṛtaṃ","_","_","śrī","PPP","","_","_"
8,"vā","_","_","vā","CCD","","_","_"
1,"_","_","_","drākṣā","NC","","_","_"
2,"_","_","_","śrī","PPP","","_","_"
3,"nāgarakaiḥ","_","_","nāgaraka","NC","","_","_"
4,"śṛtaṃ","_","_","śrī","PPP","","_","_"
5,"vā","_","_","vā","CCD","","_","_"
6,"_","_","_","balā","NC","","_","_"
7,"_","_","_","śrī","PPP","","_","_"
8,"gokṣurakaiḥ","_","_","gokṣuraka","NC","","_","_"
9,"śṛtaṃ","_","_","śrī","PPP","","_","_"
10,"vā","_","_","vā","CCD","","_","_"
1,"_","_","_","sa_saha","CX","","_","_"
2,"_","_","_","jīvaka","NC","","_","_"
3,"_","_","_","sa_saha","CX","","_","_"
4,"_","_","_","ṛṣabhaka","NC","","_","_"
5,"_","_","_","sa_saha","CX","","_","_"
6,"_","_","_","sarpis","NC","","_","_"
7,"payaḥ","_","_","payas","NC","","_","_"
8,"prayojyaṃ","_","_","prayuj","KDG","","_","_"
9,"sitayā","_","_","sitā","NC","","_","_"
10,"śṛtaṃ","_","_","śrī","PPP","","_","_"
11,"vā","_","_","vā","CCD","","_","_"
1,"_","_","_","śatāvarī","NC","","_","_"
2,"_","_","_","gokṣuraka","NC","","_","_"
3,"śṛtaṃ","_","_","śrī","PPP","","_","_"
4,"vā","_","_","vā","CCD","","_","_"
5,"śṛtaṃ","_","_","śrī","PPP","","_","_"
6,"payo","_","_","payas","NC","","_","_"
7,"_","_","_","vā","CCD","","_","_"
8,"_","_","_","api","CX","","_","_"
9,"_","_","_","atha","CAD","","_","_"
10,"parṇinībhiḥ","_","_","parṇinī","NC","","_","_"
1,"raktaṃ","_","_","rakta","NC","","_","_"
2,"_","_","_","nihan","V","nihan","_","_"
3,"_","_","_","āśu","CX","","_","_"
4,"_","_","_","viśeṣataḥ","CX","","_","_"
5,"_","_","_","tu","CCD","","_","_"
6,"_","_","_","yad","PRL","","_","_"
7,"_","_","_","mūtra","NC","","_","_"
8,"_","_","_","mārga","NC","","_","_"
9,"_","_","_","sa_saha","CX","","_","_"
10,"_","_","_","rujā","NC","","_","_"
11,"prayāti","_","_","prai","V","prai","_","_"
1,"viśeṣato","_","_","viśeṣataḥ","CX","","_","_"
2,"_","_","_","viṣ","NC","","_","_"
3,"_","_","_","patha","NC","","_","_"
4,"_","_","_","sampravṛt","PPP","","_","_"
5,"payo","_","_","payas","NC","","_","_"
6,"mataṃ","_","_","man","PPP","","_","_"
7,"_","_","_","moca","NC","","_","_"
8,"_","_","_","rasa","NC","","_","_"
9,"siddham","_","_","sidh","PPP","","_","_"
1,"_","_","_","vaṭa","NC","","_","_"
2,"_","_","_","avaroha","NC","","_","_"
3,"_","_","_","vaṭa","NC","","_","_"
4,"_","_","_","śuṅgaka","NC","","_","_"
5,"vā","_","_","vā","CCD","","_","_"
6,"_","_","_","hrīvera","NC","","_","_"
7,"_","_","_","nīla","JJ","","_","_"
8,"_","_","_","utpala","NC","","_","_"
9,"_","_","_","nāgara","NC","","_","_"
10,"_","_","_","vā","CCD","","_","_"
1,"_","_","_","kaṣāya","NC","","_","_"
2,"_","_","_","yoga","NC","","_","_"
3,"payasā","_","_","payas","NC","","_","_"
4,"purā","_","_","purā","CX","","_","_"
5,"vā","_","_","vā","CCD","","_","_"
6,"_","_","_","pā","CGDA","","_","_"
7,"_","_","_","anu","CADP","","_","_"
8,"_","_","_","ca","CCD","","_","_"
9,"_","_","_","ad","V","ad","_","_"
10,"_","_","_","payas","NC","","_","_"
11,"_","_","_","eva","CEM","","_","_"
12,"śālīn","_","_","śāli","NC","","_","_"
1,"_","_","_","kaṣāya","NC","","_","_"
2,"_","_","_","yoga","NC","","_","_"
3,"_","_","_","athavā","CX","","_","_"
4,"_","_","_","vipakva","JJ","","_","_"
5,"_","_","_","tad","PRD","","_","_"
6,"pibet","_","_","pib","V","pā","_","_"
7,"_","_","_","sarpis","NC","","_","_"
8,"_","_","_","atisrava","NC","","_","_"
9,"ca","_","_","ca","CCD","","_","_"
1,"vāsāṃ","_","_","vāsā","NC","","_","_"
2,"_","_","_","sa_saha","CX","","_","_"
3,"_","_","_","śākhā","NC","","_","_"
4,"_","_","_","sa_saha","CX","","_","_"
5,"_","_","_","palāśa","NC","","_","_"
6,"_","_","_","mūla","NC","","_","_"
7,"kṛtvā","_","_","kṛ","CGDA","","_","_"
8,"kaṣāyaṃ","_","_","kaṣāya","NC","","_","_"
9,"kusumāni","_","_","kusuma","NC","","_","_"
10,"_","_","_","ca","CCD","","_","_"
11,"_","_","_","ida","PRD","","_","_"
1,"pradāya","_","_","pradā","CGDA","","_","_"
2,"kalkaṃ","_","_","kalka","NC","","_","_"
3,"_","_","_","vipac","V","vipac","_","_"
4,"_","_","_","ghṛta","NC","","_","_"
5,"tat","_","_","tad","PRD","","_","_"
6,"_","_","_","sa_saha","CX","","_","_"
7,"_","_","_","kṣaudra","NC","","_","_"
8,"_","_","_","āśu","CX","","_","_"
9,"_","_","_","eva","CEM","","_","_"
10,"nihanti","_","_","nihan","V","nihan","_","_"
11,"raktam","_","_","rakta","NC","","_","_"
1,"iti","_","_","iti","CQT","","_","_"
2,"vāsāghṛtam","_","_","vāsāghṛta","NC","","_","_"
1,"_","_","_","palāśa","NC","","_","_"
2,"_","_","_","vṛnta","NC","","_","_"
3,"_","_","_","svarasa","NC","","_","_"
4,"siddhaṃ","_","_","sidh","PPP","","_","_"
5,"_","_","_","tad","PRD","","_","_"
6,"_","_","_","eva","CEM","","_","_"
7,"kalkena","_","_","kalka","NC","","_","_"
8,"_","_","_","madhu","NC","","_","_"
9,"_","_","_","drava","JJ","","_","_"
1,"_","_","_","liha","V","lih","_","_"
2,"_","_","_","ghṛta","NC","","_","_"
3,"_","_","_","vatsaka","NC","","_","_"
4,"_","_","_","kalka","NC","","_","_"
5,"_","_","_","sidh","PPP","","_","_"
6,"tadvat","_","_","tadvat","CX","","_","_"
7,"_","_","_","samaṅgā","NC","","_","_"
8,"_","_","_","utpala","NC","","_","_"
9,"_","_","_","lodhra","NC","","_","_"
10,"_","_","_","sidh","PPP","","_","_"
1,"_","_","_","as","V","as","_","_"
2,"_","_","_","trāyamāṇā","NC","","_","_"
3,"_","_","_","vidhi","NC","","_","_"
4,"_","_","_","tad","PRD","","_","_"
5,"eva","_","_","eva","CEM","","_","_"
6,"_","_","_","sa_saha","CX","","_","_"
7,"_","_","_","udumbara","NC","","_","_"
8,"_","_","_","ca","CCD","","_","_"
9,"_","_","_","eva","CEM","","_","_"
10,"_","_","_","paṭola","NC","","_","_"
11,"_","_","_","pattra","NC","","_","_"
1,"sarpīṃṣi","_","_","sarpis","NC","","_","_"
2,"_","_","_","pitta","NC","","_","_"
3,"_","_","_","jvara","NC","","_","_"
4,"_","_","_","nāśana","JJ","","_","_"
5,"sarvāṇi","_","_","sarva","JQ","","_","_"
6,"śastāni","_","_","śaṃs","PPP","","_","_"
7,"ca","_","_","ca","CCD","","_","_"
8,"raktapitte","_","_","raktapitta","NC","","_","_"
1,"_","_","_","abhyaṅga","NC","","_","_"
2,"_","_","_","yoga","NC","","_","_"
3,"pariṣecanāni","_","_","pariṣecana","NC","","_","_"
4,"_","_","_","seka","NC","","_","_"
5,"_","_","_","avagāha","NC","","_","_"
6,"śayanāni","_","_","śayana","NC","","_","_"
7,"veśma","_","_","veśman","NC","","_","_"
1,"śīto","_","_","śīta","JJ","","_","_"
2,"_","_","_","vidhi","NC","","_","_"
3,"_","_","_","vasti","NC","","_","_"
4,"_","_","_","vidhāna","NC","","_","_"
5,"_","_","_","agrya","JJ","","_","_"
6,"_","_","_","pitta","NC","","_","_"
7,"_","_","_","jvara","NC","","_","_"
8,"yat","_","_","yad","PRL","","_","_"
9,"praśamāya","_","_","praśama","NC","","_","_"
10,"diṣṭam","_","_","diś","PPP","","_","_"
1,"_","_","_","tad","PRD","","_","_"
2,"_","_","_","raktapitta","NC","","_","_"
3,"nikhilena","_","_","nikhila","CX","","_","_"
4,"kāryaṃ","_","_","kṛ","KDG","","_","_"
5,"kālaṃ","_","_","kāla","NC","","_","_"
6,"ca","_","_","ca","CCD","","_","_"
7,"mātrāṃ","_","_","mātrā","NC","","_","_"
8,"ca","_","_","ca","CCD","","_","_"
9,"purā","_","_","purā","CX","","_","_"
10,"samīkṣya","_","_","samīkṣ","CGDA","","_","_"
1,"_","_","_","sarpis","NC","","_","_"
2,"_","_","_","guḍa","NC","","_","_"
3,"ye","_","_","yad","PRL","","_","_"
4,"ca","_","_","ca","CCD","","_","_"
5,"hitāḥ","_","_","hita","JJ","","_","_"
6,"_","_","_","kṣan","PPP","","_","_"
7,"_","_","_","tad","PRD","","_","_"
8,"raktapittaṃ","_","_","raktapitta","NC","","_","_"
9,"śamayanti","_","_","śam","V","śam","_","_"
10,"sadyaḥ","_","_","sadyas","CAD","","_","_"
1,"_","_","_","kapha","NC","","_","_"
2,"_","_","_","anubandha","NC","","_","_"
3,"rudhire","_","_","rudhira","NC","","_","_"
4,"_","_","_","sa_saha","CX","","_","_"
5,"_","_","_","pitta","NC","","_","_"
6,"_","_","_","kaṇṭha","NC","","_","_"
7,"_","_","_","āga","PPP","","_","_"
8,"_","_","_","as","V","as","_","_"
9,"_","_","_","granth","PPP","","_","_"
10,"prayogaḥ","_","_","prayoga","NC","","_","_"
1,"yuktasya","_","_","yuj","PPP","","_","_"
2,"yuktyā","_","_","yukti","NC","","_","_"
3,"_","_","_","madhu","NC","","_","_"
4,"_","_","_","sarpis","NC","","_","_"
5,"_","_","_","ca","CCD","","_","_"
6,"kṣārasya","_","_","kṣāra","NC","","_","_"
7,"_","_","_","ca","CCD","","_","_"
8,"_","_","_","eva","CEM","","_","_"
9,"_","_","_","utpala","NC","","_","_"
10,"_","_","_","nāla","NC","","_","_"
11,"_","_","_","ja","JJ","","_","_"
1,"_","_","_","mṛṇāla","NC","","_","_"
2,"_","_","_","padma","NC","","_","_"
3,"_","_","_","utpala","NC","","_","_"
4,"_","_","_","kesara","NC","","_","_"
5,"tathā","_","_","tathā","CX","","_","_"
6,"palāśasya","_","_","palāśa","NC","","_","_"
7,"tathā","_","_","tathā","CX","","_","_"
8,"priyaṅgoḥ","_","_","priyaṅgu","NC","","_","_"
1,"tathā","_","_","tathā","CX","","_","_"
2,"madhūkasya","_","_","madhūka","NC","","_","_"
3,"_","_","_","tathā","CX","","_","_"
4,"_","_","_","asana","NC","","_","_"
5,"kṣārāḥ","_","_","kṣāra","NC","","_","_"
6,"prayojyā","_","_","prayuj","KDG","","_","_"
7,"_","_","_","vidhi","NC","","_","_"
8,"_","_","_","eva","CEM","","_","_"
9,"tena","_","_","tad","PRD","","_","_"
1,"_","_","_","śatāvarī","NC","","_","_"
2,"_","_","_","dāḍima","NC","","_","_"
3,"_","_","_","tintiḍīka","NC","","_","_"
4,"_","_","_","kākolī","NC","","_","_"
5,"_","_","_","medā","NC","","_","_"
6,"madhukaṃ","_","_","madhuka","NC","","_","_"
7,"vidārīm","_","_","vidārī","NC","","_","_"
1,"piṣṭvā","_","_","piṣ","CGDA","","_","_"
2,"ca","_","_","ca","CCD","","_","_"
3,"mūlaṃ","_","_","mūla","NC","","_","_"
4,"phalapūrakasya","_","_","phalapūraka","NC","","_","_"
5,"ghṛtaṃ","_","_","ghṛta","NC","","_","_"
6,"pacet","_","_","pac","V","pac","_","_"
7,"_","_","_","kṣīra","NC","","_","_"
8,"_","_","_","caturguṇa","JJ","","_","_"
9,"jñaḥ","_","_","jña","JJ","","_","_"
1,"_","_","_","kāsa","NC","","_","_"
2,"_","_","_","jvara","NC","","_","_"
3,"_","_","_","ānāha","NC","","_","_"
4,"_","_","_","vibandha","NC","","_","_"
5,"_","_","_","śūla","NC","","_","_"
6,"_","_","_","tad","PRD","","_","_"
7,"_","_","_","raktapitta","NC","","_","_"
8,"ca","_","_","ca","CCD","","_","_"
9,"ghṛtaṃ","_","_","ghṛta","NC","","_","_"
10,"nihanyāt","_","_","nihan","V","nihan","_","_"
1,"yat","_","_","yad","PRL","","_","_"
2,"_","_","_","pañcamūla","NC","","_","_"
3,"_","_","_","atha","CAD","","_","_"
4,"_","_","_","pañcan","NUM","","_","_"
5,"_","_","_","vā","CCD","","_","_"
6,"siddhaṃ","_","_","sidh","PPP","","_","_"
7,"ghṛtaṃ","_","_","ghṛta","NC","","_","_"
8,"_","_","_","tad","PRD","","_","_"
9,"_","_","_","ca","CCD","","_","_"
10,"_","_","_","tad","PRD","","_","_"
11,"_","_","_","artha","NC","","_","_"
12,"_","_","_","kārin","JJ","","_","_"
1,"iti","_","_","iti","CQT","","_","_"
2,"śatāvaryādighṛtam","_","_","śatāvaryādighṛta","NC","","_","_"
1,"_","_","_","kaṣāya","NC","","_","_"
2,"_","_","_","yoga","NC","","_","_"
3,"ya","_","_","yad","PRL","","_","_"
4,"_","_","_","iha","CAD","","_","_"
5,"_","_","_","upadiś","PPP","","_","_"
6,"_","_","_","tad","PRD","","_","_"
7,"_","_","_","ca","CCD","","_","_"
8,"_","_","_","avapīḍa","NC","","_","_"
9,"bhiṣajā","_","_","bhiṣaj","NC","","_","_"
10,"prayojyāḥ","_","_","prayuj","KDG","","_","_"
1,"ghrāṇāt","_","_","ghrāṇa","NC","","_","_"
2,"pravṛttaṃ","_","_","pravṛt","PPP","","_","_"
3,"rudhiraṃ","_","_","rudhira","NC","","_","_"
4,"_","_","_","sa_saha","CX","","_","_"
5,"_","_","_","pīta","JJ","","_","_"
6,"yadā","_","_","yadā","CSB","","_","_"
7,"_","_","_","bhav","V","bhū","_","_"
8,"_","_","_","niḥsṛ","PPP","","_","_"
9,"_","_","_","duṣ","PPP","","_","_"
10,"_","_","_","doṣa","NC","","_","_"
1,"rakte","_","_","rakta","NC","","_","_"
2,"praduṣṭe","_","_","praduṣ","PPP","","_","_"
3,"_","_","_","hi","CX","","_","_"
4,"_","_","_","avapīḍa","NC","","_","_"
5,"_","_","_","bandha","NC","","_","_"
6,"_","_","_","duṣ","PPP","","_","_"
7,"_","_","_","pratiśyāya","NC","","_","_"
8,"_","_","_","śiras","NC","","_","_"
9,"_","_","_","vikāra","NC","","_","_"
1,"raktaṃ","_","_","rakta","NC","","_","_"
2,"_","_","_","sa_saha","CX","","_","_"
3,"_","_","_","pūya","NC","","_","_"
4,"_","_","_","kuṇapa","JJ","","_","_"
5,"_","_","_","ca","CCD","","_","_"
6,"gandhaḥ","_","_","gandha","NC","","_","_"
7,"syād","_","_","as","V","as","_","_"
8,"_","_","_","ghrāṇa","NC","","_","_"
9,"_","_","_","nāśa","NC","","_","_"
10,"_","_","_","kṛmi","NC","","_","_"
11,"_","_","_","ca","CCD","","_","_"
12,"duṣṭāḥ","_","_","duṣṭa","JJ","","_","_"
1,"_","_","_","nīla","JJ","","_","_"
2,"_","_","_","utpala","NC","","_","_"
3,"_","_","_","gairika","NC","","_","_"
4,"_","_","_","śaṅkha","NC","","_","_"
5,"_","_","_","yuj","PPP","","_","_"
6,"_","_","_","sa_saha","CX","","_","_"
7,"_","_","_","candana","NC","","_","_"
8,"_","_","_","as","V","as","_","_"
9,"_","_","_","tu","CCD","","_","_"
10,"_","_","_","sitā","NC","","_","_"
11,"_","_","_","jala","NC","","_","_"
1,"nasyaṃ","_","_","nasya","NC","","_","_"
2,"_","_","_","tathā","CX","","_","_"
3,"_","_","_","āmra","NC","","_","_"
4,"_","_","_","asthi","NC","","_","_"
5,"_","_","_","rasa","NC","","_","_"
6,"samaṅgā","_","_","samaṅgā","NC","","_","_"
7,"_","_","_","sa_saha","CX","","_","_"
8,"_","_","_","dhātakī","NC","","_","_"
9,"_","_","_","moca","NC","","_","_"
10,"_","_","_","rasa","NC","","_","_"
11,"_","_","_","sa_saha","CX","","_","_"
12,"_","_","_","lodhra","NC","","_","_"
1,"_","_","_","drākṣā","NC","","_","_"
2,"_","_","_","rasa","NC","","_","_"
3,"_","_","_","ikṣurasa","NC","","_","_"
4,"nasyaṃ","_","_","nasya","NC","","_","_"
5,"kṣīrasya","_","_","kṣīra","NC","","_","_"
6,"_","_","_","dūrvā","NC","","_","_"
7,"_","_","_","svarasa","NC","","_","_"
8,"_","_","_","ca","CCD","","_","_"
9,"_","_","_","eva","CEM","","_","_"
1,"_","_","_","yavāsa","NC","","_","_"
2,"_","_","_","mūla","NC","","_","_"
3,"_","_","_","palāṇḍu","NC","","_","_"
4,"_","_","_","mūla","NC","","_","_"
5,"nasyaṃ","_","_","nasya","NC","","_","_"
6,"tathā","_","_","tathā","CX","","_","_"
7,"_","_","_","dāḍima","NC","","_","_"
8,"_","_","_","puṣpa","NC","","_","_"
9,"_","_","_","toya","NC","","_","_"
1,"_","_","_","priyāla","NC","","_","_"
2,"_","_","_","taila","NC","","_","_"
3,"madhukaṃ","_","_","madhuka","NC","","_","_"
4,"_","_","_","payas","NC","","_","_"
5,"_","_","_","ca","CCD","","_","_"
6,"siddhaṃ","_","_","sidh","PPP","","_","_"
7,"ghṛtaṃ","_","_","ghṛta","NC","","_","_"
8,"māhiṣam","_","_","māhiṣa","JJ","","_","_"
9,"ājikaṃ","_","_","ājika","JJ","","_","_"
10,"vā","_","_","vā","CCD","","_","_"
1,"_","_","_","āmra","NC","","_","_"
2,"_","_","_","asthi","NC","","_","_"
3,"_","_","_","pūrva","PPX","","_","_"
4,"payasā","_","_","payas","NC","","_","_"
5,"ca","_","_","ca","CCD","","_","_"
6,"nasyaṃ","_","_","nasya","NC","","_","_"
7,"_","_","_","sa_saha","CX","","_","_"
8,"_","_","_","sārivā","NC","","_","_"
9,"syāt","_","_","as","V","as","_","_"
10,"_","_","_","kamala","NC","","_","_"
11,"_","_","_","utpala","NC","","_","_"
12,"_","_","_","ca","CCD","","_","_"
1,"bhadraśriyaṃ","_","_","bhadraśriya","NC","","_","_"
2,"lohitacandanaṃ","_","_","lohitacandana","NC","","_","_"
3,"ca","_","_","ca","CCD","","_","_"
4,"prapauṇḍarīkaṃ","_","_","prapauṇḍarīka","NC","","_","_"
5,"_","_","_","kamala","NC","","_","_"
6,"_","_","_","utpala","NC","","_","_"
7,"ca","_","_","ca","CCD","","_","_"
1,"_","_","_","uśīra","NC","","_","_"
2,"_","_","_","vānīra","NC","","_","_"
3,"_","_","_","jala","NC","","_","_"
4,"mṛṇālaṃ","_","_","mṛṇāla","NC","","_","_"
5,"sahasravīryā","_","_","sahasravīryā","NC","","_","_"
6,"madhukaṃ","_","_","madhuka","NC","","_","_"
7,"payasyā","_","_","payasyā","NC","","_","_"
1,"_","_","_","śāli","NC","","_","_"
2,"_","_","_","ikṣu","NC","","_","_"
3,"_","_","_","mūla","NC","","_","_"
4,"_","_","_","yavāsa","NC","","_","_"
5,"_","_","_","gundrā","NC","","_","_"
6,"_","_","_","mūla","NC","","_","_"
7,"nalānāṃ","_","_","nala","NC","","_","_"
8,"_","_","_","kuśa","NC","","_","_"
9,"_","_","_","kāśa","NC","","_","_"
10,"_","_","_","ca","CCD","","_","_"
1,"kucandanaṃ","_","_","kucandana","NC","","_","_"
2,"_","_","_","śaivala","NC","","_","_"
3,"_","_","_","api","CX","","_","_"
4,"_","_","_","anantā","NC","","_","_"
5,"kālānusāryā","_","_","kālānusāryā","NC","","_","_"
6,"_","_","_","tṛṇamūla","NC","","_","_"
7,"_","_","_","ṛddhi","NC","","_","_"
1,"mūlāni","_","_","mūla","NC","","_","_"
2,"puṣpāṇi","_","_","puṣpa","NC","","_","_"
3,"ca","_","_","ca","CCD","","_","_"
4,"_","_","_","vāri","NC","","_","_"
5,"_","_","_","ja","JJ","","_","_"
6,"pralepanaṃ","_","_","pralepana","NC","","_","_"
7,"_","_","_","puṣkariṇī","NC","","_","_"
8,"_","_","_","mṛd","NC","","_","_"
9,"_","_","_","ca","CCD","","_","_"
1,"_","_","_","udumbara","NC","","_","_"
2,"_","_","_","aśvattha","NC","","_","_"
3,"_","_","_","madhūka","NC","","_","_"
4,"_","_","_","lodhra","NC","","_","_"
5,"_","_","_","kaṣāya","JJ","","_","_"
6,"_","_","_","vṛkṣa","NC","","_","_"
7,"_","_","_","śiśira","JJ","","_","_"
8,"_","_","_","ca","CCD","","_","_"
9,"sarve","_","_","sarva","JQ","","_","_"
1,"_","_","_","pradeha","NC","","_","_"
2,"_","_","_","kalpa","NC","","_","_"
3,"pariṣecane","_","_","pariṣecana","NC","","_","_"
4,"ca","_","_","ca","CCD","","_","_"
5,"_","_","_","tathā","CX","","_","_"
6,"_","_","_","avagāha","NC","","_","_"
7,"_","_","_","ghṛta","NC","","_","_"
8,"_","_","_","taila","NC","","_","_"
9,"_","_","_","siddhi","NC","","_","_"
1,"raktasya","_","_","rakta","NC","","_","_"
2,"pittasya","_","_","pitta","NC","","_","_"
3,"ca","_","_","ca","CCD","","_","_"
4,"_","_","_","śānti","NC","","_","_"
5,"_","_","_","iṣ","KDP","","_","_"
6,"_","_","_","bhadraśriya","NC","","_","_"
7,"_","_","_","ādi","NC","","_","_"
8,"bhiṣak","_","_","bhiṣaj","NC","","_","_"
9,"prayuñjyāt","_","_","prayuj","V","prayuj","_","_"
1,"dhārāgṛhaṃ","_","_","dhārāgṛha","NC","","_","_"
2,"bhūmigṛhaṃ","_","_","bhūmigṛha","NC","","_","_"
3,"_","_","_","su","CAD","","_","_"
4,"_","_","_","śīta","JJ","","_","_"
5,"vanaṃ","_","_","vana","NC","","_","_"
6,"ca","_","_","ca","CCD","","_","_"
7,"ramyaṃ","_","_","ramya","JJ","","_","_"
8,"_","_","_","jala","NC","","_","_"
9,"_","_","_","vāta","NC","","_","_"
10,"_","_","_","śīta","JJ","","_","_"
1,"_","_","_","vaiḍūrya","NC","","_","_"
2,"_","_","_","muktā","NC","","_","_"
3,"_","_","_","maṇi","NC","","_","_"
4,"_","_","_","bhājana","NC","","_","_"
5,"_","_","_","sparśa","NC","","_","_"
6,"_","_","_","ca","CCD","","_","_"
7,"dāhe","_","_","dāha","NC","","_","_"
8,"_","_","_","śiśira","JJ","","_","_"
9,"_","_","_","ambu","NC","","_","_"
10,"_","_","_","śīta","JJ","","_","_"
1,"patrāṇi","_","_","pattra","NC","","_","_"
2,"puṣpāṇi","_","_","puṣpa","NC","","_","_"
3,"ca","_","_","ca","CCD","","_","_"
4,"_","_","_","vāri","NC","","_","_"
5,"_","_","_","ja","JJ","","_","_"
6,"kṣaumaṃ","_","_","kṣauma","NC","","_","_"
7,"ca","_","_","ca","CCD","","_","_"
8,"śītaṃ","_","_","śīta","JJ","","_","_"
9,"_","_","_","kadala","NC","","_","_"
10,"_","_","_","dala","NC","","_","_"
1,"_","_","_","pracchādana","NC","","_","_"
2,"_","_","_","artha","NC","","_","_"
3,"_","_","_","śayana","NC","","_","_"
4,"_","_","_","āsana","NC","","_","_"
5,"_","_","_","padma","NC","","_","_"
6,"_","_","_","utpala","NC","","_","_"
7,"ca","_","_","ca","CCD","","_","_"
8,"dalāḥ","_","_","dala","NC","","_","_"
9,"praśastāḥ","_","_","praśaṃs","PPP","","_","_"
1,"_","_","_","priyaṅgukā","NC","","_","_"
2,"_","_","_","candana","NC","","_","_"
3,"_","_","_","rūṣita","JJ","","_","_"
4,"sparśāḥ","_","_","sparśa","NC","","_","_"
5,"priyāṇāṃ","_","_","priya","JJ","","_","_"
6,"ca","_","_","ca","CCD","","_","_"
7,"_","_","_","vara","JJ","","_","_"
8,"_","_","_","aṅganā","NC","","_","_"
1,"dāhe","_","_","dāha","NC","","_","_"
2,"praśastāḥ","_","_","praśaṃs","PPP","","_","_"
3,"_","_","_","sa_saha","CX","","_","_"
4,"_","_","_","jala","NC","","_","_"
5,"_","_","_","su","CAD","","_","_"
6,"_","_","_","śīta","JJ","","_","_"
7,"_","_","_","padma","NC","","_","_"
8,"_","_","_","utpala","NC","","_","_"
9,"ca","_","_","ca","CCD","","_","_"
10,"_","_","_","kalāpa","NC","","_","_"
11,"_","_","_","vāta","NC","","_","_"
1,"_","_","_","sarit","NC","","_","_"
2,"_","_","_","hrada","NC","","_","_"
3,"_","_","_","himavat","NC","","_","_"
4,"_","_","_","darī","NC","","_","_"
5,"_","_","_","candra","NC","","_","_"
6,"_","_","_","udaya","NC","","_","_"
7,"_","_","_","kamala","NC","","_","_"
8,"_","_","_","ākara","NC","","_","_"
1,"_","_","_","manas","NC","","_","_"
2,"_","_","_","anukūla","JJ","","_","_"
3,"_","_","_","śiśira","JJ","","_","_"
4,"_","_","_","ca","CCD","","_","_"
5,"sarvāḥ","_","_","sarva","JQ","","_","_"
6,"kathāḥ","_","_","kathā","NC","","_","_"
7,"_","_","_","sa_saha","CX","","_","_"
8,"_","_","_","rakta","NC","","_","_"
9,"śamayanti","_","_","śam","V","śam","_","_"
10,"pittam","_","_","pitta","NC","","_","_"
1,"tatra","_","_","tatra","CAD","","_","_"
2,"ślokau","_","_","śloka","NC","","_","_"
1,"hetuṃ","_","_","hetu","NC","","_","_"
2,"vṛddhiṃ","_","_","vṛddhi","NC","","_","_"
3,"saṃjñāṃ","_","_","saṃjñā","NC","","_","_"
4,"sthānaṃ","_","_","sthāna","NC","","_","_"
5,"liṅgaṃ","_","_","liṅga","NC","","_","_"
6,"pṛthak","_","_","pṛthak","CX","","_","_"
7,"praduṣṭasya","_","_","praduṣ","PPP","","_","_"
1,"mārgau","_","_","mārga","NC","","_","_"
2,"_","_","_","sādhay","KDG","","_","_"
3,"_","_","_","asādhya","JJ","","_","_"
4,"yāpyaṃ","_","_","yāpay","KDG","","_","_"
5,"_","_","_","kārya","NC","","_","_"
6,"_","_","_","krama","NC","","_","_"
7,"_","_","_","ca","CCD","","_","_"
8,"_","_","_","eva","CEM","","_","_"
1,"_","_","_","pāna","NC","","_","_"
2,"_","_","_","anna","NC","","_","_"
3,"_","_","_","iṣ","PPP","","_","_"
4,"_","_","_","eva","CEM","","_","_"
5,"ca","_","_","ca","CCD","","_","_"
6,"varjyaṃ","_","_","varjay","KDG","","_","_"
7,"saṃśodhanaṃ","_","_","saṃśodhana","NC","","_","_"
8,"ca","_","_","ca","CCD","","_","_"
9,"śamanaṃ","_","_","śamana","NC","","_","_"
10,"ca","_","_","ca","CCD","","_","_"
1,"_","_","_","guru","NC","","_","_"
2,"_","_","_","vac","KDP","","_","_"
3,"_","_","_","yathāvat","CX","","_","_"
4,"_","_","_","cikitsita","NC","","_","_"
5,"raktapittasya","_","_","raktapitta","NC","","_","_"
