"WordID","word","NormSTEM","suffix","lemma","PoS","Root","NormSuffix","NormWord"
1,"mā","_","_","mā","CNG","","_","_"
2,"cid","_","_","cit","CEM","","_","_"
3,"anyad","_","_","anya","PPX","","_","_"
4,"vi","_","_","vi","CADP","","_","_"
5,"śaṃsata","_","_","śaṃs","V","śaṃs","_","_"
6,"sakhāyo","_","_","sakhi","NC","","_","_"
7,"mā","_","_","mā","CNG","","_","_"
8,"riṣaṇyata","_","_","riṣaṇy","V","riṣaṇy","_","_"
1,"indram","_","_","indra","NC","","_","_"
2,"it","_","_","id","CEM","","_","_"
3,"stotā","_","_","stu","V","stu","_","_"
4,"vṛṣaṇaṃ","_","_","vṛṣan","NC","","_","_"
5,"sacā","_","_","sacā","CX","","_","_"
6,"sute","_","_","su","PPP","","_","_"
7,"muhur","_","_","muhur","CX","","_","_"
8,"ukthā","_","_","uktha","NC","","_","_"
9,"ca","_","_","ca","CCD","","_","_"
10,"śaṃsata","_","_","śaṃs","V","śaṃs","_","_"
1,"avakrakṣiṇaṃ","_","_","avakrakṣin","JJ","","_","_"
2,"vṛṣabhaṃ","_","_","vṛṣabha","NC","","_","_"
3,"_","_","_","yathā","CCM","","_","_"
4,"_","_","_","ajur","JJ","","_","_"
5,"gāṃ","_","_","go","NC","","_","_"
6,"na","_","_","na","CNG","","_","_"
7,"carṣaṇīsaham","_","_","carṣaṇīsah","JJ","","_","_"
1,"vidveṣaṇaṃ","_","_","vidveṣaṇa","JJ","","_","_"
2,"_","_","_","saṃvanana","NC","","_","_"
3,"_","_","_","ubhayaṃkara","JJ","","_","_"
4,"maṃhiṣṭham","_","_","maṃhiṣṭha","JJ","","_","_"
5,"ubhayāvinam","_","_","ubhayāvin","JJ","","_","_"
1,"yac","_","_","yat","CSB","","_","_"
2,"_","_","_","cit","CEM","","_","_"
3,"_","_","_","hi","CX","","_","_"
4,"tvā","_","_","tvat","PPR","","_","_"
5,"janā","_","_","jana","NC","","_","_"
6,"ime","_","_","ida","PRD","","_","_"
7,"nānā","_","_","nānā","CX","","_","_"
8,"havanta","_","_","hvā","V","hvā","_","_"
9,"ūtaye","_","_","ūti","NC","","_","_"
1,"asmākam","_","_","mat","PPR","","_","_"
2,"_","_","_","brahman","NC","","_","_"
3,"_","_","_","ida","PRD","","_","_"
4,"indra","_","_","indra","NC","","_","_"
5,"bhūtu","_","_","bhav","V","bhū","_","_"
6,"te","_","_","tvat","PPR","","_","_"
7,"'hā","_","_","aha","NC","","_","_"
8,"viśvā","_","_","viśva","JQ","","_","_"
9,"ca","_","_","ca","CCD","","_","_"
10,"vardhanam","_","_","vardhana","NC","","_","_"
1,"vi","_","_","vi","CADP","","_","_"
2,"tartūryante","_","_","tartar","V","tartar","_","_"
3,"maghavan","_","_","maghavan","NC","","_","_"
4,"vipaścito","_","_","vipaścit","JJ","","_","_"
5,"'ryo","_","_","ari","JJ","","_","_"
6,"vipo","_","_","vip","NC","","_","_"
7,"janānām","_","_","jana","NC","","_","_"
1,"upa","_","_","upa","CADP","","_","_"
2,"kramasva","_","_","kram","V","kram","_","_"
3,"_","_","_","puru","JJ","","_","_"
4,"_","_","_","rūpa","NC","","_","_"
5,"ā","_","_","ā","CADP","","_","_"
6,"bhara","_","_","bhṛ","V","bhṛ","_","_"
7,"vājaṃ","_","_","vāja","NC","","_","_"
8,"nediṣṭham","_","_","nediṣṭha","JJ","","_","_"
9,"ūtaye","_","_","ūti","NC","","_","_"
1,"mahe","_","_","mah","JJ","","_","_"
2,"cana","_","_","cana","CX","","_","_"
3,"tvām","_","_","tvat","PPR","","_","_"
4,"adrivaḥ","_","_","adrivat","JJ","","_","_"
5,"parā","_","_","parā","CADP","","_","_"
6,"śulkāya","_","_","śulka","NC","","_","_"
7,"deyām","_","_","dad","V","dā","_","_"
1,"na","_","_","na","CNG","","_","_"
2,"sahasrāya","_","_","sahasra","NUM","","_","_"
3,"_","_","_","na","CNG","","_","_"
4,"_","_","_","ayuta","NC","","_","_"
5,"vajrivo","_","_","vajrivat","JJ","","_","_"
6,"na","_","_","na","CNG","","_","_"
7,"śatāya","_","_","śata","NUM","","_","_"
8,"śatāmagha","_","_","śatāmagha","JJ","","_","_"
1,"vasyāṁ","_","_","vasyas","JJ","","_","_"
2,"_","_","_","indra","NC","","_","_"
3,"_","_","_","as","V","as","_","_"
4,"me","_","_","mat","PPR","","_","_"
5,"pitur","_","_","pitṛ","NC","","_","_"
6,"uta","_","_","uta","CCD","","_","_"
7,"bhrātur","_","_","bhrātṛ","NC","","_","_"
8,"_","_","_","a","CNG","","_","_"
9,"_","_","_","bhuj","KDP","","_","_"
1,"mātā","_","_","mātṛ","NC","","_","_"
2,"ca","_","_","ca","CCD","","_","_"
3,"me","_","_","mat","PPR","","_","_"
4,"chadayathaḥ","_","_","chaday","V","chaday","_","_"
5,"samā","_","_","sama","PPX","","_","_"
6,"vaso","_","_","vasu","JJ","","_","_"
7,"vasutvanāya","_","_","vasutvana","NC","","_","_"
8,"rādhase","_","_","rādhas","NC","","_","_"
1,"_","_","_","kva","CX","","_","_"
2,"_","_","_","e","V","i","_","_"
3,"_","_","_","kva","CX","","_","_"
4,"_","_","_","id","CEM","","_","_"
5,"asi","_","_","as","V","as","_","_"
6,"purutrā","_","_","purutrā","CX","","_","_"
7,"_","_","_","cit","CEM","","_","_"
8,"_","_","_","hi","CX","","_","_"
9,"te","_","_","tvat","PPR","","_","_"
10,"manaḥ","_","_","manas","NC","","_","_"
1,"alarṣi","_","_","alar","V","alar","_","_"
2,"yudhma","_","_","yudhma","NC","","_","_"
3,"_","_","_","khaja","NC","","_","_"
4,"_","_","_","kṛt","JJ","","_","_"
5,"purandara","_","_","puraṃdara","NC","","_","_"
6,"pra","_","_","pra","CADP","","_","_"
7,"gāyatrā","_","_","gāyatra","NC","","_","_"
8,"agāsiṣuḥ","_","_","gā","V","gā","_","_"
1,"_","_","_","pra","CADP","","_","_"
2,"_","_","_","ida","PRD","","_","_"
3,"gāyatram","_","_","gāyatra","NC","","_","_"
4,"arcata","_","_","arc","V","arc","_","_"
5,"vāvātur","_","_","vāvātṛ","NC","","_","_"
6,"yaḥ","_","_","yad","PRL","","_","_"
7,"purandaraḥ","_","_","puraṃdara","NC","","_","_"
1,"yābhiḥ","_","_","yad","PRL","","_","_"
2,"_","_","_","kāṇva","NC","","_","_"
3,"_","_","_","upa","CADP","","_","_"
4,"barhir","_","_","barhis","NC","","_","_"
5,"āsadaṃ","_","_","āsad","CGDI","","_","_"
6,"yāsad","_","_","yā","V","yā","_","_"
7,"vajrī","_","_","vajrin","NC","","_","_"
8,"bhinat","_","_","bhid","V","bhid","_","_"
9,"puraḥ","_","_","pur","NC","","_","_"
1,"ye","_","_","yad","PRL","","_","_"
2,"te","_","_","tvat","PPR","","_","_"
3,"santi","_","_","as","V","as","_","_"
4,"daśagvinaḥ","_","_","daśagvin","JJ","","_","_"
5,"śatino","_","_","śatin","JJ","","_","_"
6,"ye","_","_","yad","PRL","","_","_"
7,"sahasriṇaḥ","_","_","sahasrin","JJ","","_","_"
1,"aśvāso","_","_","aśva","NC","","_","_"
2,"ye","_","_","yad","PRL","","_","_"
3,"te","_","_","tvat","PPR","","_","_"
4,"vṛṣaṇo","_","_","vṛṣan","NC","","_","_"
5,"raghudruvas","_","_","raghudru","JJ","","_","_"
6,"tebhir","_","_","tad","PRD","","_","_"
7,"nas","_","_","mat","PPR","","_","_"
8,"tūyam","_","_","tūya","JJ","","_","_"
9,"ā","_","_","ā","CADP","","_","_"
10,"gahi","_","_","ga","V","ga","_","_"
1,"ā","_","_","ā","CADP","","_","_"
2,"tv","_","_","tu","CCD","","_","_"
3,"adya","_","_","adya","CX","","_","_"
4,"sabardughāṃ","_","_","sabardugha","JJ","","_","_"
5,"huve","_","_","hvā","V","hvā","_","_"
6,"_","_","_","gāyatra","NC","","_","_"
7,"_","_","_","vepas","NC","","_","_"
1,"indraṃ","_","_","indra","NC","","_","_"
2,"dhenuṃ","_","_","dhenu","NC","","_","_"
3,"_","_","_","su","CAD","","_","_"
4,"_","_","_","dugha","JJ","","_","_"
5,"anyām","_","_","anya","PPX","","_","_"
6,"iṣam","_","_","iṣ","NC","","_","_"
7,"_","_","_","uru","JJ","","_","_"
8,"_","_","_","dhārā","NC","","_","_"
9,"araṅkṛtam","_","_","araṃkṛt","JJ","","_","_"
1,"yat","_","_","yat","CSB","","_","_"
2,"tudat","_","_","tud","V","tud","_","_"
3,"sūra","_","_","svar","NC","","_","_"
4,"etaśaṃ","_","_","etaśa","NC","","_","_"
5,"vaṅkū","_","_","vaṅku","JJ","","_","_"
6,"vātasya","_","_","vāta","NC","","_","_"
7,"parṇinā","_","_","parṇin","JJ","","_","_"
1,"vahat","_","_","vah","V","vah","_","_"
2,"kutsam","_","_","kutsa","NC","","_","_"
3,"ārjuneyaṃ","_","_","ārjuneya","NC","","_","_"
4,"śatakratuḥ","_","_","śatakratu","NC","","_","_"
5,"tsarad","_","_","tsar","V","tsar","_","_"
6,"gandharvam","_","_","gandharva","NC","","_","_"
7,"astṛtam","_","_","astṛta","JJ","","_","_"
1,"ya","_","_","yad","PRL","","_","_"
2,"ṛte","_","_","ṛte","CX","","_","_"
3,"cid","_","_","cit","CEM","","_","_"
4,"abhiśriṣaḥ","_","_","abhiśriṣ","NC","","_","_"
5,"purā","_","_","purā","CX","","_","_"
6,"jatrubhya","_","_","jatru","NC","","_","_"
7,"ātṛdaḥ","_","_","ātṛd","CGDI","","_","_"
1,"saṃdhātā","_","_","saṃdhātṛ","JJ","","_","_"
2,"saṃdhim","_","_","saṃdhi","NC","","_","_"
3,"maghavā","_","_","maghavan","JJ","","_","_"
4,"purūvasur","_","_","purūvasu","JJ","","_","_"
5,"iṣkartā","_","_","iṣkartṛ","JJ","","_","_"
6,"vihrutam","_","_","vihruta","JJ","","_","_"
7,"punaḥ","_","_","punar","CAD","","_","_"
1,"mā","_","_","mā","CNG","","_","_"
2,"bhūma","_","_","bhav","V","bhū","_","_"
3,"niṣṭyā","_","_","niṣṭya","JJ","","_","_"
4,"_","_","_","iva","CCM","","_","_"
5,"_","_","_","indra","NC","","_","_"
6,"tvad","_","_","tvat","PPR","","_","_"
7,"araṇā","_","_","araṇa","JJ","","_","_"
8,"iva","_","_","iva","CCM","","_","_"
1,"vanāni","_","_","vana","NC","","_","_"
2,"na","_","_","na","CNG","","_","_"
3,"prajahitāny","_","_","prahā","PPP","","_","_"
4,"adrivo","_","_","adrivat","JJ","","_","_"
5,"duroṣāso","_","_","duroṣa","JJ","","_","_"
6,"amanmahi","_","_","man","V","man","_","_"
1,"_","_","_","man","V","man","_","_"
2,"_","_","_","id","CEM","","_","_"
3,"anāśavo","_","_","anāśu","JJ","","_","_"
4,"'nugrāsaś","_","_","anugra","JJ","","_","_"
5,"ca","_","_","ca","CCD","","_","_"
6,"vṛtrahan","_","_","vṛtrahan","NC","","_","_"
1,"sakṛt","_","_","sakṛt","CX","","_","_"
2,"su","_","_","su","CAD","","_","_"
3,"te","_","_","tvat","PPR","","_","_"
4,"mahatā","_","_","mahat","JJ","","_","_"
5,"śūra","_","_","śūra","NC","","_","_"
6,"rādhasā","_","_","rādhas","NC","","_","_"
7,"anu","_","_","anu","CADP","","_","_"
8,"stomam","_","_","stoma","NC","","_","_"
9,"mudīmahi","_","_","mod","V","mud","_","_"
1,"yadi","_","_","yadi","CSB","","_","_"
2,"stomam","_","_","stoma","NC","","_","_"
3,"mama","_","_","mat","PPR","","_","_"
4,"śravad","_","_","śṛṇ","V","śru","_","_"
5,"asmākam","_","_","mat","PPR","","_","_"
6,"indram","_","_","indra","NC","","_","_"
7,"indavaḥ","_","_","indu","NC","","_","_"
1,"tiraḥ","_","_","tiras","CX","","_","_"
2,"pavitraṃ","_","_","pavitra","NC","","_","_"
3,"sasṛvāṃsa","_","_","sṛ","KDP","","_","_"
4,"āśavo","_","_","āśu","JJ","","_","_"
5,"mandantu","_","_","mat","V","mat","_","_"
6,"tugryāvṛdhaḥ","_","_","tugryāvṛdh","JJ","","_","_"
1,"ā","_","_","ā","CADP","","_","_"
2,"tv","_","_","tu","CCD","","_","_"
3,"adya","_","_","adya","CX","","_","_"
4,"sadhastutiṃ","_","_","sadhastuti","NC","","_","_"
5,"vāvātuḥ","_","_","vāvātṛ","NC","","_","_"
6,"sakhyur","_","_","sakhi","NC","","_","_"
7,"ā","_","_","ā","CADP","","_","_"
8,"gahi","_","_","ga","V","ga","_","_"
1,"upastutir","_","_","upastuti","NC","","_","_"
2,"maghonām","_","_","maghavan","JJ","","_","_"
3,"pra","_","_","pra","CADP","","_","_"
4,"_","_","_","tvat","PPR","","_","_"
5,"_","_","_","av","V","av","_","_"
6,"adhā","_","_","adha","CX","","_","_"
7,"te","_","_","tvat","PPR","","_","_"
8,"vaśmi","_","_","vaś","V","vaś","_","_"
9,"suṣṭutim","_","_","suṣṭuti","NC","","_","_"
1,"sotā","_","_","su","V","su","_","_"
2,"hi","_","_","hi","CX","","_","_"
3,"somam","_","_","soma","NC","","_","_"
4,"adribhir","_","_","adri","NC","","_","_"
5,"_","_","_","ā","CADP","","_","_"
6,"_","_","_","īṃ","CX","","_","_"
7,"enam","_","_","a","PRD","","_","_"
8,"apsu","_","_","ap","NC","","_","_"
9,"dhāvata","_","_","dhāv","V","dhāv","_","_"
1,"gavyā","_","_","gavya","JJ","","_","_"
2,"_","_","_","vastra","NC","","_","_"
3,"_","_","_","iva","CCM","","_","_"
4,"vāsayanta","_","_","vāsay","KDP","","_","_"
5,"in","_","_","id","CEM","","_","_"
6,"naro","_","_","nṛ","NC","","_","_"
7,"nir","_","_","niḥ","CADP","","_","_"
8,"dhukṣan","_","_","duh","V","duh","_","_"
9,"vakṣaṇābhyaḥ","_","_","vakṣaṇā","NC","","_","_"
1,"adha","_","_","adha","CX","","_","_"
2,"jmo","_","_","jm","NC","","_","_"
3,"adha","_","_","adha","CX","","_","_"
4,"vā","_","_","vā","CCD","","_","_"
5,"divo","_","_","div","NC","","_","_"
6,"bṛhato","_","_","bṛhat","JJ","","_","_"
7,"rocanād","_","_","rocana","NC","","_","_"
8,"adhi","_","_","adhi","CADP","","_","_"
1,"ayā","_","_","ida","PRD","","_","_"
2,"vardhasva","_","_","vṛdh","V","vṛdh","_","_"
3,"tanvā","_","_","tanu","NC","","_","_"
4,"girā","_","_","giri","NC","","_","_"
5,"mamā","_","_","mat","PPR","","_","_"
6,"jātā","_","_","jāta","NC","","_","_"
7,"_","_","_","su","CAD","","_","_"
8,"_","_","_","kratu","NC","","_","_"
9,"pṛṇa","_","_","pṛṇ","V","pṛṇ","_","_"
1,"indrāya","_","_","indra","NC","","_","_"
2,"su","_","_","su","CAD","","_","_"
3,"madintamaṃ","_","_","madintama","JJ","","_","_"
4,"somaṃ","_","_","soma","NC","","_","_"
5,"sotā","_","_","su","V","su","_","_"
6,"vareṇyam","_","_","vareṇya","JJ","","_","_"
1,"śakra","_","_","śakra","NC","","_","_"
2,"eṇam","_","_","eṇa","NC","","_","_"
3,"pīpayad","_","_","pyā","V","pyā","_","_"
4,"viśvayā","_","_","viśva","JQ","","_","_"
5,"dhiyā","_","_","dhī","NC","","_","_"
6,"hinvānaṃ","_","_","hi","KDP","","_","_"
7,"na","_","_","na","CNG","","_","_"
8,"vājayum","_","_","vājayu","JJ","","_","_"
1,"mā","_","_","mā","CNG","","_","_"
2,"tvā","_","_","tvat","PPR","","_","_"
3,"somasya","_","_","soma","NC","","_","_"
4,"galdayā","_","_","galda","NC","","_","_"
5,"sadā","_","_","sadā","CAD","","_","_"
6,"yācann","_","_","yāc","KDP","","_","_"
7,"ahaṃ","_","_","mat","PPR","","_","_"
8,"girā","_","_","giri","NC","","_","_"
1,"bhūrṇim","_","_","bhūrṇi","JJ","","_","_"
2,"mṛgaṃ","_","_","mṛga","NC","","_","_"
3,"na","_","_","na","CNG","","_","_"
4,"savaneṣu","_","_","savana","NC","","_","_"
5,"cukrudhaṃ","_","_","krudhy","V","krudh","_","_"
6,"ka","_","_","kiṃ","PRQ","","_","_"
7,"īśānaṃ","_","_","īśāna","JJ","","_","_"
8,"na","_","_","na","CNG","","_","_"
9,"yāciṣat","_","_","yāc","V","yāc","_","_"
1,"_","_","_","mada","NC","","_","_"
2,"_","_","_","iṣay","PPP","","_","_"
3,"madam","_","_","mada","NC","","_","_"
4,"ugram","_","_","ugra","JJ","","_","_"
5,"ugreṇa","_","_","ugra","JJ","","_","_"
6,"śavasā","_","_","śavas","NC","","_","_"
1,"viśveṣāṃ","_","_","viśva","JQ","","_","_"
2,"tarutāram","_","_","tarutṛ","JJ","","_","_"
3,"madacyutam","_","_","madacyut","JJ","","_","_"
4,"made","_","_","mada","NC","","_","_"
5,"hi","_","_","hi","CX","","_","_"
6,"ṣmā","_","_","sma","CX","","_","_"
7,"dadāti","_","_","dad","V","dā","_","_"
8,"naḥ","_","_","mat","PPR","","_","_"
1,"śevāre","_","_","śevāra","NC","","_","_"
2,"vāryā","_","_","vārya","NC","","_","_"
3,"puru","_","_","puru","JJ","","_","_"
4,"devo","_","_","deva","NC","","_","_"
5,"martāya","_","_","marta","NC","","_","_"
6,"dāśuṣe","_","_","dāś","KDP","","_","_"
1,"sa","_","_","tad","PRD","","_","_"
2,"sunvate","_","_","su","KDP","","_","_"
3,"ca","_","_","ca","CCD","","_","_"
4,"stuvate","_","_","stu","KDP","","_","_"
5,"ca","_","_","ca","CCD","","_","_"
6,"rāsate","_","_","rā","V","rā","_","_"
7,"_","_","_","viśva","JQ","","_","_"
8,"_","_","_","gur","PPP","","_","_"
9,"ariṣṭutaḥ","_","_","ariṣṭuta","JJ","","_","_"
1,"_","_","_","ā","CADP","","_","_"
2,"_","_","_","indra","NC","","_","_"
3,"yāhi","_","_","yā","V","yā","_","_"
4,"matsva","_","_","mat","V","mat","_","_"
5,"citreṇa","_","_","citra","JJ","","_","_"
6,"deva","_","_","deva","NC","","_","_"
7,"rādhasā","_","_","rādhas","NC","","_","_"
1,"saro","_","_","saras","NC","","_","_"
2,"na","_","_","na","CNG","","_","_"
3,"prāsy","_","_","prā","V","prā","_","_"
4,"udaraṃ","_","_","udara","NC","","_","_"
5,"_","_","_","sa_saha","CX","","_","_"
6,"_","_","_","pīti","NC","","_","_"
7,"ā","_","_","ā","CADP","","_","_"
8,"somebhir","_","_","soma","NC","","_","_"
9,"uru","_","_","uru","JJ","","_","_"
10,"sphiram","_","_","sphira","JJ","","_","_"
1,"ā","_","_","ā","CADP","","_","_"
2,"tvā","_","_","tvat","PPR","","_","_"
3,"sahasram","_","_","sahasra","NUM","","_","_"
4,"ā","_","_","ā","CADP","","_","_"
5,"śataṃ","_","_","śata","NUM","","_","_"
6,"yuktā","_","_","yuj","PPP","","_","_"
7,"rathe","_","_","ratha","NC","","_","_"
8,"hiraṇyaye","_","_","hiraṇyaya","JJ","","_","_"
1,"_","_","_","brahman","NC","","_","_"
2,"_","_","_","yuj","JJ","","_","_"
3,"haraya","_","_","hari","NC","","_","_"
4,"indra","_","_","indra","NC","","_","_"
5,"keśino","_","_","keśin","JJ","","_","_"
6,"vahantu","_","_","vah","V","vah","_","_"
7,"_","_","_","soma","NC","","_","_"
8,"_","_","_","pīti","NC","","_","_"
1,"ā","_","_","ā","CADP","","_","_"
2,"tvā","_","_","tvat","PPR","","_","_"
3,"rathe","_","_","ratha","NC","","_","_"
4,"hiraṇyaye","_","_","hiraṇyaya","JJ","","_","_"
5,"harī","_","_","hari","NC","","_","_"
6,"_","_","_","mayūra","NC","","_","_"
7,"_","_","_","śepyā","NC","","_","_"
1,"_","_","_","śiti","JJ","","_","_"
2,"_","_","_","pṛṣṭha","NC","","_","_"
3,"vahatām","_","_","vah","V","vah","_","_"
4,"madhvo","_","_","madhu","NC","","_","_"
5,"andhaso","_","_","andhas","NC","","_","_"
6,"vivakṣaṇasya","_","_","vivakṣaṇa","JJ","","_","_"
7,"pītaye","_","_","pā","CGDI","","_","_"
1,"pibā","_","_","pib","V","pā","_","_"
2,"tv","_","_","tu","CCD","","_","_"
3,"asya","_","_","ida","PRD","","_","_"
4,"girvaṇaḥ","_","_","girvaṇas","JJ","","_","_"
5,"sutasya","_","_","su","PPP","","_","_"
6,"_","_","_","pūrva","PPX","","_","_"
7,"_","_","_","pā","JJ","","_","_"
8,"iva","_","_","iva","CCM","","_","_"
1,"pariṣkṛtasya","_","_","pariṣkṛ","PPP","","_","_"
2,"rasina","_","_","rasin","JJ","","_","_"
3,"iyam","_","_","ida","PRD","","_","_"
4,"āsutiś","_","_","āsuti","NC","","_","_"
5,"cārur","_","_","cāru","JJ","","_","_"
6,"madāya","_","_","mada","NC","","_","_"
7,"patyate","_","_","paty","V","paty","_","_"
1,"ya","_","_","yad","PRL","","_","_"
2,"eko","_","_","eka","PPX","","_","_"
3,"asti","_","_","as","V","as","_","_"
4,"daṃsanā","_","_","daṃsanā","NC","","_","_"
5,"mahāṁ","_","_","mahat","JJ","","_","_"
6,"ugro","_","_","ugra","JJ","","_","_"
7,"abhi","_","_","abhi","CADP","","_","_"
8,"vrataiḥ","_","_","vrata","NC","","_","_"
1,"gamat","_","_","gacch","V","gam","_","_"
2,"sa","_","_","tad","PRD","","_","_"
3,"śiprī","_","_","śiprin","JJ","","_","_"
4,"na","_","_","na","CNG","","_","_"
5,"sa","_","_","tad","PRD","","_","_"
6,"yoṣad","_","_","yu","V","yu","_","_"
7,"ā","_","_","ā","CADP","","_","_"
8,"gamad","_","_","gacch","V","gam","_","_"
9,"dhavaṃ","_","_","hava","NC","","_","_"
10,"na","_","_","na","CNG","","_","_"
11,"pari","_","_","pari","CADP","","_","_"
12,"varjati","_","_","vṛj","V","vṛj","_","_"
1,"tvam","_","_","tvat","PPR","","_","_"
2,"puraṃ","_","_","pur","NC","","_","_"
3,"cariṣṇvaṃ","_","_","cariṣṇu","JJ","","_","_"
4,"vadhaiḥ","_","_","vadha","NC","","_","_"
5,"śuṣṇasya","_","_","śuṣṇa","NC","","_","_"
6,"sam","_","_","sa","CADP","","_","_"
7,"piṇak","_","_","piṣ","V","piṣ","_","_"
1,"tvam","_","_","tvat","PPR","","_","_"
2,"bhā","_","_","bhās","NC","","_","_"
3,"anu","_","_","anu","CADP","","_","_"
4,"_","_","_","car","V","car","_","_"
5,"_","_","_","u","CEM","","_","_"
6,"adha","_","_","adha","CX","","_","_"
7,"dvitā","_","_","dvitā","CX","","_","_"
8,"yad","_","_","yat","CSB","","_","_"
9,"indra","_","_","indra","NC","","_","_"
10,"havyo","_","_","hu","KDG","","_","_"
11,"bhuvaḥ","_","_","bhav","V","bhū","_","_"
1,"mama","_","_","mat","PPR","","_","_"
2,"tvā","_","_","tvat","PPR","","_","_"
3,"sūra","_","_","sūra","NC","","_","_"
4,"udite","_","_","udi","PPP","","_","_"
5,"mama","_","_","mat","PPR","","_","_"
6,"madhyandine","_","_","madhyaṃdina","NC","","_","_"
7,"divaḥ","_","_","div","NC","","_","_"
1,"mama","_","_","mat","PPR","","_","_"
2,"prapitve","_","_","prapitva","NC","","_","_"
3,"apiśarvare","_","_","apiśarvara","NC","","_","_"
4,"vasav","_","_","vasu","JJ","","_","_"
5,"ā","_","_","ā","CADP","","_","_"
6,"stomāso","_","_","stoma","NC","","_","_"
7,"avṛtsata","_","_","vṛdh","V","vṛdh","_","_"
1,"stuhi","_","_","stu","V","stu","_","_"
2,"_","_","_","stu","V","stu","_","_"
3,"_","_","_","id","CEM","","_","_"
4,"ete","_","_","tad","PRD","","_","_"
5,"ghā","_","_","gha","CX","","_","_"
6,"te","_","_","tad","PRD","","_","_"
7,"maṃhiṣṭhāso","_","_","maṃhiṣṭha","JJ","","_","_"
8,"maghonām","_","_","maghavan","JJ","","_","_"
1,"ninditāśvaḥ","_","_","ninditāśva","NC","","_","_"
2,"prapathī","_","_","prapathin","NC","","_","_"
3,"paramajyā","_","_","paramajyā","JJ","","_","_"
4,"maghasya","_","_","magha","NC","","_","_"
5,"medhyātithe","_","_","medhyātithi","NC","","_","_"
1,"ā","_","_","ā","CADP","","_","_"
2,"yad","_","_","yat","CSB","","_","_"
3,"aśvān","_","_","aśva","NC","","_","_"
4,"vananvataḥ","_","_","vananvat","JJ","","_","_"
5,"_","_","_","śraddhā","NC","","_","_"
6,"_","_","_","mat","PPR","","_","_"
7,"rathe","_","_","ratha","NC","","_","_"
8,"ruham","_","_","roh","V","ruh","_","_"
1,"uta","_","_","uta","CCD","","_","_"
2,"vāmasya","_","_","vāma","JJ","","_","_"
3,"vasunaś","_","_","vasu","NC","","_","_"
4,"ciketati","_","_","cit","V","cit","_","_"
5,"yo","_","_","yad","PRL","","_","_"
6,"asti","_","_","as","V","as","_","_"
7,"yādvaḥ","_","_","yādva","JJ","","_","_"
8,"paśuḥ","_","_","paśu","NC","","_","_"
1,"ya","_","_","yad","PRL","","_","_"
2,"ṛjrā","_","_","ṛjra","JJ","","_","_"
3,"mahyam","_","_","mat","PPR","","_","_"
4,"māmahe","_","_","mah","V","mah","_","_"
5,"saha","_","_","saha","CX","","_","_"
6,"tvacā","_","_","tvac","NC","","_","_"
7,"hiraṇyayā","_","_","hiraṇya","JJ","","_","_"
1,"eṣa","_","_","tad","PRD","","_","_"
2,"viśvāny","_","_","viśva","JQ","","_","_"
3,"abhy","_","_","abhi","CADP","","_","_"
4,"astu","_","_","as","V","as","_","_"
5,"_","_","_","saubhaga","NC","","_","_"
6,"_","_","_","asaṅga","NC","","_","_"
7,"_","_","_","svan","KDP","","_","_"
8,"_","_","_","ratha","NC","","_","_"
1,"adha","_","_","adha","CX","","_","_"
2,"plāyogir","_","_","plāyogi","NC","","_","_"
3,"ati","_","_","ati","CADP","","_","_"
4,"dāsad","_","_","dad","V","dā","_","_"
5,"anyān","_","_","anya","PPX","","_","_"
6,"āsaṅgo","_","_","āsaṅga","NC","","_","_"
7,"agne","_","_","agni","NC","","_","_"
8,"daśabhiḥ","_","_","daśan","NUM","","_","_"
9,"sahasraiḥ","_","_","sahasra","NUM","","_","_"
1,"_","_","_","adha","CX","","_","_"
2,"_","_","_","ukṣan","NC","","_","_"
3,"daśa","_","_","daśan","NUM","","_","_"
4,"mahyaṃ","_","_","mat","PPR","","_","_"
5,"ruśanto","_","_","ruśat","JJ","","_","_"
6,"naﾱā","_","_","naḍa","NC","","_","_"
7,"iva","_","_","iva","CCM","","_","_"
8,"saraso","_","_","saras","NC","","_","_"
9,"nir","_","_","niḥ","CADP","","_","_"
10,"atiṣṭhan","_","_","tiṣṭh","V","sthā","_","_"
1,"anv","_","_","anu","CADP","","_","_"
2,"asya","_","_","ida","PRD","","_","_"
3,"sthūraṃ","_","_","sthūra","JJ","","_","_"
4,"dadṛśe","_","_","darś","V","dṛś","_","_"
5,"purastād","_","_","purastāt","CX","","_","_"
6,"anastha","_","_","anastha","JJ","","_","_"
7,"ūrur","_","_","ūru","NC","","_","_"
8,"avarambamāṇaḥ","_","_","avalamb","KDP","","_","_"
1,"śaśvatī","_","_","śaśvatī","NC","","_","_"
2,"nāry","_","_","nārī","NC","","_","_"
3,"_","_","_","abhicakṣ","CGDA","","_","_"
4,"_","_","_","ah","V","ah","_","_"
5,"_","_","_","su","CAD","","_","_"
6,"_","_","_","bhadra","JJ","","_","_"
7,"arya","_","_","arya","JJ","","_","_"
8,"bhojanam","_","_","bhojana","NC","","_","_"
9,"bibharṣi","_","_","bhṛ","V","bhṛ","_","_"
