"WordID","word","NormSTEM","suffix","lemma","PoS","Root","NormSuffix","NormWord"
1,"sūta","_","_","sūta","NC","","_","_"
2,"uvāca","_","_","vak","V","vac","_","_"
1,"tasya","_","_","tad","PRD","","_","_"
2,"kaṇṭham","_","_","kaṇṭha","NC","","_","_"
3,"anuprāpto","_","_","anuprāp","PPP","","_","_"
4,"brāhmaṇaḥ","_","_","brāhmaṇa","NC","","_","_"
5,"saha","_","_","saha","CX","","_","_"
6,"bhāryayā","_","_","bhāryā","NC","","_","_"
1,"dahan","_","_","dah","KDP","","_","_"
2,"dīpta","_","_","dīp","PPP","","_","_"
3,"_","_","_","iva","CCM","","_","_"
4,"_","_","_","aṅgāra","NC","","_","_"
5,"_","_","_","tad","PRD","","_","_"
6,"_","_","_","vak","V","vac","_","_"
7,"_","_","_","antarikṣa","NC","","_","_"
8,"_","_","_","ga","JJ","","_","_"
1,"dvijottama","_","_","dvijottama","NC","","_","_"
2,"vinirgaccha","_","_","vinirga","V","vinirga","_","_"
3,"tūrṇam","_","_","tūrṇa","CX","","_","_"
4,"āsyād","_","_","āsya","NC","","_","_"
5,"apāvṛtāt","_","_","apāvṛ","PPP","","_","_"
1,"na","_","_","na","CNG","","_","_"
2,"hi","_","_","hi","CX","","_","_"
3,"me","_","_","mat","PPR","","_","_"
4,"brāhmaṇo","_","_","brāhmaṇa","NC","","_","_"
5,"vadhyaḥ","_","_","vadh","KDG","","_","_"
6,"_","_","_","pāpa","NC","","_","_"
7,"_","_","_","api","CX","","_","_"
8,"rataḥ","_","_","ra","PPP","","_","_"
9,"sadā","_","_","sadā","CAD","","_","_"
1,"kathaṃ","_","_","katha","CX","","_","_"
2,"ca","_","_","ca","CCD","","_","_"
3,"tvam","_","_","tvat","PPR","","_","_"
4,"_","_","_","iha","CAD","","_","_"
5,"_","_","_","āyā","PPP","","_","_"
6,"niṣādānāṃ","_","_","niṣāda","NC","","_","_"
7,"_","_","_","mahat","JJ","","_","_"
8,"_","_","_","ālaya","NC","","_","_"
1,"aspṛśyā","_","_","aspṛśya","JJ","","_","_"
2,"yājināṃ","_","_","yājin","JJ","","_","_"
3,"nityaṃ","_","_","nitya","JJ","","_","_"
4,"satyaṃ","_","_","satya","JJ","","_","_"
5,"ca","_","_","ca","CCD","","_","_"
6,"vada","_","_","vad","V","vad","_","_"
7,"me","_","_","mat","PPR","","_","_"
8,"dvija","_","_","dvija","NC","","_","_"
1,"bruvāṇam","_","_","brū","KDP","","_","_"
2,"evaṃ","_","_","eva","CX","","_","_"
3,"garuḍaṃ","_","_","garuḍa","NC","","_","_"
4,"brāhmaṇaḥ","_","_","brāhmaṇa","NC","","_","_"
5,"samabhāṣata","_","_","sambhāṣ","V","sambhāṣ","_","_"
1,"brāhmaṇa","_","_","brāhmaṇa","NC","","_","_"
2,"uvāca","_","_","vak","V","vac","_","_"
1,"madhyadeśāt","_","_","madhyadeśa","NC","","_","_"
2,"samāyāto","_","_","samāyā","PPP","","_","_"
3,"_","_","_","dhana","NC","","_","_"
4,"_","_","_","arthin","JJ","","_","_"
5,"medinīṃ","_","_","medinī","NC","","_","_"
6,"bhraman","_","_","bhra","KDP","","_","_"
1,"tato","_","_","tatas","CX","","_","_"
2,"niṣādān","_","_","niṣāda","NC","","_","_"
3,"samprāpto","_","_","samprāp","PPP","","_","_"
4,"ratiṃ","_","_","rati","NC","","_","_"
5,"_","_","_","ca","CCD","","_","_"
6,"_","_","_","api","CX","","_","_"
7,"_","_","_","atra","CAD","","_","_"
8,"labdhavān","_","_","labh","KDP","","_","_"
1,"gāṃ","_","_","go","NC","","_","_"
2,"hiraṇyaṃ","_","_","hiraṇya","NC","","_","_"
3,"dhanaṃ","_","_","dhana","NC","","_","_"
4,"dhānyaṃ","_","_","dhānya","NC","","_","_"
5,"_","_","_","ghaṭa","NC","","_","_"
6,"_","_","_","ca","CCD","","_","_"
7,"_","_","_","kaṭaka","NC","","_","_"
8,"_","_","_","tathā","CX","","_","_"
1,"niṣādā","_","_","niṣāda","NC","","_","_"
2,"me","_","_","mat","PPR","","_","_"
3,"prayacchanti","_","_","praya","V","praya","_","_"
4,"satataṃ","_","_","satata","CX","","_","_"
5,"_","_","_","priya","JJ","","_","_"
6,"_","_","_","kārin","JJ","","_","_"
1,"niṣādī","_","_","niṣādī","NC","","_","_"
2,"śobhanā","_","_","śobhana","JJ","","_","_"
3,"_","_","_","ca","CCD","","_","_"
4,"_","_","_","atra","CAD","","_","_"
5,"bhāryā","_","_","bhāryā","NC","","_","_"
6,"jātā","_","_","jan","PPP","","_","_"
7,"_","_","_","khaga","NC","","_","_"
8,"_","_","_","uttama","JJ","","_","_"
1,"tayā","_","_","tad","PRD","","_","_"
2,"saha","_","_","saha","CX","","_","_"
3,"vasan","_","_","vas","KDP","","_","_"
4,"nityaṃ","_","_","nitya","CX","","_","_"
5,"ratim","_","_","rati","NC","","_","_"
6,"agryām","_","_","agrya","JJ","","_","_"
7,"avāptavān","_","_","avāp","KDP","","_","_"
1,"niṣādī","_","_","niṣādī","NC","","_","_"
2,"mama","_","_","mat","PPR","","_","_"
3,"_","_","_","bhāryā","NC","","_","_"
4,"_","_","_","ida","PRD","","_","_"
5,"nirgacchatu","_","_","nirga","V","nirga","_","_"
6,"mayā","_","_","mat","PPR","","_","_"
7,"saha","_","_","saha","CX","","_","_"
1,"tato","_","_","tatas","CX","","_","_"
2,"'haṃ","_","_","mat","PPR","","_","_"
3,"nirgamiṣyāmi","_","_","nirga","V","nirga","_","_"
4,"na","_","_","na","CNG","","_","_"
5,"nirgaccheyam","_","_","nirga","V","nirga","_","_"
6,"anyathā","_","_","anyathā","CX","","_","_"
1,"garuḍa","_","_","garuḍa","NC","","_","_"
2,"uvāca","_","_","vak","V","vac","_","_"
1,"etām","_","_","tad","PRD","","_","_"
2,"api","_","_","api","CX","","_","_"
3,"niṣādīṃ","_","_","niṣādī","NC","","_","_"
5,"_","_","_","parigrah","CGDA","","_","_"
6,"_","_","_","āśu","JJ","","_","_"
7,"niṣpata","_","_","niṣpat","V","niṣpat","_","_"
1,"tūrṇaṃ","_","_","tūrṇa","JJ","","_","_"
2,"_","_","_","sambhāvay","V","sambhāvay","_","_"
3,"_","_","_","ātman","NC","","_","_"
4,"ajīrṇaṃ","_","_","ajīrṇa","JJ","","_","_"
5,"mama","_","_","mat","PPR","","_","_"
6,"tejasā","_","_","tejas","NC","","_","_"
1,"sūta","_","_","sūta","NC","","_","_"
2,"uvāca","_","_","vak","V","vac","_","_"
1,"tataḥ","_","_","tatas","CX","","_","_"
2,"sa","_","_","tad","PRD","","_","_"
3,"vipro","_","_","vipra","NC","","_","_"
4,"niṣkrānto","_","_","niṣkra","PPP","","_","_"
5,"_","_","_","niṣādī","NC","","_","_"
6,"_","_","_","sahita","JJ","","_","_"
7,"_","_","_","tadā","CAD","","_","_"
1,"vardhayitvā","_","_","vardhay","CGDA","","_","_"
2,"ca","_","_","ca","CCD","","_","_"
3,"garuḍam","_","_","garuḍa","NC","","_","_"
4,"iṣṭaṃ","_","_","iṣ","PPP","","_","_"
5,"deśaṃ","_","_","deśa","NC","","_","_"
6,"jagāma","_","_","ga","V","ga","_","_"
7,"ha","_","_","ha","CEM","","_","_"
1,"sahabhārye","_","_","sahabhārya","JJ","","_","_"
2,"viniṣkrānte","_","_","viniṣkra","PPP","","_","_"
3,"tasmin","_","_","tad","PRD","","_","_"
4,"vipre","_","_","vipra","NC","","_","_"
5,"sa","_","_","tad","PRD","","_","_"
6,"pakṣirāṭ","_","_","pakṣirāj","NC","","_","_"
1,"vitatya","_","_","vitan","CGDA","","_","_"
2,"_","_","_","pakṣa","NC","","_","_"
3,"_","_","_","ākāśa","NC","","_","_"
4,"utpapāta","_","_","utpat","V","utpat","_","_"
5,"manojavaḥ","_","_","manojava","JJ","","_","_"
1,"tato","_","_","tatas","CX","","_","_"
2,"'paśyat","_","_","paś","V","paś","_","_"
3,"sa","_","_","tad","PRD","","_","_"
4,"pitaraṃ","_","_","pitṛ","NC","","_","_"
5,"_","_","_","pracch","PPP","","_","_"
6,"_","_","_","ca","CCD","","_","_"
7,"_","_","_","ākhyā","KDP","","_","_"
8,"pituḥ","_","_","pitṛ","NC","","_","_"
1,"yathānyāyam","_","_","yathānyāya","CX","","_","_"
2,"_","_","_","ameya","JJ","","_","_"
3,"_","_","_","ātman","NC","","_","_"
4,"taṃ","_","_","tad","PRD","","_","_"
5,"_","_","_","ca","CCD","","_","_"
6,"_","_","_","vak","V","vac","_","_"
7,"mahān","_","_","mahat","JJ","","_","_"
8,"ṛṣiḥ","_","_","ṛṣi","NC","","_","_"
1,"kaccid","_","_","kiṃcit","PRI","","_","_"
2,"vaḥ","_","_","tvat","PPR","","_","_"
3,"kuśalaṃ","_","_","kuśala","NC","","_","_"
4,"nityaṃ","_","_","nitya","CX","","_","_"
5,"bhojane","_","_","bhojana","NC","","_","_"
6,"bahulaṃ","_","_","bahula","JJ","","_","_"
7,"suta","_","_","suta","NC","","_","_"
1,"_","_","_","kiṃcit","PRI","","_","_"
2,"_","_","_","ca","CCD","","_","_"
3,"mānuṣe","_","_","mānuṣa","JJ","","_","_"
4,"loke","_","_","loka","NC","","_","_"
5,"_","_","_","tvat","PPR","","_","_"
6,"_","_","_","anna","NC","","_","_"
7,"vidyate","_","_","vid","V","vid","_","_"
8,"bahu","_","_","bahu","JJ","","_","_"
1,"_","_","_","samutpat","CGDA","","_","_"
2,"_","_","_","abhiviśra","PPP","","_","_"
3,"pitaraṃ","_","_","pitṛ","NC","","_","_"
4,"ca","_","_","ca","CCD","","_","_"
5,"sametya","_","_","same","CGDA","","_","_"
6,"saḥ","_","_","tad","PRD","","_","_"
1,"vavande","_","_","vand","V","vand","_","_"
2,"patatāṃ","_","_","pat","KDP","","_","_"
3,"śreṣṭho","_","_","śreṣṭha","JJ","","_","_"
4,"brahma","_","_","brahman","NC","","_","_"
5,"_","_","_","brahman","NC","","_","_"
6,"_","_","_","vid","JJ","","_","_"
7,"prabhum","_","_","prabhu","NC","","_","_"
1,"_","_","_","pracch","PPP","","_","_"
2,"_","_","_","ca","CCD","","_","_"
3,"pitrā","_","_","pitṛ","NC","","_","_"
4,"balavān","_","_","balavat","JJ","","_","_"
5,"vainateyaḥ","_","_","vainateya","NC","","_","_"
6,"pratāpavān","_","_","pratāpavat","JJ","","_","_"
1,"kva","_","_","kva","CX","","_","_"
2,"_","_","_","ga","V","ga","_","_"
3,"_","_","_","iti","CQT","","_","_"
4,"vegena","_","_","vega","NC","","_","_"
5,"mama","_","_","mat","PPR","","_","_"
6,"tvaṃ","_","_","tvat","PPR","","_","_"
7,"vaktum","_","_","vac","CGDI","","_","_"
8,"arhasi","_","_","arh","V","arh","_","_"
1,"garuḍa","_","_","garuḍa","NC","","_","_"
2,"uvāca","_","_","vak","V","vac","_","_"
1,"mātā","_","_","mātṛ","NC","","_","_"
2,"me","_","_","mat","PPR","","_","_"
3,"kuśalā","_","_","kuśala","JJ","","_","_"
4,"śaśvat","_","_","śaśvat","CX","","_","_"
5,"tathā","_","_","tathā","CX","","_","_"
6,"bhrātā","_","_","bhrātṛ","NC","","_","_"
7,"tathā","_","_","tathā","CX","","_","_"
8,"_","_","_","hi","CX","","_","_"
9,"_","_","_","mat","PPR","","_","_"
1,"na","_","_","na","CNG","","_","_"
2,"hi","_","_","hi","CX","","_","_"
3,"me","_","_","mat","PPR","","_","_"
4,"kuśalaṃ","_","_","kuśala","NC","","_","_"
5,"tāta","_","_","tāta","NC","","_","_"
6,"bhojane","_","_","bhojana","NC","","_","_"
7,"bahule","_","_","bahula","JJ","","_","_"
8,"sadā","_","_","sadā","CAD","","_","_"
1,"ahaṃ","_","_","mat","PPR","","_","_"
2,"hi","_","_","hi","CX","","_","_"
3,"sarpaiḥ","_","_","sarpa","NC","","_","_"
4,"prahitaḥ","_","_","prahi","PPP","","_","_"
5,"somam","_","_","soma","NC","","_","_"
6,"āhartum","_","_","āhṛ","CGDI","","_","_"
7,"udyataḥ","_","_","udya","PPP","","_","_"
1,"mātur","_","_","mātṛ","NC","","_","_"
2,"_","_","_","dāsya","NC","","_","_"
3,"_","_","_","vimokṣa","NC","","_","_"
4,"_","_","_","artha","NC","","_","_"
5,"āhariṣye","_","_","āhar","V","āhṛ","_","_"
6,"tam","_","_","tad","PRD","","_","_"
7,"adya","_","_","adya","CX","","_","_"
8,"vai","_","_","vai","CX","","_","_"
1,"mātrā","_","_","mātṛ","NC","","_","_"
2,"_","_","_","ca","CCD","","_","_"
3,"_","_","_","as","V","as","_","_"
4,"samādiṣṭo","_","_","samādis","PPP","","_","_"
5,"niṣādān","_","_","niṣāda","NC","","_","_"
6,"_","_","_","bhakṣay","V","bhakṣay","_","_"
7,"_","_","_","iti","CQT","","_","_"
8,"vai","_","_","vai","CX","","_","_"
1,"na","_","_","na","CNG","","_","_"
2,"ca","_","_","ca","CCD","","_","_"
3,"me","_","_","mat","PPR","","_","_"
4,"tṛptir","_","_","tṛpti","NC","","_","_"
5,"abhavad","_","_","bhav","V","bhū","_","_"
6,"bhakṣayitvā","_","_","bhakṣay","CGDA","","_","_"
7,"sahasraśaḥ","_","_","sahasraśas","CX","","_","_"
1,"tasmād","_","_","tad","PRD","","_","_"
2,"bhoktavyam","_","_","bhuj","KDG","","_","_"
3,"aparaṃ","_","_","apara","PPX","","_","_"
4,"bhagavan","_","_","bhagavat","JJ","","_","_"
5,"pradiśasva","_","_","pradiś","V","pradiś","_","_"
6,"me","_","_","mat","PPR","","_","_"
1,"yad","_","_","yad","PRL","","_","_"
2,"_","_","_","bhuj","CGDA","","_","_"
3,"_","_","_","amṛta","NC","","_","_"
4,"āhartuṃ","_","_","āhṛ","CGDI","","_","_"
5,"samarthaḥ","_","_","samartha","JJ","","_","_"
6,"syām","_","_","as","V","as","_","_"
7,"ahaṃ","_","_","mat","PPR","","_","_"
8,"prabho","_","_","prabhu","NC","","_","_"
1,"_","_","_","kṣudh","NC","","_","_"
2,"_","_","_","pipāsā","NC","","_","_"
3,"_","_","_","vighāta","NC","","_","_"
4,"_","_","_","artha","NC","","_","_"
5,"bhakṣyam","_","_","bhakṣya","NC","","_","_"
6,"ākhyātu","_","_","ākhyā","V","ākhyā","_","_"
7,"me","_","_","mat","PPR","","_","_"
8,"bhavān","_","_","bhavat","JJ","","_","_"
1,"kaśyapa","_","_","kaśyapa","NC","","_","_"
2,"uvāca","_","_","vak","V","vac","_","_"
1,"idaṃ","_","_","ida","PRD","","_","_"
2,"saro","_","_","saras","NC","","_","_"
3,"_","_","_","mahat","JJ","","_","_"
4,"_","_","_","puṇya","JJ","","_","_"
5,"_","_","_","deva","NC","","_","_"
6,"_","_","_","loka","NC","","_","_"
7,"'pi","_","_","api","CX","","_","_"
8,"viśrutam","_","_","viśru","PPP","","_","_"
1,"yatra","_","_","yatra","CX","","_","_"
2,"_","_","_","kūrma","NC","","_","_"
3,"_","_","_","agraja","NC","","_","_"
4,"hastī","_","_","hastin","NC","","_","_"
5,"sadā","_","_","sadā","CAD","","_","_"
6,"_","_","_","kṛṣ","V","kṛṣ","_","_"
7,"_","_","_","avāṅmukha","JJ","","_","_"
1,"tayor","_","_","tad","PRD","","_","_"
2,"janma","_","_","janman","NC","","_","_"
3,"tu","_","_","tu","CCD","","_","_"
4,"te","_","_","tvat","PPR","","_","_"
5,"kṛtsnaṃ","_","_","kṛtsna","JJ","","_","_"
6,"_","_","_","pravak","V","pravac","_","_"
7,"_","_","_","anupūrvaśas","CX","","_","_"
1,"tan","_","_","tad","PRD","","_","_"
2,"me","_","_","mat","PPR","","_","_"
3,"tattvaṃ","_","_","tattva","NC","","_","_"
4,"nibodhasva","_","_","nibodh","V","nibudh","_","_"
5,"_","_","_","yad","PRL","","_","_"
6,"_","_","_","pramāṇa","NC","","_","_"
7,"ca","_","_","ca","CCD","","_","_"
8,"tau","_","_","tad","PRD","","_","_"
9,"matau","_","_","man","PPP","","_","_"
1,"śṛṇu","_","_","śṛṇ","V","śru","_","_"
2,"tvaṃ","_","_","tvat","PPR","","_","_"
3,"vatsa","_","_","vatsa","NC","","_","_"
4,"bhadraṃ","_","_","bhadra","NC","","_","_"
5,"te","_","_","tvat","PPR","","_","_"
6,"kathāṃ","_","_","kathā","NC","","_","_"
7,"_","_","_","vairāgya","NC","","_","_"
8,"_","_","_","vardhin","JJ","","_","_"
1,"pitror","_","_","pitṛ","NC","","_","_"
2,"_","_","_","artha","NC","","_","_"
3,"_","_","_","vibhāga","NC","","_","_"
4,"vai","_","_","vai","CX","","_","_"
5,"samutpannāṃ","_","_","samutpad","PPP","","_","_"
6,"_","_","_","purā","CX","","_","_"
7,"_","_","_","aṇḍaja","NC","","_","_"
1,"āsīd","_","_","as","V","as","_","_"
2,"vibhāvasur","_","_","vibhāvasu","NC","","_","_"
3,"nāma","_","_","nāma","CX","","_","_"
4,"_","_","_","mahat","JJ","","_","_"
5,"_","_","_","ṛṣi","NC","","_","_"
6,"kopano","_","_","kopana","JJ","","_","_"
7,"bhṛśam","_","_","bhṛśa","CX","","_","_"
1,"bhrātā","_","_","bhrātṛ","NC","","_","_"
2,"_","_","_","tad","PRD","","_","_"
3,"_","_","_","anuja","NC","","_","_"
4,"_","_","_","ca","CCD","","_","_"
5,"_","_","_","as","V","as","_","_"
6,"supratīko","_","_","supratīka","NC","","_","_"
7,"_","_","_","mahat","JJ","","_","_"
8,"_","_","_","tapas","NC","","_","_"
1,"sa","_","_","tad","PRD","","_","_"
2,"_","_","_","na","CNG","","_","_"
3,"_","_","_","iṣ","V","iṣ","_","_"
4,"dhanaṃ","_","_","dhana","NC","","_","_"
5,"bhrātrā","_","_","bhrātṛ","NC","","_","_"
6,"_","_","_","saha","CX","","_","_"
7,"_","_","_","ekastha","JJ","","_","_"
8,"_","_","_","mahat","JJ","","_","_"
9,"_","_","_","muni","NC","","_","_"
1,"vibhāgaṃ","_","_","vibhāga","NC","","_","_"
2,"_","_","_","kīrtay","V","kīrtay","_","_"
3,"_","_","_","eva","CEM","","_","_"
4,"supratīko","_","_","supratīka","NC","","_","_"
5,"'tha","_","_","atha","CAD","","_","_"
6,"nityaśaḥ","_","_","nityaśas","CX","","_","_"
1,"_","_","_","atha","CAD","","_","_"
2,"_","_","_","abravīta","V","brū","_","_"
3,"_","_","_","ca","CCD","","_","_"
4,"taṃ","_","_","tad","PRD","","_","_"
5,"bhrātā","_","_","bhrātṛ","NC","","_","_"
6,"supratīkaṃ","_","_","supratīka","NC","","_","_"
7,"vibhāvasuḥ","_","_","vibhāvasu","NC","","_","_"
1,"vibhāge","_","_","vibhāga","NC","","_","_"
2,"bahavo","_","_","bahu","JJ","","_","_"
3,"doṣā","_","_","doṣa","NC","","_","_"
4,"bhaviṣyanti","_","_","bhav","V","bhū","_","_"
5,"_","_","_","mahat","JJ","","_","_"
6,"_","_","_","tapas","NC","","_","_"
1,"vibhāgaṃ","_","_","vibhāga","NC","","_","_"
2,"bahavo","_","_","bahu","JJ","","_","_"
3,"mohāt","_","_","moha","NC","","_","_"
4,"kartum","_","_","kṛ","CGDI","","_","_"
5,"icchanti","_","_","iṣ","V","iṣ","_","_"
6,"nityadā","_","_","nityadā","CX","","_","_"
1,"tato","_","_","tatas","CX","","_","_"
2,"vibhaktā","_","_","vibhaj","PPP","","_","_"
3,"anyonyaṃ","_","_","anyonya","PRC","","_","_"
4,"_","_","_","na","CNG","","_","_"
5,"_","_","_","ādṛ","V","ādṛ","_","_"
6,"_","_","_","artha","NC","","_","_"
7,"_","_","_","mohay","PPP","","_","_"
1,"tataḥ","_","_","tatas","CX","","_","_"
2,"_","_","_","sva","JJ","","_","_"
3,"_","_","_","artha","NC","","_","_"
4,"_","_","_","para","PPX","","_","_"
5,"mūḍhān","_","_","muh","PPP","","_","_"
6,"pṛthag","_","_","pṛthak","CX","","_","_"
7,"bhūtān","_","_","bhū","PPP","","_","_"
8,"svakair","_","_","svaka","JJ","","_","_"
9,"dhanaiḥ","_","_","dhana","NC","","_","_"
1,"viditvā","_","_","vid","CGDA","","_","_"
2,"_","_","_","bheday","V","bheday","_","_"
3,"_","_","_","tad","PRD","","_","_"
4,"amitrā","_","_","amitra","NC","","_","_"
5,"_","_","_","mitra","NC","","_","_"
6,"_","_","_","rūpin","JJ","","_","_"
1,"viditvā","_","_","vid","CGDA","","_","_"
2,"_","_","_","ca","CCD","","_","_"
3,"_","_","_","apara","PPX","","_","_"
4,"bhinnān","_","_","bhid","PPP","","_","_"
5,"antareṣu","_","_","antara","NC","","_","_"
6,"_","_","_","pat","V","pat","_","_"
7,"_","_","_","atha","CAD","","_","_"
1,"bhinnānām","_","_","bhid","PPP","","_","_"
2,"atulo","_","_","atula","JJ","","_","_"
3,"nāśaḥ","_","_","nāśa","NC","","_","_"
4,"kṣipram","_","_","kṣipra","CX","","_","_"
5,"eva","_","_","eva","CEM","","_","_"
6,"pravartate","_","_","pravart","V","pravṛt","_","_"
1,"_","_","_","tad","PRD","","_","_"
2,"_","_","_","ca","CCD","","_","_"
3,"_","_","_","eva","CEM","","_","_"
4,"_","_","_","vibhāga","NC","","_","_"
5,"_","_","_","artha","NC","","_","_"
6,"na","_","_","na","CNG","","_","_"
7,"praśaṃsanti","_","_","praśaṃs","V","praśaṃs","_","_"
8,"paṇḍitāḥ","_","_","paṇḍita","NC","","_","_"
1,"evam","_","_","eva","CX","","_","_"
2,"uktaḥ","_","_","vac","PPP","","_","_"
3,"supratīko","_","_","supratīka","NC","","_","_"
4,"bhāgaṃ","_","_","bhāga","NC","","_","_"
5,"kīrtayate","_","_","kīrtay","V","kīrtay","_","_"
6,"'niśam","_","_","aniśa","CX","","_","_"
1,"evaṃ","_","_","eva","CX","","_","_"
2,"_","_","_","nirbandh","KDP","","_","_"
3,"_","_","_","tu","CCD","","_","_"
4,"_","_","_","śap","V","śap","_","_"
5,"_","_","_","a","PRD","","_","_"
6,"vibhāvasuḥ","_","_","vibhāvasu","NC","","_","_"
1,"_","_","_","guru","NC","","_","_"
2,"_","_","_","śāstra","NC","","_","_"
3,"nibaddhānām","_","_","nibandh","PPP","","_","_"
4,"anyonyam","_","_","anyonya","PRC","","_","_"
5,"abhiśaṅkinām","_","_","abhiśaṅkin","JJ","","_","_"
1,"teṣāṃ","_","_","tad","PRD","","_","_"
2,"madhye","_","_","madhya","NC","","_","_"
3,"tvam","_","_","tvat","PPR","","_","_"
4,"_","_","_","api","CX","","_","_"
5,"_","_","_","eka","PPX","","_","_"
6,"_","_","_","chadman","NC","","_","_"
7,"_","_","_","kṛt","JJ","","_","_"
8,"_","_","_","ca","CCD","","_","_"
9,"mahātmabhiḥ","_","_","mahātman","JJ","","_","_"
1,"niyantuṃ","_","_","niya","CGDI","","_","_"
2,"na","_","_","na","CNG","","_","_"
3,"hi","_","_","hi","CX","","_","_"
4,"_","_","_","śakya","JJ","","_","_"
5,"_","_","_","tvat","PPR","","_","_"
6,"bhedato","_","_","bheda","NC","","_","_"
7,"dhanam","_","_","dhana","NC","","_","_"
8,"icchasi","_","_","iṣ","V","iṣ","_","_"
1,"yasmāt","_","_","yad","PRL","","_","_"
2,"tasmāt","_","_","tad","PRD","","_","_"
3,"supratīka","_","_","supratīka","NC","","_","_"
4,"_","_","_","hastin","NC","","_","_"
6,"samavāpsyasi","_","_","samavāp","V","samavāp","_","_"
1,"_","_","_","śap","PPP","","_","_"
2,"_","_","_","tu","CCD","","_","_"
3,"_","_","_","eva","CX","","_","_"
4,"supratīko","_","_","supratīka","NC","","_","_"
5,"vibhāvasum","_","_","vibhāvasu","NC","","_","_"
6,"_","_","_","atha","CAD","","_","_"
7,"_","_","_","abravīta","V","brū","_","_"
1,"tvam","_","_","tvat","PPR","","_","_"
2,"_","_","_","api","CX","","_","_"
3,"_","_","_","antar","CAD","","_","_"
4,"_","_","_","jalacara","NC","","_","_"
5,"kacchapaḥ","_","_","kacchapa","NC","","_","_"
6,"sambhaviṣyasi","_","_","sambhav","V","sambhū","_","_"
1,"evam","_","_","eva","CX","","_","_"
2,"_","_","_","anyonya","PRC","","_","_"
3,"_","_","_","śāpa","NC","","_","_"
4,"tau","_","_","tad","PRD","","_","_"
5,"_","_","_","supratīka","NC","","_","_"
6,"_","_","_","vibhāvasu","NC","","_","_"
1,"_","_","_","gaja","NC","","_","_"
2,"_","_","_","kacchapatā","NC","","_","_"
3,"_","_","_","prāp","PPP","","_","_"
4,"_","_","_","artha","NC","","_","_"
5,"_","_","_","artha","NC","","_","_"
6,"_","_","_","muh","PPP","","_","_"
7,"_","_","_","cetas","NC","","_","_"
1,"_","_","_","roṣa","NC","","_","_"
2,"_","_","_","doṣa","NC","","_","_"
3,"_","_","_","anuṣaṅga","NC","","_","_"
4,"_","_","_","tiryagyoni","NC","","_","_"
5,"_","_","_","ga","PPP","","_","_"
6,"_","_","_","api","CX","","_","_"
1,"_","_","_","paraspara","PRC","","_","_"
2,"_","_","_","dveṣa","NC","","_","_"
3,"_","_","_","ra","PPP","","_","_"
4,"_","_","_","pramāṇa","NC","","_","_"
5,"_","_","_","bala","NC","","_","_"
6,"_","_","_","darpay","PPP","","_","_"
1,"_","_","_","saras","NC","","_","_"
2,"_","_","_","ida","PRD","","_","_"
3,"_","_","_","mahat","JJ","","_","_"
4,"_","_","_","kāya","NC","","_","_"
5,"_","_","_","pūrva","PPX","","_","_"
6,"_","_","_","vaira","NC","","_","_"
7,"_","_","_","anusārin","JJ","","_","_"
1,"tayor","_","_","tad","PRD","","_","_"
2,"ekataraḥ","_","_","ekatara","JJ","","_","_"
3,"śrīmān","_","_","śrīmat","JJ","","_","_"
4,"samupaiti","_","_","samupai","V","samupe","_","_"
5,"_","_","_","mahat","JJ","","_","_"
6,"_","_","_","gaja","NC","","_","_"
1,"tasya","_","_","tad","PRD","","_","_"
2,"_","_","_","bṛṃhay","PPP","","_","_"
3,"_","_","_","śabda","NC","","_","_"
4,"kūrmo","_","_","kūrma","NC","","_","_"
5,"_","_","_","api","CX","","_","_"
6,"_","_","_","antar","CAD","","_","_"
7,"_","_","_","jaleśaya","JJ","","_","_"
1,"utthito","_","_","utthā","PPP","","_","_"
2,"'sau","_","_","adas","PRD","","_","_"
3,"_","_","_","mahat","JJ","","_","_"
4,"_","_","_","kāya","NC","","_","_"
5,"kṛtsnaṃ","_","_","kṛtsna","JJ","","_","_"
6,"saṃkṣobhayan","_","_","saṃkṣobhay","KDP","","_","_"
7,"saraḥ","_","_","saras","NC","","_","_"
1,"taṃ","_","_","tad","PRD","","_","_"
2,"_","_","_","dṛś","CGDA","","_","_"
3,"_","_","_","āveṣṭay","PPP","","_","_"
4,"_","_","_","kara","NC","","_","_"
5,"_","_","_","pat","V","pat","_","_"
6,"_","_","_","tad","PRD","","_","_"
7,"gajo","_","_","gaja","NC","","_","_"
8,"jalam","_","_","jala","NC","","_","_"
1,"_","_","_","danta","NC","","_","_"
2,"_","_","_","hasta","NC","","_","_"
3,"_","_","_","agra","NC","","_","_"
4,"_","_","_","lāṅgūla","NC","","_","_"
5,"_","_","_","pāda","NC","","_","_"
6,"_","_","_","vega","NC","","_","_"
7,"vīryavān","_","_","vīryavat","JJ","","_","_"
1,"taṃ","_","_","tad","PRD","","_","_"
2,"vikṣobhayamāṇaṃ","_","_","vikṣobhay","KDP","","_","_"
3,"tu","_","_","tu","CCD","","_","_"
4,"saro","_","_","saras","NC","","_","_"
5,"_","_","_","bahu","JJ","","_","_"
6,"_","_","_","jhaṣa","NC","","_","_"
7,"_","_","_","ākula","JJ","","_","_"
1,"kūrmo","_","_","kūrma","NC","","_","_"
2,"_","_","_","api","CX","","_","_"
3,"_","_","_","abhyudya","PPP","","_","_"
4,"_","_","_","śiras","NC","","_","_"
5,"_","_","_","yuddha","NC","","_","_"
6,"_","_","_","abhī","V","abhī","_","_"
7,"vīryavān","_","_","vīryavat","JJ","","_","_"
1,"ṣaḍ","_","_","ṣaṣ","NUM","","_","_"
2,"ucchrito","_","_","ucchri","PPP","","_","_"
3,"yojanāni","_","_","yojana","NC","","_","_"
4,"_","_","_","gaja","NC","","_","_"
5,"_","_","_","tad","PRD","","_","_"
6,"_","_","_","dviguṇa","JJ","","_","_"
7,"_","_","_","āya","PPP","","_","_"
1,"_","_","_","kūrma","NC","","_","_"
2,"_","_","_","tri","NUM","","_","_"
3,"_","_","_","yojana","NC","","_","_"
4,"_","_","_","utsedha","NC","","_","_"
5,"_","_","_","daśan","NUM","","_","_"
6,"_","_","_","yojana","NC","","_","_"
7,"_","_","_","maṇḍala","NC","","_","_"
1,"_","_","_","tad","PRD","","_","_"
2,"_","_","_","tad","PRD","","_","_"
3,"_","_","_","yuddha","NC","","_","_"
4,"_","_","_","sammad","PPP","","_","_"
5,"_","_","_","paraspara","PRC","","_","_"
6,"_","_","_","jaya","NC","","_","_"
7,"_","_","_","eṣin","JJ","","_","_"
1,"_","_","_","upayuj","CGDA","","_","_"
2,"_","_","_","āśu","JJ","","_","_"
3,"_","_","_","karman","NC","","_","_"
4,"_","_","_","ida","PRD","","_","_"
5,"_","_","_","sādhay","V","sādhay","_","_"
6,"_","_","_","īpsay","PPP","","_","_"
7,"ātmanaḥ","_","_","ātman","NC","","_","_"
1,"_","_","_","mahat","JJ","","_","_"
2,"_","_","_","abhra","NC","","_","_"
3,"_","_","_","ghana","NC","","_","_"
4,"_","_","_","saṃkāśa","NC","","_","_"
5,"taṃ","_","_","tad","PRD","","_","_"
6,"_","_","_","bhuj","CGDA","","_","_"
7,"_","_","_","amṛta","NC","","_","_"
8,"ānaya","_","_","ānay","V","ānī","_","_"
1,"_","_","_","mahat","JJ","","_","_"
2,"_","_","_","giri","NC","","_","_"
3,"_","_","_","sama","PPX","","_","_"
4,"_","_","_","prakhyā","NC","","_","_"
5,"_","_","_","ghora","JJ","","_","_"
6,"_","_","_","rūpa","NC","","_","_"
7,"ca","_","_","ca","CCD","","_","_"
8,"hastinam","_","_","hastin","NC","","_","_"
1,"sūta","_","_","sūta","NC","","_","_"
2,"uvāca","_","_","vak","V","vac","_","_"
1,"_","_","_","iti","CQT","","_","_"
2,"_","_","_","vac","CGDA","","_","_"
3,"garuḍaṃ","_","_","garuḍa","NC","","_","_"
4,"_","_","_","tad","PRD","","_","_"
5,"_","_","_","ṛṣi","NC","","_","_"
6,"māṅgalyam","_","_","māṅgalya","NC","","_","_"
7,"akarot","_","_","kar","V","kṛ","_","_"
8,"tadā","_","_","tadā","CAD","","_","_"
1,"yudhyataḥ","_","_","yudh","KDP","","_","_"
2,"saha","_","_","saha","CX","","_","_"
3,"_","_","_","deva","NC","","_","_"
4,"_","_","_","tvat","PPR","","_","_"
5,"yuddhe","_","_","yuddha","NC","","_","_"
6,"bhavatu","_","_","bhav","V","bhū","_","_"
7,"maṅgalam","_","_","maṅgala","NC","","_","_"
1,"_","_","_","pūrṇa","JJ","","_","_"
2,"_","_","_","kumbha","NC","","_","_"
3,"dvijā","_","_","dvija","NC","","_","_"
4,"gāvo","_","_","go","NC","","_","_"
5,"_","_","_","yad","PRL","","_","_"
6,"_","_","_","ca","CCD","","_","_"
7,"_","_","_","anya","PPX","","_","_"
8,"kiṃcid","_","_","kiṃcit","PRI","","_","_"
9,"uttamam","_","_","uttama","JJ","","_","_"
1,"śubhaṃ","_","_","śubha","JJ","","_","_"
2,"svastyayanaṃ","_","_","svastyayana","NC","","_","_"
3,"_","_","_","ca","CCD","","_","_"
4,"_","_","_","api","CX","","_","_"
5,"bhaviṣyati","_","_","bhav","V","bhū","_","_"
6,"_","_","_","tvat","PPR","","_","_"
7,"_","_","_","aṇḍaja","NC","","_","_"
1,"yudhyamānasya","_","_","yudh","KDP","","_","_"
2,"saṃgrāme","_","_","saṃgrāma","NC","","_","_"
3,"devaiḥ","_","_","deva","NC","","_","_"
4,"sārdhaṃ","_","_","sārdha","CX","","_","_"
5,"_","_","_","mahat","JJ","","_","_"
6,"_","_","_","bala","NC","","_","_"
1,"ṛco","_","_","ṛc","NC","","_","_"
2,"yajūṃṣi","_","_","yajus","NC","","_","_"
3,"sāmāni","_","_","sāman","NC","","_","_"
4,"pavitrāṇi","_","_","pavitra","NC","","_","_"
5,"havīṃṣi","_","_","havis","NC","","_","_"
6,"ca","_","_","ca","CCD","","_","_"
1,"rahasyāni","_","_","rahasya","NC","","_","_"
2,"ca","_","_","ca","CCD","","_","_"
3,"sarvāṇi","_","_","sarva","JQ","","_","_"
4,"sarve","_","_","sarva","JQ","","_","_"
5,"_","_","_","veda","NC","","_","_"
6,"_","_","_","ca","CCD","","_","_"
7,"te","_","_","tvat","PPR","","_","_"
8,"balam","_","_","bala","NC","","_","_"
1,"_","_","_","iti","CQT","","_","_"
2,"_","_","_","vac","PPP","","_","_"
3,"garuḍaḥ","_","_","garuḍa","NC","","_","_"
4,"pitrā","_","_","pitṛ","NC","","_","_"
5,"_","_","_","ga","PPP","","_","_"
6,"_","_","_","tad","PRD","","_","_"
7,"hradam","_","_","hrada","NC","","_","_"
8,"antikāt","_","_","antika","NC","","_","_"
1,"apaśyan","_","_","paś","V","paś","_","_"
2,"_","_","_","nirmala","JJ","","_","_"
3,"_","_","_","jala","NC","","_","_"
4,"_","_","_","nānā","CX","","_","_"
5,"_","_","_","pakṣin","NC","","_","_"
6,"_","_","_","samākula","JJ","","_","_"
1,"etasminn","_","_","tad","PRD","","_","_"
2,"eva","_","_","eva","CEM","","_","_"
3,"kāle","_","_","kāla","NC","","_","_"
4,"tu","_","_","tu","CCD","","_","_"
5,"_","_","_","tad","PRD","","_","_"
6,"_","_","_","ṛṣi","NC","","_","_"
7,"_","_","_","vitta","NC","","_","_"
8,"_","_","_","lolupa","JJ","","_","_"
1,"_","_","_","gaja","NC","","_","_"
2,"_","_","_","kacchapatā","NC","","_","_"
3,"prāpya","_","_","prāp","CGDA","","_","_"
4,"yuyudhāte","_","_","yudh","V","yudh","_","_"
5,"parasparam","_","_","paraspara","PRC","","_","_"
1,"sa","_","_","tad","PRD","","_","_"
2,"_","_","_","tad","PRD","","_","_"
3,"_","_","_","śru","CGDA","","_","_"
4,"pitur","_","_","pitṛ","NC","","_","_"
5,"vākyaṃ","_","_","vākya","NC","","_","_"
6,"_","_","_","bhīma","JJ","","_","_"
7,"_","_","_","vega","NC","","_","_"
8,"_","_","_","antarikṣa","NC","","_","_"
9,"_","_","_","ga","JJ","","_","_"
1,"nakhena","_","_","nakha","NC","","_","_"
2,"gajam","_","_","gaja","NC","","_","_"
3,"ekena","_","_","eka","PPX","","_","_"
4,"kūrmam","_","_","kūrma","NC","","_","_"
5,"ekena","_","_","eka","PPX","","_","_"
6,"_","_","_","ca","CCD","","_","_"
7,"_","_","_","kṣip","V","kṣip","_","_"
1,"samutpapāta","_","_","samutpat","V","samutpat","_","_"
2,"_","_","_","ca","CCD","","_","_"
3,"_","_","_","ākāśa","NC","","_","_"
4,"tata","_","_","tatas","CX","","_","_"
5,"uccair","_","_","uccais","CX","","_","_"
6,"vihaṃgamaḥ","_","_","vihaṃgama","NC","","_","_"
1,"so","_","_","tad","PRD","","_","_"
2,"'lambatīrtham","_","_","āsāday","CGDA","","_","_"
3,"āsādya","_","_","devavṛkṣa","NC","","_","_"
4,"devavṛkṣān","_","_","upaga","V","upaga","_","_"
1,"te","_","_","tad","PRD","","_","_"
2,"bhītāḥ","_","_","bhī","PPP","","_","_"
3,"samakampanta","_","_","saṃkamp","V","saṃkamp","_","_"
4,"tasya","_","_","tad","PRD","","_","_"
5,"_","_","_","pakṣa","NC","","_","_"
6,"_","_","_","anila","NC","","_","_"
7,"_","_","_","āhan","PPP","","_","_"
1,"na","_","_","na","CNG","","_","_"
2,"no","_","_","mat","PPR","","_","_"
3,"bhañjyād","_","_","bhañj","V","bhañj","_","_"
4,"iti","_","_","iti","CQT","","_","_"
5,"tadā","_","_","tadā","CAD","","_","_"
6,"divyāḥ","_","_","divya","JJ","","_","_"
7,"_","_","_","kanaka","NC","","_","_"
8,"_","_","_","śākhin","NC","","_","_"
1,"_","_","_","pracala","JJ","","_","_"
2,"_","_","_","aṅga","NC","","_","_"
3,"sa","_","_","tad","PRD","","_","_"
4,"tān","_","_","tad","PRD","","_","_"
5,"dṛṣṭvā","_","_","dṛś","CGDA","","_","_"
6,"_","_","_","manoratha","NC","","_","_"
7,"_","_","_","phala","NC","","_","_"
8,"_","_","_","aṅkura","NC","","_","_"
1,"anyān","_","_","anya","PPX","","_","_"
2,"_","_","_","atula","JJ","","_","_"
3,"_","_","_","rūpa","NC","","_","_"
4,"_","_","_","aṅga","NC","","_","_"
5,"upacakrāma","_","_","upakar","V","upakṛ","_","_"
6,"khecaraḥ","_","_","khecara","NC","","_","_"
1,"kāñcanai","_","_","kāñcana","JJ","","_","_"
2,"_","_","_","rājata","JJ","","_","_"
3,"_","_","_","ca","CCD","","_","_"
4,"_","_","_","eva","CEM","","_","_"
5,"phalair","_","_","phala","NC","","_","_"
6,"_","_","_","vaiḍūrya","NC","","_","_"
7,"_","_","_","śākhin","NC","","_","_"
1,"_","_","_","sāgara","NC","","_","_"
2,"_","_","_","ambu","NC","","_","_"
3,"_","_","_","parikṣip","PPP","","_","_"
4,"bhrājamānān","_","_","bhrāj","KDP","","_","_"
5,"_","_","_","mahat","JJ","","_","_"
6,"_","_","_","druma","NC","","_","_"
1,"teṣāṃ","_","_","tad","PRD","","_","_"
2,"madhye","_","_","madhya","NC","","_","_"
3,"mahān","_","_","mahat","JJ","","_","_"
4,"āsīt","_","_","as","V","as","_","_"
5,"pādapaḥ","_","_","pādapa","NC","","_","_"
6,"_","_","_","su","CAD","","_","_"
7,"_","_","_","manohara","JJ","","_","_"
1,"_","_","_","sahasra","NUM","","_","_"
2,"_","_","_","yojana","NC","","_","_"
3,"_","_","_","utsedha","NC","","_","_"
4,"_","_","_","bahu","JJ","","_","_"
5,"_","_","_","śākhā","NC","","_","_"
6,"_","_","_","samanvita","JJ","","_","_"
1,"khagānām","_","_","khaga","NC","","_","_"
2,"ālayo","_","_","ālaya","NC","","_","_"
3,"divyo","_","_","divya","JJ","","_","_"
4,"nāmnā","_","_","nāman","NC","","_","_"
5,"_","_","_","rohiṇa","NC","","_","_"
6,"_","_","_","pādapa","NC","","_","_"
1,"yasya","_","_","yad","PRL","","_","_"
2,"chāyāṃ","_","_","chāyā","NC","","_","_"
3,"samāśritya","_","_","samāśri","CGDA","","_","_"
4,"sadyo","_","_","sadyas","CAD","","_","_"
5,"bhavati","_","_","bhav","V","bhū","_","_"
6,"nirvṛtaḥ","_","_","nirvṛta","JJ","","_","_"
1,"tam","_","_","tad","PRD","","_","_"
2,"uvāca","_","_","vak","V","vac","_","_"
3,"_","_","_","khaga","NC","","_","_"
4,"_","_","_","śreṣṭha","JJ","","_","_"
5,"tatra","_","_","tatra","CAD","","_","_"
6,"_","_","_","rohiṇa","NC","","_","_"
7,"_","_","_","pādapa","NC","","_","_"
1,"atipravṛddhaḥ","_","_","atipravṛdh","PPP","","_","_"
2,"_","_","_","su","CAD","","_","_"
3,"_","_","_","mahat","JJ","","_","_"
4,"āpatantaṃ","_","_","āpat","KDP","","_","_"
5,"manojavam","_","_","manojava","JJ","","_","_"
1,"_","_","_","yad","PRL","","_","_"
2,"_","_","_","tad","PRD","","_","_"
3,"mama","_","_","mat","PPR","","_","_"
4,"_","_","_","mahat","JJ","","_","_"
5,"_","_","_","śākhā","NC","","_","_"
6,"_","_","_","śata","NUM","","_","_"
7,"_","_","_","yojana","NC","","_","_"
8,"āyatā","_","_","āya","PPP","","_","_"
1,"etām","_","_","tad","PRD","","_","_"
2,"āsthāya","_","_","āsthā","CGDA","","_","_"
3,"śākhāṃ","_","_","śākhā","NC","","_","_"
4,"tvaṃ","_","_","tvat","PPR","","_","_"
5,"_","_","_","khād","V","khād","_","_"
6,"_","_","_","ida","PRD","","_","_"
7,"_","_","_","gaja","NC","","_","_"
8,"_","_","_","kacchapa","NC","","_","_"
1,"tato","_","_","tatas","CX","","_","_"
2,"drumaṃ","_","_","druma","NC","","_","_"
3,"_","_","_","pataga","NC","","_","_"
4,"_","_","_","sahasra","NUM","","_","_"
5,"_","_","_","sev","PPP","","_","_"
6,"_","_","_","mahīdhara","NC","","_","_"
7,"_","_","_","pratima","JJ","","_","_"
8,"_","_","_","vapus","NC","","_","_"
9,"prakampayan","_","_","prakampay","KDP","","_","_"
1,"_","_","_","khaga","NC","","_","_"
2,"_","_","_","uttama","JJ","","_","_"
3,"drutam","_","_","dru","PPP","","_","_"
4,"abhipatya","_","_","abhipat","CGDA","","_","_"
5,"vegavān","_","_","vegavat","JJ","","_","_"
6,"babhañja","_","_","bhañj","V","bhañj","_","_"
7,"tām","_","_","tad","PRD","","_","_"
8,"_","_","_","avirala","JJ","","_","_"
9,"_","_","_","pattra","NC","","_","_"
10,"_","_","_","saṃvṛ","PPP","","_","_"
