"WordID","word","NormSTEM","suffix","lemma","PoS","Root","NormSuffix","NormWord"
1,"asāvi","_","_","su","V","su","_","_"
2,"devaṃ","_","_","deva","JJ","","_","_"
3,"goṛjīkam","_","_","goṛjīka","JJ","","_","_"
4,"andho","_","_","andhas","NC","","_","_"
5,"ny","_","_","ni","CADP","","_","_"
6,"asminn","_","_","ida","PRD","","_","_"
7,"indro","_","_","indra","NC","","_","_"
8,"_","_","_","janus","NC","","_","_"
9,"_","_","_","īṃ","CX","","_","_"
10,"uvoca","_","_","uc","V","uc","_","_"
1,"bodhāmasi","_","_","bodh","V","budh","_","_"
2,"tvā","_","_","tvat","PPR","","_","_"
3,"haryaśva","_","_","haryaśva","NC","","_","_"
4,"yajñair","_","_","yajña","NC","","_","_"
5,"bodhā","_","_","bodh","V","budh","_","_"
6,"na","_","_","mat","PPR","","_","_"
7,"stomam","_","_","stoma","NC","","_","_"
8,"andhaso","_","_","andhas","NC","","_","_"
9,"madeṣu","_","_","mada","NC","","_","_"
1,"pra","_","_","pra","CADP","","_","_"
2,"yanti","_","_","e","V","i","_","_"
3,"yajñaṃ","_","_","yajña","NC","","_","_"
4,"vipayanti","_","_","vipay","V","vipay","_","_"
5,"barhiḥ","_","_","barhis","NC","","_","_"
6,"somamādo","_","_","somamad","JJ","","_","_"
7,"vidathe","_","_","vidatha","NC","","_","_"
8,"_","_","_","dudhra","JJ","","_","_"
9,"_","_","_","vāc","NC","","_","_"
1,"ny","_","_","ni","CADP","","_","_"
2,"u","_","_","u","CEM","","_","_"
3,"bhriyante","_","_","bhṛ","V","bhṛ","_","_"
4,"yaśaso","_","_","yaśas","JJ","","_","_"
5,"gṛbhād","_","_","gṛbha","NC","","_","_"
6,"ā","_","_","ā","CADP","","_","_"
7,"dūraupabdo","_","_","dūraupabda","JJ","","_","_"
8,"vṛṣaṇo","_","_","vṛṣan","NC","","_","_"
9,"nṛṣācaḥ","_","_","nṛṣāc","JJ","","_","_"
1,"tvam","_","_","tvat","PPR","","_","_"
2,"indra","_","_","indra","NC","","_","_"
3,"sravitavā","_","_","sru","CGDI","","_","_"
4,"apas","_","_","apas","NC","","_","_"
5,"kaḥ","_","_","kar","V","kṛ","_","_"
6,"pariṣṭhitā","_","_","pariṣṭhā","PPP","","_","_"
7,"ahinā","_","_","ahi","NC","","_","_"
8,"śūra","_","_","śūra","NC","","_","_"
9,"pūrvīḥ","_","_","puru","JJ","","_","_"
1,"tvad","_","_","tvat","PPR","","_","_"
2,"vāvakre","_","_","vañc","V","vañc","_","_"
3,"rathyo","_","_","rathī","JJ","","_","_"
4,"na","_","_","na","CNG","","_","_"
5,"dhenā","_","_","dhenā","NC","","_","_"
6,"rejante","_","_","rej","V","rej","_","_"
7,"viśvā","_","_","viśva","JQ","","_","_"
8,"kṛtrimāṇi","_","_","kṛtrima","JJ","","_","_"
9,"bhīṣā","_","_","bhīṣā","NC","","_","_"
1,"bhīmo","_","_","bhīma","JJ","","_","_"
2,"_","_","_","viṣ","V","viṣ","_","_"
3,"_","_","_","āyudha","NC","","_","_"
4,"eṣām","_","_","ida","PRD","","_","_"
5,"apāṃsi","_","_","apas","NC","","_","_"
6,"viśvā","_","_","viśva","JQ","","_","_"
7,"naryāṇi","_","_","narya","NC","","_","_"
8,"vidvān","_","_","vid","KDP","","_","_"
1,"indraḥ","_","_","indra","NC","","_","_"
2,"puro","_","_","pur","NC","","_","_"
3,"jarhṛṣāṇo","_","_","jarhṛṣ","KDP","","_","_"
4,"vi","_","_","vi","CADP","","_","_"
5,"dūdhod","_","_","dhū","V","dhū","_","_"
6,"vi","_","_","vi","CADP","","_","_"
7,"_","_","_","vajra","NC","","_","_"
8,"_","_","_","hasta","NC","","_","_"
9,"mahinā","_","_","mahina","NC","","_","_"
10,"jaghāna","_","_","han","V","han","_","_"
1,"na","_","_","na","CNG","","_","_"
2,"yātava","_","_","yātu","NC","","_","_"
3,"indra","_","_","indra","NC","","_","_"
4,"jūjuvur","_","_","jū","V","jū","_","_"
5,"no","_","_","mat","PPR","","_","_"
6,"na","_","_","na","CNG","","_","_"
7,"vandanā","_","_","vandana","NC","","_","_"
8,"śaviṣṭha","_","_","śaviṣṭha","JJ","","_","_"
9,"vedyābhiḥ","_","_","vedyā","NC","","_","_"
1,"sa","_","_","tad","PRD","","_","_"
2,"śardhad","_","_","śṛdh","V","śṛdh","_","_"
3,"aryo","_","_","ari","JJ","","_","_"
4,"viṣuṇasya","_","_","viṣuṇa","JJ","","_","_"
5,"jantor","_","_","jantu","NC","","_","_"
6,"mā","_","_","mā","CNG","","_","_"
7,"_","_","_","śiśna","NC","","_","_"
8,"_","_","_","deva","NC","","_","_"
9,"api","_","_","api","CX","","_","_"
10,"gur","_","_","gā","V","gā","_","_"
11,"ṛtaṃ","_","_","ṛta","NC","","_","_"
12,"naḥ","_","_","mat","PPR","","_","_"
1,"abhi","_","_","abhi","CADP","","_","_"
2,"_","_","_","kratu","NC","","_","_"
3,"_","_","_","indra","NC","","_","_"
4,"bhūr","_","_","bhav","V","bhū","_","_"
5,"adha","_","_","adha","CX","","_","_"
6,"jman","_","_","jman","NC","","_","_"
7,"na","_","_","na","CNG","","_","_"
8,"te","_","_","tvat","PPR","","_","_"
9,"vivyaṅ","_","_","vyac","V","vyac","_","_"
10,"mahimānaṃ","_","_","mahiman","NC","","_","_"
11,"rajāṃsi","_","_","rajas","NC","","_","_"
1,"svenā","_","_","sva","JJ","","_","_"
2,"hi","_","_","hi","CX","","_","_"
3,"vṛtraṃ","_","_","vṛtra","NC","","_","_"
4,"śavasā","_","_","śavas","NC","","_","_"
5,"jaghantha","_","_","han","V","han","_","_"
6,"na","_","_","na","CNG","","_","_"
7,"śatrur","_","_","śatru","NC","","_","_"
8,"antaṃ","_","_","anta","NC","","_","_"
9,"vividad","_","_","vid","V","vid","_","_"
10,"yudhā","_","_","yudh","NC","","_","_"
11,"te","_","_","tvat","PPR","","_","_"
1,"devāś","_","_","deva","NC","","_","_"
2,"cit","_","_","cit","CEM","","_","_"
3,"te","_","_","tvat","PPR","","_","_"
4,"asuryāya","_","_","asurya","NC","","_","_"
5,"pūrve","_","_","pūrva","PPX","","_","_"
6,"'nu","_","_","anu","CADP","","_","_"
7,"kṣatrāya","_","_","kṣatra","NC","","_","_"
8,"mamire","_","_","mā","V","mā","_","_"
9,"sahāṃsi","_","_","sahas","NC","","_","_"
1,"indro","_","_","indra","NC","","_","_"
2,"maghāni","_","_","magha","NC","","_","_"
3,"dayate","_","_","day","V","day","_","_"
4,"_","_","_","viṣah","CGDA","","_","_"
5,"_","_","_","indra","NC","","_","_"
6,"vājasya","_","_","vāja","NC","","_","_"
7,"johuvanta","_","_","johav","V","johav","_","_"
8,"sātau","_","_","sāti","NC","","_","_"
1,"kīriś","_","_","kīri","NC","","_","_"
2,"_","_","_","cit","CEM","","_","_"
3,"_","_","_","hi","CX","","_","_"
4,"tvām","_","_","tvat","PPR","","_","_"
5,"avase","_","_","av","CGDI","","_","_"
6,"_","_","_","hvā","V","hvā","_","_"
7,"_","_","_","īś","KDP","","_","_"
8,"indra","_","_","indra","NC","","_","_"
9,"saubhagasya","_","_","saubhaga","NC","","_","_"
10,"bhūreḥ","_","_","bhūri","JQ","","_","_"
1,"avo","_","_","avas","CX","","_","_"
2,"babhūtha","_","_","bhav","V","bhū","_","_"
3,"śatamūte","_","_","śatamūti","JJ","","_","_"
4,"asme","_","_","mat","PPR","","_","_"
5,"abhikṣattus","_","_","abhikṣattṛ","NC","","_","_"
6,"tvāvato","_","_","tvāvat","JJ","","_","_"
7,"varūtā","_","_","varūtṛ","JJ","","_","_"
1,"sakhāyas","_","_","sakhi","NC","","_","_"
2,"ta","_","_","tvat","PPR","","_","_"
3,"indra","_","_","indra","NC","","_","_"
4,"viśvaha","_","_","viśvaha","CX","","_","_"
5,"syāma","_","_","as","V","as","_","_"
6,"_","_","_","namas","NC","","_","_"
7,"_","_","_","vṛdha","JJ","","_","_"
8,"mahinā","_","_","mahina","NC","","_","_"
9,"tarutra","_","_","tarutra","JJ","","_","_"
1,"vanvantu","_","_","van","V","van","_","_"
2,"smā","_","_","sma","CX","","_","_"
3,"te","_","_","tvat","PPR","","_","_"
4,"'vasā","_","_","avas","NC","","_","_"
5,"samīke","_","_","samīka","NC","","_","_"
6,"'bhītim","_","_","abhīti","NC","","_","_"
7,"aryo","_","_","ari","JJ","","_","_"
8,"vanuṣāṃ","_","_","vanus","JJ","","_","_"
9,"śavāṃsi","_","_","śavas","NC","","_","_"
1,"sa","_","_","tad","PRD","","_","_"
2,"na","_","_","mat","PPR","","_","_"
3,"indra","_","_","indra","NC","","_","_"
4,"tvayatāyā","_","_","tvayata","JJ","","_","_"
5,"iṣe","_","_","iṣ","NC","","_","_"
6,"dhās","_","_","dadh","V","dhā","_","_"
7,"tmanā","_","_","tman","NC","","_","_"
8,"ca","_","_","ca","CCD","","_","_"
9,"ye","_","_","yad","PRL","","_","_"
10,"maghavāno","_","_","maghavan","JJ","","_","_"
11,"junanti","_","_","jū","V","jū","_","_"
1,"vasvī","_","_","vasu","JJ","","_","_"
2,"ṣu","_","_","su","CAD","","_","_"
3,"te","_","_","tvat","PPR","","_","_"
4,"jaritre","_","_","jaritṛ","NC","","_","_"
5,"astu","_","_","as","V","as","_","_"
6,"śaktir","_","_","śakti","NC","","_","_"
7,"yūyam","_","_","tvat","PPR","","_","_"
8,"pāta","_","_","pib","V","pā","_","_"
9,"svastibhiḥ","_","_","svasti","NC","","_","_"
10,"sadā","_","_","sadā","CAD","","_","_"
11,"naḥ","_","_","mat","PPR","","_","_"
