"WordID","word","NormSTEM","suffix","lemma","PoS","Root","NormSuffix","NormWord"
NA,"<doc textid = ""dhvajagrakeyurahrdaya"" genre = ""dhāraṇī"" title = ""dhvajāgrakeyūrāhṛdaya"" author = ""n / a"" discourse = ""tantra"" tradition = ""buddh"" period = ""commentarial"" source = ""gretil accessed sept 2020 : http :// gretil.sub.uni-goettingen.d e/ greti l/ corpuste i/ sa_.xml"" date_range = ""4. ce"" notes = ""gretil text does not contain page numbers; dating based tentatively on date suvarṇaprabhāsottamasūtra with which dhvajāgrakeyūrāhṛdaya may be contemporaneous; see gergely hidas. 'buddhism; kingship and the protection of the state: the suvarṇaprabhāsottamasūtra and dhāraṇī literature.' in: dominic goodall; shaman hatley; harunaga isācson; and srilata raman. 2020. śaivism and the tantric traditions: essays in honour of alexis g.j.s. sanderson. leiden: brill. p. 237"" religion = ""buddh"" edition = ""based on the ed. by p. giunta 2008"" digitization = ""k. wille"" segmentation_lemmatization = ""ligeia lugli & buddhist translators workbench team"" metadata_enrichment = ""bruno galasek-hul & buddhist translators workbench team"" proofreader = "" n/ a"" permission = ""permission for derivatives from m. mehner on behalf of gretil"" reconstructions = ""none"">","","","","","","",""
NA,"<page number=""1"">","","","","","","",""
NA,"<s number=""1"">","","","","","","",""
1,"//","","","","punct","","","//"
2,"siddhaṃ","SIDDH","aṃ","siddha","noun-adj","","am","siddham"
3,"namo","NAM","o","namas","noun-adj","","aḥ","namaḥ"
4,"bhagavatyai","BHAGAV","atyai","bhagava","noun-adj","","atyai","bhagavatyai"
5,"ārya","ĀRY","a","ārya","noun-adj","","a","ārya"
6,"dhvajāgrakeyūrāyai","DHVAJĀGRAKEYŪR","āyai","dhvajāgrakeyūrā","noun-adj","","āyai","dhvajāgrakeyūrāyai"
7,"//","","","","punct","","","//"
NA,"</s>","","","","","","",""
NA,"<s number=""2"">","","","","","","",""
1,"evaṃ","","","eva","ind","","","eva"
2,"mayā","","","mat","pron","","","mat"
3,"śrutam","ŚRUT","am","śruta","noun-adj","","am","śrutam"
4,"ekasmin","EK","asmin","eka","noun-adj","","asmin","ekasmin"
5,"samaye","SAMAY","e","samaya","noun-adj","","e","samaye"
6,"bhagavān","BHAGAV","ān","bhagavat","noun-adj","","ān","bhagavān"
7,"deveṣu","DEV","eṣu","deva","noun-adj","","eṣu","deveṣu"
8,"trayastriṃśeṣu","TRAYASTRIṂŚ","eṣu","tri","noun-adj","","eṣu","trayastriṃśeṣu"
9,"viharati","VIHAR","ati","vihar","verb","vihṛ","ati","viharati"
10,"sma","","","sma","ind","","","sma"
11,"pāṇḍu","PĀṆḌ","u","pāṇḍu","noun-adj","","u","pāṇḍu"
12,"kambala","KAMBAL","a","kambala","noun-adj","","a","kambala"
13,"śilāyām","ŚIL","āyām","śilā","noun-adj","","āyām","śilāyām"
14,"/","","","","punct","","","/"
NA,"</s>","","","","","","",""
NA,"<s number=""3"">","","","","","","",""
1,"atha","","","atha","ind","","","atha"
2,"khalu","KHAL","u","khalu","noun-adj","","u","khalu"
3,"śakro","ŚAKR","o","śakra","noun-adj","","aḥ","śakraḥ"
4,"devānām","DEV","ānām","deva","noun-adj","","ānām","devānām"
5,"indro","INDR","o","indra","noun-adj","","aḥ","indraḥ"
6,"asurair","ASUR","air","asura","noun-adj","","air","asurair"
7,"jitaḥ","JIT","aḥ","jita","noun-adj","","aḥ","jitaḥ"
8,"parājitaḥ","PARĀJIT","aḥ","parājita","noun-adj","","aḥ","parājitaḥ"
9,"satvaraṃ","SATVAR","aṃ","satvara","noun-adj","","am","satvaram"
10,"tva","","","tvat","pron","","","tvat"
11,"ramāṇa","R","amāṇa","ram","verb","ram","amāṇa","ramāṇa"
12,"rūpo","RŪP","o","rūpa","noun-adj","","aḥ","rūpaḥ"
13,"yena","","","yad","pron","","","yad"
14,"bhagavāṃs","BHAGAV","āṃs","bhagavat","noun-adj","","āṃs","bhagavāṃs"
15,"ten","","","tad","pron","","","tad"
16,"opasaṃkrāntaḥ","UPASAṂKRĀNT","aḥ","upasaṃkrānta","noun-adj","","aḥ","upasaṃkrāntaḥ"
17,"/","","","","punct","","","/"
NA,"</s>","","","","","","",""
NA,"<s number=""4"">","","","","","","",""
1,"upasaṃkramya","UPASAṂKRAM","ya","upasaṃkram","verb","upasaṃkram","ya","upasaṃkramya"
2,"bhagavataḥ","BHAGAV","ataḥ","bhagavat","noun-adj","","ataḥ","bhagavataḥ"
3,"pādau","PĀD","au","pāda","noun-adj","","au","pādau"
4,"śiras","ŚIRAS","a","śiras","noun-adj","","a","śirasa"
5,"^ābhivandya","ABHIVAND","ya","abhivand","verb","abhivand","ya","abhivandya"
6,"bhagavantam","BHAGAV","antam","bhagavat","noun-adj","","antam","bhagavantam"
7,"etad","ETAD","","tad","pron","","","etad"
8,"avocat","AVOCAT","","vak","verb","","","avocat"
9,"/","","","","punct","","","/"
NA,"</s>","","","","","","",""
NA,"<s number=""5"">","","","","","","",""
1,"ih","","","iha","ind","","","iha"
2,"āhaṃ","ĀHAṂ","","mat","pron","","","āhaṃ"
3,"bhagavan","BHAGAV","an","bhagavat","noun-adj","","ān","bhagavān"
4,"vemacitriṇā","VEMACITR","iṇā","vemacitrin","noun-adj","","inā","vemacitrinā"
5,"surendreṇa","SURENDR","eṇa","surendra","noun-adj","","ena","surendrena"
6,"jitaḥ","JIT","aḥ","jita","noun-adj","","aḥ","jitaḥ"
7,"parājito","PARĀJIT","o","parājita","noun-adj","","aḥ","parājitaḥ"
8,"devās","DEV","ās","deva","noun-adj","","āḥ","devāḥ"
9,"trayastriṃśāś","TRAYASTRIṂŚ","āś","tra","noun-adj","","āḥ","trayastriṃśāḥ"
10,"ca","","","ca","ind","","","ca"
11,"jitāḥ","JIT","āḥ","jita","noun-adj","","āḥ","jitāḥ"
12,"parājitāḥ","PARĀJIT","āḥ","parājita","noun-adj","","āḥ","parājitāḥ"
13,"/","","","","punct","","","/"
NA,"</s>","","","","","","",""
NA,"<s number=""6"">","","","","","","",""
1,"tatrāsmābhir","","","","ind","","",""
2,"bhagavan","BHAGAV","an","bhagavat","noun-adj","","ān","bhagavān"
3,"kathaṃ","","","katham","ind","","","katham"
4,"pratipattavyam","PRATIPAT","tavyam","pratipad","noun-adj","","tavyam","pratipattavyam"
5,"/","","","","punct","","","/"
NA,"</s>","","","","","","",""
NA,"<s number=""7"">","","","","","","",""
1,"bhagavān","BHAGAV","ān","bhagavat","noun-adj","","ān","bhagavān"
2,"āha","ĀH","a","ah","verb","ah","a","āha"
3,"/","","","","punct","","","/"
NA,"</s>","","","","","","",""
NA,"<s number=""8"">","","","","","","",""
1,"udgṛhṇa","UDGṚHṆ","a","udgṛhṇāti","noun-adj","","a","udgṛhṇa"
2,"tvaṃ","","","tvat","pron","","","tvat"
3,"dev","DEV","a","deva","noun-adj","","a","deva"
4,"^endra","INDR","a","indra","noun-adj","","a","indra"
5,"dhvajāgrakeyūrānām","DHVAJĀGRAKEYŪR","ānām","dhvajāgrakeyūra","noun-adj","","ānām","dhvajāgrakeyūrānām"
6,"a","","","alpha_privativum","ind","","","alpha_privativum"
7,"dhāriṇīm","DHĀRIṆ","īm","dhāriṇī","noun-adj","","īm","dhāriṇīm"
8,"aparājitāṃ","APARĀJIT","āṃ","aparājitā","noun-adj","","ām","aparājitām"
9,"yā","","","yad","pron","","","yad"
10,"mayā","","","mat","pron","","","mat"
11,"pūrvaṃ","PŪRV","aṃ","pūrva","noun-adj","","am","pūrvam"
12,"bodhisatva","BODHISATTV","a","bodhisattva","noun-adj","","a","bodhisattva"
13,"bhūten","BHŪT","en","bhūta","noun-adj","","ena","bhūtena"
14,"āparājitadhvajasya","APARĀJITADHVAJ","asya","aparājitadhvaja","noun-adj","","asya","aparājitadhvajasya"
15,"tathāgatasy","TATHĀGAT","asya","tathāgata","noun-adj","","asya","tathāgatasya"
16,"^āntikād","ANT","ikād","antika","noun-adj","","ikād","antikād"
17,"udgṛhītā","UDGṚHĪT","ā","udgṛhīta","noun-adj","","ā","udgṛhītā"
18,"/","","","","punct","","","/"
NA,"</s>","","","","","","",""
NA,"<s number=""9"">","","","","","","",""
1,"udgṛhya","UDGṚH","ya","udgrah","verb","udgrah","ya","udgṛhya"
2,"parebhyo","PAR","ebhyo","para","noun-adj","","ebhyaḥ","parebhyaḥ"
3,"vistareṇa","VISTAR","eṇa","vistara","noun-adj","","ena","vistarena"
4,"saṃprakāśitā","SAṂPRAKĀŚIT","ā","saṃprakāśitā","noun-adj","","ā","saṃprakāśitā"
5,"/","","","","punct","","","/"
NA,"</s>","","","","","","",""
NA,"<s number=""10"">","","","","","","",""
1,"n","","","na","ind","","","na"
2,"ābhijānāmi","ABHIJĀN","āmi","abhijān","verb","abhijñā","āmi","abhijānāmi"
3,"tato","","","tatas","ind","","","tatas"
4,"arvāg","ARVĀG","","arvāga","noun-adj","","","arvāg"
5,"bhayaṃ","BHAY","aṃ","bhaya","noun-adj","","am","bhayam"
6,"vā","","","vā","ind","","","vā"
7,"stambhi","STAMBH","i","stambhi","noun-adj","","i","stambhi"
8,"tatvaṃ","TATV","aṃ","tatva","noun-adj","","am","tatvam"
9,"vā","","","vā","ind","","","vā"
10,"roma","ROM","a","roma","noun-adj","","a","roma"
11,"harṣa","HARṢ","a","harṣa","noun-adj","","a","harṣa"
12,"nimittaṃ","NIMITT","aṃ","nimitta","noun-adj","","am","nimittam"
13,"vāntaśaḥ","VĀNT","aśaḥ","vānta","noun-adj","","aśaḥ","vāntaśaḥ"
14,"kṣaṇikām","KṢAṆIK","ām","kṣaṇika","noun-adj","","ām","kṣaṇikām"
15,"api","","","api","ind","","","api"
16,"kāya","KĀY","a","kāya","noun-adj","","a","kāya"
17,"pīḍām","PĪḌ","ām","pīḍā","noun-adj","","ām","pīḍām"
18,"/","","","","punct","","","/"
NA,"</s>","","","","","","",""
NA,"<s number=""11"">","","","","","","",""
1,"tat","TAT","","tad","pron","","","tat"
2,"katamā","KATAM","ā","katama","noun-adj","","āḥ","katamāḥ"
3,"sā","","","tad","pron","","","tad"
4,"bhagavan","BHAGAV","an","bhagavat","noun-adj","","ān","bhagavān"
5,"dhvajāgrakeyūrā","DHVAJĀGRAKEYŪR","ā","dhvajāgrakeyūra","noun-adj","","āḥ","dhvajāgrakeyūrāḥ"
6,"nāma","NĀM","a","nāman","noun-adj","","a","nāma"
7,"dhāriṇī","DHĀRIṆ","ī","dhāriṇī","noun-adj","","ī","dhāriṇī"
8,"aparājitā","APARĀJIT","ā","aparājita","noun-adj","","ā","aparājitā"
9,"/","","","","punct","","","/"
NA,"</s>","","","","","","",""
NA,"<s number=""12"">","","","","","","",""
1,"tadyathā","","","tadyathā","ind","","","tadyathā"
2,"oṃ","","","oṃ","ind","","","oṃ"
3,"jaya","JAY","a","jaya","noun-adj","","a","jaya"
4,"jaya","JAY","a","jaya","noun-adj","","a","jaya"
5,"vijaya","VIJAY","a","vijaya","noun-adj","","a","vijaya"
6,"vijaya","VIJAY","a","vijaya","noun-adj","","a","vijaya"
7,"jayavā","JAY","avā","jaya","noun-adj","","avā","jayavā"
8,"hini","HIN","i","hini","noun-adj","","i","hini"
9,"śaṅkari","ŚAṂKAR","i","śaṃkari","noun-adj","","i","śaṃkari"
10,"bhayaṅ","BHAY","aṅ","bhaya","noun-adj","","am","bhayam"
11,"kari","KAR","i","kari","noun-adj","","i","kari"
12,"prabhañjani","PRABHAÑJAN","i","prabhañjana","noun-adj","","i","prabhañjani"
13,"rakṣa","RAKṢ","a","rakṣa","noun-adj","","a","rakṣa"
14,"rakṣa","RAKṢ","a","rakṣa","noun-adj","","a","rakṣa"
15,"āvadhūta","AVADHŪT","a","avadhūta","noun-adj","","a","avadhūta"
16,"śrī","ŚR","ī","śrī","noun-adj","","ī","śrī"
17,"ālakha","ĀLAK","ha","alaka","noun-adj","","ha","ālakha"
18,"vajraṃ","VAJR","aṃ","vajra","noun-adj","","am","vajram"
19,"saparivāraṃ","SAPARIVĀR","aṃ","saparivāra","noun-adj","","am","saparivāram"
20,"sarva","SARV","a","sarva","noun-adj","","a","sarva"
21,"satvāṃś","SATTV","āṃś","sattva","noun-adj","","āṃś","sattvāṃś"
22,"ca","","","ca","ind","","","ca"
23,"/","","","","punct","","","/"
NA,"</s>","","","","","","",""
NA,"<s number=""13"">","","","","","","",""
1,"pratyarthiko","PRATYARTHIK","o","pratyarthika","noun-adj","","aḥ","pratyarthikaḥ"
2,"vā","","","vā","ind","","","vā"
3,"pratyamitrov","PRATYAMITR","ov","pratyamitra","noun-adj","","ov","pratyamitrov"
4,"ābhidravati","ABHIDR","avati","abhidru","verb","abhidru","avati","abhidravati"
5,"/","","","","punct","","","/"
NA,"</s>","","","","","","",""
NA,"<s number=""14"">","","","","","","",""
1,"oṃ","","","oṃ","ind","","","oṃ"
2,"jambhaya","JAMBHA","aya","jambha","noun-adj","","aya","jambhaaya"
3,"jambhaya","JAMBHA","aya","jambha","noun-adj","","aya","jambhaaya"
4,"stambhaya","STAMBH","a","stambha","noun-adj","","a","stambha"
5,"stambhaya","STAMBH","a","stambha","noun-adj","","a","stambha"
6,"mohaya","MOH","aya","moha","noun-adj","","aya","mohaya"
7,"mohaya","MOH","aya","moha","noun-adj","","aya","mohaya"
8,"bhagavati","BHAGAV","ati","bhagavat","noun-adj","","ati","bhagavati"
9,"jayavā","JAY","avā","jaya","noun-adj","","avā","jayavā"
10,"hini","HIN","i","hini","noun-adj","","i","hini"
11,"matha","MATH","a","matha","noun-adj","","a","matha"
12,"matha","MATH","a","matha","noun-adj","","a","matha"
13,"pramatha","PRAMATH","a","pramatha","noun-adj","","a","pramatha"
14,"pramatha","PRAMATH","a","pramatha","noun-adj","","a","pramatha"
15,"grasa","GRAS","a","grasa","noun-adj","","a","grasa"
16,"grasa","GRAS","a","grasa","noun-adj","","a","grasa"
17,"hasa","HAS","a","hasa","noun-adj","","a","hasa"
18,"hasa","HAS","a","hasa","noun-adj","","a","hasa"
19,"hūṃ","","","","ind","","",""
20,"hūṃ","","","","ind","","",""
21,"lambha","LAMBHA","a","lambha","noun-adj","","a","lambhaa"
22,"lambha","LAMBHA","a","lambha","noun-adj","","a","lambhaa"
23,"lambodari","LAṂBODAR","i","laṃbodari","noun-adj","","i","laṃbodari"
24,"tri","TR","i","tri","noun-adj","","i","tri"
25,"netre","NETR","e","netra","noun-adj","","e","netre"
26,"catur","CAT","ur","catur","noun-adj","","ur","catur"
27,"vaktre","VAKTR","e","vaktra","noun-adj","","e","vaktre"
28,"catur","CAT","ur","catur","noun-adj","","ur","catur"
29,"daṃṣṭre","DAṂṢṬR","e","daṃṣṭra","noun-adj","","e","daṃṣṭre"
30,"catur","CAT","ur","catur","noun-adj","","ur","catur"
31,"bhuje","BHUJ","e","bhuja","noun-adj","","e","bhuje"
32,"a","","","alpha_privativum","ind","","","alpha_privativum"
33,"simu","SIM","u","sima","noun-adj","","u","simu"
34,"śala","ŚAL","a","śala","noun-adj","","a","śala"
35,"cakra","CAKR","a","cakra","noun-adj","","a","cakra"
36,"triśūla","TRIŚŪL","a","triśūla","noun-adj","","a","triśūla"
37,"vajra","VAJR","a","vajra","noun-adj","","a","vajra"
38,"kavaca","KAVAC","a","kavaca","noun-adj","","a","kavaca"
39,"mudrā","MUDR","ā","mudrā","noun-adj","","ā","mudrā"
40,"dhāriṇi","DHĀRIṆ","i","dhāriṇī","noun-adj","","i","dhāriṇi"
41,"rakṣa","RAKṢ","a","rakṣa","noun-adj","","a","rakṣa"
42,"rakṣa","RAKṢ","a","rakṣa","noun-adj","","a","rakṣa"
43,"āvadhūta","AVADHŪT","a","avadhūta","noun-adj","","a","avadhūta"
44,"śrī","ŚR","ī","śrī","noun-adj","","ī","śrī"
45,"ālakha","ĀLAK","ha","alaka","noun-adj","","ha","ālakha"
46,"vajraṃ","VAJR","aṃ","vajra","noun-adj","","am","vajram"
47,"saparivāraṃ","SAPARIVĀR","aṃ","saparivāra","noun-adj","","am","saparivāram"
48,"sarva","SARV","a","sarva","noun-adj","","a","sarva"
49,"satvāṃś","SATTV","āṃś","sattva","noun-adj","","āṃś","sattvāṃś"
50,"ca","","","ca","ind","","","ca"
51,"bhagavati","BHAGAV","ati","bhagavat","noun-adj","","ati","bhagavati"
52,"sarv","SARV","a","sarva","noun-adj","","a","sarva"
53,"^opadrav","UPADRAV","a","upadrava","noun-adj","","a","upadrava"
54,"^opasarg","UPASARG","a","upasarga","noun-adj","","a","upasarga"
55,"^opāyāsebhyaḥ","UPĀYĀS","ebhyaḥ","upāyāsa","noun-adj","","ebhyaḥ","upāyāsebhyaḥ"
56,"/","","","","punct","","","/"
NA,"</s>","","","","","","",""
NA,"<s number=""15"">","","","","","","",""
1,"he","","","","ind","","",""
2,"he","","","","ind","","",""
3,"bhagavati","BHAGAV","ati","bhagavat","noun-adj","","ati","bhagavati"
4,"hana","HAN","a","hana","noun-adj","","a","hana"
5,"hana","HAN","a","hana","noun-adj","","a","hana"
6,"daha","","","","ind","","",""
7,"daha","","","","ind","","",""
8,"paca","PAC","a","paca","noun-adj","","a","paca"
9,"paca","PAC","a","paca","noun-adj","","a","paca"
10,"matha","MATH","a","matha","noun-adj","","a","matha"
11,"matha","MATH","a","matha","noun-adj","","a","matha"
12,"pramatha","PRAMATH","a","pramatha","noun-adj","","a","pramatha"
13,"pramatha","PRAMATH","a","pramatha","noun-adj","","a","pramatha"
14,"dhuna","DHUN","a","dhuna","noun-adj","","a","dhuna"
15,"dhuna","DHUN","a","dhuna","noun-adj","","a","dhuna"
16,"vidhuna","VIDH","una","vidhu","noun-adj","","una","vidhuna"
17,"vidhu","VIDH","u","vidhu","noun-adj","","u","vidhu"
18,"nahūṃ","NAH","ūṃ","nahū","noun-adj","","ūm","nahūm"
19,"hūṃ","","","","ind","","",""
20,"phaṭ","PHAṬ","","phaṭa","noun-adj","","","phaṭ"
21,"phaṭ","PHAṬ","","phaṭa","noun-adj","","","phaṭ"
22,"bhañja","BHAÑJ","a","bhañja","noun-adj","","a","bhañja"
23,"bhañja","BHAÑJ","a","bhañja","noun-adj","","a","bhañja"
24,"para","PAR","a","para","noun-adj","","a","para"
25,"sainyaṃ","SAINY","aṃ","sainya","noun-adj","","am","sainyam"
26,"vidhvaṃsaya","VIDHVAṂS","aya","vidhvaṃsa","noun-adj","","aya","vidhvaṃsaya"
27,"āvadhūta","AVADHŪT","a","avadhūta","noun-adj","","a","avadhūta"
28,"śrī","ŚR","ī","śrī","noun-adj","","ī","śrī"
29,"ālakha","ĀLAK","ha","alaka","noun-adj","","ha","ālakha"
30,"vajrasya","VAJR","asya","vajra","noun-adj","","asya","vajrasya"
31,"saparivārasya","SAPARIVĀR","asya","saparivāra","noun-adj","","asya","saparivārasya"
32,"sarva","SARV","a","sarva","noun-adj","","a","sarva"
33,"śatrūn","ŚATR","ūn","śatru","noun-adj","","ūm","śatrūm"
34,"/","","","","punct","","","/"
NA,"</s>","","","","","","",""
NA,"<s number=""16"">","","","","","","",""
1,"dhvajāgrakeyūre","DHVAJĀGRAKEYŪR","e","dhvajāgrakeyūra","noun-adj","","e","dhvajāgrakeyūre"
2,"tṛṭa","","","","ind","","",""
3,"tṛṭa","","","","ind","","",""
4,"tṛṭu","","","","ind","","",""
5,"tṛṭu","","","","ind","","",""
6,"ulkādhāriṇi","ULKĀDHĀR","iṇi","ulkādhārin","noun-adj","","ini","ulkādhārini"
7,"trailokya","TRAILOKY","a","trailokya","noun-adj","","a","trailokya"
8,"mathani","MATHAN","i","mathana","noun-adj","","i","mathani"
9,"vidhvaṃsaya","VIDHVAṂS","aya","vidhvaṃsa","noun-adj","","aya","vidhvaṃsaya"
10,"para","PAR","a","para","noun-adj","","a","para"
11,"sainyam","SAINY","am","sainya","noun-adj","","am","sainyam"
12,"/","","","","punct","","","/"
NA,"</s>","","","","","","",""
NA,"<s number=""17"">","","","","","","",""
1,"rakṣa","RAKṢ","a","rakṣa","noun-adj","","a","rakṣa"
2,"rakṣa","RAKṢ","a","rakṣa","noun-adj","","a","rakṣa"
3,"āvadhūta","AVADHŪT","a","avadhūta","noun-adj","","a","avadhūta"
4,"śrī","ŚR","ī","śrī","noun-adj","","ī","śrī"
5,"ālakha","ĀLAK","ha","alaka","noun-adj","","ha","ālakha"
6,"vajraṃ","VAJR","aṃ","vajra","noun-adj","","am","vajram"
7,"saparivāraṃ","SAPARIVĀR","aṃ","saparivāra","noun-adj","","am","saparivāram"
8,"sarva","SARV","a","sarva","noun-adj","","a","sarva"
9,"satvāṃś","SATTV","āṃś","sattva","noun-adj","","āṃś","sattvāṃś"
10,"ca","","","ca","ind","","","ca"
11,"sarv","SARV","a","sarva","noun-adj","","a","sarva"
12,"^opadravebhyaḥ","UPADRAV","ebhyaḥ","upadrava","noun-adj","","ebhyaḥ","upadravebhyaḥ"
13,"/","","","","punct","","","/"
NA,"</s>","","","","","","",""
NA,"<s number=""18"">","","","","","","",""
1,"cala","CAL","a","cala","noun-adj","","a","cala"
2,"cala","CAL","a","cala","noun-adj","","a","cala"
3,"cili","CIL","i","cili","noun-adj","","i","cili"
4,"cili","CIL","i","cili","noun-adj","","i","cili"
5,"culu","CUL","u","culu","noun-adj","","u","culu"
6,"culu","CUL","u","culu","noun-adj","","u","culu"
7,"kala","KAL","a","kala","noun-adj","","a","kala"
8,"kala","KAL","a","kala","noun-adj","","a","kala"
9,"kili","KIL","i","kili","noun-adj","","i","kili"
10,"kili","KIL","i","kili","noun-adj","","i","kili"
11,"kulu","KUL","u","kula","noun-adj","","u","kulu"
12,"kulu","KUL","u","kula","noun-adj","","u","kulu"
13,"muñca","MUÑC","a","muñca","noun-adj","","a","muñca"
14,"aṭṭaṭṭahā","AṬṬAṬṬ","ahā","aṭṭaṭṭa","noun-adj","","ahā","aṭṭaṭṭahā"
15,"sam","SAM","","sama","noun-adj","","","sam"
16,"/","","","","punct","","","/"
NA,"</s>","","","","","","",""
NA,"<s number=""19"">","","","","","","",""
1,"vidhvaṃsaya","VIDHVAṂS","aya","vidhvaṃsa","noun-adj","","aya","vidhvaṃsaya"
2,"para","PAR","a","para","noun-adj","","a","para"
3,"sainyaṃ","SAINY","aṃ","sainya","noun-adj","","am","sainyam"
4,"trāsaya","TRĀSAY","a","trāsay","noun-adj","","a","trāsaya"
5,"trāsaya","TRĀSAY","a","trāsay","noun-adj","","a","trāsaya"
6,"bhrāmaya","BHRĀMAY","a","bhrāmayat","noun-adj","","a","bhrāmaya"
7,"bhrāmaya","BHRĀMAY","a","bhrāmayat","noun-adj","","a","bhrāmaya"
8,"buddha","BUDDH","a","buddha","noun-adj","","a","buddha"
9,"satyena","SATY","ena","satya","noun-adj","","ena","satyena"
10,"dharma","DHARM","a","dharma","noun-adj","","a","dharma"
11,"satyena","SATY","ena","satya","noun-adj","","ena","satyena"
12,"saṃgha","SAṂGH","a","saṃgha","noun-adj","","a","saṃgha"
13,"satyena","SATY","ena","satya","noun-adj","","ena","satyena"
14,"satyavādināṃ","SATYAVĀD","ināṃ","satyavādin","noun-adj","","inām","satyavādinām"
15,"satyena","SATY","ena","satya","noun-adj","","ena","satyena"
16,"/","","","","punct","","","/"
NA,"</s>","","","","","","",""
NA,"<s number=""20"">","","","","","","",""
1,"buddha","BUDDH","a","buddha","noun-adj","","a","buddha"
2,"satyaṃ","SATY","aṃ","satya","noun-adj","","am","satyam"
3,"māti","MĀT","i","māti","noun-adj","","i","māti"
4,"krāma","KRĀM","a","kram","verb","kram","a","krāma"
5,"/","","","","punct","","","/"
NA,"</s>","","","","","","",""
NA,"<s number=""21"">","","","","","","",""
1,"dharma","DHARM","a","dharma","noun-adj","","a","dharma"
2,"satyaṃ","SATY","aṃ","satya","noun-adj","","am","satyam"
3,"māti","MĀT","i","māti","noun-adj","","i","māti"
4,"krāma","KRĀM","a","kram","verb","kram","a","krāma"
5,"/","","","","punct","","","/"
6,"saṃgha","SAṂGH","a","saṃgha","noun-adj","","a","saṃgha"
7,"satyaṃ","SATY","aṃ","satya","noun-adj","","am","satyam"
8,"māti","MĀT","i","māti","noun-adj","","i","māti"
9,"krāma","KRĀM","a","kram","verb","kram","a","krāma"
10,"/","","","","punct","","","/"
NA,"</s>","","","","","","",""
NA,"<s number=""22"">","","","","","","",""
1,"satyavādināṃ","SATYAVĀD","ināṃ","satyavādin","noun-adj","","inām","satyavādinām"
2,"satyaṃ","SATY","aṃ","satya","noun-adj","","am","satyam"
3,"māti","MĀT","i","māti","noun-adj","","i","māti"
4,"krāma","KRĀM","a","kram","verb","kram","a","krāma"
5,"/","","","","punct","","","/"
NA,"</s>","","","","","","",""
NA,"<s number=""23"">","","","","","","",""
1,"lambodari","LAṂBODAR","i","laṃbodari","noun-adj","","i","laṃbodari"
2,"lambodari","LAṂBODAR","i","laṃbodari","noun-adj","","i","laṃbodari"
3,"kuṭa","KUṬ","a","kuṭa","noun-adj","","a","kuṭa"
4,"kuṭa","KUṬ","a","kuṭa","noun-adj","","a","kuṭa"
5,"kuṭṭa","KUṬṬ","a","kuṭṭa","noun-adj","","a","kuṭṭa"
6,"kuṭṭa","KUṬṬ","a","kuṭṭa","noun-adj","","a","kuṭṭa"
7,"rudram","RUDR","am","rudra","noun-adj","","am","rudram"
8,"ānaya","ĀNAY","a","ānaya","noun-adj","","a","ānaya"
9,"/","","","","punct","","","/"
NA,"</s>","","","","","","",""
NA,"<s number=""24"">","","","","","","",""
1,"viṣṇum","VIṢṆ","um","viṣṇu","noun-adj","","um","viṣṇum"
2,"ānaya","ĀNAY","a","ānaya","noun-adj","","a","ānaya"
3,"/","","","","punct","","","/"
NA,"</s>","","","","","","",""
NA,"<s number=""25"">","","","","","","",""
1,"candra","CANDR","a","candra","noun-adj","","a","candra"
2,"sūryam","SŪRY","am","sūrya","noun-adj","","am","sūryam"
3,"ānaya","ĀNAY","a","ānaya","noun-adj","","a","ānaya"
4,"/","","","","punct","","","/"
NA,"</s>","","","","","","",""
NA,"<s number=""26"">","","","","","","",""
1,"trailoky","TRAILOKY","a","trailokya","noun-adj","","a","trailokya"
2,"^ādhipatim","ADHIPAT","im","adhipat","noun-adj","","im","adhipatim"
3,"ānaya","ĀNAY","a","ānaya","noun-adj","","a","ānaya"
4,"/","","","","punct","","","/"
NA,"</s>","","","","","","",""
NA,"<s number=""27"">","","","","","","",""
1,"sarva","SARV","a","sarva","noun-adj","","a","sarva"
2,"devat","DEVAT","a","devatā","noun-adj","","a","devatā"
3,"^ādhipatim","ADHIPAT","im","adhipat","noun-adj","","im","adhipatim"
4,"ānaya","ĀNAY","a","ānaya","noun-adj","","a","ānaya"
5,"/","","","","punct","","","/"
NA,"</s>","","","","","","",""
NA,"<s number=""28"">","","","","","","",""
1,"sarva","SARV","a","sarva","noun-adj","","a","sarva"
2,"devatān","DEVAT","ān","devata","noun-adj","","ān","devatān"
3,"ānaya","ĀNAY","a","ānaya","noun-adj","","a","ānaya"
4,"/","","","","punct","","","/"
NA,"</s>","","","","","","",""
NA,"<s number=""29"">","","","","","","",""
1,"sarva","SARV","a","sarva","noun-adj","","a","sarva"
2,"yakṣa","YAKṢ","a","yakṣa","noun-adj","","a","yakṣa"
3,"rākṣasa","RĀKṢAS","a","rākṣasa","noun-adj","","a","rākṣasa"
4,"kumbhāṇḍa","KUMBHĀ","a","kumbhāṇḍa","noun-adj","","a","kumbhāa"
5,"mahoraga","MAHORAG","a","mahoraga","noun-adj","","a","mahoraga"
6,"nāgān","NĀG","ān","nāga","noun-adj","","ān","nāgān"
7,"ānaya","ĀNAY","a","ānaya","noun-adj","","a","ānaya"
8,"/","","","","punct","","","/"
NA,"</s>","","","","","","",""
NA,"<s number=""30"">","","","","","","",""
1,"vidhvaṃsaya","VIDHVAṂS","aya","vidhvaṃsa","noun-adj","","aya","vidhvaṃsaya"
2,"para","PAR","a","para","noun-adj","","a","para"
3,"sainyam","SAINY","am","sainya","noun-adj","","am","sainyam"
4,"/","","","","punct","","","/"
NA,"</s>","","","","","","",""
NA,"<s number=""31"">","","","","","","",""
1,"raṅga","RAṄG","a","raṅga","noun-adj","","a","raṅga"
2,"raṅga","RAṄG","a","raṅga","noun-adj","","a","raṅga"
3,"raṅgāpaya","RAṄGĀPAY","a","raṅgāpaya","noun-adj","","a","raṅgāpaya"
4,"raṅgāpaya","RAṄGĀPAY","a","raṅgāpaya","noun-adj","","a","raṅgāpaya"
5,"jvala","JVAL","a","jvala","noun-adj","","a","jvala"
6,"jvala","JVAL","a","jvala","noun-adj","","a","jvala"
7,"puṣpa","PUṢP","a","puṣpa","noun-adj","","a","puṣpa"
8,"mālini","MĀLIN","i","mālini","noun-adj","","i","mālini"
9,"rundha","RUNDH","a","rundh","noun-adj","","a","rundha"
10,"rundha","RUNDH","a","rundh","noun-adj","","a","rundha"
11,"riṭi","RIṬ","i","riṭi","noun-adj","","i","riṭi"
12,"riṭi","RIṬ","i","riṭi","noun-adj","","i","riṭi"
13,"ciṭi","","","","ind","","",""
14,"ciṭi","","","","ind","","",""
15,"bhṛkuṭī","BHṚKUṬ","ī","bhṛkuṭī","noun-adj","","ī","bhṛkuṭī"
16,"mukhi","MUKH","i","mukha","noun-adj","","i","mukhi"
17,"para","PAR","a","para","noun-adj","","a","para"
18,"sainyaṃ","SAINY","aṃ","sainya","noun-adj","","am","sainyam"
19,"kulo","KUL","o","kula","noun-adj","","aḥ","kulaḥ"
20,"modana","MODAN","a","modana","noun-adj","","a","modana"
21,"kari","KAR","i","kari","noun-adj","","i","kari"
22,"hala","HAL","a","hala","noun-adj","","a","hala"
23,"hala","HAL","a","hala","noun-adj","","a","hala"
24,"hili","HIL","i","hili","noun-adj","","i","hili"
25,"hili","HIL","i","hili","noun-adj","","i","hili"
26,"hulu","HUL","u","hulu","noun-adj","","u","hulu"
27,"hulu","HUL","u","hulu","noun-adj","","u","hulu"
28,"hūṃ","","","","ind","","",""
29,"hūṃ","","","","ind","","",""
30,"he","","","","ind","","",""
31,"he","","","","ind","","",""
32,"riṇi","RIṆ","i","riṇi","noun-adj","","i","riṇi"
33,"riṇi","RIṆ","i","riṇi","noun-adj","","i","riṇi"
34,"riṇa","RIṆ","a","riṇa","noun-adj","","a","riṇa"
35,"mati","MAT","i","mati","noun-adj","","i","mati"
36,"jambha","JAMBHA","a","jambha","noun-adj","","a","jambhaa"
37,"/","","","","punct","","","/"
NA,"</s>","","","","","","",""
NA,"<s number=""32"">","","","","","","",""
1,"dhvaje","DHVAJ","e","dhvaja","noun-adj","","e","dhvaje"
2,"buddh","BUDDH","a","buddha","noun-adj","","a","buddha"
3,"^āvalokite","AVALOKIT","e","avalokita","noun-adj","","e","avalokite"
4,"rakṣa","RAKṢ","a","rakṣa","noun-adj","","a","rakṣa"
5,"rakṣa","RAKṢ","a","rakṣa","noun-adj","","a","rakṣa"
6,"āvadhūta","AVADHŪT","a","avadhūta","noun-adj","","a","avadhūta"
7,"śri","ŚRI","","śri","noun-adj","","","śri"
8,"ālakha","ĀLAK","ha","alaka","noun-adj","","ha","ālakha"
9,"vajraṃ","VAJR","aṃ","vajra","noun-adj","","am","vajram"
10,"saparivāraṃ","SAPARIVĀR","aṃ","saparivāra","noun-adj","","am","saparivāram"
11,"sarva","SARV","a","sarva","noun-adj","","a","sarva"
12,"satvāṃś","SATTV","āṃś","sattva","noun-adj","","āṃś","sattvāṃś"
13,"ca","","","ca","ind","","","ca"
14,"sarva","SARV","a","sarva","noun-adj","","a","sarva"
15,"tathāgat","TATHĀGAT","a","tathāgata","noun-adj","","a","tathāgata"
16,"^āvalokite","AVALOKIT","e","avalokita","noun-adj","","e","avalokite"
17,"svāhā","SVĀH","ā","svāhā","noun-adj","","ā","svāhā"
18,"/","","","","punct","","","/"
NA,"</s>","","","","","","",""
NA,"<s number=""33"">","","","","","","",""
1,"guṇarājaprabhāse","GUṆARĀJAPRABHĀS","e","guṇarājaprabhāsa","noun-adj","","e","guṇarājaprabhāse"
2,"svāhā","SVĀH","ā","svāhā","noun-adj","","ā","svāhā"
3,"/","","","","punct","","","/"
NA,"</s>","","","","","","",""
NA,"<s number=""34"">","","","","","","",""
1,"sūry","SŪRY","a","sūrya","noun-adj","","a","sūrya"
2,"^ārka","ĀRK","a","arka","noun-adj","","a","ārka"
3,"vimale","VIMAL","e","vimala","noun-adj","","e","vimale"
4,"svāhā","SVĀH","ā","svāhā","noun-adj","","ā","svāhā"
5,"/","","","","punct","","","/"
NA,"</s>","","","","","","",""
NA,"<s number=""35"">","","","","","","",""
1,"candr","CANDR","a","candra","noun-adj","","a","candra"
2,"^ārka","ĀRK","a","arka","noun-adj","","a","ārka"
3,"vimale","VIMAL","e","vimala","noun-adj","","e","vimale"
4,"svāhā","SVĀH","ā","svāhā","noun-adj","","ā","svāhā"
5,"/","","","","punct","","","/"
NA,"</s>","","","","","","",""
NA,"<s number=""36"">","","","","","","",""
1,"sarva","SARV","a","sarva","noun-adj","","a","sarva"
2,"graha","GRAH","a","graha","noun-adj","","a","graha"
3,"nakṣatra","NAKṢATR","a","nakṣatra","noun-adj","","a","nakṣatra"
4,"dhyāmīkaraṇe","DHYĀMĪKARAṆ","e","dhyāmīkaraṇa","noun-adj","","e","dhyāmīkaraṇe"
5,"svāhā","SVĀH","ā","svāhā","noun-adj","","ā","svāhā"
6,"/","","","","punct","","","/"
7,"hūṃ","","","","ind","","",""
8,"hūṃ","","","","ind","","",""
9,"rakṣa","RAKṢ","a","rakṣa","noun-adj","","a","rakṣa"
10,"rakṣa","RAKṢ","a","rakṣa","noun-adj","","a","rakṣa"
11,"āvadhūta","AVADHŪT","a","avadhūta","noun-adj","","a","avadhūta"
12,"śrī","ŚR","ī","śrī","noun-adj","","ī","śrī"
13,"ālakha","ĀLAK","ha","alaka","noun-adj","","ha","ālakha"
14,"vajraṃ","VAJR","aṃ","vajra","noun-adj","","am","vajram"
15,"saparivāraṃ","SAPARIVĀR","aṃ","saparivāra","noun-adj","","am","saparivāram"
16,"sarva","SARV","a","sarva","noun-adj","","a","sarva"
17,"satvāṃś","SATTV","āṃś","sattva","noun-adj","","āṃś","sattvāṃś"
18,"ca","","","ca","ind","","","ca"
19,"sarva","SARV","a","sarva","noun-adj","","a","sarva"
20,"bhayebhyaḥ","BHAY","ebhyaḥ","bhaya","noun-adj","","ebhyaḥ","bhayebhyaḥ"
21,"svāhā","SVĀH","ā","svāhā","noun-adj","","ā","svāhā"
22,"//","","","","punct","","","//"
NA,"</s>","","","","","","",""
NA,"<s number=""37"">","","","","","","",""
1,"iyaṃ","","","idam","pron","","","idam"
2,"sā","","","tad","pron","","","tad"
3,"dev","DEV","a","deva","noun-adj","","a","deva"
4,"^endra","INDR","a","indra","noun-adj","","a","indra"
5,"dhvajāgrakeyūrā","DHVAJĀGRAKEYŪR","ā","dhvajāgrakeyūra","noun-adj","","āḥ","dhvajāgrakeyūrāḥ"
6,"nāma","NĀM","a","nāman","noun-adj","","a","nāma"
7,"dhāriṇī","DHĀRIṆ","ī","dhāriṇī","noun-adj","","ī","dhāriṇī"
8,"aparājitā","APARĀJIT","ā","aparājita","noun-adj","","ā","aparājitā"
9,"/","","","","punct","","","/"
NA,"</s>","","","","","","",""
NA,"<s number=""38"">","","","","","","",""
1,"yatra","","","yatra","ind","","","yatra"
2,"kvacid","","","kva","ind","","","kva"
3,"gacched","GACCH","ed","gacch","verb","gam","ed","gacched"
4,"yuddhe","YUDDH","e","yuddha","noun-adj","","e","yuddhe"
5,"vā","","","vā","ind","","","vā"
6,"kalahe","KALAH","e","kalaha","noun-adj","","e","kalahe"
7,"vā","","","vā","ind","","","vā"
8,"vigrahe","VIGRAH","e","vigraha","noun-adj","","e","vigrahe"
9,"vā","","","vā","ind","","","vā"
10,"vivāde","VIVĀD","e","vivāda","noun-adj","","e","vivāde"
11,"vā","","","vā","ind","","","vā"
12,"sarvatra","SARV","atra","sarvatra","noun-adj","","atra","sarvatra"
13,"vijayo","VIJAY","o","vijaya","noun-adj","","aḥ","vijayaḥ"
14,"bhaviṣyati","BHAVIṢ","yati","bhav","verb","bhū","yati","bhaviṣyati"
15,"/","","","","punct","","","/"
NA,"</s>","","","","","","",""
NA,"<s number=""39"">","","","","","","",""
1,"dhvajāgre","DHVAJĀGR","e","dhvajāgra","noun-adj","","e","dhvajāgre"
2,"kaṇṭhe","KAṆṬH","e","kaṇṭha","noun-adj","","e","kaṇṭhe"
3,"v","","","vā","ind","","","vā"
4,"ābaddhvā","ĀBADDH","vā","ābaddha","noun-adj","","vāḥ","ābaddhvāḥ"
5,"dhārayitavyā","DHĀRAY","itavyā","dhar","verb","dhṛ","itavyā","dhārayitavyā"
6,"manuṣya","MANUṢY","a","manuṣya","noun-adj","","a","manuṣya"
7,"rājñā","RĀJ","ñā","rājan","noun-adj","","nā","rājnā"
8,"śūra","ŚŪR","a","śūra","noun-adj","","a","śūra"
9,"puruṣāṇāṃ","PURUṢ","āṇāṃ","puruṣa","noun-adj","","ānām","puruṣānām"
10,"ca","","","ca","ind","","","ca"
11,"sarveṣāṃ","SARV","eṣāṃ","sarva","noun-adj","","eṣāṃ","sarveṣāṃ"
12,"rakṣāṃ","RAKṢ","āṃ","rakṣā","noun-adj","","ām","rakṣām"
13,"karoti","KAR","oti","kar","verb","kṛ","ati","karati"
14,"/","","","","punct","","","/"
NA,"</s>","","","","","","",""
NA,"<s number=""40"">","","","","","","",""
1,"strī","STR","ī","strī","noun-adj","","ī","strī"
2,"rūpa","RŪP","a","rūpa","noun-adj","","a","rūpa"
3,"dhāriṇī","DHĀRIṆ","ī","dhāriṇī","noun-adj","","ī","dhāriṇī"
4,"bhūtvā","BHŪT","vā","bhav","verb","bhū","vāḥ","bhūtvāḥ"
5,"puratas","PURAT","as","puratas","noun-adj","","aḥ","purataḥ"
6,"tiṣṭhati","TIṢṬH","ati","tiṣṭh","verb","sthā","ati","tiṣṭhati"
7,"/","","","","punct","","","/"
NA,"</s>","","","","","","",""
NA,"<s number=""41"">","","","","","","",""
1,"abhayaṃ","ABHAY","aṃ","abhaya","noun-adj","","am","abhayam"
2,"dadāti","DAD","āti","dad","verb","dā","āti","dadāti"
3,"rakṣāṃ","RAKṢ","āṃ","rakṣā","noun-adj","","ām","rakṣām"
4,"karoti","KAR","oti","kar","verb","kṛ","ati","karati"
5,"para","PAR","a","para","noun-adj","","a","para"
6,"sainyaṃ","SAINY","aṃ","sainya","noun-adj","","am","sainyam"
7,"vidrāvayati","VIDRĀV","ayati","vidru","verb","vidru","ayati","vidrāvayati"
8,"/","","","","punct","","","/"
NA,"</s>","","","","","","",""
NA,"<s number=""42"">","","","","","","",""
1,"māṅgalyaṃ","MĀṄGALY","aṃ","māṅgalya","noun-adj","","am","māṅgalyam"
2,"pavitraṃ","PAVITR","aṃ","pavitra","noun-adj","","am","pavitram"
3,"śrī","ŚRĪ","","śrī","noun-adj","","","śrī"
4,"lakṣmīṃ","LAKṢM","īṃ","lakṣmī","noun-adj","","īm","lakṣmīm"
5,"saṃsthā","SAṂSTH","ā","saṃsthā","noun-adj","","ā","saṃsthā"
6,"pikā","PIK","ā","pikā","noun-adj","","ā","pikā"
7,"/","","","","punct","","","/"
NA,"</s>","","","","","","",""
NA,"<s number=""43"">","","","","","","",""
1,"idam","IDAM","","idam","pron","","","idam"
2,"avocad","AVOCAD","","vak","verb","","","avocad"
3,"bhagavān","BHAGAV","ān","bhagavat","noun-adj","","ān","bhagavān"
4,"/","","","","punct","","","/"
5,"āttamanāḥ","ĀTTAMAN","āḥ","āttamanas","noun-adj","","āḥ","āttamanāḥ"
6,"śakra","ŚAKR","a","śakra","noun-adj","","a","śakra"
7,"dev","DEV","a","deva","noun-adj","","a","deva"
8,"^endras","INDR","as","indra","noun-adj","","aḥ","indraḥ"
9,"te","","","tad","pron","","","tad"
10,"ca","","","ca","ind","","","ca"
11,"bhikṣavas","BHIKṢ","avas","bhikṣu","noun-adj","","avas","bhikṣavas"
12,"te","","","tad","pron","","","tad"
13,"ca","","","ca","ind","","","ca"
14,"bodhisatv","BODHISATTV","","bodhisattva","noun-adj","","","bodhisattv"
15,"ā","","","alpha_privativum","ind","","","alpha_privativum"
16,"bhagavato","BHAGAV","ato","bhagavat","noun-adj","","ataḥ","bhagavataḥ"
17,"bhāṣitam","BHĀṢIT","am","bhāṣita","noun-adj","","am","bhāṣitam"
18,"abhyanandann","ABHYANAND","ann","abhyanand","noun-adj","","ann","abhyanandann"
19,"iti","","","iti","ind","","","iti"
20,"//","","","","punct","","","//"
NA,"</s>","","","","","","",""
NA,"<s number=""44"">","","","","","","",""
1,"//","","","","punct","","","//"
2,"ārya","ĀRY","a","ārya","noun-adj","","a","ārya"
3,"dhvajāgrakeyūrā","DHVAJĀGRAKEYŪR","ā","dhvajāgrakeyūra","noun-adj","","āḥ","dhvajāgrakeyūrāḥ"
4,"nāma","NĀM","a","nāman","noun-adj","","a","nāma"
5,"dhāriṇī","DHĀRIṆ","ī","dhāriṇī","noun-adj","","ī","dhāriṇī"
6,"samāptā","SAMĀPT","ā","samāpta","noun-adj","","ā","samāptā"
7,"//","","","","punct","","","//"
NA,"</s>","","","","","","",""
NA,"<s number=""45"">","","","","","","",""
1,"oṃ","","","oṃ","ind","","","oṃ"
2,"bhagavati","BHAGAV","ati","bhagavat","noun-adj","","ati","bhagavati"
3,"dhvajāgrakeyūre","DHVAJĀGRAKEYŪR","e","dhvajāgrakeyūra","noun-adj","","e","dhvajāgrakeyūre"
4,"para","PAR","a","para","noun-adj","","a","para"
5,"sainya","SAINY","a","sainya","noun-adj","","a","sainya"
6,"vidhvaṃ","VIDH","vaṃ","vidhu","noun-adj","","vaṃ","vidhvaṃ"
7,"sana","SAN","a","sana","noun-adj","","a","sana"
8,"kari","KAR","i","kari","noun-adj","","i","kari"
9,"/","","","","punct","","","/"
NA,"</s>","","","","","","",""
NA,"<s number=""46"">","","","","","","",""
1,"sva","SV","a","sva","noun-adj","","a","sva"
2,"sainya","SAINY","a","sainya","noun-adj","","a","sainya"
3,"paripālana","PARIPĀLAN","a","paripālana","noun-adj","","a","paripālana"
4,"kari","KAR","i","kari","noun-adj","","i","kari"
5,"/","","","","punct","","","/"
NA,"</s>","","","","","","",""
NA,"<s number=""47"">","","","","","","",""
1,"ulkāmukhi","ULKĀMUKH","i","ulkāmukhi","noun-adj","","i","ulkāmukhi"
2,"/","","","","punct","","","/"
NA,"</s>","","","","","","",""
NA,"<s number=""48"">","","","","","","",""
1,"kha","","","kha","ind","","","kha"
2,"kha","","","kha","ind","","","kha"
3,"/","","","","punct","","","/"
NA,"</s>","","","","","","",""
NA,"<s number=""49"">","","","","","","",""
1,"k","","","kim","pron","","","kim"
2,"hāhi","HĀH","i","hāhi","noun-adj","","i","hāhi"
3,"k","","","kim","pron","","","kim"
4,"hāhi","HĀH","i","hāhi","noun-adj","","i","hāhi"
5,"/","","","","punct","","","/"
NA,"</s>","","","","","","",""
NA,"<s number=""50"">","","","","","","",""
1,"para","PAR","a","para","noun-adj","","a","para"
2,"sainyam","SAINY","am","sainya","noun-adj","","am","sainyam"
3,"ananta","ANANT","a","ananta","noun-adj","","a","ananta"
4,"mukhen","MUKH","en","mukha","noun-adj","","ena","mukhena"
5,"ānanta","ANANT","a","ananta","noun-adj","","a","ananta"
6,"bhujena","BHUJ","ena","bhuja","noun-adj","","ena","bhujena"
7,"prahara","PRAHAR","a","prahara","noun-adj","","a","prahara"
8,"prahara","PRAHAR","a","prahara","noun-adj","","a","prahara"
9,"/","","","","punct","","","/"
NA,"</s>","","","","","","",""
NA,"<s number=""51"">","","","","","","",""
1,"hūṃ","","","","ind","","",""
2,"hūṃ","","","","ind","","",""
3,"/","","","","punct","","","/"
4,"phaṭ","PHAṬ","","phaṭa","noun-adj","","","phaṭ"
5,"phaṭ","PHAṬ","","phaṭa","noun-adj","","","phaṭ"
6,"svāhā","SVĀH","ā","svāhā","noun-adj","","ā","svāhā"
7,"//","","","","punct","","","//"
NA,"</s>","","","","","","",""
NA,"<s number=""52"">","","","","","","",""
1,"ārya","ĀRY","a","ārya","noun-adj","","a","ārya"
2,"dhvajāgrakeyūr","DHVAJĀGRAKEYŪR","","dhvajāgrakeyūra","noun-adj","","","dhvajāgrakeyūr"
3,"ā","","","alpha_privativum","ind","","","alpha_privativum"
4,"hṛdayaṃ","HṚDAY","aṃ","hṛdaya","noun-adj","","am","hṛdayam"
5,"samāptam","SAMĀPT","am","samāpta","noun-adj","","am","samāptam"
6,"//","","","","punct","","","//"
NA,"</s>","","","","","","",""
NA,"<s number=""53"">","","","","","","",""
1,"//","","","","punct","","","//"
NA,"</s>","","","","","","",""
NA,"</page>","","","","","","",""
NA,"</doc>","","","","","","",""
