"WordID","word","NormSTEM","suffix","lemma","PoS","Root","NormSuffix","NormWord"
1,"vaṣaṭ","_","_","vaṣaṭ","CX","","_","_"
2,"te","_","_","tvat","PPR","","_","_"
3,"pūṣann","_","_","pūṣan","NC","","_","_"
4,"asmint","_","_","ida","PRD","","_","_"
5,"sūtāv","_","_","sūti","NC","","_","_"
6,"aryamā","_","_","aryaman","NC","","_","_"
7,"hotā","_","_","hotṛ","NC","","_","_"
8,"kṛṇotu","_","_","kar","V","kṛ","_","_"
9,"vedhāḥ","_","_","vedhas","NC","","_","_"
1,"sisratāṃ","_","_","sṛ","V","sṛ","_","_"
2,"nāry","_","_","nārī","NC","","_","_"
3,"_","_","_","ṛta","JJ","","_","_"
4,"_","_","_","prajan","PPP","","_","_"
5,"vi","_","_","vi","CADP","","_","_"
6,"parvāṇi","_","_","parvan","NC","","_","_"
7,"jihatāṃ","_","_","jah","V","hā","_","_"
8,"sūtavā","_","_","sū","CGDI","","_","_"
1,"catasro","_","_","catur","NUM","","_","_"
2,"divaḥ","_","_","div","NC","","_","_"
3,"pradiśaś","_","_","pradiś","NC","","_","_"
4,"catasro","_","_","catur","NUM","","_","_"
5,"bhūmyā","_","_","bhūmi","NC","","_","_"
6,"uta","_","_","uta","CCD","","_","_"
1,"devā","_","_","deva","NC","","_","_"
2,"garbhaṃ","_","_","garbha","NC","","_","_"
3,"sam","_","_","sa","CADP","","_","_"
4,"airayan","_","_","īray","V","īray","_","_"
5,"taṃ","_","_","tad","PRD","","_","_"
6,"vy","_","_","vi","CADP","","_","_"
7,"ūrṇuvantu","_","_","vṛ","V","vṛ","_","_"
8,"sūtave","_","_","sū","CGDI","","_","_"
1,"sūṣā","_","_","sūṣā","NC","","_","_"
2,"vy","_","_","vi","CADP","","_","_"
3,"ūrṇotu","_","_","vṛ","V","vṛ","_","_"
4,"vi","_","_","vi","CADP","","_","_"
5,"yoniṃ","_","_","yoni","NC","","_","_"
6,"hāpayāmasi","_","_","hāpay","V","hāpay","_","_"
1,"śrathayā","_","_","śrathay","V","śrathay","_","_"
2,"sūṣaṇe","_","_","sūṣaṇā","NC","","_","_"
3,"tvam","_","_","tvat","PPR","","_","_"
4,"ava","_","_","ava","CX","","_","_"
5,"tvaṃ","_","_","tvat","PPR","","_","_"
6,"biṣkale","_","_","biṣkalā","NC","","_","_"
7,"sṛja","_","_","sṛja","V","sṛj","_","_"
1,"_","_","_","na","CNG","","_","_"
2,"_","_","_","iva","CCM","","_","_"
3,"māṃse","_","_","māṃsa","NC","","_","_"
4,"na","_","_","na","CNG","","_","_"
5,"pīvasi","_","_","pīvas","NC","","_","_"
6,"_","_","_","na","CNG","","_","_"
7,"_","_","_","iva","CCM","","_","_"
8,"majjasv","_","_","majjan","NC","","_","_"
9,"āhatam","_","_","āhan","PPP","","_","_"
1,"avaitu","_","_","ave","V","ave","_","_"
2,"pṛśni","_","_","pṛśni","JJ","","_","_"
3,"śevalaṃ","_","_","śevala","JJ","","_","_"
4,"śune","_","_","śvan","NC","","_","_"
5,"jarāyv","_","_","jarāyu","NC","","_","_"
6,"attave","_","_","ad","CGDI","","_","_"
7,"'va","_","_","ava","CX","","_","_"
8,"jarāyu","_","_","jarāyu","NC","","_","_"
9,"padyatām","_","_","pad","V","pad","_","_"
1,"vi","_","_","vi","CADP","","_","_"
2,"te","_","_","tvat","PPR","","_","_"
3,"bhinadmi","_","_","bhid","V","bhid","_","_"
4,"mehanaṃ","_","_","mehana","NC","","_","_"
5,"vi","_","_","vi","CADP","","_","_"
6,"yoniṃ","_","_","yoni","NC","","_","_"
7,"vi","_","_","vi","CADP","","_","_"
8,"gavīnike","_","_","gavīnikā","NC","","_","_"
1,"vi","_","_","vi","CADP","","_","_"
2,"mātaraṃ","_","_","mātṛ","NC","","_","_"
3,"ca","_","_","ca","CCD","","_","_"
4,"putraṃ","_","_","putra","NC","","_","_"
5,"ca","_","_","ca","CCD","","_","_"
6,"vi","_","_","vi","CADP","","_","_"
7,"kumāraṃ","_","_","kumāra","NC","","_","_"
8,"_","_","_","jarāyu","NC","","_","_"
9,"_","_","_","ava","CX","","_","_"
10,"jarāyu","_","_","jarāyu","NC","","_","_"
11,"padyatām","_","_","pad","V","pad","_","_"
1,"yathā","_","_","yathā","CCM","","_","_"
2,"vāto","_","_","vāta","NC","","_","_"
3,"yathā","_","_","yathā","CCM","","_","_"
4,"mano","_","_","manas","NC","","_","_"
5,"yathā","_","_","yathā","CCM","","_","_"
6,"patanti","_","_","pat","V","pat","_","_"
7,"pakṣiṇaḥ","_","_","pakṣin","NC","","_","_"
1,"evā","_","_","eva","CEM","","_","_"
2,"tvaṃ","_","_","tvat","PPR","","_","_"
3,"daśamāsya","_","_","daśamāsya","JJ","","_","_"
4,"sākaṃ","_","_","sāka","CX","","_","_"
5,"jarāyuṇā","_","_","jarāyu","NC","","_","_"
6,"_","_","_","pat","V","pat","_","_"
7,"_","_","_","ava","CX","","_","_"
8,"jarāyu","_","_","jarāyu","NC","","_","_"
9,"padyatām","_","_","pad","V","pad","_","_"
