"WordID","word","NormSTEM","suffix","lemma","PoS","Root","NormSuffix","NormWord"
1,"tad","_","_","tad","PRD","","_","_"
2,"āhur","_","_","ah","V","ah","_","_"
3,"ya","_","_","yad","PRL","","_","_"
4,"āhitāgnir","_","_","āhitāgni","NC","","_","_"
5,"upavasathe","_","_","upavasatha","NC","","_","_"
6,"'śru","_","_","aśru","NC","","_","_"
7,"kurvīta","_","_","kar","V","kṛ","_","_"
8,"kā","_","_","kiṃ","PRQ","","_","_"
9,"tatra","_","_","tatra","CAD","","_","_"
10,"prāyaścittir","_","_","prāyaścitti","NC","","_","_"
11,"iti","_","_","iti","CQT","","_","_"
12,"so","_","_","tad","PRD","","_","_"
13,"'gnaye","_","_","agni","NC","","_","_"
14,"_","_","_","vrata","NC","","_","_"
15,"_","_","_","bhṛt","JJ","","_","_"
16,"'ṣṭākapālam","_","_","aṣṭākapāla","JJ","","_","_"
17,"puroﾱāśaṃ","_","_","puroḍāś","NC","","_","_"
18,"nirvapet","_","_","nirvap","V","nirvap","_","_"
19,"tasya","_","_","tad","PRD","","_","_"
20,"_","_","_","yājyā","NC","","_","_"
21,"_","_","_","anuvākyā","NC","","_","_"
22,"_","_","_","tvat","PPR","","_","_"
23,"_","_","_","agni","NC","","_","_"
24,"_","_","_","vrata","NC","","_","_"
25,"_","_","_","bhṛt","JJ","","_","_"
26,"chucir","_","_","śuci","JJ","","_","_"
27,"vratāni","_","_","vrata","NC","","_","_"
28,"bibhrad","_","_","bhṛ","KDP","","_","_"
29,"_","_","_","vrata","NC","","_","_"
30,"_","_","_","pā","JJ","","_","_"
31,"adabdha","_","_","adabdha","JJ","","_","_"
32,"ity","_","_","iti","CQT","","_","_"
33,"āhutiṃ","_","_","āhuti","NC","","_","_"
34,"_","_","_","vā","CCD","","_","_"
35,"_","_","_","āhavanīya","NC","","_","_"
36,"juhuyād","_","_","hu","V","hu","_","_"
37,"agnaye","_","_","agni","NC","","_","_"
38,"_","_","_","vrata","NC","","_","_"
39,"_","_","_","bhṛt","JJ","","_","_"
40,"_","_","_","svāhā","CX","","_","_"
41,"_","_","_","iti","CQT","","_","_"
42,"sā","_","_","tad","PRD","","_","_"
43,"tatra","_","_","tatra","CAD","","_","_"
44,"prāyaścittiḥ","_","_","prāyaścitti","NC","","_","_"
1,"tad","_","_","tad","PRD","","_","_"
2,"āhur","_","_","ah","V","ah","_","_"
3,"ya","_","_","yad","PRL","","_","_"
4,"āhitāgnir","_","_","āhitāgni","NC","","_","_"
5,"upavasathe","_","_","upavasatha","NC","","_","_"
6,"'vratyam","_","_","avratya","NC","","_","_"
7,"āpadyeta","_","_","āpady","V","āpad","_","_"
8,"kā","_","_","kiṃ","PRQ","","_","_"
9,"tatra","_","_","tatra","CAD","","_","_"
10,"prāyaścittir","_","_","prāyaścitti","NC","","_","_"
11,"iti","_","_","iti","CQT","","_","_"
12,"so","_","_","tad","PRD","","_","_"
13,"'gnaye","_","_","agni","NC","","_","_"
14,"vratapataye","_","_","vratapati","NC","","_","_"
15,"'ṣṭākapālam","_","_","aṣṭākapāla","JJ","","_","_"
16,"puroﾱāśaṃ","_","_","puroḍāś","NC","","_","_"
17,"nirvapet","_","_","nirvap","V","nirvap","_","_"
18,"tasya","_","_","tad","PRD","","_","_"
19,"_","_","_","yājyā","NC","","_","_"
20,"_","_","_","anuvākyā","NC","","_","_"
21,"tvam","_","_","tvat","PPR","","_","_"
22,"agne","_","_","agni","NC","","_","_"
23,"_","_","_","vrata","NC","","_","_"
24,"_","_","_","pā","JJ","","_","_"
25,"asi","_","_","as","V","as","_","_"
26,"yad","_","_","yat","CSB","","_","_"
27,"vo","_","_","tvat","PPR","","_","_"
28,"vayam","_","_","mat","PPR","","_","_"
29,"pramināma","_","_","pramī","V","pramī","_","_"
30,"_","_","_","vrata","NC","","_","_"
31,"_","_","_","iti","CQT","","_","_"
32,"āhutiṃ","_","_","āhuti","NC","","_","_"
33,"_","_","_","vā","CCD","","_","_"
34,"_","_","_","āhavanīya","NC","","_","_"
35,"juhuyād","_","_","hu","V","hu","_","_"
36,"agnaye","_","_","agni","NC","","_","_"
37,"vratapataye","_","_","vratapati","NC","","_","_"
38,"_","_","_","svāhā","CX","","_","_"
39,"_","_","_","iti","CQT","","_","_"
40,"sā","_","_","tad","PRD","","_","_"
41,"tatra","_","_","tatra","CAD","","_","_"
42,"prāyaścittiḥ","_","_","prāyaścitti","NC","","_","_"
1,"tad","_","_","tad","PRD","","_","_"
2,"āhur","_","_","ah","V","ah","_","_"
3,"ya","_","_","yad","PRL","","_","_"
4,"āhitāgnir","_","_","āhitāgni","NC","","_","_"
5,"amāvāsyām","_","_","amāvāsyā","NC","","_","_"
6,"paurṇamāsīṃ","_","_","paurṇamāsī","NC","","_","_"
7,"_","_","_","vā","CCD","","_","_"
8,"_","_","_","atye","V","atī","_","_"
9,"kā","_","_","kiṃ","PRQ","","_","_"
10,"tatra","_","_","tatra","CAD","","_","_"
11,"prāyaścittir","_","_","prāyaścitti","NC","","_","_"
12,"iti","_","_","iti","CQT","","_","_"
13,"so","_","_","tad","PRD","","_","_"
14,"'gnaye","_","_","agni","NC","","_","_"
15,"pathikṛte","_","_","pathikṛt","JJ","","_","_"
16,"'ṣṭākapālam","_","_","aṣṭākapāla","JJ","","_","_"
17,"puroﾱāśaṃ","_","_","puroḍāś","NC","","_","_"
18,"nirvapet","_","_","nirvap","V","nirvap","_","_"
19,"tasya","_","_","tad","PRD","","_","_"
20,"_","_","_","yājyā","NC","","_","_"
21,"_","_","_","anuvākyā","NC","","_","_"
22,"vetthā","_","_","vid","V","vid","_","_"
23,"hi","_","_","hi","CX","","_","_"
24,"vedho","_","_","vedhas","NC","","_","_"
25,"'dhvana","_","_","adhvan","NC","","_","_"
26,"ā","_","_","ā","CADP","","_","_"
27,"devānām","_","_","deva","NC","","_","_"
28,"api","_","_","api","CX","","_","_"
29,"panthām","_","_","pathin","NC","","_","_"
30,"_","_","_","ga","V","ga","_","_"
31,"_","_","_","iti","CQT","","_","_"
32,"āhutiṃ","_","_","āhuti","NC","","_","_"
33,"_","_","_","vā","CCD","","_","_"
34,"_","_","_","āhavanīya","NC","","_","_"
35,"juhuyād","_","_","hu","V","hu","_","_"
36,"agnaye","_","_","agni","NC","","_","_"
37,"pathikṛte","_","_","pathikṛt","JJ","","_","_"
38,"_","_","_","svāhā","CX","","_","_"
39,"_","_","_","iti","CQT","","_","_"
40,"sā","_","_","tad","PRD","","_","_"
41,"tatra","_","_","tatra","CAD","","_","_"
42,"prāyaścittiḥ","_","_","prāyaścitti","NC","","_","_"
1,"tad","_","_","tad","PRD","","_","_"
2,"āhur","_","_","ah","V","ah","_","_"
3,"yasya","_","_","yad","PRL","","_","_"
4,"sarva","_","_","sarva","JQ","","_","_"
5,"_","_","_","eva","CEM","","_","_"
6,"_","_","_","agni","NC","","_","_"
7,"upaśāmyeran","_","_","upaśa","V","upaśa","_","_"
8,"kā","_","_","kiṃ","PRQ","","_","_"
9,"tatra","_","_","tatra","CAD","","_","_"
10,"prāyaścittir","_","_","prāyaścitti","NC","","_","_"
11,"iti","_","_","iti","CQT","","_","_"
12,"so","_","_","tad","PRD","","_","_"
13,"'gnaye","_","_","agni","NC","","_","_"
14,"tapasvate","_","_","tapasvat","JJ","","_","_"
15,"janadvate","_","_","janadvat","JJ","","_","_"
16,"pāvakavate","_","_","pāvakavat","JJ","","_","_"
17,"'ṣṭākapālam","_","_","aṣṭākapāla","JJ","","_","_"
18,"puroﾱāśaṃ","_","_","puroḍāś","NC","","_","_"
19,"nirvapet","_","_","nirvap","V","nirvap","_","_"
20,"tasya","_","_","tad","PRD","","_","_"
21,"_","_","_","yājyā","NC","","_","_"
22,"_","_","_","anuvākyā","NC","","_","_"
23,"āyāhi","_","_","āyā","V","āyā","_","_"
24,"tapasā","_","_","tapas","NC","","_","_"
25,"janeṣv","_","_","jana","NC","","_","_"
26,"ā","_","_","ā","CADP","","_","_"
27,"no","_","_","mat","PPR","","_","_"
28,"yāhi","_","_","yā","V","yā","_","_"
29,"tapasā","_","_","tapas","NC","","_","_"
30,"janeṣv","_","_","jana","NC","","_","_"
31,"ity","_","_","iti","CQT","","_","_"
32,"āhutiṃ","_","_","āhuti","NC","","_","_"
33,"_","_","_","vā","CCD","","_","_"
34,"_","_","_","āhavanīya","NC","","_","_"
35,"juhuyād","_","_","hu","V","hu","_","_"
36,"agnaye","_","_","agni","NC","","_","_"
37,"tapasvate","_","_","tapasvat","JJ","","_","_"
38,"janadvate","_","_","janadvat","JJ","","_","_"
39,"pāvakavate","_","_","pāvakavat","JJ","","_","_"
40,"_","_","_","svāhā","CX","","_","_"
41,"_","_","_","iti","CQT","","_","_"
42,"sā","_","_","tad","PRD","","_","_"
43,"tatra","_","_","tatra","CAD","","_","_"
44,"prāyaścittiḥ","_","_","prāyaścitti","NC","","_","_"
