"WordID","word","NormSTEM","suffix","lemma","PoS","Root","NormSuffix","NormWord"
1,"yudhiṣṭhira","_","_","yudhiṣṭhira","NC","","_","_"
2,"uvāca","_","_","vak","V","vac","_","_"
1,"mahān","_","_","mahat","JJ","","_","_"
2,"ayaṃ","_","_","ida","PRD","","_","_"
3,"_","_","_","dharma","NC","","_","_"
4,"_","_","_","patha","NC","","_","_"
5,"_","_","_","bahu","JJ","","_","_"
6,"_","_","_","śākhā","NC","","_","_"
7,"_","_","_","ca","CCD","","_","_"
8,"bhārata","_","_","bhārata","NC","","_","_"
1,"kiṃ","_","_","kiṃ","PRQ","","_","_"
2,"svid","_","_","svid","CX","","_","_"
3,"_","_","_","eva","CEM","","_","_"
4,"_","_","_","iha","CAD","","_","_"
5,"dharmāṇām","_","_","dharma","NC","","_","_"
6,"anuṣṭheyatamaṃ","_","_","anuṣṭheyatama","JJ","","_","_"
7,"matam","_","_","man","PPP","","_","_"
1,"kiṃ","_","_","kiṃ","PRQ","","_","_"
2,"kāryaṃ","_","_","kṛ","KDG","","_","_"
3,"_","_","_","sarva","JQ","","_","_"
4,"_","_","_","dharma","NC","","_","_"
5,"garīyo","_","_","garīyas","JJ","","_","_"
6,"bhavato","_","_","bhavat","JJ","","_","_"
7,"matam","_","_","man","PPP","","_","_"
1,"_","_","_","yathā","CCM","","_","_"
2,"_","_","_","ida","PRD","","_","_"
3,"puruṣo","_","_","puruṣa","NC","","_","_"
4,"dharmam","_","_","dharma","NC","","_","_"
5,"iha","_","_","iha","CAD","","_","_"
6,"ca","_","_","ca","CCD","","_","_"
7,"pretya","_","_","pre","CGDA","","_","_"
8,"_","_","_","ca","CCD","","_","_"
9,"_","_","_","āpn","V","āp","_","_"
1,"bhīṣma","_","_","bhīṣma","NC","","_","_"
2,"uvāca","_","_","vak","V","vac","_","_"
1,"_","_","_","mātā","NC","","_","_"
2,"_","_","_","pitṛ","NC","","_","_"
3,"gurūṇāṃ","_","_","guru","NC","","_","_"
4,"ca","_","_","ca","CCD","","_","_"
5,"pūjā","_","_","pūjā","NC","","_","_"
6,"_","_","_","bahu","JJ","","_","_"
7,"_","_","_","man","PPP","","_","_"
8,"mama","_","_","mat","PPR","","_","_"
1,"atra","_","_","atra","CAD","","_","_"
2,"yukto","_","_","yuj","PPP","","_","_"
3,"naro","_","_","nara","NC","","_","_"
4,"lokān","_","_","loka","NC","","_","_"
5,"_","_","_","yaśas","NC","","_","_"
6,"_","_","_","ca","CCD","","_","_"
7,"mahad","_","_","mahat","JJ","","_","_"
8,"aśnute","_","_","aśn","V","aś","_","_"
1,"yad","_","_","yad","PRL","","_","_"
2,"ete","_","_","tad","PRD","","_","_"
3,"_","_","_","hi","CX","","_","_"
4,"_","_","_","abhijān","V","abhijñā","_","_"
5,"karma","_","_","karman","NC","","_","_"
6,"tāta","_","_","tāta","NC","","_","_"
7,"_","_","_","su","CAD","","_","_"
8,"_","_","_","pūjay","PPP","","_","_"
1,"dharmyaṃ","_","_","dharmya","JJ","","_","_"
2,"_","_","_","dharma","NC","","_","_"
3,"_","_","_","virudh","PPP","","_","_"
4,"vā","_","_","vā","CCD","","_","_"
5,"tat","_","_","tad","PRD","","_","_"
6,"kartavyaṃ","_","_","kṛ","KDG","","_","_"
7,"yudhiṣṭhira","_","_","yudhiṣṭhira","NC","","_","_"
1,"na","_","_","na","CNG","","_","_"
2,"tair","_","_","tad","PRD","","_","_"
3,"anabhyanujñāto","_","_","anabhyanujñāta","JJ","","_","_"
4,"dharmam","_","_","dharma","NC","","_","_"
5,"anyaṃ","_","_","anya","PPX","","_","_"
6,"prakalpayet","_","_","prakalp","V","prakḷp","_","_"
1,"yam","_","_","yad","PRL","","_","_"
2,"ete","_","_","tad","PRD","","_","_"
3,"'bhyanujānīyuḥ","_","_","abhyanujān","V","abhyanujñā","_","_"
4,"sa","_","_","tad","PRD","","_","_"
5,"dharma","_","_","dharma","NC","","_","_"
6,"iti","_","_","iti","CQT","","_","_"
7,"niścayaḥ","_","_","niścaya","NC","","_","_"
1,"eta","_","_","tad","PRD","","_","_"
2,"eva","_","_","eva","CEM","","_","_"
3,"trayo","_","_","tri","NUM","","_","_"
4,"lokā","_","_","loka","NC","","_","_"
5,"eta","_","_","tad","PRD","","_","_"
6,"_","_","_","eva","CEM","","_","_"
7,"_","_","_","āśrama","NC","","_","_"
8,"_","_","_","tri","NUM","","_","_"
1,"eta","_","_","tad","PRD","","_","_"
2,"eva","_","_","eva","CEM","","_","_"
3,"trayo","_","_","tri","NUM","","_","_"
4,"vedā","_","_","vid","V","vid","_","_"
5,"eta","_","_","tad","PRD","","_","_"
6,"eva","_","_","eva","CEM","","_","_"
7,"trayo","_","_","tri","NUM","","_","_"
8,"'gnayaḥ","_","_","agni","NC","","_","_"
1,"pitā","_","_","pitṛ","NC","","_","_"
2,"_","_","_","hi","CX","","_","_"
3,"_","_","_","agni","NC","","_","_"
4,"gārhapatyo","_","_","gārhapatya","NC","","_","_"
5,"_","_","_","mātṛ","NC","","_","_"
6,"_","_","_","agni","NC","","_","_"
7,"dakṣiṇaḥ","_","_","dakṣiṇa","JJ","","_","_"
8,"smṛtaḥ","_","_","smṛ","PPP","","_","_"
1,"gurur","_","_","guru","NC","","_","_"
2,"_","_","_","āhavanīya","NC","","_","_"
3,"_","_","_","tu","CCD","","_","_"
4,"_","_","_","tad","PRD","","_","_"
5,"_","_","_","agni","NC","","_","_"
6,"_","_","_","tretā","NC","","_","_"
7,"garīyasī","_","_","garīyas","JJ","","_","_"
1,"_","_","_","tri","NUM","","_","_"
2,"_","_","_","apramādyat","JJ","","_","_"
3,"eteṣu","_","_","tad","PRD","","_","_"
4,"trīṃl","_","_","tri","NUM","","_","_"
5,"lokān","_","_","loka","NC","","_","_"
6,"avajeṣyasi","_","_","avaji","V","avaji","_","_"
1,"_","_","_","pitṛ","NC","","_","_"
2,"_","_","_","vṛtti","NC","","_","_"
3,"_","_","_","tu","CCD","","_","_"
4,"_","_","_","ida","PRD","","_","_"
5,"lokaṃ","_","_","loka","NC","","_","_"
6,"_","_","_","mātṛ","NC","","_","_"
7,"_","_","_","vṛtti","NC","","_","_"
8,"_","_","_","tathā","CX","","_","_"
9,"_","_","_","apara","PPX","","_","_"
1,"_","_","_","brahman","NC","","_","_"
2,"_","_","_","loka","NC","","_","_"
3,"guror","_","_","guru","NC","","_","_"
4,"vṛttyā","_","_","vṛtti","NC","","_","_"
5,"nityam","_","_","nitya","CX","","_","_"
6,"eva","_","_","eva","CEM","","_","_"
7,"cariṣyasi","_","_","car","V","car","_","_"
1,"samyag","_","_","samyak","CX","","_","_"
2,"eteṣu","_","_","tad","PRD","","_","_"
3,"vartasva","_","_","vart","V","vṛt","_","_"
4,"triṣu","_","_","tri","NUM","","_","_"
5,"lokeṣu","_","_","loka","NC","","_","_"
6,"bhārata","_","_","bhārata","NC","","_","_"
1,"yaśaḥ","_","_","yaśas","NC","","_","_"
2,"prāpsyasi","_","_","prāpn","V","prāp","_","_"
3,"bhadraṃ","_","_","bhadra","NC","","_","_"
4,"te","_","_","tvat","PPR","","_","_"
5,"dharmaṃ","_","_","dharma","NC","","_","_"
6,"ca","_","_","ca","CCD","","_","_"
7,"_","_","_","su","CAD","","_","_"
8,"_","_","_","mahat","JJ","","_","_"
9,"_","_","_","phala","NC","","_","_"
1,"_","_","_","na","CNG","","_","_"
2,"_","_","_","tad","PRD","","_","_"
3,"_","_","_","atiśī","V","atiśī","_","_"
4,"_","_","_","jātu","CX","","_","_"
5,"_","_","_","na","CNG","","_","_"
6,"_","_","_","atyaś","V","atyaś","_","_"
7,"_","_","_","na","CNG","","_","_"
8,"dūṣayet","_","_","dūṣay","V","dūṣay","_","_"
1,"nityaṃ","_","_","nitya","CX","","_","_"
2,"_","_","_","paricar","V","paricar","_","_"
3,"_","_","_","ca","CCD","","_","_"
4,"_","_","_","eva","CEM","","_","_"
5,"tad","_","_","tad","PRD","","_","_"
6,"vai","_","_","vai","CX","","_","_"
7,"_","_","_","su","CAD","","_","_"
8,"_","_","_","kṛ","PPP","","_","_"
9,"uttamam","_","_","uttama","JJ","","_","_"
1,"kīrtiṃ","_","_","kīrti","NC","","_","_"
2,"puṇyaṃ","_","_","puṇya","JJ","","_","_"
3,"yaśo","_","_","yaśas","NC","","_","_"
4,"lokān","_","_","loka","NC","","_","_"
5,"prāpsyase","_","_","prāpn","V","prāp","_","_"
6,"ca","_","_","ca","CCD","","_","_"
7,"janādhipa","_","_","janādhipa","NC","","_","_"
1,"sarve","_","_","sarva","JQ","","_","_"
2,"_","_","_","tad","PRD","","_","_"
3,"_","_","_","ādṛ","PPP","","_","_"
4,"lokā","_","_","loka","NC","","_","_"
5,"_","_","_","yad","PRL","","_","_"
6,"_","_","_","tad","PRD","","_","_"
7,"traya","_","_","tri","NUM","","_","_"
8,"ādṛtāḥ","_","_","ādṛ","PPP","","_","_"
1,"_","_","_","anādṛta","JJ","","_","_"
2,"_","_","_","tu","CCD","","_","_"
3,"_","_","_","yad","PRL","","_","_"
4,"_","_","_","tad","PRD","","_","_"
5,"_","_","_","sarva","JQ","","_","_"
6,"_","_","_","tad","PRD","","_","_"
7,"_","_","_","aphala","JJ","","_","_"
8,"kriyāḥ","_","_","kriyā","NC","","_","_"
1,"_","_","_","na","CNG","","_","_"
2,"_","_","_","eva","CEM","","_","_"
3,"_","_","_","ida","PRD","","_","_"
4,"na","_","_","na","CNG","","_","_"
5,"paro","_","_","para","PPX","","_","_"
6,"_","_","_","loka","NC","","_","_"
7,"_","_","_","tad","PRD","","_","_"
8,"_","_","_","ca","CCD","","_","_"
9,"_","_","_","eva","CEM","","_","_"
10,"paraṃtapa","_","_","paraṃtapa","JJ","","_","_"
1,"a","_","_","alpha_privativum","JJ","","_","_"
1,"amānitā","_","_","mānita","JJ","","_","_"
2,"nityam","_","_","nitya","CX","","_","_"
3,"eva","_","_","eva","CEM","","_","_"
4,"_","_","_","yad","PRL","","_","_"
5,"_","_","_","tad","PRD","","_","_"
6,"_","_","_","guru","NC","","_","_"
7,"_","_","_","tri","NUM","","_","_"
1,"na","_","_","na","CNG","","_","_"
2,"_","_","_","ca","CCD","","_","_"
3,"_","_","_","ida","PRD","","_","_"
4,"_","_","_","na","CNG","","_","_"
5,"pare","_","_","para","PPX","","_","_"
6,"loke","_","_","loka","NC","","_","_"
7,"_","_","_","yaśas","NC","","_","_"
8,"_","_","_","tad","PRD","","_","_"
9,"prakāśate","_","_","prakāś","V","prakāś","_","_"
1,"na","_","_","na","CNG","","_","_"
2,"_","_","_","ca","CCD","","_","_"
3,"_","_","_","anya","PPX","","_","_"
4,"api","_","_","api","CX","","_","_"
5,"kalyāṇaṃ","_","_","kalyāṇa","JJ","","_","_"
6,"pāratraṃ","_","_","pāratra","NC","","_","_"
7,"samudāhṛtam","_","_","samudāhṛ","PPP","","_","_"
1,"tebhya","_","_","tad","PRD","","_","_"
2,"eva","_","_","eva","CEM","","_","_"
3,"tu","_","_","tu","CCD","","_","_"
4,"tat","_","_","tad","PRD","","_","_"
5,"sarvaṃ","_","_","sarva","JQ","","_","_"
6,"kṛtyayā","_","_","kṛtyā","NC","","_","_"
7,"_","_","_","visṛj","V","visṛj","_","_"
8,"_","_","_","mat","PPR","","_","_"
1,"tad","_","_","tad","PRD","","_","_"
2,"_","_","_","as","V","as","_","_"
3,"_","_","_","mat","PPR","","_","_"
4,"śataguṇaṃ","_","_","śataguṇa","JJ","","_","_"
5,"sahasraguṇam","_","_","sahasraguṇa","JJ","","_","_"
6,"eva","_","_","eva","CEM","","_","_"
7,"ca","_","_","ca","CCD","","_","_"
1,"_","_","_","tad","PRD","","_","_"
2,"_","_","_","mat","PPR","","_","_"
3,"saṃprakāśante","_","_","samprakās","V","samprakās","_","_"
4,"trayo","_","_","tri","NUM","","_","_"
5,"lokā","_","_","loka","NC","","_","_"
6,"yudhiṣṭhira","_","_","yudhiṣṭhira","NC","","_","_"
1,"_","_","_","daśan","NUM","","_","_"
2,"_","_","_","eva","CEM","","_","_"
3,"tu","_","_","tu","CCD","","_","_"
4,"_","_","_","sat","JJ","","_","_"
5,"_","_","_","ācārya","NC","","_","_"
6,"śrotriyān","_","_","śrotriya","NC","","_","_"
7,"atiricyate","_","_","atiric","V","atiric","_","_"
1,"_","_","_","daśan","NUM","","_","_"
2,"_","_","_","ācārya","NC","","_","_"
3,"upādhyāya","_","_","upādhyāya","NC","","_","_"
4,"upādhyāyān","_","_","upādhyāya","NC","","_","_"
5,"pitā","_","_","pitṛ","NC","","_","_"
6,"daśa","_","_","daśan","NUM","","_","_"
1,"pitṝn","_","_","pitṛ","NC","","_","_"
2,"daśa","_","_","daśan","NUM","","_","_"
3,"tu","_","_","tu","CCD","","_","_"
4,"_","_","_","mātṛ","NC","","_","_"
5,"_","_","_","eka","PPX","","_","_"
6,"sarvāṃ","_","_","sarva","JQ","","_","_"
7,"vā","_","_","vā","CCD","","_","_"
8,"pṛthivīm","_","_","pṛthivī","NC","","_","_"
9,"api","_","_","api","CX","","_","_"
1,"_","_","_","guru","NC","","_","_"
3,"_","_","_","abhibhav","V","abhibhū","_","_"
4,"_","_","_","na","CNG","","_","_"
5,"_","_","_","as","V","as","_","_"
6,"_","_","_","mātṛ","NC","","_","_"
7,"_","_","_","sama","PPX","","_","_"
8,"guruḥ","_","_","guru","NC","","_","_"
1,"gurur","_","_","guru","NC","","_","_"
2,"garīyān","_","_","garīyas","JJ","","_","_"
3,"pitṛto","_","_","pitṛ","NC","","_","_"
4,"_","_","_","mātṛ","NC","","_","_"
5,"_","_","_","ca","CCD","","_","_"
6,"_","_","_","iti","CQT","","_","_"
7,"me","_","_","mat","PPR","","_","_"
8,"matiḥ","_","_","mati","NC","","_","_"
1,"ubhau","_","_","ubh","PPX","","_","_"
2,"hi","_","_","hi","CX","","_","_"
3,"_","_","_","mātā","NC","","_","_"
4,"_","_","_","pitṛ","NC","","_","_"
5,"janmani","_","_","janman","NC","","_","_"
6,"vyupayujyataḥ","_","_","vyupayuj","V","vyupayuj","_","_"
1,"śarīram","_","_","śarīra","NC","","_","_"
2,"etau","_","_","tad","PRD","","_","_"
3,"sṛjataḥ","_","_","sṛj","V","sṛj","_","_"
4,"pitā","_","_","pitṛ","NC","","_","_"
5,"mātā","_","_","mātṛ","NC","","_","_"
6,"ca","_","_","ca","CCD","","_","_"
7,"bhārata","_","_","bhārata","NC","","_","_"
1,"_","_","_","ācārya","NC","","_","_"
2,"_","_","_","śās","PPP","","_","_"
3,"yā","_","_","yad","PRL","","_","_"
4,"jātiḥ","_","_","jāti","NC","","_","_"
5,"sā","_","_","tad","PRD","","_","_"
6,"divyā","_","_","divya","JJ","","_","_"
7,"_","_","_","tad","PRD","","_","_"
8,"_","_","_","ajara","JJ","","_","_"
9,"_","_","_","amara","JJ","","_","_"
1,"avadhyā","_","_","avadhya","JJ","","_","_"
2,"hi","_","_","hi","CX","","_","_"
3,"sadā","_","_","sadā","CAD","","_","_"
4,"mātā","_","_","mātṛ","NC","","_","_"
5,"pitā","_","_","pitṛ","NC","","_","_"
6,"_","_","_","ca","CCD","","_","_"
7,"_","_","_","api","CX","","_","_"
8,"_","_","_","apakārin","JJ","","_","_"
1,"na","_","_","na","CNG","","_","_"
2,"saṃduṣyati","_","_","saṃduṣ","V","saṃduṣ","_","_"
3,"tat","_","_","tad","PRD","","_","_"
4,"kṛtvā","_","_","kṛ","CGDA","","_","_"
5,"na","_","_","na","CNG","","_","_"
6,"ca","_","_","ca","CCD","","_","_"
7,"te","_","_","tad","PRD","","_","_"
8,"dūṣayanti","_","_","dūṣay","V","dūṣay","_","_"
9,"tam","_","_","tad","PRD","","_","_"
1,"dharmāya","_","_","dharma","NC","","_","_"
2,"yatamānānāṃ","_","_","yat","KDP","","_","_"
3,"vidur","_","_","vid","V","vid","_","_"
4,"devāḥ","_","_","deva","NC","","_","_"
5,"_","_","_","saha","CX","","_","_"
6,"_","_","_","ṛṣi","NC","","_","_"
1,"ya","_","_","yad","PRL","","_","_"
2,"_","_","_","āvṛ","V","āvṛ","_","_"
3,"_","_","_","avitatha","JJ","","_","_"
4,"karṇāv","_","_","karṇa","NC","","_","_"
5,"ṛtaṃ","_","_","ṛta","NC","","_","_"
6,"bruvann","_","_","brū","KDP","","_","_"
7,"amṛtaṃ","_","_","amṛta","NC","","_","_"
8,"samprayacchan","_","_","sampraya","KDP","","_","_"
1,"taṃ","_","_","tad","PRD","","_","_"
2,"vai","_","_","vai","CX","","_","_"
3,"manye","_","_","man","V","man","_","_"
4,"pitaraṃ","_","_","pitṛ","NC","","_","_"
5,"mātaraṃ","_","_","mātṛ","NC","","_","_"
6,"ca","_","_","ca","CCD","","_","_"
7,"tasmai","_","_","tad","PRD","","_","_"
8,"na","_","_","na","CNG","","_","_"
9,"druhyet","_","_","druh","V","druh","_","_"
10,"kṛtam","_","_","kṛta","NC","","_","_"
11,"asya","_","_","ida","PRD","","_","_"
12,"jānan","_","_","jñā","KDP","","_","_"
1,"vidyāṃ","_","_","vidyā","NC","","_","_"
2,"śrutvā","_","_","śru","CGDA","","_","_"
3,"ye","_","_","yad","PRL","","_","_"
4,"guruṃ","_","_","guru","NC","","_","_"
5,"_","_","_","na","CNG","","_","_"
6,"_","_","_","ādṛ","V","ādṛ","_","_"
7,"pratyāsannaṃ","_","_","pratyāsad","PPP","","_","_"
8,"manasā","_","_","manas","NC","","_","_"
9,"karmaṇā","_","_","karman","NC","","_","_"
10,"vā","_","_","vā","CCD","","_","_"
1,"_","_","_","yathā","CCM","","_","_"
2,"_","_","_","eva","CEM","","_","_"
3,"te","_","_","tad","PRD","","_","_"
4,"gurubhir","_","_","guru","JJ","","_","_"
5,"bhāvanīyās","_","_","bhāvay","KDG","","_","_"
6,"tathā","_","_","tathā","CX","","_","_"
7,"teṣāṃ","_","_","tad","PRD","","_","_"
8,"guravo","_","_","guru","NC","","_","_"
9,"_","_","_","api","CX","","_","_"
10,"_","_","_","arc","KDG","","_","_"
1,"tasmāt","_","_","tasmāt","CX","","_","_"
2,"_","_","_","pūjay","KDG","","_","_"
3,"_","_","_","ca","CCD","","_","_"
4,"_","_","_","saṃvibhaj","KDG","","_","_"
5,"_","_","_","ca","CCD","","_","_"
6,"yatnataḥ","_","_","yatna","NC","","_","_"
1,"guravo","_","_","guru","NC","","_","_"
2,"_","_","_","arcay","KDG","","_","_"
3,"_","_","_","ca","CCD","","_","_"
4,"purāṇaṃ","_","_","purāṇa","JJ","","_","_"
5,"dharmam","_","_","dharma","NC","","_","_"
6,"icchatā","_","_","iṣ","KDP","","_","_"
1,"yena","_","_","yad","PRL","","_","_"
2,"_","_","_","prī","PPP","","_","_"
3,"_","_","_","ca","CCD","","_","_"
4,"_","_","_","pitṛ","NC","","_","_"
5,"_","_","_","tad","PRD","","_","_"
6,"prītaḥ","_","_","prī","PPP","","_","_"
7,"pitāmahaḥ","_","_","pitāmaha","NC","","_","_"
1,"prīṇāti","_","_","prī","V","prī","_","_"
2,"mātaraṃ","_","_","mātṛ","NC","","_","_"
3,"yena","_","_","yad","PRL","","_","_"
4,"pṛthivī","_","_","pṛthivī","NC","","_","_"
5,"tena","_","_","tad","PRD","","_","_"
6,"pūjitā","_","_","pūjay","PPP","","_","_"
1,"yena","_","_","yad","PRL","","_","_"
2,"_","_","_","prī","V","prī","_","_"
3,"_","_","_","upādhyāya","NC","","_","_"
4,"tena","_","_","tad","PRD","","_","_"
5,"syād","_","_","as","V","as","_","_"
6,"brahma","_","_","brahman","NC","","_","_"
7,"pūjitam","_","_","pūjay","PPP","","_","_"
1,"mātṛtaḥ","_","_","mātṛ","NC","","_","_"
2,"_","_","_","pitṛ","NC","","_","_"
3,"_","_","_","ca","CCD","","_","_"
4,"_","_","_","eva","CEM","","_","_"
5,"tasmāt","_","_","tasmāt","CX","","_","_"
6,"pūjyatamo","_","_","pūjyatama","JJ","","_","_"
7,"guruḥ","_","_","guru","NC","","_","_"
1,"_","_","_","ṛṣi","NC","","_","_"
2,"_","_","_","ca","CCD","","_","_"
3,"hi","_","_","hi","CX","","_","_"
4,"_","_","_","deva","NC","","_","_"
5,"_","_","_","ca","CCD","","_","_"
6,"prīyante","_","_","prai","V","prai","_","_"
7,"pitṛbhiḥ","_","_","pitṛ","NC","","_","_"
8,"saha","_","_","saha","CX","","_","_"
1,"na","_","_","na","CNG","","_","_"
2,"kenacana","_","_","kaścana","PRI","","_","_"
3,"vṛttena","_","_","vṛtta","NC","","_","_"
4,"_","_","_","hi","CX","","_","_"
5,"_","_","_","avajñā","KDG","","_","_"
6,"gurur","_","_","guru","NC","","_","_"
7,"bhavet","_","_","bhav","V","bhū","_","_"
1,"na","_","_","na","CNG","","_","_"
2,"ca","_","_","ca","CCD","","_","_"
3,"mātā","_","_","mātṛ","NC","","_","_"
4,"na","_","_","na","CNG","","_","_"
5,"ca","_","_","ca","CCD","","_","_"
6,"pitā","_","_","pitṛ","NC","","_","_"
7,"tādṛśo","_","_","tādṛśa","JJ","","_","_"
8,"yādṛśo","_","_","yādṛśa","JJ","","_","_"
9,"guruḥ","_","_","guru","NC","","_","_"
1,"na","_","_","na","CNG","","_","_"
2,"te","_","_","tad","PRD","","_","_"
3,"'vamānam","_","_","avamāna","NC","","_","_"
4,"arhanti","_","_","arh","V","arh","_","_"
5,"na","_","_","na","CNG","","_","_"
6,"ca","_","_","ca","CCD","","_","_"
7,"te","_","_","tad","PRD","","_","_"
8,"dūṣayanti","_","_","dūṣay","V","dūṣay","_","_"
9,"tam","_","_","tad","PRD","","_","_"
1,"gurūṇām","_","_","guru","NC","","_","_"
2,"eva","_","_","eva","CEM","","_","_"
3,"satkāraṃ","_","_","satkāra","NC","","_","_"
4,"vidur","_","_","vid","V","vid","_","_"
5,"devāḥ","_","_","deva","NC","","_","_"
6,"_","_","_","saha","CX","","_","_"
7,"_","_","_","ṛṣi","NC","","_","_"
1,"upādhyāyaṃ","_","_","upādhyāya","NC","","_","_"
2,"pitaraṃ","_","_","pitṛ","NC","","_","_"
3,"mātaraṃ","_","_","mātṛ","NC","","_","_"
4,"ca","_","_","ca","CCD","","_","_"
5,"ye","_","_","yad","PRL","","_","_"
6,"'bhidruhyanti","_","_","abhidruh","V","abhidruh","_","_"
7,"manasā","_","_","manas","NC","","_","_"
8,"karmaṇā","_","_","karman","NC","","_","_"
9,"vā","_","_","vā","CCD","","_","_"
1,"teṣāṃ","_","_","tad","PRD","","_","_"
2,"pāpaṃ","_","_","pāpa","NC","","_","_"
3,"_","_","_","bhrūṇa","NC","","_","_"
4,"_","_","_","hatyā","NC","","_","_"
5,"_","_","_","viśiṣ","PPP","","_","_"
6,"_","_","_","tad","PRD","","_","_"
7,"_","_","_","na","CNG","","_","_"
8,"_","_","_","anya","PPX","","_","_"
9,"_","_","_","pāpa","NC","","_","_"
10,"_","_","_","kṛt","JJ","","_","_"
11,"asti","_","_","as","V","as","_","_"
12,"loke","_","_","loka","NC","","_","_"
1,"_","_","_","mitra","NC","","_","_"
2,"_","_","_","druh","JJ","","_","_"
3,"kṛtaghnasya","_","_","kṛtaghna","JJ","","_","_"
4,"_","_","_","strī","NC","","_","_"
5,"_","_","_","ghna","JJ","","_","_"
6,"piśunasya","_","_","piśuna","JJ","","_","_"
7,"ca","_","_","ca","CCD","","_","_"
1,"caturṇāṃ","_","_","catur","NUM","","_","_"
2,"vayam","_","_","mat","PPR","","_","_"
3,"eteṣāṃ","_","_","tad","PRD","","_","_"
4,"niṣkṛtiṃ","_","_","niṣkṛti","NC","","_","_"
5,"_","_","_","na","CNG","","_","_"
6,"_","_","_","anuśṛṇ","V","anuśru","_","_"
1,"etat","_","_","tad","PRD","","_","_"
2,"sarvam","_","_","sarva","JQ","","_","_"
3,"atideśena","_","_","atideśa","NC","","_","_"
4,"sṛṣṭaṃ","_","_","sṛj","PPP","","_","_"
5,"yat","_","_","yad","PRL","","_","_"
6,"kartavyaṃ","_","_","kṛ","KDG","","_","_"
7,"_","_","_","puruṣa","NC","","_","_"
8,"_","_","_","iha","CAD","","_","_"
9,"loke","_","_","loka","NC","","_","_"
1,"_","_","_","tad","PRD","","_","_"
2,"_","_","_","śreyas","JJ","","_","_"
3,"_","_","_","na","CNG","","_","_"
4,"_","_","_","anya","PPX","","_","_"
5,"asmād","_","_","ida","PRD","","_","_"
6,"viśiṣṭaṃ","_","_","viśiṣ","PPP","","_","_"
7,"sarvān","_","_","sarva","JQ","","_","_"
8,"dharmān","_","_","dharma","NC","","_","_"
9,"_","_","_","anusṛ","CGDA","","_","_"
10,"_","_","_","tad","PRD","","_","_"
11,"uktam","_","_","vac","PPP","","_","_"
