"WordID","word","NormSTEM","suffix","lemma","PoS","Root","NormSuffix","NormWord"
NA,"<doc textid = ""dipamkarazrijjana_cittotpadasamvaravidhikrama"" genre = ""śāstra"" title = ""cittotpadasamvaravidhikrama"" author = ""dīpaṅkaraśrījñana_atiśa"" discourse = ""other"" tradition = ""madhyamaka-yogācāra"" period = ""commentarial"" source = ""gretil accessed april 2021 : http :// gretil.sub.uni-goettingen.d e/ greti l/ corpuste i/ sa_.xml"" date_range = ""11. ce"" notes = ""date range = 11. ce ? the skt originals of atiśa's works are lost; unable to find text on dsbc; presumably the source is this publication: ramesh chandra negi. atīśaviracitā ekādaśagranthaḥ: eleven treatises by atiśa. restored; translated and edited by ramesh chandra negi. bhoṭa-bhāratīya granthamālā; 24. varanasi: central institute of higher tibetan studies; 1992 but unable to access publ."" religion = ""buddh"" edition = ""r.c. negi. atisha-virachita ekadasagrantha. sarnath: central institute of higher tibetan studies; 1992."" digitization = ""members of the sanskrit buddhist input project"" segmentation_lemmatization = ""ligeia lugli & buddhist translators workbench team"" metadata_enrichment = ""bruno galasek-hul & buddhist translators workbench team"" proofreader = "" n/ a"" permission = ""permission for derivatives from m. mehner on behalf of gretil"" reconstructions = ""retranslated"">","","","","","","",""
NA,"<s number=""1"">","","","","","","",""
1,"cittotpāda","CITTOTPĀD","a","cittotpāda","noun-adj","","a","cittotpāda"
2,"saṃvara","SAṂVAR","a","saṃvara","noun-adj","","a","saṃvara"
3,"vidhi","VIDH","i","vidhi","noun-adj","","i","vidhi"
4,"kramaḥ","KRAM","aḥ","krama","noun-adj","","aḥ","kramaḥ"
5,"namo","NAM","o","namas","noun-adj","","aḥ","namaḥ"
6,"mañjuśriye","MAÑJUŚR","iye","","noun-adj","","iye","mañjuśriye"
7,"kumāra","KUMĀR","a","kumāra","noun-adj","","a","kumāra"
8,"bhūtāya","BHŪT","āya","bhūta","noun-adj","","āya","bhūtāya"
NA,"</s>","","","","","","",""
NA,"<s number=""2"">","","","","","","",""
1,"sarva","SARV","a","sarva","noun-adj","","a","sarva"
2,"durgatito","DURGAT","ito","durgatita","noun-adj","","ito","durgatito"
3,"hīnaṃ","HĪN","aṃ","hīna","noun-adj","","am","hīnam"
4,"sarv","SARV","a","sarva","noun-adj","","a","sarva"
5,"^āvaraṇa","ĀVARAṆ","a","āvaraṇa","noun-adj","","a","āvaraṇa"
6,"varjitam","VARJIT","am","varjita","noun-adj","","am","varjitam"
7,"/","","","","punct","","","/"
8,"bodhicittaṃ","BODHICITT","aṃ","bodhicitta","noun-adj","","am","bodhicittam"
9,"namasyāmi","NAMAS","yāmi","namasy","verb","namasy","yāmi","namasyāmi"
10,"sambuddha","SAṂBUDDH","a","saṃbuddha","noun-adj","","a","saṃbuddha"
11,"pada","PAD","a","pada","noun-adj","","a","pada"
12,"dāyakam","DĀYAK","am","dāyaka","noun-adj","","am","dāyakam"
13,"//","","","","punct","","","//"
14,"1","","","","ind","","",""
15,"//","","","","punct","","","//"
NA,"</s>","","","","","","",""
NA,"<s number=""3"">","","","","","","",""
1,"sambuddhaṃ","SAṂBUDDH","aṃ","saṃbuddha","noun-adj","","am","saṃbuddham"
2,"c","","a","ca","ind","","a","ca"
3,"^āpi","","","api","ind","","","api"
4,"sad","SAD","","sat","noun-adj","","","sad"
5,"dharma","DHARM","a","dharma","noun-adj","","a","dharma"
6,"bodhisattva","BODHISATTV","a","bodhisattva","noun-adj","","a","bodhisattva"
7,"gaṇān","GAṆ","ān","gaṇa","noun-adj","","ān","gaṇān"
8,"api","","","api","ind","","","api"
9,"/","","","","punct","","","/"
10,"likhāmi","LIKH","āmi","likh","verb","likh","āmi","likhāmi"
11,"bodhisattvānāṃ","BODHISATTV","ānāṃ","bodhisattva","noun-adj","","ānām","bodhisattvānām"
12,"yathā","","","yathā","ind","","","yathā"
13,"vad","VAD","","vat","noun-adj","","","vad"
14,"saṃvara","SAṂVAR","a","saṃvara","noun-adj","","a","saṃvara"
15,"kramam","KRAM","am","krama","noun-adj","","am","kramam"
16,"//","","","","punct","","","//"
17,"2","","","","ind","","",""
18,"//","","","","punct","","","//"
NA,"</s>","","","","","","",""
NA,"<s number=""4"">","","","","","","",""
1,"tatra","","","tatra","ind","","","tatra"
2,"prathamaṃ","PRATHAM","aṃ","prathama","noun-adj","","am","prathamam"
3,"sarva","SARV","a","sarva","noun-adj","","a","sarva"
4,"buddha","BUDDH","a","buddha","noun-adj","","a","buddha"
5,"bodhisattva","BODHISATTV","a","bodhisattva","noun-adj","","a","bodhisattva"
6,"vandanā","VANDAN","ā","vandanā","noun-adj","","ā","vandanā"
7,"pūj","PŪJ","a","pūjā","noun-adj","","a","pūjā"
8,"^ādi","ĀD","i","ādi","noun-adj","","i","ādi"
9,"vidhipūrvakam","VIDHIPŪRV","akam","vidhipūrvaka","noun-adj","","akam","vidhipūrvakam"
10,"kalyāṇamitre","KALYĀṆAMITR","e","kalyāṇamitra","noun-adj","","e","kalyāṇamitre"
11,"śāstṛ","ŚĀST","ṛ","śāstṛ","noun-adj","","ṛ","śāstṛ"
12,"saṃjñām","SAṂJÑ","ām","saṃjñā","noun-adj","","ām","saṃjñām"
13,"utpādya","UTPĀDY","a","utpad","verb","utpad","a","utpādya"
14,"evam","","","eva","ind","","","eva"
15,"adhy","ADHY","a","adhi","noun-adj","","a","adhya"
16,"^eṣitavyam","EṢ","itavyam","iṣ","verb","iṣ","itavyam","eṣitavyam"
17,"yathā","","","yathā","ind","","","yathā"
18,"pūrva","PŪRV","a","pūrva","noun-adj","","a","pūrva"
19,"tathāgat","TATHĀGAT","a","tathāgata","noun-adj","","a","tathāgata"
20,"^ārhat","ĀRHAT","","ārhata","noun-adj","","","ārhat"
21,"samyaksambuddhaiḥ","SAMYAKSAMBUDDH","aiḥ","samyaksaṃbuddha","noun-adj","","air","samyaksambuddhair"
22,"mahābhūmi","MAHĀBHŪM","i","mahābhūmi","noun-adj","","i","mahābhūmi"
23,"sthita","STHIT","a","sthita","noun-adj","","a","sthita"
24,"bodhisattvaiś","BODHISATTV","aiś","bodhisattva","noun-adj","","aiś","bodhisattvaiś"
25,"ca","","","ca","ind","","","ca"
26,"pūrvam","PŪRV","am","pūrva","noun-adj","","am","pūrvam"
27,"anuttara","ANUTTAR","a","anuttara","noun-adj","","a","anuttara"
28,"samyaksambodhau","SAMYAKSAMBODH","au","samyaksambodha","noun-adj","","au","samyaksambodhau"
29,"cittotpādaḥ","CITTOTPĀD","aḥ","cittotpāda","noun-adj","","aḥ","cittotpādaḥ"
30,"kṛtaḥ","KṚT","aḥ","kṛta","noun-adj","","aḥ","kṛtaḥ"
31,"tathā","","","tathā","ind","","","tathā"
32,"evaṃ","","","eva","ind","","","eva"
33,"nāmno","NĀMN","o","nāmnā","noun-adj","","aḥ","nāmnaḥ"
34,"mam","MAM","a","mat","pron","","a","mama"
35,"^āpi","","","api","ind","","","api"
36,"ācāryo","ĀCĀRY","o","ācārya","noun-adj","","aḥ","ācāryaḥ"
37,"anuttara","ANUTTAR","a","anuttara","noun-adj","","a","anuttara"
38,"samyaksambodhau","SAMYAKSAMBODH","au","samyaksambodha","noun-adj","","au","samyaksambodhau"
39,"cittam","CITT","am","citta","noun-adj","","am","cittam"
40,"utpādayed","UTPĀDAY","ed","utpad","verb","utpad","ed","utpādayed"
41,"iti","","","iti","ind","","","iti"
42,"triḥ","","","tri","ind","","","tri"
43,"vadet","VAD","et","vad","verb","vad","et","vadet"
44,"/","","","","punct","","","/"
NA,"</s>","","","","","","",""
NA,"<s number=""5"">","","","","","","",""
1,"evam","","","eva","ind","","","eva"
2,"adhyeṣya","ADHYEṢ","ya","adhīṣ","verb","adhīṣ","ya","adhyeṣya"
3,"tri","TR","i","tri","noun-adj","","i","tri"
4,"śaraṇa","ŚARAṆ","a","śaraṇa","noun-adj","","a","śaraṇa"
5,"gamanam","GAMAN","am","gamana","noun-adj","","am","gamanam"
6,"samanvāhara","SAMANVĀHAR","a","samanvāhar","noun-adj","","a","samanvāhara"
7,"ācārya","ĀCĀRY","a","ācārya","noun-adj","","a","ācārya"
8,"/","","","","punct","","","/"
NA,"</s>","","","","","","",""
NA,"<s number=""6"">","","","","","","",""
1,"aham","AHAM","","mat","pron","","","aham"
2,"evaṃnāmā","EVAṂNĀM","ā","evaṃnāman","noun-adj","","ā","evaṃnāmā"
3,"etatkāla","ETATKĀL","a","etatkāla","noun-adj","","a","etatkāla"
4,"prabhṛti","PRABHṚT","i","prabhṛti","noun-adj","","i","prabhṛti"
5,"yāvad","YĀVAD","","yāvat","ind","","","yāvad"
6,"bodhimaṇḍaṃ","BODHIMAṆḌ","aṃ","bodhimaṇḍa","noun-adj","","am","bodhimaṇḍam"
7,"dvipadānāṃ","DVIPAD","ānāṃ","dvipada","noun-adj","","ānām","dvipadānām"
8,"śreṣṭhaṃ","ŚREṢṬH","aṃ","śreṣṭha","noun-adj","","am","śreṣṭham"
9,"buddhaṃ","BUDDH","aṃ","buddha","noun-adj","","am","buddham"
10,"bhagavantaṃ","BHAGAV","antaṃ","bhagavat","noun-adj","","antam","bhagavantam"
11,"śaraṇaṃ","ŚARAṆ","aṃ","śaraṇa","noun-adj","","am","śaraṇam"
12,"gacchāmi","GACCH","āmi","gacch","verb","gam","āmi","gacchāmi"
13,"/","","","","punct","","","/"
NA,"</s>","","","","","","",""
NA,"<s number=""7"">","","","","","","",""
1,"samanvāhara","SAMANVĀHAR","a","samanvāhar","noun-adj","","a","samanvāhara"
2,"ācārya","ĀCĀRY","a","ācārya","noun-adj","","a","ācārya"
3,"/","","","","punct","","","/"
NA,"</s>","","","","","","",""
NA,"<s number=""8"">","","","","","","",""
1,"aham","AHAM","","mat","pron","","","aham"
2,"evaṃnāmā","EVAṂNĀM","ā","evaṃnāman","noun-adj","","ā","evaṃnāmā"
3,"etatkāla","ETATKĀL","a","etatkāla","noun-adj","","a","etatkāla"
4,"prabhṛti","PRABHṚT","i","prabhṛti","noun-adj","","i","prabhṛti"
5,"yāvad","YĀVAD","","yāvat","ind","","","yāvad"
6,"bodhimaṇḍaṃ","BODHIMAṆḌ","aṃ","bodhimaṇḍa","noun-adj","","am","bodhimaṇḍam"
7,"dharmāṇām","DHARM","āṇām","dharma","noun-adj","","ānām","dharmānām"
8,"uttamaṃ","UTTAM","aṃ","uttama","noun-adj","","am","uttamam"
9,"śānta","ŚĀNT","a","śānta","noun-adj","","a","śānta"
10,"virāgaṃ","VIRĀG","aṃ","virāga","noun-adj","","am","virāgam"
11,"dharma","DHARM","a","dharma","noun-adj","","a","dharma"
12,"śaraṇaṃ","ŚARAṆ","aṃ","śaraṇa","noun-adj","","am","śaraṇam"
13,"gacchāmi","GACCH","āmi","gacch","verb","gam","āmi","gacchāmi"
14,"/","","","","punct","","","/"
NA,"</s>","","","","","","",""
NA,"<s number=""9"">","","","","","","",""
1,"samanvāhara","SAMANVĀHAR","a","samanvāhar","noun-adj","","a","samanvāhara"
2,"ācārya","ĀCĀRY","a","ācārya","noun-adj","","a","ācārya"
3,"/","","","","punct","","","/"
NA,"</s>","","","","","","",""
NA,"<s number=""10"">","","","","","","",""
1,"aham","AHAM","","mat","pron","","","aham"
2,"evaṃnāmā","EVAṂNĀM","ā","evaṃnāman","noun-adj","","ā","evaṃnāmā"
3,"etatkāla","ETATKĀL","a","etatkāla","noun-adj","","a","etatkāla"
4,"prabhṛti","PRABHṚT","i","prabhṛti","noun-adj","","i","prabhṛti"
5,"yāvad","YĀVAD","","yāvat","ind","","","yāvad"
6,"bodhimaṇḍaṃ","BODHIMAṆḌ","aṃ","bodhimaṇḍa","noun-adj","","am","bodhimaṇḍam"
7,"gaṇānām","GAṆ","ānām","gaṇa","noun-adj","","ānām","gaṇānām"
8,"uttamaṃ","UTTAM","aṃ","uttama","noun-adj","","am","uttamam"
9,"ārya","ĀRY","a","ārya","noun-adj","","a","ārya"
10,"bodhisattv","BODHISATTV","a","bodhisattva","noun-adj","","a","bodhisattva"
11,"^āvaivartika","AVAIVARTIK","a","avaivartika","noun-adj","","a","avaivartika"
12,"bodhisattva","BODHISATTV","a","bodhisattva","noun-adj","","a","bodhisattva"
13,"saṃghaṃ","SAṂGH","aṃ","saṃgha","noun-adj","","am","saṃgham"
14,"śaraṇaṃ","ŚARAṆ","aṃ","śaraṇa","noun-adj","","am","śaraṇam"
15,"gacchāmi","GACCH","āmi","gacch","verb","gam","āmi","gacchāmi"
16,"iti","","","iti","ind","","","iti"
17,"triḥ","","","tri","ind","","","tri"
18,"vadet","VAD","et","vad","verb","vad","et","vadet"
19,"/","","","","punct","","","/"
NA,"</s>","","","","","","",""
NA,"<s number=""11"">","","","","","","",""
1,"evaṃ","","","eva","ind","","","eva"
2,"viśiṣṭaṃ","VIŚIṢṬ","aṃ","viśiṣṭa","noun-adj","","am","viśiṣṭam"
3,"śaraṇa","ŚARAṆ","a","śaraṇa","noun-adj","","a","śaraṇa"
4,"gamanaṃ","GAMAN","aṃ","gamana","noun-adj","","am","gamanam"
5,"kṛttvā","KṚTT","vā","kar","verb","kṛ","vāḥ","kṛttvāḥ"
6,"bhagavantaṃ","BHAGAV","antaṃ","bhagavat","noun-adj","","antam","bhagavantam"
7,"śākyamuniṃ","ŚĀKYAMUN","iṃ","śākyamuni","noun-adj","","im","śākyamunim"
8,"daśadiśāṃ","DAŚADI","śāṃ","daśadia","noun-adj","","śāṃ","daśadiśāṃ"
9,"sarva","SARV","a","sarva","noun-adj","","a","sarva"
10,"buddhān","BUDDH","ān","buddha","noun-adj","","ān","buddhān"
11,"bodhisattvāṃś","BODHISATTV","āṃś","bodhisattva","noun-adj","","āṃś","bodhisattvāṃś"
12,"ca","","","ca","ind","","","ca"
13,"manasā","MAN","asā","manas","noun-adj","","asā","manasā"
14,"ālambya","ĀLAṂB","ya","ālamb","verb","ālamb","ya","ālaṃbya"
15,"praṇamanaṃ","PRAṆAM","anaṃ","praṇama","noun-adj","","anaṃ","praṇamanaṃ"
16,"yathā","","","yathā","ind","","","yathā"
17,"labdhaṃ","LABDH","aṃ","labdha","noun-adj","","am","labdham"
18,"pūj","PŪJ","a","pūjā","noun-adj","","a","pūjā"
19,"^ādikaṃ","ĀDIK","aṃ","ādika","noun-adj","","am","ādikam"
20,"ca","","","ca","ind","","","ca"
21,"kuryāt","KUR","yāt","kar","verb","kṛ","yāt","kuryāt"
22,"/","","","","punct","","","/"
NA,"</s>","","","","","","",""
NA,"<s number=""12"">","","","","","","",""
1,"ācāryam","ĀCĀRY","am","ācārya","noun-adj","","am","ācāryam"
2,"sammukhaṃ","SAMMUKH","aṃ","sammukha","noun-adj","","am","sammukham"
3,"kṛtvā","KṚT","vā","kar","verb","kṛ","vāḥ","kṛtvāḥ"
4,"dakṣiṇaṃ","DAKṢIṆ","aṃ","dakṣiṇa","noun-adj","","am","dakṣiṇam"
5,"jānumaṇḍalaṃ","JĀNUMAṆḌAL","aṃ","jānumaṇḍala","noun-adj","","am","jānumaṇḍalam"
6,"pṛthivyāṃ","PṚTHIV","yāṃ","pṛthivi","noun-adj","","yām","pṛthivyām"
7,"pratiṣṭhāpya","PRATIṢṬHĀPY","a","pratiṣṭhāpya","noun-adj","","a","pratiṣṭhāpya"
8,"utkuṭuk","UTKUṬUK","a","utkuṭuka","noun-adj","","a","utkuṭuka"
9,"^āsano","ĀSAN","o","āsana","noun-adj","","aḥ","āsanaḥ"
10,"api","","","api","ind","","","api"
11,"vā","","","vā","ind","","","vā"
12,"kṛtāñjaliḥ","KṚTĀÑJAL","iḥ","kṛtāñjali","noun-adj","","iḥ","kṛtāñjaliḥ"
13,"cittam","CITT","am","citta","noun-adj","","am","cittam"
14,"utpādayet","UTPĀDAY","et","utpad","verb","utpad","et","utpādayet"
15,"/","","","","punct","","","/"
NA,"</s>","","","","","","",""
NA,"<s number=""13"">","","","","","","",""
1,"daśa","DAŚ","a","daśa","noun-adj","","a","daśa"
2,"dig","DI","g","dik","noun-adj","","g","dig"
3,"avasthitāḥ","AVASTHIT","āḥ","avasthita","noun-adj","","āḥ","avasthitāḥ"
4,"sarve","SARV","e","sarva","noun-adj","","e","sarve"
5,"buddha","BUDDH","a","buddha","noun-adj","","a","buddha"
6,"bodhisattvāḥ","BODHISATTV","āḥ","bodhisattva","noun-adj","","āḥ","bodhisattvāḥ"
7,"/","","","","punct","","","/"
NA,"</s>","","","","","","",""
NA,"<s number=""14"">","","","","","","",""
1,"mām","","","mat","pron","","","mat"
2,"samanvāharata","SAMANVĀHAR","ata","samanvāhar","noun-adj","","ati","samanvāharati"
3,"/","","","","punct","","","/"
NA,"</s>","","","","","","",""
NA,"<s number=""15"">","","","","","","",""
1,"ācārya","ĀCĀRY","a","ācārya","noun-adj","","a","ācārya"
2,"/","","","","punct","","","/"
NA,"</s>","","","","","","",""
NA,"<s number=""16"">","","","","","","",""
1,"samanvāhara","SAMANVĀHAR","a","samanvāhar","noun-adj","","a","samanvāhara"
2,"/","","","","punct","","","/"
NA,"</s>","","","","","","",""
NA,"<s number=""17"">","","","","","","",""
1,"aham","AHAM","","mat","pron","","","aham"
2,"evaṃnāmā","EVAṂNĀM","ā","evaṃnāman","noun-adj","","ā","evaṃnāmā"
3,"asyāṃ","","","idam","pron","","","idam"
4,"jātāv","JĀT","āv","jāta","noun-adj","","au","jātau"
5,"anyasu","ANY","asu","anya","pron","","asu","anyasu"
6,"vā","","","vā","ind","","","vā"
7,"jātiṣv","JĀT","iṣv","jāti","noun-adj","","iṣu","jātiṣu"
8,"anavarāgre","ANAVARĀGR","e","anavarāgra","noun-adj","","e","anavarāgre"
9,"vā","","","vā","ind","","","vā"
10,"dāna","DĀN","a","dāna","noun-adj","","a","dāna"
11,"śīla","ŚĪL","a","śīla","noun-adj","","a","śīla"
12,"bhāvan","BHĀVAN","a","bhāvat","noun-adj","","a","bhāvana"
13,"^āyaṃ","ĀYAṂ","","idam","pron","","","āyaṃ"
14,"kuśala","KUŚAL","a","kuśala","noun-adj","","a","kuśala"
15,"mūlaṃ","MŪL","aṃ","mūla","noun-adj","","am","mūlam"
16,"mayā","","","mat","pron","","","mat"
17,"kṛtaṃ","KṚT","aṃ","kṛta","noun-adj","","am","kṛtam"
18,"syāt","","","as","verb","as","",""
19,"kāritaṃ","KĀRIT","aṃ","kārita","noun-adj","","am","kāritam"
20,"kriya","KRIY","a","kriya","noun-adj","","a","kriya"
21,"māṇaṃ","MĀṆ","aṃ","māṇa","noun-adj","","am","māṇam"
22,"vā","","","vā","ind","","","vā"
23,"anumoditaṃ","ANUMODIT","aṃ","anumodita","noun-adj","","am","anumoditam"
24,"bhavet","BHAV","et","bhav","verb","bhū","et","bhavet"
25,"taiḥ","","","tad","pron","","","tad"
26,"kuśala","KUŚAL","a","kuśala","noun-adj","","a","kuśala"
27,"mūlaiḥ","MŪL","aiḥ","mūla","noun-adj","","air","mūlair"
28,"yathā","","","yathā","ind","","","yathā"
29,"pūrvakaiḥ","PŪRVAKA","iḥ","pūrvaka","noun-adj","","iḥ","pūrvakaiḥ"
30,"tathāgat","TATHĀGAT","a","tathāgata","noun-adj","","a","tathāgata"
31,"^ārhat","ĀRHAT","","ārhata","noun-adj","","","ārhat"
32,"samyaksambuddhaiḥ","SAMYAKSAMBUDDH","aiḥ","samyaksaṃbuddha","noun-adj","","air","samyaksambuddhair"
33,"mahābhūmi","MAHĀBHŪM","i","mahābhūmi","noun-adj","","i","mahābhūmi"
34,"praviṣṭaiḥ","PRAVIṢṬ","aiḥ","praviṣṭa","noun-adj","","air","praviṣṭair"
35,"mahā","MAH","ā","mahat","noun-adj","","ā","mahā"
36,"bodhisattvaiś","BODHISATTV","aiś","bodhisattva","noun-adj","","aiś","bodhisattvaiś"
37,"ca","","","ca","ind","","","ca"
38,"anuttara","ANUTTAR","a","anuttara","noun-adj","","a","anuttara"
39,"saṃyak","SAṂY","ak","saṃyaka","noun-adj","","ak","saṃyak"
40,"sambodhau","SAMBODHA","au","sambodha","noun-adj","","au","sambodhaau"
41,"cittam","CITT","am","citta","noun-adj","","am","cittam"
42,"utpāditaṃ","UTPĀDIT","aṃ","utpādita","noun-adj","","am","utpāditam"
43,"tathā","","","tathā","ind","","","tathā"
44,"evaṃnāmā","EVAṂNĀM","ā","evaṃnāman","noun-adj","","ā","evaṃnāmā"
45,"aham","AHAM","","mat","pron","","","aham"
46,"api","","","api","ind","","","api"
47,"etatkāla","ETATKĀL","a","etatkāla","noun-adj","","a","etatkāla"
48,"prabhṛti","PRABHṚT","i","prabhṛti","noun-adj","","i","prabhṛti"
49,"yāvad","YĀVAD","","yāvat","ind","","","yāvad"
50,"bodhimaṇḍaṃ","BODHIMAṆḌ","aṃ","bodhimaṇḍa","noun-adj","","am","bodhimaṇḍam"
51,"anuttara","ANUTTAR","a","anuttara","noun-adj","","a","anuttara"
52,"samyak","SAMYAK","","samyaka","noun-adj","","","samyak"
53,"mahā","MAH","ā","mahat","noun-adj","","ā","mahā"
54,"sambodhau","SAMBODHA","au","sambodha","noun-adj","","au","sambodhaau"
55,"cittam","CITT","am","citta","noun-adj","","am","cittam"
56,"utpādayeyam","UTPĀD","ayeyam","utpad","verb","utpad","ayeyam","utpādayeyam"
57,"/","","","","punct","","","/"
NA,"</s>","","","","","","",""
NA,"<s number=""18"">","","","","","","",""
1,"a","","","alpha_privativum","ind","","","alpha_privativum"
2,"tīrṇān","TĪRṆ","ān","tīrṇa","noun-adj","","ān","tīrṇān"
3,"sattvān","SATTV","ān","sattva","noun-adj","","ān","sattvān"
4,"tārayeyam","TĀR","ayeyam","tar","verb","tṛ","ayeyam","tārayeyam"
5,"/","","","","punct","","","/"
NA,"</s>","","","","","","",""
NA,"<s number=""19"">","","","","","","",""
1,"amukta","AMUKT","a","amukta","noun-adj","","a","amukta"
2,"sattvān","SATTV","ān","sattva","noun-adj","","ān","sattvān"
3,"mocayeyam","MOC","ayeyam","muñc","verb","muc","ayeyam","mocayeyam"
4,"/","","","","punct","","","/"
NA,"</s>","","","","","","",""
NA,"<s number=""20"">","","","","","","",""
1,"an","","","alpha_privativum","ind","","","alpha_privativum"
2,"āśvas","ĀŚVAS","","āśvas","noun-adj","","","āśvas"
3,"tān","TĀN","","tad","pron","","","tān"
4,"āśvāsaye","ĀŚVĀS","aye","āśvāsi","noun-adj","","aye","āśvāsaye"
5,"yam","YAM","","yad","pron","","","yam"
6,"/","","","","punct","","","/"
NA,"</s>","","","","","","",""
NA,"<s number=""21"">","","","","","","",""
1,"a","","","alpha_privativum","ind","","","alpha_privativum"
2,"parinirvṛtān","PARINIRVṚT","ān","parinirvṛta","noun-adj","","ān","parinirvṛtān"
3,"parinirvāpayeyam","PARINIRVĀP","ayeyam","parinirvāp","verb","","ayeyam","parinirvāpayeyam"
4,"/","","","","punct","","","/"
NA,"</s>","","","","","","",""
NA,"<s number=""22"">","","","","","","",""
1,"evaṃ","","","eva","ind","","","eva"
2,"triḥ","","","tri","ind","","","tri"
3,"vadet","VAD","et","vad","verb","vad","et","vadet"
4,"/","","","","punct","","","/"
NA,"</s>","","","","","","",""
NA,"<s number=""23"">","","","","","","",""
1,"tath","TATH","a","tathā","ind","","a","tathā"
2,"^aiva","","","eva","ind","","","eva"
3,"ācāryā","ĀCĀRY","ā","ācāryā","noun-adj","","ā","ācāryā"
4,"bhāve","BHĀV","e","bhāva","noun-adj","","e","bhāve"
5,"api","","","api","ind","","","api"
6,"svayaṃ","SVAY","aṃ","svayam","noun-adj","","am","svayam"
7,"bodhi","BODH","i","bodhi","noun-adj","","i","bodhi"
8,"cittotpāda","CITTOTPĀD","a","cittotpāda","noun-adj","","a","cittotpāda"
9,"vidhiḥ","VIDH","iḥ","vidhi","noun-adj","","iḥ","vidhiḥ"
10,"tathāgata","TATHĀGAT","a","tathāgata","noun-adj","","a","tathāgata"
11,"śākyamuniṃ","ŚĀKYAMUN","iṃ","śākyamuni","noun-adj","","im","śākyamunim"
12,"daśa","DAŚ","a","daśa","noun-adj","","a","daśa"
13,"dik","DI","k","dik","noun-adj","","k","dik"
14,"sarva","SARV","a","sarva","noun-adj","","a","sarva"
15,"tathāgatāṃś","TATHĀGAT","āṃś","tathāgata","noun-adj","","āṃś","tathāgatāṃś"
16,"ca","","","ca","ind","","","ca"
17,"manasā","MAN","asā","manas","noun-adj","","asā","manasā"
18,"vicintya","VICINT","ya","vicint","verb","vicint","ya","vicintya"
19,"vandanā","VANDAN","ā","vandanā","noun-adj","","ā","vandanā"
20,"pūj","PŪJ","a","pūjā","noun-adj","","a","pūjā"
21,"^ādi","ĀD","i","ādi","noun-adj","","i","ādi"
22,"vidhiṃ","VIDH","iṃ","vidhi","noun-adj","","im","vidhim"
23,"ca","","","ca","ind","","","ca"
24,"kṛtvā","KṚT","vā","kar","verb","kṛ","vāḥ","kṛtvāḥ"
25,"adhyeṣaṇ","ADHYEṢAṆ","","adhyeṣaṇa","noun-adj","","","adhyeṣaṇ"
26,"ā","","","alpha_privativum","ind","","","alpha_privativum"
27,"sahitam","SAHIT","am","sahita","noun-adj","","am","sahitam"
28,"ācārya","ĀCĀRY","a","ācārya","noun-adj","","a","ācārya"
29,"pada","PAD","a","pada","noun-adj","","a","pada"
30,"virahita","VIRAHIT","a","virahita","noun-adj","","a","virahita"
31,"śaraṇa","ŚARAṆ","a","śaraṇa","noun-adj","","a","śaraṇa"
32,"gaman","GAMAN","a","gamana","noun-adj","","a","gamana"
33,"^ādik","ĀDIK","","ādika","noun-adj","","","ādik"
34,"ramaṃ","RAM","aṃ","rama","noun-adj","","am","ramam"
35,"pūrvavad","PŪRV","avad","pūrvavat","noun-adj","","avad","pūrvavad"
36,"niṣp","NIṢP","a","niṣpṛ","noun-adj","","a","niṣpa"
37,"^ādayet","ĀDAY","et","ad","verb","ad","et","ādayet"
38,"/","","","","punct","","","/"
NA,"</s>","","","","","","",""
NA,"<s number=""24"">","","","","","","",""
1,"evaṃ","","","eva","ind","","","eva"
2,"utpanna","UTPANN","a","utpanna","noun-adj","","a","utpanna"
3,"cittaḥ","CITT","aḥ","citta","noun-adj","","aḥ","cittaḥ"
4,"pudgalaḥ","PUDGAL","aḥ","pudgala","noun-adj","","aḥ","pudgalaḥ"
5,"bodhicitta","BODHICITT","a","bodhicitta","noun-adj","","a","bodhicitta"
6,"vṛddhy","VṚDDH","y","vṛddhi","noun-adj","","i","vṛddhi"
7,"artha","ARTH","a","artha","noun-adj","","a","artha"
8,"antaśo","ANTAŚ","o","antaśas","noun-adj","","aḥ","antaśaḥ"
9,"divā","DIV","ā","divā","noun-adj","","ā","divā"
10,"trivāraṃ","TRIV","āraṃ","trivat","noun-adj","","āram","trivāram"
11,"rātrau","RĀTR","au","rātra","noun-adj","","au","rātrau"
12,"ca","","","ca","ind","","","ca"
13,"trivāraṃ","TRIV","āraṃ","trivat","noun-adj","","āram","trivāram"
14,"buddhaṃ","BUDDH","aṃ","buddha","noun-adj","","am","buddham"
15,"ca","","","ca","ind","","","ca"
16,"dharmañ","DHARM","añ","dharma","noun-adj","","ān","dharmān"
17,"ca","","","ca","ind","","","ca"
18,"gaṇ","GAṆ","a","gaṇa","noun-adj","","a","gaṇa"
19,"^ottamaṃ","UTTAM","aṃ","uttama","noun-adj","","am","uttamam"
20,"ca","","","ca","ind","","","ca"
21,"yāvaddhi","YĀVADDH","i","yāvaddhā","noun-adj","","i","yāvaddhi"
22,"bodhiṃ","BODH","iṃ","bodhi","noun-adj","","im","bodhim"
23,"śaraṇaṃ","ŚARAṆ","aṃ","śaraṇa","noun-adj","","am","śaraṇam"
24,"gato","GAT","o","gata","noun-adj","","aḥ","gataḥ"
25,"asmi","","","as","verb","as","",""
26,"/","","","","punct","","","/"
27,"dā","","","","ind","","",""
28,"nādi","NĀDI","","nādi","noun-adj","","","nādi"
29,"kṛtyaiś","KṚTY","aiś","kṛtya","noun-adj","","aiś","kṛtyaiś"
30,"ca","","","ca","ind","","","ca"
31,"kṛ","","","","ind","","",""
32,"tair","","","tad","pron","","","tad"
33,"may","MAY","a","mat","pron","","a","maya"
34,"^aibhiḥ","AIBH","iḥ","aibhi","noun-adj","","iḥ","aibhiḥ"
35,"buddho","BUDDH","o","buddha","noun-adj","","aḥ","buddhaḥ"
36,"bhaveyaṃ","BHAV","eyaṃ","bhav","verb","bhū","eyaṃ","bhaveyaṃ"
37,"jagato","JAGAT","o","jagat","noun-adj","","aḥ","jagataḥ"
38,"hitāya","HIT","āya","hita","noun-adj","","āya","hitāya"
39,"//","","","","punct","","","//"
40,"3","","","","ind","","",""
41,"//","","","","punct","","","//"
NA,"</s>","","","","","","",""
NA,"<s number=""25"">","","","","","","",""
1,"iti","","","iti","ind","","","iti"
2,"bodhicittam","BODHICITT","am","bodhicitta","noun-adj","","am","bodhicittam"
3,"utpādayet","UTPĀDAY","et","utpad","verb","utpad","et","utpādayet"
4,"/","","","","punct","","","/"
NA,"</s>","","","","","","",""
NA,"<s number=""26"">","","","","","","",""
1,"bodhicitta","BODHICITT","a","bodhicitta","noun-adj","","a","bodhicitta"
2,"vyāghātakebhyaś","VYĀGHĀTAK","ebhyaś","vyāghātaka","noun-adj","","ebhyaḥ","vyāghātakebhyaḥ"
3,"caturbhyor","CAT","urbhyor","catur","noun-adj","","urbhyor","caturbhyor"
4,"dharmebhyo","DHARM","ebhyo","dharma","noun-adj","","ebhyaḥ","dharmebhyaḥ"
5,"vyāvṛtto","VYĀVṚTT","o","vyāvṛtta","noun-adj","","aḥ","vyāvṛttaḥ"
6,"bhavet","BHAV","et","bhav","verb","bhū","et","bhavet"
7,"/","","","","punct","","","/"
NA,"</s>","","","","","","",""
NA,"<s number=""27"">","","","","","","",""
1,"katame","KATAM","e","katama","noun-adj","","e","katame"
2,"catvāraḥ","CATVĀR","aḥ","catur","noun-adj","","aḥ","catvāraḥ"
3,"/","","","","punct","","","/"
NA,"</s>","","","","","","",""
NA,"<s number=""28"">","","","","","","",""
1,"guru","GUR","u","guru","noun-adj","","u","guru"
2,"dakṣiṇīya","DAKṢIṆĪY","a","dakṣiṇīya","noun-adj","","a","dakṣiṇīya"
3,"visaṃvādanam","VISAṂVĀDAN","am","visaṃvādana","noun-adj","","am","visaṃvādanam"
4,"pareṣu","PAR","eṣu","para","noun-adj","","eṣu","pareṣu"
5,"a","","","alpha_privativum","ind","","","alpha_privativum"
6,"kaukṛtya","KAUKṚTY","a","kaukṛtya","noun-adj","","a","kaukṛtya"
7,"sthānīyeṣu","STHĀNĪY","eṣu","sthānīya","noun-adj","","eṣu","sthānīyeṣu"
8,"kaukṛtyo","KAUKṚTY","o","kaukṛtya","noun-adj","","aḥ","kaukṛtyaḥ"
9,"pādanam","PĀD","anam","pāda","noun-adj","","anam","pādanam"
10,"utpanna","UTPANN","a","utpanna","noun-adj","","a","utpanna"
11,"cittebhyo","CITT","ebhyo","citta","noun-adj","","ebhyaḥ","cittebhyaḥ"
12,"bodhisattvebhyo","BODHISATTV","ebhyo","bodhisattva","noun-adj","","ebhyaḥ","bodhisattvebhyaḥ"
13,"dveṣeṇa","DVEṢ","eṇa","dveṣa","noun-adj","","ena","dveṣena"
14,"avarṇa","AVARṆ","a","avarṇa","noun-adj","","a","avarṇa"
15,"bhāṣaṇam","BHĀṢAṆ","am","bhāṣaṇa","noun-adj","","am","bhāṣaṇam"
16,"sarva","SARV","a","sarva","noun-adj","","a","sarva"
17,"sattveṣu","SATTV","eṣu","sattva","noun-adj","","eṣu","sattveṣu"
18,"māyā","MĀY","ā","māyā","noun-adj","","ā","māyā"
19,"śāṭhy","ŚĀṬHY","a","śāṭhya","noun-adj","","a","śāṭhya"
20,"^ācaraṇañ","ĀCARAṆ","añ","ācaraṇa","noun-adj","","ān","ācaraṇān"
21,"ca","","","ca","ind","","","ca"
22,"/","","","","punct","","","/"
NA,"</s>","","","","","","",""
NA,"<s number=""29"">","","","","","","",""
1,"bodhicitt","BODHICITT","","bodhicitta","noun-adj","","","bodhicitt"
2,"ā","","","alpha_privativum","ind","","","alpha_privativum"
3,"vyāghātakān","VYĀGHĀTAK","ān","vyāghātaka","noun-adj","","ān","vyāghātakān"
4,"caturdhar","CATURDHAR","","caturdhara","noun-adj","","","caturdhar"
5,"mān","MĀN","","māna","noun-adj","","","mān"
6,"śikṣeta","ŚIKṢ","eta","śikṣ","verb","śikṣ","eta","śikṣeta"
7,"/","","","","punct","","","/"
NA,"</s>","","","","","","",""
NA,"<s number=""30"">","","","","","","",""
1,"kata","KAT","a","kata","noun-adj","","a","kata"
2,"māṃścaturaḥ","MĀṂŚCAT","uraḥ","māṃścatu","noun-adj","","uraḥ","māṃścaturaḥ"
3,"/","","","","punct","","","/"
NA,"</s>","","","","","","",""
NA,"<s number=""31"">","","","","","","",""
1,"jīvitasy","JĪVIT","asya","jīvita","noun-adj","","asya","jīvitasya"
2,"^āpi","","","api","ind","","","api"
3,"bhetoḥ","BHET","oḥ","bhetu","noun-adj","","oḥ","bhetoḥ"
4,"prajānan","PRAJĀN","an","praja","noun-adj","","ān","prajānān"
5,"a","","","alpha_privativum","ind","","","alpha_privativum"
6,"mṛṣā","MṚṢ","ā","mṛṣā","noun-adj","","ā","mṛṣā"
7,"vādam","VĀD","am","vāda","noun-adj","","am","vādam"
8,"sarva","SARV","a","sarva","noun-adj","","a","sarva"
9,"sattveṣu","SATTV","eṣu","sattva","noun-adj","","eṣu","sattveṣu"
10,"adhyāśaya","ADHYĀŚAY","a","adhyāśaya","noun-adj","","a","adhyāśaya"
11,"viśuddhyā","VIŚUDDH","yā","viśuddhi","noun-adj","","yāḥ","viśuddhyāḥ"
12,"sthitiḥ","STHIT","iḥ","sthiti","noun-adj","","iḥ","sthitiḥ"
13,"na","","","na","ind","","","na"
14,"māyā","MĀY","ā","māyā","noun-adj","","ā","māyā"
15,"śāṭhyena","ŚĀṬHY","ena","śāṭhya","noun-adj","","ena","śāṭhyena"
16,"utpanna","UTPANN","a","utpanna","noun-adj","","a","utpanna"
17,"citteṣu","CITT","eṣu","citta","noun-adj","","eṣu","citteṣu"
18,"bodhisattveṣu","BODHISATTV","eṣu","bodhisattva","noun-adj","","eṣu","bodhisattveṣu"
19,"śāstṛ","ŚĀST","ṛ","śāstṛ","noun-adj","","ṛ","śāstṛ"
20,"saṃjñām","SAṂJÑ","ām","saṃjñā","noun-adj","","ām","saṃjñām"
21,"utpādya","UTPĀD","ya","utpad","verb","utpad","ya","utpādya"
22,"daśasu","DAŚAS","u","daśas","noun-adj","","u","daśasu"
23,"dikṣu","DIKṢ","u","dik","noun-adj","","u","dikṣu"
24,"samyag","SAMYA","g","samyak","noun-adj","","g","samyag"
25,"guṇ","GUṆ","a","guṇa","noun-adj","","a","guṇa"
26,"^ākhyānam","ĀKHYĀN","am","ākhyāna","noun-adj","","am","ākhyānam"
27,"ye","","","yad","pron","","","yad"
28,"sattvāḥ","SATTV","āḥ","sattva","noun-adj","","āḥ","sattvāḥ"
29,"kuśale","KUŚAL","e","kuśala","noun-adj","","e","kuśale"
30,"sthāpitāḥ","STHĀPIT","āḥ","sthāpita","noun-adj","","āḥ","sthāpitāḥ"
31,"teṣām","","","tad","pron","","","tad"
32,"anuttara","ANUTTAR","a","anuttara","noun-adj","","a","anuttara"
33,"samyaksambodhau","SAMYAKSAMBODH","au","samyaksambodha","noun-adj","","au","samyaksambodhau"
34,"sthāpanaṃ","STHĀPAN","aṃ","sthāpana","noun-adj","","am","sthāpanam"
35,"na","","","na","ind","","","na"
36,"tu","","","tu","ind","","","tu"
37,"śrāvaka","ŚRĀVAK","a","śrāvaka","noun-adj","","a","śrāvaka"
38,"pratyekabuddhatveṣv","PRATYEKABUDDHATV","eṣv","pratyekabuddhatva","noun-adj","","eṣu","pratyekabuddhatveṣu"
39,"iti","","","iti","ind","","","iti"
40,"/","","","","punct","","","/"
NA,"</s>","","","","","","",""
NA,"<s number=""32"">","","","","","","",""
1,"viśeṣeṇ","VIŚEṢ","eṇ","viśeṣa","noun-adj","","ena","viśeṣena"
2,"ābhijñāṃ","ABHIJÑ","āṃ","abhijñā","noun-adj","","ām","abhijñām"
3,"śīghraṃ","ŚĪGHR","aṃ","śīghra","noun-adj","","am","śīghram"
4,"labdhu","LABDH","u","labdhṛ","noun-adj","","u","labdhu"
5,"kāmo","KĀM","o","kāma","noun-adj","","aḥ","kāmaḥ"
6,"bodhisattvaḥ","BODHISATTV","aḥ","bodhisattva","noun-adj","","aḥ","bodhisattvaḥ"
7,"ārya","ĀRY","a","ārya","noun-adj","","a","ārya"
8,"avalokiteśvara","AVALOKITEŚVAR","a","avalokiteśvara","noun-adj","","a","avalokiteśvara"
9,"paripṛcch","PARIPṚCCH","","paripṛcchā","noun-adj","","","paripṛcch"
10,"ā","","","alpha_privativum","ind","","","alpha_privativum"
11,"sapta","SAPT","a","sapta","noun-adj","","a","sapta"
12,"dharmaka","DHARM","aka","dharmaka","noun-adj","","aka","dharmaka"
13,"nāma","NĀM","a","nāman","noun-adj","","a","nāma"
14,"mahāyāna","MAHĀYĀN","a","mahāyāna","noun-adj","","a","mahāyāna"
15,"sūtraṃ","SŪTR","aṃ","sūtra","noun-adj","","am","sūtram"
16,"śikṣeta","ŚIKṢ","eta","śikṣ","verb","śikṣ","eta","śikṣeta"
17,"/","","","","punct","","","/"
NA,"</s>","","","","","","",""
NA,"<s number=""33"">","","","","","","",""
1,"bodhi","BODH","i","bodhi","noun-adj","","i","bodhi"
2,"cittotpād","CITTOTPĀD","a","cittotpāda","noun-adj","","a","cittotpāda"
3,"^ānuśaṃsā","ANUŚAṂS","ā","anuśaṃsa","noun-adj","","āḥ","anuśaṃsāḥ"
4,"tu","","","tu","ind","","","tu"
5,"gaṇḍavyūha","GAṆḌAVYŪH","a","gaṇḍavyūha","noun-adj","","a","gaṇḍavyūha"
6,"sūtr","SŪTR","","sūtra","noun-adj","","","sūtr"
7,"ādibhyo","ĀD","ibhyo","ādi","noun-adj","","ibhyaḥ","ādibhyaḥ"
8,"jñātavyā","JÑĀ","tavyā","jān","verb","jñā","tavyā","jñātavyā"
9,"/","","","","punct","","","/"
NA,"</s>","","","","","","",""
NA,"<s number=""34"">","","","","","","",""
1,"tatra","","","tatra","ind","","","tatra"
2,"prathamaṃ","PRATHAM","aṃ","prathama","noun-adj","","am","prathamam"
3,"vidhivad","VIDH","ivad","vidhivat","noun-adj","","ivad","vidhivad"
4,"utpanna","UTPANN","a","utpanna","noun-adj","","a","utpanna"
5,"bodhicittasya","BODHICITT","asya","bodhicitta","noun-adj","","asya","bodhicittasya"
6,"bodhisattvasya","BODHISATTV","asya","bodhisattva","noun-adj","","asya","bodhisattvasya"
7,"sarva","SARV","a","sarva","noun-adj","","a","sarva"
8,"bodhisattva","BODHISATTV","a","bodhisattva","noun-adj","","a","bodhisattva"
9,"śīla","ŚĪL","a","śīla","noun-adj","","a","śīla"
10,"śikṣāṃ","ŚIKṢ","āṃ","śikṣā","noun-adj","","ām","śikṣām"
11,"su","","","su","ind","","","su"
12,"śikṣitukāmanayā","ŚIKṢITUKĀM","anayā","śikṣitukāma","noun-adj","","anayā","śikṣitukāmanayā"
13,"bodhisattvaṃ","BODHISATTV","aṃ","bodhisattva","noun-adj","","am","bodhisattvam"
14,"bodhisattva","BODHISATTV","a","bodhisattva","noun-adj","","a","bodhisattva"
15,"saṃvara","SAṂVAR","a","saṃvara","noun-adj","","a","saṃvara"
16,"sthitaṃ","STHIT","aṃ","sthita","noun-adj","","am","sthitam"
17,"bodhisattva","BODHISATTV","a","bodhisattva","noun-adj","","a","bodhisattva"
18,"saṃvara","SAṂVAR","a","saṃvara","noun-adj","","a","saṃvara"
19,"vidhijñaṃ","VIDHIJÑ","aṃ","vidhijña","noun-adj","","am","vidhijñam"
20,"bodhisattva","BODHISATTV","a","bodhisattva","noun-adj","","a","bodhisattva"
21,"saṃvaraprad","SAṂVARAPRAD","a","saṃvaraprada","noun-adj","","a","saṃvaraprada"
22,"^ānena","","","idam","pron","","","idam"
23,"śiṣy","ŚIṢY","a","śiṣya","noun-adj","","a","śiṣya"
24,"^ānugraha","ANUGRAH","a","anugraha","noun-adj","","a","anugraha"
25,"samartha","SAMARTH","a","samartha","noun-adj","","a","samartha"
26,"kalyāṇamitraṃ","KALYĀṆAMITR","aṃ","kalyāṇamitra","noun-adj","","am","kalyāṇamitram"
27,"namaskṛtya","NAMASKṚT","ya","namaskar","verb","namaskṛ","ya","namaskṛtya"
28,"tac","","","tad","pron","","","tad"
29,"caraṇe","CARAṆ","e","caraṇa","noun-adj","","e","caraṇe"
30,"nipatya","NIPAT","ya","nipat","verb","nipat","ya","nipatya"
31,"adhyeṣaṇā","ADHYEṢAṆ","ā","adhyeṣaṇa","noun-adj","","āḥ","adhyeṣaṇāḥ"
32,"ācārya","ĀCĀRY","a","ācārya","noun-adj","","a","ācārya"
33,"/","","","","punct","","","/"
NA,"</s>","","","","","","",""
NA,"<s number=""35"">","","","","","","",""
1,"tav","TAV","a","tad","pron","","a","tava"
2,"^āhaṃ","ĀHAṂ","","mat","pron","","","āhaṃ"
3,"bodhisattva","BODHISATTV","a","bodhisattva","noun-adj","","a","bodhisattva"
4,"śīla","ŚĪL","a","śīla","noun-adj","","a","śīla"
5,"saṃvara","SAṂVAR","a","saṃvara","noun-adj","","a","saṃvara"
6,"samādānam","SAMĀDĀN","am","samādāna","noun-adj","","am","samādānam"
7,"ākāṃkṣāmy","ĀKĀṄKṢA","āmy","ākāṅkṣa","noun-adj","","āmi","ākāṅkṣaāmi"
8,"ādātuṃ","ĀDĀT","uṃ","ādad","verb","ādā","uṃ","ādātuṃ"
9,"tadarhasy","TADARH","asy","tadarha","noun-adj","","asya","tadarhasya"
10,"anuparodhena","ANUPARODH","ena","anuparodha","noun-adj","","ena","anuparodhena"
11,"muhūrtam","MUHŪRT","am","muhūrta","noun-adj","","am","muhūrtam"
12,"asmākam","ASMĀK","am","asmat","pron","","am","asmākam"
13,"anukampayā","ANUKAMPĀ","ayā","anukampā","noun-adj","","ayā","anukampāayā"
14,"dātuṃ","DĀT","uṃ","dad","verb","dā","uṃ","dātuṃ"
15,"śrotuñ","ŚROT","uñ","śṛṇ","verb","śru","uñ","śrotuñ"
16,"ca","","","ca","ind","","","ca"
17,"ity","","","iti","ind","","","iti"
18,"evaṃ","","","eva","ind","","","eva"
19,"trivāraṃ","TRIV","āraṃ","trivat","noun-adj","","āram","trivāram"
20,"adhy","ADHY","a","adhi","noun-adj","","a","adhya"
21,"^eṣitavyam","EṢ","itavyam","iṣ","verb","iṣ","itavyam","eṣitavyam"
22,"/","","","","punct","","","/"
NA,"</s>","","","","","","",""
NA,"<s number=""36"">","","","","","","",""
1,"kulaputra","KULAPUTR","a","kulaputra","noun-adj","","a","kulaputra"
2,"/","","","","punct","","","/"
NA,"</s>","","","","","","",""
NA,"<s number=""37"">","","","","","","",""
1,"tvaṃ","","","tvat","pron","","","tvat"
2,"śrṛṇu","","","","ind","","",""
3,"/","","","","punct","","","/"
NA,"</s>","","","","","","",""
NA,"<s number=""38"">","","","","","","",""
1,"tvam","","","tvat","pron","","","tvat"
2,"evaṃ","","","eva","ind","","","eva"
3,"sattvān","SATTV","ān","sattva","noun-adj","","ān","sattvān"
4,"anutti","ANUTT","i","anutta","noun-adj","","i","anutti"
5,"īrṇān","ĪRṆ","ān","īrṇa","noun-adj","","ān","īrṇān"
6,"utt","UTT","a","utta","noun-adj","","a","utta"
7,"^ārya","ĀRY","a","ārya","noun-adj","","a","ārya"
8,"amuktān","AMUKT","ān","amukta","noun-adj","","ān","amuktān"
9,"mocayitvā","MOC","ayitvā","muñc","verb","muc","tvā","moctvā"
10,"anāśva","ANĀŚ","va","anāśu","noun-adj","","vahi","anāśvahi"
11,"tān","TĀN","","tad","pron","","","tān"
12,"āśvāsya","ĀŚVĀS","ya","āśvāsya","noun-adj","","ya","āśvāsya"
13,"a","","","alpha_privativum","ind","","","alpha_privativum"
14,"parinirvṛt","PARINIRVṚT","","parinirvṛta","noun-adj","","","parinirvṛt"
15,"tān","TĀN","","tad","pron","","","tān"
16,"parinirv","PARINIRV","a","parinirvāti","noun-adj","","a","parinirva"
17,"^āpy","","","api","ind","","","api"
18,"a","","","alpha_privativum","ind","","","alpha_privativum"
19,"buddha","BUDDH","a","buddha","noun-adj","","a","buddha"
20,"vaṃśān","VAṂŚ","ān","vaṃśa","noun-adj","","ān","vaṃśān"
21,"ucchedam","UCCHED","am","uccheda","noun-adj","","am","ucchedam"
22,"icchasi","ICCH","asi","icch","verb","","asi","icchasi"
23,"/","","","","punct","","","/"
NA,"</s>","","","","","","",""
NA,"<s number=""39"">","","","","","","",""
1,"tatas","","","tatas","ind","","","tatas"
2,"tvaṃ","TVA","ṃ","tvat","pron","","ṃ","tvaṃ"
3,"cittotpāda","CITTOTPĀD","a","cittotpāda","noun-adj","","a","cittotpāda"
4,"dārḍhya","DĀRḌHY","a","dārḍhya","noun-adj","","a","dārḍhya"
5,"samādāna","SAMĀDĀN","a","samādāna","noun-adj","","a","samādāna"
6,"dārḍhyañ","DĀRḌHY","añ","dārḍhya","noun-adj","","ān","dārḍhyān"
7,"ca","","","ca","ind","","","ca"
8,"kuru","KUR","u","kar","verb","kṛ","u","kuru"
9,"/","","","","punct","","","/"
NA,"</s>","","","","","","",""
NA,"<s number=""40"">","","","","","","",""
1,"na","","","na","ind","","","na"
2,"t","","","tu","ind","","","tu"
3,"vanyaiḥ","VANY","aiḥ","vanya","noun-adj","","air","vanyair"
4,"saha","SAH","a","sa_saha","ind","","a","saha"
5,"pratispardhā","PRATISPARDH","ā","pratispardhā","noun-adj","","ā","pratispardhā"
6,"hetave","HET","ave","hetu","noun-adj","","ave","hetave"
7,"/","","","","punct","","","/"
NA,"</s>","","","","","","",""
NA,"<s number=""41"">","","","","","","",""
1,"n","","","na","ind","","","na"
2,"ānyair","ANY","air","anya","pron","","air","anyair"
3,"balād","BAL","ād","bala","noun-adj","","āt","balāt"
4,"grāhito","GRĀH","ito","grāhita","noun-adj","","ito","grāhito"
5,"asi","","","as","verb","as","",""
6,"/","","","","punct","","","/"
NA,"</s>","","","","","","",""
NA,"<s number=""42"">","","","","","","",""
1,"evaṃ","","","eva","ind","","","eva"
2,"pṛcchet","PṚCCH","et","pṛcch","verb","prach","et","pṛcchet"
3,"/","","","","punct","","","/"
NA,"</s>","","","","","","",""
NA,"<s number=""43"">","","","","","","",""
1,"tat","TAT","","tad","pron","","","tat"
2,"paścāt","PAŚC","āt","paśca","noun-adj","","āt","paścāt"
3,"tathāgata","TATHĀGAT","a","tathāgata","noun-adj","","a","tathāgata"
4,"śākyamuneḥ","ŚĀKYAMUN","eḥ","śākyamuni","noun-adj","","eḥ","śākyamuneḥ"
5,"niṣiktāṃ","NIṢIKT","āṃ","niṣikta","noun-adj","","ām","niṣiktām"
6,"pratimāṃ","PRATIM","āṃ","pratimā","noun-adj","","ām","pratimām"
7,"paṭa","PAṬ","a","paṭa","noun-adj","","a","paṭa"
8,"citram","CITR","am","citra","noun-adj","","am","citram"
9,"vā","","","vā","ind","","","vā"
10,"purato","PURAT","o","puratas","noun-adj","","aḥ","purataḥ"
11,"avasth","AVASTH","a","avastha","noun-adj","","a","avastha"
12,"^āpy","","","api","ind","","","api"
13,"a","","","alpha_privativum","ind","","","alpha_privativum"
14,"tathāgata","TATHĀGAT","a","tathāgata","noun-adj","","a","tathāgata"
15,"śākyamunyā","ŚĀKYAMUN","yā","śākyamuni","noun-adj","","yāḥ","śākyamunyāḥ"
16,"dīn","DĪN","","dīna","noun-adj","","","dīn"
17,"daśa","DAŚ","a","daśa","noun-adj","","a","daśa"
18,"dik","DI","k","dik","noun-adj","","k","dik"
19,"sarva","SARV","a","sarva","noun-adj","","a","sarva"
20,"lokadhātv","LOKADHĀT","v","lokadhātu","noun-adj","","v","lokadhātv"
21,"avasthitān","AVASTHIT","ān","avasthita","noun-adj","","ān","avasthitān"
22,"sarva","SARV","a","sarva","noun-adj","","a","sarva"
23,"buddha","BUDDH","a","buddha","noun-adj","","a","buddha"
24,"bodhisattvān","BODHISATTV","ān","bodhisattva","noun-adj","","ān","bodhisattvān"
25,"purato","PURAT","o","puratas","noun-adj","","aḥ","purataḥ"
26,"bhāvayet","BHĀVAY","et","bhav","verb","bhū","et","bhāvayet"
27,"/","","","","punct","","","/"
NA,"</s>","","","","","","",""
NA,"<s number=""44"">","","","","","","",""
1,"yathā","","","yathā","ind","","","yathā"
2,"śakti","ŚAKT","i","śakti","noun-adj","","i","śakti"
3,"bāhya","BĀHY","a","bāhya","noun-adj","","a","bāhya"
4,"pañca","PAÑC","a","pañca","noun-adj","","a","pañca"
5,"pūjayā","PŪJ","ayā","pūjā","noun-adj","","ayā","pūjayā"
6,"pūjāṃ","PŪJ","āṃ","pūjā","noun-adj","","ām","pūjām"
7,"vandanaṃ","VANDAN","aṃ","vandana","noun-adj","","am","vandanam"
8,"ca","","","ca","ind","","","ca"
9,"kuryāt","KUR","yāt","kar","verb","kṛ","yāt","kuryāt"
10,"/","","","","punct","","","/"
NA,"</s>","","","","","","",""
NA,"<s number=""45"">","","","","","","",""
1,"tad","TAD","","tad","pron","","","tad"
2,"anantaraṃ","ANANTAR","aṃ","anantara","noun-adj","","am","anantaram"
3,"kalyāṇamitram","KALYĀṆAMITR","am","kalyāṇamitra","noun-adj","","am","kalyāṇamitram"
4,"ucc","UCC","a","ucca","noun-adj","","a","ucca"
5,"^āsana","ĀSAN","a","āsana","noun-adj","","a","āsana"
6,"sthitaṃ","STHIT","aṃ","sthita","noun-adj","","am","sthitam"
7,"śāstṛ","ŚĀST","ṛ","śāstṛ","noun-adj","","ṛ","śāstṛ"
8,"saṃjñayā","SAṂJÑ","ayā","saṃjñā","noun-adj","","ayā","saṃjñayā"
9,"namaskṛtya","NAMASKṚT","ya","namaskar","verb","namaskṛ","ya","namaskṛtya"
10,"dakṣiṇaṃ","DAKṢIṆ","aṃ","dakṣiṇa","noun-adj","","am","dakṣiṇam"
11,"jānumaṇḍalaṃ","JĀNUMAṆḌAL","aṃ","jānumaṇḍala","noun-adj","","am","jānumaṇḍalam"
12,"pṛthivyāṃ","PṚTHIV","yāṃ","pṛthivi","noun-adj","","yām","pṛthivyām"
13,"pratiṣṭhāpya","PRATIṢṬHĀPY","a","pratiṣṭhāpya","noun-adj","","a","pratiṣṭhāpya"
14,"utkuṭuk","UTKUṬUK","a","utkuṭuka","noun-adj","","a","utkuṭuka"
15,"^āsanena","ĀSAN","ena","āsana","noun-adj","","ena","āsanena"
16,"v","","a","vā","ind","","a","vā"
17,"^āpi","","","api","ind","","","api"
18,"kṛtāñjaliḥ","KṚTĀÑJAL","iḥ","kṛtāñjali","noun-adj","","iḥ","kṛtāñjaliḥ"
19,"kalyāṇamitraṃ","KALYĀṆAMITR","aṃ","kalyāṇamitra","noun-adj","","am","kalyāṇamitram"
20,"bodhisattva","BODHISATTV","a","bodhisattva","noun-adj","","a","bodhisattva"
21,"saṃvara","SAṂVAR","a","saṃvara","noun-adj","","a","saṃvara"
22,"grahaṇāya","GRAHAṆ","āya","grahaṇa","noun-adj","","āya","grahaṇāya"
23,"evam","","","eva","ind","","","eva"
24,"adhyeṣayet","ADHYEṢ","ayet","adhīṣ","verb","adhīṣ","yet","adhyeṣyet"
25,"ācāryo","ĀCĀRY","o","ācārya","noun-adj","","aḥ","ācāryaḥ"
26,"bodhisattva","BODHISATTV","a","bodhisattva","noun-adj","","a","bodhisattva"
27,"śīla","ŚĪL","a","śīla","noun-adj","","a","śīla"
28,"saṃvara","SAṂVAR","a","saṃvara","noun-adj","","a","saṃvara"
29,"samādānaṃ","SAMĀDĀN","aṃ","samādāna","noun-adj","","am","samādānam"
30,"me","","","mat","pron","","","mat"
31,"śīghraṃ","ŚĪGHR","aṃ","śīghra","noun-adj","","am","śīghram"
32,"dadātu","DAD","ātu","dad","verb","dā","ātu","dadātu"
33,"ity","","","iti","ind","","","iti"
34,"evaṃ","","","eva","ind","","","eva"
35,"trivāraṃ","TRIV","āraṃ","trivat","noun-adj","","āram","trivāram"
36,"kalyāṇamitram","KALYĀṆAMITR","am","kalyāṇamitra","noun-adj","","am","kalyāṇamitram"
37,"adhyeṣeta","ADHYEṢ","eta","adhyeṣ","verb","","eta","adhyeṣeta"
38,"/","","","","punct","","","/"
NA,"</s>","","","","","","",""
NA,"<s number=""46"">","","","","","","",""
1,"tataḥ","","","tatas","ind","","","tatas"
2,"kalyāṇamitra","KALYĀṆAMITR","a","kalyāṇamitra","noun-adj","","a","kalyāṇamitra"
3,"upaviṣṭa","UPAVIṢṬ","a","upaviṣṭa","noun-adj","","a","upaviṣṭa"
4,"utthito","UTTHIT","o","utthita","noun-adj","","aḥ","utthitaḥ"
5,"v","","a","vā","ind","","a","vā"
6,"^āpi","","","api","ind","","","api"
7,"saḥ","","","tad","pron","","","tad"
8,"bodhisattva","BODHISATTV","a","bodhisattva","noun-adj","","a","bodhisattva"
9,"saṃvara","SAṂVAR","a","saṃvara","noun-adj","","a","saṃvara"
10,"grāhakaṃ","GRĀHAK","aṃ","grāhaka","noun-adj","","am","grāhakam"
11,"taṃ","","","tad","pron","","","tad"
12,"evaṃ","","","eva","ind","","","eva"
13,"paripṛcchet","PARIPṚCCH","et","paripṛcch","verb","pariprach","et","paripṛcchet"
14,"evaṃnāmā","EVAṂNĀM","ā","evaṃnāman","noun-adj","","ā","evaṃnāmā"
15,"tvaṃ","","","tvat","pron","","","tvat"
16,"bodhisattvo","BODHISATTV","o","bodhisattva","noun-adj","","aḥ","bodhisattvaḥ"
17,"asi","","","as","verb","as","",""
18,"bodhau","BODH","au","bodha","noun-adj","","au","bodhau"
19,"ca","","","ca","ind","","","ca"
20,"kṛta","KṚT","a","kṛta","noun-adj","","a","kṛta"
21,"praṇidhānaḥ","PRAṆIDHĀN","aḥ","praṇidhāna","noun-adj","","aḥ","praṇidhānaḥ"
22,"/","","","","punct","","","/"
NA,"</s>","","","","","","",""
NA,"<s number=""47"">","","","","","","",""
1,"evaṃ","","","eva","ind","","","eva"
2,"pṛṣṭe","PṚṢṬ","e","pṛṣṭa","noun-adj","","e","pṛṣṭe"
3,"sati","SAT","i","sat","noun-adj","","i","sati"
4,"tena","","","tad","pron","","","tad"
5,"grāhaka","GRĀHAK","a","grāhaka","noun-adj","","a","grāhaka"
6,"bodhisattven","BODHISATTV","ena","bodhisattva","noun-adj","","ena","bodhisattvena"
7,"^āpi","","","api","ind","","","api"
8,"āmeti","","","","ind","","",""
9,"pratijñātavyam","PRATIJÑĀ","tavyam","pratijān","verb","pratijñā","tavyam","pratijñātavyam"
10,"/","","","","punct","","","/"
NA,"</s>","","","","","","",""
NA,"<s number=""48"">","","","","","","",""
1,"tataḥ","","","tatas","ind","","","tatas"
2,"a","","","alpha_privativum","ind","","","alpha_privativum"
3,"kṣayā","KṢAY","ā","kṣayā","noun-adj","","ā","kṣayā"
4,"pramey","PRAMEY","a","prameya","noun-adj","","a","prameya"
5,"^ānuttara","ANUTTAR","a","anuttara","noun-adj","","a","anuttara"
6,"puṇya","PUṆY","a","puṇya","noun-adj","","a","puṇya"
7,"mahā","MAH","ā","mahat","noun-adj","","ā","mahā"
8,"nidhi","NIDH","i","nidhi","noun-adj","","i","nidhi"
9,"bhūtaḥ","BHŪT","aḥ","bhūta","noun-adj","","aḥ","bhūtaḥ"
10,"sarva","SARV","a","sarva","noun-adj","","a","sarva"
11,"buddha","BUDDH","a","buddha","noun-adj","","a","buddha"
12,"guṇa","GUṆ","a","guṇa","noun-adj","","a","guṇa"
13,"ratnākaro","RATNĀKAR","o","ratnākara","noun-adj","","aḥ","ratnākaraḥ"
14,"bodhisattva","BODHISATTV","a","bodhisattva","noun-adj","","a","bodhisattva"
15,"saṃvaro","SAṂVAR","o","saṃvara","noun-adj","","aḥ","saṃvaraḥ"
16,"a","","","alpha_privativum","ind","","","alpha_privativum"
17,"cireṇa","CIREṆ","a","cireṇa","noun-adj","","a","cireṇa"
18,"adhigamyata","ADHIGAMY","ata","adhigamya","noun-adj","","ati","adhigamyati"
19,"iti","","","iti","ind","","","iti"
20,"cintayan","CINT","ayan","cint","verb","cint","ayan","cintayan"
21,"citta","CITT","a","citta","noun-adj","","a","citta"
22,"prasādāt","PRASĀD","āt","prasāda","noun-adj","","āt","prasādāt"
23,"sa","","","tad","pron","","","tad"
24,"harṣa","HARṢ","a","harṣa","noun-adj","","a","harṣa"
25,"tūṣṇī","TŪṢṆ","ī","tūṣṇī","noun-adj","","ī","tūṣṇī"
26,"bhūya","BHŪY","a","bhūya","noun-adj","","a","bhūya"
27,"kṛtāñjalis","KṚTĀÑJAL","is","kṛtāñjali","noun-adj","","is","kṛtāñjalis"
28,"tiṣṭhet","TIṢṬH","et","tiṣṭh","verb","sthā","et","tiṣṭhet"
29,"/","","","","punct","","","/"
NA,"</s>","","","","","","",""
NA,"<s number=""49"">","","","","","","",""
1,"atha","","","atha","ind","","","atha"
2,"sa","","","tad","pron","","","tad"
3,"kalyāṇamitraḥ","KALYĀṆAMITR","aḥ","kalyāṇamitra","noun-adj","","aḥ","kalyāṇamitraḥ"
4,"trikāla","TRIKĀL","a","trikāla","noun-adj","","a","trikāla"
5,"sarva","SARV","a","sarva","noun-adj","","a","sarva"
6,"bodhisattva","BODHISATTV","a","bodhisattva","noun-adj","","a","bodhisattva"
7,"sarva","SARV","a","sarva","noun-adj","","a","sarva"
8,"śikṣāpadāni","ŚIKṢĀPAD","āni","śikṣāpada","noun-adj","","āni","śikṣāpadāni"
9,"sarvañ","SARV","añ","sarva","noun-adj","","ān","sarvān"
10,"ca","","","ca","ind","","","ca"
11,"śīlaṃ","ŚĪL","aṃ","śīla","noun-adj","","am","śīlam"
12,"saṃvara","SAṂVAR","a","saṃvara","noun-adj","","a","saṃvara"
13,"śīlaṃ","ŚĪL","aṃ","śīla","noun-adj","","am","śīlam"
14,"kuśala","KUŚAL","a","kuśala","noun-adj","","a","kuśala"
15,"dharmasaṅ","DHARMAS","aṅ","dharmasū","noun-adj","","am","dharmasam"
16,"grāhaka","GRĀHAK","a","grāhaka","noun-adj","","a","grāhaka"
17,"śīlaṃ","ŚĪL","aṃ","śīla","noun-adj","","am","śīlam"
18,"sattv","SATTV","a","sattva","noun-adj","","a","sattva"
19,"^ārthakriy","ARTHAKRIY","a","arthakriyā","noun-adj","","a","arthakriyā"
20,"^āśīlañ","ĀŚĪL","añ","āśīl","noun-adj","","ān","āśīlān"
21,"ca","","","ca","ind","","","ca"
22,"samāsataḥ","SAMĀS","ataḥ","samāsa","noun-adj","","ataḥ","samāsataḥ"
23,"śiṣyam","ŚIṢY","am","śiṣya","noun-adj","","am","śiṣyam"
24,"ab","","","ap","ind","","","ap"
25,"abodhya","ABODH","ya","","noun-adj","","ya","abodhya"
26,"sarva","SARV","a","sarva","noun-adj","","a","sarva"
27,"bodhisattva","BODHISATTV","a","bodhisattva","noun-adj","","a","bodhisattva"
28,"śikṣāpadāni","ŚIKṢĀPAD","āni","śikṣāpada","noun-adj","","āni","śikṣāpadāni"
29,"tāni","","","tad","pron","","","tad"
30,"ca","","","ca","ind","","","ca"
31,"sarva","SARV","a","sarva","noun-adj","","a","sarva"
32,"bodhisattva","BODHISATTV","a","bodhisattva","noun-adj","","a","bodhisattva"
33,"śīlāni","ŚĪL","āni","śīla","noun-adj","","āni","śīlāni"
34,"kiṃ","","","kim","pron","","","kim"
35,"mattaḥ","MATT","aḥ","matta","noun-adj","","aḥ","mattaḥ"
36,"gṛhītu","GṚHĪT","u","gṛhīta","noun-adj","","u","gṛhītu"
37,"kāmo","KĀM","o","kāma","noun-adj","","aḥ","kāmaḥ"
38,"asi","","","as","verb","as","",""
39,"evaṃ","","","eva","ind","","","eva"
40,"śiṣyaṃ","ŚIṢY","aṃ","śiṣya","noun-adj","","am","śiṣyam"
41,"pṛcchet","PṚCCH","et","pṛcch","verb","prach","et","pṛcchet"
42,"/","","","","punct","","","/"
NA,"</s>","","","","","","",""
NA,"<s number=""50"">","","","","","","",""
1,"tasmin","","","tad","pron","","","tad"
2,"tathā","","","tathā","ind","","","tathā"
3,"gṛhītu","GṚHĪT","u","gṛhīta","noun-adj","","u","gṛhītu"
4,"kāmo","KĀM","o","kāma","noun-adj","","aḥ","kāmaḥ"
5,"asmi","","","as","verb","as","",""
6,"iti","","","iti","ind","","","iti"
7,"pratijñāte","PRATIJÑĀT","e","pratijñāta","noun-adj","","e","pratijñāte"
8,"sati","SAT","i","sat","noun-adj","","i","sati"
9,"bodhisattva","BODHISATTV","a","bodhisattva","noun-adj","","a","bodhisattva"
10,"saṃvaro","SAṂVAR","o","saṃvara","noun-adj","","aḥ","saṃvaraḥ"
11,"dātavyaḥ","DĀ","tavyaḥ","dad","verb","dā","tavyaḥ","dātavyaḥ"
12,"/","","","","punct","","","/"
NA,"</s>","","","","","","",""
NA,"<s number=""51"">","","","","","","",""
1,"tvam","TVA","m","tvat","pron","","m","tvam"
2,"evaṃnāmā","EVAṂNĀM","ā","evaṃnāman","noun-adj","","ā","evaṃnāmā"
3,"bhadanta","BHADANT","a","bhadanta","noun-adj","","a","bhadanta"
4,"āyuṣmān","ĀYUṢM","ān","āyuṣmat","noun-adj","","ān","āyuṣmān"
5,"kulaputro","KULAPUTR","o","kulaputra","noun-adj","","aḥ","kulaputraḥ"
6,"vā","","","vā","ind","","","vā"
7,"mat","","","mat","pron","","","mat"
8,"bodhisattva","BODHISATTV","a","bodhisattva","noun-adj","","a","bodhisattva"
9,"ity","","","iti","ind","","","iti"
10,"eva","","","eva","ind","","","eva"
11,"saṃjñakāt","SAṂJÑ","akāt","saṃjñaka","noun-adj","","akāt","saṃjñakāt"
12,"sarvāṇi","SARV","āṇi","sarva","noun-adj","","āni","sarvāni"
13,"bodhisattva","BODHISATTV","a","bodhisattva","noun-adj","","a","bodhisattva"
14,"śikṣāpadāni","ŚIKṢĀPAD","āni","śikṣāpada","noun-adj","","āni","śikṣāpadāni"
15,"sarvañ","SARV","añ","sarva","noun-adj","","ān","sarvān"
16,"ca","","","ca","ind","","","ca"
17,"bodhisattva","BODHISATTV","a","bodhisattva","noun-adj","","a","bodhisattva"
18,"śīlaṃ","ŚĪL","aṃ","śīla","noun-adj","","am","śīlam"
19,"saṃvara","SAṂVAR","a","saṃvara","noun-adj","","a","saṃvara"
20,"śīlaṃ","ŚĪL","aṃ","śīla","noun-adj","","am","śīlam"
21,"kuśala","KUŚAL","a","kuśala","noun-adj","","a","kuśala"
22,"dharma","DHARM","a","dharma","noun-adj","","a","dharma"
23,"saṃgrāhaka","SAṂGRĀH","aka","saṃgrāhaka","noun-adj","","aka","saṃgrāhaka"
24,"śīlaṃ","ŚĪL","aṃ","śīla","noun-adj","","am","śīlam"
25,"sattv","SATTV","a","sattva","noun-adj","","a","sattva"
26,"^ārthakriy","ARTHAKRIY","a","arthakriyā","noun-adj","","a","arthakriyā"
27,"^āśīlañ","ĀŚĪL","añ","āśīl","noun-adj","","ān","āśīlān"
28,"ca","","","ca","ind","","","ca"
29,"/","","","","punct","","","/"
NA,"</s>","","","","","","",""
NA,"<s number=""52"">","","","","","","",""
1,"yāni","","","yad","pron","","","yad"
2,"śikṣāpadāni","ŚIKṢĀPAD","āni","śikṣāpada","noun-adj","","āni","śikṣāpadāni"
3,"yacchīlam","YACCHĪL","am","yacchīla","noun-adj","","am","yacchīlam"
4,"atītānāṃ","ATĪT","ānāṃ","atīta","noun-adj","","ānām","atītānām"
5,"sarva","SARV","a","sarva","noun-adj","","a","sarva"
6,"bodhisattvānām","BODHISATTV","ānām","bodhisattva","noun-adj","","ānām","bodhisattvānām"
7,"a","","","alpha_privativum","ind","","","alpha_privativum"
8,"bhūt","BHŪT","","bhūta","noun-adj","","","bhūt"
9,"/","","","","punct","","","/"
NA,"</s>","","","","","","",""
NA,"<s number=""53"">","","","","","","",""
1,"yāni","","","yad","pron","","","yad"
2,"śikṣāpadāni","ŚIKṢĀPAD","āni","śikṣāpada","noun-adj","","āni","śikṣāpadāni"
3,"yacchīlam","YACCHĪL","am","yacchīla","noun-adj","","am","yacchīlam"
4,"anāgatānāṃ","ANĀGAT","ānāṃ","anāgata","noun-adj","","ānām","anāgatānām"
5,"sarva","SARV","a","sarva","noun-adj","","a","sarva"
6,"bodhisattvānāṃ","BODHISATTV","ānāṃ","bodhisattva","noun-adj","","ānām","bodhisattvānām"
7,"bhaviṣyati","BHAV","iṣyati","bhav","verb","bhū","iṣyati","bhaviṣyati"
8,"/","","","","punct","","","/"
NA,"</s>","","","","","","",""
NA,"<s number=""54"">","","","","","","",""
1,"yāni","","","yad","pron","","","yad"
2,"śikṣāpadāni","ŚIKṢĀPAD","āni","śikṣāpada","noun-adj","","āni","śikṣāpadāni"
3,"yacchīlam","YACCHĪL","am","yacchīla","noun-adj","","am","yacchīlam"
4,"etarhi","ETARH","i","etarhi","noun-adj","","i","etarhi"
5,"daśasu","DAŚAS","u","daśas","noun-adj","","u","daśasu"
6,"dikṣu","DIKṢ","u","dik","noun-adj","","u","dikṣu"
7,"pratyutpannānāṃ","PRATYUTPANN","ānāṃ","pratyutpanna","noun-adj","","ānām","pratyutpannānām"
8,"sarva","SARV","a","sarva","noun-adj","","a","sarva"
9,"bodhisattvānāṃ","BODHISATTV","ānāṃ","bodhisattva","noun-adj","","ānām","bodhisattvānām"
10,"bhavati","BHAV","ati","bhav","verb","bhū","ati","bhavati"
11,"/","","","","punct","","","/"
NA,"</s>","","","","","","",""
NA,"<s number=""55"">","","","","","","",""
1,"yeṣu","","","yad","pron","","","yad"
2,"śikṣāpadeśu","ŚIKṢĀPADEŚ","u","śikṣāpadeśu","noun-adj","","u","śikṣāpadeśu"
3,"yacchīle","YACCHĪL","e","yacchīla","noun-adj","","e","yacchīle"
4,"atītāḥ","ATĪT","āḥ","atīta","noun-adj","","āḥ","atītāḥ"
5,"sarva","SARV","a","sarva","noun-adj","","a","sarva"
6,"bodhisattvāḥ","BODHISATTV","āḥ","bodhisattva","noun-adj","","āḥ","bodhisattvāḥ"
7,"śikṣita","ŚIKṢIT","a","śikṣita","noun-adj","","a","śikṣita"
8,"vantaḥ","VANT","aḥ","vanti","noun-adj","","aḥ","vantaḥ"
9,"/","","","","punct","","","/"
NA,"</s>","","","","","","",""
NA,"<s number=""56"">","","","","","","",""
1,"anāgatāḥ","ANĀGAT","āḥ","anāgata","noun-adj","","āḥ","anāgatāḥ"
2,"sarva","SARV","a","sarva","noun-adj","","a","sarva"
3,"bodhisattvāḥ","BODHISATTV","āḥ","bodhisattva","noun-adj","","āḥ","bodhisattvāḥ"
4,"śikṣiṣyante","ŚIKṢ","iṣyante","śikṣ","verb","","iṣyante","śikṣiṣyante"
5,"/","","","","punct","","","/"
NA,"</s>","","","","","","",""
NA,"<s number=""57"">","","","","","","",""
1,"pratyutpannāḥ","PRATYUTPANN","āḥ","pratyutpanna","noun-adj","","āḥ","pratyutpannāḥ"
2,"sarva","SARV","a","sarva","noun-adj","","a","sarva"
3,"bodhisattvāḥ","BODHISATTV","āḥ","bodhisattva","noun-adj","","āḥ","bodhisattvāḥ"
4,"śikṣante","ŚIKṢ","ante","śikṣ","verb","śikṣ","ante","śikṣante"
5,"/","","","","punct","","","/"
NA,"</s>","","","","","","",""
NA,"<s number=""58"">","","","","","","",""
1,"tena","","","tad","pron","","","tad"
2,"pratigṛhṇāmi","PRATIGṚHṆ","āmi","pratigrah","verb","pratigrah","āmi","pratigṛhṇāmi"
3,"iti","","","iti","ind","","","iti"
4,"pratijñātavyam","PRATIJÑĀ","tavyam","pratijān","verb","pratijñā","tavyam","pratijñātavyam"
5,"/","","","","punct","","","/"
NA,"</s>","","","","","","",""
NA,"<s number=""59"">","","","","","","",""
1,"evam","","","eva","ind","","","eva"
2,"ācāryeṇa","ĀCĀRY","eṇa","ācārya","noun-adj","","ena","ācāryena"
3,"trivāraṃ","TRIV","āraṃ","trivat","noun-adj","","āram","trivāram"
4,"grahīṣyasi","GRAH","īṣyasi","grah","verb","","īṣyasi","grahīṣyasi"
5,"kiṃ","","","kim","pron","","","kim"
6,"iti","","","iti","ind","","","iti"
7,"uktvā","UKTV","ā","vak","verb","vac","ā","uktvā"
8,"śiṣyeṇām","ŚIṢY","eṇaām","śiṣya","noun-adj","","eṇaām","śiṣyeṇaām"
9,"sugṛhīṣyāmi","SUGṚH","īṣyāmi","sugṛh","verb","sugrah","īṣyāmi","sugṛhīṣyāmi"
10,"iti","","","iti","ind","","","iti"
11,"trivāraṃ","TRIV","āraṃ","trivat","noun-adj","","āram","trivāram"
12,"abhihite","ABHIHIT","e","abhihita","noun-adj","","e","abhihite"
13,"saṃvaraṃ","SAṂVAR","aṃ","saṃvara","noun-adj","","am","saṃvaram"
14,"samā","SAM","ā","samā","noun-adj","","ā","samā"
15,"dadyāt","DADY","āt","dad","noun-adj","","āt","dadyāt"
16,"/","","","","punct","","","/"
NA,"</s>","","","","","","",""
NA,"<s number=""60"">","","","","","","",""
1,"tataḥ","","","tatas","ind","","","tatas"
2,"sa","","","tad","pron","","","tad"
3,"kalyāṇamitraḥ","KALYĀṆAMITR","aḥ","kalyāṇamitra","noun-adj","","aḥ","kalyāṇamitraḥ"
4,"śiṣyāya","ŚIṢY","āya","śiṣya","noun-adj","","āya","śiṣyāya"
5,"bodhisattva","BODHISATTV","a","bodhisattva","noun-adj","","a","bodhisattva"
6,"saṃvaraṃ","SAṂVAR","aṃ","saṃvara","noun-adj","","am","saṃvaram"
7,"sattvā","SATTV","ā","sattva","noun-adj","","āḥ","sattvāḥ"
8,"daśa","DAŚ","a","daśa","noun-adj","","a","daśa"
9,"dik","DI","k","dik","noun-adj","","k","dik"
10,"sarva","SARV","a","sarva","noun-adj","","a","sarva"
11,"buddha","BUDDH","a","buddha","noun-adj","","a","buddha"
12,"bodhisattvebhyaḥ","BODHISATTV","ebhyaḥ","bodhisattva","noun-adj","","ebhyaḥ","bodhisattvebhyaḥ"
13,"pañc","PAÑC","a","pañca","noun-adj","","a","pañca"
14,"^āṅga","ĀṄG","a","āṅga","noun-adj","","a","āṅga"
15,"namaskāra","NAMASKĀR","a","namaskāra","noun-adj","","a","namaskāra"
16,"pūrva","PŪRVA","","pūrva","noun-adj","","","pūrva"
17,"kṛtāñjaliḥ","KṚTĀÑJAL","iḥ","kṛtāñjali","noun-adj","","iḥ","kṛtāñjaliḥ"
18,"evaṃ","","","eva","ind","","","eva"
19,"trivāraṃ","TRIV","āraṃ","trivat","noun-adj","","āram","trivāram"
20,"vadet","VAD","et","vad","verb","vad","et","vadet"
21,"pratī","PRAT","ī","pratī","noun-adj","","ī","pratī"
22,"gṛhītam","GṚHĪT","am","gṛhīta","noun-adj","","am","gṛhītam"
23,"anena","","","idam","pron","","","idam"
24,"evaṃnāmnā","EVAṂNĀM","nā","evaṃnāman","noun-adj","","nā","evaṃnāmnā"
25,"bodhisattvena","BODHISATTV","ena","bodhisattva","noun-adj","","ena","bodhisattvena"
26,"mama","","","mat","pron","","","mat"
27,"evaṃnāmno","EVAṂNĀM","no","evaṃnāman","noun-adj","","naḥ","evaṃnāmnaḥ"
28,"bodhisattvasy","BODHISATTV","asy","bodhisattva","noun-adj","","asya","bodhisattvasya"
29,"āntikād","ĀNTIK","ād","āntika","noun-adj","","āt","āntikāt"
30,"yāvat","","","yāvat","ind","","","yāvat"
31,"t","","","tu","ind","","","tu"
32,"rir","RIR","","rirī","noun-adj","","","rir"
33,"api","","","api","ind","","","api"
34,"bodhisattva","BODHISATTV","a","bodhisattva","noun-adj","","a","bodhisattva"
35,"śīla","ŚĪL","a","śīla","noun-adj","","a","śīla"
36,"saṃvara","SAṂVAR","a","saṃvara","noun-adj","","a","saṃvara"
37,"samādānam","SAMĀDĀN","am","samādāna","noun-adj","","am","samādānam"
38,"/","","","","punct","","","/"
NA,"</s>","","","","","","",""
NA,"<s number=""61"">","","","","","","",""
1,"so","","","tad","pron","","","tad"
2,"aham","AHAM","","mat","pron","","","aham"
3,"evaṃnām","EVAṂNĀM","a","evaṃnāman","noun-adj","","a","evaṃnāma"
4,"^ātmānaṃ","ĀTM","ānaṃ","ātman","noun-adj","","ānaṃ","ātmānaṃ"
5,"sākṣibhūt","SĀKṢIBHŪT","","sākṣibhūta","noun-adj","","","sākṣibhūt"
6,"amasy","AMAS","y","amasa","noun-adj","","i","amasi"
7,"aitan","ETAN","","tad","pron","","","etan"
8,"nāmno","NĀMN","o","nāmnā","noun-adj","","aḥ","nāmnaḥ"
9,"bodhisattvasya","BODHISATTV","asya","bodhisattva","noun-adj","","asya","bodhisattvasya"
10,"param","PARAM","a","parama","noun-adj","","a","parama"
11,"^āryāṇāṃ","ĀRY","āṇāṃ","ārya","noun-adj","","ānām","āryānām"
12,"viparokṣāṇām","VIPAROKṢ","āṇām","viparokṣa","noun-adj","","ānām","viparokṣānām"
13,"api","","","api","ind","","","api"
14,"sarvatra","SARV","atra","sarvatra","noun-adj","","atra","sarvatra"
15,"sarva","SARV","a","sarva","noun-adj","","a","sarva"
16,"sattv","SATTV","","sattva","noun-adj","","","sattv"
17,"ā","","","alpha_privativum","ind","","","alpha_privativum"
18,"viparokṣa","VIPAROKṢ","a","viparokṣa","noun-adj","","a","viparokṣa"
19,"buddhīnāṃ","BUDDH","īnāṃ","buddhi","noun-adj","","īnām","buddhīnām"
20,"daśasu","DAŚAS","u","daśas","noun-adj","","u","daśasu"
21,"dikṣv","DIKṢ","v","dik","noun-adj","","v","dikṣv"
22,"anantā","ANANT","ā","anantā","noun-adj","","ā","anantā"
23,"paryanteṣu","PAR","yanteṣu","paryanta","noun-adj","","yanteṣu","paryanteṣu"
24,"lokadhātuṣv","LOKADHĀT","uṣv","lokadhātu","noun-adj","","uṣu","lokadhātuṣu"
25,"ārocayāmy","ĀROCAY","āmy","āroc","verb","āruc","āmi","ārocayāmi"
26,"asmin","","","idam","pron","","","idam"
27,"bodhisattva","BODHISATTV","a","bodhisattva","noun-adj","","a","bodhisattva"
28,"śīla","ŚĪL","a","śīla","noun-adj","","a","śīla"
29,"saṃvara","SAṂVAR","a","saṃvara","noun-adj","","a","saṃvara"
30,"samādānam","SAMĀDĀN","am","samādāna","noun-adj","","am","samādānam"
31,"/","","","","punct","","","/"
NA,"</s>","","","","","","",""
NA,"<s number=""62"">","","","","","","",""
1,"iti","","","iti","ind","","","iti"
2,"trivāraṃ","TRIV","āraṃ","trivat","noun-adj","","āram","trivāram"
3,"daśa","DAŚ","a","daśa","noun-adj","","a","daśa"
4,"diks","DI","ks","dik","noun-adj","","ks","diks"
5,"abuddha","ABUDDH","a","abuddha","noun-adj","","a","abuddha"
6,"bodhisattvebhya","BODHISATTV","ebhya","bodhisattva","noun-adj","","ebhya","bodhisattvebhya"
7,"uktvā","UKTV","ā","vak","verb","vac","ā","uktvā"
8,"namaskṛtya","NAMASKṚT","ya","namaskar","verb","namaskṛ","ya","namaskṛtya"
9,"ca","","","ca","ind","","","ca"
10,"guru","GUR","u","guru","noun-adj","","u","guru"
11,"śiṣyau","ŚIṢY","au","śiṣya","noun-adj","","au","śiṣyau"
12,"uttiṣṭhe","UTTIṢṬH","e","uttiṣṭha","noun-adj","","e","uttiṣṭhe"
13,"tām","TĀM","","tad","pron","","","tām"
14,"/","","","","punct","","","/"
NA,"</s>","","","","","","",""
NA,"<s number=""63"">","","","","","","",""
1,"tata","","","tatas","ind","","","tatas"
2,"utthāya","UTTHĀY","a","utthāya","noun-adj","","a","utthāya"
3,"kalyāṇamitraḥ","KALYĀṆAMITR","aḥ","kalyāṇamitra","noun-adj","","aḥ","kalyāṇamitraḥ"
4,"bodhisattva","BODHISATTV","a","bodhisattva","noun-adj","","a","bodhisattva"
5,"saṃvara","SAṂVAR","a","saṃvara","noun-adj","","a","saṃvara"
6,"grāhakaṃ","GRĀHAK","aṃ","grāhaka","noun-adj","","am","grāhakam"
7,"bodhisattvam","BODHISATTV","am","bodhisattva","noun-adj","","am","bodhisattvam"
8,"evaṃ","","","eva","ind","","","eva"
9,"brūyāt","VRŪ","yāt","","noun-adj","","yāt","vrūyāt"
10,"evaṃnāma","EVAṂNĀM","a","evaṃnāman","noun-adj","","a","evaṃnāma"
11,"bodhisattva","BODHISATTV","a","bodhisattva","noun-adj","","a","bodhisattva"
12,"/","","","","punct","","","/"
NA,"</s>","","","","","","",""
NA,"<s number=""64"">","","","","","","",""
1,"tvaṃ","","","tvat","pron","","","tvat"
2,"śṛṇu","ŚṚṆ","u","śṛṇ","verb","śru","u","śṛṇu"
3,"iyaṃ","","","idam","pron","","","idam"
4,"hi","","","hi","ind","","","hi"
5,"dharmatā","DHARMAT","ā","dharmatā","noun-adj","","ā","dharmatā"
6,"/","","","","punct","","","/"
NA,"</s>","","","","","","",""
NA,"<s number=""65"">","","","","","","",""
1,"yadā","","","yadā","ind","","","yadā"
2,"bodhisattvena","BODHISATTV","ena","bodhisattva","noun-adj","","ena","bodhisattvena"
3,"bodhisattva","BODHISATTV","a","bodhisattva","noun-adj","","a","bodhisattva"
4,"saṃvara","SAṂVAR","a","saṃvara","noun-adj","","a","saṃvara"
5,"samādāna","SAMĀDĀN","a","samādāna","noun-adj","","a","samādāna"
6,"karma","KARM","a","karman","noun-adj","","a","karma"
7,"vācanā","VĀCAN","ā","vācanā","noun-adj","","ā","vācanā"
8,"parisam","PARISAM","","parisama","noun-adj","","","parisam"
9,"pādyate","PĀD","yate","pad","verb","pad","yate","pādyate"
10,"tadā","","","tadā","ind","","","tadā"
11,"daśa","DAŚ","a","daśa","noun-adj","","a","daśa"
12,"dik","DI","k","dik","noun-adj","","k","dik"
13,"sarva","SARV","a","sarva","noun-adj","","a","sarva"
14,"buddhakṣetreṣu","BUDDHAKṢETR","eṣu","buddhakṣetra","noun-adj","","eṣu","buddhakṣetreṣu"
15,"buddha","BUDDH","a","buddha","noun-adj","","a","buddha"
16,"bodhisattveṣu","BODHISATTV","eṣu","bodhisattva","noun-adj","","eṣu","bodhisattveṣu"
17,"etādṛṅ","ETĀDṚ","ṅ","etādṛk","noun-adj","","ṅ","etādṛṅ"
18,"nimittāni","NIMITT","āni","nimitta","noun-adj","","āni","nimittāni"
19,"prādurbha","PRĀDURBH","a","prādurbhū","noun-adj","","a","prādurbha"
20,"vanti","VANT","i","vanti","noun-adj","","i","vanti"
21,"/","","","","punct","","","/"
NA,"</s>","","","","","","",""
NA,"<s number=""66"">","","","","","","",""
1,"te","","","tad","pron","","","tad"
2,"buddha","BUDDH","a","buddha","noun-adj","","a","buddha"
3,"bodhisattvā","BODHISATTV","ā","bodhisattva","noun-adj","","āḥ","bodhisattvāḥ"
4,"evaṃ","","","eva","ind","","","eva"
5,"kasmiṃścid","KAS","miṃścid","kimcit","noun-adj","","miṃścid","kasmiṃścid"
6,"buddhakṣetre","BUDDHAKṢETR","e","buddhakṣetra","noun-adj","","e","buddhakṣetre"
7,"evaṃnāmā","EVAṂNĀM","ā","evaṃnāman","noun-adj","","ā","evaṃnāmā"
8,"bodhisattva","BODHISATTV","a","bodhisattva","noun-adj","","a","bodhisattva"
9,"evaṃnāmno","EVAṂNĀM","no","evaṃnāman","noun-adj","","naḥ","evaṃnāmnaḥ"
10,"bodhisattvād","BODHISATTV","ād","bodhisattva","noun-adj","","āt","bodhisattvāt"
11,"bodhisattva","BODHISATTV","a","bodhisattva","noun-adj","","a","bodhisattva"
12,"saṃvara","SAṂVAR","a","saṃvara","noun-adj","","a","saṃvara"
13,"samādānaṃ","SAMĀDĀN","aṃ","samādāna","noun-adj","","am","samādānam"
14,"gṛhṇāti","GṚHṆ","āti","grah","verb","grah","āti","gṛhṇāti"
15,"iti","","","iti","ind","","","iti"
16,"saṃjānanti","SAṂJĀN","anti","saṃjān","verb","saṃjñā","anti","saṃjānanti"
17,"/","","","","punct","","","/"
NA,"</s>","","","","","","",""
NA,"<s number=""67"">","","","","","","",""
1,"ataḥ","","","atas","ind","","","atas"
2,"te","","","tad","pron","","","tad"
3,"bhagavanto","BHAGAV","anto","bhagavat","noun-adj","","antaḥ","bhagavantaḥ"
4,"buddhā","BUDDH","ā","buddha","noun-adj","","āḥ","buddhāḥ"
5,"te","","","tad","pron","","","tad"
6,"ca","","","ca","ind","","","ca"
7,"bodhisattvā","BODHISATTV","ā","bodhisattva","noun-adj","","āḥ","bodhisattvāḥ"
8,"dharmasne","DHARMAS","ne","dharmasū","noun-adj","","nā","dharmasnā"
9,"hāt","HĀT","","hāta","noun-adj","","","hāt"
10,"putrān","PUTR","ān","putra","noun-adj","","ān","putrān"
11,"bhrātṛkān","BHRĀTṚK","ān","bhrātṛka","noun-adj","","ān","bhrātṛkān"
12,"iva","","","iva","ind","","","iva"
13,"sandadhate","SANDADH","ate","saṃdadh","verb","saṃdhā","ate","sandadhate"
14,"/","","","","punct","","","/"
NA,"</s>","","","","","","",""
NA,"<s number=""68"">","","","","","","",""
1,"tathā","","","tathā","ind","","","tathā"
2,"sandhānāt","SANDHĀN","āt","sandhāna","noun-adj","","āt","sandhānāt"
3,"puṇya","PUṆY","a","puṇya","noun-adj","","a","puṇya"
4,"jñāna","JÑĀN","a","jñāna","noun-adj","","a","jñāna"
5,"sambhāra","SAṂBHĀR","a","saṃbhāra","noun-adj","","a","saṃbhāra"
6,"vṛddhir","VṚDDH","ir","vṛddhi","noun-adj","","iḥ","vṛddhiḥ"
7,"bhaviṣyati","BHAVIṢY","ati","bhav","verb","bhū","ati","bhaviṣyati"
8,"iti","","","iti","ind","","","iti"
9,"vaktavyam","VAK","tavyam","vak","verb","vac","tavyam","vaktavyam"
10,"/","","","","punct","","","/"
NA,"</s>","","","","","","",""
NA,"<s number=""69"">","","","","","","",""
1,"atha","","","atha","ind","","","atha"
2,"tena","","","tad","pron","","","tad"
3,"kalyāṇamitreṇa","KALYĀṆAMITR","eṇa","kalyāṇamitra","noun-adj","","ena","kalyāṇamitrena"
4,"sa","","","tad","pron","","","tad"
5,"bodhisattva","BODHISATTV","a","bodhisattva","noun-adj","","a","bodhisattva"
6,"evaṃ","","","eva","ind","","","eva"
7,"vaktvyaḥ","VAKTV","yaḥ","vaktvī","noun-adj","","yaḥ","vaktvyaḥ"
8,"/","","","","punct","","","/"
NA,"</s>","","","","","","",""
NA,"<s number=""70"">","","","","","","",""
1,"evaṃnāma","EVAṂNĀM","a","evaṃnāman","noun-adj","","a","evaṃnāma"
2,"bodhisattva","BODHISATTV","a","bodhisattva","noun-adj","","a","bodhisattva"
3,"/","","","","punct","","","/"
NA,"</s>","","","","","","",""
NA,"<s number=""71"">","","","","","","",""
1,"tvaṃ","","","tvat","pron","","","tvat"
2,"śṛṇu","ŚṚṆ","u","śṛṇ","verb","śru","u","śṛṇu"
3,"/","","","","punct","","","/"
NA,"</s>","","","","","","",""
NA,"<s number=""72"">","","","","","","",""
1,"bodhisattva","BODHISATTV","a","bodhisattva","noun-adj","","a","bodhisattva"
2,"saṃvara","SAṂVAR","a","saṃvara","noun-adj","","a","saṃvara"
3,"samādāna","SAMĀDĀN","a","samādāna","noun-adj","","a","samādāna"
4,"midaṃ","MID","aṃ","midh","noun-adj","","am","midam"
5,"aśraddadhānānām","AŚRADDADHĀN","ānām","aśraddadhāna","noun-adj","","ānām","aśraddadhānānām"
6,"agre","AGR","e","agra","noun-adj","","e","agre"
7,"na","","","na","ind","","","na"
8,"vācyam","VĀCY","am","vācya","noun-adj","","am","vācyam"
9,"/","","","","punct","","","/"
NA,"</s>","","","","","","",""
NA,"<s number=""73"">","","","","","","",""
1,"yato","","","yatas","ind","","","yatas"
2,"aśraddhebhyo","AŚRADDH","ebhyo","aśraddha","noun-adj","","ebhyaḥ","aśraddhebhyaḥ"
3,"bodhisattva","BODHISATTV","a","bodhisattva","noun-adj","","a","bodhisattva"
4,"saṃvara","SAṂVAR","a","saṃvara","noun-adj","","a","saṃvara"
5,"pradarśane","PRADARŚAN","e","pradarśana","noun-adj","","e","pradarśane"
6,"aśraddadhānā","AŚRADDADHĀN","ā","aśraddadhāna","noun-adj","","āḥ","aśraddadhānāḥ"
7,"sattvās","SATTV","ās","sattva","noun-adj","","āḥ","sattvāḥ"
8,"te","","","tad","pron","","","tad"
9,"bodhisattva","BODHISATTV","a","bodhisattva","noun-adj","","a","bodhisattva"
10,"saṃvaraṃ","SAṂVAR","aṃ","saṃvara","noun-adj","","am","saṃvaram"
11,"a","","","alpha_privativum","ind","","","alpha_privativum"
12,"śraddhayā","ŚRADDH","ayā","śraddhā","noun-adj","","ayā","śraddhayā"
13,"parityajanti","PARITYAJ","anti","parityaj","verb","parityaj","anti","parityajanti"
14,"/","","","","punct","","","/"
NA,"</s>","","","","","","",""
NA,"<s number=""74"">","","","","","","",""
1,"ato","","","atas","ind","","","atas"
2,"yāvad","","","yāvat","ind","","","yāvat"
3,"bodhisattvo","BODHISATTV","o","bodhisattva","noun-adj","","aḥ","bodhisattvaḥ"
4,"bodhisattva","BODHISATTV","a","bodhisattva","noun-adj","","a","bodhisattva"
5,"saṃvara","SAṂVAR","a","saṃvara","noun-adj","","a","saṃvara"
6,"sthitaḥ","STHIT","aḥ","sthita","noun-adj","","aḥ","sthitaḥ"
7,"puṇyarāśi","PUṆYARĀŚ","i","puṇyarāśi","noun-adj","","i","puṇyarāśi"
8,"yukto","YUKT","o","yukta","noun-adj","","aḥ","yuktaḥ"
9,"bhavati","BHAV","ati","bhav","verb","bhū","ati","bhavati"
10,"tāvad","","","tāvat","ind","","","tāvat"
11,"a","","","alpha_privativum","ind","","","alpha_privativum"
12,"śraddhayā","ŚRADDH","ayā","śraddhā","noun-adj","","ayā","śraddhayā"
13,"sa","","","tad","pron","","","tad"
14,"ten","","a","tad","pron","","a","tad"
15,"^aiva","","","eva","ind","","","eva"
16,"a","","","alpha_privativum","ind","","","alpha_privativum"
17,"puṇyarāśinā","PUṆYARĀŚ","inā","puṇyarāśi","noun-adj","","inā","puṇyarāśinā"
18,"ca","","","ca","ind","","","ca"
19,"yukto","YUKT","o","yukta","noun-adj","","aḥ","yuktaḥ"
20,"bhavati","BHAV","ati","bhav","verb","bhū","ati","bhavati"
21,"/","","","","punct","","","/"
NA,"</s>","","","","","","",""
NA,"<s number=""75"">","","","","","","",""
1,"yato","","","yatas","ind","","","yatas"
2,"bodhisattvaḥ","BODHISATTV","aḥ","bodhisattva","noun-adj","","aḥ","bodhisattvaḥ"
3,"sattvān","SATTV","ān","sattva","noun-adj","","ān","sattvān"
4,"sarvaduḥkhebhyaḥ","SARVAD","uḥkhebhyaḥ","sarvadu","noun-adj","","uḥkhebhyaḥ","sarvaduḥkhebhyaḥ"
5,"parirakṣati","PARIRAKṢ","ati","parirakṣ","verb","parirakṣ","ati","parirakṣati"
6,"anyāṃś","ANY","āṃś","anya","pron","","āṃś","anyāṃś"
7,"ca","","","ca","ind","","","ca"
8,"pāpebhyo","PĀP","ebhyo","pāpa","noun-adj","","ebhyaḥ","pāpebhyaḥ"
9,"nivārayati","NIVĀR","ayati","nivṛ","verb","nivṛ","ayati","nivārayati"
10,"/","","","","punct","","","/"
NA,"</s>","","","","","","",""
NA,"<s number=""76"">","","","","","","",""
1,"ataḥ","","","atas","ind","","","atas"
2,"sa","","","tad","pron","","","tad"
3,"kuśalo","KUŚAL","o","kuśala","noun-adj","","aḥ","kuśalaḥ"
4,"bodhisattvo","BODHISATTV","o","bodhisattva","noun-adj","","aḥ","bodhisattvaḥ"
5,"gopāyati","GOPĀ","yati","gopā","verb","","yati","gopāyati"
6,"/","","","","punct","","","/"
NA,"</s>","","","","","","",""
NA,"<s number=""77"">","","","","","","",""
1,"atha","","","atha","ind","","","atha"
2,"śikṣāpada","ŚIKṢĀPAD","a","śikṣāpada","noun-adj","","a","śikṣāpada"
3,"pār","PĀR","a","pāra","noun-adj","","a","pāra"
4,"^ājika","AJIK","a","ajika","noun-adj","","a","ajika"
5,"sthāna","STHĀN","a","sthāna","noun-adj","","a","sthāna"
6,"bhūtān","BHŪT","ān","bhūta","noun-adj","","ān","bhūtān"
7,"saṃvara","SAṂVAR","a","saṃvara","noun-adj","","a","saṃvara"
8,"nāśa","NĀŚ","a","nāśa","noun-adj","","a","nāśa"
9,"hetūn","HET","ūn","hetu","noun-adj","","ūm","hetūm"
10,"darśayitvā","DARŚAYIT","vā","darśayitṛ","noun-adj","","vāḥ","darśayitvāḥ"
11,"duṣkṛtān","DUṢKṚT","ān","duṣkṛta","noun-adj","","ān","duṣkṛtān"
12,"kliṣṭ","KLIṢṬ","","kliṣṭa","noun-adj","","","kliṣṭ"
13,"ā","","","alpha_privativum","ind","","","alpha_privativum"
14,"kliṣṭān","KLIṢṬ","ān","kliṣṭa","noun-adj","","ān","kliṣṭān"
15,"api","","","api","ind","","","api"
16,"darśayet","DARŚAY","et","darś","verb","dṛś","et","darśayet"
17,"/","","","","punct","","","/"
NA,"</s>","","","","","","",""
NA,"<s number=""78"">","","","","","","",""
1,"kalyāṇamitraḥ","KALYĀṆAMITR","aḥ","kalyāṇamitra","noun-adj","","aḥ","kalyāṇamitraḥ"
2,"samāsato","SAMĀS","ato","samāsa","noun-adj","","ataḥ","samāsataḥ"
3,"bodhisattva","BODHISATTV","a","bodhisattva","noun-adj","","a","bodhisattva"
4,"saṃvara","SAṂVAR","a","saṃvara","noun-adj","","a","saṃvara"
5,"viṃśakam","VIṂŚ","akam","viṃśaka","noun-adj","","akam","viṃśakam"
6,"tathā","","","tathā","ind","","","tathā"
7,"bodhisattvabhūmeḥ","BODHISATTVABHŪM","eḥ","bodhisattvabhūmi","noun-adj","","eḥ","bodhisattvabhūmeḥ"
8,"śīla","ŚĪL","a","śīla","noun-adj","","a","śīla"
9,"parivarttañ","PARIVART","añ","parivarta","noun-adj","","ān","parivartān"
10,"ca","","","ca","ind","","","ca"
11,"bhāṣeta","BHĀṢ","eta","bhāṣ","verb","bhāṣ","eta","bhāṣeta"
12,"/","","","","punct","","","/"
NA,"</s>","","","","","","",""
NA,"<s number=""79"">","","","","","","",""
1,"bodhi","BODH","i","bodhi","noun-adj","","i","bodhi"
2,"cittotpāda","CITTOTPĀD","a","cittotpāda","noun-adj","","a","cittotpāda"
3,"bodhisattva","BODHISATTV","a","bodhisattva","noun-adj","","a","bodhisattva"
4,"saṃvara","SAṂVAR","a","saṃvara","noun-adj","","a","saṃvara"
5,"vidhir","VIDH","ir","vidhi","noun-adj","","iḥ","vidhiḥ"
6,"mahācāryadī","MAHĀCĀRY","adī","mahācārya","noun-adj","","adī","mahācāryadī"
7,"paṅkar","PAṄK","ar","paṅka","noun-adj","","ar","paṅkar"
8,"aśrī","AŚR","ī","aśrī","noun-adj","","ī","aśrī"
9,"jñāna","JÑĀN","a","jñāna","noun-adj","","a","jñāna"
10,"kṛtaḥ","KṚT","aḥ","kṛta","noun-adj","","aḥ","kṛtaḥ"
11,"samāptaḥ","SAMĀPT","aḥ","samāpta","noun-adj","","aḥ","samāptaḥ"
12,"//","","","","punct","","","//"
NA,"</s>","","","","","","",""
NA,"<s number=""80"">","","","","","","",""
1,"ten","","a","tad","pron","","a","tad"
2,"^aiva","","","eva","ind","","","eva"
3,"bhāratīy","BHĀRATĪY","a","bhāratīya","noun-adj","","a","bhāratīya"
4,"^opādhyāyena","UPĀDHYĀY","ena","upādhyāya","noun-adj","","ena","upādhyāyena"
5,"mahāsaṃ","MAHĀS","aṃ","mahāsi","noun-adj","","am","mahāsam"
6,"śodhaka","ŚODH","aka","śodhaka","noun-adj","","aka","śodhaka"
7,"loka","LOK","a","loka","noun-adj","","a","loka"
8,"cakṣuṣā","CAKṢUṢ","ā","cakṣuṣa","noun-adj","","āḥ","cakṣuṣāḥ"
9,"bhikṣu","BHIKṢ","u","bhikṣu","noun-adj","","u","bhikṣu"
10,"kuśala","KUŚAL","a","kuśala","noun-adj","","a","kuśala"
11,"matinā","MAT","inā","mati","noun-adj","","inā","matinā"
12,"dge","","","","ind","","",""
13,"vai","","","vai","ind","","","vai"
14,"blo","","","","ind","","",""
15,"gros","","","","ind","","",""
16,"c","","a","ca","ind","","a","ca"
17,"^ānūditaḥ","ANŪDIT","aḥ","anūdita","noun-adj","","aḥ","anūditaḥ"
18,"//","","","","punct","","","//"
NA,"</s>","","","","","","",""
NA,"<s number=""81"">","","","","","","",""
1,"punas","","","punar","ind","","","punar"
2,"te","","","tad","pron","","","tad"
3,"n","","a","na","ind","","a","na"
4,"^aiva","","","eva","ind","","","eva"
5,"paṇḍitena","PAṆḌIT","ena","paṇḍita","noun-adj","","ena","paṇḍitena"
6,"loka","LOK","a","loka","noun-adj","","a","loka"
7,"cakṣuṣā","CAKṢUṢ","ā","cakṣuṣa","noun-adj","","āḥ","cakṣuṣāḥ"
8,"bhikṣu","BHIKṢ","u","bhikṣu","noun-adj","","u","bhikṣu"
9,"jaya","JAY","a","jaya","noun-adj","","a","jaya"
10,"śīlena","ŚĪL","ena","śīla","noun-adj","","ena","śīlena"
11,"c","","","ca","ind","","","ca"
12,"hul","HUL","","hula","noun-adj","","","hul"
13,"khrims","","","","ind","","",""
14,"rgyal","","","","ind","","",""
15,"va","","","vai","ind","","","vai"
16,"ca","","","ca","ind","","","ca"
17,"saṃś","SAṂŚ","a","saṃśi","noun-adj","","a","saṃśa"
18,"^odhya","UDHY","a","udhya","noun-adj","","a","udhya"
19,"nirṇītaḥ","NIRṆĪT","aḥ","nirṇīta","noun-adj","","aḥ","nirṇītaḥ"
20,"//","","","","punct","","","//"
NA,"</s>","","","","","","",""
NA,"</doc>","","","","","","",""
