"WordID","word","NormSTEM","suffix","lemma","PoS","Root","NormSuffix","NormWord"
1,"janamejaya","_","_","janamejaya","NC","","_","_"
2,"uvāca","_","_","vak","V","vac","_","_"
1,"sabhāyāṃ","_","_","sabhā","NC","","_","_"
2,"_","_","_","vas","KDP","","_","_"
3,"_","_","_","tad","PRD","","_","_"
4,"_","_","_","nihan","CGDA","","_","_"
5,"_","_","_","ari","NC","","_","_"
6,"_","_","_","mahātman","JJ","","_","_"
1,"_","_","_","keśava","NC","","_","_"
2,"_","_","_","arjuna","NC","","_","_"
3,"kā","_","_","kiṃ","PRQ","","_","_"
4,"nu","_","_","nu","CX","","_","_"
5,"kathā","_","_","kathā","NC","","_","_"
6,"samabhavad","_","_","sambhav","V","sambhū","_","_"
7,"dvija","_","_","dvija","NC","","_","_"
1,"vaiśaṃpāyana","_","_","vaiśampāyana","NC","","_","_"
2,"uvāca","_","_","vak","V","vac","_","_"
1,"kṛṣṇena","_","_","kṛṣṇa","NC","","_","_"
2,"sahitaḥ","_","_","sahita","JJ","","_","_"
3,"pārthaḥ","_","_","pārtha","NC","","_","_"
4,"_","_","_","sva","JJ","","_","_"
5,"_","_","_","rājya","NC","","_","_"
6,"prāpya","_","_","prāp","CGDA","","_","_"
7,"kevalam","_","_","kevala","JJ","","_","_"
1,"tasyāṃ","_","_","tad","PRD","","_","_"
2,"sabhāyāṃ","_","_","sabhā","NC","","_","_"
3,"ramyāyāṃ","_","_","ramya","JJ","","_","_"
4,"vijahāra","_","_","vihar","V","vihṛ","_","_"
5,"mudā","_","_","mud","NC","","_","_"
6,"yutaḥ","_","_","yuta","JJ","","_","_"
1,"tataḥ","_","_","tatas","CX","","_","_"
2,"kaṃcit","_","_","kiṃcit","PRI","","_","_"
3,"_","_","_","sabhā","NC","","_","_"
4,"_","_","_","uddeśa","NC","","_","_"
5,"_","_","_","svarga","NC","","_","_"
6,"_","_","_","uddeśa","NC","","_","_"
7,"_","_","_","sama","PPX","","_","_"
8,"nṛpa","_","_","nṛpa","NC","","_","_"
1,"yadṛcchayā","_","_","yadṛcchā","NC","","_","_"
2,"tau","_","_","tad","PRD","","_","_"
3,"muditau","_","_","mud","PPP","","_","_"
4,"jagmatuḥ","_","_","ga","V","ga","_","_"
5,"_","_","_","sva","JJ","","_","_"
6,"_","_","_","jana","NC","","_","_"
7,"_","_","_","āvṛ","PPP","","_","_"
1,"tataḥ","_","_","tatas","CX","","_","_"
2,"pratītaḥ","_","_","pratī","PPP","","_","_"
3,"kṛṣṇena","_","_","kṛṣṇa","NC","","_","_"
4,"sahitaḥ","_","_","sahita","JJ","","_","_"
5,"pāṇḍavo","_","_","pāṇḍava","NC","","_","_"
6,"'rjunaḥ","_","_","arjuna","NC","","_","_"
1,"nirīkṣya","_","_","nirīkṣ","CGDA","","_","_"
2,"tāṃ","_","_","tad","PRD","","_","_"
3,"sabhāṃ","_","_","sabhā","NC","","_","_"
4,"ramyām","_","_","ramya","JJ","","_","_"
5,"idaṃ","_","_","ida","PRD","","_","_"
6,"vacanam","_","_","vacana","NC","","_","_"
7,"abravīt","_","_","abravīta","V","brū","_","_"
1,"viditaṃ","_","_","vid","PPP","","_","_"
2,"te","_","_","tvat","PPR","","_","_"
3,"_","_","_","mahat","JJ","","_","_"
4,"_","_","_","bāhu","NC","","_","_"
5,"saṃgrāme","_","_","saṃgrāma","NC","","_","_"
6,"samupasthite","_","_","samupasthā","PPP","","_","_"
1,"māhātmyaṃ","_","_","māhātmya","NC","","_","_"
2,"_","_","_","devakī","NC","","_","_"
3,"_","_","_","mātṛ","NC","","_","_"
4,"_","_","_","tad","PRD","","_","_"
5,"_","_","_","ca","CCD","","_","_"
6,"te","_","_","tvat","PPR","","_","_"
7,"rūpam","_","_","rūpa","NC","","_","_"
8,"aiśvaram","_","_","aiśvara","JJ","","_","_"
1,"yat","_","_","yad","PRL","","_","_"
2,"tu","_","_","tu","CCD","","_","_"
3,"tad","_","_","tad","PRD","","_","_"
4,"bhavatā","_","_","bhavat","JJ","","_","_"
5,"proktaṃ","_","_","pravac","PPP","","_","_"
6,"tadā","_","_","tadā","CAD","","_","_"
7,"keśava","_","_","keśava","NC","","_","_"
8,"sauhṛdāt","_","_","sauhṛda","NC","","_","_"
1,"tat","_","_","tad","PRD","","_","_"
2,"sarvaṃ","_","_","sarva","JQ","","_","_"
3,"_","_","_","puruṣa","NC","","_","_"
4,"_","_","_","vyāghra","NC","","_","_"
5,"naṣṭaṃ","_","_","naś","PPP","","_","_"
6,"me","_","_","mat","PPR","","_","_"
7,"_","_","_","naś","PPP","","_","_"
8,"_","_","_","cetas","NC","","_","_"
1,"mama","_","_","mat","PPR","","_","_"
2,"kautūhalaṃ","_","_","kautūhala","NC","","_","_"
3,"_","_","_","tu","CCD","","_","_"
4,"_","_","_","as","V","as","_","_"
5,"_","_","_","tad","PRD","","_","_"
6,"_","_","_","artha","NC","","_","_"
7,"punaḥ","_","_","punar","CAD","","_","_"
8,"prabho","_","_","prabhu","JJ","","_","_"
1,"_","_","_","bhavat","JJ","","_","_"
2,"_","_","_","ca","CCD","","_","_"
3,"dvārakāṃ","_","_","dvārakā","NC","","_","_"
4,"gantā","_","_","ga","V","ga","_","_"
5,"nacirād","_","_","nacirāt","CX","","_","_"
6,"iva","_","_","iva","CCM","","_","_"
7,"mādhava","_","_","mādhava","NC","","_","_"
1,"evam","_","_","eva","CX","","_","_"
2,"_","_","_","vac","PPP","","_","_"
3,"_","_","_","tatas","CX","","_","_"
4,"kṛṣṇaḥ","_","_","kṛṣṇa","NC","","_","_"
5,"phalgunaṃ","_","_","phalguna","NC","","_","_"
6,"pratyabhāṣata","_","_","pratibhāṣ","V","pratibhāṣ","_","_"
1,"pariṣvajya","_","_","pariṣvaj","CGDA","","_","_"
2,"_","_","_","mahat","JJ","","_","_"
3,"_","_","_","tejas","NC","","_","_"
4,"vacanaṃ","_","_","vacana","NC","","_","_"
5,"vadatāṃ","_","_","vad","KDP","","_","_"
6,"varaḥ","_","_","vara","JJ","","_","_"
1,"_","_","_","śrāvay","PPP","","_","_"
2,"_","_","_","tvat","PPR","","_","_"
3,"mayā","_","_","mat","PPR","","_","_"
4,"guhyaṃ","_","_","guhya","NC","","_","_"
5,"_","_","_","jñāpay","PPP","","_","_"
6,"_","_","_","ca","CCD","","_","_"
7,"sanātanam","_","_","sanātana","JJ","","_","_"
1,"dharmaṃ","_","_","dharma","NC","","_","_"
2,"svarūpiṇaṃ","_","_","svarūpin","JJ","","_","_"
3,"pārtha","_","_","pārtha","NC","","_","_"
4,"_","_","_","sarva","JQ","","_","_"
5,"_","_","_","loka","NC","","_","_"
6,"_","_","_","ca","CCD","","_","_"
7,"śāśvatān","_","_","śāśvata","JJ","","_","_"
1,"a","_","_","alpha_privativum","CX","","_","_"
1,"abuddhvā","_","_","buddhvā","CX","","_","_"
2,"_","_","_","yad","PRL","","_","_"
3,"_","_","_","na","CNG","","_","_"
4,"_","_","_","grah","V","grah","_","_"
5,"_","_","_","tad","PRD","","_","_"
6,"_","_","_","mat","PPR","","_","_"
7,"_","_","_","su","CAD","","_","_"
8,"_","_","_","mahat","JJ","","_","_"
9,"apriyam","_","_","apriya","JJ","","_","_"
1,"nūnam","_","_","nūna","CX","","_","_"
2,"aśraddadhāno","_","_","aśraddadhāna","JJ","","_","_"
3,"'si","_","_","as","V","as","_","_"
4,"_","_","_","durmedhas","JJ","","_","_"
5,"_","_","_","ca","CCD","","_","_"
6,"_","_","_","as","V","as","_","_"
7,"pāṇḍava","_","_","pāṇḍava","NC","","_","_"
1,"sa","_","_","tad","PRD","","_","_"
2,"hi","_","_","hi","CX","","_","_"
3,"dharmaḥ","_","_","dharma","NC","","_","_"
4,"_","_","_","su","CAD","","_","_"
5,"_","_","_","paryāp","PPP","","_","_"
6,"brahmaṇaḥ","_","_","brahman","NC","","_","_"
7,"_","_","_","pada","NC","","_","_"
8,"_","_","_","vedana","NC","","_","_"
1,"na","_","_","na","CNG","","_","_"
2,"śakyaṃ","_","_","śakya","JJ","","_","_"
3,"_","_","_","tad","PRD","","_","_"
4,"_","_","_","mat","PPR","","_","_"
5,"_","_","_","bhūyas","CX","","_","_"
6,"_","_","_","tathā","CX","","_","_"
7,"vaktum","_","_","vac","CGDI","","_","_"
8,"aśeṣataḥ","_","_","aśeṣatas","CX","","_","_"
1,"paraṃ","_","_","para","PPX","","_","_"
2,"hi","_","_","hi","CX","","_","_"
3,"brahma","_","_","brahman","NC","","_","_"
4,"kathitaṃ","_","_","kathay","PPP","","_","_"
5,"_","_","_","yoga","NC","","_","_"
6,"_","_","_","yuj","PPP","","_","_"
7,"_","_","_","tad","PRD","","_","_"
8,"_","_","_","mat","PPR","","_","_"
1,"itihāsaṃ","_","_","itihāsa","NC","","_","_"
2,"tu","_","_","tu","CCD","","_","_"
3,"vakṣyāmi","_","_","vak","V","vac","_","_"
4,"tasminn","_","_","tad","PRD","","_","_"
5,"arthe","_","_","artha","NC","","_","_"
6,"purātanam","_","_","purātana","JJ","","_","_"
1,"yathā","_","_","yathā","CCM","","_","_"
2,"tāṃ","_","_","tad","PRD","","_","_"
3,"buddhim","_","_","buddhi","NC","","_","_"
4,"āsthāya","_","_","āsthā","CGDA","","_","_"
5,"gatim","_","_","gati","NC","","_","_"
6,"agryāṃ","_","_","agrya","JJ","","_","_"
7,"gamiṣyasi","_","_","gacch","V","gam","_","_"
1,"śṛṇu","_","_","śṛṇ","V","śru","_","_"
2,"_","_","_","dharma","NC","","_","_"
3,"_","_","_","bhṛt","JJ","","_","_"
4,"śreṣṭha","_","_","śreṣṭha","JJ","","_","_"
5,"gadataḥ","_","_","gad","KDP","","_","_"
6,"sarvam","_","_","sarva","JQ","","_","_"
7,"eva","_","_","eva","CEM","","_","_"
8,"me","_","_","mat","PPR","","_","_"
1,"āgacchad","_","_","āga","V","āga","_","_"
2,"brāhmaṇaḥ","_","_","brāhmaṇa","NC","","_","_"
3,"kaścit","_","_","kiṃcit","PRI","","_","_"
4,"_","_","_","svarga","NC","","_","_"
5,"_","_","_","loka","NC","","_","_"
6,"ariṃdama","_","_","ariṃdama","JJ","","_","_"
1,"_","_","_","brahman","NC","","_","_"
2,"_","_","_","loka","NC","","_","_"
3,"_","_","_","ca","CCD","","_","_"
4,"durdharṣaḥ","_","_","durdharṣa","JJ","","_","_"
5,"so","_","_","tad","PRD","","_","_"
6,"'smābhiḥ","_","_","mat","PPR","","_","_"
7,"pūjito","_","_","pūjay","PPP","","_","_"
8,"'bhavat","_","_","bhav","V","bhū","_","_"
1,"asmābhiḥ","_","_","mat","PPR","","_","_"
2,"_","_","_","paripracch","PPP","","_","_"
3,"_","_","_","ca","CCD","","_","_"
4,"yad","_","_","yad","PRL","","_","_"
5,"āha","_","_","ah","V","ah","_","_"
6,"_","_","_","bharata","NC","","_","_"
7,"_","_","_","ṛṣabha","NC","","_","_"
1,"divyena","_","_","divya","JJ","","_","_"
2,"vidhinā","_","_","vidhi","NC","","_","_"
3,"pārtha","_","_","pārtha","NC","","_","_"
4,"_","_","_","tad","PRD","","_","_"
5,"_","_","_","śṛṇ","V","śru","_","_"
6,"_","_","_","avicārayat","JJ","","_","_"
1,"brāhmaṇa","_","_","brāhmaṇa","NC","","_","_"
2,"uvāca","_","_","vak","V","vac","_","_"
1,"_","_","_","mokṣa","NC","","_","_"
2,"_","_","_","dharma","NC","","_","_"
3,"samāśritya","_","_","samāśri","CGDA","","_","_"
4,"kṛṣṇa","_","_","kṛṣṇa","NC","","_","_"
5,"_","_","_","yad","PRL","","_","_"
6,"_","_","_","mat","PPR","","_","_"
7,"_","_","_","anupṛcch","V","anuprach","_","_"
1,"bhūtānām","_","_","bhūta","NC","","_","_"
2,"_","_","_","anukampā","NC","","_","_"
3,"_","_","_","artha","NC","","_","_"
4,"_","_","_","yad","PRL","","_","_"
5,"_","_","_","moha","NC","","_","_"
6,"_","_","_","chedana","NC","","_","_"
7,"prabho","_","_","prabhu","JJ","","_","_"
1,"tat","_","_","tad","PRD","","_","_"
2,"te","_","_","tvat","PPR","","_","_"
3,"'haṃ","_","_","mat","PPR","","_","_"
4,"sampravakṣyāmi","_","_","saṃpravak","V","saṃpravac","_","_"
5,"_","_","_","yathāvat","CX","","_","_"
6,"_","_","_","madhusūdana","NC","","_","_"
1,"_","_","_","śṛṇ","V","śru","_","_"
2,"_","_","_","avahita","JJ","","_","_"
3,"bhūtvā","_","_","bhū","CGDA","","_","_"
4,"gadato","_","_","gad","KDP","","_","_"
5,"mama","_","_","mat","PPR","","_","_"
6,"mādhava","_","_","mādhava","NC","","_","_"
1,"kaścid","_","_","kiṃcit","PRI","","_","_"
2,"_","_","_","vipra","NC","","_","_"
3,"_","_","_","tapas","NC","","_","_"
4,"_","_","_","yuj","PPP","","_","_"
5,"kāśyapo","_","_","kāśyapa","NC","","_","_"
6,"_","_","_","dharma","NC","","_","_"
7,"_","_","_","vittama","JJ","","_","_"
1,"āsasāda","_","_","āsīd","V","āsad","_","_"
2,"dvijaṃ","_","_","dvija","NC","","_","_"
3,"kaṃcid","_","_","kiṃcit","PRI","","_","_"
4,"dharmāṇām","_","_","dharma","NC","","_","_"
5,"_","_","_","āga","PPP","","_","_"
6,"_","_","_","āgama","NC","","_","_"
1,"gatāgate","_","_","gatāgata","NC","","_","_"
2,"_","_","_","su","CAD","","_","_"
3,"_","_","_","bahuśas","CX","","_","_"
4,"_","_","_","jñāna","NC","","_","_"
5,"_","_","_","vijñāna","NC","","_","_"
6,"_","_","_","pāraga","JJ","","_","_"
1,"_","_","_","loka","NC","","_","_"
2,"_","_","_","tattva","NC","","_","_"
3,"_","_","_","artha","NC","","_","_"
4,"_","_","_","kuśala","JJ","","_","_"
5,"jñātāraṃ","_","_","jñātṛ","JJ","","_","_"
6,"_","_","_","sukha","NC","","_","_"
7,"_","_","_","duḥkha","NC","","_","_"
1,"_","_","_","jātī","NC","","_","_"
2,"_","_","_","maraṇa","NC","","_","_"
3,"_","_","_","tattva","NC","","_","_"
4,"_","_","_","jña","JJ","","_","_"
5,"kovidaṃ","_","_","kovida","JJ","","_","_"
6,"_","_","_","puṇya","NC","","_","_"
7,"_","_","_","pāpa","NC","","_","_"
1,"draṣṭāram","_","_","draṣṭṛ","JJ","","_","_"
2,"_","_","_","ucca","JJ","","_","_"
3,"_","_","_","nīca","JJ","","_","_"
4,"karmabhir","_","_","karman","NC","","_","_"
5,"dehināṃ","_","_","dehin","NC","","_","_"
6,"gatim","_","_","gati","NC","","_","_"
1,"carantaṃ","_","_","car","KDP","","_","_"
2,"_","_","_","muc","PPP","","_","_"
3,"_","_","_","vat","CX","","_","_"
4,"siddhaṃ","_","_","siddha","NC","","_","_"
5,"praśāntaṃ","_","_","praśa","PPP","","_","_"
6,"_","_","_","saṃya","PPP","","_","_"
7,"_","_","_","indriya","NC","","_","_"
1,"dīpyamānaṃ","_","_","dīp","KDP","","_","_"
2,"śriyā","_","_","śrī","NC","","_","_"
3,"brāhmyā","_","_","brāhma","JJ","","_","_"
4,"kramamāṇaṃ","_","_","kra","KDP","","_","_"
5,"ca","_","_","ca","CCD","","_","_"
6,"sarvaśaḥ","_","_","sarvaśas","CX","","_","_"
1,"_","_","_","antardhāna","NC","","_","_"
2,"_","_","_","gati","NC","","_","_"
3,"_","_","_","jña","JJ","","_","_"
4,"ca","_","_","ca","CCD","","_","_"
5,"śrutvā","_","_","śru","CGDA","","_","_"
6,"tattvena","_","_","tattva","NC","","_","_"
7,"kāśyapaḥ","_","_","kāśyapa","NC","","_","_"
1,"_","_","_","tathā","CX","","_","_"
2,"_","_","_","eva","CEM","","_","_"
3,"_","_","_","antardhā","PPP","","_","_"
4,"siddhair","_","_","siddha","NC","","_","_"
5,"yāntaṃ","_","_","yā","KDP","","_","_"
6,"_","_","_","cakra","NC","","_","_"
7,"_","_","_","dhara","JJ","","_","_"
8,"saha","_","_","saha","CX","","_","_"
1,"sambhāṣamāṇam","_","_","sambhāṣ","KDP","","_","_"
2,"ekānte","_","_","ekānta","NC","","_","_"
3,"samāsīnaṃ","_","_","samās","PPP","","_","_"
4,"ca","_","_","ca","CCD","","_","_"
5,"taiḥ","_","_","tad","PRD","","_","_"
6,"saha","_","_","saha","CX","","_","_"
1,"yadṛcchayā","_","_","yadṛcchā","NC","","_","_"
2,"ca","_","_","ca","CCD","","_","_"
3,"gacchantam","_","_","ga","KDP","","_","_"
4,"asaktaṃ","_","_","asakta","JJ","","_","_"
5,"pavanaṃ","_","_","pavana","NC","","_","_"
6,"yathā","_","_","yathā","CCM","","_","_"
1,"taṃ","_","_","tad","PRD","","_","_"
2,"samāsādya","_","_","samāsāday","CGDA","","_","_"
3,"medhāvī","_","_","medhāvin","JJ","","_","_"
4,"sa","_","_","tad","PRD","","_","_"
5,"tadā","_","_","tadā","CAD","","_","_"
6,"dvijasattamaḥ","_","_","dvijasattama","NC","","_","_"
1,"caraṇau","_","_","caraṇa","NC","","_","_"
2,"_","_","_","dharma","NC","","_","_"
3,"_","_","_","kāma","NC","","_","_"
4,"vai","_","_","vai","CX","","_","_"
5,"tapasvī","_","_","tapasvin","NC","","_","_"
6,"_","_","_","su","CAD","","_","_"
7,"_","_","_","samāhita","JJ","","_","_"
1,"pratipede","_","_","pratipad","V","pratipad","_","_"
2,"yathānyāyaṃ","_","_","yathānyāya","CX","","_","_"
3,"bhaktyā","_","_","bhakti","NC","","_","_"
4,"paramayā","_","_","parama","JJ","","_","_"
5,"yutaḥ","_","_","yuta","JJ","","_","_"
1,"_","_","_","vismi","PPP","","_","_"
2,"_","_","_","ca","CCD","","_","_"
3,"_","_","_","adbhuta","JJ","","_","_"
4,"dṛṣṭvā","_","_","dṛś","CGDA","","_","_"
5,"_","_","_","kāśyapa","NC","","_","_"
6,"_","_","_","tad","PRD","","_","_"
7,"dvijottamam","_","_","dvijottama","NC","","_","_"
1,"paricāreṇa","_","_","paricāra","NC","","_","_"
2,"mahatā","_","_","mahat","JJ","","_","_"
3,"guruṃ","_","_","guru","NC","","_","_"
4,"vaidyam","_","_","vaidya","NC","","_","_"
5,"atoṣayat","_","_","toṣay","V","toṣay","_","_"
1,"_","_","_","prī","PPP","","_","_"
2,"_","_","_","ātman","NC","","_","_"
3,"_","_","_","ca","CCD","","_","_"
4,"_","_","_","upapad","PPP","","_","_"
5,"_","_","_","ca","CCD","","_","_"
6,"_","_","_","śruta","NC","","_","_"
7,"_","_","_","cāritra","NC","","_","_"
8,"_","_","_","saṃyuta","JJ","","_","_"
1,"bhāvena","_","_","bhāva","NC","","_","_"
2,"_","_","_","toṣay","V","toṣay","_","_"
3,"_","_","_","ca","CCD","","_","_"
4,"_","_","_","a","PRD","","_","_"
5,"_","_","_","guru","NC","","_","_"
6,"_","_","_","vṛtti","NC","","_","_"
7,"paraṃtapaḥ","_","_","paraṃtapa","JJ","","_","_"
1,"tasmai","_","_","tad","PRD","","_","_"
2,"tuṣṭaḥ","_","_","tuṣ","PPP","","_","_"
3,"sa","_","_","sa_saha","CX","","_","_"
4,"śiṣyāya","_","_","śiṣya","NC","","_","_"
5,"prasanno","_","_","prasad","PPP","","_","_"
6,"_","_","_","atha","CAD","","_","_"
7,"_","_","_","abravīta","V","brū","_","_"
8,"guruḥ","_","_","guru","NC","","_","_"
1,"siddhiṃ","_","_","siddhi","NC","","_","_"
2,"parām","_","_","para","PPX","","_","_"
3,"abhiprekṣya","_","_","abhiprekṣ","CGDA","","_","_"
4,"śṛṇu","_","_","śṛṇ","V","śru","_","_"
5,"_","_","_","tad","PRD","","_","_"
6,"_","_","_","mat","PPR","","_","_"
7,"janārdana","_","_","janārdana","NC","","_","_"
1,"vividhaiḥ","_","_","vividha","JJ","","_","_"
2,"_","_","_","karman","NC","","_","_"
3,"_","_","_","tāta","NC","","_","_"
4,"_","_","_","puṇya","JJ","","_","_"
5,"_","_","_","yoga","NC","","_","_"
6,"_","_","_","ca","CCD","","_","_"
7,"kevalaiḥ","_","_","kevala","JJ","","_","_"
1,"_","_","_","ga","V","ga","_","_"
2,"_","_","_","iha","CAD","","_","_"
3,"gatiṃ","_","_","gati","NC","","_","_"
4,"martyā","_","_","martya","NC","","_","_"
5,"_","_","_","deva","NC","","_","_"
6,"_","_","_","loka","NC","","_","_"
7,"'pi","_","_","api","CX","","_","_"
8,"ca","_","_","ca","CCD","","_","_"
9,"sthitim","_","_","sthiti","NC","","_","_"
1,"na","_","_","na","CNG","","_","_"
2,"kvacit","_","_","kvacid","CX","","_","_"
3,"sukham","_","_","sukha","NC","","_","_"
4,"atyantaṃ","_","_","atyanta","JJ","","_","_"
5,"na","_","_","na","CNG","","_","_"
6,"_","_","_","kvacid","CX","","_","_"
7,"_","_","_","śāśvata","JJ","","_","_"
8,"sthitiḥ","_","_","sthiti","NC","","_","_"
1,"_","_","_","sthāna","NC","","_","_"
2,"_","_","_","ca","CCD","","_","_"
3,"mahato","_","_","mahat","JJ","","_","_"
4,"bhraṃśo","_","_","bhraṃśa","NC","","_","_"
5,"_","_","_","duḥkha","NC","","_","_"
6,"_","_","_","labh","PPP","","_","_"
7,"punaḥ","_","_","punar","CAD","","_","_"
8,"punaḥ","_","_","punar","CAD","","_","_"
1,"aśubhā","_","_","aśubha","JJ","","_","_"
2,"gatayaḥ","_","_","gati","NC","","_","_"
3,"prāptāḥ","_","_","prāp","PPP","","_","_"
4,"kaṣṭā","_","_","kaṣṭa","JJ","","_","_"
5,"me","_","_","mat","PPR","","_","_"
6,"_","_","_","pāpa","NC","","_","_"
7,"_","_","_","sevana","NC","","_","_"
1,"_","_","_","kāma","NC","","_","_"
2,"_","_","_","manyu","NC","","_","_"
3,"_","_","_","parī","PPP","","_","_"
4,"tṛṣṇayā","_","_","tṛṣṇā","NC","","_","_"
5,"mohitena","_","_","mohay","PPP","","_","_"
6,"ca","_","_","ca","CCD","","_","_"
1,"punaḥ","_","_","punar","CAD","","_","_"
2,"_","_","_","punar","CAD","","_","_"
3,"_","_","_","ca","CCD","","_","_"
4,"maraṇaṃ","_","_","maraṇa","NC","","_","_"
5,"janma","_","_","janman","NC","","_","_"
6,"_","_","_","ca","CCD","","_","_"
7,"_","_","_","eva","CEM","","_","_"
8,"punaḥ","_","_","punar","CAD","","_","_"
9,"punaḥ","_","_","punar","CAD","","_","_"
1,"āhārā","_","_","āhāra","NC","","_","_"
2,"vividhā","_","_","vividha","JJ","","_","_"
3,"bhuktāḥ","_","_","bhuj","PPP","","_","_"
4,"pītā","_","_","pā","PPP","","_","_"
5,"nānāvidhāḥ","_","_","nānāvidha","JJ","","_","_"
6,"stanāḥ","_","_","stana","NC","","_","_"
1,"mātaro","_","_","mātṛ","NC","","_","_"
2,"vividhā","_","_","vividha","JJ","","_","_"
3,"dṛṣṭāḥ","_","_","dṛś","PPP","","_","_"
4,"_","_","_","pitṛ","NC","","_","_"
5,"_","_","_","ca","CCD","","_","_"
6,"pṛthagvidhāḥ","_","_","pṛthagvidha","JJ","","_","_"
1,"sukhāni","_","_","sukha","NC","","_","_"
2,"ca","_","_","ca","CCD","","_","_"
3,"vicitrāṇi","_","_","vicitra","JJ","","_","_"
4,"duḥkhāni","_","_","duḥkha","NC","","_","_"
5,"ca","_","_","ca","CCD","","_","_"
6,"_","_","_","mat","PPR","","_","_"
7,"_","_","_","anagha","JJ","","_","_"
1,"priyair","_","_","priya","JJ","","_","_"
2,"vivāso","_","_","vivāsa","NC","","_","_"
3,"bahuśaḥ","_","_","bahuśas","CX","","_","_"
4,"_","_","_","saṃvāsa","NC","","_","_"
5,"_","_","_","ca","CCD","","_","_"
6,"_","_","_","apriya","JJ","","_","_"
7,"saha","_","_","saha","CX","","_","_"
1,"_","_","_","dhana","NC","","_","_"
2,"_","_","_","nāśa","NC","","_","_"
3,"_","_","_","ca","CCD","","_","_"
4,"samprāpto","_","_","samprāp","PPP","","_","_"
5,"labdhvā","_","_","labh","CGDA","","_","_"
6,"duḥkhena","_","_","duḥkha","NC","","_","_"
7,"tad","_","_","tad","PRD","","_","_"
8,"dhanam","_","_","dhana","NC","","_","_"
1,"avamānāḥ","_","_","avamāna","NC","","_","_"
2,"_","_","_","su","CAD","","_","_"
3,"_","_","_","kaṣṭa","JJ","","_","_"
4,"_","_","_","ca","CCD","","_","_"
5,"parataḥ","_","_","paratas","CX","","_","_"
6,"_","_","_","sva","JJ","","_","_"
7,"_","_","_","jana","NC","","_","_"
8,"tathā","_","_","tathā","CX","","_","_"
1,"śārīrā","_","_","śārīra","JJ","","_","_"
2,"_","_","_","mānasa","JJ","","_","_"
3,"_","_","_","ca","CCD","","_","_"
4,"_","_","_","api","CX","","_","_"
5,"vedanā","_","_","vedanā","NC","","_","_"
6,"_","_","_","bhṛśa","JJ","","_","_"
7,"_","_","_","dāruṇa","JJ","","_","_"
1,"prāptā","_","_","prāp","PPP","","_","_"
2,"_","_","_","vimānana","NC","","_","_"
3,"_","_","_","ca","CCD","","_","_"
4,"_","_","_","ugra","JJ","","_","_"
5,"_","_","_","vadha","NC","","_","_"
6,"_","_","_","bandha","NC","","_","_"
7,"_","_","_","ca","CCD","","_","_"
8,"dāruṇāḥ","_","_","dāruṇa","JJ","","_","_"
1,"patanaṃ","_","_","patana","NC","","_","_"
2,"niraye","_","_","niraya","NC","","_","_"
3,"_","_","_","ca","CCD","","_","_"
4,"_","_","_","eva","CEM","","_","_"
5,"_","_","_","yātanā","NC","","_","_"
6,"_","_","_","ca","CCD","","_","_"
7,"_","_","_","yama","NC","","_","_"
8,"_","_","_","kṣaya","NC","","_","_"
1,"jarā","_","_","jarā","NC","","_","_"
2,"_","_","_","roga","NC","","_","_"
3,"_","_","_","ca","CCD","","_","_"
4,"satataṃ","_","_","satata","CX","","_","_"
5,"vāsanāni","_","_","vāsana","NC","","_","_"
6,"ca","_","_","ca","CCD","","_","_"
7,"bhūriśaḥ","_","_","bhūriśas","CX","","_","_"
1,"loke","_","_","loka","NC","","_","_"
2,"'sminn","_","_","ida","PRD","","_","_"
3,"anubhūtāni","_","_","anubhū","PPP","","_","_"
4,"_","_","_","dvaṃdva","NC","","_","_"
5,"_","_","_","ja","JJ","","_","_"
6,"bhṛśaṃ","_","_","bhṛśa","CX","","_","_"
7,"mayā","_","_","mat","PPR","","_","_"
1,"tataḥ","_","_","tatas","CX","","_","_"
2,"kadācin","_","_","kadācid","CX","","_","_"
3,"_","_","_","nirveda","NC","","_","_"
4,"_","_","_","nikāra","NC","","_","_"
5,"_","_","_","nikṛ","PPP","","_","_"
6,"ca","_","_","ca","CCD","","_","_"
1,"lokatantraṃ","_","_","lokatantra","NC","","_","_"
2,"parityaktaṃ","_","_","parityaj","PPP","","_","_"
3,"_","_","_","duḥkha","NC","","_","_"
4,"_","_","_","ārta","JJ","","_","_"
5,"bhṛśaṃ","_","_","bhṛśa","CX","","_","_"
6,"mayā","_","_","mat","PPR","","_","_"
1,"tataḥ","_","_","tatas","CX","","_","_"
2,"siddhir","_","_","siddhi","NC","","_","_"
3,"iyaṃ","_","_","ida","PRD","","_","_"
4,"prāptā","_","_","prāp","PPP","","_","_"
5,"prasādād","_","_","prasāda","NC","","_","_"
6,"ātmano","_","_","ātman","NC","","_","_"
7,"mayā","_","_","mat","PPR","","_","_"
1,"_","_","_","na","CNG","","_","_"
2,"_","_","_","mat","PPR","","_","_"
3,"punar","_","_","punar","CAD","","_","_"
4,"_","_","_","iha","CAD","","_","_"
5,"_","_","_","āga","V","āga","_","_"
6,"lokān","_","_","loka","NC","","_","_"
7,"_","_","_","ālokay","V","ālokay","_","_"
8,"_","_","_","mat","PPR","","_","_"
1,"ā","_","_","ā","CADP","","_","_"
2,"siddher","_","_","siddhi","NC","","_","_"
3,"ā","_","_","ā","CADP","","_","_"
4,"_","_","_","prajā","NC","","_","_"
5,"_","_","_","sarga","NC","","_","_"
6,"ātmano","_","_","ātman","NC","","_","_"
7,"me","_","_","mat","PPR","","_","_"
8,"gatiḥ","_","_","gati","NC","","_","_"
9,"śubhā","_","_","śubha","JJ","","_","_"
1,"upalabdhā","_","_","upalabh","PPP","","_","_"
2,"dvijaśreṣṭha","_","_","dvijaśreṣṭha","NC","","_","_"
3,"_","_","_","tathā","CX","","_","_"
4,"_","_","_","ida","PRD","","_","_"
5,"siddhir","_","_","siddhi","NC","","_","_"
6,"uttamā","_","_","uttama","JJ","","_","_"
1,"itaḥ","_","_","itas","CX","","_","_"
2,"paraṃ","_","_","para","CX","","_","_"
3,"gamiṣyāmi","_","_","gacch","V","gam","_","_"
4,"tataḥ","_","_","tatas","CX","","_","_"
5,"parataraṃ","_","_","paratara","JJ","","_","_"
6,"punaḥ","_","_","punar","CAD","","_","_"
1,"brahmaṇaḥ","_","_","brahman","NC","","_","_"
2,"padam","_","_","pada","NC","","_","_"
3,"avyagraṃ","_","_","avyagra","JJ","","_","_"
4,"mā","_","_","mā","CNG","","_","_"
5,"te","_","_","tvat","PPR","","_","_"
6,"bhūd","_","_","bhav","V","bhū","_","_"
7,"atra","_","_","atra","CAD","","_","_"
8,"saṃśayaḥ","_","_","saṃśaya","NC","","_","_"
1,"_","_","_","na","CNG","","_","_"
2,"_","_","_","mat","PPR","","_","_"
3,"punar","_","_","punar","CAD","","_","_"
4,"_","_","_","iha","CAD","","_","_"
5,"_","_","_","āga","V","āga","_","_"
6,"_","_","_","martya","NC","","_","_"
7,"_","_","_","loka","NC","","_","_"
8,"paraṃtapa","_","_","paraṃtapa","JJ","","_","_"
1,"prīto","_","_","prī","PPP","","_","_"
2,"'smi","_","_","as","V","as","_","_"
3,"te","_","_","tvat","PPR","","_","_"
4,"_","_","_","mahat","JJ","","_","_"
5,"_","_","_","prājña","JJ","","_","_"
6,"brūhi","_","_","abravīta","V","brū","_","_"
7,"kiṃ","_","_","kiṃ","PRQ","","_","_"
8,"karavāṇi","_","_","kar","V","kṛ","_","_"
9,"te","_","_","tvat","PPR","","_","_"
1,"_","_","_","yad","PRL","","_","_"
2,"_","_","_","īpsu","JJ","","_","_"
3,"_","_","_","upapad","PPP","","_","_"
4,"_","_","_","tvat","PPR","","_","_"
5,"tasya","_","_","tad","PRD","","_","_"
6,"kālo","_","_","kāla","NC","","_","_"
7,"'yam","_","_","ida","PRD","","_","_"
8,"āgataḥ","_","_","āga","PPP","","_","_"
1,"abhijāne","_","_","abhijān","V","abhijñā","_","_"
2,"ca","_","_","ca","CCD","","_","_"
3,"tad","_","_","tad","PRD","","_","_"
4,"ahaṃ","_","_","mat","PPR","","_","_"
5,"_","_","_","yad","PRL","","_","_"
6,"_","_","_","artha","NC","","_","_"
7,"mā","_","_","mat","PPR","","_","_"
8,"tvam","_","_","tvat","PPR","","_","_"
9,"āgataḥ","_","_","āga","PPP","","_","_"
1,"acirāt","_","_","acirāt","CX","","_","_"
2,"tu","_","_","tu","CCD","","_","_"
3,"gamiṣyāmi","_","_","gacch","V","gam","_","_"
4,"_","_","_","ya","CX","","_","_"
5,"_","_","_","mat","PPR","","_","_"
6,"tvām","_","_","tvat","PPR","","_","_"
7,"acūcudam","_","_","cod","V","cud","_","_"
1,"bhṛśaṃ","_","_","bhṛśa","CX","","_","_"
2,"prīto","_","_","prī","PPP","","_","_"
3,"'smi","_","_","as","V","as","_","_"
4,"_","_","_","bhavat","JJ","","_","_"
5,"_","_","_","cāritra","NC","","_","_"
6,"vicakṣaṇa","_","_","vicakṣaṇa","JJ","","_","_"
1,"paripṛccha","_","_","paripracch","V","paripracch","_","_"
2,"yāvad","_","_","yāvat","CX","","_","_"
3,"bhavate","_","_","bhavat","JJ","","_","_"
4,"bhāṣeyaṃ","_","_","bhāṣ","V","bhāṣ","_","_"
5,"yat","_","_","yad","PRL","","_","_"
6,"_","_","_","tvat","PPR","","_","_"
7,"_","_","_","īpsay","PPP","","_","_"
1,"bahu","_","_","bahu","JJ","","_","_"
2,"manye","_","_","man","V","man","_","_"
3,"ca","_","_","ca","CCD","","_","_"
4,"te","_","_","tvat","PPR","","_","_"
5,"buddhiṃ","_","_","buddhi","NC","","_","_"
6,"bhṛśaṃ","_","_","bhṛśa","CX","","_","_"
7,"sampūjayāmi","_","_","sampūjay","V","sampūjay","_","_"
8,"ca","_","_","ca","CCD","","_","_"
1,"_","_","_","ya","CX","","_","_"
2,"_","_","_","mat","PPR","","_","_"
3,"bhavatā","_","_","bhavat","JJ","","_","_"
4,"buddho","_","_","budh","PPP","","_","_"
5,"medhāvī","_","_","medhāvin","JJ","","_","_"
6,"_","_","_","hi","CX","","_","_"
7,"_","_","_","as","V","as","_","_"
8,"kāśyapa","_","_","kāśyapa","NC","","_","_"
