"WordID","word","NormSTEM","suffix","lemma","PoS","Root","NormSuffix","NormWord"
1,"dhaumya","_","_","dhaumya","NC","","_","_"
2,"uvāca","_","_","vak","V","vac","_","_"
1,"udīcyāṃ","_","_","udīcī","NC","","_","_"
2,"_","_","_","rājan","NC","","_","_"
3,"_","_","_","śārdūla","NC","","_","_"
4,"diśi","_","_","diś","NC","","_","_"
5,"puṇyāni","_","_","puṇya","NC","","_","_"
6,"yāni","_","_","yad","PRL","","_","_"
7,"vai","_","_","vai","CX","","_","_"
1,"tāni","_","_","tad","PRD","","_","_"
2,"te","_","_","tvat","PPR","","_","_"
3,"kīrtayiṣyāmi","_","_","kīrtay","V","kīrtay","_","_"
4,"_","_","_","puṇya","JJ","","_","_"
5,"_","_","_","āyatana","NC","","_","_"
6,"ca","_","_","ca","CCD","","_","_"
1,"sarasvatī","_","_","sarasvatī","NC","","_","_"
2,"_","_","_","puṇya","NC","","_","_"
3,"_","_","_","vaha","JJ","","_","_"
4,"hradinī","_","_","hradinī","NC","","_","_"
5,"_","_","_","vana","NC","","_","_"
6,"_","_","_","mālin","JJ","","_","_"
1,"samudragā","_","_","samudragā","NC","","_","_"
2,"_","_","_","mahat","JJ","","_","_"
3,"_","_","_","vega","NC","","_","_"
4,"yamunā","_","_","yamunā","NC","","_","_"
5,"yatra","_","_","yatra","CX","","_","_"
6,"pāṇḍava","_","_","pāṇḍava","NC","","_","_"
1,"tatra","_","_","tatra","CAD","","_","_"
2,"puṇyatamaṃ","_","_","puṇyatama","JJ","","_","_"
3,"tīrthaṃ","_","_","tīrtha","NC","","_","_"
4,"plakṣāvataraṇaṃ","_","_","plakṣāvataraṇa","NC","","_","_"
5,"śivam","_","_","śiva","JJ","","_","_"
1,"yatra","_","_","yatra","CX","","_","_"
2,"sārasvatair","_","_","sārasvata","NC","","_","_"
3,"iṣṭvā","_","_","yaj","CGDA","","_","_"
4,"_","_","_","ga","V","ga","_","_"
5,"_","_","_","avabhṛtha","NC","","_","_"
6,"dvijāḥ","_","_","dvija","NC","","_","_"
1,"puṇyaṃ","_","_","puṇya","JJ","","_","_"
2,"_","_","_","ca","CCD","","_","_"
3,"_","_","_","ākhyā","V","ākhyā","_","_"
4,"divyaṃ","_","_","divya","JJ","","_","_"
5,"śivam","_","_","śiva","JJ","","_","_"
6,"agniśiro","_","_","agniśiras","NC","","_","_"
7,"'nagha","_","_","anagha","JJ","","_","_"
1,"sahadevo","_","_","sahadeva","NC","","_","_"
2,"'yajad","_","_","yaj","V","yaj","_","_"
3,"yatra","_","_","yatra","CX","","_","_"
4,"_","_","_","śamyā","NC","","_","_"
5,"_","_","_","kṣepa","NC","","_","_"
6,"bhārata","_","_","bhārata","JJ","","_","_"
1,"etasminn","_","_","tad","PRD","","_","_"
2,"eva","_","_","eva","CEM","","_","_"
3,"_","_","_","indra","NC","","_","_"
4,"_","_","_","gītā","NC","","_","_"
5,"indragītā","_","_","yudhiṣṭhira","NC","","_","_"
1,"gāthā","_","_","gāthā","NC","","_","_"
2,"carati","_","_","car","V","car","_","_"
3,"loke","_","_","loka","NC","","_","_"
4,"'smin","_","_","ida","PRD","","_","_"
5,"gīyamānā","_","_","gā","KDP","","_","_"
6,"dvijātibhiḥ","_","_","dvijāti","NC","","_","_"
1,"agnayaḥ","_","_","agni","NC","","_","_"
2,"sahadevena","_","_","sahadeva","NC","","_","_"
3,"ye","_","_","yad","PRL","","_","_"
4,"citā","_","_","ci","PPP","","_","_"
5,"yamunām","_","_","yamunā","NC","","_","_"
6,"anu","_","_","anu","CADP","","_","_"
1,"śataṃ","_","_","śata","NUM","","_","_"
2,"_","_","_","śata","NUM","","_","_"
3,"_","_","_","sahasra","NUM","","_","_"
4,"_","_","_","sahasra","NUM","","_","_"
5,"_","_","_","śata","NUM","","_","_"
6,"_","_","_","dakṣiṇā","NC","","_","_"
1,"_","_","_","tatra","CAD","","_","_"
2,"_","_","_","eva","CEM","","_","_"
3,"bharato","_","_","bharata","NC","","_","_"
4,"rājā","_","_","rājan","NC","","_","_"
5,"cakravartī","_","_","cakravartin","NC","","_","_"
6,"_","_","_","mahat","JJ","","_","_"
7,"_","_","_","yaśas","NC","","_","_"
1,"viṃśatiṃ","_","_","viṃśati","NC","","_","_"
2,"sapta","_","_","saptan","NUM","","_","_"
3,"_","_","_","ca","CCD","","_","_"
4,"_","_","_","aṣṭan","NUM","","_","_"
5,"ca","_","_","ca","CCD","","_","_"
6,"hayamedhān","_","_","hayamedha","NC","","_","_"
7,"upāharat","_","_","upahar","V","upahṛ","_","_"
1,"_","_","_","kāma","NC","","_","_"
2,"_","_","_","kṛt","JJ","","_","_"
3,"yo","_","_","yad","PRL","","_","_"
4,"dvijātīnāṃ","_","_","dvijāti","NC","","_","_"
5,"śrutas","_","_","śru","PPP","","_","_"
6,"tāta","_","_","tāta","NC","","_","_"
7,"mayā","_","_","mat","PPR","","_","_"
8,"purā","_","_","purā","CX","","_","_"
1,"atyantam","_","_","atyanta","JJ","","_","_"
2,"āśramaḥ","_","_","āśrama","NC","","_","_"
3,"puṇyaḥ","_","_","puṇya","JJ","","_","_"
4,"sarakas","_","_","saraka","NC","","_","_"
5,"tasya","_","_","tad","PRD","","_","_"
6,"viśrutaḥ","_","_","viśru","PPP","","_","_"
1,"sarasvatī","_","_","sarasvatī","NC","","_","_"
2,"nadī","_","_","nadī","NC","","_","_"
3,"sadbhiḥ","_","_","sat","JJ","","_","_"
4,"satataṃ","_","_","satata","CX","","_","_"
5,"pārtha","_","_","pārtha","NC","","_","_"
6,"pūjitā","_","_","pūjay","PPP","","_","_"
1,"vālakhilyair","_","_","vālakhilya","NC","","_","_"
2,"_","_","_","mahat","JJ","","_","_"
3,"_","_","_","rāja","NC","","_","_"
4,"_","_","_","yatra","CX","","_","_"
5,"_","_","_","yaj","PPP","","_","_"
6,"ṛṣibhiḥ","_","_","ṛṣi","NC","","_","_"
7,"purā","_","_","purā","CX","","_","_"
1,"dṛṣadvatī","_","_","dṛṣadvatī","NC","","_","_"
2,"puṇyatamā","_","_","puṇyatama","JJ","","_","_"
3,"tatra","_","_","tatra","CAD","","_","_"
4,"khyātā","_","_","khyā","PPP","","_","_"
5,"yudhiṣṭhira","_","_","yudhiṣṭhira","NC","","_","_"
1,"tatra","_","_","tatra","CAD","","_","_"
2,"_","_","_","vaivarṇya","NC","","_","_"
3,"_","_","_","varṇa","NC","","_","_"
4,"ca","_","_","ca","CCD","","_","_"
5,"_","_","_","su","CAD","","_","_"
6,"_","_","_","puṇya","JJ","","_","_"
7,"_","_","_","manuja","NC","","_","_"
8,"_","_","_","adhipa","NC","","_","_"
1,"_","_","_","veda","NC","","_","_"
2,"_","_","_","jña","JJ","","_","_"
3,"_","_","_","veda","NC","","_","_"
4,"_","_","_","vid","PPP","","_","_"
5,"_","_","_","vidyā","NC","","_","_"
6,"_","_","_","veda","NC","","_","_"
7,"_","_","_","vid","JJ","","_","_"
8,"ubhau","_","_","ubh","PPX","","_","_"
1,"yajantau","_","_","yaj","KDP","","_","_"
2,"kratubhir","_","_","kratu","NC","","_","_"
3,"nityaṃ","_","_","nitya","CX","","_","_"
4,"puṇyair","_","_","puṇya","JJ","","_","_"
5,"_","_","_","bharata","NC","","_","_"
6,"_","_","_","sattama","JJ","","_","_"
1,"sametya","_","_","same","CGDA","","_","_"
2,"bahuśo","_","_","bahuśas","CX","","_","_"
3,"devāḥ","_","_","deva","NC","","_","_"
4,"_","_","_","sa_saha","CX","","_","_"
5,"_","_","_","indra","NC","","_","_"
6,"savaruṇāḥ","_","_","savaruṇa","JJ","","_","_"
7,"purā","_","_","purā","CX","","_","_"
1,"_","_","_","viśākha","NC","","_","_"
2,"_","_","_","yūpa","NC","","_","_"
3,"'tapyanta","_","_","tap","V","tap","_","_"
4,"tasmāt","_","_","tad","PRD","","_","_"
5,"puṇyatamaḥ","_","_","puṇyatama","JJ","","_","_"
6,"sa","_","_","tad","PRD","","_","_"
7,"vai","_","_","vai","CX","","_","_"
1,"ṛṣir","_","_","ṛṣi","NC","","_","_"
2,"mahān","_","_","mahat","JJ","","_","_"
3,"mahābhāgo","_","_","mahābhāga","JJ","","_","_"
4,"jamadagnir","_","_","jamadagni","NC","","_","_"
5,"_","_","_","mahat","JJ","","_","_"
6,"_","_","_","yaśas","NC","","_","_"
1,"palāśakeṣu","_","_","palāśaka","NC","","_","_"
2,"puṇyeṣu","_","_","puṇya","JJ","","_","_"
3,"ramyeṣv","_","_","ramya","JJ","","_","_"
1,"yatra","_","_","yatra","CX","","_","_"
2,"sarvāḥ","_","_","sarva","JQ","","_","_"
3,"_","_","_","sarit","NC","","_","_"
4,"_","_","_","śreṣṭha","JJ","","_","_"
5,"sākṣāt","_","_","sākṣāt","CX","","_","_"
6,"tam","_","_","tad","PRD","","_","_"
7,"_","_","_","ṛṣi","NC","","_","_"
8,"_","_","_","sattama","JJ","","_","_"
1,"svaṃ","_","_","sva","JJ","","_","_"
2,"svaṃ","_","_","sva","JJ","","_","_"
3,"toyam","_","_","toya","NC","","_","_"
4,"upādāya","_","_","upādā","CGDA","","_","_"
5,"_","_","_","parivāray","CGDA","","_","_"
6,"_","_","_","upatiṣṭh","V","upasthā","_","_"
1,"api","_","_","api","CX","","_","_"
2,"_","_","_","ca","CCD","","_","_"
3,"_","_","_","atra","CAD","","_","_"
4,"_","_","_","mahat","JJ","","_","_"
5,"_","_","_","rāja","NC","","_","_"
6,"svayaṃ","_","_","svaya","CX","","_","_"
7,"viśvāvasur","_","_","viśvāvasu","NC","","_","_"
8,"jagau","_","_","gā","V","gā","_","_"
1,"imaṃ","_","_","ida","PRD","","_","_"
2,"ślokaṃ","_","_","śloka","NC","","_","_"
3,"tadā","_","_","tadā","CAD","","_","_"
4,"vīra","_","_","vīra","NC","","_","_"
5,"prekṣya","_","_","prekṣ","CGDA","","_","_"
6,"vīryaṃ","_","_","vīrya","NC","","_","_"
7,"mahātmanaḥ","_","_","mahātman","JJ","","_","_"
1,"yajamānasya","_","_","yajamāna","NC","","_","_"
2,"vai","_","_","vai","CX","","_","_"
3,"_","_","_","deva","NC","","_","_"
4,"_","_","_","jamadagni","NC","","_","_"
5,"mahātmanaḥ","_","_","mahātman","JJ","","_","_"
1,"āgamya","_","_","āga","CGDA","","_","_"
2,"saritaḥ","_","_","sarit","NC","","_","_"
3,"sarvā","_","_","sarva","JQ","","_","_"
4,"madhunā","_","_","madhu","NC","","_","_"
5,"samatarpayan","_","_","saṃtarpay","V","saṃtarpay","_","_"
1,"_","_","_","gandharva","NC","","_","_"
2,"_","_","_","yakṣa","NC","","_","_"
3,"_","_","_","rakṣas","NC","","_","_"
4,"apsarobhiś","_","_","apsaras","NC","","_","_"
5,"ca","_","_","ca","CCD","","_","_"
6,"śobhitam","_","_","śobhay","PPP","","_","_"
1,"_","_","_","kirāta","NC","","_","_"
2,"_","_","_","kiṃnara","NC","","_","_"
3,"_","_","_","āvāsa","NC","","_","_"
4,"śailaṃ","_","_","śaila","NC","","_","_"
5,"śikhariṇāṃ","_","_","śikharin","NC","","_","_"
6,"varam","_","_","vara","JJ","","_","_"
1,"bibheda","_","_","bhid","V","bhid","_","_"
2,"tarasā","_","_","taras","NC","","_","_"
3,"gaṅgā","_","_","gaṅgā","NC","","_","_"
4,"gaṅgādvāre","_","_","gaṅgādvāra","NC","","_","_"
5,"yudhiṣṭhira","_","_","yudhiṣṭhira","NC","","_","_"
1,"puṇyaṃ","_","_","puṇya","JJ","","_","_"
2,"tat","_","_","tad","PRD","","_","_"
3,"khyāyate","_","_","khyā","V","khyā","_","_"
4,"rājan","_","_","rājan","NC","","_","_"
5,"_","_","_","brahman","NC","","_","_"
6,"_","_","_","ṛṣi","NC","","_","_"
7,"_","_","_","gaṇa","NC","","_","_"
8,"_","_","_","sev","PPP","","_","_"
1,"sanatkumāraḥ","_","_","sanatkumāra","NC","","_","_"
2,"kauravya","_","_","kauravya","NC","","_","_"
3,"puṇyaṃ","_","_","puṇya","JJ","","_","_"
4,"kanakhalaṃ","_","_","kanakhala","NC","","_","_"
5,"tathā","_","_","tathā","CX","","_","_"
1,"_","_","_","parvata","NC","","_","_"
2,"_","_","_","ca","CCD","","_","_"
3,"purur","_","_","puru","NC","","_","_"
4,"nāma","_","_","nāma","CX","","_","_"
5,"yatra","_","_","yatra","CX","","_","_"
6,"jātaḥ","_","_","jan","PPP","","_","_"
7,"purūravāḥ","_","_","purūravas","NC","","_","_"
1,"bhṛgur","_","_","bhṛgu","NC","","_","_"
2,"yatra","_","_","yatra","CX","","_","_"
3,"tapas","_","_","tapas","NC","","_","_"
4,"tepe","_","_","tap","V","tap","_","_"
5,"_","_","_","mahat","JJ","","_","_"
6,"_","_","_","ṛṣi","NC","","_","_"
7,"_","_","_","gaṇa","NC","","_","_"
8,"_","_","_","sev","PPP","","_","_"
1,"sa","_","_","tad","PRD","","_","_"
2,"rājann","_","_","rājan","NC","","_","_"
3,"āśramaḥ","_","_","āśrama","NC","","_","_"
4,"khyāto","_","_","khyā","PPP","","_","_"
5,"bhṛgutuṅgo","_","_","bhṛgutuṅga","NC","","_","_"
6,"_","_","_","mahat","JJ","","_","_"
7,"_","_","_","giri","NC","","_","_"
1,"_","_","_","yad","PRL","","_","_"
2,"_","_","_","ca","CCD","","_","_"
3,"bhūtaṃ","_","_","bhū","PPP","","_","_"
4,"_","_","_","bhaviṣyat","JJ","","_","_"
5,"_","_","_","ca","CCD","","_","_"
6,"_","_","_","bhū","KDP","","_","_"
7,"_","_","_","ca","CCD","","_","_"
8,"_","_","_","puruṣa","NC","","_","_"
9,"_","_","_","ṛṣabha","NC","","_","_"
1,"nārāyaṇaḥ","_","_","nārāyaṇa","NC","","_","_"
2,"prabhur","_","_","prabhu","JJ","","_","_"
3,"viṣṇuḥ","_","_","viṣṇu","NC","","_","_"
4,"śāśvataḥ","_","_","śāśvata","JJ","","_","_"
5,"puruṣottamaḥ","_","_","puruṣottama","NC","","_","_"
1,"_","_","_","tad","PRD","","_","_"
2,"_","_","_","atiyaśas","JJ","","_","_"
3,"puṇyāṃ","_","_","puṇya","JJ","","_","_"
4,"viśālāṃ","_","_","viśāla","JJ","","_","_"
5,"badarīm","_","_","badarī","NC","","_","_"
6,"anu","_","_","anu","CADP","","_","_"
1,"āśramaḥ","_","_","āśrama","NC","","_","_"
2,"khyāyate","_","_","khyā","V","khyā","_","_"
3,"puṇyas","_","_","puṇya","JJ","","_","_"
4,"triṣu","_","_","tri","NUM","","_","_"
5,"lokeṣu","_","_","loka","NC","","_","_"
6,"viśrutaḥ","_","_","viśru","PPP","","_","_"
1,"_","_","_","uṣṇa","JJ","","_","_"
2,"_","_","_","toya","NC","","_","_"
3,"_","_","_","vaha","JJ","","_","_"
4,"gaṅgā","_","_","gaṅgā","NC","","_","_"
5,"_","_","_","śīta","JJ","","_","_"
6,"_","_","_","toya","NC","","_","_"
7,"_","_","_","vaha","JJ","","_","_"
8,"_","_","_","apara","PPX","","_","_"
1,"_","_","_","suvarṇa","NC","","_","_"
2,"_","_","_","sikatā","NC","","_","_"
3,"rājan","_","_","rājan","NC","","_","_"
4,"viśālāṃ","_","_","viśāla","JJ","","_","_"
5,"badarīm","_","_","badarī","NC","","_","_"
6,"anu","_","_","anu","CADP","","_","_"
1,"ṛṣayo","_","_","ṛṣi","NC","","_","_"
2,"yatra","_","_","yatra","CX","","_","_"
3,"devāś","_","_","deva","NC","","_","_"
4,"ca","_","_","ca","CCD","","_","_"
5,"mahābhāgā","_","_","mahābhāga","JJ","","_","_"
6,"_","_","_","mahat","JJ","","_","_"
7,"_","_","_","ojas","NC","","_","_"
1,"prāpya","_","_","prāp","CGDA","","_","_"
2,"nityaṃ","_","_","nitya","CX","","_","_"
3,"namasyanti","_","_","namasy","V","namasy","_","_"
4,"devaṃ","_","_","deva","NC","","_","_"
5,"nārāyaṇaṃ","_","_","nārāyaṇa","NC","","_","_"
6,"vibhum","_","_","vibhu","JJ","","_","_"
1,"yatra","_","_","yatra","CX","","_","_"
2,"nārāyaṇo","_","_","nārāyaṇa","NC","","_","_"
3,"devaḥ","_","_","deva","NC","","_","_"
4,"paramātmā","_","_","paramātman","NC","","_","_"
5,"sanātanaḥ","_","_","sanātana","JJ","","_","_"
1,"tatra","_","_","tatra","CAD","","_","_"
2,"kṛtsnaṃ","_","_","kṛtsna","JJ","","_","_"
3,"jagat","_","_","jagat","NC","","_","_"
4,"pārtha","_","_","pārtha","NC","","_","_"
5,"_","_","_","tīrtha","NC","","_","_"
6,"_","_","_","āyatana","NC","","_","_"
7,"ca","_","_","ca","CCD","","_","_"
1,"tat","_","_","tad","PRD","","_","_"
2,"puṇyaṃ","_","_","puṇya","JJ","","_","_"
3,"tat","_","_","tad","PRD","","_","_"
4,"paraṃ","_","_","para","PPX","","_","_"
5,"brahma","_","_","brahman","NC","","_","_"
6,"tat","_","_","tad","PRD","","_","_"
7,"tīrthaṃ","_","_","tīrtha","NC","","_","_"
8,"tat","_","_","tad","PRD","","_","_"
9,"tapovanam","_","_","tapovana","NC","","_","_"
1,"tatra","_","_","tatra","CAD","","_","_"
2,"devarṣayaḥ","_","_","devarṣi","NC","","_","_"
3,"siddhāḥ","_","_","siddha","NC","","_","_"
4,"sarve","_","_","sarva","JQ","","_","_"
5,"_","_","_","ca","CCD","","_","_"
6,"_","_","_","eva","CEM","","_","_"
7,"tapodhanāḥ","_","_","tapodhana","JJ","","_","_"
1,"ādidevo","_","_","ādideva","NC","","_","_"
2,"_","_","_","mahat","JJ","","_","_"
3,"_","_","_","yogin","NC","","_","_"
4,"_","_","_","yatra","CX","","_","_"
5,"_","_","_","ās","V","ās","_","_"
6,"madhusūdanaḥ","_","_","madhusūdana","NC","","_","_"
1,"puṇyānām","_","_","puṇya","JJ","","_","_"
2,"api","_","_","api","CX","","_","_"
3,"tat","_","_","tad","PRD","","_","_"
4,"puṇyaṃ","_","_","puṇya","JJ","","_","_"
5,"tatra","_","_","tatra","CAD","","_","_"
6,"te","_","_","tvat","PPR","","_","_"
7,"saṃśayo","_","_","saṃśaya","NC","","_","_"
8,"'stu","_","_","as","V","as","_","_"
9,"mā","_","_","mā","CNG","","_","_"
1,"etāni","_","_","tad","PRD","","_","_"
2,"rājan","_","_","rājan","NC","","_","_"
3,"puṇyāni","_","_","puṇya","JJ","","_","_"
4,"pṛthivyāṃ","_","_","pṛthivī","NC","","_","_"
5,"pṛthivīpate","_","_","pṛthivīpati","NC","","_","_"
1,"kīrtitāni","_","_","kīrtay","PPP","","_","_"
2,"_","_","_","nara","NC","","_","_"
3,"_","_","_","śreṣṭha","JJ","","_","_"
4,"_","_","_","tīrtha","NC","","_","_"
5,"_","_","_","āyatana","NC","","_","_"
6,"ca","_","_","ca","CCD","","_","_"
1,"etāni","_","_","tad","PRD","","_","_"
2,"vasubhiḥ","_","_","vasu","NC","","_","_"
3,"sādhyair","_","_","sādhya","NC","","_","_"
4,"ādityair","_","_","āditya","NC","","_","_"
5,"_","_","_","marut","NC","","_","_"
6,"_","_","_","aśvin","NC","","_","_"
1,"ṛṣibhir","_","_","ṛṣi","NC","","_","_"
2,"_","_","_","brahman","NC","","_","_"
3,"_","_","_","kalpa","NC","","_","_"
4,"ca","_","_","ca","CCD","","_","_"
5,"sevitāni","_","_","sev","PPP","","_","_"
6,"mahātmabhiḥ","_","_","mahātman","JJ","","_","_"
1,"caran","_","_","car","KDP","","_","_"
2,"etāni","_","_","tad","PRD","","_","_"
3,"kaunteya","_","_","kaunteya","NC","","_","_"
4,"sahito","_","_","sahita","JJ","","_","_"
5,"_","_","_","brāhmaṇa","NC","","_","_"
6,"_","_","_","ṛṣabha","NC","","_","_"
1,"bhrātṛbhiś","_","_","bhrātṛ","NC","","_","_"
2,"ca","_","_","ca","CCD","","_","_"
3,"mahābhāgair","_","_","mahābhāga","JJ","","_","_"
4,"utkaṇṭhāṃ","_","_","utkaṇṭhā","NC","","_","_"
5,"vijahiṣyasi","_","_","vijah","V","vihā","_","_"
