"WordID","word","NormSTEM","suffix","lemma","PoS","Root","NormSuffix","NormWord"
1,"yuvo","_","_","tvat","PPR","","_","_"
2,"rajāṃsi","_","_","rajas","NC","","_","_"
3,"_","_","_","su","CAD","","_","_"
4,"_","_","_","yama","NC","","_","_"
5,"aśvā","_","_","aśva","NC","","_","_"
6,"ratho","_","_","ratha","NC","","_","_"
7,"yad","_","_","yat","CSB","","_","_"
8,"vām","_","_","tvat","PPR","","_","_"
9,"pary","_","_","pari","CADP","","_","_"
10,"arṇāṃsi","_","_","arṇas","NC","","_","_"
11,"dīyat","_","_","dī","V","dī","_","_"
1,"hiraṇyayā","_","_","hiraṇyaya","JJ","","_","_"
2,"vām","_","_","tvat","PPR","","_","_"
3,"pavayaḥ","_","_","pavi","NC","","_","_"
4,"pruṣāyan","_","_","pruṣāy","V","pruṣāy","_","_"
5,"madhvaḥ","_","_","madhu","NC","","_","_"
6,"pibantā","_","_","pā","KDP","","_","_"
7,"uṣasaḥ","_","_","uṣas","NC","","_","_"
8,"sacethe","_","_","sac","V","sac","_","_"
1,"yuvam","_","_","tvat","PPR","","_","_"
2,"_","_","_","atya","NC","","_","_"
3,"_","_","_","ava","CX","","_","_"
4,"nakṣatho","_","_","nakṣ","V","nakṣ","_","_"
5,"yad","_","_","yad","PRL","","_","_"
6,"vipatmano","_","_","vipatman","JJ","","_","_"
7,"naryasya","_","_","narya","JJ","","_","_"
8,"prayajyoḥ","_","_","prayajyu","JJ","","_","_"
1,"svasā","_","_","svasṛ","NC","","_","_"
2,"yad","_","_","yat","CSB","","_","_"
3,"vāṃ","_","_","tvat","PPR","","_","_"
4,"_","_","_","viśva","JQ","","_","_"
5,"_","_","_","gūrti","NC","","_","_"
6,"bharāti","_","_","bhṛ","V","bhṛ","_","_"
7,"_","_","_","vāja","NC","","_","_"
8,"_","_","_","īḍ","V","īḍ","_","_"
9,"_","_","_","madhu","NC","","_","_"
10,"_","_","_","pā","JJ","","_","_"
11,"iṣe","_","_","iṣ","NC","","_","_"
12,"ca","_","_","ca","CCD","","_","_"
1,"yuvam","_","_","tvat","PPR","","_","_"
2,"paya","_","_","payas","NC","","_","_"
3,"usriyāyām","_","_","usriyā","NC","","_","_"
4,"adhattam","_","_","dadh","V","dhā","_","_"
5,"pakvam","_","_","pakva","JJ","","_","_"
6,"āmāyām","_","_","āma","JJ","","_","_"
7,"ava","_","_","ava","CX","","_","_"
8,"pūrvyaṃ","_","_","pūrvya","JJ","","_","_"
9,"goḥ","_","_","go","NC","","_","_"
1,"antar","_","_","antar","CAD","","_","_"
2,"yad","_","_","yad","PRL","","_","_"
3,"vanino","_","_","vanin","NC","","_","_"
4,"vām","_","_","tvat","PPR","","_","_"
5,"ṛtapsū","_","_","ṛtapsu","JJ","","_","_"
6,"hvāro","_","_","hvāra","NC","","_","_"
7,"na","_","_","na","CNG","","_","_"
8,"śucir","_","_","śuci","JJ","","_","_"
9,"yajate","_","_","yaj","V","yaj","_","_"
10,"haviṣmān","_","_","haviṣmat","JJ","","_","_"
1,"yuvaṃ","_","_","tvat","PPR","","_","_"
2,"ha","_","_","ha","CEM","","_","_"
3,"gharmam","_","_","gharma","NC","","_","_"
4,"madhumantam","_","_","madhumat","JJ","","_","_"
5,"atraye","_","_","atri","NC","","_","_"
6,"'po","_","_","apas","JJ","","_","_"
7,"na","_","_","na","CNG","","_","_"
8,"kṣodo","_","_","kṣodas","NC","","_","_"
9,"'vṛṇītam","_","_","vṛ","V","vṛ","_","_"
10,"eṣe","_","_","eṣa","NC","","_","_"
1,"tad","_","_","tad","PRD","","_","_"
2,"vāṃ","_","_","tvat","PPR","","_","_"
3,"narāv","_","_","nara","NC","","_","_"
4,"aśvinā","_","_","aśvin","NC","","_","_"
5,"paśvaiṣṭī","_","_","paśvaiṣṭi","JJ","","_","_"
6,"_","_","_","rathyā","NC","","_","_"
7,"_","_","_","iva","CCM","","_","_"
8,"cakrā","_","_","cakra","NC","","_","_"
9,"prati","_","_","prati","CADP","","_","_"
10,"yanti","_","_","e","V","i","_","_"
11,"madhvaḥ","_","_","madhu","NC","","_","_"
1,"ā","_","_","ā","CADP","","_","_"
2,"vāṃ","_","_","tvat","PPR","","_","_"
3,"dānāya","_","_","dāna","NC","","_","_"
4,"vavṛtīya","_","_","vart","V","vṛt","_","_"
5,"dasrā","_","_","dasra","NC","","_","_"
6,"gor","_","_","go","NC","","_","_"
7,"oheṇa","_","_","oha","NC","","_","_"
8,"taugryo","_","_","taugrya","NC","","_","_"
9,"na","_","_","na","CNG","","_","_"
10,"jivriḥ","_","_","jivri","JJ","","_","_"
1,"apaḥ","_","_","ap","NC","","_","_"
2,"kṣoṇī","_","_","kṣoṇī","NC","","_","_"
3,"sacate","_","_","sac","V","sac","_","_"
4,"māhinā","_","_","māhina","JJ","","_","_"
5,"vāṃ","_","_","tvat","PPR","","_","_"
6,"jūrṇo","_","_","jṛ","PPP","","_","_"
7,"vām","_","_","tvat","PPR","","_","_"
8,"akṣur","_","_","akṣu","NC","","_","_"
9,"aṃhaso","_","_","aṃhas","NC","","_","_"
10,"yajatrā","_","_","yajatra","JJ","","_","_"
1,"ni","_","_","ni","CADP","","_","_"
2,"yad","_","_","yat","CSB","","_","_"
3,"yuvethe","_","_","yu","V","yu","_","_"
4,"niyutaḥ","_","_","niyut","NC","","_","_"
5,"_","_","_","su","CAD","","_","_"
6,"_","_","_","dānu","NC","","_","_"
7,"upa","_","_","upa","CADP","","_","_"
8,"svadhābhiḥ","_","_","svadhā","NC","","_","_"
9,"sṛjathaḥ","_","_","sṛj","V","sṛj","_","_"
10,"purandhim","_","_","puraṃdhi","NC","","_","_"
1,"veṣad","_","_","vye","V","vī","_","_"
2,"vāto","_","_","vāta","NC","","_","_"
3,"na","_","_","na","CNG","","_","_"
4,"sūrir","_","_","sūri","NC","","_","_"
5,"ā","_","_","ā","CADP","","_","_"
6,"mahe","_","_","mah","JJ","","_","_"
7,"dade","_","_","dad","V","dā","_","_"
8,"suvrato","_","_","suvrata","JJ","","_","_"
9,"na","_","_","na","CNG","","_","_"
10,"vājam","_","_","vāja","NC","","_","_"
1,"vayaṃ","_","_","mat","PPR","","_","_"
2,"_","_","_","cit","CEM","","_","_"
3,"_","_","_","hi","CX","","_","_"
4,"vāṃ","_","_","tvat","PPR","","_","_"
5,"jaritāraḥ","_","_","jaritṛ","NC","","_","_"
6,"satyā","_","_","satya","JJ","","_","_"
7,"vipanyāmahe","_","_","vipan","V","vipan","_","_"
8,"vi","_","_","vi","CADP","","_","_"
9,"paṇir","_","_","paṇi","NC","","_","_"
10,"hitāvān","_","_","hitāvat","JJ","","_","_"
1,"adhā","_","_","adha","CX","","_","_"
2,"_","_","_","cit","CEM","","_","_"
3,"_","_","_","hi","CX","","_","_"
4,"_","_","_","sma","CX","","_","_"
5,"_","_","_","aśvin","NC","","_","_"
6,"anindyā","_","_","anindya","JJ","","_","_"
7,"pātho","_","_","pib","V","pā","_","_"
8,"hi","_","_","hi","CX","","_","_"
9,"ṣmā","_","_","sma","CX","","_","_"
10,"vṛṣaṇāv","_","_","vṛṣan","NC","","_","_"
11,"antidevam","_","_","antideva","JJ","","_","_"
1,"yuvāṃ","_","_","tvat","PPR","","_","_"
2,"_","_","_","cit","CEM","","_","_"
3,"_","_","_","hi","CX","","_","_"
4,"_","_","_","sma","CX","","_","_"
5,"_","_","_","aśvin","NC","","_","_"
6,"anu","_","_","anu","CADP","","_","_"
7,"dyūn","_","_","div","NC","","_","_"
8,"virudrasya","_","_","virudra","JJ","","_","_"
9,"prasravaṇasya","_","_","prasravaṇa","NC","","_","_"
10,"sātau","_","_","sāti","NC","","_","_"
1,"agastyo","_","_","agastya","NC","","_","_"
2,"narāṃ","_","_","nṛ","NC","","_","_"
3,"nṛṣu","_","_","nṛ","NC","","_","_"
4,"praśastaḥ","_","_","praśaṃs","PPP","","_","_"
5,"_","_","_","kārādhunī","NC","","_","_"
6,"_","_","_","iva","CCM","","_","_"
7,"citayat","_","_","citay","V","citay","_","_"
8,"sahasraiḥ","_","_","sahasra","NUM","","_","_"
1,"pra","_","_","pra","CADP","","_","_"
2,"yad","_","_","yat","CSB","","_","_"
3,"vahethe","_","_","vah","V","vah","_","_"
4,"mahinā","_","_","mahina","NC","","_","_"
5,"rathasya","_","_","ratha","NC","","_","_"
6,"pra","_","_","pra","CADP","","_","_"
7,"syandrā","_","_","syandra","JJ","","_","_"
8,"yātho","_","_","yā","V","yā","_","_"
9,"manuṣo","_","_","manus","NC","","_","_"
10,"na","_","_","na","CNG","","_","_"
11,"hotā","_","_","hotṛ","NC","","_","_"
1,"dhattaṃ","_","_","dadh","V","dhā","_","_"
2,"sūribhya","_","_","sūri","NC","","_","_"
3,"uta","_","_","uta","CCD","","_","_"
4,"vā","_","_","vā","CCD","","_","_"
5,"_","_","_","su","CAD","","_","_"
6,"_","_","_","aśvya","NC","","_","_"
7,"nāsatyā","_","_","nāsatya","NC","","_","_"
8,"rayiṣācaḥ","_","_","rayiṣac","JJ","","_","_"
9,"syāma","_","_","as","V","as","_","_"
1,"taṃ","_","_","tad","PRD","","_","_"
2,"vāṃ","_","_","tvat","PPR","","_","_"
3,"rathaṃ","_","_","ratha","NC","","_","_"
4,"vayam","_","_","mat","PPR","","_","_"
5,"adyā","_","_","adya","CX","","_","_"
6,"huvema","_","_","hve","V","hve","_","_"
7,"stomair","_","_","stoma","NC","","_","_"
8,"aśvinā","_","_","aśvin","NC","","_","_"
9,"suvitāya","_","_","suvita","NC","","_","_"
10,"navyam","_","_","navya","JJ","","_","_"
1,"a","_","_","alpha_privativum","JJ","","_","_"
1,"_","_","_","riṣṭa","JJ","","_","_"
2,"_","_","_","nemi","NC","","_","_"
3,"pari","_","_","pari","CADP","","_","_"
4,"dyām","_","_","div","NC","","_","_"
5,"iyānaṃ","_","_","i","KDP","","_","_"
6,"_","_","_","vid","V","vid","_","_"
7,"_","_","_","iṣa","JJ","","_","_"
8,"vṛjanaṃ","_","_","vṛjana","NC","","_","_"
9,"_","_","_","jīra","JJ","","_","_"
10,"_","_","_","dānu","NC","","_","_"
