"WordID","word","NormSTEM","suffix","lemma","PoS","Root","NormSuffix","NormWord"
1,"yathā","_","_","yathā","CCM","","_","_"
2,"mano","_","_","manas","NC","","_","_"
3,"manasketaiḥ","_","_","manasketa","NC","","_","_"
4,"parāpataty","_","_","parāpat","V","parāpat","_","_"
5,"āśumat","_","_","āśumat","JJ","","_","_"
1,"evā","_","_","eva","CEM","","_","_"
2,"tvaṃ","_","_","tvat","PPR","","_","_"
3,"kāse","_","_","kāsā","NC","","_","_"
4,"pra","_","_","pra","CADP","","_","_"
5,"pata","_","_","pat","V","pat","_","_"
6,"manaso","_","_","manas","NC","","_","_"
7,"'nu","_","_","anu","CADP","","_","_"
8,"pravāyyam","_","_","pravāyya","NC","","_","_"
1,"yathā","_","_","yathā","CCM","","_","_"
2,"bāṇaḥ","_","_","bāṇa","NC","","_","_"
3,"_","_","_","su","CAD","","_","_"
4,"_","_","_","saṃśā","PPP","","_","_"
5,"parāpataty","_","_","parāpat","V","parāpat","_","_"
6,"āśumat","_","_","āśumat","JJ","","_","_"
1,"evā","_","_","eva","CEM","","_","_"
2,"tvaṃ","_","_","tvat","PPR","","_","_"
3,"kāse","_","_","kāsā","NC","","_","_"
4,"pra","_","_","pra","CADP","","_","_"
5,"pata","_","_","pat","V","pat","_","_"
6,"pṛthivyā","_","_","pṛthivī","NC","","_","_"
7,"anu","_","_","anu","CADP","","_","_"
8,"saṃvatam","_","_","saṃvat","NC","","_","_"
1,"yathā","_","_","yathā","CCM","","_","_"
2,"sūryasya","_","_","sūrya","NC","","_","_"
3,"raśmayaḥ","_","_","raśmi","NC","","_","_"
4,"parāpatanty","_","_","parāpat","V","parāpat","_","_"
5,"āśumat","_","_","āśumat","JJ","","_","_"
1,"evā","_","_","eva","CEM","","_","_"
2,"tvaṃ","_","_","tvat","PPR","","_","_"
3,"kāse","_","_","kāsā","NC","","_","_"
4,"pra","_","_","pra","CADP","","_","_"
5,"pata","_","_","pat","V","pat","_","_"
6,"_","_","_","samudra","NC","","_","_"
7,"_","_","_","anu","CADP","","_","_"
8,"vikṣaram","_","_","vikṣara","NC","","_","_"
