"WordID","word","NormSTEM","suffix","lemma","PoS","Root","NormSuffix","NormWord"
1,"pra","_","_","pra","CADP","","_","_"
2,"te","_","_","tvat","PPR","","_","_"
3,"dhārā","_","_","dhārā","NC","","_","_"
4,"asaścato","_","_","asaścat","JJ","","_","_"
5,"divo","_","_","div","NC","","_","_"
6,"na","_","_","na","CNG","","_","_"
7,"yanti","_","_","e","V","i","_","_"
8,"vṛṣṭayaḥ","_","_","vṛṣṭi","NC","","_","_"
1,"acchā","_","_","acchā","CADP","","_","_"
2,"vājaṃ","_","_","vāja","NC","","_","_"
3,"sahasriṇam","_","_","sahasrin","JJ","","_","_"
1,"abhi","_","_","abhi","CADP","","_","_"
2,"priyāṇi","_","_","priya","JJ","","_","_"
3,"kāvyā","_","_","kāvya","NC","","_","_"
4,"viśvā","_","_","viśva","JQ","","_","_"
5,"cakṣāṇo","_","_","cakṣ","KDP","","_","_"
6,"arṣati","_","_","ṛṣ","V","ṛṣ","_","_"
1,"haris","_","_","hari","JJ","","_","_"
2,"tuñjāna","_","_","tuj","KDP","","_","_"
3,"āyudhā","_","_","āyudha","NC","","_","_"
1,"sa","_","_","tad","PRD","","_","_"
2,"marmṛjāna","_","_","marmṛj","KDP","","_","_"
3,"āyubhir","_","_","āyu","NC","","_","_"
4,"ibho","_","_","ibha","NC","","_","_"
5,"_","_","_","rājan","NC","","_","_"
6,"_","_","_","iva","CCM","","_","_"
7,"suvrataḥ","_","_","suvrata","JJ","","_","_"
1,"śyeno","_","_","śya","NC","","_","_"
2,"na","_","_","na","CNG","","_","_"
3,"vaṃsu","_","_","sīd","V","sad","_","_"
1,"sa","_","_","tad","PRD","","_","_"
2,"no","_","_","mat","PPR","","_","_"
3,"viśvā","_","_","viśva","JQ","","_","_"
4,"divo","_","_","div","NC","","_","_"
5,"vasūto","_","_","pṛthivī","NC","","_","_"
6,"pṛthivyā","_","_","adhi","CADP","","_","_"
1,"punāna","_","_","pū","KDP","","_","_"
2,"indav","_","_","indu","NC","","_","_"
3,"ā","_","_","ā","CADP","","_","_"
4,"bhara","_","_","bhṛ","V","bhṛ","_","_"
