"WordID","word","NormSTEM","suffix","lemma","PoS","Root","NormSuffix","NormWord"
1,"dhṛtarāṣṭra","_","_","dhṛtarāṣṭra","NC","","_","_"
2,"uvāca","_","_","vak","V","vac","_","_"
1,"bhayaṃ","_","_","bhaya","NC","","_","_"
2,"me","_","_","mat","PPR","","_","_"
3,"_","_","_","su","CAD","","_","_"
4,"_","_","_","mahat","JJ","","_","_"
5,"_","_","_","jan","PPP","","_","_"
6,"_","_","_","vismaya","NC","","_","_"
7,"_","_","_","ca","CCD","","_","_"
8,"_","_","_","eva","CEM","","_","_"
9,"saṃjaya","_","_","saṃjaya","NC","","_","_"
1,"śrutvā","_","_","śru","CGDA","","_","_"
2,"_","_","_","pāṇḍu","NC","","_","_"
3,"_","_","_","kumāra","NC","","_","_"
4,"karma","_","_","karman","NC","","_","_"
5,"devaiḥ","_","_","deva","NC","","_","_"
6,"_","_","_","su","CAD","","_","_"
7,"_","_","_","duṣkara","JJ","","_","_"
1,"putrāṇāṃ","_","_","putra","NC","","_","_"
2,"ca","_","_","ca","CCD","","_","_"
3,"parābhavaṃ","_","_","parābhava","NC","","_","_"
4,"śrutvā","_","_","śru","CGDA","","_","_"
5,"saṃjaya","_","_","saṃjaya","NC","","_","_"
6,"sarvaśaḥ","_","_","sarvaśas","CX","","_","_"
1,"cintā","_","_","cintā","NC","","_","_"
2,"me","_","_","mat","PPR","","_","_"
3,"mahatī","_","_","mahat","JJ","","_","_"
4,"sūta","_","_","sūta","NC","","_","_"
5,"bhaviṣyati","_","_","bhav","V","bhū","_","_"
6,"kathaṃ","_","_","katha","CX","","_","_"
7,"_","_","_","tu","CCD","","_","_"
8,"_","_","_","iti","CQT","","_","_"
1,"dhruvaṃ","_","_","dhruva","CX","","_","_"
2,"_","_","_","vidura","NC","","_","_"
3,"_","_","_","vākya","NC","","_","_"
4,"dhakṣyanti","_","_","dah","V","dah","_","_"
5,"hṛdayaṃ","_","_","hṛdaya","NC","","_","_"
6,"mama","_","_","mat","PPR","","_","_"
1,"yathā","_","_","yathā","CCM","","_","_"
2,"hi","_","_","hi","CX","","_","_"
3,"dṛśyate","_","_","darś","V","dṛś","_","_"
4,"sarvaṃ","_","_","sarva","JQ","","_","_"
5,"_","_","_","daiva","NC","","_","_"
6,"_","_","_","yoga","NC","","_","_"
7,"saṃjaya","_","_","saṃjaya","NC","","_","_"
1,"yatra","_","_","yatra","CX","","_","_"
2,"_","_","_","bhīṣma","NC","","_","_"
3,"_","_","_","mukha","NC","","_","_"
4,"śūrān","_","_","śūra","NC","","_","_"
5,"_","_","_","astra","NC","","_","_"
6,"_","_","_","jña","JJ","","_","_"
7,"_","_","_","yodha","NC","","_","_"
8,"_","_","_","sattama","JJ","","_","_"
1,"pāṇḍavānām","_","_","pāṇḍava","NC","","_","_"
2,"anīkāni","_","_","anīka","NC","","_","_"
3,"yodhayanti","_","_","yodhay","V","yodhay","_","_"
4,"prahāriṇaḥ","_","_","prahārin","JJ","","_","_"
1,"_","_","_","ka","CX","","_","_"
2,"_","_","_","avadhya","JJ","","_","_"
3,"mahātmānaḥ","_","_","mahātman","JJ","","_","_"
4,"_","_","_","pāṇḍu","NC","","_","_"
5,"_","_","_","putra","NC","","_","_"
6,"_","_","_","mahat","JJ","","_","_"
7,"_","_","_","bala","NC","","_","_"
1,"kena","_","_","ka","CX","","_","_"
2,"_","_","_","dā","PPP","","_","_"
3,"_","_","_","vara","NC","","_","_"
4,"_","_","_","tāta","NC","","_","_"
5,"kiṃ","_","_","kiṃ","PRQ","","_","_"
6,"vā","_","_","vā","CCD","","_","_"
7,"jñānaṃ","_","_","jñāna","NC","","_","_"
8,"vidanti","_","_","vid","V","vid","_","_"
9,"te","_","_","tad","PRD","","_","_"
1,"yena","_","_","ya","CX","","_","_"
2,"kṣayaṃ","_","_","kṣaya","NC","","_","_"
3,"na","_","_","na","CNG","","_","_"
4,"gacchanti","_","_","gacch","V","gam","_","_"
5,"divi","_","_","div","NC","","_","_"
6,"_","_","_","tārā","NC","","_","_"
7,"_","_","_","gaṇa","NC","","_","_"
8,"iva","_","_","iva","CCM","","_","_"
1,"punaḥ","_","_","punar","CAD","","_","_"
2,"punar","_","_","punar","CAD","","_","_"
3,"na","_","_","na","CNG","","_","_"
4,"mṛṣyāmi","_","_","mṛṣ","V","mṛṣ","_","_"
5,"hataṃ","_","_","han","PPP","","_","_"
6,"sainyaṃ","_","_","sainya","NC","","_","_"
7,"sma","_","_","sma","CX","","_","_"
8,"pāṇḍavaiḥ","_","_","pāṇḍava","NC","","_","_"
1,"_","_","_","mat","PPR","","_","_"
2,"_","_","_","eva","CEM","","_","_"
3,"daṇḍaḥ","_","_","daṇḍa","NC","","_","_"
4,"patati","_","_","pat","V","pat","_","_"
5,"daivāt","_","_","daiva","NC","","_","_"
6,"_","_","_","parama","JJ","","_","_"
7,"_","_","_","dāruṇa","JJ","","_","_"
1,"_","_","_","yathā","CCM","","_","_"
2,"_","_","_","avadhya","JJ","","_","_"
3,"_","_","_","pāṇḍu","NC","","_","_"
4,"_","_","_","suta","NC","","_","_"
5,"yathā","_","_","yathā","CCM","","_","_"
6,"_","_","_","vadh","KDG","","_","_"
7,"_","_","_","ca","CCD","","_","_"
8,"me","_","_","mat","PPR","","_","_"
9,"sutāḥ","_","_","suta","NC","","_","_"
1,"_","_","_","tad","PRD","","_","_"
2,"_","_","_","mat","PPR","","_","_"
3,"sarvam","_","_","sarva","JQ","","_","_"
4,"ācakṣva","_","_","cakṣ","V","cakṣ","_","_"
5,"yathātattvena","_","_","yathātattva","CX","","_","_"
6,"saṃjaya","_","_","saṃjaya","NC","","_","_"
1,"na","_","_","na","CNG","","_","_"
2,"hi","_","_","hi","CX","","_","_"
3,"pāraṃ","_","_","pāra","NC","","_","_"
4,"prapaśyāmi","_","_","prapaś","V","prapaś","_","_"
5,"_","_","_","duḥkha","NC","","_","_"
6,"_","_","_","ida","PRD","","_","_"
7,"kathaṃcana","_","_","kathaṃcana","CX","","_","_"
1,"_","_","_","samudra","NC","","_","_"
2,"_","_","_","iva","CCM","","_","_"
3,"mahato","_","_","mahat","JJ","","_","_"
4,"bhujābhyāṃ","_","_","bhuja","NC","","_","_"
5,"_","_","_","pratṛ","KDP","","_","_"
6,"_","_","_","nara","NC","","_","_"
1,"putrāṇāṃ","_","_","putra","NC","","_","_"
2,"vyasanaṃ","_","_","vyasana","NC","","_","_"
3,"manye","_","_","man","V","man","_","_"
4,"dhruvaṃ","_","_","dhruva","JJ","","_","_"
5,"prāptaṃ","_","_","prāp","PPP","","_","_"
6,"_","_","_","su","CAD","","_","_"
7,"_","_","_","dāruṇa","JJ","","_","_"
1,"ghātayiṣyati","_","_","han","V","han","_","_"
2,"me","_","_","mat","PPR","","_","_"
3,"putrān","_","_","putra","NC","","_","_"
4,"sarvān","_","_","sarva","JQ","","_","_"
5,"bhīmo","_","_","bhīma","NC","","_","_"
6,"na","_","_","na","CNG","","_","_"
7,"saṃśayaḥ","_","_","saṃśaya","NC","","_","_"
1,"na","_","_","na","CNG","","_","_"
2,"hi","_","_","hi","CX","","_","_"
3,"paśyāmi","_","_","paś","V","paś","_","_"
4,"taṃ","_","_","tad","PRD","","_","_"
5,"vīraṃ","_","_","vīra","NC","","_","_"
6,"yo","_","_","yad","PRL","","_","_"
7,"me","_","_","mat","PPR","","_","_"
8,"rakṣet","_","_","rakṣ","V","rakṣ","_","_"
9,"sutān","_","_","suta","NC","","_","_"
10,"raṇe","_","_","raṇa","NC","","_","_"
1,"dhruvaṃ","_","_","dhruva","CX","","_","_"
2,"vināśaḥ","_","_","vināśa","NC","","_","_"
3,"samare","_","_","samara","NC","","_","_"
4,"putrāṇāṃ","_","_","putra","NC","","_","_"
5,"mama","_","_","mat","PPR","","_","_"
6,"saṃjaya","_","_","saṃjaya","NC","","_","_"
1,"_","_","_","tasmāt","CX","","_","_"
2,"_","_","_","mat","PPR","","_","_"
3,"kāraṇaṃ","_","_","kāraṇa","NC","","_","_"
4,"sūta","_","_","sūta","NC","","_","_"
5,"yuktiṃ","_","_","yukti","NC","","_","_"
6,"_","_","_","ca","CCD","","_","_"
7,"_","_","_","eva","CEM","","_","_"
8,"viśeṣataḥ","_","_","viśeṣataḥ","CX","","_","_"
1,"pṛcchato","_","_","pracch","KDP","","_","_"
2,"'dya","_","_","adya","CX","","_","_"
3,"yathātattvaṃ","_","_","yathātattva","CX","","_","_"
4,"sarvam","_","_","sarva","JQ","","_","_"
5,"ākhyātum","_","_","ākhyā","CGDI","","_","_"
6,"arhasi","_","_","arh","V","arh","_","_"
1,"duryodhano","_","_","duryodhana","NC","","_","_"
2,"'pi","_","_","api","CX","","_","_"
3,"_","_","_","yad","PRL","","_","_"
4,"_","_","_","kar","V","kṛ","_","_"
5,"dṛṣṭvā","_","_","dṛś","CGDA","","_","_"
6,"svān","_","_","sva","JJ","","_","_"
7,"vimukhān","_","_","vimukha","JJ","","_","_"
8,"raṇe","_","_","raṇa","NC","","_","_"
1,"_","_","_","bhīṣma","NC","","_","_"
2,"_","_","_","droṇa","NC","","_","_"
3,"_","_","_","kṛpa","NC","","_","_"
4,"_","_","_","ca","CCD","","_","_"
5,"_","_","_","eva","CEM","","_","_"
6,"saubaleyo","_","_","saubaleya","NC","","_","_"
7,"jayadrathaḥ","_","_","jayadratha","NC","","_","_"
1,"drauṇir","_","_","drauṇi","NC","","_","_"
2,"_","_","_","vā","CCD","","_","_"
3,"_","_","_","api","CX","","_","_"
4,"_","_","_","mahat","JJ","","_","_"
5,"_","_","_","iṣvāsa","NC","","_","_"
6,"vikarṇo","_","_","vikarṇa","NC","","_","_"
7,"vā","_","_","vā","CCD","","_","_"
8,"_","_","_","mahat","JJ","","_","_"
9,"_","_","_","bala","NC","","_","_"
1,"niścayo","_","_","niścaya","NC","","_","_"
2,"_","_","_","vā","CCD","","_","_"
3,"_","_","_","api","CX","","_","_"
4,"_","_","_","kiṃ","PRQ","","_","_"
5,"_","_","_","tad","PRD","","_","_"
6,"tadā","_","_","tadā","CAD","","_","_"
7,"_","_","_","hi","CX","","_","_"
8,"_","_","_","as","V","as","_","_"
9,"_","_","_","mahātman","JJ","","_","_"
1,"vimukheṣu","_","_","vimukha","JJ","","_","_"
2,"_","_","_","mahat","JJ","","_","_"
3,"_","_","_","prājña","JJ","","_","_"
4,"mama","_","_","mat","PPR","","_","_"
5,"putreṣu","_","_","putra","NC","","_","_"
6,"saṃjaya","_","_","saṃjaya","NC","","_","_"
1,"saṃjaya","_","_","saṃjaya","NC","","_","_"
2,"uvāca","_","_","vak","V","vac","_","_"
1,"śṛṇu","_","_","śṛṇ","V","śru","_","_"
2,"rājann","_","_","rājan","NC","","_","_"
3,"avahitaḥ","_","_","avahita","JJ","","_","_"
4,"śrutvā","_","_","śru","CGDA","","_","_"
5,"_","_","_","ca","CCD","","_","_"
6,"_","_","_","eva","CEM","","_","_"
7,"_","_","_","avadhāray","V","avadhāray","_","_"
1,"_","_","_","na","CNG","","_","_"
2,"_","_","_","eva","CEM","","_","_"
3,"_","_","_","mantra","NC","","_","_"
4,"_","_","_","kṛ","PPP","","_","_"
5,"kiṃcin","_","_","kiṃcit","PRI","","_","_"
6,"_","_","_","na","CNG","","_","_"
7,"_","_","_","eva","CEM","","_","_"
8,"māyāṃ","_","_","māyā","NC","","_","_"
9,"tathāvidhām","_","_","tathāvidha","JJ","","_","_"
1,"na","_","_","na","CNG","","_","_"
2,"vai","_","_","vai","CX","","_","_"
3,"vibhīṣikāṃ","_","_","vibhīṣikā","NC","","_","_"
4,"kāṃcid","_","_","kiṃcit","PRI","","_","_"
5,"rājan","_","_","rājan","NC","","_","_"
6,"kurvanti","_","_","kar","V","kṛ","_","_"
7,"pāṇḍavāḥ","_","_","pāṇḍava","NC","","_","_"
1,"yudhyanti","_","_","yudh","V","yudh","_","_"
2,"te","_","_","tad","PRD","","_","_"
3,"yathānyāyaṃ","_","_","yathānyāya","CX","","_","_"
4,"_","_","_","śaktimat","JJ","","_","_"
5,"_","_","_","ca","CCD","","_","_"
6,"saṃyuge","_","_","saṃyuga","NC","","_","_"
1,"dharmeṇa","_","_","dharma","NC","","_","_"
2,"_","_","_","sarva","JQ","","_","_"
3,"_","_","_","kārya","NC","","_","_"
4,"_","_","_","kīrtay","PPP","","_","_"
5,"_","_","_","iti","CQT","","_","_"
6,"bhārata","_","_","bhārata","NC","","_","_"
1,"ārabhante","_","_","ārambh","V","ārambh","_","_"
2,"sadā","_","_","sadā","CAD","","_","_"
3,"pārthāḥ","_","_","pārtha","NC","","_","_"
4,"prārthayānā","_","_","prārthay","KDP","","_","_"
5,"mahad","_","_","mahat","JJ","","_","_"
6,"yaśaḥ","_","_","yaśas","NC","","_","_"
1,"na","_","_","na","CNG","","_","_"
2,"te","_","_","tad","PRD","","_","_"
3,"_","_","_","yuddha","NC","","_","_"
4,"_","_","_","nivart","V","nivṛt","_","_"
5,"_","_","_","dharma","NC","","_","_"
6,"_","_","_","upe","PPP","","_","_"
7,"_","_","_","mahat","JJ","","_","_"
8,"_","_","_","bala","NC","","_","_"
1,"śriyā","_","_","śrī","NC","","_","_"
2,"paramayā","_","_","parama","JJ","","_","_"
3,"yuktā","_","_","yuj","PPP","","_","_"
4,"yato","_","_","yatas","CX","","_","_"
5,"_","_","_","dharma","NC","","_","_"
6,"_","_","_","tatas","CX","","_","_"
7,"jayaḥ","_","_","jaya","NC","","_","_"
1,"_","_","_","ta","CX","","_","_"
2,"_","_","_","avadhya","JJ","","_","_"
3,"raṇe","_","_","raṇa","NC","","_","_"
4,"pārthā","_","_","pārtha","NC","","_","_"
5,"_","_","_","jaya","NC","","_","_"
6,"_","_","_","yuj","PPP","","_","_"
7,"_","_","_","ca","CCD","","_","_"
8,"pārthiva","_","_","pārthiva","NC","","_","_"
1,"tava","_","_","tvat","PPR","","_","_"
2,"putrā","_","_","putra","NC","","_","_"
3,"durātmānaḥ","_","_","durātman","JJ","","_","_"
4,"_","_","_","pāpa","NC","","_","_"
5,"_","_","_","abhira","PPP","","_","_"
6,"sadā","_","_","sadā","CAD","","_","_"
1,"niṣṭhurā","_","_","niṣṭhura","JJ","","_","_"
2,"_","_","_","hā","PPP","","_","_"
3,"_","_","_","karman","NC","","_","_"
4,"_","_","_","ta","CX","","_","_"
5,"hīyanti","_","_","jah","V","hā","_","_"
6,"saṃyuge","_","_","saṃyuga","NC","","_","_"
1,"_","_","_","su","CAD","","_","_"
2,"_","_","_","bahu","JJ","","_","_"
3,"nṛśaṃsāni","_","_","nṛśaṃsa","JJ","","_","_"
4,"_","_","_","putra","NC","","_","_"
5,"_","_","_","tvat","PPR","","_","_"
6,"janeśvara","_","_","janeśvara","NC","","_","_"
1,"_","_","_","nikṛta","JJ","","_","_"
2,"_","_","_","iha","CAD","","_","_"
3,"pāṇḍūnāṃ","_","_","pāṇḍu","NC","","_","_"
4,"nīcair","_","_","nīca","JJ","","_","_"
5,"iva","_","_","iva","CCM","","_","_"
6,"yathā","_","_","yathā","CCM","","_","_"
7,"naraiḥ","_","_","nara","NC","","_","_"
1,"sarvaṃ","_","_","sarva","JQ","","_","_"
2,"ca","_","_","ca","CCD","","_","_"
3,"tad","_","_","tad","PRD","","_","_"
4,"anādṛtya","_","_","anādṛtya","CX","","_","_"
5,"putrāṇāṃ","_","_","putra","NC","","_","_"
6,"tava","_","_","tvat","PPR","","_","_"
7,"kilbiṣam","_","_","kilbiṣa","NC","","_","_"
1,"_","_","_","sa_saha","CX","","_","_"
2,"_","_","_","apahnava","NC","","_","_"
3,"_","_","_","sadā","CAD","","_","_"
4,"_","_","_","eva","CEM","","_","_"
5,"_","_","_","as","V","as","_","_"
6,"pāṇḍavāḥ","_","_","pāṇḍava","NC","","_","_"
7,"_","_","_","pāṇḍu","NC","","_","_"
8,"_","_","_","pūrvaja","NC","","_","_"
1,"na","_","_","na","CNG","","_","_"
2,"_","_","_","ca","CCD","","_","_"
3,"_","_","_","a","PRD","","_","_"
4,"bahu","_","_","bahu","JJ","","_","_"
5,"manyante","_","_","man","V","man","_","_"
6,"_","_","_","putra","NC","","_","_"
7,"_","_","_","tvat","PPR","","_","_"
8,"viśāṃ","_","_","viś","NC","","_","_"
9,"pate","_","_","pati","NC","","_","_"
1,"tasya","_","_","tad","PRD","","_","_"
2,"pāpasya","_","_","pāpa","JJ","","_","_"
3,"satataṃ","_","_","satata","CX","","_","_"
4,"kriyamāṇasya","_","_","kṛ","KDP","","_","_"
5,"karmaṇaḥ","_","_","karman","NC","","_","_"
1,"samprāptaṃ","_","_","samprāp","PPP","","_","_"
2,"_","_","_","su","CAD","","_","_"
3,"_","_","_","mahat","JJ","","_","_"
4,"ghoraṃ","_","_","ghora","JJ","","_","_"
5,"phalaṃ","_","_","phala","NC","","_","_"
6,"_","_","_","kimpāka","JJ","","_","_"
7,"_","_","_","saṃnibha","JJ","","_","_"
1,"sa","_","_","tad","PRD","","_","_"
2,"tad","_","_","tad","PRD","","_","_"
3,"bhuṅkṣva","_","_","bhuj","V","bhuj","_","_"
4,"_","_","_","mahat","JJ","","_","_"
5,"_","_","_","rāja","NC","","_","_"
6,"_","_","_","sa_saha","CX","","_","_"
7,"_","_","_","putra","NC","","_","_"
8,"_","_","_","sa_saha","CX","","_","_"
9,"_","_","_","suhṛd","NC","","_","_"
10,"_","_","_","jana","NC","","_","_"
1,"_","_","_","na","CNG","","_","_"
2,"_","_","_","avabodh","V","avabudh","_","_"
3,"yad","_","_","yad","PRL","","_","_"
4,"rājan","_","_","rājan","NC","","_","_"
5,"vāryamāṇaḥ","_","_","vāray","KDP","","_","_"
6,"_","_","_","suhṛd","NC","","_","_"
7,"_","_","_","jana","NC","","_","_"
1,"_","_","_","vidura","NC","","_","_"
2,"_","_","_","atha","CAD","","_","_"
3,"bhīṣmeṇa","_","_","bhīṣma","NC","","_","_"
4,"droṇena","_","_","droṇa","NC","","_","_"
5,"ca","_","_","ca","CCD","","_","_"
6,"mahātmanā","_","_","mahātman","JJ","","_","_"
1,"tathā","_","_","tathā","CX","","_","_"
2,"mayā","_","_","mat","PPR","","_","_"
3,"_","_","_","ca","CCD","","_","_"
4,"_","_","_","api","CX","","_","_"
5,"a","_","_","alpha_privativum","CX","","_","_"
5,"_","_","_","sakṛt","CX","","_","_"
6,"vāryamāṇo","_","_","vāray","KDP","","_","_"
7,"na","_","_","na","CNG","","_","_"
8,"gṛhṇasi","_","_","grah","V","grah","_","_"
1,"vākyaṃ","_","_","vākya","NC","","_","_"
2,"hitaṃ","_","_","hita","JJ","","_","_"
3,"ca","_","_","ca","CCD","","_","_"
4,"pathyaṃ","_","_","pathya","JJ","","_","_"
5,"ca","_","_","ca","CCD","","_","_"
6,"martyaḥ","_","_","martya","NC","","_","_"
7,"pathyam","_","_","pathya","JJ","","_","_"
8,"_","_","_","iva","CCM","","_","_"
9,"_","_","_","auṣadha","NC","","_","_"
1,"putrāṇāṃ","_","_","putra","NC","","_","_"
2,"matam","_","_","mata","NC","","_","_"
3,"āsthāya","_","_","āsthā","CGDA","","_","_"
4,"_","_","_","ji","PPP","","_","_"
5,"_","_","_","man","V","man","_","_"
6,"pāṇḍavān","_","_","pāṇḍava","NC","","_","_"
1,"śṛṇu","_","_","śṛṇ","V","śru","_","_"
2,"bhūyo","_","_","bhūyas","CX","","_","_"
3,"yathātattvaṃ","_","_","yathātattva","CX","","_","_"
4,"_","_","_","yad","PRL","","_","_"
5,"_","_","_","mat","PPR","","_","_"
6,"tvaṃ","_","_","tvat","PPR","","_","_"
7,"paripṛcchasi","_","_","paripṛcch","V","pariprach","_","_"
1,"kāraṇaṃ","_","_","kāraṇa","NC","","_","_"
2,"_","_","_","bharata","NC","","_","_"
3,"_","_","_","śreṣṭha","JJ","","_","_"
4,"pāṇḍavānāṃ","_","_","pāṇḍava","NC","","_","_"
5,"jayaṃ","_","_","jaya","NC","","_","_"
6,"prati","_","_","prati","CADP","","_","_"
1,"tat","_","_","tad","PRD","","_","_"
2,"te","_","_","tvat","PPR","","_","_"
3,"'haṃ","_","_","mat","PPR","","_","_"
4,"kathayiṣyāmi","_","_","kath","V","kath","_","_"
5,"yathāśrutam","_","_","yathāśruta","JJ","","_","_"
6,"ariṃdama","_","_","ariṃdama","JJ","","_","_"
1,"duryodhanena","_","_","duryodhana","NC","","_","_"
2,"saṃpṛṣṭa","_","_","sampracch","PPP","","_","_"
3,"etam","_","_","tad","PRD","","_","_"
4,"arthaṃ","_","_","artha","NC","","_","_"
5,"pitāmahaḥ","_","_","pitāmaha","NC","","_","_"
1,"dṛṣṭvā","_","_","dṛś","CGDA","","_","_"
2,"bhrātṝn","_","_","bhrātṛ","NC","","_","_"
3,"raṇe","_","_","raṇa","NC","","_","_"
4,"_","_","_","sarva","JQ","","_","_"
5,"_","_","_","nirji","PPP","","_","_"
6,"_","_","_","su","CAD","","_","_"
7,"_","_","_","mahat","JJ","","_","_"
8,"_","_","_","ratha","NC","","_","_"
1,"_","_","_","śoka","NC","","_","_"
2,"_","_","_","sammuh","PPP","","_","_"
3,"_","_","_","hṛdaya","NC","","_","_"
4,"_","_","_","niśā","NC","","_","_"
5,"_","_","_","kāla","NC","","_","_"
6,"sma","_","_","sma","CX","","_","_"
7,"kauravaḥ","_","_","kaurava","NC","","_","_"
1,"pitāmahaṃ","_","_","pitāmaha","NC","","_","_"
2,"_","_","_","mahat","JJ","","_","_"
3,"_","_","_","prājña","JJ","","_","_"
4,"_","_","_","vinaya","NC","","_","_"
5,"_","_","_","upaga","CGDA","","_","_"
6,"ha","_","_","ha","CEM","","_","_"
1,"yad","_","_","yad","PRL","","_","_"
2,"abravīt","_","_","abravīta","V","brū","_","_"
3,"_","_","_","suta","NC","","_","_"
4,"_","_","_","tvat","PPR","","_","_"
5,"'sau","_","_","adas","PRD","","_","_"
6,"_","_","_","tad","PRD","","_","_"
7,"_","_","_","mat","PPR","","_","_"
8,"śṛṇu","_","_","śṛṇ","V","śru","_","_"
9,"janeśvara","_","_","janeśvara","NC","","_","_"
1,"duryodhana","_","_","duryodhana","NC","","_","_"
2,"uvāca","_","_","vak","V","vac","_","_"
1,"tvaṃ","_","_","tvat","PPR","","_","_"
2,"ca","_","_","ca","CCD","","_","_"
3,"_","_","_","droṇa","NC","","_","_"
4,"_","_","_","ca","CCD","","_","_"
5,"_","_","_","śalya","NC","","_","_"
6,"_","_","_","ca","CCD","","_","_"
7,"kṛpo","_","_","kṛpa","NC","","_","_"
8,"_","_","_","drauṇi","NC","","_","_"
9,"_","_","_","tathā","CX","","_","_"
10,"_","_","_","eva","CEM","","_","_"
11,"ca","_","_","ca","CCD","","_","_"
1,"kṛtavarmā","_","_","kṛtavarman","NC","","_","_"
2,"ca","_","_","ca","CCD","","_","_"
3,"hārdikyaḥ","_","_","hārdikya","NC","","_","_"
4,"_","_","_","kāmboja","NC","","_","_"
5,"_","_","_","ca","CCD","","_","_"
6,"sudakṣiṇaḥ","_","_","sudakṣiṇa","NC","","_","_"
1,"bhūriśravā","_","_","bhūriśravas","NC","","_","_"
2,"_","_","_","vikarṇa","NC","","_","_"
3,"_","_","_","ca","CCD","","_","_"
4,"_","_","_","bhagadatta","NC","","_","_"
5,"_","_","_","ca","CCD","","_","_"
6,"vīryavān","_","_","vīryavat","JJ","","_","_"
1,"_","_","_","mahat","JJ","","_","_"
2,"_","_","_","ratha","NC","","_","_"
3,"samākhyātāḥ","_","_","samākhyā","PPP","","_","_"
4,"_","_","_","kula","NC","","_","_"
5,"_","_","_","putra","NC","","_","_"
6,"_","_","_","tanutyaj","JJ","","_","_"
1,"trayāṇām","_","_","tri","NUM","","_","_"
2,"api","_","_","api","CX","","_","_"
3,"lokānāṃ","_","_","loka","NC","","_","_"
4,"paryāptā","_","_","paryāp","PPP","","_","_"
5,"iti","_","_","iti","CQT","","_","_"
6,"me","_","_","mat","PPR","","_","_"
7,"matiḥ","_","_","mati","NC","","_","_"
1,"pāṇḍavānāṃ","_","_","pāṇḍava","NC","","_","_"
2,"_","_","_","samasta","JJ","","_","_"
3,"_","_","_","ca","CCD","","_","_"
4,"na","_","_","na","CNG","","_","_"
5,"tiṣṭhanti","_","_","tiṣṭh","V","sthā","_","_"
6,"parākrame","_","_","parākrama","NC","","_","_"
1,"tatra","_","_","tatra","CAD","","_","_"
2,"me","_","_","mat","PPR","","_","_"
3,"saṃśayo","_","_","saṃśaya","NC","","_","_"
4,"_","_","_","jan","PPP","","_","_"
5,"_","_","_","tad","PRD","","_","_"
6,"_","_","_","mat","PPR","","_","_"
7,"_","_","_","ācakṣ","V","ācakṣ","_","_"
8,"pṛcchataḥ","_","_","pracch","KDP","","_","_"
1,"yaṃ","_","_","yad","PRL","","_","_"
2,"samāśritya","_","_","samāśri","CGDA","","_","_"
3,"kaunteyā","_","_","kaunteya","NC","","_","_"
4,"_","_","_","jay","V","ji","_","_"
5,"_","_","_","mat","PPR","","_","_"
6,"pade","_","_","pada","NC","","_","_"
7,"pade","_","_","pada","NC","","_","_"
1,"bhīṣma","_","_","bhīṣma","NC","","_","_"
2,"uvāca","_","_","vak","V","vac","_","_"
1,"śṛṇu","_","_","śṛṇ","V","śru","_","_"
2,"rājan","_","_","rājan","NC","","_","_"
3,"vaco","_","_","vacas","NC","","_","_"
4,"mahyaṃ","_","_","mat","PPR","","_","_"
5,"yat","_","_","yad","PRL","","_","_"
6,"tvāṃ","_","_","tvat","PPR","","_","_"
7,"vakṣyāmi","_","_","vak","V","vac","_","_"
8,"kaurava","_","_","kaurava","NC","","_","_"
1,"_","_","_","bahuśas","CX","","_","_"
2,"_","_","_","ca","CCD","","_","_"
3,"_","_","_","mat","PPR","","_","_"
4,"_","_","_","vac","PPP","","_","_"
5,"'si","_","_","as","V","as","_","_"
6,"na","_","_","na","CNG","","_","_"
7,"ca","_","_","ca","CCD","","_","_"
8,"me","_","_","mat","PPR","","_","_"
9,"_","_","_","tad","PRD","","_","_"
10,"_","_","_","tvat","PPR","","_","_"
11,"kṛtam","_","_","kṛ","PPP","","_","_"
1,"kriyatāṃ","_","_","kar","V","kṛ","_","_"
2,"pāṇḍavaiḥ","_","_","pāṇḍava","NC","","_","_"
3,"sārdhaṃ","_","_","sārdha","CX","","_","_"
4,"śamo","_","_","śama","NC","","_","_"
5,"_","_","_","bharata","NC","","_","_"
6,"_","_","_","sattama","JJ","","_","_"
1,"etat","_","_","tad","PRD","","_","_"
2,"kṣamam","_","_","kṣama","JJ","","_","_"
3,"ahaṃ","_","_","mat","PPR","","_","_"
4,"manye","_","_","man","V","man","_","_"
5,"_","_","_","pṛthivī","NC","","_","_"
6,"_","_","_","tvat","PPR","","_","_"
7,"_","_","_","ca","CCD","","_","_"
8,"_","_","_","abhibhu","JJ","","_","_"
1,"_","_","_","bhuj","V","bhuj","_","_"
2,"_","_","_","ida","PRD","","_","_"
3,"pṛthivīṃ","_","_","pṛthivī","NC","","_","_"
4,"rājan","_","_","rājan","NC","","_","_"
5,"bhrātṛbhiḥ","_","_","bhrātṛ","NC","","_","_"
6,"sahitaḥ","_","_","sahita","JJ","","_","_"
7,"sukhī","_","_","sukhin","JJ","","_","_"
1,"_","_","_","durhṛd","NC","","_","_"
2,"_","_","_","tāpay","KDP","","_","_"
3,"_","_","_","sarva","JQ","","_","_"
4,"_","_","_","nanday","KDP","","_","_"
5,"_","_","_","ca","CCD","","_","_"
6,"_","_","_","api","CX","","_","_"
7,"bāndhavān","_","_","bāndhava","NC","","_","_"
1,"na","_","_","na","CNG","","_","_"
2,"ca","_","_","ca","CCD","","_","_"
3,"me","_","_","mat","PPR","","_","_"
4,"_","_","_","kruś","KDP","","_","_"
5,"_","_","_","tāta","NC","","_","_"
6,"śrutavān","_","_","śru","KDP","","_","_"
7,"asi","_","_","as","V","as","_","_"
8,"vai","_","_","vai","CX","","_","_"
9,"purā","_","_","purā","CX","","_","_"
1,"tad","_","_","tad","PRD","","_","_"
2,"idaṃ","_","_","ida","PRD","","_","_"
3,"samanuprāptaṃ","_","_","samanuprāp","PPP","","_","_"
4,"yat","_","_","yat","CSB","","_","_"
5,"pāṇḍūn","_","_","pāṇḍu","NC","","_","_"
6,"avamanyase","_","_","avaman","V","avaman","_","_"
1,"_","_","_","yad","PRL","","_","_"
2,"_","_","_","ca","CCD","","_","_"
3,"hetur","_","_","hetu","NC","","_","_"
4,"_","_","_","avadhya","JJ","","_","_"
6,"teṣām","_","_","tad","PRD","","_","_"
7,"a","_","_","alpha_privativum","JJ","","_","_"
7,"_","_","_","kliṣṭa","JJ","","_","_"
8,"_","_","_","karman","NC","","_","_"
1,"taṃ","_","_","tad","PRD","","_","_"
2,"śṛṇuṣva","_","_","śṛṇ","V","śru","_","_"
3,"_","_","_","mahat","JJ","","_","_"
4,"_","_","_","rāja","NC","","_","_"
5,"mama","_","_","mat","PPR","","_","_"
6,"kīrtayataḥ","_","_","kīrtay","KDP","","_","_"
7,"prabho","_","_","prabhu","NC","","_","_"
1,"_","_","_","na","CNG","","_","_"
2,"_","_","_","as","V","as","_","_"
3,"lokeṣu","_","_","loka","NC","","_","_"
4,"tad","_","_","tad","PRD","","_","_"
5,"bhūtaṃ","_","_","bhūta","NC","","_","_"
6,"bhavitā","_","_","bhav","V","bhū","_","_"
7,"no","_","_","no","CX","","_","_"
8,"bhaviṣyati","_","_","bhav","V","bhū","_","_"
1,"yo","_","_","yad","PRL","","_","_"
2,"jayet","_","_","jay","V","ji","_","_"
3,"pāṇḍavān","_","_","pāṇḍava","NC","","_","_"
4,"saṃkhye","_","_","saṃkhya","NC","","_","_"
5,"pālitāñ","_","_","pālay","PPP","","_","_"
6,"śārṅgadhanvanā","_","_","śārṅgadhanvan","NC","","_","_"
1,"yat","_","_","yad","PRL","","_","_"
2,"tu","_","_","tu","CCD","","_","_"
3,"me","_","_","mat","PPR","","_","_"
4,"kathitaṃ","_","_","kathay","PPP","","_","_"
5,"tāta","_","_","tāta","NC","","_","_"
6,"munibhir","_","_","muni","NC","","_","_"
7,"bhāvitātmabhiḥ","_","_","bhāvitātman","JJ","","_","_"
1,"_","_","_","purāṇa","NC","","_","_"
2,"_","_","_","gā","PPP","","_","_"
3,"_","_","_","dharma","NC","","_","_"
4,"_","_","_","jña","JJ","","_","_"
5,"_","_","_","tad","PRD","","_","_"
6,"_","_","_","śṛṇ","V","śru","_","_"
7,"yathātatham","_","_","yathātatha","JJ","","_","_"
1,"purā","_","_","purā","CX","","_","_"
2,"kila","_","_","kila","CX","","_","_"
3,"surāḥ","_","_","sura","NC","","_","_"
4,"sarve","_","_","sarva","JQ","","_","_"
5,"_","_","_","ṛṣi","NC","","_","_"
6,"_","_","_","ca","CCD","","_","_"
7,"samāgatāḥ","_","_","samāga","PPP","","_","_"
1,"pitāmaham","_","_","pitāmaha","NC","","_","_"
2,"upāseduḥ","_","_","upāsad","V","upāsad","_","_"
3,"parvate","_","_","parvata","NC","","_","_"
4,"gandhamādane","_","_","gandhamādana","NC","","_","_"
1,"madhye","_","_","madhya","NC","","_","_"
2,"teṣāṃ","_","_","tad","PRD","","_","_"
3,"samāsīnaḥ","_","_","samās","PPP","","_","_"
4,"prajāpatir","_","_","prajāpati","NC","","_","_"
5,"apaśyata","_","_","paś","V","paś","_","_"
1,"vimānaṃ","_","_","vimāna","NC","","_","_"
2,"jājvalad","_","_","jājval","KDP","","_","_"
3,"bhāsā","_","_","bhās","NC","","_","_"
4,"sthitaṃ","_","_","sthā","PPP","","_","_"
5,"pravaram","_","_","pravara","JJ","","_","_"
6,"ambare","_","_","ambara","NC","","_","_"
1,"_","_","_","dhyāna","NC","","_","_"
2,"_","_","_","āveday","CGDA","","_","_"
3,"taṃ","_","_","tad","PRD","","_","_"
4,"brahmā","_","_","brahman","NC","","_","_"
5,"kṛtvā","_","_","kṛ","CGDA","","_","_"
6,"ca","_","_","ca","CCD","","_","_"
7,"niyato","_","_","niya","PPP","","_","_"
8,"'ñjalim","_","_","añjali","NC","","_","_"
1,"namaścakāra","_","_","namaskar","V","namaskṛ","_","_"
2,"_","_","_","hṛṣ","PPP","","_","_"
3,"_","_","_","ātman","NC","","_","_"
4,"paramaṃ","_","_","parama","JJ","","_","_"
5,"parameśvaram","_","_","parameśvara","NC","","_","_"
1,"_","_","_","ṛṣi","NC","","_","_"
2,"_","_","_","tu","CCD","","_","_"
3,"_","_","_","atha","CAD","","_","_"
4,"_","_","_","deva","NC","","_","_"
5,"_","_","_","ca","CCD","","_","_"
6,"dṛṣṭvā","_","_","dṛś","CGDA","","_","_"
7,"brahmāṇam","_","_","brahman","NC","","_","_"
8,"utthitam","_","_","utthā","PPP","","_","_"
1,"sthitāḥ","_","_","sthā","PPP","","_","_"
2,"prāñjalayaḥ","_","_","prāñjali","JJ","","_","_"
3,"sarve","_","_","sarva","JQ","","_","_"
4,"paśyanto","_","_","dṛś","KDP","","_","_"
5,"mahad","_","_","mahat","JJ","","_","_"
6,"adbhutam","_","_","adbhuta","NC","","_","_"
1,"_","_","_","yathāvat","CX","","_","_"
2,"_","_","_","ca","CCD","","_","_"
3,"tam","_","_","tad","PRD","","_","_"
4,"abhyarcya","_","_","abhyarc","CGDA","","_","_"
5,"brahmā","_","_","brahman","NC","","_","_"
6,"_","_","_","brahman","NC","","_","_"
7,"_","_","_","vid","JJ","","_","_"
8,"varaḥ","_","_","vara","JJ","","_","_"
1,"jagāda","_","_","gad","V","gad","_","_"
2,"jagataḥ","_","_","jagat","NC","","_","_"
3,"sraṣṭā","_","_","sraṣṭṛ","NC","","_","_"
4,"paraṃ","_","_","para","CX","","_","_"
5,"_","_","_","parama","JJ","","_","_"
6,"_","_","_","dharma","NC","","_","_"
7,"_","_","_","vid","JJ","","_","_"
1,"viśvāvasur","_","_","viśvāvasu","NC","","_","_"
2,"viśvamūrtir","_","_","viśvamūrti","NC","","_","_"
3,"viśveśo","_","_","viśveśa","NC","","_","_"
4,"viṣvakseno","_","_","viṣvaksa","NC","","_","_"
5,"viśvakarmā","_","_","viśvakarman","NC","","_","_"
6,"vaśī","_","_","vaśin","JJ","","_","_"
7,"ca","_","_","ca","CCD","","_","_"
1,"viśveśvaro","_","_","viśveśvara","NC","","_","_"
2,"vāsudevo","_","_","vāsudeva","NC","","_","_"
3,"'si","_","_","as","V","as","_","_"
4,"tasmād","_","_","tasmāt","CX","","_","_"
5,"_","_","_","yoga","NC","","_","_"
6,"_","_","_","ātman","NC","","_","_"
7,"daivataṃ","_","_","daivata","JJ","","_","_"
8,"tvām","_","_","tvat","PPR","","_","_"
9,"upaimi","_","_","upai","V","upe","_","_"
1,"jaya","_","_","jay","V","ji","_","_"
2,"viśva","_","_","viśva","NC","","_","_"
3,"mahādeva","_","_","mahādeva","NC","","_","_"
4,"jaya","_","_","jay","V","ji","_","_"
5,"_","_","_","loka","NC","","_","_"
6,"_","_","_","hita","NC","","_","_"
7,"rata","_","_","ra","PPP","","_","_"
1,"jaya","_","_","jay","V","ji","_","_"
2,"yogīśvara","_","_","yogīśvara","NC","","_","_"
3,"vibho","_","_","vibhu","JJ","","_","_"
4,"jaya","_","_","jay","V","ji","_","_"
5,"_","_","_","yoga","NC","","_","_"
6,"_","_","_","parāvara","JJ","","_","_"
1,"padmagarbha","_","_","padmagarbha","NC","","_","_"
2,"viśālākṣa","_","_","viśālākṣa","NC","","_","_"
3,"jaya","_","_","jay","V","ji","_","_"
4,"_","_","_","loka","NC","","_","_"
5,"_","_","_","īśvara","NC","","_","_"
6,"_","_","_","īśvara","NC","","_","_"
1,"_","_","_","bhū","PPP","","_","_"
2,"_","_","_","bhū","KDG","","_","_"
3,"_","_","_","bhū","KDP","","_","_"
4,"_","_","_","nātha","NC","","_","_"
5,"jaya","_","_","jay","V","ji","_","_"
6,"_","_","_","saumya","JJ","","_","_"
7,"_","_","_","ātmaja","NC","","_","_"
8,"_","_","_","ātmaja","NC","","_","_"
1,"_","_","_","asaṃkhyeya","JJ","","_","_"
2,"_","_","_","guṇa","NC","","_","_"
3,"_","_","_","ajeya","JJ","","_","_"
4,"jaya","_","_","jay","V","ji","_","_"
5,"_","_","_","sarva","JQ","","_","_"
6,"_","_","_","parāyaṇa","NC","","_","_"
1,"nārāyaṇa","_","_","nārāyaṇa","NC","","_","_"
2,"_","_","_","su","CAD","","_","_"
3,"_","_","_","duṣpāra","JJ","","_","_"
4,"jaya","_","_","jay","V","ji","_","_"
5,"_","_","_","śārṅga","NC","","_","_"
6,"_","_","_","dhanus","NC","","_","_"
7,"_","_","_","dhara","JJ","","_","_"
1,"_","_","_","sarva","JQ","","_","_"
2,"_","_","_","guhya","NC","","_","_"
3,"_","_","_","guṇa","NC","","_","_"
4,"_","_","_","upe","PPP","","_","_"
5,"viśvamūrte","_","_","viśvamūrti","NC","","_","_"
6,"nirāmaya","_","_","nirāmaya","JJ","","_","_"
1,"viśveśvara","_","_","viśveśvara","NC","","_","_"
2,"mahābāho","_","_","mahābāhu","NC","","_","_"
3,"jaya","_","_","jay","V","ji","_","_"
4,"_","_","_","loka","NC","","_","_"
5,"_","_","_","artha","NC","","_","_"
6,"_","_","_","tatpara","JJ","","_","_"
1,"mahoraga","_","_","mahoraga","NC","","_","_"
2,"_","_","_","varāha","NC","","_","_"
3,"_","_","_","ādya","JJ","","_","_"
4,"harikeśa","_","_","harikeśa","NC","","_","_"
5,"vibho","_","_","vibhu","JJ","","_","_"
6,"jaya","_","_","jay","V","ji","_","_"
1,"harivāsa","_","_","harivāsa","NC","","_","_"
2,"_","_","_","viś","NC","","_","_"
3,"_","_","_","īśa","NC","","_","_"
4,"_","_","_","viśvāvāsa","NC","","_","_"
5,"_","_","_","amita","JJ","","_","_"
6,"_","_","_","avyaya","JJ","","_","_"
1,"_","_","_","vyakta","JJ","","_","_"
2,"_","_","_","avyakta","JJ","","_","_"
3,"_","_","_","amita","JJ","","_","_"
4,"_","_","_","sthāna","NC","","_","_"
5,"_","_","_","niya","PPP","","_","_"
6,"_","_","_","indriya","NC","","_","_"
7,"_","_","_","sa_saha","CX","","_","_"
8,"_","_","_","indriya","NC","","_","_"
1,"_","_","_","asaṃkhyeya","JJ","","_","_"
2,"_","_","_","ātman","NC","","_","_"
3,"_","_","_","bhāva","NC","","_","_"
4,"_","_","_","jña","JJ","","_","_"
5,"jaya","_","_","jay","V","ji","_","_"
6,"gambhīra","_","_","gambhīra","JJ","","_","_"
7,"_","_","_","kāma","NC","","_","_"
8,"_","_","_","da","JJ","","_","_"
1,"ananta","_","_","ananta","JJ","","_","_"
2,"_","_","_","vid","PPP","","_","_"
3,"_","_","_","prajñā","NC","","_","_"
4,"nityaṃ","_","_","nitya","CX","","_","_"
5,"_","_","_","bhūta","NC","","_","_"
6,"_","_","_","vibhāvana","JJ","","_","_"
1,"_","_","_","kṛ","PPP","","_","_"
2,"_","_","_","kārya","NC","","_","_"
3,"kṛtaprajña","_","_","kṛtaprajña","JJ","","_","_"
4,"_","_","_","dharma","NC","","_","_"
5,"_","_","_","jña","JJ","","_","_"
6,"_","_","_","vijay","V","viji","_","_"
7,"_","_","_","ajaya","JJ","","_","_"
1,"_","_","_","guhya","JJ","","_","_"
2,"_","_","_","ātman","NC","","_","_"
3,"_","_","_","sarva","JQ","","_","_"
4,"_","_","_","bhūta","NC","","_","_"
5,"_","_","_","ātman","NC","","_","_"
6,"_","_","_","sphuṭa","JJ","","_","_"
7,"_","_","_","sambhū","PPP","","_","_"
8,"_","_","_","sambhava","NC","","_","_"
1,"_","_","_","bhūta","NC","","_","_"
2,"_","_","_","artha","NC","","_","_"
3,"_","_","_","tattva","NC","","_","_"
4,"lokeśa","_","_","lokeśa","NC","","_","_"
5,"jaya","_","_","jay","V","ji","_","_"
6,"_","_","_","bhūta","NC","","_","_"
7,"_","_","_","vibhāvana","JJ","","_","_"
1,"ātmayone","_","_","ātmayoni","NC","","_","_"
2,"mahābhāga","_","_","mahābhāga","JJ","","_","_"
3,"_","_","_","kalpa","NC","","_","_"
4,"_","_","_","saṃkṣepa","NC","","_","_"
5,"_","_","_","tatpara","JJ","","_","_"
1,"udbhāvana","_","_","udbhāvana","JJ","","_","_"
2,"manodbhāva","_","_","jay","V","ji","_","_"
3,"_","_","_","brahman","NC","","_","_"
4,"_","_","_","jana","NC","","_","_"
5,"_","_","_","priya","JJ","","_","_"
1,"_","_","_","nisarga","NC","","_","_"
2,"_","_","_","sarga","NC","","_","_"
3,"_","_","_","abhira","PPP","","_","_"
4,"_","_","_","kāma","NC","","_","_"
5,"_","_","_","īśa","NC","","_","_"
6,"parameśvara","_","_","parameśvara","NC","","_","_"
1,"_","_","_","amṛta","NC","","_","_"
2,"_","_","_","udbhava","JJ","","_","_"
3,"sadbhāva","_","_","sadbhāva","NC","","_","_"
4,"_","_","_","yuga","NC","","_","_"
5,"_","_","_","agni","NC","","_","_"
6,"_","_","_","vijaya","NC","","_","_"
7,"_","_","_","prada","JJ","","_","_"
1,"_","_","_","prajāpati","NC","","_","_"
2,"_","_","_","pati","NC","","_","_"
3,"deva","_","_","deva","NC","","_","_"
4,"padmanābha","_","_","padmanābha","NC","","_","_"
5,"_","_","_","mahat","JJ","","_","_"
6,"_","_","_","bala","NC","","_","_"
1,"_","_","_","ātman","NC","","_","_"
2,"_","_","_","bhū","PPP","","_","_"
3,"mahābhūta","_","_","mahābhūta","NC","","_","_"
4,"_","_","_","karman","NC","","_","_"
5,"_","_","_","ātman","NC","","_","_"
6,"jaya","_","_","jay","V","ji","_","_"
7,"_","_","_","karman","NC","","_","_"
8,"_","_","_","da","JJ","","_","_"
1,"pādau","_","_","pāda","NC","","_","_"
2,"tava","_","_","tvat","PPR","","_","_"
3,"dharā","_","_","dharā","NC","","_","_"
4,"devī","_","_","devī","NC","","_","_"
5,"diśo","_","_","diś","NC","","_","_"
6,"bāhur","_","_","bāhu","NC","","_","_"
7,"divaṃ","_","_","diva","NC","","_","_"
8,"śiraḥ","_","_","śiras","NC","","_","_"
1,"_","_","_","mūrti","NC","","_","_"
2,"_","_","_","tvat","PPR","","_","_"
3,"'haṃ","_","_","mat","PPR","","_","_"
4,"surāḥ","_","_","sura","NC","","_","_"
5,"_","_","_","kāya","NC","","_","_"
6,"_","_","_","candra","NC","","_","_"
7,"_","_","_","āditya","NC","","_","_"
8,"ca","_","_","ca","CCD","","_","_"
9,"cakṣuṣī","_","_","cakṣus","NC","","_","_"
1,"balaṃ","_","_","bala","NC","","_","_"
2,"_","_","_","tapas","NC","","_","_"
3,"_","_","_","ca","CCD","","_","_"
4,"satyaṃ","_","_","satya","NC","","_","_"
5,"ca","_","_","ca","CCD","","_","_"
6,"dharmaḥ","_","_","dharma","NC","","_","_"
7,"_","_","_","kāma","NC","","_","_"
8,"_","_","_","ātmaja","NC","","_","_"
9,"prabho","_","_","prabhu","NC","","_","_"
1,"tejo","_","_","tejas","NC","","_","_"
2,"'gniḥ","_","_","agni","NC","","_","_"
3,"pavanaḥ","_","_","pavana","NC","","_","_"
4,"śvāsa","_","_","śvāsa","NC","","_","_"
5,"_","_","_","ap","NC","","_","_"
6,"_","_","_","tvat","PPR","","_","_"
7,"_","_","_","sveda","NC","","_","_"
8,"_","_","_","sambhava","NC","","_","_"
1,"aśvinau","_","_","aśvin","NC","","_","_"
2,"śravaṇau","_","_","śravaṇa","NC","","_","_"
3,"nityaṃ","_","_","nitya","CX","","_","_"
4,"devī","_","_","devī","NC","","_","_"
5,"jihvā","_","_","jihvā","NC","","_","_"
6,"sarasvatī","_","_","sarasvatī","NC","","_","_"
1,"vedāḥ","_","_","veda","NC","","_","_"
2,"_","_","_","saṃskāra","NC","","_","_"
3,"_","_","_","niṣṭhā","NC","","_","_"
4,"hi","_","_","hi","CX","","_","_"
5,"_","_","_","tvat","PPR","","_","_"
6,"_","_","_","ida","PRD","","_","_"
7,"jagad","_","_","jagat","NC","","_","_"
8,"āśritam","_","_","āśri","PPP","","_","_"
1,"na","_","_","na","CNG","","_","_"
2,"saṃkhyāṃ","_","_","saṃkhyā","NC","","_","_"
3,"na","_","_","na","CNG","","_","_"
4,"parīmāṇaṃ","_","_","parīmāṇa","NC","","_","_"
5,"na","_","_","na","CNG","","_","_"
6,"tejo","_","_","tejas","NC","","_","_"
7,"na","_","_","na","CNG","","_","_"
8,"parākramam","_","_","parākrama","NC","","_","_"
1,"na","_","_","na","CNG","","_","_"
2,"balaṃ","_","_","bala","NC","","_","_"
3,"_","_","_","yoga","NC","","_","_"
4,"_","_","_","yogin","NC","","_","_"
5,"_","_","_","īśa","NC","","_","_"
6,"_","_","_","jān","V","jñā","_","_"
7,"_","_","_","tvat","PPR","","_","_"
8,"na","_","_","na","CNG","","_","_"
9,"saṃbhavam","_","_","sambhava","NC","","_","_"
1,"_","_","_","tvat","PPR","","_","_"
2,"_","_","_","bhakti","NC","","_","_"
3,"_","_","_","nira","PPP","","_","_"
4,"deva","_","_","deva","NC","","_","_"
5,"_","_","_","niyama","NC","","_","_"
6,"_","_","_","tvat","PPR","","_","_"
7,"samāhitāḥ","_","_","samāhita","JJ","","_","_"
1,"arcayāmaḥ","_","_","arcay","V","arcay","_","_"
2,"sadā","_","_","sadā","CAD","","_","_"
3,"viṣṇo","_","_","viṣṇu","NC","","_","_"
4,"parameśaṃ","_","_","parameśa","NC","","_","_"
5,"maheśvaram","_","_","maheśvara","NC","","_","_"
1,"ṛṣayo","_","_","ṛṣi","NC","","_","_"
2,"_","_","_","deva","NC","","_","_"
3,"_","_","_","gandharva","NC","","_","_"
4,"_","_","_","yakṣa","NC","","_","_"
5,"_","_","_","rākṣasa","NC","","_","_"
6,"_","_","_","pannaga","NC","","_","_"
1,"piśācā","_","_","piśāca","NC","","_","_"
2,"_","_","_","mānuṣa","NC","","_","_"
3,"_","_","_","ca","CCD","","_","_"
4,"_","_","_","eva","CEM","","_","_"
5,"_","_","_","mṛga","NC","","_","_"
6,"_","_","_","pakṣin","NC","","_","_"
7,"_","_","_","sarīsṛpa","NC","","_","_"
1,"evamādi","_","_","evamādi","JJ","","_","_"
2,"mayā","_","_","mat","PPR","","_","_"
3,"sṛṣṭaṃ","_","_","sṛj","PPP","","_","_"
4,"pṛthivyāṃ","_","_","pṛthivī","NC","","_","_"
5,"_","_","_","tvat","PPR","","_","_"
6,"_","_","_","prasāda","NC","","_","_"
7,"_","_","_","ja","JJ","","_","_"
1,"padmanābha","_","_","padmanābha","NC","","_","_"
2,"viśālākṣa","_","_","viśālākṣa","NC","","_","_"
3,"kṛṣṇa","_","_","kṛṣṇa","NC","","_","_"
4,"_","_","_","duḥsvapna","NC","","_","_"
5,"_","_","_","nāśana","JJ","","_","_"
1,"tvaṃ","_","_","tvat","PPR","","_","_"
2,"gatiḥ","_","_","gati","NC","","_","_"
3,"_","_","_","sarva","JQ","","_","_"
4,"_","_","_","bhūta","NC","","_","_"
5,"tvaṃ","_","_","tvat","PPR","","_","_"
6,"netā","_","_","netṛ","NC","","_","_"
7,"tvaṃ","_","_","tvat","PPR","","_","_"
8,"_","_","_","jagat","NC","","_","_"
9,"_","_","_","mukha","NC","","_","_"
1,"_","_","_","tvat","PPR","","_","_"
2,"_","_","_","prasāda","NC","","_","_"
3,"deveśa","_","_","deveśa","NC","","_","_"
4,"sukhino","_","_","sukhin","JJ","","_","_"
5,"vibudhāḥ","_","_","vibudha","NC","","_","_"
6,"sadā","_","_","sadā","CAD","","_","_"
1,"pṛthivī","_","_","pṛthivī","NC","","_","_"
2,"nirbhayā","_","_","nirbhaya","JJ","","_","_"
3,"deva","_","_","deva","NC","","_","_"
4,"_","_","_","tvat","PPR","","_","_"
5,"_","_","_","prasāda","NC","","_","_"
6,"_","_","_","sadā","CAD","","_","_"
7,"_","_","_","bhav","V","bhū","_","_"
1,"tasmād","_","_","tasmāt","CX","","_","_"
2,"bhava","_","_","bhav","V","bhū","_","_"
3,"viśālākṣa","_","_","viśālākṣa","NC","","_","_"
4,"_","_","_","yadu","NC","","_","_"
5,"_","_","_","vaṃśa","NC","","_","_"
6,"_","_","_","vivardhana","JJ","","_","_"
1,"_","_","_","dharma","NC","","_","_"
2,"_","_","_","saṃsthāpana","NC","","_","_"
3,"_","_","_","artha","NC","","_","_"
4,"daiteyānāṃ","_","_","daiteya","NC","","_","_"
5,"vadhāya","_","_","vadha","NC","","_","_"
6,"ca","_","_","ca","CCD","","_","_"
1,"jagato","_","_","jagat","NC","","_","_"
2,"_","_","_","dhāraṇa","NC","","_","_"
3,"_","_","_","artha","NC","","_","_"
4,"vijñāpyaṃ","_","_","vijñāpay","KDG","","_","_"
5,"kuru","_","_","kar","V","kṛ","_","_"
6,"me","_","_","mat","PPR","","_","_"
7,"prabho","_","_","prabhu","NC","","_","_"
1,"yad","_","_","yad","PRL","","_","_"
2,"etat","_","_","tad","PRD","","_","_"
3,"paramaṃ","_","_","parama","JJ","","_","_"
4,"guhyaṃ","_","_","guhya","NC","","_","_"
5,"_","_","_","tvat","PPR","","_","_"
6,"_","_","_","prasāda","NC","","_","_"
7,"_","_","_","maya","JJ","","_","_"
8,"vibho","_","_","vibhu","JJ","","_","_"
1,"vāsudeva","_","_","vāsudeva","NC","","_","_"
2,"tad","_","_","tad","PRD","","_","_"
3,"etat","_","_","tad","PRD","","_","_"
4,"te","_","_","tvat","PPR","","_","_"
5,"_","_","_","mat","PPR","","_","_"
6,"_","_","_","udgā","PPP","","_","_"
7,"yathātatham","_","_","yathātatha","JJ","","_","_"
1,"sṛṣṭvā","_","_","sṛj","CGDA","","_","_"
2,"saṃkarṣaṇaṃ","_","_","saṃkarṣaṇa","NC","","_","_"
3,"devaṃ","_","_","deva","NC","","_","_"
4,"svayam","_","_","svaya","CX","","_","_"
5,"ātmānam","_","_","ātman","NC","","_","_"
6,"ātmanā","_","_","ātman","NC","","_","_"
1,"kṛṣṇa","_","_","kṛṣṇa","NC","","_","_"
2,"tvam","_","_","tvat","PPR","","_","_"
3,"_","_","_","ātman","NC","","_","_"
4,"_","_","_","sṛj","V","sṛj","_","_"
5,"pradyumnaṃ","_","_","pradyumna","NC","","_","_"
6,"_","_","_","ca","CCD","","_","_"
7,"_","_","_","ātmasambhava","NC","","_","_"
1,"_","_","_","pradyumna","NC","","_","_"
2,"_","_","_","ca","CCD","","_","_"
3,"_","_","_","aniruddha","NC","","_","_"
4,"tvaṃ","_","_","tvat","PPR","","_","_"
5,"yaṃ","_","_","yad","PRL","","_","_"
6,"vidur","_","_","vid","V","vid","_","_"
7,"viṣṇum","_","_","viṣṇu","NC","","_","_"
8,"avyayam","_","_","avyaya","JJ","","_","_"
1,"aniruddho","_","_","aniruddha","NC","","_","_"
2,"_","_","_","sṛj","V","sṛj","_","_"
3,"_","_","_","mat","PPR","","_","_"
4,"vai","_","_","vai","CX","","_","_"
5,"brahmāṇaṃ","_","_","brahman","NC","","_","_"
6,"_","_","_","loka","NC","","_","_"
7,"_","_","_","dhārin","JJ","","_","_"
1,"_","_","_","vāsudeva","NC","","_","_"
2,"_","_","_","maya","JJ","","_","_"
3,"so","_","_","tad","PRD","","_","_"
4,"'haṃ","_","_","mat","PPR","","_","_"
5,"_","_","_","tvat","PPR","","_","_"
6,"_","_","_","eva","CEM","","_","_"
7,"_","_","_","as","V","as","_","_"
8,"vinirmitaḥ","_","_","vinirmā","PPP","","_","_"
1,"vibhajya","_","_","vibhaj","CGDA","","_","_"
2,"bhāgaśo","_","_","bhāgaśas","CX","","_","_"
3,"'%%tmānaṃ","_","_","vraj","V","vraj","_","_"
4,"_","_","_","mānuṣa","NC","","_","_"
6,"mānuṣatāṃ","_","_","vibhu","JJ","","_","_"
1,"_","_","_","tatra","CAD","","_","_"
2,"_","_","_","asura","NC","","_","_"
3,"_","_","_","vadha","NC","","_","_"
4,"kṛtvā","_","_","kṛ","CGDA","","_","_"
5,"_","_","_","sarva","JQ","","_","_"
6,"_","_","_","loka","NC","","_","_"
7,"_","_","_","sukha","NC","","_","_"
8,"vai","_","_","vai","CX","","_","_"
1,"dharmaṃ","_","_","dharma","NC","","_","_"
2,"sthāpya","_","_","sthāpay","CGDA","","_","_"
3,"yaśaḥ","_","_","yaśas","NC","","_","_"
4,"prāpya","_","_","prāp","CGDA","","_","_"
5,"yogaṃ","_","_","yoga","NC","","_","_"
6,"prāpsyasi","_","_","prāpn","V","prāp","_","_"
7,"tattvataḥ","_","_","tattva","NC","","_","_"
1,"tvāṃ","_","_","tvat","PPR","","_","_"
2,"hi","_","_","hi","CX","","_","_"
3,"brahmarṣayo","_","_","brahmarṣi","NC","","_","_"
4,"loke","_","_","loka","NC","","_","_"
5,"_","_","_","deva","NC","","_","_"
6,"_","_","_","ca","CCD","","_","_"
7,"_","_","_","amitavikrama","NC","","_","_"
1,"_","_","_","tad","PRD","","_","_"
2,"_","_","_","tad","PRD","","_","_"
3,"_","_","_","ca","CCD","","_","_"
4,"nāmabhir","_","_","nāman","NC","","_","_"
5,"bhaktā","_","_","bhakta","NC","","_","_"
6,"gāyanti","_","_","gāy","V","gai","_","_"
7,"_","_","_","parama","JJ","","_","_"
8,"_","_","_","ātmaka","JJ","","_","_"
1,"_","_","_","sthā","PPP","","_","_"
2,"_","_","_","ca","CCD","","_","_"
3,"sarve","_","_","sarva","JQ","","_","_"
4,"tvayi","_","_","tvat","PPR","","_","_"
5,"_","_","_","bhūta","NC","","_","_"
6,"_","_","_","saṃgha","NC","","_","_"
7,"_","_","_","kṛ","CGDA","","_","_"
8,"_","_","_","āśraya","NC","","_","_"
9,"tvāṃ","_","_","tvat","PPR","","_","_"
10,"_","_","_","vara","NC","","_","_"
11,"_","_","_","da","JJ","","_","_"
12,"_","_","_","su","CAD","","_","_"
13,"_","_","_","bāhu","NC","","_","_"
1,"_","_","_","anādi","JJ","","_","_"
2,"_","_","_","madhya","NC","","_","_"
3,"_","_","_","anta","NC","","_","_"
4,"_","_","_","apāra","JJ","","_","_"
5,"_","_","_","yoga","NC","","_","_"
6,"lokasya","_","_","loka","NC","","_","_"
7,"setuṃ","_","_","setu","NC","","_","_"
8,"pravadanti","_","_","pravad","V","pravad","_","_"
9,"viprāḥ","_","_","vipra","NC","","_","_"
