"WordID","word","NormSTEM","suffix","lemma","PoS","Root","NormSuffix","NormWord"
1,"vaiśaṃpāyana","_","_","vaiśampāyana","NC","","_","_"
2,"uvāca","_","_","vak","V","vac","_","_"
1,"_","_","_","bṛhaspati","NC","","_","_"
2,"_","_","_","sama","PPX","","_","_"
3,"buddhyā","_","_","buddhi","NC","","_","_"
4,"kṣamayā","_","_","kṣamā","NC","","_","_"
5,"brahmaṇaḥ","_","_","brahman","NC","","_","_"
6,"samam","_","_","sama","PPX","","_","_"
1,"parākrame","_","_","parākrama","NC","","_","_"
2,"_","_","_","śakra","NC","","_","_"
3,"_","_","_","sama","PPX","","_","_"
4,"_","_","_","āditya","NC","","_","_"
5,"_","_","_","sama","PPX","","_","_"
6,"_","_","_","tejas","NC","","_","_"
1,"gāṅgeyam","_","_","gāṅgeya","NC","","_","_"
2,"_","_","_","arjuna","NC","","_","_"
3,"_","_","_","āji","NC","","_","_"
4,"nihataṃ","_","_","nihan","PPP","","_","_"
5,"_","_","_","bhūri","JQ","","_","_"
6,"_","_","_","varcas","NC","","_","_"
1,"bhrātṛbhiḥ","_","_","bhrātṛ","NC","","_","_"
2,"sahito","_","_","sahita","JJ","","_","_"
3,"_","_","_","anya","PPX","","_","_"
4,"_","_","_","ca","CCD","","_","_"
5,"paryupāste","_","_","ās","V","ās","_","_"
6,"yudhiṣṭhiraḥ","_","_","yudhiṣṭhira","NC","","_","_"
1,"śayānaṃ","_","_","śī","KDP","","_","_"
2,"_","_","_","vīra","NC","","_","_"
3,"_","_","_","śayana","NC","","_","_"
4,"_","_","_","kāla","NC","","_","_"
5,"_","_","_","ākāṅkṣin","JJ","","_","_"
6,"acyutam","_","_","acyuta","JJ","","_","_"
1,"ājagmur","_","_","āga","V","āga","_","_"
2,"_","_","_","bharata","NC","","_","_"
3,"_","_","_","śreṣṭha","JJ","","_","_"
4,"_","_","_","draṣṭu","NC","","_","_"
5,"_","_","_","kāma","NC","","_","_"
6,"_","_","_","mahat","JJ","","_","_"
7,"_","_","_","ṛṣi","NC","","_","_"
1,"atrir","_","_","atri","NC","","_","_"
2,"vasiṣṭho","_","_","vasiṣṭha","NC","","_","_"
3,"'tha","_","_","atha","CAD","","_","_"
4,"bhṛguḥ","_","_","bhṛgu","NC","","_","_"
5,"pulastyaḥ","_","_","pulastya","NC","","_","_"
6,"pulahaḥ","_","_","pulaha","NC","","_","_"
7,"kratuḥ","_","_","kratu","NC","","_","_"
1,"aṅgirā","_","_","aṅgiras","NC","","_","_"
2,"gautamo","_","_","gautama","NC","","_","_"
3,"'gastyaḥ","_","_","agastya","NC","","_","_"
4,"sumatiḥ","_","_","sumati","NC","","_","_"
5,"svāyur","_","_","svāyu","NC","","_","_"
6,"ātmavān","_","_","ātmavat","JJ","","_","_"
1,"viśvāmitraḥ","_","_","viśvāmitra","NC","","_","_"
2,"sthūlaśirāḥ","_","_","sthūlaśiras","NC","","_","_"
3,"saṃvartaḥ","_","_","saṃvarta","NC","","_","_"
4,"pramatir","_","_","pramati","NC","","_","_"
5,"damaḥ","_","_","dama","NC","","_","_"
1,"uśanā","_","_","uśanas","NC","","_","_"
2,"bṛhaspatir","_","_","bṛhaspati","NC","","_","_"
3,"_","_","_","vyāsa","NC","","_","_"
4,"_","_","_","cyavana","NC","","_","_"
5,"kāśyapo","_","_","kāśyapa","NC","","_","_"
6,"dhruvaḥ","_","_","dhruva","NC","","_","_"
1,"durvāsā","_","_","durvāsas","NC","","_","_"
2,"_","_","_","jamadagni","NC","","_","_"
3,"_","_","_","ca","CCD","","_","_"
4,"mārkaṇḍeyo","_","_","mārkaṇḍeya","NC","","_","_"
5,"'tha","_","_","atha","CAD","","_","_"
6,"gālavaḥ","_","_","gālava","NC","","_","_"
1,"_","_","_","bharadvāja","NC","","_","_"
2,"_","_","_","ca","CCD","","_","_"
3,"_","_","_","raibhya","NC","","_","_"
4,"_","_","_","ca","CCD","","_","_"
5,"_","_","_","yavakrīta","NC","","_","_"
6,"_","_","_","trita","NC","","_","_"
7,"_","_","_","tathā","CX","","_","_"
1,"sthūlākṣaḥ","_","_","sthūlākṣa","NC","","_","_"
2,"_","_","_","śakalākṣa","NC","","_","_"
3,"_","_","_","ca","CCD","","_","_"
4,"kaṇvo","_","_","kaṇva","NC","","_","_"
5,"medhātithiḥ","_","_","medhātithi","NC","","_","_"
6,"kṛśaḥ","_","_","kṛśa","NC","","_","_"
1,"nāradaḥ","_","_","nārada","NC","","_","_"
2,"_","_","_","parvata","NC","","_","_"
3,"_","_","_","ca","CCD","","_","_"
4,"_","_","_","eva","CEM","","_","_"
5,"_","_","_","sudhanvan","NC","","_","_"
6,"_","_","_","atha","CAD","","_","_"
7,"_","_","_","ekata","NC","","_","_"
8,"dvitaḥ","_","_","dvita","NC","","_","_"
1,"nitaṃbhūr","_","_","nitambhū","NC","","_","_"
2,"bhuvano","_","_","bhuvana","NC","","_","_"
3,"dhaumyaḥ","_","_","dhaumya","NC","","_","_"
4,"śatānando","_","_","śatānanda","NC","","_","_"
5,"'kṛtavraṇaḥ","_","_","akṛtavraṇa","NC","","_","_"
1,"_","_","_","jāmadagnya","NC","","_","_"
2,"_","_","_","tathā","CX","","_","_"
3,"rāmaḥ","_","_","rāma","NC","","_","_"
4,"_","_","_","kāmya","NC","","_","_"
5,"_","_","_","ca","CCD","","_","_"
6,"_","_","_","iti","CQT","","_","_"
7,"_","_","_","evamādi","JJ","","_","_"
1,"samāgatā","_","_","samāga","PPP","","_","_"
2,"mahātmāno","_","_","mahātman","JJ","","_","_"
3,"bhīṣmaṃ","_","_","bhīṣma","NC","","_","_"
4,"draṣṭuṃ","_","_","dṛś","CGDI","","_","_"
5,"_","_","_","mahat","JJ","","_","_"
6,"_","_","_","ṛṣi","NC","","_","_"
1,"teṣāṃ","_","_","tad","PRD","","_","_"
2,"mahātmanāṃ","_","_","mahātman","JJ","","_","_"
3,"pūjām","_","_","pūjā","NC","","_","_"
4,"āgatānāṃ","_","_","āga","PPP","","_","_"
5,"yudhiṣṭhiraḥ","_","_","yudhiṣṭhira","NC","","_","_"
1,"bhrātṛbhiḥ","_","_","bhrātṛ","NC","","_","_"
2,"_","_","_","sahita","JJ","","_","_"
3,"_","_","_","kar","V","kṛ","_","_"
4,"yathāvad","_","_","yathāvat","CX","","_","_"
5,"anupūrvaśaḥ","_","_","anupūrvaśas","CX","","_","_"
1,"te","_","_","tad","PRD","","_","_"
2,"pūjitāḥ","_","_","pūjay","PPP","","_","_"
3,"_","_","_","sukha","JJ","","_","_"
4,"_","_","_","ās","PPP","","_","_"
5,"_","_","_","kathā","NC","","_","_"
6,"_","_","_","kar","V","kṛ","_","_"
7,"_","_","_","mahat","JJ","","_","_"
8,"_","_","_","ṛṣi","NC","","_","_"
1,"_","_","_","bhīṣma","NC","","_","_"
2,"_","_","_","āśri","PPP","","_","_"
3,"_","_","_","su","CAD","","_","_"
4,"_","_","_","madhura","JJ","","_","_"
5,"_","_","_","sarva","JQ","","_","_"
6,"_","_","_","indriya","NC","","_","_"
7,"_","_","_","manas","NC","","_","_"
8,"_","_","_","hara","JJ","","_","_"
1,"_","_","_","bhīṣma","NC","","_","_"
2,"_","_","_","tad","PRD","","_","_"
3,"kathāḥ","_","_","kathā","NC","","_","_"
4,"śrutvā","_","_","śru","CGDA","","_","_"
5,"ṛṣīṇāṃ","_","_","ṛṣi","NC","","_","_"
6,"bhāvitātmanām","_","_","bhāvitātman","JJ","","_","_"
1,"mene","_","_","man","V","man","_","_"
2,"_","_","_","divi","NC","","_","_"
3,"_","_","_","stha","JJ","","_","_"
4,"ātmānaṃ","_","_","ātman","NC","","_","_"
5,"tuṣṭyā","_","_","tuṣṭi","NC","","_","_"
6,"paramayā","_","_","parama","JJ","","_","_"
7,"yutaḥ","_","_","yuta","JJ","","_","_"
1,"_","_","_","tatas","CX","","_","_"
2,"_","_","_","tad","PRD","","_","_"
3,"bhīṣmam","_","_","bhīṣma","NC","","_","_"
4,"āmantrya","_","_","āmantray","CGDA","","_","_"
5,"_","_","_","pāṇḍava","NC","","_","_"
6,"_","_","_","ca","CCD","","_","_"
7,"_","_","_","mahat","JJ","","_","_"
8,"_","_","_","ṛṣi","NC","","_","_"
1,"antardhānaṃ","_","_","antardhāna","NC","","_","_"
2,"gatāḥ","_","_","ga","PPP","","_","_"
3,"sarve","_","_","sarva","JQ","","_","_"
4,"sarveṣām","_","_","sarva","JQ","","_","_"
5,"eva","_","_","eva","CEM","","_","_"
6,"paśyatām","_","_","dṛś","KDP","","_","_"
1,"tān","_","_","tad","PRD","","_","_"
2,"ṛṣīn","_","_","ṛṣi","NC","","_","_"
3,"_","_","_","su","CAD","","_","_"
4,"_","_","_","mahābhāga","JJ","","_","_"
5,"_","_","_","antardhāna","NC","","_","_"
6,"_","_","_","ga","PPP","","_","_"
7,"api","_","_","api","CX","","_","_"
1,"_","_","_","pāṇḍava","NC","","_","_"
2,"_","_","_","stu","V","stu","_","_"
3,"sarve","_","_","sarva","JQ","","_","_"
4,"_","_","_","praṇa","V","praṇa","_","_"
5,"_","_","_","ca","CCD","","_","_"
6,"muhur","_","_","muhur","CX","","_","_"
7,"muhuḥ","_","_","muhur","CX","","_","_"
1,"_","_","_","prasad","PPP","","_","_"
2,"_","_","_","manas","NC","","_","_"
3,"sarve","_","_","sarva","JQ","","_","_"
4,"gāṅgeyaṃ","_","_","gāṅgeya","NC","","_","_"
5,"_","_","_","kuru","NC","","_","_"
6,"_","_","_","sattama","JJ","","_","_"
1,"upatasthur","_","_","upatiṣṭh","V","upasthā","_","_"
2,"_","_","_","yathā","CCM","","_","_"
3,"_","_","_","udi","KDP","","_","_"
4,"ādityaṃ","_","_","āditya","NC","","_","_"
5,"_","_","_","mantra","NC","","_","_"
6,"_","_","_","kovida","JJ","","_","_"
1,"prabhāvāt","_","_","prabhāva","NC","","_","_"
2,"_","_","_","tapas","NC","","_","_"
3,"_","_","_","tad","PRD","","_","_"
4,"ṛṣīṇāṃ","_","_","ṛṣi","NC","","_","_"
5,"vīkṣya","_","_","vīkṣ","CGDA","","_","_"
6,"pāṇḍavāḥ","_","_","pāṇḍava","NC","","_","_"
1,"prakāśanto","_","_","prakāś","KDP","","_","_"
2,"diśaḥ","_","_","diś","NC","","_","_"
3,"sarvā","_","_","sarva","JQ","","_","_"
4,"vismayaṃ","_","_","vismaya","NC","","_","_"
5,"paramaṃ","_","_","parama","JJ","","_","_"
6,"yayuḥ","_","_","yā","V","yā","_","_"
1,"_","_","_","mahat","JJ","","_","_"
2,"_","_","_","bhāgya","NC","","_","_"
3,"paraṃ","_","_","para","PPX","","_","_"
4,"teṣām","_","_","tad","PRD","","_","_"
5,"ṛṣīṇām","_","_","ṛṣi","NC","","_","_"
6,"anucintya","_","_","anucintay","CGDA","","_","_"
7,"te","_","_","tad","PRD","","_","_"
1,"pāṇḍavāḥ","_","_","pāṇḍava","NC","","_","_"
2,"saha","_","_","saha","CX","","_","_"
3,"bhīṣmeṇa","_","_","bhīṣma","NC","","_","_"
4,"_","_","_","kathā","NC","","_","_"
5,"_","_","_","kar","V","kṛ","_","_"
6,"_","_","_","tad","PRD","","_","_"
7,"_","_","_","āśraya","NC","","_","_"
1,"_","_","_","kathā","NC","","_","_"
2,"_","_","_","anta","NC","","_","_"
3,"śirasā","_","_","śiras","NC","","_","_"
4,"pādau","_","_","pāda","NC","","_","_"
5,"spṛṣṭvā","_","_","spṛś","CGDA","","_","_"
6,"bhīṣmasya","_","_","bhīṣma","NC","","_","_"
7,"pāṇḍavaḥ","_","_","pāṇḍava","NC","","_","_"
1,"dharmyaṃ","_","_","dharmya","JJ","","_","_"
2,"_","_","_","dharma","NC","","_","_"
3,"_","_","_","suta","NC","","_","_"
4,"praśnaṃ","_","_","praśna","NC","","_","_"
5,"paryapṛcchad","_","_","paripracch","V","paripracch","_","_"
6,"yudhiṣṭhiraḥ","_","_","yudhiṣṭhira","NC","","_","_"
1,"ke","_","_","kiṃ","PRQ","","_","_"
2,"deśāḥ","_","_","deśa","NC","","_","_"
3,"ke","_","_","kiṃ","PRQ","","_","_"
4,"janapadā","_","_","janapada","NC","","_","_"
5,"āśramāḥ","_","_","āśrama","NC","","_","_"
6,"ke","_","_","kiṃ","PRQ","","_","_"
7,"ca","_","_","ca","CCD","","_","_"
8,"parvatāḥ","_","_","parvata","NC","","_","_"
1,"prakṛṣṭāḥ","_","_","prakṛṣṭa","JJ","","_","_"
2,"puṇyataḥ","_","_","puṇya","NC","","_","_"
3,"_","_","_","kiṃ","PRQ","","_","_"
4,"_","_","_","ca","CCD","","_","_"
5,"jñeyā","_","_","jñā","KDG","","_","_"
6,"nadyaḥ","_","_","nadī","NC","","_","_"
7,"pitāmaha","_","_","pitāmaha","NC","","_","_"
1,"bhīṣma","_","_","bhīṣma","NC","","_","_"
2,"uvāca","_","_","vak","V","vac","_","_"
1,"_","_","_","atra","CAD","","_","_"
2,"_","_","_","api","CX","","_","_"
3,"_","_","_","udāhṛ","V","udāhṛ","_","_"
4,"_","_","_","ida","PRD","","_","_"
5,"itihāsaṃ","_","_","itihāsa","NC","","_","_"
6,"purātanam","_","_","purātana","JJ","","_","_"
1,"_","_","_","śila","NC","","_","_"
2,"_","_","_","uñcha","NC","","_","_"
3,"_","_","_","vṛtti","NC","","_","_"
4,"saṃvādaṃ","_","_","saṃvāda","NC","","_","_"
5,"siddhasya","_","_","siddha","NC","","_","_"
6,"ca","_","_","ca","CCD","","_","_"
7,"yudhiṣṭhira","_","_","yudhiṣṭhira","NC","","_","_"
1,"imāṃ","_","_","ida","PRD","","_","_"
2,"kaścit","_","_","kiṃcit","PRI","","_","_"
3,"parikramya","_","_","parikra","CGDA","","_","_"
4,"pṛthivīṃ","_","_","pṛthivī","NC","","_","_"
5,"_","_","_","śaila","NC","","_","_"
6,"_","_","_","bhūṣay","PPP","","_","_"
1,"a","_","_","alpha_privativum","CX","","_","_"
1,"asakṛd","_","_","sakṛt","CX","","_","_"
2,"dvipadāṃ","_","_","dvipad","NC","","_","_"
3,"śreṣṭhaḥ","_","_","śreṣṭha","JJ","","_","_"
4,"śreṣṭhasya","_","_","śreṣṭha","JJ","","_","_"
5,"gṛhamedhinaḥ","_","_","gṛhamedhin","NC","","_","_"
1,"_","_","_","śila","NC","","_","_"
2,"_","_","_","vṛtti","NC","","_","_"
3,"gṛhaṃ","_","_","gṛha","NC","","_","_"
4,"prāptaḥ","_","_","prāp","PPP","","_","_"
5,"sa","_","_","tad","PRD","","_","_"
6,"tena","_","_","tad","PRD","","_","_"
7,"_","_","_","vidhi","NC","","_","_"
8,"_","_","_","arcay","PPP","","_","_"
1,"kṛtakṛtya","_","_","kṛtakṛtya","JJ","","_","_"
2,"upātiṣṭhat","_","_","upatiṣṭh","V","upasthā","_","_"
3,"siddhaṃ","_","_","siddha","NC","","_","_"
4,"tam","_","_","tad","PRD","","_","_"
5,"atithiṃ","_","_","atithi","NC","","_","_"
6,"tadā","_","_","tadā","CAD","","_","_"
1,"tau","_","_","tad","PRD","","_","_"
2,"sametya","_","_","same","CGDA","","_","_"
3,"mahātmānau","_","_","mahātman","JJ","","_","_"
4,"_","_","_","sukha","JJ","","_","_"
5,"_","_","_","ās","PPP","","_","_"
6,"kathāḥ","_","_","kathā","NC","","_","_"
7,"śubhāḥ","_","_","śubha","JJ","","_","_"
1,"cakratur","_","_","kar","V","kṛ","_","_"
2,"_","_","_","veda","NC","","_","_"
3,"_","_","_","sambandh","PPP","","_","_"
4,"_","_","_","tad","PRD","","_","_"
5,"_","_","_","śeṣa","NC","","_","_"
6,"_","_","_","kṛ","PPP","","_","_"
7,"_","_","_","lakṣaṇa","NC","","_","_"
1,"_","_","_","śila","NC","","_","_"
2,"_","_","_","vṛtti","NC","","_","_"
3,"_","_","_","kathā","NC","","_","_"
4,"_","_","_","anta","NC","","_","_"
5,"tu","_","_","tu","CCD","","_","_"
6,"siddham","_","_","siddha","NC","","_","_"
7,"āmantrya","_","_","āmantray","CGDA","","_","_"
8,"yatnataḥ","_","_","yatna","NC","","_","_"
1,"praśnaṃ","_","_","praśna","NC","","_","_"
2,"papraccha","_","_","pṛcch","V","prach","_","_"
3,"medhāvī","_","_","medhāvin","JJ","","_","_"
4,"_","_","_","yad","PRL","","_","_"
5,"_","_","_","mat","PPR","","_","_"
6,"tvaṃ","_","_","tvat","PPR","","_","_"
7,"paripṛcchasi","_","_","paripṛcch","V","pariprach","_","_"
1,"_","_","_","śila","NC","","_","_"
2,"_","_","_","vṛtti","NC","","_","_"
3,"uvāca","_","_","vak","V","vac","_","_"
1,"ke","_","_","kiṃ","PRQ","","_","_"
2,"deśāḥ","_","_","deśa","NC","","_","_"
3,"ke","_","_","kiṃ","PRQ","","_","_"
4,"janapadāḥ","_","_","janapada","NC","","_","_"
5,"ke","_","_","kiṃ","PRQ","","_","_"
6,"'%%śramāḥ","_","_","āśrama","NC","","_","_"
7,"ke","_","_","kiṃ","PRQ","","_","_"
8,"ca","_","_","ca","CCD","","_","_"
9,"parvatāḥ","_","_","parvata","NC","","_","_"
1,"prakṛṣṭāḥ","_","_","prakṛṣṭa","JJ","","_","_"
2,"puṇyataḥ","_","_","puṇya","NC","","_","_"
3,"_","_","_","kiṃ","PRQ","","_","_"
4,"_","_","_","ca","CCD","","_","_"
5,"jñeyā","_","_","jñā","KDG","","_","_"
6,"_","_","_","nadī","NC","","_","_"
7,"_","_","_","tad","PRD","","_","_"
8,"ucyatām","_","_","vak","V","vac","_","_"
1,"siddha","_","_","siddha","NC","","_","_"
2,"uvāca","_","_","vak","V","vac","_","_"
1,"te","_","_","tad","PRD","","_","_"
2,"_","_","_","deśa","NC","","_","_"
3,"_","_","_","tad","PRD","","_","_"
4,"_","_","_","janapada","NC","","_","_"
5,"_","_","_","tad","PRD","","_","_"
6,"_","_","_","āśrama","NC","","_","_"
7,"_","_","_","tad","PRD","","_","_"
8,"ca","_","_","ca","CCD","","_","_"
9,"parvatāḥ","_","_","parvata","NC","","_","_"
1,"yeṣāṃ","_","_","yad","PRL","","_","_"
2,"bhāgīrathī","_","_","bhāgīrathī","NC","","_","_"
3,"gaṅgā","_","_","gaṅgā","NC","","_","_"
4,"_","_","_","madhya","NC","","_","_"
5,"_","_","_","e","V","i","_","_"
6,"_","_","_","sarit","NC","","_","_"
7,"_","_","_","vara","JJ","","_","_"
1,"tapasā","_","_","tapas","NC","","_","_"
2,"brahmacaryeṇa","_","_","brahmacarya","NC","","_","_"
3,"_","_","_","yajña","NC","","_","_"
4,"_","_","_","tyāga","NC","","_","_"
5,"vā","_","_","vā","CCD","","_","_"
6,"punaḥ","_","_","punar","CAD","","_","_"
1,"gatiṃ","_","_","gati","NC","","_","_"
2,"tāṃ","_","_","tad","PRD","","_","_"
3,"na","_","_","na","CNG","","_","_"
4,"_","_","_","labh","V","labh","_","_"
5,"_","_","_","jantu","NC","","_","_"
6,"gaṅgāṃ","_","_","gaṅgā","NC","","_","_"
7,"saṃsevya","_","_","saṃsev","CGDA","","_","_"
8,"yāṃ","_","_","yad","PRL","","_","_"
9,"labhet","_","_","labh","V","labh","_","_"
1,"spṛṣṭāni","_","_","spṛś","PPP","","_","_"
2,"yeṣāṃ","_","_","yad","PRL","","_","_"
3,"_","_","_","gāṅgeya","JJ","","_","_"
4,"_","_","_","toya","NC","","_","_"
5,"gātrāṇi","_","_","gātra","NC","","_","_"
6,"dehinām","_","_","dehin","NC","","_","_"
1,"nyastāni","_","_","nyas","PPP","","_","_"
2,"na","_","_","na","CNG","","_","_"
3,"_","_","_","punar","CAD","","_","_"
4,"_","_","_","tad","PRD","","_","_"
5,"tyāgaḥ","_","_","tyāga","NC","","_","_"
6,"svargād","_","_","svarga","NC","","_","_"
7,"vidhīyate","_","_","vidadh","V","vidhā","_","_"
1,"sarvāṇi","_","_","sarva","JQ","","_","_"
2,"yeṣāṃ","_","_","yad","PRL","","_","_"
3,"_","_","_","gāṅgeya","JJ","","_","_"
4,"_","_","_","toya","NC","","_","_"
5,"kṛtyāni","_","_","kṛtya","NC","","_","_"
6,"dehinām","_","_","dehin","NC","","_","_"
1,"gāṃ","_","_","go","NC","","_","_"
2,"tyaktvā","_","_","tyaj","CGDA","","_","_"
3,"mānavā","_","_","mānava","NC","","_","_"
4,"vipra","_","_","vipra","NC","","_","_"
5,"divi","_","_","div","NC","","_","_"
6,"tiṣṭhanti","_","_","tiṣṭh","V","sthā","_","_"
7,"te","_","_","tad","PRD","","_","_"
8,"'calāḥ","_","_","acala","JJ","","_","_"
1,"pūrve","_","_","pūrva","PPX","","_","_"
2,"vayasi","_","_","vayas","NC","","_","_"
3,"karmāṇi","_","_","karman","NC","","_","_"
4,"kṛtvā","_","_","kṛ","CGDA","","_","_"
5,"pāpāni","_","_","pāpa","NC","","_","_"
6,"ye","_","_","yad","PRL","","_","_"
7,"narāḥ","_","_","nara","NC","","_","_"
1,"paścād","_","_","paścāt","CAD","","_","_"
2,"gaṅgāṃ","_","_","gaṅgā","NC","","_","_"
3,"niṣevante","_","_","niṣev","V","niṣev","_","_"
4,"te","_","_","tad","PRD","","_","_"
5,"'pi","_","_","api","CX","","_","_"
6,"_","_","_","yā","V","yā","_","_"
7,"_","_","_","uttama","JJ","","_","_"
8,"gatim","_","_","gati","NC","","_","_"
1,"snātānāṃ","_","_","snā","PPP","","_","_"
2,"_","_","_","śuci","JJ","","_","_"
3,"_","_","_","toya","NC","","_","_"
4,"gāṅgeyaiḥ","_","_","gāṅgeya","JJ","","_","_"
5,"_","_","_","praya","PPP","","_","_"
6,"_","_","_","ātman","NC","","_","_"
1,"vyuṣṭir","_","_","vyuṣṭi","NC","","_","_"
2,"bhavati","_","_","bhav","V","bhū","_","_"
3,"yā","_","_","yad","PRL","","_","_"
4,"puṃsāṃ","_","_","puṃs","NC","","_","_"
5,"na","_","_","na","CNG","","_","_"
6,"sā","_","_","tad","PRD","","_","_"
7,"_","_","_","kratu","NC","","_","_"
8,"_","_","_","śata","NUM","","_","_"
9,"api","_","_","api","CX","","_","_"
1,"yāvad","_","_","yāvat","CX","","_","_"
2,"asthi","_","_","asthi","NC","","_","_"
3,"manuṣyasya","_","_","manuṣya","NC","","_","_"
4,"_","_","_","gaṅgā","NC","","_","_"
5,"_","_","_","toya","NC","","_","_"
6,"tiṣṭhati","_","_","tiṣṭh","V","sthā","_","_"
1,"tāvad","_","_","tāvat","CX","","_","_"
2,"_","_","_","varṣa","NC","","_","_"
3,"_","_","_","sahasra","NUM","","_","_"
4,"svargaṃ","_","_","svarga","NC","","_","_"
5,"prāpya","_","_","prāp","CGDA","","_","_"
6,"mahīyate","_","_","mahīy","V","mahīy","_","_"
1,"apahatya","_","_","apahan","CGDA","","_","_"
2,"_","_","_","tamas","NC","","_","_"
3,"_","_","_","tīvra","JJ","","_","_"
4,"yathā","_","_","yathā","CCM","","_","_"
5,"_","_","_","bhā","V","bhā","_","_"
6,"_","_","_","udaya","NC","","_","_"
7,"raviḥ","_","_","ravi","NC","","_","_"
1,"_","_","_","tathā","CX","","_","_"
2,"_","_","_","apahan","CGDA","","_","_"
3,"pāpmānaṃ","_","_","pāpman","NC","","_","_"
4,"bhāti","_","_","bhā","V","bhā","_","_"
5,"_","_","_","gaṅgā","NC","","_","_"
6,"_","_","_","jala","NC","","_","_"
7,"_","_","_","ukṣ","PPP","","_","_"
1,"visomā","_","_","visoma","JJ","","_","_"
2,"iva","_","_","iva","CCM","","_","_"
3,"śarvaryo","_","_","śarvarī","NC","","_","_"
4,"_","_","_","vipuṣpa","JJ","","_","_"
5,"_","_","_","taru","NC","","_","_"
6,"yathā","_","_","yathā","CCM","","_","_"
1,"tadvad","_","_","tadvat","CX","","_","_"
2,"deśā","_","_","deśa","NC","","_","_"
3,"_","_","_","diś","NC","","_","_"
4,"_","_","_","ca","CCD","","_","_"
5,"_","_","_","eva","CEM","","_","_"
6,"hīnā","_","_","hā","PPP","","_","_"
7,"_","_","_","gaṅgā","NC","","_","_"
8,"_","_","_","jala","NC","","_","_"
9,"śubhaiḥ","_","_","śubha","JJ","","_","_"
1,"_","_","_","varṇa","NC","","_","_"
2,"_","_","_","āśrama","NC","","_","_"
3,"yathā","_","_","yathā","CCM","","_","_"
4,"sarve","_","_","sarva","JQ","","_","_"
5,"_","_","_","svadharma","NC","","_","_"
6,"_","_","_","jñāna","NC","","_","_"
7,"_","_","_","varjay","PPP","","_","_"
1,"_","_","_","kratu","NC","","_","_"
2,"_","_","_","ca","CCD","","_","_"
3,"_","_","_","yathā","CCM","","_","_"
4,"_","_","_","asoma","JJ","","_","_"
5,"_","_","_","tathā","CX","","_","_"
6,"gaṅgāṃ","_","_","gaṅgā","NC","","_","_"
7,"vinā","_","_","vinā","CX","","_","_"
8,"jagat","_","_","jagat","NC","","_","_"
1,"yathā","_","_","yathā","CCM","","_","_"
2,"hīnaṃ","_","_","hā","PPP","","_","_"
3,"nabho","_","_","nabhas","NC","","_","_"
4,"'rkeṇa","_","_","arka","NC","","_","_"
5,"bhūḥ","_","_","bhū","NC","","_","_"
6,"śailaiḥ","_","_","śaila","NC","","_","_"
7,"khaṃ","_","_","kha","NC","","_","_"
8,"ca","_","_","ca","CCD","","_","_"
9,"vāyunā","_","_","vāyu","NC","","_","_"
1,"tathā","_","_","tathā","CX","","_","_"
2,"deśā","_","_","deśa","NC","","_","_"
3,"_","_","_","diś","NC","","_","_"
4,"_","_","_","ca","CCD","","_","_"
5,"_","_","_","eva","CEM","","_","_"
6,"_","_","_","gaṅgā","NC","","_","_"
7,"_","_","_","hā","PPP","","_","_"
8,"na","_","_","na","CNG","","_","_"
9,"saṃśayaḥ","_","_","saṃśaya","NC","","_","_"
1,"triṣu","_","_","tri","NUM","","_","_"
2,"lokeṣu","_","_","loka","NC","","_","_"
3,"ye","_","_","yad","PRL","","_","_"
4,"kecit","_","_","kiṃcit","PRI","","_","_"
5,"prāṇinaḥ","_","_","prāṇin","NC","","_","_"
6,"sarva","_","_","sarva","JQ","","_","_"
7,"eva","_","_","eva","CEM","","_","_"
8,"te","_","_","tad","PRD","","_","_"
1,"tarpyamāṇāḥ","_","_","tarpay","KDP","","_","_"
2,"parāṃ","_","_","para","PPX","","_","_"
3,"tṛptiṃ","_","_","tṛpti","NC","","_","_"
4,"yānti","_","_","yā","V","yā","_","_"
5,"_","_","_","gaṅgā","NC","","_","_"
6,"_","_","_","jala","NC","","_","_"
7,"śubhaiḥ","_","_","śubha","JJ","","_","_"
1,"_","_","_","yad","PRL","","_","_"
2,"_","_","_","tu","CCD","","_","_"
3,"sūryeṇa","_","_","sūrya","NC","","_","_"
4,"niṣṭaptaṃ","_","_","niṣṭap","PPP","","_","_"
5,"gāṅgeyaṃ","_","_","gāṅgeya","JJ","","_","_"
6,"pibate","_","_","pib","V","pā","_","_"
7,"jalam","_","_","jala","NC","","_","_"
1,"gavāṃ","_","_","go","NC","","_","_"
2,"_","_","_","nirhāra","NC","","_","_"
3,"_","_","_","nirmuc","PPP","","_","_"
4,"yāvakāt","_","_","yāvaka","NC","","_","_"
5,"tad","_","_","tad","PRD","","_","_"
6,"viśiṣyate","_","_","viśās","V","viśās","_","_"
1,"_","_","_","induvrata","NC","","_","_"
2,"_","_","_","sahasra","NUM","","_","_"
3,"tu","_","_","tu","CCD","","_","_"
4,"cared","_","_","car","V","car","_","_"
5,"yaḥ","_","_","yad","PRL","","_","_"
6,"_","_","_","kāya","NC","","_","_"
7,"_","_","_","śodhana","JJ","","_","_"
1,"pibed","_","_","pib","V","pā","_","_"
2,"_","_","_","yad","PRL","","_","_"
3,"_","_","_","ca","CCD","","_","_"
4,"_","_","_","api","CX","","_","_"
5,"_","_","_","gaṅgā","NC","","_","_"
6,"_","_","_","ambhas","NC","","_","_"
7,"samau","_","_","sama","PPX","","_","_"
8,"syātāṃ","_","_","as","V","as","_","_"
9,"na","_","_","na","CNG","","_","_"
10,"vā","_","_","vā","CCD","","_","_"
11,"samau","_","_","sama","PPX","","_","_"
1,"tiṣṭhed","_","_","tiṣṭh","V","sthā","_","_"
2,"_","_","_","yuga","NC","","_","_"
3,"_","_","_","sahasra","NUM","","_","_"
4,"tu","_","_","tu","CCD","","_","_"
5,"_","_","_","pāda","NC","","_","_"
6,"_","_","_","eka","PPX","","_","_"
7,"yaḥ","_","_","yad","PRL","","_","_"
8,"pumān","_","_","puṃs","NC","","_","_"
1,"māsam","_","_","māsa","NC","","_","_"
2,"ekaṃ","_","_","eka","PPX","","_","_"
3,"tu","_","_","tu","CCD","","_","_"
4,"gaṅgāyāṃ","_","_","gaṅgā","NC","","_","_"
5,"samau","_","_","sama","PPX","","_","_"
6,"syātāṃ","_","_","as","V","as","_","_"
7,"na","_","_","na","CNG","","_","_"
8,"vā","_","_","vā","CCD","","_","_"
9,"samau","_","_","sama","PPX","","_","_"
1,"_","_","_","lamb","V","lamb","_","_"
2,"_","_","_","avākśiras","JJ","","_","_"
3,"_","_","_","yad","PRL","","_","_"
4,"_","_","_","tu","CCD","","_","_"
5,"yugānām","_","_","yuga","NC","","_","_"
6,"ayutaṃ","_","_","ayuta","NC","","_","_"
7,"pumān","_","_","puṃs","NC","","_","_"
1,"tiṣṭhed","_","_","tiṣṭh","V","sthā","_","_"
2,"_","_","_","yathā","CCM","","_","_"
3,"_","_","_","iṣ","PPP","","_","_"
4,"_","_","_","yad","PRL","","_","_"
5,"_","_","_","ca","CCD","","_","_"
6,"_","_","_","api","CX","","_","_"
7,"gaṅgāyāṃ","_","_","gaṅgā","NC","","_","_"
8,"sa","_","_","tad","PRD","","_","_"
9,"viśiṣyate","_","_","viśās","V","viśās","_","_"
1,"agnau","_","_","agni","NC","","_","_"
2,"prāptaṃ","_","_","prāp","PPP","","_","_"
3,"pradhūyeta","_","_","pradhū","V","pradhū","_","_"
4,"yathā","_","_","yathā","CCM","","_","_"
5,"tūlaṃ","_","_","tūla","NC","","_","_"
6,"dvijottama","_","_","dvijottama","NC","","_","_"
1,"tathā","_","_","tathā","CX","","_","_"
2,"_","_","_","gaṅgā","NC","","_","_"
3,"_","_","_","avagāh","PPP","","_","_"
4,"sarvaṃ","_","_","sarva","JQ","","_","_"
5,"pāpaṃ","_","_","pāpa","NC","","_","_"
6,"pradhūyate","_","_","pradhū","V","pradhū","_","_"
1,"bhūtānām","_","_","bhūta","NC","","_","_"
2,"iha","_","_","iha","CAD","","_","_"
3,"sarveṣāṃ","_","_","sarva","JQ","","_","_"
4,"_","_","_","duḥkha","NC","","_","_"
5,"_","_","_","upahan","PPP","","_","_"
6,"_","_","_","cetas","NC","","_","_"
1,"gatim","_","_","gati","NC","","_","_"
2,"anveṣamāṇānāṃ","_","_","anviṣ","KDP","","_","_"
3,"na","_","_","na","CNG","","_","_"
4,"_","_","_","gaṅgā","NC","","_","_"
5,"_","_","_","sadṛśa","JJ","","_","_"
6,"gatiḥ","_","_","gati","NC","","_","_"
1,"bhavanti","_","_","bhav","V","bhū","_","_"
2,"nirviṣāḥ","_","_","nirviṣa","JJ","","_","_"
3,"sarpā","_","_","sarpa","NC","","_","_"
4,"yathā","_","_","yathā","CCM","","_","_"
5,"tārkṣyasya","_","_","tārkṣya","NC","","_","_"
6,"darśanāt","_","_","darśana","NC","","_","_"
1,"gaṅgāyā","_","_","gaṅgā","NC","","_","_"
2,"darśanāt","_","_","darśana","NC","","_","_"
3,"tadvat","_","_","tadvat","CX","","_","_"
4,"_","_","_","sarva","JQ","","_","_"
5,"_","_","_","pāpa","NC","","_","_"
6,"pramucyate","_","_","pramuñc","V","pramuc","_","_"
1,"_","_","_","apratiṣṭha","JJ","","_","_"
2,"_","_","_","ca","CCD","","_","_"
3,"ye","_","_","yad","PRL","","_","_"
4,"kecid","_","_","kiṃcit","PRI","","_","_"
5,"_","_","_","adharma","NC","","_","_"
6,"_","_","_","śaraṇa","NC","","_","_"
7,"_","_","_","ca","CCD","","_","_"
8,"ye","_","_","yad","PRL","","_","_"
1,"teṣāṃ","_","_","tad","PRD","","_","_"
2,"pratiṣṭhā","_","_","pratiṣṭhā","NC","","_","_"
3,"_","_","_","gaṅgā","NC","","_","_"
4,"_","_","_","iha","CAD","","_","_"
5,"śaraṇaṃ","_","_","śaraṇa","NC","","_","_"
6,"śarma","_","_","śarman","NC","","_","_"
7,"varma","_","_","varman","NC","","_","_"
8,"ca","_","_","ca","CCD","","_","_"
1,"prakṛṣṭair","_","_","prakṛṣṭa","JJ","","_","_"
2,"aśubhair","_","_","aśubha","NC","","_","_"
3,"grastān","_","_","gras","PPP","","_","_"
4,"anekaiḥ","_","_","aneka","JJ","","_","_"
5,"_","_","_","puruṣa","NC","","_","_"
6,"_","_","_","adhama","JJ","","_","_"
1,"patato","_","_","pat","KDP","","_","_"
2,"narake","_","_","naraka","NC","","_","_"
3,"gaṅgā","_","_","gaṅgā","NC","","_","_"
4,"saṃśritān","_","_","saṃśri","PPP","","_","_"
5,"pretya","_","_","pre","CGDA","","_","_"
6,"tārayet","_","_","tar","V","tṛ","_","_"
1,"te","_","_","tad","PRD","","_","_"
2,"saṃvibhaktā","_","_","saṃvibhaj","PPP","","_","_"
3,"munibhir","_","_","muni","NC","","_","_"
4,"nūnaṃ","_","_","nūna","CX","","_","_"
5,"devaiḥ","_","_","deva","NC","","_","_"
6,"_","_","_","sa_saha","CX","","_","_"
7,"_","_","_","vāsava","NC","","_","_"
1,"ye","_","_","yad","PRL","","_","_"
2,"'bhigacchanti","_","_","abhiga","V","abhiga","_","_"
3,"satataṃ","_","_","satata","CX","","_","_"
4,"gaṅgām","_","_","gaṅgā","NC","","_","_"
5,"abhigatāṃ","_","_","abhiga","PPP","","_","_"
6,"suraiḥ","_","_","sura","NC","","_","_"
1,"_","_","_","vinaya","NC","","_","_"
2,"_","_","_","ācāra","NC","","_","_"
3,"_","_","_","hā","PPP","","_","_"
4,"_","_","_","ca","CCD","","_","_"
5,"_","_","_","aśiva","JJ","","_","_"
6,"_","_","_","ca","CCD","","_","_"
7,"_","_","_","nara","NC","","_","_"
8,"_","_","_","adhama","JJ","","_","_"
1,"te","_","_","tad","PRD","","_","_"
2,"bhavanti","_","_","bhav","V","bhū","_","_"
3,"śivā","_","_","śiva","JJ","","_","_"
4,"vipra","_","_","vipra","NC","","_","_"
5,"ye","_","_","yad","PRL","","_","_"
6,"vai","_","_","vai","CX","","_","_"
7,"gaṅgāṃ","_","_","gaṅgā","NC","","_","_"
8,"samāśritāḥ","_","_","samāśri","PPP","","_","_"
1,"yathā","_","_","yathā","CCM","","_","_"
2,"surāṇām","_","_","sura","NC","","_","_"
3,"amṛtaṃ","_","_","amṛta","NC","","_","_"
4,"pitṝṇāṃ","_","_","pitṛ","NC","","_","_"
5,"ca","_","_","ca","CCD","","_","_"
6,"yathā","_","_","yathā","CCM","","_","_"
7,"svadhā","_","_","svadhā","NC","","_","_"
1,"sudhā","_","_","sudhā","NC","","_","_"
2,"yathā","_","_","yathā","CCM","","_","_"
3,"ca","_","_","ca","CCD","","_","_"
4,"nāgānāṃ","_","_","nāga","NC","","_","_"
5,"tathā","_","_","tathā","CX","","_","_"
6,"_","_","_","gaṅgā","NC","","_","_"
7,"_","_","_","jala","NC","","_","_"
8,"nṛṇām","_","_","nṛ","NC","","_","_"
1,"upāsate","_","_","ās","V","ās","_","_"
2,"yathā","_","_","yathā","CCM","","_","_"
3,"bālā","_","_","bāla","NC","","_","_"
4,"mātaraṃ","_","_","mātṛ","NC","","_","_"
5,"_","_","_","kṣudhā","NC","","_","_"
6,"_","_","_","arday","PPP","","_","_"
1,"_","_","_","śreyaskāma","JJ","","_","_"
2,"_","_","_","tathā","CX","","_","_"
3,"gaṅgām","_","_","gaṅgā","NC","","_","_"
4,"_","_","_","upās","V","upās","_","_"
5,"_","_","_","iha","CAD","","_","_"
6,"dehinaḥ","_","_","dehin","NC","","_","_"
1,"svāyaṃbhuvaṃ","_","_","svāyambhuva","JJ","","_","_"
2,"yathā","_","_","yathā","CCM","","_","_"
3,"sthānaṃ","_","_","sthāna","NC","","_","_"
4,"sarveṣāṃ","_","_","sarva","JQ","","_","_"
5,"śreṣṭham","_","_","śreṣṭha","JJ","","_","_"
6,"ucyate","_","_","vak","V","vac","_","_"
1,"snātānāṃ","_","_","snā","PPP","","_","_"
2,"saritāṃ","_","_","sarit","NC","","_","_"
3,"śreṣṭhā","_","_","śreṣṭha","JJ","","_","_"
4,"gaṅgā","_","_","gaṅgā","NC","","_","_"
5,"tadvad","_","_","tadvat","CX","","_","_"
6,"_","_","_","iha","CAD","","_","_"
7,"_","_","_","vak","V","vac","_","_"
1,"_","_","_","yathā","CCM","","_","_"
2,"_","_","_","upajīvin","JJ","","_","_"
3,"dhenur","_","_","dhenu","NC","","_","_"
4,"_","_","_","deva","NC","","_","_"
5,"_","_","_","ādi","NC","","_","_"
6,"dharā","_","_","dharā","NC","","_","_"
7,"smṛtā","_","_","smṛ","PPP","","_","_"
1,"_","_","_","tathā","CX","","_","_"
2,"_","_","_","upajīvin","JJ","","_","_"
3,"gaṅgā","_","_","gaṅgā","NC","","_","_"
4,"_","_","_","sarva","JQ","","_","_"
5,"_","_","_","prāṇabhṛt","JJ","","_","_"
6,"iha","_","_","iha","CAD","","_","_"
1,"devāḥ","_","_","deva","NC","","_","_"
2,"_","_","_","soma","NC","","_","_"
3,"_","_","_","arka","NC","","_","_"
4,"_","_","_","saṃstha","JJ","","_","_"
5,"yathā","_","_","yathā","CCM","","_","_"
6,"_","_","_","sattra","NC","","_","_"
7,"_","_","_","ādi","NC","","_","_"
8,"makhaiḥ","_","_","makha","NC","","_","_"
1,"_","_","_","amṛta","NC","","_","_"
2,"_","_","_","upajīv","V","upajīv","_","_"
3,"tathā","_","_","tathā","CX","","_","_"
4,"_","_","_","gaṅgā","NC","","_","_"
5,"_","_","_","jala","NC","","_","_"
6,"narāḥ","_","_","nara","NC","","_","_"
1,"_","_","_","jāhnavī","NC","","_","_"
2,"_","_","_","pulina","NC","","_","_"
3,"_","_","_","uttha","JJ","","_","_"
4,"sikatābhiḥ","_","_","sikatā","NC","","_","_"
5,"samukṣitaḥ","_","_","samukṣ","PPP","","_","_"
1,"manyate","_","_","man","V","man","_","_"
2,"puruṣo","_","_","puruṣa","NC","","_","_"
3,"'%%tmānaṃ","_","_","ātman","NC","","_","_"
4,"diviṣṭham","_","_","diviṣṭha","JJ","","_","_"
5,"iva","_","_","iva","CCM","","_","_"
6,"śobhitam","_","_","śobhay","PPP","","_","_"
1,"_","_","_","jāhnavī","NC","","_","_"
2,"_","_","_","tīra","NC","","_","_"
3,"_","_","_","sambhū","PPP","","_","_"
4,"mṛdaṃ","_","_","mṛd","NC","","_","_"
5,"mūrdhnā","_","_","mūrdhan","NC","","_","_"
6,"bibharti","_","_","bhṛ","V","bhṛ","_","_"
7,"yaḥ","_","_","yad","PRL","","_","_"
1,"bibharti","_","_","bhṛ","V","bhṛ","_","_"
2,"rūpaṃ","_","_","rūpa","NC","","_","_"
3,"so","_","_","tad","PRD","","_","_"
4,"'rkasya","_","_","arka","NC","","_","_"
5,"_","_","_","tamas","NC","","_","_"
6,"_","_","_","nāśa","NC","","_","_"
7,"_","_","_","su","CAD","","_","_"
8,"_","_","_","nirmala","JJ","","_","_"
1,"_","_","_","gaṅgā","NC","","_","_"
2,"_","_","_","ūrmi","NC","","_","_"
3,"atho","_","_","atho","CX","","_","_"
4,"digdhaḥ","_","_","dih","PPP","","_","_"
5,"puruṣaṃ","_","_","puruṣa","NC","","_","_"
6,"pavano","_","_","pavana","NC","","_","_"
7,"yadā","_","_","yadā","CSB","","_","_"
1,"spṛśate","_","_","spṛś","V","spṛś","_","_"
2,"so","_","_","tad","PRD","","_","_"
3,"'pi","_","_","api","CX","","_","_"
4,"pāpmānaṃ","_","_","pāpman","NC","","_","_"
5,"sadya","_","_","sadyas","CAD","","_","_"
6,"_","_","_","eva","CEM","","_","_"
7,"_","_","_","apamṛj","V","apamṛj","_","_"
1,"vyasanair","_","_","vyasana","NC","","_","_"
2,"abhitaptasya","_","_","abhitap","PPP","","_","_"
3,"narasya","_","_","nara","NC","","_","_"
4,"vinaśiṣyataḥ","_","_","vinaś","KDP","","_","_"
1,"_","_","_","gaṅgā","NC","","_","_"
2,"_","_","_","darśana","NC","","_","_"
3,"_","_","_","ja","JJ","","_","_"
4,"prītir","_","_","prīti","NC","","_","_"
5,"_","_","_","vyasana","NC","","_","_"
6,"_","_","_","apakṛṣ","V","apakṛṣ","_","_"
1,"_","_","_","haṃsa","NC","","_","_"
2,"_","_","_","ārāva","NC","","_","_"
3,"_","_","_","koka","NC","","_","_"
4,"_","_","_","rava","NC","","_","_"
5,"ravair","_","_","rava","NC","","_","_"
6,"_","_","_","anya","PPX","","_","_"
7,"_","_","_","ca","CCD","","_","_"
8,"pakṣiṇām","_","_","pakṣin","NC","","_","_"
1,"paspardha","_","_","spardh","V","spṛdh","_","_"
2,"gaṅgā","_","_","gaṅgā","NC","","_","_"
3,"gandharvān","_","_","gandharva","NC","","_","_"
4,"_","_","_","pulina","NC","","_","_"
5,"_","_","_","ca","CCD","","_","_"
6,"śiloccayān","_","_","śiloccaya","NC","","_","_"
1,"_","_","_","haṃsa","NC","","_","_"
2,"_","_","_","ādi","NC","","_","_"
3,"_","_","_","su","CAD","","_","_"
4,"_","_","_","bahu","JJ","","_","_"
5,"vividhaiḥ","_","_","vividha","JJ","","_","_"
6,"pakṣibhir","_","_","pakṣin","NC","","_","_"
7,"vṛtām","_","_","vṛ","PPP","","_","_"
1,"gaṅgāṃ","_","_","gaṅgā","NC","","_","_"
2,"_","_","_","go","CX","","_","_"
3,"_","_","_","kula","NC","","_","_"
4,"_","_","_","sambādha","NC","","_","_"
5,"dṛṣṭvā","_","_","dṛś","CGDA","","_","_"
6,"svargo","_","_","svarga","NC","","_","_"
7,"'pi","_","_","api","CX","","_","_"
8,"vismṛtaḥ","_","_","vismṛ","PPP","","_","_"
1,"na","_","_","na","CNG","","_","_"
2,"sā","_","_","tad","PRD","","_","_"
3,"prītir","_","_","prīti","NC","","_","_"
4,"diviṣṭhasya","_","_","diviṣṭha","JJ","","_","_"
5,"_","_","_","sarva","JQ","","_","_"
6,"_","_","_","kāma","NC","","_","_"
1,"abhavad","_","_","bhav","V","bhū","_","_"
2,"yā","_","_","yad","PRL","","_","_"
3,"parā","_","_","para","PPX","","_","_"
4,"prītir","_","_","prīti","NC","","_","_"
5,"gaṅgāyāḥ","_","_","gaṅgā","NC","","_","_"
6,"puline","_","_","pulina","NC","","_","_"
7,"nṛṇām","_","_","nṛ","NC","","_","_"
1,"_","_","_","vāc","NC","","_","_"
2,"_","_","_","manas","NC","","_","_"
3,"_","_","_","karman","NC","","_","_"
4,"_","_","_","ja","JJ","","_","_"
5,"grastaḥ","_","_","gras","PPP","","_","_"
6,"pāpair","_","_","pāpa","NC","","_","_"
7,"api","_","_","api","CX","","_","_"
8,"pumān","_","_","puṃs","NC","","_","_"
9,"iha","_","_","iha","CAD","","_","_"
1,"vīkṣya","_","_","vīkṣ","CGDA","","_","_"
2,"gaṅgāṃ","_","_","gaṅgā","NC","","_","_"
3,"bhavet","_","_","bhav","V","bhū","_","_"
4,"_","_","_","pū","PPP","","_","_"
5,"_","_","_","tatra","CAD","","_","_"
6,"me","_","_","mat","PPR","","_","_"
7,"_","_","_","na","CNG","","_","_"
8,"_","_","_","as","V","as","_","_"
9,"saṃśayaḥ","_","_","saṃśaya","NC","","_","_"
1,"_","_","_","saptan","NUM","","_","_"
2,"_","_","_","avara","JJ","","_","_"
3,"sapta","_","_","saptan","NUM","","_","_"
4,"parān","_","_","para","PPX","","_","_"
5,"_","_","_","pitṛ","NC","","_","_"
6,"_","_","_","tad","PRD","","_","_"
7,"_","_","_","ca","CCD","","_","_"
8,"ye","_","_","yad","PRL","","_","_"
9,"pare","_","_","para","PPX","","_","_"
1,"_","_","_","puṃs","NC","","_","_"
2,"_","_","_","tāray","V","tāray","_","_"
3,"gaṅgāṃ","_","_","gaṅgā","NC","","_","_"
4,"vīkṣya","_","_","vīkṣ","CGDA","","_","_"
5,"_","_","_","spṛś","CGDA","","_","_"
6,"_","_","_","avagāh","CGDA","","_","_"
7,"ca","_","_","ca","CCD","","_","_"
1,"_","_","_","śru","PPP","","_","_"
2,"_","_","_","abhilaṣ","PPP","","_","_"
3,"dṛṣṭā","_","_","dṛś","PPP","","_","_"
4,"spṛṣṭā","_","_","spṛś","PPP","","_","_"
5,"_","_","_","pā","PPP","","_","_"
6,"_","_","_","avagāh","PPP","","_","_"
1,"gaṅgā","_","_","gaṅgā","NC","","_","_"
2,"tārayate","_","_","tar","V","tṛ","_","_"
3,"nṝṇām","_","_","nṛ","NC","","_","_"
4,"ubhau","_","_","ubh","PPX","","_","_"
5,"vaṃśau","_","_","vaṃśa","NC","","_","_"
6,"viśeṣataḥ","_","_","viśeṣataḥ","CX","","_","_"
1,"darśanāt","_","_","darśana","NC","","_","_"
2,"sparśanāt","_","_","sparśana","NC","","_","_"
3,"pānāt","_","_","pāna","NC","","_","_"
4,"tathā","_","_","tathā","CX","","_","_"
5,"_","_","_","gaṅgā","NC","","_","_"
6,"_","_","_","iti","CQT","","_","_"
7,"kīrtanāt","_","_","kīrtana","NC","","_","_"
1,"_","_","_","pū","V","pū","_","_"
2,"_","_","_","apuṇya","JJ","","_","_"
3,"puruṣāñ","_","_","puruṣa","NC","","_","_"
4,"śataśo","_","_","śataśas","CX","","_","_"
5,"'tha","_","_","atha","CAD","","_","_"
6,"sahasraśaḥ","_","_","sahasraśas","CX","","_","_"
1,"ya","_","_","yad","PRL","","_","_"
2,"icchet","_","_","iṣ","V","iṣ","_","_"
3,"saphalaṃ","_","_","saphala","JJ","","_","_"
4,"janma","_","_","janman","NC","","_","_"
5,"jīvitaṃ","_","_","jīvita","NC","","_","_"
6,"śrutam","_","_","śruta","NC","","_","_"
7,"eva","_","_","eva","CEM","","_","_"
8,"ca","_","_","ca","CCD","","_","_"
1,"sa","_","_","tad","PRD","","_","_"
2,"_","_","_","pitṛ","NC","","_","_"
3,"_","_","_","tarpay","V","tarpay","_","_"
4,"gaṅgām","_","_","gaṅgā","NC","","_","_"
5,"abhigamya","_","_","abhiga","CGDA","","_","_"
6,"_","_","_","sura","NC","","_","_"
7,"_","_","_","tathā","CX","","_","_"
1,"na","_","_","na","CNG","","_","_"
2,"sutair","_","_","suta","NC","","_","_"
3,"na","_","_","na","CNG","","_","_"
4,"ca","_","_","ca","CCD","","_","_"
5,"vittena","_","_","vitta","NC","","_","_"
6,"karmaṇā","_","_","karman","NC","","_","_"
7,"na","_","_","na","CNG","","_","_"
8,"ca","_","_","ca","CCD","","_","_"
9,"tat","_","_","tad","PRD","","_","_"
10,"phalam","_","_","phala","NC","","_","_"
1,"prāpnuyāt","_","_","prāpn","V","prāp","_","_"
2,"puruṣo","_","_","puruṣa","NC","","_","_"
3,"'tyantaṃ","_","_","atyanta","JJ","","_","_"
4,"gaṅgāṃ","_","_","gaṅgā","NC","","_","_"
5,"prāpya","_","_","prāp","CGDA","","_","_"
6,"yad","_","_","yad","PRL","","_","_"
7,"āpnuyāt","_","_","āpn","V","āp","_","_"
1,"_","_","_","jāti","NC","","_","_"
2,"_","_","_","andha","JJ","","_","_"
3,"iha","_","_","iha","CAD","","_","_"
4,"_","_","_","tulya","JJ","","_","_"
5,"_","_","_","tad","PRD","","_","_"
6,"mṛtaiḥ","_","_","mṛ","PPP","","_","_"
7,"paṅgubhir","_","_","paṅgu","JJ","","_","_"
8,"eva","_","_","eva","CEM","","_","_"
9,"ca","_","_","ca","CCD","","_","_"
1,"samarthā","_","_","samartha","JJ","","_","_"
2,"ye","_","_","yad","PRL","","_","_"
3,"na","_","_","na","CNG","","_","_"
4,"paśyanti","_","_","paś","V","paś","_","_"
5,"gaṅgāṃ","_","_","gaṅgā","NC","","_","_"
6,"_","_","_","puṇya","JJ","","_","_"
7,"_","_","_","jala","NC","","_","_"
8,"śivām","_","_","śiva","JJ","","_","_"
1,"_","_","_","bhū","PPP","","_","_"
2,"_","_","_","bhū","KDG","","_","_"
3,"_","_","_","bhaviṣya","JJ","","_","_"
4,"_","_","_","jña","JJ","","_","_"
5,"_","_","_","mahat","JJ","","_","_"
6,"_","_","_","ṛṣi","NC","","_","_"
7,"upasthitām","_","_","upasthā","PPP","","_","_"
1,"devaiḥ","_","_","deva","NC","","_","_"
2,"_","_","_","sa_saha","CX","","_","_"
3,"_","_","_","indra","NC","","_","_"
4,"_","_","_","ca","CCD","","_","_"
5,"ko","_","_","kiṃ","PRQ","","_","_"
6,"gaṅgāṃ","_","_","gaṅgā","NC","","_","_"
7,"_","_","_","na","CNG","","_","_"
8,"_","_","_","upasev","V","upasev","_","_"
9,"mānavaḥ","_","_","mānava","NC","","_","_"
1,"vānaprasthair","_","_","vānaprastha","NC","","_","_"
2,"_","_","_","gṛhastha","NC","","_","_"
3,"_","_","_","ca","CCD","","_","_"
4,"yatibhir","_","_","yati","NC","","_","_"
5,"brahmacāribhiḥ","_","_","brahmacārin","NC","","_","_"
1,"vidyāvadbhiḥ","_","_","vidyāvat","JJ","","_","_"
2,"śritāṃ","_","_","śri","PPP","","_","_"
3,"gaṅgāṃ","_","_","gaṅgā","NC","","_","_"
4,"pumān","_","_","puṃs","NC","","_","_"
5,"ko","_","_","kiṃ","PRQ","","_","_"
6,"nāma","_","_","nāma","CX","","_","_"
7,"_","_","_","na","CNG","","_","_"
8,"_","_","_","āśray","V","āśri","_","_"
1,"_","_","_","utkra","KDP","","_","_"
2,"_","_","_","ca","CCD","","_","_"
3,"yaḥ","_","_","yad","PRL","","_","_"
4,"prāṇaiḥ","_","_","prāṇa","NC","","_","_"
5,"prayataḥ","_","_","praya","PPP","","_","_"
6,"_","_","_","śās","PPP","","_","_"
7,"_","_","_","samman","PPP","","_","_"
1,"_","_","_","cintay","V","cintay","_","_"
2,"_","_","_","manas","NC","","_","_"
3,"gaṅgāṃ","_","_","gaṅgā","NC","","_","_"
4,"sa","_","_","tad","PRD","","_","_"
5,"gatiṃ","_","_","gati","NC","","_","_"
6,"paramāṃ","_","_","parama","JJ","","_","_"
7,"labhet","_","_","labh","V","labh","_","_"
1,"na","_","_","na","CNG","","_","_"
2,"bhayebhyo","_","_","bhaya","NC","","_","_"
3,"bhayaṃ","_","_","bhaya","NC","","_","_"
4,"tasya","_","_","tad","PRD","","_","_"
5,"na","_","_","na","CNG","","_","_"
6,"pāpebhyo","_","_","pāpa","NC","","_","_"
7,"na","_","_","na","CNG","","_","_"
8,"rājataḥ","_","_","rājan","NC","","_","_"
1,"dehapatanād","_","_","dehapatana","NC","","_","_"
2,"gaṅgām","_","_","gaṅgā","NC","","_","_"
3,"upāste","_","_","ās","V","ās","_","_"
4,"yaḥ","_","_","yad","PRL","","_","_"
5,"pumān","_","_","puṃs","NC","","_","_"
6,"iha","_","_","iha","CAD","","_","_"
1,"gaganād","_","_","gagana","NC","","_","_"
2,"yāṃ","_","_","yad","PRL","","_","_"
3,"_","_","_","mahat","JJ","","_","_"
4,"_","_","_","puṇya","JJ","","_","_"
5,"patantīṃ","_","_","pat","KDP","","_","_"
6,"vai","_","_","vai","CX","","_","_"
7,"maheśvaraḥ","_","_","maheśvara","NC","","_","_"
1,"dadhāra","_","_","dhar","V","dhṛ","_","_"
2,"śirasā","_","_","śiras","NC","","_","_"
3,"devīṃ","_","_","devī","NC","","_","_"
4,"tām","_","_","tad","PRD","","_","_"
5,"eva","_","_","eva","CEM","","_","_"
6,"divi","_","_","div","NC","","_","_"
7,"sevate","_","_","sev","V","sev","_","_"
1,"_","_","_","alaṃkṛ","PPP","","_","_"
2,"_","_","_","tri","NUM","","_","_"
3,"lokāḥ","_","_","loka","NC","","_","_"
4,"pathibhir","_","_","pathin","NC","","_","_"
5,"_","_","_","vimala","JJ","","_","_"
6,"_","_","_","tri","NUM","","_","_"
1,"_","_","_","yad","PRL","","_","_"
2,"_","_","_","tu","CCD","","_","_"
3,"tasyā","_","_","tad","PRD","","_","_"
4,"jalaṃ","_","_","jala","NC","","_","_"
5,"sevet","_","_","sev","V","sev","_","_"
6,"kṛtakṛtyaḥ","_","_","kṛtakṛtya","JJ","","_","_"
7,"pumān","_","_","puṃs","NC","","_","_"
8,"bhavet","_","_","bhav","V","bhū","_","_"
1,"divi","_","_","div","NC","","_","_"
2,"jyotir","_","_","jyotis","NC","","_","_"
3,"_","_","_","yathā","CCM","","_","_"
4,"_","_","_","āditya","NC","","_","_"
5,"pitṝṇāṃ","_","_","pitṛ","NC","","_","_"
6,"_","_","_","ca","CCD","","_","_"
7,"_","_","_","eva","CEM","","_","_"
8,"candramāḥ","_","_","candramas","NC","","_","_"
1,"_","_","_","deva","NC","","_","_"
2,"_","_","_","īśa","NC","","_","_"
3,"_","_","_","ca","CCD","","_","_"
4,"yathā","_","_","yathā","CCM","","_","_"
5,"nṝṇāṃ","_","_","nṛ","NC","","_","_"
6,"_","_","_","gaṅgā","NC","","_","_"
7,"_","_","_","iha","CAD","","_","_"
8,"saritāṃ","_","_","sarit","NC","","_","_"
9,"tathā","_","_","tathā","CX","","_","_"
1,"mātrā","_","_","mātṛ","NC","","_","_"
2,"pitrā","_","_","pitṛ","NC","","_","_"
3,"sutair","_","_","suta","NC","","_","_"
4,"dārair","_","_","dāra","NC","","_","_"
5,"viyuktasya","_","_","viyuj","PPP","","_","_"
6,"dhanena","_","_","dhana","NC","","_","_"
7,"vā","_","_","vā","CCD","","_","_"
1,"na","_","_","na","CNG","","_","_"
2,"_","_","_","bhav","V","bhū","_","_"
3,"_","_","_","hi","CX","","_","_"
4,"tathā","_","_","tathā","CX","","_","_"
5,"duḥkhaṃ","_","_","duḥkha","NC","","_","_"
6,"yathā","_","_","yathā","CCM","","_","_"
7,"_","_","_","gaṅgā","NC","","_","_"
8,"_","_","_","viyoga","NC","","_","_"
9,"_","_","_","ja","JJ","","_","_"
1,"_","_","_","na","CNG","","_","_"
2,"_","_","_","āraṇya","JJ","","_","_"
3,"_","_","_","na","CNG","","_","_"
4,"_","_","_","iṣ","PPP","","_","_"
5,"_","_","_","viṣaya","NC","","_","_"
6,"na","_","_","na","CNG","","_","_"
7,"sutair","_","_","suta","NC","","_","_"
8,"na","_","_","na","CNG","","_","_"
9,"_","_","_","dhana","NC","","_","_"
10,"_","_","_","āgama","NC","","_","_"
1,"tathā","_","_","tathā","CX","","_","_"
2,"prasādo","_","_","prasāda","NC","","_","_"
3,"bhavati","_","_","bhav","V","bhū","_","_"
4,"gaṅgāṃ","_","_","gaṅgā","NC","","_","_"
5,"vīkṣya","_","_","vīkṣ","CGDA","","_","_"
6,"yathā","_","_","yathā","CCM","","_","_"
7,"nṛṇām","_","_","nṛ","NC","","_","_"
1,"pūrṇam","_","_","pṛ","PPP","","_","_"
2,"induṃ","_","_","indu","NC","","_","_"
3,"yathā","_","_","yathā","CCM","","_","_"
4,"dṛṣṭvā","_","_","dṛś","CGDA","","_","_"
5,"nṛṇāṃ","_","_","nṛ","NC","","_","_"
6,"dṛṣṭiḥ","_","_","dṛṣṭi","NC","","_","_"
7,"prasīdati","_","_","prasīd","V","prasad","_","_"
1,"gaṅgāṃ","_","_","gaṅgā","NC","","_","_"
2,"tripathagāṃ","_","_","tripathagā","NC","","_","_"
3,"dṛṣṭvā","_","_","dṛś","CGDA","","_","_"
4,"tathā","_","_","tathā","CX","","_","_"
5,"dṛṣṭiḥ","_","_","dṛṣṭi","NC","","_","_"
6,"prasīdati","_","_","prasīd","V","prasad","_","_"
1,"_","_","_","tad","PRD","","_","_"
2,"_","_","_","bhāva","NC","","_","_"
3,"_","_","_","tad","PRD","","_","_"
4,"_","_","_","ga","PPP","","_","_"
5,"_","_","_","manas","NC","","_","_"
6,"_","_","_","tad","PRD","","_","_"
7,"_","_","_","niṣṭhā","NC","","_","_"
8,"_","_","_","tad","PRD","","_","_"
9,"_","_","_","parāyaṇa","NC","","_","_"
1,"gaṅgāṃ","_","_","gaṅgā","NC","","_","_"
2,"yo","_","_","yad","PRL","","_","_"
3,"'nugato","_","_","anuga","PPP","","_","_"
4,"bhaktyā","_","_","bhakti","NC","","_","_"
5,"sa","_","_","tad","PRD","","_","_"
6,"tasyāḥ","_","_","tad","PRD","","_","_"
7,"_","_","_","priya","JJ","","_","_"
9,"vrajet","_","_","vraj","V","vraj","_","_"
1,"_","_","_","bhū","NC","","_","_"
2,"_","_","_","stha","JJ","","_","_"
3,"_","_","_","kha","NC","","_","_"
4,"_","_","_","stha","JJ","","_","_"
5,"_","_","_","diviṣṭha","JJ","","_","_"
6,"_","_","_","ca","CCD","","_","_"
7,"bhūtair","_","_","bhūta","NC","","_","_"
8,"uccāvacair","_","_","uccāvaca","JJ","","_","_"
9,"api","_","_","api","CX","","_","_"
1,"gaṅgā","_","_","gaṅgā","NC","","_","_"
2,"vigāhyā","_","_","vigāh","KDG","","_","_"
3,"satatam","_","_","satata","CX","","_","_"
4,"etat","_","_","tad","PRD","","_","_"
5,"kāryatamaṃ","_","_","kāryatama","JJ","","_","_"
6,"satām","_","_","sat","JJ","","_","_"
1,"triṣu","_","_","tri","NUM","","_","_"
2,"lokeṣu","_","_","loka","NC","","_","_"
3,"_","_","_","puṇya","JJ","","_","_"
5,"gaṅgāyāḥ","_","_","gaṅgā","NC","","_","_"
6,"prathitaṃ","_","_","prath","PPP","","_","_"
7,"yaśaḥ","_","_","yaśas","NC","","_","_"
1,"yat","_","_","yat","CSB","","_","_"
2,"putrān","_","_","putra","NC","","_","_"
3,"_","_","_","sagara","NC","","_","_"
4,"_","_","_","tad","PRD","","_","_"
5,"_","_","_","bhasman","NC","","_","_"
6,"_","_","_","ākhyā","NC","","_","_"
7,"anayad","_","_","nay","V","nī","_","_"
8,"divam","_","_","div","NC","","_","_"
1,"_","_","_","vāyu","NC","","_","_"
2,"_","_","_","īray","PPP","","_","_"
3,"_","_","_","su","CAD","","_","_"
4,"_","_","_","mahat","JJ","","_","_"
5,"_","_","_","svana","NC","","_","_"
6,"drutābhir","_","_","dru","PPP","","_","_"
7,"_","_","_","atyartha","JJ","","_","_"
8,"_","_","_","samucchri","PPP","","_","_"
1,"_","_","_","gaṅgā","NC","","_","_"
2,"_","_","_","ūrmi","NC","","_","_"
3,"bhānumatībhir","_","_","bhānumat","JJ","","_","_"
4,"iddhaḥ","_","_","indh","PPP","","_","_"
5,"_","_","_","sahasraraśmi","NC","","_","_"
6,"_","_","_","pratimā","NC","","_","_"
7,"vibhāti","_","_","vibhā","V","vibhā","_","_"
1,"payasvinīṃ","_","_","payasvin","JJ","","_","_"
2,"ghṛtinīm","_","_","ghṛtin","JJ","","_","_"
3,"_","_","_","ati","CADP","","_","_"
4,"_","_","_","udāra","JJ","","_","_"
5,"samṛddhinīṃ","_","_","samṛddhin","JJ","","_","_"
6,"veginīṃ","_","_","vegin","JJ","","_","_"
7,"durvigāhyām","_","_","durvigāhya","JJ","","_","_"
1,"gaṅgāṃ","_","_","gaṅgā","NC","","_","_"
2,"gatvā","_","_","ga","CGDA","","_","_"
3,"yaiḥ","_","_","yad","PRL","","_","_"
4,"śarīraṃ","_","_","śarīra","NC","","_","_"
5,"visṛṣṭaṃ","_","_","visṛj","PPP","","_","_"
6,"gatā","_","_","ga","PPP","","_","_"
7,"_","_","_","dhīra","JJ","","_","_"
8,"_","_","_","tad","PRD","","_","_"
9,"vibudhaiḥ","_","_","vibudha","NC","","_","_"
10,"_","_","_","sama","PPX","","_","_"
1,"andhāñ","_","_","andha","JJ","","_","_"
2,"jaḍān","_","_","jaḍa","JJ","","_","_"
3,"_","_","_","dravya","NC","","_","_"
4,"_","_","_","hā","PPP","","_","_"
5,"_","_","_","ca","CCD","","_","_"
6,"gaṅgā","_","_","gaṅgā","NC","","_","_"
7,"yaśasvinī","_","_","yaśasvin","JJ","","_","_"
8,"bṛhatī","_","_","bṛhat","JJ","","_","_"
9,"_","_","_","viśva","JQ","","_","_"
10,"_","_","_","rūpa","NC","","_","_"
1,"devaiḥ","_","_","deva","NC","","_","_"
2,"_","_","_","sa_saha","CX","","_","_"
3,"_","_","_","indra","NC","","_","_"
4,"munibhir","_","_","muni","NC","","_","_"
5,"_","_","_","mānava","NC","","_","_"
6,"_","_","_","ca","CCD","","_","_"
7,"niṣevitā","_","_","niṣev","PPP","","_","_"
8,"_","_","_","sarva","JQ","","_","_"
9,"_","_","_","kāma","NC","","_","_"
10,"yunakti","_","_","yuj","V","yuj","_","_"
1,"ūrjāvatīṃ","_","_","ūrjāvat","JJ","","_","_"
2,"madhumatīṃ","_","_","madhumat","JJ","","_","_"
3,"_","_","_","mahat","JJ","","_","_"
4,"_","_","_","puṇya","JJ","","_","_"
5,"_","_","_","tri","NUM","","_","_"
6,"_","_","_","vartman","NC","","_","_"
7,"_","_","_","ga","JJ","","_","_"
1,"_","_","_","triloka","NC","","_","_"
2,"_","_","_","goptṛ","JJ","","_","_"
3,"ye","_","_","yad","PRL","","_","_"
4,"gaṅgāṃ","_","_","gaṅgā","NC","","_","_"
5,"_","_","_","saṃśri","PPP","","_","_"
6,"_","_","_","tad","PRD","","_","_"
7,"divaṃ","_","_","div","NC","","_","_"
8,"gatāḥ","_","_","ga","PPP","","_","_"
1,"yo","_","_","yad","PRL","","_","_"
2,"vatsyati","_","_","vas","V","vas","_","_"
3,"drakṣyati","_","_","darś","V","dṛś","_","_"
4,"_","_","_","vā","CCD","","_","_"
5,"_","_","_","api","CX","","_","_"
6,"martyas","_","_","martya","NC","","_","_"
7,"tasmai","_","_","tad","PRD","","_","_"
8,"prayacchanti","_","_","praya","V","praya","_","_"
9,"sukhāni","_","_","sukha","NC","","_","_"
10,"devāḥ","_","_","deva","NC","","_","_"
1,"_","_","_","tad","PRD","","_","_"
2,"_","_","_","bhāvay","PPP","","_","_"
3,"sparśane","_","_","sparśana","NC","","_","_"
4,"darśane","_","_","darśana","NC","","_","_"
5,"yas","_","_","yad","PRL","","_","_"
6,"tasmai","_","_","tad","PRD","","_","_"
7,"devā","_","_","deva","NC","","_","_"
8,"gatim","_","_","gati","NC","","_","_"
9,"iṣṭāṃ","_","_","iṣ","PPP","","_","_"
10,"diśanti","_","_","diś","V","diś","_","_"
1,"dakṣāṃ","_","_","dakṣa","JJ","","_","_"
2,"pṛthvīṃ","_","_","pṛthu","JJ","","_","_"
3,"bṛhatīṃ","_","_","bṛhat","JJ","","_","_"
4,"viprakṛṣṭāṃ","_","_","viprakṛṣṭa","JJ","","_","_"
5,"śivām","_","_","śiva","JJ","","_","_"
6,"ṛtāṃ","_","_","ṛta","JJ","","_","_"
7,"_","_","_","su","CAD","","_","_"
8,"_","_","_","rasa","NC","","_","_"
9,"_","_","_","su","CAD","","_","_"
10,"_","_","_","prasad","PPP","","_","_"
1,"vibhāvarīṃ","_","_","vibhāvarī","NC","","_","_"
2,"_","_","_","sarva","JQ","","_","_"
3,"_","_","_","bhūta","NC","","_","_"
4,"_","_","_","pratiṣṭhā","NC","","_","_"
5,"gaṅgāṃ","_","_","gaṅgā","NC","","_","_"
6,"gatā","_","_","ga","PPP","","_","_"
7,"ye","_","_","yad","PRL","","_","_"
8,"tridivaṃ","_","_","tridiva","NC","","_","_"
9,"_","_","_","ga","PPP","","_","_"
10,"_","_","_","tad","PRD","","_","_"
1,"khyātir","_","_","khyāti","NC","","_","_"
2,"yasyāḥ","_","_","yad","PRL","","_","_"
3,"khaṃ","_","_","kha","NC","","_","_"
4,"divaṃ","_","_","div","NC","","_","_"
5,"gāṃ","_","_","go","NC","","_","_"
6,"ca","_","_","ca","CCD","","_","_"
7,"nityaṃ","_","_","nitya","CX","","_","_"
8,"purā","_","_","purā","CX","","_","_"
9,"diśo","_","_","diś","NC","","_","_"
10,"_","_","_","vidiś","NC","","_","_"
11,"_","_","_","ca","CCD","","_","_"
12,"_","_","_","avatiṣṭh","V","avasthā","_","_"
1,"tasyā","_","_","tad","PRD","","_","_"
2,"jalaṃ","_","_","jala","NC","","_","_"
3,"sevya","_","_","sev","CGDA","","_","_"
4,"saridvarāyā","_","_","saridvarā","NC","","_","_"
5,"martyāḥ","_","_","martya","NC","","_","_"
6,"sarve","_","_","sarva","JQ","","_","_"
7,"kṛtakṛtyā","_","_","kṛtakṛtya","JJ","","_","_"
8,"bhavanti","_","_","bhav","V","bhū","_","_"
1,"iyaṃ","_","_","ida","PRD","","_","_"
2,"_","_","_","gaṅgā","NC","","_","_"
3,"_","_","_","iti","CQT","","_","_"
4,"niyataṃ","_","_","niyata","CX","","_","_"
5,"pratiṣṭhā","_","_","pratiṣṭhā","NC","","_","_"
6,"guhasya","_","_","guha","NC","","_","_"
7,"rukmasya","_","_","rukma","NC","","_","_"
8,"ca","_","_","ca","CCD","","_","_"
9,"garbhayoṣā","_","_","garbhayoṣā","NC","","_","_"
1,"_","_","_","prātar","CX","","_","_"
2,"_","_","_","tri","NUM","","_","_"
3,"_","_","_","mārga","NC","","_","_"
4,"_","_","_","ghṛta","NC","","_","_"
5,"_","_","_","vaha","JJ","","_","_"
6,"vipāpmā","_","_","vipāpman","JJ","","_","_"
7,"_","_","_","gaṅgā","NC","","_","_"
8,"_","_","_","avatṛ","PPP","","_","_"
9,"viyato","_","_","viyat","NC","","_","_"
10,"_","_","_","viśva","JQ","","_","_"
11,"_","_","_","toya","NC","","_","_"
1,"_","_","_","sutā","NC","","_","_"
2,"_","_","_","avanīdhra","NC","","_","_"
3,"harasya","_","_","hara","NC","","_","_"
4,"bhāryā","_","_","bhāryā","NC","","_","_"
5,"divo","_","_","div","NC","","_","_"
6,"_","_","_","bhū","NC","","_","_"
7,"_","_","_","ca","CCD","","_","_"
8,"_","_","_","api","CX","","_","_"
9,"_","_","_","kakṣyā","NC","","_","_"
10,"_","_","_","anurūpa","JJ","","_","_"
1,"bhavyā","_","_","bhavya","JJ","","_","_"
2,"pṛthivyā","_","_","pṛthivī","NC","","_","_"
3,"bhāvinī","_","_","bhāvin","JJ","","_","_"
4,"bhāti","_","_","bhā","V","bhā","_","_"
5,"rājan","_","_","rājan","NC","","_","_"
6,"gaṅgā","_","_","gaṅgā","NC","","_","_"
7,"lokānāṃ","_","_","loka","NC","","_","_"
8,"_","_","_","puṇya","NC","","_","_"
9,"_","_","_","da","JJ","","_","_"
10,"vai","_","_","vai","CX","","_","_"
11,"trayāṇām","_","_","tri","NUM","","_","_"
1,"_","_","_","madhu","NC","","_","_"
2,"_","_","_","pravāha","NC","","_","_"
3,"_","_","_","ghṛta","NC","","_","_"
4,"_","_","_","rāga","NC","","_","_"
5,"_","_","_","uddhṛ","PPP","","_","_"
6,"_","_","_","mahat","JJ","","_","_"
7,"_","_","_","ūrmi","NC","","_","_"
8,"śobhitā","_","_","śobhay","PPP","","_","_"
9,"_","_","_","brāhmaṇa","NC","","_","_"
10,"_","_","_","ca","CCD","","_","_"
1,"_","_","_","div","NC","","_","_"
2,"_","_","_","cyu","PPP","","_","_"
3,"_","_","_","śiras","NC","","_","_"
4,"_","_","_","ādā","PPP","","_","_"
5,"bhavena","_","_","bhava","NC","","_","_"
6,"_","_","_","gaṅgā","NC","","_","_"
7,"_","_","_","avanīdhra","NC","","_","_"
8,"_","_","_","tridiva","NC","","_","_"
9,"mālā","_","_","mālā","NC","","_","_"
1,"yonir","_","_","yoni","NC","","_","_"
2,"variṣṭhā","_","_","variṣṭha","JJ","","_","_"
3,"virajā","_","_","virajas","JJ","","_","_"
4,"vitanvī","_","_","vitanu","JJ","","_","_"
5,"śuṣmā","_","_","śuṣma","JJ","","_","_"
6,"irā","_","_","irā","NC","","_","_"
7,"_","_","_","vāri","NC","","_","_"
8,"_","_","_","vaha","JJ","","_","_"
9,"_","_","_","yaśas","NC","","_","_"
10,"_","_","_","da","JJ","","_","_"
1,"viśvāvatī","_","_","viśvāvatī","NC","","_","_"
2,"_","_","_","ca","CCD","","_","_"
3,"_","_","_","ākṛti","NC","","_","_"
4,"iṣṭir","_","_","iṣṭi","NC","","_","_"
5,"iddhā","_","_","indh","PPP","","_","_"
6,"_","_","_","gaṅgā","NC","","_","_"
7,"_","_","_","ukṣ","PPP","","_","_"
8,"bhuvanasya","_","_","bhuvana","NC","","_","_"
9,"panthāḥ","_","_","pathin","NC","","_","_"
1,"kṣāntyā","_","_","kṣānti","NC","","_","_"
2,"mahyā","_","_","mahī","NC","","_","_"
3,"gopane","_","_","gopana","NC","","_","_"
4,"dhāraṇe","_","_","dhāraṇa","NC","","_","_"
5,"ca","_","_","ca","CCD","","_","_"
6,"dīptyā","_","_","dīpti","NC","","_","_"
7,"_","_","_","kṛśānu","NC","","_","_"
8,"_","_","_","tapana","NC","","_","_"
9,"_","_","_","ca","CCD","","_","_"
10,"_","_","_","eva","CEM","","_","_"
1,"tulyā","_","_","tulya","JJ","","_","_"
2,"gaṅgā","_","_","gaṅgā","NC","","_","_"
3,"saṃmatā","_","_","samman","PPP","","_","_"
4,"brāhmaṇānāṃ","_","_","brāhmaṇa","NC","","_","_"
5,"guhasya","_","_","guha","NC","","_","_"
6,"_","_","_","brahmaṇya","JJ","","_","_"
8,"ca","_","_","ca","CCD","","_","_"
9,"nityam","_","_","nitya","CX","","_","_"
1,"ṛṣiṣṭutāṃ","_","_","ṛṣiṣṭuta","JJ","","_","_"
2,"viṣṇupadīṃ","_","_","viṣṇupadī","NC","","_","_"
3,"purāṇīṃ","_","_","purāṇa","JJ","","_","_"
4,"_","_","_","su","CAD","","_","_"
5,"_","_","_","puṇya","JJ","","_","_"
6,"_","_","_","toya","NC","","_","_"
7,"_","_","_","manas","NC","","_","_"
8,"_","_","_","api","CX","","_","_"
9,"loke","_","_","loka","NC","","_","_"
1,"_","_","_","sarva","JQ","","_","_"
2,"_","_","_","ātman","NC","","_","_"
3,"jāhnavīṃ","_","_","jāhnavī","NC","","_","_"
4,"ye","_","_","yad","PRL","","_","_"
5,"prapannās","_","_","prapad","PPP","","_","_"
6,"te","_","_","tad","PRD","","_","_"
7,"brahmaṇaḥ","_","_","brahman","NC","","_","_"
8,"sadanaṃ","_","_","sadana","NC","","_","_"
9,"samprayātāḥ","_","_","samprayā","PPP","","_","_"
1,"lokān","_","_","loka","NC","","_","_"
2,"_","_","_","ida","PRD","","_","_"
3,"_","_","_","nay","V","nī","_","_"
4,"yā","_","_","yad","PRL","","_","_"
5,"_","_","_","jananī","NC","","_","_"
6,"_","_","_","iva","CCM","","_","_"
7,"putrān","_","_","putra","NC","","_","_"
8,"_","_","_","sarva","JQ","","_","_"
9,"_","_","_","ātman","NC","","_","_"
10,"_","_","_","sarva","JQ","","_","_"
11,"_","_","_","guṇa","NC","","_","_"
12,"_","_","_","upapad","PPP","","_","_"
1,"_","_","_","sva","JJ","","_","_"
2,"_","_","_","sthāna","NC","","_","_"
3,"iṣṭam","_","_","iṣ","PPP","","_","_"
4,"iha","_","_","iha","CAD","","_","_"
5,"brāhmam","_","_","brāhma","JJ","","_","_"
6,"abhīpsamānair","_","_","abhīps","KDP","","_","_"
7,"gaṅgā","_","_","gaṅgā","NC","","_","_"
8,"_","_","_","sadā","CAD","","_","_"
9,"_","_","_","eva","CEM","","_","_"
10,"_","_","_","ātman","NC","","_","_"
11,"_","_","_","vaśa","NC","","_","_"
12,"upāsyā","_","_","upās","KDG","","_","_"
1,"usrāṃ","_","_","usrā","NC","","_","_"
2,"juṣṭāṃ","_","_","juṣ","PPP","","_","_"
3,"miṣatīṃ","_","_","miṣ","KDP","","_","_"
4,"_","_","_","viśva","JQ","","_","_"
5,"_","_","_","toya","NC","","_","_"
6,"irāṃ","_","_","irā","NC","","_","_"
7,"vajrīṃ","_","_","vajrī","NC","","_","_"
8,"revatīṃ","_","_","revatī","NC","","_","_"
9,"bhūdharāṇām","_","_","bhūdhara","NC","","_","_"
1,"_","_","_","śās","PPP","","_","_"
2,"_","_","_","āśraya","NC","","_","_"
3,"amṛtāṃ","_","_","amṛta","JJ","","_","_"
4,"_","_","_","brahman","NC","","_","_"
5,"_","_","_","kānta","JJ","","_","_"
6,"gaṅgāṃ","_","_","gaṅgā","NC","","_","_"
7,"śrayed","_","_","śray","V","śri","_","_"
8,"ātmavān","_","_","ātmavat","JJ","","_","_"
9,"_","_","_","siddhi","NC","","_","_"
10,"_","_","_","kāma","NC","","_","_"
1,"prasādya","_","_","prasāday","CGDA","","_","_"
2,"devān","_","_","deva","NC","","_","_"
3,"_","_","_","sa_saha","CX","","_","_"
4,"_","_","_","vibhu","JJ","","_","_"
5,"samastān","_","_","samasta","JJ","","_","_"
6,"_","_","_","bhagīratha","NC","","_","_"
7,"_","_","_","tapas","NC","","_","_"
8,"_","_","_","ugra","JJ","","_","_"
9,"gaṅgām","_","_","gaṅgā","NC","","_","_"
1,"gām","_","_","go","NC","","_","_"
2,"ānayat","_","_","ānay","V","ānī","_","_"
3,"tām","_","_","tad","PRD","","_","_"
4,"abhigamya","_","_","abhiga","CGDA","","_","_"
5,"śaśvan","_","_","puṃs","NC","","_","_"
6,"pumān","_","_","bhaya","NC","","_","_"
7,"_","_","_","na","CNG","","_","_"
8,"_","_","_","iha","CAD","","_","_"
9,"_","_","_","na","CNG","","_","_"
10,"_","_","_","amutra","CX","","_","_"
11,"nāmutra","_","_","vid","V","vid","_","_"
1,"udāhṛtaḥ","_","_","udāhṛ","PPP","","_","_"
2,"sarvathā","_","_","sarvathā","CX","","_","_"
3,"te","_","_","tvat","PPR","","_","_"
4,"guṇānāṃ","_","_","guṇa","NC","","_","_"
5,"_","_","_","maya","JJ","","_","_"
6,"_","_","_","eka","PPX","","_","_"
7,"_","_","_","deśa","NC","","_","_"
8,"prasamīkṣya","_","_","prasamīkṣ","CGDA","","_","_"
9,"buddhyā","_","_","buddhi","NC","","_","_"
1,"śaktir","_","_","śakti","NC","","_","_"
2,"na","_","_","na","CNG","","_","_"
3,"me","_","_","mat","PPR","","_","_"
4,"kācid","_","_","kiṃcit","PRI","","_","_"
5,"_","_","_","iha","CAD","","_","_"
6,"_","_","_","as","V","as","_","_"
7,"vaktuṃ","_","_","vac","CGDI","","_","_"
8,"guṇān","_","_","guṇa","NC","","_","_"
9,"sarvān","_","_","sarva","JQ","","_","_"
10,"parimātuṃ","_","_","parimā","CGDI","","_","_"
11,"_","_","_","tathā","CX","","_","_"
12,"_","_","_","eva","CEM","","_","_"
1,"meroḥ","_","_","meru","NC","","_","_"
2,"samudrasya","_","_","samudra","NC","","_","_"
3,"ca","_","_","ca","CCD","","_","_"
4,"_","_","_","sarva","JQ","","_","_"
5,"_","_","_","ratna","NC","","_","_"
6,"_","_","_","saṃkhyā","NC","","_","_"
7,"_","_","_","upala","NC","","_","_"
8,"udakasya","_","_","udaka","NC","","_","_"
9,"_","_","_","vā","CCD","","_","_"
10,"_","_","_","api","CX","","_","_"
1,"vaktuṃ","_","_","vac","CGDI","","_","_"
2,"śakyaṃ","_","_","śakya","JJ","","_","_"
3,"_","_","_","na","CNG","","_","_"
4,"_","_","_","iha","CAD","","_","_"
5,"_","_","_","gaṅgā","NC","","_","_"
6,"_","_","_","jala","NC","","_","_"
7,"_","_","_","guṇa","NC","","_","_"
8,"_","_","_","ākhyāna","NC","","_","_"
9,"parimātuṃ","_","_","parimā","CGDI","","_","_"
10,"_","_","_","tathā","CX","","_","_"
11,"_","_","_","eva","CEM","","_","_"
1,"tasmād","_","_","tasmāt","CX","","_","_"
2,"imān","_","_","ida","PRD","","_","_"
3,"parayā","_","_","para","PPX","","_","_"
4,"_","_","_","śraddhā","NC","","_","_"
5,"_","_","_","vac","PPP","","_","_"
6,"guṇān","_","_","guṇa","NC","","_","_"
7,"sarvāñ","_","_","sarva","JQ","","_","_"
8,"_","_","_","jāhnavī","NC","","_","_"
9,"_","_","_","ja","JJ","","_","_"
10,"_","_","_","tathā","CX","","_","_"
11,"_","_","_","eva","CEM","","_","_"
1,"bhajed","_","_","bhaj","V","bhaj","_","_"
2,"vācā","_","_","vāc","NC","","_","_"
3,"manasā","_","_","manas","NC","","_","_"
4,"karmaṇā","_","_","karman","NC","","_","_"
5,"ca","_","_","ca","CCD","","_","_"
6,"bhaktyā","_","_","bhakti","NC","","_","_"
7,"yuktaḥ","_","_","yuj","PPP","","_","_"
8,"parayā","_","_","para","PPX","","_","_"
9,"śraddadhānaḥ","_","_","śraddhā","KDP","","_","_"
1,"lokān","_","_","loka","NC","","_","_"
2,"_","_","_","ida","PRD","","_","_"
3,"_","_","_","tri","NUM","","_","_"
4,"yaśasā","_","_","yaśas","NC","","_","_"
5,"vitatya","_","_","vitan","CGDA","","_","_"
6,"siddhiṃ","_","_","siddhi","NC","","_","_"
7,"prāpya","_","_","prāp","CGDA","","_","_"
8,"mahatīṃ","_","_","mahat","JJ","","_","_"
9,"tāṃ","_","_","tad","PRD","","_","_"
10,"durāpām","_","_","durāpa","JJ","","_","_"
1,"_","_","_","gaṅgā","NC","","_","_"
2,"_","_","_","kṛ","PPP","","_","_"
3,"_","_","_","acireṇa","CX","","_","_"
4,"_","_","_","eva","CEM","","_","_"
5,"lokān","_","_","loka","NC","","_","_"
6,"yatheṣṭam","_","_","yatheṣṭa","JJ","","_","_"
7,"iṣṭān","_","_","iṣ","PPP","","_","_"
8,"vicariṣyasi","_","_","vicar","V","vicar","_","_"
9,"tvam","_","_","tvat","PPR","","_","_"
1,"tava","_","_","tvat","PPR","","_","_"
2,"mama","_","_","mat","PPR","","_","_"
3,"ca","_","_","ca","CCD","","_","_"
4,"guṇair","_","_","guṇa","NC","","_","_"
5,"_","_","_","mahat","JJ","","_","_"
6,"_","_","_","anubhāva","NC","","_","_"
7,"juṣatu","_","_","juṣ","V","juṣ","_","_"
8,"matiṃ","_","_","mati","NC","","_","_"
9,"satataṃ","_","_","satata","CX","","_","_"
10,"_","_","_","svadharma","NC","","_","_"
11,"_","_","_","yuj","PPP","","_","_"
1,"_","_","_","abhiga","PPP","","_","_"
2,"_","_","_","jana","NC","","_","_"
3,"_","_","_","vatsala","JJ","","_","_"
4,"hi","_","_","hi","CX","","_","_"
5,"gaṅgā","_","_","gaṅgā","NC","","_","_"
6,"bhajati","_","_","bhaj","V","bhaj","_","_"
7,"yunakti","_","_","yuj","V","yuj","_","_"
8,"_","_","_","sukha","NC","","_","_"
9,"_","_","_","ca","CCD","","_","_"
10,"bhaktimantam","_","_","bhaktimat","JJ","","_","_"
1,"bhīṣma","_","_","bhīṣma","NC","","_","_"
2,"uvāca","_","_","vak","V","vac","_","_"
1,"iti","_","_","iti","CQT","","_","_"
2,"_","_","_","parama","JJ","","_","_"
3,"_","_","_","mati","NC","","_","_"
4,"guṇān","_","_","guṇa","NC","","_","_"
5,"anekāñ","_","_","aneka","JJ","","_","_"
6,"_","_","_","śila","NC","","_","_"
7,"_","_","_","rati","NC","","_","_"
8,"_","_","_","tripathā","NC","","_","_"
9,"_","_","_","anuyoga","NC","","_","_"
10,"_","_","_","rūpa","NC","","_","_"
1,"bahuvidham","_","_","bahuvidha","JJ","","_","_"
2,"anuśāsya","_","_","anuśās","CGDA","","_","_"
3,"_","_","_","tathya","JJ","","_","_"
4,"_","_","_","rūpa","NC","","_","_"
5,"_","_","_","gagana","NC","","_","_"
6,"_","_","_","tala","NC","","_","_"
7,"dyutimān","_","_","dyutimat","JJ","","_","_"
8,"viveśa","_","_","viś","V","viś","_","_"
9,"siddhaḥ","_","_","siddha","NC","","_","_"
1,"_","_","_","śila","NC","","_","_"
2,"_","_","_","vṛtti","NC","","_","_"
3,"_","_","_","tu","CCD","","_","_"
4,"siddhasya","_","_","siddha","NC","","_","_"
5,"vākyaiḥ","_","_","vākya","NC","","_","_"
6,"_","_","_","sambodhay","PPP","","_","_"
7,"_","_","_","tadā","CAD","","_","_"
1,"gaṅgām","_","_","gaṅgā","NC","","_","_"
2,"upāsya","_","_","upās","CGDA","","_","_"
3,"vidhivat","_","_","vidhivat","CX","","_","_"
4,"siddhiṃ","_","_","siddhi","NC","","_","_"
5,"prāptaḥ","_","_","prāp","PPP","","_","_"
6,"_","_","_","su","CAD","","_","_"
7,"_","_","_","durlabha","JJ","","_","_"
1,"tasmāt","_","_","tasmāt","CX","","_","_"
2,"tvam","_","_","tvat","PPR","","_","_"
3,"api","_","_","api","CX","","_","_"
4,"kaunteya","_","_","kaunteya","NC","","_","_"
5,"bhaktyā","_","_","bhakti","NC","","_","_"
6,"paramayā","_","_","parama","JJ","","_","_"
7,"yutaḥ","_","_","yuta","JJ","","_","_"
1,"gaṅgām","_","_","gaṅgā","NC","","_","_"
2,"abhyehi","_","_","abhī","V","abhī","_","_"
3,"satataṃ","_","_","satata","CX","","_","_"
4,"prāpsyase","_","_","prāpn","V","prāp","_","_"
5,"siddhim","_","_","siddhi","NC","","_","_"
6,"uttamām","_","_","uttama","JJ","","_","_"
1,"vaiśaṃpāyana","_","_","vaiśampāyana","NC","","_","_"
2,"uvāca","_","_","vak","V","vac","_","_"
1,"_","_","_","śru","CGDA","","_","_"
2,"_","_","_","itihāsa","NC","","_","_"
3,"_","_","_","bhīṣma","NC","","_","_"
4,"_","_","_","vac","PPP","","_","_"
5,"gaṅgāyāḥ","_","_","gaṅgā","NC","","_","_"
6,"_","_","_","stava","NC","","_","_"
7,"_","_","_","saṃyuta","JJ","","_","_"
1,"yudhiṣṭhiraḥ","_","_","yudhiṣṭhira","NC","","_","_"
2,"parāṃ","_","_","para","PPX","","_","_"
3,"prītim","_","_","prīti","NC","","_","_"
4,"agacchad","_","_","ga","V","ga","_","_"
5,"bhrātṛbhiḥ","_","_","bhrātṛ","NC","","_","_"
6,"saha","_","_","saha","CX","","_","_"
1,"itihāsam","_","_","itihāsa","NC","","_","_"
2,"imaṃ","_","_","ida","PRD","","_","_"
3,"puṇyaṃ","_","_","puṇya","JJ","","_","_"
4,"śṛṇuyād","_","_","śṛṇ","V","śru","_","_"
5,"yaḥ","_","_","yad","PRL","","_","_"
6,"paṭheta","_","_","paṭh","V","paṭh","_","_"
7,"vā","_","_","vā","CCD","","_","_"
1,"gaṅgāyāḥ","_","_","gaṅgā","NC","","_","_"
2,"_","_","_","stava","NC","","_","_"
3,"_","_","_","saṃyuj","PPP","","_","_"
4,"sa","_","_","tad","PRD","","_","_"
5,"mucyet","_","_","muñc","V","muc","_","_"
6,"_","_","_","sarva","JQ","","_","_"
7,"_","_","_","kilbiṣa","NC","","_","_"
