"WordID","word","NormSTEM","suffix","lemma","PoS","Root","NormSuffix","NormWord"
1,"ye","_","_","yad","PRL","","_","_"
2,"panthāno","_","_","pathin","NC","","_","_"
3,"bahavo","_","_","bahu","JJ","","_","_"
4,"_","_","_","deva","NC","","_","_"
5,"_","_","_","yāna","JJ","","_","_"
6,"antarā","_","_","antarā","CX","","_","_"
7,"dyāvāpṛthivī","_","_","dyāvāpṛthivī","NC","","_","_"
8,"saṃcaranti","_","_","saṃcar","V","saṃcar","_","_"
1,"teṣām","_","_","tad","PRD","","_","_"
2,"ajyāniṃ","_","_","ajyāni","NC","","_","_"
3,"yatamo","_","_","yatama","PRL","","_","_"
4,"vahāti","_","_","vah","V","vah","_","_"
5,"tasmai","_","_","tad","PRD","","_","_"
6,"mā","_","_","mat","PPR","","_","_"
7,"devāḥ","_","_","deva","NC","","_","_"
8,"pari","_","_","pari","CADP","","_","_"
9,"_","_","_","dad","V","dā","_","_"
10,"_","_","_","iha","CAD","","_","_"
11,"sarve","_","_","sarva","JQ","","_","_"
1,"grīṣmo","_","_","grīṣma","NC","","_","_"
2,"hemantaḥ","_","_","hemanta","NC","","_","_"
3,"śiśiro","_","_","śiśira","NC","","_","_"
4,"vasantaḥ","_","_","vasanta","NC","","_","_"
5,"śarad","_","_","śarad","NC","","_","_"
6,"varṣāḥ","_","_","varṣa","NC","","_","_"
7,"svite","_","_","svita","NC","","_","_"
8,"no","_","_","mat","PPR","","_","_"
9,"dadhāta","_","_","dadh","V","dhā","_","_"
1,"ā","_","_","ā","CADP","","_","_"
2,"no","_","_","mat","PPR","","_","_"
3,"goṣu","_","_","go","NC","","_","_"
4,"bhajatā","_","_","bhaj","V","bhaj","_","_"
5,"prajāyāṃ","_","_","prajā","NC","","_","_"
6,"nivāta","_","_","nivāta","JJ","","_","_"
7,"id","_","_","id","CEM","","_","_"
8,"vaḥ","_","_","tvat","PPR","","_","_"
9,"śaraṇe","_","_","śaraṇa","NC","","_","_"
10,"syāma","_","_","as","V","as","_","_"
1,"idāvatsarāya","_","_","idāvatsara","NC","","_","_"
2,"parivatsarāya","_","_","parivatsara","NC","","_","_"
3,"saṃvatsarāya","_","_","saṃvatsara","NC","","_","_"
4,"kṛṇutā","_","_","kar","V","kṛ","_","_"
5,"bṛhan","_","_","bṛhat","JJ","","_","_"
6,"namaḥ","_","_","namas","NC","","_","_"
1,"teṣāṃ","_","_","tad","PRD","","_","_"
2,"vayaṃ","_","_","mat","PPR","","_","_"
3,"sumatau","_","_","sumati","NC","","_","_"
4,"yajñiyānām","_","_","yajñiya","JJ","","_","_"
5,"api","_","_","api","CX","","_","_"
6,"bhadre","_","_","bhadra","NC","","_","_"
7,"saumanase","_","_","saumanasa","NC","","_","_"
8,"syāma","_","_","as","V","as","_","_"
