"WordID","word","NormSTEM","suffix","lemma","PoS","Root","NormSuffix","NormWord"
1,"saṃjaya","_","_","saṃjaya","NC","","_","_"
2,"uvāca","_","_","vak","V","vac","_","_"
1,"sraṃsanta","_","_","sraṃs","V","sraṃs","_","_"
2,"iva","_","_","iva","CCM","","_","_"
3,"_","_","_","majjan","NC","","_","_"
4,"_","_","_","tāvaka","JJ","","_","_"
5,"_","_","_","bhaya","NC","","_","_"
6,"_","_","_","nṛpa","NC","","_","_"
1,"tau","_","_","tad","PRD","","_","_"
2,"dṛṣṭvā","_","_","dṛś","CGDA","","_","_"
3,"samatikrāntau","_","_","samatikra","PPP","","_","_"
4,"_","_","_","vāsudeva","NC","","_","_"
5,"_","_","_","dhanaṃjaya","NC","","_","_"
1,"sarve","_","_","sarva","JQ","","_","_"
2,"tu","_","_","tu","CCD","","_","_"
3,"pratisaṃrabdhā","_","_","pratisaṃrabh","PPP","","_","_"
4,"hrīmantaḥ","_","_","hrīmat","JJ","","_","_"
5,"_","_","_","sattva","NC","","_","_"
6,"_","_","_","coday","PPP","","_","_"
1,"sthirībhūtā","_","_","sthirībhū","PPP","","_","_"
2,"mahātmānaḥ","_","_","mahātman","JJ","","_","_"
3,"pratyagacchan","_","_","pratiga","V","pratiga","_","_"
4,"dhanaṃjayam","_","_","dhanaṃjaya","NC","","_","_"
1,"ye","_","_","yad","PRL","","_","_"
2,"gatāḥ","_","_","ga","PPP","","_","_"
3,"pāṇḍavaṃ","_","_","pāṇḍava","NC","","_","_"
4,"yuddhe","_","_","yuddha","NC","","_","_"
5,"_","_","_","krodha","NC","","_","_"
6,"_","_","_","amarṣa","NC","","_","_"
7,"_","_","_","samanvita","JJ","","_","_"
1,"te","_","_","tad","PRD","","_","_"
2,"_","_","_","adya","CX","","_","_"
3,"_","_","_","api","CX","","_","_"
4,"na","_","_","na","CNG","","_","_"
5,"nivartante","_","_","nivart","V","nivṛt","_","_"
6,"sindhavaḥ","_","_","sindhu","NC","","_","_"
7,"sāgarād","_","_","sāgara","NC","","_","_"
8,"iva","_","_","iva","CCM","","_","_"
1,"_","_","_","asat","JJ","","_","_"
2,"_","_","_","tu","CCD","","_","_"
3,"nyavartanta","_","_","nivart","V","nivṛt","_","_"
4,"vedebhya","_","_","veda","NC","","_","_"
5,"iva","_","_","iva","CCM","","_","_"
6,"nāstikāḥ","_","_","nāstika","NC","","_","_"
1,"narakaṃ","_","_","naraka","NC","","_","_"
2,"_","_","_","bhaj","KDP","","_","_"
3,"_","_","_","tad","PRD","","_","_"
4,"pratyapadyanta","_","_","pratipad","V","pratipad","_","_"
5,"kilbiṣam","_","_","kilbiṣa","NC","","_","_"
1,"_","_","_","tad","PRD","","_","_"
2,"_","_","_","atī","CGDA","","_","_"
3,"_","_","_","ratha","NC","","_","_"
4,"_","_","_","anīka","NC","","_","_"
5,"vimuktau","_","_","vimuc","PPP","","_","_"
6,"_","_","_","puruṣa","NC","","_","_"
7,"_","_","_","ṛṣabha","NC","","_","_"
1,"dadṛśāte","_","_","darś","V","dṛś","_","_"
2,"yathā","_","_","yathā","CCM","","_","_"
3,"rāhor","_","_","rāhu","NC","","_","_"
4,"_","_","_","āsya","NC","","_","_"
5,"_","_","_","muc","PPP","","_","_"
6,"prabhākarau","_","_","prabhākara","NC","","_","_"
1,"_","_","_","matsya","NC","","_","_"
2,"_","_","_","iva","CCM","","_","_"
3,"_","_","_","mahat","JJ","","_","_"
4,"_","_","_","jāla","NC","","_","_"
5,"vidārya","_","_","vidāray","CGDA","","_","_"
6,"_","_","_","viga","PPP","","_","_"
7,"_","_","_","jvara","NC","","_","_"
1,"tathā","_","_","tathā","CX","","_","_"
2,"_","_","_","kṛṣṇa","NC","","_","_"
3,"_","_","_","darś","V","dṛś","_","_"
4,"_","_","_","senā","NC","","_","_"
5,"_","_","_","jāla","NC","","_","_"
6,"vidārya","_","_","vidāray","CGDA","","_","_"
7,"tat","_","_","tad","PRD","","_","_"
1,"vimuktau","_","_","vimuc","PPP","","_","_"
2,"_","_","_","śastra","NC","","_","_"
3,"_","_","_","sambādha","NC","","_","_"
4,"_","_","_","droṇa","NC","","_","_"
5,"_","_","_","anīka","NC","","_","_"
6,"_","_","_","su","CAD","","_","_"
7,"_","_","_","durbhida","JJ","","_","_"
1,"adṛśyetāṃ","_","_","darś","V","dṛś","_","_"
2,"mahātmānau","_","_","mahātman","JJ","","_","_"
3,"_","_","_","kāla","NC","","_","_"
4,"_","_","_","sūrya","NC","","_","_"
5,"_","_","_","iva","CCM","","_","_"
6,"_","_","_","udi","PPP","","_","_"
1,"_","_","_","astra","NC","","_","_"
2,"_","_","_","sambādha","NC","","_","_"
3,"_","_","_","nirmuc","PPP","","_","_"
4,"vimuktau","_","_","vimuc","PPP","","_","_"
5,"_","_","_","śastra","NC","","_","_"
6,"_","_","_","saṃkaṭa","NC","","_","_"
1,"adṛśyetāṃ","_","_","darś","V","dṛś","_","_"
2,"mahātmānau","_","_","mahātman","JJ","","_","_"
3,"_","_","_","śatru","NC","","_","_"
4,"_","_","_","sambādha","NC","","_","_"
5,"_","_","_","kārin","JJ","","_","_"
1,"vimuktau","_","_","vimuc","PPP","","_","_"
2,"_","_","_","jvalana","NC","","_","_"
3,"_","_","_","sparśa","NC","","_","_"
4,"_","_","_","makara","NC","","_","_"
5,"_","_","_","āsya","NC","","_","_"
6,"_","_","_","jhaṣa","NC","","_","_"
7,"_","_","_","iva","CCM","","_","_"
1,"vyakṣobhayetāṃ","_","_","vikṣobhay","V","vikṣobhay","_","_"
2,"senāṃ","_","_","senā","NC","","_","_"
3,"tau","_","_","tad","PRD","","_","_"
4,"samudraṃ","_","_","samudra","NC","","_","_"
5,"_","_","_","makara","NC","","_","_"
6,"_","_","_","iva","CCM","","_","_"
1,"_","_","_","tāvaka","JJ","","_","_"
2,"_","_","_","tvat","PPR","","_","_"
3,"_","_","_","putra","NC","","_","_"
4,"_","_","_","ca","CCD","","_","_"
5,"_","_","_","droṇa","NC","","_","_"
6,"_","_","_","anīka","NC","","_","_"
7,"_","_","_","stha","JJ","","_","_"
8,"_","_","_","tad","PRD","","_","_"
1,"_","_","_","na","CNG","","_","_"
2,"_","_","_","tad","PRD","","_","_"
3,"tariṣyato","_","_","tar","V","tṛ","_","_"
4,"droṇam","_","_","droṇa","NC","","_","_"
5,"iti","_","_","iti","CQT","","_","_"
6,"_","_","_","kar","V","kṛ","_","_"
7,"_","_","_","tadā","CAD","","_","_"
8,"matim","_","_","mati","NC","","_","_"
1,"tau","_","_","tad","PRD","","_","_"
2,"tu","_","_","tu","CCD","","_","_"
3,"dṛṣṭvā","_","_","dṛś","CGDA","","_","_"
4,"vyatikrāntau","_","_","vyatikra","PPP","","_","_"
5,"_","_","_","droṇa","NC","","_","_"
6,"_","_","_","anīka","NC","","_","_"
7,"_","_","_","mahat","JJ","","_","_"
8,"_","_","_","dyuti","NC","","_","_"
1,"_","_","_","na","CNG","","_","_"
2,"_","_","_","āśaṃs","V","āśaṃs","_","_"
3,"_","_","_","mahat","JJ","","_","_"
4,"_","_","_","rāja","NC","","_","_"
5,"sindhurājasya","_","_","sindhurāja","NC","","_","_"
6,"jīvitam","_","_","jīvita","NC","","_","_"
1,"āśā","_","_","āśā","NC","","_","_"
2,"balavatī","_","_","balavat","JJ","","_","_"
3,"rājan","_","_","rājan","NC","","_","_"
4,"putrāṇām","_","_","putra","NC","","_","_"
5,"abhavat","_","_","bhav","V","bhū","_","_"
6,"tava","_","_","tvat","PPR","","_","_"
1,"_","_","_","droṇa","NC","","_","_"
2,"_","_","_","hārdikya","NC","","_","_"
3,"kṛṣṇau","_","_","kṛṣṇa","NC","","_","_"
4,"na","_","_","na","CNG","","_","_"
5,"mokṣyete","_","_","muñc","V","muc","_","_"
6,"iti","_","_","iti","CQT","","_","_"
7,"prabho","_","_","prabhu","NC","","_","_"
1,"tām","_","_","tad","PRD","","_","_"
2,"āśāṃ","_","_","āśā","NC","","_","_"
3,"viphalāṃ","_","_","viphala","JJ","","_","_"
4,"kṛtvā","_","_","kṛ","CGDA","","_","_"
5,"nistīrṇau","_","_","nistṛ","PPP","","_","_"
6,"tau","_","_","tad","PRD","","_","_"
7,"paraṃtapau","_","_","paraṃtapa","JJ","","_","_"
1,"_","_","_","droṇa","NC","","_","_"
2,"_","_","_","anīka","NC","","_","_"
3,"_","_","_","mahat","JJ","","_","_"
4,"_","_","_","rāja","NC","","_","_"
5,"_","_","_","bhoja","NC","","_","_"
6,"_","_","_","anīka","NC","","_","_"
7,"ca","_","_","ca","CCD","","_","_"
8,"dustaram","_","_","dustara","JJ","","_","_"
1,"atha","_","_","atha","CAD","","_","_"
2,"dṛṣṭvā","_","_","dṛś","CGDA","","_","_"
3,"vyatikrāntau","_","_","vyatikra","PPP","","_","_"
4,"_","_","_","jval","PPP","","_","_"
5,"_","_","_","iva","CCM","","_","_"
6,"pāvakau","_","_","pāvaka","NC","","_","_"
1,"nirāśāḥ","_","_","nirāśa","JJ","","_","_"
2,"sindhurājasya","_","_","sindhurāja","NC","","_","_"
3,"jīvitaṃ","_","_","jīvita","NC","","_","_"
4,"_","_","_","na","CNG","","_","_"
5,"_","_","_","āśaṃs","V","āśaṃs","_","_"
1,"_","_","_","mithas","CX","","_","_"
2,"_","_","_","ca","CCD","","_","_"
3,"samabhāṣetām","_","_","sambhāṣ","V","sambhāṣ","_","_"
4,"abhītau","_","_","abhīta","JJ","","_","_"
5,"_","_","_","bhaya","NC","","_","_"
6,"_","_","_","vardhana","JJ","","_","_"
1,"_","_","_","jayadratha","NC","","_","_"
2,"_","_","_","vadha","NC","","_","_"
3,"_","_","_","vāc","NC","","_","_"
4,"_","_","_","tad","PRD","","_","_"
5,"_","_","_","tad","PRD","","_","_"
6,"_","_","_","kṛṣṇa","NC","","_","_"
7,"_","_","_","dhanaṃjaya","NC","","_","_"
1,"asau","_","_","adas","PRD","","_","_"
2,"madhye","_","_","madhya","NC","","_","_"
3,"kṛtaḥ","_","_","kṛ","PPP","","_","_"
4,"ṣaḍbhir","_","_","ṣaṣ","NUM","","_","_"
5,"dhārtarāṣṭrair","_","_","dhārtarāṣṭra","JJ","","_","_"
6,"_","_","_","mahat","JJ","","_","_"
7,"_","_","_","ratha","NC","","_","_"
1,"_","_","_","cakṣus","NC","","_","_"
2,"_","_","_","viṣaya","NC","","_","_"
3,"_","_","_","samprāp","PPP","","_","_"
4,"na","_","_","na","CNG","","_","_"
5,"nau","_","_","mat","PPR","","_","_"
6,"mokṣyati","_","_","muñc","V","muc","_","_"
7,"saindhavaḥ","_","_","saindhava","NC","","_","_"
1,"_","_","_","yadi","CSB","","_","_"
2,"_","_","_","ida","PRD","","_","_"
3,"samare","_","_","samara","NC","","_","_"
4,"goptā","_","_","goptṛ","JJ","","_","_"
5,"śakro","_","_","śakra","NC","","_","_"
6,"_","_","_","deva","NC","","_","_"
7,"_","_","_","gaṇa","NC","","_","_"
8,"saha","_","_","saha","CX","","_","_"
1,"_","_","_","tathā","CX","","_","_"
2,"_","_","_","api","CX","","_","_"
3,"_","_","_","a","PRD","","_","_"
4,"haniṣyāva","_","_","han","V","han","_","_"
5,"iti","_","_","iti","CQT","","_","_"
6,"_","_","_","kṛṣṇa","NC","","_","_"
7,"_","_","_","bhāṣ","V","bhāṣ","_","_"
1,"iti","_","_","iti","CQT","","_","_"
2,"kṛṣṇau","_","_","kṛṣṇa","NC","","_","_"
3,"_","_","_","mahat","JJ","","_","_"
4,"_","_","_","bāhu","NC","","_","_"
5,"mithaḥ","_","_","mithas","CX","","_","_"
6,"kathayatāṃ","_","_","kathay","V","kathay","_","_"
7,"tadā","_","_","tadā","CAD","","_","_"
1,"sindhurājam","_","_","sindhurāja","NC","","_","_"
2,"avekṣantau","_","_","avekṣ","KDP","","_","_"
3,"tat","_","_","tad","PRD","","_","_"
4,"_","_","_","putra","NC","","_","_"
5,"_","_","_","tvat","PPR","","_","_"
6,"śuśruvuḥ","_","_","śṛṇ","V","śru","_","_"
1,"atītya","_","_","atī","CGDA","","_","_"
2,"_","_","_","maru","NC","","_","_"
3,"_","_","_","dhanvan","NC","","_","_"
4,"_","_","_","iva","CCM","","_","_"
5,"prayāntau","_","_","tṛṣita","JJ","","_","_"
6,"tṛṣitau","_","_","gaja","NC","","_","_"
1,"pītvā","_","_","pā","CGDA","","_","_"
2,"vāri","_","_","vāri","NC","","_","_"
3,"samāśvastau","_","_","samāśvas","PPP","","_","_"
4,"_","_","_","tathā","CX","","_","_"
5,"_","_","_","eva","CEM","","_","_"
6,"_","_","_","as","V","as","_","_"
7,"ariṃdamau","_","_","ariṃdama","JJ","","_","_"
1,"_","_","_","vyāghra","NC","","_","_"
2,"_","_","_","siṃha","NC","","_","_"
3,"_","_","_","gaja","NC","","_","_"
4,"_","_","_","ākṛ","PPP","","_","_"
5,"_","_","_","atikra","CGDA","","_","_"
6,"_","_","_","iva","CCM","","_","_"
7,"parvatān","_","_","parvata","NC","","_","_"
1,"adṛśyetāṃ","_","_","darś","V","dṛś","_","_"
2,"_","_","_","mahat","JJ","","_","_"
3,"_","_","_","bāhu","NC","","_","_"
4,"yathā","_","_","yathā","CCM","","_","_"
5,"_","_","_","mṛtyu","NC","","_","_"
6,"_","_","_","jarā","NC","","_","_"
7,"_","_","_","atiga","JJ","","_","_"
1,"tathā","_","_","tathā","CX","","_","_"
2,"hi","_","_","hi","CX","","_","_"
3,"_","_","_","mukha","NC","","_","_"
4,"_","_","_","varṇa","NC","","_","_"
5,"'yam","_","_","ida","PRD","","_","_"
6,"anayor","_","_","ida","PRD","","_","_"
7,"iti","_","_","iti","CQT","","_","_"
8,"menire","_","_","man","V","man","_","_"
1,"tāvakā","_","_","tāvaka","JJ","","_","_"
2,"dṛśya","_","_","dṛś","CGDA","","_","_"
3,"muktau","_","_","muc","PPP","","_","_"
4,"tau","_","_","tad","PRD","","_","_"
5,"vikrośanti","_","_","vikroś","V","vikruś","_","_"
6,"sma","_","_","sma","CX","","_","_"
7,"sarvataḥ","_","_","sarvatas","CX","","_","_"
1,"droṇād","_","_","droṇa","NC","","_","_"
2,"_","_","_","āśīviṣa","NC","","_","_"
3,"_","_","_","ākāra","NC","","_","_"
4,"_","_","_","jval","PPP","","_","_"
5,"iva","_","_","iva","CCM","","_","_"
6,"pāvakāt","_","_","pāvaka","NC","","_","_"
1,"anyebhyaḥ","_","_","anya","PPX","","_","_"
2,"_","_","_","pārthiva","NC","","_","_"
3,"_","_","_","ca","CCD","","_","_"
4,"_","_","_","bhāsvat","JJ","","_","_"
5,"_","_","_","iva","CCM","","_","_"
6,"bhāskarau","_","_","bhāskara","NC","","_","_"
1,"tau","_","_","tad","PRD","","_","_"
2,"muktau","_","_","muc","PPP","","_","_"
3,"_","_","_","sāgara","NC","","_","_"
4,"_","_","_","prakhyā","NC","","_","_"
5,"_","_","_","droṇa","NC","","_","_"
6,"_","_","_","anīka","NC","","_","_"
7,"ariṃdamau","_","_","ariṃdama","JJ","","_","_"
1,"adṛśyetāṃ","_","_","darś","V","dṛś","_","_"
2,"mudā","_","_","mud","NC","","_","_"
3,"yuktau","_","_","yuj","PPP","","_","_"
4,"_","_","_","samuttṛ","CGDA","","_","_"
5,"_","_","_","arṇava","NC","","_","_"
6,"yathā","_","_","yathā","CCM","","_","_"
1,"_","_","_","śastra","NC","","_","_"
2,"_","_","_","ogha","NC","","_","_"
3,"_","_","_","mahat","JJ","","_","_"
4,"muktau","_","_","muc","PPP","","_","_"
5,"_","_","_","droṇa","NC","","_","_"
6,"_","_","_","hārdikya","NC","","_","_"
7,"_","_","_","rakṣ","PPP","","_","_"
1,"_","_","_","ruc","KDP","","_","_"
2,"_","_","_","darś","V","dṛś","_","_"
3,"_","_","_","indra","NC","","_","_"
4,"_","_","_","agni","NC","","_","_"
5,"sadṛśau","_","_","sadṛśa","JJ","","_","_"
6,"raṇe","_","_","raṇa","NC","","_","_"
1,"_","_","_","udbhid","PPP","","_","_"
2,"_","_","_","rudhira","NC","","_","_"
3,"kṛṣṇau","_","_","kṛṣṇa","NC","","_","_"
4,"bhāradvājasya","_","_","bhāradvāja","NC","","_","_"
5,"sāyakaiḥ","_","_","sāyaka","NC","","_","_"
1,"_","_","_","śā","PPP","","_","_"
2,"_","_","_","ci","PPP","","_","_"
3,"vyarocetāṃ","_","_","viroc","V","viruc","_","_"
4,"karṇikārair","_","_","karṇikāra","NC","","_","_"
5,"_","_","_","iva","CCM","","_","_"
6,"_","_","_","acala","NC","","_","_"
1,"_","_","_","droṇa","NC","","_","_"
2,"_","_","_","grāha","NC","","_","_"
3,"_","_","_","hrada","NC","","_","_"
4,"_","_","_","muc","PPP","","_","_"
5,"_","_","_","śakti","NC","","_","_"
6,"_","_","_","āśīviṣa","NC","","_","_"
7,"_","_","_","saṃkaṭa","JJ","","_","_"
1,"_","_","_","ayas","NC","","_","_"
2,"_","_","_","śara","NC","","_","_"
3,"_","_","_","ugra","JJ","","_","_"
4,"_","_","_","makara","NC","","_","_"
5,"_","_","_","kṣatriya","NC","","_","_"
6,"_","_","_","pravara","JJ","","_","_"
7,"_","_","_","ambhas","NC","","_","_"
1,"_","_","_","jyā","NC","","_","_"
2,"_","_","_","ghoṣa","NC","","_","_"
3,"_","_","_","tala","NC","","_","_"
4,"_","_","_","nirhrāda","NC","","_","_"
5,"_","_","_","gadā","NC","","_","_"
6,"_","_","_","nistriṃśa","NC","","_","_"
7,"_","_","_","vidyut","NC","","_","_"
1,"_","_","_","droṇa","NC","","_","_"
2,"_","_","_","astra","NC","","_","_"
3,"_","_","_","megha","NC","","_","_"
4,"_","_","_","nirmuc","PPP","","_","_"
5,"_","_","_","sūrya","NC","","_","_"
6,"_","_","_","indu","NC","","_","_"
7,"timirād","_","_","timira","NC","","_","_"
8,"iva","_","_","iva","CCM","","_","_"
1,"bāhubhyām","_","_","bāhu","NC","","_","_"
2,"iva","_","_","iva","CCM","","_","_"
3,"saṃtīrṇau","_","_","saṃtṛ","PPP","","_","_"
4,"_","_","_","sindhu","NC","","_","_"
5,"_","_","_","ṣaṣṭha","JJ","","_","_"
6,"samudragāḥ","_","_","samudragā","NC","","_","_"
1,"tapānte","_","_","tapānta","NC","","_","_"
2,"saritaḥ","_","_","sarit","NC","","_","_"
3,"pūrṇā","_","_","pṛ","PPP","","_","_"
4,"_","_","_","mahat","JJ","","_","_"
5,"_","_","_","grāha","NC","","_","_"
6,"_","_","_","samākula","JJ","","_","_"
1,"iti","_","_","iti","CQT","","_","_"
2,"kṛṣṇau","_","_","kṛṣṇa","NC","","_","_"
3,"_","_","_","mahat","JJ","","_","_"
4,"_","_","_","iṣvāsa","NC","","_","_"
5,"yaśasā","_","_","yaśas","NC","","_","_"
6,"_","_","_","loka","NC","","_","_"
7,"_","_","_","viśru","PPP","","_","_"
1,"_","_","_","sarva","JQ","","_","_"
2,"_","_","_","bhūta","NC","","_","_"
3,"_","_","_","man","V","man","_","_"
4,"_","_","_","droṇa","NC","","_","_"
5,"_","_","_","astra","NC","","_","_"
6,"_","_","_","bala","NC","","_","_"
7,"_","_","_","vismaya","NC","","_","_"
1,"jayadrathaṃ","_","_","jayadratha","NC","","_","_"
2,"_","_","_","samīpa","NC","","_","_"
3,"_","_","_","stha","JJ","","_","_"
4,"avekṣantau","_","_","avekṣ","KDP","","_","_"
5,"jighāṃsayā","_","_","jighāṃsā","NC","","_","_"
1,"ruruṃ","_","_","ruru","NC","","_","_"
2,"nipāne","_","_","nipāna","NC","","_","_"
3,"lipsantau","_","_","lips","KDP","","_","_"
4,"_","_","_","vyāghra","NC","","_","_"
5,"_","_","_","vat","CX","","_","_"
6,"_","_","_","tad","PRD","","_","_"
7,"_","_","_","tiṣṭh","V","sthā","_","_"
1,"yathā","_","_","yathā","CCM","","_","_"
2,"hi","_","_","hi","CX","","_","_"
3,"_","_","_","mukha","NC","","_","_"
4,"_","_","_","varṇa","NC","","_","_"
5,"'yam","_","_","ida","PRD","","_","_"
6,"anayor","_","_","ida","PRD","","_","_"
7,"iti","_","_","iti","CQT","","_","_"
8,"menire","_","_","man","V","man","_","_"
1,"tava","_","_","tvat","PPR","","_","_"
2,"yodhā","_","_","yodha","NC","","_","_"
3,"_","_","_","mahat","JJ","","_","_"
4,"_","_","_","rāja","NC","","_","_"
5,"hatam","_","_","han","PPP","","_","_"
6,"eva","_","_","eva","CEM","","_","_"
7,"jayadratham","_","_","jayadratha","NC","","_","_"
1,"_","_","_","lohita","JJ","","_","_"
2,"_","_","_","akṣa","NC","","_","_"
3,"_","_","_","mahat","JJ","","_","_"
4,"_","_","_","bāhu","NC","","_","_"
5,"saṃyattau","_","_","saṃyat","PPP","","_","_"
6,"_","_","_","kṛṣṇa","NC","","_","_"
7,"_","_","_","pāṇḍava","NC","","_","_"
1,"sindhurājam","_","_","sindhurāja","NC","","_","_"
2,"abhiprekṣya","_","_","abhiprekṣ","CGDA","","_","_"
3,"hṛṣṭau","_","_","hṛṣ","PPP","","_","_"
4,"vyanadatāṃ","_","_","vinad","V","vinad","_","_"
5,"muhuḥ","_","_","muhur","CX","","_","_"
1,"śaurer","_","_","śauri","NC","","_","_"
2,"_","_","_","abhīśu","NC","","_","_"
3,"_","_","_","hasta","NC","","_","_"
4,"pārthasya","_","_","pārtha","NC","","_","_"
5,"ca","_","_","ca","CCD","","_","_"
6,"dhanuṣmataḥ","_","_","dhanuṣmat","JJ","","_","_"
1,"tayor","_","_","tad","PRD","","_","_"
2,"āsīt","_","_","as","V","as","_","_"
3,"pratibhrājaḥ","_","_","pratibhrāja","NC","","_","_"
4,"_","_","_","sūrya","NC","","_","_"
5,"_","_","_","pāvaka","NC","","_","_"
6,"iva","_","_","iva","CCM","","_","_"
1,"harṣa","_","_","harṣa","NC","","_","_"
2,"eva","_","_","eva","CEM","","_","_"
3,"tayor","_","_","tad","PRD","","_","_"
4,"āsīd","_","_","as","V","as","_","_"
5,"_","_","_","droṇa","NC","","_","_"
6,"_","_","_","anīka","NC","","_","_"
7,"_","_","_","pramuc","PPP","","_","_"
1,"samīpe","_","_","samīpa","NC","","_","_"
2,"saindhavaṃ","_","_","saindhava","NC","","_","_"
3,"dṛṣṭvā","_","_","dṛś","CGDA","","_","_"
4,"śyenayor","_","_","śya","NC","","_","_"
5,"āmiṣaṃ","_","_","āmiṣa","NC","","_","_"
6,"yathā","_","_","yathā","CCM","","_","_"
1,"tau","_","_","tad","PRD","","_","_"
2,"tu","_","_","tu","CCD","","_","_"
3,"saindhavam","_","_","saindhava","NC","","_","_"
4,"ālokya","_","_","ālokay","CGDA","","_","_"
5,"vartamānam","_","_","vṛt","KDP","","_","_"
6,"_","_","_","iva","CCM","","_","_"
7,"_","_","_","antika","NC","","_","_"
1,"sahasā","_","_","sahasā","CX","","_","_"
2,"petatuḥ","_","_","pat","V","pat","_","_"
3,"kruddhau","_","_","krudh","PPP","","_","_"
4,"kṣipraṃ","_","_","kṣipra","CX","","_","_"
5,"_","_","_","śya","NC","","_","_"
6,"_","_","_","iva","CCM","","_","_"
7,"_","_","_","āmiṣa","NC","","_","_"
1,"tau","_","_","tad","PRD","","_","_"
2,"tu","_","_","tu","CCD","","_","_"
3,"dṛṣṭvā","_","_","dṛś","CGDA","","_","_"
4,"vyatikrāntau","_","_","vyatikra","PPP","","_","_"
5,"_","_","_","hṛṣīkeśa","NC","","_","_"
6,"_","_","_","dhanaṃjaya","NC","","_","_"
1,"sindhurājasya","_","_","sindhurāja","NC","","_","_"
2,"_","_","_","rakṣā","NC","","_","_"
3,"_","_","_","artha","NC","","_","_"
4,"parākrāntaḥ","_","_","parākra","PPP","","_","_"
5,"_","_","_","suta","NC","","_","_"
6,"_","_","_","tvat","PPR","","_","_"
1,"_","_","_","droṇa","NC","","_","_"
2,"_","_","_","ābandh","PPP","","_","_"
3,"_","_","_","kavaca","NC","","_","_"
4,"rājā","_","_","rājan","NC","","_","_"
5,"_","_","_","duryodhana","NC","","_","_"
6,"_","_","_","tadā","CAD","","_","_"
1,"_","_","_","yā","V","yā","_","_"
2,"_","_","_","eka","PPX","","_","_"
3,"_","_","_","ratha","NC","","_","_"
4,"_","_","_","āji","NC","","_","_"
5,"_","_","_","haya","NC","","_","_"
6,"_","_","_","saṃskāra","NC","","_","_"
7,"_","_","_","vid","JJ","","_","_"
8,"prabho","_","_","prabhu","JJ","","_","_"
1,"_","_","_","kṛṣṇa","NC","","_","_"
2,"_","_","_","pārtha","NC","","_","_"
3,"_","_","_","mahat","JJ","","_","_"
4,"_","_","_","iṣvāsa","NC","","_","_"
5,"_","_","_","vyatikra","CGDA","","_","_"
6,"_","_","_","atha","CAD","","_","_"
7,"te","_","_","tvat","PPR","","_","_"
8,"sutaḥ","_","_","suta","NC","","_","_"
1,"agrataḥ","_","_","agratas","CX","","_","_"
2,"puṇḍarīkākṣaṃ","_","_","puṇḍarīkākṣa","NC","","_","_"
3,"pratīyāya","_","_","pratye","V","pratī","_","_"
4,"narādhipa","_","_","narādhipa","NC","","_","_"
1,"tataḥ","_","_","tatas","CX","","_","_"
2,"sarveṣu","_","_","sarva","JQ","","_","_"
3,"sainyeṣu","_","_","sainya","NC","","_","_"
4,"vāditrāṇi","_","_","vāditra","NC","","_","_"
5,"_","_","_","prahṛṣ","PPP","","_","_"
6,"_","_","_","vat","CX","","_","_"
1,"prāvādayan","_","_","pravāday","V","pravāday","_","_"
2,"samatikrānte","_","_","samatikra","PPP","","_","_"
3,"tava","_","_","tvat","PPR","","_","_"
4,"putre","_","_","putra","NC","","_","_"
5,"dhanaṃjayam","_","_","dhanaṃjaya","NC","","_","_"
1,"_","_","_","siṃhanāda","NC","","_","_"
2,"_","_","_","rava","NC","","_","_"
3,"_","_","_","ca","CCD","","_","_"
4,"_","_","_","as","V","as","_","_"
5,"_","_","_","śaṅkha","NC","","_","_"
6,"_","_","_","dundubhi","NC","","_","_"
7,"_","_","_","miśray","PPP","","_","_"
1,"dṛṣṭvā","_","_","dṛś","CGDA","","_","_"
2,"duryodhanaṃ","_","_","duryodhana","NC","","_","_"
3,"tatra","_","_","tatra","CAD","","_","_"
4,"kṛṣṇayoḥ","_","_","kṛṣṇa","NC","","_","_"
5,"pramukhe","_","_","pramukha","NC","","_","_"
6,"sthitam","_","_","sthā","PPP","","_","_"
1,"ye","_","_","yad","PRL","","_","_"
2,"ca","_","_","ca","CCD","","_","_"
3,"te","_","_","tad","PRD","","_","_"
4,"sindhurājasya","_","_","sindhurāja","NC","","_","_"
5,"goptāraḥ","_","_","goptṛ","JJ","","_","_"
6,"_","_","_","pāvaka","NC","","_","_"
7,"_","_","_","upama","JJ","","_","_"
1,"te","_","_","tad","PRD","","_","_"
2,"prahṛṣyanta","_","_","prahṛṣ","V","prahṛṣ","_","_"
3,"samare","_","_","samara","NC","","_","_"
4,"dṛṣṭvā","_","_","dṛś","CGDA","","_","_"
5,"putraṃ","_","_","putra","NC","","_","_"
6,"_","_","_","tvat","PPR","","_","_"
7,"_","_","_","abhibhu","JJ","","_","_"
1,"dṛṣṭvā","_","_","dṛś","CGDA","","_","_"
2,"duryodhanaṃ","_","_","duryodhana","NC","","_","_"
3,"_","_","_","kṛṣṇa","NC","","_","_"
4,"_","_","_","tu","CCD","","_","_"
5,"_","_","_","atikra","PPP","","_","_"
6,"_","_","_","saha","CX","","_","_"
7,"_","_","_","anuga","JJ","","_","_"
1,"abravīd","_","_","abravīta","V","brū","_","_"
2,"arjunaṃ","_","_","arjuna","NC","","_","_"
3,"rājan","_","_","rājan","NC","","_","_"
4,"_","_","_","prāp","PPP","","_","_"
5,"_","_","_","kāla","NC","","_","_"
6,"idaṃ","_","_","ida","PRD","","_","_"
7,"vacaḥ","_","_","vacas","NC","","_","_"
