"WordID","word","NormSTEM","suffix","lemma","PoS","Root","NormSuffix","NormWord"
1,"_","_","_","sa_saha","CX","","_","_"
2,"_","_","_","aṅga","NC","","_","_"
3,"_","_","_","upāṅga","NC","","_","_"
4,"_","_","_","aneka","JJ","","_","_"
5,"_","_","_","yoga","NC","","_","_"
6,"_","_","_","nicaya","NC","","_","_"
7,"sāraṃ","_","_","sāra","NC","","_","_"
8,"varaṃ","_","_","vara","JJ","","_","_"
9,"_","_","_","ca","CCD","","_","_"
10,"_","_","_","uddhṛ","PPP","","_","_"
11,"yuktaṃ","_","_","yuj","PPP","","_","_"
12,"_","_","_","pārada","NC","","_","_"
13,"_","_","_","bandhana","NC","","_","_"
14,"_","_","_","mṛdu","JJ","","_","_"
15,"_","_","_","haṭha","NC","","_","_"
16,"dṛṣṭaṃ","_","_","dṛś","PPP","","_","_"
17,"paraṃ","_","_","para","PPX","","_","_"
18,"_","_","_","yad","PRL","","_","_"
19,"_","_","_","mat","PPR","","_","_"
1,"_","_","_","tad","PRD","","_","_"
2,"_","_","_","sarva","JQ","","_","_"
3,"sugamaṃ","_","_","sugama","JJ","","_","_"
4,"pravacmi","_","_","pravak","V","pravac","_","_"
5,"sahasā","_","_","sahasā","CX","","_","_"
6,"_","_","_","siddha","NC","","_","_"
7,"_","_","_","ānana","NC","","_","_"
8,"_","_","_","āga","PPP","","_","_"
9,"_","_","_","pratyakṣa","JJ","","_","_"
10,"_","_","_","anubhava","NC","","_","_"
11,"_","_","_","vārttika","NC","","_","_"
12,"_","_","_","gaṇa","NC","","_","_"
13,"_","_","_","sāmrājya","NC","","_","_"
14,"_","_","_","da","JJ","","_","_"
1,"_","_","_","śudh","PPP","","_","_"
2,"_","_","_","pārada","NC","","_","_"
3,"_","_","_","bhāga","NC","","_","_"
4,"_","_","_","eka","PPX","","_","_"
5,"ṭaṅkaṇena","_","_","ṭaṅkaṇa","NC","","_","_"
6,"samaṃ","_","_","sama","PPX","","_","_"
7,"samam","_","_","sama","PPX","","_","_"
1,"_","_","_","marday","V","marday","_","_"
2,"_","_","_","triphalā","NC","","_","_"
3,"_","_","_","kvātha","NC","","_","_"
4,"_","_","_","nara","NC","","_","_"
5,"_","_","_","mūtra","NC","","_","_"
6,"_","_","_","yuta","JJ","","_","_"
7,"_","_","_","tatas","CX","","_","_"
1,"_","_","_","karṣa","NC","","_","_"
2,"_","_","_","aṃśa","NC","","_","_"
3,"gulikāḥ","_","_","gulikā","NC","","_","_"
4,"kṛtvā","_","_","kṛ","CGDA","","_","_"
5,"_","_","_","māṣa","NC","","_","_"
6,"_","_","_","cūrṇa","NC","","_","_"
7,"_","_","_","jala","NC","","_","_"
8,"_","_","_","anvita","JJ","","_","_"
1,"_","_","_","sūta","NC","","_","_"
2,"a","_","_","alpha_privativum","JJ","","_","_"
2,"_","_","_","dṛṣṭa","JJ","","_","_"
3,"_","_","_","guṇa","NC","","_","_"
4,"_","_","_","lip","CGDA","","_","_"
5,"chāyāśuṣkāṃ","_","_","chāyāśuṣka","JJ","","_","_"
6,"dhamed","_","_","dham","V","dha","_","_"
7,"dṛḍham","_","_","dṛḍha","CX","","_","_"
1,"koṣṭhīyantre","_","_","koṣṭhīyantra","NC","","_","_"
2,"vaṃkanāle","_","_","vaṅkanāla","NC","","_","_"
3,"kiṭṭaṃ","_","_","kiṭṭa","NC","","_","_"
4,"bhittvā","_","_","bhid","CGDA","","_","_"
5,"samāharet","_","_","samāhar","V","samāhṛ","_","_"
1,"_","_","_","rasa","NC","","_","_"
2,"_","_","_","adas","PRD","","_","_"
3,"_","_","_","vartula","JJ","","_","_"
4,"_","_","_","ākāra","NC","","_","_"
5,"_","_","_","ṣaṇḍa","NC","","_","_"
6,"_","_","_","bandh","PPP","","_","_"
7,"_","_","_","bhav","V","bhū","_","_"
8,"_","_","_","ala","CX","","_","_"
1,"_","_","_","āraṇya","JJ","","_","_"
2,"_","_","_","mallikā","NC","","_","_"
3,"_","_","_","drāva","NC","","_","_"
4,"_","_","_","mūṣā","NC","","_","_"
5,"_","_","_","kanyā","NC","","_","_"
6,"_","_","_","drava","NC","","_","_"
7,"_","_","_","ca","CCD","","_","_"
8,"vā","_","_","vā","CCD","","_","_"
1,"_","_","_","drava","NC","","_","_"
2,"_","_","_","hariṇakhurī","NC","","_","_"
3,"vā","_","_","vā","CCD","","_","_"
4,"_","_","_","nara","NC","","_","_"
5,"_","_","_","mūtra","NC","","_","_"
6,"_","_","_","yuta","JJ","","_","_"
7,"rasam","_","_","rasa","NC","","_","_"
1,"_","_","_","tri","NUM","","_","_"
2,"_","_","_","dina","NC","","_","_"
3,"_","_","_","marday","V","marday","_","_"
4,"_","_","_","khalva","NC","","_","_"
5,"mūtraṃ","_","_","mūtra","NC","","_","_"
6,"dattvā","_","_","dā","CGDA","","_","_"
7,"punaḥ","_","_","punar","CAD","","_","_"
8,"punaḥ","_","_","punar","CAD","","_","_"
1,"_","_","_","tad","PRD","","_","_"
2,"_","_","_","vaṭī","NC","","_","_"
3,"_","_","_","māṣa","NC","","_","_"
4,"_","_","_","piṣṭa","NC","","_","_"
5,"liptvā","_","_","lip","CGDA","","_","_"
6,"dhāmyaṃ","_","_","dha","KDG","","_","_"
7,"ca","_","_","ca","CCD","","_","_"
8,"pūrvavat","_","_","pūrvavat","CX","","_","_"
1,"_","_","_","tadvat","CX","","_","_"
2,"_","_","_","sūta","NC","","_","_"
3,"_","_","_","bhav","V","bhū","_","_"
4,"_","_","_","bandh","PPP","","_","_"
5,"_","_","_","tad","PRD","","_","_"
6,"_","_","_","śodhay","KDG","","_","_"
7,"_","_","_","kāca","NC","","_","_"
8,"_","_","_","ṭaṅkaṇa","NC","","_","_"
1,"_","_","_","markaṭī","NC","","_","_"
2,"_","_","_","mūla","NC","","_","_"
3,"_","_","_","ja","JJ","","_","_"
4,"_","_","_","drāva","NC","","_","_"
5,"pāradaṃ","_","_","pārada","NC","","_","_"
6,"_","_","_","marday","V","marday","_","_"
7,"_","_","_","dina","NC","","_","_"
1,"_","_","_","markaṭī","NC","","_","_"
2,"_","_","_","mūla","NC","","_","_"
3,"_","_","_","ja","JJ","","_","_"
4,"piṇḍe","_","_","piṇḍa","NC","","_","_"
5,"_","_","_","kṣip","V","kṣip","_","_"
6,"_","_","_","tad","PRD","","_","_"
7,"_","_","_","marday","PPP","","_","_"
8,"rasam","_","_","rasa","NC","","_","_"
1,"_","_","_","tad","PRD","","_","_"
2,"_","_","_","piṇḍa","NC","","_","_"
3,"vajramūṣāyāṃ","_","_","vajramūṣā","NC","","_","_"
4,"ruddhvā","_","_","rudh","CGDA","","_","_"
5,"_","_","_","tīvra","JJ","","_","_"
6,"_","_","_","agni","NC","","_","_"
7,"dhamet","_","_","dham","V","dha","_","_"
1,"jāyate","_","_","jan","V","jan","_","_"
2,"_","_","_","khoṭa","NC","","_","_"
3,"_","_","_","bandh","PPP","","_","_"
4,"_","_","_","ida","PRD","","_","_"
5,"_","_","_","sarva","JQ","","_","_"
6,"_","_","_","kārya","NC","","_","_"
7,"_","_","_","kara","JJ","","_","_"
8,"_","_","_","kṣama","JJ","","_","_"
1,"_","_","_","arka","NC","","_","_"
2,"_","_","_","mūla","NC","","_","_"
3,"_","_","_","ravi","NC","","_","_"
4,"_","_","_","kṣīra","NC","","_","_"
5,"piṣṭvā","_","_","piṣ","CGDA","","_","_"
6,"mūṣāṃ","_","_","mūṣā","NC","","_","_"
7,"ghanaṃ","_","_","ghana","NC","","_","_"
8,"kṣipet","_","_","kṣip","V","kṣip","_","_"
1,"_","_","_","tad","PRD","","_","_"
2,"_","_","_","madhye","CX","","_","_"
3,"jāritaṃ","_","_","jāray","PPP","","_","_"
4,"sūtaṃ","_","_","sūta","NC","","_","_"
5,"kṣiptvā","_","_","kṣip","CGDA","","_","_"
6,"_","_","_","rudh","CGDA","","_","_"
7,"_","_","_","atha","CAD","","_","_"
8,"rodhayet","_","_","rudh","V","rudh","_","_"
1,"mṛṇmaye","_","_","mṛṇmaya","JJ","","_","_"
2,"saṃpuṭe","_","_","sampuṭa","NC","","_","_"
3,"taṃ","_","_","tad","PRD","","_","_"
4,"ca","_","_","ca","CCD","","_","_"
5,"_","_","_","nirudh","V","nirudh","_","_"
6,"_","_","_","loha","NC","","_","_"
7,"_","_","_","sampuṭa","NC","","_","_"
1,"tato","_","_","tatas","CX","","_","_"
2,"gajapuṭe","_","_","gajapuṭa","NC","","_","_"
3,"pacyāt","_","_","pac","V","pac","_","_"
4,"pārado","_","_","pārada","NC","","_","_"
5,"_","_","_","bandha","NC","","_","_"
6,"_","_","_","āpn","V","āp","_","_"
1,"jalakumbhyā","_","_","jalakumbhī","NC","","_","_"
2,"dravaiḥ","_","_","drava","NC","","_","_"
3,"sūtaṃ","_","_","sūta","NC","","_","_"
4,"_","_","_","marday","V","marday","_","_"
5,"_","_","_","divasa","NC","","_","_"
6,"_","_","_","traya","NC","","_","_"
1,"jalakumbhyā","_","_","jalakumbhī","NC","","_","_"
2,"_","_","_","dala","NC","","_","_"
3,"_","_","_","mūṣā","NC","","_","_"
4,"kṛtvā","_","_","kṛ","CGDA","","_","_"
5,"tatra","_","_","tatra","CAD","","_","_"
6,"_","_","_","kṣip","V","kṣip","_","_"
7,"_","_","_","tu","CCD","","_","_"
8,"tat","_","_","tad","PRD","","_","_"
1,"ruddhvā","_","_","rudh","CGDA","","_","_"
2,"tāṃ","_","_","tad","PRD","","_","_"
3,"vajramūṣāyāṃ","_","_","vajramūṣā","NC","","_","_"
4,"chāyāśuṣkāṃ","_","_","chāyāśuṣka","JJ","","_","_"
5,"_","_","_","puṭ","V","puṭ","_","_"
6,"_","_","_","laghu","JJ","","_","_"
1,"_","_","_","utpala","NC","","_","_"
2,"_","_","_","ekaika","PRC","","_","_"
3,"_","_","_","vṛddhi","NC","","_","_"
4,"tu","_","_","tu","CCD","","_","_"
5,"_","_","_","viṃśat","NC","","_","_"
6,"_","_","_","vāra","NC","","_","_"
7,"puṭaiḥ","_","_","puṭa","NC","","_","_"
8,"pacet","_","_","pac","V","pac","_","_"
1,"tato","_","_","tatas","CX","","_","_"
2,"gajapuṭaṃ","_","_","gajapuṭa","NC","","_","_"
3,"deyaṃ","_","_","dā","KDG","","_","_"
4,"_","_","_","samyak","CX","","_","_"
5,"_","_","_","bandh","PPP","","_","_"
6,"_","_","_","bhav","V","bhū","_","_"
7,"_","_","_","rasa","NC","","_","_"
1,"_","_","_","ekavīrā","NC","","_","_"
2,"_","_","_","drava","NC","","_","_"
3,"_","_","_","mṛd","KDG","","_","_"
4,"_","_","_","tri","NUM","","_","_"
5,"_","_","_","dina","NC","","_","_"
6,"_","_","_","śudh","PPP","","_","_"
7,"_","_","_","pārada","NC","","_","_"
1,"_","_","_","ekavīrā","NC","","_","_"
2,"_","_","_","kanda","NC","","_","_"
3,"_","_","_","kalka","NC","","_","_"
4,"_","_","_","vajramūṣā","NC","","_","_"
5,"pralepayet","_","_","pralepay","V","pralepay","_","_"
1,"tasyāṃ","_","_","tad","PRD","","_","_"
2,"_","_","_","pūrva","PPX","","_","_"
3,"_","_","_","rasa","NC","","_","_"
4,"ruddhvā","_","_","rudh","CGDA","","_","_"
5,"dhmāte","_","_","dha","PPP","","_","_"
6,"baddho","_","_","bandh","PPP","","_","_"
7,"_","_","_","bhav","V","bhū","_","_"
8,"_","_","_","rasa","NC","","_","_"
1,"_","_","_","ārakta","JJ","","_","_"
2,"_","_","_","kṣīrakanda","NC","","_","_"
3,"_","_","_","uttha","JJ","","_","_"
4,"_","_","_","drava","NC","","_","_"
5,"_","_","_","tri","NUM","","_","_"
6,"_","_","_","stanya","NC","","_","_"
7,"_","_","_","saṃyuta","JJ","","_","_"
1,"_","_","_","tri","NUM","","_","_"
2,"_","_","_","dina","NC","","_","_"
3,"pāradaṃ","_","_","pārada","NC","","_","_"
4,"mardyaṃ","_","_","mṛd","KDG","","_","_"
5,"_","_","_","vajrakanda","NC","","_","_"
6,"_","_","_","drava","NC","","_","_"
7,"_","_","_","tri","NUM","","_","_"
8,"_","_","_","aha","NC","","_","_"
1,"kṣīrakaṃdasya","_","_","kṣīrakanda","NC","","_","_"
2,"kalkena","_","_","kalka","NC","","_","_"
3,"vajramūṣāṃ","_","_","vajramūṣā","NC","","_","_"
4,"pralepayet","_","_","pralepay","V","pralepay","_","_"
1,"tatra","_","_","tatra","CAD","","_","_"
2,"_","_","_","pūrva","PPX","","_","_"
3,"_","_","_","rasa","NC","","_","_"
4,"ruddhvā","_","_","rudh","CGDA","","_","_"
5,"dhmāte","_","_","dha","PPP","","_","_"
6,"baddho","_","_","bandh","PPP","","_","_"
7,"_","_","_","bhav","V","bhū","_","_"
8,"_","_","_","rasa","NC","","_","_"
1,"kṛtvā","_","_","kṛ","CGDA","","_","_"
2,"_","_","_","tāmra","NC","","_","_"
3,"_","_","_","maya","JJ","","_","_"
4,"cakraṃ","_","_","cakra","NC","","_","_"
5,"vistīrṇaṃ","_","_","vistṛ","PPP","","_","_"
6,"_","_","_","catur","NUM","","_","_"
7,"_","_","_","aṅgula","NC","","_","_"
1,"unnataṃ","_","_","unna","PPP","","_","_"
2,"_","_","_","ca","CCD","","_","_"
3,"_","_","_","aṅgulīka","NC","","_","_"
4,"tu","_","_","tu","CCD","","_","_"
5,"_","_","_","su","CAD","","_","_"
6,"_","_","_","dṛḍha","JJ","","_","_"
7,"vartulaṃ","_","_","vartula","JJ","","_","_"
8,"samam","_","_","sama","PPX","","_","_"
1,"gaṃdhakaṃ","_","_","gandhaka","NC","","_","_"
2,"pāradaṃ","_","_","pārada","NC","","_","_"
3,"tutthaṃ","_","_","tuttha","NC","","_","_"
4,"_","_","_","kar","V","kṛ","_","_"
5,"_","_","_","khalva","NC","","_","_"
6,"kajjalīm","_","_","kajjalī","NC","","_","_"
1,"_","_","_","tad","PRD","","_","_"
2,"_","_","_","kajjala","NC","","_","_"
3,"_","_","_","tāmra","NC","","_","_"
4,"_","_","_","tulya","JJ","","_","_"
5,"_","_","_","mūṣā","NC","","_","_"
6,"_","_","_","madhye","CX","","_","_"
7,"vinikṣipet","_","_","vinikṣip","V","vinikṣip","_","_"
1,"taṃ","_","_","tad","PRD","","_","_"
2,"cakraṃ","_","_","cakra","NC","","_","_"
3,"_","_","_","mūṣikā","NC","","_","_"
4,"_","_","_","vaktra","NC","","_","_"
5,"dattvā","_","_","dā","CGDA","","_","_"
6,"_","_","_","rudh","CGDA","","_","_"
7,"_","_","_","atha","CAD","","_","_"
8,"śoṣayet","_","_","śuṣ","V","śuṣ","_","_"
1,"taṃ","_","_","tad","PRD","","_","_"
2,"_","_","_","pac","V","pac","_","_"
3,"_","_","_","haṇḍikā","NC","","_","_"
4,"_","_","_","yantra","NC","","_","_"
5,"_","_","_","dvi","NUM","","_","_"
6,"_","_","_","yāma","NC","","_","_"
7,"_","_","_","laghu","JJ","","_","_"
8,"_","_","_","vahni","NC","","_","_"
1,"uddhṛtya","_","_","uddhṛ","CGDA","","_","_"
2,"_","_","_","grāhay","V","grāhay","_","_"
3,"_","_","_","cakra","NC","","_","_"
4,"_","_","_","rasarāja","NC","","_","_"
5,"punaḥ","_","_","punar","CAD","","_","_"
6,"punaḥ","_","_","punar","CAD","","_","_"
1,"_","_","_","tad","PRD","","_","_"
2,"_","_","_","tulya","JJ","","_","_"
3,"ṭaṃkaṇaṃ","_","_","ṭaṅkaṇa","NC","","_","_"
4,"_","_","_","kāca","NC","","_","_"
5,"_","_","_","ūrdhva","JJ","","_","_"
6,"_","_","_","adhas","CX","","_","_"
7,"_","_","_","tad","PRD","","_","_"
8,"dāpayet","_","_","dad","V","dā","_","_"
1,"_","_","_","andhamūṣā","NC","","_","_"
2,"_","_","_","ga","PPP","","_","_"
3,"_","_","_","dha","KDG","","_","_"
4,"_","_","_","eva","CX","","_","_"
5,"_","_","_","vāra","NC","","_","_"
6,"_","_","_","traya","NC","","_","_"
7,"kṛte","_","_","kṛ","PPP","","_","_"
1,"rasendro","_","_","rasendra","NC","","_","_"
2,"jāyate","_","_","jan","V","jan","_","_"
3,"baddho","_","_","bandh","PPP","","_","_"
4,"_","_","_","hi","CX","","_","_"
5,"_","_","_","akṣīṇa","JJ","","_","_"
6,"_","_","_","na","CNG","","_","_"
7,"_","_","_","atra","CAD","","_","_"
8,"saṃśayaḥ","_","_","saṃśaya","NC","","_","_"
1,"_","_","_","śudh","PPP","","_","_"
2,"_","_","_","sūta","NC","","_","_"
3,"samaṃ","_","_","sama","PPX","","_","_"
4,"gaṃdhaṃ","_","_","gandha","NC","","_","_"
5,"dvābhyāṃ","_","_","dvi","NUM","","_","_"
6,"tulyaṃ","_","_","tulya","JJ","","_","_"
7,"ca","_","_","ca","CCD","","_","_"
8,"tālakam","_","_","tālaka","NC","","_","_"
1,"_","_","_","mṛd","KDG","","_","_"
2,"_","_","_","unmattaka","NC","","_","_"
3,"_","_","_","drāva","NC","","_","_"
4,"khalve","_","_","khalva","NC","","_","_"
5,"_","_","_","yāma","NC","","_","_"
6,"_","_","_","catuṣṭaya","NC","","_","_"
1,"_","_","_","pātay","V","pātay","_","_"
2,"_","_","_","pātanāyantra","NC","","_","_"
3,"_","_","_","dina","NC","","_","_"
4,"_","_","_","eka","PPX","","_","_"
5,"_","_","_","manda","JJ","","_","_"
6,"_","_","_","vahni","NC","","_","_"
1,"_","_","_","ūrdhva","JJ","","_","_"
2,"_","_","_","lag","PPP","","_","_"
3,"_","_","_","adhas","CX","","_","_"
4,"_","_","_","stha","JJ","","_","_"
5,"ca","_","_","ca","CCD","","_","_"
6,"_","_","_","tad","PRD","","_","_"
7,"_","_","_","sarva","JQ","","_","_"
8,"tu","_","_","tu","CCD","","_","_"
9,"samāharet","_","_","samāhar","V","samāhṛ","_","_"
1,"mardyam","_","_","mṛd","KDG","","_","_"
2,"_","_","_","unmattaka","NC","","_","_"
3,"_","_","_","drāva","NC","","_","_"
4,"dṛḍhaṃ","_","_","dṛḍha","CX","","_","_"
5,"_","_","_","yāma","NC","","_","_"
6,"_","_","_","catuṣṭaya","NC","","_","_"
1,"_","_","_","tad","PRD","","_","_"
2,"_","_","_","gola","NC","","_","_"
3,"_","_","_","pūrvavat","CX","","_","_"
4,"_","_","_","pac","KDG","","_","_"
5,"_","_","_","punar","CAD","","_","_"
6,"_","_","_","ādā","CGDA","","_","_"
7,"mardayet","_","_","marday","V","marday","_","_"
1,"punaḥ","_","_","punar","CAD","","_","_"
2,"pācyaṃ","_","_","pac","KDG","","_","_"
3,"_","_","_","punar","CAD","","_","_"
4,"_","_","_","mṛd","KDG","","_","_"
5,"_","_","_","ūrdhva","JJ","","_","_"
6,"_","_","_","adhas","CX","","_","_"
7,"_","_","_","stha","JJ","","_","_"
8,"prayatnataḥ","_","_","prayatna","NC","","_","_"
1,"sarvaṃ","_","_","sarva","JQ","","_","_"
2,"_","_","_","yāvat","CX","","_","_"
3,"_","_","_","adhas","CX","","_","_"
4,"bhāṇḍe","_","_","bhāṇḍa","NC","","_","_"
5,"tiṣṭhate","_","_","tiṣṭh","V","sthā","_","_"
6,"_","_","_","tāvat","JJ","","_","_"
7,"_","_","_","avadhi","NC","","_","_"
1,"_","_","_","tad","PRD","","_","_"
2,"_","_","_","sarva","JQ","","_","_"
3,"_","_","_","pūrvavat","CX","","_","_"
4,"_","_","_","mṛd","KDG","","_","_"
5,"golaṃ","_","_","gola","NC","","_","_"
6,"_","_","_","kṛ","CGDA","","_","_"
7,"_","_","_","atha","CAD","","_","_"
8,"śoṣayet","_","_","śuṣ","V","śuṣ","_","_"
1,"samyak","_","_","samyak","CX","","_","_"
2,"_","_","_","saṃpeṣay","V","saṃpeṣay","_","_"
3,"_","_","_","amla","NC","","_","_"
4,"_","_","_","nalika","NC","","_","_"
5,"_","_","_","kuṣṭha","NC","","_","_"
6,"_","_","_","eva","CEM","","_","_"
7,"ca","_","_","ca","CCD","","_","_"
1,"_","_","_","pīta","JJ","","_","_"
2,"_","_","_","añjana","NC","","_","_"
3,"vā","_","_","vā","CCD","","_","_"
4,"peṣyaṃ","_","_","piṣ","KDG","","_","_"
5,"ca","_","_","ca","CCD","","_","_"
6,"tena","_","_","tad","PRD","","_","_"
7,"golaṃ","_","_","gola","NC","","_","_"
8,"pralepayet","_","_","pralepay","V","pralepay","_","_"
1,"_","_","_","vajramūṣā","NC","","_","_"
2,"_","_","_","udara","NC","","_","_"
3,"_","_","_","ca","CCD","","_","_"
4,"_","_","_","atha","CAD","","_","_"
5,"tena","_","_","tad","PRD","","_","_"
6,"kalkena","_","_","kalka","NC","","_","_"
7,"lepya","_","_","lepay","CGDA","","_","_"
8,"vai","_","_","vai","CX","","_","_"
1,"golakaṃ","_","_","golaka","NC","","_","_"
2,"_","_","_","tāpay","V","tāpay","_","_"
3,"_","_","_","tatra","CAD","","_","_"
4,"vaṃkanālena","_","_","vaṅkanāla","NC","","_","_"
5,"taṃ","_","_","tad","PRD","","_","_"
6,"dhaman","_","_","dha","KDP","","_","_"
1,"_","_","_","khoṭa","NC","","_","_"
2,"_","_","_","bandh","PPP","","_","_"
3,"_","_","_","bhav","V","bhū","_","_"
4,"_","_","_","sākṣāt","CX","","_","_"
5,"_","_","_","tīvra","JJ","","_","_"
6,"_","_","_","dhāma","NC","","_","_"
7,"_","_","_","anala","NC","","_","_"
8,"tu","_","_","tu","CCD","","_","_"
1,"palaṃ","_","_","pala","NC","","_","_"
2,"sūtaṃ","_","_","sūta","NC","","_","_"
3,"palaṃ","_","_","pala","NC","","_","_"
4,"nāgaṃ","_","_","nāga","NC","","_","_"
5,"dvābhyāṃ","_","_","dvi","NUM","","_","_"
6,"tulyā","_","_","tulya","JJ","","_","_"
7,"manaḥśilā","_","_","manaḥśilā","NC","","_","_"
1,"_","_","_","pūrvavat","CX","","_","_"
2,"_","_","_","krama","NC","","_","_"
3,"_","_","_","yoga","NC","","_","_"
4,"_","_","_","khoṭa","NC","","_","_"
5,"_","_","_","bandh","PPP","","_","_"
6,"_","_","_","bhav","V","bhū","_","_"
7,"_","_","_","rasa","NC","","_","_"
1,"nāgaṃ","_","_","nāga","NC","","_","_"
2,"tāraṃ","_","_","tāra","NC","","_","_"
3,"samaṃ","_","_","sama","PPX","","_","_"
4,"drāvyaṃ","_","_","drāvay","KDG","","_","_"
5,"_","_","_","tad","PRD","","_","_"
6,"_","_","_","cūrṇa","NC","","_","_"
7,"_","_","_","pala","NC","","_","_"
8,"_","_","_","mātraka","NC","","_","_"
1,"_","_","_","śudh","PPP","","_","_"
2,"_","_","_","sūta","NC","","_","_"
3,"_","_","_","pala","NC","","_","_"
4,"_","_","_","eka","PPX","","_","_"
5,"ca","_","_","ca","CCD","","_","_"
6,"_","_","_","sarva","JQ","","_","_"
7,"_","_","_","tulya","JJ","","_","_"
8,"manaḥśilā","_","_","manaḥśilā","NC","","_","_"
1,"_","_","_","pūrvavat","CX","","_","_"
2,"_","_","_","krama","NC","","_","_"
3,"_","_","_","yoga","NC","","_","_"
4,"_","_","_","khoṭa","NC","","_","_"
5,"_","_","_","bandh","PPP","","_","_"
6,"_","_","_","bhav","V","bhū","_","_"
7,"_","_","_","rasa","NC","","_","_"
1,"palaṃ","_","_","pala","NC","","_","_"
2,"sūtaṃ","_","_","sūta","NC","","_","_"
3,"palaṃ","_","_","pala","NC","","_","_"
4,"tāraṃ","_","_","tāra","NC","","_","_"
5,"_","_","_","piṣ","PPP","","_","_"
6,"_","_","_","amla","NC","","_","_"
7,"kenacit","_","_","kiṃcit","PRI","","_","_"
1,"dvābhyāṃ","_","_","dvi","NUM","","_","_"
2,"tulyā","_","_","tulya","JJ","","_","_"
3,"śilā","_","_","śilā","NC","","_","_"
4,"yojyā","_","_","yuj","KDG","","_","_"
5,"_","_","_","pūrva","PPX","","_","_"
6,"_","_","_","yoga","NC","","_","_"
7,"pācayet","_","_","pāc","V","pācay","_","_"
1,"_","_","_","tāra","NC","","_","_"
2,"_","_","_","vat","CX","","_","_"
3,"_","_","_","svarṇa","NC","","_","_"
4,"_","_","_","piṣṭī","NC","","_","_"
5,"ca","_","_","ca","CCD","","_","_"
6,"gaṃdhakena","_","_","gandhaka","NC","","_","_"
7,"ca","_","_","ca","CCD","","_","_"
8,"pūrvavat","_","_","pūrvavat","CX","","_","_"
1,"_","_","_","kṛṣṇa","JJ","","_","_"
2,"_","_","_","abhraka","NC","","_","_"
3,"satvaṃ","_","_","sattva","NC","","_","_"
4,"ca","_","_","ca","CCD","","_","_"
5,"tīkṣṇaṃ","_","_","tīkṣṇa","NC","","_","_"
6,"kāṃtaṃ","_","_","kānta","NC","","_","_"
7,"ca","_","_","ca","CCD","","_","_"
8,"hāṭakam","_","_","hāṭaka","NC","","_","_"
1,"śulbaṃ","_","_","śulba","NC","","_","_"
2,"tāraṃ","_","_","tāra","NC","","_","_"
3,"ca","_","_","ca","CCD","","_","_"
4,"mākṣīkaṃ","_","_","mākṣīka","NC","","_","_"
5,"samaṃ","_","_","sama","PPX","","_","_"
6,"sūkṣmaṃ","_","_","sūkṣma","JJ","","_","_"
7,"vicūrṇayet","_","_","vicūrṇay","V","vicūrṇay","_","_"
1,"_","_","_","vajramūṣā","NC","","_","_"
2,"_","_","_","ga","PPP","","_","_"
3,"ruddhvā","_","_","rudh","CGDA","","_","_"
4,"dhmāte","_","_","dha","PPP","","_","_"
5,"khoṭaṃ","_","_","khoṭa","NC","","_","_"
6,"_","_","_","bhav","V","bhū","_","_"
7,"_","_","_","tu","CCD","","_","_"
8,"tat","_","_","tad","PRD","","_","_"
1,"_","_","_","śveta","JJ","","_","_"
2,"_","_","_","abhraka","NC","","_","_"
3,"satvaṃ","_","_","sattva","NC","","_","_"
4,"ca","_","_","ca","CCD","","_","_"
5,"tāraṃ","_","_","tāra","NC","","_","_"
6,"tīkṣṇaṃ","_","_","tīkṣṇa","NC","","_","_"
7,"ca","_","_","ca","CCD","","_","_"
8,"mākṣikam","_","_","mākṣika","NC","","_","_"
1,"samaṃ","_","_","sama","PPX","","_","_"
2,"cūrṇya","_","_","cūrṇay","CGDA","","_","_"
3,"kṛtaṃ","_","_","kṛ","PPP","","_","_"
4,"khoṭaṃ","_","_","khoṭa","NC","","_","_"
5,"_","_","_","khoṭa","NC","","_","_"
6,"_","_","_","aṃśa","NC","","_","_"
7,"_","_","_","śudh","PPP","","_","_"
8,"_","_","_","sūtaka","NC","","_","_"
1,"haritālaṃ","_","_","haritāla","NC","","_","_"
2,"_","_","_","dvi","NUM","","_","_"
3,"_","_","_","tulya","JJ","","_","_"
4,"sūkṣmaṃ","_","_","sūkṣma","JJ","","_","_"
5,"mardyaṃ","_","_","mṛd","KDG","","_","_"
6,"ca","_","_","ca","CCD","","_","_"
7,"pūrvavat","_","_","pūrvavat","CX","","_","_"
1,"_","_","_","mahat","JJ","","_","_"
2,"_","_","_","agni","NC","","_","_"
3,"_","_","_","ga","PPP","","_","_"
4,"dhmātaṃ","_","_","dha","PPP","","_","_"
5,"khoṭaṃ","_","_","khoṭa","NC","","_","_"
6,"bhavati","_","_","bhav","V","bhū","_","_"
7,"_","_","_","tad","PRD","","_","_"
8,"_","_","_","rasa","NC","","_","_"
1,"pāradaṃ","_","_","pārada","NC","","_","_"
2,"gaṃdhakaṃ","_","_","gandhaka","NC","","_","_"
3,"tulyaṃ","_","_","tulya","JJ","","_","_"
4,"mardyaṃ","_","_","mṛd","KDG","","_","_"
5,"_","_","_","kanyā","NC","","_","_"
6,"_","_","_","drava","NC","","_","_"
7,"_","_","_","dina","NC","","_","_"
1,"_","_","_","tad","PRD","","_","_"
2,"_","_","_","gola","NC","","_","_"
3,"dviguṇaṃ","_","_","dviguṇa","JJ","","_","_"
4,"gaṃdhaṃ","_","_","gandha","NC","","_","_"
5,"dattvā","_","_","dā","CGDA","","_","_"
6,"_","_","_","mūṣā","NC","","_","_"
7,"_","_","_","adhara","JJ","","_","_"
8,"_","_","_","uttara","JJ","","_","_"
1,"ruddhvā","_","_","rudh","CGDA","","_","_"
2,"saṃdhiṃ","_","_","saṃdhi","NC","","_","_"
3,"_","_","_","viśoṣay","CGDA","","_","_"
4,"_","_","_","atha","CAD","","_","_"
5,"koṣṭhīyantre","_","_","koṣṭhīyantra","NC","","_","_"
6,"dṛḍhaṃ","_","_","dṛḍha","CX","","_","_"
7,"dhaman","_","_","dha","KDP","","_","_"
1,"_","_","_","tad","PRD","","_","_"
2,"_","_","_","sūta","NC","","_","_"
3,"jāyate","_","_","jan","V","jan","_","_"
4,"khoṭaṃ","_","_","khoṭa","NC","","_","_"
5,"_","_","_","gandha","NC","","_","_"
6,"_","_","_","bandh","PPP","","_","_"
7,"_","_","_","ida","PRD","","_","_"
8,"bhavet","_","_","bhav","V","bhū","_","_"
1,"pañcāṅgaṃ","_","_","pañcāṅga","NC","","_","_"
2,"rājavṛkṣasya","_","_","rājavṛkṣa","NC","","_","_"
3,"_","_","_","kvātha","NC","","_","_"
4,"_","_","_","aṣṭan","NUM","","_","_"
5,"_","_","_","avaśeṣay","PPP","","_","_"
1,"_","_","_","tad","PRD","","_","_"
2,"_","_","_","drava","NC","","_","_"
3,"tu","_","_","tu","CCD","","_","_"
4,"rase","_","_","rasa","NC","","_","_"
5,"kṣiptvā","_","_","kṣip","CGDA","","_","_"
6,"pācyaṃ","_","_","pac","KDG","","_","_"
7,"_","_","_","yāma","NC","","_","_"
8,"_","_","_","dvaya","NC","","_","_"
9,"śubham","_","_","śubha","JJ","","_","_"
1,"_","_","_","bhav","V","bhū","_","_"
2,"_","_","_","tad","PRD","","_","_"
3,"khoṭo","_","_","khoṭa","NC","","_","_"
4,"vai","_","_","vai","CX","","_","_"
5,"_","_","_","sarva","JQ","","_","_"
6,"_","_","_","kārya","NC","","_","_"
7,"_","_","_","kṛt","JJ","","_","_"
1,"candravallyā","_","_","candravallī","NC","","_","_"
2,"_","_","_","drava","NC","","_","_"
3,"_","_","_","mṛd","KDG","","_","_"
4,"_","_","_","tri","NUM","","_","_"
5,"_","_","_","dina","NC","","_","_"
6,"_","_","_","śudh","PPP","","_","_"
7,"_","_","_","pārada","NC","","_","_"
1,"ṭaṃkaṇena","_","_","ṭaṅkaṇa","NC","","_","_"
2,"tu","_","_","tu","CCD","","_","_"
3,"saṃyojya","_","_","saṃyojay","CGDA","","_","_"
4,"vaṭikāṃ","_","_","vaṭikā","NC","","_","_"
5,"kārayed","_","_","kar","V","kṛ","_","_"
6,"budhaḥ","_","_","budha","JJ","","_","_"
1,"_","_","_","koṣṭha","NC","","_","_"
2,"_","_","_","yantra","NC","","_","_"
3,"_","_","_","ga","PPP","","_","_"
4,"dhmātaṃ","_","_","dha","PPP","","_","_"
5,"_","_","_","khoṭa","NC","","_","_"
6,"_","_","_","bandh","PPP","","_","_"
7,"_","_","_","bhav","V","bhū","_","_"
8,"_","_","_","rasa","NC","","_","_"
1,"bhallātakānāṃ","_","_","bhallātaka","NC","","_","_"
2,"_","_","_","taila","NC","","_","_"
3,"_","_","_","antar","CAD","","_","_"
4,"_","_","_","pala","NC","","_","_"
5,"_","_","_","eka","PPX","","_","_"
6,"_","_","_","kṣip","V","kṣip","_","_"
7,"_","_","_","rasa","NC","","_","_"
1,"_","_","_","yāvat","CX","","_","_"
2,"_","_","_","taila","NC","","_","_"
3,"_","_","_","pac","V","pac","_","_"
4,"_","_","_","tāvat","CX","","_","_"
5,"_","_","_","ravi","NC","","_","_"
6,"_","_","_","kṣīra","NC","","_","_"
7,"kṣipan","_","_","kṣip","KDP","","_","_"
8,"kṣipan","_","_","kṣip","KDP","","_","_"
1,"_","_","_","ghaṭṭay","V","ghaṭṭay","_","_"
2,"_","_","_","loha","NC","","_","_"
3,"_","_","_","daṇḍa","NC","","_","_"
4,"_","_","_","khoṭa","NC","","_","_"
5,"_","_","_","bandh","PPP","","_","_"
6,"_","_","_","bhav","V","bhū","_","_"
7,"_","_","_","rasa","NC","","_","_"
1,"dravaiḥ","_","_","drava","NC","","_","_"
2,"_","_","_","sa_saha","CX","","_","_"
3,"_","_","_","mūla","NC","","_","_"
4,"_","_","_","kārpāsī","NC","","_","_"
5,"_","_","_","tri","NUM","","_","_"
6,"_","_","_","dina","NC","","_","_"
7,"_","_","_","marday","V","marday","_","_"
8,"_","_","_","sama","PPX","","_","_"
1,"ṭaṃkaṇena","_","_","ṭaṅkaṇa","NC","","_","_"
2,"_","_","_","pāda","NC","","_","_"
3,"_","_","_","aṃśa","NC","","_","_"
4,"vaṭikāḥ","_","_","vaṭikā","NC","","_","_"
5,"_","_","_","kāray","V","kāray","_","_"
6,"_","_","_","laghu","JJ","","_","_"
1,"_","_","_","valmīka","NC","","_","_"
2,"_","_","_","mṛttikā","NC","","_","_"
3,"_","_","_","māṣa","NC","","_","_"
4,"_","_","_","godhūma","NC","","_","_"
5,"ca","_","_","ca","CCD","","_","_"
6,"cūrṇakam","_","_","cūrṇaka","NC","","_","_"
1,"samaṃ","_","_","sama","PPX","","_","_"
2,"_","_","_","marday","CGDA","","_","_"
3,"_","_","_","udaka","NC","","_","_"
4,"_","_","_","eva","CEM","","_","_"
5,"mūṣāṃ","_","_","mūṣā","NC","","_","_"
6,"_","_","_","tad","PRD","","_","_"
7,"_","_","_","eva","CEM","","_","_"
8,"kārayet","_","_","kar","V","kṛ","_","_"
1,"_","_","_","tad","PRD","","_","_"
2,"_","_","_","antar","CAD","","_","_"
3,"_","_","_","marday","PPP","","_","_"
4,"sūtaṃ","_","_","sūta","NC","","_","_"
5,"vaṭīṃ","_","_","vaṭī","NC","","_","_"
6,"kṣiptvā","_","_","kṣip","CGDA","","_","_"
7,"dhamed","_","_","dham","V","dha","_","_"
8,"dṛḍham","_","_","dṛḍha","CX","","_","_"
1,"_","_","_","khoṭa","NC","","_","_"
2,"_","_","_","bandh","PPP","","_","_"
3,"_","_","_","bhav","V","bhū","_","_"
4,"_","_","_","tad","PRD","","_","_"
5,"_","_","_","api","CX","","_","_"
6,"_","_","_","andhamūṣā","NC","","_","_"
7,"_","_","_","ga","PPP","","_","_"
8,"rasaḥ","_","_","rasa","NC","","_","_"
1,"rasaṃ","_","_","rasa","NC","","_","_"
2,"pañcaguṇaṃ","_","_","pañcaguṇa","JJ","","_","_"
3,"_","_","_","ca","CCD","","_","_"
4,"_","_","_","eva","CEM","","_","_"
5,"dviguṇaṃ","_","_","dviguṇa","JJ","","_","_"
6,"_","_","_","śveta","JJ","","_","_"
7,"_","_","_","ṭaṅkaṇa","NC","","_","_"
1,"_","_","_","śveta","JJ","","_","_"
2,"_","_","_","vātāri","NC","","_","_"
3,"_","_","_","taila","NC","","_","_"
4,"_","_","_","majjā","NC","","_","_"
5,"_","_","_","aśva","NC","","_","_"
6,"komalā","_","_","komala","JJ","","_","_"
1,"_","_","_","tri","NUM","","_","_"
2,"_","_","_","dina","NC","","_","_"
3,"_","_","_","marday","V","marday","_","_"
4,"_","_","_","khalva","NC","","_","_"
5,"_","_","_","nara","NC","","_","_"
6,"_","_","_","mūtra","NC","","_","_"
7,"sādhakaḥ","_","_","sādhaka","NC","","_","_"
1,"tato","_","_","tatas","CX","","_","_"
2,"_","_","_","godhūma","NC","","_","_"
3,"_","_","_","cūrṇa","NC","","_","_"
4,"tu","_","_","tu","CCD","","_","_"
5,"kṣiptvā","_","_","kṣip","CGDA","","_","_"
6,"_","_","_","kar","V","kṛ","_","_"
7,"_","_","_","vaṭī","NC","","_","_"
8,"śubhāḥ","_","_","śubha","JJ","","_","_"
1,"_","_","_","viśoṣay","CGDA","","_","_"
2,"_","_","_","atha","CAD","","_","_"
3,"_","_","_","dha","V","dha","_","_"
4,"_","_","_","paścāt","CAD","","_","_"
5,"_","_","_","kāca","NC","","_","_"
6,"_","_","_","ṭaṅkaṇa","NC","","_","_"
7,"_","_","_","yoga","NC","","_","_"
1,"_","_","_","khoṭa","NC","","_","_"
2,"_","_","_","bandh","PPP","","_","_"
3,"_","_","_","bhav","V","bhū","_","_"
4,"_","_","_","sūta","NC","","_","_"
5,"_","_","_","tejasvin","JJ","","_","_"
6,"_","_","_","sarva","JQ","","_","_"
7,"_","_","_","kārya","NC","","_","_"
8,"_","_","_","kṛt","JJ","","_","_"
1,"karkoṭī","_","_","karkoṭī","NC","","_","_"
2,"_","_","_","lāṅgalī","NC","","_","_"
3,"_","_","_","kanda","NC","","_","_"
4,"_","_","_","drava","NC","","_","_"
5,"_","_","_","mṛd","KDG","","_","_"
6,"_","_","_","dina","NC","","_","_"
7,"_","_","_","traya","NC","","_","_"
1,"_","_","_","vandhyākarkoṭakī","NC","","_","_"
2,"_","_","_","kanda","NC","","_","_"
3,"taṃ","_","_","tad","PRD","","_","_"
4,"rasaṃ","_","_","rasa","NC","","_","_"
5,"tu","_","_","tu","CCD","","_","_"
6,"niveśayet","_","_","niviś","V","niviś","_","_"
1,"_","_","_","kanda","NC","","_","_"
2,"_","_","_","bāhya","JJ","","_","_"
3,"mṛdā","_","_","mṛd","NC","","_","_"
4,"lepyaṃ","_","_","lepay","KDG","","_","_"
5,"_","_","_","sarvatas","CX","","_","_"
6,"_","_","_","aṅgula","NC","","_","_"
7,"_","_","_","mātraka","NC","","_","_"
1,"śuṣkaṃ","_","_","śuṣka","JJ","","_","_"
2,"_","_","_","tuṣa","NC","","_","_"
3,"_","_","_","puṭa","NC","","_","_"
4,"pacyāt","_","_","pac","V","pac","_","_"
5,"_","_","_","tri","NUM","","_","_"
6,"_","_","_","dina","NC","","_","_"
7,"parivartayan","_","_","parivartay","KDP","","_","_"
1,"samuddhṛtya","_","_","samuddhṛ","CGDA","","_","_"
2,"_","_","_","punar","CAD","","_","_"
3,"_","_","_","mṛd","KDG","","_","_"
4,"_","_","_","pūrva","PPX","","_","_"
5,"_","_","_","kanda","NC","","_","_"
6,"_","_","_","drava","NC","","_","_"
7,"_","_","_","tri","NUM","","_","_"
8,"_","_","_","aha","NC","","_","_"
1,"_","_","_","pūrvavat","CX","","_","_"
2,"_","_","_","puṭapāka","NC","","_","_"
3,"pārado","_","_","pārada","NC","","_","_"
4,"jāyate","_","_","jan","V","jan","_","_"
5,"mṛtaḥ","_","_","mṛ","PPP","","_","_"
1,"haṃsapādyā","_","_","haṃsapādī","NC","","_","_"
2,"_","_","_","drava","NC","","_","_"
3,"_","_","_","mṛd","KDG","","_","_"
4,"_","_","_","saptan","NUM","","_","_"
5,"_","_","_","aha","NC","","_","_"
6,"_","_","_","śudh","PPP","","_","_"
7,"_","_","_","pārada","NC","","_","_"
1,"_","_","_","kṣīrakanda","NC","","_","_"
2,"_","_","_","udara","NC","","_","_"
3,"_","_","_","antar","CAD","","_","_"
4,"_","_","_","vai","CX","","_","_"
5,"kṣiptvā","_","_","kṣip","CGDA","","_","_"
6,"kaṃdaṃ","_","_","kanda","NC","","_","_"
7,"mṛdā","_","_","mṛd","NC","","_","_"
8,"lipet","_","_","lip","V","lip","_","_"
1,"_","_","_","karīṣa","NC","","_","_"
2,"_","_","_","agni","NC","","_","_"
3,"dinaṃ","_","_","dina","NC","","_","_"
4,"_","_","_","pac","V","pac","_","_"
5,"_","_","_","pūrvavat","CX","","_","_"
6,"_","_","_","marday","V","marday","_","_"
7,"_","_","_","punar","CAD","","_","_"
1,"kaṃde","_","_","kanda","NC","","_","_"
2,"kṣiptvā","_","_","kṣip","CGDA","","_","_"
3,"_","_","_","pac","V","pac","_","_"
4,"_","_","_","tadvat","CX","","_","_"
5,"_","_","_","tatas","CX","","_","_"
6,"mardyaṃ","_","_","mṛd","KDG","","_","_"
7,"ca","_","_","ca","CCD","","_","_"
8,"pūrvavat","_","_","pūrvavat","CX","","_","_"
1,"_","_","_","kṣīrakanda","NC","","_","_"
2,"_","_","_","udara","NC","","_","_"
3,"ruddhvā","_","_","rudh","CGDA","","_","_"
4,"mṛdā","_","_","mṛd","NC","","_","_"
5,"liptaṃ","_","_","lip","PPP","","_","_"
6,"ca","_","_","ca","CCD","","_","_"
7,"śoṣayet","_","_","śuṣ","V","śuṣ","_","_"
1,"_","_","_","samyak","CX","","_","_"
2,"_","_","_","gajapuṭa","NC","","_","_"
3,"pacyāt","_","_","pac","V","pac","_","_"
4,"mṛto","_","_","mṛ","PPP","","_","_"
5,"bhavati","_","_","bhav","V","bhū","_","_"
6,"niścitam","_","_","niścita","CX","","_","_"
1,"_","_","_","haṃsapādī","NC","","_","_"
2,"_","_","_","kṣīrakanda","NC","","_","_"
3,"_","_","_","drava","NC","","_","_"
4,"_","_","_","mṛd","KDG","","_","_"
5,"_","_","_","dina","NC","","_","_"
6,"_","_","_","traya","NC","","_","_"
1,"rasaṃ","_","_","rasa","NC","","_","_"
2,"_","_","_","tad","PRD","","_","_"
3,"_","_","_","krauñcapāda","NC","","_","_"
4,"_","_","_","antar","CAD","","_","_"
5,"kṣiptvā","_","_","kṣip","CGDA","","_","_"
6,"pādaṃ","_","_","pāda","NC","","_","_"
7,"mṛdā","_","_","mṛd","NC","","_","_"
8,"lipet","_","_","lip","V","lip","_","_"
1,"_","_","_","karīṣa","NC","","_","_"
2,"_","_","_","agni","NC","","_","_"
3,"dinaṃ","_","_","dina","NC","","_","_"
4,"_","_","_","pac","V","pac","_","_"
5,"_","_","_","mṛd","V","mṛd","_","_"
6,"_","_","_","pūrva","PPX","","_","_"
7,"_","_","_","drava","NC","","_","_"
8,"_","_","_","tri","NUM","","_","_"
9,"_","_","_","aha","NC","","_","_"
1,"dinaṃ","_","_","dina","NC","","_","_"
2,"_","_","_","tadvat","CX","","_","_"
3,"_","_","_","puṭa","NC","","_","_"
4,"_","_","_","pac","V","pac","_","_"
5,"_","_","_","punar","CAD","","_","_"
6,"_","_","_","mṛd","KDG","","_","_"
7,"ca","_","_","ca","CCD","","_","_"
8,"pācayet","_","_","pāc","V","pācay","_","_"
1,"jāyate","_","_","jan","V","jan","_","_"
2,"_","_","_","bhasman","NC","","_","_"
3,"_","_","_","sūta","NC","","_","_"
4,"_","_","_","ida","PRD","","_","_"
5,"_","_","_","sarva","JQ","","_","_"
6,"_","_","_","kārya","NC","","_","_"
7,"_","_","_","kara","JJ","","_","_"
8,"_","_","_","kṣama","JJ","","_","_"
1,"uktānāṃ","_","_","vac","PPP","","_","_"
2,"_","_","_","khoṭa","NC","","_","_"
3,"_","_","_","bandh","PPP","","_","_"
4,"mukhaṃ","_","_","mukha","NC","","_","_"
5,"_","_","_","kar","V","kṛ","_","_"
6,"_","_","_","tad","PRD","","_","_"
7,"_","_","_","vak","V","vac","_","_"
1,"vacā","_","_","vacā","NC","","_","_"
2,"_","_","_","caṇḍālinī","NC","","_","_"
3,"_","_","_","kanda","NC","","_","_"
4,"_","_","_","brahmadaṇḍīya","JJ","","_","_"
5,"_","_","_","mūlaka","NC","","_","_"
1,"gaṃdhakaṃ","_","_","gandhaka","NC","","_","_"
2,"ṭaṃkaṇaṃ","_","_","ṭaṅkaṇa","NC","","_","_"
3,"tulyaṃ","_","_","tulya","JJ","","_","_"
4,"_","_","_","bhānu","NC","","_","_"
5,"_","_","_","dugdha","NC","","_","_"
6,"peṣayet","_","_","piṣ","V","piṣ","_","_"
1,"_","_","_","caṇa","NC","","_","_"
2,"_","_","_","mātra","NC","","_","_"
3,"vaṭīṃ","_","_","vaṭī","NC","","_","_"
4,"kṛtvā","_","_","kṛ","CGDA","","_","_"
5,"_","_","_","pūrva","PPX","","_","_"
6,"_","_","_","sūta","NC","","_","_"
7,"drute","_","_","dru","PPP","","_","_"
8,"kṣipet","_","_","kṣip","V","kṣip","_","_"
1,"ekām","_","_","eka","PPX","","_","_"
2,"ekāṃ","_","_","eka","PPX","","_","_"
3,"_","_","_","dha","KDP","","_","_"
4,"_","_","_","eva","CEM","","_","_"
5,"_","_","_","vaṭikā","NC","","_","_"
6,"_","_","_","saptaka","NC","","_","_"
7,"kramāt","_","_","kramāt","CX","","_","_"
1,"grasate","_","_","gras","V","gras","_","_"
2,"_","_","_","sarva","JQ","","_","_"
3,"_","_","_","loha","NC","","_","_"
4,"_","_","_","yathā","CCM","","_","_"
5,"_","_","_","iṣ","PPP","","_","_"
6,"na","_","_","na","CNG","","_","_"
7,"saṃśayaḥ","_","_","saṃśaya","NC","","_","_"
1,"grāso","_","_","grāsa","NC","","_","_"
2,"deyo","_","_","dā","KDG","","_","_"
3,"yathāśaktyā","_","_","yathāśaktyā","CX","","_","_"
4,"_","_","_","pūrvavat","CX","","_","_"
5,"_","_","_","māray","V","māray","_","_"
6,"_","_","_","punar","CAD","","_","_"
1,"mukhaṃ","_","_","mukha","NC","","_","_"
2,"baddhvā","_","_","bandh","CGDA","","_","_"
3,"niyuñjīta","_","_","niyuj","V","niyuj","_","_"
4,"tāre","_","_","tāra","NC","","_","_"
5,"tāmre","_","_","tāmra","NC","","_","_"
6,"bhujaṃgame","_","_","bhujaṃgama","NC","","_","_"
1,"_","_","_","tad","PRD","","_","_"
2,"_","_","_","sarva","JQ","","_","_"
3,"jāyate","_","_","jan","V","jan","_","_"
4,"svarṇaṃ","_","_","svarṇa","NC","","_","_"
5,"vedho","_","_","vedha","NC","","_","_"
6,"daśaguṇo","_","_","daśaguṇa","JJ","","_","_"
7,"mataḥ","_","_","man","PPP","","_","_"
1,"_","_","_","siddha","NC","","_","_"
2,"_","_","_","yoga","NC","","_","_"
3,"samākhyātaḥ","_","_","samākhyā","PPP","","_","_"
4,"_","_","_","samyak","CX","","_","_"
5,"_","_","_","dṛś","CGDA","","_","_"
6,"_","_","_","guru","NC","","_","_"
7,"_","_","_","mukha","NC","","_","_"
1,"_","_","_","sūta","NC","","_","_"
2,"_","_","_","abhra","NC","","_","_"
3,"gaṃdhakaṃ","_","_","gandhaka","NC","","_","_"
4,"śuddhaṃ","_","_","śudh","PPP","","_","_"
1,"_","_","_","tad","PRD","","_","_"
2,"_","_","_","sarva","JQ","","_","_"
3,"_","_","_","mātuluṅga","NC","","_","_"
4,"_","_","_","amla","NC","","_","_"
5,"dinam","_","_","dina","NC","","_","_"
6,"ekaṃ","_","_","eka","PPX","","_","_"
7,"samaṃ","_","_","sama","PPX","","_","_"
8,"samam","_","_","sama","PPX","","_","_"
1,"śuddhāni","_","_","śudh","PPP","","_","_"
2,"_","_","_","tāmra","NC","","_","_"
3,"_","_","_","pattra","NC","","_","_"
4,"tena","_","_","tad","PRD","","_","_"
5,"kalkena","_","_","kalka","NC","","_","_"
6,"lepayet","_","_","lepay","V","lepay","_","_"
1,"ruddhvā","_","_","rudh","CGDA","","_","_"
2,"gajapuṭe","_","_","gajapuṭa","NC","","_","_"
3,"_","_","_","pac","V","pac","_","_"
4,"_","_","_","punar","CAD","","_","_"
5,"_","_","_","utthāpay","CGDA","","_","_"
6,"lepayet","_","_","lepay","V","lepay","_","_"
1,"evaṃ","_","_","eva","CX","","_","_"
2,"_","_","_","puṭa","NC","","_","_"
3,"_","_","_","traya","NC","","_","_"
4,"pakvaṃ","_","_","pakva","JJ","","_","_"
5,"_","_","_","tad","PRD","","_","_"
6,"_","_","_","tāmra","NC","","_","_"
7,"kāṃcanaṃ","_","_","kāñcana","NC","","_","_"
8,"bhavet","_","_","bhav","V","bhū","_","_"
1,"_","_","_","rakta","JJ","","_","_"
2,"_","_","_","snuhī","NC","","_","_"
3,"_","_","_","payas","NC","","_","_"
4,"_","_","_","ca","CCD","","_","_"
5,"_","_","_","tāmra","NC","","_","_"
6,"_","_","_","pattra","NC","","_","_"
7,"lepayet","_","_","lepay","V","lepay","_","_"
1,"_","_","_","kāray","V","kāray","_","_"
2,"_","_","_","agni","NC","","_","_"
3,"_","_","_","tap","PPP","","_","_"
4,"tasmin","_","_","tad","PRD","","_","_"
5,"kṣīre","_","_","kṣīra","NC","","_","_"
6,"niṣecayet","_","_","niṣecay","V","niṣecay","_","_"
1,"_","_","_","iti","CQT","","_","_"
2,"_","_","_","eva","CX","","_","_"
3,"saptadhā","_","_","saptadhā","CX","","_","_"
4,"_","_","_","kar","V","kṛ","_","_"
5,"_","_","_","lepa","NC","","_","_"
6,"_","_","_","tāpa","NC","","_","_"
7,"_","_","_","niṣecana","NC","","_","_"
1,"samāvartya","_","_","samāvartay","CGDA","","_","_"
2,"tu","_","_","tu","CCD","","_","_"
3,"_","_","_","tad","PRD","","_","_"
4,"_","_","_","tāmra","NC","","_","_"
5,"divyaṃ","_","_","divya","JJ","","_","_"
6,"bhavati","_","_","bhav","V","bhū","_","_"
7,"kāṃcanam","_","_","kāñcana","NC","","_","_"
1,"rasakaṃ","_","_","rasaka","NC","","_","_"
2,"daradaṃ","_","_","darada","NC","","_","_"
3,"gaṃdhaṃ","_","_","gandha","NC","","_","_"
4,"gaganaṃ","_","_","gagana","NC","","_","_"
5,"kunaṭī","_","_","kunaṭī","NC","","_","_"
6,"samam","_","_","sama","PPX","","_","_"
1,"_","_","_","ārakta","JJ","","_","_"
2,"_","_","_","snuh","NC","","_","_"
3,"_","_","_","payas","NC","","_","_"
4,"_","_","_","tad","PRD","","_","_"
5,"_","_","_","marday","V","marday","_","_"
6,"_","_","_","divasa","NC","","_","_"
7,"_","_","_","traya","NC","","_","_"
1,"tena","_","_","tad","PRD","","_","_"
2,"vedhyaṃ","_","_","vedhay","KDG","","_","_"
3,"drutaṃ","_","_","dru","PPP","","_","_"
4,"tāmraṃ","_","_","tāmra","NC","","_","_"
5,"nāgaṃ","_","_","nāga","NC","","_","_"
6,"vā","_","_","vā","CCD","","_","_"
7,"_","_","_","tāra","NC","","_","_"
8,"_","_","_","eva","CEM","","_","_"
9,"vā","_","_","vā","CCD","","_","_"
1,"_","_","_","sahasra","NUM","","_","_"
2,"_","_","_","aṃśa","NC","","_","_"
3,"_","_","_","tad","PRD","","_","_"
4,"_","_","_","divya","JJ","","_","_"
5,"suvarṇaṃ","_","_","suvarṇa","NC","","_","_"
6,"jāyate","_","_","jan","V","jan","_","_"
7,"dhruvam","_","_","dhruva","CX","","_","_"
1,"_","_","_","rakta","JJ","","_","_"
2,"_","_","_","snuhī","NC","","_","_"
3,"_","_","_","bhava","NC","","_","_"
4,"kṣīrai","_","_","kṣīra","NC","","_","_"
5,"rajanīṃ","_","_","rajanī","NC","","_","_"
6,"mardayet","_","_","marday","V","marday","_","_"
7,"_","_","_","tri","NUM","","_","_"
8,"_","_","_","aha","NC","","_","_"
1,"tena","_","_","tad","PRD","","_","_"
2,"nāgasya","_","_","nāga","NC","","_","_"
3,"patrāṇi","_","_","pattra","NC","","_","_"
4,"praliptāni","_","_","pralip","PPP","","_","_"
5,"puṭe","_","_","puṭa","NC","","_","_"
6,"pacet","_","_","pac","V","pac","_","_"
1,"_","_","_","punar","CAD","","_","_"
2,"_","_","_","lepay","KDG","","_","_"
3,"punaḥ","_","_","punar","CAD","","_","_"
4,"pācyaṃ","_","_","pac","KDG","","_","_"
5,"saptadhā","_","_","saptadhā","CX","","_","_"
6,"kāṃcanaṃ","_","_","kāñcana","NC","","_","_"
7,"bhavet","_","_","bhav","V","bhū","_","_"
1,"_","_","_","padminī","NC","","_","_"
2,"_","_","_","pattra","NC","","_","_"
3,"_","_","_","puṣpa","NC","","_","_"
4,"_","_","_","ābha","JJ","","_","_"
5,"vijñeyā","_","_","vijñā","KDG","","_","_"
6,"sthalapadminī","_","_","sthalapadminī","NC","","_","_"
1,"bhaṅge","_","_","bhaṅga","NC","","_","_"
2,"raktaṃ","_","_","rakta","JJ","","_","_"
3,"_","_","_","srav","V","sru","_","_"
4,"_","_","_","kṣīra","NC","","_","_"
5,"jñātvā","_","_","jñā","CGDA","","_","_"
6,"_","_","_","tad","PRD","","_","_"
7,"_","_","_","uddhar","V","uddhṛ","_","_"
8,"_","_","_","tatas","CX","","_","_"
1,"pāradaṃ","_","_","pārada","NC","","_","_"
2,"gaṃdhakaṃ","_","_","gandhaka","NC","","_","_"
3,"tālaṃ","_","_","tāla","NC","","_","_"
4,"māhiṣī","_","_","māhiṣa","JJ","","_","_"
5,"kunaṭī","_","_","kunaṭī","NC","","_","_"
6,"samam","_","_","sama","PPX","","_","_"
1,"_","_","_","pūrva","PPX","","_","_"
2,"_","_","_","vac","PPP","","_","_"
3,"_","_","_","padminī","NC","","_","_"
4,"_","_","_","yuj","PPP","","_","_"
5,"_","_","_","marday","V","marday","_","_"
6,"_","_","_","dina","NC","","_","_"
7,"_","_","_","saptaka","NC","","_","_"
1,"tena","_","_","tad","PRD","","_","_"
2,"śulbaṃ","_","_","śulba","NC","","_","_"
3,"_","_","_","bhav","V","bhū","_","_"
4,"_","_","_","svarṇa","NC","","_","_"
5,"_","_","_","sahasra","NUM","","_","_"
6,"_","_","_","aṃśa","NC","","_","_"
7,"vedhitam","_","_","vedhay","PPP","","_","_"
1,"nāgaṃ","_","_","nāga","NC","","_","_"
2,"baṃgaṃ","_","_","vaṅga","NC","","_","_"
3,"tīkṣṇasāraṃ","_","_","tīkṣṇasāra","NC","","_","_"
4,"tāraṃ","_","_","tāra","NC","","_","_"
5,"ca","_","_","ca","CCD","","_","_"
6,"kramaśa","_","_","kramaśas","CX","","_","_"
7,"uttaram","_","_","uttara","JJ","","_","_"
1,"pañcānāṃ","_","_","pañcan","NUM","","_","_"
2,"tu","_","_","tu","CCD","","_","_"
3,"samaṃ","_","_","sama","PPX","","_","_"
4,"tāmraṃ","_","_","tāmra","NC","","_","_"
5,"sarvaṃ","_","_","sarva","JQ","","_","_"
6,"_","_","_","mūṣā","NC","","_","_"
7,"_","_","_","ga","PPP","","_","_"
8,"dhamet","_","_","dham","V","dha","_","_"
1,"prakaṭaṃ","_","_","prakaṭa","JJ","","_","_"
2,"vaṃkanālena","_","_","vaṅkanāla","NC","","_","_"
3,"_","_","_","yāvat","CX","","_","_"
4,"_","_","_","tāra","NC","","_","_"
5,"_","_","_","avaśeṣay","PPP","","_","_"
1,"_","_","_","tad","PRD","","_","_"
2,"_","_","_","tāra","NC","","_","_"
3,"_","_","_","padmarāga","NC","","_","_"
4,"_","_","_","ābha","JJ","","_","_"
5,"jāyate","_","_","jan","V","jan","_","_"
6,"_","_","_","drāvay","V","drāvay","_","_"
7,"_","_","_","punar","CAD","","_","_"
1,"vedhyaṃ","_","_","vedhay","KDG","","_","_"
2,"_","_","_","rasaka","NC","","_","_"
3,"_","_","_","sattva","NC","","_","_"
4,"_","_","_","pañcama","JJ","","_","_"
5,"_","_","_","aṃśa","NC","","_","_"
6,"yatnataḥ","_","_","yatna","NC","","_","_"
1,"tad","_","_","tad","PRD","","_","_"
2,"_","_","_","bhav","V","bhū","_","_"
3,"_","_","_","kāñcana","NC","","_","_"
4,"divyaṃ","_","_","divya","JJ","","_","_"
5,"_","_","_","siddha","NC","","_","_"
6,"_","_","_","yoga","NC","","_","_"
7,"udāhṛtaḥ","_","_","udāhṛ","PPP","","_","_"
1,"_","_","_","rakta","JJ","","_","_"
2,"_","_","_","citraka","NC","","_","_"
3,"_","_","_","pañcāṅga","NC","","_","_"
4,"chāyāśuṣkaṃ","_","_","chāyāśuṣka","JJ","","_","_"
5,"vicūrṇayet","_","_","vicūrṇay","V","vicūrṇay","_","_"
1,"_","_","_","tad","PRD","","_","_"
2,"_","_","_","vāpa","NC","","_","_"
3,"_","_","_","dru","PPP","","_","_"
4,"_","_","_","vaṅga","NC","","_","_"
5,"ruddhvā","_","_","rudh","CGDA","","_","_"
6,"ruddhvā","_","_","rudh","CGDA","","_","_"
7,"_","_","_","tri","NUM","","_","_"
8,"_","_","_","vāraka","NC","","_","_"
1,"deyaṃ","_","_","dā","KDG","","_","_"
2,"_","_","_","tad","PRD","","_","_"
3,"_","_","_","jan","V","jan","_","_"
4,"tāraṃ","_","_","tāra","NC","","_","_"
5,"_","_","_","śaṅkha","NC","","_","_"
6,"_","_","_","kunda","NC","","_","_"
7,"_","_","_","indu","NC","","_","_"
8,"_","_","_","saṃnibha","JJ","","_","_"
1,"_","_","_","rakta","JJ","","_","_"
2,"_","_","_","citraka","NC","","_","_"
3,"_","_","_","mūla","NC","","_","_"
4,"tu","_","_","tu","CCD","","_","_"
5,"kāṃjikaṃ","_","_","kāñjika","NC","","_","_"
6,"_","_","_","śudh","PPP","","_","_"
7,"_","_","_","pārada","NC","","_","_"
1,"_","_","_","kaṅguṇī","NC","","_","_"
2,"_","_","_","taila","NC","","_","_"
3,"_","_","_","saṃyuj","PPP","","_","_"
4,"sarvaṃ","_","_","sarva","JQ","","_","_"
5,"kalkaṃ","_","_","kalka","NC","","_","_"
6,"pralepayet","_","_","pralepay","V","pralepay","_","_"
1,"_","_","_","tāmra","NC","","_","_"
2,"_","_","_","pattra","NC","","_","_"
3,"taptāni","_","_","tap","PPP","","_","_"
4,"tasmin","_","_","tad","PRD","","_","_"
5,"_","_","_","sic","V","sic","_","_"
6,"_","_","_","tri","NUM","","_","_"
7,"_","_","_","saptadhā","CX","","_","_"
1,"_","_","_","tad","PRD","","_","_"
2,"_","_","_","tāmra","NC","","_","_"
3,"_","_","_","dvi","NUM","","_","_"
4,"_","_","_","ṣaṣ","NUM","","_","_"
5,"_","_","_","bhāga","NC","","_","_"
6,"tāraṃ","_","_","tāra","NC","","_","_"
7,"_","_","_","ṣoḍaśan","JJ","","_","_"
8,"_","_","_","bhāgaka","NC","","_","_"
1,"ekīkṛtya","_","_","ekīkṛ","CGDA","","_","_"
2,"samāvartya","_","_","samāvartay","CGDA","","_","_"
3,"tena","_","_","tad","PRD","","_","_"
4,"patrāṇi","_","_","pattra","NC","","_","_"
5,"kārayet","_","_","kar","V","kṛ","_","_"
1,"_","_","_","rakta","JJ","","_","_"
2,"_","_","_","citraka","NC","","_","_"
3,"_","_","_","mūla","NC","","_","_"
4,"_","_","_","bhallāta","NC","","_","_"
5,"_","_","_","taila","NC","","_","_"
6,"_","_","_","peṣay","PPP","","_","_"
1,"anena","_","_","ida","PRD","","_","_"
2,"_","_","_","pūrva","PPX","","_","_"
3,"_","_","_","pattra","NC","","_","_"
4,"praliptāni","_","_","pralip","PPP","","_","_"
5,"puṭe","_","_","puṭa","NC","","_","_"
6,"pacet","_","_","pac","V","pac","_","_"
1,"evaṃ","_","_","eva","CX","","_","_"
2,"_","_","_","tri","NUM","","_","_"
3,"_","_","_","saptadhā","CX","","_","_"
4,"kuryād","_","_","kar","V","kṛ","_","_"
5,"divyaṃ","_","_","divya","JJ","","_","_"
6,"bhavati","_","_","bhav","V","bhū","_","_"
7,"kāñcanam","_","_","kāñcana","NC","","_","_"
1,"_","_","_","nāginī","NC","","_","_"
2,"_","_","_","kanda","NC","","_","_"
3,"_","_","_","sūtendra","NC","","_","_"
4,"_","_","_","rakta","JJ","","_","_"
5,"_","_","_","citraka","NC","","_","_"
6,"_","_","_","mūlaka","NC","","_","_"
1,"piṣṭvā","_","_","piṣ","CGDA","","_","_"
2,"_","_","_","tad","PRD","","_","_"
3,"_","_","_","eva","CEM","","_","_"
4,"patrāṇi","_","_","pattra","NC","","_","_"
5,"_","_","_","pūrva","PPX","","_","_"
6,"_","_","_","vac","PPP","","_","_"
7,"pralepayet","_","_","pralepay","V","pralepay","_","_"
1,"_","_","_","tadvat","CX","","_","_"
2,"_","_","_","pac","V","pac","_","_"
3,"_","_","_","puṭa","NC","","_","_"
4,"_","_","_","eva","CX","","_","_"
5,"divyaṃ","_","_","divya","JJ","","_","_"
6,"bhavati","_","_","bhav","V","bhū","_","_"
7,"kāṃcanam","_","_","kāñcana","NC","","_","_"
1,"_","_","_","jyotiṣmatī","NC","","_","_"
2,"_","_","_","bhava","NC","","_","_"
3,"_","_","_","taila","NC","","_","_"
4,"_","_","_","tāmra","NC","","_","_"
5,"_","_","_","kumbha","NC","","_","_"
6,"prapūrayet","_","_","prapṛ","V","prapṛ","_","_"
1,"mukhaṃ","_","_","mukha","NC","","_","_"
2,"ruddhvā","_","_","rudh","CGDA","","_","_"
3,"_","_","_","kṣip","V","kṣip","_","_"
4,"_","_","_","bhūmi","NC","","_","_"
5,"pṛṣṭhe","_","_","pṛṣṭha","NC","","_","_"
6,"_","_","_","tuṣa","NC","","_","_"
7,"_","_","_","puṭa","NC","","_","_"
8,"sadā","_","_","sadā","CAD","","_","_"
1,"evaṃ","_","_","eva","CX","","_","_"
2,"_","_","_","ṣaṣ","NUM","","_","_"
3,"_","_","_","māsa","NC","","_","_"
4,"_","_","_","paryanta","NC","","_","_"
5,"_","_","_","puṭay","V","puṭay","_","_"
6,"_","_","_","uddhar","V","uddhṛ","_","_"
7,"kramāt","_","_","kramāt","CX","","_","_"
1,"_","_","_","bahis","CX","","_","_"
2,"_","_","_","tuṣa","NC","","_","_"
3,"_","_","_","puṭa","NC","","_","_"
4,"_","_","_","pac","V","pac","_","_"
5,"_","_","_","tri","NUM","","_","_"
6,"_","_","_","dina","NC","","_","_"
7,"_","_","_","tad","PRD","","_","_"
8,"_","_","_","diva","NC","","_","_"
9,"_","_","_","niśa","NC","","_","_"
1,"_","_","_","tad","PRD","","_","_"
2,"_","_","_","tāmra","NC","","_","_"
3,"hāṭakaṃ","_","_","hāṭaka","NC","","_","_"
4,"tulyaṃ","_","_","tulya","JJ","","_","_"
5,"samāvartaṃ","_","_","samāvarta","NC","","_","_"
6,"tu","_","_","tu","CCD","","_","_"
7,"kārayet","_","_","kar","V","kṛ","_","_"
1,"kṣipte","_","_","kṣip","PPP","","_","_"
2,"_","_","_","jyotiṣmatī","NC","","_","_"
3,"_","_","_","taila","NC","","_","_"
4,"sarvaṃ","_","_","sarva","JQ","","_","_"
5,"bhavati","_","_","bhav","V","bhū","_","_"
6,"kāṃcanam","_","_","kāñcana","NC","","_","_"
1,"_","_","_","kṣīrakanda","NC","","_","_"
2,"_","_","_","bhava","NC","","_","_"
3,"kṣīre","_","_","kṣīra","NC","","_","_"
4,"taptaṃ","_","_","tap","PPP","","_","_"
5,"tāmraṃ","_","_","tāmra","NC","","_","_"
6,"niṣecayet","_","_","niṣecay","V","niṣecay","_","_"
1,"_","_","_","śata","NUM","","_","_"
2,"_","_","_","vāra","NC","","_","_"
3,"prayatnena","_","_","prayatna","NC","","_","_"
4,"_","_","_","tad","PRD","","_","_"
5,"_","_","_","tāmra","NC","","_","_"
6,"kāṃcanaṃ","_","_","kāñcana","NC","","_","_"
7,"bhavet","_","_","bhav","V","bhū","_","_"
1,"gaṃdhakaṃ","_","_","gandhaka","NC","","_","_"
2,"rasakaṃ","_","_","rasaka","NC","","_","_"
3,"tāpyaṃ","_","_","tāpya","NC","","_","_"
4,"pāradaṃ","_","_","pārada","NC","","_","_"
5,"raktacandanam","_","_","raktacandana","NC","","_","_"
1,"mardyaṃ","_","_","mṛd","KDG","","_","_"
2,"_","_","_","rudantikā","NC","","_","_"
3,"_","_","_","drāva","NC","","_","_"
4,"_","_","_","avicchinna","JJ","","_","_"
5,"_","_","_","dina","NC","","_","_"
6,"_","_","_","traya","NC","","_","_"
1,"tena","_","_","tad","PRD","","_","_"
2,"tārasya","_","_","tāra","NC","","_","_"
3,"patrāṇi","_","_","pattra","NC","","_","_"
4,"liptvā","_","_","lip","CGDA","","_","_"
5,"ruddhvā","_","_","rudh","CGDA","","_","_"
6,"puṭe","_","_","puṭa","NC","","_","_"
7,"pacet","_","_","pac","V","pac","_","_"
1,"_","_","_","iti","CQT","","_","_"
2,"_","_","_","eva","CX","","_","_"
3,"saptadhā","_","_","saptadhā","CX","","_","_"
4,"kuryāt","_","_","kar","V","kṛ","_","_"
5,"divyaṃ","_","_","divya","JJ","","_","_"
6,"bhavati","_","_","bhav","V","bhū","_","_"
7,"kāṃcanam","_","_","kāñcana","NC","","_","_"
1,"kṛṣṇāyā","_","_","kṛṣṇa","JJ","","_","_"
2,"_","_","_","vā","CCD","","_","_"
3,"_","_","_","atha","CAD","","_","_"
4,"pītāyā","_","_","pīta","JJ","","_","_"
5,"devadālyā","_","_","devadālī","NC","","_","_"
6,"_","_","_","phala","NC","","_","_"
7,"_","_","_","drava","NC","","_","_"
1,"_","_","_","viṣṇukrāntā","NC","","_","_"
2,"_","_","_","drava","NC","","_","_"
3,"tulyaṃ","_","_","tulya","JJ","","_","_"
4,"kṛtvā","_","_","kṛ","CGDA","","_","_"
5,"_","_","_","tad","PRD","","_","_"
6,"_","_","_","eva","CEM","","_","_"
7,"mardayet","_","_","marday","V","marday","_","_"
1,"_","_","_","saptan","NUM","","_","_"
2,"_","_","_","aha","NC","","_","_"
3,"pāradaṃ","_","_","pārada","NC","","_","_"
4,"śuddhaṃ","_","_","śudh","PPP","","_","_"
5,"_","_","_","tatas","CX","","_","_"
6,"_","_","_","tāmra","NC","","_","_"
7,"pralepayet","_","_","pralepay","V","pralepay","_","_"
1,"ruddhvā","_","_","rudh","CGDA","","_","_"
2,"gajapuṭe","_","_","gajapuṭa","NC","","_","_"
3,"_","_","_","pac","V","pac","_","_"
4,"_","_","_","tatas","CX","","_","_"
5,"_","_","_","tīvra","JJ","","_","_"
6,"_","_","_","agni","NC","","_","_"
7,"dhamet","_","_","dham","V","dha","_","_"
1,"_","_","_","daśan","NUM","","_","_"
2,"_","_","_","aṃśa","NC","","_","_"
3,"_","_","_","tad","PRD","","_","_"
4,"_","_","_","rasa","NC","","_","_"
5,"kṣiptvā","_","_","kṣip","CGDA","","_","_"
6,"divyaṃ","_","_","divya","JJ","","_","_"
7,"bhavati","_","_","bhav","V","bhū","_","_"
8,"kāṃcanam","_","_","kāñcana","NC","","_","_"
1,"_","_","_","vasubhaṭṭa","NC","","_","_"
2,"_","_","_","rasa","NC","","_","_"
3,"_","_","_","atha","CAD","","_","_"
4,"tridhā","_","_","tridhā","CX","","_","_"
5,"siñcet","_","_","sic","V","sic","_","_"
6,"_","_","_","su","CAD","","_","_"
7,"_","_","_","tāpay","PPP","","_","_"
1,"_","_","_","loṇa","NC","","_","_"
2,"_","_","_","vat","CX","","_","_"
3,"_","_","_","sphuṭ","PPP","","_","_"
4,"_","_","_","dhātu","NC","","_","_"
5,"_","_","_","mṛdu","JJ","","_","_"
6,"syāt","_","_","as","V","as","_","_"
7,"sikthako","_","_","sikthaka","NC","","_","_"
8,"yathā","_","_","yathā","CCM","","_","_"
1,"devadālyā","_","_","devadālī","NC","","_","_"
2,"phalaṃ","_","_","phala","NC","","_","_"
3,"mūlam","_","_","mūla","NC","","_","_"
4,"_","_","_","īśvarā","NC","","_","_"
5,"_","_","_","phala","NC","","_","_"
6,"_","_","_","ja","JJ","","_","_"
7,"_","_","_","drava","NC","","_","_"
1,"piṣṭvā","_","_","piṣ","CGDA","","_","_"
2,"_","_","_","tad","PRD","","_","_"
3,"_","_","_","kalka","NC","","_","_"
4,"_","_","_","vāpa","NC","","_","_"
5,"drutaṃ","_","_","dru","PPP","","_","_"
6,"baṃgaṃ","_","_","vaṅga","NC","","_","_"
7,"dṛḍhaṃ","_","_","dṛḍha","JJ","","_","_"
8,"bhavet","_","_","bhav","V","bhū","_","_"
1,"bhūyo","_","_","bhūyas","CX","","_","_"
2,"bhūyas","_","_","bhūyas","CX","","_","_"
3,"_","_","_","tu","CCD","","_","_"
4,"_","_","_","ida","PRD","","_","_"
5,"_","_","_","vāpay","KDG","","_","_"
6,"_","_","_","tāra","NC","","_","_"
7,"bhavati","_","_","bhav","V","bhū","_","_"
8,"śobhanam","_","_","śobhana","JJ","","_","_"
1,"_","_","_","kṛṣṇa","NC","","_","_"
2,"_","_","_","pakṣa","NC","","_","_"
3,"_","_","_","caturdaśī","NC","","_","_"
4,"_","_","_","aṣṭamī","NC","","_","_"
5,"_","_","_","grahaṇa","NC","","_","_"
6,"_","_","_","athavā","CX","","_","_"
1,"_","_","_","nṛ","NC","","_","_"
2,"_","_","_","kapāla","NC","","_","_"
3,"_","_","_","śveta","JJ","","_","_"
4,"_","_","_","guñjā","NC","","_","_"
5,"_","_","_","vāpay","V","vāpay","_","_"
6,"_","_","_","śuddha","JJ","","_","_"
7,"_","_","_","bhūmi","NC","","_","_"
1,"_","_","_","secay","V","secay","_","_"
2,"_","_","_","salila","NC","","_","_"
3,"nityaṃ","_","_","nitya","CX","","_","_"
4,"_","_","_","yāvat","CX","","_","_"
5,"_","_","_","phalavat","JJ","","_","_"
6,"bhavet","_","_","bhav","V","bhū","_","_"
1,"_","_","_","mantra","NC","","_","_"
2,"_","_","_","pūjā","NC","","_","_"
3,"tataḥ","_","_","tatas","CX","","_","_"
4,"kṛtvā","_","_","kṛ","CGDA","","_","_"
5,"puṣye","_","_","puṣya","NC","","_","_"
6,"grāhya","_","_","grāhay","CGDA","","_","_"
7,"phalāni","_","_","phala","NC","","_","_"
8,"vai","_","_","vai","CX","","_","_"
1,"_","_","_","śudh","PPP","","_","_"
2,"_","_","_","tāmra","NC","","_","_"
3,"_","_","_","pala","NC","","_","_"
4,"śvetaṃ","_","_","śveta","JJ","","_","_"
5,"_","_","_","viṃśati","NC","","_","_"
6,"_","_","_","uttaraka","JJ","","_","_"
7,"śatam","_","_","śata","NUM","","_","_"
1,"ekaikaṃ","_","_","ekaika","PRC","","_","_"
2,"_","_","_","pūrva","PPX","","_","_"
3,"_","_","_","bīja","NC","","_","_"
4,"_","_","_","samyak","CX","","_","_"
5,"_","_","_","rudh","CGDA","","_","_"
6,"dhamed","_","_","dham","V","dha","_","_"
7,"dṛḍham","_","_","dṛḍha","CX","","_","_"
1,"_","_","_","tad","PRD","","_","_"
2,"_","_","_","tāmra","NC","","_","_"
3,"jāyate","_","_","jan","V","jan","_","_"
4,"tāraṃ","_","_","tāra","NC","","_","_"
5,"_","_","_","śaṅkha","NC","","_","_"
6,"_","_","_","kunda","NC","","_","_"
7,"_","_","_","indu","NC","","_","_"
8,"_","_","_","saṃnibha","JJ","","_","_"
1,"tāraṃ","_","_","tāra","NC","","_","_"
2,"_","_","_","tad","PRD","","_","_"
3,"_","_","_","jan","V","jan","_","_"
4,"svarṇaṃ","_","_","svarṇa","NC","","_","_"
5,"_","_","_","su","CAD","","_","_"
6,"_","_","_","śudh","PPP","","_","_"
7,"_","_","_","bandh","PPP","","_","_"
8,"_","_","_","rītikā","NC","","_","_"
1,"bhūnāgānāṃ","_","_","bhūnāga","NC","","_","_"
2,"_","_","_","rasa","NC","","_","_"
3,"_","_","_","mṛd","KDG","","_","_"
4,"śuddhaṃ","_","_","śudh","PPP","","_","_"
5,"tālaṃ","_","_","tāla","NC","","_","_"
6,"_","_","_","dina","NC","","_","_"
7,"_","_","_","avadhi","CX","","_","_"
1,"_","_","_","tad","PRD","","_","_"
2,"_","_","_","piṇḍa","NC","","_","_"
3,"_","_","_","haṇḍikā","NC","","_","_"
4,"_","_","_","madhye","CX","","_","_"
5,"_","_","_","tālaka","NC","","_","_"
6,"_","_","_","aṃśa","NC","","_","_"
7,"nirodhayet","_","_","nirrudh","V","nirrudh","_","_"
1,"_","_","_","tāmra","NC","","_","_"
2,"_","_","_","pattra","NC","","_","_"
3,"_","_","_","tad","PRD","","_","_"
4,"_","_","_","paścāt","CAD","","_","_"
5,"ḍhaṅkaṇena","_","_","ḍhaṅkaṇī","NC","","_","_"
6,"nirudhya","_","_","nirudh","CGDA","","_","_"
7,"ca","_","_","ca","CCD","","_","_"
1,"haṃḍikā","_","_","haṇḍikā","NC","","_","_"
2,"bhasmanā","_","_","bhasman","NC","","_","_"
3,"pūryā","_","_","pūray","KDG","","_","_"
4,"ruddhvā","_","_","rudh","CGDA","","_","_"
5,"_","_","_","caṇḍa","JJ","","_","_"
6,"_","_","_","agni","NC","","_","_"
7,"pacet","_","_","pac","V","pac","_","_"
1,"_","_","_","pañcan","NUM","","_","_"
2,"_","_","_","yāma","NC","","_","_"
3,"_","_","_","samuddhṛ","CGDA","","_","_"
4,"_","_","_","niṣka","NC","","_","_"
5,"_","_","_","ṭaṅkaṇa","NC","","_","_"
6,"_","_","_","saṃyuta","JJ","","_","_"
1,"_","_","_","mūkamūṣā","NC","","_","_"
2,"_","_","_","ga","PPP","","_","_"
3,"dhāmyaṃ","_","_","dha","KDG","","_","_"
4,"guṭikāṃ","_","_","guṭikā","NC","","_","_"
5,"tāṃ","_","_","tad","PRD","","_","_"
6,"samuddharet","_","_","samuddhar","V","samuddhṛ","_","_"
1,"svāṃgaśītaṃ","_","_","svāṅgaśīta","JJ","","_","_"
2,"samāhṛtya","_","_","samāhṛ","CGDA","","_","_"
3,"mūṣāyāṃ","_","_","mūṣā","NC","","_","_"
4,"prakaṭaṃ","_","_","prakaṭa","JJ","","_","_"
5,"dhamet","_","_","dham","V","dha","_","_"
1,"_","_","_","vāra","NC","","_","_"
2,"_","_","_","traya","NC","","_","_"
3,"_","_","_","kṣip","V","kṣip","_","_"
4,"_","_","_","tad","PRD","","_","_"
5,"vaṭikāṃ","_","_","vaṭikā","NC","","_","_"
6,"_","_","_","vedhana","NC","","_","_"
7,"_","_","_","mukha","NC","","_","_"
1,"mukhaṃ","_","_","mukha","NC","","_","_"
2,"tasya","_","_","tad","PRD","","_","_"
3,"_","_","_","bhav","V","bhū","_","_"
4,"_","_","_","tīvra","JJ","","_","_"
5,"śuddhaṃ","_","_","śudh","PPP","","_","_"
6,"baṃgaṃ","_","_","vaṅga","NC","","_","_"
7,"_","_","_","dru","V","dru","_","_"
8,"_","_","_","ala","CX","","_","_"
1,"yadā","_","_","yadā","CSB","","_","_"
2,"na","_","_","na","CNG","","_","_"
3,"grasate","_","_","gras","V","gras","_","_"
4,"_","_","_","tad","PRD","","_","_"
5,"_","_","_","vaṭī","NC","","_","_"
6,"deyā","_","_","dā","KDG","","_","_"
7,"punaḥ","_","_","punar","CAD","","_","_"
8,"punaḥ","_","_","punar","CAD","","_","_"
1,"jīrṇe","_","_","jṛ","PPP","","_","_"
2,"śataguṇe","_","_","śataguṇa","JJ","","_","_"
3,"vaṅge","_","_","vaṅga","NC","","_","_"
4,"_","_","_","tatara","JJ","","_","_"
5,"_","_","_","tāmra","NC","","_","_"
6,"dāpayet","_","_","dad","V","dā","_","_"
1,"drutasya","_","_","dru","PPP","","_","_"
2,"_","_","_","śata","NUM","","_","_"
3,"_","_","_","bhāga","NC","","_","_"
4,"_","_","_","tad","PRD","","_","_"
5,"_","_","_","tāra","NC","","_","_"
6,"jāyate","_","_","jan","V","jan","_","_"
7,"śubham","_","_","śubha","JJ","","_","_"
1,"gaṃdhakaṃ","_","_","gandhaka","NC","","_","_"
2,"dhūmasāraṃ","_","_","dhūmasāra","NC","","_","_"
3,"ca","_","_","ca","CCD","","_","_"
4,"phaṭkarī","_","_","phaṭkirī","NC","","_","_"
5,"ṭaṃkaṇaṃ","_","_","ṭaṅkaṇa","NC","","_","_"
6,"samam","_","_","sama","PPX","","_","_"
1,"_","_","_","eraṇḍa","NC","","_","_"
2,"_","_","_","bīja","NC","","_","_"
3,"_","_","_","majjan","NC","","_","_"
4,"_","_","_","api","CX","","_","_"
5,"sarveṣāṃ","_","_","sarva","JQ","","_","_"
6,"dviguṇā","_","_","dviguṇa","JJ","","_","_"
7,"bhavet","_","_","bhav","V","bhū","_","_"
1,"bhūnāgāḥ","_","_","bhūnāga","NC","","_","_"
2,"_","_","_","sarva","JQ","","_","_"
3,"_","_","_","tulya","JJ","","_","_"
4,"syuḥ","_","_","as","V","as","_","_"
5,"_","_","_","sarva","JQ","","_","_"
6,"_","_","_","ekatra","CX","","_","_"
7,"mardayet","_","_","marday","V","marday","_","_"
1,"_","_","_","caṇa","NC","","_","_"
2,"_","_","_","mātra","NC","","_","_"
3,"vaṭīḥ","_","_","vaṭī","NC","","_","_"
4,"kāryā","_","_","kṛ","KDG","","_","_"
5,"_","_","_","khyā","PPP","","_","_"
6,"_","_","_","ida","PRD","","_","_"
7,"vaḍavāmukhā","_","_","vaḍavāmukhā","NC","","_","_"
1,"_","_","_","śudh","PPP","","_","_"
2,"_","_","_","nāga","NC","","_","_"
3,"drutaṃ","_","_","dru","PPP","","_","_"
4,"kṣepyaṃ","_","_","kṣip","KDG","","_","_"
5,"taile","_","_","taila","NC","","_","_"
6,"eraṇḍake","_","_","eraṇḍaka","NC","","_","_"
7,"punaḥ","_","_","punar","CAD","","_","_"
1,"drāvyaṃ","_","_","drāvay","KDG","","_","_"
2,"drāvyaṃ","_","_","drāvay","KDG","","_","_"
3,"punaḥ","_","_","punar","CAD","","_","_"
4,"kṣepyaṃ","_","_","kṣip","KDG","","_","_"
5,"_","_","_","yāvat","CX","","_","_"
6,"_","_","_","vāra","NC","","_","_"
7,"śṛtaṃ","_","_","śrī","PPP","","_","_"
8,"bhavet","_","_","bhav","V","bhū","_","_"
1,"_","_","_","punar","CAD","","_","_"
2,"_","_","_","tad","PRD","","_","_"
3,"_","_","_","dru","PPP","","_","_"
4,"deyā","_","_","dā","KDG","","_","_"
5,"vaṭikā","_","_","vaṭikā","NC","","_","_"
6,"vaḍavāmukhā","_","_","vaḍavāmukhā","NC","","_","_"
1,"_","_","_","dvi","NUM","","_","_"
2,"_","_","_","tri","NUM","","_","_"
3,"_","_","_","vāra","NC","","_","_"
4,"prayatnena","_","_","prayatna","NC","","_","_"
5,"_","_","_","nāga","NC","","_","_"
6,"_","_","_","ittha","CX","","_","_"
7,"mukhaṃ","_","_","mukha","NC","","_","_"
8,"bhavet","_","_","bhav","V","bhū","_","_"
1,"grasate","_","_","gras","V","gras","_","_"
2,"_","_","_","sarva","JQ","","_","_"
3,"_","_","_","loha","NC","","_","_"
4,"satvāni","_","_","sattva","NC","","_","_"
5,"vividhāni","_","_","vividha","JJ","","_","_"
6,"ca","_","_","ca","CCD","","_","_"
1,"yadā","_","_","yadā","CSB","","_","_"
2,"na","_","_","na","CNG","","_","_"
3,"grasate","_","_","gras","V","gras","_","_"
4,"tasmād","_","_","tasmāt","CX","","_","_"
5,"vaṭī","_","_","vaṭī","NC","","_","_"
6,"deyā","_","_","dā","KDG","","_","_"
7,"punaḥ","_","_","punar","CAD","","_","_"
8,"punaḥ","_","_","punar","CAD","","_","_"
1,"_","_","_","madhūka","NC","","_","_"
2,"_","_","_","puṣpī","NC","","_","_"
3,"yaṣṭīkaṃ","_","_","yaṣṭīka","NC","","_","_"
4,"_","_","_","rambhā","NC","","_","_"
5,"_","_","_","kanda","NC","","_","_"
6,"ghṛtaṃ","_","_","ghṛta","NC","","_","_"
7,"guḍam","_","_","guḍa","NC","","_","_"
1,"_","_","_","tila","NC","","_","_"
2,"_","_","_","taila","NC","","_","_"
3,"_","_","_","ajā","NC","","_","_"
4,"_","_","_","kṣīra","NC","","_","_"
5,"kṣaudraṃ","_","_","kṣaudra","NC","","_","_"
6,"ca","_","_","ca","CCD","","_","_"
7,"_","_","_","tulya","JJ","","_","_"
8,"_","_","_","tulyaka","JJ","","_","_"
1,"_","_","_","tad","PRD","","_","_"
2,"_","_","_","madhye","CX","","_","_"
3,"kaṭhinaṃ","_","_","kaṭhina","JJ","","_","_"
4,"dhātu","_","_","dhātu","NC","","_","_"
5,"tridhā","_","_","tridhā","CX","","_","_"
6,"siñcyāt","_","_","sic","V","sic","_","_"
7,"_","_","_","su","CAD","","_","_"
8,"_","_","_","tāpay","PPP","","_","_"
1,"_","_","_","mṛdu","JJ","","_","_"
3,"yāti","_","_","yā","V","yā","_","_"
4,"no","_","_","no","CX","","_","_"
5,"citraṃ","_","_","citra","JJ","","_","_"
6,"_","_","_","sūtra","NC","","_","_"
7,"_","_","_","yogya","JJ","","_","_"
8,"na","_","_","na","CNG","","_","_"
9,"saṃśayaḥ","_","_","saṃśaya","NC","","_","_"
1,"_","_","_","vasubhadra","NC","","_","_"
2,"_","_","_","rasa","NC","","_","_"
3,"_","_","_","atha","CAD","","_","_"
4,"tridhā","_","_","tridhā","CX","","_","_"
5,"_","_","_","su","CAD","","_","_"
6,"_","_","_","tāpay","PPP","","_","_"
1,"_","_","_","loṇa","NC","","_","_"
2,"_","_","_","vat","CX","","_","_"
3,"_","_","_","sphuṭ","PPP","","_","_"
4,"_","_","_","dhātu","NC","","_","_"
5,"_","_","_","mṛdu","JJ","","_","_"
6,"syāt","_","_","as","V","as","_","_"
7,"_","_","_","sikthaka","NC","","_","_"
8,"_","_","_","upama","JJ","","_","_"
1,"_","_","_","ati","CADP","","_","_"
2,"_","_","_","sthūla","JJ","","_","_"
3,"bhekasya","_","_","bheka","NC","","_","_"
4,"_","_","_","nivāray","CGDA","","_","_"
5,"_","_","_","antra","NC","","_","_"
6,"tatra","_","_","tatra","CAD","","_","_"
7,"vai","_","_","vai","CX","","_","_"
1,"cūrṇitaṃ","_","_","cūrṇay","PPP","","_","_"
2,"ṭaṃkaṇaṃ","_","_","ṭaṅkaṇa","NC","","_","_"
3,"kṣiptvā","_","_","kṣip","CGDA","","_","_"
4,"_","_","_","tad","PRD","","_","_"
5,"_","_","_","bhāṇḍa","NC","","_","_"
6,"_","_","_","stha","JJ","","_","_"
7,"_","_","_","khan","V","khan","_","_"
8,"_","_","_","bhū","NC","","_","_"
1,"_","_","_","tri","NUM","","_","_"
2,"_","_","_","saptan","NUM","","_","_"
3,"_","_","_","aha","NC","","_","_"
4,"samuddhṛtya","_","_","samuddhṛ","CGDA","","_","_"
5,"_","_","_","tad","PRD","","_","_"
6,"_","_","_","vāpa","NC","","_","_"
7,"_","_","_","mṛdu","JJ","","_","_"
9,"vrajet","_","_","vraj","V","vraj","_","_"
1,"svarṇaṃ","_","_","svarṇa","NC","","_","_"
2,"vā","_","_","vā","CCD","","_","_"
3,"yadi","_","_","yadi","CSB","","_","_"
4,"vā","_","_","vā","CCD","","_","_"
5,"raupyaṃ","_","_","raupya","NC","","_","_"
6,"mṛdu","_","_","mṛdu","JJ","","_","_"
7,"_","_","_","as","V","as","_","_"
8,"_","_","_","pattra","NC","","_","_"
9,"_","_","_","yogyaka","JJ","","_","_"
1,"_","_","_","tṛṇajyotīya","JJ","","_","_"
2,"_","_","_","mūla","NC","","_","_"
3,"_","_","_","mātuluṅga","NC","","_","_"
4,"_","_","_","rasa","NC","","_","_"
5,"ca","_","_","ca","CCD","","_","_"
1,"_","_","_","tri","NUM","","_","_"
2,"_","_","_","dina","NC","","_","_"
3,"_","_","_","marday","V","marday","_","_"
4,"_","_","_","sūta","NC","","_","_"
5,"gaganaṃ","_","_","gagana","NC","","_","_"
6,"grasate","_","_","gras","V","gras","_","_"
7,"kṣaṇāt","_","_","kṣaṇa","NC","","_","_"
1,"_","_","_","bhūnāga","NC","","_","_"
2,"_","_","_","sūkṣma","JJ","","_","_"
3,"_","_","_","cūrṇa","NC","","_","_"
4,"tu","_","_","tu","CCD","","_","_"
5,"ṭaṃkaṇena","_","_","ṭaṅkaṇa","NC","","_","_"
6,"samaṃ","_","_","sama","PPX","","_","_"
7,"bhavet","_","_","bhav","V","bhū","_","_"
1,"_","_","_","tad","PRD","","_","_"
2,"_","_","_","cūrṇa","NC","","_","_"
3,"tu","_","_","tu","CCD","","_","_"
4,"drute","_","_","dru","PPP","","_","_"
5,"nāge","_","_","nāga","NC","","_","_"
6,"vāhyaṃ","_","_","vāhay","KDG","","_","_"
7,"śataguṇaṃ","_","_","śataguṇa","JJ","","_","_"
8,"dhaman","_","_","dha","KDP","","_","_"
1,"_","_","_","guhya","NC","","_","_"
2,"_","_","_","ākhya","JJ","","_","_"
3,"_","_","_","tad","PRD","","_","_"
4,"_","_","_","bhav","V","bhū","_","_"
5,"_","_","_","sidh","PPP","","_","_"
6,"grāsaṃ","_","_","grāsa","NC","","_","_"
7,"_","_","_","tad","PRD","","_","_"
8,"_","_","_","eva","CEM","","_","_"
9,"vakṣyate","_","_","vak","V","vac","_","_"
1,"_","_","_","śilā","NC","","_","_"
2,"_","_","_","gandhaka","NC","","_","_"
3,"_","_","_","mākṣīka","NC","","_","_"
4,"_","_","_","bhūnāga","NC","","_","_"
5,"_","_","_","drava","NC","","_","_"
6,"_","_","_","peṣay","PPP","","_","_"
1,"_","_","_","mūṣā","NC","","_","_"
2,"_","_","_","garbha","NC","","_","_"
3,"_","_","_","lip","V","lip","_","_"
4,"_","_","_","tad","PRD","","_","_"
5,"_","_","_","guhya","NC","","_","_"
6,"_","_","_","ākhya","JJ","","_","_"
7,"tatra","_","_","tatra","CAD","","_","_"
8,"nikṣipet","_","_","nikṣip","V","nikṣip","_","_"
1,"bhuktaṃ","_","_","bhukta","NC","","_","_"
2,"_","_","_","tad","PRD","","_","_"
3,"_","_","_","kṣip","V","kṣip","_","_"
4,"_","_","_","svarṇa","NC","","_","_"
5,"stokaṃ","_","_","stoka","NC","","_","_"
6,"stokaṃ","_","_","stoka","NC","","_","_"
7,"_","_","_","dha","KDP","","_","_"
8,"_","_","_","dha","KDP","","_","_"
1,"grasate","_","_","gras","V","gras","_","_"
2,"_","_","_","bhāra","NC","","_","_"
3,"_","_","_","saṃkhyā","NC","","_","_"
4,"tu","_","_","tu","CCD","","_","_"
5,"mūṣā","_","_","mūṣā","NC","","_","_"
6,"lepyā","_","_","lepay","KDG","","_","_"
7,"punaḥ","_","_","punar","CAD","","_","_"
8,"punaḥ","_","_","punar","CAD","","_","_"
1,"_","_","_","muñc","V","muc","_","_"
2,"_","_","_","adas","PRD","","_","_"
3,"drute","_","_","dru","PPP","","_","_"
4,"nāge","_","_","nāga","NC","","_","_"
5,"_","_","_","guhya","NC","","_","_"
6,"_","_","_","guhya","NC","","_","_"
7,"prakāśitam","_","_","prakāś","PPP","","_","_"
1,"bhūnāgaṃ","_","_","bhūnāga","NC","","_","_"
2,"ṭaṃkaṇaṃ","_","_","ṭaṅkaṇa","NC","","_","_"
3,"tulyaṃ","_","_","tulya","JJ","","_","_"
4,"_","_","_","sūkṣma","JJ","","_","_"
5,"_","_","_","carv","PPP","","_","_"
6,"kārayet","_","_","kar","V","kṛ","_","_"
1,"taṃ","_","_","tad","PRD","","_","_"
2,"vāhayed","_","_","vāhay","V","vāhay","_","_"
3,"drute","_","_","dru","PPP","","_","_"
4,"baṃge","_","_","vaṅga","NC","","_","_"
5,"_","_","_","yāvat","CX","","_","_"
6,"_","_","_","śataguṇa","JJ","","_","_"
7,"dhaman","_","_","dha","KDP","","_","_"
1,"tataḥ","_","_","tatas","CX","","_","_"
2,"śataguṇaṃ","_","_","śataguṇa","JJ","","_","_"
3,"baṃgaṃ","_","_","vaṅga","NC","","_","_"
4,"_","_","_","tad","PRD","","_","_"
5,"_","_","_","eva","CEM","","_","_"
6,"_","_","_","upari","CX","","_","_"
7,"vāhayet","_","_","vāhay","V","vāhay","_","_"
1,"stokaṃ","_","_","stoka","NC","","_","_"
2,"stokaṃ","_","_","stoka","NC","","_","_"
3,"_","_","_","dha","KDP","","_","_"
4,"_","_","_","eva","CEM","","_","_"
5,"grasate","_","_","gras","V","gras","_","_"
6,"_","_","_","na","CNG","","_","_"
7,"_","_","_","atra","CAD","","_","_"
8,"saṃśayaḥ","_","_","saṃśaya","NC","","_","_"
1,"tālakaṃ","_","_","tālaka","NC","","_","_"
2,"saiṃdhavaṃ","_","_","saindhava","NC","","_","_"
3,"tulyaṃ","_","_","tulya","JJ","","_","_"
4,"_","_","_","bhūnāga","NC","","_","_"
5,"_","_","_","drava","NC","","_","_"
6,"_","_","_","peṣay","PPP","","_","_"
1,"_","_","_","mūṣā","NC","","_","_"
2,"_","_","_","garbha","NC","","_","_"
3,"_","_","_","lip","V","lip","_","_"
4,"_","_","_","tad","PRD","","_","_"
5,"_","_","_","tad","PRD","","_","_"
6,"_","_","_","vaṅga","NC","","_","_"
7,"tatra","_","_","tatra","CAD","","_","_"
8,"nikṣipet","_","_","nikṣip","V","nikṣip","_","_"
1,"stokaṃ","_","_","stoka","NC","","_","_"
2,"stokaṃ","_","_","stoka","NC","","_","_"
3,"_","_","_","kṣip","V","kṣip","_","_"
4,"_","_","_","tad","PRD","","_","_"
5,"biḍaṃ","_","_","viḍa","NC","","_","_"
6,"dattvā","_","_","dā","CGDA","","_","_"
7,"_","_","_","dha","KDP","","_","_"
8,"_","_","_","dha","KDP","","_","_"
1,"_","_","_","bhāra","NC","","_","_"
2,"_","_","_","saṃkhyā","NC","","_","_"
3,"_","_","_","gras","V","gras","_","_"
4,"_","_","_","eva","CX","","_","_"
5,"_","_","_","guhyavaṅga","NC","","_","_"
6,"_","_","_","iti","CQT","","_","_"
7,"smṛtam","_","_","smṛ","PPP","","_","_"
1,"drute","_","_","dru","PPP","","_","_"
2,"baṃge","_","_","vaṅga","NC","","_","_"
3,"vinikṣiptaṃ","_","_","vinikṣip","PPP","","_","_"
4,"_","_","_","yāvat","CX","","_","_"
5,"_","_","_","saṃkhyā","NC","","_","_"
6,"na","_","_","na","CNG","","_","_"
7,"saṃśayaḥ","_","_","saṃśaya","NC","","_","_"
1,"tāvad","_","_","tāvat","CX","","_","_"
2,"drute","_","_","dru","PPP","","_","_"
3,"na","_","_","na","CNG","","_","_"
4,"saṃdehaḥ","_","_","saṃdeha","NC","","_","_"
5,"_","_","_","siddha","NC","","_","_"
6,"_","_","_","yoga","NC","","_","_"
7,"udāhṛtaḥ","_","_","udāhṛ","PPP","","_","_"
1,"_","_","_","kṣip","CGDA","","_","_"
2,"_","_","_","atha","CAD","","_","_"
3,"māhiṣe","_","_","māhiṣa","JJ","","_","_"
4,"śṛṅge","_","_","śṛṅga","NC","","_","_"
5,"_","_","_","marday","KDP","","_","_"
6,"_","_","_","agni","NC","","_","_"
7,"pacet","_","_","pac","V","pac","_","_"
1,"_","_","_","niṣka","NC","","_","_"
2,"_","_","_","eka","PPX","","_","_"
3,"_","_","_","bhav","V","bhū","_","_"
4,"_","_","_","yāvat","CX","","_","_"
5,"_","_","_","tāvat","CX","","_","_"
6,"_","_","_","mṛd","KDG","","_","_"
7,"kṣipan","_","_","kṣip","KDP","","_","_"
8,"kṣipan","_","_","kṣip","KDP","","_","_"
1,"tad","_","_","tad","PRD","","_","_"
2,"_","_","_","bhav","V","bhū","_","_"
3,"_","_","_","rasa","NC","","_","_"
4,"_","_","_","tulya","JJ","","_","_"
5,"tu","_","_","tu","CCD","","_","_"
6,"_","_","_","samādā","CGDA","","_","_"
7,"_","_","_","atha","CAD","","_","_"
8,"_","_","_","tad","PRD","","_","_"
9,"_","_","_","sama","PPX","","_","_"
1,"pāradaṃ","_","_","pārada","NC","","_","_"
2,"_","_","_","śudh","PPP","","_","_"
3,"_","_","_","heman","NC","","_","_"
4,"_","_","_","atha","CAD","","_","_"
5,"satvaṃ","_","_","sattva","NC","","_","_"
6,"_","_","_","bhūnāga","NC","","_","_"
7,"_","_","_","sambhava","NC","","_","_"
1,"_","_","_","catvāriṃśat","NC","","_","_"
2,"_","_","_","nāga","NC","","_","_"
3,"_","_","_","bhāga","NC","","_","_"
4,"mardyaṃ","_","_","mṛd","KDG","","_","_"
5,"_","_","_","jambīra","NC","","_","_"
6,"_","_","_","ja","JJ","","_","_"
7,"_","_","_","drava","NC","","_","_"
1,"_","_","_","tad","PRD","","_","_"
2,"_","_","_","golaka","NC","","_","_"
3,"_","_","_","viśoṣay","CGDA","","_","_"
4,"_","_","_","atha","CAD","","_","_"
5,"kalke","_","_","kalka","NC","","_","_"
6,"_","_","_","bhūnāga","NC","","_","_"
7,"_","_","_","sambhava","NC","","_","_"
1,"_","_","_","mūṣā","NC","","_","_"
2,"_","_","_","garbha","NC","","_","_"
3,"_","_","_","vilepay","CGDA","","_","_"
4,"_","_","_","ādau","CX","","_","_"
5,"tasyāṃ","_","_","tad","PRD","","_","_"
6,"golaṃ","_","_","gola","NC","","_","_"
7,"nirodhayet","_","_","nirrudh","V","nirrudh","_","_"
1,"_","_","_","dha","V","dha","_","_"
2,"_","_","_","tīvra","JJ","","_","_"
3,"_","_","_","agni","NC","","_","_"
4,"_","_","_","tāvat","CX","","_","_"
5,"_","_","_","yāvat","CX","","_","_"
6,"_","_","_","na","CNG","","_","_"
7,"_","_","_","atra","CAD","","_","_"
8,"_","_","_","avaśeṣay","PPP","","_","_"
1,"_","_","_","sarva","JQ","","_","_"
2,"_","_","_","vat","CX","","_","_"
3,"_","_","_","gras","V","gras","_","_"
4,"datte","_","_","dā","PPP","","_","_"
5,"_","_","_","guhya","NC","","_","_"
6,"_","_","_","ākhya","JJ","","_","_"
7,"_","_","_","yoga","NC","","_","_"
8,"_","_","_","uttama","JJ","","_","_"
1,"_","_","_","atha","CAD","","_","_"
2,"_","_","_","atas","CX","","_","_"
3,"sampravakṣyāmi","_","_","saṃpravak","V","saṃpravac","_","_"
4,"_","_","_","guṭikā","NC","","_","_"
5,"_","_","_","bandha","NC","","_","_"
6,"_","_","_","uttama","JJ","","_","_"
1,"_","_","_","sama","PPX","","_","_"
2,"_","_","_","jṛ","PPP","","_","_"
3,"kṛtaṃ","_","_","kṛ","PPP","","_","_"
4,"vyoma","_","_","vyoman","NC","","_","_"
5,"samato","_","_","samataḥ","CX","","_","_"
6,"rasaṃ","_","_","rasa","NC","","_","_"
7,"jārayet","_","_","jar","V","jṛ","_","_"
1,"_","_","_","ravi","NC","","_","_"
2,"_","_","_","saṃkhyā","NC","","_","_"
3,"_","_","_","aṃśaka","NC","","_","_"
4,"śulbaṃ","_","_","śulba","NC","","_","_"
5,"dattvā","_","_","dā","CGDA","","_","_"
6,"piṣṭiṃ","_","_","piṣṭi","NC","","_","_"
7,"ca","_","_","ca","CCD","","_","_"
8,"kārayet","_","_","kar","V","kṛ","_","_"
1,"_","_","_","dhānyābhraka","NC","","_","_"
2,"_","_","_","sama","PPX","","_","_"
3,"gaṃdhaṃ","_","_","gandha","NC","","_","_"
4,"śulbe","_","_","śulba","NC","","_","_"
5,"kṣiptvā","_","_","kṣip","CGDA","","_","_"
6,"vimardayet","_","_","vimarday","V","vimarday","_","_"
1,"_","_","_","tad","PRD","","_","_"
2,"_","_","_","mūṣā","NC","","_","_"
3,"_","_","_","ākṛti","NC","","_","_"
4,"kṛtvā","_","_","kṛ","CGDA","","_","_"
5,"_","_","_","piṣṭī","NC","","_","_"
6,"_","_","_","madhya","NC","","_","_"
7,"vimocayet","_","_","vimocay","V","vimocay","_","_"
1,"_","_","_","nara","NC","","_","_"
2,"_","_","_","māṃsa","NC","","_","_"
3,"saṃveṣṭya","_","_","saṃveṣṭay","CGDA","","_","_"
4,"_","_","_","māṣa","NC","","_","_"
5,"_","_","_","piṣṭī","NC","","_","_"
6,"_","_","_","tathā","CX","","_","_"
7,"_","_","_","eva","CEM","","_","_"
8,"ca","_","_","ca","CCD","","_","_"
1,"_","_","_","pac","V","pac","_","_"
2,"_","_","_","atasī","NC","","_","_"
3,"_","_","_","taila","NC","","_","_"
4,"_","_","_","māsa","NC","","_","_"
5,"_","_","_","mātra","NC","","_","_"
6,"tu","_","_","tu","CCD","","_","_"
7,"sādhakaḥ","_","_","sādhaka","NC","","_","_"
1,"akṣayā","_","_","akṣaya","JJ","","_","_"
2,"_","_","_","kāmadhenu","NC","","_","_"
3,"_","_","_","ca","CCD","","_","_"
4,"_","_","_","vaṅga","NC","","_","_"
5,"_","_","_","stambhana","NC","","_","_"
6,"_","_","_","kārin","JJ","","_","_"
1,"pārade","_","_","pārada","NC","","_","_"
2,"jāryaṃ","_","_","jāray","KDG","","_","_"
3,"_","_","_","kṛṣṇa","JJ","","_","_"
4,"_","_","_","abhra","NC","","_","_"
5,"rukmam","_","_","rukma","NC","","_","_"
6,"aṣṭaguṇaṃ","_","_","aṣṭaguṇa","JJ","","_","_"
7,"yadi","_","_","yadi","CSB","","_","_"
1,"rañjitaṃ","_","_","rañjay","PPP","","_","_"
2,"_","_","_","gandha","NC","","_","_"
3,"_","_","_","rāga","NC","","_","_"
4,"_","_","_","nara","NC","","_","_"
5,"_","_","_","māṃsa","NC","","_","_"
6,"veṣṭitam","_","_","veṣṭay","PPP","","_","_"
1,"_","_","_","māṣa","NC","","_","_"
2,"_","_","_","piṣṭī","NC","","_","_"
3,"_","_","_","pralip","CGDA","","_","_"
4,"_","_","_","atha","CAD","","_","_"
5,"_","_","_","atasī","NC","","_","_"
6,"_","_","_","taila","NC","","_","_"
7,"pācayet","_","_","pāc","V","pācay","_","_"
1,"_","_","_","kāmadhenu","NC","","_","_"
2,"_","_","_","ida","PRD","","_","_"
3,"khyātā","_","_","khyā","PPP","","_","_"
4,"_","_","_","nāga","NC","","_","_"
5,"_","_","_","stambhana","NC","","_","_"
6,"_","_","_","kārin","JJ","","_","_"
1,"_","_","_","rasa","NC","","_","_"
2,"_","_","_","pāda","NC","","_","_"
3,"_","_","_","aṃśaka","NC","","_","_"
4,"_","_","_","heman","NC","","_","_"
5,"_","_","_","piṣṭi","NC","","_","_"
6,"_","_","_","kar","V","kṛ","_","_"
7,"_","_","_","ca","CCD","","_","_"
8,"sundarām","_","_","sundara","JJ","","_","_"
1,"vilipya","_","_","vilip","CGDA","","_","_"
2,"kāmadhenuṃ","_","_","kāmadhenu","NC","","_","_"
3,"ca","_","_","ca","CCD","","_","_"
4,"_","_","_","nāga","NC","","_","_"
5,"_","_","_","drāva","NC","","_","_"
6,"niyojayet","_","_","niyuj","V","niyuj","_","_"
1,"taṃ","_","_","tad","PRD","","_","_"
2,"nāgaṃ","_","_","nāga","NC","","_","_"
3,"kurute","_","_","kar","V","kṛ","_","_"
4,"rukmaṃ","_","_","rukma","NC","","_","_"
5,"_","_","_","vāñch","PPP","","_","_"
6,"_","_","_","artha","NC","","_","_"
7,"_","_","_","siddhi","NC","","_","_"
8,"_","_","_","da","JJ","","_","_"
1,"guṭikāṃ","_","_","guṭikā","NC","","_","_"
2,"kāmadhenuṃ","_","_","kāmadhenu","NC","","_","_"
3,"tāṃ","_","_","tad","PRD","","_","_"
4,"pratyahaṃ","_","_","pratyaha","CX","","_","_"
5,"_","_","_","dhāray","V","dhāray","_","_"
6,"_","_","_","mukha","NC","","_","_"
1,"_","_","_","śastra","NC","","_","_"
2,"_","_","_","astra","NC","","_","_"
3,"_","_","_","na","CNG","","_","_"
4,"ca","_","_","ca","CCD","","_","_"
5,"bhidyeta","_","_","bhid","V","bhid","_","_"
6,"_","_","_","divya","JJ","","_","_"
7,"_","_","_","deha","NC","","_","_"
8,"_","_","_","avāp","V","avāp","_","_"
1,"śilayā","_","_","śilā","NC","","_","_"
2,"mārito","_","_","māray","PPP","","_","_"
3,"nāgaḥ","_","_","nāga","NC","","_","_"
4,"_","_","_","sūtarāja","NC","","_","_"
5,"_","_","_","samanvita","JJ","","_","_"
1,"rañjito","_","_","rañjay","PPP","","_","_"
2,"_","_","_","gandha","NC","","_","_"
3,"_","_","_","rāga","NC","","_","_"
4,"_","_","_","sama","PPX","","_","_"
5,"_","_","_","heman","NC","","_","_"
6,"ca","_","_","ca","CCD","","_","_"
7,"sārayet","_","_","sāray","V","sāray","_","_"
1,"_","_","_","tāra","NC","","_","_"
2,"_","_","_","vedha","NC","","_","_"
3,"pradātavyo","_","_","pradā","KDG","","_","_"
4,"divyaṃ","_","_","divya","JJ","","_","_"
5,"bhavati","_","_","bhav","V","bhū","_","_"
6,"kāṃcanam","_","_","kāñcana","NC","","_","_"
1,"śilayā","_","_","śilā","NC","","_","_"
2,"_","_","_","ravi","NC","","_","_"
3,"_","_","_","dugdha","NC","","_","_"
4,"_","_","_","nāga","NC","","_","_"
5,"_","_","_","pattra","NC","","_","_"
6,"lepayet","_","_","lepay","V","lepay","_","_"
1,"_","_","_","māray","V","māray","_","_"
2,"_","_","_","puṭa","NC","","_","_"
3,"_","_","_","yoga","NC","","_","_"
4,"divyaṃ","_","_","divya","JJ","","_","_"
5,"bhavati","_","_","bhav","V","bhū","_","_"
6,"kāṃcanam","_","_","kāñcana","NC","","_","_"
1,"_","_","_","meṣī","NC","","_","_"
2,"_","_","_","kṣīra","NC","","_","_"
3,"_","_","_","amlavarga","NC","","_","_"
4,"daradaṃ","_","_","darada","NC","","_","_"
5,"_","_","_","gharma","NC","","_","_"
6,"_","_","_","bhāvay","PPP","","_","_"
1,"śatadhā","_","_","śatadhā","CX","","_","_"
2,"_","_","_","tad","PRD","","_","_"
3,"_","_","_","prayoga","NC","","_","_"
4,"śoṣyaṃ","_","_","śoṣay","KDG","","_","_"
5,"peṣyaṃ","_","_","piṣ","KDG","","_","_"
6,"_","_","_","khara","JJ","","_","_"
7,"_","_","_","ātapa","NC","","_","_"
1,"sitasvarṇasya","_","_","sitasvarṇa","NC","","_","_"
2,"patrāṇi","_","_","pattra","NC","","_","_"
3,"liptvā","_","_","lip","CGDA","","_","_"
4,"liptvā","_","_","lip","CGDA","","_","_"
5,"puṭe","_","_","puṭa","NC","","_","_"
6,"pacet","_","_","pac","V","pac","_","_"
1,"evaṃ","_","_","eva","CX","","_","_"
2,"_","_","_","tri","NUM","","_","_"
3,"_","_","_","saptadhā","CX","","_","_"
4,"kuryād","_","_","kar","V","kṛ","_","_"
5,"divyaṃ","_","_","divya","JJ","","_","_"
6,"bhavati","_","_","bhav","V","bhū","_","_"
7,"kāṃcanam","_","_","kāñcana","NC","","_","_"
1,"_","_","_","tṛṇa","NC","","_","_"
2,"_","_","_","jātīya","JJ","","_","_"
3,"_","_","_","mūla","NC","","_","_"
4,"tu","_","_","tu","CCD","","_","_"
5,"_","_","_","mātuluṅga","NC","","_","_"
6,"_","_","_","rasa","NC","","_","_"
7,"ca","_","_","ca","CCD","","_","_"
1,"_","_","_","tri","NUM","","_","_"
2,"_","_","_","dina","NC","","_","_"
3,"_","_","_","marday","V","marday","_","_"
4,"_","_","_","sūta","NC","","_","_"
5,"gaganaṃ","_","_","gagana","NC","","_","_"
6,"grasate","_","_","gras","V","gras","_","_"
7,"kṣaṇāt","_","_","kṣaṇa","NC","","_","_"
1,"_","_","_","siddha","NC","","_","_"
2,"_","_","_","gaṇa","NC","","_","_"
3,"_","_","_","sura","NC","","_","_"
4,"_","_","_","vara","JJ","","_","_"
5,"_","_","_","rasa","NC","","_","_"
6,"_","_","_","siddhi","NC","","_","_"
7,"_","_","_","kāma","NC","","_","_"
8,"baddhaṃ","_","_","bandh","PPP","","_","_"
9,"_","_","_","haṭha","NC","","_","_"
10,"_","_","_","parama","JJ","","_","_"
11,"_","_","_","mantra","NC","","_","_"
12,"_","_","_","bala","NC","","_","_"
13,"_","_","_","tad","PRD","","_","_"
14,"_","_","_","ca","CCD","","_","_"
1,"tasmād","_","_","tasmāt","CX","","_","_"
2,"viśiṣṭam","_","_","viśiṣ","PPP","","_","_"
3,"anujaiḥ","_","_","anuja","NC","","_","_"
4,"_","_","_","kṛ","PPP","","_","_"
5,"_","_","_","mantra","NC","","_","_"
6,"_","_","_","jāpa","NC","","_","_"
7,"kāryaṃ","_","_","kṛ","KDG","","_","_"
8,"tato","_","_","tatas","CX","","_","_"
9,"rasavare","_","_","rasavara","NC","","_","_"
10,"_","_","_","vara","JJ","","_","_"
11,"_","_","_","bandhana","NC","","_","_"
12,"ca","_","_","ca","CCD","","_","_"
