"WordID","word","NormSTEM","suffix","lemma","PoS","Root","NormSuffix","NormWord"
1,"dhenuḥ","_","_","dhenu","NC","","_","_"
2,"pratnasya","_","_","pratna","JJ","","_","_"
3,"kāmyaṃ","_","_","kāmya","JJ","","_","_"
4,"_","_","_","duh","KDP","","_","_"
5,"_","_","_","antar","CAD","","_","_"
6,"putraś","_","_","putra","NC","","_","_"
7,"carati","_","_","car","V","car","_","_"
8,"dakṣiṇāyāḥ","_","_","dakṣiṇā","NC","","_","_"
1,"ā","_","_","ā","CADP","","_","_"
2,"dyotaniṃ","_","_","dyotani","NC","","_","_"
3,"vahati","_","_","vah","V","vah","_","_"
4,"_","_","_","śubhra","JJ","","_","_"
5,"_","_","_","yāma","NC","","_","_"
6,"_","_","_","uṣas","NC","","_","_"
7,"stomo","_","_","stoma","NC","","_","_"
8,"aśvināv","_","_","aśvin","NC","","_","_"
9,"ajīgaḥ","_","_","jāgṛ","V","jāgṛ","_","_"
1,"_","_","_","su","CAD","","_","_"
2,"_","_","_","yuj","JJ","","_","_"
3,"vahanti","_","_","vahan","V","vah","_","_"
4,"prati","_","_","prati","CADP","","_","_"
5,"vām","_","_","tvat","PPR","","_","_"
6,"_","_","_","ṛta","NC","","_","_"
7,"_","_","_","ūrdhva","JJ","","_","_"
8,"bhavanti","_","_","bhav","V","bhū","_","_"
9,"_","_","_","pitṛ","NC","","_","_"
10,"_","_","_","iva","CCM","","_","_"
11,"medhāḥ","_","_","medha","NC","","_","_"
1,"jarethām","_","_","jar","V","jṛ","_","_"
2,"asmad","_","_","mat","PPR","","_","_"
3,"vi","_","_","vi","CADP","","_","_"
4,"paṇer","_","_","paṇi","NC","","_","_"
5,"manīṣāṃ","_","_","manīṣā","NC","","_","_"
6,"yuvor","_","_","tvat","PPR","","_","_"
7,"avaś","_","_","avas","NC","","_","_"
8,"cakṛmā","_","_","kar","V","kṛ","_","_"
9,"yātam","_","_","yā","V","yā","_","_"
10,"arvāk","_","_","arvāk","CX","","_","_"
1,"_","_","_","su","CAD","","_","_"
2,"_","_","_","yuj","NC","","_","_"
3,"aśvaiḥ","_","_","aśva","NC","","_","_"
4,"suvṛtā","_","_","suvṛt","JJ","","_","_"
5,"rathena","_","_","ratha","NC","","_","_"
6,"dasrāv","_","_","dasra","NC","","_","_"
7,"imaṃ","_","_","ida","PRD","","_","_"
8,"śṛṇutaṃ","_","_","śṛṇ","V","śru","_","_"
9,"ślokam","_","_","śloka","NC","","_","_"
10,"adreḥ","_","_","adri","NC","","_","_"
1,"kim","_","_","kim","CX","","_","_"
2,"aṅga","_","_","aṅga","CEM","","_","_"
3,"vām","_","_","tvat","PPR","","_","_"
4,"praty","_","_","prati","CADP","","_","_"
5,"avartiṃ","_","_","avarti","NC","","_","_"
6,"_","_","_","gamiṣṭha","JJ","","_","_"
7,"_","_","_","ah","V","ah","_","_"
8,"viprāso","_","_","vipra","NC","","_","_"
9,"aśvinā","_","_","aśvin","NC","","_","_"
10,"purājāḥ","_","_","purājā","JJ","","_","_"
1,"ā","_","_","ā","CADP","","_","_"
2,"manyethām","_","_","man","V","man","_","_"
3,"ā","_","_","ā","CADP","","_","_"
4,"gataṃ","_","_","ga","V","ga","_","_"
5,"kaccid","_","_","kaccit","CX","","_","_"
6,"evair","_","_","eva","NC","","_","_"
7,"viśve","_","_","viśva","JQ","","_","_"
8,"janāso","_","_","jana","NC","","_","_"
9,"aśvinā","_","_","aśvin","NC","","_","_"
10,"havante","_","_","hve","V","hve","_","_"
1,"imā","_","_","ida","PRD","","_","_"
2,"hi","_","_","hi","CX","","_","_"
3,"vāṃ","_","_","tvat","PPR","","_","_"
4,"_","_","_","go","NC","","_","_"
5,"_","_","_","ṛjīka","JJ","","_","_"
6,"madhūni","_","_","madhu","NC","","_","_"
7,"pra","_","_","pra","CADP","","_","_"
8,"mitrāso","_","_","mitra","NC","","_","_"
9,"na","_","_","na","CNG","","_","_"
10,"dadur","_","_","dad","V","dā","_","_"
11,"usro","_","_","usṛ","NC","","_","_"
12,"agre","_","_","agra","NC","","_","_"
1,"tiraḥ","_","_","tiras","CX","","_","_"
2,"purū","_","_","puru","JJ","","_","_"
3,"cid","_","_","cit","CEM","","_","_"
4,"aśvinā","_","_","aśvin","NC","","_","_"
5,"rajāṃsy","_","_","rajas","NC","","_","_"
6,"āṅgūṣo","_","_","āṅgūṣa","NC","","_","_"
7,"vām","_","_","tvat","PPR","","_","_"
8,"maghavānā","_","_","maghavan","JJ","","_","_"
9,"janeṣu","_","_","jana","NC","","_","_"
1,"_","_","_","ā","CADP","","_","_"
2,"_","_","_","iha","CAD","","_","_"
3,"yātam","_","_","yā","V","yā","_","_"
4,"pathibhir","_","_","pathin","NC","","_","_"
5,"_","_","_","deva","NC","","_","_"
6,"_","_","_","yāna","NC","","_","_"
7,"dasrāv","_","_","dasra","NC","","_","_"
8,"ime","_","_","ida","PRD","","_","_"
9,"vāṃ","_","_","tvat","PPR","","_","_"
10,"nidhayo","_","_","nidhi","NC","","_","_"
11,"madhūnām","_","_","madhu","NC","","_","_"
1,"purāṇam","_","_","purāṇa","JJ","","_","_"
2,"okaḥ","_","_","oka","NC","","_","_"
3,"sakhyaṃ","_","_","sakhya","NC","","_","_"
4,"śivaṃ","_","_","śiva","JJ","","_","_"
5,"vāṃ","_","_","tvat","PPR","","_","_"
6,"yuvor","_","_","tvat","PPR","","_","_"
7,"narā","_","_","nṛ","NC","","_","_"
8,"draviṇaṃ","_","_","draviṇa","NC","","_","_"
9,"jahnāvyām","_","_","jahnāvī","NC","","_","_"
1,"punaḥ","_","_","punar","CAD","","_","_"
2,"kṛṇvānāḥ","_","_","kṛ","KDP","","_","_"
3,"sakhyā","_","_","sakhya","NC","","_","_"
4,"śivāni","_","_","śiva","JJ","","_","_"
5,"madhvā","_","_","madhu","NC","","_","_"
6,"madema","_","_","mand","V","mand","_","_"
7,"saha","_","_","saha","CX","","_","_"
8,"nū","_","_","nu","CX","","_","_"
9,"samānāḥ","_","_","samāna","JJ","","_","_"
1,"aśvinā","_","_","aśvin","NC","","_","_"
2,"vāyunā","_","_","vāyu","NC","","_","_"
3,"yuvaṃ","_","_","tvat","PPR","","_","_"
4,"_","_","_","su","CAD","","_","_"
5,"_","_","_","dakṣa","JJ","","_","_"
6,"niyudbhiś","_","_","niyut","NC","","_","_"
7,"ca","_","_","ca","CCD","","_","_"
8,"sajoṣasā","_","_","sajoṣas","JJ","","_","_"
9,"yuvānā","_","_","yuvan","NC","","_","_"
1,"nāsatyā","_","_","nāsatya","NC","","_","_"
2,"tiroahnyaṃ","_","_","tiroahnya","JJ","","_","_"
3,"juṣāṇā","_","_","juṣ","KDP","","_","_"
4,"somam","_","_","soma","NC","","_","_"
5,"pibatam","_","_","pib","V","pā","_","_"
6,"a","_","_","alpha_privativum","JJ","","_","_"
6,"asridhā","_","_","sridh","JJ","","_","_"
7,"sudānū","_","_","sudānu","JJ","","_","_"
1,"aśvinā","_","_","aśvin","NC","","_","_"
2,"pari","_","_","pari","CADP","","_","_"
3,"vām","_","_","tvat","PPR","","_","_"
4,"iṣaḥ","_","_","iṣ","NC","","_","_"
5,"purūcīr","_","_","purūcī","NC","","_","_"
6,"īyur","_","_","e","V","i","_","_"
7,"gīrbhir","_","_","gir","NC","","_","_"
8,"yatamānā","_","_","yat","KDP","","_","_"
9,"amṛdhrāḥ","_","_","amṛdhra","JJ","","_","_"
1,"ratho","_","_","ratha","NC","","_","_"
2,"ha","_","_","ha","CEM","","_","_"
3,"vām","_","_","tvat","PPR","","_","_"
4,"_","_","_","ṛta","NC","","_","_"
5,"_","_","_","jā","JJ","","_","_"
6,"_","_","_","adri","NC","","_","_"
7,"_","_","_","jū","PPP","","_","_"
8,"pari","_","_","pari","CADP","","_","_"
9,"dyāvāpṛthivī","_","_","dyāvāpṛthivī","NC","","_","_"
10,"yāti","_","_","yā","V","yā","_","_"
11,"sadyaḥ","_","_","sadyas","CAD","","_","_"
1,"aśvinā","_","_","aśvin","NC","","_","_"
2,"madhuṣuttamo","_","_","madhuṣuttama","JJ","","_","_"
3,"yuvākuḥ","_","_","yuvāku","JJ","","_","_"
4,"somas","_","_","soma","NC","","_","_"
5,"tam","_","_","tad","PRD","","_","_"
6,"pātam","_","_","pib","V","pā","_","_"
7,"ā","_","_","ā","CADP","","_","_"
8,"gataṃ","_","_","ga","V","ga","_","_"
9,"duroṇe","_","_","duroṇa","NC","","_","_"
1,"ratho","_","_","ratha","NC","","_","_"
2,"ha","_","_","ha","CEM","","_","_"
3,"vām","_","_","tvat","PPR","","_","_"
4,"bhūri","_","_","bhūri","JQ","","_","_"
5,"varpaḥ","_","_","varpas","NC","","_","_"
6,"karikrat","_","_","karikṛ","KDP","","_","_"
7,"sutāvato","_","_","sutāvat","JJ","","_","_"
8,"niṣkṛtam","_","_","niṣkṛta","NC","","_","_"
9,"āgamiṣṭhaḥ","_","_","āgamiṣṭha","JJ","","_","_"
