"WordID","word","NormSTEM","suffix","lemma","PoS","Root"
"","<doc textid = ""tathagatabimbakarapanasutra_gilgit"" genre = ""sūtra"" title = ""tathāgatabimbakārāpaṇasūtra"" author = ""n /a"" discourse = ""homiletic"" tradition = ""buddh"" period = ""commentarial"" source = ""gretil accessed feb 2021 : http://gretil.sub.uni-goettingen.de/gretil/corpustei/sa_.xml"" date_range = ""6.-7. ce"" notes = ""date-range 6th-7th cent. ce based tentatively on date gilgit manuscripts. more information on dating unavailbale without access to a. mette’s edition. beginning of sūtra lost. in the sūtra the buddha explains the spiritual benefits of making and worshipping pūjā buddha-images."" religion = ""buddh"" edition = ""based on the ed. by adelheid mette: zwei kleine fragmente aus gilgit. in studien zur indologie und iranistik 7 1981 ; pp 133-151 and gbm 1684.1_1691.2 bl. 2_5 ; page number = folio number of gilgit buddhist manuscript; colons replaced by /; numbers indicating verse numbers retained unaltered in text"" digitization = ""klaus wille"" segmentation_lemmatization = ""ligeia lugli & buddhist translators workbench team"" metadata_enrichment = ""bruno galasek-hul & buddhist translators workbench team"" proofreader = ""n/a"" permission = """" reconstructions = ""none"">","","","","",""
"","<page number=""0"">","","","","",""
"","<s number=""1"">","","","","",""
"1","tathāgata","TATHĀGAT","a@","tathāgata","noun-adj",""
"2","bimba","BIMB","a@","bimba","noun-adj",""
"3","kārāpaṇa","KĀRĀPAṆ","a@","kārāpaṇa","noun-adj",""
"4","sūtra","SŪTR","a","sūtra","noun-adj",""
"","</page>","","","","",""
"","<page number=""2r1"">","","","","",""
"","</s>","","","","",""
"","<s number=""2"">","","","","",""
"1","+++","","","CORRUPTED","ind",""
"2","s","","","su","ind",""
"3","sa","","","sa_saha","ind",""
"4","kotūhala","KOTŪHAL","a@","kotūhala","noun-adj",""
"5","hṛdayā","HṚDAY","ā","hṛdayā","noun-adj",""
"6","evam","","","eva","ind",""
"7","ūcu","","","","ind",""
"8","/","","","","punct",""
"9","aho","","","aho","ind",""
"10","puṇya","PUṆY","a@","puṇya","noun-adj",""
"11","phala","PHAL","a@","phala","noun-adj",""
"12","prabhāvam","PRABHĀV","am","prabhāva","noun-adj",""
"13","iti","","","iti","ind",""
"14","mahātvaṃ","MAH","ātvaṃ","mahat","noun-adj",""
"15","aho","","","aho","ind",""
"16","puṇya","PUṆY","a@","puṇya","noun-adj",""
"17","prabhāvam","PRABHĀV","am","prabhāva","noun-adj",""
"18","iti","","","iti","ind",""
"19","tūṣṇī","TŪṢṆ","ī","tūṣṇī","noun-adj",""
"20","abhūvuḥ","ABHŪV","uḥ","abhūvu","noun-adj",""
"21","tataḥ","","","tatas","ind",""
"22","suvarṇa","SUVARṆ","a@","suvarṇa","noun-adj",""
"23","prabho","PRABH","o","prabha","noun-adj",""
"","</page>","","","","",""
"","<page number=""2r2"">","","","","",""
"","</s>","","","","",""
"","<s number=""3"">","","","","",""
"1","saparivāra","SAPARIVĀR","a","saparivāra","noun-adj",""
"2","bhagavantaṃ","BHAGAV","antaṃ","bhagavat","noun-adj",""
"3","pradakṣiṇī","PRADAKṢIṆ","ī@","pradakṣiṇa","noun-adj",""
"4","kṛtya","KṚTY","a","kṛtya","noun-adj",""
"5","śirasā","ŚIRAS","ā","śiras","noun-adj",""
"6","praṇamya","PRAṆAMY","a","praṇamya","noun-adj",""
"7","bhagavato","BHAGAV","ato","bhagavat","noun-adj",""
"8","antikaṃ","ANTIK","aṃ","antika","noun-adj",""
"9","niṣaṇṇa","NIṢAṆṆ","a","niṣaṇṇa","noun-adj",""
"10","dharmaśravaṇa","DHARMAŚRAVAṆ","a@","dharmaśravaṇa","noun-adj",""
"11","ārtham","ARTH","am","artha","noun-adj",""
"12","atha","","","atha","ind",""
"","</page>","","","","",""
"","<page number=""2r3"">","","","","",""
"","</s>","","","","",""
"","<s number=""4"">","","","","",""
"1","bhagavāṃ","BHAGAV","āṃ","bhagavat","noun-adj",""
"2","sarva","SARV","a@","sarva","noun-adj",""
"3","satva","SATTV","a@","sattva","noun-adj",""
"4","ānusaṃśayaṃ","ĀNUSAṂŚAY","aṃ","ānusaṃśaya","noun-adj",""
"5","jñātvā","JÑĀT","vā","jñāta","noun-adj",""
"6","tebhyo","","","tad","pron",""
"7","mahā","MAH","ā@","mahat","noun-adj",""
"8","janakāyebhya","JANAKĀY","ebhya","janakāya","noun-adj",""
"9","dharmaśrā","DHARMAŚR","ā@","dharmaśrī","noun-adj",""
"10","vaṇikebhyaḥ","VAṆIK","ebhyaḥ","vaṇika","noun-adj",""
"11","tasya","","","tad","pron",""
"12","suvarṇaprabhasya","SUVARṆAPRABH","asya","suvarṇaprabha","noun-adj",""
"13","rājakumārasya","RĀJAKUMĀR","asya","rājakumāra","noun-adj",""
"14","pūrva","PŪRV","a","pūrva","noun-adj",""
"15","su","","","su","ind",""
"16","carita","CARIT","a@","carita","noun-adj",""
"17","puṇya","PUṆY","a@","puṇya","noun-adj",""
"18","phalena","PHAL","ena","phala","noun-adj",""
"","</page>","","","","",""
"","<page number=""2r4"">","","","","",""
"","</s>","","","","",""
"","<s number=""5"">","","","","",""
"1","prabhāva","PRABHĀV","a@","prabhāva","noun-adj",""
"2","samudaya","SAMUDAY","a@","samudaya","noun-adj",""
"3","saṃdarśana","SAṂDARŚAN","a@","saṃdarśana","noun-adj",""
"4","hetu","HET","u@","hetu","noun-adj",""
"5","bhūtāṃ","BHŪT","āṃ","bhūta","noun-adj",""
"6","vicitra","VICITR","a","vicitra","noun-adj",""
"7","prakārāṃ","PRAKĀR","āṃ","prakāra","noun-adj",""
"8","sa","","","sa_saha","ind",""
"9","pratītyasamutpādāṃ","PRATĪTYASAMUTPĀD","āṃ","pratītyasamutpāda","noun-adj",""
"10","catur","CAT","ur","catur","noun-adj",""
"11","āryasatya","ĀRYASATY","a@","āryasatya","noun-adj",""
"12","kathā","","","","ind",""
"13","saṃyuktāṃ","SAṂYUKT","āṃ","saṃyuktā","noun-adj",""
"","</page>","","","","",""
"","<page number=""2r5"">","","","","",""
"","</s>","","","","",""
"","<s number=""6"">","","","","",""
"1","dharma","DHARM","a@","dharma","noun-adj",""
"2","deśanāṃ","DEŚAN","āṃ","deśanā","noun-adj",""
"3","deśayati","DEŚ","ayati","diś","verb","diś"
"4","/","","","","punct",""
"5","ādau","ĀD","au","ād","verb",""
"6","kalyāṇaṃ","KALYĀṆ","aṃ","kalyāṇa","noun-adj",""
"7","madhye","MADHY","e","madhya","noun-adj",""
"8","kalyāṇaṃ","KALYĀṆ","aṃ","kalyāṇa","noun-adj",""
"9","paryavasāne","PARYAVASĀN","e","paryavasāna","noun-adj",""
"10","kalyāṇaṃ","KALYĀṆ","aṃ","kalyāṇa","noun-adj",""
"11","sv","","","su","ind",""
"12","arthaṃ","ARTH","aṃ","artha","noun-adj",""
"13","su","","","su","ind",""
"14","vyaṃjanaṃ","VYAṂJAN","aṃ","vyaṃjana","noun-adj",""
"15","kevalaṃ","KEVAL","aṃ","kevala","noun-adj",""
"16","paripūrṇaṃ","PARIPŪRṆ","aṃ","paripūrṇa","noun-adj",""
"","</page>","","","","",""
"","<page number=""2r6"">","","","","",""
"","</s>","","","","",""
"","<s number=""7"">","","","","",""
"1","pariśuddhaṃ","PARIŚUDDH","aṃ","pariśuddha","noun-adj",""
"2","paryavadātaṃ","PARYAVADĀT","aṃ","paryavadāta","noun-adj",""
"3","brahmacaryaṃ","BRAHMACARY","aṃ","brahmacarya","noun-adj",""
"4","prakāśayati","PRAKĀŚ","ayati","prakāś","verb","prakāś"
"5","sma","","","sma","ind",""
"6","/","","","","punct",""
"7","bhūta","BHŪT","a@","bhūta","noun-adj",""
"8","pūrvaṃ","PŪRV","aṃ","pūrva","noun-adj",""
"9","bhikṣavaḥ","BHIKṢ","avaḥ","bhikṣu","noun-adj",""
"10","atīte","ATĪT","e","atīta","noun-adj",""
"11","adhvani","ADHV","ani","adhvat","noun-adj",""
"12","eka","EK","a@","eka","noun-adj",""
"13","navatime","NAVAT","ime","navata","noun-adj",""
"14","kalpe","KALP","e","kalpa","noun-adj",""
"","</page>","","","","",""
"","<page number=""2r7"">","","","","",""
"","</s>","","","","",""
"","<s number=""8"">","","","","",""
"1","vipaśyī","VIPAŚY","ī","vipaśyin","noun-adj",""
"2","nāma","NĀM","a","nāman","noun-adj",""
"3","samyaksaṃbuddho","SAMYAKSAṂBUDDH","o","samyaksaṃbuddha","noun-adj",""
"4","vidyācaraṇasaṃpannas","VIDYĀCARAṆASAṂPANN","as","vidyācaraṇasaṃpanna","noun-adj",""
"5","sugato","SUGAT","o","sugata","noun-adj",""
"6","loka","LOK","a@","loka","noun-adj",""
"7","vid","VID","","vid","noun-adj",""
"8","anuttaraḥ","ANUTTAR","aḥ","anuttara","noun-adj",""
"9","puruṣadamyasārathiś","PURUṢADAMYASĀRATH","iś","puruṣadamyasārathi","noun-adj",""
"10","śāstā","ŚĀST","ā","śastṛ","noun-adj",""
"11","deva","DEV","a@","deva","noun-adj",""
"12","manuṣyāṇāṃ","MANUṢY","āṇāṃ","manuṣya","noun-adj",""
"","</page>","","","","",""
"","<page number=""2v1"">","","","","",""
"","</s>","","","","",""
"","<s number=""9"">","","","","",""
"1","buddho","BUDDH","o","buddha","noun-adj",""
"2","bhagavāṃ","BHAGAV","āṃ","bhagavat","noun-adj",""
"3","buddha","BUDDH","a@","buddha","noun-adj",""
"4","kṛtyam","KṚTY","am","kṛtya","noun-adj",""
"5","a+++a","","","CORRUPTED","ind",""
"6","śiṣya","ŚIṢY","a@","śiṣya","noun-adj",""
"7","vineya","VINEY","a@","vineya","noun-adj",""
"8","kṛtyaṃ","KṚTY","aṃ","kṛtya","noun-adj",""
"9","kṛtvā","KṚT","vā","kṛta","noun-adj",""
"10","nirindhano","NIRINDHAN","o","nirindhana","noun-adj",""
"11","agnir","AGN","ir","agni","noun-adj",""
"12","iva","","","iva","ind",""
"13","parinirvṛta","PARINIRVṚT","a","parinirvṛta","noun-adj",""
"14","samabhijagāma","SAMABHIJAGĀM","a","samabhijagāma","noun-adj",""
"15","/","","","","punct",""
"16","tad","TAD","","tad","pron",""
"17","eka","EK","a@","eka","noun-adj",""
"18","puruṣo","PURUṢ","o","puruṣa","noun-adj",""
"","</page>","","","","",""
"","<page number=""2v2"">","","","","",""
"","</s>","","","","",""
"","<s number=""10"">","","","","",""
"1","bhikṣavaḥ","BHIKṢ","avaḥ","bhikṣu","noun-adj",""
"2","paruṣa","PARUṢ","a@","paruṣa","noun-adj",""
"3","daridra","DARIDR","a@","daridra","noun-adj",""
"4","kṛṣi","KṚṢI","","kṛṣi","noun-adj",""
"5","karmaṇāva","KARM","aṇāva","karman","noun-adj",""
"6","prativṛtti","PRATIVṚTT","i","prativṛtti","noun-adj",""
"7","bhagavatā","BHAGAV","atā","bhagavat","noun-adj",""
"8","vipaśyina","VIPAŚY","ina","vipaśyin","noun-adj",""
"9","śāsanebhiḥ","ŚĀSAN","ebhiḥ","śāsana","noun-adj",""
"10","prasannāḥ","PRASANN","āḥ","prasanna","noun-adj",""
"11","bhagavato","BHAGAV","ato","bhagavat","noun-adj",""
"12","vipaśyinaḥ","VIPAŚY","inaḥ","vipaśyin","noun-adj",""
"","</page>","","","","",""
"","<page number=""2v3"">","","","","",""
"","</s>","","","","",""
"","<s number=""11"">","","","","",""
"1","pratimāṃ","PRATIM","āṃ","pratimā","noun-adj",""
"2","kartā","KART","ā","kartṛ","noun-adj",""
"3","tasmiṃ","","","tad","pron",""
"4","kāle","KĀL","e","kāla","noun-adj",""
"5","tasmiṃ","","","tad","pron",""
"6","samaye","SAMAY","e","samaya","noun-adj",""
"7","sa","","","sa_saha","ind",""
"8","ev","","","eva","ind",""
"9","āyaṃ","ĀYAṂ","","idam","pron",""
"10","suvarṇaprabho","SUVARṆAPRABH","o","suvarṇaprabha","noun-adj",""
"11","rāja","RĀJ","a@","rājan","noun-adj",""
"12","kumāra","KUMĀR","a","kumāra","noun-adj",""
"13","yad","","","yadi","ind",""
"14","bhagavato","BHAGAV","ato","bhagavat","noun-adj",""
"15","vipaśyinaḥ","VIPAŚY","inaḥ","vipaśyin","noun-adj",""
"16","prati","PRAT","i","prati","noun-adj",""
"17","māṃ","","","mat","pron",""
"","</page>","","","","",""
"","<page number=""2v4"">","","","","",""
"","</s>","","","","",""
"","<s number=""12"">","","","","",""
"1","kārayata","KĀRAY","ata","kar","verb","kṛ"
"2","yat","","","yad","pron",""
"3","puṇya","PUṆY","a@","puṇya","noun-adj",""
"4","phala","PHAL","a@","phala","noun-adj",""
"5","samudaya","SAMUDAY","a@","samudaya","noun-adj",""
"6","prabhāvai","PRABHĀV","ai","prabhāva","noun-adj",""
"7","divya","DIVY","a@","divya","noun-adj",""
"8","sukha","SUKH","a@","sukha","noun-adj",""
"9","opabhoga","UPABHOG","a@","upabhoga","noun-adj",""
"10","aiśvarya","AIŚVARY","a@","aiśvarya","noun-adj",""
"11","mahātvam","MAH","ātvam","mahat","noun-adj",""
"12","anubhūtavān","ANUBHŪT","avān","anubhūtavat","noun-adj",""
"13","ayaṃ","AYAṂ","","idam","pron",""
"14","sa","","","sa_saha","ind",""
"15","suvarṇa","SUVARṆ","a@","suvarṇa","noun-adj",""
"16","prabho","PRABH","o","prabha","noun-adj",""
"17","rāja","RĀJ","a@","rājan","noun-adj",""
"18","kumāra","KUMĀR","a","kumāra","noun-adj",""
"19","samāsato","SAMĀS","ato","samāsa","noun-adj",""
"20","bhikṣava","BHIKṢ","ava","bhikṣu","noun-adj",""
"21","sarvāsu","SARV","āsu","sarvā","noun-adj",""
"22","jātiṣu","JĀT","iṣu","jāti","noun-adj",""
"23","tad","TAD","","tad","pron",""
"24","bhāṣayāmi","BHĀṢ","ayāmi","bhāṣ","verb","bhāṣ"
"25","/","","","","punct",""
"26","saptaratnamayena","SAPTARATNAMAY","ena","saptaratnamaya","noun-adj",""
"27","samanvāgato","SAMANVĀGAT","o","samanvāgata","noun-adj",""
"28","śrī","ŚRĪ","","śrī","noun-adj",""
"29","cakravarti","CAKRAVART","i@","cakravartin","noun-adj",""
"30","rājyaṃ","RĀJY","aṃ","rājya","noun-adj",""
"","</page>","","","","",""
"","<page number=""2r6"">","","","","",""
"","</s>","","","","",""
"","<s number=""13"">","","","","",""
"1","caturdvīpeśvaro","CATURDVĪPEŚVAR","o","caturdvīpeśvara","noun-adj",""
"2","nabhastala","NABHASTAL","a@","nabhastala","noun-adj",""
"3","cara","CAR","a","cara","noun-adj",""
"4","/","","","","punct",""
"5","a","","","alpha_privativum","ind",""
"6","pratihata","PRATIHAT","a@","pratihata","noun-adj",""
"7","cakra","CAKR","a@","cakra","noun-adj",""
"8","ratna","RATN","a@","ratna","noun-adj",""
"9","gati","GAT","i@","gati","noun-adj",""
"10","pracāra","PRACĀR","a","pracāra","noun-adj",""
"11","/","","","","punct",""
"12","adhīśvara","ADHĪŚVAR","a@","adhīśvara","noun-adj",""
"13","ādhipati","ADHIPAT","i","adhipati","noun-adj",""
"14","/","","","","punct",""
"15","śatasahasra","ŚATASAHASR","a@","śatasahasra","noun-adj",""
"16","kṛtvā","KṚT","vā","kṛta","noun-adj",""
"","</page>","","","","",""
"","<page number=""3r1"">","","","","",""
"","</s>","","","","",""
"","<s number=""14"">","","","","",""
"1","caturdvīpeśvaro","CATURDVĪPEŚVAR","o","caturdvīpeśvara","noun-adj",""
"2","rājā","RĀJ","ā","rājan","noun-adj",""
"3","cakravartī","CAKRAVART","ī","cakravartin","noun-adj",""
"4","abhūvu","ABHŪV","u","abhūvu","noun-adj",""
"5","/","","","","punct",""
"6","anen","","","idam","pron",""
"7","^","","","","",""
"8","aiva","","","eva","ind",""
"9","buddha","BUDDH","a@","buddha","noun-adj",""
"10","pratimā","PRATIM","ā@","pratimā","noun-adj",""
"11","puṇya","PUṆY","a@","puṇya","noun-adj",""
"12","phala","PHAL","a@","phala","noun-adj",""
"13","vipākena","VIPĀK","ena","vipāka","noun-adj",""
"14","tath","","","tathā","ind",""
"15","^","","","","",""
"16","aivaṃvidha","EVAṂVIDH","a","evaṃvidha","noun-adj",""
"17","/","","","","punct",""
"","</page>","","","","",""
"","<page number=""3r2"">","","","","",""
"","</s>","","","","",""
"","<s number=""15"">","","","","",""
"1","sa","","","sa_saha","ind",""
"2","kāmāvacareṣu","KĀMĀVACAR","eṣu","kāmāvacara","noun-adj",""
"3","deva","DEV","a@","deva","noun-adj",""
"4","nikāyeṣu","NIKĀY","eṣu","nikāya","noun-adj",""
"5","svargeṣu","SVARG","eṣu","svarga","noun-adj",""
"6","ekaikaśaḥ","EKAIK","aśaḥ","ekaika","noun-adj",""
"7","śatasahasra","ŚATASAHASR","a@","śatasahasra","noun-adj",""
"8","kṛtvā","KṚT","vā","kṛta","noun-adj",""
"9","bhikṣava","BHIKṢ","ava","bhikṣu","noun-adj",""
"10","devānām","DEV","ānām","deva","noun-adj",""
"11","indro","INDR","o","indra","noun-adj",""
"12","rājā","RĀJ","ā","rājan","noun-adj",""
"13","abhūva","ABHŪV","a","abhūva","noun-adj",""
"14","/","","","","punct",""
"","</page>","","","","",""
"","<page number=""3r2"">","","","","",""
"","</s>","","","","",""
"","<s number=""16"">","","","","",""
"1","evaṃvidha","EVAṂVIDH","a","evaṃvidha","noun-adj",""
"2","/","","","","punct",""
"3","śatasahasra","ŚATASAHASR","a@","śatasahasra","noun-adj",""
"4","kṛtvā","KṚT","vā","kṛta","noun-adj",""
"5","daśa","DAŚ","a","daśa","noun-adj",""
"6","brahmakāyikeṣu","BRAHMAKĀYIK","eṣu","brahmakāyika","noun-adj",""
"7","brahma","BRAHM","a@","brahma","noun-adj",""
"8","ādhipatir","ADHIPAT","ir","adhipati","noun-adj",""
"9","abhūvu","ABHŪV","u","abhūvu","noun-adj",""
"10","/","","","","punct",""
"11","anulomapratiloma","ANULOMAPRATILOM","a@","anulomapratiloma","noun-adj",""
"12","janma","JANM","a","janma","noun-adj",""
"13","śatasahasreṣu","ŚATASAHASR","eṣu","śatasahasra","noun-adj",""
"","</page>","","","","",""
"","<page number=""3r4"">","","","","",""
"","</s>","","","","",""
"","<s number=""17"">","","","","",""
"1","koṭi","KOṬ","i","koṭi","noun-adj",""
"2","kṣatriya","KṢATRIY","a@","kṣatriya","noun-adj",""
"3","brāhmaṇa","BRĀHMAṆ","a@","brāhmaṇa","noun-adj",""
"4","eśvara","EŚVAR","a@","eśvara","noun-adj",""
"5","ādhipati","ADHIPAT","i@","adhipati","noun-adj",""
"6","kuleṣu","KUL","eṣu","kul","verb",""
"7","rājā","RĀJ","ā","rājan","noun-adj",""
"8","abhūva","ABHŪV","a","abhūva","noun-adj",""
"9","/","","","","punct",""
"10","evaṃvidhaś","EVAṂVIDH","aś","evaṃvidha","noun-adj",""
"11","ca","","","ca","ind",""
"12","bhikṣava","BHIKṢ","ava","bhikṣu","noun-adj",""
"13","/","","","","punct",""
"14","saubhāgya","SAUBHĀGY","a@","saubhāgya","noun-adj",""
"15","kānti","KĀNT","i@","kānti","noun-adj",""
"16","dyuti","DYUT","i@","dyuti","noun-adj",""
"17","kīrti","KĪRT","i@","kīrti","noun-adj",""
"18","yaśo","YAŚO","a@","yaśoa","noun-adj",""
"19","bala","BAL","a@","bala","noun-adj",""
"20","samanvāgata","SAMANVĀGAT","a","samanvāgata","noun-adj",""
"","</page>","","","","",""
"","<page number=""3r5"">","","","","",""
"","</s>","","","","",""
"","<s number=""18"">","","","","",""
"1","svargā","SVARG","ā","svarga","noun-adj",""
"2","cyuta","CYUT","a","cyuta","noun-adj",""
"3","/","","","","punct",""
"4","aiśvaryeṣu","AIŚVARY","eṣu","aiśvarya","noun-adj",""
"5","rāja","RĀJ","a@","rājan","noun-adj",""
"6","kule","KUL","e","kula","noun-adj",""
"7","jātaḥ","JĀT","aḥ","jāta","noun-adj",""
"8","uttama","UTTAM","a@","uttama","noun-adj",""
"9","jāta","JĀT","a","jāta","noun-adj",""
"10","anuttama","ANUTTAM","a@","anuttama","noun-adj",""
"11","jāta","JĀT","a","jāta","noun-adj",""
"12","/","","","","punct",""
"","</page>","","","","",""
"","<page number=""3r6"">","","","","",""
"","</s>","","","","",""
"","<s number=""19"">","","","","",""
"1","suvarṇaprabho","SUVARṆAPRABH","o","suvarṇaprabha","noun-adj",""
"2","rāja","RĀJ","a@","rājan","noun-adj",""
"3","kumāraḥ","KUMĀR","aḥ","kumāra","noun-adj",""
"4","antike","ANTIK","e","antika","noun-adj",""
"5","deva","DEV","a@","deva","noun-adj",""
"6","manuṣyāṇāṃ","MANUṢY","āṇāṃ","manuṣya","noun-adj",""
"7","a","","","alpha_privativum","ind",""
"8","cyutaṃ","CYUT","aṃ","cyuta","noun-adj",""
"9","a","","","alpha_privativum","ind",""
"10","jaraṃ","JAR","aṃ","jarā","noun-adj",""
"11","a","","","alpha_privativum","ind",""
"12","maraṇaṃ","MARAṆ","aṃ","maraṇa","noun-adj",""
"13","śivaṃ","ŚIV","aṃ","śiva","noun-adj",""
"14","śāntaṃ","ŚĀNT","aṃ","śānta","noun-adj",""
"15","padaṃ","PAD","aṃ","pada","noun-adj",""
"16","labhiṣyati","LABH","iṣyati","labh","verb","labh"
"17","iti","","","iti","ind",""
"18","/","","","","punct",""
"19","tato","","","tatas","ind",""
"","</page>","","","","",""
"","<page number=""3r7"">","","","","",""
"","</s>","","","","",""
"","<s number=""20"">","","","","",""
"1","asya","","","idam","pron",""
"2","bhikṣava","BHIKṢ","ava","bhikṣu","noun-adj",""
"3","suvarṇaprabhasya","SUVARṆAPRABH","asya","suvarṇaprabha","noun-adj",""
"4","rāja","RĀJ","a@","rājan","noun-adj",""
"5","kumārasya","KUMĀR","asya","kumāra","noun-adj",""
"6","buddha","BUDDH","a@","buddha","noun-adj",""
"7","pratimā","PRATIM","ā@","pratimā","noun-adj",""
"8","puṇya","PUṆY","a@","puṇya","noun-adj",""
"9","phala","PHAL","a@","phala","noun-adj",""
"10","prabhāvam","PRABHĀV","am","prabhāva","noun-adj",""
"11","anuśṛṇutā","ANUŚṚṆ","utā","anuśṛṇ","verb","anuśru"
"12","mānuṣya","MĀNUṢY","a@","mānuṣya","noun-adj",""
"13","jātiṣu","JĀT","iṣu","jāti","noun-adj",""
"14","yeṣu","","","yad","pron",""
"","</page>","","","","",""
"","<page number=""3v1"">","","","","",""
"","</s>","","","","",""
"","<s number=""21"">","","","","",""
"1","ātma","ĀTM","a@","ātman","noun-adj",""
"2","hita","HIT","a@","hita","noun-adj",""
"3","parahita","PARAHIT","a@","parahita","noun-adj",""
"4","kāmena","KĀM","ena","kāma","noun-adj",""
"5","nāma","NĀM","a","nāman","noun-adj",""
"6","bhikṣava","BHIKṢ","ava","bhikṣu","noun-adj",""
"7","buddha","BUDDH","a@","buddha","noun-adj",""
"8","pratimā","PRATIM","ā","pratimā","noun-adj",""
"9","nikaraṇīyā","NIKARAṆ","īyā","nikaraṇa","noun-adj",""
"10","/","","","","punct",""
"11","tadyathā","","","tadyathā","ind",""
"12","bhikṣava","BHIKṢ","ava","bhikṣu","noun-adj",""
"13","/","","","","punct",""
"14","mṛnmayī","MṚNMAY","ī","mṛnmaya","noun-adj",""
"15","vā","","","vā","ind",""
"16","/","","","","punct",""
"","</page>","","","","",""
"","<page number=""3v2"">","","","","",""
"","</s>","","","","",""
"","<s number=""22"">","","","","",""
"1","śaila","ŚAIL","a@","śaila","noun-adj",""
"2","mayī","MAY","ī","mayī","noun-adj",""
"3","vā","","","vā","ind",""
"4","/","","","","punct",""
"5","danta","DANT","a@","danta","noun-adj",""
"6","mayī","MAY","ī","mayī","noun-adj",""
"7","vā","","","vā","ind",""
"8","/","","","","punct",""
"9","dārumayī","DĀRUMAY","ī","dārumaya","noun-adj",""
"10","vā","","","vā","ind",""
"11","/","","","","punct",""
"12","suvarṇa","SUVARṆ","a@","suvarṇa","noun-adj",""
"13","mayī","MAY","ī","mayī","noun-adj",""
"14","vā","","","vā","ind",""
"15","/","","","","punct",""
"16","kaṃsa","KAṂS","a@","kaṃsa","noun-adj",""
"17","mayī","MAY","ī","mayī","noun-adj",""
"18","vā","","","vā","ind",""
"19","/","","","","punct",""
"20","tra+++mayī","TRA+++MAY","ī","CORRUPTED","noun-adj",""
"21","vā","","","vā","ind",""
"22","/","","","","punct",""
"23","rupya","RUPY","a@","rupyati","noun-adj",""
"24","mayī","MAY","ī","mayī","noun-adj",""
"","</page>","","","","",""
"","<page number=""3v3"">","","","","",""
"","</s>","","","","",""
"","<s number=""23"">","","","","",""
"1","vā","","","vā","ind",""
"2","sphaṭika","SPHAṬIK","a@","sphaṭika","noun-adj",""
"3","mayī","MAY","ī","mayī","noun-adj",""
"4","vā","","","vā","ind",""
"5","/","","","","punct",""
"6","maṇi","MAṆ","i@","maṇi","noun-adj",""
"7","ratnaka","RATN","aka@","ratnaka","noun-adj",""
"8","mayī","MAY","ī","mayī","noun-adj",""
"9","vā","","","vā","ind",""
"10","/","","","","punct",""
"11","rīta","RĪT","a@","rīti","noun-adj",""
"12","mayī","MAY","ī","mayī","noun-adj",""
"13","vā","","","vā","ind",""
"14","/","","","","punct",""
"15","buddha","BUDDH","a@","buddha","noun-adj",""
"16","pratimā","PRATIM","ā","pratimā","noun-adj",""
"17","karaṇīyakā","KARAṆĪY","akā","karaṇīya","noun-adj",""
"18","vā","","","vā","ind",""
"19","/","","","","punct",""
"20","dīrghakā","DĪRGH","akā","dīrghā","noun-adj",""
"21","vā","","","vā","ind",""
"22","/","","","","punct",""
"23","hra","HRA","","hra","noun-adj",""
"24","sva","","","sva","ind",""
"25","kāṃ","","","kim","pron",""
"","</page>","","","","",""
"","<page number=""3v4"">","","","","",""
"","</s>","","","","",""
"","<s number=""24"">","","","","",""
"1","vā","","","vā","ind",""
"2","/","","","","punct",""
"3","sa","","","sa_saha","ind",""
"4","dhātukaṃ","DHĀTUK","aṃ","dhātuka","noun-adj",""
"5","vā","","","vā","ind",""
"6","/","","","","punct",""
"7","sa","","","sa_saha","ind",""
"8","pratītyasamutpādaṃ","PRATĪTYASAMUTPĀD","aṃ","pratītyasamutpāda","noun-adj",""
"9","vā","","","vā","ind",""
"10","/","","","","punct",""
"11","buddha","BUDDH","a@","buddha","noun-adj",""
"12","pratimā","PRATIM","ā","pratimā","noun-adj",""
"13","kārayitvā","KĀRAY","itvā","kāraya","noun-adj",""
"14","/","","","","punct",""
"15","sthāpayitvā","STHĀP","ayitvā","tiṣṭh","verb","sthā"
"16","gandha","GANDH","a@","gandha","noun-adj",""
"17","odaka","ODAK","a@","odaka","noun-adj",""
"18","puṣpa","PUṢP","a@","puṣpa","noun-adj",""
"19","odaka","ODAK","a@","odaka","noun-adj",""
"20","ādibhiḥ","ĀD","ibhiḥ","ādi","noun-adj",""
"","</page>","","","","",""
"","<page number=""3v5"">","","","","",""
"","</s>","","","","",""
"","<s number=""25"">","","","","",""
"1","pūjā","PŪJ","ā@","pūjā","noun-adj",""
"2","viśeṣai","VIŚEṢ","ai","viśeṣa","noun-adj",""
"3","/","","","","punct",""
"4","snāpayitvā","SNĀP","ayitvā","snāpa","noun-adj",""
"5","pūjayitvā","PŪJ","ayitvā","pūj","verb","pūj"
"6","yasya","","","yad","pron",""
"7","kasyacid","KASYACID","","kimcit","noun-adj",""
"8","bhikṣavaḥ","BHIKṢ","avaḥ","bhikṣu","noun-adj",""
"9","kulaputrasya","KULAPUTR","asya","kulaputra","noun-adj",""
"10","vā","","","vā","ind",""
"11","kuladuhitur","KULADUHIT","ur","kuladuhitṛ","noun-adj",""
"12","vā","","","vā","ind",""
"13","buddha","BUDDH","a@","buddha","noun-adj",""
"14","pratimā","PRATIM","ā@","pratimā","noun-adj",""
"15","puṇya","PUṆY","a@","puṇya","noun-adj",""
"16","phala","PHAL","a@","phala","noun-adj",""
"17","niṣyanda","NIṢYAND","a","niṣyanda","noun-adj",""
"18","/","","","","punct",""
"","</page>","","","","",""
"","<page number=""3v6"">","","","","",""
"","</s>","","","","",""
"","<s number=""26"">","","","","",""
"1","puṇya","PUṆY","a@","puṇya","noun-adj",""
"2","skandhaḥ","SKANDH","aḥ","skandha","noun-adj",""
"3","puṇyarāśi","PUṆYARĀŚ","i","puṇyarāśi","noun-adj",""
"4","a","","","alpha_privativum","ind",""
"5","prameya","PRAMEY","a","prameya","noun-adj",""
"6","a","","","alpha_privativum","ind",""
"7","sādharaṇa","SĀDHARAṆ","a","sādharaṇa","noun-adj",""
"8","/","","","","punct",""
"9","ananty","ANANT","y@","ananti","noun-adj",""
"10","upama","UPAM","a","upama","noun-adj",""
"11","/","","","","punct",""
"12","puṇya","PUṆY","a@","puṇya","noun-adj",""
"13","skandha","SKANDH","a","skandha","noun-adj",""
"14","^","","","","",""
"15","eti","","","iti","ind",""
"16","punar","","","punar","ind",""
"17","aparaṃ","APAR","aṃ","apara","noun-adj",""
"18","bhikṣava","BHIKṢ","ava","bhikṣu","noun-adj",""
"19","/","","","","punct",""
"","</page>","","","","",""
"","<page number=""3v7"">","","","","",""
"","</s>","","","","",""
"","<s number=""27"">","","","","",""
"1","yaḥ","","","yad","pron",""
"2","kaścid","","","kimcit","ind",""
"3","bhikṣur","BHIKṢ","ur","bhikṣu","noun-adj",""
"4","vā","","","vā","ind",""
"5","bhikṣuṇī","BHIKṢ","uṇī","bhikṣuṇī","noun-adj",""
"6","vā","","","vā","ind",""
"7","upāsako","UPĀSAK","o","upāsaka","noun-adj",""
"8","vā","","","vā","ind",""
"9","upāsikā","UPĀSIK","ā","upāsikā","noun-adj",""
"10","vā","","","vā","ind",""
"11","/","","","","punct",""
"12","kṣatriyo","KṢATRIY","o","kṣatriya","noun-adj",""
"13","vā","","","vā","ind",""
"14","brāhmaṇo","BRĀHMAṆ","o","brāhmaṇa","noun-adj",""
"15","vā","","","vā","ind",""
"16","/","","","","punct",""
"17","vaiśyo","VAIŚY","o","vaiśya","noun-adj",""
"18","vā","","","vā","ind",""
"19","/","","","","punct",""
"20","śūdro","ŚŪDR","o","śūdra","noun-adj",""
"21","vā","","","vā","ind",""
"22","evaṃ","","","eva","ind",""
"23","rūpāsu","RŪP","āsu","rūp","verb",""
"","</page>","","","","",""
"","<page number=""4r1"">","","","","",""
"","</s>","","","","",""
"","<s number=""28"">","","","","",""
"1","jātiṣu","JĀT","iṣu","jāti","noun-adj",""
"2","/","","","","punct",""
"3","śruti","ŚRUT","i@","śruti","noun-adj",""
"4","dharo","DHAR","o","dhara","noun-adj",""
"5","bhavati","BHAV","ati","bhav","verb","bhū"
"6","/","","","","punct",""
"7","jāti","JĀT","i@","jāti","noun-adj",""
"8","smaro","SMAR","o","smara","noun-adj",""
"9","bhavati","BHAV","ati","bhav","verb","bhū"
"10","/","","","","punct",""
"11","sva","SV","a@","sva","noun-adj",""
"12","jana","JAN","a@","jana","noun-adj",""
"13","parijana","PARIJAN","a@","parijana","noun-adj",""
"14","dāsī","DĀS","ī@","dāsī","noun-adj",""
"15","dāsa","DĀS","a@","dāsa","noun-adj",""
"16","karma","KARM","a@","karman","noun-adj",""
"17","kara","KAR","a@","kara","noun-adj",""
"18","pauruṣeya","PAURUṢEY","a@","pauruṣeya","noun-adj",""
"19","prabhṛtiṣu","PRABHṚT","iṣu","prabhṛti","noun-adj",""
"20","sa","","","sa_saha","ind",""
"21","ādeya","ĀDEY","a@","ādeya","noun-adj",""
"22","vādyo","VĀDY","o","vādya","noun-adj",""
"23","bhavati","BHAV","ati","bhav","verb","bhū"
"24","/","","","","punct",""
"","</page>","","","","",""
"","<page number=""4r2"">","","","","",""
"","</s>","","","","",""
"","<s number=""29"">","","","","",""
"1","sarva","SARV","a@","sarva","noun-adj",""
"2","satva","SATTV","a@","sattva","noun-adj",""
"3","priya","PRIY","a@","priya","noun-adj",""
"4","darśan","DARŚ","an","darśat","noun-adj",""
"5","adharo","ADHAR","o","adhara","noun-adj",""
"6","bhavati","BHAV","ati","bhav","verb","bhū"
"7","/","","","","punct",""
"8","sarva","SARV","a@","sarva","noun-adj",""
"9","guṇa","GUṆ","a@","guṇa","noun-adj",""
"10","lakṣaṇa","LAKṢAṆ","a@","lakṣaṇa","noun-adj",""
"11","dharo","DHAR","o","dhara","noun-adj",""
"12","bhavati","BHAV","ati","bhav","verb","bhū"
"13","sarva","SARV","a@","sarva","noun-adj",""
"14","satva","SATTV","a@","sattva","noun-adj",""
"15","ādhipatir","ADHIPAT","ir","adhipati","noun-adj",""
"16","bhavati","BHAV","ati","bhav","verb","bhū"
"17","/","","","","punct",""
"18","sarva","SARV","a@","sarva","noun-adj",""
"19","buddha","BUDDH","a@","buddha","noun-adj",""
"20","pratyekabuddha","PRATYEKABUDDH","a@","pratyekabuddha","noun-adj",""
"21","śrāvaka","ŚRĀVAK","a@","śrāvaka","noun-adj",""
"22","ārhad","ARH","ad","arhat","noun-adj",""
"23","guṇa","GUṆ","a","guṇa","noun-adj",""
"24","samāgato","SAMĀGAT","o","samāgata","noun-adj",""
"","</page>","","","","",""
"","<page number=""4r3"">","","","","",""
"","</s>","","","","",""
"","<s number=""30"">","","","","",""
"1","bhavati","BHAV","ati","bhav","verb","bhū"
"2","/","","","","punct",""
"3","nityaṃ","NITY","aṃ","nitya","noun-adj",""
"4","bodhicitta","BODHICITT","a@","bodhicitta","noun-adj",""
"5","parāyaṇo","PARĀYAṆ","o","parāyaṇa","noun-adj",""
"6","bhavati","BHAV","ati","bhav","verb","bhū"
"7","/","","","","punct",""
"8","yasya","","","yad","pron",""
"9","yatr","","","yatra","ind",""
"10","^","","","","",""
"11","ābhikāṃkṣati","ĀBHIKĀṂKṢ","ati","ābhikāṃkṣat","noun-adj",""
"12","/","","","","punct",""
"13","tatra","","","tatra","ind",""
"14","tatra","","","tatra","ind",""
"15","etaṃ","","","tad","pron",""
"16","labhati","LABH","ati","labh","verb","labh"
"17","/","","","","punct",""
"18","rāga","RĀG","a@","rāga","noun-adj",""
"19","dveṣa","DVEṢ","a@","dveṣa","noun-adj",""
"20","moha","MOH","a@","moha","noun-adj",""
"21","erṣyā","IRṢY","ā@","irṣyā","noun-adj",""
"22","mātsarya","MĀTSARY","a@","mātsarya","noun-adj",""
"23","lobha","LOBH","a@","lobha","noun-adj",""
"24","tṛṣṇa","TṚṢṆ","a@","tṛṣṇa","noun-adj",""
"25","ādi","ĀD","i@","ādi","noun-adj",""
"26","kleśa","KLEŚ","a@","kleśa","noun-adj",""
"27","ādibhi","ĀD","ibhi","ādi","noun-adj",""
"28","/","","","","punct",""
"","</page>","","","","",""
"","<page number=""4r4"">","","","","",""
"","</s>","","","","",""
"","<s number=""31"">","","","","",""
"1","vivarjito","VIVARJIT","o","vivarjita","noun-adj",""
"2","bhavati","BHAV","ati","bhav","verb","bhū"
"3","/","","","","punct",""
"4","buddhatvam","BUDDH","atvam","buddhatva","noun-adj",""
"5","anvantaram","ANVANTAR","am","anvantara","noun-adj",""
"6","adhigacchati","ADHIGACCH","ati","adhigacch","verb","adhigam"
"7","/","","","","punct",""
"8","kṣipraṃ","KṢIPR","aṃ","kṣipra","noun-adj",""
"9","ca","","","ca","ind",""
"10","parinirvāṇaṃ","PARINIRVĀṆ","aṃ","parinirvāṇa","noun-adj",""
"11","śāntam","ŚĀNT","am","śānta","noun-adj",""
"12","adhigacchati","ADHIGACCH","ati","adhigacch","verb","adhigam"
"13","iti","","","iti","ind",""
"14","vadāmi","VAD","āmi","vad","verb","vad"
"15","bhikṣavaḥ","BHIKṢ","avaḥ","bhikṣu","noun-adj",""
"","</page>","","","","",""
"","<page number=""4r5"">","","","","",""
"","</s>","","","","",""
"","<s number=""32"">","","","","",""
"1","tat","TAT","","tad","pron",""
"2","kasmād","KASMĀD","","kimcit","noun-adj",""
"3","hetor","HET","or","hetu","noun-adj",""
"4","ananta","ANANT","a@","ananta","noun-adj",""
"5","phala","PHAL","a@","phala","noun-adj",""
"6","samudaya","SAMUDAY","a@","samudaya","noun-adj",""
"7","prabhāva","PRABHĀV","a","prabhāva","noun-adj",""
"8","/","","","","punct",""
"9","buddha","BUDDH","a@","buddha","noun-adj",""
"10","pratimā","PRATIM","ā@","pratimā","noun-adj",""
"11","puṇya","PUṆY","a@","puṇya","noun-adj",""
"12","phala","PHAL","a@","phala","noun-adj",""
"13","samudaya","SAMUDAY","a@","samudaya","noun-adj",""
"14","prabhāvam","PRABHĀV","am","prabhāva","noun-adj",""
"15","buddha","BUDDH","a@","buddha","noun-adj",""
"16","pratimā","PRATIM","ā@","pratimā","noun-adj",""
"17","puṇya","PUṆY","a@","puṇya","noun-adj",""
"18","phala","PHAL","a@","phala","noun-adj",""
"19","vipāka","VIPĀK","a","vipāka","noun-adj",""
"","</page>","","","","",""
"","<page number=""4r6"">","","","","",""
"","</s>","","","","",""
"","<s number=""33"">","","","","",""
"1","parinirvṛto","PARINIRVṚT","o","parinirvṛta","noun-adj",""
"2","api","","","api","ind",""
"3","adhigato","ADHIGAT","o","adhigata","noun-adj",""
"4","n","","","na","ind",""
"5","^","","","","",""
"6","āpi","","","api","ind",""
"7","buddho","BUDDH","o","buddha","noun-adj",""
"8","bhagavāṃ","BHAGAV","āṃ","bhagavat","noun-adj",""
"9","parinirvṛta","PARINIRVṚT","a","parinirvṛta","noun-adj",""
"10","iva","","","iva","ind",""
"11","buddha","BUDDH","a@","buddha","noun-adj",""
"12","pratimāyā","PRATIMĀY","ā","pratimāyā","noun-adj",""
"13","darśanād","DARŚAN","ād","darśana","noun-adj",""
"14","iti","","","iti","ind",""
"15","vadāmi","VAD","āmi","vad","verb","vad"
"16","bhikṣava","BHIKṢ","ava","bhikṣu","noun-adj",""
"17","idam","IDAM","","idam","pron",""
"18","avocad","AVOCAD","","vak","verb","vac"
"19","bhagavāṃ","BHAGAV","āṃ","bhagavat","noun-adj",""
"","</page>","","","","",""
"","<page number=""4r7"">","","","","",""
"","</s>","","","","",""
"","<s number=""34"">","","","","",""
"1","tathā","","","tathā","ind",""
"2","paraṃ","PAR","aṃ","para","noun-adj",""
"3","gāthāṃ","GĀTH","āṃ","gāthā","noun-adj",""
"4","bhāṣate","BHĀṢ","ate","bhāṣ","verb","bhāṣ"
"5","/","","","","punct",""
"6","kṛtvā","KṚT","vā","kṛta","noun-adj",""
"7","purā","PUR","ā","purā","noun-adj",""
"8","kāśyapa","KĀŚYAP","a@","kāśyapa","noun-adj",""
"9","biṃbam","BIMB","am","bimba","noun-adj",""
"10","agryaṃ","AGRY","aṃ","agrya","noun-adj",""
"11","gandha","GANDH","a@","gandha","noun-adj",""
"12","odakai","ODAK","ai","odaka","noun-adj",""
"13","snāpitavāṃ","SNĀPIT","avāṃ","snāpita","noun-adj",""
"14","dvija","DVIJ","a@","dvija","noun-adj",""
"15","endraḥ","INDR","aḥ","indra","noun-adj",""
"16","/","","","","punct",""
"","</page>","","","","",""
"","<page number=""4v1"">","","","","",""
"","</s>","","","","",""
"","<s number=""35"">","","","","",""
"1","puṣpai","PUṢP","ai","puṣpa","noun-adj",""
"2","sugandhais","SUGANDH","ais","sugandha","noun-adj",""
"3","su","","","su","ind",""
"4","manojña","MANOJÑ","a@","manojña","noun-adj",""
"5","gandhai","GANDH","ai","gandha","noun-adj",""
"6","ten","","","tad","pron",""
"7","^","","","","",""
"8","aiva","","","eva","ind",""
"9","puṇyena","PUṆY","ena","puṇya","noun-adj",""
"10","bhavād","BHAV","ād","bhava","noun-adj",""
"11","vimuktaḥ","VIMUKT","aḥ","vimukta","noun-adj",""
"12","1","","","","ind",""
"13","yaṃ","","","yad","pron",""
"14","nirmalaḥ","NIRMAL","aḥ","nirmala","noun-adj",""
"15","kleśa","KLEŚ","a@","kleśa","noun-adj",""
"16","malair","MAL","air","mala","noun-adj",""
"17","vimukta","VIMUKT","a","vimukta","noun-adj",""
"18","cittasya","CITT","asya","citta","noun-adj",""
"19","citta","CITT","a@","citta","noun-adj",""
"20","eśvaratā","EŚVAR","atā","eśvaratā","noun-adj",""
"21","gatiṃ","GAT","iṃ","gati","noun-adj",""
"22","syaḥ","","","","ind",""
"23","rūpaṃ","RŪP","aṃ","rūpa","noun-adj",""
"24","na","","","na","ind",""
"25","tṛptāś","TṚPT","āś","tṛpta","noun-adj",""
"26","ca","","","ca","ind",""
"27","nirīkṣya","NIRĪKṢY","a","nirīkṣya","noun-adj",""
"28","matvā","","","","ind",""
"29","tad","TAD","","tad","pron",""
"30","biṃba","BIMB","a","bimba","noun-adj",""
"31","saṃsnāpayat","SAṂSNĀPAY","at","saṃsnāpayat","noun-adj",""
"32","jinasya","JIN","asya","jina","noun-adj",""
"33","2","","","","ind",""
"","</page>","","","","",""
"","<page number=""4v2"">","","","","",""
"","</s>","","","","",""
"","<s number=""36"">","","","","",""
"1","vicitra","VICITR","a@","vicitra","noun-adj",""
"2","bhogā","BHOG","ā","bhogā","noun-adj",""
"3","vividha","VIVIDH","a@","vividha","noun-adj",""
"4","prakārā","PRAKĀR","ā","prakāra","noun-adj",""
"5","candra","CANDR","a@","candra","noun-adj",""
"6","ārka","ARK","a@","arka","noun-adj",""
"7","saumya","SAUMY","a@","saumya","noun-adj",""
"8","ādhika","ADHIK","a@","adhika","noun-adj",""
"9","teja","TEJ","a@","teja","noun-adj",""
"10","śobhā","ŚOBH","ā","śobhā","noun-adj",""
"11","/","","","","punct",""
"12","labhanti","LABH","anti","labh","verb","labh"
"13","nāryaḥ","NĀRY","aḥ","nārya","noun-adj",""
"14","puruṣāś","PURUṢ","āś","puruṣa","noun-adj",""
"15","ca","","","ca","ind",""
"16","loke","LOK","e","loka","noun-adj",""
"17","tad","TAD","","tad","pron",""
"18","biṃba","BIMB","a","bimba","noun-adj",""
"19","saṃsnāpayato","SAṂSNĀPAY","ato","saṃsnāpaya","noun-adj",""
"20","jinasya","JIN","asya","jina","noun-adj",""
"21","3","","","","ind",""
"","</page>","","","","",""
"","<page number=""4v3"">","","","","",""
"","</s>","","","","",""
"","<s number=""37"">","","","","",""
"1","kleśa","KLEŚ","a@","kleśa","noun-adj",""
"2","āndhakāra","ANDHAKĀR","a@","andhakāra","noun-adj",""
"3","ādi","ĀD","i@","ādi","noun-adj",""
"4","vimukta","VIMUKT","a@","vimukta","noun-adj",""
"5","cittā","CITT","ā","citta","noun-adj",""
"6","moha","MOH","a@","moha","noun-adj",""
"7","āndhakārā","ANDHAKĀR","ā@","andhakāra","noun-adj",""
"8","divi","DIV","i@","divi","noun-adj",""
"9","pūrṇacandra","PŪRṆACANDR","a","pūrṇacandra","noun-adj",""
"10","/","","","","punct",""
"11","śāntaṃ","ŚĀNT","aṃ","śānta","noun-adj",""
"12","padaṃ","PAD","aṃ","pada","noun-adj",""
"13","yānti","YĀ","nti","yā","noun-adj",""
"14","narā","NAR","ā","nara","noun-adj",""
"15","striyo","STR","iyo","strī","noun-adj",""
"16","vā","","","vā","ind",""
"17","tad","TAD","","tad","pron",""
"18","biṃba","BIMB","a","bimba","noun-adj",""
"19","saṃsnāpayato","SAṂSNĀPAY","ato","saṃsnāpaya","noun-adj",""
"20","jinasya","JIN","asya","jina","noun-adj",""
"21","4","","","","ind",""
"","</page>","","","","",""
"","<page number=""4v4"">","","","","",""
"","</s>","","","","",""
"","<s number=""38"">","","","","",""
"1","tyaktvā","TYAKT","vā","tyakta","noun-adj",""
"2","kaḍevaram","KAḌEVAR","am","kaḍevara","noun-adj",""
"3","ih","","","iha","ind",""
"4","^","","","","",""
"5","aiva","","","eva","ind",""
"6","narā","NAR","ā","nara","noun-adj",""
"7","striyo","STR","iyo","strī","noun-adj",""
"8","vā","","","vā","ind",""
"9","svarge","SVARG","e","svarga","noun-adj",""
"10","prayāti","PRAYĀT","i","prayāti","noun-adj",""
"11","bahu","BAH","u@","bahu","noun-adj",""
"12","kalpa","KALP","a@","kalpa","noun-adj",""
"13","śatai","ŚAT","ai","śata","noun-adj",""
"14","su","","","su","ind",""
"15","nirvṛtte","NIRVṚT","te","nirvṛta","noun-adj",""
"16","prāpnuvanty","PRĀPN","uvanty","prāpn","verb","prāp"
"17","anupamaṃ","ANUPAM","aṃ","anupama","noun-adj",""
"18","sukham","SUKH","am","sukha","noun-adj",""
"19","apsarebhi","APSAR","ebhi","apsara","noun-adj",""
"","</page>","","","","",""
"","<page number=""4v5"">","","","","",""
"","</s>","","","","",""
"","<s number=""39"">","","","","",""
"1","viśvasya","VIŚV","asya","viśva","noun-adj",""
"2","tat","TAT","","tad","pron",""
"3","phalam","PHAL","am","phala","noun-adj",""
"4","udāram","UDĀR","am","udāra","noun-adj",""
"5","uvāca","UVĀC","a","vak","verb","vac"
"6","buddhaḥ","BUDDH","aḥ","buddha","noun-adj",""
"7","5","","","","ind",""
"8","śrī","ŚR","ī@","śrī","noun-adj",""
"9","kānti","KĀNT","i@","kānti","noun-adj",""
"10","divya","DIVY","a@","divya","noun-adj",""
"11","salilo","SALIL","o","salila","noun-adj",""
"12","guṇa","GUṆ","a@","guṇa","noun-adj",""
"13","rūpa","RŪP","a@","rūpa","noun-adj",""
"14","śobhā","ŚOBH","ā","śobhā","noun-adj",""
"15","saubhāgya","SAUBHĀGY","a@","saubhāgya","noun-adj",""
"16","bhāgye","BHĀGY","e","bhāgya","noun-adj",""
"17","vara","VAR","a@","vara","noun-adj",""
"18","saukhya","SAUKHY","a@","saukhya","noun-adj",""
"19","paṭutva","PAṬ","utva","paṭu","noun-adj",""
"20","vākya","VĀKY","a","vākya","noun-adj",""
"21","/","","","","punct",""
"","</page>","","","","",""
"","<page number=""4v6"">","","","","",""
"","</s>","","","","",""
"","<s number=""40"">","","","","",""
"1","āditya","ĀDITY","a@","āditya","noun-adj",""
"2","candra","CANDR","a@","candra","noun-adj",""
"3","kiraṇā","KIRAṆ","ā","kiraṇā","noun-adj",""
"4","iva","","","iva","ind",""
"5","saumya","SAUMY","a@","saumya","noun-adj",""
"6","tejā","TEJ","ā","teja","noun-adj",""
"7","—","","","","punct",""
"8","buddha","BUDDH","a@","buddha","noun-adj",""
"9","biṃba","BIMB","a@","bimba","noun-adj",""
"10","karaṇā","KARAṆ","ā","karaṇā","noun-adj",""
"11","labhate","LABH","ate","labh","verb","labh"
"12","manuṣyaḥ","MANUṢY","aḥ","manuṣya","noun-adj",""
"13","6","","","","ind",""
"14","yāvantaḥ","","","","ind",""
"15","paramāṇavo","PARAMĀṆ","avo","paramāṇu","noun-adj",""
"16","bhagavata","BHAGAV","ata","bhagavat","noun-adj",""
"17","stūpeṣu","STŪP","eṣu","stūpa","noun-adj",""
"18","biṃbasya","BIMB","asya","bimba","noun-adj",""
"19","vā","","","vā","ind",""
"20","/","","","","punct",""
"","</page>","","","","",""
"","<page number=""4v7"">","","","","",""
"","</s>","","","","",""
"","<s number=""41"">","","","","",""
"1","tat","TAT","","tad","pron",""
"2","kartum","KART","um","kar","verb","kṛ"
"3","divi","DIV","i","divi","noun-adj",""
"4","bhūta","BHŪT","a@","bhūta","noun-adj",""
"5","leca","LEC","a","leca","noun-adj",""
"6","niyataṃ","NIYAT","aṃ","niyata","noun-adj",""
"7","tavanti","","","","ind",""
"8","rājyāni","RĀJY","āni","rājya","noun-adj",""
"9","te","","","tad","pron",""
"10","/","","","","punct",""
"11","buddhānāṃ","BUDDH","ānāṃ","buddha","noun-adj",""
"12","khalu","KHAL","u","khal","verb",""
"13","dhātave","DHĀT","ave","dhātu","noun-adj",""
"14","bhagavatā","BHAGAV","atā","bhagavat","noun-adj",""
"15","śarīrāni","ŚARĪR","āni","śarīra","noun-adj",""
"16","ca","","","ca","ind",""
"17","nirmitā","NIRMIT","ā","nirmita","noun-adj",""
"18","/","","","","punct",""
"","</page>","","","","",""
"","<page number=""5r1"">","","","","",""
"","</s>","","","","",""
"","<s number=""42"">","","","","",""
"1","ekaika","EKAIK","a@","ekaika","noun-adj",""
"2","ādbhuta","ADBHUT","a@","adbhuta","noun-adj",""
"3","puṇyarāśi","PUṆYARĀŚ","i@","puṇyarāśi","noun-adj",""
"4","janitair","JANIT","air","janita","noun-adj",""
"5","ekaika","EKAIK","a@","ekaika","noun-adj",""
"6","sūkṣma","SŪKṢM","a@","sūkṣma","noun-adj",""
"7","āṇubhi","ĀṆ","ubhi","āṇi","noun-adj",""
"8","/","","","","punct",""
"9","7","","","","ind",""
"10","trailokya","TRAILOKY","a@","trailokya","noun-adj",""
"11","yaśasya","YAŚASY","a","yaśasya","noun-adj",""
"12","biṃbaṃ","BIMB","aṃ","bimba","noun-adj",""
"13","daśabala","DAŚABAL","a@","daśabala","noun-adj",""
"14","balinā","BAL","inā","bali","noun-adj",""
"15","dikṣu","DIK","ṣu","dik","noun-adj",""
"16","vikhyāta","VIKHYĀT","a@","vikhyāta","noun-adj",""
"17","kīrte","KĪRT","e","kīrti","noun-adj",""
"18","/","","","","punct",""
"19","ye","","","yad","pron",""
"20","martyāḥ","MARTY","āḥ","martya","noun-adj",""
"21","kārayitvā","KĀRA","yitvā","kārā","noun-adj",""
"22","pramudita","PRAMUDIT","a@","pramudita","noun-adj",""
"23","manasā","MAN","asā","manas","noun-adj",""
"24","pūjayante","PŪJ","ayante","pūj","verb","pūj"
"25","yathāvat","YATHĀVAT","","yathāvat","noun-adj",""
"","</page>","","","","",""
"","<page number=""5r2"">","","","","",""
"","</s>","","","","",""
"","<s number=""43"">","","","","",""
"1","svarge","SVARG","e","svarga","noun-adj",""
"2","saktye","SAKT","ye","sakta","noun-adj",""
"3","ca","","","ca","ind",""
"4","rūpaṃ","RŪP","aṃ","rūpa","noun-adj",""
"5","nayana","NAYAN","a@","nayana","noun-adj",""
"6","ratikaraṃ","RATIKAR","aṃ","ratikara","noun-adj",""
"7","śuddha","ŚUDDH","a@","śuddha","noun-adj",""
"8","cāmīkarābham","CĀMĪKAR","ābham","cāmīkara","noun-adj",""
"9","te","","","tad","pron",""
"10","labdhāś","LABDH","āś","labdha","noun-adj",""
"11","śāntikā","ŚĀNTIK","ā","śāntika","noun-adj",""
"12","mā","","","mā","ind",""
"13","sukham","SUKH","am","sukha","noun-adj",""
"14","idam","IDAM","","idam","pron",""
"15","a","","","alpha_privativum","ind",""
"16","tulaṃ","TUL","aṃ","tula","noun-adj",""
"17","prāpnuvanty","PRĀPN","uvanty","prāpn","verb","prāp"
"18","āvajuṣṭaṃ","AVAJUṢṬ","aṃ","avajuṣṭa","noun-adj",""
"19","//","","","","punct",""
"20","8","","","","ind",""
"","</page>","","","","",""
"","<page number=""5r3"">","","","","",""
"","</s>","","","","",""
"","<s number=""44"">","","","","",""
"1","ity","","","iti","ind",""
"2","ev","","","eva","ind",""
"3","ādi","ĀD","i@","ādi","noun-adj",""
"4","prakārāṃ","PRAKĀR","āṃ","prakāra","noun-adj",""
"5","suvarṇa","SUVARṆ","a@","suvarṇa","noun-adj",""
"6","prabhava","PRABHAV","a","prabhava","noun-adj",""
"7","su","","","su","ind",""
"8","yuktāṃ","YUKT","āṃ","yuktā","noun-adj",""
"9","dharma","DHARM","a@","dharma","noun-adj",""
"10","deśanāṃ","DEŚAN","āṃ","deśanā","noun-adj",""
"11","śrutvā","ŚRUT","vā","śruta","noun-adj",""
"12","paṃca","PAÑC","a@","pañca","noun-adj",""
"13","śata","ŚAT","a@","śata","noun-adj",""
"14","sahasra","SAHASR","a","sa_saha","ind",""
"","</page>","","","","",""
"","<page number=""5r4"">","","","","",""
"","</s>","","","","",""
"","<s number=""45"">","","","","",""
"1","antaḥpura","ANTAḤPUR","a@","antaḥpura","noun-adj",""
"2","strī","STR","ī@","strī","noun-adj",""
"3","kānta","KĀNT","a@","kānta","noun-adj",""
"4","parivārai","PARIVĀR","ai","parivāra","noun-adj",""
"5","suvarṇaprabho","SUVARṆAPRABH","o","suvarṇaprabha","noun-adj",""
"6","rāja","RĀJ","a@","rājan","noun-adj",""
"7","kumāra","KUMĀR","a","kumāra","noun-adj",""
"8","buddha","BUDDH","a@","buddha","noun-adj",""
"9","pratimā","PRATIM","ā@","pratimā","noun-adj",""
"10","puṇya","PUṆY","a@","puṇya","noun-adj",""
"11","phala","PHAL","a@","phala","noun-adj",""
"12","rājaśrī","RĀJAŚR","ī@","rājaśrī","noun-adj",""
"13","samudaya","SAMUDAY","a@","samudaya","noun-adj",""
"14","saṃmuda","SAṂMUD","a@","saṃmuda","noun-adj",""
"15","saukhyaṃ","SAUKHY","aṃ","saukhya","noun-adj",""
"","</page>","","","","",""
"","<page number=""5r5"">","","","","",""
"","</s>","","","","",""
"","<s number=""46"">","","","","",""
"1","sarvaṃ","SARV","aṃ","sarva","noun-adj",""
"2","gārhasthyam","GĀRHASTH","yam","gārhastha","noun-adj",""
"3","apahāya","APAHĀ","ya","apahā","noun-adj",""
"4","tatha","TATH","a","tathā","ind",""
"5","^","","","","",""
"6","aiva","","","eva","ind",""
"7","śāsane","ŚĀSAN","e","śāsana","noun-adj",""
"8","pravrajita","PRAVRAJIT","a","pravrajita","noun-adj",""
"9","yoniśa","YONIŚ","a","yoniśas","noun-adj",""
"10","sa","","","sa_saha","ind",""
"11","manaskāraṃ","MANASKĀR","aṃ","manaskāra","noun-adj",""
"12","kṛtvā","KṚT","vā","kṛta","noun-adj",""
"13","sarva","SARV","a@","sarva","noun-adj",""
"14","kleśa","KLEŚ","a@","kleśa","noun-adj",""
"15","prahāṇā","PRAHĀṆ","ā","prahāṇa","noun-adj",""
"16","arhat","ARHAT","","arhat","noun-adj",""
"17","vaṃ","","","","ind",""
"18","strī","STR","ī@","strī","noun-adj",""
"19","parivārās","PARIVĀR","ās","parivāra","noun-adj",""
"","</page>","","","","",""
"","<page number=""5r6"">","","","","",""
"","</s>","","","","",""
"","<s number=""47"">","","","","",""
"1","sama","SAM","a@","sama","noun-adj",""
"2","loṣṭa","LOṢṬ","a@","loṣṭa","noun-adj",""
"3","kāṃcana","KĀÑCAN","a","kāñcana","noun-adj",""
"4","sama","SAM","a@","sama","noun-adj",""
"5","cittāḥ","CITT","āḥ","citta","noun-adj",""
"6","kṛtaṃ","KṚT","aṃ","kṛta","noun-adj",""
"7","karaṇīyā","KARAṆĪY","ā","karaṇīya","noun-adj",""
"8","apahṛtabhārāḥ","APAHṚTABHĀR","āḥ","apahṛtabhāra","noun-adj",""
"9","parikṣīṇa","PARIKṢĪṆ","a@","parikṣīṇa","noun-adj",""
"10","bhava","BHAV","a@","bhava","noun-adj",""
"11","saṃyojana","SAṂYOJAN","a","saṃyojana","noun-adj",""
"12","vimuktās","VIMUKT","ās","vimukta","noun-adj",""
"13","saṃsāra","SAṂSĀR","a@","saṃsāra","noun-adj",""
"14","bandhanās","BANDHAN","ās","bandhana","noun-adj",""
"","</page>","","","","",""
"","<page number=""5r7"">","","","","",""
"","</s>","","","","",""
"","<s number=""48"">","","","","",""
"1","sarva","SARV","a@","sarva","noun-adj",""
"2","deva","DEV","a@","deva","noun-adj",""
"3","namaskṛta","NAMASKṚT","a@","namaskṛti","noun-adj",""
"4","caraṇa","CARAṆ","a@","caraṇa","noun-adj",""
"5","yugalā","YUGAL","ā","yugala","noun-adj",""
"6","suprabuddhā","SUPRABUDDH","ā","suprabuddhā","noun-adj",""
"7","buddha","BUDDH","a@","buddha","noun-adj",""
"8","pratimā","PRATIM","ā@","pratimā","noun-adj",""
"9","puṇya","PUṆY","a@","puṇya","noun-adj",""
"10","phala","PHAL","a@","phala","noun-adj",""
"11","samudaya","SAMUDAY","a@","samudaya","noun-adj",""
"12","vibhūti","VIBHŪT","i@","vibhūti","noun-adj",""
"13","mahātva","MAH","ātva","mahat","noun-adj",""
"14","prakāśanam","PRAKĀŚAN","am","prakāśana","noun-adj",""
"15","idaṃ","IDAṂ","","idam","pron",""
"16","sūtram","SŪTR","am","sūtra","noun-adj",""
"","</page>","","","","",""
"","<page number=""5v1"">","","","","",""
"","</s>","","","","",""
"","<s number=""49"">","","","","",""
"1","idam","IDAM","","idam","pron",""
"2","avocad","AVOCAD","","vak","verb","vac"
"3","bhagavān","BHAGAV","ān","bhagavat","noun-adj",""
"4","āttamanasas","ĀTTAMAN","asas","āttamanas","noun-adj",""
"5","te","","","tad","pron",""
"6","bhikṣavo","BHIKṢ","avo","bhikṣu","noun-adj",""
"7","bhagavato","BHAGAV","ato","bhagavat","noun-adj",""
"8","bhāṣitam","BHĀṢIT","am","bhāṣita","noun-adj",""
"9","abhyanandam","ABHYANAND","am","abhyananda","noun-adj",""
"10","bhikṣavaś","BHIKṢ","avaś","bhikṣu","noun-adj",""
"11","catur","CAT","ur","catur","noun-adj",""
"12","diśa","DIŚ","a@","diśa","noun-adj",""
"13","saṃkhya","SAṂKHY","a@","saṃkhyā","noun-adj",""
"14","ārhatvaṃ","ĀRHAT","vaṃ","ārhata","noun-adj",""
"15","abhūvu","ABHŪV","u","abhūvu","noun-adj",""
"16","/","","","","punct",""
"17","buddha","BUDDH","a@","buddha","noun-adj",""
"18","pratimā","PRATIM","ā@","pratimā","noun-adj",""
"19","puṇya","PUṆY","a@","puṇya","noun-adj",""
"20","phala","PHAL","a@","phala","noun-adj",""
"21","prakāśitam","PRAKĀŚIT","am","prakāśita","noun-adj",""
"22","idaṃ","IDAṂ","","idam","pron",""
"23","sūtraṃ","SŪTR","aṃ","sūtra","noun-adj",""
"24","samāptam","SAMĀPT","am","samāpta","noun-adj",""
"25","//","","","","punct",""
"","</s>","","","","",""
"","<s number=""50"">","","","","",""
"1","//","","","","punct",""
"2","tathāgata","TATHĀGAT","a@","tathāgata","noun-adj",""
"3","biṃba","BIMB","a@","bimba","noun-adj",""
"4","kārāpaṇaṃ","KĀRĀPAṆ","aṃ","kārāpaṇa","noun-adj",""
"5","sūtraṃ","SŪTR","aṃ","sūtra","noun-adj",""
"6","samāptam","SAMĀPT","am","samāpta","noun-adj",""
"7","//","","","","punct",""
"8","//","","","","punct",""
"","</s>","","","","",""
"","</page>","","","","",""
"","</doc>","","","","",""
