"WordID","word","NormSTEM","suffix","lemma","PoS","Root"
"","<doc textid = ""svagatasutra_fragment"" genre = ""sūtra"" title = ""svāgatasūtra"" author = ""n/a"" discourse = ""homiletic"" tradition = ""buddh"" period = ""foundational"" source = ""gretil accessed may 2021 : http://gretil.sub.uni-goettingen.de/gretil/corpustei/sa_.xml"" date_range = ""200-400 ce"" notes = ""alternative title: daśabalsūtra ī; belonging to the nidānasaṃyukta of the sarvāstivādins; see thomas oberlies. 2004. ein bibliographischer überblick über die kanonischen texte der śrāvakayāna-schulen des buddhismus. wzks 47; p. 53."" religion = ""buddh"" edition = ""based on the ed. by e. waldschmidt: 'ein zweites daśabalasūtra.' in: mitteilungen des instituts für orientforschung 6. 1958; pp. 392-397. reprint in: e. waldschmidt. von ceylon bis turfan; schriften zur geschichte; literatur; religion und kunst des indischen kulturraumes; festgabe zum 70. geburtstag. göttingen 1967; pp. 357-362. no pagination available in this digitized version"" digitization = ""klaus wille"" segmentation_lemmatization = ""ligeia lugli & buddhist translators workbench team"" metadata_enrichment = ""bruno galasek-hul & buddhist translators workbench team"" proofreader = ""n/a"" permission = ""permission for derivatives from m. mehner on behalf of gretil"" reconstructions = ""none"">","","","","",""
"","<page number=""0"">","","","","",""
"","<s number=""1"">","","","","",""
"1","svāgata","SVĀGAT","a@","svāgata","noun-adj",""
"2","sūtra","SŪTR","a","sūtra","noun-adj",""
"3","śrāvastyāṃ","ŚRĀVAST","yāṃ","śrāvasti","noun-adj",""
"4","/","","","","punct",""
"","</s>","","","","",""
"","<page number=""0000"">","","","","",""
"","<s number=""2"">","","","","",""
"1","svāgataṃ","SVĀGAT","aṃ","svāgata","noun-adj",""
"2","vo","","","yuṣmat","pron",""
"3","bhikṣavaḥ","BHIKṢ","avaḥ","bhikṣu","noun-adj",""
"4","/","","","","punct",""
"","</s>","","","","",""
"","<s number=""3"">","","","","",""
"1","su","","","su","ind",""
"2","pravrajyā","PRAVRAJY","ā","pravrajyā","noun-adj",""
"3","vo","","","yuṣmat","pron",""
"4","bhikṣavaḥ","BHIKṢ","avaḥ","bhikṣu","noun-adj",""
"5","/","","","","punct",""
"","</s>","","","","",""
"","<s number=""4"">","","","","",""
"1","lābhā","LĀBH","ā","lābha","noun-adj",""
"2","su","","","su","ind",""
"3","labdhā","LABDH","ā","labdhā","noun-adj",""
"4","/","","","","punct",""
"","</s>","","","","",""
"","<s number=""5"">","","","","",""
"1","kadācit","KADĀCIT","","kadācita","noun-adj",""
"2","karhicid","KARH","icid","karhi","noun-adj",""
"3","ārya","ĀRY","a@","ārya","noun-adj",""
"4","āyatane","ĀYATAN","e","āyatana","noun-adj",""
"5","pratyājāti","PRATYĀJĀT","i","pratyājāti","noun-adj",""
"6","indriyair","INDRIY","air","indriya","noun-adj",""
"7","a","","","alpha_privativum","ind",""
"8","vikalatā","VIKALAT","ā","vikalatā","noun-adj",""
"9","a","","","alpha_privativum","ind",""
"10","jaḍatā","JAḌ","atā","jaḍatā","noun-adj",""
"11","an","","","alpha_privativum","ind",""
"12","eḍamūkatā","EḌAMŪK","atā","eḍamūka","noun-adj",""
"13","a","","","alpha_privativum","ind",""
"14","hasta","HAST","a@","hasta","noun-adj",""
"15","saṃvāca","SAṂVĀC","a@","saṃvāca","noun-adj",""
"16","katā","KAT","ā","kata","noun-adj",""
"17","pratibalatā","PRATIBAL","atā","pratibala","noun-adj",""
"18","su","","","su","ind",""
"19","bhāṣita","BHĀṢIT","a@","bhāṣita","noun-adj",""
"20","durbhāṣitānāṃ","DURBHĀṢIT","ānāṃ","durbhāṣita","noun-adj",""
"21","dharmāṇām","DHARM","āṇām","dharma","noun-adj",""
"22","artham","ARTH","am","artha","noun-adj",""
"23","ājñātum","ĀJÑĀT","um","ājñātu","noun-adj",""
"24","/","","","","punct",""
"","</s>","","","","",""
"","<s number=""6"">","","","","",""
"1","ahaṃ","","","mat","pron",""
"2","c","","","ca","ind",""
"3","aitarhi","ETARH","i","etarhi","noun-adj",""
"4","śāstā","ŚĀST","ā","śastṛ","noun-adj",""
"5","loke","LOK","e","loka","noun-adj",""
"6","utpannas","UTPANN","as","utpanna","noun-adj",""
"7","tathāgato","TATHĀGAT","o","tathāgata","noun-adj",""
"8","arhāṃ","ARH","āṃ","arhat","noun-adj",""
"9","samyaksaṃbuddho","SAMYAKSAṂBUDDH","o","samyaksaṃbuddha","noun-adj",""
"10","vidyācaraṇasaṃpannaḥ","VIDYĀCARAṆASAṂPANN","aḥ","vidyācaraṇasaṃpanna","noun-adj",""
"11","sugato","SUGAT","o","sugata","noun-adj",""
"12","lokavid","LOKAV","id","lokavat","noun-adj",""
"13","anuttara","ANUTTAR","a","anuttara","noun-adj",""
"14","puruṣadamyasārathiḥ","PURUṢADAMYASĀRATH","iḥ","puruṣadamyasārathi","noun-adj",""
"15","śāstā","ŚĀST","ā","śastṛ","noun-adj",""
"16","deva","DEV","a@","deva","noun-adj",""
"17","manuṣyāṇāṃ","MANUṢY","āṇāṃ","manuṣya","noun-adj",""
"18","buddho","BUDDH","o","buddha","noun-adj",""
"19","bhagavāṃ","BHAGAV","āṃ","bhagavat","noun-adj",""
"20","/","","","","punct",""
"","</s>","","","","",""
"","<s number=""7"">","","","","",""
"1","dharmaś","DHARM","aś","dharma","noun-adj",""
"2","ca","","","ca","ind",""
"3","deśyate","DEŚ","yate","diś","verb","diś"
"4","a","","","alpha_privativum","ind",""
"5","upaśamikaḥ","UPAŚAM","ikaḥ","upaśamika","noun-adj",""
"6","pāri","PĀR","i@","pāri","noun-adj",""
"7","nirvāṇikaḥ","NIRVĀṆ","ikaḥ","nirvāṇika","noun-adj",""
"8","saṃbodha","SAṂBODH","a@","saṃbodha","noun-adj",""
"9","gāmī","GĀM","ī","gāmin","noun-adj",""
"10","sugata","SUGAT","a@","sugata","noun-adj",""
"11","praveditaḥ","PRAVED","itaḥ","praveda","noun-adj",""
"12","/","","","","punct",""
"","</s>","","","","",""
"","<s number=""8"">","","","","",""
"1","yadut","","","yaduta","ind",""
"2","^","","","","",""
"3","āsmiṃ","","","idam","pron",""
"4","sat","SAT","@","sat","noun-adj",""
"5","īdaṃ","ĪDAṂ","","idam","pron",""
"6","bhavaty","BHAV","aty","bhav","verb","bhū"
"7","asy","","","as","verb","as"
"8","otpādād","UTPĀD","ād","utpāda","noun-adj",""
"9","idam","","","idam","pron",""
"10","utpadyate","UTPAD","yate","utpad","verb","utpad"
"11","/","","","","punct",""
"","</s>","","","","",""
"","<s number=""9"">","","","","",""
"1","yadut","","","yaduta","ind",""
"2","^","","","","",""
"3","ā","","","alpha_privativum","ind",""
"4","vidyā","VIDY","ā@","vidyā","noun-adj",""
"5","pratyayāḥ","PRATYAY","āḥ","pratyaya","noun-adj",""
"6","saṃskārā","SAṂSKĀR","ā","saṃskāra","noun-adj",""
"7","yāvat","YĀVAT","","yāvat","ind",""
"8","samudayo","SAMUDAY","o","samudaya","noun-adj",""
"9","nirodhaś","NIRODH","aś","nirodha","noun-adj",""
"10","ca","","","ca","ind",""
"11","bhavati","BHAV","ati","bhav","verb","bhū"
"12","/","","","","punct",""
"","</s>","","","","",""
"","<s number=""10"">","","","","",""
"1","tad","","","tad","pron",""
"2","idaṃ","","","idam","pron",""
"3","bhikṣavaḥ","BHIKṢ","avaḥ","bhikṣu","noun-adj",""
"4","su","","","su","ind",""
"5","durlabha","DURLABH","a@","durlabha","noun-adj",""
"6","durlabhaṃ","DURLABH","aṃ","durlabha","noun-adj",""
"7","yat","","","yad","pron",""
"8","kadācit","KADĀCIT","","kadācita","noun-adj",""
"9","karhicid","KARH","icid","karhi","noun-adj",""
"10","ārya","ĀRY","a@","ārya","noun-adj",""
"11","āyatane","ĀYATAN","e","āyatana","noun-adj",""
"12","pratyājāti","PRATYĀJĀT","i","pratyājāti","noun-adj",""
"13","indriyair","INDRIY","air","indriya","noun-adj",""
"14","a","","","alpha_privativum","ind",""
"15","vikalatā","VIKALAT","ā","vikalatā","noun-adj",""
"16","yāvat","YĀVAT","","yāvat","ind",""
"17","samudayo","SAMUDAY","o","samudaya","noun-adj",""
"18","nirodhaś","NIRODH","aś","nirodha","noun-adj",""
"19","ca","","","ca","ind",""
"20","bhavati","BHAV","ati","bhav","verb","bhū"
"21","/","","","","punct",""
"","</s>","","","","",""
"","<s number=""11"">","","","","",""
"1","tasmāt","","","tad","pron",""
"2","tarhi","","","tarhi","ind",""
"3","bhikṣava","BHIKṢ","ava","bhikṣu","noun-adj",""
"4","ātma","ĀTM","a@","ātman","noun-adj",""
"5","ārthaṃ","ARTH","aṃ","artha","noun-adj",""
"6","samanupaśyadbhiḥ","SAMANUPAŚY","adbhiḥ","samanupaśyat","noun-adj",""
"7","parārthañ","PARĀRTH","añ","parārtha","noun-adj",""
"8","c","","","ca","ind",""
"9","^","","","","",""
"10","obhaya","UBHAY","a@","ubhaya","noun-adj",""
"11","ārthaṃ","ARTH","aṃ","artha","noun-adj",""
"12","ca","","","ca","ind",""
"13","yāvad","YĀVAD","","yāvat","ind",""
"14","evaṃ","","","eva","ind",""
"15","vo","","","yuṣmat","pron",""
"16","bhikṣavaḥ","BHIKṢ","avaḥ","bhikṣu","noun-adj",""
"17","śikṣitavyam","ŚIKṢ","itavyam","śikṣ","verb","śikṣ"
"17","śikṣitavyam","ŚIKṢ","itavyam","śakn","verb","śak"
"18","//","","","","punct",""
"","</s>","","","","",""
"","<s number=""12"">","","","","",""
"1","svāgata","SVĀGAT","a@","svāgata","noun-adj",""
"2","sūtraṃ","SŪTR","aṃ","sūtra","noun-adj",""
"3","/","","","","punct",""
"","</s>","","","","",""
"","<s number=""13"">","","","","",""
"1","samāptaḥ","SAMĀPT","aḥ","samāpta","noun-adj",""
"2","//","","","","punct",""
"","</s>","","","","",""
"","</page>","","","","",""
"","</doc>","","","","",""
