"WordID","word","NormSTEM","suffix","lemma","PoS","Root"
"","<doc textid = ""nairatmyasiddhi"" genre = ""śāstra"" title = ""nairātmyasiddhi"" author = ""jitāri"" discourse = ""philosophy"" tradition = ""pramāṇa"" period = ""commentarial"" source = ""sarit accessed june 2021"" date_range = ""10. ce"" notes = ""author of several short but influential works on pramāṇa following the tradition of dharmakīrti. "" religion = ""buddh"" edition = ""based on the ed. gudrun bühnemann. 1982. jitāri: kleine texte. wien: arbeitskreis für tibetische und buddhistische studien; universität wien."" digitization = ""data entry by: aurorachana; auroville; prepared for sarit by: liudmila olalde"" segmentation_lemmatization = ""ligeia lugli & buddhist translators workbench team"" metadata_enrichment = ""bruno galasek-hul & buddhist translators workbench team"" proofreader = ""n/a"" permission = ""cc by-sa 4.0"" reconstructions = ""none"">","","","","",""
"","<page number=""29"">","","","","",""
"","<s number=""1"">","","","","",""
"1","nairātmya","NAIRĀTMY","a@","nairātmya","noun-adj",""
"2","siddhi","SIDDH","i","siddhi","noun-adj",""
"3","namo","NAM","o","namas","noun-adj",""
"4","buddhāya","BUDDH","āya","buddha","noun-adj",""
"5","/","","","","punct",""
"","</s>","","","","",""
"","<page number=""0000"">","","","","",""
"","<s number=""2"">","","","","",""
"1","yasya","","","yad","pron",""
"2","yena","","","yad","pron",""
"3","saha","SAH","a","sa_saha","ind",""
"4","kaścit","","","kimcit","ind",""
"5","pratibandho","PRATIBANDH","o","pratibandha","noun-adj",""
"6","n","","","na","ind",""
"7","^","","","","",""
"8","āsti","","","as","verb","as"
"9","/","","","","punct",""
"","</s>","","","","",""
"","<s number=""3"">","","","","",""
"1","na","","","na","ind",""
"2","sa","","","sa_saha","ind",""
"3","tena","","","tad","pron",""
"4","tadvān","TADV","ān","tadva","noun-adj",""
"5","/","","","","punct",""
"","</s>","","","","",""
"","<s number=""4"">","","","","",""
"1","tad","","","tad","pron",""
"2","yathā","","","yathā","ind",""
"3","hima","HIM","a@","hima","noun-adj",""
"4","ālayo","ĀLAY","o","ālaya","noun-adj",""
"5","mala","MAL","a","mala","noun-adj",""
"6","yena","","","yad","pron",""
"7","/","","","","punct",""
"","</s>","","","","",""
"","<s number=""5"">","","","","",""
"1","na","","","na","ind",""
"2","sthira","STHIR","a@","sthira","noun-adj",""
"3","ātmanā","ĀTM","anā","ātman","noun-adj",""
"4","saha","SAH","a","sa_saha","ind",""
"5","kaścit","","","kimcit","ind",""
"6","saṃbandho","SAṂBANDH","o","saṃbandhati","noun-adj",""
"7","jīvac","JĪV","ac","jīvat","noun-adj",""
"8","charīrasya","ŚARĪR","asya","śarīra","noun-adj",""
"9","iti","","","iti","ind",""
"10","vyāpak","VYĀP","ak@","vyāpaka","noun-adj",""
"11","ānupalabdhiḥ","ANUPALABDH","iḥ","anupalabdhi","noun-adj",""
"12","nāyam","NĀY","am","nāya","noun-adj",""
"13","asiddho","ASIDDH","o","asiddha","noun-adj",""
"14","hetuḥ","HET","uḥ","hetu","noun-adj",""
"15","/","","","","punct",""
"","</s>","","","","",""
"","<s number=""6"">","","","","",""
"1","yataḥ","","","yatas","ind",""
"2","saṃbandho","SAṂBANDH","o","saṃbandhati","noun-adj",""
"3","bhavan","BHAVAN","","bhavat","noun-adj",""
"4","tādātmyaṃ","TĀDĀTMY","aṃ","tādātmya","noun-adj",""
"5","tad","TAD","","tad","pron",""
"6","utpattir","UTPATT","ir","utpatti","noun-adj",""
"7","vā","","","vā","ind",""
"8","bhāvet","BHĀV","et","bhāv","verb","bhū"
"9","/","","","","punct",""
"","</s>","","","","",""
"","<s number=""7"">","","","","",""
"1","na","","","na","ind",""
"2","ca","","","ca","ind",""
"3","tādātmyam","TĀDĀTMY","am","tādātmya","noun-adj",""
"4","ātma","ĀTM","a@","ātman","noun-adj",""
"5","śarīrayoḥ","ŚARĪR","ayoḥ","śarīra","noun-adj",""
"6","/","","","","punct",""
"","</s>","","","","",""
"","<s number=""8"">","","","","",""
"1","śarīrasyā","ŚARĪR","asyā","śarīra","noun-adj",""
"2","nitya","NITY","a@","nitya","noun-adj",""
"3","ādi","ĀD","i@","ādi","noun-adj",""
"4","rūpatvāt","RŪP","atvāt","rūpatva","noun-adj",""
"5","/","","","","punct",""
"","</s>","","","","",""
"","<s number=""9"">","","","","",""
"1","tad","TAD","","tad","pron",""
"2","viparītasy","VIPARĪT","asy","viparīta","noun-adj",""
"3","ātmano","ĀTM","ano","ātman","noun-adj",""
"4","abhyupetatvāt","ABHYUPET","atvāt","abhyupeta","noun-adj",""
"5","/","","","","punct",""
"","</s>","","","","",""
"","<s number=""10"">","","","","",""
"1","n","","","na","ind",""
"2","^","","","","",""
"3","āpi","","","api","ind",""
"4","tad","TAD","","tad","pron",""
"5","utpattir","UTPATT","ir","utpatti","noun-adj",""
"6","nityasy","NITY","asy","nitya","noun-adj",""
"7","ātmanaḥ","ĀTM","anaḥ","ātman","noun-adj",""
"8","śarīra","ŚARĪR","a","śarīra","noun-adj",""
"9","—","","","","punct",""
"10","utpattya","UTPATT","ya@","utpatta","noun-adj",""
"11","yogāt","YOG","āt","yoga","noun-adj",""
"12","/","","","","punct",""
"","</s>","","","","",""
"","<s number=""11"">","","","","",""
"1","nitya","NITY","a@","nitya","noun-adj",""
"2","ātmano","ĀTM","ano","ātman","noun-adj",""
"3","vā","","","vā","ind",""
"4","śarīrasya","ŚARĪR","asya","śarīra","noun-adj",""
"5","/","","","","punct",""
"","</s>","","","","",""
"","<s number=""12"">","","","","",""
"1","saṃyoga","SAṂYOG","a@","saṃyoga","noun-adj",""
"2","lakṣaṇas","LAKṢAṆ","as","lakṣaṇa","noun-adj",""
"3","tayoḥ","","","tad","pron",""
"4","saṃbandha","SAṂBANDH","a","saṃbandhati","noun-adj",""
"5","iti","","","iti","ind",""
"6","cet","CET","","ced","noun-adj",""
"7","/","","","","punct",""
"","</s>","","","","",""
"","<s number=""13"">","","","","",""
"1","ten","","","tad","pron",""
"2","^","","","","",""
"3","aiva","","","eva","ind",""
"4","saha","SAH","a","sa_saha","ind",""
"5","tayoḥ","","","tad","pron",""
"6","/","","","","punct",""
"","</s>","","","","",""
"","<s number=""14"">","","","","",""
"1","kaḥ","","","kim","pron",""
"2","saṃbandhaḥ","SAṂBANDH","aḥ","saṃbandhati","noun-adj",""
"3","/","","","","punct",""
"","</s>","","","","",""
"","<s number=""15"">","","","","",""
"1","samavāya","SAMAVĀY","a","samavāya","noun-adj",""
"2","iti","","","iti","ind",""
"3","cet","CET","","ced","noun-adj",""
"4","/","","","","punct",""
"","</s>","","","","",""
"","<s number=""16"">","","","","",""
"1","ten","TEN","","tad","pron",""
"2","^","","","","",""
"3","āpi","","","api","ind",""
"4","saha","SAH","a","sa_saha","ind",""
"5","teṣāṃ","","","tad","pron",""
"6","kaḥ","","","kim","pron",""
"7","saṃbandhaḥ","SAṂBANDH","aḥ","saṃbandhati","noun-adj",""
"8","/","","","","punct",""
"","</s>","","","","",""
"","<s number=""17"">","","","","",""
"1","saṃbandha","SAṂBANDH","a@","saṃbandhati","noun-adj",""
"2","āntar","ANTAR","","antara","noun-adj",""
"3","opagame","UPAGAM","e","upagama","noun-adj",""
"4","an","","","alpha_privativum","ind",""
"5","avasthā","AVASTH","ā","avasthā","noun-adj",""
"6","/","","","","punct",""
"","</s>","","","","",""
"","<s number=""18"">","","","","",""
"1","an","","","alpha_privativum","ind",""
"2","abhyupagame","ABHYUPAGAM","e","abhyupagama","noun-adj",""
"3","na","","","na","ind",""
"4","teṣāṃ","","","tad","pron",""
"5","samavāyaḥ","SAMAVĀY","aḥ","samavāya","noun-adj",""
"6","/","","","","punct",""
"","</s>","","","","",""
"","<s number=""19"">","","","","",""
"1","tathā","","","tathā","ind",""
"2","c","","","ca","ind",""
"3","^","","","","",""
"4","ātma","ĀTM","a","ātman","noun-adj",""
"5","śarīrayoḥ","ŚARĪR","ayoḥ","śarīra","noun-adj",""
"6","saṃbandha","SAṂBANDH","a@","saṃbandhati","noun-adj",""
"7","āntara","ANTAR","a@","antara","noun-adj",""
"8","parikalpane","PARIKALPAN","e","parikalpana","noun-adj",""
"9","apy","","","api","ind",""
"10","ayam","","","idam","pron",""
"11","eva","","","eva","ind",""
"12","dṛṣṭānta","DṚṢṬĀNT","a","dṛṣṭānta","noun-adj",""
"13","iti","","","iti","ind",""
"14","nāsya","NĀS","ya","nās","verb",""
"15","hetor","HET","or","hetu","noun-adj",""
"16","asiddhiḥ","ASIDDH","iḥ","asiddhi","noun-adj",""
"17","/","","","","punct",""
"","</s>","","","","",""
"","<s number=""20"">","","","","",""
"1","viruddhat","VIRUDDH","at","viruddha","noun-adj",""
"2","āpyasya","ĀPY","asya","āpya","noun-adj",""
"3","n","","","na","ind",""
"4","^","","","","",""
"5","āsti","","","as","verb","as"
"6","/","","","","punct",""
"","</s>","","","","",""
"","<s number=""21"">","","","","",""
"1","sa","","","sa_saha","ind",""
"2","pakṣe","PAKṢ","e","pakṣa","noun-adj",""
"3","bhāvāt","BHĀV","āt","bhāva","noun-adj",""
"4","/","","","","punct",""
"","</s>","","","","",""
"","<s number=""22"">","","","","",""
"1","an","","","alpha_privativum","ind",""
"2","aikāntikat","AIKĀNTIK","at","aikāntika","noun-adj",""
"3","āpi","","","api","ind",""
"4","n","","","na","ind",""
"5","opadṛśyate","UPADṚŚ","yate","upadarś","verb","upadṛś"
"6","/","","","","punct",""
"","</s>","","","","",""
"","<s number=""23"">","","","","",""
"1","tadvattv","TADVATT","v","tadvattā","noun-adj",""
"2","avyavahārasya","AVYAVAHĀR","asya","avyavahāra","noun-adj",""
"3","naimittikasya","NAIMITTIK","asya","naimittika","noun-adj",""
"4","saṃbandhani","SAṂBANDH","ani","saṃbandhati","noun-adj",""
"5","bandhanatvena","BANDHAN","atvena","bandhana","noun-adj",""
"6","vyāptatvāt","VYĀPT","atvāt","vyāptatva","noun-adj",""
"7","/","","","","punct",""
"","</s>","","","","",""
"","<s number=""24"">","","","","",""
"1","saṃbandha","SAṂBANDH","a@","saṃbandhati","noun-adj",""
"2","ābhāve","ĀBHĀV","e","ābhāvati","noun-adj",""
"3","api","","","api","ind",""
"4","tadvattv","TADVATT","v","tadvattā","noun-adj",""
"5","avyavahāre","AVYAVAHĀR","e","avyavahāra","noun-adj",""
"6","niyata","NIYAT","a@","niyata","noun-adj",""
"7","viṣayatv","VIṢAY","atv","viṣayatva","noun-adj",""
"8","ābhāva","ĀBHĀV","a@","ābhāvati","noun-adj",""
"9","prasaṅgād","PRASAṄG","ād","prasaṅga","noun-adj",""
"10","iti","","","iti","ind",""
"11","sthitam","STHIT","am","sthita","noun-adj",""
"12","/","","","","punct",""
"","</s>","","","","",""
"","<s number=""25"">","","","","",""
"1","nairātmya","NAIRĀTMY","a@","nairātmya","noun-adj",""
"2","siddhiḥ","SIDDH","iḥ","siddhi","noun-adj",""
"3","samāpta","SAMĀPT","a","samāpta","noun-adj",""
"4","//","","","","punct",""
"","</s>","","","","",""
"","</page>","","","","",""
"","</doc>","","","","",""
