"WordID","word","NormSTEM","suffix","lemma","PoS","Root"
"","<doc textid = ""guhyavali"" genre = ""tantra"" title = ""guhyāvalī"" author = ""dauḍīpāda"" discourse = ""tantra"" tradition = ""tantra"" period = ""commentarial"" source = ""dsbc accessed aug 2021"" date_range = ""after 10. ce"" notes = """" religion = ""buddh"" edition = ""based on ? ?"" digitization = ""input by ?"" segmentation_lemmatization = ""ligeia lugli & buddhist translators workbench team"" metadata_enrichment = ""bruno galasek-hul & buddhist translators workbench team"" proofreader = ""n/a"" permission = """" reconstructions = ""none"">","","","","",""
"","<page number=""0000"">","","","","",""
"","<s number=""1"">","","","","",""
"1","guhya","GUHY","a@","guhya","noun-adj",""
"2","āvalīom","ĀVAL","īom","āvala","noun-adj",""
"3","namaḥ","NAM","aḥ","nama","noun-adj",""
"4","vajrayoginyai","VAJRAYOGIN","yai","vajrayoginī","noun-adj",""
"","</s>","","","","",""
"","<s number=""2"">","","","","",""
"1","tāmraṃ","TĀMR","aṃ","tāmra","noun-adj",""
"2","kāñcanatāṃ","KĀÑCAN","atāṃ","kāñcanatā","noun-adj",""
"3","na","","","na","ind",""
"4","gac","","","","ind",""
"5","cati","CAT","i","catur","noun-adj",""
"6","mahā","MAH","ā@","mahat","noun-adj",""
"7","kleśair","KLEŚ","air","kleśa","noun-adj",""
"8","api","","","api","ind",""
"9","prāṇināṃ","PRĀṆ","ināṃ","prāṇin","noun-adj",""
"10","prajñāpaṅ","PRAJÑĀP","aṅ","prajñāp","verb","prajñā"
"11","kaja","KAJ","a@","kaja","noun-adj",""
"12","seva","SEV","a@","sevā","noun-adj",""
"13","yāpi","YĀP","i","yāp","verb",""
"14","sahaja","SAHAJ","a@","sa_saha","ind",""
"15","ānande","ĀNAND","e","ānanda","noun-adj",""
"16","na","","","na","ind",""
"17","saṃbhāvyate","SAṂBHĀV","yate","saṃbhav","verb","saṃbhū"
"18","/","","","","punct",""
"19","tasmād","","","tad","pron",""
"20","ye","","","yad","pron",""
"21","kṛta","KṚT","a@","kṛta","noun-adj",""
"22","puṇya","PUṆY","a@","puṇya","noun-adj",""
"23","rāśi","RĀŚ","i@","rāśi","noun-adj",""
"24","vapuṣaḥ","VAPUṢ","aḥ","vapuṣa","noun-adj",""
"25","prādeśikās","PRĀDEŚIK","ās","prādeśika","noun-adj",""
"26","te","","","tad","pron",""
"27","kvacin","KVACIN","","kva","noun-adj",""
"28","mudrā","MUDR","ā@","mudrā","noun-adj",""
"29","kunduru","KUNDUR","u@","kunduru","noun-adj",""
"30","nista","NIST","a@","nistṝ","noun-adj",""
"31","raṅgama","RAṄGAM","a@","raṅgama","noun-adj",""
"32","nasaḥ","NAS","aḥ","nasa","noun-adj",""
"33","sidd","SID","d","sida","noun-adj",""
"34","hāstu","HĀST","u","hāsta","noun-adj",""
"35","tebhyo","","","tad","pron",""
"36","namaḥ","NAM","aḥ","nama","noun-adj",""
"37","//1//","","","","punct",""
"","</s>","","","","",""
"","<s number=""3"">","","","","",""
"1","yā","","","yad","pron",""
"2","saṃvit","SAṂV","it","saṃva","noun-adj",""
"3","parivarṇitā","PARIVARṆIT","ā","parivarṇitā","noun-adj",""
"4","bhagavatā","BHAGAV","atā","bhagavat","noun-adj",""
"5","vajra","VAJR","a@","vajra","noun-adj",""
"6","āṃbj","ĀMB","j","āmba","noun-adj",""
"7","ayogāt","AYOG","āt","ayoga","noun-adj",""
"8","kva","","","kva","ind",""
"9","sā","","","tad","pron",""
"10","sattva","SATTV","a@","sattva","noun-adj",""
"11","ā","","","alpha_privativum","ind",""
"12","nāmatha","NĀM","atha","nāman","noun-adj",""
"13","sampradāya","SAMPRADĀY","a@","sampradāya","noun-adj",""
"14","gamane","GAMAN","e","gamana","noun-adj",""
"15","rāgād","RĀG","ād","rāga","noun-adj",""
"16","virāgaḥ","VIRĀG","aḥ","virāga","noun-adj",""
"17","param","PARAM","","parama","noun-adj",""
"18","/","","","","punct",""
"19","ānanda","ĀNAND","a@","ānanda","noun-adj",""
"20","dvayam","DVAY","am","dvaya","noun-adj",""
"21","adhyavartini","ADHYAVART","ini","adhyavartin","noun-adj",""
"22","parijñāna","PARIJÑĀN","a@","parijñāna","noun-adj",""
"23","opadeśāt","UPADEŚ","āt","upadeśa","noun-adj",""
"24","punas","","","punar","ind",""
"25","teṣāṃ","","","tad","pron",""
"26","su","","","su","ind",""
"27","rata","RAT","a@","rata","noun-adj",""
"28","sukhena","SUKH","ena","sukha","noun-adj",""
"29","vihitā","VIHIT","ā","vihita","noun-adj",""
"30","mudra","MUDR","a@","mudrā","noun-adj",""
"31","ādi","ĀD","i@","ādi","noun-adj",""
"32","mukti","MUKT","i@","mukti","noun-adj",""
"33","sthitiḥ","STHIT","iḥ","sthiti","noun-adj",""
"34","//2//","","","","punct",""
"","</s>","","","","",""
"","<s number=""4"">","","","","",""
"1","tatr","","","tatra","ind",""
"2","ādau","ĀD","au","ād","verb",""
"3","viramasya","VIRAM","asya","virama","noun-adj",""
"4","śeṣa","ŚEṢ","a@","śeṣa","noun-adj",""
"5","padavī","PADAV","ī@","padavī","noun-adj",""
"6","rāgasya","RĀG","asya","rāga","noun-adj",""
"7","madhya","MADH","ya@","madhu","noun-adj",""
"8","kṣaṇe","KṢAṆ","e","kṣaṇa","noun-adj",""
"9","tyaktvā","TYAKT","vā","tyakta","noun-adj",""
"10","strī","STR","ī@","strī","noun-adj",""
"11","sukham","SUKH","am","sukha","noun-adj",""
"12","anyada","ANYAD","a@","anyadā","noun-adj",""
"13","kṣara","KṢAR","a@","kṣara","noun-adj",""
"14","sukhaṃ","SUKH","aṃ","sukha","noun-adj",""
"15","gṛhṇāti","GṚHṆ","āti","gṛhṇa","noun-adj",""
"16","yas","","","yad","pron",""
"17","tanmayaḥ","TANMAY","aḥ","tanmaya","noun-adj",""
"18","/","","","","punct",""
"19","sa","","","sa_saha","ind",""
"20","śri","ŚRI","","śrī","noun-adj",""
"21","mān","MĀN","","māna","noun-adj",""
"22","ghana","GHAN","a@","ghana","noun-adj",""
"23","sāra","SĀR","a@","sāra","noun-adj",""
"24","mudraṇa","MUDR","aṇa","mudrā","noun-adj",""
"25","vidhau","VIDH","au","vidh","verb",""
"26","vijño","VIJÑ","o","vijña","noun-adj",""
"27","guro","GUR","o@","gura","noun-adj",""
"28","rājñayā","RĀJ","ñayā","rājan","noun-adj",""
"29","sv","","","su","ind",""
"30","ānanda","ĀNAND","a@","ānanda","noun-adj",""
"31","āsava","ĀSAV","a@","āsava","noun-adj",""
"32","pāna","PĀN","a@","pāna","noun-adj",""
"33","ghūrṇi","GHŪRṆ","i@","ghūrṇi","noun-adj",""
"34","tamanā","TAMAN","ā","tamana","noun-adj",""
"35","nābhyeti","NĀBH","yeti","nābha","noun-adj",""
"36","mohaṃ","MOH","aṃ","moha","noun-adj",""
"37","sudhīḥ","SUDH","īḥ","sudha","noun-adj",""
"38","//3//","","","","punct",""
"","</s>","","","","",""
"","<s number=""5"">","","","","",""
"1","gavāṃ","GAV","āṃ","gavā","noun-adj",""
"2","yūtha","YŪTH","a@","yūtha","noun-adj",""
"3","nyāya","NYĀY","a@","nyāya","noun-adj",""
"4","krama","KRAM","a@","krama","noun-adj",""
"5","gamana","GAMAN","a@","gamana","noun-adj",""
"6","saṃbhāvita","SAMBHĀVIT","a@","sambhāvita","noun-adj",""
"7","dhiyāṃ","DHIY","āṃ","dhiyāyate","noun-adj",""
"8","kathā","","","","ind",""
"9","keyaṃ","","","","ind",""
"10","teṣām","","","tad","pron",""
"11","aśani","AŚAN","i@","aśani","noun-adj",""
"12","pada","PAD","a@","pada","noun-adj",""
"13","merau","MER","au","meru","noun-adj",""
"14","vidadhati","VIDADH","ati","vidadh","verb","vidhā"
"15","/","","","","punct",""
"16","adhiṣṭhānād","ADHIṢṬHĀN","ād","adhiṣṭhāna","noun-adj",""
"17","asmād","ASMĀD","","idam","pron",""
"18","guru","GUR","u@","guru","noun-adj",""
"19","caraṇa","CARAṆ","a@","caraṇa","noun-adj",""
"20","saṃjāta","SAṂJĀT","a@","saṃjāta","noun-adj",""
"21","rabhasā","RABHAS","ā","rabhasā","noun-adj",""
"22","svayaṃ","SVAY","aṃ","svaya","noun-adj",""
"23","prajñās","PRAJÑ","ās","prajñā","noun-adj",""
"24","aṅgo","AṄG","o","aṅga","noun-adj",""
"25","bhavati","BHAV","ati","bhav","verb","bhū"
"26","kṛtino","KṚT","ino","kṛtin","noun-adj",""
"27","anuttara","ANUTTAR","a@","anuttara","noun-adj",""
"28","padam","PADAM","","padama","noun-adj",""
"29","//4//","","","","punct",""
"","</s>","","","","",""
"","<s number=""6"">","","","","",""
"1","guruḥ","GUR","uḥ","guru","noun-adj",""
"2","svādhiṣṭhānād","SVĀDHIṢṬHĀN","ād","svādhiṣṭhāna","noun-adj",""
"3","apaha","APAH","a@","apaha","noun-adj",""
"4","rati","RAT","i","rati","noun-adj",""
"5","cittaṃ","CITT","aṃ","citta","noun-adj",""
"6","ma","","","","ind",""
"7","timatāṃ","TIM","atāṃ","timatā","noun-adj",""
"8","svasaṃ","SVAS","aṃ","svasa","noun-adj",""
"9","vedyaṃ","VEDY","aṃ","vedya","noun-adj",""
"10","jñānaṃ","JÑĀN","aṃ","jñāna","noun-adj",""
"11","jhaṭiti","JHAṬIT","i","jhaṭiti","noun-adj",""
"12","kurute","KURUT","e","kurutā","noun-adj",""
"13","durlabham","DURLABH","am","durlabha","noun-adj",""
"14","api","","","api","ind",""
"15","/","","","","punct",""
"16","mi","","","","ind",""
"17","lattū","LATT","ū","lattū","noun-adj",""
"18","lopa","LOP","a@","lopa","noun-adj",""
"19","dhira","DHIR","a@","dhira","noun-adj",""
"20","jvalati","JVAL","ati","jval","verb",""
"21","sahasā","SAHAS","ā","sa_saha","ind",""
"22","bhāskara","BHĀSKAR","a@","bhāskara","noun-adj",""
"23","maṇiḥ","MAṆ","iḥ","maṇi","noun-adj",""
"24","svabhāvo","SVABHĀV","o","svabhāva","noun-adj",""
"25","vastūnāṃ","VAST","ūnāṃ","vastu","noun-adj",""
"26","katham","KATHAM","","katham","ind",""
"27","api","","","api","ind",""
"28","na","","","na","ind",""
"29","yoxxxti","","","CORRUPTED","ind",""
"30","kramet","KRAM","et","krām","verb","kram"
"31","//5//","","","","punct",""
"","</s>","","","","",""
"","<s number=""7"">","","","","",""
"1","yada","YAD","a@","yada","noun-adj",""
"2","smābhiḥ","SMĀBH","iḥ","smābhi","noun-adj",""
"3","kiñcid","","","kimcit","ind",""
"4","bhidura","BHIDUR","a@","bhidura","noun-adj",""
"5","dhara","DHAR","a@","dhara","noun-adj",""
"6","mārgeṣv","MĀRG","eṣv","mārga","noun-adj",""
"7","adhigataṃ","ADHIGAT","aṃ","adhigata","noun-adj",""
"8","tad","TAD","","tad","pron",""
"9","uktaṃ","UKT","aṃ","ukta","noun-adj",""
"10","sv","","","su","ind",""
"11","ajñāna","AJÑĀN","a@","ajñāna","noun-adj",""
"12","ānna","ANN","a","anna","noun-adj",""
"13","kim","","","kim","pron",""
"14","api","","","api","ind",""
"15","budhā","BUDH","ā","budhā","noun-adj",""
"16","dūṣaṇam","DŪṢAṆ","am","dūṣaṇa","noun-adj",""
"17","iha","","","iha","ind",""
"18","/","","","","punct",""
"19","ataḥ","","","atas","ind",""
"20","prajñāyo","PRAJÑĀY","o@","prajñāyate","noun-adj",""
"21","gād","GĀD","","gāda","noun-adj",""
"22","yadi","","","yadi","ind",""
"23","bhavati","BHAV","ati","bhav","verb","bhū"
"24","samādhāna","SAMĀDHĀN","a@","samādhāna","noun-adj",""
"25","madhikaṃ","MADH","ikaṃ","madhu","noun-adj",""
"26","guroḥ","GUR","oḥ","guru","noun-adj",""
"27","svādhiṣṭhānād","SVĀDHIṢṬHĀN","ād","svādhiṣṭhāna","noun-adj",""
"28","api","","","api","ind",""
"29","ca","","","ca","ind",""
"30","na","","","na","ind",""
"31","tṛtīyo","TṚTĪY","o","tṛtīya","noun-adj",""
"32","asti","","","as","verb","as"
"33","viṣayaḥ","VIṢAY","aḥ","viṣaya","noun-adj",""
"34","//6//","","","","punct",""
"","</s>","","","","",""
"","<s number=""8"">","","","","",""
"1","rāgānte","RĀG","ānte","rāga","noun-adj",""
"2","virama","VIRAM","a@","virama","noun-adj",""
"3","praveśa","PRAVEŚ","a@","praveśa","noun-adj",""
"4","samaye","SAMAY","e","samaya","noun-adj",""
"5","candre","CANDR","e","candra","noun-adj",""
"6","svabha","SVABH","a@","svabhū","noun-adj",""
"7","āvasthite","AVASTHIT","e","avasthita","noun-adj",""
"8","yo","","","yad","pron",""
"9","vittiṃ","VITT","iṃ","vitti","noun-adj",""
"10","manasaḥ","MANAS","aḥ","manas","noun-adj",""
"11","pravṛttir","PRAVṚTT","ir","pravṛtti","noun-adj",""
"12","aparo","APAR","o","apara","noun-adj",""
"13","vāyor","VĀ","yor","vāi","noun-adj",""
"14","niruddhā","NIRUDDH","ā","niruddha","noun-adj",""
"15","sṛtiḥ","SṚT","iḥ","sṛti","noun-adj",""
"16","/","","","","punct",""
"17","tatkāle","TATKĀL","e","tatkāla","noun-adj",""
"18","yada","YAD","a@","yada","noun-adj",""
"19","nanya","NANY","a@","nanya","noun-adj",""
"20","saṃbhava","SAṂBHAV","a@","saṃbhava","noun-adj",""
"21","sukhaṃ","SUKH","aṃ","sukha","noun-adj",""
"22","sākṣāt","SĀKṢĀT","","sākṣāta","noun-adj",""
"23","paraṃ","PAR","aṃ","para","noun-adj",""
"24","tat","TAT","","tad","pron",""
"25","padaṃ","PAD","aṃ","pada","noun-adj",""
"26","tatra","","","tatra","ind",""
"27","sv","","","su","ind",""
"28","ānubhavo","ANUBHAV","o","anubhava","noun-adj",""
"29","hi","","","hi","ind",""
"30","yasya","","","yad","pron",""
"31","sa","","","sa_saha","ind",""
"32","punaḥ","","","punar","ind",""
"33","siddho","SIDDH","o","siddha","noun-adj",""
"34","mahā","MAH","ā@","mahat","noun-adj",""
"35","mudrayā","MUDR","ayā","mudrā","noun-adj",""
"36","//7//","","","","punct",""
"","</s>","","","","",""
"","<s number=""9"">","","","","",""
"1","vinā","","","vinā","ind",""
"2","prajña","PRAJÑ","a@","prajñā","noun-adj",""
"3","āyogaṃ","ĀYOG","aṃ","āyoga","noun-adj",""
"4","jhaṭiti","JHAṬIT","i","jhaṭiti","noun-adj",""
"5","kurute","KURUT","e","kurutā","noun-adj",""
"6","vajra","VAJR","a@","vajra","noun-adj",""
"7","padavīṃ","PADAV","īṃ","padavī","noun-adj",""
"8","satāṃ","SAT","āṃ","satā","noun-adj",""
"9","tad","TAD","","tad","pron",""
"10","yogād","YOG","ād","yoga","noun-adj",""
"11","vā","","","vā","ind",""
"12","śiśira","ŚIŚIR","a@","śiśira","noun-adj",""
"13","kara","KAR","a@","kara","noun-adj",""
"14","saṃbodha","SAṂBODH","a@","saṃbodha","noun-adj",""
"15","karaṇāt","KARAṆ","āt","karaṇa","noun-adj",""
"16","/","","","","punct",""
"17","adhiṣṭhāna","ADHIṢṬHĀN","a@","adhiṣṭhāna","noun-adj",""
"18","jño","JÑ","o","jña","noun-adj",""
"19","yaḥ","","","yad","pron",""
"20","sa","","","sa_saha","ind",""
"21","gurur","GUR","ur","guru","noun-adj",""
"22","iha","","","iha","ind",""
"23","naiv","NAIV","","naiva","noun-adj",""
"24","āpara","APAR","a","apara","noun-adj",""
"25","iti","","","iti","ind",""
"26","prabhāvo","PRABHĀV","o","prabhāva","noun-adj",""
"27","yasya","","","yad","pron",""
"28","drāk","DRĀK","","drākh","noun-adj",""
"29","prabhavati","PRABHAV","ati","prabhav","verb","prabhū"
"30","mano","MAN","o","manas","noun-adj",""
"31","durjana","DURJAN","a","durjana","noun-adj",""
"32","iti","","","iti","ind",""
"33","//8//","","","","punct",""
"","</s>","","","","",""
"","<s number=""10"">","","","","",""
"1","ānandada","ĀNANDAD","a@","ānandada","noun-adj",""
"2","vaya","VAY","a@","vaya","noun-adj",""
"3","madhya","MADHY","a@","madhya","noun-adj",""
"4","jaṃ","J","aṃ","ja","noun-adj",""
"5","kṣaṇa","KṢAṆ","a@","kṣaṇa","noun-adj",""
"6","mati","MAT","i@","mati","noun-adj",""
"7","kṣudraṃ","KṢUDR","aṃ","kṣudra","noun-adj",""
"8","na","","","na","ind",""
"9","saṃlakṣyate","SAṂLAKṢ","yate","saṃlakṣ","verb","saṃlakṣ"
"10","tatkāle","TATKĀL","e","tatkāla","noun-adj",""
"11","katham","KATHAM","","katham","ind",""
"12","ākaroti","ĀKAR","oti","ākar","verb","ākṛ"
"13","manasā","MAN","asā","manas","noun-adj",""
"14","vajra","VAJR","a@","vajra","noun-adj",""
"15","ābja","ABJ","a@","abja","noun-adj",""
"16","yogāt","YOG","āt","yoga","noun-adj",""
"17","param","PARAM","","parama","noun-adj",""
"18","/","","","","punct",""
"19","tasmād","TASMĀD","","tad","pron",""
"20","akṣara","AKṢAR","a@","akṣara","noun-adj",""
"21","saukhyam","SAUKHY","am","saukhya","noun-adj",""
"22","eva","","","eva","ind",""
"23","su","","","su","ind",""
"24","janair","JANA","ir","janai","noun-adj",""
"25","āśrīyate","ĀŚRĪ","yate","āśrīa","noun-adj",""
"26","yatnataḥ","YATN","ataḥ","yatna","noun-adj",""
"27","sthitvā","STH","itvā","sthā","noun-adj",""
"28","tatra","","","tatra","ind",""
"29","ciraṃ","CIR","aṃ","cira","noun-adj",""
"30","samāhita","SAMĀHIT","a@","samāhita","noun-adj",""
"31","janā","JAN","ā","jana","noun-adj",""
"32","gṛhṇanti","GṚHṆ","anti","gṛhṇ","verb","grah"
"33","tattvaṃ","TATTV","aṃ","tad","pron",""
"34","punaḥ","","","punar","ind",""
"35","//9//","","","","punct",""
"","</s>","","","","",""
"","<s number=""11"">","","","","",""
"1","mṛga","MṚG","a@","mṛga","noun-adj",""
"2","āmbhaḥ","ĀMBH","aḥ","āmbhi","noun-adj",""
"3","kiṃ","","","kim","pron",""
"4","grāhyaṃ","GRĀH","yaṃ","grāha","noun-adj",""
"5","kamaṭha","KAMAṬH","a@","kamaṭha","noun-adj",""
"6","nayana","NAYAN","a@","nayana","noun-adj",""
"7","spandana","SPANDAN","a","spandana","noun-adj",""
"8","iva","","","iva","ind",""
"9","kṣaṇe","KṢAṆ","e","kṣaṇa","noun-adj",""
"10","sākṣātkartuṃ","SĀKṢĀTKAR","tuṃ","sākṣātkar","verb","sākṣātkṛ"
"11","pavij","PAV","ij","pava","noun-adj",""
"12","alaja","ALAJ","a@","alaja","noun-adj",""
"13","yoga","YOG","a@","yoga","noun-adj",""
"14","śruta","ŚRUT","a@","śruta","noun-adj",""
"15","vatām","VAT","ām","vatā","noun-adj",""
"16","/","","","","punct",""
"17","ciraṃ","CIR","aṃ","cira","noun-adj",""
"18","c","","","ca","ind",""
"19","^","","","","",""
"20","āvasthānād","AVASTHĀN","ād","avasthāna","noun-adj",""
"21","anubhava","ANUBHAV","a@","anubhava","noun-adj",""
"22","daśā","DAŚ","ā","daśā","noun-adj",""
"23","saṃbhavati","SAṂBHAV","ati","saṃbhav","verb","saṃbhū"
"24","sā","","","tad","pron",""
"25","gate","GAT","e","gata","noun-adj",""
"26","candre","CANDR","e","candra","noun-adj",""
"27","vajrāt","VAJR","āt","vajra","noun-adj",""
"28","puna","PUN","a@","puna","noun-adj",""
"29","riha","LIH","a","liha","noun-adj",""
"30","hi","","","hi","ind",""
"31","saukhyaṃ","SAUKHY","aṃ","saukhya","noun-adj",""
"32","na","","","na","ind",""
"33","kim","","","kim","pron",""
"34","api","","","api","ind",""
"35","//10//","","","","punct",""
"","</s>","","","","",""
"","<s number=""12"">","","","","",""
"1","priya","PRIY","a@","priya","noun-adj",""
"2","āsaṅgāt","ĀSAṄG","āt","āsaṅga","noun-adj",""
"3","pūrvaṃ","PŪRV","aṃ","pūrva","noun-adj",""
"4","yada","YAD","a@","yada","noun-adj",""
"5","dhigatam","DHIGAT","am","dhigata","noun-adj",""
"6","ātyantika","ĀTYANTIK","a@","ātyantika","noun-adj",""
"7","sukhaṃ","SUKH","aṃ","sukha","noun-adj",""
"8","tad","TAD","","tad","pron",""
"9","ev","","","eva","ind",""
"10","edānīṃ","IDĀN","īṃ","idāni","noun-adj",""
"11","cet","CET","","ced","noun-adj",""
"12","ki","","","","ind",""
"13","madhi","MADH","i@","madhu","noun-adj",""
"14","vara","VAR","a@","vara","noun-adj",""
"15","mudra","MUDR","a@","mudrā","noun-adj",""
"16","ādhigama","ADHIGAM","a@","adhigama","noun-adj",""
"17","nam","NAM","","nama","noun-adj",""
"18","/","","","","punct",""
"19","ih","","","iha","ind",""
"20","āste","AST","e","asta","noun-adj",""
"21","saṃvid","SAṂV","id","saṃva","noun-adj",""
"22","bāhya","BĀHY","a@","bāhya","noun-adj",""
"23","sukha","SUKH","a@","sukha","noun-adj",""
"24","viṣayād","VIṢAY","ād","viṣaya","noun-adj",""
"25","anyada","ANYAD","a@","anyadā","noun-adj",""
"26","paraṃ","PAR","aṃ","para","noun-adj",""
"27","tataḥ","","","tatas","ind",""
"28","ko","","","kim","pron",""
"29","apy","","","api","ind",""
"30","eko","","","eka","ind",""
"31","anyaḥ","ANY","aḥ","anya","noun-adj",""
"32","sahaja","SAHAJ","a@","sa_saha","ind",""
"33","sukha","SUKH","a@","sukha","noun-adj",""
"34","śambhuḥ","ŚAMBH","uḥ","śambhu","noun-adj",""
"35","prabhavati","PRABHAV","ati","prabhav","verb","prabhū"
"36","//11//","","","","punct",""
"","</s>","","","","",""
"","<s number=""13"">","","","","",""
"1","guroḥ","GUR","oḥ","guru","noun-adj",""
"2","svādhiṣṭhānād","SVĀDHIṢṬHĀN","ād","svādhiṣṭhāna","noun-adj",""
"3","bhavati","BHAV","ati","bhav","verb","bhū"
"4","viduṣām","VIDUṢ","ām","viduṣā","noun-adj",""
"5","indriya","INDRIY","a@","indriya","noun-adj",""
"6","layo","LAY","o","laya","noun-adj",""
"7","layāt","LAY","āt","laya","noun-adj",""
"8","saṃvin","SAṂV","in","saṃvin","noun-adj",""
"9","mātraṃ","MĀTR","aṃ","mātra","noun-adj",""
"10","sphurati","SPHUR","ati","sphur","verb",""
"11","nirapekṣaṃ","NIRAPEKṢ","aṃ","nirapekṣa","noun-adj",""
"12","tri","TR","i@","tri","noun-adj",""
"13","jagati","JAGAT","i","jagat","noun-adj",""
"14","/","","","","punct",""
"15","asāmānyātkiṃ","ASĀMĀNY","ātkiṃ","asāmānya","noun-adj",""
"16","bhūyād","BHŪY","ād","bhūya","noun-adj",""
"17","a","","","alpha_privativum","ind",""
"18","cira","CIR","a@","cira","noun-adj",""
"19","madhikaṃ","MADH","ikaṃ","madhu","noun-adj",""
"20","tattvam","TATTV","am","tad","pron",""
"21","aparaṃ","APARAṂ","","aparaṃa","noun-adj",""
"22","pratijñātaṃ","PRATIJÑĀT","aṃ","pratijñāta","noun-adj",""
"23","yais","","","","ind",""
"24","te","","","tad","pron",""
"25","bhidura","BHIDUR","a@","bhidura","noun-adj",""
"26","dhara","DHAR","a@","dhara","noun-adj",""
"27","saṃva","SAṂV","a@","saṃva","noun-adj",""
"28","ādi","ĀD","i@","ādi","noun-adj",""
"29","vapuṣaḥ","VAPUṢ","aḥ","vapuṣa","noun-adj",""
"30","//12//","","","","punct",""
"","</s>","","","","",""
"","<s number=""14"">","","","","",""
"1","adhiṣṭhāne","ADHIṢṬHĀN","e","adhiṣṭhāna","noun-adj",""
"2","dhanye","DHAN","ye","dhan","verb",""
"3","janita","JANIT","a@","janita","noun-adj",""
"4","vara","VAR","a@","vara","noun-adj",""
"5","karmaṇy","KARMAṆY","","karmaṇya","noun-adj",""
"6","api","","","api","ind",""
"7","sure","SUR","e","sura","noun-adj",""
"8","prabhāvaḥ","PRABHĀV","aḥ","prabhāva","noun-adj",""
"9","ko","","","kim","pron",""
"10","apy","","","api","ind",""
"11","eṣa","","","tad","pron",""
"12","dhvanayati","DHVAN","ayati","dhvan","verb",""
"13","tad","TAD","","tad","pron",""
"14","antar","ANTAR","@","antara","noun-adj",""
"15","vini","VIN","i@","vini","noun-adj",""
"16","hitam","HIT","am","hita","noun-adj",""
"17","/","","","","punct",""
"18","prabhāvasya","PRABHĀV","asya","prabhāva","noun-adj",""
"19","^","","","","",""
"20","a","","","alpha_privativum","ind",""
"21","bhāvāt","BHĀV","āt","bhāva","noun-adj",""
"22","paśu","PAŚ","u@","paśu","noun-adj",""
"23","sadṛśa","SADṚŚ","a@","sadṛśa","noun-adj",""
"24","yoga","YOG","a@","yoga","noun-adj",""
"25","eśvara","EŚVAR","a@","eśvara","noun-adj",""
"26","naraḥ","NAR","aḥ","nara","noun-adj",""
"27","suro","SUR","o","sura","noun-adj",""
"28","ap","","","api","ind",""
"29","yantaḥ","YANT","aḥ","yanti","noun-adj",""
"30","śūnyo","ŚŪNY","o","śūnya","noun-adj",""
"31","mṛdu","MṚD","u@","mṛdu","noun-adj",""
"32","guru","GUR","u@","guru","noun-adj",""
"33","śilā","ŚIL","ā@","śilā","noun-adj",""
"34","kalpita","KALPIT","a@","kalpita","noun-adj",""
"35","vapuḥ","VAP","uḥ","vapu","noun-adj",""
"36","//13//","","","","punct",""
"","</s>","","","","",""
"","<s number=""15"">","","","","",""
"1","an","","","alpha_privativum","ind",""
"2","abhyāsād","ABHYĀS","ād","abhyāsa","noun-adj",""
"3","asmād","ASMĀD","","idam","pron",""
"4","an","","","alpha_privativum","ind",""
"5","adhigata","ADHIGAT","a@","adhigata","noun-adj",""
"6","mārgād","MĀRG","ād","mārga","noun-adj",""
"7","avacana","AVACAN","a@","avacana","noun-adj",""
"8","ā","","","alpha_privativum","ind",""
"9","daka","DAK","a@","daka","noun-adj",""
"10","smāda","SMĀD","a@","smāda","noun-adj",""
"11","kleśāt","KLEŚ","āt","kleśa","noun-adj",""
"12","satatam","SATAT","am","satata","noun-adj",""
"13","a","","","alpha_privativum","ind",""
"14","parokṣāt","PAROKṢ","āt","parokṣa","noun-adj",""
"15","sapadi","SAPAD","i","sapadi","noun-adj",""
"16","ca","","","ca","ind",""
"17","/","","","","punct",""
"18","guro","GUR","o@","gura","noun-adj",""
"19","rājñ","RĀJ","ñ@","rājan","noun-adj",""
"20","ānandād","ĀNAND","ād","ānanda","noun-adj",""
"21","uparat","UPAR","at","uparat","noun-adj",""
"22","apade","APAD","e","apada","noun-adj",""
"23","yastu","YAST","u@","yasta","noun-adj",""
"24","kriyate","KRI","yate","kria","noun-adj",""
"25","nasaṃvin","NASAṂV","in","nasaṃvin","noun-adj",""
"26","mātraṃ","MĀTR","aṃ","mātra","noun-adj",""
"27","yad","","","yadi","ind",""
"28","bhavati","BHAV","ati","bhav","verb","bhū"
"29","tad","TAD","","tad","pron",""
"30","adhiṣṭhānam","ADHIṢṬHĀN","am","adhiṣṭhāna","noun-adj",""
"31","iti","","","iti","ind",""
"32","ca","","","ca","ind",""
"33","//14//","","","","punct",""
"","</s>","","","","",""
"","<s number=""16"">","","","","",""
"1","iha","","","iha","ind",""
"2","svādhiṣṭhāna","SVĀDHIṢṬHĀN","a@","svādhiṣṭhāna","noun-adj",""
"3","kramaja","KRAMAJ","a@","kramaja","noun-adj",""
"4","nita","NIT","a@","nita","noun-adj",""
"5","yogaiś","YOG","aiś","yoga","noun-adj",""
"6","ca","","","ca","ind",""
"7","yada","YAD","a@","yada","noun-adj",""
"8","yaṃ","YAM","","yad","pron",""
"9","y","","","","ind",""
"10","adakṣāxxx","ADAKṢ","āxxx","CORRUPTED","noun-adj",""
"11","tyajati","TYAJ","ati","tyaj","verb","tyaj"
"12","svanir","SVAN","ir","svani","noun-adj",""
"13","moka","MOK","a@","moka","noun-adj",""
"14","sadṛśam","SADṚŚ","am","sadṛśa","noun-adj",""
"15","/","","","","punct",""
"16","gṛhīto","GṚHĪT","o","gṛhīta","noun-adj",""
"17","rāga","RĀG","a@","rāga","noun-adj",""
"18","ādy","ĀD","y@","ādi","noun-adj",""
"19","aira","AIR","a@","aira","noun-adj",""
"20","virata","VIRAT","a@","virata","noun-adj",""
"21","mano","MAN","o@","manas","noun-adj",""
"22","vṛtti","VṚTT","i@","vṛtti","noun-adj",""
"23","rasikaḥ","RASIK","aḥ","rasika","noun-adj",""
"24","sva","SV","a@","sva","noun-adj",""
"25","saṃvid","SAṂV","id","saṃva","noun-adj",""
"26","devīṃ","DEV","īṃ","devī","noun-adj",""
"27","na","","","na","ind",""
"28","praviśati","PRAVIŚ","ati","praviś","verb","praviś"
"29","jale","JAL","e","jala","noun-adj",""
"30","antas","ANT","as","anta","noun-adj",""
"31","talam","TAL","am","tala","noun-adj",""
"32","iva","","","iva","ind",""
"33","//15//","","","","punct",""
"","</s>","","","","",""
"","<s number=""17"">","","","","",""
"1","etat","ETAT","","tad","pron",""
"2","pañca","PAÑC","a@","pañca","noun-adj",""
"3","vyasana","VYASAN","a@","vyasana","noun-adj",""
"4","rasikā","RASIK","ā","rasika","noun-adj",""
"5","yānti","","","","ind",""
"6","pāpa","PĀP","a@","pāpa","noun-adj",""
"7","āndha","ANDH","a@","andha","noun-adj",""
"8","kūpaṃ","KŪP","aṃ","kūpa","noun-adj",""
"9","no","","","asmat","pron",""
"10","cen","","","ced","ind",""
"11","mokṣaṃ","MOKṢ","aṃ","mokṣa","noun-adj",""
"12","parikṛta","PARIKṚT","a@","parikṛta","noun-adj",""
"13","padāḥ","PAD","āḥ","pada","noun-adj",""
"14","s","","","su","ind",""
"15","vacc","VAC","c","vaca","noun-adj",""
"16","abhūmer","ABHŪM","er","abhūmi","noun-adj",""
"17","vibhedat","VIBHED","at","vibhedat","noun-adj",""
"18","/","","","","punct",""
"19","tat","","","tad","pron",""
"20","sandehaṃ","SANDEH","aṃ","sandeha","noun-adj",""
"21","praviśati","PRAVIŚ","ati","praviś","verb","praviś"
"22","kathaṃ","","","katham","ind",""
"23","nir","","","niḥ_privativum","ind",""
"24","vikalpa","VIKALP","a@","vikalpa","noun-adj",""
"25","āvalepāt","AVALEP","āt","avalepa","noun-adj",""
"26","saṃsāra","SAṂSĀR","a@","saṃsāra","noun-adj",""
"27","ābdher","ABDH","er","abdhi","noun-adj",""
"28","viharati","VIHAR","ati","vihar","verb","vihṛ"
"29","paraḥ","PAR","aḥ","para","noun-adj",""
"30","kaḥ","","","kim","pron",""
"31","punas","","","punar","ind",""
"32","tasya","","","tad","pron",""
"33","pāram","PĀRAM","","pārama","noun-adj",""
"34","//16//","","","","punct",""
"","</s>","","","","",""
"","<s number=""18"">","","","","",""
"1","ete","","","tad","pron",""
"2","pañca","PAÑC","a","pañca","noun-adj",""
"3","nayanti","","","","ind",""
"4","moha","MOH","a@","moha","noun-adj",""
"5","taṭinī","TAṬ","inī","taṭin","noun-adj",""
"6","pāraṃ","PĀR","aṃ","pāra","noun-adj",""
"7","parān","PAR","ān","para","noun-adj",""
"8","auriva","AUR","iva","aurā","noun-adj",""
"9","vyāghātaḥ","VYĀGHĀT","aḥ","vyāghāta","noun-adj",""
"10","parama","PARAM","a@","parama","noun-adj",""
"11","sti","ST","i","sti","noun-adj",""
"12","ko","","","kim","pron",""
"13","api","","","api","ind",""
"14","vipadāṃ","VIPAD","āṃ","vipada","noun-adj",""
"15","harturya","HART","urya","hartu","noun-adj",""
"16","eko","","","eka","ind",""
"17","mahān","MAH","ān","mahat","noun-adj",""
"18","/","","","","punct",""
"19","akṣāṇām","AKṢ","āṇām","akṣa","noun-adj",""
"20","anurāga","ANURĀG","a@","anurāga","noun-adj",""
"21","sundara","SUNDAR","a@","sundara","noun-adj",""
"22","sura","SUR","a@","sura","noun-adj",""
"23","āpāna","ĀPĀN","a@","āpāna","noun-adj",""
"24","pramattaṃ","PRAMATT","aṃ","pramatta","noun-adj",""
"25","manaḥ","MAN","aḥ@","manas","noun-adj",""
"26","sphu","SPH","u@","sphu","noun-adj",""
"27","ūrjad","ŪRJ","ad","ūrjat","noun-adj",""
"28","gandha","GANDH","a@","gandha","noun-adj",""
"29","kari","KAR","i@","karin","noun-adj",""
"30","īndra","INDR","a","indra","noun-adj",""
"31","eṣa","","","tad","pron",""
"32","bhuvane","BHUVAN","e","bhuvana","noun-adj",""
"33","dhāvan","DHĀV","an","dhāvat","noun-adj",""
"34","nimāṃ","NIM","āṃ","nimā","noun-adj",""
"35","gāṃ","G","āṃ","gā","noun-adj",""
"36","prati","PRAT","i","prati","noun-adj",""
"37","//17//","","","","punct",""
"","</s>","","","","",""
"","<s number=""19"">","","","","",""
"1","surā","SUR","ā","sura","noun-adj",""
"2","nārī","NĀR","ī@","nārī","noun-adj",""
"3","saṅge","SAṄG","e","saṅga","noun-adj",""
"4","apy","","","api","ind",""
"5","upanayati","UPAN","ayati","upanay","verb","upanī"
"6","puṃsaḥ","PUṂS","aḥ","puṃsa","noun-adj",""
"7","pa","","","","ind",""
"8","vipadaṃ","VIPAD","aṃ","vipada","noun-adj",""
"9","gṛhītaṃ","GṚHĪT","aṃ","gṛhīta","noun-adj",""
"10","na","","","na","ind",""
"11","tyaktaṃ","TYAKT","aṃ","tyakta","noun-adj",""
"12","tad","TAD","","tad","pron",""
"13","iha","","","iha","ind",""
"14","bhavadhī","BHAVAD","hī","bhavadā","noun-adj",""
"15","mattv","MATT","v","mattu","noun-adj",""
"16","avihitaḥ","AVIHIT","aḥ","avihita","noun-adj",""
"17","/","","","","punct",""
"18","yada","YAD","a@","yada","noun-adj",""
"19","ekaṃ","EK","aṃ","eka","noun-adj",""
"20","pañcānām","PAÑC","ānām","pañca","noun-adj",""
"21","a","","","alpha_privativum","ind",""
"22","nubhavaxxx","NUBHAV","axxx","CORRUPTED","noun-adj",""
"23","sukhadaṃ","SUKH","adaṃ","sukhat","noun-adj",""
"24","dvitīyaṃ","DVITĪY","aṃ","dvitīya","noun-adj",""
"25","tadvay","TADVAY","","tadvayas","noun-adj",""
"26","^","","","","",""
"27","āpi","","","api","ind",""
"28","sthira","STHIR","a@","sthira","noun-adj",""
"29","calam","CAL","am","cala","noun-adj",""
"30","a","","","alpha_privativum","ind",""
"31","śeṣaṃ","ŚEṢ","aṃ","śeṣa","noun-adj",""
"32","agaditi","AGADIT","i","agadita","noun-adj",""
"33","//18//","","","","punct",""
"","</s>","","","","",""
"","<s number=""20"">","","","","",""
"1","guroḥ","GUR","oḥ","guru","noun-adj",""
"2","pāramparya","PĀRAMPARY","a@","pāramparya","noun-adj",""
"3","krama","KRAM","a@","krama","noun-adj",""
"4","janita","JANIT","a@","janita","noun-adj",""
"5","saṃbhāvita","SAMBHĀVIT","a@","sambhāvita","noun-adj",""
"6","dhiyā","DHIY","ā","dhiyāyate","noun-adj",""
"7","tad","TAD","","tad","pron",""
"8","ev","","","eva","ind",""
"9","ādhiṣṭhānaṃ","ADHIṢṬHĀN","aṃ","adhiṣṭhāna","noun-adj",""
"10","svapara","SVAPAR","a@","svapara","noun-adj",""
"11","vacanaṃ","VACAN","aṃ","vacana","noun-adj",""
"12","kṣīyata","KṢĪYAT","a","kṣīyata","noun-adj",""
"13","iti","","","iti","ind",""
"14","/","","","","punct",""
"15","yato","","","yatas","ind",""
"16","dīpād","DĪP","ād","dīpa","noun-adj",""
"17","dīpaḥ","DĪP","aḥ","dīpa","noun-adj",""
"18","prabhavati","PRABHAV","ati","prabhav","verb","prabhū"
"19","tato","","","tatas","ind",""
"20","apy","","","api","ind",""
"21","evam","","","eva","ind",""
"22","apare","APAR","e","apara","noun-adj",""
"23","pradīpā","PRADĪP","ā","pradīpa","noun-adj",""
"24","jāyante","JĀYANT","e","jāyanta","noun-adj",""
"25","kramaśa","KRAM","aśa","krama","noun-adj",""
"26","iha","","","iha","ind",""
"27","ko","","","kim","pron",""
"28","vismaya","VISMAY","a","vismaya","noun-adj",""
"29","iva","","","iva","ind",""
"30","//19//","","","","punct",""
"","</s>","","","","",""
"","<s number=""21"">","","","","",""
"1","jvalaj","JVAL","aj","jvalat","noun-adj",""
"2","jvālo","JVĀL","o","jvāla","noun-adj",""
"3","nīla","NĪL","a@","nīla","noun-adj",""
"4","jvalanam","JVALAN","am","jvalana","noun-adj",""
"5","a","","","alpha_privativum","ind",""
"6","niśaṃ","NIŚ","aṃ","niśa","noun-adj",""
"7","śūnya","ŚŪNY","a@","śūnya","noun-adj",""
"8","bhavane","BHAVAN","e","bhavana","noun-adj",""
"9","jaḍo","JAḌ","o","jaḍa","noun-adj",""
"10","yastaṃ","YAST","aṃ","yasta","noun-adj",""
"11","yadvad","","","yadvat","ind",""
"12","bhajati","BHAJ","ati","bhaj","verb","bhaj"
"13","sa","","","sa_saha","ind",""
"14","sukhī","SUKH","ī","sukhī","noun-adj",""
"15","tatra","","","tatra","ind",""
"16","bhavati","BHAV","ati","bhav","verb","bhū"
"17","/","","","","punct",""
"18","guroḥ","GUR","oḥ","guru","noun-adj",""
"19","pādām","PĀD","ām","pāda","noun-adj",""
"20","bhoja","BHOJ","a@","bhoja","noun-adj",""
"21","praṇati","PRAṆA","ti","praṇā","noun-adj",""
"22","śata","ŚAT","a@","śata","noun-adj",""
"23","saṃbhūṣita","SAṂBHŪṢIT","a@","saṃbhūṣita","noun-adj",""
"24","śiro","ŚIR","o@","śira","noun-adj",""
"25","rajo","RAJ","o@","raja","noun-adj",""
"26","rekhāṃ","REKH","āṃ","rekhā","noun-adj",""
"27","labdhvā","LABDH","vā","labdha","noun-adj",""
"28","sapadi","SAPAD","i","sapadi","noun-adj",""
"29","kurute","KURUT","e","kurutā","noun-adj",""
"30","vajra","VAJR","a@","vajra","noun-adj",""
"31","padavīm","PADAV","īm","padavī","noun-adj",""
"32","//20//","","","","punct",""
"","</s>","","","","",""
"","<s number=""22"">","","","","",""
"1","a","","","alpha_privativum","ind",""
"2","dūre","DŪR","e","dūra","noun-adj",""
"3","dūre","DŪR","e","dūra","noun-adj",""
"4","vā","","","vā","ind",""
"5","gurur","GUR","ur","guru","noun-adj",""
"6","iha","","","iha","ind",""
"7","kathā","","","","ind",""
"8","ke","","","kim","pron",""
"9","yama","YAM","a@","yama","noun-adj",""
"10","satī","SAT","ī","satī","noun-adj",""
"11","śiśoḥ","ŚIŚ","oḥ","śiśu","noun-adj",""
"12","saṃvit","SAṂV","it","saṃva","noun-adj",""
"13","siddhir","SIDDH","ir","siddhi","noun-adj",""
"14","bhavati","BHAV","ati","bhav","verb","bhū"
"15","sahasā","SAHAS","ā","sa_saha","ind",""
"16","yojana","YOJAN","a@","yojana","noun-adj",""
"17","śataiḥ","ŚAT","aiḥ","śata","noun-adj",""
"18","/","","","","punct",""
"19","nabho","NABH","o@","nabha","noun-adj",""
"20","bhāge","BHĀG","e","bhāga","noun-adj",""
"21","bhānur","BHĀN","ur","bhānu","noun-adj",""
"22","vikasati","VIKAS","ati","vikas","verb",""
"23","sarojaṃ","SAROJ","aṃ","saroja","noun-adj",""
"24","vikasati","VIKAS","ati","vikas","verb",""
"25","prabhāvaḥ","PRABHĀV","aḥ","prabhāva","noun-adj",""
"26","śaktānāṃ","ŚAKT","ānāṃ","śakta","noun-adj",""
"27","bhavati","BHAV","ati","bhav","verb","bhū"
"28","kim","","","kim","pron",""
"29","ayaṃ","AYAṂ","","idam","pron",""
"30","vismaya","VISMAY","a@","vismaya","noun-adj",""
"31","karaḥ","KAR","aḥ","kara","noun-adj",""
"32","//21//","","","","punct",""
"","</s>","","","","",""
"","<s number=""23"">","","","","",""
"1","dv","DV","","dva","noun-adj",""
"2","dhā","DH","ā","dhā","noun-adj",""
"3","tattva","TATTV","a@","tad","pron",""
"4","jñānaṃ","JÑĀN","aṃ","jñāna","noun-adj",""
"5","sa","","","sa_saha","ind",""
"6","vacanam","VACAN","am","vacana","noun-adj",""
"7","a","","","alpha_privativum","ind",""
"8","vācyaṃ","VĀC","yaṃ","vāc","noun-adj",""
"9","kim","","","kim","pron",""
"10","api","","","api","ind",""
"11","ca","","","ca","ind",""
"12","kramaty","KRAM","aty","krām","verb","kram"
"13","aṅgād","AṄG","ād","aṅga","noun-adj",""
"14","ekaṃ","EK","aṃ","eka","noun-adj",""
"15","yada","YAD","a@","yada","noun-adj",""
"16","parama","PARAM","a@","parama","noun-adj",""
"17","naṅgāt","NAṄG","āt","naṅga","noun-adj",""
"18","kramati","KRAMAT","i","kramatas","noun-adj",""
"19","ca","","","ca","ind",""
"20","/","","","","punct",""
"21","dvayor","DVAY","or","dvayu","noun-adj",""
"22","ekatve","EK","atve","eka","noun-adj",""
"23","yaḥ","","","yad","pron",""
"24","satatam","SATAT","am","satata","noun-adj",""
"25","avabodhāt","AVABODH","āt","avabodha","noun-adj",""
"26","prabhavati","PRABHAV","ati","prabhav","verb","prabhū"
"27","svataḥ","SVAT","aḥ","svata","noun-adj",""
"28","siddhaḥ","SIDDH","aḥ","siddha","noun-adj",""
"29","so","","","tad","pron",""
"30","ayaṃ","","","idam","pron",""
"31","bhidura","BHIDUR","a@","bhidura","noun-adj",""
"32","dhara","DHAR","a@","dhara","noun-adj",""
"33","mārga","MĀRG","a@","mārga","noun-adj",""
"34","ottara","UTTAR","a@","uttara","noun-adj",""
"35","padam","PADAM","","padama","noun-adj",""
"36","//22//","","","","punct",""
"","</s>","","","","",""
"","<s number=""24"">","","","","",""
"1","prāṇī","PRĀṆ","ī","prāṇin","noun-adj",""
"2","vajra","VAJR","a@","vajra","noun-adj",""
"3","dharaḥ","DHAR","aḥ","dhara","noun-adj",""
"4","kapāliv","KAPĀL","iv","kapāla","noun-adj",""
"5","anita","ANIT","a@","anita","noun-adj",""
"6","ā","","","alpha_privativum","ind",""
"7","tulyo","TULY","o","tulya","noun-adj",""
"8","jagat","JAGAT","@","jagat","noun-adj",""
"9","strī","STR","ī@","strī","noun-adj",""
"10","janaḥ","JAN","aḥ","jana","noun-adj",""
"11","so","","","tad","pron",""
"12","ahaṃ","","","mat","pron",""
"13","heruka","HER","uka","heru","noun-adj",""
"14","mūrti","MŪRT","i@","mūrti","noun-adj",""
"15","reṣa","REṢ","a","reṣa","noun-adj",""
"16","bhagavān","BHAGAV","ān","bhagavat","noun-adj",""
"17","yāna","YĀN","a@","yāna","noun-adj",""
"18","prabhinno","PRABHINN","o","prabhinna","noun-adj",""
"19","mayi","","","mat","pron",""
"20","/","","","","punct",""
"21","śrī","ŚRĪ","","śrī","noun-adj",""
"22","padmaṃ","PADM","aṃ","padma","noun-adj",""
"23","madanaṃ","MADAN","aṃ","madana","noun-adj",""
"24","ca","","","ca","ind",""
"25","goku","GOK","u@","gokā","noun-adj",""
"26","dahanaṃ","DAHAN","aṃ","dahana","noun-adj",""
"27","kurvan","KURV","an","kurvat","noun-adj",""
"28","yathā","","","yathā","ind",""
"29","gauravād","GAURAV","ād","gaurava","noun-adj",""
"30","etat","ETAT","","tad","pron",""
"31","sarvam","SARV","am","sarva","noun-adj",""
"32","atīndriya","ATĪNDRIY","a@","atīndriya","noun-adj",""
"33","aika","EK","a@","eka","noun-adj",""
"34","manasā","MAN","asā","manas","noun-adj",""
"35","yogi","YOG","i@","yogin","noun-adj",""
"36","īśvaraḥ","ĪŚVAR","aḥ","īśvara","noun-adj",""
"37","siddhayati","SID","dhayati","sida","noun-adj",""
"38","//23//","","","","punct",""
"","</s>","","","","",""
"","<s number=""25"">","","","","",""
"1","kvacit","","","kva","ind",""
"2","prajñāyo","PRAJÑĀY","o@","prajñāyate","noun-adj",""
"3","gāt","GĀT","","gāta","noun-adj",""
"4","kvacid","","","kva","ind",""
"5","api","","","api","ind",""
"6","ca","","","ca","ind",""
"7","pañca","PAÑC","a@","pañca","noun-adj",""
"8","endriya","INDRIY","a@","indriya","noun-adj",""
"9","balāt","BAL","āt","bala","noun-adj",""
"10","kvacit","","","kva","ind",""
"11","svādhiṣṭhānād","SVĀDHIṢṬHĀN","ād","svādhiṣṭhāna","noun-adj",""
"12","guru","GUR","u@","guru","noun-adj",""
"13","vacana","VACAN","a@","vacana","noun-adj",""
"14","mārgāt","MĀRG","āt","mārga","noun-adj",""
"15","kvacid","","","kva","ind",""
"16","api","","","api","ind",""
"17","/","","","","punct",""
"18","rucer","RUC","er","ruci","noun-adj",""
"19","bhedāt","BHED","āt","bheda","noun-adj",""
"20","puṃsi","PUṂS","i","puṃsi","noun-adj",""
"21","prakaṭayati","PRAKAṬ","ayati","prakaṭ","verb",""
"22","vajra","VAJR","a@","vajra","noun-adj",""
"23","āṅkita","AṄKIT","a@","aṅkita","noun-adj",""
"24","karo","KAR","o","kara","noun-adj",""
"25","na","","","na","ind",""
"26","siddhaṃ","SIDDH","aṃ","siddha","noun-adj",""
"27","svā","","","","ind",""
"28","sādhyaṃ","SĀDHY","aṃ","sādhya","noun-adj",""
"29","kim","","","kim","pron",""
"30","api","","","api","ind",""
"31","yada","","","","ind",""
"32","vāg","VĀG","","vāk","noun-adj",""
"33","gocara","GOCAR","a@","gocara","noun-adj",""
"34","padam","PADAM","","padama","noun-adj",""
"35","//24//","","","","punct",""
"","</s>","","","","",""
"","<s number=""26"">","","","","",""
"1","xxxna","","","CORRUPTED","ind",""
"2","me","","","mat","pron",""
"3","astu","","","as","verb","as"
"4","tavaj","","","","ind",""
"5","jñānaṃ","JÑĀN","aṃ","jñāna","noun-adj",""
"6","na","","","na","ind",""
"7","me","","","mat","pron",""
"8","pada","PAD","a@","pada","noun-adj",""
"9","pada","PAD","a@","pada","noun-adj",""
"10","ārtha","ARTH","a@","artha","noun-adj",""
"11","kathāsu","","","","ind",""
"12","dhīrāḥ","DHĪR","āḥ","dhīra","noun-adj",""
"13","/","","","","punct",""
"14","cakra","CAKR","a@","cakra","noun-adj",""
"15","āṅghri","AṄGHR","i@","aṅghri","noun-adj",""
"16","paṅkaja","PAṄKAJ","a@","paṅkaja","noun-adj",""
"17","rajaḥ","RAJ","aḥ","raja","noun-adj",""
"18","praṇaya","PRAṆAY","a@","praṇaya","noun-adj",""
"19","ā","","","alpha_privativum","ind",""
"20","diyaṃ","DIY","aṃ","diya","noun-adj",""
"21","ced","","","ced","ind",""
"22","guhya","GUHY","a@","guhya","noun-adj",""
"23","āvalī","ĀVAL","ī","āvalī","noun-adj",""
"24","sphurati","SPHUR","ati","sphur","verb",""
"25","tat","TAT","","tad","pron",""
"26","kim","","","kim","pron",""
"27","ahaṃ","AHAṂ","","mat","pron",""
"28","karomi","KAR","omi","kara","noun-adj",""
"29","//25//","","","","punct",""
"","</s>","","","","",""
"","<s number=""27"">","","","","",""
"1","iti","","","iti","ind",""
"2","dauḍī","","","","ind",""
"3","pādīyā","PĀD","īyā","pāda","noun-adj",""
"4","guhya","GUHY","a@","guhya","noun-adj",""
"5","āvalī","ĀVAL","ī","āvalī","noun-adj",""
"6","samāptā","SAMĀPT","ā","samāpta","noun-adj",""
"7","//","","","","punct",""
"","</s>","","","","",""
"","</page>","","","","",""
"","</doc>","","","","",""
