"WordID","word","NormSTEM","suffix","lemma","PoS","Root"
"","<doc textid = ""smaller-sukhavativyuha"" genre = ""sūtra"" title = ""smaller_sukhāvatīvyūha"" author = ""n/a"" discourse = ""homiletic"" tradition = ""buddh"" period = ""foundational"" source = ""gretil accessed may 2021 : http://gretil.sub.uni-goettingen.de/gretil/corpustei/sa_.xml"" date_range = ""3. ce"" notes = ""alternative title: amitābhasūtra; dating: c. 3rd cent. ce according to buswell and lopez. 2014. princeton dictionary of buddhism; p. 867."" religion = ""buddh"" edition = ""based on the ed. by ? ?"" digitization = ""yoshimichi fujita"" segmentation_lemmatization = ""ligeia lugli & buddhist translators workbench team"" metadata_enrichment = ""bruno galasek-hul & buddhist translators workbench team"" proofreader = ""n/a"" permission = ""permission for derivatives from m. mehner on behalf of gretil"" reconstructions = ""none"">","","","","",""
"","<page number=""0"">","","","","",""
"","<s number=""1"">","","","","",""
"1","//","","","","punct",""
"2","namaḥ","NAM","aḥ","nama","noun-adj",""
"3","sarvajñāya","SARVAJÑ","āya","sarvajña","noun-adj",""
"4","//","","","","punct",""
"","</s>","","","","",""
"","<s number=""2"">","","","","",""
"1","evaṃ","","","eva","ind",""
"2","mayā","","","mat","pron",""
"3","śrutaṃ","ŚRUT","aṃ","śruta","noun-adj",""
"4","/","","","","punct",""
"5","ekasmin","EK","asmin","eka","noun-adj",""
"6","samaye","SAMAY","e","samaya","noun-adj",""
"7","bhagavāñ","BHAGAV","āñ","bhagavat","noun-adj",""
"8","śrāvastyāṃ","ŚRĀVAST","yāṃ","śrāvasti","noun-adj",""
"9","viharati","VIHAR","ati","vihar","verb","vihṛ"
"","</s>","","","","",""
"","<s number=""3"">","","","","",""
"1","sma","","","sma","ind",""
"2","jetavane","JETAVAN","e","jetavana","noun-adj",""
"3","anāth","ANĀTH","","anātha","noun-adj",""
"4","api","","","api","ind",""
"5","ṃḍa","","","","ind",""
"6","dasya","DASY","a@","dasyu","noun-adj",""
"7","ārāme","ĀRĀM","e","ārāma","noun-adj",""
"8","mahatā","MAHAT","ā","mahat","noun-adj",""
"9","bhikṣusaṃghena","BHIKṢUSAṂGH","ena","bhikṣusaṃgha","noun-adj",""
"10","sārdham","SĀRDH","am","sārdha","noun-adj",""
"","</s>","","","","",""
"","<s number=""4"">","","","","",""
"1","ardhat","ARDH","at","ardhat","noun-adj",""
"2","rayoda","RAY","oda","raya","noun-adj",""
"3","śabhir","ŚABH","ir","śabh","verb",""
"","</s>","","","","",""
"","<s number=""5"">","","","","",""
"1","bhikṣuśa-tair","BHIKṢ","uśa-tair","bhikṣu","noun-adj",""
"2","abhijñāna","ABHIJÑĀN","a@","abhijñāna","noun-adj",""
"3","ābhijñātaiḥ","ABHIJÑĀT","aiḥ","abhijñāta","noun-adj",""
"4","sthavirair","STHAVIR","air","sthavira","noun-adj",""
"5","mahā","MAH","ā@","mahat","noun-adj",""
"6","śrāvakaiḥ","ŚRĀVAK","aiḥ","śrāvaka","noun-adj",""
"7","sarvair","SARV","air","sarva","noun-adj",""
"8","arhadbhiḥ","ARH","adbhiḥ","arhat","noun-adj",""
"9","/","","","","punct",""
"","</s>","","","","",""
"","<s number=""6"">","","","","",""
"1","tadyathā","","","tadyathā","ind",""
"2","sthavireṇa","STHAVIR","eṇa","sthavira","noun-adj",""
"3","ca","","","ca","ind",""
"4","śāriputreṇa","ŚĀRIPUTR","eṇa","śāriputra","noun-adj",""
"5","mahāmaudgalyāyanena","MAHĀMAUDGALYĀYAN","ena","mahāmaudgalyāyana","noun-adj",""
"6","ca","","","ca","ind",""
"7","mahākāśyapena","MAHĀKĀŚYAP","ena","mahākāśyapa","noun-adj",""
"","</s>","","","","",""
"","<s number=""7"">","","","","",""
"1","ca","","","ca","ind",""
"2","mahākapphiṇena","MAHĀKAPPHIṆ","ena","mahākapphiṇa","noun-adj",""
"3","ca","","","ca","ind",""
"4","mahākātyāyanena","MAHĀKĀTYĀYAN","ena","mahākātyāyana","noun-adj",""
"5","ca","","","ca","ind",""
"6","mahākauṣṭhilena","MAHĀKAUṢṬHIL","ena","mahākauṣṭhila","noun-adj",""
"","</s>","","","","",""
"","<s number=""8"">","","","","",""
"1","ca","","","ca","ind",""
"2","revatena","REVAT","ena","revata","noun-adj",""
"3","ca","","","ca","ind",""
"4","śuddhipaṃtha","ŚUDDH","ipaṃtha","śuddha","noun-adj",""
"5","kena","KEN","a","kim","pron",""
"6","ca","","","ca","ind",""
"7","naṃdena","","","","ind",""
"8","c","","","ca","ind",""
"9","^","","","","",""
"10","ānaṃdena","","","","ind",""
"11","ca","","","ca","ind",""
"12","rāhulena","RĀHUL","ena","rāhula","noun-adj",""
"13","ca","","","ca","ind",""
"","</s>","","","","",""
"","<s number=""9"">","","","","",""
"1","gavāṃpatinā","GAVĀMPAT","inā","gavāmpati","noun-adj",""
"2","ca","","","ca","ind",""
"3","bharadvājena","BHARADVĀJ","ena","bharadvāja","noun-adj",""
"4","ca","","","ca","ind",""
"5","kālodayinā","KĀLODAY","inā","kālodayin","noun-adj",""
"6","ca","","","ca","ind",""
"7","vakkulena","VAKKUL","ena","vakkula","noun-adj",""
"8","c","","","ca","ind",""
"9","^","","","","",""
"10","āniruddhena","ĀNIRUDDH","ena","āniruddha","noun-adj",""
"","</s>","","","","",""
"","<s number=""10"">","","","","",""
"1","ca","","","ca","ind",""
"2","/","","","","punct",""
"3","etaiś","","","","ind",""
"4","c","","","ca","ind",""
"5","^","","","","",""
"6","ānyaiś","ANY","aiś","anya","noun-adj",""
"7","ca","","","ca","ind",""
"8","saṃbahulair","SAṂBAHUL","air","saṃbahula","noun-adj",""
"9","mahā","MAH","ā@","mahat","noun-adj",""
"10","śrāvakaiḥ","ŚRĀVAK","aiḥ","śrāvaka","noun-adj",""
"11","saṃbahulaiś","SAṂBAHUL","aiś","saṃbahula","noun-adj",""
"12","ca","","","ca","ind",""
"13","bodhisattvair","BODHISATTV","air","bodhisattva","noun-adj",""
"","</s>","","","","",""
"","<s number=""11"">","","","","",""
"1","mahāsattvaiḥ","MAHĀSATTV","aiḥ","mahāsattva","noun-adj",""
"2","/","","","","punct",""
"3","tadyathā","","","tadyathā","ind",""
"4","maṃjuśriyā","MAṂJUŚR","iyā","maṃjuśra","noun-adj",""
"5","ca","","","ca","ind",""
"6","kumār","KUMĀR","","kumāra","noun-adj",""
"7","a","","","alpha_privativum","ind",""
"8","bhūtena","BHŪT","ena","bhūta","noun-adj",""
"9","^","","","","",""
"10","a","","","alpha_privativum","ind",""
"11","jitena","JIT","ena","jita","noun-adj",""
"12","ca","","","ca","ind",""
"","</s>","","","","",""
"","<s number=""12"">","","","","",""
"1","bodhisattvena","BODHISATTV","ena","bodhisattva","noun-adj",""
"2","gaṃdhahastinā","GAṂDHAHAST","inā","gaṃdhahasti","noun-adj",""
"3","ca","","","ca","ind",""
"4","bodhisattvena","BODHISATTV","ena","bodhisattva","noun-adj",""
"5","nityodyuktena","NITYODYUKT","ena","nityodyukta","noun-adj",""
"6","ca","","","ca","ind",""
"","</s>","","","","",""
"","<s number=""13"">","","","","",""
"1","bodhisattven","BODHISATTV","en","bodhisattva","noun-adj",""
"2","ānikṣiptadhureṇa","ANIKṢIPTADHUR","eṇa","anikṣiptadhura","noun-adj",""
"","</s>","","","","",""
"","<s number=""14"">","","","","",""
"1","ca","","","ca","ind",""
"2","bodhisattvena","BODHISATTV","ena","bodhisattva","noun-adj",""
"3","/","","","","punct",""
"4","etaiś","","","","ind",""
"5","c","","","ca","ind",""
"6","^","","","","",""
"7","ānyaiś","ANY","aiś","anya","noun-adj",""
"8","ca","","","ca","ind",""
"9","saṃbahulair","SAṂBAHUL","air","saṃbahula","noun-adj",""
"10","bodhisattvair","BODHISATTV","air","bodhisattva","noun-adj",""
"","</s>","","","","",""
"","<s number=""15"">","","","","",""
"1","mahāsattvaiḥ","MAHĀSATTV","aiḥ","mahāsattva","noun-adj",""
"2","/","","","","punct",""
"3","śakreṇa","ŚAKR","eṇa","śakra","noun-adj",""
"4","ca","","","ca","ind",""
"5","devānām","DEV","ānām","deva","noun-adj",""
"6","iṃd","","","","ind",""
"7","reṇa","REṆ","a","reṇa","noun-adj",""
"8","brahmaṇā","BRAHMAṆ","ā","brahmaṇ","verb",""
"9","ca","","","ca","ind",""
"10","sahāṃpatinā","SAHĀMPAT","inā","sa_sahin","ind",""
"11","/","","","","punct",""
"","</s>","","","","",""
"","<s number=""16"">","","","","",""
"1","etaiś","","","","ind",""
"2","c","","","ca","ind",""
"3","^","","","","",""
"4","ānyaiś","ANY","aiś","anya","noun-adj",""
"5","ca","","","ca","ind",""
"6","saṃbahulair","SAṂBAHUL","air","saṃbahula","noun-adj",""
"7","devaputra","DEVAPUTR","a@","devaputra","noun-adj",""
"8","nayuta","NAYUT","a@","nayuta","noun-adj",""
"9","śatasahasraiḥ","ŚATASAHASR","aiḥ","śatasahasra","noun-adj",""
"10","//1//","","","","punct",""
"","</s>","","","","",""
"","<s number=""17"">","","","","",""
"","</page>","","","","",""
"","<page number=""p93","","","","",""
"3",";-j196"">","","","","",""
"","</s>","","","","",""
"","<s number=""18"">","","","","",""
"1","tatra","","","tatra","ind",""
"2","khalu","KHAL","u","khal","verb",""
"3","bhagavān","BHAGAV","ān","bhagavat","noun-adj",""
"4","āyuṣmaṃ","ĀYUṢM","aṃ","āyuṣmat","noun-adj",""
"5","taṃ","","","tad","pron",""
"6","śāriputram","ŚĀRIPUTR","am","śāriputra","noun-adj",""
"7","āmaṃtrayati","ĀMAṂTR","ayati","āmaṃtra","noun-adj",""
"8","sma","","","sma","ind",""
"9","/","","","","punct",""
"10","asti","AST","i","asta","noun-adj",""
"","</s>","","","","",""
"","<s number=""19"">","","","","",""
"1","śāriputra","ŚĀRIPUTR","a","śāriputra","noun-adj",""
"2","paścime","PAŚCIM","e","paścima","noun-adj",""
"3","digbhāga","DIGBHĀG","a","digbhāga","noun-adj",""
"4","ito","","","","ind",""
"5","buddha","BUDDH","a@","buddha","noun-adj",""
"6","kṣetraṃ","KṢETR","aṃ","kṣetra","noun-adj",""
"7","koṭi","KOṬ","i@","koṭi","noun-adj",""
"8","śatasahasraṃ","ŚATASAHASR","aṃ","śatasahasra","noun-adj",""
"9","buddha","BUDDH","a@","buddha","noun-adj",""
"10","kṣetrāṇām","KṢETR","āṇām","kṣetra","noun-adj",""
"","</s>","","","","",""
"","<s number=""20"">","","","","",""
"1","atikramya","ATIKRAM","ya","atikrām","verb","atikram"
"2","sukhāvatī","SUKHĀVAT","ī","sukhāvatī","noun-adj",""
"3","nāma","NĀM","a","nāman","noun-adj",""
"4","lokadhātuḥ","LOKADHĀT","uḥ","lokadhātu","noun-adj",""
"5","/","","","","punct",""
"6","tatr","","","tatra","ind",""
"7","āmitāyur","AMITĀY","ur","amitāyu","noun-adj",""
"8","nāma","NĀM","a","nāman","noun-adj",""
"9","tathāgato","TATHĀGAT","o","tathāgata","noun-adj",""
"","</s>","","","","",""
"","<s number=""21"">","","","","",""
"1","arhan","ARH","an","arhat","noun-adj",""
"2","samyaksaṃbuddha","SAMYAKSAṂBUDDH","a","samyaksaṃbuddha","noun-adj",""
"3","etarhi","ETARH","i","etarhi","noun-adj",""
"4","tiṣṭhati","TIṢṬH","ati","sthā","verb",""
"5","dhriyate","DHRI","yate","dhar","verb","dhṛ"
"6","yāpayati","YĀP","ayati","yā","verb","yā"
"7","dharmaṃ","DHARM","aṃ","dharma","noun-adj",""
"8","ca","","","ca","ind",""
"","</s>","","","","",""
"","<s number=""22"">","","","","",""
"1","deśayati","DEŚ","ayati","diś","verb","diś"
"2","/","","","","punct",""
"3","tat","TAT","","tad","pron",""
"4","kiṃ","","","kim","pron",""
"5","manyase","MAN","yase","man","verb","man"
"6","śāriputra","ŚĀRIPUTR","a","śāriputra","noun-adj",""
"7","kena","KEN","a","kim","pron",""
"8","kāraṇena","KĀRAṆ","ena","kāraṇa","noun-adj",""
"9","sā","","","tad","pron",""
"10","lokadhātuḥ","LOKADHĀT","uḥ","lokadhātu","noun-adj",""
"","</s>","","","","",""
"","<s number=""23"">","","","","",""
"1","sukhāvati","SUKHĀVAT","i","sukhāvatī","noun-adj",""
"2","ity","","","iti","ind",""
"3","ucyate","UC","yate","vak","verb","vac"
"4","/","","","","punct",""
"5","tatra","","","tatra","ind",""
"6","khalu","KHAL","u","khal","verb",""
"7","punaḥ","","","punar","ind",""
"8","śāriputra","ŚĀRIPUTR","a","śāriputra","noun-adj",""
"9","sukhāvatyāṃ","SUKHĀVAT","yāṃ","sukhāvatī","noun-adj",""
"10","lokadhātau","LOKADHĀT","au","lokadhātu","noun-adj",""
"","</s>","","","","",""
"","<s number=""24"">","","","","",""
"1","n","","","na","ind",""
"2","^","","","","",""
"3","āsti","","","as","verb","as"
"4","sattvānāṃ","SATTV","ānāṃ","sattva","noun-adj",""
"5","kāya","KĀY","a@","kāya","noun-adj",""
"6","duḥkhaṃ","DUḤKH","aṃ","duḥkha","noun-adj",""
"7","na","","","na","ind",""
"8","citta","CITT","a@","citta","noun-adj",""
"9","duḥkhaṃ","DUḤKH","aṃ","duḥkha","noun-adj",""
"10","apramāṇāny","APRAMĀṆ","āny","apramāṇa","noun-adj",""
"11","eva","","","eva","ind",""
"12","sukha","SUKH","a@","sukha","noun-adj",""
"13","kāraṇāni","KĀRAṆ","āni","kāraṇa","noun-adj",""
"14","/","","","","punct",""
"","</s>","","","","",""
"","<s number=""25"">","","","","",""
"1","tena","TEN","a","tad","pron",""
"2","kāraṇena","KĀRAṆ","ena","kāraṇa","noun-adj",""
"3","sā","","","tad","pron",""
"4","lokadhātuḥ","LOKADHĀT","uḥ","lokadhātu","noun-adj",""
"5","sukhāvati","SUKHĀVAT","i","sukhāvatī","noun-adj",""
"6","ity","","","iti","ind",""
"7","ucyate","UC","yate","vak","verb","vac"
"8","//2//","","","","punct",""
"","</s>","","","","",""
"","<s number=""26"">","","","","",""
"1","punar","","","punar","ind",""
"2","aparaṃ","APAR","aṃ","apara","noun-adj",""
"3","śāriputra","ŚĀRIPUTR","a","śāriputra","noun-adj",""
"4","sukhāvatī","SUKHĀVAT","ī","sukhāvatī","noun-adj",""
"5","lokadhātuḥ","LOKADHĀT","uḥ","lokadhātu","noun-adj",""
"6","saptabhir","SAPT","abhir","sapta","noun-adj",""
"7","vedikābhiḥ","VEDIK","ābhiḥ","vedikā","noun-adj",""
"","</s>","","","","",""
"","<s number=""27"">","","","","",""
"1","saptabhis","SAPT","abhis","sapta","noun-adj",""
"2","tāla","TĀL","a@","tāla","noun-adj",""
"3","paṃktibhiḥ","PAṄKT","ibhiḥ","paṅkti","noun-adj",""
"4","kiṃkiṇī","KIṄKIṆ","ī@","kiṅkiṇī","noun-adj",""
"5","jālaiś","JĀL","aiś","jāla","noun-adj",""
"6","ca","","","ca","ind",""
"7","samalaṃkṛtā","SAMALAṂKṚT","ā","samalaṃkṛta","noun-adj",""
"8","samaṃ","SAM","aṃ","sama","noun-adj",""
"9","tato","","","tatas","ind",""
"10","anuparikṣiptā","ANUPARIKṢIPT","ā","anuparikṣipta","noun-adj",""
"","</s>","","","","",""
"","<s number=""28"">","","","","",""
"1","citrā","CITR","ā","citra","noun-adj",""
"2","darśanīyā","DARŚANĪY","ā","darśanīya","noun-adj",""
"3","caturṇāṃ","CAT","urṇāṃ","catur","noun-adj",""
"4","ratnānāṃ","RATN","ānāṃ","ratna","noun-adj",""
"5","/","","","","punct",""
"6","tadyathā","","","tadyathā","ind",""
"7","suvarṇasya","SUVARṆAS","ya","suvarṇasa","noun-adj",""
"","</s>","","","","",""
"","<s number=""29"">","","","","",""
"1","rūpyasya","RŪPY","asya","rūpya","noun-adj",""
"2","vaiḍūryasya","VAIḌŪRY","asya","vaiḍūrya","noun-adj",""
"3","sphaṭikasya","SPHAṬIK","asya","sphaṭika","noun-adj",""
"4","/","","","","punct",""
"5","evaṃrūpaiḥ","EVAṂRŪP","aiḥ","evaṃrūpa","noun-adj",""
"6","śāriputra","ŚĀRIPUTR","a","śāriputra","noun-adj",""
"7","buddha","BUDDH","a@","buddha","noun-adj",""
"8","kṣetr","KṢETR","","kṣetra","noun-adj",""
"9","aguṇa","AGUṆ","a@","aguṇa","noun-adj",""
"10","vyūhaiḥ","VYŪH","aiḥ","vyūha","noun-adj",""
"","</s>","","","","",""
"","<s number=""30"">","","","","",""
"1","samalaṃkṛtaṃ","SAMALAṂKṚT","aṃ","samalaṃkṛta","noun-adj",""
"2","tad","TAD","","tad","pron",""
"3","buddha","BUDDH","a@","buddha","noun-adj",""
"4","kṣetraṃ","KṢETR","aṃ","kṣetra","noun-adj",""
"5","//3//","","","","punct",""
"","</s>","","","","",""
"","<s number=""31"">","","","","",""
"1","punar","","","punar","ind",""
"2","aparaṃ","APAR","aṃ","apara","noun-adj",""
"3","śāriputra","ŚĀRIPUTR","a","śāriputra","noun-adj",""
"4","sukhāvatyāṃ","SUKHĀVAT","yāṃ","sukhāvatī","noun-adj",""
"5","lokadhātau","LOKADHĀT","au","lokadhātu","noun-adj",""
"6","saptaratnamayyaḥ","SAPTARATNAMAY","yaḥ","saptaratnamaya","noun-adj",""
"7","puṣkariṇyaḥ","PUṢKARIṆ","yaḥ","puṣkariṇī","noun-adj",""
"8","/","","","","punct",""
"","</s>","","","","",""
"","<s number=""32"">","","","","",""
"1","tadyathā","","","tadyathā","ind",""
"2","suvarṇasya","SUVARṆAS","ya","suvarṇasa","noun-adj",""
"3","rūpyasya","RŪPY","asya","rūpya","noun-adj",""
"4","vaiḍūryasya","VAIḌŪRY","asya","vaiḍūrya","noun-adj",""
"5","sphaṭikasya","SPHAṬIK","asya","sphaṭika","noun-adj",""
"6","lohitamuktasy","LOHITAMUKT","asy","lohitamukta","noun-adj",""
"7","āśmagarbhasya","AŚMAGARBH","asya","aśmagarbha","noun-adj",""
"8","musāragalvasya","MUSĀRAGALV","asya","musāragalva","noun-adj",""
"9","saptamasya","SAPTAM","asya","saptama","noun-adj",""
"10","ratnasya","RATNAS","ya","ratnasū","noun-adj",""
"11","/","","","","punct",""
"12","aṣṭāṃ","AṢṬ","āṃ","aṣṭā","noun-adj",""
"13","gopet","GOP","et","gop","verb","gup"
"14","avāri","AVĀR","i","avāri","noun-adj",""
"","</s>","","","","",""
"","<s number=""33"">","","","","",""
"1","paripūrṇāḥ","PARIPŪRṆ","āḥ","paripūrṇa","noun-adj",""
"2","samatīrthakāḥ","SAMATĪRTHAK","āḥ","samatīrthaka","noun-adj",""
"3","kākapeyā","KĀKAPEY","ā","kākapeya","noun-adj",""
"4","suvarṇava","SUVARṆAV","a@","suvarṇavat","noun-adj",""
"5","āluka","ĀLUK","a@","āluka","noun-adj",""
"6","ā","","","alpha_privativum","ind",""
"7","saṃstṛtāḥ","SAṂSTṚT","āḥ","saṃstṛta","noun-adj",""
"8","/","","","","punct",""
"","</s>","","","","",""
"","<s number=""34"">","","","","",""
"1","tāsu","","","tad","pron",""
"2","ca","","","ca","ind",""
"3","puṣkariṇīṣu","PUṢKARIṆ","īṣu","puṣkariṇī","noun-adj",""
"4","samaṃ","SAM","aṃ","sama","noun-adj",""
"5","tāc","","","","ind",""
"6","caturdi","CATURD","i@","caturdat","noun-adj",""
"7","śaṃ","ŚAṂ","","śaṃs","noun-adj",""
"8","catvāri","CATVĀR","i","catur","noun-adj",""
"9","sopānāni","SOPĀN","āni","sopāna","noun-adj",""
"10","citrāṇi","CITRĀṆ","i","citrāṇi","noun-adj",""
"","</s>","","","","",""
"","<s number=""35"">","","","","",""
"1","darśanīyāni","DARŚANĪY","āni","darśanīya","noun-adj",""
"2","caturṇāṃ","CAT","urṇāṃ","catur","noun-adj",""
"3","ratnānāṃ","RATN","ānāṃ","ratna","noun-adj",""
"4","/","","","","punct",""
"5","tadyathā","","","tadyathā","ind",""
"6","suvarṇasya","SUVARṆAS","ya","suvarṇasa","noun-adj",""
"7","rūpyasya","RŪPY","asya","rūpya","noun-adj",""
"8","vaiḍūryasya","VAIḌŪRY","asya","vaiḍūrya","noun-adj",""
"","</s>","","","","",""
"","<s number=""36"">","","","","",""
"1","sphaṭikasya","SPHAṬIK","asya","sphaṭika","noun-adj",""
"2","/","","","","punct",""
"3","tāsāṃ","","","tad","pron",""
"4","ca","","","ca","ind",""
"5","puṣkariṇīnāṃ","PUṢKARIṆ","īnāṃ","puṣkariṇī","noun-adj",""
"6","samaṃ","SAM","aṃ","sama","noun-adj",""
"7","tād","TĀD","","tādṛ","noun-adj",""
"8","ratnavṛkṣā","RATNAVṚKṢ","ā","ratnavṛkṣa","noun-adj",""
"9","jātāś","JĀT","āś","jāta","noun-adj",""
"10","citrā","CITR","ā","citra","noun-adj",""
"","</s>","","","","",""
"","<s number=""37"">","","","","",""
"1","darśanīyā","DARŚANĪY","ā","darśanīya","noun-adj",""
"2","saptānāṃ","SAPT","ānāṃ","sapta","noun-adj",""
"3","ratnānāṃ","RATN","ānāṃ","ratna","noun-adj",""
"4","/","","","","punct",""
"5","tadyathā","","","tadyathā","ind",""
"6","suvarṇasya","SUVARṆAS","ya","suvarṇasa","noun-adj",""
"7","rūpyasya","RŪPY","asya","rūpya","noun-adj",""
"8","vaiḍūryasya","VAIḌŪRY","asya","vaiḍūrya","noun-adj",""
"","</s>","","","","",""
"","<s number=""38"">","","","","",""
"1","sphaṭikasya","SPHAṬIK","asya","sphaṭika","noun-adj",""
"2","lohitamuktasy","LOHITAMUKT","asy","lohitamukta","noun-adj",""
"3","āśmagarbhasya","AŚMAGARBH","asya","aśmagarbha","noun-adj",""
"4","musāragalvasya","MUSĀRAGALV","asya","musāragalva","noun-adj",""
"5","saptamasya","SAPTAM","asya","saptama","noun-adj",""
"","</s>","","","","",""
"","<s number=""39"">","","","","",""
"","</page>","","","","",""
"","<page number=""p94","","","","",""
"3",";-j198"">","","","","",""
"","</s>","","","","",""
"","<s number=""40"">","","","","",""
"1","ratnasya","RATNAS","ya","ratnasū","noun-adj",""
"2","/","","","","punct",""
"3","tāsu","","","tad","pron",""
"4","ca","","","ca","ind",""
"5","puṣkariṇīṣu","PUṢKARIṆ","īṣu","puṣkariṇī","noun-adj",""
"6","saṃti","","","","ind",""
"7","padmāni","PADM","āni","padma","noun-adj",""
"8","jātāni","JĀT","āni","jāta","noun-adj",""
"9","nīlāni","NĪL","āni","nīla","noun-adj",""
"","</s>","","","","",""
"","<s number=""41"">","","","","",""
"1","nīlavarṇāni","NĪLAVARṆ","āni","nīlavarṇa","noun-adj",""
"2","nīla","NĪL","a@","nīla","noun-adj",""
"3","nirbhāsāni","NIRBHĀS","āni","nirbhāsa","noun-adj",""
"4","nīla","NĪL","a@","nīla","noun-adj",""
"5","nidarśanāni","NIDARŚAN","āni","nidarśana","noun-adj",""
"6","/","","","","punct",""
"7","pītāni","PĪT","āni","pīta","noun-adj",""
"","</s>","","","","",""
"","<s number=""42"">","","","","",""
"1","pītavarṇāni","PĪTAVARṆ","āni","pītavarṇa","noun-adj",""
"2","pīta","PĪT","a@","pīta","noun-adj",""
"3","nirbhāsāni","NIRBHĀS","āni","nirbhāsa","noun-adj",""
"4","pīta","PĪT","a@","pīta","noun-adj",""
"5","nidarśanāni","NIDARŚAN","āni","nidarśana","noun-adj",""
"6","/","","","","punct",""
"7","lohitāni","LOHIT","āni","lohita","noun-adj",""
"","</s>","","","","",""
"","<s number=""43"">","","","","",""
"1","lohita","LOHIT","a@","lohita","noun-adj",""
"2","varṇāni","VARṆ","āni","varṇa","noun-adj",""
"3","lohita","LOHIT","a@","lohita","noun-adj",""
"4","nirbhāsāni","NIRBHĀS","āni","nirbhāsa","noun-adj",""
"5","lohita","LOHIT","a@","lohita","noun-adj",""
"6","nidarśanāni","NIDARŚAN","āni","nidarśana","noun-adj",""
"7","/","","","","punct",""
"8","avadātāny","AVADĀT","āny","avadāta","noun-adj",""
"","</s>","","","","",""
"","<s number=""44"">","","","","",""
"1","avadāt","AVAD","āt","avada","noun-adj",""
"2","avarṇāny","AVARṆ","āny","avarṇa","noun-adj",""
"3","avadāta","AVADĀT","a@","avadāta","noun-adj",""
"4","nirbhāsāny","NIRBHĀS","āny","nirbhāsa","noun-adj",""
"5","avadāta","AVADĀT","a@","avadāta","noun-adj",""
"6","nidarśanāni","NIDARŚAN","āni","nidarśana","noun-adj",""
"7","/","","","","punct",""
"8","citrāni","CITR","āni","citra","noun-adj",""
"","</s>","","","","",""
"","<s number=""45"">","","","","",""
"1","citravarṇāni","CITRAVARṆ","āni","citravarṇa","noun-adj",""
"2","citra","CITR","a@","citra","noun-adj",""
"3","nirbhāsāni","NIRBHĀS","āni","nirbhāsa","noun-adj",""
"4","citra","CITR","a@","citra","noun-adj",""
"5","nidarśanāni","NIDARŚAN","āni","nidarśana","noun-adj",""
"6","śakaṭa","ŚAKAṬ","a@","śakaṭa","noun-adj",""
"7","cakra","CAKR","a@","cakra","noun-adj",""
"8","pramāṇa","PRAMĀṆ","a@","pramāṇa","noun-adj",""
"9","pariṇāhāni","PARIṆĀH","āni","pariṇāha","noun-adj",""
"10","/","","","","punct",""
"11","evaṃrūpaiḥ","EVAṂRŪP","aiḥ","evaṃrūpa","noun-adj",""
"12","śāriputra","ŚĀRIPUTR","a","śāriputra","noun-adj",""
"13","buddha","BUDDH","a@","buddha","noun-adj",""
"14","kṣetr","KṢETR","","kṣetra","noun-adj",""
"15","aguṇa","AGUṆ","a@","aguṇa","noun-adj",""
"16","vyūhaiḥ","VYŪH","aiḥ","vyūha","noun-adj",""
"17","samalaṃkṛtaṃ","SAMALAṂKṚT","aṃ","samalaṃkṛta","noun-adj",""
"","</s>","","","","",""
"","<s number=""46"">","","","","",""
"1","tad","TAD","","tad","pron",""
"2","buddha","BUDDH","a@","buddha","noun-adj",""
"3","kṣetraṃ","KṢETR","aṃ","kṣetra","noun-adj",""
"4","//4//","","","","punct",""
"","</s>","","","","",""
"","<s number=""47"">","","","","",""
"1","punar","","","punar","ind",""
"2","aparaṃ","APAR","aṃ","apara","noun-adj",""
"3","śāriputra","ŚĀRIPUTR","a","śāriputra","noun-adj",""
"4","tatra","","","tatra","ind",""
"5","buddha","BUDDH","a@","buddha","noun-adj",""
"6","kṣetre","KṢETR","e","kṣetra","noun-adj",""
"7","nitya","NITY","a@","nitya","noun-adj",""
"8","pravāditāni","PRAVĀDIT","āni","pravādita","noun-adj",""
"9","divyāni","DIVY","āni","divya","noun-adj",""
"","</s>","","","","",""
"","<s number=""48"">","","","","",""
"1","tūryāṇi","TŪRY","āṇi","tūrya","noun-adj",""
"2","suvarṇavarṇā","SUVARṆAVARṆ","ā","suvarṇavarṇā","noun-adj",""
"3","ca","","","ca","ind",""
"4","mahāpṛthivī","MAHĀPṚTHIV","ī","mahāpṛthivī","noun-adj",""
"5","ramaṇīyā","RAMAṆĪY","ā","ramaṇīyā","noun-adj",""
"6","/","","","","punct",""
"7","tatra","","","tatra","ind",""
"8","ca","","","ca","ind",""
"9","buddha","BUDDH","a@","buddha","noun-adj",""
"10","kṣetre","KṢETR","e","kṣetra","noun-adj",""
"","</s>","","","","",""
"","<s number=""49"">","","","","",""
"1","triṣkṛtvo","TRIṢKṚTV","o","triṣkṛtvas","noun-adj",""
"2","rātrau","RĀTR","au","rātra","noun-adj",""
"3","triṣkṛtvo","TRIṢKṚTV","o","triṣkṛtvas","noun-adj",""
"4","divasasya","DIVAS","asya","divasa","noun-adj",""
"5","puṣpavarṣaṃ","PUṢPAVARṢ","aṃ","puṣpavarṣa","noun-adj",""
"6","pravarṣati","PRAVARṢ","ati","pravarṣat","noun-adj",""
"7","divyānāṃ","DIVY","ānāṃ","divya","noun-adj",""
"","</s>","","","","",""
"","<s number=""50"">","","","","",""
"1","māṃ","","","mat","pron",""
"2","dārava","DĀRAV","a@","dārava","noun-adj",""
"3","puṣpāṇāṃ","PUṢP","āṇāṃ","puṣpa","noun-adj",""
"4","/","","","","punct",""
"5","tatra","","","tatra","ind",""
"6","ye","","","yad","pron",""
"7","sattvā","SATTV","ā","sattva","noun-adj",""
"8","upapannās","UPAPANN","ās","upapanna","noun-adj",""
"9","ta","","","tad","pron",""
"10","e","","","","ind",""
"11","kena","KEN","a","kim","pron",""
"12","purobhaktena","PUROBHAKT","ena","purobhakta","noun-adj",""
"","</s>","","","","",""
"","<s number=""51"">","","","","",""
"1","koṭi","KOṬ","i@","koṭi","noun-adj",""
"2","śatasahasraṃ","ŚATASAHASR","aṃ","śatasahasra","noun-adj",""
"3","buddhānāṃ","BUDDH","ānāṃ","buddha","noun-adj",""
"4","vaṃdaṃty","","","","ind",""
"5","anyāṃ","ANY","āṃ","anya","noun-adj",""
"6","lokadhātūn","LOKADHĀT","ūn","lokadhātu","noun-adj",""
"7","gatvā","GAT","vā","gata","noun-adj",""
"8","/","","","","punct",""
"9","ekaikaṃ","EKAIK","aṃ","ekaika","noun-adj",""
"10","ca","","","ca","ind",""
"","</s>","","","","",""
"","<s number=""52"">","","","","",""
"1","tathāgataṃ","TATHĀGAT","aṃ","tathāgata","noun-adj",""
"2","koṭi","KOṬ","i@","koṭi","noun-adj",""
"3","śatasahasrābhiḥ","ŚATASAHASR","ābhiḥ","śatasahasra","noun-adj",""
"4","puṣpa","PUṢP","a@","puṣpa","noun-adj",""
"5","vṛṣṭibhir","VṚṢṬ","ibhir","vṛṣṭi","noun-adj",""
"6","abhyavakīrya","ABHYAVAKĪR","ya","abhyavakīr","verb",""
"7","punar","","","punar","ind",""
"8","api","","","api","ind",""
"","</s>","","","","",""
"","<s number=""53"">","","","","",""
"1","tām","TĀM","","tad","pron",""
"2","eva","","","eva","ind",""
"3","lokadhātum","LOKADHĀT","um","lokadhātu","noun-adj",""
"4","āgacchaṃti","ĀGACCH","aṃti","āgaccha","noun-adj",""
"5","divāvihārāya","DIVĀVIHĀR","āya","divāvihāra","noun-adj",""
"6","/","","","","punct",""
"7","evaṃrūpaiḥ","EVAṂRŪP","aiḥ","evaṃrūpa","noun-adj",""
"8","śāriputra","ŚĀRIPUTR","a","śāriputra","noun-adj",""
"","</s>","","","","",""
"","<s number=""54"">","","","","",""
"1","buddha","BUDDH","a@","buddha","noun-adj",""
"2","kṣetr","KṢETR","","kṣetra","noun-adj",""
"3","aguṇa","AGUṆ","a@","aguṇa","noun-adj",""
"4","vyūhaiḥ","VYŪH","aiḥ","vyūha","noun-adj",""
"5","samalaṃkṛtaṃ","SAMALAṂKṚT","aṃ","samalaṃkṛta","noun-adj",""
"6","tad","TAD","","tad","pron",""
"7","buddha","BUDDH","a@","buddha","noun-adj",""
"8","kṣetraṃ","KṢETR","aṃ","kṣetra","noun-adj",""
"9","//5//","","","","punct",""
"","</s>","","","","",""
"","<s number=""55"">","","","","",""
"1","punar","","","punar","ind",""
"2","aparaṃ","APAR","aṃ","apara","noun-adj",""
"3","śāriputra","ŚĀRIPUTR","a","śāriputra","noun-adj",""
"4","tatra","","","tatra","ind",""
"5","buddha","BUDDH","a@","buddha","noun-adj",""
"6","kṣetre","KṢETR","e","kṣetra","noun-adj",""
"7","saṃti","","","","ind",""
"8","haṃsāḥ","HAṂS","āḥ","haṃsa","noun-adj",""
"9","krai","","","","ind",""
"10","c","","","ca","ind",""
"11","^","","","","",""
"12","ā","","","alpha_privativum","ind",""
"13","mayūrāś","MAYŪR","āś","mayūra","noun-adj",""
"14","ca","","","ca","ind",""
"15","/","","","","punct",""
"","</s>","","","","",""
"","<s number=""56"">","","","","",""
"1","te","","","tad","pron",""
"2","triṣkṛtvo","TRIṢKṚTV","o","triṣkṛtvas","noun-adj",""
"3","rātrau","RĀTR","au","rātra","noun-adj",""
"4","triṣkṛtvo","TRIṢKṚTV","o","triṣkṛtvas","noun-adj",""
"5","divasasya","DIVAS","asya","divasa","noun-adj",""
"6","saṃnipatya","SAṂNIPAT","ya","saṃnipat","verb",""
"7","saṃgītiṃ","SAṂGĪT","iṃ","saṃgīti","noun-adj",""
"8","kurvaṃti","KURV","aṃti","kurvat","noun-adj",""
"","</s>","","","","",""
"","<s number=""57"">","","","","",""
"1","sma","","","sma","ind",""
"2","svakasvakāni","SVAKASVAK","āni","svakasvaka","noun-adj",""
"3","ca","","","ca","ind",""
"4","rutāni","RUT","āni","ruta","noun-adj",""
"5","pravyāharaṃti","PRAVYĀHAR","aṃti","pravyāhar","verb",""
"6","/","","","","punct",""
"7","teṣāṃ","","","tad","pron",""
"8","pravyāharatām","PRAVYĀHAR","atām","pravihar","verb","pravihṛ"
"","</s>","","","","",""
"","<s number=""58"">iṃ","","iṃ","","",""
"1","driya","DRIY","a@","driyate","noun-adj",""
"2","bala","BAL","a@","bala","noun-adj",""
"3","bodhy","BODH","y@","bodhi","noun-adj",""
"4","aṃga","AṄG","a@","aṅga","noun-adj",""
"5","śabdo","ŚABD","o","śabda","noun-adj",""
"6","niścarati","NIŚCAR","ati","niścar","verb","niścar"
"7","/","","","","punct",""
"8","tatra","","","tatra","ind",""
"9","teṣāṃ","","","tad","pron",""
"10","manuṣyāṇāṃ","MANUṢY","āṇāṃ","manuṣya","noun-adj",""
"11","taṃ","","","tad","pron",""
"12","śabdaṃ","ŚABD","aṃ","śabda","noun-adj",""
"","</s>","","","","",""
"","<s number=""59"">","","","","",""
"1","śrutvā","ŚRUT","vā","śruta","noun-adj",""
"2","buddha","BUDDH","a@","buddha","noun-adj",""
"3","manasikāra","MANASIKĀR","a","manasikāra","noun-adj",""
"4","utpadyate","UTPAD","yate","utpad","verb","utpad"
"5","dharma","DHARM","a@","dharma","noun-adj",""
"6","manasikāra","MANASIKĀR","a","manasikāra","noun-adj",""
"7","utpadyate","UTPAD","yate","utpad","verb","utpad"
"8","saṃgha","SAṂGH","a@","saṃgha","noun-adj",""
"9","manasikāra","MANASIKĀR","a","manasikāra","noun-adj",""
"","</s>","","","","",""
"","<s number=""60"">","","","","",""
"1","utpadyate","UTPAD","yate","utpad","verb","utpad"
"2","//","","","","punct",""
"3","tat","TAT","","tad","pron",""
"4","kiṃ","","","kim","pron",""
"5","manyase","MAN","yase","man","verb","man"
"6","śāriputra","ŚĀRIPUTR","a","śāriputra","noun-adj",""
"7","tiryagyoni","TIRYAGYON","i@","tiryagyoni","noun-adj",""
"8","gatās","GATĀS","","gatāsu","noun-adj",""
"9","te","","","tad","pron",""
"","</s>","","","","",""
"","<s number=""61"">","","","","",""
"","</page>","","","","",""
"","<page number=""p95","","","","",""
"3",";-j200"">","","","","",""
"","</s>","","","","",""
"","<s number=""62"">","","","","",""
"1","sattvāḥ","SATTV","āḥ","sattva","noun-adj",""
"2","/","","","","punct",""
"3","na","","","na","ind",""
"4","punar","","","punar","ind",""
"5","evaṃ","","","eva","ind",""
"6","draṣṭavyaṃ","DRAṢ","ṭavyaṃ","darś","verb","dṛś"
"7","/","","","","punct",""
"8","tat","TAT","","tad","pron",""
"9","kasmād","KASMĀD","","kimcit","noun-adj",""
"10","hetoḥ","HET","oḥ","hetu","noun-adj",""
"11","/","","","","punct",""
"12","nāma","NĀM","a","nāman","noun-adj",""
"13","^","","","","",""
"14","āpi","","","api","ind",""
"15","śāriputra","ŚĀRIPUTR","a","śāriputra","noun-adj",""
"","</s>","","","","",""
"","<s number=""63"">","","","","",""
"1","tatra","","","tatra","ind",""
"2","buddha","BUDDH","a@","buddha","noun-adj",""
"3","kṣetre","KṢETR","e","kṣetra","noun-adj",""
"4","nirayāṇāṃ","NIRAY","āṇāṃ","niraya","noun-adj",""
"5","n","","","na","ind",""
"6","^","","","","",""
"7","āsti","","","as","verb","as"
"8","tiryagyonīnāṃ","TIRYAGYON","īnāṃ","tiryagyoni","noun-adj",""
"9","yamalokasya","YAMALOK","asya","yamaloka","noun-adj",""
"","</s>","","","","",""
"","<s number=""64"">","","","","",""
"1","n","","","na","ind",""
"2","^","","","","",""
"3","āsti","","","as","verb","as"
"4","/","","","","punct",""
"5","te","","","tad","pron",""
"6","punaḥ","","","punar","ind",""
"7","pakṣi","PAKṢ","i@","pakṣin","noun-adj",""
"8","saṃghās","SAṂGH","ās","saṃgha","noun-adj",""
"9","tena","TEN","a@","tad","pron",""
"10","āmitāyuṣā","AMITĀY","uṣā","amitāyu","noun-adj",""
"11","tathāgatena","TATHĀGAT","ena","tathāgata","noun-adj",""
"12","nirmitā","NIRMIT","ā","nirmita","noun-adj",""
"","</s>","","","","",""
"","<s number=""65"">","","","","",""
"1","dharmaś","DHARM","aś","dharma","noun-adj",""
"2","abdaṃ","ABD","aṃ","abda","noun-adj",""
"3","niścārayaṃ","NIŚCĀR","ayaṃ","niścār","verb",""
"4","ti","","","","ind",""
"5","/","","","","punct",""
"6","evaṃrūpaiḥ","EVAṂRŪP","aiḥ","evaṃrūpa","noun-adj",""
"7","śāriputra","ŚĀRIPUTR","a","śāriputra","noun-adj",""
"8","buddha","BUDDH","a@","buddha","noun-adj",""
"9","kṣetr","KṢETR","","kṣetra","noun-adj",""
"10","aguṇa","AGUṆ","a@","aguṇa","noun-adj",""
"11","vyūhaiḥ","VYŪH","aiḥ","vyūha","noun-adj",""
"","</s>","","","","",""
"","<s number=""66"">","","","","",""
"1","samalaṃkṛtaṃ","SAMALAṂKṚT","aṃ","samalaṃkṛta","noun-adj",""
"2","tad","TAD","","tad","pron",""
"3","buddha","BUDDH","a@","buddha","noun-adj",""
"4","kṣetraṃ","KṢETR","aṃ","kṣetra","noun-adj",""
"5","//6//","","","","punct",""
"","</s>","","","","",""
"","<s number=""67"">","","","","",""
"1","punar","","","punar","ind",""
"2","aparaṃ","APAR","aṃ","apara","noun-adj",""
"3","śāriputra","ŚĀRIPUTR","a","śāriputra","noun-adj",""
"4","tatra","","","tatra","ind",""
"5","buddha","BUDDH","a@","buddha","noun-adj",""
"6","kṣetre","KṢETR","e","kṣetra","noun-adj",""
"7","tāsāṃ","","","tad","pron",""
"8","ca","","","ca","ind",""
"9","tāla","TĀL","a@","tāla","noun-adj",""
"10","paṃktīnāṃ","PAṄKT","īnāṃ","paṅkti","noun-adj",""
"11","teṣāṃ","","","tad","pron",""
"12","ca","","","ca","ind",""
"","</s>","","","","",""
"","<s number=""68"">","","","","",""
"1","kiṃ","","","kim","pron",""
"2","kiṇī","KIṆ","ī@","kiṇī","noun-adj",""
"3","jālānāṃ","JĀL","ānāṃ","jāla","noun-adj",""
"4","vāta","VĀT","a@","vāta","noun-adj",""
"5","eritānāṃ","ERIT","ānāṃ","erita","noun-adj",""
"6","valgur","VALG","ur","valgu","noun-adj",""
"7","manojñaḥ","MANOJÑ","aḥ","manojña","noun-adj",""
"8","śabdo","ŚABD","o","śabda","noun-adj",""
"9","niścarati","NIŚCAR","ati","niścar","verb","niścar"
"10","/","","","","punct",""
"","</s>","","","","",""
"","<s number=""69"">","","","","",""
"1","tadyath","","","tadyathā","ind",""
"2","āpi","","","api","ind",""
"3","nāma","NĀM","a","nāman","noun-adj",""
"4","śāriputra","ŚĀRIPUTR","a","śāriputra","noun-adj",""
"5","koṭi","KOṬ","i@","koṭi","noun-adj",""
"6","śatasahasra","ŚATASAHASR","a@","śatasahasra","noun-adj",""
"7","āṃgikasya","ĀṄGIK","asya","āṅgika","noun-adj",""
"8","divyasya","DIVY","asya","divya","noun-adj",""
"9","tūryasya","TŪRY","asya","tūrya","noun-adj",""
"","</s>","","","","",""
"","<s number=""70"">","","","","",""
"1","cāryaiḥ","CĀRY","aiḥ","cārya","noun-adj",""
"2","saṃpravāditasya","SAṂPRAVĀDIT","asya","saṃpravādita","noun-adj",""
"3","valgur","VALG","ur","valgu","noun-adj",""
"4","manojñaḥ","MANOJÑ","aḥ","manojña","noun-adj",""
"5","śabdo","ŚABD","o","śabda","noun-adj",""
"6","niścarati","NIŚCAR","ati","niścar","verb","niścar"
"7","evam","","","eva","ind",""
"8","eva","","","eva","ind",""
"","</s>","","","","",""
"","<s number=""71"">","","","","",""
"1","śāriputra","ŚĀRIPUTR","a","śāriputra","noun-adj",""
"2","tāsāṃ","","","tad","pron",""
"3","ca","","","ca","ind",""
"4","tāla","TĀL","a@","tāla","noun-adj",""
"5","paṃktīnāṃ","PAṄKT","īnāṃ","paṅkti","noun-adj",""
"6","teṣāṃ","","","tad","pron",""
"7","ca","","","ca","ind",""
"8","kiṃ","","","kim","pron",""
"9","kiṇī","KIṆ","ī@","kiṇī","noun-adj",""
"10","jālānāṃ","JĀL","ānāṃ","jāla","noun-adj",""
"","</s>","","","","",""
"","<s number=""72"">","","","","",""
"1","vāta","VĀT","a@","vāta","noun-adj",""
"2","eritānāṃ","ERIT","ānāṃ","erita","noun-adj",""
"3","valgur","VALG","ur","valgu","noun-adj",""
"4","manojñaḥ","MANOJÑ","aḥ","manojña","noun-adj",""
"5","śabdo","ŚABD","o","śabda","noun-adj",""
"6","niścarati","NIŚCAR","ati","niścar","verb","niścar"
"7","/","","","","punct",""
"8","tatra","","","tatra","ind",""
"9","teṣāṃ","","","tad","pron",""
"10","manuṣyāṇāṃ","MANUṢY","āṇāṃ","manuṣya","noun-adj",""
"","</s>","","","","",""
"","<s number=""73"">","","","","",""
"1","taṃ","","","tad","pron",""
"2","śabdaṃ","ŚABD","aṃ","śabda","noun-adj",""
"3","śrutvā","ŚRUT","vā","śruta","noun-adj",""
"4","buddhānusmṛtiḥ","BUDDHĀNUSMṚT","iḥ","buddhānusmṛti","noun-adj",""
"5","kāye","KĀY","e","kāya","noun-adj",""
"6","saṃtiṣṭhati","SAṂTIṢṬH","ati","saṃtiṣṭh","verb","saṃsthā"
"7","dharmānusmṛtiḥ","DHARMĀNUSMṚT","iḥ","dharmānusmṛti","noun-adj",""
"8","kāye","KĀY","e","kāya","noun-adj",""
"","</s>","","","","",""
"","<s number=""74"">","","","","",""
"1","saṃtiṣṭhati","SAṂTIṢṬH","ati","saṃtiṣṭh","verb","saṃsthā"
"2","saṃgha","SAṂGH","a@","saṃgha","noun-adj",""
"3","ānusmṛtiḥ","ANUSMṚT","iḥ","anusmṛti","noun-adj",""
"4","kāye","KĀY","e","kāya","noun-adj",""
"5","saṃtiṣṭhati","SAṂTIṢṬH","ati","saṃtiṣṭh","verb","saṃsthā"
"6","/","","","","punct",""
"7","evaṃrūpaiḥ","EVAṂRŪP","aiḥ","evaṃrūpa","noun-adj",""
"8","śāriputra","ŚĀRIPUTR","a","śāriputra","noun-adj",""
"","</s>","","","","",""
"","<s number=""75"">","","","","",""
"1","buddha","BUDDH","a@","buddha","noun-adj",""
"2","kṣetr","KṢETR","","kṣetra","noun-adj",""
"3","aguṇa","AGUṆ","a@","aguṇa","noun-adj",""
"4","vyūhaiḥ","VYŪH","aiḥ","vyūha","noun-adj",""
"5","samalaṃkṛtaṃ","SAMALAṂKṚT","aṃ","samalaṃkṛta","noun-adj",""
"6","tad","TAD","","tad","pron",""
"7","buddha","BUDDH","a@","buddha","noun-adj",""
"8","kṣetraṃ","KṢETR","aṃ","kṣetra","noun-adj",""
"9","//7//","","","","punct",""
"","</s>","","","","",""
"","<s number=""76"">","","","","",""
"1","tat","TAT","","tad","pron",""
"2","kiṃ","","","kim","pron",""
"3","manyase","MAN","yase","man","verb","man"
"4","śāriputra","ŚĀRIPUTR","a","śāriputra","noun-adj",""
"5","kena","KEN","a","kim","pron",""
"6","kāraṇena","KĀRAṆ","ena","kāraṇa","noun-adj",""
"7","sa","","","sa_saha","ind",""
"8","tathāgato","TATHĀGAT","o","tathāgata","noun-adj",""
"9","amitāyur","AMITĀY","ur","amitāyu","noun-adj",""
"10","nāma","NĀM","a@","nāman","noun-adj",""
"11","ocyate","UC","yate","vak","verb","vac"
"12","/","","","","punct",""
"","</s>","","","","",""
"","<s number=""77"">","","","","",""
"1","tasya","","","tad","pron",""
"2","khalu","KHAL","u","khal","verb",""
"3","punaḥ","","","punar","ind",""
"4","śāriputra","ŚĀRIPUTR","a","śāriputra","noun-adj",""
"5","tathāgatasya","TATHĀGAT","asya","tathāgata","noun-adj",""
"6","teṣāṃ","","","tad","pron",""
"7","ca","","","ca","ind",""
"8","manuṣyāṇām","MANUṢY","āṇām","manuṣya","noun-adj",""
"","</s>","","","","",""
"","<s number=""78"">","","","","",""
"1","aparimitam","APARIMIT","am","aparimita","noun-adj",""
"2","āyuḥ","ĀYUṢ","","āyuṣa","noun-adj",""
"3","pramāṇaṃ","PRAMĀṆ","aṃ","pramāṇa","noun-adj",""
"4","/","","","","punct",""
"5","tena","TEN","a","tad","pron",""
"6","kāraṇena","KĀRAṆ","ena","kāraṇa","noun-adj",""
"7","sa","","","sa_saha","ind",""
"8","tathāgato","TATHĀGAT","o","tathāgata","noun-adj",""
"9","amitāyur","AMITĀY","ur","amitāyu","noun-adj",""
"10","nāma","NĀM","a@","nāman","noun-adj",""
"11","ocyate","UC","yate","vak","verb","vac"
"12","/","","","","punct",""
"","</s>","","","","",""
"","<s number=""79"">","","","","",""
"1","tasya","","","tad","pron",""
"2","ca","","","ca","ind",""
"3","śāriputra","ŚĀRIPUTR","a","śāriputra","noun-adj",""
"4","tathāgatasya","TATHĀGAT","asya","tathāgata","noun-adj",""
"5","daśa","DAŚ","a","daśa","noun-adj",""
"6","kalpā","KALP","ā","kalpa","noun-adj",""
"7","anuttarāṃ","ANUTTAR","āṃ","anuttara","noun-adj",""
"","</s>","","","","",""
"","<s number=""80"">","","","","",""
"1","samyaksaṃbodhim","SAMYAKSAṂBODH","im","samyaksaṃbodhi","noun-adj",""
"2","abhisaṃbuddhasya","ABHISAMBUDDH","asya","abhisambuddha","noun-adj",""
"3","//8//","","","","punct",""
"","</s>","","","","",""
"","<s number=""81"">","","","","",""
"1","tat","TAT","","tad","pron",""
"2","kiṃ","","","kim","pron",""
"3","manyase","MAN","yase","man","verb","man"
"4","śāriputra","ŚĀRIPUTR","a","śāriputra","noun-adj",""
"5","kena","KEN","a","kim","pron",""
"6","kāraṇena","KĀRAṆ","ena","kāraṇa","noun-adj",""
"7","sa","","","sa_saha","ind",""
"8","tathāgato","TATHĀGAT","o","tathāgata","noun-adj",""
"9","amitābho","AMITĀBH","o","amitābha","noun-adj",""
"","</s>","","","","",""
"","<s number=""82"">","","","","",""
"1","nāma","NĀM","a@","nāman","noun-adj",""
"2","ocyate","UC","yate","vak","verb","vac"
"3","/","","","","punct",""
"4","tasya","","","tad","pron",""
"5","khalu","KHAL","u","khal","verb",""
"6","punaḥ","","","punar","ind",""
"7","śāriputra","ŚĀRIPUTR","a","śāriputra","noun-adj",""
"8","tathāgatas","TATHĀGAT","as","tathāgata","noun-adj",""
"9","yābha","YĀBH","a@","yābha","noun-adj",""
"10","ā","","","alpha_privativum","ind",""
"11","pratihatā","PRATIHAT","ā","pratihata","noun-adj",""
"","</s>","","","","",""
"","<s number=""83"">","","","","",""
"1","sarva","SARV","a@","sarva","noun-adj",""
"2","buddha","BUDDH","a@","buddha","noun-adj",""
"3","kṣetreṣu","KṢETR","eṣu","kṣetra","noun-adj",""
"4","/","","","","punct",""
"5","tena","TEN","a","tad","pron",""
"6","kāraṇena","KĀRAṆ","ena","kāraṇa","noun-adj",""
"7","sa","","","sa_saha","ind",""
"8","tathāgato","TATHĀGAT","o","tathāgata","noun-adj",""
"9","amitābho","AMITĀBH","o","amitābha","noun-adj",""
"10","nāma","NĀM","a@","nāman","noun-adj",""
"11","ocyate","UC","yate","vak","verb","vac"
"12","//","","","","punct",""
"","</s>","","","","",""
"","<s number=""84"">","","","","",""
"","</page>","","","","",""
"","<page number=""p96","","","","",""
"3",";-j202"">","","","","",""
"","</s>","","","","",""
"","<s number=""85"">","","","","",""
"1","tasya","","","tad","pron",""
"2","ca","","","ca","ind",""
"3","śāriputra","ŚĀRIPUTR","a","śāriputra","noun-adj",""
"4","tathāgatasya","TATHĀGAT","asya","tathāgata","noun-adj",""
"5","^","","","","",""
"6","a","","","alpha_privativum","ind",""
"7","prameyaḥ","PRAMEY","aḥ","prameya","noun-adj",""
"8","śrāvaka","ŚRĀV","aka@","śrāvaka","noun-adj",""
"9","saṃgho","SAṂGH","o","saṃgha","noun-adj",""
"10","yeṣāṃ","","","yad","pron",""
"11","na","","","na","ind",""
"12","sukaraṃ","SUKAR","aṃ","sukara","noun-adj",""
"","</s>","","","","",""
"","<s number=""86"">","","","","",""
"1","pramāṇam","PRAMĀṆ","am","pramāṇa","noun-adj",""
"2","ākhyātuṃ","ĀKHYĀT","uṃ","ākhyā","verb","ākhyā"
"3","śuddhānām","ŚUDDH","ānām","śuddha","noun-adj",""
"4","arhatāṃ","ARHAT","āṃ","arhat","noun-adj",""
"5","/","","","","punct",""
"6","evaṃrūpaiḥ","EVAṂRŪP","aiḥ","evaṃrūpa","noun-adj",""
"7","śāriputra","ŚĀRIPUTR","a","śāriputra","noun-adj",""
"","</s>","","","","",""
"","<s number=""87"">","","","","",""
"1","buddha","BUDDH","a@","buddha","noun-adj",""
"2","kṣetr","KṢETR","","kṣetra","noun-adj",""
"3","aguṇa","AGUṆ","a@","aguṇa","noun-adj",""
"4","vyūhaiḥ","VYŪH","aiḥ","vyūha","noun-adj",""
"","</s>","","","","",""
"","<s number=""88"">","","","","",""
"1","samalaṃkṛtaṃ","SAMALAṂKṚT","aṃ","samalaṃkṛta","noun-adj",""
"2","tad","TAD","","tad","pron",""
"3","buddha","BUDDH","a@","buddha","noun-adj",""
"4","kṣetraṃ","KṢETR","aṃ","kṣetra","noun-adj",""
"5","//9//","","","","punct",""
"","</s>","","","","",""
"","<s number=""89"">","","","","",""
"1","punar","","","punar","ind",""
"2","aparaṃ","APAR","aṃ","apara","noun-adj",""
"3","śāriputra","ŚĀRIPUTR","a","śāriputra","noun-adj",""
"4","ye","","","yad","pron",""
"5","amita","AMIT","a@","amita","noun-adj",""
"6","āyuṣas","ĀYUṢ","as","āyuṣa","noun-adj",""
"7","tathāgatasya","TATHĀGAT","asya","tathāgata","noun-adj",""
"8","buddha","BUDDH","a@","buddha","noun-adj",""
"9","kṣetre","KṢETR","e","kṣetra","noun-adj",""
"10","sattvā","SATTV","ā","sattva","noun-adj",""
"","</s>","","","","",""
"","<s number=""90"">","","","","",""
"1","upapannāḥ","UPAPANN","āḥ","upapanna","noun-adj",""
"2","śuddhā","ŚUDDH","ā","śuddha","noun-adj",""
"3","bodhisattvā","BODHISATTV","ā","bodhisattva","noun-adj",""
"4","avinivartanīyā","AVINIVARTANĪY","ā","avinivartanīya","noun-adj",""
"5","ekajātipratibaddhās","EKAJĀTIPRATIBADDH","ās","ekajātipratibaddha","noun-adj",""
"","</s>","","","","",""
"","<s number=""91"">","","","","",""
"1","teṣāṃ","","","tad","pron",""
"2","śāriputra","ŚĀRIPUTR","a","śāriputra","noun-adj",""
"3","bodhisattvānāṃ","BODHISATTV","ānāṃ","bodhisattva","noun-adj",""
"4","na","","","na","ind",""
"5","sukaraṃ","SUKAR","aṃ","sukara","noun-adj",""
"6","pramāṇam","PRAMĀṆ","am","pramāṇa","noun-adj",""
"7","ākhyātum","ĀKHYĀT","um","ākhyā","verb","ākhyā"
"","</s>","","","","",""
"","<s number=""92"">","","","","",""
"1","anyatra","ANYATR","a@","anyatra","noun-adj",""
"2","ā","","","alpha_privativum","ind",""
"3","prameyā","PRAMEY","ā@","prameya","noun-adj",""
"4","saṃkhyeyā","SAṂKHYEY","ā","saṃkhyeya","noun-adj",""
"","</s>","","","","",""
"","<s number=""93"">","","","","",""
"1","iti","","","iti","ind",""
"2","saṃkhyāṃ","SAṂKHY","āṃ","saṃkhyā","noun-adj",""
"3","gacchaṃti","GACCH","aṃti","gaccha","noun-adj",""
"4","//","","","","punct",""
"5","tatra","","","tatra","ind",""
"6","khalu","KHAL","u","khal","verb",""
"7","punaḥ","","","punar","ind",""
"8","śāriputra","ŚĀRIPUTR","a","śāriputra","noun-adj",""
"","</s>","","","","",""
"","<s number=""94"">","","","","",""
"1","buddha","BUDDH","a@","buddha","noun-adj",""
"2","kṣetre","KṢETR","e","kṣetra","noun-adj",""
"3","sattvaiḥ","SATTV","aiḥ","sattva","noun-adj",""
"4","praṇidhānaṃ","PRAṆIDHĀN","aṃ","praṇidhāna","noun-adj",""
"5","kartavyaṃ","KAR","tavyaṃ","kar","verb","kṛ"
"6","/","","","","punct",""
"7","tat","TAT","","tad","pron",""
"8","kasmād","KASMĀD","","kimcit","noun-adj",""
"9","hetoḥ","HET","oḥ","hetu","noun-adj",""
"10","/","","","","punct",""
"11","yatra","","","yatra","ind",""
"12","hi","","","hi","ind",""
"13","nāma","NĀM","a","nāman","noun-adj",""
"","</s>","","","","",""
"","<s number=""95"">","","","","",""
"1","tathārūpaiḥ","TATHĀRŪP","aiḥ","tathārūpa","noun-adj",""
"2","satpuruṣaiḥ","SATPURUṢ","aiḥ","satpuruṣa","noun-adj",""
"3","saha","SAH","a","sa_saha","ind",""
"4","samavadhānaṃ","SAMAVADHĀN","aṃ","samavadhāna","noun-adj",""
"5","bhavati","BHAV","ati","bhav","verb","bhū"
"6","/","","","","punct",""
"7","nāvara","NĀVAR","a@","nāvara","noun-adj",""
"8","mātrakeṇa","MĀTRAK","eṇa","mātraka","noun-adj",""
"","</s>","","","","",""
"","<s number=""96"">","","","","",""
"1","śāriputra","ŚĀRIPUTR","a","śāriputra","noun-adj",""
"2","kuśala","KUŚAL","a@","kuśala","noun-adj",""
"3","mūlen","MŪL","en","mūla","noun-adj",""
"4","āmitāyu","AMITĀY","u@","amitāyu","noun-adj",""
"5","ṣas","ṢAS","","ṣasa","noun-adj",""
"6","tathāgatasya","TATHĀGAT","asya","tathāgata","noun-adj",""
"7","buddha","BUDDH","a@","buddha","noun-adj",""
"8","kṣetre","KṢETR","e","kṣetra","noun-adj",""
"9","sattvā","SATTV","ā","sattva","noun-adj",""
"10","upapadyaṃ","UPAPADY","aṃ","upapadya","noun-adj",""
"11","te","","","tad","pron",""
"12","/","","","","punct",""
"","</s>","","","","",""
"","<s number=""97"">","","","","",""
"1","yaḥ","","","yad","pron",""
"2","kaścic","KAŚCI","c","kimcit","noun-adj",""
"3","chāriputra","ŚĀRIPUTR","a","śāriputra","noun-adj",""
"4","kulaputro","KULAPUTR","o","kulaputra","noun-adj",""
"5","vā","","","vā","ind",""
"6","kuladuhitā","KULADUHIT","ā","kuladuhitṛ","noun-adj",""
"7","vā","","","vā","ind",""
"8","tasya","","","tad","pron",""
"","</s>","","","","",""
"","<s number=""98"">","","","","",""
"1","bhagavato","BHAGAVAT","o","bhagavatī","noun-adj",""
"2","amita","AMIT","a@","amita","noun-adj",""
"3","āyuṣas","ĀYUṢ","as","āyuṣa","noun-adj",""
"4","tathāgatasya","TATHĀGAT","asya","tathāgata","noun-adj",""
"5","nāmadheyaṃ","NĀMADHEY","aṃ","nāmadheya","noun-adj",""
"6","śroṣyati","ŚROṢ","yati","śroṣa","noun-adj",""
"7","śrutvā","ŚRUT","vā","śruta","noun-adj",""
"8","ca","","","ca","ind",""
"9","manasi","MANAS","i@","manasi","noun-adj",""
"10","kariṣyati","KAR","iṣyati","kar","verb","kṛ"
"","</s>","","","","",""
"","<s number=""99"">","","","","",""
"1","ekarātraṃ","EKARĀTR","aṃ","ekarātra","noun-adj",""
"2","vā","","","vā","ind",""
"3","dvirātraṃ","DVIRĀTR","aṃ","dvirātra","noun-adj",""
"4","vā","","","vā","ind",""
"5","trirātraṃ","TRIRĀTR","aṃ","trirātra","noun-adj",""
"6","vā","","","vā","ind",""
"7","catūrātraṃ","CATŪRĀTRA","ṃ","catūrātram","noun-adj",""
"8","vā","","","vā","ind",""
"","</s>","","","","",""
"","<s number=""100"">","","","","",""
"1","paṃca","PAÑC","a@","pañca","noun-adj",""
"2","rātraṃ","RĀTRA","ṃ","rātrau","noun-adj",""
"3","vā","","","vā","ind",""
"4","ṣaḍrātraṃ","ṢAḌRĀTR","aṃ","ṣaḍrātra","noun-adj",""
"5","vā","","","vā","ind",""
"6","saptarātraṃ","SAPTARĀTR","aṃ","saptarātra","noun-adj",""
"7","vā","","","vā","ind",""
"8","vikṣiptacitto","VIKṢIPTACITT","o","vikṣiptacitta","noun-adj",""
"9","manasi","MANAS","i@","manasi","noun-adj",""
"10","kariṣyati","KAR","iṣyati","kar","verb","kṛ"
"","</s>","","","","",""
"","<s number=""101"">","","","","",""
"1","yadā","YAD","ā","yadā","noun-adj",""
"2","sa","","","sa_saha","ind",""
"3","kulaputro","KULAPUTR","o","kulaputra","noun-adj",""
"4","vā","","","vā","ind",""
"5","kuladuhitā","KULADUHIT","ā","kuladuhitṛ","noun-adj",""
"6","vā","","","vā","ind",""
"7","kālaṃ","KĀL","aṃ","kāla","noun-adj",""
"8","kariṣyati","KAR","iṣyati","kar","verb","kṛ"
"9","tasya","","","tad","pron",""
"10","kālaṃ","KĀL","aṃ","kāla","noun-adj",""
"","</s>","","","","",""
"","<s number=""102"">","","","","",""
"1","kurvataḥ","KUR","vataḥ","kar","verb","kṛ"
"2","so","","","tad","pron",""
"3","amitāyus","AMITĀY","us","amitāyu","noun-adj",""
"4","tathāgataḥ","TATHĀGAT","aḥ","tathāgata","noun-adj",""
"5","śrāvaka","ŚRĀV","aka@","śrāvaka","noun-adj",""
"6","saṃgh","SAṂGH","","saṃgha","noun-adj",""
"7","aparivṛto","APARIVṚT","o","aparivṛta","noun-adj",""
"8","bodhisattva","BODHISATTV","a@","bodhisattva","noun-adj",""
"9","gaṇa","GAṆ","a@","gaṇa","noun-adj",""
"10","puraskṛtaḥ","PURASKṚT","aḥ","puraskṛta","noun-adj",""
"","</s>","","","","",""
"","<s number=""103"">","","","","",""
"1","purataḥ","PURAT","aḥ","puratas","noun-adj",""
"2","sthāsyati","STHĀS","yati","sthāsu","noun-adj",""
"3","so","","","tad","pron",""
"4","a","","","alpha_privativum","ind",""
"5","viparyasta","VIPARYAST","a@","viparyasta","noun-adj",""
"6","cittaḥ","CITT","aḥ","citta","noun-adj",""
"7","kālaṃ","KĀL","aṃ","kāla","noun-adj",""
"8","kariṣyati","KAR","iṣyati","kar","verb","kṛ"
"9","ca","","","ca","ind",""
"10","/","","","","punct",""
"","</s>","","","","",""
"","<s number=""104"">","","","","",""
"1","sa","","","sa_saha","ind",""
"2","kālaṃ","KĀL","aṃ","kāla","noun-adj",""
"3","k","","","kim","pron",""
"4","rtvā","RTV","ā","rtvā","noun-adj",""
"5","tasy","","","tad","pron",""
"6","^","","","","",""
"7","aiv","","","eva","ind",""
"8","^","","","","",""
"9","ā","","","alpha_privativum","ind",""
"10","mita","MIT","a@","mita","noun-adj",""
"11","āyuṣas","ĀYUṢ","as","āyuṣa","noun-adj",""
"12","tathāgatasya","TATHĀGAT","asya","tathāgata","noun-adj",""
"13","buddha","BUDDH","a@","buddha","noun-adj",""
"14","kṣetre","KṢETR","e","kṣetra","noun-adj",""
"15","sukhāvatyāṃ","SUKHĀVAT","yāṃ","sukhāvatī","noun-adj",""
"","</s>","","","","",""
"","<s number=""105"">","","","","",""
"1","lokadhātāv","LOKADHĀT","āv","lokadhātu","noun-adj",""
"2","upapats-yate","UPAPAT","s-yate","upapat","verb",""
"3","/","","","","punct",""
"4","tasmāt","","","tad","pron",""
"5","tarhi","","","tarhi","ind",""
"6","śāriputra","ŚĀRIPUTR","a","śāriputra","noun-adj",""
"7","idam","IDAM","","idam","pron",""
"8","arthavaśam","ARTHAVAŚ","am","arthavaśa","noun-adj",""
"9","saṃpaśya","SAMPAŚY","a@","sampaśya","noun-adj",""
"10","māna","MĀN","a","māna","noun-adj",""
"","</s>","","","","",""
"","<s number=""106"">","","","","",""
"1","evaṃ","","","eva","ind",""
"2","vadāmi","VAD","āmi","vad","verb","vad"
"3","satkṛtya","SATKṚTY","a","satkṛtya","noun-adj",""
"4","kulaputreṇa","KULAPUTR","eṇa","kulaputra","noun-adj",""
"5","vā","","","vā","ind",""
"6","kula","KUL","a@","kula","noun-adj",""
"7","duhitrā","DUH","itrā","duhitā","noun-adj",""
"8","vā","","","vā","ind",""
"9","tatra","","","tatra","ind",""
"10","buddha","BUDDH","a@","buddha","noun-adj",""
"11","kṣetre","KṢETR","e","kṣetra","noun-adj",""
"","</s>","","","","",""
"","<s number=""107"">","","","","",""
"1","citta","CITT","a@","citta","noun-adj",""
"2","praṇidhānaṃ","PRAṆIDHĀN","aṃ","praṇidhāna","noun-adj",""
"3","kartavyaṃ","KAR","tavyaṃ","kar","verb","kṛ"
"4","//10//","","","","punct",""
"","</s>","","","","",""
"","<s number=""108"">","","","","",""
"1","tadyath","","","tadyathā","ind",""
"2","āpi","","","api","ind",""
"3","nāma","NĀM","a","nāman","noun-adj",""
"4","śāriputra","ŚĀRIPUTR","a","śāriputra","noun-adj",""
"5","aham","AHAM","","mat","pron",""
"6","etarhi","ETARH","i","etarhi","noun-adj",""
"7","tāṃ","","","tad","pron",""
"8","parikīrtayāmi","PARIKĪRT","ayāmi","parikīrt","verb",""
"9","evam","","","eva","ind",""
"10","eva","","","eva","ind",""
"","</s>","","","","",""
"","<s number=""109"">","","","","",""
"","</page>","","","","",""
"","<page number=""p97","","","","",""
"3",";-j204"">","","","","",""
"","</s>","","","","",""
"","<s number=""110"">","","","","",""
"1","śāriputra","ŚĀRIPUTR","a","śāriputra","noun-adj",""
"2","pūrvasyāṃ","PŪRVAS","yāṃ","pūrvasū","noun-adj",""
"3","diśy","DIŚ","y","diśi","noun-adj",""
"4","akṣobhyo","AKṢOBHY","o","akṣobhya","noun-adj",""
"5","nāma","NĀM","a","nāman","noun-adj",""
"6","tathāgato","TATHĀGAT","o","tathāgata","noun-adj",""
"7","merudhvajo","MERUDHVAJ","o","merudhvaja","noun-adj",""
"8","nāma","NĀM","a","nāman","noun-adj",""
"","</s>","","","","",""
"","<s number=""111"">","","","","",""
"1","tathāgato","TATHĀGAT","o","tathāgata","noun-adj",""
"2","mahāmerur","MAHĀMER","ur","mahāmeru","noun-adj",""
"3","nāma","NĀM","a","nāman","noun-adj",""
"4","tathāgato","TATHĀGAT","o","tathāgata","noun-adj",""
"5","meruprabhāso","MERUPRABHĀS","o","meruprabhāsa","noun-adj",""
"6","nāma","NĀM","a","nāman","noun-adj",""
"7","tathāgato","TATHĀGAT","o","tathāgata","noun-adj",""
"","</s>","","","","",""
"","<s number=""112"">","","","","",""
"1","maṃjudhvajo","MAṂJUDHVAJ","o","maṃjudhvaja","noun-adj",""
"2","nāma","NĀM","a","nāman","noun-adj",""
"3","tathāgata","TATHĀGAT","a","tathāgata","noun-adj",""
"4","evaṃ","","","eva","ind",""
"5","pramukhāḥ","PRAMUKH","āḥ","pramukha","noun-adj",""
"6","śāriputra","ŚĀRIPUTR","a","śāriputra","noun-adj",""
"7","pūrvasyāṃ","PŪRVAS","yāṃ","pūrvasū","noun-adj",""
"8","diśi","DIŚ","i","dik","noun-adj",""
"","</s>","","","","",""
"","<s number=""113"">","","","","",""
"1","gaṃgā","GAṄG","ā@","gaṅgā","noun-adj",""
"2","nadī","NAD","ī@","nadī","noun-adj",""
"3","vāluka","VĀLUK","a@","vāluka","noun-adj",""
"4","opamā","UPAM","ā","upamā","noun-adj",""
"5","buddhā","BUDDH","ā","buddha","noun-adj",""
"6","bhagavaṃ","BHAGAV","aṃ","bhagavat","noun-adj",""
"7","taḥ","","","","ind",""
"8","svakasvakāni","SVAKASVAK","āni","svakasvaka","noun-adj",""
"9","buddha","BUDDH","a@","buddha","noun-adj",""
"10","kṣetrāṇi","KṢETR","āṇi","kṣetra","noun-adj",""
"","</s>","","","","",""
"","<s number=""114"">","","","","",""
"1","jihva","JIHV","a@","jihvā","noun-adj",""
"2","eṃdriyeṇa","EṂDRIY","eṇa","eṃdriya","noun-adj",""
"3","saṃcchādayitvā","SAṂCCHĀD","ayitvā","saṃcchāda","noun-adj",""
"4","nirveṭhanaṃ","NIRVEṬHAN","aṃ","nirveṭhana","noun-adj",""
"5","kurvaṃti","KURV","aṃti","kurvat","noun-adj",""
"6","/","","","","punct",""
"7","pratī","PRAT","ī@","pratī","noun-adj",""
"8","yatha","","","yathā","ind",""
"9","yūyam","YŪY","am","yuṣmat","pron",""
"10","idam","IDAM","","idam","pron",""
"","</s>","","","","",""
"","<s number=""115"">","","","","",""
"1","aciṃty","","","","ind",""
"2","aguṇa","AGUṆ","a@","aguṇa","noun-adj",""
"3","parikīrtanaṃ","PARIKĪRTAN","aṃ","parikīrtana","noun-adj",""
"4","sarva","SARV","a@","sarva","noun-adj",""
"5","buddha","BUDDH","a@","buddha","noun-adj",""
"6","parigrahaṃ","PARIGRAH","aṃ","parigraha","noun-adj",""
"7","nāma","NĀM","a","nāman","noun-adj",""
"8","dharmaparyāyaṃ","DHARMAPARYĀY","aṃ","dharmaparyāya","noun-adj",""
"9","//11//","","","","punct",""
"","</s>","","","","",""
"","<s number=""116"">","","","","",""
"1","evaṃ","","","eva","ind",""
"2","dakṣiṇasyāṃ","DAKṢIṆ","asyāṃ","dakṣiṇa","noun-adj",""
"3","diśi","DIŚ","i","dik","noun-adj",""
"4","caṃdra","","","","ind",""
"5","sūryapradīpo","SŪRYAPRADĪP","o","sūryapradīpa","noun-adj",""
"6","nāma","NĀM","a","nāman","noun-adj",""
"7","tathāgato","TATHĀGAT","o","tathāgata","noun-adj",""
"8","yaśaḥprabho","YAŚAḤPRABH","o","yaśaḥprabha","noun-adj",""
"","</s>","","","","",""
"","<s number=""117"">","","","","",""
"1","nāma","NĀM","a","nāman","noun-adj",""
"2","tathāgato","TATHĀGAT","o","tathāgata","noun-adj",""
"3","mahārciskaṃdho","MAHĀRCISKAṂDH","o","mahārciskaṃdha","noun-adj",""
"4","nāma","NĀM","a","nāman","noun-adj",""
"5","tathāgato","TATHĀGAT","o","tathāgata","noun-adj",""
"6","merupradīpo","MERUPRADĪP","o","merupradīpa","noun-adj",""
"7","nāma","NĀM","a","nāman","noun-adj",""
"","</s>","","","","",""
"","<s number=""118"">","","","","",""
"1","tathāgato","TATHĀGAT","o","tathāgata","noun-adj",""
"2","anaṃt","","","","ind",""
"3","avīryo","AVĪRY","o","avīrya","noun-adj",""
"4","nāma","NĀM","a","nāman","noun-adj",""
"5","tathāgata","TATHĀGAT","a","tathāgata","noun-adj",""
"6","evaṃ","","","eva","ind",""
"7","pramukhāḥ","PRAMUKH","āḥ","pramukha","noun-adj",""
"8","śāriputra","ŚĀRIPUTR","a","śāriputra","noun-adj",""
"9","dakṣiṇasyāṃ","DAKṢIṆ","asyāṃ","dakṣiṇa","noun-adj",""
"","</s>","","","","",""
"","<s number=""119"">","","","","",""
"1","diśi","DIŚ","i","dik","noun-adj",""
"2","gaṃgā","GAṄG","ā@","gaṅgā","noun-adj",""
"3","nadī","NAD","ī@","nadī","noun-adj",""
"4","vāluka","VĀLUK","a@","vāluka","noun-adj",""
"5","opamā","UPAM","ā","upamā","noun-adj",""
"6","buddhā","BUDDH","ā","buddha","noun-adj",""
"7","bhagavaṃ","BHAGAV","aṃ","bhagavat","noun-adj",""
"8","taḥ","","","","ind",""
"9","svakasvakāni","SVAKASVAK","āni","svakasvaka","noun-adj",""
"","</s>","","","","",""
"","<s number=""120"">","","","","",""
"1","buddha","BUDDH","a@","buddha","noun-adj",""
"2","kṣetrāṇi","KṢETR","āṇi","kṣetra","noun-adj",""
"3","jihva","JIHV","a@","jihvā","noun-adj",""
"4","eṃdriyeṇa","EṂDRIY","eṇa","eṃdriya","noun-adj",""
"5","saṃcchādayitvā","SAṂCCHĀD","ayitvā","saṃcchāda","noun-adj",""
"6","nirveṭhanaṃ","NIRVEṬHAN","aṃ","nirveṭhana","noun-adj",""
"7","kurvaṃti","KURV","aṃti","kurvat","noun-adj",""
"8","/","","","","punct",""
"9","pratī","PRAT","ī@","pratī","noun-adj",""
"10","yatha","","","yathā","ind",""
"","</s>","","","","",""
"","<s number=""121"">","","","","",""
"1","yūyam","YŪY","am","yuṣmat","pron",""
"2","idam","IDAM","","idam","pron",""
"3","aciṃty","","","","ind",""
"4","aguṇa","AGUṆ","a@","aguṇa","noun-adj",""
"5","parikīrtanaṃ","PARIKĪRTAN","aṃ","parikīrtana","noun-adj",""
"6","sarva","SARV","a@","sarva","noun-adj",""
"7","buddha","BUDDH","a@","buddha","noun-adj",""
"8","parigrahaṃ","PARIGRAH","aṃ","parigraha","noun-adj",""
"9","nāma","NĀM","a","nāman","noun-adj",""
"10","dharmaparyāyaṃ","DHARMAPARYĀY","aṃ","dharmaparyāya","noun-adj",""
"","</s>","","","","",""
"","<s number=""122"">","","","","",""
"1","//12//","","","","punct",""
"","</s>","","","","",""
"","<s number=""123"">","","","","",""
"1","evaṃ","","","eva","ind",""
"2","paścimāyāṃ","PAŚCIM","āyāṃ","paścima","noun-adj",""
"3","diśy","DIŚ","y","diśi","noun-adj",""
"4","amitāyur","AMITĀY","ur","amitāyu","noun-adj",""
"5","nāma","NĀM","a","nāman","noun-adj",""
"6","tathāgato","TATHĀGAT","o","tathāgata","noun-adj",""
"7","amitaskaṃdho","AMITASKAṂDH","o","amitaskaṃdha","noun-adj",""
"8","nāma","NĀM","a","nāman","noun-adj",""
"","</s>","","","","",""
"","<s number=""124"">","","","","",""
"1","tathāgato","TATHĀGAT","o","tathāgata","noun-adj",""
"2","amitadhvajo","AMITADHVAJ","o","amitadhvaja","noun-adj",""
"3","nāma","NĀM","a","nāman","noun-adj",""
"4","tathāgato","TATHĀGAT","o","tathāgata","noun-adj",""
"5","mahāprabho","MAHĀPRABH","o","mahāprabha","noun-adj",""
"6","nāma","NĀM","a","nāman","noun-adj",""
"7","tathāgato","TATHĀGAT","o","tathāgata","noun-adj",""
"","</s>","","","","",""
"","<s number=""125"">","","","","",""
"1","mahāratnaketur","MAHĀRATNAKET","ur","mahāratnaketu","noun-adj",""
"2","nāma","NĀM","a","nāman","noun-adj",""
"3","tathāgataḥ","TATHĀGAT","aḥ","tathāgata","noun-adj",""
"4","śuddharaśmiprabho","ŚUDDHARAŚMIPRABH","o","śuddharaśmiprabha","noun-adj",""
"5","nāma","NĀM","a","nāman","noun-adj",""
"6","tathāgata","TATHĀGAT","a","tathāgata","noun-adj",""
"7","evaṃ","","","eva","ind",""
"8","pramukhāḥ","PRAMUKH","āḥ","pramukha","noun-adj",""
"","</s>","","","","",""
"","<s number=""126"">","","","","",""
"1","śāriputra","ŚĀRIPUTR","a","śāriputra","noun-adj",""
"2","paścimāyāṃ","PAŚCIM","āyāṃ","paścima","noun-adj",""
"3","diśi","DIŚ","i","dik","noun-adj",""
"4","gaṃgā","GAṄG","ā@","gaṅgā","noun-adj",""
"5","nadī","NAD","ī@","nadī","noun-adj",""
"6","vāluka","VĀLUK","a@","vāluka","noun-adj",""
"7","opamā","UPAM","ā","upamā","noun-adj",""
"8","buddhā","BUDDH","ā","buddha","noun-adj",""
"","</s>","","","","",""
"","<s number=""127"">","","","","",""
"1","bhagavaṃ","BHAGAV","aṃ","bhagavat","noun-adj",""
"2","taḥ","","","","ind",""
"3","svakasvakāni","SVAKASVAK","āni","svakasvaka","noun-adj",""
"4","buddha","BUDDH","a@","buddha","noun-adj",""
"5","kṣetrāṇi","KṢETR","āṇi","kṣetra","noun-adj",""
"6","jihva","JIHV","a@","jihvā","noun-adj",""
"7","eṃdriyeṇa","EṂDRIY","eṇa","eṃdriya","noun-adj",""
"8","saṃcchādayitvā","SAṂCCHĀD","ayitvā","saṃcchāda","noun-adj",""
"","</s>","","","","",""
"","<s number=""128"">","","","","",""
"1","nirveṭhanaṃ","NIRVEṬHAN","aṃ","nirveṭhana","noun-adj",""
"2","kurvaṃti","KURV","aṃti","kurvat","noun-adj",""
"3","/","","","","punct",""
"4","pratī","PRAT","ī@","pratī","noun-adj",""
"5","yatha","","","yathā","ind",""
"6","yūyam","YŪY","am","yuṣmat","pron",""
"7","idam","IDAM","","idam","pron",""
"8","aciṃty","","","","ind",""
"9","aguṇa","AGUṆ","a@","aguṇa","noun-adj",""
"10","parikīrtanaṃ","PARIKĪRTAN","aṃ","parikīrtana","noun-adj",""
"","</s>","","","","",""
"","<s number=""129"">","","","","",""
"1","sarva","SARV","a@","sarva","noun-adj",""
"2","buddha","BUDDH","a@","buddha","noun-adj",""
"3","parigrahaṃ","PARIGRAH","aṃ","parigraha","noun-adj",""
"","</s>","","","","",""
"","<s number=""130"">","","","","",""
"1","nāma","NĀM","a","nāman","noun-adj",""
"2","dharmaparyāyaṃ","DHARMAPARYĀY","aṃ","dharmaparyāya","noun-adj",""
"3","//13//","","","","punct",""
"","</s>","","","","",""
"","<s number=""131"">","","","","",""
"1","evam","","","eva","ind",""
"2","uttarāyāṃ","UTTAR","āyāṃ","uttarā","noun-adj",""
"3","diśi","DIŚ","i","dik","noun-adj",""
"4","mahārciskaṃdho","MAHĀRCISKAṂDH","o","mahārciskaṃdha","noun-adj",""
"5","nāma","NĀM","a","nāman","noun-adj",""
"6","tathāgato","TATHĀGAT","o","tathāgata","noun-adj",""
"7","vaiśvānaranirghoṣo","VAIŚVĀNARANIRGHOṢ","o","vaiśvānaranirghoṣa","noun-adj",""
"","</s>","","","","",""
"","<s number=""132"">","","","","",""
"1","nāma","NĀM","a","nāman","noun-adj",""
"2","tathāgato","TATHĀGAT","o","tathāgata","noun-adj",""
"3","duṃd","","","","ind",""
"4","ubhi","UBH","i@","ubha","noun-adj",""
"5","svara","SVAR","a@","svara","noun-adj",""
"6","nirghoṣo","NIRGHOṢ","o","nirghoṣa","noun-adj",""
"7","nāma","NĀM","a","nāman","noun-adj",""
"8","tathāgato","TATHĀGAT","o","tathāgata","noun-adj",""
"","</s>","","","","",""
"","<s number=""133"">","","","","",""
"","</page>","","","","",""
"","<page number=""p98","","","","",""
"3",";-j206"">","","","","",""
"","</s>","","","","",""
"","<s number=""134"">","","","","",""
"1","duṣpradharṣo","DUṢPRADHARṢ","o","duṣpradharṣa","noun-adj",""
"2","nāma","NĀM","a","nāman","noun-adj",""
"3","tathāgata","TATHĀGAT","a","tathāgata","noun-adj",""
"4","ādityasaṃbhavo","ĀDITYASAṂBHAV","o","ādityasaṃbhava","noun-adj",""
"5","nāma","NĀM","a","nāman","noun-adj",""
"6","tathāgato","TATHĀGAT","o","tathāgata","noun-adj",""
"7","jaleniprabho","JALENIPRABH","o","jaleniprabha","noun-adj",""
"","</s>","","","","",""
"","<s number=""135"">","","","","",""
"1","nāma","NĀM","a","nāman","noun-adj",""
"2","tathāgataḥ","TATHĀGAT","aḥ","tathāgata","noun-adj",""
"3","prabhākaro","PRABHĀKAR","o","prabhākara","noun-adj",""
"4","nāma","NĀM","a","nāman","noun-adj",""
"5","tathāgata","TATHĀGAT","a","tathāgata","noun-adj",""
"6","evaṃ","","","eva","ind",""
"7","pramukhā","PRAMUKH","ā","pramukha","noun-adj",""
"8","śāriputra","ŚĀRIPUTR","a@","śāriputra","noun-adj",""
"9","ottarāyāṃ","UTTAR","āyāṃ","uttarā","noun-adj",""
"","</s>","","","","",""
"","<s number=""136"">","","","","",""
"1","diśi","DIŚ","i","dik","noun-adj",""
"2","gaṃgā","GAṄG","ā@","gaṅgā","noun-adj",""
"3","nadī","NAD","ī@","nadī","noun-adj",""
"4","vāluka","VĀLUK","a@","vāluka","noun-adj",""
"5","opamā","UPAM","ā","upamā","noun-adj",""
"6","buddhā","BUDDH","ā","buddha","noun-adj",""
"7","bhagavaṃ","BHAGAV","aṃ","bhagavat","noun-adj",""
"8","taḥ","","","","ind",""
"9","svakasvakāni","SVAKASVAK","āni","svakasvaka","noun-adj",""
"","</s>","","","","",""
"","<s number=""137"">","","","","",""
"1","buddha","BUDDH","a@","buddha","noun-adj",""
"2","kṣetrāṇi","KṢETR","āṇi","kṣetra","noun-adj",""
"3","jihva","JIHV","a@","jihvā","noun-adj",""
"4","eṃdriyeṇa","EṂDRIY","eṇa","eṃdriya","noun-adj",""
"5","saṃcchādayitvā","SAṂCCHĀD","ayitvā","saṃcchāda","noun-adj",""
"6","nirveṭhanaṃ","NIRVEṬHAN","aṃ","nirveṭhana","noun-adj",""
"7","kurvaṃti","KURV","aṃti","kurvat","noun-adj",""
"8","/","","","","punct",""
"","</s>","","","","",""
"","<s number=""138"">","","","","",""
"1","pratī","PRAT","ī@","pratī","noun-adj",""
"2","yatha","","","yathā","ind",""
"3","yūyam","YŪY","am","yuṣmat","pron",""
"4","idam","IDAM","","idam","pron",""
"5","aciṃty","","","","ind",""
"6","aguṇa","AGUṆ","a@","aguṇa","noun-adj",""
"7","parikīrtanaṃ","PARIKĪRTAN","aṃ","parikīrtana","noun-adj",""
"8","sarva","SARV","a@","sarva","noun-adj",""
"9","buddha","BUDDH","a@","buddha","noun-adj",""
"10","parigrahaṃ","PARIGRAH","aṃ","parigraha","noun-adj",""
"11","nāma","NĀM","a","nāman","noun-adj",""
"","</s>","","","","",""
"","<s number=""139"">","","","","",""
"1","dharmaparyāyaṃ","DHARMAPARYĀY","aṃ","dharmaparyāya","noun-adj",""
"2","//14//","","","","punct",""
"","</s>","","","","",""
"","<s number=""140"">","","","","",""
"1","evam","","","eva","ind",""
"2","adhastāyāṃ","ADHAST","āyāṃ","adhasta","noun-adj",""
"3","diśi","DIŚ","i","dik","noun-adj",""
"4","siṃho","SIṂH","o","siṃha","noun-adj",""
"5","nāma","NĀM","a","nāman","noun-adj",""
"6","tathāgato","TATHĀGAT","o","tathāgata","noun-adj",""
"7","yaśo","YAŚ","o","yaśa","noun-adj",""
"8","nāma","NĀM","a","nāman","noun-adj",""
"9","tathāgato","TATHĀGAT","o","tathāgata","noun-adj",""
"","</s>","","","","",""
"","<s number=""141"">","","","","",""
"1","yaśaḥprabhāso","YAŚAḤPRABHĀS","o","yaśaḥprabhāsa","noun-adj",""
"2","nāma","NĀM","a","nāman","noun-adj",""
"3","tathāgato","TATHĀGAT","o","tathāgata","noun-adj",""
"4","dharmo","DHARM","o","dharma","noun-adj",""
"5","nama","NAM","a","nama","noun-adj",""
"6","tathāgato","TATHĀGAT","o","tathāgata","noun-adj",""
"7","dharmadharo","DHARMADHAR","o","dharmadhara","noun-adj",""
"","</s>","","","","",""
"","<s number=""142"">","","","","",""
"1","nāma","NĀM","a","nāman","noun-adj",""
"2","tathāgato","TATHĀGAT","o","tathāgata","noun-adj",""
"3","dharmadhvajo","DHARMADHVAJ","o","dharmadhvaja","noun-adj",""
"4","nāma","NĀM","a","nāman","noun-adj",""
"5","tathāgata","TATHĀGAT","a","tathāgata","noun-adj",""
"6","evaṃ","","","eva","ind",""
"7","pramukhāḥ","PRAMUKH","āḥ","pramukha","noun-adj",""
"8","śāriputra","ŚĀRIPUTR","a@","śāriputra","noun-adj",""
"9","ādhastāyāṃ","ADHAST","āyāṃ","adhasta","noun-adj",""
"","</s>","","","","",""
"","<s number=""143"">","","","","",""
"1","diśi","DIŚ","i","dik","noun-adj",""
"2","gaṃgā","GAṄG","ā@","gaṅgā","noun-adj",""
"3","nadī","NAD","ī@","nadī","noun-adj",""
"4","vāluka","VĀLUK","a@","vāluka","noun-adj",""
"5","opamā","UPAM","ā","upamā","noun-adj",""
"6","buddhā","BUDDH","ā","buddha","noun-adj",""
"7","bhagavaṃ","BHAGAV","aṃ","bhagavat","noun-adj",""
"8","taḥ","","","","ind",""
"9","svakasvakāni","SVAKASVAK","āni","svakasvaka","noun-adj",""
"","</s>","","","","",""
"","<s number=""144"">","","","","",""
"1","buddha","BUDDH","a@","buddha","noun-adj",""
"2","kṣetrāṇi","KṢETR","āṇi","kṣetra","noun-adj",""
"3","jihva","JIHV","a@","jihvā","noun-adj",""
"4","eṃdriyeṇa","EṂDRIY","eṇa","eṃdriya","noun-adj",""
"5","saṃcchādayitvā","SAṂCCHĀD","ayitvā","saṃcchāda","noun-adj",""
"6","nirveṭhanaṃ","NIRVEṬHAN","aṃ","nirveṭhana","noun-adj",""
"7","kurvaṃti","KURV","aṃti","kurvat","noun-adj",""
"8","/","","","","punct",""
"","</s>","","","","",""
"","<s number=""145"">","","","","",""
"1","pratī","PRAT","ī@","pratī","noun-adj",""
"2","yatha","","","yathā","ind",""
"3","yūyam","YŪY","am","yuṣmat","pron",""
"4","idam","IDAM","","idam","pron",""
"5","aciṃty","","","","ind",""
"6","aguṇa","AGUṆ","a@","aguṇa","noun-adj",""
"7","parikīrtanaṃ","PARIKĪRTAN","aṃ","parikīrtana","noun-adj",""
"8","sarva","SARV","a@","sarva","noun-adj",""
"9","buddha","BUDDH","a@","buddha","noun-adj",""
"10","parigrahaṃ","PARIGRAH","aṃ","parigraha","noun-adj",""
"11","nāma","NĀM","a","nāman","noun-adj",""
"","</s>","","","","",""
"","<s number=""146"">","","","","",""
"1","dharmaparyāyaṃ","DHARMAPARYĀY","aṃ","dharmaparyāya","noun-adj",""
"2","//15//","","","","punct",""
"","</s>","","","","",""
"","<s number=""147"">","","","","",""
"1","evam","","","eva","ind",""
"2","upariṣṭhāyāṃ","UPARIṢṬH","āyāṃ","upariṣṭha","noun-adj",""
"3","diśi","DIŚ","i","dik","noun-adj",""
"4","brahmaghoṣo","BRAHMAGHOṢ","o","brahmaghoṣa","noun-adj",""
"5","nāma","NĀM","a","nāman","noun-adj",""
"6","tathāgato","TATHĀGAT","o","tathāgata","noun-adj",""
"7","nakṣatrarājo","NAKṢATRARĀJ","o","nakṣatrarāja","noun-adj",""
"","</s>","","","","",""
"","<s number=""148"">","","","","",""
"1","nāma","NĀM","a","nāman","noun-adj",""
"2","tathāgata","TATHĀGAT","a","tathāgata","noun-adj",""
"3","iṃdr","","","","ind",""
"4","aketu","AKET","u@","aketu","noun-adj",""
"5","dhvajarājo","DHVAJARĀJ","o","dhvajarājin","noun-adj",""
"6","nāma","NĀM","a","nāman","noun-adj",""
"7","tathāgato","TATHĀGAT","o","tathāgata","noun-adj",""
"8","gaṃdhottamo","GAṂDHOTTAM","o","gaṃdhottama","noun-adj",""
"9","nama","NAM","a","nama","noun-adj",""
"","</s>","","","","",""
"","<s number=""149"">","","","","",""
"1","tathāgato","TATHĀGAT","o","tathāgata","noun-adj",""
"2","gaṃdhaprabhāso","GAṂDHAPRABHĀS","o","gaṃdhaprabhāsa","noun-adj",""
"3","nāma","NĀM","a","nāman","noun-adj",""
"4","tathāgato","TATHĀGAT","o","tathāgata","noun-adj",""
"5","mahārciskaṃdho","MAHĀRCISKAṂDH","o","mahārciskaṃdha","noun-adj",""
"6","nāma","NĀM","a","nāman","noun-adj",""
"7","tathāgato","TATHĀGAT","o","tathāgata","noun-adj",""
"","</s>","","","","",""
"","<s number=""150"">","","","","",""
"1","ratnaku","RATNAK","u@","ratnaka","noun-adj",""
"2","suma","SUM","a@","suma","noun-adj",""
"3","saṃpuṣpita","SAṂPUṢPIT","a@","saṃpuṣpita","noun-adj",""
"4","gātro","GĀTR","o","gātra","noun-adj",""
"5","nāma","NĀM","a","nāman","noun-adj",""
"6","tathāgataḥ","TATHĀGAT","aḥ","tathāgata","noun-adj",""
"7","sāla","SĀL","a@","sāla","noun-adj",""
"8","eṃdra","EṂDR","a@","eṃdra","noun-adj",""
"9","rājo","RĀJ","o","rājan","noun-adj",""
"10","nāma","NĀM","a","nāman","noun-adj",""
"","</s>","","","","",""
"","<s number=""151"">","","","","",""
"1","tathāgato","TATHĀGAT","o","tathāgata","noun-adj",""
"2","ratnotpalaśrīr","RATNOTPALAŚR","īr","ratnotpalaśrī","noun-adj",""
"3","nāma","NĀM","a","nāman","noun-adj",""
"4","tathāgataḥ","TATHĀGAT","aḥ","tathāgata","noun-adj",""
"5","sarvārthadarśo","SARVĀRTHADARŚ","o","sarvārthadarśa","noun-adj",""
"6","nāma","NĀM","a","nāman","noun-adj",""
"7","tathāgataḥ","TATHĀGAT","aḥ","tathāgata","noun-adj",""
"","</s>","","","","",""
"","<s number=""152"">","","","","",""
"1","sumerukalpo","SUMERUKALP","o","sumerukalpa","noun-adj",""
"2","nāma","NĀM","a","nāman","noun-adj",""
"3","tathāgata","TATHĀGAT","a","tathāgata","noun-adj",""
"4","evaṃ","","","eva","ind",""
"5","pramukhāḥ","PRAMUKH","āḥ","pramukha","noun-adj",""
"6","śāriputra","ŚĀRIPUTR","a@","śāriputra","noun-adj",""
"7","opari","UPAR","i@","upari","noun-adj",""
"8","ṣṭhāyāṃ","ṢṬH","āyāṃ","ṣṭhā","noun-adj",""
"9","diśi","DIŚ","i","dik","noun-adj",""
"","</s>","","","","",""
"","<s number=""153"">","","","","",""
"1","gaṃgā","GAṄG","ā@","gaṅgā","noun-adj",""
"2","nadī","NAD","ī@","nadī","noun-adj",""
"3","vāluka","VĀLUK","a@","vāluka","noun-adj",""
"4","opamā","UPAM","ā","upamā","noun-adj",""
"5","buddhā","BUDDH","ā","buddha","noun-adj",""
"6","bhagavaṃ","BHAGAV","aṃ","bhagavat","noun-adj",""
"7","taḥ","","","","ind",""
"8","svakasvakāni","SVAKASVAK","āni","svakasvaka","noun-adj",""
"9","buddha","BUDDH","a@","buddha","noun-adj",""
"10","kṣetrāṇi","KṢETR","āṇi","kṣetra","noun-adj",""
"","</s>","","","","",""
"","<s number=""154"">","","","","",""
"1","jihva","JIHV","a@","jihvā","noun-adj",""
"2","eṃdriyeṇa","EṂDRIY","eṇa","eṃdriya","noun-adj",""
"3","saṃcchādayitvā","SAṂCCHĀD","ayitvā","saṃcchāda","noun-adj",""
"4","nirveṭhanaṃ","NIRVEṬHAN","aṃ","nirveṭhana","noun-adj",""
"5","kurvaṃti","KURV","aṃti","kurvat","noun-adj",""
"6","/","","","","punct",""
"7","pratī","PRAT","ī@","pratī","noun-adj",""
"8","yatha","","","yathā","ind",""
"9","yūyam","YŪY","am","yuṣmat","pron",""
"10","idam","IDAM","","idam","pron",""
"","</s>","","","","",""
"","<s number=""155"">","","","","",""
"1","aciṃty","","","","ind",""
"2","aguṇa","AGUṆ","a@","aguṇa","noun-adj",""
"3","parikīrtanaṃ","PARIKĪRTAN","aṃ","parikīrtana","noun-adj",""
"4","sarva","SARV","a@","sarva","noun-adj",""
"5","buddha","BUDDH","a@","buddha","noun-adj",""
"6","parigrahaṃ","PARIGRAH","aṃ","parigraha","noun-adj",""
"7","nāma","NĀM","a","nāman","noun-adj",""
"8","dharmaparyāyaṃ","DHARMAPARYĀY","aṃ","dharmaparyāya","noun-adj",""
"9","//16//","","","","punct",""
"","</s>","","","","",""
"","<s number=""156"">","","","","",""
"","</page>","","","","",""
"","<page number=""p99","","","","",""
"3",";-j208"">","","","","",""
"","</s>","","","","",""
"","<s number=""157"">","","","","",""
"1","tat","TAT","","tad","pron",""
"2","kiṃ","","","kim","pron",""
"3","manyase","MAN","yase","man","verb","man"
"4","śāriputra","ŚĀRIPUTR","a","śāriputra","noun-adj",""
"5","kena","KEN","a","kim","pron",""
"6","kāraṇen","KĀRAṆ","en","kāraṇa","noun-adj",""
"7","āyaṃ","ĀYAṂ","","idam","pron",""
"8","dharmaparyāyaḥ","DHARMAPARYĀY","aḥ","dharmaparyāya","noun-adj",""
"9","sarva","SARV","a@","sarva","noun-adj",""
"10","buddha","BUDDH","a@","buddha","noun-adj",""
"11","parigraho","PARIGRAH","o","parigraha","noun-adj",""
"","</s>","","","","",""
"","<s number=""158"">","","","","",""
"1","nāma","NĀM","a@","nāman","noun-adj",""
"2","ocyate","UC","yate","vak","verb","vac"
"3","/","","","","punct",""
"4","ye","","","yad","pron",""
"5","kecic","KECIC","","kimcit","noun-adj",""
"6","chāriputra","ŚĀRIPUTR","a","śāriputra","noun-adj",""
"7","kulaputrā","KULAPUTR","ā","kulaputra","noun-adj",""
"8","vā","","","vā","ind",""
"9","kula","KUL","a@","kula","noun-adj",""
"10","duhi","DUH","i@","duhi","noun-adj",""
"11","taro","TAR","o","tara","noun-adj",""
"","</s>","","","","",""
"","<s number=""159"">","","","","",""
"1","vāsya","VĀS","ya","vās","verb",""
"2","dharmaparyāyasya","DHARMAPARYĀY","asya","dharmaparyāya","noun-adj",""
"3","nāmadheyaṃ","NĀMADHEY","aṃ","nāmadheya","noun-adj",""
"4","śroṣyaṃti","ŚROṢY","aṃti","śroṣya","noun-adj",""
"5","teṣāṃ","","","tad","pron",""
"6","ca","","","ca","ind",""
"7","buddhānāṃ","BUDDH","ānāṃ","buddha","noun-adj",""
"8","bhagavatāṃ","BHAGAVAT","āṃ","bhagavatī","noun-adj",""
"","</s>","","","","",""
"","<s number=""160"">","","","","",""
"1","nāmadheyaṃ","NĀMADHEY","aṃ","nāmadheya","noun-adj",""
"2","dhārayiṣyaṃti","DHĀRAYIṢY","aṃti","dhārayiṣya","noun-adj",""
"3","sarve","SARV","e","sarva","noun-adj",""
"4","te","","","tad","pron",""
"5","buddha","BUDDH","a@","buddha","noun-adj",""
"6","parigṛhītā","PARIGṚHĪT","ā","parigṛhītṛ","noun-adj",""
"7","bhaviṣyaṃty","BHAVIṢY","aṃty","bhaviṣya","noun-adj",""
"8","avinivartanīyāś","AVINIVARTANĪY","āś","avinivartanīya","noun-adj",""
"","</s>","","","","",""
"","<s number=""161"">","","","","",""
"1","ca","","","ca","ind",""
"2","bhaviṣyaṃty","BHAVIṢY","aṃty","bhaviṣya","noun-adj",""
"3","anuttarāyāṃ","ANUTTARĀY","āṃ","anuttarāyā","noun-adj",""
"4","samyaksaṃbodhau","SAMYAKSAṂBODH","au","samyaksaṃbodhi","noun-adj",""
"5","/","","","","punct",""
"6","tasmāt","","","tad","pron",""
"7","tarhi","","","tarhi","ind",""
"8","śāriputra","ŚĀRIPUTR","a","śāriputra","noun-adj",""
"","</s>","","","","",""
"","<s number=""162"">","","","","",""
"1","śraddadha","ŚRADDADH","a@","śraddadha","noun-adj",""
"2","ādhvaṃ","ADHV","aṃ","adhva","noun-adj",""
"3","pratī","PRAT","ī@","pratī","noun-adj",""
"4","yatha","","","yathā","ind",""
"5","mākāṃ","MĀK","āṃ","mākī","noun-adj",""
"6","kṣayatha","KṢAYATH","a","kṣayathu","noun-adj",""
"7","mama","MAM","a","mat","pron",""
"8","ca","","","ca","ind",""
"9","teṣāṃ","","","tad","pron",""
"10","ca","","","ca","ind",""
"11","buddhānāṃ","BUDDH","ānāṃ","buddha","noun-adj",""
"12","bhagavatāṃ","BHAGAVAT","āṃ","bhagavatī","noun-adj",""
"13","/","","","","punct",""
"","</s>","","","","",""
"","<s number=""163"">","","","","",""
"1","ye","","","yad","pron",""
"2","kecic","KECIC","","kimcit","noun-adj",""
"3","chāriputra","ŚĀRIPUTR","a","śāriputra","noun-adj",""
"4","kulaputrā","KULAPUTR","ā","kulaputra","noun-adj",""
"5","vā","","","vā","ind",""
"6","kula","KUL","a@","kula","noun-adj",""
"7","duhi","DUH","i@","duhi","noun-adj",""
"8","taro","TAR","o","tara","noun-adj",""
"9","vā","","","vā","ind",""
"10","tasya","","","tad","pron",""
"","</s>","","","","",""
"","<s number=""164"">","","","","",""
"1","bhagavato","BHAGAVAT","o","bhagavatī","noun-adj",""
"2","amita","AMIT","a@","amita","noun-adj",""
"3","āyuṣas","ĀYUṢ","as","āyuṣa","noun-adj",""
"4","tathāgatasya","TATHĀGAT","asya","tathāgata","noun-adj",""
"5","buddha","BUDDH","a@","buddha","noun-adj",""
"6","kṣetre","KṢETR","e","kṣetra","noun-adj",""
"7","citta","CITT","a@","citta","noun-adj",""
"8","praṇidhānaṃ","PRAṆIDHĀN","aṃ","praṇidhāna","noun-adj",""
"9","kariṣyaṃti","KARIṢY","aṃti","kariṣya","noun-adj",""
"","</s>","","","","",""
"","<s number=""165"">","","","","",""
"1","kṛtaṃ","KṚT","aṃ","kṛta","noun-adj",""
"2","vā","","","vā","ind",""
"3","kurvaṃti","KURV","aṃti","kurvat","noun-adj",""
"4","vā","","","vā","ind",""
"5","sarve","SARV","e","sarva","noun-adj",""
"6","te","","","tad","pron",""
"7","avinivartanīyā","AVINIVARTANĪY","ā","avinivartanīya","noun-adj",""
"8","bhaviṣyaṃty","BHAVIṢY","aṃty","bhaviṣya","noun-adj",""
"9","anuttarāyāṃ","ANUTTARĀY","āṃ","anuttarāyā","noun-adj",""
"","</s>","","","","",""
"","<s number=""166"">","","","","",""
"1","samyaksaṃbodhau","SAMYAKSAṂBODH","au","samyaksaṃbodhi","noun-adj",""
"2","tatra","","","tatra","ind",""
"3","ca","","","ca","ind",""
"4","buddha","BUDDH","a@","buddha","noun-adj",""
"5","kṣetra","KṢETR","a","kṣetra","noun-adj",""
"6","upapatsyaṃty","UPAPATS","yaṃty","upapatsa","noun-adj",""
"7","upapannā","UPAPANN","ā","upapanna","noun-adj",""
"8","v","","","vā","ind",""
"9","opapadyaṃti","UPAPADY","aṃti","upapadya","noun-adj",""
"10","vā","","","vā","ind",""
"11","/","","","","punct",""
"","</s>","","","","",""
"","<s number=""167"">","","","","",""
"1","tasmāt","","","tad","pron",""
"2","tarhi","","","tarhi","ind",""
"3","śāriputra","ŚĀRIPUTR","a","śāriputra","noun-adj",""
"4","śrāddhaiḥ","ŚRĀDDH","aiḥ","śrāddha","noun-adj",""
"5","kulaputraiḥ","KULAPUTR","aiḥ","kulaputra","noun-adj",""
"6","kula","KUL","a@","kula","noun-adj",""
"7","duhi","DUH","i@","duhi","noun-adj",""
"8","tṛbhiś","TṚBH","iś","tṛbhi","noun-adj",""
"9","ca","","","ca","ind",""
"10","tatra","","","tatra","ind",""
"11","buddha","BUDDH","a@","buddha","noun-adj",""
"12","kṣetre","KṢETR","e","kṣetra","noun-adj",""
"","</s>","","","","",""
"","<s number=""168"">","","","","",""
"1","citta","CITT","a@","citta","noun-adj",""
"2","praṇidhir","PRAṆIDH","ir","praṇidhi","noun-adj",""
"3","utpādayitavyaḥ","UTPĀDAY","itavyaḥ","utaḥpad","verb","utpad"
"4","//17//","","","","punct",""
"","</s>","","","","",""
"","<s number=""169"">","","","","",""
"1","tadyath","","","tadyathā","ind",""
"2","āpi","","","api","ind",""
"3","nāma","NĀM","a","nāman","noun-adj",""
"4","śāriputra","ŚĀRIPUTR","a@","śāriputra","noun-adj",""
"5","āham","ĀHAM","","mat","pron",""
"6","etarhi","ETARH","i","etarhi","noun-adj",""
"7","teṣāṃ","","","tad","pron",""
"8","buddhānāṃ","BUDDH","ānāṃ","buddha","noun-adj",""
"9","bhagavatām","BHAGAVAT","ām","bhagavatī","noun-adj",""
"","</s>","","","","",""
"","<s number=""170"">","","","","",""
"1","evam","","","eva","ind",""
"2","aciṃty","","","","ind",""
"3","aguṇān","AGUṆ","ān","aguṇa","noun-adj",""
"","</s>","","","","",""
"","<s number=""171"">","","","","",""
"1","parikīrtayāmi","PARIKĪRT","ayāmi","parikīrt","verb",""
"2","evam","","","eva","ind",""
"3","eva","","","eva","ind",""
"4","śāriputra","ŚĀRIPUTR","a","śāriputra","noun-adj",""
"5","mama","MAM","a","mat","pron",""
"6","^","","","","",""
"7","āpi","","","api","ind",""
"8","te","","","tad","pron",""
"9","buddhā","BUDDH","ā","buddha","noun-adj",""
"","</s>","","","","",""
"","<s number=""172"">","","","","",""
"1","bhagavaṃ","BHAGAV","aṃ","bhagavat","noun-adj",""
"2","ta","","","tad","pron",""
"3","evam","","","eva","ind",""
"4","aciṃty","","","","ind",""
"5","aguṇān","AGUṆ","ān","aguṇa","noun-adj",""
"6","parikīrtayaṃ","PARIKĪRT","ayaṃ","parikīrt","verb",""
"7","ti","","","","ind",""
"8","/","","","","punct",""
"9","su","SU","","su","noun-adj",""
"10","duṣ","","","duḥ","ind",""
"11","karaṃ","KAR","aṃ","kara","noun-adj",""
"12","bhagavatā","BHAGAV","atā","bhagavat","noun-adj",""
"13","śākyamuninā","ŚĀKYAMUN","inā","śākyamuni","noun-adj",""
"","</s>","","","","",""
"","<s number=""173"">","","","","",""
"1","śākya","ŚĀKY","a@","śākya","noun-adj",""
"2","ādhi","ĀDH","i@","ādhi","noun-adj",""
"3","rājena","RĀJ","ena","rājan","noun-adj",""
"4","kṛtaṃ","KṚT","aṃ","kṛta","noun-adj",""
"5","/","","","","punct",""
"6","sahāyāṃ","SAHĀY","āṃ","sa_saha","ind",""
"7","lokadhātāv","LOKADHĀT","āv","lokadhātu","noun-adj",""
"8","anuttarāṃ","ANUTTAR","āṃ","anuttara","noun-adj",""
"","</s>","","","","",""
"","<s number=""174"">","","","","",""
"1","samyaksaṃbodhim","SAMYAKSAṂBODH","im","samyaksaṃbodhi","noun-adj",""
"2","abhisaṃbudhya","ABHISAṂBUDH","ya","abhisaṃbodh","verb","abhisaṃbudh"
"3","sarvaloka","SARVALOK","a@","sarvaloka","noun-adj",""
"4","vipratyayanīyo","VIPRATYAYANĪY","o","vipratyayanīya","noun-adj",""
"5","dharmo","DHARM","o","dharma","noun-adj",""
"6","deśitaḥ","DEŚIT","aḥ","deśita","noun-adj",""
"","</s>","","","","",""
"","<s number=""175"">","","","","",""
"1","kalpakaṣāye","KALPAKAṢĀY","e","kalpakaṣāya","noun-adj",""
"2","sattvakaṣāye","SATTVAKAṢĀY","e","sattvakaṣāya","noun-adj",""
"3","dṛṣṭi","DṚṢṬ","i@","dṛṣṭi","noun-adj",""
"4","kaṣāya","KAṢĀY","a","kaṣāya","noun-adj",""
"5","āyuṣ","ĀYUṢ","","āyuṣa","noun-adj",""
"6","kaṣāye","KAṢĀY","e","kaṣāya","noun-adj",""
"7","kleśa","KLEŚ","a@","kleśa","noun-adj",""
"8","kaṣāye","KAṢĀY","e","kaṣāya","noun-adj",""
"9","//18//","","","","punct",""
"","</s>","","","","",""
"","<s number=""176"">","","","","",""
"1","tan","TAN","","tad","pron",""
"2","mama","MAM","a","mat","pron",""
"3","^","","","","",""
"4","āpi","","","api","ind",""
"5","śāriputra","ŚĀRIPUTR","a","śāriputra","noun-adj",""
"6","parama","PARAM","a@","parama","noun-adj",""
"7","duṣ","","","duḥ","ind",""
"8","karaṃ","KAR","aṃ","kara","noun-adj",""
"9","yan","","","yad","pron",""
"10","mayā","","","mat","pron",""
"11","sahāyāṃ","SAHĀY","āṃ","sa_saha","ind",""
"12","lokadhātāv","LOKADHĀT","āv","lokadhātu","noun-adj",""
"","</s>","","","","",""
"","<s number=""177"">","","","","",""
"1","anuttarāṃ","ANUTTAR","āṃ","anuttara","noun-adj",""
"2","samyaksaṃbodhim","SAMYAKSAṂBODH","im","samyaksaṃbodhi","noun-adj",""
"3","abhisaṃbudhya","ABHISAṂBUDH","ya","abhisaṃbodh","verb","abhisaṃbudh"
"4","sarvaloka","SARVALOK","a@","sarvaloka","noun-adj",""
"5","vipratyayanīyo","VIPRATYAYANĪY","o","vipratyayanīya","noun-adj",""
"6","dharmo","DHARM","o","dharma","noun-adj",""
"","</s>","","","","",""
"","<s number=""178"">","","","","",""
"1","deśitaḥ","DEŚIT","aḥ","deśita","noun-adj",""
"2","sattvakaṣāye","SATTVAKAṢĀY","e","sattvakaṣāya","noun-adj",""
"3","dṛṣṭi","DṚṢṬ","i@","dṛṣṭi","noun-adj",""
"4","kaṣāye","KAṢĀY","e","kaṣāya","noun-adj",""
"5","kleśa","KLEŚ","a@","kleśa","noun-adj",""
"6","kaṣāya","KAṢĀY","a","kaṣāya","noun-adj",""
"7","āyuṣ","ĀYUṢ","","āyuṣa","noun-adj",""
"8","kaṣāye","KAṢĀY","e","kaṣāya","noun-adj",""
"9","kalpakaṣāye","KALPAKAṢĀY","e","kalpakaṣāya","noun-adj",""
"","</s>","","","","",""
"","<s number=""179"">","","","","",""
"1","//19//","","","","punct",""
"","</s>","","","","",""
"","<s number=""180"">","","","","",""
"","</page>","","","","",""
"","<page number=""p100","","","","",""
"3",";-j210"">","","","","",""
"","</s>","","","","",""
"","<s number=""181"">","","","","",""
"1","idam","IDAM","","idam","pron",""
"2","avocad","AVOCAD","","vak","verb","vac"
"3","bhagavān","BHAGAV","ān","bhagavat","noun-adj",""
"4","āttamanāḥ","ĀTTAMAN","āḥ","āttamanas","noun-adj",""
"5","/","","","","punct",""
"6","āyuṣmāñ","ĀYUṢM","āñ","āyuṣmat","noun-adj",""
"7","śāriputras","ŚĀRIPUTR","as","śāriputra","noun-adj",""
"8","te","","","tad","pron",""
"9","ca","","","ca","ind",""
"10","bhikṣavas","BHIKṢ","avas","bhikṣu","noun-adj",""
"","</s>","","","","",""
"","<s number=""182"">","","","","",""
"1","te","","","tad","pron",""
"2","ca","","","ca","ind",""
"3","bodhisattvāḥ","BODHISATTV","āḥ","bodhisattva","noun-adj",""
"4","sadeva","SADEV","a@","sadeva","noun-adj",""
"5","mānuṣa","MĀNUṢ","a@","mānuṣa","noun-adj",""
"6","āsura","ĀSUR","a@","āsura","noun-adj",""
"7","gaṃdharvaś","GAṂDHARV","aś","gaṃdharva","noun-adj",""
"8","ca","","","ca","ind",""
"9","loko","LOK","o","loka","noun-adj",""
"10","bhagavato","BHAGAVAT","o","bhagavatī","noun-adj",""
"","</s>","","","","",""
"","<s number=""183"">","","","","",""
"1","bhāsitam","BHĀS","itam","bhāsa","noun-adj",""
"2","abhyanaṃ","ABHY","anaṃ","abhyat","noun-adj",""
"3","dan","DAN","","danu","noun-adj",""
"4","//20//","","","","punct",""
"","</s>","","","","",""
"","<s number=""184"">","","","","",""
"1","//","","","","punct",""
"2","sukhāvatīvyūho","SUKHĀVATĪVYŪH","o","sukhāvatīvyūha","noun-adj",""
"3","nāma","NĀM","a","nāman","noun-adj",""
"4","mahāyānasūtraṃ","MAHĀYĀNASŪTR","aṃ","mahāyānasūtra","noun-adj",""
"5","//","","","","punct",""
"","</s>","","","","",""
"","</page>","","","","",""
"","</doc>","","","","",""
