"WordID","word","NormSTEM","suffix","lemma","PoS","Root"
"","<doc textid = ""mahamantranusarini"" genre = ""dhāraṇī"" title = ""mahāmantrānusāriṇī"" author = ""n /a"" discourse = ""tantra"" tradition = ""pañcarakṣā"" period = ""commentarial"" source = ""gretil accessed sept 2020 : http://gretil.sub.uni-goettingen.de/gretil/corpustei/sa_.xml"" date_range = ""1.-8. ce"" notes = ""part of the pañcarakṣā group of apotropaic scriptures; dating proposed by g. hidas: mahādaṇḍadhāraṇīśītavatī; a buddhist apotropaic scripture. in indic manuscript cultures through the ages. 2017 p. 454-55: i.-vī. cent. ce; however actual manuscript evidence for pañcarakṣā collection is c. 800 ce for tibetan translation and 11. cent. ce for sanskrit manuscripts according to peter skilling. the rakṣā literature of the śrāvakayāna. jpts 16; 1992: 109–182. see g. hidas. dhāraṇī sūtras; p. 133-34."" religion = ""buddh"" edition = ""based on the ed. by p. skilling 1994; page numbers = reference format as presented in gretil file minus letter c; variant readings removed"" digitization = ""k. wille"" segmentation_lemmatization = ""ligeia lugli & buddhist translators workbench team"" metadata_enrichment = ""bruno galasek-hul & buddhist translators workbench team"" proofreader = ""n/a"" permission = ""permission for derivatives from m. mehner on behalf of gretil"" reconstructions = ""none"">","","","","",""
"","<page number=""0"">","","","","",""
"","<s number=""1"">","","","","",""
"1","mahāmantrānusāriṇī","MAHĀMANTRĀNUSĀRIṆ","ī","mahāmantrānusāriṇī","noun-adj",""
"","</page>","","","","",""
"","<page number=""0.1"">","","","","",""
"4","oṃ","","","oṃ","ind",""
"5","namo","NAM","o","namas","noun-adj",""
"6","bhagavatyai","BHAGAV","atyai","bhagavat","noun-adj",""
"7","ārya","ĀRY","a@","ārya","noun-adj",""
"8","mahāmantrānusāriṇyai","MAHĀMANTRĀNUSĀRIṆ","yai","mahāmantrānusāriṇī","noun-adj",""
"9","/","","","","punct",""
"","</s>","","","","",""
"","<s number=""2"">","","","","",""
"1","namo","NAM","o","namas","noun-adj",""
"2","vidyārājāya","VIDYĀRĀJ","āya","vidyārāja","noun-adj",""
"3","/","","","","punct",""
"4","namaḥ","NAM","aḥ","nama","noun-adj",""
"5","samanta","SAMANT","a@","samanta","noun-adj",""
"6","buddhānāṃ","BUDDH","ānāṃ","buddha","noun-adj",""
"7","//","","","","punct",""
"","</s>","","","","",""
"","<s number=""3"">","","","","",""
"","</page>","","","","",""
"","<page number=""1.1a"">","","","","",""
"3","evaṃ","","","eva","ind",""
"4","mayā","","","mat","pron",""
"5","śrutam","ŚRUT","am","śruta","noun-adj",""
"6","ekasmin","EK","asmin","eka","noun-adj",""
"7","samaye","SAMAY","e","samaya","noun-adj",""
"8","bhagavān","BHAGAV","ān","bhagavat","noun-adj",""
"9","rājagṛhe","RĀJAGṚH","e","rājagṛha","noun-adj",""
"10","viharati","VIHAR","ati","vihar","verb","vihṛ"
"11","sma","","","sma","ind",""
"12","/","","","","punct",""
"","</s>","","","","",""
"","<s number=""4"">","","","","",""
"1","veṇuvane","VEṆUVAN","e","veṇuvana","noun-adj",""
"2","karandakanivāpe","KARANDAKANIVĀP","e","karandakanivāpa","noun-adj",""
"3","/","","","","punct",""
"","</s>","","","","",""
"","<s number=""5"">","","","","",""
"","</page>","","","","",""
"","<page number=""1.2"">","","","","",""
"3","tatra","","","tatra","ind",""
"4","bhagavān","BHAGAV","ān@","bhagavat","noun-adj",""
"5","āyuṣmantam","ĀYUṢM","antam","āyuṣmat","noun-adj",""
"6","ānandam","ĀNAND","am","ānanda","noun-adj",""
"7","āmantrayate","AMANTR","ayate","amantra","noun-adj",""
"8","sma","","","sma","ind",""
"9","/","","","","punct",""
"","</s>","","","","",""
"","<s number=""7"">","","","","",""
"1","āgamaya","ĀGAMAY","a@","āgamayati","noun-adj",""
"2","ānanda","ĀNAND","a","ānanda","noun-adj",""
"3","yena","","","yad","pron",""
"4","vaiśāli","VAIŚĀL","i","vaiśālī","noun-adj",""
"5","iti","","","iti","ind",""
"6","/","","","","punct",""
"","</s>","","","","",""
"","<s number=""8"">","","","","",""
"1","evaṃ","","","eva","ind",""
"2","bhadanta","BHADANT","a","bhadanta","noun-adj",""
"3","^","","","","",""
"4","ety","","","iti","ind",""
"5","āyuṣmān","ĀYUṢM","ān","āyuṣmat","noun-adj",""
"6","ānando","ĀNAND","o","ānanda","noun-adj",""
"7","bhagavataḥ","BHAGAV","ataḥ","bhagavat","noun-adj",""
"8","pratyaśrauṣīt","PRATYAŚRAUṢ","īt","pratiśṛṇ","verb","pratiśru"
"9","/","","","","punct",""
"","</s>","","","","",""
"","<s number=""9"">","","","","",""
"1","atha","","","atha","ind",""
"2","bhagavān","BHAGAV","ān","bhagavat","noun-adj",""
"3","vṛjiṣu","VṚJ","iṣu","vṛj","verb",""
"4","janapadeṣu","JANAPAD","eṣu","janapada","noun-adj",""
"5","janapada","JANAPAD","a@","janapada","noun-adj",""
"6","cārikāñ","CĀRIK","āñ","cārikā","noun-adj",""
"7","caran","CALAN","","calana","noun-adj",""
"8","vaiśālīm","VAIŚĀL","īm","vaiśālī","noun-adj",""
"9","anuprāpto","ANUPRĀPT","o","anuprāpta","noun-adj",""
"10","vaiśālyāṃ","VAIŚĀLY","āṃ","vaiśālya","noun-adj",""
"11","viharaty","VIHAR","aty","vihar","verb","vihṛ"
"12","āmrapālī","ĀMRAPĀL","ī@","āmrapālī","noun-adj",""
"13","vane","VAN","e","vana","noun-adj",""
"14","/","","","","punct",""
"","</s>","","","","",""
"","<s number=""10"">","","","","",""
"","</page>","","","","",""
"","<page number=""1.3"">","","","","",""
"3","tatra","","","tatra","ind",""
"4","bhagavān","BHAGAV","ān@","bhagavat","noun-adj",""
"5","āyuṣmantam","ĀYUṢM","antam","āyuṣmat","noun-adj",""
"6","ānandam","ĀNAND","am","ānanda","noun-adj",""
"7","āmantrayate","AMANTR","ayate","amantra","noun-adj",""
"8","sma","","","sma","ind",""
"9","/","","","","punct",""
"","</s>","","","","",""
"","<s number=""11"">","","","","",""
"1","gaccha","GACCH","a@","gaccha","noun-adj",""
"2","ānanda","ĀNAND","a","ānanda","noun-adj",""
"3","vaiśālīṃ","VAIŚĀL","īṃ","vaiśālī","noun-adj",""
"4","gatvā","GAT","vā@","gata","noun-adj",""
"5","indrakīle","INDRAKĪL","e","indrakīla","noun-adj",""
"6","pādaṃ","PĀD","aṃ","pāda","noun-adj",""
"7","sthāpayitvā","STHĀP","ayitvā","tiṣṭh","verb","sthā"
"8","imāni","","","idam","pron",""
"9","mahāmantrānusāriṇī","MAHĀMANTRĀNUSĀRIṆ","ī","mahāmantrānusāriṇī","noun-adj",""
"10","mantra","MANTR","a@","mantra","noun-adj",""
"11","padāni","PAD","āni","pada","noun-adj",""
"12","bhāṣasva","BHĀṢ","asva","bhāṣa","noun-adj",""
"13","/","","","","punct",""
"","</s>","","","","",""
"","<s number=""12"">","","","","",""
"1","imāś","","","idam","pron",""
"2","ca","","","ca","ind",""
"3","gāthāḥ","GĀTH","āḥ","gāthā","noun-adj",""
"4","/","","","","punct",""
"","</s>","","","","",""
"","<s number=""13"">","","","","",""
"","</page>","","","","",""
"","<page number=""2.1"">","","","","",""
"3","visarata","VISAR","ata","visar","verb",""
"4","visarata","VISAR","ata","visar","verb",""
"5","visarata","VISAR","ata","visar","verb",""
"6","visarata","VISAR","ata","visar","verb",""
"7","visarata","VISAR","ata","visar","verb",""
"8","/","","","","punct",""
"","</s>","","","","",""
"","<s number=""14"">","","","","",""
"","</page>","","","","",""
"","<page number=""2.2"">","","","","",""
"3","buddho","BUDDH","o","buddha","noun-adj",""
"4","loka","LOK","a@","loka","noun-adj",""
"5","ānukampaka","ANUKAMP","aka","anukampaka","noun-adj",""
"6","ājñāpayati","ĀJÑĀP","ayati","ājñāpa","noun-adj",""
"7","/","","","","punct",""
"","</s>","","","","",""
"","<s number=""15"">","","","","",""
"1","sarva","SARV","a@","sarva","noun-adj",""
"2","buddha","BUDDH","a@","buddha","noun-adj",""
"3","ānumatena","ĀNUMAT","ena","ānumata","noun-adj",""
"4","/","","","","punct",""
"","</s>","","","","",""
"","<s number=""16"">","","","","",""
"1","sarva","SARV","a@","sarva","noun-adj",""
"2","pratyekabuddha","PRATYEKABUDDH","a@","pratyekabuddha","noun-adj",""
"3","ānumatena","ĀNUMAT","ena","ānumata","noun-adj",""
"4","/","","","","punct",""
"","</s>","","","","",""
"","<s number=""17"">","","","","",""
"1","sarva","SARV","a@","sarva","noun-adj",""
"2","ārhad","ARH","ad","arhat","noun-adj",""
"3","ānumatena","ĀNUMAT","ena","ānumata","noun-adj",""
"4","sarva","SARV","a@","sarva","noun-adj",""
"5","śaikṣa","ŚAIKṢ","a@","śaikṣa","noun-adj",""
"6","ānumatena","ĀNUMAT","ena","ānumata","noun-adj",""
"7","/","","","","punct",""
"","</s>","","","","",""
"","<s number=""18"">","","","","",""
"1","sarva","SARV","a@","sarva","noun-adj",""
"2","śrāvaka","ŚRĀVAK","a@","śrāvaka","noun-adj",""
"3","ānumatena","ĀNUMAT","ena","ānumata","noun-adj",""
"4","/","","","","punct",""
"","</s>","","","","",""
"","<s number=""19"">","","","","",""
"1","sarva","SARV","a@","sarva","noun-adj",""
"2","satyavākya","SATYAVĀKY","a@","satyavākya","noun-adj",""
"3","ānumatena","ĀNUMAT","ena","ānumata","noun-adj",""
"4","/","","","","punct",""
"","</s>","","","","",""
"","<s number=""20"">","","","","",""
"1","pratyekabrahma","PRATYEKABRAHM","a@","pratyekabrahman","noun-adj",""
"2","ānumatena","ĀNUMAT","ena","ānumata","noun-adj",""
"3","/","","","","punct",""
"","</s>","","","","",""
"","<s number=""21"">","","","","",""
"1","brahma","BRAHM","a@","brahma","noun-adj",""
"2","ānumatena","ĀNUMAT","ena","ānumata","noun-adj",""
"3","/","","","","punct",""
"","</s>","","","","",""
"","<s number=""22"">","","","","",""
"1","kāma","KĀM","a@","kāma","noun-adj",""
"2","eśvara","EŚVAR","a@","eśvara","noun-adj",""
"3","ānumatena","ĀNUMAT","ena","ānumata","noun-adj",""
"4","/","","","","punct",""
"","</s>","","","","",""
"","<s number=""23"">","","","","",""
"1","indra","INDR","a@","indra","noun-adj",""
"2","ānumatena","ĀNUMAT","ena","ānumata","noun-adj",""
"3","/","","","","punct",""
"","</s>","","","","",""
"","<s number=""24"">","","","","",""
"1","deva","DEV","a@","deva","noun-adj",""
"2","ānumatena","ĀNUMAT","ena","ānumata","noun-adj",""
"3","/","","","","punct",""
"","</s>","","","","",""
"","<s number=""25"">","","","","",""
"1","a","","","alpha_privativum","ind",""
"2","surendra","SURENDR","a@","surendra","noun-adj",""
"3","ānumatena","ĀNUMAT","ena","ānumata","noun-adj",""
"4","/","","","","punct",""
"","</s>","","","","",""
"","<s number=""26"">","","","","",""
"1","sarva","SARV","a@","sarva","noun-adj",""
"2","āsura","ĀSUR","a@","āsura","noun-adj",""
"3","ānumatena","ĀNUMAT","ena","ānumata","noun-adj",""
"4","/","","","","punct",""
"","</s>","","","","",""
"","<s number=""27"">","","","","",""
"1","asura","ASUR","a@","asura","noun-adj",""
"2","preṣya","PREṢY","a@","preṣya","noun-adj",""
"3","ānumatena","ĀNUMAT","ena","ānumata","noun-adj",""
"4","/","","","","punct",""
"","</s>","","","","",""
"","<s number=""28"">","","","","",""
"1","sarva","SARV","a@","sarva","noun-adj",""
"2","bhūta","BHŪT","a@","bhūta","noun-adj",""
"3","ānumatena","ĀNUMAT","ena","ānumata","noun-adj",""
"4","/","","","","punct",""
"","</s>","","","","",""
"","<s number=""29"">","","","","",""
"","</page>","","","","",""
"","<page number=""2.3"">","","","","",""
"3","visarata","VISAR","ata","visar","verb",""
"4","visarata","VISAR","ata","visar","verb",""
"5","visarata","VISAR","ata","visar","verb",""
"6","visarata","VISAR","ata","visar","verb",""
"7","visarata","VISAR","ata","visar","verb",""
"8","/","","","","punct",""
"","</s>","","","","",""
"","<s number=""30"">","","","","",""
"","</page>","","","","",""
"","<page number=""2.4"">","","","","",""
"3","buddho","BUDDH","o","buddha","noun-adj",""
"4","loka","LOK","a@","loka","noun-adj",""
"5","ānukampaka","ANUKAMP","aka","anukampaka","noun-adj",""
"6","ājñāpayati","ĀJÑĀP","ayati","ājñāpa","noun-adj",""
"7","/","","","","punct",""
"","</s>","","","","",""
"","<s number=""31"">","","","","",""
"1","mūm","","","","ind",""
"2","cata","CAT","a","catur","noun-adj",""
"3","mūm","","","","ind",""
"4","cata","CAT","a","catur","noun-adj",""
"5","mūm","","","","ind",""
"6","cata","CAT","a","catur","noun-adj",""
"7","mūm","","","","ind",""
"8","cata","CAT","a","catur","noun-adj",""
"9","/","","","","punct",""
"","</s>","","","","",""
"","<s number=""32"">","","","","",""
"1","mā","","","mā","ind",""
"2","tiṣṭhantu","TIṢṬH","antu","tiṣṭh","verb","sthā"
"3","/","","","","punct",""
"","</s>","","","","",""
"","<s number=""33"">","","","","",""
"1","ītir","","","","ind",""
"2","vyupaśāmyatu","VYUPAŚĀM","yatu","vyupaśāma","noun-adj",""
"3","/","","","","punct",""
"","</s>","","","","",""
"","<s number=""34"">","","","","",""
"1","nirgacchata","NIRGACCH","ata","nirgacch","verb","nirgam"
"2","nirgacchata","NIRGACCH","ata","nirgacch","verb","nirgam"
"3","nirgacchata","NIRGACCH","ata","nirgacch","verb","nirgam"
"4","/","","","","punct",""
"","</s>","","","","",""
"","<s number=""35"">","","","","",""
"","</page>","","","","",""
"","<page number=""2.5"">","","","","",""
"3","buddhaḥ","BUDDH","aḥ","buddha","noun-adj",""
"4","praviśati","PRAVIŚ","ati","praviś","verb","praviś"
"5","mahādevo","MAHĀDEV","o","mahādeva","noun-adj",""
"6","deva","DEV","a@","deva","noun-adj",""
"7","ātidevo","ATIDEV","o","atideva","noun-adj",""
"8","devaguruḥ","DEVAGUR","uḥ","devaguru","noun-adj",""
"9","s","","","su","ind",""
"10","endrakaś","INDR","akaś","indraka","noun-adj",""
"11","ca","","","ca","ind",""
"12","devāḥ","DEV","āḥ","deva","noun-adj",""
"13","sa","","","sa_saha","ind",""
"14","brahmakāḥsa","BRAHM","akāḥsa","brahmaka","noun-adj",""
"15","prajāpatikaś","PRAJĀPAT","ikaś","prajāpatika","noun-adj",""
"16","catvāraś","CATVĀR","aś","catur","noun-adj",""
"17","ca","","","ca","ind",""
"18","loka","LOK","a@","loka","noun-adj",""
"19","pālāḥ","PĀL","āḥ","pāla","noun-adj",""
"20","praviśanti","PRAVIŚ","anti","praviś","verb","praviś"
"21","an","","","alpha_privativum","ind",""
"22","ekāni","EK","āni","eka","noun-adj",""
"23","ca","","","ca","ind",""
"24","devatā","DEVAT","ā@","devatā","noun-adj",""
"25","sahasrāṇy","SAHASR","āṇy","sa_saha","ind",""
"26","a","","","alpha_privativum","ind",""
"27","surendrāś","SURENDR","āś","surendra","noun-adj",""
"28","ca","","","ca","ind",""
"29","/","","","","punct",""
"","</s>","","","","",""
"","<s number=""36"">","","","","",""
"1","an","","","alpha_privativum","ind",""
"2","ekāni","EK","āni","eka","noun-adj",""
"3","ca","","","ca","ind",""
"4","asura","ASUR","a@","asura","noun-adj",""
"5","sahasrāṇi","SAHASR","āṇi","sa_saha","ind",""
"6","prativasanti","PRATIVAS","anti","prativas","verb","prativas"
"7","/","","","","punct",""
"","</s>","","","","",""
"","<s number=""37"">","","","","",""
"1","bahūni","BAH","ūni","bahu","noun-adj",""
"2","ca","","","ca","ind",""
"3","bhūta","BHŪT","a@","bhūta","noun-adj",""
"4","sahasrāṇi","SAHASR","āṇi","sa_saha","ind",""
"5","bhagavato","BHAGAV","ato","bhagavat","noun-adj",""
"6","abhiprasannāni","ABHIPRASANN","āni","abhiprasanna","noun-adj",""
"7","pravekṣyanti","PRAVEKṢ","yanti","pravekṣa","noun-adj",""
"8","sarva","SARV","a@","sarva","noun-adj",""
"9","satvānām","SATTV","ānām","sattva","noun-adj",""
"10","arthe","ARTH","e","artha","noun-adj",""
"11","/","","","","punct",""
"","</s>","","","","",""
"","<s number=""38"">","","","","",""
"","</page>","","","","",""
"","<page number=""2.6"">","","","","",""
"3","te","","","tad","pron",""
"4","vo","","","yuṣmat","pron",""
"5","māna","MĀN","a@","māna","noun-adj",""
"6","rthaṃ","RTH","aṃ","rtha","noun-adj",""
"7","kariṣyanti","KAR","iṣyanti","kar","verb","kṛ"
"8","/","","","","punct",""
"","</s>","","","","",""
"","<s number=""39"">","","","","",""
"1","nirgacchata","NIRGACCH","ata","nirgacch","verb","nirgam"
"2","nirgacchata","NIRGACCH","ata","nirgacch","verb","nirgam"
"3","nirgacchata","NIRGACCH","ata","nirgacch","verb","nirgam"
"4","nirgacchata","NIRGACCH","ata","nirgacch","verb","nirgam"
"5","/","","","","punct",""
"","</s>","","","","",""
"","<s number=""40"">","","","","",""
"1","kṣiptaṃ","KṢIPT","aṃ","kṣipta","noun-adj",""
"2","palāyata","PALĀY","ata","palā","verb",""
"3","/","","","","punct",""
"","</s>","","","","",""
"","<s number=""41"">","","","","",""
"1","yadi","","","yadi","ind",""
"2","yūyaṃ","YŪY","aṃ","yuṣmat","pron",""
"3","duṣṭa","DUṢṬ","a@","duṣṭa","noun-adj",""
"4","cittā","CITT","ā","citta","noun-adj",""
"5","na","","","na","ind",""
"6","palāyeta","PALĀ","yeta","palā","verb",""
"7","naśyeta","NAŚ","yeta","naśy","verb","naś"
"8","/","","","","punct",""
"","</s>","","","","",""
"","<s number=""42"">","","","","",""
"1","ye","","","yad","pron",""
"2","maitra","MAITR","a@","maitra","noun-adj",""
"3","citta","CITT","a","citta","noun-adj",""
"4","^","","","","",""
"5","ān","","","alpha_privativum","ind",""
"6","āparādhu","APARĀDH","u@","aparādha","noun-adj",""
"7","kāma","KĀM","a@","kāma","noun-adj",""
"8","ārakṣāṃ","ĀRAKṢ","āṃ","ārakṣā","noun-adj",""
"9","c","","","ca","ind",""
"10","^","","","","",""
"11","ānuvartayitu","ĀNUVARTAY","itu@","ānuvartaya","noun-adj",""
"12","kāmās","KĀM","ās","kāma","noun-adj",""
"13","te","","","tad","pron",""
"14","tiṣṭhantu","TIṢṬH","antu","tiṣṭh","verb","sthā"
"15","mataṃ","MAT","aṃ","mata","noun-adj",""
"16","ca","","","ca","ind",""
"17","praviśantu","PRAVIŚ","antu","praviś","verb","praviś"
"18","/","","","","punct",""
"","</s>","","","","",""
"","<s number=""43"">","","","","",""
"","</page>","","","","",""
"","<page number=""2.7"">","","","","",""
"3","buddho","BUDDH","o","buddha","noun-adj",""
"4","loka","LOK","a@","loka","noun-adj",""
"5","ānukampaka","ANUKAMP","aka","anukampaka","noun-adj",""
"6","evam","","","eva","ind",""
"7","ājñāpayati","ĀJÑĀP","ayati","ājñāpa","noun-adj",""
"8","/","","","","punct",""
"","</s>","","","","",""
"","<s number=""44"">","","","","",""
"","</page>","","","","",""
"","<page number=""2.8"">","","","","",""
"3","su","","","su","ind",""
"4","muru","MUR","u","mur","verb",""
"5","su","","","su","ind",""
"6","muru","MUR","u","mur","verb",""
"7","su","","","su","ind",""
"8","muru","MUR","u","mur","verb",""
"9","su","","","su","ind",""
"10","muru","MUR","u","mur","verb",""
"11","suru","","","","ind",""
"12","suru","","","","ind",""
"13","suru","","","","ind",""
"14","suru","","","","ind",""
"15","huru","","","","ind",""
"16","huru","","","","ind",""
"17","huru","","","","ind",""
"18","huru","","","","ind",""
"19","mu","","","","ind",""
"20","mu","","","","ind",""
"21","mu","","","","ind",""
"22","mu","","","","ind",""
"23","praviśati","PRAVIŚ","ati","praviś","verb","praviś"
"24","/","","","","punct",""
"","</s>","","","","",""
"","<s number=""45"">","","","","",""
"1","muru","MUR","u@","muru","noun-adj",""
"2","muru","MUR","u@","muru","noun-adj",""
"3","muru","MUR","u@","muru","noun-adj",""
"4","muru","MUR","u@","muru","noun-adj",""
"5","muru","MUR","u@","muru","noun-adj",""
"6","muru","MUR","u@","muru","noun-adj",""
"7","muru","MUR","u@","muru","noun-adj",""
"8","miri","MIR","i","mirā","noun-adj",""
"9","miri","MIR","i","mirā","noun-adj",""
"10","miri","MIR","i","mirā","noun-adj",""
"11","miri","MIR","i","mirā","noun-adj",""
"12","miri","MIR","i","mirā","noun-adj",""
"13","miri","MIR","i","mirā","noun-adj",""
"14","muru","MUR","u@","muru","noun-adj",""
"15","miri","MIR","i","mirā","noun-adj",""
"16","miri","MIR","i","mirā","noun-adj",""
"17","miri","MIR","i","mirā","noun-adj",""
"18","miri","MIR","i","mirā","noun-adj",""
"19","miri","MIR","i","mirā","noun-adj",""
"20","miri","MIR","i","mirā","noun-adj",""
"21","miri","MIR","i","mirā","noun-adj",""
"22","miri","MIR","i","mirā","noun-adj",""
"23","miri","MIR","i","mirā","noun-adj",""
"24","miri","MIR","i","mirā","noun-adj",""
"25","miri","MIR","i","mirā","noun-adj",""
"26","miri","MIR","i","mirā","noun-adj",""
"27","miri","MIR","i@","mirā","noun-adj",""
"28","muru","MUR","u@","muru","noun-adj",""
"29","miri","MIR","i","mirā","noun-adj",""
"30","iti","","","iti","ind",""
"31","miri","MIR","i","mirā","noun-adj",""
"32","iti","","","iti","ind",""
"33","miri","MIR","i","mirā","noun-adj",""
"34","iti","","","iti","ind",""
"35","miri","MIR","i","mirā","noun-adj",""
"36","iti","","","iti","ind",""
"37","miri","MIR","i","mirā","noun-adj",""
"38","iti","","","iti","ind",""
"39","miri","MIR","i","mirā","noun-adj",""
"40","iti","","","iti","ind",""
"41","ri","","","","ind",""
"42","ri","","","","ind",""
"43","ri","","","","ind",""
"44","ri","","","","ind",""
"45","ri","","","","ind",""
"46","ri","","","","ind",""
"47","rī","","","","ind",""
"48","rī","","","","ind",""
"49","rī","","","","ind",""
"50","rī","","","","ind",""
"51","rī","","","","ind",""
"52","rī","","","","ind",""
"53","miri","MIR","i","mirā","noun-adj",""
"54","miri","MIR","i","mirā","noun-adj",""
"55","miri","MIR","i","mirā","noun-adj",""
"56","miri","MIR","i","mirā","noun-adj",""
"57","miri","MIR","i","mirā","noun-adj",""
"58","miri","MIR","i","mirā","noun-adj",""
"59","tiri","","","","ind",""
"60","hasa","HAS","a","hasa","noun-adj",""
"61","miri","MIR","i","mirā","noun-adj",""
"62","ti","","","","ind",""
"63","mirī","MIR","ī","mirā","noun-adj",""
"64","ri","","","","ind",""
"65","miri","MIR","i","mirā","noun-adj",""
"66","kartā","KART","ā","kartṛ","noun-adj",""
"67","karaṃ","KAR","aṃ","kara","noun-adj",""
"68","kartā","KART","ā","kartṛ","noun-adj",""
"69","kaṃkarā","KAṄKAR","ā","kaṅkara","noun-adj",""
"70","kara","KAR","a@","kara","noun-adj",""
"71","kacā","KAC","ā","kacā","noun-adj",""
"72","/","","","","punct",""
"","</s>","","","","",""
"","<s number=""46"">","","","","",""
"1","kaṃkarā","KAṄKAR","ā","kaṅkara","noun-adj",""
"2","kaṃkarā","KAṄKAR","ā","kaṅkara","noun-adj",""
"3","kaṃkarā","KAṄKAR","ā","kaṅkara","noun-adj",""
"4","kaṃkarā","KAṄKAR","ā","kaṅkara","noun-adj",""
"5","kaṃkarā","KAṄKAR","ā","kaṅkara","noun-adj",""
"6","kaṃkarā","KAṄKAR","ā","kaṅkara","noun-adj",""
"7","kaṃkarā","KAṄKAR","ā","kaṅkara","noun-adj",""
"8","kaṃkaro","KAṄKAR","o","kaṅkara","noun-adj",""
"9","caṃ","","","","ind",""
"10","kar","KAR","","kara","noun-adj",""
"11","iti","","","iti","ind",""
"12","kurīśe","KUR","īśe","kar","verb","kṛ"
"13","/","","","","punct",""
"","</s>","","","","",""
"","<s number=""47"">","","","","",""
"1","kaṃkari","KAṄKAR","i","kaṅkara","noun-adj",""
"2","kaṃkari","KAṄKAR","i","kaṅkara","noun-adj",""
"3","kaṃkari","KAṄKAR","i","kaṅkara","noun-adj",""
"4","ṣeti","","","","ind",""
"5","/","","","","punct",""
"","</s>","","","","",""
"","<s number=""48"">","","","","",""
"1","ri","","","","ind",""
"2","ri","","","","ind",""
"3","ri","","","","ind",""
"4","ri","","","","ind",""
"5","ri","","","","ind",""
"6","ri","","","","ind",""
"7","repha","REPH","a@","repha","noun-adj",""
"8","sāri","SĀR","i","sāri","noun-adj",""
"9","/","","","","punct",""
"","</s>","","","","",""
"","<s number=""49"">","","","","",""
"1","phuri","","","","ind",""
"2","phuri","","","","ind",""
"3","phuri","","","","ind",""
"4","phuri","","","","ind",""
"5","phuri","","","","ind",""
"6","phuri","","","","ind",""
"7","phuri","","","","ind",""
"8","pharā","PHAR","ā","phara","noun-adj",""
"9","nātha","NĀTH","a@","nātha","noun-adj",""
"10","ā","","","alpha_privativum","ind",""
"11","nāthā","NĀTH","ā","nātha","noun-adj",""
"12","siri","SIR","i","siri","noun-adj",""
"13","thi","","","","ind",""
"14","phuri","","","","ind",""
"15","ruri","RUR","i","ruru","noun-adj",""
"16","prāsturi","PRĀST","uri","prāstu","noun-adj",""
"17","a","","","alpha_privativum","ind",""
"18","nātha","NĀTH","a@","nātha","noun-adj",""
"19","ā","","","alpha_privativum","ind",""
"20","nāthā","NĀTH","ā","nātha","noun-adj",""
"21","nirgacchata","NIRGACCH","ata","nirgacch","verb","nirgam"
"22","ripūṃ","RIP","ūṃ","ripū","noun-adj",""
"23","nirgacchatayadi","NIRGACCH","atayadi","nirgacchat","noun-adj",""
"24","yūyaṃ","YŪY","aṃ","yuṣmat","pron",""
"25","duṣṭa","DUṢṬ","a@","duṣṭa","noun-adj",""
"26","cittā","CITT","ā","citta","noun-adj",""
"27","na","","","na","ind",""
"28","palāyeta","PALĀ","yeta","palā","verb",""
"29","naśyeta","NAŚY","eta","naśy","verb","naś"
"","</page>","","","","",""
"","<page number=""2.9"">","","","","",""
"32","buddho","BUDDH","o","buddha","noun-adj",""
"33","loka","LOK","a@","loka","noun-adj",""
"34","ānukampaka","ANUKAMP","aka","anukampaka","noun-adj",""
"35","evam","","","eva","ind",""
"36","ājñāpayati","ĀJÑĀP","ayati","ājñāpa","noun-adj",""
"37","/","","","","punct",""
"","</s>","","","","",""
"","<s number=""50"">","","","","",""
"1","praviśati","PRAVIŚ","ati","praviś","verb","praviś"
"2","sarva","SARV","a@","sarva","noun-adj",""
"3","satva","SATTV","a@","sattva","noun-adj",""
"4","hita","HIT","a@","hita","noun-adj",""
"5","ādhyāśayo","ADHYĀŚAY","o","adhyāśaya","noun-adj",""
"6","maitrī","MAITR","ī@","maitrī","noun-adj",""
"7","vihārī","VIHĀR","ī@","vihārī","noun-adj",""
"8","kāruṇiko","KĀRUṆIK","o","kāruṇika","noun-adj",""
"9","muditā","MUDIT","ā@","muditā","noun-adj",""
"10","vihārī","VIHĀR","ī","vihārin","noun-adj",""
"11","upekṣā","UPEKṢ","ā@","upekṣā","noun-adj",""
"12","vihārī","VIHĀR","ī","vihārin","noun-adj",""
"13","/","","","","punct",""
"","</s>","","","","",""
"","<s number=""51"">","","","","",""
"","</page>","","","","",""
"","<page number=""2.10"">","","","","",""
"3","ete","","","tad","pron",""
"4","mantra","MANTR","a@","mantra","noun-adj",""
"5","padāḥ","PAD","āḥ","pada","noun-adj",""
"6","siddhāḥ","SIDDH","āḥ","siddha","noun-adj",""
"7","siddha","SIDDH","a@","siddha","noun-adj",""
"8","gāthā","GĀTH","ā","gāthā","noun-adj",""
"9","jina","JIN","a@","jina","noun-adj",""
"10","oditāḥ","UDIT","āḥ","udita","noun-adj",""
"11","/","","","","punct",""
"12","sarveṣāṃ","SARV","eṣāṃ","sarva","noun-adj",""
"13","devatānāṃ","DEVAT","ānāṃ","devatā","noun-adj",""
"14","hi","","","hi","ind",""
"15","bhūtānāṃ","BHŪT","ānāṃ","bhūta","noun-adj",""
"16","ca","","","ca","ind",""
"17","hitaiṣiṇāṃ","HITAIṢ","iṇāṃ","hitaiṣin","noun-adj",""
"18","//","","","","punct",""
"","</s>","","","","",""
"","<s number=""52"">","","","","",""
"1","jñāne","JÑĀN","e","jñāna","noun-adj",""
"2","nātha","NĀTH","a@","nātha","noun-adj",""
"3","ottame","UTTAM","e","uttama","noun-adj",""
"4","nādya","NĀDY","a","nādya","noun-adj",""
"5","tathā","","","tathā","ind",""
"6","dharmatay","DHARMAT","ay","dharmatā","noun-adj",""
"7","^","","","","",""
"8","āpi","","","api","ind",""
"9","ca","","","ca","ind",""
"10","/","","","","punct",""
"11","jagatām","JAGAT","ām","jagat","noun-adj",""
"12","ītayaḥ","","","","ind",""
"13","sarvāḥ","SARV","āḥ","sarva","noun-adj",""
"14","śāmyantv","ŚĀMY","antv","śāmyat","noun-adj",""
"15","ārogyam","ĀROGY","am","ārogya","noun-adj",""
"16","astu","","","as","verb","as"
"17","vaḥ","","","yuṣmat","pron",""
"18","//","","","","punct",""
"","</s>","","","","",""
"","<s number=""53"">","","","","",""
"","</page>","","","","",""
"","<page number=""3.1"">","","","","",""
"3","viśaktikā","VIŚAKT","ikā","viśaktika","noun-adj",""
"4","yasya","","","yad","pron",""
"5","tṛṣṇā","TṚṢṆ","ā","tṛṣṇā","noun-adj",""
"6","vidhvastā","VIDHVAST","ā","vidhvasta","noun-adj",""
"7","viralī","VIRAL","ī@","viralī","noun-adj",""
"8","kṛtāḥ","KṚT","āḥ","kṛta","noun-adj",""
"9","/","","","","punct",""
"10","śānta","ŚĀNT","a@","śānta","noun-adj",""
"11","citto","CITT","o","citta","noun-adj",""
"12","hy","","","hi","ind",""
"13","an","","","alpha_privativum","ind",""
"14","āyāsaḥ","ĀYĀS","aḥ","āyāsa","noun-adj",""
"15","sa","","","sa_saha","ind",""
"16","vaḥ","","","yuṣmat","pron",""
"17","svasti","SVAST","i","svasti","noun-adj",""
"18","kariṣyati","KAR","iṣyati","kar","verb","kṛ"
"19","//","","","","punct",""
"","</s>","","","","",""
"","<s number=""54"">","","","","",""
"","</page>","","","","",""
"","<page number=""3.2"">","","","","",""
"3","yo","","","yad","pron",""
"4","jagan","JAGAN","","jagat","noun-adj",""
"5","mokṣa","MOKṢ","a@","mokṣa","noun-adj",""
"6","mārgasmin","MĀRG","asmin","mārga","noun-adj",""
"7","niveśayati","NIVEŚ","ayati","niveś","verb","niviś"
"8","nāyakaḥ","NĀYAK","aḥ","nāyaka","noun-adj",""
"9","/","","","","punct",""
"10","deśakaḥ","DEŚAK","aḥ","deśaka","noun-adj",""
"11","sarva","SARV","a@","sarva","noun-adj",""
"12","dharmāṇāṃ","DHARM","āṇāṃ","dharma","noun-adj",""
"13","sa","","","sa_saha","ind",""
"14","vaḥ","","","yuṣmat","pron",""
"15","svasti","SVAST","i","svasti","noun-adj",""
"16","kariṣyati","KAR","iṣyati","kar","verb","kṛ"
"17","//","","","","punct",""
"","</s>","","","","",""
"","<s number=""55"">","","","","",""
"","</page>","","","","",""
"","<page number=""3.3"">","","","","",""
"3","gatir","GAT","ir","gati","noun-adj",""
"4","yo","","","yad","pron",""
"5","jagatāṃ","JAGAT","āṃ","jagat","noun-adj",""
"6","śāstā","ŚĀST","ā","śastṛ","noun-adj",""
"7","kṛtaṃ","KṚT","aṃ","kṛta","noun-adj",""
"8","yena","","","yad","pron",""
"9","sukhī","SUKH","ī","sukhī","noun-adj",""
"10","bahuḥ","BAH","uḥ","bahu","noun-adj",""
"11","/","","","","punct",""
"12","arthāya","ARTH","āya","artha","noun-adj",""
"13","sarva","SARV","a@","sarva","noun-adj",""
"14","satvānāṃ","SATTV","ānāṃ","sattva","noun-adj",""
"15","sa","","","sa_saha","ind",""
"16","vaḥ","","","yuṣmat","pron",""
"17","svasti","SVAST","i","svasti","noun-adj",""
"18","kariṣyati","KAR","iṣyati","kar","verb","kṛ"
"19","//","","","","punct",""
"","</s>","","","","",""
"","<s number=""56"">","","","","",""
"","</page>","","","","",""
"","<page number=""3.4"">","","","","",""
"3","yena","","","yad","pron",""
"4","sarva","SARV","a@","sarva","noun-adj",""
"5","jagac","JAG","ac","jagat","noun-adj",""
"6","c","","","ca","ind",""
"7","aitan","ETAN","","tad","pron",""
"8","maitra","MAITR","a@","maitra","noun-adj",""
"9","cittena","CITT","ena","citta","noun-adj",""
"10","tāyinā","TĀY","inā","tāyin","noun-adj",""
"11","/","","","","punct",""
"12","pālitaṃ","PĀLIT","aṃ","pālita","noun-adj",""
"13","putravan","PUTR","avan","putravat","noun-adj",""
"14","nityaṃ","NITY","aṃ","nitya","noun-adj",""
"15","sa","","","sa_saha","ind",""
"16","vaḥ","","","yuṣmat","pron",""
"17","svasti","SVAST","i","svasti","noun-adj",""
"18","kariṣyati","KAR","iṣyati","kar","verb","kṛ"
"19","//","","","","punct",""
"","</s>","","","","",""
"","<s number=""57"">","","","","",""
"","</page>","","","","",""
"","<page number=""3.5"">","","","","",""
"3","gatir","GAT","ir","gati","noun-adj",""
"4","yaḥ","","","yad","pron",""
"5","sarva","SARV","a@","sarva","noun-adj",""
"6","satvānāṃ","SATTV","ānāṃ","sattva","noun-adj",""
"7","trāṇaṃ","TRĀṆ","aṃ","trāṇa","noun-adj",""
"8","dvīpaḥ","DVĪP","aḥ","dvīpa","noun-adj",""
"9","parāyaṇaṃ","PARĀYAṆ","aṃ","parāyaṇa","noun-adj",""
"10","/","","","","punct",""
"11","saṃsāre","SAṂSĀR","e","saṃsāra","noun-adj",""
"12","vartamānānāṃ","VARTAMĀN","ānāṃ","vartamāna","noun-adj",""
"13","sa","","","sa_saha","ind",""
"14","vaḥ","","","yuṣmat","pron",""
"15","svasti","SVAST","i","svasti","noun-adj",""
"16","kariṣyati","KAR","iṣyati","kar","verb","kṛ"
"17","//","","","","punct",""
"","</s>","","","","",""
"","<s number=""58"">","","","","",""
"","</page>","","","","",""
"","<page number=""3.6"">","","","","",""
"3","yaḥ","","","yad","pron",""
"4","sākṣāt","SĀKṢĀT","","sākṣāta","noun-adj",""
"5","sarva","SARV","a@","sarva","noun-adj",""
"6","dharmāṇām","DHARM","āṇām","dharma","noun-adj",""
"7","a","","","alpha_privativum","ind",""
"8","visaṃvādakaḥ","VISAṂVĀD","akaḥ","visaṃvādaka","noun-adj",""
"9","śuciḥ","ŚUC","iḥ","śuci","noun-adj",""
"10","/","","","","punct",""
"11","śuci","ŚUC","i@","śuci","noun-adj",""
"12","vākyaḥ","VĀKY","aḥ","vākya","noun-adj",""
"13","śuci","ŚUC","i@","śuci","noun-adj",""
"14","karaḥ","KAR","aḥ","kara","noun-adj",""
"15","sa","","","sa_saha","ind",""
"16","vaḥ","","","yuṣmat","pron",""
"17","svasti","SVAST","i","svasti","noun-adj",""
"18","kariṣyati","KAR","iṣyati","kar","verb","kṛ"
"19","//","","","","punct",""
"","</s>","","","","",""
"","<s number=""59"">","","","","",""
"","</page>","","","","",""
"","<page number=""3.7"">","","","","",""
"3","yasmiñ","YASM","iñ","yad","pron",""
"4","jāte","JĀT","e","jāta","noun-adj",""
"5","mahāvīre","MAHĀVĪR","e","mahāvīra","noun-adj",""
"6","samṛddhāḥ","SAMṚDDH","āḥ","samṛddha","noun-adj",""
"7","sarva","SARV","a@","sarva","noun-adj",""
"8","sampadaḥ","SAMPAD","aḥ","sampada","noun-adj",""
"9","/","","","","punct",""
"10","siddhārthaḥ","SIDDHĀRTH","aḥ","siddhārtha","noun-adj",""
"11","siddha","SIDDH","a@","siddha","noun-adj",""
"12","saṃbhāraḥ","SAṂBHĀR","aḥ","saṃbhāra","noun-adj",""
"13","sa","","","sa_saha","ind",""
"14","vaḥ","","","yuṣmat","pron",""
"15","svasti","SVAST","i","svasti","noun-adj",""
"16","kariṣyati","KAR","iṣyati","kar","verb","kṛ"
"17","//","","","","punct",""
"","</s>","","","","",""
"","<s number=""60"">","","","","",""
"","</page>","","","","",""
"","<page number=""3.8"">","","","","",""
"3","yasmiñ","YASM","iñ","yad","pron",""
"4","jāte","JĀT","e","jāta","noun-adj",""
"5","vasumatī","VASUMAT","ī","vasumatī","noun-adj",""
"6","savaneyaṃ","SAVAN","eyaṃ","savana","noun-adj",""
"7","prakaṃpitāḥ","PRAKAMPIT","āḥ","prakampita","noun-adj",""
"8","/","","","","punct",""
"9","sarve","SARV","e","sarva","noun-adj",""
"10","satvāḥ","SATTV","āḥ","sattva","noun-adj",""
"11","pramuditāḥ","PRAMUDIT","āḥ","pramudita","noun-adj",""
"12","sa","","","sa_saha","ind",""
"13","vaḥ","","","yuṣmat","pron",""
"14","svasti","SVAST","i","svasti","noun-adj",""
"15","kariṣyati","KAR","iṣyati","kar","verb","kṛ"
"16","//","","","","punct",""
"","</s>","","","","",""
"","<s number=""61"">","","","","",""
"","</page>","","","","",""
"","<page number=""3.9"">","","","","",""
"3","ṣaḍ","ṢAḌ","@","ṣaḍi","noun-adj",""
"4","vikāraṃ","VIKĀR","aṃ","vikāra","noun-adj",""
"5","pracalitā","PRACALIT","ā","pracalita","noun-adj",""
"6","yasya","","","yad","pron",""
"7","bodhau","BODH","au","bodh","verb",""
"8","vasuṃdharāḥ","VASUṂDHAR","āḥ","vasuṃdharā","noun-adj",""
"9","/","","","","punct",""
"10","māraś","MĀR","aś","māra","noun-adj",""
"11","ca","","","ca","ind",""
"12","durmanā","DURMAN","ā","durmanas","noun-adj",""
"13","āsīt","ĀSĪT","","as","verb","as"
"14","sa","","","sa_saha","ind",""
"15","vaḥ","","","yuṣmat","pron",""
"16","svasti","SVAST","i","svasti","noun-adj",""
"17","kariṣyati","KAR","iṣyati","kar","verb","kṛ"
"18","//","","","","punct",""
"","</s>","","","","",""
"","<s number=""62"">","","","","",""
"","</page>","","","","",""
"","<page number=""3.10"">","","","","",""
"3","yaśa","","","","ind",""
"4","āsīn","ĀSĪN","","āsīna","noun-adj",""
"5","muner","MUN","er","muni","noun-adj",""
"6","yasya","","","yad","pron",""
"7","dharmacakre","DHARMACAKR","e","dharmacakra","noun-adj",""
"8","pravartite","PRAVARTIT","e","pravartita","noun-adj",""
"9","/","","","","punct",""
"10","āryasatyāni","ĀRYASATY","āni","āryasatya","noun-adj",""
"11","vadataḥ","VAD","ataḥ","vada","noun-adj",""
"12","sa","","","sa_saha","ind",""
"13","vaḥ","","","yuṣmat","pron",""
"14","svasti","SVAST","i","svasti","noun-adj",""
"15","kariṣyati","KAR","iṣyati","kar","verb","kṛ"
"16","//","","","","punct",""
"","</s>","","","","",""
"","<s number=""63"">","","","","",""
"","</page>","","","","",""
"","<page number=""3.11"">","","","","",""
"3","yena","","","yad","pron",""
"4","tīrthakarāḥ","TĪRTHAKAR","āḥ","tīrthakara","noun-adj",""
"5","sarve","SARV","e","sarva","noun-adj",""
"6","jitā","JIT","ā","jita","noun-adj",""
"7","dharmeṇa","DHARM","eṇa","dharma","noun-adj",""
"8","tāyinā","TĀY","inā","tāyin","noun-adj",""
"9","/","","","","punct",""
"10","vaśī","VAŚ","ī@","vaśī","noun-adj",""
"11","kṛtāḥ","KṚT","āḥ","kṛta","noun-adj",""
"12","sarva","SARV","a@","sarva","noun-adj",""
"13","gaṇāḥ","GAṆ","āḥ","gaṇa","noun-adj",""
"14","sa","","","sa_saha","ind",""
"15","vaḥ","","","yuṣmat","pron",""
"16","svasti","SVAST","i","svasti","noun-adj",""
"17","kariṣyati","KAR","iṣyati","kar","verb","kṛ"
"18","//","","","","punct",""
"","</s>","","","","",""
"","<s number=""64"">","","","","",""
"","</page>","","","","",""
"","<page number=""3.12"">","","","","",""
"3","svasti","SVAST","i","svasti","noun-adj",""
"4","vaḥ","","","yuṣmat","pron",""
"5","kurutāṃ","KUR","utāṃ","kar","verb","kṛ"
"6","buddhaḥ","BUDDH","aḥ","buddha","noun-adj",""
"7","svasti","SVAST","i","svasti","noun-adj",""
"8","devāḥ","DEV","āḥ","deva","noun-adj",""
"9","sa","","","sa_saha","ind",""
"10","śakrakāḥ","ŚAKR","akāḥ","śakraka","noun-adj",""
"11","/","","","","punct",""
"12","svasti","SVAST","i","svasti","noun-adj",""
"13","sarvāṇi","SARV","āṇi","sarva","noun-adj",""
"14","bhūtāni","BHŪT","āni","bhūta","noun-adj",""
"15","sarva","SARV","a@","sarva","noun-adj",""
"16","kālaṃ","KĀL","aṃ","kāla","noun-adj",""
"17","diśantu","DIŚ","antu","diś","verb","diś"
"18","vaḥ","","","yuṣmat","pron",""
"19","//","","","","punct",""
"","</s>","","","","",""
"","<s number=""65"">","","","","",""
"","</page>","","","","",""
"","<page number=""3.13"">","","","","",""
"3","buddha","BUDDH","a@","buddha","noun-adj",""
"4","puṇya","PUṆY","a@","puṇya","noun-adj",""
"5","ānubhāvena","ANUBHĀV","ena","anubhāva","noun-adj",""
"6","devatānāṃ","DEVAT","ānāṃ","devatā","noun-adj",""
"7","matena","MAT","ena","mata","noun-adj",""
"8","ca","","","ca","ind",""
"9","/","","","","punct",""
"","</s>","","","","",""
"","<s number=""66"">","","","","",""
"1","yo","","","yad","pron",""
"2","yo","","","yad","pron",""
"3","arthaḥ","ARTH","aḥ","artha","noun-adj",""
"4","samabhipretaḥ","SAMABHIPRET","aḥ","samabhipreta","noun-adj",""
"5","sarva","SARV","a@","sarva","noun-adj",""
"6","ārthodya","ARTH","odya","artha","noun-adj",""
"7","samṛddhyatāṃ","SAMṚDHY","atāṃ","samṛdhyati","noun-adj",""
"8","/","","","","punct",""
"","</s>","","","","",""
"","<s number=""67"">","","","","",""
"","</page>","","","","",""
"","<page number=""3.14"">","","","","",""
"3","svasti","SVAST","i","svasti","noun-adj",""
"4","vo","","","yuṣmat","pron",""
"5","dvipade","DVIPAD","e","dvipada","noun-adj",""
"6","bhontu","BHO","ntu","bhav","verb","bhū"
"7","svasti","SVAST","i","svasti","noun-adj",""
"8","vo","","","yuṣmat","pron",""
"9","astu","","","as","verb","as"
"10","catuṣ","CATU","ṣ","catua","noun-adj",""
"11","pade","PAD","e","pada","noun-adj",""
"12","/","","","","punct",""
"13","svasti","SVAST","i","svasti","noun-adj",""
"14","vo","","","yuṣmat","pron",""
"15","vrajatāṃ","VRAJ","atāṃ","vrajat","noun-adj",""
"16","mārge","MĀRG","e","mārga","noun-adj",""
"17","svasti","SVAST","i","svasti","noun-adj",""
"18","pratyāgateṣu","PRATYĀGAT","eṣu","pratyāgata","noun-adj",""
"19","ca","","","ca","ind",""
"20","//","","","","punct",""
"","</s>","","","","",""
"","<s number=""68"">","","","","",""
"","</page>","","","","",""
"","<page number=""3.15"">","","","","",""
"3","svasti","SVAST","i","svasti","noun-adj",""
"4","rātrau","RĀTR","au","rātra","noun-adj",""
"5","svasti","SVAST","i","svasti","noun-adj",""
"6","divā","DIV","ā","divā","noun-adj",""
"7","svasti","SVAST","i","svasti","noun-adj",""
"8","madhyaṃdine","MADHYAṂDIN","e","madhyaṃdina","noun-adj",""
"9","sthite","STHIT","e","sthita","noun-adj",""
"10","/","","","","punct",""
"11","sarvatra","SARVATR","a","sarvatra","noun-adj",""
"12","svasti","SVAST","i","svasti","noun-adj",""
"13","vo","","","yuṣmat","pron",""
"14","bhontu","BHO","ntu","bhav","verb","bhū"
"15","mā","","","mā","ind",""
"16","c","","","ca","ind",""
"17","^","","","","",""
"18","eṣāṃ","","","idam","pron",""
"19","pāpam","PĀP","am","pāpa","noun-adj",""
"20","āgamat","ĀGAM","at","āgamat","noun-adj",""
"21","//","","","","punct",""
"","</s>","","","","",""
"","<s number=""69"">","","","","",""
"","</page>","","","","",""
"","<page number=""3.16"">","","","","",""
"3","sarve","SARV","e","sarva","noun-adj",""
"4","satvāḥ","SATTV","āḥ","sattva","noun-adj",""
"5","sarve","SARV","e","sarva","noun-adj",""
"6","prāṇāḥ","PRĀṆ","āḥ","prāṇa","noun-adj",""
"7","sarve","SARV","e","sarva","noun-adj",""
"8","bhūtāś","BHŪT","āś","bhūta","noun-adj",""
"9","ca","","","ca","ind",""
"10","kevalāḥ","KEVAL","āḥ","kevala","noun-adj",""
"11","/","","","","punct",""
"","</s>","","","","",""
"","<s number=""70"">","","","","",""
"1","sarve","SARV","e","sarva","noun-adj",""
"2","vai","","","vai","ind",""
"3","sukhinaḥ","SUKH","inaḥ","sukhī","noun-adj",""
"4","santu","SANT","u@","as","verb","as"
"5","sarve","SARV","e","sarva","noun-adj",""
"6","santu","SANT","u@","as","verb","as"
"7","nirāmayāḥ","NIRĀMAY","āḥ","nirāmaya","noun-adj",""
"8","/","","","","punct",""
"9","sarve","SARV","e","sarva","noun-adj",""
"10","bhadrāṇi","BHADR","āṇi","bhadra","noun-adj",""
"11","paśyantu","PAŚ","yantu","paś","verb","paś"
"12","mā","","","mā","ind",""
"13","kaścit","","","kimcit","ind",""
"14","pāpam","PĀP","am","pāpa","noun-adj",""
"15","āgamat","ĀGAM","at","āgamat","noun-adj",""
"16","//","","","","punct",""
"","</s>","","","","",""
"","<s number=""71"">","","","","",""
"","</page>","","","","",""
"","<page number=""3.17"">","","","","",""
"3","yāni","","","yad","pron",""
"4","iha","","","iha","ind",""
"5","bhūtāni","BHŪT","āni","bhūta","noun-adj",""
"6","samāgatāni","SAMĀGAT","āni","samāgata","noun-adj",""
"7","sthitāni","STHIT","āni","sthita","noun-adj",""
"8","bhūmāv","BHŪM","āv","bhūma","noun-adj",""
"9","athava","ATHAV","a@","athavā","noun-adj",""
"10","āntarīkṣe","ANTARĪKṢ","e","antarīkṣa","noun-adj",""
"11","/","","","","punct",""
"12","kurvantu","KUR","vantu","kar","verb","kṛ"
"13","maitrīṃ","MAITR","īṃ","maitrī","noun-adj",""
"14","satataṃ","SATAT","aṃ","satata","noun-adj",""
"15","prajāsu","PRAJ","āsu","prajā","noun-adj",""
"16","divā","DIV","ā","divā","noun-adj",""
"17","ca","","","ca","ind",""
"18","rātrau","RĀTR","au","rātra","noun-adj",""
"19","ca","","","ca","ind",""
"20","carantu","CAR","antu","car","verb","car"
"21","dharmaṃ","DHARM","aṃ","dharma","noun-adj",""
"22","//","","","","punct",""
"","</s>","","","","",""
"","<s number=""72"">","","","","",""
"","</page>","","","","",""
"","<page number=""4"">","","","","",""
"3","ity","","","iti","ind",""
"4","evaṃ","","","eva","ind",""
"5","bhadanta","BHADANT","a","bhadanta","noun-adj",""
"6","^","","","","",""
"7","ety","","","iti","ind",""
"8","āyuṣmān","ĀYUṢM","ān","āyuṣmat","noun-adj",""
"9","ānando","ĀNAND","o","ānanda","noun-adj",""
"10","bhagavataḥ","BHAGAV","ataḥ","bhagavat","noun-adj",""
"11","pratiśrutya","PRATIŚRUT","ya","pratiśruta","noun-adj",""
"12","indrakīle","INDRAKĪL","e","indrakīla","noun-adj",""
"13","pādaṃ","PĀD","aṃ","pāda","noun-adj",""
"14","sthāpayitvāi","STHĀP","ayitvāi","sthāpa","noun-adj",""
"15","māni","MĀN","i","māni","noun-adj",""
"16","mahāmantrānusāriṇī","MAHĀMANTRĀNUSĀRIṆ","ī@","mahāmantrānusāriṇī","noun-adj",""
"17","mantra","MANTR","a@","mantra","noun-adj",""
"18","padāni","PAD","āni","pada","noun-adj",""
"19","bhāṣate","BHĀṢ","ate","bhāṣ","verb","bhāṣ"
"20","sma","","","sma","ind",""
"21","/","","","","punct",""
"","</s>","","","","",""
"","<s number=""73"">","","","","",""
"1","imāś","","","idam","pron",""
"2","ca","","","ca","ind",""
"3","gāthāḥ","GĀTH","āḥ","gāthā","noun-adj",""
"4","/","","","","punct",""
"","</s>","","","","",""
"","<s number=""74"">","","","","",""
"","</page>","","","","",""
"","<page number=""5.1"">","","","","",""
"3","visarata","VISAR","ata","visar","verb",""
"4","visarata","VISAR","ata","visar","verb",""
"5","visarata","VISAR","ata","visar","verb",""
"6","visarata","VISAR","ata","visar","verb",""
"7","visarata","VISAR","ata","visar","verb",""
"8","/","","","","punct",""
"","</s>","","","","",""
"","<s number=""75"">","","","","",""
"","</page>","","","","",""
"","<page number=""5.2"">","","","","",""
"3","buddho","BUDDH","o","buddha","noun-adj",""
"4","loka","LOK","a@","loka","noun-adj",""
"5","ānukampaka","ANUKAMP","aka","anukampaka","noun-adj",""
"6","ājñāpayati","ĀJÑĀP","ayati","ājñāpa","noun-adj",""
"7","/","","","","punct",""
"","</s>","","","","",""
"","<s number=""76"">","","","","",""
"1","sarva","SARV","a@","sarva","noun-adj",""
"2","buddha","BUDDH","a@","buddha","noun-adj",""
"3","ānumatena","ĀNUMAT","ena","ānumata","noun-adj",""
"4","/","","","","punct",""
"","</s>","","","","",""
"","<s number=""77"">","","","","",""
"1","sarva","SARV","a@","sarva","noun-adj",""
"2","pratyekabuddha","PRATYEKABUDDH","a@","pratyekabuddha","noun-adj",""
"3","ānumatena","ĀNUMAT","ena","ānumata","noun-adj",""
"4","/","","","","punct",""
"","</s>","","","","",""
"","<s number=""78"">","","","","",""
"1","sarva","SARV","a@","sarva","noun-adj",""
"2","ārhad","ARH","ad","arhat","noun-adj",""
"3","ānumatena","ĀNUMAT","ena","ānumata","noun-adj",""
"4","/","","","","punct",""
"","</s>","","","","",""
"","<s number=""79"">","","","","",""
"1","sarva","SARV","a@","sarva","noun-adj",""
"2","śaikṣa","ŚAIKṢ","a@","śaikṣa","noun-adj",""
"3","ānumatena","ĀNUMAT","ena","ānumata","noun-adj",""
"4","/","","","","punct",""
"","</s>","","","","",""
"","<s number=""80"">","","","","",""
"1","sarva","SARV","a@","sarva","noun-adj",""
"2","śrāvaka","ŚRĀVAK","a@","śrāvaka","noun-adj",""
"3","ānumatena","ĀNUMAT","ena","ānumata","noun-adj",""
"4","/","","","","punct",""
"","</s>","","","","",""
"","<s number=""81"">","","","","",""
"1","sarva","SARV","a@","sarva","noun-adj",""
"2","satyavākya","SATYAVĀKY","a@","satyavākya","noun-adj",""
"3","ānumatena","ĀNUMAT","ena","ānumata","noun-adj",""
"4","/","","","","punct",""
"","</s>","","","","",""
"","<s number=""82"">","","","","",""
"1","pratyekabrahma","PRATYEKABRAHM","a@","pratyekabrahman","noun-adj",""
"2","ānumatena","ĀNUMAT","ena","ānumata","noun-adj",""
"3","/","","","","punct",""
"","</s>","","","","",""
"","<s number=""83"">","","","","",""
"1","brahma","BRAHM","a@","brahma","noun-adj",""
"2","ānumatena","ĀNUMAT","ena","ānumata","noun-adj",""
"3","/","","","","punct",""
"","</s>","","","","",""
"","<s number=""84"">","","","","",""
"1","kāma","KĀM","a@","kāma","noun-adj",""
"2","eśvara","EŚVAR","a@","eśvara","noun-adj",""
"3","ānumatena","ĀNUMAT","ena","ānumata","noun-adj",""
"4","/","","","","punct",""
"","</s>","","","","",""
"","<s number=""85"">","","","","",""
"1","indra","INDR","a@","indra","noun-adj",""
"2","ānumatena","ĀNUMAT","ena","ānumata","noun-adj",""
"3","/","","","","punct",""
"","</s>","","","","",""
"","<s number=""86"">","","","","",""
"1","deva","DEV","a@","deva","noun-adj",""
"2","ānumatena","ĀNUMAT","ena","ānumata","noun-adj",""
"3","/","","","","punct",""
"","</s>","","","","",""
"","<s number=""87"">","","","","",""
"1","a","","","alpha_privativum","ind",""
"2","surendra","SURENDR","a@","surendra","noun-adj",""
"3","ānumatena","ĀNUMAT","ena","ānumata","noun-adj",""
"4","/","","","","punct",""
"","</s>","","","","",""
"","<s number=""88"">","","","","",""
"1","sarva","SARV","a@","sarva","noun-adj",""
"2","āsura","ĀSUR","a@","āsura","noun-adj",""
"3","ānumatena","ĀNUMAT","ena","ānumata","noun-adj",""
"4","/","","","","punct",""
"","</s>","","","","",""
"","<s number=""89"">","","","","",""
"1","asura","ASUR","a@","asura","noun-adj",""
"2","preṣya","PREṢY","a@","preṣya","noun-adj",""
"3","ānumatena","ĀNUMAT","ena","ānumata","noun-adj",""
"4","/","","","","punct",""
"","</s>","","","","",""
"","<s number=""90"">","","","","",""
"1","sarva","SARV","a@","sarva","noun-adj",""
"2","bhūta","BHŪT","a@","bhūta","noun-adj",""
"3","ānumatena","ĀNUMAT","ena","ānumata","noun-adj",""
"4","/","","","","punct",""
"","</s>","","","","",""
"","<s number=""91"">","","","","",""
"","</page>","","","","",""
"","<page number=""5.3"">","","","","",""
"3","visarata","VISAR","ata","visar","verb",""
"4","visarata","VISAR","ata","visar","verb",""
"5","visarata","VISAR","ata","visar","verb",""
"6","visarata","VISAR","ata","visar","verb",""
"7","visarata","VISAR","ata","visar","verb",""
"8","/","","","","punct",""
"","</s>","","","","",""
"","<s number=""92"">","","","","",""
"","</page>","","","","",""
"","<page number=""5.4"">","","","","",""
"3","buddho","BUDDH","o","buddha","noun-adj",""
"4","loka","LOK","a@","loka","noun-adj",""
"5","ānukampaka","ANUKAMP","aka","anukampaka","noun-adj",""
"6","ājñāpayati","ĀJÑĀP","ayati","ājñāpa","noun-adj",""
"7","/","","","","punct",""
"","</s>","","","","",""
"","<s number=""93"">","","","","",""
"1","mūm","","","","ind",""
"2","cata","CAT","a","catur","noun-adj",""
"3","mūm","","","","ind",""
"4","cata","CAT","a","catur","noun-adj",""
"5","mūm","","","","ind",""
"6","cata","CAT","a","catur","noun-adj",""
"7","mūm","","","","ind",""
"8","cata","CAT","a","catur","noun-adj",""
"9","/","","","","punct",""
"","</s>","","","","",""
"","<s number=""94"">","","","","",""
"1","mā","","","mā","ind",""
"2","tiṣṭhantu","TIṢṬH","antu","tiṣṭh","verb","sthā"
"3","/","","","","punct",""
"","</s>","","","","",""
"","<s number=""95"">","","","","",""
"1","ītir","","","","ind",""
"2","vyupaśāmyatu","VYUPAŚĀM","yatu","vyupaśāma","noun-adj",""
"3","/","","","","punct",""
"","</s>","","","","",""
"","<s number=""96"">","","","","",""
"1","nirgacchata","NIRGACCH","ata","nirgacch","verb","nirgam"
"2","nirgacchata","NIRGACCH","ata","nirgacch","verb","nirgam"
"3","nirgacchata","NIRGACCH","ata","nirgacch","verb","nirgam"
"4","nirgacchata","NIRGACCH","ata","nirgacch","verb","nirgam"
"5","/","","","","punct",""
"","</s>","","","","",""
"","<s number=""97"">","","","","",""
"","</page>","","","","",""
"","<page number=""5.5"">","","","","",""
"3","buddhaḥ","BUDDH","aḥ","buddha","noun-adj",""
"4","praviśati","PRAVIŚ","ati","praviś","verb","praviś"
"5","mahādevo","MAHĀDEV","o","mahādeva","noun-adj",""
"6","deva","DEV","a@","deva","noun-adj",""
"7","ātidevo","ATIDEV","o","atideva","noun-adj",""
"8","devaguruḥ","DEVAGUR","uḥ","devaguru","noun-adj",""
"9","s","","","su","ind",""
"10","endrakaś","INDR","akaś","indraka","noun-adj",""
"11","ca","","","ca","ind",""
"12","devāḥ","DEV","āḥ","deva","noun-adj",""
"13","sa","","","sa_saha","ind",""
"14","brahmakāḥsa","BRAHM","akāḥsa","brahmaka","noun-adj",""
"15","prajāpatikaś","PRAJĀPAT","ikaś","prajāpatika","noun-adj",""
"16","catvāraś","CATVĀR","aś","catur","noun-adj",""
"17","ca","","","ca","ind",""
"18","loka","LOK","a@","loka","noun-adj",""
"19","pālāḥ","PĀL","āḥ","pāla","noun-adj",""
"20","praviśanti","PRAVIŚ","anti","praviś","verb","praviś"
"21","/","","","","punct",""
"","</s>","","","","",""
"","<s number=""98"">","","","","",""
"1","an","","","alpha_privativum","ind",""
"2","ekāni","EK","āni","eka","noun-adj",""
"3","ca","","","ca","ind",""
"4","devatā","DEVAT","ā@","devatā","noun-adj",""
"5","sahasrāṇi","SAHASR","āṇi","sa_saha","ind",""
"6","a","","","alpha_privativum","ind",""
"7","surendrāś","SURENDR","āś","surendra","noun-adj",""
"8","ca","","","ca","ind",""
"9","/","","","","punct",""
"","</s>","","","","",""
"","<s number=""99"">","","","","",""
"1","an","","","alpha_privativum","ind",""
"2","ekāni","EK","āni","eka","noun-adj",""
"3","c","","","ca","ind",""
"4","^","","","","",""
"5","āsura","ĀSUR","a@","āsura","noun-adj",""
"6","sahasrāṇi","SAHASR","āṇi","sa_saha","ind",""
"7","praviśanti","PRAVIŚ","anti","praviś","verb","praviś"
"8","/","","","","punct",""
"","</s>","","","","",""
"","<s number=""100"">","","","","",""
"1","bahūni","BAH","ūni","bahu","noun-adj",""
"2","ca","","","ca","ind",""
"3","bhūta","BHŪT","a@","bhūta","noun-adj",""
"4","sahasrāṇi","SAHASR","āṇi","sa_saha","ind",""
"5","bhagavato","BHAGAV","ato","bhagavat","noun-adj",""
"6","abhiprasannāni","ABHIPRASANN","āni","abhiprasanna","noun-adj",""
"7","pravekṣyanti","PRAVEKṢ","yanti","pravekṣa","noun-adj",""
"8","sarva","SARV","a@","sarva","noun-adj",""
"9","satvānām","SATTV","ānām","sattva","noun-adj",""
"10","arthe","ARTH","e","artha","noun-adj",""
"11","/","","","","punct",""
"","</s>","","","","",""
"","<s number=""101"">","","","","",""
"","</page>","","","","",""
"","<page number=""5.6"">","","","","",""
"3","te","","","tad","pron",""
"4","vo","","","yuṣmat","pron",""
"5","māna","MĀN","a@","māna","noun-adj",""
"6","rthaṃ","RTH","aṃ","rtha","noun-adj",""
"7","kariṣyanti","KAR","iṣyanti","kar","verb","kṛ"
"8","/","","","","punct",""
"","</s>","","","","",""
"","<s number=""102"">","","","","",""
"1","nirgacchata","NIRGACCH","ata","nirgacch","verb","nirgam"
"2","nirgacchata","NIRGACCH","ata","nirgacch","verb","nirgam"
"3","nirgacchata","NIRGACCH","ata","nirgacch","verb","nirgam"
"4","nirgacchata","NIRGACCH","ata","nirgacch","verb","nirgam"
"5","/","","","","punct",""
"","</s>","","","","",""
"","<s number=""103"">","","","","",""
"1","kṣipraṃ","KṢIPR","aṃ","kṣipra","noun-adj",""
"2","palāyata","PALĀY","ata","palā","verb",""
"3","/","","","","punct",""
"","</s>","","","","",""
"","<s number=""104"">","","","","",""
"1","yadi","","","yadi","ind",""
"2","yūyaṃ","YŪY","aṃ","yuṣmat","pron",""
"3","duṣṭa","DUṢṬ","a@","duṣṭa","noun-adj",""
"4","cittā","CITT","ā","citta","noun-adj",""
"5","na","","","na","ind",""
"6","palāyeta","PALĀ","yeta","palā","verb",""
"7","naśyeta","NAŚ","yeta","naśy","verb","naś"
"8","/","","","","punct",""
"","</s>","","","","",""
"","<s number=""105"">","","","","",""
"1","ye","","","yad","pron",""
"2","maitra","MAITR","a@","maitra","noun-adj",""
"3","cittā","CITT","ā","citta","noun-adj",""
"4","na","","","na","ind",""
"5","c","","","ca","ind",""
"6","^","","","","",""
"7","āparādhu","APARĀDH","u@","aparādha","noun-adj",""
"8","kāmā","KĀM","ā","kāma","noun-adj",""
"9","rakṣāṃ","RAKṢ","āṃ","rakṣā","noun-adj",""
"10","c","","","ca","ind",""
"11","^","","","","",""
"12","ānuvartayitu","ĀNUVARTAY","itu@","ānuvartaya","noun-adj",""
"13","kāmās","KĀM","ās","kāma","noun-adj",""
"14","te","","","tad","pron",""
"15","tiṣṭhantu","TIṢṬH","antu","tiṣṭh","verb","sthā"
"16","mataṃ","MAT","aṃ","mata","noun-adj",""
"17","ca","","","ca","ind",""
"18","praviśantu","PRAVIŚ","antu","praviś","verb","praviś"
"19","/","","","","punct",""
"","</s>","","","","",""
"","<s number=""106"">","","","","",""
"","</page>","","","","",""
"","<page number=""5.7"">","","","","",""
"3","buddho","BUDDH","o","buddha","noun-adj",""
"4","loka","LOK","a@","loka","noun-adj",""
"5","ānukampa","ANUKAMP","a","anukampā","noun-adj",""
"6","evam","","","eva","ind",""
"7","ājñāpayati","ĀJÑĀP","ayati","ājñāpa","noun-adj",""
"8","/","","","","punct",""
"","</s>","","","","",""
"","<s number=""107"">","","","","",""
"","</page>","","","","",""
"","<page number=""5.8"">","","","","",""
"3","su","","","su","ind",""
"4","muru","MUR","u","mur","verb",""
"5","su","","","su","ind",""
"6","muru","MUR","u","mur","verb",""
"7","su","","","su","ind",""
"8","muru","MUR","u","mur","verb",""
"9","su","","","su","ind",""
"10","muru","MUR","u","mur","verb",""
"11","suru","","","","ind",""
"12","suru","","","","ind",""
"13","suru","","","","ind",""
"14","suru","","","","ind",""
"15","huru","","","","ind",""
"16","huru","","","","ind",""
"17","huru","","","","ind",""
"18","huru","","","","ind",""
"19","mu","","","","ind",""
"20","mu","","","","ind",""
"21","mu","","","","ind",""
"22","mu","","","","ind",""
"23","praviśati","PRAVIŚ","ati","praviś","verb","praviś"
"24","/","","","","punct",""
"","</s>","","","","",""
"","<s number=""108"">","","","","",""
"1","muru","MUR","u@","muru","noun-adj",""
"2","muru","MUR","u@","muru","noun-adj",""
"3","muru","MUR","u@","muru","noun-adj",""
"4","muru","MUR","u@","muru","noun-adj",""
"5","muru","MUR","u@","muru","noun-adj",""
"6","muru","MUR","u@","muru","noun-adj",""
"7","muru","MUR","u@","muru","noun-adj",""
"8","miri","MIR","i","mirā","noun-adj",""
"9","miri","MIR","i","mirā","noun-adj",""
"10","miri","MIR","i","mirā","noun-adj",""
"11","miri","MIR","i","mirā","noun-adj",""
"12","miri","MIR","i","mirā","noun-adj",""
"13","miri","MIR","i","mirā","noun-adj",""
"14","muru","MUR","u@","muru","noun-adj",""
"15","miri","MIR","i","mirā","noun-adj",""
"16","miri","MIR","i","mirā","noun-adj",""
"17","miri","MIR","i","mirā","noun-adj",""
"18","miri","MIR","i","mirā","noun-adj",""
"19","miri","MIR","i","mirā","noun-adj",""
"20","miri","MIR","i","mirā","noun-adj",""
"21","miri","MIR","i","mirā","noun-adj",""
"22","miri","MIR","i","mirā","noun-adj",""
"23","miri","MIR","i","mirā","noun-adj",""
"24","miri","MIR","i","mirā","noun-adj",""
"25","miri","MIR","i","mirā","noun-adj",""
"26","miri","MIR","i","mirā","noun-adj",""
"27","miri","MIR","i@","mirā","noun-adj",""
"28","muru","MUR","u@","muru","noun-adj",""
"29","miri","MIR","i","mirā","noun-adj",""
"30","iti","","","iti","ind",""
"31","miri","MIR","i","mirā","noun-adj",""
"32","iti","","","iti","ind",""
"33","miri","MIR","i","mirā","noun-adj",""
"34","iti","","","iti","ind",""
"35","miri","MIR","i","mirā","noun-adj",""
"36","iti","","","iti","ind",""
"37","miri","MIR","i","mirā","noun-adj",""
"38","iti","","","iti","ind",""
"39","miri","MIR","i","mirā","noun-adj",""
"40","iti","","","iti","ind",""
"41","ri","","","","ind",""
"42","ri","","","","ind",""
"43","ri","","","","ind",""
"44","ri","","","","ind",""
"45","ri","","","","ind",""
"46","ri","","","","ind",""
"47","rī","","","","ind",""
"48","rī","","","","ind",""
"49","rī","","","","ind",""
"50","rī","","","","ind",""
"51","rī","","","","ind",""
"52","rī","","","","ind",""
"53","miri","MIR","i","mirā","noun-adj",""
"54","miri","MIR","i","mirā","noun-adj",""
"55","miri","MIR","i","mirā","noun-adj",""
"56","miri","MIR","i","mirā","noun-adj",""
"57","miri","MIR","i","mirā","noun-adj",""
"58","miri","MIR","i","mirā","noun-adj",""
"59","tiri","","","","ind",""
"60","hasa","HAS","a","hasa","noun-adj",""
"61","miri","MIR","i","mirā","noun-adj",""
"62","ti","","","","ind",""
"63","mirī","MIR","ī","mirā","noun-adj",""
"64","ri","","","","ind",""
"65","miri","MIR","i","mirā","noun-adj",""
"66","kartā","KART","ā","kartṛ","noun-adj",""
"67","karaṃ","KAR","aṃ","kara","noun-adj",""
"68","kartā","KART","ā","kartṛ","noun-adj",""
"69","kaṃkarā","KAṄKAR","ā","kaṅkara","noun-adj",""
"70","kara","KAR","a@","kara","noun-adj",""
"71","kacā","KAC","ā","kacā","noun-adj",""
"72","/","","","","punct",""
"","</s>","","","","",""
"","<s number=""109"">","","","","",""
"1","kaṃkarā","KAṄKAR","ā","kaṅkara","noun-adj",""
"2","kaṃkarā","KAṄKAR","ā","kaṅkara","noun-adj",""
"3","kaṃkarā","KAṄKAR","ā","kaṅkara","noun-adj",""
"4","kaṃkarā","KAṄKAR","ā","kaṅkara","noun-adj",""
"5","kaṃkarā","KAṄKAR","ā","kaṅkara","noun-adj",""
"6","kaṃkarā","KAṄKAR","ā","kaṅkara","noun-adj",""
"7","kaṃkarā","KAṄKAR","ā","kaṅkara","noun-adj",""
"8","kaṃkaro","KAṄKAR","o","kaṅkara","noun-adj",""
"9","caṃ","","","","ind",""
"10","kar","KAR","","kara","noun-adj",""
"11","iti","","","iti","ind",""
"12","kurīśe","KUR","īśe","kar","verb","kṛ"
"13","/","","","","punct",""
"","</s>","","","","",""
"","<s number=""110"">","","","","",""
"1","kaṃkari","KAṄKAR","i","kaṅkara","noun-adj",""
"2","kaṃkari","KAṄKAR","i","kaṅkara","noun-adj",""
"3","kaṃkari","KAṄKAR","i","kaṅkara","noun-adj",""
"4","ṣeti","","","","ind",""
"5","/","","","","punct",""
"","</s>","","","","",""
"","<s number=""111"">","","","","",""
"1","ri","","","","ind",""
"2","ri","","","","ind",""
"3","ri","","","","ind",""
"4","ri","","","","ind",""
"5","ri","","","","ind",""
"6","ri","","","","ind",""
"7","repha","REPH","a@","repha","noun-adj",""
"8","sāri","SĀR","i","sāri","noun-adj",""
"9","/","","","","punct",""
"","</s>","","","","",""
"","<s number=""112"">","","","","",""
"1","phuri","","","","ind",""
"2","phuri","","","","ind",""
"3","phuri","","","","ind",""
"4","phuri","","","","ind",""
"5","phuri","","","","ind",""
"6","phuri","","","","ind",""
"7","phuri","","","","ind",""
"8","pharā","PHAR","ā","phara","noun-adj",""
"9","nātha","NĀTH","a@","nātha","noun-adj",""
"10","ā","","","alpha_privativum","ind",""
"11","nāthā","NĀTH","ā","nātha","noun-adj",""
"12","siri","SIR","i","siri","noun-adj",""
"13","thi","","","","ind",""
"14","phuri","","","","ind",""
"15","ruri","RUR","i","ruru","noun-adj",""
"16","prāsturi","PRĀST","uri","prāstu","noun-adj",""
"17","a","","","alpha_privativum","ind",""
"18","nātha","NĀTH","a@","nātha","noun-adj",""
"19","ā","","","alpha_privativum","ind",""
"20","nāthā","NĀTH","ā","nātha","noun-adj",""
"21","nirgacchata","NIRGACCH","ata","nirgacch","verb","nirgam"
"22","ripūṃ","RIP","ūṃ","ripū","noun-adj",""
"23","nirgacchatayadi","NIRGACCH","atayadi","nirgacchat","noun-adj",""
"24","yūyaṃ","YŪY","aṃ","yuṣmat","pron",""
"25","duṣṭa","DUṢṬ","a@","duṣṭa","noun-adj",""
"26","cittā","CITT","ā","citta","noun-adj",""
"27","na","","","na","ind",""
"28","palāyeta","PALĀ","yeta","palā","verb",""
"29","naśyeta","NAŚY","eta","naśy","verb","naś"
"","</page>","","","","",""
"","<page number=""5.9"">","","","","",""
"32","buddho","BUDDH","o","buddha","noun-adj",""
"33","loka","LOK","a@","loka","noun-adj",""
"34","ānukampaka","ANUKAMP","aka","anukampaka","noun-adj",""
"35","evam","","","eva","ind",""
"36","ājñāpayati","ĀJÑĀP","ayati","ājñāpa","noun-adj",""
"37","/","","","","punct",""
"","</s>","","","","",""
"","<s number=""113"">","","","","",""
"1","praviśati","PRAVIŚ","ati","praviś","verb","praviś"
"2","sarva","SARV","a@","sarva","noun-adj",""
"3","satva","SATTV","a@","sattva","noun-adj",""
"4","hita","HIT","a@","hita","noun-adj",""
"5","ādhyāśayo","ADHYĀŚAY","o","adhyāśaya","noun-adj",""
"6","maitrī","MAITR","ī@","maitrī","noun-adj",""
"7","vihārī","VIHĀR","ī@","vihārī","noun-adj",""
"8","kāruṇiko","KĀRUṆIK","o","kāruṇika","noun-adj",""
"9","muditā","MUDIT","ā@","muditā","noun-adj",""
"10","vihārī","VIHĀR","ī","vihārin","noun-adj",""
"11","upekṣā","UPEKṢ","ā@","upekṣā","noun-adj",""
"12","vihārī","VIHĀR","ī","vihārin","noun-adj",""
"13","/","","","","punct",""
"","</s>","","","","",""
"","<s number=""114"">","","","","",""
"","</page>","","","","",""
"","<page number=""5.10"">","","","","",""
"3","ete","","","tad","pron",""
"4","mantra","MANTR","a@","mantra","noun-adj",""
"5","padāḥ","PAD","āḥ","pada","noun-adj",""
"6","siddhāh","SIDDH","āh","siddha","noun-adj",""
"7","siddha","SIDDH","a@","siddha","noun-adj",""
"8","gāthā","GĀTH","ā","gāthā","noun-adj",""
"9","jina","JIN","a@","jina","noun-adj",""
"10","oditāḥ","UDIT","āḥ","udita","noun-adj",""
"11","/","","","","punct",""
"12","sarveṣāṃ","SARV","eṣāṃ","sarva","noun-adj",""
"13","devatānāṃ","DEVAT","ānāṃ","devatā","noun-adj",""
"14","hi","","","hi","ind",""
"15","bhūtānāṃ","BHŪT","ānāṃ","bhūta","noun-adj",""
"16","ca","","","ca","ind",""
"17","hitaiṣiṇāṃ","HITAIṢ","iṇāṃ","hitaiṣin","noun-adj",""
"18","//","","","","punct",""
"","</s>","","","","",""
"","<s number=""115"">","","","","",""
"1","jñāne","JÑĀN","e","jñāna","noun-adj",""
"2","nātha","NĀTH","a@","nātha","noun-adj",""
"3","ottame","UTTAM","e","uttama","noun-adj",""
"4","nādya","NĀDY","a","nādya","noun-adj",""
"5","tathā","","","tathā","ind",""
"6","dharmatay","DHARMAT","ay","dharmatā","noun-adj",""
"7","^","","","","",""
"8","āpi","","","api","ind",""
"9","ca","","","ca","ind",""
"10","/","","","","punct",""
"11","jagatām","JAGAT","ām","jagat","noun-adj",""
"12","ītayaḥ","","","","ind",""
"13","sarvāḥ","SARV","āḥ","sarva","noun-adj",""
"14","śāmyatv","ŚĀMY","atv","śāmyatva","noun-adj",""
"15","ārogyam","ĀROGY","am","ārogya","noun-adj",""
"16","astu","","","as","verb","as"
"17","vaḥ","","","yuṣmat","pron",""
"18","//","","","","punct",""
"","</s>","","","","",""
"","<s number=""116"">","","","","",""
"","</page>","","","","",""
"","<page number=""6.1"">","","","","",""
"3","viśaktikā","VIŚAKT","ikā","viśaktika","noun-adj",""
"4","yasya","","","yad","pron",""
"5","tṛṣṇā","TṚṢṆ","ā","tṛṣṇā","noun-adj",""
"6","vidhvastā","VIDHVAST","ā","vidhvasta","noun-adj",""
"7","viralī","VIRAL","ī@","viralī","noun-adj",""
"8","kṛtāḥ","KṚT","āḥ","kṛta","noun-adj",""
"9","/","","","","punct",""
"10","śānta","ŚĀNT","a@","śānta","noun-adj",""
"11","citto","CITT","o","citta","noun-adj",""
"12","hy","","","hi","ind",""
"13","an","","","alpha_privativum","ind",""
"14","āyāsaḥ","ĀYĀS","aḥ","āyāsa","noun-adj",""
"15","sa","","","sa_saha","ind",""
"16","vaḥ","","","yuṣmat","pron",""
"17","svasti","SVAST","i","svasti","noun-adj",""
"18","kariṣyati","KAR","iṣyati","kar","verb","kṛ"
"19","//","","","","punct",""
"","</s>","","","","",""
"","<s number=""117"">","","","","",""
"","</page>","","","","",""
"","<page number=""6.2"">","","","","",""
"3","yo","","","yad","pron",""
"4","jagan","JAGAN","","jagat","noun-adj",""
"5","mokṣa","MOKṢ","a@","mokṣa","noun-adj",""
"6","mārgasmin","MĀRG","asmin","mārga","noun-adj",""
"7","niveśayati","NIVEŚ","ayati","niveś","verb","niviś"
"8","nāyakaḥ","NĀYAK","aḥ","nāyaka","noun-adj",""
"9","/","","","","punct",""
"10","deśakaḥ","DEŚAK","aḥ","deśaka","noun-adj",""
"11","sarva","SARV","a@","sarva","noun-adj",""
"12","dharmāṇāṃ","DHARM","āṇāṃ","dharma","noun-adj",""
"13","sa","","","sa_saha","ind",""
"14","vaḥ","","","yuṣmat","pron",""
"15","svasti","SVAST","i","svasti","noun-adj",""
"16","kariṣyati","KAR","iṣyati","kar","verb","kṛ"
"17","//","","","","punct",""
"","</s>","","","","",""
"","<s number=""118"">","","","","",""
"","</page>","","","","",""
"","<page number=""6.3"">","","","","",""
"3","gatir","GAT","ir","gati","noun-adj",""
"4","yo","","","yad","pron",""
"5","jagatāṃ","JAGAT","āṃ","jagat","noun-adj",""
"6","śāstā","ŚĀST","ā","śastṛ","noun-adj",""
"7","kṛtaṃ","KṚT","aṃ","kṛta","noun-adj",""
"8","yena","","","yad","pron",""
"9","sukhī","SUKH","ī","sukhī","noun-adj",""
"10","bahu","BAH","u","bahu","noun-adj",""
"11","/","","","","punct",""
"12","arthāya","ARTH","āya","artha","noun-adj",""
"13","sarva","SARV","a@","sarva","noun-adj",""
"14","satvānāṃ","SATTV","ānāṃ","sattva","noun-adj",""
"15","sa","","","sa_saha","ind",""
"16","vaḥ","","","yuṣmat","pron",""
"17","svasti","SVAST","i","svasti","noun-adj",""
"18","kariṣyati","KAR","iṣyati","kar","verb","kṛ"
"19","//","","","","punct",""
"","</s>","","","","",""
"","<s number=""119"">","","","","",""
"","</page>","","","","",""
"","<page number=""6.4"">","","","","",""
"3","yena","","","yad","pron",""
"4","sarva","SARV","a","sarva","noun-adj",""
"5","jagac","JAG","ac","jagat","noun-adj",""
"6","c","","","ca","ind",""
"7","aitan","ETAN","","tad","pron",""
"8","maitra","MAITR","a@","maitra","noun-adj",""
"9","cittena","CITT","ena","citta","noun-adj",""
"10","tāyinā","TĀY","inā","tāyin","noun-adj",""
"11","/","","","","punct",""
"12","pālitaṃ","PĀLIT","aṃ","pālita","noun-adj",""
"13","putravan","PUTR","avan","putravat","noun-adj",""
"14","nityaṃ","NITY","aṃ","nitya","noun-adj",""
"15","sa","","","sa_saha","ind",""
"16","vaḥ","","","yuṣmat","pron",""
"17","svasti","SVAST","i","svasti","noun-adj",""
"18","kariṣyati","KAR","iṣyati","kar","verb","kṛ"
"19","//","","","","punct",""
"","</s>","","","","",""
"","<s number=""120"">","","","","",""
"","</page>","","","","",""
"","<page number=""6.5"">","","","","",""
"3","gatir","GAT","ir","gati","noun-adj",""
"4","yaḥ","","","yad","pron",""
"5","sarva","SARV","a@","sarva","noun-adj",""
"6","satvānāṃ","SATTV","ānāṃ","sattva","noun-adj",""
"7","trāṇaṃ","TRĀṆ","aṃ","trāṇa","noun-adj",""
"8","dvīpaḥ","DVĪP","aḥ","dvīpa","noun-adj",""
"9","parāyaṇam","PARĀYAṆ","am","parāyaṇa","noun-adj",""
"10","/","","","","punct",""
"11","saṃsāre","SAṂSĀR","e","saṃsāra","noun-adj",""
"12","varttamānānāṃ","VART","amānānāṃ","vart","verb","vṛt"
"13","sa","","","sa_saha","ind",""
"14","vaḥ","","","yuṣmat","pron",""
"15","svasti","SVAST","i","svasti","noun-adj",""
"16","kariṣyati","KAR","iṣyati","kar","verb","kṛ"
"17","//","","","","punct",""
"","</s>","","","","",""
"","<s number=""121"">","","","","",""
"","</page>","","","","",""
"","<page number=""6.6"">","","","","",""
"3","yaḥ","","","yad","pron",""
"4","sākṣāt","SĀKṢĀT","","sākṣāta","noun-adj",""
"5","sarva","SARV","a@","sarva","noun-adj",""
"6","dharmāṇām","DHARM","āṇām","dharma","noun-adj",""
"7","a","","","alpha_privativum","ind",""
"8","visaṃvādakaḥ","VISAṂVĀD","akaḥ","visaṃvādaka","noun-adj",""
"9","śuciḥ","ŚUC","iḥ","śuci","noun-adj",""
"10","/","","","","punct",""
"11","śuci","ŚUC","i@","śuci","noun-adj",""
"12","vākyaḥ","VĀKY","aḥ","vākya","noun-adj",""
"13","śuci","ŚUC","i@","śuci","noun-adj",""
"14","karaḥ","KAR","aḥ","kara","noun-adj",""
"15","sa","","","sa_saha","ind",""
"16","vaḥ","","","yuṣmat","pron",""
"17","svasti","SVAST","i","svasti","noun-adj",""
"18","kariṣyati","KAR","iṣyati","kar","verb","kṛ"
"19","//","","","","punct",""
"","</s>","","","","",""
"","<s number=""122"">","","","","",""
"","</page>","","","","",""
"","<page number=""6.7"">","","","","",""
"3","yasmiñ","YASM","iñ","yad","pron",""
"4","jāte","JĀT","e","jāta","noun-adj",""
"5","mahāvīre","MAHĀVĪR","e","mahāvīra","noun-adj",""
"6","samṛddhāḥ","SAMṚDDH","āḥ","samṛddha","noun-adj",""
"7","sarva","SARV","a@","sarva","noun-adj",""
"8","sampadaḥ","SAMPAD","aḥ","sampada","noun-adj",""
"9","/","","","","punct",""
"10","siddhārthaḥ","SIDDHĀRTH","aḥ","siddhārtha","noun-adj",""
"11","siddha","SIDDH","a@","siddha","noun-adj",""
"12","saṃbhāra","SAṂBHĀR","a","saṃbhāra","noun-adj",""
"13","sa","","","sa_saha","ind",""
"14","vaḥ","","","yuṣmat","pron",""
"15","svasti","SVAST","i","svasti","noun-adj",""
"16","kariṣyati","KAR","iṣyati","kar","verb","kṛ"
"17","//","","","","punct",""
"","</s>","","","","",""
"","<s number=""123"">","","","","",""
"","</page>","","","","",""
"","<page number=""6.8"">","","","","",""
"3","yasmin","YASMIN","","yad","pron",""
"4","jāte","JĀT","e","jāta","noun-adj",""
"5","vasumatī","VASUMAT","ī","vasumatī","noun-adj",""
"6","savaneyaṃ","SAVAN","eyaṃ","savana","noun-adj",""
"7","prakampitā","PRAKAMPIT","ā","prakampita","noun-adj",""
"8","/","","","","punct",""
"9","sarve","SARV","e","sarva","noun-adj",""
"10","satvāḥ","SATTV","āḥ","sattva","noun-adj",""
"11","pramuditāḥ","PRAMUDIT","āḥ","pramudita","noun-adj",""
"12","sa","","","sa_saha","ind",""
"13","vaḥ","","","yuṣmat","pron",""
"14","svasti","SVAST","i","svasti","noun-adj",""
"15","kariṣyati","KAR","iṣyati","kar","verb","kṛ"
"16","//","","","","punct",""
"","</s>","","","","",""
"","<s number=""124"">","","","","",""
"","</page>","","","","",""
"","<page number=""6.9"">","","","","",""
"3","ṣaḍ","ṢAḌ","@","ṣaḍi","noun-adj",""
"4","vikāraṃ","VIKĀR","aṃ","vikāra","noun-adj",""
"5","pracalitā","PRACALIT","ā","pracalita","noun-adj",""
"6","yasya","","","yad","pron",""
"7","bodhau","BODH","au","bodh","verb",""
"8","vasundharā","VASUNDHAR","ā","vasundharā","noun-adj",""
"9","/","","","","punct",""
"10","māraś","MĀR","aś","māra","noun-adj",""
"11","ca","","","ca","ind",""
"12","durmanā","DURMAN","ā","durmanas","noun-adj",""
"13","āsīt","ĀSĪT","","as","verb","as"
"14","sa","","","sa_saha","ind",""
"15","vaḥ","","","yuṣmat","pron",""
"16","svasti","SVAST","i","svasti","noun-adj",""
"17","kariṣyati","KAR","iṣyati","kar","verb","kṛ"
"18","//","","","","punct",""
"","</s>","","","","",""
"","<s number=""125"">","","","","",""
"","</page>","","","","",""
"","<page number=""6.10"">","","","","",""
"3","yaśa","","","","ind",""
"4","āsīn","ĀSĪN","","āsīna","noun-adj",""
"5","muner","MUN","er","muni","noun-adj",""
"6","yasya","","","yad","pron",""
"7","dharmacakre","DHARMACAKR","e","dharmacakra","noun-adj",""
"8","pravartite","PRAVARTIT","e","pravartita","noun-adj",""
"9","/","","","","punct",""
"10","āryasatyāni","ĀRYASATY","āni","āryasatya","noun-adj",""
"11","vadataḥ","VAD","ataḥ","vada","noun-adj",""
"12","sa","","","sa_saha","ind",""
"13","vaḥ","","","yuṣmat","pron",""
"14","svasti","SVAST","i","svasti","noun-adj",""
"15","kariṣyati","KAR","iṣyati","kar","verb","kṛ"
"16","//","","","","punct",""
"","</s>","","","","",""
"","<s number=""126"">","","","","",""
"","</page>","","","","",""
"","<page number=""6.11"">","","","","",""
"3","yena","","","yad","pron",""
"4","tīrthakarāḥ","TĪRTHAKAR","āḥ","tīrthakara","noun-adj",""
"5","sarve","SARV","e","sarva","noun-adj",""
"6","jitā","JIT","ā","jita","noun-adj",""
"7","dharmeṇa","DHARM","eṇa","dharma","noun-adj",""
"8","tāyinā","TĀY","inā","tāyin","noun-adj",""
"9","/","","","","punct",""
"10","vaśī","VAŚ","ī@","vaśī","noun-adj",""
"11","kṛtāḥ","KṚT","āḥ","kṛta","noun-adj",""
"12","sarva","SARV","a@","sarva","noun-adj",""
"13","gaṇāḥ","GAṆ","āḥ","gaṇa","noun-adj",""
"14","sa","","","sa_saha","ind",""
"15","vaḥ","","","yuṣmat","pron",""
"16","svasti","SVAST","i","svasti","noun-adj",""
"17","kariṣyati","KAR","iṣyati","kar","verb","kṛ"
"18","//","","","","punct",""
"","</s>","","","","",""
"","<s number=""127"">","","","","",""
"","</page>","","","","",""
"","<page number=""6.12"">","","","","",""
"3","svasti","SVAST","i","svasti","noun-adj",""
"4","vaḥ","","","yuṣmat","pron",""
"5","kurutāṃ","KUR","utāṃ","kar","verb","kṛ"
"6","buddhaḥ","BUDDH","aḥ","buddha","noun-adj",""
"7","svasti","SVAST","i","svasti","noun-adj",""
"8","devāḥ","DEV","āḥ","deva","noun-adj",""
"9","sa","","","sa_saha","ind",""
"10","śakrakāḥ","ŚAKR","akāḥ","śakraka","noun-adj",""
"11","/","","","","punct",""
"12","svasti","SVAST","i","svasti","noun-adj",""
"13","sarvāṇi","SARV","āṇi","sarva","noun-adj",""
"14","bhūtāni","BHŪT","āni","bhūta","noun-adj",""
"15","sarva","SARV","a@","sarva","noun-adj",""
"16","kālaṃ","KĀL","aṃ","kāla","noun-adj",""
"17","diśantu","DIŚ","antu","diś","verb","diś"
"18","vaḥ","","","yuṣmat","pron",""
"19","//","","","","punct",""
"","</s>","","","","",""
"","<s number=""128"">","","","","",""
"","</page>","","","","",""
"","<page number=""6.13"">","","","","",""
"3","buddha","BUDDH","a@","buddha","noun-adj",""
"4","puṇya","PUṆY","a@","puṇya","noun-adj",""
"5","ānubhāvena","ANUBHĀV","ena","anubhāva","noun-adj",""
"6","devatānāṃ","DEVAT","ānāṃ","devatā","noun-adj",""
"7","matena","MAT","ena","mata","noun-adj",""
"8","ca","","","ca","ind",""
"9","/","","","","punct",""
"","</s>","","","","",""
"","<s number=""129"">","","","","",""
"1","yo","","","yad","pron",""
"2","yo","","","yad","pron",""
"3","arthaḥ","ARTH","aḥ","artha","noun-adj",""
"4","samabhipretaḥ","SAMABHIPRET","aḥ","samabhipreta","noun-adj",""
"5","sarva","SARV","a@","sarva","noun-adj",""
"6","ārthodya","ARTH","odya","artha","noun-adj",""
"7","samṛddhyatāṃ","SAMṚDHY","atāṃ","samṛdhyati","noun-adj",""
"8","/","","","","punct",""
"","</s>","","","","",""
"","<s number=""130"">","","","","",""
"","</page>","","","","",""
"","<page number=""6.14"">","","","","",""
"3","svasti","SVAST","i","svasti","noun-adj",""
"4","vo","","","yuṣmat","pron",""
"5","dvipade","DVIPAD","e","dvipada","noun-adj",""
"6","bhontu","BHO","ntu","bhav","verb","bhū"
"7","svasti","SVAST","i","svasti","noun-adj",""
"8","vo","","","yuṣmat","pron",""
"9","astu","","","as","verb","as"
"10","catuṣ","CATU","ṣ","catua","noun-adj",""
"11","pade","PAD","e","pada","noun-adj",""
"12","/","","","","punct",""
"13","svasti","SVAST","i","svasti","noun-adj",""
"14","vo","","","yuṣmat","pron",""
"15","vrajatāṃ","VRAJ","atāṃ","vrajat","noun-adj",""
"16","mārge","MĀRG","e","mārga","noun-adj",""
"17","svasti","SVAST","i","svasti","noun-adj",""
"18","pratyāgateṣu","PRATYĀGAT","eṣu","pratyāgata","noun-adj",""
"19","ca","","","ca","ind",""
"20","//","","","","punct",""
"","</s>","","","","",""
"","<s number=""131"">","","","","",""
"","</page>","","","","",""
"","<page number=""6.15"">","","","","",""
"3","svasti","SVAST","i","svasti","noun-adj",""
"4","rātrau","RĀTR","au","rātra","noun-adj",""
"5","svasti","SVAST","i","svasti","noun-adj",""
"6","divā","DIV","ā","divā","noun-adj",""
"7","svasti","SVAST","i","svasti","noun-adj",""
"8","madhyaṃdine","MADHYAṂDIN","e","madhyaṃdina","noun-adj",""
"9","sthite","STHIT","e","sthita","noun-adj",""
"10","/","","","","punct",""
"11","sarvatra","SARVATR","a","sarvatra","noun-adj",""
"12","svasti","SVAST","i","svasti","noun-adj",""
"13","vo","","","yuṣmat","pron",""
"14","bhontu","BHO","ntu","bhav","verb","bhū"
"15","mā","","","mā","ind",""
"16","c","","","ca","ind",""
"17","^","","","","",""
"18","eṣāṃ","","","idam","pron",""
"19","pāpam","PĀP","am","pāpa","noun-adj",""
"20","āgamat","ĀGAM","at","āgamat","noun-adj",""
"21","//","","","","punct",""
"","</s>","","","","",""
"","<s number=""132"">","","","","",""
"","</page>","","","","",""
"","<page number=""3.16"">","","","","",""
"3","sarve","SARV","e","sarva","noun-adj",""
"4","satvāḥ","SATTV","āḥ","sattva","noun-adj",""
"5","sarve","SARV","e","sarva","noun-adj",""
"6","prāṇāḥ","PRĀṆ","āḥ","prāṇa","noun-adj",""
"7","sarve","SARV","e","sarva","noun-adj",""
"8","bhūtāś","BHŪT","āś","bhūta","noun-adj",""
"9","ca","","","ca","ind",""
"10","kevalāḥ","KEVAL","āḥ","kevala","noun-adj",""
"11","/","","","","punct",""
"","</s>","","","","",""
"","<s number=""133"">","","","","",""
"1","sarve","SARV","e","sarva","noun-adj",""
"2","vai","","","vai","ind",""
"3","sukhinaḥ","SUKH","inaḥ","sukhī","noun-adj",""
"4","santu","SANT","u@","as","verb","as"
"5","sarve","SARV","e","sarva","noun-adj",""
"6","santu","SANT","u@","as","verb","as"
"7","nirāmayāḥ","NIRĀMAY","āḥ","nirāmaya","noun-adj",""
"8","/","","","","punct",""
"9","sarve","SARV","e","sarva","noun-adj",""
"10","bhadrāṇi","BHADR","āṇi","bhadra","noun-adj",""
"11","paśyantu","PAŚ","yantu","paś","verb","paś"
"12","mā","","","mā","ind",""
"13","kaścit","","","kimcit","ind",""
"14","pāpam","PĀP","am","pāpa","noun-adj",""
"15","āgamat","ĀGAM","at","āgamat","noun-adj",""
"16","//","","","","punct",""
"","</s>","","","","",""
"","<s number=""134"">","","","","",""
"","</page>","","","","",""
"","<page number=""3.17"">","","","","",""
"3","yāni","","","yad","pron",""
"4","iha","","","iha","ind",""
"5","bhūtāni","BHŪT","āni","bhūta","noun-adj",""
"6","samāgatāni","SAMĀGAT","āni","samāgata","noun-adj",""
"7","sthitāni","STHIT","āni","sthita","noun-adj",""
"8","bhūmāv","BHŪM","āv","bhūma","noun-adj",""
"9","athava","ATHAV","a@","athavā","noun-adj",""
"10","āntarīkṣe","ANTARĪKṢ","e","antarīkṣa","noun-adj",""
"11","/","","","","punct",""
"12","kurvantu","KUR","vantu","kar","verb","kṛ"
"13","maitrīṃ","MAITR","īṃ","maitrī","noun-adj",""
"14","satataṃ","SATAT","aṃ","satata","noun-adj",""
"15","prajāsu","PRAJ","āsu","prajā","noun-adj",""
"16","divā","DIV","ā","divā","noun-adj",""
"17","ca","","","ca","ind",""
"18","rātrau","RĀTR","au","rātra","noun-adj",""
"19","ca","","","ca","ind",""
"20","carantu","CAR","antu","car","verb","car"
"21","dharmaṃ","DHARM","aṃ","dharma","noun-adj",""
"22","//","","","","punct",""
"","</s>","","","","",""
"","<s number=""135"">","","","","",""
"","</page>","","","","",""
"","<page number=""7.1"">","","","","",""
"3","iti","","","iti","ind",""
"4","tatra","","","tatra","ind",""
"5","buddhānāṃ","BUDDH","ānāṃ","buddha","noun-adj",""
"6","buddha","BUDDH","a@","buddha","noun-adj",""
"7","ānubhāvena","ANUBHĀV","ena","anubhāva","noun-adj",""
"8","devatānāṃ","DEVAT","ānāṃ","devatā","noun-adj",""
"9","devata","DEVAT","a@","devatā","noun-adj",""
"10","ānubhāvena","ANUBHĀV","ena","anubhāva","noun-adj",""
"11","mahati","MAHAT","i","mahat","noun-adj",""
"12","itir","","","","ind",""
"13","vyupaśānta","VYUPAŚĀNT","a","vyupaśānta","noun-adj",""
"14","^","","","","",""
"15","eti","","","iti","ind",""
"16","/","","","","punct",""
"","</s>","","","","",""
"","<s number=""136"">","","","","",""
"","</page>","","","","",""
"","<page number=""7.2"">","","","","",""
"3","idam","IDAM","","idam","pron",""
"4","avocad","AVOCAD","","vak","verb","vac"
"5","bhagavān","BHAGAV","ān@","bhagavat","noun-adj",""
"6","āttamanās","ĀTTAMAN","ās","āttamanas","noun-adj",""
"7","te","","","tad","pron",""
"8","ca","","","ca","ind",""
"9","bhikṣavas","BHIKṢ","avas","bhikṣu","noun-adj",""
"10","te","","","tad","pron",""
"11","ca","","","ca","ind",""
"12","bodhisatvā","BODHISATTV","ā","bodhisattva","noun-adj",""
"13","sā","","","tad","pron",""
"14","ca","","","ca","ind",""
"15","sarvāvatī","SARV","āvatī","sarvāvat","noun-adj",""
"16","parṣat","PARṢ","at","parṣad","noun-adj",""
"17","sad","SAD","","sat","noun-adj",""
"18","eva","","","eva","ind",""
"19","mānuṣa","MĀNUṢ","a@","mānuṣa","noun-adj",""
"20","āsura","ĀSUR","a@","āsura","noun-adj",""
"21","gandharvaś","GANDHARV","aś","gandharva","noun-adj",""
"22","ca","","","ca","ind",""
"23","loko","LOK","o","loka","noun-adj",""
"24","bhagavato","BHAGAV","ato","bhagavat","noun-adj",""
"25","bhāṣitam","BHĀṢIT","am","bhāṣita","noun-adj",""
"26","abhyanandann","ABHYANAND","ann","abhyanandat","noun-adj",""
"27","iti","","","iti","ind",""
"28","/","","","","punct",""
"","</s>","","","","",""
"","<s number=""137"">","","","","",""
"","</page>","","","","",""
"","<page number=""8"">","","","","",""
"3","iti","","","iti","ind",""
"4","mantra","MANTR","a@","mantra","noun-adj",""
"5","ānusārīnī","ANUSĀR","īnī","anusārin","noun-adj",""
"6","parī","PAR","ī@","para","noun-adj",""
"7","samāpta","SAMĀPT","a","samāpta","noun-adj",""
"8","/","","","","punct",""
"","</s>","","","","",""
"","<s number=""138"">","","","","",""
"","</page>","","","","",""
"","<page number=""9"">","","","","",""
"3","śubham","ŚUBH","am","śubha","noun-adj",""
"4","astu","","","as","verb","as"
"5","sarva","SARV","a@","sarva","noun-adj",""
"6","jagatāṃ","JAGAT","āṃ","jagat","noun-adj",""
"","</s>","","","","",""
"","</page>","","","","",""
"","</doc>","","","","",""
