"WordID","word","NormSTEM","suffix","lemma","PoS","Root"
"","<doc textid = ""sadgatikarika"" genre = ""lit"" title = ""ṣaḍgatikārikā"" author = ""n/a"" discourse = ""homiletic"" tradition = ""buddh"" period = ""uncertain"" source = ""dsbc accessed aug 2021"" date_range = ""before 11. ce"" notes = ""translation into chinese by jih-ch'eng and dharmarakṣa in 11th cent. ce. alternative discourse poetry. but this is not really a poetic work more like a sūtra naming and describing different hells etc. no access to p. mus publication. no information on dating of text; a japanese language paper on the text can be downloded here: https://catalog.lib.kyushu-u.ac.jp/opac_detail_md/?lang=1&amode=md100000&bibid=1957708"" religion = ""buddh"" edition = ""based on the ed. kiyoshi okano. a study of the verses of the six realms of existence : ṣaḍgatikārikāḥ — its sanskrit tibetan pāli and chinese texts. in south asian classical studies no. 13. 2018. kyushu university. fukuoka; japan"" digitization = ""miroj shakya"" segmentation_lemmatization = ""ligeia lugli & buddhist translators workbench team"" metadata_enrichment = ""bruno galasek-hul & buddhist translators workbench team"" proofreader = ""n/a"" permission = """" reconstructions = ""none"">","","","","",""
"","<page number=""0000"">","","","","",""
"","<s number=""1"">","","","","",""
"1","ṣaḍgati","ṢAḌGAT","i@","ṣaḍgata","noun-adj",""
"2","kārikāḥ","KĀRIK","āḥ","kārikā","noun-adj",""
"","</s>","","","","",""
"","<s number=""2"">","","","","",""
"1","guṇino","GUṆ","ino","guṇin","noun-adj",""
"2","jita","JIT","a@","jita","noun-adj",""
"3","jeyasya","JEY","asya","jeya","noun-adj",""
"4","samyag","SAMYA","g@","samyak","noun-adj",""
"5","jñāna","JÑĀN","a@","jñāna","noun-adj",""
"6","āvabhāsinaḥ","AVABHĀS","inaḥ","avabhāsin","noun-adj",""
"7","/","","","","punct",""
"8","parārtha","PARĀRTH","a@","parārtha","noun-adj",""
"9","kāriṇo","KĀRIṆ","o","kāriṇī","noun-adj",""
"10","nityaṃ","NITY","aṃ","nitya","noun-adj",""
"11","tri","TR","i@","tri","noun-adj",""
"12","lokaguruṇo","LOKAGUR","uṇo","lokaguru","noun-adj",""
"13","namaḥ","NAM","aḥ","nama","noun-adj",""
"14","//","","","","punct",""
"","</s>","","","","",""
"","<s number=""3"">","","","","",""
"1","kāya","KĀY","a@","kāya","noun-adj",""
"2","ā","","","alpha_privativum","ind",""
"3","vāg","VĀG","","vāk","noun-adj",""
"4","mānasaṃ","MĀNAS","aṃ","mānasa","noun-adj",""
"5","karma","KARM","a","karman","noun-adj",""
"6","kṛtaṃ","KṚT","aṃ","kṛta","noun-adj",""
"7","yac","","","yad","pron",""
"8","ca","","","ca","ind",""
"9","śubhāśubham","ŚUBHĀŚUBH","am","śubhāśubha","noun-adj",""
"10","/","","","","punct",""
"11","lokas","LOK","as","loka","noun-adj",""
"12","tasya","","","tad","pron",""
"13","phalaṃ","PHAL","aṃ","phala","noun-adj",""
"14","bhuṅkte","BHUṄKT","e","bhuṅkte","noun-adj",""
"15","kartān","KART","ān","karta","noun-adj",""
"16","ānyo","ANY","o","anya","noun-adj",""
"17","asti","","","as","verb","as"
"18","kasya","","","kim","pron",""
"19","cit","","","cid","ind",""
"20","//","","","","punct",""
"","</s>","","","","",""
"","<s number=""4"">","","","","",""
"1","iti","","","iti","ind",""
"2","sarve","SARV","e","sarva","noun-adj",""
"3","kṛpa","KṚP","a@","kṛpā","noun-adj",""
"4","āviṣṭās","ĀVIṢṬ","ās","āviṣṭa","noun-adj",""
"5","trailokya","TRAILOKY","a@","trailokya","noun-adj",""
"6","guravo","GUR","avo","guru","noun-adj",""
"7","jināḥ","JIN","āḥ","jina","noun-adj",""
"8","/","","","","punct",""
"9","ukta","UKT","a@","ukta","noun-adj",""
"10","vantas","VANT","as","vanti","noun-adj",""
"11","tathā","","","tathā","ind",""
"12","tad","","","tad","pron",""
"13","dhi","","","","ind",""
"14","karmaṇo","KARMAṆ","o","karmaṇi","noun-adj",""
"15","yasya","","","yad","pron",""
"16","yat","","","yad","pron",""
"17","phalam","PHAL","am","phala","noun-adj",""
"18","//","","","","punct",""
"","</s>","","","","",""
"","<s number=""5"">","","","","",""
"1","tad","","","tad","pron",""
"2","vakṣāmi","VAKṢ","āmi","vac","verb",""
"3","samā","SAM","ā@","samā","noun-adj",""
"4","sena","SEN","a","sena","noun-adj",""
"5","śrotuṃ","ŚROT","uṃ","śṛṇ","verb","śru"
"6","yuktaṃ","YUKT","aṃ","yukta","noun-adj",""
"7","bhava","BHAV","a@","bhava","noun-adj",""
"8","ārthibhiḥ","ARTH","ibhiḥ","arthin","noun-adj",""
"9","/","","","","punct",""
"10","karma","KARM","a","karman","noun-adj",""
"11","kartuṃ","KART","uṃ","kar","verb","kṛ"
"12","vihātuṃ","VIHĀT","uṃ","vihātu","noun-adj",""
"13","ca","","","ca","ind",""
"14","sad","SAD","","sat","noun-adj",""
"15","a","","","alpha_privativum","ind",""
"16","sad","SAD","","sat","noun-adj",""
"17","g","","","","ind",""
"18","atihe","ATIH","e","atiha","noun-adj",""
"19","tukam","TUK","am","tuka","noun-adj",""
"20","//","","","","punct",""
"","</s>","","","","",""
"","<s number=""6"">","","","","",""
"1","lobha","LOBH","a@","lobha","noun-adj",""
"2","moha","MOH","a@","moha","noun-adj",""
"3","bhaya","BHAY","a@","bhaya","noun-adj",""
"4","krodhā","KRODH","ā","krodha","noun-adj",""
"5","ye","","","yad","pron",""
"6","narā","NAR","ā","nara","noun-adj",""
"7","nara","NAR","a@","nara","noun-adj",""
"8","ghātinaḥ","GHĀT","inaḥ","ghātin","noun-adj",""
"9","/","","","","punct",""
"10","saṃva","SAṂV","a@","saṃva","noun-adj",""
"11","dhyāny","DHYĀN","y@","dhyāni","noun-adj",""
"12","āṃś","ĀṂŚ","","āṃśa","noun-adj",""
"13","ca","","","ca","ind",""
"14","hiṃsanti","HIṂS","anti","hiṃs","verb",""
"15","saṃjīvaṃ","SAṂJĪV","aṃ","saṃjīva","noun-adj",""
"16","yānti","","","","ind",""
"17","te","","","tad","pron",""
"18","dhruvam","DHRUV","am","dhruva","noun-adj",""
"19","//","","","","punct",""
"","</s>","","","","",""
"","<s number=""7"">","","","","",""
"1","saṃvatsara","SAṂVATSAR","a@","saṃvatsara","noun-adj",""
"2","sahasrāṇi","SAHASR","āṇi","sa_saha","ind",""
"3","ba","","","","ind",""
"4","hūny","HŪN","y","hūna","noun-adj",""
"5","api","","","api","ind",""
"6","hatā","HAT","ā","hata","noun-adj",""
"7","hatāḥ","HAT","āḥ","hata","noun-adj",""
"8","/","","","","punct",""
"9","saṃjīvanti","SAṂJĪVANT","i","saṃjīvanti","noun-adj",""
"10","yatas","","","yatas","ind",""
"11","tatra","","","tatra","ind",""
"12","tena","","","tad","pron",""
"13","saṃjīva","SAṂJĪV","a","saṃjīva","noun-adj",""
"14","ucyate","UC","yate","vak","verb","vac"
"15","//","","","","punct",""
"","</s>","","","","",""
"","<s number=""8"">","","","","",""
"1","mātāpitṛ","MĀTĀPIT","ṛ@","mātāpitṛ","noun-adj",""
"2","suhṛda","SUHṚD","a@","suhṛda","noun-adj",""
"3","bandhumitra","BANDHUMITR","a@","bandhumitra","noun-adj",""
"4","droha","DROH","a@","droha","noun-adj",""
"5","karāś","KAR","āś","kara","noun-adj",""
"6","ca","","","ca","ind",""
"7","ye","","","yad","pron",""
"8","/","","","","punct",""
"9","paiśunya","PAIŚUNY","a@","paiśunya","noun-adj",""
"10","ānṛta","ANṚT","a@","anṛta","noun-adj",""
"11","vaktāraḥ","VAKT","āraḥ","vaktṛ","noun-adj",""
"12","kālasūtra","KĀLASŪTR","a@","kālasūtra","noun-adj",""
"13","ābhigāminaḥ","ABHIGĀM","inaḥ","abhigāmin","noun-adj",""
"14","//","","","","punct",""
"","</s>","","","","",""
"","<s number=""9"">","","","","",""
"1","kālasūtreṇa","KĀLASŪTR","eṇa","kālasūtra","noun-adj",""
"2","saṃsūtrya","SAṂSŪTR","ya","saṃsūtra","noun-adj",""
"3","pāṭyante","PĀṬ","yante","pāṭa","noun-adj",""
"4","dāru","DĀR","u@","dāru","noun-adj",""
"5","vad","VAD","","vat","noun-adj",""
"6","yataḥ","","","yatas","ind",""
"7","/","","","","punct",""
"8","jvaladbhiḥ","JVAL","adbhiḥ","jvalat","noun-adj",""
"9","krakacais","KRAKAC","ais","krakaca","noun-adj",""
"10","tatra","","","tatra","ind",""
"11","kālasūtras","KĀLASŪTR","as","kālasūtra","noun-adj",""
"12","tataḥ","","","tatas","ind",""
"13","smṛtaḥ","SMṚT","aḥ","smṛta","noun-adj",""
"14","//","","","","punct",""
"","</s>","","","","",""
"","<s number=""10"">","","","","",""
"1","dāva","DĀV","a@","dāva","noun-adj",""
"2","ādau","ĀD","au","ād","verb",""
"3","dahanair","DAHAN","air","dahana","noun-adj",""
"4","dāhaṃ","DĀH","aṃ","dāha","noun-adj",""
"5","dehināṃ","DEHIN","āṃ","dehinī","noun-adj",""
"6","vidadhāti","VIDADH","āti","vidadha","noun-adj",""
"7","yaḥ","","","yad","pron",""
"8","/","","","","punct",""
"9","sa","","","sa_saha","ind",""
"10","tīvrair","TĪVR","air","tīvra","noun-adj",""
"11","jvalanair","JVALAN","air","jvalana","noun-adj",""
"12","jantus","JANT","us","jantu","noun-adj",""
"13","tapyate","TAP","yate","tap","verb","tap"
"14","tapane","TAPAN","e","tapana","noun-adj",""
"15","raṭan","RAṬAN","","raṭana","noun-adj",""
"16","//","","","","punct",""
"","</s>","","","","",""
"","<s number=""11"">","","","","",""
"1","tīvraṃ","TĪVR","aṃ","tīvra","noun-adj",""
"2","tapana","TAPAN","a@","tapana","noun-adj",""
"3","saṃtāpaṃ","SAṂTĀP","aṃ","saṃtāpa","noun-adj",""
"4","tan","TAN","","tad","pron",""
"5","oty","","","","ind",""
"6","eva","","","eva","ind",""
"7","nirantaram","NIRANTAR","am","nirantara","noun-adj",""
"8","/","","","","punct",""
"9","yat","","","yad","pron",""
"10","tato","","","tatas","ind",""
"11","anvarthayā","ANVARTH","ayā","anvartha","noun-adj",""
"12","loke","LOK","e","loka","noun-adj",""
"13","khyātas","KHYĀT","as","khyāta","noun-adj",""
"14","tapana","TAPAN","a@","tapana","noun-adj",""
"15","saṃjñayā","SAṂJÑ","ayā","saṃjñā","noun-adj",""
"16","//","","","","punct",""
"","</s>","","","","",""
"","<s number=""12"">","","","","",""
"1","dharma","DHARM","a@","dharma","noun-adj",""
"2","ā","","","alpha_privativum","ind",""
"3","dharma","DHARM","a@","dharma","noun-adj",""
"4","viparyāsaṃ","VIPARYĀS","aṃ","viparyāsa","noun-adj",""
"5","nāstiko","NĀSTIK","o","nāstika","noun-adj",""
"6","yaḥ","","","yad","pron",""
"7","prakāśa","PRAKĀŚ","a","prakāśa","noun-adj",""
"8","yan","","","yad","pron",""
"9","/","","","","punct",""
"10","saṃtāpayati","SAṂTĀP","ayati","saṃtāpa","noun-adj",""
"11","c","","","ca","ind",""
"12","^","","","","",""
"13","ānyāṃś","ANY","āṃś","anya","noun-adj",""
"14","ca","","","ca","ind",""
"15","tapyate","TAP","yate","tap","verb","tap"
"16","sa","","","sa_saha","ind",""
"17","pratāpane","PRATĀPAN","e","pratāpana","noun-adj",""
"18","//","","","","punct",""
"","</s>","","","","",""
"","<s number=""13"">","","","","",""
"1","pratāpayati","PRATĀP","ayati","pratāpa","noun-adj",""
"2","tatra","","","tatra","ind",""
"3","sthān","STHĀN","","sthāna","noun-adj",""
"4","sattvāṃs","SATTV","āṃs","sattva","noun-adj",""
"5","tīvreṇa","TĪVR","eṇa","tīvra","noun-adj",""
"6","vahninā","VAHNIN","ā","vahnin","noun-adj",""
"7","/","","","","punct",""
"8","tapanāti","TAPAN","āti","tapana","noun-adj",""
"9","śaye","ŚAY","e","śaya","noun-adj",""
"10","nāsau","NĀS","au","nās","verb",""
"11","proktas","PROKT","as","prokta","noun-adj",""
"12","tasmāt","","","tad","pron",""
"13","pratāpanaḥ","PRATĀPAN","aḥ","pratāpana","noun-adj",""
"14","//","","","","punct",""
"","</s>","","","","",""
"","<s number=""14"">","","","","",""
"1","ajaiḍaka","AJAIḌAK","a@","ajaiḍaka","noun-adj",""
"2","śṛgālāṃś","ŚṚGĀL","āṃś","śṛgāla","noun-adj",""
"3","ca","","","ca","ind",""
"4","śaśa","ŚAŚ","a@","śaśa","noun-adj",""
"5","ākhu","ĀKH","u@","ākhu","noun-adj",""
"6","mṛga","MṚG","a@","mṛga","noun-adj",""
"7","sūkarān","SŪKAR","ān","sūkara","noun-adj",""
"8","anyāṃś","ANY","āṃś","anya","noun-adj",""
"9","ca","","","ca","ind",""
"10","prāṇino","PRĀṆ","ino","prāṇin","noun-adj",""
"11","ghnanti","","","han","verb","han"
"12","saṃghātaṃ","SAṂGHĀT","aṃ","saṃghāta","noun-adj",""
"13","yānti","","","","ind",""
"14","te","","","tad","pron",""
"15","narāḥ","NAR","āḥ","nara","noun-adj",""
"16","//","","","","punct",""
"","</s>","","","","",""
"","<s number=""15"">","","","","",""
"1","saṃhatās","SAṂHAT","ās","saṃhata","noun-adj",""
"2","tatra","","","tatra","ind",""
"3","ghātyante","GHĀT","yante","ghāta","noun-adj",""
"4","samyag","SAMYA","g","samyak","noun-adj",""
"5","vā","","","vā","ind",""
"6","hananaṃ","HAN","anaṃ","hanat","noun-adj",""
"7","yataḥ","","","yatas","ind",""
"8","/","","","","punct",""
"9","tasmāt","","","tad","pron",""
"10","saṃghāta","SAṂGHĀT","a","saṃghāta","noun-adj",""
"11","ity","","","iti","ind",""
"12","evaṃ","","","eva","ind",""
"13","vikhyāto","VIKHYĀT","o","vikhyāta","noun-adj",""
"14","anvartha","ANVARTH","a@","anvartha","noun-adj",""
"15","saṃjñayā","SAṂJÑ","ayā","saṃjñā","noun-adj",""
"16","//","","","","punct",""
"","</s>","","","","",""
"","<s number=""16"">","","","","",""
"1","kāya","KĀY","a@","kāya","noun-adj",""
"2","vāg","VĀG","","vāk","noun-adj",""
"3","mānasaṃ","MĀNAS","aṃ","mānasa","noun-adj",""
"4","tāpaṃ","TĀP","aṃ","tāpa","noun-adj",""
"5","ye","","","yad","pron",""
"6","kurvanti","KUR","vanti","kar","verb","kṛ"
"7","iha","","","iha","ind",""
"8","dehinām","DEHIN","ām","dehinī","noun-adj",""
"9","/","","","","punct",""
"10","kaṭuka","KAṬUK","a@","kaṭuka","noun-adj",""
"11","ā","","","alpha_privativum","ind",""
"12","paṭikā","PAṬ","ikā","paṭika","noun-adj",""
"13","ye","","","yad","pron",""
"14","ca","","","ca","ind",""
"15","rauravaṃ","RAURAV","aṃ","raurava","noun-adj",""
"16","yānti","","","","ind",""
"17","te","","","tad","pron",""
"18","narāḥ","NAR","āḥ","nara","noun-adj",""
"19","//","","","","punct",""
"","</s>","","","","",""
"","<s number=""17"">","","","","",""
"1","tīvreṇa","TĪVR","eṇa","tīvra","noun-adj",""
"2","vahninā","VAHNIN","ā","vahnin","noun-adj",""
"3","tatra","","","tatra","ind",""
"4","dahyamānā","","","","ind",""
"5","nirantaram","NIRANTAR","am","nirantara","noun-adj",""
"6","/","","","","punct",""
"7","raudraṃ","RAUDR","aṃ","raudra","noun-adj",""
"8","ravaṃ","RAV","aṃ","rava","noun-adj",""
"9","vimuñcanti","VIMUÑC","anti","vimuñc","verb","vimuc"
"10","yatas","","","yatas","ind",""
"11","tasmāt","","","tad","pron",""
"12","sa","","","sa_saha","ind",""
"13","rauravaḥ","RAURAV","aḥ","raurava","noun-adj",""
"14","//","","","","punct",""
"","</s>","","","","",""
"","<s number=""18"">","","","","",""
"1","devad","DEV","ad","devat","noun-adj",""
"2","vija","VIJ","a@","vija","noun-adj",""
"3","guror","GUR","or","guru","noun-adj",""
"4","dravyaṃ","DRAVY","aṃ","dravya","noun-adj",""
"5","hṛtaṃ","HṚT","aṃ","hṛta","noun-adj",""
"6","yair","","","yad","pron",""
"7","duḥkhinām","DUḤKH","inām","duḥkhin","noun-adj",""
"8","iha","","","iha","ind",""
"9","/","","","","punct",""
"10","te","","","tad","pron",""
"11","mahā","MAH","ā@","mahat","noun-adj",""
"12","rauravaṃ","RAURAV","aṃ","raurava","noun-adj",""
"13","yānti","","","","ind",""
"14","ye","","","yad","pron",""
"15","c","","","ca","ind",""
"16","^","","","","",""
"17","ānyasv","ANY","asv","anya","noun-adj",""
"18","āpahāriṇaḥ","APAHĀR","iṇaḥ","apahārin","noun-adj",""
"19","//","","","","punct",""
"","</s>","","","","",""
"","<s number=""19"">","","","","",""
"1","raudratvād","RAUDR","atvād","raudratva","noun-adj",""
"2","vahni","VAHN","i@","vahni","noun-adj",""
"3","dāhasya","DĀH","asya","dāha","noun-adj",""
"4","ra","","","","ind",""
"5","vasya","VAS","ya","vas","verb",""
"6","ca","","","ca","ind",""
"7","mahattayā","MAHATT","ayā","mahattā","noun-adj",""
"8","/","","","","punct",""
"9","rauravo","RAURAV","o","raurava","noun-adj",""
"10","hi","","","hi","ind",""
"11","mahāṃs","MAH","āṃs","mahat","noun-adj",""
"12","tasya","","","tad","pron",""
"13","mahat","MAHAT","","mahat","noun-adj",""
"14","tvara","TVAR","a@","tvara","noun-adj",""
"15","uravād","URAV","ād","urava","noun-adj",""
"16","api","","","api","ind",""
"17","//","","","","punct",""
"","</s>","","","","",""
"","<s number=""20"">","","","","",""
"1","kṛtvā","KṚT","vā","kṛta","noun-adj",""
"2","guṇā","GUṆ","ā@","guṇa","noun-adj",""
"3","dhike","DHIK","e","dhikṣ","noun-adj",""
"4","tīvram","TĪVR","am","tīvra","noun-adj",""
"5","apakāraṃ","APAKĀR","aṃ","apakāra","noun-adj",""
"6","nihatya","NIHAT","ya","nihata","noun-adj",""
"7","ca","","","ca","ind",""
"8","/","","","","punct",""
"9","mātāpitṛ","MĀTĀPIT","ṛ@","mātāpitṛ","noun-adj",""
"10","gurūn","GUR","ūn","guru","noun-adj",""
"11","kalpam","KALP","am","kalpa","noun-adj",""
"12","a","","","alpha_privativum","ind",""
"13","vīca","VĪC","a","vīca","noun-adj",""
"14","upacyate","UPAC","yate","upaca","noun-adj",""
"15","dhruvam","DHRUV","am","dhruva","noun-adj",""
"16","//","","","","punct",""
"","</s>","","","","",""
"","<s number=""21"">","","","","",""
"1","asthīny","ASTH","īny","asthin","noun-adj",""
"2","api","","","api","ind",""
"3","viśīryante","VIŚĪL","yante","viśīl","verb",""
"4","raudra","RAUDR","a@","raudra","noun-adj",""
"5","āgnau","AGN","au","agni","noun-adj",""
"6","tatra","","","tatra","ind",""
"7","dehinām","DEHIN","ām","dehinī","noun-adj",""
"8","/","","","","punct",""
"9","yato","","","yatas","ind",""
"10","na","","","na","ind",""
"11","vīciḥ","VĪC","iḥ","vīci","noun-adj",""
"12","saukhyasya","SAUKHY","asya","saukhya","noun-adj",""
"13","te","","","tad","pron",""
"14","nāvī","NĀV","ī@","nāvī","noun-adj",""
"15","cir","CIR","","cira","noun-adj",""
"16","udāhṛtaḥ","UDĀHṚT","aḥ","udāhṛta","noun-adj",""
"17","//","","","","punct",""
"","</s>","","","","",""
"","<s number=""22"">","","","","",""
"1","mitho","MITH","o@","mitha","noun-adj",""
"2","droha","DROH","a@","droha","noun-adj",""
"3","ratā","RAT","ā","rata","noun-adj",""
"4","ye","","","yad","pron",""
"5","atra","","","atra","ind",""
"6","raṇe","RAṆ","e","raṇa","noun-adj",""
"7","ghnan","GHN","an","ghnat","noun-adj",""
"8","tīva","TĪV","a","tīva","noun-adj",""
"9","dehinaḥ","DEHIN","aḥ","dehin","noun-adj",""
"10","/","","","","punct",""
"11","pāpād","PĀP","ād","pāpa","noun-adj",""
"12","asi","","","as","verb","as"
"13","nakhās","NAKH","ās","nakha","noun-adj",""
"14","te","","","tad","pron",""
"15","tu","","","tu","ind",""
"16","jāyante","JĀYANT","e","jāyanta","noun-adj",""
"17","duḥkha","DUḤKH","a@","duḥkha","noun-adj",""
"18","bhāginaḥ","BHĀG","inaḥ","bhāgin","noun-adj",""
"19","//","","","","punct",""
"","</s>","","","","",""
"","<s number=""23"">","","","","",""
"1","nakhā","NAKH","ā","nakha","noun-adj",""
"2","ev","","","eva","ind",""
"3","āsayas","ĀSAY","as","āsaya","noun-adj",""
"4","teṣām","","","tad","pron",""
"5","āyasā","ĀYAS","ā","āyasa","noun-adj",""
"6","jvalitāḥ","JVALIT","āḥ","jvalita","noun-adj",""
"7","kharāḥ","KHAR","āḥ","khara","noun-adj",""
"8","/","","","","punct",""
"9","tair","","","tad","pron",""
"10","anyonyaṃ","ANYONY","aṃ","anyonya","noun-adj",""
"11","nikṛntanti","NIKṚNT","anti","nikṛnt","verb",""
"12","yat","","","yad","pron",""
"13","tenāsi","TEN","āsi","tena","noun-adj",""
"14","nakhāḥ","NAKH","āḥ","nakha","noun-adj",""
"15","smṛtāḥ","SMṚT","āḥ","smṛta","noun-adj",""
"16","//","","","","punct",""
"","</s>","","","","",""
"","<s number=""24"">","","","","",""
"1","loha","LOH","a@","loha","noun-adj",""
"2","jvalita","JVALIT","a@","jvalita","noun-adj",""
"3","tīkṣṇa","TĪKṢṆ","a@","tīkṣṇa","noun-adj",""
"4","āgrāṃ","AGR","āṃ","agrā","noun-adj",""
"5","ṣoḍoś","ṢOḌ","oś","ṣoḍa","noun-adj",""
"6","āṅgula","AṄGUL","a@","aṅgula","noun-adj",""
"7","kaṇṭakām","KAṆṬAK","ām","kaṇṭakā","noun-adj",""
"8","/","","","","punct",""
"9","balād","BAL","ād","bala","noun-adj",""
"10","ārohyate","ĀROH","yate","āroh","verb","āruh"
"11","krandan","KRANDAN","","krandana","noun-adj",""
"12","śālmalīṃ","ŚĀLMAL","īṃ","śālmalī","noun-adj",""
"13","pāra","PĀR","a@","pāra","noun-adj",""
"14","dārikaḥ","DĀRIK","aḥ","dārikā","noun-adj",""
"15","//","","","","punct",""
"","</s>","","","","",""
"","<s number=""25"">","","","","",""
"1","loha","LOH","a@","loha","noun-adj",""
"2","daṃṣṭrā","DAṂṢṬR","ā","daṃṣṭra","noun-adj",""
"3","mahākāyā","MAHĀKĀY","ā","mahākāya","noun-adj",""
"4","jvalitās","JVALIT","ās","jvalita","noun-adj",""
"5","tīvra","TĪVR","a@","tīvra","noun-adj",""
"6","bhairavāḥ","BHAIRAV","āḥ","bhairava","noun-adj",""
"7","/","","","","punct",""
"8","āśliṣya","ĀŚLIṢ","ya","āśliṣ","verb",""
"9","bhakṣayanty","BHAKṢ","ayanty","bhakṣ","verb",""
"10","enaṃ","","","ena","ind",""
"11","paradāra","PARADĀR","a@","paradāra","noun-adj",""
"12","āpahāriṇam","APAHĀR","iṇam","apahārin","noun-adj",""
"13","//","","","","punct",""
"","</s>","","","","",""
"","<s number=""26"">","","","","",""
"1","ā","","","alpha_privativum","ind",""
"2","raṭanto","RAṬANT","o","raṭantī","noun-adj",""
"3","api","","","api","ind",""
"4","khādyante","KHĀD","yante","khād","verb",""
"5","śva","","","","ind",""
"6","gṛdhra","GṚDHR","a@","gṛdhra","noun-adj",""
"7","olūka","ULŪK","a@","ulūka","noun-adj",""
"8","vāyasaiḥ","VĀYAS","aiḥ","vāyasa","noun-adj",""
"9","/","","","","punct",""
"10","asi","","","as","verb","as"
"11","pattra","PATTR","a@","pattra","noun-adj",""
"12","vane","VAN","e","vana","noun-adj",""
"13","chinnā","CHINN","ā","chinnā","noun-adj",""
"14","narā","NAR","ā","nara","noun-adj",""
"15","viśvāsa","VIŚVĀS","a@","viśvāsa","noun-adj",""
"16","ghātinaḥ","GHĀT","inaḥ","ghātin","noun-adj",""
"17","//","","","","punct",""
"","</s>","","","","",""
"","<s number=""27"">","","","","",""
"1","ayoguḍāni","AYOGUḌ","āni","ayoguḍa","noun-adj",""
"2","bhojyante","BHOJ","yante","bhoj","verb",""
"3","prataptāni","PRATAPT","āni","pratapta","noun-adj",""
"4","punaḥ","","","punar","ind",""
"5","punaḥ","","","punar","ind",""
"6","/","","","","punct",""
"7","pāyyante","PĀY","yante","pā","verb",""
"8","kvathitaṃ","KVATHIT","aṃ","kvathita","noun-adj",""
"9","tāmraṃ","TĀMR","aṃ","tāmra","noun-adj",""
"10","ye","","","yad","pron",""
"11","parasva","PARASV","a@","parasva","noun-adj",""
"12","āpahāriṇaḥ","APAHĀR","iṇaḥ","apahārin","noun-adj",""
"13","//","","","","punct",""
"","</s>","","","","",""
"","<s number=""28"">","","","","",""
"1","krūraiḥ","KRŪRA","iḥ","krūram","noun-adj",""
"2","śva","","","","ind",""
"3","bhir","BHIR","","bhiru","noun-adj",""
"4","ayodaṃṣṭraiḥ","AYODAṂṢṬR","aiḥ","ayodaṃṣṭra","noun-adj",""
"5","khādyante","KHĀD","yante","khād","verb",""
"6","vivaśā","VIVAŚ","ā","vivaśa","noun-adj",""
"7","bhṛśam","BHṚŚ","am","bhṛśa","noun-adj",""
"8","/","","","","punct",""
"9","varṣa","VARṢ","a@","varṣa","noun-adj",""
"10","koṭī","KOṬ","ī","koṭi","noun-adj",""
"11","raṭanto","RAṬANT","o","raṭantī","noun-adj",""
"12","api","","","api","ind",""
"13","ye","","","yad","pron",""
"14","sadadā","","","","ind",""
"15","kheṭake","KHEṬ","ake","kheṭaka","noun-adj",""
"16","ratāḥ","RAT","āḥ","rata","noun-adj",""
"17","//","","","","punct",""
"","</s>","","","","",""
"","<s number=""29"">","","","","",""
"1","matsyādīñ","MATSYĀD","īñ","matsyāda","noun-adj",""
"2","jala","JAL","a@","jala","noun-adj",""
"3","jān","JĀN","","jāna","noun-adj",""
"4","hatvā","HATV","ā","hatvā","noun-adj",""
"5","jvalat","JVAL","at","jvalat","noun-adj",""
"6","tāmra","TĀMR","a@","tāmra","noun-adj",""
"7","drava","DRAV","a@","drava","noun-adj",""
"8","odakām","ODAK","ām","odaka","noun-adj",""
"9","/","","","","punct",""
"10","yāti","","","","ind",""
"11","vaitaraṇīṃ","VAITARAṆ","īṃ","vaitaraṇī","noun-adj",""
"12","śaśvad","ŚAŚV","ad","śaśvat","noun-adj",""
"13","vahninā","VAHNIN","ā","vahnin","noun-adj",""
"14","dahyate","DAH","yate","dah","verb","dah"
"15","naraḥ","NAR","aḥ","nara","noun-adj",""
"16","//","","","","punct",""
"","</s>","","","","",""
"","<s number=""30"">","","","","",""
"1","yaḥ","","","yad","pron",""
"2","svārtha","SVĀRTH","a@","svārtha","noun-adj",""
"3","lava","LAV","a@","lava","noun-adj",""
"4","saṃmūḍho","SAMMŪḌH","o","sammūḍha","noun-adj",""
"5","vyavahāram","VYAVAHĀR","am","vyavahāra","noun-adj",""
"6","a","","","alpha_privativum","ind",""
"7","dhārmikam","DHĀRMIK","am","dhārmika","noun-adj",""
"8","/","","","","punct",""
"9","karoti","KAR","oti","kar","verb","kṛ"
"10","narake","NARAK","e","naraka","noun-adj",""
"11","krandan","KRANDAN","","krandana","noun-adj",""
"12","sa","","","sa_saha","ind",""
"13","cakreṇ","CAKR","eṇ","cakra","noun-adj",""
"14","ābhipīḍyate","ABHIPĪḌ","yate","abhipīḍ","verb",""
"15","//","","","","punct",""
"","</s>","","","","",""
"","<s number=""31"">","","","","",""
"1","pīḍā","PĪḌ","ā","pīḍā","noun-adj",""
"2","bahubhir","BAH","ubhir","bahu","noun-adj",""
"3","ākāraiḥ","ĀKĀR","aiḥ","ākāra","noun-adj",""
"4","kṛtā","KṚT","ā","kṛta","noun-adj",""
"5","yair","","","yad","pron",""
"6","dehinām","DEHIN","ām","dehinī","noun-adj",""
"7","iha","","","iha","ind",""
"8","/","","","","punct",""
"9","pīḍyante","PĪḌ","yante","pīḍ","verb",""
"10","te","","","tad","pron",""
"11","ciraṃ","CIR","aṃ","cira","noun-adj",""
"12","taptair","TAPT","air","tapta","noun-adj",""
"13","yantra","YANTR","a@","yantra","noun-adj",""
"14","parvata","PARVAT","a@","parvata","noun-adj",""
"15","mudgaraiḥ","MUDGAR","aiḥ","mudgara","noun-adj",""
"16","//","","","","punct",""
"","</s>","","","","",""
"","<s number=""32"">","","","","",""
"1","bhedakā","BHED","akā","bhedaka","noun-adj",""
"2","dharma","DHARM","a@","dharma","noun-adj",""
"3","setūnāṃ","SET","ūnāṃ","setu","noun-adj",""
"4","ye","","","yad","pron",""
"5","c","","","ca","ind",""
"6","^","","","","",""
"7","ā","","","alpha_privativum","ind",""
"8","sanmārga","SANMĀRG","a@","sanmārga","noun-adj",""
"9","vādinaḥ","VĀDIN","aḥ","vādin","noun-adj",""
"10","/","","","","punct",""
"11","kṣura","KṢUR","a@","kṣura","noun-adj",""
"12","dhāra","DHĀR","a@","dhāra","noun-adj",""
"13","ācitaṃ","ĀCIT","aṃ","ācita","noun-adj",""
"14","mārgaṃ","MĀRG","aṃ","mārga","noun-adj",""
"15","gatvā","GAT","vā","gata","noun-adj",""
"16","krāmanti","KRĀM","anti","krām","verb","kram"
"17","te","","","tad","pron",""
"18","narāḥ","NAR","āḥ","nara","noun-adj",""
"19","//","","","","punct",""
"","</s>","","","","",""
"","<s number=""33"">","","","","",""
"1","nakhaiḥ","NAKH","aiḥ","nakha","noun-adj",""
"2","saṃcūrṇya","SAṂCŪRṆ","ya","saṃcūrṇa","noun-adj",""
"3","yūka","YŪK","a@","yūka","noun-adj",""
"4","ādīṃś","ĀD","īṃś","ādi","noun-adj",""
"5","cūrṇyante","CŪRṆ","yante","cūrṇ","verb",""
"6","meṣa","MEṢ","a@","meṣa","noun-adj",""
"7","parvataiḥ","PARVAT","aiḥ","parvata","noun-adj",""
"8","/","","","","punct",""
"9","bhūyo","BHŪY","o","bhūya","noun-adj",""
"10","bhūyo","BHŪY","o","bhūya","noun-adj",""
"11","mahākāyāḥ","MAHĀKĀY","āḥ","mahākāya","noun-adj",""
"12","krandantas","KRAND","antas","krandat","noun-adj",""
"13","te","","","tad","pron",""
"14","śara","ŚAR","a@","śara","noun-adj",""
"15","cchatam","ŚAT","am","śata","noun-adj",""
"16","//","","","","punct",""
"","</s>","","","","",""
"","<s number=""34"">","","","","",""
"1","vrataṃ","VRAT","aṃ","vrata","noun-adj",""
"2","yas","","","yad","pron",""
"3","tu","","","tu","ind",""
"4","samāśritya","SAMĀŚRIT","ya","samāśrita","noun-adj",""
"5","samyag","SAMYA","g","samyak","noun-adj",""
"6","no","","","asmat","pron",""
"7","parir","PAR","ir","para","noun-adj",""
"8","akṣati","AKṢAT","i","akṣati","noun-adj",""
"9","/","","","","punct",""
"10","sa","","","sa_saha","ind",""
"11","śīryamāna","ŚĪR","yamāna","śīra","noun-adj",""
"12","māṃsa","MĀṂS","a@","māṃsa","noun-adj",""
"13","ā","","","alpha_privativum","ind",""
"14","sthiḥ","STH","iḥ","sthi","noun-adj",""
"15","ku","","","","ind",""
"16","kūle","KŪL","e","kūla","noun-adj",""
"17","pacyate","PAC","yate","pac","verb",""
"18","dhruvam","DHRUV","am","dhruva","noun-adj",""
"19","//","","","","punct",""
"","</s>","","","","",""
"","<s number=""35"">","","","","",""
"1","aṇun","","","","ind",""
"2","^","","","","",""
"3","āpi","","","api","ind",""
"4","hi","","","hi","ind",""
"5","yaḥ","","","yad","pron",""
"6","kaścin","KAŚCIN","","kimcit","noun-adj",""
"7","mithya","MITHY","a@","mithyā","noun-adj",""
"8","ājīvena","ĀJĪV","ena","ājīva","noun-adj",""
"9","jīvati","JĪV","ati","jīv","verb","jīv"
"10","/","","","","punct",""
"11","bhakṣyate","BHAKṢ","yate","bhaj","verb","bhaj"
"12","kṛmibhiś","KṚM","ibhiś","kṛmi","noun-adj",""
"13","caṇḍaiḥ","CAṆḌ","aiḥ","caṇḍa","noun-adj",""
"14","sa","","","sa_saha","ind",""
"15","magno","MAGN","o","magna","noun-adj",""
"16","gūtha","GŪTH","a@","gūtha","noun-adj",""
"17","mṛttike","MṚTTIK","e","mṛttikā","noun-adj",""
"18","//","","","","punct",""
"","</s>","","","","",""
"","<s number=""36"">","","","","",""
"1","dṛṣṭv","DṚṢṬV","","dṛṣṭvā","noun-adj",""
"2","^","","","","",""
"3","āpi","","","api","ind",""
"4","vrīhi","VRĪH","i@","vrīhi","noun-adj",""
"5","madhya","MADHY","a@","madhya","noun-adj",""
"6","sthān","STHĀN","","sthāna","noun-adj",""
"7","prāṇi","PRĀṆ","i@","prāṇin","noun-adj",""
"8","naś","NAŚ","","asmat","pron",""
"9","cūrṇayanti","CŪRṆ","ayanti","cūrṇ","verb",""
"10","ye","","","yad","pron",""
"11","/","","","","punct",""
"12","āyasair","ĀYAS","air","āyasa","noun-adj",""
"13","muṣalais","MUṢAL","ais","muṣala","noun-adj",""
"14","taptaiḥ","TAPT","aiḥ","tapta","noun-adj",""
"15","kṣobhyante","KṢOBH","yante","kṣobh","verb",""
"16","te","","","tad","pron",""
"17","punaḥ","","","punar","ind",""
"18","punaḥ","","","punar","ind",""
"19","//","","","","punct",""
"","</s>","","","","",""
"","<s number=""37"">","","","","",""
"1","atyanta","ATYANT","a@","atyanta","noun-adj",""
"2","krodhanāḥ","KRODHAN","āḥ","krodhana","noun-adj",""
"3","krūrāḥ","KRŪR","āḥ","krūra","noun-adj",""
"4","śaṭhāḥ","ŚAṬH","āḥ","śaṭha","noun-adj",""
"5","pāpa","PĀP","a@","pāpa","noun-adj",""
"6","ābhikāṅkṣiṇaḥ","ABHIKĀṄKṢ","iṇaḥ","abhikāṅkṣin","noun-adj",""
"7","/","","","","punct",""
"8","para","PAR","a@","para","noun-adj",""
"9","vyasana","VYASAN","a@","vyasana","noun-adj",""
"10","hṛṣṭāś","HṚṢṬ","āś","hṛṣṭa","noun-adj",""
"11","ca","","","ca","ind",""
"12","jāyante","JĀYANT","e","jāyanta","noun-adj",""
"13","yama","YAM","a@","yama","noun-adj",""
"14","rākṣasāḥ","RĀKṢAS","āḥ","rākṣasa","noun-adj",""
"15","//","","","","punct",""
"","</s>","","","","",""
"","<s number=""38"">","","","","",""
"1","sarveṣām","SARV","eṣām","sarva","noun-adj",""
"2","eva","","","eva","ind",""
"3","duḥkhānāṃ","DUḤKH","ānāṃ","duḥkha","noun-adj",""
"4","bījaṃ","BĪJ","aṃ","bīja","noun-adj",""
"5","mṛdv","MṚD","v","mṛdu","noun-adj",""
"6","ādi","ĀD","i@","ādi","noun-adj",""
"7","bhedataḥ","BHED","ataḥ","bheda","noun-adj",""
"8","/","","","","punct",""
"9","kāya","KĀY","a@","kāya","noun-adj",""
"10","vāg","VĀG","","vāk","noun-adj",""
"11","mānasaṃ","MĀNAS","aṃ","mānasa","noun-adj",""
"12","pāpaṃ","PĀP","aṃ","pāpa","noun-adj",""
"13","yat","","","yad","pron",""
"14","tad","","","tad","pron",""
"15","aṇv","AṆV","","aṇva","noun-adj",""
"16","api","","","api","ind",""
"17","varjayet","VARJAY","et","varja","verb",""
"18","//","","","","punct",""
"","</s>","","","","",""
"","<s number=""39"">","","","","",""
"1","naraka","NARAK","a@","naraka","noun-adj",""
"2","kāṇḍaṃ","KĀṆḌ","aṃ","kāṇḍa","noun-adj",""
"3","samāptam","SAMĀPT","am","samāpta","noun-adj",""
"4","//","","","","punct",""
"","</s>","","","","",""
"","<s number=""40"">","","","","",""
"1","haṃsa","HAM","sa","hama","noun-adj",""
"2","pārāvata","PĀRĀVAT","a@","pārāvata","noun-adj",""
"3","ādīnāṃ","ĀD","īnāṃ","ādi","noun-adj",""
"4","kharāṇām","KHAR","āṇām","khara","noun-adj",""
"5","api","","","api","ind",""
"6","rāgiṇām","RĀGIṆ","ām","rāgiṇī","noun-adj",""
"7","/","","","","punct",""
"8","yonau","YON","au","yoni","noun-adj",""
"9","rāgeṇa","RĀG","eṇa","rāga","noun-adj",""
"10","jāyante","JĀYANT","e","jāyanta","noun-adj",""
"11","mūḍhāḥ","MŪḌH","āḥ","mūḍha","noun-adj",""
"12","kīṭa","KĪṬ","a@","kīṭa","noun-adj",""
"13","ādi","ĀD","i@","ādi","noun-adj",""
"14","yoniṣu","YON","iṣu","yoni","noun-adj",""
"15","//","","","","punct",""
"","</s>","","","","",""
"","<s number=""41"">","","","","",""
"1","sarpāḥ","SARP","āḥ","sarpa","noun-adj",""
"2","krodha","KRODH","a@","krodha","noun-adj",""
"3","opanāha","UPANĀH","a@","upanāha","noun-adj",""
"4","ābhyāṃ","ĀBH","yāṃ","idam","pron",""
"5","mānastabdhā","MĀNASTABDH","ā","mānastabdha","noun-adj",""
"6","mṛgādhipāḥ","MṚGĀDHIP","āḥ","mṛgādhipa","noun-adj",""
"7","/","","","","punct",""
"8","abhimānena","ABHIMĀN","ena","abhimāna","noun-adj",""
"9","jāyante","JĀYANT","e","jāyanta","noun-adj",""
"10","gardabha","GARDABH","a@","gardabha","noun-adj",""
"11","śvādi","ŚVĀD","i@","śvāda","noun-adj",""
"12","yoniṣu","YON","iṣu","yoni","noun-adj",""
"13","//","","","","punct",""
"","</s>","","","","",""
"","<s number=""42"">","","","","",""
"1","mātsaryeṣ","MĀTSARY","eṣ","mātsarya","noun-adj",""
"2","yādi","YĀD","i@","yādi","noun-adj",""
"3","doṣeṇa","DOṢ","eṇa","doṣa","noun-adj",""
"4","vānarāḥ","VĀNAR","āḥ","vānara","noun-adj",""
"5","pretya","PRETY","a","pretya","noun-adj",""
"6","dehinaḥ","DEHIN","aḥ","dehin","noun-adj",""
"7","/","","","","punct",""
"8","jāyante","JĀYANT","e","jāyanta","noun-adj",""
"9","mukharā","MUKHAR","ā","mukharā","noun-adj",""
"10","dhṛṣṭāś","DHṚṢṬ","āś","dhṛṣṭa","noun-adj",""
"11","capala","CAPAL","a@","capala","noun-adj",""
"12","ātmāś","ĀTM","āś","ātman","noun-adj",""
"13","ca","","","ca","ind",""
"14","vāyasāḥ","VĀYAS","āḥ","vāyasa","noun-adj",""
"15","//","","","","punct",""
"","</s>","","","","",""
"","<s number=""43"">","","","","",""
"1","vadhabandhan","VADHABANDH","an","vadhabandha","noun-adj",""
"2","amātsaryair","AMĀTSARY","air","amātsarya","noun-adj",""
"3","gava","GAV","a@","gava","noun-adj",""
"4","ā","","","alpha_privativum","ind",""
"5","śvādiṣu","ŚVĀD","iṣu","śvāda","noun-adj",""
"6","dehinaḥ","DEHIN","aḥ","dehin","noun-adj",""
"7","/","","","","punct",""
"8","jāyante","JĀYANT","e","jāyanta","noun-adj",""
"9","krūra","KRŪR","a@","krūra","noun-adj",""
"10","karmāṇo","KARM","āṇo","karman","noun-adj",""
"11","lūtāḥ","LŪT","āḥ","lūta","noun-adj",""
"12","kharjūra","KHARJŪR","a@","kharjūra","noun-adj",""
"13","vṛścikāḥ","VṚŚCIK","āḥ","vṛścika","noun-adj",""
"14","//","","","","punct",""
"","</s>","","","","",""
"","<s number=""44"">","","","","",""
"1","vyāghra","VYĀGHR","a@","vyāghra","noun-adj",""
"2","mārjāra","MĀRJĀR","a@","mārjāra","noun-adj",""
"3","gomāyu","GOMĀY","u@","gomāyu","noun-adj",""
"4","ṛkṣa","ṚKṢ","a@","ṛkṣa","noun-adj",""
"5","gṛdhra","GṚDHR","a@","gṛdhra","noun-adj",""
"6","vṛka","VṚK","a@","vṛka","noun-adj",""
"7","ādayaḥ","ĀD","ayaḥ","ādi","noun-adj",""
"8","/","","","","punct",""
"9","jāyante","JĀYANT","e","jāyanta","noun-adj",""
"10","pretya","PRETY","a","pretya","noun-adj",""
"11","māṃ","","","mat","pron",""
"12","sādāḥ","SĀD","āḥ","sāda","noun-adj",""
"13","krodhanā","KRODHAN","ā","krodhana","noun-adj",""
"14","matsarā","MATSAR","ā","matsara","noun-adj",""
"15","narāḥ","NAR","āḥ","nara","noun-adj",""
"16","//","","","","punct",""
"","</s>","","","","",""
"","<s number=""45"">","","","","",""
"1","dātāraḥ","DĀTĀR","aḥ","dātāra","noun-adj",""
"2","krodhanāḥ","KRODHAN","āḥ","krodhana","noun-adj",""
"3","krūrā","KRŪR","ā","krūra","noun-adj",""
"4","narā","NAR","ā","nara","noun-adj",""
"5","nāga","NĀG","a@","nāga","noun-adj",""
"6","maharddhikāḥ","MAHARDDHIK","āḥ","maharddhika","noun-adj",""
"7","/","","","","punct",""
"8","bhavanti","BHAV","anti","bhav","verb","bhū"
"9","tyāgino","TYĀG","ino","tyāgin","noun-adj",""
"10","darpāt","DARP","āt","darpa","noun-adj",""
"11","krodhāc","KRODH","āc","krodha","noun-adj",""
"12","ca","","","ca","ind",""
"13","garuḍa","GARUḌ","a@","garuḍa","noun-adj",""
"14","eśvarāḥ","EŚVAR","āḥ","eśvara","noun-adj",""
"15","//","","","","punct",""
"","</s>","","","","",""
"","<s number=""46"">","","","","",""
"1","kṛtaṃ","KṚT","aṃ","kṛta","noun-adj",""
"2","yat","","","yad","pron",""
"3","pāpakaṃ","PĀPAK","aṃ","pāpaka","noun-adj",""
"4","karma","KARM","a","karman","noun-adj",""
"5","svayaṃ","SVAY","aṃ","svaya","noun-adj",""
"6","vāk","VĀK","","vāk","noun-adj",""
"7","kāya","KĀY","a@","kāya","noun-adj",""
"8","mānasam","MĀNAS","am","mānasa","noun-adj",""
"9","/","","","","punct",""
"10","triyañcas","","","","ind",""
"11","tena","","","tad","pron",""
"12","jāyante","JĀYANT","e","jāyanta","noun-adj",""
"13","tan","","","tad","pron",""
"14","ma","","","","ind",""
"15","nāg","NĀG","","nāga","noun-adj",""
"16","api","","","api","ind",""
"17","mā","","","mā","ind",""
"18","kṛthāḥ","KṚTH","āḥ","kṛtha","noun-adj",""
"19","//","","","","punct",""
"","</s>","","","","",""
"","<s number=""47"">","","","","",""
"1","tri","TR","i@","tri","noun-adj",""
"2","yakk","YAK","k@","yakk","noun-adj",""
"3","āṇḍaṃ","ĀṆḌ","aṃ","āṇḍa","noun-adj",""
"4","samāptam","SAMĀPT","am","samāpta","noun-adj",""
"5","bhakṣya","BHAKṢY","a@","bhakṣya","noun-adj",""
"6","bhojya","BHOJY","a@","bhojya","noun-adj",""
"7","āpahartāro","APAHART","āro","apahartṛ","noun-adj",""
"8","ye","","","yad","pron",""
"9","kṣudrā","KṢUDR","ā","kṣudrā","noun-adj",""
"10","dāna","DĀN","a@","dāna","noun-adj",""
"11","varjitāḥ","VARJIT","āḥ","varjita","noun-adj",""
"12","/","","","","punct",""
"13","bhavanti","BHAV","anti","bhav","verb","bhū"
"14","kuṇapa","KUṆAP","a@","kuṇapa","noun-adj",""
"15","āhārāḥ","ĀHĀR","āḥ","āhāra","noun-adj",""
"16","pretās","PRET","ās","preta","noun-adj",""
"17","te","","","tad","pron",""
"18","kaṭa","KAṬ","a@","kaṭa","noun-adj",""
"19","pūtanāḥ","PŪTAN","āḥ","pūtana","noun-adj",""
"20","//","","","","punct",""
"","</s>","","","","",""
"","<s number=""48"">","","","","",""
"1","viheṭhayanti","VIHEṬH","ayanti","viheṭh","verb",""
"2","ye","","","yad","pron",""
"3","bālān","BĀL","ān","bāla","noun-adj",""
"4","vañcayanty","VAÑC","ayanty","vañc","verb",""
"5","api","","","api","ind",""
"6","tṛṣṇayā","TṚṢṆ","ayā","tṛṣṇā","noun-adj",""
"7","/","","","","punct",""
"8","te","","","tad","pron",""
"9","api","","","api","ind",""
"10","garbha","GARBH","a@","garbha","noun-adj",""
"11","mala","MAL","a@","mala","noun-adj",""
"12","āhārā","ĀHĀR","ā","āhāra","noun-adj",""
"13","jāyante","JĀYANT","e","jāyanta","noun-adj",""
"14","kaṭa","KAṬ","a@","kaṭa","noun-adj",""
"15","pūtanāḥ","PŪTAN","āḥ","pūtana","noun-adj",""
"16","//","","","","punct",""
"","</s>","","","","",""
"","<s number=""49"">","","","","",""
"1","hīna","HĪN","a@","hīna","noun-adj",""
"2","ācāra","ĀCĀR","a@","ācāra","noun-adj",""
"3","ātidī","ATID","ī@","atidā","noun-adj",""
"4","nāś","NĀŚ","","nāśa","noun-adj",""
"5","ca","","","ca","ind",""
"6","matsarā","MATSAR","ā","matsara","noun-adj",""
"7","nitya","NITY","a@","nitya","noun-adj",""
"8","kāṅkṣiṇaḥ","KĀṄKṢ","iṇaḥ","kāṅkṣin","noun-adj",""
"9","/","","","","punct",""
"10","jāyante","JĀYANT","e","jāyanta","noun-adj",""
"11","ye","","","yad","pron",""
"12","narāḥ","NAR","āḥ","nara","noun-adj",""
"13","pretya","PRETY","a","pretya","noun-adj",""
"14","pretās","PRET","ās","preta","noun-adj",""
"15","te","","","tad","pron",""
"16","gala","GAL","a@","gala","noun-adj",""
"17","gaṇḍakāḥ","GAṆḌ","akāḥ","gaṇḍaka","noun-adj",""
"18","//","","","","punct",""
"","</s>","","","","",""
"","<s number=""50"">","","","","",""
"1","dānaṃ","DĀN","aṃ","dāna","noun-adj",""
"2","nivāraya","NIVĀRAY","a@","nivāraya","noun-adj",""
"3","ty","TY","","tya","noun-adj",""
"4","eva","","","eva","ind",""
"5","na","","","na","ind",""
"6","ca","","","ca","ind",""
"7","kiṃcid","","","kimcit","ind",""
"8","dadāti","DAD","āti","dadat","noun-adj",""
"9","yaḥ","","","yad","pron",""
"10","/","","","","punct",""
"11","kṣutkṣāmo","KṢUTKṢĀM","o","kṣutkṣāma","noun-adj",""
"12","asau","","","adas","pron",""
"13","mahā","MAH","ā@","mahat","noun-adj",""
"14","kukṣiḥ","KUKṢ","iḥ","kukṣi","noun-adj",""
"15","pretaḥ","PRET","aḥ","preta","noun-adj",""
"16","śūcī","ŚŪC","ī@","śūcī","noun-adj",""
"17","mukho","MUKH","o","mukha","noun-adj",""
"18","bhavet","BHAV","et","bhav","verb","bhū"
"19","//","","","","punct",""
"","</s>","","","","",""
"","<s number=""51"">","","","","",""
"1","dhanaṃ","DHAN","aṃ","dhana","noun-adj",""
"2","rakṣati","RAKṢ","ati","rakṣ","verb","rakṣ"
"3","vaṃśa","VAṂŚ","a@","vaṃśa","noun-adj",""
"4","ārthaṃ","ARTH","aṃ","artha","noun-adj",""
"5","na","","","na","ind",""
"6","bhuṅkte","BHUṄKT","e","bhuṅkte","noun-adj",""
"7","na","","","na","ind",""
"8","dadāti","DAD","āti","dadat","noun-adj",""
"9","yaḥ","","","yad","pron",""
"10","/","","","","punct",""
"11","datta","DATT","a@","datta","noun-adj",""
"12","ādāyī","ADĀY","ī","adāyin","noun-adj",""
"13","tataḥ","","","tatas","ind",""
"14","pretaḥ","PRET","aḥ","preta","noun-adj",""
"15","śrāddha","ŚRĀDDH","a@","śrāddha","noun-adj",""
"16","bhoktā","BHOKT","ā","bhoktṛ","noun-adj",""
"17","sa","","","sa_saha","ind",""
"18","jāyate","JĀ","yate","jan","verb","jan"
"19","//","","","","punct",""
"","</s>","","","","",""
"","<s number=""52"">","","","","",""
"1","yaḥ","","","yad","pron",""
"2","parasva","PARASV","a@","parasva","noun-adj",""
"3","āpahāre","APAHĀR","e","apahāra","noun-adj",""
"4","psur","PSUR","","psuras","noun-adj",""
"5","dattvā","DATTV","ā","dattvā","noun-adj",""
"6","cai","","","","ind",""
"7","vānu","VĀN","u@","vāna","noun-adj",""
"8","tapyate","TAP","yate","tap","verb","tap"
"9","/","","","","punct",""
"10","bhoktā","BHOKT","ā","bhoktṛ","noun-adj",""
"11","viṭa","VIṬ","a@","viṭa","noun-adj",""
"12","śleṣmava","ŚLEṢMAV","a@","śleṣmavat","noun-adj",""
"13","āntānāṃ","ANT","ānāṃ","anta","noun-adj",""
"14","pretya","PRETY","a","pretya","noun-adj",""
"15","pretaḥ","PRET","aḥ","preta","noun-adj",""
"16","sa","","","sa_saha","ind",""
"17","jāyate","JĀ","yate","jan","verb","jan"
"18","//","","","","punct",""
"","</s>","","","","",""
"","<s number=""53"">","","","","",""
"1","a","","","alpha_privativum","ind",""
"2","priyaṃ","PRIY","aṃ","priya","noun-adj",""
"3","vakti","VAKT","i","vakti","noun-adj",""
"4","yaḥ","","","yad","pron",""
"5","krodhād","KRODH","ād","krodha","noun-adj",""
"6","vākyaṃ","VĀKY","aṃ","vākya","noun-adj",""
"7","marma","MARM","a@","marman","noun-adj",""
"8","āvaghaṭṭanam","AVAGHAṬṬAN","am","avaghaṭṭana","noun-adj",""
"9","/","","","","punct",""
"10","bhavaty","BHAV","aty","bhav","verb","bhū"
"11","ulka","ULK","a@","ulka","noun-adj",""
"12","āmukhaḥ","ĀMUKH","aḥ","āmukha","noun-adj",""
"13","pretaḥ","PRET","aḥ","preta","noun-adj",""
"14","su","","","su","ind",""
"15","ciraṃ","CIR","aṃ","cira","noun-adj",""
"16","tena","","","tad","pron",""
"17","karmaṇā","KARMAṆ","ā","karmaṇi","noun-adj",""
"18","//","","","","punct",""
"","</s>","","","","",""
"","<s number=""54"">","","","","",""
"1","kurute","KURUT","e","kurutā","noun-adj",""
"2","kalahaṃ","KALAH","aṃ","kalaha","noun-adj",""
"3","yas","","","yad","pron",""
"4","tu","","","tu","ind",""
"5","niṣkṛpaḥ","NIṢKṚP","aḥ","niṣkṛpa","noun-adj",""
"6","krūra","KRŪR","a@","krūra","noun-adj",""
"7","mānasaḥ","MĀNAS","aḥ","mānasa","noun-adj",""
"8","/","","","","punct",""
"9","kṛmi","KṚM","i@","kṛmi","noun-adj",""
"10","kīṭa","KĪṬ","a@","kīṭa","noun-adj",""
"11","pataṅ","PAT","aṅ","pata","noun-adj",""
"12","gādaḥ","GĀD","aḥ","gāda","noun-adj",""
"13","preto","PRET","o","preta","noun-adj",""
"14","asau","","","adas","pron",""
"15","jyotiko","JYOT","iko","jyotika","noun-adj",""
"16","bhavet","BHAV","et","bhav","verb","bhū"
"17","//","","","","punct",""
"","</s>","","","","",""
"","<s number=""55"">","","","","",""
"1","grāma","GRĀM","a@","grāma","noun-adj",""
"2","kūṭo","KŪṬ","o","kūṭa","noun-adj",""
"3","dadāty","DAD","āty","dadat","noun-adj",""
"4","eva","","","eva","ind",""
"5","yo","","","yad","pron",""
"6","dānaṃ","DĀN","aṃ","dāna","noun-adj",""
"7","pīḍa","PĪḌ","a@","pīḍā","noun-adj",""
"8","yaty","YATY","","yatya","noun-adj",""
"9","api","","","api","ind",""
"10","/","","","","punct",""
"11","kumbhāṇḍo","KUMBHĀṆḌ","o","kumbhāṇḍa","noun-adj",""
"12","vikṛta","VIKṚT","a@","vikṛta","noun-adj",""
"13","ākāraḥ","ĀKĀR","aḥ","ākāra","noun-adj",""
"14","pūjyamānaḥ","PŪJ","yamānaḥ","pūj","verb","pūj"
"15","sa","","","sa_saha","ind",""
"16","jāyate","JĀ","yate","jan","verb","jan"
"17","//","","","","punct",""
"","</s>","","","","",""
"","<s number=""56"">","","","","",""
"1","nirdayāḥ","NIRDAY","āḥ","nirdaya","noun-adj",""
"2","prāṇino","PRĀṆ","ino","prāṇin","noun-adj",""
"3","ghnanti","","","han","verb","han"
"4","bhakṣya","BHAKṢY","a@","bhakṣya","noun-adj",""
"5","ārthaṃ","ARTH","aṃ","artha","noun-adj",""
"6","ye","","","yad","pron",""
"7","dada","DAD","a@","dada","noun-adj",""
"8","ty","TY","","tya","noun-adj",""
"9","api","","","api","ind",""
"10","/","","","","punct",""
"11","bhakṣya","BHAKṢY","a@","bhakṣya","noun-adj",""
"12","bhojyāni","BHOJY","āni","bhojya","noun-adj",""
"13","te","","","tad","pron",""
"14","avaśyaṃ","AVAŚY","aṃ","avaśya","noun-adj",""
"15","labhanti","LABH","anti","labh","verb","labh"
"16","pretya","PRETY","a","pretya","noun-adj",""
"17","rākṣasāḥ","RĀKṢAS","āḥ","rākṣasa","noun-adj",""
"18","//","","","","punct",""
"","</s>","","","","",""
"","<s number=""57"">","","","","",""
"1","gandha","GANDH","a@","gandha","noun-adj",""
"2","mālā","MĀL","ā@","mālā","noun-adj",""
"3","ratā","RAT","ā","rata","noun-adj",""
"4","nityaṃ","NITY","aṃ","nitya","noun-adj",""
"5","manda","MAND","a@","manda","noun-adj",""
"6","krodhāḥ","KRODH","āḥ","krodha","noun-adj",""
"7","pradāyakāḥ","PRADĀYAK","āḥ","pradāyaka","noun-adj",""
"8","/","","","","punct",""
"9","gandharvāḥ","GANDHARV","āḥ","gandharva","noun-adj",""
"10","pretya","PRETY","a","pretya","noun-adj",""
"11","jāyante","JĀYANT","e","jāyanta","noun-adj",""
"12","devānāṃ","DEV","ānāṃ","deva","noun-adj",""
"13","rati","RAT","i@","rati","noun-adj",""
"14","hetavaḥ","HET","avaḥ","hetu","noun-adj",""
"15","//","","","","punct",""
"","</s>","","","","",""
"","<s number=""58"">","","","","",""
"1","krodhanaḥ","KRODHAN","aḥ","krodhana","noun-adj",""
"2","piśunaḥ","PIŚUN","aḥ","piśuna","noun-adj",""
"3","kaś","","","kim","pron",""
"4","cid","","","cid","ind",""
"5","artha","ARTH","a@","artha","noun-adj",""
"6","ārthaṃ","ARTH","aṃ","artha","noun-adj",""
"7","yaḥ","","","yad","pron",""
"8","prayacchati","PRAYACCH","ati","prayacch","verb",""
"9","/","","","","punct",""
"10","sa","","","sa_saha","ind",""
"11","piśācaḥ","PIŚĀC","aḥ","piśāca","noun-adj",""
"12","praduṣṭa","PRADUṢṬ","a@","praduṣṭa","noun-adj",""
"13","ātmā","ĀTM","ā","ātman","noun-adj",""
"14","jāyate","JĀ","yate","jan","verb","jan"
"15","vikṛta","VIKṚT","a@","vikṛta","noun-adj",""
"16","ānanaḥ","ĀNAN","aḥ","ānana","noun-adj",""
"17","//","","","","punct",""
"","</s>","","","","",""
"","<s number=""59"">","","","","",""
"1","nitya","NITY","a@","nitya","noun-adj",""
"2","praduṣṭāś","PRADUṢṬ","āś","praduṣṭa","noun-adj",""
"3","capalāḥ","CAPAL","āḥ","capala","noun-adj",""
"4","parapīḍa","PARAPĪḌ","a@","parapīḍa","noun-adj",""
"5","ā","","","alpha_privativum","ind",""
"6","karā","KAR","ā","kara","noun-adj",""
"7","narāḥ","NAR","āḥ","nara","noun-adj",""
"8","/","","","","punct",""
"9","saṃpradāna","SAMPRADĀN","a@","sampradāna","noun-adj",""
"10","ratā","RAT","ā","rata","noun-adj",""
"11","nityaṃ","NITY","aṃ","nitya","noun-adj",""
"12","bhūtāḥ","BHŪT","āḥ","bhūta","noun-adj",""
"13","pretya","PRETY","a","pretya","noun-adj",""
"14","bhavanti","BHAV","anti","bhav","verb","bhū"
"15","te","","","tad","pron",""
"16","//","","","","punct",""
"","</s>","","","","",""
"","<s number=""60"">","","","","",""
"1","krūrāḥ","KRŪR","āḥ","krūra","noun-adj",""
"2","kruddhāḥ","KRUDDH","āḥ","kruddha","noun-adj",""
"3","pradātāraḥ","PRADĀTĀR","aḥ","pradātāra","noun-adj",""
"4","priya","PRIY","a@","priya","noun-adj",""
"5","āsava","ĀSAV","a@","āsava","noun-adj",""
"6","surāś","SUR","āś","sura","noun-adj",""
"7","ca","","","ca","ind",""
"8","ye","","","yad","pron",""
"9","/","","","","punct",""
"10","jāyante","JĀYANT","e","jāyanta","noun-adj",""
"11","pretya","PRETY","a","pretya","noun-adj",""
"12","yakṣās","YAKṢ","ās","yakṣa","noun-adj",""
"13","te","","","tad","pron",""
"14","krūra","KRŪR","a@","krūra","noun-adj",""
"15","ātma","ĀTM","a@","ātman","noun-adj",""
"16","ā","","","alpha_privativum","ind",""
"17","nah","NAH","","naha","noun-adj",""
"18","surā","SUR","ā@","sura","noun-adj",""
"19","priyāḥ","PRIY","āḥ","priya","noun-adj",""
"20","//","","","","punct",""
"","</s>","","","","",""
"","<s number=""61"">","","","","",""
"1","mātāpitṛ","MĀTĀPIT","ṛ@","mātāpitṛ","noun-adj",""
"2","gurūn","GUR","ūn","guru","noun-adj",""
"3","yān","","","yad","pron",""
"4","air","AIR","","aira","noun-adj",""
"5","ye","","","yad","pron",""
"6","nayanti","","","","ind",""
"7","yathepsitam","YATHEPSIT","am","yathepsita","noun-adj",""
"8","/","","","","punct",""
"9","vimāna","VIMĀN","a@","vimāna","noun-adj",""
"10","cāriṇo","CĀR","iṇo","cārin","noun-adj",""
"11","yakṣā","YAKṢ","ā","yakṣa","noun-adj",""
"12","jāyante","JĀYANT","e","jāyanta","noun-adj",""
"13","te","","","tad","pron",""
"14","sukha","SUKH","a@","sukha","noun-adj",""
"15","ānvitāḥ","ANVIT","āḥ","anvita","noun-adj",""
"16","//","","","","punct",""
"","</s>","","","","",""
"","<s number=""62"">","","","","",""
"1","tṛṣṇā","TṚṢṆ","ā@","tṛṣṇā","noun-adj",""
"2","mātsarya","MĀTSARY","a@","mātsarya","noun-adj",""
"3","doṣeṇa","DOṢ","eṇa","doṣa","noun-adj",""
"4","pretya","PRETY","a","pretya","noun-adj",""
"5","pretā","PRET","ā","pretṛ","noun-adj",""
"6","bhavanty","BHAV","anty","bhav","verb","bhū"
"7","amī","","","adas","pron",""
"8","/","","","","punct",""
"9","yakṣa","YAKṢ","a@","yakṣa","noun-adj",""
"10","ādayaḥ","ĀD","ayaḥ","ādi","noun-adj",""
"11","śubhaiḥ","ŚUBH","aiḥ","śubha","noun-adj",""
"12","kliṣṭair","KLIṢṬ","air","kliṣṭa","noun-adj",""
"13","atas","","","atas","ind",""
"14","tān","","","tad","pron",""
"15","parivarjayet","PARIVARJAY","et","parivarja","verb",""
"16","//","","","","punct",""
"","</s>","","","","",""
"","<s number=""63"">","","","","",""
"1","preta","PRET","a@","preta","noun-adj",""
"2","kāṇḍaṃ","KĀṆḌ","aṃ","kāṇḍa","noun-adj",""
"3","samāptam","SAMĀPT","am","samāpta","noun-adj",""
"4","deva","DEV","a@","deva","noun-adj",""
"5","āsura","ĀSUR","a@","āsura","noun-adj",""
"6","manuṣyeṣu","MANUṢY","eṣu","manuṣya","noun-adj",""
"7","dīrgham","DĪRGH","am","dīrgha","noun-adj",""
"8","āyur","ĀY","ur","āyu","noun-adj",""
"9","a","","","alpha_privativum","ind",""
"10","hiṃsayā","HIṂS","ayā","hiṃsā","noun-adj",""
"11","/","","","","punct",""
"12","jāyate","JĀ","yate","jan","verb","jan"
"13","hiṃsay","HIṂS","ay","hiṃsā","noun-adj",""
"14","ālpa","ALP","a@","alpa","noun-adj",""
"15","āyur","ĀY","ur","āyu","noun-adj",""
"16","ato","","","atas","ind",""
"17","hiṃsāṃ","HIṂS","āṃ","hiṃsā","noun-adj",""
"18","vivarjayet","VIVARJAY","et","vivarjayat","noun-adj",""
"19","//","","","","punct",""
"","</s>","","","","",""
"","<s number=""64"">","","","","",""
"1","ku","","","","ind",""
"2","ṣṭha","ṢṬH","a@","ṣṭhā","noun-adj",""
"3","kṣaya","KṢAY","a@","kṣaya","noun-adj",""
"4","jvaron","JVAR","on","jvara","noun-adj",""
"5","mādā","MĀD","ā","māda","noun-adj",""
"6","ye","","","yad","pron",""
"7","c","","","ca","ind",""
"8","^","","","","",""
"9","ānye","ANY","e","anya","noun-adj",""
"10","vyādhayo","VYĀDH","ayo","vyādha","noun-adj",""
"11","nṛṇām","ANṚṆ","ām","anṛṇā","noun-adj",""
"12","/","","","","punct",""
"13","bhavanti","BHAV","anti","bhav","verb","bhū"
"14","kṛ","","","","ind",""
"15","tair","","","tad","pron",""
"16","bhūteṣu","BHŪT","eṣu","bhūta","noun-adj",""
"17","vadhabandhana","VADHABANDH","ana","vadhabandha","noun-adj",""
"18","tāḍanaiḥ","TĀḌAN","aiḥ","tāḍana","noun-adj",""
"19","//","","","","punct",""
"","</s>","","","","",""
"","<s number=""65"">","","","","",""
"1","yo","","","yad","pron",""
"2","hi","","","hi","ind",""
"3","hartā","HART","ā","hartṛ","noun-adj",""
"4","parasvānāṃ","PARASV","ānāṃ","parasva","noun-adj",""
"5","na","","","na","ind",""
"6","ca","","","ca","ind",""
"7","kiṃcit","","","kimcit","ind",""
"8","prayacchati","PRAYACCH","ati","prayacch","verb",""
"9","/","","","","punct",""
"10","mahat","MAHAT","","mahat","noun-adj",""
"11","^","","","","",""
"12","āpi","","","api","ind",""
"13","prayatnena","PRAYATN","ena","prayatna","noun-adj",""
"14","sa","","","sa_saha","ind",""
"15","dravyaṃ","DRAVY","aṃ","dravya","noun-adj",""
"16","n","","","na","ind",""
"17","ādhigacchati","ADHIGACCH","ati","adhigacch","verb","adhigam"
"18","//","","","","punct",""
"","</s>","","","","",""
"","<s number=""66"">","","","","",""
"1","a","","","alpha_privativum","ind",""
"2","dattaṃ","DATT","aṃ","datta","noun-adj",""
"3","vittam","VITT","am","vitta","noun-adj",""
"4","ādāya","ĀDĀ","ya","ādā","verb","ādā"
"5","dānāni","DĀN","āni","dāna","noun-adj",""
"6","ca","","","ca","ind",""
"7","dadāti","DAD","āti","dadat","noun-adj",""
"8","yaḥ","","","yad","pron",""
"9","/","","","","punct",""
"10","sa","","","sa_saha","ind",""
"11","pretya","PRETY","a","pretya","noun-adj",""
"12","dravya","DRAVY","a@","dravya","noun-adj",""
"13","vān","VĀN","","vāna","noun-adj",""
"14","bhūt","BHŪT","","bhūta","noun-adj",""
"15","vā","","","vā","ind",""
"16","bhūyo","BHŪY","o","bhūya","noun-adj",""
"17","bhavati","BHAV","ati","bhav","verb","bhū"
"18","nirdhanaḥ","NIRDHAN","aḥ","nirdhana","noun-adj",""
"19","//","","","","punct",""
"","</s>","","","","",""
"","<s number=""67"">","","","","",""
"1","yo","","","yad","pron",""
"2","na","","","na","ind",""
"3","hartā","HART","ā","hartṛ","noun-adj",""
"4","na","","","na","ind",""
"5","dātā","DĀT","ā","dātṛ","noun-adj",""
"6","ca","","","ca","ind",""
"7","na","","","na","ind",""
"8","c","","","ca","ind",""
"9","^","","","","",""
"10","āti","","","","ind",""
"11","kṛpaṇo","KṚPAṆ","o","kṛpaṇa","noun-adj",""
"12","naraḥ","NAR","aḥ","nara","noun-adj",""
"13","/","","","","punct",""
"14","kṛcchreṇa","KṚCCHR","eṇa","kṛcchra","noun-adj",""
"15","mahatā","MAHAT","ā","mahat","noun-adj",""
"16","dravyaṃ","DRAVY","aṃ","dravya","noun-adj",""
"17","sthiraṃ","STHIR","aṃ","sthira","noun-adj",""
"18","sa","","","sa_saha","ind",""
"19","labhate","LABH","ate","labh","verb","labh"
"20","dhruvam","DHRUV","am","dhruva","noun-adj",""
"21","//","","","","punct",""
"","</s>","","","","",""
"","<s number=""68"">","","","","",""
"1","yo","","","yad","pron",""
"2","na","","","na","ind",""
"3","hartā","HART","ā","hartṛ","noun-adj",""
"4","parasvānāṃ","PARASV","ānāṃ","parasva","noun-adj",""
"5","tyāga","TYĀG","a@","tyāga","noun-adj",""
"6","vān","VĀN","","vāna","noun-adj",""
"7","vīta","VĪT","a@","vīta","noun-adj",""
"8","matsaraḥ","MATSAR","aḥ","matsara","noun-adj",""
"9","/","","","","punct",""
"10","a","","","alpha_privativum","ind",""
"11","hāryaṃ","HĀRY","aṃ","hārya","noun-adj",""
"12","vipulaṃ","VIPUL","aṃ","vipula","noun-adj",""
"13","vittam","VITT","am","vitta","noun-adj",""
"14","iṣṭaṃ","IṢṬ","aṃ","iṣṭa","noun-adj",""
"15","sa","","","sa_saha","ind",""
"16","labhate","LABH","ate","labh","verb","labh"
"17","naraḥ","NAR","aḥ","nara","noun-adj",""
"18","//","","","","punct",""
"","</s>","","","","",""
"","<s number=""69"">","","","","",""
"1","āyur","ĀY","ur","āyu","noun-adj",""
"2","varṇa","VARṆ","a@","varṇa","noun-adj",""
"3","bala","BAL","a@","bala","noun-adj",""
"4","opetaḥ","UPET","aḥ","upeta","noun-adj",""
"5","śrīmān","ŚRĪM","ān","śrīmat","noun-adj",""
"6","roga","ROG","a@","roga","noun-adj",""
"7","vivarjitaḥ","VIVARJIT","aḥ","vivarjita","noun-adj",""
"8","/","","","","punct",""
"9","sukhī","SUKH","ī","sukhī","noun-adj",""
"10","ca","","","ca","ind",""
"11","sa","","","sa_saha","ind",""
"12","bhaven","BHAV","en","bhava","noun-adj",""
"13","nityaṃ","NITY","aṃ","nitya","noun-adj",""
"14","yo","","","yad","pron",""
"15","dadāti","DAD","āti","dadat","noun-adj",""
"16","iha","","","iha","ind",""
"17","bhojanam","BHOJAN","am","bhojana","noun-adj",""
"18","//","","","","punct",""
"","</s>","","","","",""
"","<s number=""70"">","","","","",""
"1","sa","","","sa_saha","ind",""
"2","lajjo","LAJJ","o","lajjā","noun-adj",""
"3","rūpa","RŪP","a@","rūpa","noun-adj",""
"4","vān","VĀN","","vāna","noun-adj",""
"5","bhogī","BHOG","ī","bhogin","noun-adj",""
"6","succhāyaḥ","SUCCHĀY","aḥ","succhāya","noun-adj",""
"7","prāṇināṃ","PRĀṆ","ināṃ","prāṇin","noun-adj",""
"8","priyaḥ","PRIY","aḥ","priya","noun-adj",""
"9","/","","","","punct",""
"10","sa","","","sa_saha","ind",""
"11","bhaved","BHAV","ed","bhav","verb","bhū"
"12","vastra","VASTR","a@","vastra","noun-adj",""
"13","lābhī","LĀBH","ī","lābhin","noun-adj",""
"14","ca","","","ca","ind",""
"15","yo","","","yad","pron",""
"16","vastrāṇi","VASTR","āṇi","vastra","noun-adj",""
"17","prayacchati","PRAYACCH","ati","prayacch","verb",""
"18","//","","","","punct",""
"","</s>","","","","",""
"","<s number=""71"">","","","","",""
"1","āvāsaṃ","ĀVĀS","aṃ","āvāsa","noun-adj",""
"2","yo","","","yad","pron",""
"3","dadāti","DAD","āti","dadat","noun-adj",""
"4","iha","","","iha","ind",""
"5","su","","","su","ind",""
"6","prasannena","PRASANN","ena","prasanna","noun-adj",""
"7","cetasā","CETAS","ā","cetas","noun-adj",""
"8","/","","","","punct",""
"9","prāsādāḥ","PRĀSĀD","āḥ","prāsāda","noun-adj",""
"10","sarva","SARV","a@","sarva","noun-adj",""
"11","kāmāś","KĀM","āś","kāma","noun-adj",""
"12","ca","","","ca","ind",""
"13","jāyante","JĀYANT","e","jāyanta","noun-adj",""
"14","tasya","","","tad","pron",""
"15","dehinaḥ","DEHIN","aḥ","dehin","noun-adj",""
"16","//","","","","punct",""
"","</s>","","","","",""
"","<s number=""72"">","","","","",""
"1","upānat","UPĀN","at","upānī","noun-adj",""
"2","saṃkrama","SAṂKRAM","a@","saṃkrama","noun-adj",""
"3","ādīni","ĀD","īni","ādi","noun-adj",""
"4","ye","","","yad","pron",""
"5","prayacchanti","PRAYACCH","anti","prayacch","verb",""
"6","mānavāḥ","MĀNAV","āḥ","mānava","noun-adj",""
"7","/","","","","punct",""
"8","bhavanti","BHAV","anti","bhav","verb","bhū"
"9","sukhino","SUKH","ino","sukhī","noun-adj",""
"10","nityaṃ","NITY","aṃ","nitya","noun-adj",""
"11","yā","","","yad","pron",""
"12","nāni","NĀN","i","nāni","noun-adj",""
"13","ca","","","ca","ind",""
"14","labhanti","LABH","anti","labh","verb","labh"
"15","te","","","tad","pron",""
"16","//","","","","punct",""
"","</s>","","","","",""
"","<s number=""73"">","","","","",""
"1","prapāku","PRAPĀK","u@","prapāka","noun-adj",""
"2","ūpataḍāga","ŪPATAḌĀG","a@","ūpataḍāga","noun-adj",""
"3","ādīn","ĀD","īn","ādi","noun-adj",""
"4","kārayitvā","KĀR","ayitvā","kār","verb","kṛ"
"5","jala","JAL","a@","jala","noun-adj",""
"6","āśrayān","ĀŚRAY","ān","āśraya","noun-adj",""
"7","/","","","","punct",""
"8","sukhi","SUKH","i@","sukhī","noun-adj",""
"9","nas","NAS","","asmat","pron",""
"10","tyakta","TYAKT","a@","tyakta","noun-adj",""
"11","saṃtāpā","SAṂTĀP","ā","saṃtāpa","noun-adj",""
"12","saṃtāpā","SAṂTĀP","ā","saṃtāpa","noun-adj",""
"13","niṣ","","","niḥ_privativum","ind",""
"14","pipāsā","PIPĀS","ā","pipāsā","noun-adj",""
"15","bhavanti","BHAV","anti","bhav","verb","bhū"
"16","te","","","tad","pron",""
"17","//","","","","punct",""
"","</s>","","","","",""
"","<s number=""74"">","","","","",""
"1","puṣpair","PUṢP","air","puṣpa","noun-adj",""
"2","abhyarcitaḥ","ABHYARCIT","aḥ","abhyarcita","noun-adj",""
"3","śrīmāñ","ŚRĪM","āñ","śrīmat","noun-adj",""
"4","charaṇyaḥ","ŚARAṆY","aḥ","śaraṇya","noun-adj",""
"5","sarvade","SARVAD","e","sarvadā","noun-adj",""
"6","hinām","HIN","ām","hinā","noun-adj",""
"7","/","","","","punct",""
"8","sadā","","","sadā","ind",""
"9","samṛddhaḥ","SAMṚDDH","aḥ","samṛddha","noun-adj",""
"10","sa","","","sa_saha","ind",""
"11","bhaved","BHAV","ed","bhav","verb","bhū"
"12","ārāmaṃ","ĀRĀM","aṃ","ārāma","noun-adj",""
"13","yaḥ","","","yad","pron",""
"14","prayacchati","PRAYACCH","ati","prayacch","verb",""
"15","//","","","","punct",""
"","</s>","","","","",""
"","<s number=""75"">","","","","",""
"1","vidya","VIDY","a@","vidyā","noun-adj",""
"2","ādānena","ĀDĀN","ena","ādāna","noun-adj",""
"3","pāṇḍityaṃ","PĀṆḌ","ityaṃ","pāṇḍa","noun-adj",""
"4","prajña","PRAJÑ","a@","prajñā","noun-adj",""
"5","ābhyāsena","ABHYĀS","ena","abhyāsa","noun-adj",""
"6","cāpyate","CĀP","yate","cāpa","noun-adj",""
"7","/","","","","punct",""
"8","bhaiṣajya","BHAIṢAJY","a@","bhaiṣajya","noun-adj",""
"9","ā","","","alpha_privativum","ind",""
"10","bhaya","BHAY","a@","bhaya","noun-adj",""
"11","dānena","DĀN","ena","dāna","noun-adj",""
"12","roga","ROG","a@","roga","noun-adj",""
"13","muktas","MUKT","as","mukta","noun-adj",""
"14","tu","","","tu","ind",""
"15","jāyate","JĀ","yate","jan","verb","jan"
"16","//","","","","punct",""
"","</s>","","","","",""
"","<s number=""76"">","","","","",""
"1","dīpa","DĪP","a@","dīpa","noun-adj",""
"2","dānena","DĀN","ena","dāna","noun-adj",""
"3","cakṣuṣ","CAKṢ","uṣ","cakṣu","noun-adj",""
"4","mān","MĀN","","māna","noun-adj",""
"5","vādya","VĀDY","a@","vādya","noun-adj",""
"6","dānena","DĀN","ena","dāna","noun-adj",""
"7","su","","","su","ind",""
"8","svaraḥ","SVAR","aḥ","svara","noun-adj",""
"9","śayanāsana","ŚAYANĀSAN","a@","śayanāsana","noun-adj",""
"10","dānena","DĀN","ena","dāna","noun-adj",""
"11","sukhī","SUKH","ī","sukhī","noun-adj",""
"12","bhavati","BHAV","ati","bhav","verb","bhū"
"13","mānavaḥ","MĀNAV","aḥ","mānava","noun-adj",""
"14","//","","","","punct",""
"","</s>","","","","",""
"","<s number=""77"">","","","","",""
"1","ga","","","","ind",""
"2","vādīn","VĀD","īn","vādin","noun-adj",""
"3","yo","","","yad","pron",""
"4","dadāti","DAD","āti","dadat","noun-adj",""
"5","iha","","","iha","ind",""
"6","bhojyaṃ","BHOJY","aṃ","bhojya","noun-adj",""
"7","kṣīra","KṢĪR","a@","kṣīra","noun-adj",""
"8","samanvitam","SAMANVIT","am","samanvita","noun-adj",""
"9","/","","","","punct",""
"10","bala","BAL","a@","bala","noun-adj",""
"11","vān","VĀN","","vāna","noun-adj",""
"12","varṇa","VARṆ","a@","varṇa","noun-adj",""
"13","vān","VĀN","","vāna","noun-adj",""
"14","bhogī","BHOG","ī","bhogin","noun-adj",""
"15","dīrgha","DĪRGH","a@","dīrgha","noun-adj",""
"16","āyuḥ","ĀYUṢ","","āyuṣa","noun-adj",""
"17","sa","","","sa_saha","ind",""
"18","bhaven","BHAV","en","bhava","noun-adj",""
"19","naraḥ","NAR","aḥ","nara","noun-adj",""
"20","//","","","","punct",""
"","</s>","","","","",""
"","<s number=""78"">","","","","",""
"1","kanya","KANY","a@","kanyā","noun-adj",""
"2","ādānena","ĀDĀN","ena","ādāna","noun-adj",""
"3","kāmānāṃ","KĀM","ānāṃ","kāma","noun-adj",""
"4","lābhī","LĀBH","ī","lābhin","noun-adj",""
"5","syāt","","","as","verb","as"
"6","parivāra","PARIVĀR","a@","parivāra","noun-adj",""
"7","vān","VĀN","","vāna","noun-adj",""
"8","/","","","","punct",""
"9","dhana","DHAN","a@","dhana","noun-adj",""
"10","dhānya","DHĀNY","a@","dhānya","noun-adj",""
"11","samṛddhas","SAMṚDDH","as","samṛddha","noun-adj",""
"12","tu","","","tu","ind",""
"13","bhūmi","BHŪM","i","bhūmi","noun-adj",""
"14","dānena","DĀN","ena","dāna","noun-adj",""
"15","jāyate","JĀ","yate","jan","verb","jan"
"16","//","","","","punct",""
"","</s>","","","","",""
"","<s number=""79"">","","","","",""
"1","pattraṃ","PATTR","aṃ","pattra","noun-adj",""
"2","puṣpaṃ","PUṢP","aṃ","puṣpa","noun-adj",""
"3","phalaṃ","PHAL","aṃ","phala","noun-adj",""
"4","toyam","TOY","am","toya","noun-adj",""
"5","abhayaṃ","ABHAY","aṃ","abhaya","noun-adj",""
"6","vacanaṃ","VACAN","aṃ","vacana","noun-adj",""
"7","priyam","PRIY","am","priya","noun-adj",""
"8","/","","","","punct",""
"9","yad","","","yadi","ind",""
"10","yad","","","yadi","ind",""
"11","ev","","","eva","ind",""
"12","epsitaṃ","EPSIT","aṃ","epsita","noun-adj",""
"13","bhaktyā","BHAKT","yā","bhakti","noun-adj",""
"14","dātavyaṃ","DĀ","tavyaṃ","dad","verb","dā"
"15","tat","","","tad","pron",""
"16","tad","","","tad","pron",""
"17","arthinaḥ","ARTH","inaḥ","arthin","noun-adj",""
"18","//","","","","punct",""
"","</s>","","","","",""
"","<s number=""80"">","","","","",""
"1","kleśayitvā","KLEŚ","ayitvā","kleś","verb",""
"2","dadāti","DAD","āti","dadat","noun-adj",""
"3","iha","","","iha","ind",""
"4","svarga","SVARG","a@","svarga","noun-adj",""
"5","ārthaṃ","ARTH","aṃ","artha","noun-adj",""
"6","vā","","","vā","ind",""
"7","bhayena","BHAY","ena","bhaya","noun-adj",""
"8","vā","","","vā","ind",""
"9","/","","","","punct",""
"10","yaśaḥ","YAŚ","aḥ","yaśa","noun-adj",""
"11","saukhya","SAUKHY","a@","saukhya","noun-adj",""
"12","ābhilāṣād","ABHILĀṢ","ād","abhilāṣa","noun-adj",""
"13","vā","","","vā","ind",""
"14","kliṣṭaṃ","KLIṢṬ","aṃ","kliṣṭa","noun-adj",""
"15","sa","","","sa_saha","ind",""
"16","labhate","LABH","ate","labh","verb","labh"
"17","phalam","PHAL","am","phala","noun-adj",""
"18","//","","","","punct",""
"","</s>","","","","",""
"","<s number=""81"">","","","","",""
"1","svaka","SVAK","a@","svaka","noun-adj",""
"2","ārtha","ARTH","a@","artha","noun-adj",""
"3","nirapekṣeṇa","NIRAPEKṢ","eṇa","nirapekṣa","noun-adj",""
"4","kṛpa","KṚP","a@","kṛpā","noun-adj",""
"5","āviṣṭena","ĀVIṢṬ","ena","āviṣṭa","noun-adj",""
"6","cetasā","CETAS","ā","cetas","noun-adj",""
"7","/","","","","punct",""
"8","parārthaṃ","PARĀRTH","aṃ","parārtha","noun-adj",""
"9","yo","","","yad","pron",""
"10","dadāti","DAD","āti","dadat","noun-adj",""
"11","iha","","","iha","ind",""
"12","so","","","tad","pron",""
"13","a","","","alpha_privativum","ind",""
"14","kliṣṭaṃ","KLIṢṬ","aṃ","kliṣṭa","noun-adj",""
"15","phalam","PHAL","am","phala","noun-adj",""
"16","aśnute","AŚNUT","e","aśnute","noun-adj",""
"17","//","","","","punct",""
"","</s>","","","","",""
"","<s number=""82"">","","","","",""
"1","yat","","","yad","pron",""
"2","kiṃcid","","","kimcit","ind",""
"3","dīyate","DĪ","yate","dad","verb","dā"
"4","anyasmai","ANY","asmai","anya","noun-adj",""
"5","yathākālaṃ","YATHĀKĀL","aṃ","yathākāla","noun-adj",""
"6","yathā","","","yathā","ind",""
"7","vidhi","VIDH","i","vidhi","noun-adj",""
"8","/","","","","punct",""
"9","tena","","","tad","pron",""
"10","tena","","","tad","pron",""
"11","prakāreṇa","PRAKĀR","eṇa","prakāra","noun-adj",""
"12","tat","","","tad","pron",""
"13","sarvam","SARV","am","sarva","noun-adj",""
"14","upatiṣṭhate","UPATIṢṬH","ate","upatiṣṭh","verb","upasthā"
"15","//","","","","punct",""
"","</s>","","","","",""
"","<s number=""83"">","","","","",""
"1","parān","PAR","ān","para","noun-adj",""
"2","anupahaty","ANUPAHAT","y","anupahata","noun-adj",""
"3","^","","","","",""
"4","aiva","","","eva","ind",""
"5","yathākālaṃ","YATHĀKĀL","aṃ","yathākāla","noun-adj",""
"6","yathepsitam","YATHEPSIT","am","yathepsita","noun-adj",""
"7","/","","","","punct",""
"8","a","","","alpha_privativum","ind",""
"9","kleśayitvā","KLEŚ","ayitvā","kleś","verb",""
"10","dātavyaṃ","DĀ","tavyaṃ","dad","verb","dā"
"11","hitaṃ","HIT","aṃ","hita","noun-adj",""
"12","dharma","DHARM","a@","dharma","noun-adj",""
"13","ā","","","alpha_privativum","ind",""
"14","virodhi","VIRODH","i","virodhi","noun-adj",""
"15","yat","","","yad","pron",""
"16","//","","","","punct",""
"","</s>","","","","",""
"","<s number=""84"">","","","","",""
"1","evaṃ","","","eva","ind",""
"2","hi","","","hi","ind",""
"3","dīyamānasya","DĪ","yamānasya","dad","verb","dā"
"4","dānasy","DĀN","asy","dāna","noun-adj",""
"5","^","","","","",""
"6","aiva","","","eva","ind",""
"7","phala","PHAL","a@","phala","noun-adj",""
"8","odayaḥ","UDAY","aḥ","udaya","noun-adj",""
"9","/","","","","punct",""
"10","dānaṃ","DĀN","aṃ","dāna","noun-adj",""
"11","hi","","","hi","ind",""
"12","sarva","SARV","a@","sarva","noun-adj",""
"13","saukhyānām","SAUKHYĀN","ām","saukhyānā","noun-adj",""
"14","an","","","alpha_privativum","ind",""
"15","anyat","ANY","at","anyat","noun-adj",""
"16","kāraṇaṃ","KĀRAṆ","aṃ","kāraṇa","noun-adj",""
"17","ma","","","","ind",""
"18","tam","TAM","","tad","pron",""
"19","//","","","","punct",""
"","</s>","","","","",""
"","<s number=""85"">","","","","",""
"1","virataḥ","VIRAT","aḥ","virata","noun-adj",""
"2","paradārebhyo","PARADĀR","ebhyo","paradāra","noun-adj",""
"3","dārān","DĀR","ān","dāra","noun-adj",""
"4","iṣṭān","IṢṬ","ān","iṣṭa","noun-adj",""
"5","avāpnu","AVĀPN","u@","avāpn","verb",""
"6","yāt","YĀT","","yāta","noun-adj",""
"7","/","","","","punct",""
"8","svebhyo","","","","ind",""
"9","apy","","","api","ind",""
"10","a","","","alpha_privativum","ind",""
"11","deśak","DEŚ","ak@","deśaka","noun-adj",""
"12","ālau","ĀLA","u","ālau","noun-adj",""
"13","ca","","","ca","ind",""
"14","varjayan","VARJ","ayan","varja","noun-adj",""
"15","puṃstvam","PUṂSTV","am","puṃstva","noun-adj",""
"16","ṛcchati","ṚCCH","ati","ṛcch","verb",""
"17","//","","","","punct",""
"","</s>","","","","",""
"","<s number=""86"">","","","","",""
"1","paradāreṣu","PARADĀR","eṣu","paradāra","noun-adj",""
"2","saṃsaktaṃ","SAṂSAKT","aṃ","saṃsakta","noun-adj",""
"3","cittaṃ","CITT","aṃ","citta","noun-adj",""
"4","yo","","","yad","pron",""
"5","na","","","na","ind",""
"6","niyacchati","NIYACCH","ati","niyacch","verb",""
"7","/","","","","punct",""
"8","a","","","alpha_privativum","ind",""
"9","naṅgeṣu","NAṄG","eṣu","naṅga","noun-adj",""
"10","ca","","","ca","ind",""
"11","rajyeta","RAJ","yeta","raj","verb","raj"
"11","rajyeta","RAJ","yeta","rañj","verb","rañj"
"12","sa","","","sa_saha","ind",""
"13","pumān","PUM","ān","puma","noun-adj",""
"14","strītvam","STRĪTV","am","strītva","noun-adj",""
"15","ṛcchati","ṚCCH","ati","ṛcch","verb",""
"16","//","","","","punct",""
"","</s>","","","","",""
"","<s number=""87"">","","","","",""
"1","strītvaṃ","STRĪTV","aṃ","strītva","noun-adj",""
"2","jugupsate","JUGUPS","ate","jugupsat","noun-adj",""
"3","yā","","","yad","pron",""
"4","tu","","","tu","ind",""
"5","su","","","su","ind",""
"6","śilā","ŚIL","ā","śilā","noun-adj",""
"7","manda","MAND","a@","manda","noun-adj",""
"8","rāgiṇī","RĀGIṆ","ī","rāgiṇī","noun-adj",""
"9","/","","","","punct",""
"10","puṃstvam","PUṂSTV","am","puṃstva","noun-adj",""
"11","ākāṅkṣate","ĀKĀṄKṢ","ate","ākāṅkṣ","verb","ākāṅkṣ"
"12","nityaṃ","NITY","aṃ","nitya","noun-adj",""
"13","sā","","","tad","pron",""
"14","nārī","NĀR","ī","nārī","noun-adj",""
"15","naratāṃ","NARAT","āṃ","naratā","noun-adj",""
"16","vrajet","VRAJ","et","vraj","verb",""
"17","//","","","","punct",""
"","</s>","","","","",""
"","<s number=""88"">","","","","",""
"1","yas","","","yad","pron",""
"2","tu","","","tu","ind",""
"3","samyaṅ","SAMYA","ṅ","samyak","noun-adj",""
"4","nir","NIR","","niḥ_privativum","ind",""
"5","ātaṅkaṃ","ĀTAṄK","aṃ","ātaṅka","noun-adj",""
"6","brahmacaryaṃ","BRAHMACARY","aṃ","brahmacarya","noun-adj",""
"7","niṣevate","NIṢEV","ate","niṣe","verb","niṣi"
"8","/","","","","punct",""
"9","te","","","tad","pron",""
"10","jasvī","JASV","ī","jasvan","noun-adj",""
"11","sad","SAD","@","sat","noun-adj",""
"12","guṇaḥ","GUṆ","aḥ","guṇa","noun-adj",""
"13","śrīmān","ŚRĪM","ān","śrīmat","noun-adj",""
"14","devair","DEV","air","deva","noun-adj",""
"15","api","","","api","ind",""
"16","sa","","","sa_saha","ind",""
"17","pūjyate","PŪJ","yate","pūj","verb","pūj"
"18","//","","","","punct",""
"","</s>","","","","",""
"","<s number=""89"">","","","","",""
"1","dṛḍha","DṚḌH","a@","dṛḍha","noun-adj",""
"2","smṛtir","SMṚT","ir","smṛti","noun-adj",""
"3","asaṃmūḍho","ASAṂMŪḌH","o","asaṃmūḍha","noun-adj",""
"4","madyapāna","MADYAPĀN","a@","madyapāna","noun-adj",""
"5","ā","","","alpha_privativum","ind",""
"6","niṣevaṇāt","NIṢEVAṆ","āt","niṣevaṇa","noun-adj",""
"7","/","","","","punct",""
"8","jāyate","JĀ","yate","jan","verb","jan"
"9","satya","SATY","a@","satya","noun-adj",""
"10","vādī","VĀD","ī","vādin","noun-adj",""
"11","ca","","","ca","ind",""
"12","yaśaḥ","YAŚ","aḥ","yaśa","noun-adj",""
"13","saukhya","SAUKHY","a@","saukhya","noun-adj",""
"14","ānvitaḥ","ANVIT","aḥ","anvita","noun-adj",""
"15","pumān","PUM","ān","puma","noun-adj",""
"16","//","","","","punct",""
"","</s>","","","","",""
"","<s number=""90"">","","","","",""
"1","bhinnānām","BHINN","ānām","bhinna","noun-adj",""
"2","api","","","api","ind",""
"3","sattvānāṃ","SATTV","ānāṃ","sattva","noun-adj",""
"4","bhedaṃ","BHED","aṃ","bheda","noun-adj",""
"5","n","","","na","ind",""
"6","^","","","","",""
"7","aiva","","","eva","ind",""
"8","karoti","KAR","oti","kar","verb","kṛ"
"9","yaḥ","","","yad","pron",""
"10","/","","","","punct",""
"11","a","","","alpha_privativum","ind",""
"12","bhedya","BHEDY","a@","bhedya","noun-adj",""
"13","parivāro","PARIVĀR","o","parivāra","noun-adj",""
"14","asau","","","adas","pron",""
"15","jāyate","JĀ","yate","jan","verb","jan"
"16","sthira","STHIR","a@","sthira","noun-adj",""
"17","mānasaḥ","MĀNAS","aḥ","mānasa","noun-adj",""
"18","//","","","","punct",""
"","</s>","","","","",""
"","<s number=""91"">","","","","",""
"1","yas","","","yad","pron",""
"2","tv","","","tu","ind",""
"3","ājñāṃ","ĀJÑ","āṃ","ājñā","noun-adj",""
"4","kurute","KURUT","e","kurutā","noun-adj",""
"5","nityaṃ","NITY","aṃ","nitya","noun-adj",""
"6","gurūṇāṃ","GUR","ūṇāṃ","guru","noun-adj",""
"7","hṛṣṭa","HṚṢṬ","a@","hṛṣṭa","noun-adj",""
"8","mānasaḥ","MĀNAS","aḥ","mānasa","noun-adj",""
"9","/","","","","punct",""
"10","hitā","HIT","ā@","hita","noun-adj",""
"11","hita","HIT","a@","hita","noun-adj",""
"12","ābhidhāyī","ABHIDHĀY","ī","abhidhāyin","noun-adj",""
"13","ca","","","ca","ind",""
"14","sa","","","sa_saha","ind",""
"15","syād","","","as","verb","as"
"16","ādeya","ĀDEY","a@","ādeya","noun-adj",""
"17","vāṅ","VĀṄ","","vāk","noun-adj",""
"18","naraḥ","NAR","aḥ","nara","noun-adj",""
"19","//","","","","punct",""
"","</s>","","","","",""
"","<s number=""92"">","","","","",""
"1","nīcāḥ","NĪC","āḥ","nīca","noun-adj",""
"2","pa","","","","ind",""
"3","rāva","RĀV","a@","rāva","noun-adj",""
"4","mānena","MĀN","ena","māna","noun-adj",""
"5","viparyāsena","VIPARYĀS","ena","viparyāsa","noun-adj",""
"6","c","","","ca","ind",""
"7","^","","","","",""
"8","odgatāḥ","UDGAT","āḥ","udgata","noun-adj",""
"9","/","","","","punct",""
"10","bhavanti","BHAV","anti","bhav","verb","bhū"
"11","sukhinaḥ","SUKH","inaḥ","sukhī","noun-adj",""
"12","saukhyaṃ","SAUKHY","aṃ","saukhya","noun-adj",""
"13","duḥkhaṃ","DUḤKH","aṃ","duḥkha","noun-adj",""
"14","dattvā","DATTV","ā","dattvā","noun-adj",""
"15","ca","","","ca","ind",""
"16","duḥkhinaḥ","DUḤKH","inaḥ","duḥkhin","noun-adj",""
"17","//","","","","punct",""
"","</s>","","","","",""
"","<s number=""93"">","","","","",""
"1","para","PAR","a@","para","noun-adj",""
"2","prapañca","PRAPAÑC","a@","prapañca","noun-adj",""
"3","ābhiratāḥ","ABHIRAT","āḥ","abhirata","noun-adj",""
"4","śaṭhāś","ŚAṬH","āś","śaṭha","noun-adj",""
"5","c","","","ca","ind",""
"6","^","","","","",""
"7","ānṛta","ANṚT","a@","anṛta","noun-adj",""
"8","vādinaḥ","VĀDIN","aḥ","vādin","noun-adj",""
"9","/","","","","punct",""
"10","kubjav","KUBJ","av","kubja","noun-adj",""
"11","āmanatāṃ","ĀMAN","atāṃ","āmanatā","noun-adj",""
"12","yānti","","","","ind",""
"13","ye","","","yad","pron",""
"14","ca","","","ca","ind",""
"15","rūpa","RŪP","a@","rūpa","noun-adj",""
"16","ābhimāninaḥ","ABHIMĀN","inaḥ","abhimānin","noun-adj",""
"17","jaḍo","JAḌ","o","jaḍa","noun-adj",""
"18","vijñāna","VIJÑĀN","a@","vijñāna","noun-adj",""
"19","mātsaryād","MĀTSARY","ād","mātsarya","noun-adj",""
"20","bhaven","BHAV","en","bhava","noun-adj",""
"21","mūkaḥ","MŪK","aḥ","mūka","noun-adj",""
"22","priya","PRIY","a@","priya","noun-adj",""
"23","ā","","","alpha_privativum","ind",""
"24","priyaḥ","PRIY","aḥ","priya","noun-adj",""
"25","/","","","","punct",""
"26","bādhiryaṃ","BĀDHIRY","aṃ","bādhirya","noun-adj",""
"27","yāti","","","","ind",""
"28","mūḍha","MŪḌH","a@","mūḍha","noun-adj",""
"29","ātmā","ĀTM","ā","ātman","noun-adj",""
"30","hita","HIT","a@","hita","noun-adj",""
"31","vāk","VĀK","","vāk","noun-adj",""
"32","y","","","","ind",""
"33","ābhyasūyakaḥ","ABHYASŪY","akaḥ","abhyasūyaka","noun-adj",""
"34","//","","","","punct",""
"","</s>","","","","",""
"","<s number=""94"">","","","","",""
"1","duḥkhaṃ","DUḤKH","aṃ","duḥkha","noun-adj",""
"2","pāpasya","PĀP","asya","pāpa","noun-adj",""
"3","puṇyasya","PUṆY","asya","puṇya","noun-adj",""
"4","sukhaṃ","SUKH","aṃ","sukha","noun-adj",""
"5","miśrasya","MIŚR","asya","miśra","noun-adj",""
"6","miśritam","MIŚR","itam","miśra","noun-adj",""
"7","/","","","","punct",""
"8","sarvaṃ","SARV","aṃ","sarva","noun-adj",""
"9","s","","","su","ind",""
"10","ādṛśya","ADṚŚY","a@","adṛśya","noun-adj",""
"11","nisyandam","NISYAND","am","nisyanda","noun-adj",""
"12","abhyu","ABHY","u@","abhyu","noun-adj",""
"13","ūhyaṃ","ŪHY","aṃ","ūhya","noun-adj",""
"14","karmaṇaḥ","KARMAṆ","aḥ","karmaṇi","noun-adj",""
"15","phalam","PHAL","am","phala","noun-adj",""
"16","//","","","","punct",""
"","</s>","","","","",""
"","<s number=""95"">","","","","",""
"1","manuṣya","MANUṢY","a@","manuṣya","noun-adj",""
"2","kāṇḍaṃ","KĀṆḌ","aṃ","kāṇḍa","noun-adj",""
"3","samāptam","SAMĀPT","am","samāpta","noun-adj",""
"4","//","","","","punct",""
"","</s>","","","","",""
"","<s number=""96"">","","","","",""
"1","śāṭhyena","ŚĀṬHY","ena","śāṭhya","noun-adj",""
"2","māyayā","MĀY","ayā","māyā","noun-adj",""
"3","nityaṃ","NITY","aṃ","nitya","noun-adj",""
"4","caraty","CALAT","y","calati","noun-adj",""
"5","a","","","alpha_privativum","ind",""
"6","kṛta","KṚT","a@","kṛta","noun-adj",""
"7","kilbiṣaḥ","KILBIṢ","aḥ","kilbiṣa","noun-adj",""
"8","/","","","","punct",""
"9","kali","KAL","i@","kali","noun-adj",""
"10","priyaḥ","PRIY","aḥ","priya","noun-adj",""
"11","pradātā","PRADĀT","ā","pradātṛ","noun-adj",""
"12","ca","","","ca","ind",""
"13","sa","","","sa_saha","ind",""
"14","bhaved","BHAV","ed","bhav","verb","bhū"
"15","asura","ASUR","a@","asura","noun-adj",""
"16","eśvaraḥ","EŚVAR","aḥ","eśvara","noun-adj",""
"17","//","","","","punct",""
"","</s>","","","","",""
"","<s number=""97"">","","","","",""
"1","asura","ASUR","a@","asura","noun-adj",""
"2","kāṇḍaṃ","KĀṆḌ","aṃ","kāṇḍa","noun-adj",""
"3","samāptam","SAMĀPT","am","samāpta","noun-adj",""
"4","//","","","","punct",""
"","</s>","","","","",""
"","<s number=""98"">","","","","",""
"1","n","","","na","ind",""
"2","ātmanā","ĀTM","anā","ātman","noun-adj",""
"3","yaḥ","","","yad","pron",""
"4","sukha","SUKH","a@","sukha","noun-adj",""
"5","ākāṅkṣī","ĀKĀṄKṢ","ī","ākāṅkṣin","noun-adj",""
"6","na","","","na","ind",""
"7","ca","","","ca","ind",""
"8","hṛṣyet","HṚṢY","et","hṛṣ","verb",""
"9","parigrahaiḥ","PARIGRAH","aiḥ","parigraha","noun-adj",""
"10","/","","","","punct",""
"11","grahāṇām","GRAH","āṇām","graha","noun-adj",""
"12","agraṇīś","AGRAṆ","īś","agraṇī","noun-adj",""
"13","c","","","ca","ind",""
"14","^","","","","",""
"15","mahārāji","MAHĀRĀJ","i@","mahārāji","noun-adj",""
"16","katāṃ","KAT","āṃ","katā","noun-adj",""
"17","vrajet","VRAJ","et","vraj","verb",""
"18","//","","","","punct",""
"","</s>","","","","",""
"","<s number=""99"">","","","","",""
"1","mātāpitṛ","MĀTĀPIT","ṛ@","mātāpitṛ","noun-adj",""
"2","kulay","KUL","ay","kulā","noun-adj",""
"3","eṣṭha","EṢṬH","a@","eṣṭha","noun-adj",""
"4","pūja","PŪJ","a@","pūjā","noun-adj",""
"5","kas","KAS","","kim","pron",""
"6","tyāga","TYĀG","a@","tyāga","noun-adj",""
"7","vān","VĀN","","vāna","noun-adj",""
"8","kṣamī","KṢAM","ī","kṣamin","noun-adj",""
"9","/","","","","punct",""
"10","hṛṣyate","HṚṢ","yate","hṛṣ","verb",""
"11","yo","","","yad","pron",""
"12","na","","","na","ind",""
"13","kalahais","KALAH","ais","kalaha","noun-adj",""
"14","tri","TR","i@","tri","noun-adj",""
"15","daśeṣu","DAŚ","eṣu","daś","verb",""
"16","sa","","","sa_saha","ind",""
"17","jāyate","JĀ","yate","jan","verb","jan"
"18","//","","","","punct",""
"","</s>","","","","",""
"","<s number=""100"">","","","","",""
"1","na","","","na","ind",""
"2","vigrahe","VIGRAH","e","vigraha","noun-adj",""
"3","ratān","RAT","ān","rata","noun-adj",""
"4","^","","","","",""
"5","aiva","","","eva","ind",""
"6","kalahe","KALAH","e","kalaha","noun-adj",""
"7","hṛṣṭa","HṚṢṬ","a@","hṛṣṭa","noun-adj",""
"8","mānasāḥ","MĀNAS","āḥ","mānasa","noun-adj",""
"9","/","","","","punct",""
"10","ekānta","EKĀNT","a@","ekānta","noun-adj",""
"11","kuśalod","KUŚAL","od","kuśala","noun-adj",""
"12","yuktā","YUKT","ā","yukta","noun-adj",""
"13","ye","","","yad","pron",""
"14","ca","","","ca","ind",""
"15","yāma","YĀM","a@","yāma","noun-adj",""
"16","opagās","UPAG","ās","upaga","noun-adj",""
"17","tu","","","tu","ind",""
"18","te","","","tad","pron",""
"19","//","","","","punct",""
"","</s>","","","","",""
"","<s number=""101"">","","","","",""
"1","bahuśrutā","BAHUŚRUT","ā","bahuśruta","noun-adj",""
"2","dharmadharāḥ","DHARMADHAR","āḥ","dharmadhara","noun-adj",""
"3","su","","","su","ind",""
"4","prajñā","PRAJÑ","ā","prajñā","noun-adj",""
"5","mokṣa","MOKṢ","a@","mokṣa","noun-adj",""
"6","kāṅkṣiṇaḥ","KĀṄKṢ","iṇaḥ","kāṅkṣin","noun-adj",""
"7","/","","","","punct",""
"8","guṇair","GUṆ","air","guṇa","noun-adj",""
"9","ye","","","yad","pron",""
"10","parihṛṣṇāś","PARIH","ṛṣṇāś","parihṛ","noun-adj",""
"11","ca","","","ca","ind",""
"12","narās","NAR","ās","nara","noun-adj",""
"13","te","","","tad","pron",""
"14","tuṣita","TUṢIT","a@","tuṣita","noun-adj",""
"15","opagāḥ","UPAG","āḥ","upaga","noun-adj",""
"16","//","","","","punct",""
"","</s>","","","","",""
"","<s number=""102"">","","","","",""
"1","śīla","ŚĪL","a@","śīla","noun-adj",""
"2","pradāna","PRADĀN","a@","pradāna","noun-adj",""
"3","vinaye","VINAY","e","vinaya","noun-adj",""
"4","pravṛttā","PRAVṚTT","ā","pravṛttā","noun-adj",""
"5","ye","","","yad","pron",""
"6","svayaṃ","SVAY","aṃ","svaya","noun-adj",""
"7","narāḥ","NAR","āḥ","nara","noun-adj",""
"8","/","","","","punct",""
"9","mahot","MAH","ot","mahat","noun-adj",""
"10","sāhāś","SĀH","āś","sāha","noun-adj",""
"11","ca","","","ca","ind",""
"12","te","","","tad","pron",""
"13","avaśyaṃ","AVAŚY","aṃ","avaśya","noun-adj",""
"14","nirmāṇarati","NIRMĀṆARAT","i@","nirmāṇarata","noun-adj",""
"15","gāminaḥ","GĀM","inaḥ","gāmin","noun-adj",""
"16","//","","","","punct",""
"","</s>","","","","",""
"","<s number=""103"">","","","","",""
"1","a","","","alpha_privativum","ind",""
"2","dīna","DĪN","a@","dīna","noun-adj",""
"3","sattvā","SATTV","ā","sattva","noun-adj",""
"4","ye","","","yad","pron",""
"5","śreṣṭhāḥ","ŚREṢṬH","āḥ","śreṣṭha","noun-adj",""
"6","pradāna","PRADĀN","a@","pradāna","noun-adj",""
"7","dama","DAM","a@","dama","noun-adj",""
"8","saṃyamaiḥ","SAṂYAM","aiḥ","saṃyama","noun-adj",""
"9","/","","","","punct",""
"10","guṇā","GUṆ","ā@","guṇa","noun-adj",""
"11","dhikāś","DHIK","āś","dhikṣ","noun-adj",""
"12","ca","","","ca","ind",""
"13","ye","","","yad","pron",""
"14","yānti","","","","ind",""
"15","para","PAR","a@","para","noun-adj",""
"16","nirmitatāṃ","NIRMIT","atāṃ","nirmitatā","noun-adj",""
"17","dhruvam","DHRUV","am","dhruva","noun-adj",""
"18","//","","","","punct",""
"","</s>","","","","",""
"","<s number=""104"">","","","","",""
"1","śīlena","ŚĪL","ena","śīla","noun-adj",""
"2","svargam","SVARG","am","svarga","noun-adj",""
"3","āpnoti","APN","oti","apnas","noun-adj",""
"4","dhyānena","DHYĀN","ena","dhyāna","noun-adj",""
"5","ca","","","ca","ind",""
"6","viśeṣataḥ","VIŚEṢ","ataḥ","viśeṣa","noun-adj",""
"7","/","","","","punct",""
"8","yathābhūta","YATHĀBHŪT","a@","yathābhūta","noun-adj",""
"9","parijñānāt","PARIJÑĀN","āt","parijñāna","noun-adj",""
"10","paryante","PAR","yante","para","noun-adj",""
"11","c","","","ca","ind",""
"12","^","","","","",""
"13","ā","","","alpha_privativum","ind",""
"14","punarbhavaḥ","PUNARBHAV","aḥ","punarbhava","noun-adj",""
"15","//","","","","punct",""
"","</s>","","","","",""
"","<s number=""105"">","","","","",""
"1","śubhāśubha","ŚUBHĀŚUBH","a@","śubhāśubha","noun-adj",""
"2","phalaṃ","PHAL","aṃ","phala","noun-adj",""
"3","karma","KARM","a","karman","noun-adj",""
"4","yad","","","yadi","ind",""
"5","etat","","","tad","pron",""
"6","kathitaṃ","KATHIT","aṃ","kathita","noun-adj",""
"7","sphuṭam","SPHUṬ","am","sphuṭa","noun-adj",""
"8","/","","","","punct",""
"9","śubhena","ŚUBH","ena","śubha","noun-adj",""
"10","labhyate","LABH","yate","labh","verb","labh"
"11","saukhyaṃ","SAUKHY","aṃ","saukhya","noun-adj",""
"12","duḥkhaṃ","DUḤKH","aṃ","duḥkha","noun-adj",""
"13","tv","","","tu","ind",""
"14","a","","","alpha_privativum","ind",""
"15","śubha","ŚUBH","a@","śubha","noun-adj",""
"16","saṃbhavam","SAṂBHAV","am","saṃbhava","noun-adj",""
"17","//","","","","punct",""
"","</s>","","","","",""
"","<s number=""106"">","","","","",""
"1","mṛtyur","MṚTY","ur","mṛtyu","noun-adj",""
"2","vyādhir","VYĀDH","ir","vyādhi","noun-adj",""
"3","jarā","JAR","ā","jarā","noun-adj",""
"4","c","","","ca","ind",""
"5","^","","","","",""
"6","aiva","","","eva","ind",""
"7","cintan","CINT","an","cintat","noun-adj",""
"8","īyam","ĪYAM","","idam","pron",""
"9","idaṃ","","","idam","pron",""
"10","trayam","TRAY","am","tri","noun-adj",""
"11","/","","","","punct",""
"12","viprayogaḥ","VIPRAYOG","aḥ","viprayoga","noun-adj",""
"13","priyaiḥ","PRIY","aiḥ","priya","noun-adj",""
"14","sārdhaṃ","SĀRDH","aṃ","sārdha","noun-adj",""
"15","karmaṇāṃ","KARMAṆ","āṃ","karmaṇi","noun-adj",""
"16","ca","","","ca","ind",""
"17","svakaṃ","SVAK","aṃ","svaka","noun-adj",""
"18","phalam","PHAL","am","phala","noun-adj",""
"19","//","","","","punct",""
"","</s>","","","","",""
"","<s number=""107"">","","","","",""
"1","evaṃ","","","eva","ind",""
"2","virāgam","VIRĀG","am","virāga","noun-adj",""
"3","āpnoti","APN","oti","apnas","noun-adj",""
"4","viraktaḥ","VIRAKT","aḥ","virakta","noun-adj",""
"5","puṇyam","PUṆY","am","puṇya","noun-adj",""
"6","ṛcchati","ṚCCH","ati","ṛcch","verb",""
"7","/","","","","punct",""
"8","pāpaṃ","PĀP","aṃ","pāpa","noun-adj",""
"9","ca","","","ca","ind",""
"10","varjaya","VARJAY","a@","varjayati","noun-adj",""
"11","ty","TY","","tya","noun-adj",""
"12","evaṃ","","","eva","ind",""
"13","tac","","","tad","pron",""
"14","ca","","","ca","ind",""
"15","saṃkṣepataḥ","SAṂKṢEP","ataḥ","saṃkṣepa","noun-adj",""
"16","śṛṇu","ŚṚṆ","u","śṛṇ","verb","śru"
"17","//","","","","punct",""
"","</s>","","","","",""
"","<s number=""108"">","","","","",""
"1","samyaka","SAMYAK","a@","samyaka","noun-adj",""
"2","parārtha","PARĀRTH","a@","parārtha","noun-adj",""
"3","karaṇaṃ","KARAṆ","aṃ","karaṇa","noun-adj",""
"4","parān","PAR","ān","para","noun-adj",""
"5","artha","ARTH","a@","artha","noun-adj",""
"6","vivarjanam","VIVARJAN","am","vivarjana","noun-adj",""
"7","/","","","","punct",""
"8","puṇyaṃ","PUṆY","aṃ","puṇya","noun-adj",""
"9","viparyayāt","VIPARYAY","āt","viparyaya","noun-adj",""
"10","pāpam","PĀP","am","pāpa","noun-adj",""
"11","uktam","UKT","am","ukta","noun-adj",""
"12","etad","","","tad","pron",""
"13","maha","MAH","a@","mahat","noun-adj",""
"14","ātmanā","ĀTM","anā","ātman","noun-adj",""
"15","//","","","","punct",""
"","</s>","","","","",""
"","<s number=""109"">","","","","",""
"1","devaka","DEVAK","a@","devaka","noun-adj",""
"2","āṇḍaṃ","ĀṆḌ","aṃ","āṇḍa","noun-adj",""
"3","samāptam","SAMĀPT","am","samāpta","noun-adj",""
"4","//","","","","punct",""
"","</s>","","","","",""
"","<s number=""110"">","","","","",""
"1","ārya","ĀRY","a@","ārya","noun-adj",""
"2","saddharma","SADDHARM","a@","saddharma","noun-adj",""
"3","smṛty","SMṚT","y@","smṛti","noun-adj",""
"4","upasat","UPAS","at","upasat","noun-adj",""
"5","hāna","HĀN","a@","hāna","noun-adj",""
"6","mahāyānasūtra","MAHĀYĀNASŪTR","a@","mahāyānasūtra","noun-adj",""
"7","āntāt","ANT","āt","anta","noun-adj",""
"8","samā","SAM","ā@","samā","noun-adj",""
"9","kṛṣṭā","KṚṢṬ","ā","kṛṣṭa","noun-adj",""
"10","mahā","MAH","ā@","mahat","noun-adj",""
"11","paṇḍita","PAṆḌIT","a@","paṇḍita","noun-adj",""
"12","āśva","ĀŚV","a@","āśva","noun-adj",""
"13","ghoṣena","GHOṢ","ena","ghoṣa","noun-adj",""
"14","ṣaḍgati","ṢAḌGAT","i@","ṣaḍgata","noun-adj",""
"15","kārikāḥ","KĀRIK","āḥ","kārikā","noun-adj",""
"16","samāptāḥ","SAMĀPT","āḥ","samāpta","noun-adj",""
"17","//","","","","punct",""
"","</s>","","","","",""
"","</page>","","","","",""
"","</doc>","","","","",""
