"WordID","word","NormSTEM","suffix","lemma","PoS","Root"
"","<doc textid = ""dharmadhatustava"" genre = ""śāstra"" title = ""dharmadhātustava"" author = ""n/a"" discourse = ""tantra"" tradition = ""tantra"" period = ""commentarial"" source = ""dsbc accessed aug 2021"" date_range = ""before or in 8. ce"" notes = ""traditional author ascription: nāgārjuna. manuscript of the skt. text found at the potala. ms is dated to the 11. century ce; see liu zhen. on the sanskrit version of dharmadhātustava; p. 2; for dating cf. p. 10."" religion = ""buddh"" edition = ""based on the ed. by liu zhen. 2015. dharmadhātustava. china tibetology publishing house. bejing & hamburg"" digitization = ""miroj shakya"" segmentation_lemmatization = ""ligeia lugli & buddhist translators workbench team"" metadata_enrichment = ""bruno galasek-hul & buddhist translators workbench team"" proofreader = ""n/a"" permission = """" reconstructions = ""none"">","","","","",""
"","<page number=""0000"">","","","","",""
"","<s number=""1"">","","","","",""
"1","dharmadhātu","DHARMADHĀT","u@","dharmadhātu","noun-adj",""
"2","stava","STAV","a","stava","noun-adj",""
"","</s>","","","","",""
"","<s number=""2"">","","","","",""
"1","dharmadhāto","DHARMADHĀT","o","dharmadhātu","noun-adj",""
"2","namas","NAM","as","nama","noun-adj",""
"3","tubhyaṃ","TUBH","yaṃ","tubh","verb",""
"4","sarva","SARV","a@","sarva","noun-adj",""
"5","sattveṣv","SATTV","eṣv","sattva","noun-adj",""
"6","avasthita","AVASTHIT","a","avasthita","noun-adj",""
"7","/","","","","punct",""
"8","yasya","","","yad","pron",""
"9","te","","","tad","pron",""
"10","a","","","alpha_privativum","ind",""
"11","parijñānād","PARIJÑĀN","ād","parijñāna","noun-adj",""
"12","bhramanti","BHRAM","anti","bhram","verb",""
"13","tribhava","TRIBHAV","a@","tribhava","noun-adj",""
"14","ālaye","ĀLAY","e","ālaya","noun-adj",""
"15","//","","","","punct",""
"","</s>","","","","",""
"","<s number=""3"">","","","","",""
"1","ye","","","yad","pron",""
"2","eva","","","eva","ind",""
"3","dhātuḥ","DHĀT","uḥ","dhātu","noun-adj",""
"4","saṃsāre","SAṂSĀR","e","saṃsāra","noun-adj",""
"5","śodhyamānaḥ","ŚODH","yamānaḥ","śodh","verb","śudh"
"6","sa","","","sa_saha","ind",""
"7","eva","","","eva","ind",""
"8","tu","","","tu","ind",""
"9","/","","","","punct",""
"10","śuddhaḥ","ŚUDDH","aḥ","śuddha","noun-adj",""
"11","sa","","","sa_saha","ind",""
"12","eva","","","eva","ind",""
"13","nirvāṇe","NIRVĀṆ","e","nirvāṇa","noun-adj",""
"14","dharmakāyaḥ","DHARMAKĀY","aḥ","dharmakāya","noun-adj",""
"15","sa","","","sa_saha","ind",""
"16","eva","","","eva","ind",""
"17","hi","","","hi","ind",""
"18","//","","","","punct",""
"","</s>","","","","",""
"","<s number=""4"">","","","","",""
"1","yathā","","","yathā","ind",""
"2","hi","","","hi","ind",""
"3","kṣīra","KṢĪR","a@","kṣīra","noun-adj",""
"4","sammi","SAMM","i@","sammi","noun-adj",""
"5","śaraṃ","ŚAR","aṃ","śara","noun-adj",""
"6","sarpi","SARP","i@","sarpi","noun-adj",""
"7","maṇḍaṃ","MAṆḌ","aṃ","maṇḍa","noun-adj",""
"8","na","","","na","ind",""
"9","dṛśyate","DṚŚ","yate","darś","verb","dṛś"
"10","tathā","","","tathā","ind",""
"11","hi","","","hi","ind",""
"12","kleśa","KLEŚ","a@","kleśa","noun-adj",""
"13","sammiśro","SAMMIŚR","o","sammiśra","noun-adj",""
"14","dharmadhātur","DHARMADHĀT","ur","dharmadhātu","noun-adj",""
"15","na","","","na","ind",""
"16","dṛśyate","DṚŚ","yate","darś","verb","dṛś"
"17","//","","","","punct",""
"","</s>","","","","",""
"","<s number=""5"">","","","","",""
"1","yathā","","","yathā","ind",""
"2","viśodhitaṃ","VIŚODHIT","aṃ","viśodhita","noun-adj",""
"3","kṣīraṃ","KṢĪR","aṃ","kṣīra","noun-adj",""
"4","ghṛta","GHṚT","a@","ghṛta","noun-adj",""
"5","dravyaṃ","DRAVY","aṃ","dravya","noun-adj",""
"6","sunirmalam","SUNIRMAL","am","sunirmala","noun-adj",""
"7","/","","","","punct",""
"8","tathā","","","tathā","ind",""
"9","viśodhitāḥ","VIŚODHIT","āḥ","viśodhita","noun-adj",""
"10","kleśā","KLEŚ","ā","kleśa","noun-adj",""
"11","dharmadhātuḥ","DHARMADHĀT","uḥ","dharmadhātu","noun-adj",""
"12","sunirmalaḥ","SUNIRMAL","aḥ","sunirmala","noun-adj",""
"13","//","","","","punct",""
"","</s>","","","","",""
"","<s number=""6"">","","","","",""
"1","yathā","","","yathā","ind",""
"2","dīpo","DĪP","o","dīpa","noun-adj",""
"3","ghaṭa","GHAṬ","a@","ghaṭa","noun-adj",""
"4","stho","STH","o","sthā","noun-adj",""
"5","hi","","","hi","ind",""
"6","na","","","na","ind",""
"7","kiñcid","","","kimcit","ind",""
"8","avabhāsate","AVABHĀS","ate","avabhās","verb",""
"9","/","","","","punct",""
"10","tathā","","","tathā","ind",""
"11","kleśa","KLEŚ","a@","kleśa","noun-adj",""
"12","ghaṭa","GHAṬ","a@","ghaṭa","noun-adj",""
"13","stho","STH","o","sthā","noun-adj",""
"14","hi","","","hi","ind",""
"15","dharmadhātur","DHARMADHĀT","ur","dharmadhātu","noun-adj",""
"16","na","","","na","ind",""
"17","bhāsate","BHĀSAT","e","bhāsatā","noun-adj",""
"18","//","","","","punct",""
"","</s>","","","","",""
"","<s number=""7"">","","","","",""
"1","yena","","","yad","pron",""
"2","yena","","","yad","pron",""
"3","hi","","","hi","ind",""
"4","pārśvena","PĀRŚV","ena","pārśva","noun-adj",""
"5","c","","","ca","ind",""
"6","chidrī","CHIDR","ī@","chidrī","noun-adj",""
"7","bhavati","BHAV","ati","bhav","verb","bhū"
"8","tad","","","tad","pron",""
"9","ghaṭam","GHAṬ","am","ghaṭa","noun-adj",""
"10","/","","","","punct",""
"11","tena","","","tad","pron",""
"12","tena","","","tad","pron",""
"13","hi","","","hi","ind",""
"14","pārśvena","PĀRŚV","ena","pārśva","noun-adj",""
"15","raśma","RAŚM","a@","raśma","noun-adj",""
"16","yas","YAŚ","","yad","pron",""
"17","tasya","","","tad","pron",""
"18","nirgatāḥ","NIRGAT","āḥ","nirgata","noun-adj",""
"19","//","","","","punct",""
"","</s>","","","","",""
"","<s number=""8"">","","","","",""
"1","yadā","","","yadā","ind",""
"2","samādhi","SAMĀDH","i@","samādhi","noun-adj",""
"3","vajreṇa","VAJR","eṇa","vajra","noun-adj",""
"4","bhinnaṃ","BHINN","aṃ","bhinna","noun-adj",""
"5","bhavati","BHAV","ati","bhav","verb","bhū"
"6","tad","","","tad","pron",""
"7","ghaṭam","GHAṬ","am","ghaṭa","noun-adj",""
"8","/","","","","punct",""
"9","sa","","","sa_saha","ind",""
"10","tad","TAD","","tad","pron",""
"11","ākāśa","ĀKĀŚ","a@","ākāśa","noun-adj",""
"12","paryantaṃ","PARYANT","aṃ","paryanta","noun-adj",""
"13","samantād","SAMANT","ād","samanta","noun-adj",""
"14","avabhāsate","AVABHĀS","ate","avabhās","verb",""
"15","//","","","","punct",""
"","</s>","","","","",""
"","<s number=""9"">","","","","",""
"1","dharmadhātur","DHARMADHĀT","ur","dharmadhātu","noun-adj",""
"2","na","","","na","ind",""
"3","c","","","ca","ind",""
"4","^","","","","",""
"5","otpanno","UTPANN","o","utpanna","noun-adj",""
"6","na","","","na","ind",""
"7","niruddhaḥ","NIRUDDH","aḥ","niruddha","noun-adj",""
"8","kadā","","","kadā","ind",""
"9","cana","","","","ind",""
"10","/","","","","punct",""
"11","sarvakālam","SARVAKĀL","am","sarvakāla","noun-adj",""
"12","a","","","alpha_privativum","ind",""
"13","saṅkliṣṭa","SAṄKLIṢṬ","a","saṅkliṣṭa","noun-adj",""
"14","ādima","ĀDIM","a@","ādima","noun-adj",""
"15","dhyānta","DHYĀN","ta","dhyāna","noun-adj",""
"16","nirmalaḥ","NIRMAL","aḥ","nirmala","noun-adj",""
"17","//","","","","punct",""
"","</s>","","","","",""
"","<s number=""10"">","","","","",""
"1","yathā","","","yathā","ind",""
"2","vaiḍury","VAIḌUR","y@","vaiḍuri","noun-adj",""
"3","aratnaṃ","ARATN","aṃ","aratna","noun-adj",""
"4","hi","","","hi","ind",""
"5","sarvakāla","SARVAKĀL","a@","sarvakāla","noun-adj",""
"6","prabhāsvaram","PRABHĀSVAR","am","prabhāsvara","noun-adj",""
"7","/","","","","punct",""
"8","pāṣāṇa","PĀṢĀṆ","a@","pāṣāṇa","noun-adj",""
"9","kośe","KOŚ","e","kośa","noun-adj",""
"10","sañchannam","SAṂCHANN","am","saṃchanna","noun-adj",""
"11","ābhā","","","","ind",""
"12","tasya","","","tad","pron",""
"13","na","","","na","ind",""
"14","rājate","RĀJAT","e","rājata","noun-adj",""
"15","//","","","","punct",""
"","</s>","","","","",""
"","<s number=""11"">","","","","",""
"1","evaṃ","","","eva","ind",""
"2","hi","","","hi","ind",""
"3","kleśa","KLEŚ","a@","kleśa","noun-adj",""
"4","sañchanno","SAṂCHANN","o","saṃchanna","noun-adj",""
"5","dharmadhātuḥ","DHARMADHĀT","uḥ","dharmadhātu","noun-adj",""
"6","sunirmalaḥ","SUNIRMAL","aḥ","sunirmala","noun-adj",""
"7","/","","","","punct",""
"8","n","","","na","ind",""
"9","^","","","","",""
"10","bhrājati","BHRĀJ","ati","bhrāj","verb",""
"11","saṃsāre","SAṂSĀR","e","saṃsāra","noun-adj",""
"12","nirvāṇe","NIRVĀṆ","e","nirvāṇa","noun-adj",""
"13","tu","","","tu","ind",""
"14","prabhāsvaraḥ","PRABHĀSVAR","aḥ","prabhāsvara","noun-adj",""
"15","//","","","","punct",""
"","</s>","","","","",""
"","<s number=""12"">","","","","",""
"1","gotre","GOTR","e","gotra","noun-adj",""
"2","ca","","","ca","ind",""
"3","sati","","","","ind",""
"4","vyāyāmo","VYĀYĀM","o","vyāyāma","noun-adj",""
"5","jātarūpa","JĀTARŪP","a@","jātarūpa","noun-adj",""
"6","nidarśanāt","NIDARŚAN","āt","nidarśana","noun-adj",""
"7","/","","","","punct",""
"8","gotre","GOTR","e","gotra","noun-adj",""
"9","asati","ASAT","i","asatī","noun-adj",""
"10","vyāyāmaḥ","VYĀYĀM","aḥ","vyāyāma","noun-adj",""
"11","śramaḥ","ŚRAM","aḥ","śrama","noun-adj",""
"12","kevalam","KEVAL","am","kevala","noun-adj",""
"13","iṣyate","IṢ","yate","icch","verb","iṣ1"
"13","iṣyate","IṢ","yate","eṣ","verb","iṣ2"
"14","//","","","","punct",""
"","</s>","","","","",""
"","<s number=""13"">","","","","",""
"1","yathā","","","yathā","ind",""
"2","hi","","","hi","ind",""
"3","tuṣa","TUṢ","a@","tuṣa","noun-adj",""
"4","sañchannaṃ","SAṂCHANN","aṃ","saṃchanna","noun-adj",""
"5","na","","","na","ind",""
"6","dhānyaṃ","DHĀNY","aṃ","dhānya","noun-adj",""
"7","tat","","","tad","pron",""
"8","phalaṃ","PHAL","aṃ","phala","noun-adj",""
"9","ma","","","","ind",""
"10","tam","TAM","","tad","pron",""
"11","/","","","","punct",""
"12","tathā","","","tathā","ind",""
"13","hi","","","hi","ind",""
"14","kleśa","KLEŚ","a@","kleśa","noun-adj",""
"15","sañchanno","SAṂCHANN","o","saṃchanna","noun-adj",""
"16","n","","","na","ind",""
"17","^","","","","",""
"18","buddheti","BUDDH","eti","buddh","verb",""
"19","kalpyate","KALP","yate","kalp","verb","kḷp"
"20","//","","","","punct",""
"","</s>","","","","",""
"","<s number=""14"">","","","","",""
"1","yathā","","","yathā","ind",""
"2","hi","","","hi","ind",""
"3","tuṣa","TUṢ","a@","tuṣa","noun-adj",""
"4","nirmuktaṃ","NIRMUKT","aṃ","nirmukta","noun-adj",""
"5","tat","","","tad","pron",""
"6","phalaṃ","PHAL","aṃ","phala","noun-adj",""
"7","pratibhāsate","PRATIBHĀS","ate","pratibhāsa","noun-adj",""
"8","/","","","","punct",""
"9","tathā","","","tathā","ind",""
"10","hi","","","hi","ind",""
"11","kleśa","KLEŚ","a@","kleśa","noun-adj",""
"12","nirmukto","NIRMUKT","o","nirmukta","noun-adj",""
"13","dharmakāyaḥ","DHARMAKĀY","aḥ","dharmakāya","noun-adj",""
"14","prabhāsate","PRABHĀS","ate","prabhās","verb",""
"15","//","","","","punct",""
"","</s>","","","","",""
"","<s number=""15"">","","","","",""
"1","upamā","UPAM","ā","upamā","noun-adj",""
"2","kriyate","KRI","yate","kria","noun-adj",""
"3","loke","LOK","e","loka","noun-adj",""
"4","kadalyān","KADAL","yān","kadala","noun-adj",""
"5","^","","","","",""
"6","āsti","","","as","verb","as"
"7","sā","","","tad","pron",""
"8","ratā","RAT","ā","ratā","noun-adj",""
"9","/","","","","punct",""
"10","phalāni","PHAL","āni","phala","noun-adj",""
"11","tasya","","","tad","pron",""
"12","sārāṇi","SĀR","āṇi","sāra","noun-adj",""
"13","bhakṣyate","BHAKṢ","yate","bhaj","verb","bhaj"
"14","amṛta","AMṚT","a@","amṛta","noun-adj",""
"15","opamā","UPAM","ā","upamā","noun-adj",""
"16","//","","","","punct",""
"","</s>","","","","",""
"","<s number=""16"">","","","","",""
"1","evaṃ","","","eva","ind",""
"2","hy","","","hi","ind",""
"3","a","","","alpha_privativum","ind",""
"4","sāre","SĀR","e","sāra","noun-adj",""
"5","saṃsāre","SAṂSĀR","e","saṃsāra","noun-adj",""
"6","nirvṛte","NIRVṚT","e","nirvṛta","noun-adj",""
"7","kleśa","KLEŚ","a@","kleśa","noun-adj",""
"8","sāgare","SĀGAR","e","sāgara","noun-adj",""
"9","/","","","","punct",""
"10","phalaṃ","PHAL","aṃ","phala","noun-adj",""
"11","tasy","","","tad","pron",""
"12","āpi","","","api","ind",""
"13","buddhatvam","BUDDHATV","am","buddhatva","noun-adj",""
"14","amṛtaṃ","AMṚT","aṃ","amṛta","noun-adj",""
"15","sarvade","SARVAD","e","sarvadā","noun-adj",""
"16","hinām","HIN","ām","hinā","noun-adj",""
"17","//","","","","punct",""
"","</s>","","","","",""
"","<s number=""17"">","","","","",""
"1","evaṃ","","","eva","ind",""
"2","hi","","","hi","ind",""
"3","sarva","SARV","a@","sarva","noun-adj",""
"4","bījeṣu","BĪJ","eṣu","bīja","noun-adj",""
"5","sādṛśyāṃ","SĀDṚŚY","āṃ","sādṛśya","noun-adj",""
"6","jāyate","JĀ","yate","jan","verb","jan"
"7","phalam","PHAL","am","phala","noun-adj",""
"8","/","","","","punct",""
"9","bījair","BĪJ","air","bīja","noun-adj",""
"10","vinā","","","vinā","ind",""
"11","phalaṃ","PHAL","aṃ","phala","noun-adj",""
"12","n","","","na","ind",""
"13","^","","","","",""
"14","āsti","","","as","verb","as"
"15","kaḥ","","","kim","pron",""
"16","prājñaḥ","PRĀJÑ","aḥ","prājña","noun-adj",""
"17","pratipatsyate","PRATIPATS","yate","pratipatsa","noun-adj",""
"18","//","","","","punct",""
"","</s>","","","","",""
"","<s number=""18"">","","","","",""
"1","bīja","BĪJ","a@","bīja","noun-adj",""
"2","bhūtas","BHŪT","as","bhūta","noun-adj",""
"3","tv","","","tu","ind",""
"4","asau","","","adas","pron",""
"5","dhātur","DHĀT","ur","dhātu","noun-adj",""
"6","dharmāṇām","DHARM","āṇām","dharma","noun-adj",""
"7","āśrayo","ĀŚRAY","o","āśraya","noun-adj",""
"8","mataḥ","MAT","aḥ","mata","noun-adj",""
"9","/","","","","punct",""
"10","śodhyamānaḥ","ŚODH","yamānaḥ","śodh","verb","śudh"
"11","krameṇa","KRAMEṆ","a","krameṇa","noun-adj",""
"12","^","","","","",""
"13","aivaṃ","","","eva","ind",""
"14","buddhatva","BUDDHATV","a@","buddhatva","noun-adj",""
"15","āspadam","ĀSPAD","am","āspada","noun-adj",""
"16","āvahet","ĀVAH","et","āvah","verb",""
"17","//","","","","punct",""
"","</s>","","","","",""
"","<s number=""19"">","","","","",""
"1","nirmālau","NIRMĀL","au","nirmāla","noun-adj",""
"2","candra","CANDR","a@","candra","noun-adj",""
"3","sūryau","SŪRY","au","sūrya","noun-adj",""
"4","hi","","","hi","ind",""
"5","āvṛta","ĀVṚT","a","āvṛta","noun-adj",""
"6","upañcabhir","UPAÑC","abhir","upañca","noun-adj",""
"7","malaiḥ","MAL","aiḥ","mala","noun-adj",""
"8","/","","","","punct",""
"9","a","","","alpha_privativum","ind",""
"10","bhra","BHR","a@","bhra","noun-adj",""
"11","nīhāra","NĪHĀR","a@","nīhāra","noun-adj",""
"12","dhūmena","DHŪM","ena","dhūma","noun-adj",""
"13","rāhu","RĀH","u@","rāhu","noun-adj",""
"14","vaktra","VAKTR","a@","vaktra","noun-adj",""
"15","raja","RAJ","a@","raja","noun-adj",""
"16","ādibhiḥ","ĀD","ibhiḥ","ādi","noun-adj",""
"17","//","","","","punct",""
"","</s>","","","","",""
"","<s number=""20"">","","","","",""
"1","evaṃ","","","eva","ind",""
"2","prabhāsvaraṃ","PRABHĀSVAR","aṃ","prabhāsvara","noun-adj",""
"3","cittam","CITT","am","citta","noun-adj",""
"4","āvṛtaṃ","ĀVṚT","aṃ","āvṛta","noun-adj",""
"5","pañcabhir","PAÑC","abhir","pañca","noun-adj",""
"6","malaiḥ","MAL","aiḥ","mala","noun-adj",""
"7","/","","","","punct",""
"8","kāma","KĀM","a@","kāma","noun-adj",""
"9","vyāpāda","VYĀPĀD","a@","vyāpāda","noun-adj",""
"10","middhena","MIDDH","ena","middha","noun-adj",""
"11","auddhatya","AUDDHATY","a@","auddhatya","noun-adj",""
"12","vicikitsayā","VICIKITS","ayā","vicikitsā","noun-adj",""
"13","//","","","","punct",""
"","</s>","","","","",""
"","<s number=""21"">","","","","",""
"1","agni","AGN","i@","agni","noun-adj",""
"2","śaucaṃ","ŚAUC","aṃ","śauca","noun-adj",""
"3","yathā","","","yathā","ind",""
"4","vastraṃ","VASTR","aṃ","vastra","noun-adj",""
"5","malinaṃ","MALIN","aṃ","malina","noun-adj",""
"6","vividhair","VIVIDH","air","vividha","noun-adj",""
"7","malaiḥ","MAL","aiḥ","mala","noun-adj",""
"8","/","","","","punct",""
"9","agni","AGN","i@","agni","noun-adj",""
"10","madhye","MADHY","e","madhya","noun-adj",""
"11","yathā","","","yathā","ind",""
"12","kṣiptaṃ","KṢIPT","aṃ","kṣipta","noun-adj",""
"13","malaṃ","MAL","aṃ","mala","noun-adj",""
"14","dagdhaṃ","DAGDH","aṃ","dagdha","noun-adj",""
"15","na","","","na","ind",""
"16","vastratā","VASTR","atā","vastra","noun-adj",""
"17","//","","","","punct",""
"","</s>","","","","",""
"","<s number=""22"">","","","","",""
"1","evaṃ","","","eva","ind",""
"2","prabhāsvaraṃ","PRABHĀSVAR","aṃ","prabhāsvara","noun-adj",""
"3","cittaṃ","CITT","aṃ","citta","noun-adj",""
"4","malinaṃ","MALIN","aṃ","malina","noun-adj",""
"5","rā","","","","ind",""
"6","gajair","GAJ","air","gaja","noun-adj",""
"7","malaiḥ","MAL","aiḥ","mala","noun-adj",""
"8","/","","","","punct",""
"9","jñāna","JÑĀN","a@","jñāna","noun-adj",""
"10","āgninā","AGN","inā","agni","noun-adj",""
"11","malaṃ","MAL","aṃ","mala","noun-adj",""
"12","dagdhaṃ","DAGDH","aṃ","dagdha","noun-adj",""
"13","na","","","na","ind",""
"14","dagdhaṃ","DAGDH","aṃ","dagdha","noun-adj",""
"15","tat","","","tad","pron",""
"16","prabhāsvaram","PRABHĀSVAR","am","prabhāsvara","noun-adj",""
"17","//","","","","punct",""
"","</s>","","","","",""
"","<s number=""23"">","","","","",""
"1","śūnyatā","ŚŪNYAT","ā@","śūnyatā","noun-adj",""
"2","hārakāḥ","HĀRAK","āḥ","hāraka","noun-adj",""
"3","sūtrā","SŪTR","ā","sūtra","noun-adj",""
"4","ye","","","yad","pron",""
"5","kecid","","","kimcit","ind",""
"6","bhāṣitā","BHĀṢIT","ā","bhāṣitṛ","noun-adj",""
"7","jinaiḥ","JIN","aiḥ","jina","noun-adj",""
"8","/","","","","punct",""
"9","sarvais","SARV","ais","sarva","noun-adj",""
"10","taiḥ","","","tad","pron",""
"11","kleśa","KLEŚ","a@","kleśa","noun-adj",""
"12","vyāvṛttir","VYĀVṚTT","ir","vyāvṛtti","noun-adj",""
"13","n","","","na","ind",""
"14","^","","","","",""
"15","aiva","","","eva","ind",""
"16","dhātor","DHĀT","or","dhātu","noun-adj",""
"17","vināśa","VINĀŚ","a@","vināśa","noun-adj",""
"18","nam","NAM","","nama","noun-adj",""
"19","//","","","","punct",""
"","</s>","","","","",""
"","<s number=""24"">","","","","",""
"1","pṛthivy","PṚTHIV","y@","pṛthivī","noun-adj",""
"2","antar","ANTAR","@","antara","noun-adj",""
"3","hitaṃ","HIT","aṃ","hita","noun-adj",""
"4","toyaṃ","TOY","aṃ","toya","noun-adj",""
"5","yathā","","","yathā","ind",""
"6","tiṣṭhati","TIṢṬH","ati","sthā","verb",""
"7","nirmalam","NIRMAL","am","nirmala","noun-adj",""
"8","/","","","","punct",""
"9","kleśair","KLEŚ","air","kleśa","noun-adj",""
"10","antar","ANTAR","","antara","noun-adj",""
"11","itaṃ","","","","ind",""
"12","jñānaṃ","JÑĀN","aṃ","jñāna","noun-adj",""
"13","tathā","","","tathā","ind",""
"14","bhāti","BHĀT","i","bhāti","noun-adj",""
"15","sunirmalam","SUNIRMAL","am","sunirmala","noun-adj",""
"16","//","","","","punct",""
"","</s>","","","","",""
"","<s number=""25"">","","","","",""
"1","dharmadhātur","DHARMADHĀT","ur","dharmadhātu","noun-adj",""
"2","yato","","","yatas","ind",""
"3","n","","","na","ind",""
"4","ātmā","ĀTM","ā","ātman","noun-adj",""
"5","na","","","na","ind",""
"6","ca","","","ca","ind",""
"7","strīnṛ","STR","īnṛ","strī","noun-adj",""
"8","napuṃsakaḥ","NAPUṂSAK","aḥ","napuṃsaka","noun-adj",""
"9","/","","","","punct",""
"10","sarva","SARV","a@","sarva","noun-adj",""
"11","grāha","GRĀH","a@","grāha","noun-adj",""
"12","vinirmuktaḥ","VINIRMUKT","aḥ","vinirmukta","noun-adj",""
"13","kathamā","KATHAM","ā","kathamā","noun-adj",""
"14","tma","TM","a@","tman","noun-adj",""
"15","eti","ET","i","iti","noun-adj",""
"16","kalpyate","KALP","yate","kalp","verb","kḷp"
"17","//","","","","punct",""
"","</s>","","","","",""
"","<s number=""26"">","","","","",""
"1","sarve","SARV","e","sarva","noun-adj",""
"2","dharmā","DHARM","ā","dharma","noun-adj",""
"3","hy","","","hi","ind",""
"4","a","","","alpha_privativum","ind",""
"5","saṃsaktāḥ","SAṂSAKT","āḥ","saṃsakta","noun-adj",""
"6","strīpuṃstvaṃ","STRĪPUṂS","tvaṃ","strīpuṃsa","noun-adj",""
"7","hi","","","hi","ind",""
"8","na","","","na","ind",""
"9","vidyate","VID","yate","vid","verb","vid"
"10","/","","","","punct",""
"11","rāga","RĀG","a@","rāga","noun-adj",""
"12","āndha","ANDH","a@","andha","noun-adj",""
"13","vineya","VINEY","a@","vineya","noun-adj",""
"14","ārthāya","ARTH","āya","artha","noun-adj",""
"15","strīpuṃstvaṃ","STRĪPUṂS","tvaṃ","strīpuṃsa","noun-adj",""
"16","hi","","","hi","ind",""
"17","pradarśitam","PRADARŚIT","am","pradarśita","noun-adj",""
"18","//","","","","punct",""
"","</s>","","","","",""
"","<s number=""27"">","","","","",""
"1","a","","","alpha_privativum","ind",""
"2","nitya","NITY","a@","nitya","noun-adj",""
"3","duḥkha","DUḤKH","a@","duḥkha","noun-adj",""
"4","śūnyeti","ŚŪN","yeti","śūna","noun-adj",""
"5","citta","CITT","a@","citta","noun-adj",""
"6","nidhyapta","NIDHYAPT","a@","nidhyapta","noun-adj",""
"7","yas","YAŚ","","yad","pron",""
"8","trayaḥ","TRAY","aḥ","tri","noun-adj",""
"9","/","","","","punct",""
"10","paramā","PARAM","ā","parama","noun-adj",""
"11","citta","CITT","a@","citta","noun-adj",""
"12","nidhyaptir","NIDHYAPT","ir","nidhyapti","noun-adj",""
"13","dharmāṇāṃ","DHARM","āṇāṃ","dharma","noun-adj",""
"14","nih","","","niḥ_privativum","ind",""
"15","svabhāvatā","SVABHĀV","atā","svabhāvatā","noun-adj",""
"16","//","","","","punct",""
"","</s>","","","","",""
"","<s number=""28"">","","","","",""
"1","yathā","","","yathā","ind",""
"2","hi","","","hi","ind",""
"3","garbho","GARBH","o","garbha","noun-adj",""
"4","garbhiṇyāṃ","GARBHIṆ","yāṃ","garbhiṇī","noun-adj",""
"5","vidyate","VID","yate","vid","verb","vid"
"6","na","","","na","ind",""
"7","ca","","","ca","ind",""
"8","dṛśyate","DṚŚ","yate","darś","verb","dṛś"
"9","/","","","","punct",""
"10","tathā","","","tathā","ind",""
"11","hi","","","hi","ind",""
"12","kleśa","KLEŚ","a@","kleśa","noun-adj",""
"13","sañchannaṃ","SAṂCHANN","aṃ","saṃchanna","noun-adj",""
"14","dharma","DHARM","a@","dharma","noun-adj",""
"15","tattvaṃ","TATTV","aṃ","tad","pron",""
"16","na","","","na","ind",""
"17","dṛśyate","DṚŚ","yate","darś","verb","dṛś"
"18","//","","","","punct",""
"","</s>","","","","",""
"","<s number=""29"">","","","","",""
"1","caturṇāṃ","CAT","urṇāṃ","catur","noun-adj",""
"2","hi","","","hi","ind",""
"3","vikalpānām","VIKALP","ānām","vikalpa","noun-adj",""
"4","utpattir","UTPATT","ir","utpatti","noun-adj",""
"5","bhūt","BHŪT","@","bhūta","noun-adj",""
"6","abhau","ABH","au","abhi","noun-adj",""
"7","tikāt","TIK","āt","tika","noun-adj",""
"8","/","","","","punct",""
"9","ahaṃ","AHAṂ","","mat","pron",""
"10","mama","MAM","a@","mat","pron",""
"11","vikalpo","VIKALP","o","vikalpa","noun-adj",""
"12","hi","","","hi","ind",""
"13","nāma","NĀM","a@","nāman","noun-adj",""
"14","sañjña","SAÑJÑ","a@","sañjña","noun-adj",""
"15","ānimitta","ĀNIMITT","a@","ānimitta","noun-adj",""
"16","jaḥ","J","aḥ","ja","noun-adj",""
"17","//","","","","punct",""
"","</s>","","","","",""
"","<s number=""30"">","","","","",""
"1","praṇidhānaṃ","PRAṆIDHĀN","aṃ","praṇidhāna","noun-adj",""
"2","hi","","","hi","ind",""
"3","buddhānāṃ","BUDDH","ānāṃ","buddha","noun-adj",""
"4","nir","NIR","","niḥ_privativum","ind",""
"5","ābhāsam","ĀBHĀS","am","ābhāsa","noun-adj",""
"6","alakṣaṇam","ALAKṢAṆ","am","alakṣaṇa","noun-adj",""
"7","/","","","","punct",""
"8","pratyām","PRATY","ām","pratyā","noun-adj",""
"9","a","","","alpha_privativum","ind",""
"10","vedya","VEDY","a@","vedya","noun-adj",""
"11","yogitvād","YOG","itvād","yoga","noun-adj",""
"12","buddhānāṃ","BUDDH","ānāṃ","buddha","noun-adj",""
"13","nitya","NITY","a@","nitya","noun-adj",""
"14","dharmatā","DHARMAT","ā","dharmatā","noun-adj",""
"15","//","","","","punct",""
"","</s>","","","","",""
"","<s number=""31"">","","","","",""
"1","yathā","","","yathā","ind",""
"2","śaśa","ŚAŚ","a@","śaśa","noun-adj",""
"3","viṣāṇāṃ","VIṢĀṆ","āṃ","viṣāṇā","noun-adj",""
"4","hi","","","hi","ind",""
"5","kalpyamānaṃ","KALP","yamānaṃ","kalp","verb","kḷp"
"6","na","","","na","ind",""
"7","vidyate","VID","yate","vid","verb","vid"
"8","/","","","","punct",""
"9","tathā","","","tathā","ind",""
"10","hi","","","hi","ind",""
"11","sarva","SARV","a@","sarva","noun-adj",""
"12","dharmeṣu","DHARM","eṣu","dharma","noun-adj",""
"13","kalpitaṃ","KALPIT","aṃ","kalpita","noun-adj",""
"14","n","","","na","ind",""
"15","^","","","","",""
"16","aiva","","","eva","ind",""
"17","vidyate","VID","yate","vid","verb","vid"
"18","//","","","","punct",""
"","</s>","","","","",""
"","<s number=""32"">","","","","",""
"1","paramāṇu","PARAMĀṆ","u@","paramāṇu","noun-adj",""
"2","rajaḥ","RAJ","aḥ","raja","noun-adj",""
"3","kintu","KIṂT","u","kiṃtu","noun-adj",""
"4","go","","","","ind",""
"5","viṣānaṃ","VIṢ","ānaṃ","viṣa","noun-adj",""
"6","na","","","na","ind",""
"7","vidyate","VID","yate","vid","verb","vid"
"8","/","","","","punct",""
"9","yathā","","","yathā","ind",""
"10","pūrvaṃ","PŪRV","aṃ","pūrva","noun-adj",""
"11","tathā","","","tathā","ind",""
"12","paścāt","PAŚC","āt","paśca","noun-adj",""
"13","tasya","","","tad","pron",""
"14","kiṃ","","","kim","pron",""
"15","kalpyate","KALP","yate","kalp","verb","kḷp"
"16","buddhaiḥ","BUDDH","aiḥ","buddha","noun-adj",""
"17","//","","","","punct",""
"","</s>","","","","",""
"","<s number=""33"">","","","","",""
"1","pratītyo","PRATĪTY","o@","pratītya","noun-adj",""
"2","padyate","PAD","yate","pad","verb","pad"
"3","c","","","ca","ind",""
"4","^","","","","",""
"5","aiva","","","eva","ind",""
"6","pratītya","PRATĪTY","a","pratītya","noun-adj",""
"7","ca","","","ca","ind",""
"8","nirudhyate","NIRUDH","yate","nirodh","verb","nirudh"
"9","/","","","","punct",""
"10","ekasya","EKA","sya","eka","noun-adj",""
"11","sambhavo","SAMBHAV","o","sambhava","noun-adj",""
"12","n","","","na","ind",""
"13","^","","","","",""
"14","āsti","","","as","verb","as"
"15","kathaṃ","","","katham","ind",""
"16","bālair","BĀL","air","bāla","noun-adj",""
"17","vikalpyate","VIKALP","yate","vikalp","verb","vikḷp"
"18","//","","","","punct",""
"","</s>","","","","",""
"","<s number=""34"">","","","","",""
"1","śaśa","ŚAŚ","a@","śaśa","noun-adj",""
"2","gośṛṅga","GOŚṚṄG","a@","gośṛṅga","noun-adj",""
"3","dṛṣṭa","DṚṢṬ","a@","dṛṣṭa","noun-adj",""
"4","ānatam","ĀNAT","am","ānata","noun-adj",""
"5","ubhau","UBH","au","ubh","verb",""
"6","kalpita","KALPIT","a@","kalpita","noun-adj",""
"7","lakṣaṇau","LAKṢAṆ","au","lakṣaṇa","noun-adj",""
"8","/","","","","punct",""
"9","madhyamā","MADHYAM","ā","madhyamā","noun-adj",""
"10","pratipadyeta","PRATIPAD","yeta","pratipad","verb","pratipad"
"11","yathā","","","yathā","ind",""
"12","sugata","SUGAT","a@","sugata","noun-adj",""
"13","dharmatā","DHARMAT","ā","dharmatā","noun-adj",""
"14","//","","","","punct",""
"","</s>","","","","",""
"","<s number=""35"">","","","","",""
"1","yathā","","","yathā","ind",""
"2","candra","CANDR","a@","candra","noun-adj",""
"3","ārkatārāṇāṃ","ĀRK","atārāṇāṃ","ārkatā","noun-adj",""
"4","sv","","","su","ind",""
"5","accha","ACCH","a","accha","noun-adj",""
"6","udaka","UDAK","a@","udaka","noun-adj",""
"7","bhājane","BHĀJAN","e","bhājana","noun-adj",""
"8","/","","","","punct",""
"9","dṛśyate","DṚŚ","yate","darś","verb","dṛś"
"10","pratibimbaṃ","PRATIBIMB","aṃ","pratibimba","noun-adj",""
"11","hi","","","hi","ind",""
"12","tathā","","","tathā","ind",""
"13","niṣpanna","NIṢPANN","a@","niṣpanna","noun-adj",""
"14","lakṣaṇam","LAKṢAṆ","am","lakṣaṇa","noun-adj",""
"15","//","","","","punct",""
"","</s>","","","","",""
"","<s number=""36"">","","","","",""
"1","ād","","","","ind",""
"2","hima","HIM","a@","hima","noun-adj",""
"3","dhyānta","DHYĀN","ta","dhyāna","noun-adj",""
"4","kalyāṇam","KALYĀṆ","am","kalyāṇa","noun-adj",""
"5","a","","","alpha_privativum","ind",""
"6","visaṃvādakaṃ","VISAṂVĀD","akaṃ","visaṃvādaka","noun-adj",""
"7","dhruvam","DHRUV","am","dhruva","noun-adj",""
"8","/","","","","punct",""
"9","yasya","","","yad","pron",""
"10","c","","","ca","ind",""
"11","aivaṃvidhān","EVAṂVIDH","ān","evaṃvidha","noun-adj",""
"12","ātmā","ĀTM","ā","ātman","noun-adj",""
"13","kathamā","KATHAM","ā","kathamā","noun-adj",""
"14","tma","TM","a@","tman","noun-adj",""
"15","eti","ET","i","iti","noun-adj",""
"16","kalpyate","KALP","yate","kalp","verb","kḷp"
"17","//","","","","punct",""
"","</s>","","","","",""
"","<s number=""37"">","","","","",""
"1","grīṣma","GRĪṢM","a@","grīṣma","noun-adj",""
"2","kāle","KĀL","e","kāla","noun-adj",""
"3","yathā","","","yathā","ind",""
"4","vāri","VĀR","i","vāri","noun-adj",""
"5","uṣṇam","UṢṆ","am","uṣṇa","noun-adj",""
"6","ity","","","iti","ind",""
"7","abhidhīyate","ABHIDHĪ","yate","abhidhīa","noun-adj",""
"8","/","","","","punct",""
"9","tad","","","tad","pron",""
"10","eva","","","eva","ind",""
"11","śīta","ŚĪT","a@","śīta","noun-adj",""
"12","kāleṣu","KĀL","eṣu","kāla","noun-adj",""
"13","śītam","ŚĪT","am","śīta","noun-adj",""
"14","ity","","","iti","ind",""
"15","abhidhīyate","ABHIDHĪ","yate","abhidhīa","noun-adj",""
"16","//","","","","punct",""
"","</s>","","","","",""
"","<s number=""38"">","","","","",""
"1","āvṛtaṃ","ĀVṚT","aṃ","āvṛta","noun-adj",""
"2","kleśa","KLEŚ","a@","kleśa","noun-adj",""
"3","jālena","JĀL","ena","jāla","noun-adj",""
"4","cittam","CITT","am","citta","noun-adj",""
"5","ity","","","iti","ind",""
"6","abhidhīyate","ABHIDHĪ","yate","abhidhīa","noun-adj",""
"7","/","","","","punct",""
"8","tad","","","tad","pron",""
"9","eva","","","eva","ind",""
"10","kleśa","KLEŚ","a@","kleśa","noun-adj",""
"11","āpagamād","APAGAM","ād","apagama","noun-adj",""
"12","buddha","BUDDH","a","buddha","noun-adj",""
"13","ity","","","iti","ind",""
"14","abhidhīyate","ABHIDHĪ","yate","abhidhīa","noun-adj",""
"15","//","","","","punct",""
"","</s>","","","","",""
"","<s number=""39"">","","","","",""
"1","cakṣuḥ","CAKṢ","uḥ","cakṣu","noun-adj",""
"2","pratītya","PRATĪTY","a","pratītya","noun-adj",""
"3","rūpaṃ","RŪP","aṃ","rūpa","noun-adj",""
"4","ca","","","ca","ind",""
"5","avabhāsāḥ","AVABHĀS","āḥ","avabhāsa","noun-adj",""
"6","sunirmalāḥ","SUNIRMAL","āḥ","sunirmala","noun-adj",""
"7","/","","","","punct",""
"8","an","","","alpha_privativum","ind",""
"9","utpanna","UTPANN","a@","utpanna","noun-adj",""
"10","ā","","","alpha_privativum","ind",""
"11","niruddhās","NIRUDDH","ās","niruddha","noun-adj",""
"12","te","","","tad","pron",""
"13","dharmadhātuṃ","DHARMADHĀT","uṃ","dharmadhātu","noun-adj",""
"14","prajāna","PRAJĀN","a@","prajāna","noun-adj",""
"15","tha","TH","a","tha","noun-adj",""
"16","//","","","","punct",""
"","</s>","","","","",""
"","<s number=""40"">","","","","",""
"1","śrotram","ŚROTR","am","śrotra","noun-adj",""
"2","pratītya","PRATĪTY","a","pratītya","noun-adj",""
"3","śabdaṃ","ŚABD","aṃ","śabda","noun-adj",""
"4","ca","","","ca","ind",""
"5","cittaṃ","CITT","aṃ","citta","noun-adj",""
"6","vijñapta","VIJÑAPT","a@","vijñapta","noun-adj",""
"7","yas","YAŚ","","yad","pron",""
"8","trayaḥ","TRAY","aḥ","tri","noun-adj",""
"9","/","","","","punct",""
"10","śrūyate","ŚRŪ","yate","śṛṇ","verb","śru"
"11","sva","SV","a@","sva","noun-adj",""
"12","vikalpena","VIKALPEN","a","vikalpena","noun-adj",""
"13","dharmadhātur","DHARMADHĀT","ur","dharmadhātu","noun-adj",""
"14","alakṣaṇaḥ","ALAKṢAṆ","aḥ","alakṣaṇa","noun-adj",""
"15","//","","","","punct",""
"","</s>","","","","",""
"","<s number=""41"">","","","","",""
"1","ghrāṇaṃ","GHRĀṆ","aṃ","ghrāṇa","noun-adj",""
"2","gandha","GANDH","a@","gandha","noun-adj",""
"3","āśritaṃ","ĀŚRIT","aṃ","āśrita","noun-adj",""
"4","ghrāṇi","GHRĀṆ","i","ghrāṇi","noun-adj",""
"5","a","","","alpha_privativum","ind",""
"6","rūpam","RŪP","am","rūpa","noun-adj",""
"7","a","","","alpha_privativum","ind",""
"8","nidarśanam","NIDARŚAN","am","nidarśana","noun-adj",""
"9","/","","","","punct",""
"10","ghrāṇa","GHRĀṆ","a@","ghrāṇa","noun-adj",""
"11","vijñāna","VIJÑĀN","a@","vijñāna","noun-adj",""
"12","tathātā","TATHĀT","ā","tathātā","noun-adj",""
"13","dharmadhātur","DHARMADHĀT","ur","dharmadhātu","noun-adj",""
"14","vikalpyate","VIKALP","yate","vikalp","verb","vikḷp"
"15","//","","","","punct",""
"","</s>","","","","",""
"","<s number=""42"">","","","","",""
"1","jihvā","JIHV","ā","jihvā","noun-adj",""
"2","svabhāva","SVABHĀV","a@","svabhāva","noun-adj",""
"3","śūnyā","ŚŪNY","ā","śūnya","noun-adj",""
"4","hi","","","hi","ind",""
"5","rasa","RAS","a@","rasa","noun-adj",""
"6","dhātur","DHĀT","ur","dhātu","noun-adj",""
"7","viviktatā","VIVIKT","atā","viviktatā","noun-adj",""
"8","/","","","","punct",""
"9","a","","","alpha_privativum","ind",""
"10","pratiṣṭhita","PRATIṢṬHIT","a@","pratiṣṭhita","noun-adj",""
"11","vijñānaṃ","VIJÑĀN","aṃ","vijñāna","noun-adj",""
"12","dharmadhātu","DHARMADHĀT","u@","dharmadhātu","noun-adj",""
"13","svabhāvatā","SVABHĀVAT","ā","svabhāvatā","noun-adj",""
"14","//","","","","punct",""
"","</s>","","","","",""
"","<s number=""43"">","","","","",""
"1","śuddha","ŚUDDH","a@","śuddha","noun-adj",""
"2","kāya","KĀY","a@","kāya","noun-adj",""
"3","svabhāvena","SVABHĀV","ena","svabhāva","noun-adj",""
"4","sparśa","SPARŚ","a@","sparśa","noun-adj",""
"5","pratyaya","PRATYAY","a@","pratyaya","noun-adj",""
"6","lakṣaṇam","LAKṢAṆ","am","lakṣaṇa","noun-adj",""
"7","/","","","","punct",""
"8","pratyayebhyo","PRATYAY","ebhyo","pratyaya","noun-adj",""
"9","vinirmuktaṃ","VINIRMUKT","aṃ","vinirmukta","noun-adj",""
"10","dharmadhātuṃ","DHARMADHĀT","uṃ","dharmadhātu","noun-adj",""
"11","va","","","vai","ind",""
"12","dāmy","DĀM","y","dāmi","noun-adj",""
"13","aham","","","mat","pron",""
"14","//","","","","punct",""
"","</s>","","","","",""
"","<s number=""44"">","","","","",""
"1","manaḥ","MAN","aḥ@","manas","noun-adj",""
"2","pradhāna","PRADHĀN","a@","pradhāna","noun-adj",""
"3","dharmeṣu","DHARM","eṣu","dharma","noun-adj",""
"4","kalpya","KALPY","a@","kalpya","noun-adj",""
"5","kalpana","KALPAN","a@","kalpanā","noun-adj",""
"6","varjitam","VARJIT","am","varjita","noun-adj",""
"7","/","","","","punct",""
"8","dharmāṇāṃ","DHARM","āṇāṃ","dharma","noun-adj",""
"9","niḥ","","","niḥ_privativum","ind",""
"10","svabhāvatvaṃ","SVABHĀV","atvaṃ","svabhāvatva","noun-adj",""
"11","dharmadhātur","DHARMADHĀT","ur","dharmadhātu","noun-adj",""
"12","vibhāvyate","VIBHĀV","yate","vibhav","verb","vibhū"
"13","//","","","","punct",""
"","</s>","","","","",""
"","<s number=""45"">","","","","",""
"1","paśyate","PAŚ","yate","paś","verb","paś"
"2","śṛṇute","ŚṚṆ","ute","śṛṇu","noun-adj",""
"3","ghrāti","GHR","āti","ghra","noun-adj",""
"4","svādate","SVĀD","ate","svād","verb",""
"5","s","","","su","ind",""
"6","pṛśati","PṚŚAT","i","pṛśati","noun-adj",""
"7","iti","","","iti","ind",""
"8","ca","","","ca","ind",""
"9","/","","","","punct",""
"10","dharmān","DHARM","ān","dharma","noun-adj",""
"11","vijānate","VIJĀN","ate","vijānat","noun-adj",""
"12","yogī","YOG","ī","yogin","noun-adj",""
"13","evaṃ","","","eva","ind",""
"14","niṣpanna","NIṢPANN","a@","niṣpanna","noun-adj",""
"15","lakṣaṇam","LAKṢAṆ","am","lakṣaṇa","noun-adj",""
"16","//","","","","punct",""
"","</s>","","","","",""
"","<s number=""46"">","","","","",""
"1","cakṣuḥ","CAKṢ","uḥ","cakṣu","noun-adj",""
"2","śrotraṃ","ŚROTR","aṃ","śrotra","noun-adj",""
"3","ca","","","ca","ind",""
"4","ghrāṇaṃ","GHRĀṆ","aṃ","ghrāṇa","noun-adj",""
"5","ca","","","ca","ind",""
"6","jihvā","JIHV","ā","jihvā","noun-adj",""
"7","kāyo","KĀY","o","kāya","noun-adj",""
"8","manas","MANAS","","manasa","noun-adj",""
"9","tathā","","","tathā","ind",""
"10","/","","","","punct",""
"11","ṣaḍa","ṢAḌ","a@","ṣaṭ","noun-adj",""
"12","āyatanaṃ","ĀYATAN","aṃ","āyatana","noun-adj",""
"13","viśuddham","VIŚUDDH","am","viśuddha","noun-adj",""
"14","etat","","","tad","pron",""
"15","tattvasya","","","","ind",""
"16","lakṣaṇam","LAKṢAṆ","am","lakṣaṇa","noun-adj",""
"17","//","","","","punct",""
"","</s>","","","","",""
"","<s number=""47"">","","","","",""
"1","cittam","CITT","am","citta","noun-adj",""
"2","eva","","","eva","ind",""
"3","dv","DV","","dva","noun-adj",""
"4","dhā","DH","ā","dhā","noun-adj",""
"5","dṛṣṭaṃ","DṚṢṬ","aṃ","dṛṣṭa","noun-adj",""
"6","loki","LOK","i","loki","noun-adj",""
"7","lokottaraṃ","LOKOTTAR","aṃ","lokottara","noun-adj",""
"8","ca","","","ca","ind",""
"9","yat","","","yad","pron",""
"10","/","","","","punct",""
"11","ātma","ĀTM","a@","ātman","noun-adj",""
"12","grāheṇa","GRĀH","eṇa","grāha","noun-adj",""
"13","saṃsāraḥ","SAṂSĀR","aḥ","saṃsāra","noun-adj",""
"14","pratyātma","PRATYĀTM","a","pratyātma","noun-adj",""
"15","tathātā","TATHĀT","ā","tathātā","noun-adj",""
"16","hi","","","hi","ind",""
"17","tat","","","tad","pron",""
"18","//","","","","punct",""
"","</s>","","","","",""
"","<s number=""48"">","","","","",""
"1","rāga","RĀG","a@","rāga","noun-adj",""
"2","kṣayo","KṢAY","o","kṣaya","noun-adj",""
"3","hi","","","hi","ind",""
"4","nirvāṇaṃ","NIRVĀṆ","aṃ","nirvāṇa","noun-adj",""
"5","dveṣa","DVEṢ","a@","dveṣa","noun-adj",""
"6","moha","MOH","a@","moha","noun-adj",""
"7","kṣayaś","KṢAY","aś","kṣaya","noun-adj",""
"8","ca","","","ca","ind",""
"9","yat","","","yad","pron",""
"10","/","","","","punct",""
"11","tasya","","","tad","pron",""
"12","bodhāya","BODH","āya","bodha","noun-adj",""
"13","buddhatvaṃ","BUDDHATV","aṃ","buddhatva","noun-adj",""
"14","śaraṇaṃ","ŚARAṆ","aṃ","śaraṇa","noun-adj",""
"15","sarvade","SARVAD","e","sarvadā","noun-adj",""
"16","hinām","HIN","ām","hinā","noun-adj",""
"17","//","","","","punct",""
"","</s>","","","","",""
"","<s number=""49"">","","","","",""
"1","asmiṃ","","","idam","pron",""
"2","kale","KAL","e","kala","noun-adj",""
"3","vare","VAR","e","vara","noun-adj",""
"4","sarvaṃ","SARV","aṃ","sarva","noun-adj",""
"5","jñānam","JÑĀN","am","jñāna","noun-adj",""
"6","ajñānam","AJÑĀN","am","ajñāna","noun-adj",""
"7","eva","","","eva","ind",""
"8","ca","","","ca","ind",""
"9","/","","","","punct",""
"10","badhyate","BADH","yate","badha","noun-adj",""
"11","sva","SV","a@","sva","noun-adj",""
"12","vikalpena","VIKALPEN","a","vikalpena","noun-adj",""
"13","mucyate","MUC","yate","muñc","verb","muc"
"14","sva","SV","a@","sva","noun-adj",""
"15","parijñayā","PARIJÑ","ayā","parijñā","noun-adj",""
"16","//","","","","punct",""
"","</s>","","","","",""
"","<s number=""50"">","","","","",""
"1","bodhir","BODH","ir","bodhi","noun-adj",""
"2","na","","","na","ind",""
"3","dūre","DŪR","e","dūra","noun-adj",""
"4","n","","","na","ind",""
"5","āsanne","ĀSANN","e","āsanna","noun-adj",""
"6","na","","","na","ind",""
"7","gatān","GAT","ān","gata","noun-adj",""
"8","^","","","","",""
"9","āpi","","","api","ind",""
"10","v","","","vā","ind",""
"11","āgatā","ĀGAT","ā","āgata","noun-adj",""
"12","/","","","","punct",""
"13","na","","","na","ind",""
"14","dṛśyate","DṚŚ","yate","darś","verb","dṛś"
"15","dṛśyate","DṚŚ","yate","darś","verb","dṛś"
"16","c","","","ca","ind",""
"17","^","","","","",""
"18","aiva","","","eva","ind",""
"19","atr","","","atra","ind",""
"20","^","","","","",""
"21","aiva","","","eva","ind",""
"22","kleśa","KLEŚ","a@","kleśa","noun-adj",""
"23","pañjare","PAÑJAR","e","pañjara","noun-adj",""
"24","//","","","","punct",""
"","</s>","","","","",""
"","<s number=""51"">","","","","",""
"1","uktaṃ","UKT","aṃ","ukta","noun-adj",""
"2","ca","","","ca","ind",""
"3","sūtra","SŪTR","a@","sūtra","noun-adj",""
"4","vargeṣu","VARG","eṣu","varga","noun-adj",""
"5","vihara","VIHAR","a@","vihara","noun-adj",""
"6","ty","TY","","tya","noun-adj",""
"7","ātma","ĀTM","a@","ātman","noun-adj",""
"8","cintakaḥ","CINT","akaḥ","cintaka","noun-adj",""
"9","/","","","","punct",""
"10","prajñā","PRAJÑ","ā@","prajñā","noun-adj",""
"11","dīpa","DĪP","a@","dīpa","noun-adj",""
"12","vihāreṇa","VIHĀR","eṇa","vihāra","noun-adj",""
"13","paramāṃ","PARAM","āṃ","parama","noun-adj",""
"14","śāntim","ŚĀNT","im","śānti","noun-adj",""
"15","āgataḥ","ĀGAT","aḥ","āgata","noun-adj",""
"16","//","","","","punct",""
"","</s>","","","","",""
"","<s number=""52"">","","","","",""
"1","na","","","na","ind",""
"2","bodher","BODH","er","bodhi","noun-adj",""
"3","dūraṃ","DŪR","aṃ","dūra","noun-adj",""
"4","sañjñī","SAÑJÑ","ī","sañjñin","noun-adj",""
"5","syān","","","as","verb","as"
"6","na","","","na","ind",""
"7","s","","","su","ind",""
"8","āsannā","ĀSANN","ā","āsanna","noun-adj",""
"9","ca","","","ca","ind",""
"10","sañjñinaḥ","SAÑJÑ","inaḥ","sañjñin","noun-adj",""
"11","/","","","","punct",""
"12","ṣaṇṇāṃ","ṢAṆṆ","āṃ","ṣaṇṇa","noun-adj",""
"13","hi","","","hi","ind",""
"14","viṣaya","VIṢAY","a@","viṣaya","noun-adj",""
"15","ābhāso","ĀBHĀS","o","ābhāsa","noun-adj",""
"16","yathābhūtaṃ","YATHĀBHŪT","aṃ","yathābhūta","noun-adj",""
"17","parijñāyā","PARIJÑ","āyā","parijñā","noun-adj",""
"18","//","","","","punct",""
"","</s>","","","","",""
"","<s number=""53"">","","","","",""
"1","yathā","","","yathā","ind",""
"2","dakena","DAK","ena","daka","noun-adj",""
"3","sammiśraṃ","SAMMIŚR","aṃ","sammiśra","noun-adj",""
"4","kṣīram","KṢĪR","am","kṣīra","noun-adj",""
"5","ekatra","EKATR","a","ekatra","noun-adj",""
"6","bhājane","BHĀJAN","e","bhājana","noun-adj",""
"7","/","","","","punct",""
"8","kṣīraṃ","KṢĪR","aṃ","kṣīra","noun-adj",""
"9","pibanti","PIB","anti","pib","verb",""
"10","haṃsā","HAṂS","ā","haṃsa","noun-adj",""
"11","hi","","","hi","ind",""
"12","udakaṃ","UDAK","aṃ","udaka","noun-adj",""
"13","ca","","","ca","ind",""
"14","tathā","","","tathā","ind",""
"15","sthitam","STHIT","am","sthita","noun-adj",""
"16","//","","","","punct",""
"","</s>","","","","",""
"","<s number=""54"">","","","","",""
"1","evaṃ","","","eva","ind",""
"2","hi","","","hi","ind",""
"3","kleśa","KLEŚ","a@","kleśa","noun-adj",""
"4","sammiśraṃ","SAMMIŚR","aṃ","sammiśra","noun-adj",""
"5","jñānam","JÑĀN","am","jñāna","noun-adj",""
"6","ekatra","EKATR","a","ekatra","noun-adj",""
"7","bhājane","BHĀJAN","e","bhājana","noun-adj",""
"8","/","","","","punct",""
"9","pibanti","PIB","anti","pib","verb",""
"10","yogino","YOGIN","o","yoginī","noun-adj",""
"11","jñānam","JÑĀN","am","jñāna","noun-adj",""
"12","ajñānaṃ","AJÑĀN","aṃ","ajñāna","noun-adj",""
"13","sphorayanti","SPH","orayanti","sph","verb",""
"14","te","","","tad","pron",""
"15","//","","","","punct",""
"","</s>","","","","",""
"","<s number=""55"">","","","","",""
"1","ahaṃ","","","mat","pron",""
"2","mameti","MAM","eti","mam","verb",""
"3","vā","","","vā","ind",""
"4","grāho","GRĀH","o","grāha","noun-adj",""
"5","yāvad","YĀVAD","","yāvat","ind",""
"6","bāhyo","BĀHY","o","bāhya","noun-adj",""
"7","vikalpyate","VIKALP","yate","vikalp","verb","vikḷp"
"8","/","","","","punct",""
"9","dṛṣṭe","DṚṢṬ","e","dṛṣṭa","noun-adj",""
"10","viṣaya","VIṢAY","a@","viṣaya","noun-adj",""
"11","nairātmye","NAIRĀTMY","e","nairātmya","noun-adj",""
"12","bhava","BHAV","a@","bhava","noun-adj",""
"13","bījaṃ","BĪJ","aṃ","bīja","noun-adj",""
"14","nirudhyate","NIRUDH","yate","nirodh","verb","nirudh"
"15","//","","","","punct",""
"","</s>","","","","",""
"","<s number=""56"">","","","","",""
"1","buddho","BUDDH","o","buddha","noun-adj",""
"2","hi","","","hi","ind",""
"3","parinirvāti","PARINIRV","āti","parinirvāti","noun-adj",""
"4","śucir","ŚUC","ir","śuci","noun-adj",""
"5","nitya","NITY","a@","nitya","noun-adj",""
"6","śubha","ŚUBH","a@","śubha","noun-adj",""
"7","ālayaḥ","ĀLAY","aḥ","ālaya","noun-adj",""
"8","/","","","","punct",""
"9","kalpayanti","KALP","ayanti","kalp","verb","kḷp"
"10","dvayaṃ","DV","ayaṃ","dva","noun-adj",""
"11","bālā","BĀL","ā","bāla","noun-adj",""
"12","a","","","alpha_privativum","ind",""
"13","dvayaṃ","DVAY","aṃ","dvaya","noun-adj",""
"14","yogināṃ","YOGIN","āṃ","yoginī","noun-adj",""
"15","padam","PAD","am","pada","noun-adj",""
"16","//","","","","punct",""
"","</s>","","","","",""
"","<s number=""57"">","","","","",""
"1","duṣ","","","duḥ","ind",""
"2","karair","KAR","air","kara","noun-adj",""
"3","vividhair","VIVIDH","air","vividha","noun-adj",""
"4","dānaiḥ","DĀN","aiḥ","dāna","noun-adj",""
"5","śīlaiḥ","ŚĪL","aiḥ","śīla","noun-adj",""
"6","sattv","SATT","v","sattu","noun-adj",""
"7","ārtha","ARTH","a@","artha","noun-adj",""
"8","saṅgrahaiḥ","SAṂGRAH","aiḥ","saṃgraha","noun-adj",""
"9","/","","","","punct",""
"10","sattva","SATTV","a@","sattva","noun-adj",""
"11","opakāra","UPAKĀR","a@","upakāra","noun-adj",""
"12","kṣāntyā","KṢĀNT","yā","kṣānti","noun-adj",""
"13","ca","","","ca","ind",""
"14","dhātu","DHĀT","u@","dhātu","noun-adj",""
"15","puṣṭir","PUṢṬ","ir","puṣṭi","noun-adj",""
"16","iyaṃ","","","idam","pron",""
"17","tridhā","","","","ind",""
"18","//","","","","punct",""
"","</s>","","","","",""
"","<s number=""58"">","","","","",""
"1","vīryaṃ","VĪRY","aṃ","vīrya","noun-adj",""
"2","ca","","","ca","ind",""
"3","sarva","SARV","a@","sarva","noun-adj",""
"4","dharmeṣu","DHARM","eṣu","dharma","noun-adj",""
"5","dhyāne","DHYĀN","e","dhyāna","noun-adj",""
"6","cittaṃ","CITT","aṃ","citta","noun-adj",""
"7","pracāritam","PRACĀR","itam","pracāra","noun-adj",""
"8","/","","","","punct",""
"9","prajñāyām","PRAJÑ","āyām","prajñā","noun-adj",""
"10","a","","","alpha_privativum","ind",""
"11","calaṃ","CAL","aṃ","cala","noun-adj",""
"12","nityaṃ","NITY","aṃ","nitya","noun-adj",""
"13","bodhi","BODH","i@","bodhi","noun-adj",""
"14","puṣṭir","PUṢṬ","ir","puṣṭi","noun-adj",""
"15","iyaṃ","","","idam","pron",""
"16","punaḥ","","","punar","ind",""
"17","//","","","","punct",""
"","</s>","","","","",""
"","<s number=""59"">","","","","",""
"1","upāya","UPĀY","a@","upāya","noun-adj",""
"2","sahitā","SAHIT","ā","sa_saha","ind",""
"3","prajñā","PRAJÑ","ā","prajñā","noun-adj",""
"4","praṇidhānair","PRAṆIDHĀN","air","praṇidhāna","noun-adj",""
"5","viśodhitā","VIŚODHIT","ā","viśodhita","noun-adj",""
"6","/","","","","punct",""
"7","baleṣu","BAL","eṣu","bal","verb",""
"8","suṣṭhitaṃ","SUṢṬH","itaṃ","suṣṭhu","noun-adj",""
"9","jñānaṃ","JÑĀN","aṃ","jñāna","noun-adj",""
"10","dhātu","DHĀT","u@","dhātu","noun-adj",""
"11","puṣṭiś","PUṢṬ","iś","puṣṭi","noun-adj",""
"12","catur","CAT","ur@","catur","noun-adj",""
"13","vidhā","VIDH","ā","vidhā","noun-adj",""
"14","//","","","","punct",""
"","</s>","","","","",""
"","<s number=""60"">","","","","",""
"1","mā","","","mā","ind",""
"2","bhodhi","BHODH","i@","bhodhi","noun-adj",""
"3","sattvān","SATT","vān","sattvat","noun-adj",""
"4","tu","","","tu","ind",""
"5","vandeti","VAND","eti","vand","verb","vand"
"6","atidur","ATID","ur","atidā","noun-adj",""
"7","bhāṣitaṃ","BHĀṢIT","aṃ","bhāṣita","noun-adj",""
"8","kṛtam","KṚT","am","kṛta","noun-adj",""
"9","/","","","","punct",""
"10","bodhisattvam","BODHISATTV","am","bodhisattva","noun-adj",""
"11","a","","","alpha_privativum","ind",""
"12","jīvaṃ","JĪV","aṃ","jīva","noun-adj",""
"13","tu","","","tu","ind",""
"14","xxxxxxxxxx","","","CORRUPTED","ind",""
"15","//","","","","punct",""
"","</s>","","","","",""
"","<s number=""61"">","","","","",""
"1","xxxxxxxxxx","","","CORRUPTED","ind",""
"2","xxxxxxxxxx","","","CORRUPTED","ind",""
"3","xxxxxxxxxx","","","CORRUPTED","ind",""
"4","xxxxxxxxxx","","","CORRUPTED","ind",""
"5","//","","","","punct",""
"","</s>","","","","",""
"","<s number=""62"">","","","","",""
"1","xxxxxxxxxx","","","CORRUPTED","ind",""
"2","sannidhāya","SANNIDHĀY","a@","sannidhāya","noun-adj",""
"3","ātra","ĀTR","a","atra","noun-adj",""
"4","cintayet","CINTAY","et","cint","verb","cint"
"5","/","","","","punct",""
"6","guḍa","GUḌ","a@","guḍa","noun-adj",""
"7","śarkara","ŚARKAR","a@","śarkara","noun-adj",""
"8","khaṇḍānām","KHAṆḌ","ānām","khaṇḍa","noun-adj",""
"9","utpattis","UTPATT","is","utpatti","noun-adj",""
"10","tatra","","","tatra","ind",""
"11","jāyate","JĀ","yate","jan","verb","jan"
"12","//","","","","punct",""
"","</s>","","","","",""
"","<s number=""63"">","","","","",""
"1","rakṣite","RAKṢIT","e","rakṣita","noun-adj",""
"2","bodhicitte","BODHICITT","e","bodhicitta","noun-adj",""
"3","hi","","","hi","ind",""
"4","sannidhāya","SANNIDHĀY","a@","sannidhāya","noun-adj",""
"5","ātra","ĀTR","a","atra","noun-adj",""
"6","cintayet","CINTAY","et","cint","verb","cint"
"7","/","","","","punct",""
"8","arhat","ARHAT","","arhat","noun-adj",""
"9","pratyekabuddhānām","PRATYEKABUDDH","ānām","pratyekabuddha","noun-adj",""
"10","utpattis","UTPATT","is","utpatti","noun-adj",""
"11","tatra","","","tatra","ind",""
"12","jāyate","JĀ","yate","jan","verb","jan"
"13","//","","","","punct",""
"","</s>","","","","",""
"","<s number=""64"">","","","","",""
"1","yathā","","","yathā","ind",""
"2","śālyā","ŚĀL","yā","śāli","noun-adj",""
"3","ṅkura","ṄKUR","a@","ṅkura","noun-adj",""
"4","ādīnāṃ","ĀD","īnāṃ","ādi","noun-adj",""
"5","rakṣāṃ","RAKṢ","āṃ","rakṣā","noun-adj",""
"6","kurvanti","KUR","vanti","kar","verb","kṛ"
"7","kārṣikāḥ","KĀRṢ","ikāḥ","kārṣika","noun-adj",""
"8","/","","","","punct",""
"9","tath","","","tathā","ind",""
"10","^","","","","",""
"11","āśraya","ĀŚRAY","a@","āśraya","noun-adj",""
"12","ādhimuktānāṃ","ADHIMUKT","ānāṃ","adhimukta","noun-adj",""
"13","rakṣāṃ","RAKṢ","āṃ","rakṣā","noun-adj",""
"14","kurvanti","KUR","vanti","kar","verb","kṛ"
"15","nāyakāḥ","NĀYAK","āḥ","nāyaka","noun-adj",""
"16","//","","","","punct",""
"","</s>","","","","",""
"","<s number=""65"">","","","","",""
"1","yathā","","","yathā","ind",""
"2","kṛṣṇa","KṚṢṆ","a@","kṛṣṇa","noun-adj",""
"3","caturdaśyāṃ","CATURDAŚ","yāṃ","caturdaśi","noun-adj",""
"4","dṛśyate","DṚŚ","yate","darś","verb","dṛś"
"5","candra","CANDR","a@","candra","noun-adj",""
"6","vigraham","VIGRAH","am","vigraha","noun-adj",""
"7","/","","","","punct",""
"8","tathā","","","tathā","ind",""
"9","gr","","","","ind",""
"10","ayāna","AYĀN","a@","ayāna","noun-adj",""
"11","ādhimuktānāṃ","ADHIMUKT","ānāṃ","adhimukta","noun-adj",""
"12","dṛśyate","DṚŚ","yate","darś","verb","dṛś"
"13","buddha","BUDDH","a@","buddha","noun-adj",""
"14","vigraham","VIGRAH","am","vigraha","noun-adj",""
"15","//","","","","punct",""
"","</s>","","","","",""
"","<s number=""66"">","","","","",""
"1","yatha","YATH","a","yathā","ind",""
"2","^","","","","",""
"3","aiva","","","eva","ind",""
"4","bālacandrasya","BĀLACANDR","asya","bālacandra","noun-adj",""
"5","dṛṣṭā","DṚṢṬ","ā","dṛṣṭa","noun-adj",""
"6","vṛddhiḥ","VṚDDH","iḥ","vṛddhi","noun-adj",""
"7","kṣaṇe","KṢAṆ","e","kṣaṇa","noun-adj",""
"8","kṣaṇe","KṢAṆ","e","kṣaṇa","noun-adj",""
"9","/","","","","punct",""
"10","tathā","","","tathā","ind",""
"11","bhūmi","BHŪM","i@","bhūmi","noun-adj",""
"12","praviṣṭānāṃ","PRAVIṢṬ","ānāṃ","praviṣṭa","noun-adj",""
"13","dṛṣṭā","DṚṢṬ","ā","dṛṣṭa","noun-adj",""
"14","vṛddhiḥ","VṚDDH","iḥ","vṛddhi","noun-adj",""
"15","kṣaṇe","KṢAṆ","e","kṣaṇa","noun-adj",""
"16","kṣaṇe","KṢAṆ","e","kṣaṇa","noun-adj",""
"17","//","","","","punct",""
"","</s>","","","","",""
"","<s number=""67"">","","","","",""
"1","yathā","","","yathā","ind",""
"2","hi","","","hi","ind",""
"3","pañca","PAÑC","a@","pañca","noun-adj",""
"4","daśyāṃ","DAŚ","yāṃ","daśi","noun-adj",""
"5","vai","","","vai","ind",""
"6","pūrṇa","PŪRṆ","a@","pūrṇa","noun-adj",""
"7","candro","CANDR","o","candra","noun-adj",""
"8","hi","","","hi","ind",""
"9","jāyate","JĀ","yate","jan","verb","jan"
"10","/","","","","punct",""
"11","tathā","","","tathā","ind",""
"12","niṣṭha","NIṢṬH","a@","niṣṭha","noun-adj",""
"13","āgata","ĀGAT","a@","āgata","noun-adj",""
"14","ā","","","alpha_privativum","ind",""
"15","bhūmyāṃ","BHŪM","yāṃ","bhūmi","noun-adj",""
"16","dharmakāyo","DHARMAKĀY","o","dharmakāya","noun-adj",""
"17","hi","","","hi","ind",""
"18","jāyate","JĀ","yate","jan","verb","jan"
"19","//","","","","punct",""
"","</s>","","","","",""
"","<s number=""68"">","","","","",""
"1","adhimukti","ADHIMUKT","i@","adhimukti","noun-adj",""
"2","dṛḍhaṃ","DṚḌH","aṃ","dṛḍha","noun-adj",""
"3","yasya","","","yad","pron",""
"4","buddhe","BUDDH","e","buddha","noun-adj",""
"5","dharme","DHARM","e","dharma","noun-adj",""
"6","ca","","","ca","ind",""
"7","nityaśaḥ","NITYAŚ","aḥ","nityaśas","noun-adj",""
"8","/","","","","punct",""
"9","utpādayati","UTPĀD","ayati","utpad","verb","utpad"
"10","tac","","","tad","pron",""
"11","cittam","CITT","am","citta","noun-adj",""
"12","a","","","alpha_privativum","ind",""
"13","nivartyam","NIVARTY","am","nivartya","noun-adj",""
"14","bhave","BHAV","e","bhava","noun-adj",""
"15","bhave","BHAV","e","bhava","noun-adj",""
"16","//","","","","punct",""
"","</s>","","","","",""
"","<s number=""69"">","","","","",""
"1","kṛṣṇa","KṚṢṆ","a@","kṛṣṇa","noun-adj",""
"2","āśraya","ĀŚRAY","a@","āśraya","noun-adj",""
"3","parāvṛttiḥ","PARĀVṚTT","iḥ","parāvṛtti","noun-adj",""
"4","śukla","ŚUKL","a@","śukla","noun-adj",""
"5","āśraya","ĀŚRAY","a@","āśraya","noun-adj",""
"6","parigrahaḥ","PARIGRAH","aḥ","parigraha","noun-adj",""
"7","/","","","","punct",""
"8","tadā","","","tadā","ind",""
"9","tasy","","","tad","pron",""
"10","āvabodhena","AVABODH","ena","avabodha","noun-adj",""
"11","mudita","MUDIT","a@","mudita","noun-adj",""
"12","ety","","","iti","ind",""
"13","abhidhīyate","ABHIDHĪ","yate","abhidhīa","noun-adj",""
"14","//","","","","punct",""
"","</s>","","","","",""
"","<s number=""70"">","","","","",""
"1","m","","","","ind",""
"2","alimaṃ","ALIM","aṃ","alimat","noun-adj",""
"3","nitya","NITY","a@","nitya","noun-adj",""
"4","kālaṃ","KĀL","aṃ","kāla","noun-adj",""
"5","hi","","","hi","ind",""
"6","rāga","RĀG","a@","rāga","noun-adj",""
"7","ādy","ĀD","y@","ādi","noun-adj",""
"8","air","AIR","","aira","noun-adj",""
"9","vividhair","VIVIDH","air","vividha","noun-adj",""
"10","malaiḥ","MAL","aiḥ","mala","noun-adj",""
"11","/","","","","punct",""
"12","malā","MAL","ā@","mala","noun-adj",""
"13","bhāve","BHĀV","e","bhāva","noun-adj",""
"14","ca","","","ca","ind",""
"15","yā","","","yad","pron",""
"16","śuddhiḥ","ŚUDDH","iḥ","śuddhi","noun-adj",""
"17","vimala","VIMAL","a@","vimala","noun-adj",""
"18","ety","","","iti","ind",""
"19","abhidhīyate","ABHIDHĪ","yate","abhidhīa","noun-adj",""
"20","//","","","","punct",""
"","</s>","","","","",""
"","<s number=""71"">","","","","",""
"1","nirodhāt","NIRODH","āt","nirodha","noun-adj",""
"2","kleśa","KLEŚ","a@","kleśa","noun-adj",""
"3","jālasya","JĀL","asya","jāla","noun-adj",""
"4","prabhā","PRABH","ā@","prabhā","noun-adj",""
"5","bhrāja","BHRĀJ","a@","bhrāja","noun-adj",""
"6","vinirmalā","VINIRMAL","ā","vinirmala","noun-adj",""
"7","/","","","","punct",""
"8","a","","","alpha_privativum","ind",""
"9","pramāṇa","PRAMĀṆ","a@","pramāṇa","noun-adj",""
"10","āndhakārasya","ANDHAKĀR","asya","andhakāra","noun-adj",""
"11","vigatā","VIGAT","ā","vigatā","noun-adj",""
"12","tu","","","tu","ind",""
"13","prabhākarī","PRABHĀKAR","ī","prabhākarī","noun-adj",""
"14","//","","","","punct",""
"","</s>","","","","",""
"","<s number=""72"">","","","","",""
"1","śuddhā","ŚUDDH","ā","śuddha","noun-adj",""
"2","prabhāsvarā","PRABHĀSVAR","ā","prabhāsvara","noun-adj",""
"3","nityaṃ","NITY","aṃ","nitya","noun-adj",""
"4","s","","","su","ind",""
"5","aṅgajaiḥ","AṄGAJ","aiḥ","aṅgaja","noun-adj",""
"6","parivarjitā","PARIVARJIT","ā","parivarjita","noun-adj",""
"7","/","","","","punct",""
"8","jñāna","JÑĀN","a@","jñāna","noun-adj",""
"9","ārciṣaiḥ","ĀRC","iṣaiḥ","ārca","noun-adj",""
"10","parivṛtā","PARIVṚT","ā","parivṛta","noun-adj",""
"11","bhūmir","BHŪM","ir","bhūmi","noun-adj",""
"12","arciṣ","ARC","iṣ","arca","noun-adj",""
"13","matī","MAT","ī","mati","noun-adj",""
"14","matā","MAT","ā","mata","noun-adj",""
"15","//","","","","punct",""
"","</s>","","","","",""
"","<s number=""73"">","","","","",""
"1","sarv","SARV","","sarva","noun-adj",""
"2","avidya","AVIDY","a@","avidyā","noun-adj",""
"3","ākala","ĀKAL","a@","ākala","noun-adj",""
"4","ā","","","alpha_privativum","ind",""
"5","śilpa","ŚILP","a","śilpa","noun-adj",""
"6","dhyānānāṃ","DHYĀN","ānāṃ","dhyāna","noun-adj",""
"7","ca","","","ca","ind",""
"8","vicitratā","VICITR","atā","vicitratā","noun-adj",""
"9","/","","","","punct",""
"10","durjayānāṃ","DURJAY","ānāṃ","durjaya","noun-adj",""
"11","hi","","","hi","ind",""
"12","kleśānāṃ","KLEŚ","ānāṃ","kleśa","noun-adj",""
"13","vijayā","VIJAY","ā","vijayā","noun-adj",""
"14","tu","","","tu","ind",""
"15","su","","","su","ind",""
"16","durjayā","DURJAY","ā","durjaya","noun-adj",""
"17","//","","","","punct",""
"","</s>","","","","",""
"","<s number=""74"">","","","","",""
"1","ti","","","","ind",""
"2","sṛṇām","SṚṆ","ām","sṛṇā","noun-adj",""
"3","api","","","api","ind",""
"4","bodhīnāṃ","BODH","īnāṃ","bodhi","noun-adj",""
"5","saṅgrahaḥ","SAṂGRAH","aḥ","saṃgraha","noun-adj",""
"6","sarva","SARV","a@","sarva","noun-adj",""
"7","sampadām","SAMPAD","ām","sampadā","noun-adj",""
"8","/","","","","punct",""
"9","utpāda","UTPĀD","a@","utpāda","noun-adj",""
"10","vyaya","VYAY","a@","vyaya","noun-adj",""
"11","gambhīrā","GAMBHĪR","ā","gambhīrā","noun-adj",""
"12","bhūmis","BHŪM","is","bhūmi","noun-adj",""
"13","tv","","","tu","ind",""
"14","abhimukhī","ABHIMUKH","ī@","abhimukhī","noun-adj",""
"15","bhūtā","BHŪT","ā","bhūta","noun-adj",""
"16","//","","","","punct",""
"","</s>","","","","",""
"","<s number=""75"">","","","","",""
"1","krīḍate","KRĪḌ","ate","krīḍ","verb","krīḍ"
"2","raśmi","RAŚM","i@","raśmi","noun-adj",""
"3","jālena","JĀL","ena","jāla","noun-adj",""
"4","cakra","CAKR","a@","cakra","noun-adj",""
"5","vyūhaiḥ","VYŪH","aiḥ","vyūha","noun-adj",""
"6","samantataḥ","SAMANTAT","aḥ","samantatas","noun-adj",""
"7","/","","","","punct",""
"8","tri","TR","i@","tri","noun-adj",""
"9","lokāt","LOK","āt","loka","noun-adj",""
"10","tīrṇa","TĪRṆ","a@","tīrṇa","noun-adj",""
"11","paṅka","PAṄK","a@","paṅka","noun-adj",""
"12","ughair","UGH","air","ugha","noun-adj",""
"13","dūraṅ","DŪR","aṅ","dūra","noun-adj",""
"14","gamā","GAM","ā","gama","noun-adj",""
"15","iti","","","iti","ind",""
"16","smṛtā","SMṚT","ā","smṛta","noun-adj",""
"17","//","","","","punct",""
"","</s>","","","","",""
"","<s number=""76"">","","","","",""
"1","buddhaiḥ","BUDDH","aiḥ","buddha","noun-adj",""
"2","sand","SAN","d","sana","noun-adj",""
"3","hriyamāṇo","HR","iyamāṇo","hra","noun-adj",""
"4","asau","","","adas","pron",""
"5","praviṣṭo","PRAVIṢṬ","o","praviṣṭa","noun-adj",""
"6","jñāna","JÑĀN","a@","jñāna","noun-adj",""
"7","sāgare","SĀGAR","e","sāgara","noun-adj",""
"8","/","","","","punct",""
"9","an","","","alpha_privativum","ind",""
"10","ābhoga","ĀBHOG","a@","ābhoga","noun-adj",""
"11","vaśi","VAŚ","i@","vaśī","noun-adj",""
"12","prāptaḥ","PRĀPT","aḥ","prāpta","noun-adj",""
"13","a","","","alpha_privativum","ind",""
"14","kampyā","KAMPY","ā","kampya","noun-adj",""
"15","mārakiṅ","MĀRAK","iṅ","māraka","noun-adj",""
"16","karaiḥ","KAR","aiḥ","kara","noun-adj",""
"17","//","","","","punct",""
"","</s>","","","","",""
"","<s number=""77"">","","","","",""
"1","pratisaṃvitsu","PRATISAṂVIT","su","pratisaṃvita","noun-adj",""
"2","sarvāsu","SARV","āsu","sarvā","noun-adj",""
"3","sa","","","sa_saha","ind",""
"4","yogī","YOG","ī","yogin","noun-adj",""
"5","pāramī","PĀRAM","ī@","pāramī","noun-adj",""
"6","gataḥ","GAT","aḥ","gata","noun-adj",""
"7","/","","","","punct",""
"8","dharmade","DHARMAD","e","dharmada","noun-adj",""
"9","śana","ŚANA","","śana","noun-adj",""
"10","sāṅ","","","","ind",""
"11","kathyair","KATHY","air","kathya","noun-adj",""
"12","bhūmiḥ","BHŪM","iḥ","bhūmi","noun-adj",""
"13","sādhu","SĀDH","u@","sādhu","noun-adj",""
"14","matī","MAT","ī","mati","noun-adj",""
"15","smṛtā","SMṚT","ā","smṛta","noun-adj",""
"16","//","","","","punct",""
"","</s>","","","","",""
"","<s number=""78"">","","","","",""
"1","kāyaṃ","KĀY","aṃ","kāya","noun-adj",""
"2","jñānam","JÑĀN","am","jñāna","noun-adj",""
"3","ayaṃ","AYAṂ","","idam","pron",""
"4","rāmyam","RĀMY","am","rāmyā","noun-adj",""
"5","ākāśam","ĀKĀŚ","am","ākāśa","noun-adj",""
"6","iva","","","iva","ind",""
"7","nirmalam","NIRMAL","am","nirmala","noun-adj",""
"8","/","","","","punct",""
"9","sandhārayati","SANDHĀR","ayati","sandhar","verb","sandhṛ"
"10","buddhānāṃ","BUDDH","ānāṃ","buddha","noun-adj",""
"11","dharmameghā","DHARMAMEGH","ā","dharmamegha","noun-adj",""
"12","samantataḥ","SAMANTAT","aḥ","samantatas","noun-adj",""
"13","//","","","","punct",""
"","</s>","","","","",""
"","<s number=""79"">","","","","",""
"1","āśrayaḥ","ĀŚRAY","aḥ","āśraya","noun-adj",""
"2","sarva","SARV","a@","sarva","noun-adj",""
"3","dharmāṇāṃ","DHARM","āṇāṃ","dharma","noun-adj",""
"4","caryā","CARY","ā@","caryā","noun-adj",""
"5","phala","PHAL","a@","phala","noun-adj",""
"6","parigrahaḥ","PARIGRAH","aḥ","parigraha","noun-adj",""
"7","/","","","","punct",""
"8","āśrayasya","ĀŚRAY","asya","āśraya","noun-adj",""
"9","parāvṛttir","PARĀVṚTT","ir","parāvṛtti","noun-adj",""
"10","dharmakāyo","DHARMAKĀY","o","dharmakāya","noun-adj",""
"11","abhidhīyate","ABHIDHĪ","yate","abhidhīa","noun-adj",""
"12","//","","","","punct",""
"","</s>","","","","",""
"","<s number=""80"">","","","","",""
"1","acintyo","ACINTY","o","acintya","noun-adj",""
"2","vāsanād","VĀSAN","ād","vāsana","noun-adj",""
"3","muktaś","MUKT","aś","mukta","noun-adj",""
"4","cintyaḥ","CINTY","aḥ","cintya","noun-adj",""
"5","saṃsāra","SAṂSĀR","a@","saṃsāra","noun-adj",""
"6","vāsanaḥ","VĀSAN","aḥ","vāsana","noun-adj",""
"7","/","","","","punct",""
"8","tvam","","","tvat","pron",""
"9","acintyo","ACINTY","o","acintya","noun-adj",""
"10","asi","","","as","verb","as"
"11","sarveṣāṃ","SARV","eṣāṃ","sarva","noun-adj",""
"12","kas","","","kim","pron",""
"13","tvā","","","tvat","pron",""
"14","vijñātum","VIJÑĀT","um","vijān","verb","vijñā"
"15","arhati","ARHAT","i","arhat","noun-adj",""
"16","//","","","","punct",""
"","</s>","","","","",""
"","<s number=""81"">","","","","",""
"1","sarva","SARV","a@","sarva","noun-adj",""
"2","vāg","VĀG","@","vāk","noun-adj",""
"3","viṣay","VIṢAY","","viṣaya","noun-adj",""
"4","ātītaṃ","ATĪT","aṃ","atīta","noun-adj",""
"5","sarva","SARV","a@","sarva","noun-adj",""
"6","endriyam","INDRIY","am","indriya","noun-adj",""
"7","a","","","alpha_privativum","ind",""
"8","gocaram","GOCAR","am","gocara","noun-adj",""
"9","/","","","","punct",""
"10","mano","MAN","o@","manas","noun-adj",""
"11","vijñāna","VIJÑĀN","a@","vijñāna","noun-adj",""
"12","gamyo","GAMY","o","gamya","noun-adj",""
"13","asi","","","as","verb","as"
"14","yo","","","yad","pron",""
"15","asi","","","as","verb","as"
"16","yo","","","yad","pron",""
"17","asi","","","as","verb","as"
"18","namo","NAM","o","namas","noun-adj",""
"19","astu","","","as","verb","as"
"20","te","","","tad","pron",""
"21","//","","","","punct",""
"","</s>","","","","",""
"","<s number=""82"">","","","","",""
"1","krameṇa","KRAMEṆ","a","krameṇa","noun-adj",""
"2","samudānītā","SAMUDĀN","ītā","samudāna","noun-adj",""
"3","buddha","BUDDH","a@","buddha","noun-adj",""
"4","putrā","PUTR","ā","putra","noun-adj",""
"5","mahāyaśāḥ","MAHĀYAŚ","āḥ","mahāyaśas","noun-adj",""
"6","/","","","","punct",""
"7","dharmameghena","DHARMAMEGH","ena","dharmamegha","noun-adj",""
"8","jñānena","JÑĀN","ena","jñāna","noun-adj",""
"9","śūnyaṃ","ŚŪNY","aṃ","śūnya","noun-adj",""
"10","paśyanti","PAŚ","yanti","paś","verb","paś"
"11","dharmatām","DHARMAT","ām","dharmatā","noun-adj",""
"12","//","","","","punct",""
"","</s>","","","","",""
"","<s number=""83"">","","","","",""
"1","yadā","","","yadā","ind",""
"2","prakṣālitaṃ","PRAKṢĀLIT","aṃ","prakṣālita","noun-adj",""
"3","cittam","CITT","am","citta","noun-adj",""
"4","uttīrṇaṃ","UTTĪRṆ","aṃ","uttīrṇa","noun-adj",""
"5","bhava","BHAV","a@","bhava","noun-adj",""
"6","sāgarāt","SĀGAR","āt","sāgara","noun-adj",""
"7","/","","","","punct",""
"8","mahāpadmam","MAHĀPADM","am","mahāpadma","noun-adj",""
"9","ayaṃ","AYAṂ","","idam","pron",""
"10","tasya","","","tad","pron",""
"11","āsanaṃ","ĀSAN","aṃ","āsana","noun-adj",""
"12","sampratiṣṭhati","SAMPRATIṢṬH","ati","sampratiṣṭh","verb","samprasthā"
"13","//","","","","punct",""
"","</s>","","","","",""
"","<s number=""84"">","","","","",""
"1","aneka","ANEK","a@","aneka","noun-adj",""
"2","ratna","RATN","a@","ratna","noun-adj",""
"3","pattra","PATTR","a@","pattra","noun-adj",""
"4","ābhaṃ","ĀBH","aṃ","ābha","noun-adj",""
"5","lakṣaṇa","LAKṢAṆ","a@","lakṣaṇa","noun-adj",""
"6","ojjvala","UJJVAL","a@","ujjvala","noun-adj",""
"7","kalpikam","KALPIK","am","kalpika","noun-adj",""
"8","/","","","","punct",""
"9","anekaiḥ","ANEK","aiḥ","aneka","noun-adj",""
"10","padm","PADM","","padma","noun-adj",""
"11","a","","","alpha_privativum","ind",""
"12","kotoṭībhiḥ","KOT","oṭībhiḥ","kota","noun-adj",""
"13","samantāt","SAMANT","āt","samanta","noun-adj",""
"14","parivāritam","PARIVĀRIT","am","parivārita","noun-adj",""
"15","//","","","","punct",""
"","</s>","","","","",""
"","<s number=""85"">","","","","",""
"1","daś","DAŚ","","daśa","noun-adj",""
"2","abhīś","ABHI","iś","abhii","noun-adj",""
"3","ca","","","ca","ind",""
"4","balair","BAL","air","bala","noun-adj",""
"5","bālas","BĀL","as","bāla","noun-adj",""
"6","tiṣṭhate","TIṢṬH","ate","sthā","verb",""
"7","bālacandra","BĀLACANDR","a@","bālacandra","noun-adj",""
"8","vat","VAT","","vat","noun-adj",""
"9","/","","","","punct",""
"10","kleśair","KLEŚ","air","kleśa","noun-adj",""
"11","malina","MALIN","a@","malina","noun-adj",""
"12","sattvānāṃ","SATTV","ānāṃ","sattva","noun-adj",""
"13","na","","","na","ind",""
"14","paśyati","PAŚ","yati","paś","verb","paś"
"15","tathāgatam","TATHĀGAT","am","tathāgata","noun-adj",""
"16","//","","","","punct",""
"","</s>","","","","",""
"","<s number=""86"">","","","","",""
"1","yadā","","","yadā","ind",""
"2","pretāḥ","PRET","āḥ","preta","noun-adj",""
"3","samantāt","SAMANT","āt","samanta","noun-adj",""
"4","tu","","","tu","ind",""
"5","śuṣkaṃ","ŚUṢK","aṃ","śuṣka","noun-adj",""
"6","paśyanti","PAŚ","yanti","paś","verb","paś"
"7","sāgaram","SĀGAR","am","sāgara","noun-adj",""
"8","/","","","","punct",""
"9","tatha","TATH","a","tathā","ind",""
"10","^","","","","",""
"11","aiv","","","eva","ind",""
"12","ājñāna","ĀJÑĀN","a@","ājñāna","noun-adj",""
"13","dagdhānāṃ","DAGDH","ānāṃ","dagdha","noun-adj",""
"14","buddho","BUDDH","o","buddha","noun-adj",""
"15","n","","","na","ind",""
"16","^","","","","",""
"17","āsti","","","as","verb","as"
"18","iti","","","iti","ind",""
"19","kalpanā","KALPAN","ā","kalpanā","noun-adj",""
"20","//","","","","punct",""
"","</s>","","","","",""
"","<s number=""87"">","","","","",""
"1","sattvānām","SATTV","ānām","sattva","noun-adj",""
"2","alpa","ALP","a@","alpa","noun-adj",""
"3","puṇyānāṃ","PUṆY","ānāṃ","puṇya","noun-adj",""
"4","bhagavān","BHAGAV","ān","bhagavat","noun-adj",""
"5","kiṃ","","","kim","pron",""
"6","kariṣyati","KAR","iṣyati","kar","verb","kṛ"
"7","/","","","","punct",""
"8","jātya","JĀTY","a","jātya","noun-adj",""
"9","xxxxxxxxx","","","CORRUPTED","ind",""
"10","xxxxxxxxxx","","","CORRUPTED","ind",""
"11","//","","","","punct",""
"","</s>","","","","",""
"","</page>","","","","",""
"","</doc>","","","","",""
