"WordID","word","NormSTEM","suffix","lemma","PoS","Root"
"","<doc textid = ""adbhutadharmaparyaya"" genre = ""sūtra"" title = ""adbhutadharmaparyāya"" author = ""n /a"" discourse = ""homiletic"" tradition = ""buddh"" period = ""foundational"" source = ""gretil accessed aug 2019 : http://gretil.sub.uni-goettingen.de/gretil/corpustei/sa_.xml"" date_range = ""n/a"" notes = """" religion = ""buddh"" edition = ""based on the ed. by y. bentor 1988 page number = section number"" digitization = ""j.u. hartmann"" segmentation_lemmatization = ""ligeia lugli & buddhist translators workbench team"" metadata_enrichment = ""bruno galasek-hul & buddhist translators workbench team"" proofreader = ""n/a"" permission = ""permission for derivatives from m. mehner on behalf of gretil"" reconstructions = ""none"">","","","","",""
"","<page number=""0"">","","","","",""
"","<s number=""1"">","","","","",""
"1","adbhuta","ADBHUT","a@","adbhuta","noun-adj",""
"2","dharmaparyāya","DHARMAPARYĀY","a","dharmaparyāya","noun-adj",""
"","</s>","","","","",""
"4","evaṃ","","","eva","ind",""
"5","mayā","","","mat","pron",""
"6","śrutam","ŚRUT","am","śruta","noun-adj",""
"7","ekasmin","EK","asmin","eka","noun-adj",""
"8","samaye","SAMAY","e","samaya","noun-adj",""
"9","bhagavān","BHAGAV","ān","bhagavat","noun-adj",""
"10","śrāvastyāṃ","ŚRĀVAST","yāṃ","śrāvasti","noun-adj",""
"11","viharati","VIHAR","ati","vihar","verb","vihṛ"
"12","sma","","","sma","ind",""
"13","veṇuvane","VEṆUVAN","e","veṇuvana","noun-adj",""
"14","kalandaka","KALANDAK","a@","kalandaka","noun-adj",""
"15","nivāse","NIVĀS","e","nivāsa","noun-adj",""
"16","/","","","","punct",""
"","</s>","","","","",""
"","<s number=""2"">","","","","",""
"","</s>","","","","",""
"","<s number=""3"">","","","","",""
"","</page>","","","","",""
"","<page number=""1"">","","","","",""
"3","ath","","","atha","ind",""
"4","^","","","","",""
"5","āyuṣmān","ĀYUṢM","ān","āyuṣmat","noun-adj",""
"6","ānandaḥ","ĀNAND","aḥ","ānanda","noun-adj",""
"7","pūrvāhṇe","PŪRVĀHṆ","e","pūrvāhṇa","noun-adj",""
"8","nivāsya","NIVĀS","ya","nivās","verb",""
"9","pātra","PĀTR","a@","pātra","noun-adj",""
"10","cīvaram","CĪVAR","am","cīvara","noun-adj",""
"11","ādāya","ĀDĀY","a","ādāya","noun-adj",""
"12","rājagṛhaṃ","RĀJAGṚH","aṃ","rājagṛha","noun-adj",""
"13","piṇḍāya","PIṆḌ","āya","piṇḍa","noun-adj",""
"14","prāvi","PRĀV","i@","prāvi","noun-adj",""
"15","kṣat","KṢAT","","kṣata","noun-adj",""
"16","/","","","","punct",""
"","</s>","","","","",""
"","<s number=""4"">","","","","",""
"1","adrākṣīd","ADRĀKṢ","īd","adrākṣa","noun-adj",""
"2","āyuṣmān","ĀYUṢM","ān","āyuṣmat","noun-adj",""
"3","ānando","ĀNAND","o","ānanda","noun-adj",""
"4","rājagṛhe","RĀJAGṚH","e","rājagṛha","noun-adj",""
"5","nagare","NAGAR","e","nagara","noun-adj",""
"6","sāvadānaṃ","SĀVADĀN","aṃ","sāvadāna","noun-adj",""
"7","piṇḍāya","PIṆḌ","āya","piṇḍa","noun-adj",""
"8","caramāṇo","CAR","amāṇo","car","verb","car"
"9","anyatamasmin","ANYATAM","asmin","anyatama","noun-adj",""
"10","pradeśe","PRADEŚ","e","pradeśa","noun-adj",""
"11","kūṭāgāram","KŪṬĀGĀR","am","kūṭāgāra","noun-adj",""
"12","aśīti","AŚĪT","i@","aśīti","noun-adj",""
"13","dvāram","DVĀR","am","dvāra","noun-adj",""
"14","ullipta","ULLIPT","a@","ullipta","noun-adj",""
"15","āvaliptam","AVALIPT","am","avalipta","noun-adj",""
"16","ucchṛta","UCCHṚT","a@","ucchṛta","noun-adj",""
"17","dhvaja","DHVAJ","a@","dhvaja","noun-adj",""
"18","patākam","PATĀK","am","patākā","noun-adj",""
"19","āmukta","ĀMUKT","a@","āmukta","noun-adj",""
"20","paṭṭa","PAṬṬ","a@","paṭṭa","noun-adj",""
"21","dāma","DĀM","a@","dāma","noun-adj",""
"22","kalāpam","KALĀP","am","kalāpa","noun-adj",""
"23","/","","","","punct",""
"","</s>","","","","",""
"","<s number=""5"">","","","","",""
"1","dṛṣṭvā","DṚṢṬ","vā","darś","verb","dṛś"
"2","ca","","","ca","ind",""
"3","punas","","","punar","ind",""
"4","tasy","","","tad","pron",""
"5","aitad","AITAD","","tad","pron",""
"6","a","","","alpha_privativum","ind",""
"7","bhavat","BHAV","at","bhavat","noun-adj",""
"8","/","","","","punct",""
"","</s>","","","","",""
"","<s number=""6"">","","","","",""
"1","yaḥ","","","yad","pron",""
"2","kaścic","KAŚCI","c","kimcit","noun-adj",""
"3","chrāddhaḥ","ŚRĀDDH","aḥ","śrāddha","noun-adj",""
"4","kulaputro","KULAPUTR","o","kulaputra","noun-adj",""
"5","vā","","","vā","ind",""
"6","kuladuhitā","KULADUHIT","ā","kuladuhitṛ","noun-adj",""
"7","vā","","","vā","ind",""
"8","īdṛśaṃ","ĪDṚŚ","aṃ","īdṛśa","noun-adj",""
"9","kūṭāgāraṃ","KŪṬĀGĀR","aṃ","kūṭāgāra","noun-adj",""
"10","kārayitvā","KĀRAY","itvā","kāraya","noun-adj",""
"11","catur","CAT","ur","catur","noun-adj",""
"12","diśe","DIŚ","e","dik","noun-adj",""
"13","bhikṣu","BHIKṢ","u@","bhikṣu","noun-adj",""
"14","saṃghe","SAṂGH","e","saṃgha","noun-adj",""
"15","niryātayed","NIRYĀTAY","ed","niryāta","verb",""
"16","yo","","","yad","pron",""
"17","vā","","","vā","ind",""
"18","tathāgatasy","TATHĀGAT","asy","tathāgata","noun-adj",""
"19","ārhatḥ","ĀRHAT","ḥ","ārhata","noun-adj",""
"20","samyaksaṃbuddhasy","SAMYAKSAṂBUDDH","asy","samyaksaṃbuddha","noun-adj",""
"21","āmalaka","ĀMALAK","a@","āmalaka","noun-adj",""
"22","pramāṇaṃ","PRAMĀṆ","aṃ","pramāṇa","noun-adj",""
"23","stūpaṃ","STŪP","aṃ","stūpa","noun-adj",""
"24","pratiṣṭhāpayet","PRATIṢṬHĀPAY","et","pratiṣṭhāpay","verb","pratiṣṭhā"
"25","sūcī","SŪC","ī@","sūcī","noun-adj",""
"26","mātrāṃ","MĀTR","āṃ","mātra","noun-adj",""
"27","yaṣṭim","YAṢṬ","im","yaṣṭi","noun-adj",""
"28","āropayed","ĀROPAY","ed","āropa","verb",""
"29","badarī","BADAR","ī","badarī","noun-adj",""
"30","patra","PATR","a@","patra","noun-adj",""
"31","mātraṃ","MĀTR","aṃ","mātra","noun-adj",""
"32","cchatraṃ","ŚATR","aṃ","śatra","noun-adj",""
"33","yava","YAV","a@","yava","noun-adj",""
"34","phala","PHAL","a@","phala","noun-adj",""
"35","pramāṇāṃ","PRAMĀṆ","āṃ","pramāṇā","noun-adj",""
"36","pratimāṃ","PRATIM","āṃ","pratimā","noun-adj",""
"37","kārayet","KĀRAY","et","kāra","verb",""
"38","sarṣapa","SARṢAP","a@","sarṣapa","noun-adj",""
"39","hala","HAL","a@","hala","noun-adj",""
"40","pramāṇaṃ","PRAMĀṆ","aṃ","pramāṇa","noun-adj",""
"41","dhātuṃ","DHĀT","uṃ","dhātu","noun-adj",""
"42","pratiṣṭhāpayet","PRATIṢṬHĀPAY","et","pratiṣṭhāpay","verb","pratiṣṭhā"
"43","tat","TAT","","tad","pron",""
"44","katamaṃ","KATAM","aṃ","katama","noun-adj",""
"45","tataḥ","","","tatas","ind",""
"46","prabhūtataraṃ","PRABHŪT","ataraṃ","prabhūta","noun-adj",""
"47","puṇyaṃ","PUṆY","aṃ","puṇya","noun-adj",""
"48","syāt","","","as","verb","as"
"49","?","","","","punct",""
"","</s>","","","","",""
"","<s number=""7"">","","","","",""
"1","ath","","","atha","ind",""
"2","^","","","","",""
"3","āyuṣmata","ĀYUṢM","ata","āyuṣmat","noun-adj",""
"4","ānandasy","ĀNAND","asy","ānanda","noun-adj",""
"5","aitad","AITAD","","tad","pron",""
"6","a","","","alpha_privativum","ind",""
"7","bhavat","BHAV","at","bhavat","noun-adj",""
"8","/","","","","punct",""
"","</s>","","","","",""
"","<s number=""8"">","","","","",""
"1","śāstā","ŚĀST","ā","śastṛ","noun-adj",""
"2","me","","","mat","pron",""
"3","saṃmukhī","SAṂMUKH","ī@","saṃmukhī","noun-adj",""
"4","bhūtaḥ","BHŪT","aḥ","bhūta","noun-adj",""
"5","sugato","SUGAT","o","sugata","noun-adj",""
"6","me","","","mat","pron",""
"7","saṃmukhī","SAṂMUKH","ī@","saṃmukhī","noun-adj",""
"8","bhūtaḥ","BHŪT","aḥ","bhūta","noun-adj",""
"9","/","","","","punct",""
"","</s>","","","","",""
"","<s number=""9"">","","","","",""
"1","yaṇv","YAṆV","","yaṇva","noun-adj",""
"2","aham","AHAM","","mat","pron",""
"3","etam","ETAM","","tad","pron",""
"4","ev","","","eva","ind",""
"5","ārthaṃ","ARTH","aṃ","artha","noun-adj",""
"6","bhagavata","BHAGAV","ata","bhagavat","noun-adj",""
"7","ārocayeyaṃ","ĀROCAY","eyaṃ","āroca","verb",""
"8","yathā","","","yathā","ind",""
"9","me","","","mat","pron",""
"10","sa","","","sa_saha","ind",""
"11","bhagavāṃ","BHAGAV","āṃ","bhagavat","noun-adj",""
"12","vyākariṣyati","VYĀKAR","iṣyati","vyākar","verb","vyākṛ"
"13","tath","","","tathā","ind",""
"14","^","","","","",""
"15","āhaṃ","ĀHAṂ","","mat","pron",""
"16","dhārayiṣyāmi","DHĀR","ayiṣyāmi","dhar","verb","dhṛ"
"17","ity","","","iti","ind",""
"18","/","","","","punct",""
"","</s>","","","","",""
"","<s number=""10"">","","","","",""
"","</s>","","","","",""
"","<s number=""11"">","","","","",""
"","</page>","","","","",""
"","<page number=""2"">","","","","",""
"3","ath","","","atha","ind",""
"4","^","","","","",""
"5","āyuṣmān","ĀYUṢM","ān","āyuṣmat","noun-adj",""
"6","ānando","ĀNAND","o","ānanda","noun-adj",""
"7","rājagṛhe","RĀJAGṚH","e","rājagṛha","noun-adj",""
"8","nagare","NAGAR","e","nagara","noun-adj",""
"9","sāvadānaṃ","SĀVADĀN","aṃ","sāvadāna","noun-adj",""
"10","piṇḍāya","PIṆḌ","āya","piṇḍa","noun-adj",""
"11","caritvā","CAR","itvā","car","verb","car"
"12","kṛta","KṚT","a@","kṛta","noun-adj",""
"13","bhaktakṛtya","BHAKTAKṚTY","a","bhaktakṛtya","noun-adj",""
"14","paścādbhakta","PAŚCĀDBHAKT","a@","paścādbhakta","noun-adj",""
"15","piṇḍapāta","PIṆḌAPĀT","a@","piṇḍapāta","noun-adj",""
"16","pratikrāntaḥ","PRATIKRĀNT","aḥ","pratikrānta","noun-adj",""
"17","pātra","PĀTR","a@","pātra","noun-adj",""
"18","cīvaraṃ","CĪVAR","aṃ","cīvara","noun-adj",""
"19","pratiśamayya","PRATIŚAMAY","ya","pratiśamaya","noun-adj",""
"20","pādau","PĀD","au","pāda","noun-adj",""
"21","prakṣālya","PRAKṢĀLY","a","prakṣālya","noun-adj",""
"22","yena","","","yad","pron",""
"23","bhagavāṃs","BHAGAV","āṃs","bhagavat","noun-adj",""
"24","ten","","","tad","pron",""
"25","opasaṃkrānta","UPASAṂKRĀNT","a","upasaṃkrānta","noun-adj",""
"26","upasaṃkramya","UPASAṂKRAM","ya","upasaṃkrām","verb","upasaṃkram"
"27","bhagavataḥ","BHAGAV","ataḥ","bhagavat","noun-adj",""
"28","pādau","PĀD","au","pāda","noun-adj",""
"29","śirasā","ŚIRAS","ā","śiras","noun-adj",""
"30","vanditv","VANDIT","v","vanditu","noun-adj",""
"31","aikānte","EKĀNT","e","ekānta","noun-adj",""
"32","a","","","alpha_privativum","ind",""
"33","sthāt","STH","āt","sthā","noun-adj",""
"34","/","","","","punct",""
"","</s>","","","","",""
"","<s number=""12"">","","","","",""
"1","ekānta","EKĀNT","a@","ekānta","noun-adj",""
"2","sthita","STHIT","a","sthita","noun-adj",""
"3","āyuṣmān","ĀYUṢM","ān","āyuṣmat","noun-adj",""
"4","ānando","ĀNAND","o","ānanda","noun-adj",""
"5","bhagavantam","BHAGAV","antam","bhagavat","noun-adj",""
"6","idam","IDAM","","idam","pron",""
"7","avocat","AVOCAT","","vak","verb","vac"
"8","/","","","","punct",""
"","</s>","","","","",""
"","<s number=""13"">","","","","",""
"1","ih","","","iha","ind",""
"2","āhaṃ","ĀHAṂ","","mat","pron",""
"3","bhadanta","BHADANT","a","bhadanta","noun-adj",""
"4","pūrvāhṇe","PŪRVĀHṆ","e","pūrvāhṇa","noun-adj",""
"5","nivāsya","NIVĀS","ya","nivās","verb",""
"6","pātra","PĀTR","a@","pātra","noun-adj",""
"7","cīvaram","CĪVAR","am","cīvara","noun-adj",""
"8","ādāya","ĀDĀY","a","ādāya","noun-adj",""
"9","rājagṛhaṃ","RĀJAGṚH","aṃ","rājagṛha","noun-adj",""
"10","piṇḍāya","PIṆḌ","āya","piṇḍa","noun-adj",""
"11","prāvikṣaṃ","PRĀVIKṢ","aṃ","prāvikṣa","noun-adj",""
"12","/","","","","punct",""
"","</s>","","","","",""
"","<s number=""14"">","","","","",""
"1","so","","","tad","pron",""
"2","aham","AHAM","","mat","pron",""
"3","adrākṣam","ADRĀKṢ","am","adrākṣa","noun-adj",""
"4","rājagṛhe","RĀJAGṚH","e","rājagṛha","noun-adj",""
"5","nagare","NAGAR","e","nagara","noun-adj",""
"6","sāvadānaṃ","SĀVADĀN","aṃ","sāvadāna","noun-adj",""
"7","piṇḍāya","PIṆḌ","āya","piṇḍa","noun-adj",""
"8","caramāṇo","CAR","amāṇo","car","verb","car"
"9","anyatamasmin","ANYATAM","asmin","anyatama","noun-adj",""
"10","pradeśe","PRADEŚ","e","pradeśa","noun-adj",""
"11","kūṭāgāram","KŪṬĀGĀR","am","kūṭāgāra","noun-adj",""
"12","aśīti","AŚĪT","i@","aśīti","noun-adj",""
"13","dvāram","DVĀR","am","dvāra","noun-adj",""
"14","ullipta","ULLIPT","a@","ullipta","noun-adj",""
"15","āvaliptam","AVALIPT","am","avalipta","noun-adj",""
"16","ucchṛta","UCCHṚT","a@","ucchṛta","noun-adj",""
"17","dhvaja","DHVAJ","a@","dhvaja","noun-adj",""
"18","patākam","PATĀK","am","patākā","noun-adj",""
"19","āmukta","ĀMUKT","a@","āmukta","noun-adj",""
"20","paṭṭa","PAṬṬ","a@","paṭṭa","noun-adj",""
"21","dāma","DĀM","a@","dāma","noun-adj",""
"22","kalāpaṃ","KALĀP","aṃ","kalāpa","noun-adj",""
"23","ca","","","ca","ind",""
"24","dṛṣṭvā","DṚṢṬ","vā","darś","verb","dṛś"
"25","ca","","","ca","ind",""
"26","punar","","","punar","ind",""
"27","me","","","mat","pron",""
"28","etad","ETAD","","tad","pron",""
"29","a","","","alpha_privativum","ind",""
"30","bhavat","BHAV","at","bhavat","noun-adj",""
"31","/","","","","punct",""
"","</s>","","","","",""
"","<s number=""15"">","","","","",""
"1","yaḥ","","","yad","pron",""
"2","kaścic","KAŚCI","c","kimcit","noun-adj",""
"3","chrāddhaḥ","ŚRĀDDH","aḥ","śrāddha","noun-adj",""
"4","kulaputro","KULAPUTR","o","kulaputra","noun-adj",""
"5","vā","","","vā","ind",""
"6","kuladuhitā","KULADUHIT","ā","kuladuhitṛ","noun-adj",""
"7","vā","","","vā","ind",""
"8","īdṛśaṃ","ĪDṚŚ","aṃ","īdṛśa","noun-adj",""
"9","kūṭāgāraṃ","KŪṬĀGĀR","aṃ","kūṭāgāra","noun-adj",""
"10","catur","CAT","ur","catur","noun-adj",""
"11","diśe","DIŚ","e","dik","noun-adj",""
"12","bhikṣu","BHIKṢ","u@","bhikṣu","noun-adj",""
"13","saṃghe","SAṂGH","e","saṃgha","noun-adj",""
"14","niryātayed","NIRYĀTAY","ed","niryāta","verb",""
"15","yo","","","yad","pron",""
"16","vā","","","vā","ind",""
"17","tathāgatasy","TATHĀGAT","asy","tathāgata","noun-adj",""
"18","ārhatḥ","ĀRHAT","ḥ","ārhata","noun-adj",""
"19","samyaksaṃbuddhasya","SAMYAKSAṂBUDDH","asya","samyaksaṃbuddha","noun-adj",""
"20","parinirvṛtasya","PARINIRVṚT","asya","parinirvṛta","noun-adj",""
"21","mṛttikā","MṚTTIK","ā@","mṛttikā","noun-adj",""
"22","piṇḍād","PIṆḌ","ād","piṇḍa","noun-adj",""
"23","āmalaka","ĀMALAK","a@","āmalaka","noun-adj",""
"24","pramāṇaṃ","PRAMĀṆ","aṃ","pramāṇa","noun-adj",""
"25","stūpaṃ","STŪP","aṃ","stūpa","noun-adj",""
"26","pratiṣṭhāpayet","PRATIṢṬHĀPAY","et","pratiṣṭhāpay","verb","pratiṣṭhā"
"27","sūcī","SŪC","ī@","sūcī","noun-adj",""
"28","mātrāṃ","MĀTR","āṃ","mātra","noun-adj",""
"29","yaṣṭim","YAṢṬ","im","yaṣṭi","noun-adj",""
"30","āropayed","ĀROPAY","ed","āropa","verb",""
"31","badarī","BADAR","ī","badarī","noun-adj",""
"32","patra","PATR","a@","patra","noun-adj",""
"33","mātraṃ","MĀTR","aṃ","mātra","noun-adj",""
"34","cchatraṃ","ŚATR","aṃ","śatra","noun-adj",""
"35","yava","YAV","a@","yava","noun-adj",""
"36","phala","PHAL","a@","phala","noun-adj",""
"37","pramāṇāṃ","PRAMĀṆ","āṃ","pramāṇā","noun-adj",""
"38","pratimāṃ","PRATIM","āṃ","pratimā","noun-adj",""
"39","kārayet","KĀRAY","et","kāra","verb",""
"40","sarṣapa","SARṢAP","a@","sarṣapa","noun-adj",""
"41","hala","HAL","a@","hala","noun-adj",""
"42","pramāṇaṃ","PRAMĀṆ","aṃ","pramāṇa","noun-adj",""
"43","dhātuṃ","DHĀT","uṃ","dhātu","noun-adj",""
"44","pratiṣṭhāpayet","PRATIṢṬHĀPAY","et","pratiṣṭhāpay","verb","pratiṣṭhā"
"45","tat","TAT","","tad","pron",""
"46","katamaṃ","KATAM","aṃ","katama","noun-adj",""
"47","tataḥ","","","tatas","ind",""
"48","prabhūtataraṃ","PRABHŪT","ataraṃ","prabhūta","noun-adj",""
"49","puṇyaṃ","PUṆY","aṃ","puṇya","noun-adj",""
"50","syāt","","","as","verb","as"
"51","?","","","","punct",""
"","</s>","","","","",""
"","<s number=""16"">","","","","",""
"1","tasya","","","tad","pron",""
"2","mama","MAM","a@","mat","pron",""
"3","aitad","AITAD","","tad","pron",""
"4","a","","","alpha_privativum","ind",""
"5","bhavat","BHAV","at","bhavat","noun-adj",""
"6","/","","","","punct",""
"","</s>","","","","",""
"","<s number=""17"">","","","","",""
"1","śāstā","ŚĀST","ā","śastṛ","noun-adj",""
"2","me","","","mat","pron",""
"3","saṃmukhī","SAṂMUKH","ī@","saṃmukhī","noun-adj",""
"4","bhūtaḥ","BHŪT","aḥ","bhūta","noun-adj",""
"5","sugato","SUGAT","o","sugata","noun-adj",""
"6","me","","","mat","pron",""
"7","saṃmukhī","SAṂMUKH","ī@","saṃmukhī","noun-adj",""
"8","bhūtaḥ","BHŪT","aḥ","bhūta","noun-adj",""
"9","/","","","","punct",""
"","</s>","","","","",""
"","<s number=""18"">","","","","",""
"1","yanv","","","","ind",""
"2","aham","AHAM","","mat","pron",""
"3","etam","ETAM","","tad","pron",""
"4","ev","","","eva","ind",""
"5","ārthaṃ","ARTH","aṃ","artha","noun-adj",""
"6","bhagavata","BHAGAV","ata","bhagavat","noun-adj",""
"7","ārocayeyaṃ","ĀROCAY","eyaṃ","āroca","verb",""
"8","yathā","","","yathā","ind",""
"9","bhagavāṃ","BHAGAV","āṃ","bhagavat","noun-adj",""
"10","vyākariṣyati","VYĀKAR","iṣyati","vyākar","verb","vyākṛ"
"11","tath","","","tathā","ind",""
"12","^","","","","",""
"13","āhaṃ","ĀHAṂ","","mat","pron",""
"14","dhārayiṣyāmi","DHĀR","ayiṣyāmi","dhar","verb","dhṛ"
"15","ity","","","iti","ind",""
"16","/","","","","punct",""
"","</s>","","","","",""
"","<s number=""19"">","","","","",""
"","</s>","","","","",""
"","<s number=""20"">","","","","",""
"","</page>","","","","",""
"","<page number=""3"">","","","","",""
"3","evam","","","eva","ind",""
"4","ukte","UKT","e","ukta","noun-adj",""
"5","bhagavān","BHAGAV","ān","bhagavat","noun-adj",""
"6","āyuṣmantam","ĀYUṢM","antam","āyuṣmat","noun-adj",""
"7","ānanda","ĀNAND","a","ānanda","noun-adj",""
"8",";","","","","punct",""
"9","idam","IDAM","","idam","pron",""
"10","avocat","AVOCAT","","vak","verb","vac"
"11","/","","","","punct",""
"","</s>","","","","",""
"","<s number=""21"">","","","","",""
"1","sādhu","SĀDH","u@","sādhu","noun-adj",""
"2","sādhv","SĀDHV","","sādhvī","noun-adj",""
"3","ānanda","ĀNAND","a","ānanda","noun-adj",""
"4","bahujana","BAHUJAN","a@","bahujana","noun-adj",""
"5","hitāya","HIT","āya","hita","noun-adj",""
"6","tvam","","","tvat","pron",""
"7","ānanda","ĀNAND","a","ānanda","noun-adj",""
"8","pratipanno","PRATIPANN","o","pratipanna","noun-adj",""
"9","ca","","","ca","ind",""
"10","bahujana","BAHUJAN","a@","bahujana","noun-adj",""
"11","sukhāya","SUKH","āya","sukha","noun-adj",""
"12","loka","LOK","a@","loka","noun-adj",""
"13","ānukampāyai","ANUKAMP","āyai","anukampā","noun-adj",""
"14","arthāya","ARTH","āya","artha","noun-adj",""
"15","hitāya","HIT","āya","hita","noun-adj",""
"16","sukhāya","SUKH","āya","sukha","noun-adj",""
"17","deva","DEV","a@","deva","noun-adj",""
"18","manuṣyāṇāṃ","MANUṢY","āṇāṃ","manuṣya","noun-adj",""
"19","yas","","","yad","pron",""
"20","tvaṃ","","","tvat","pron",""
"21","tathāgatam","TATHĀGAT","am","tathāgata","noun-adj",""
"22","etam","ETAM","","tad","pron",""
"23","ev","","","eva","ind",""
"24","ārthaṃ","ARTH","aṃ","artha","noun-adj",""
"25","paripraṣṭavyaṃ","PARIPRAṢ","ṭavyaṃ","paripraṣa","noun-adj",""
"26","manyase","MAN","yase","man","verb","man"
"27","/","","","","punct",""
"","</s>","","","","",""
"","<s number=""22"">","","","","",""
"1","tena","","","tad","pron",""
"2","hy","","","hi","ind",""
"3","ānanda","ĀNAND","a","ānanda","noun-adj",""
"4","śṛṇu","ŚṚṆ","u@","śṛṇu","noun-adj",""
"5","sādhu","SĀDH","u","sādh","verb",""
"6","ca","","","ca","ind",""
"7","suṣṭhu","SUṢṬH","u","suṣṭhu","noun-adj",""
"8","ca","","","ca","ind",""
"9","manasi","MANAS","i@","manasi","noun-adj",""
"10","kuru","KUR","u","kar","verb","kṛ"
"11",";","","","","punct",""
"12","bhāṣiṣye","BHĀṢ","iṣye","bhāṣ","verb","bhāṣ"
"13","/","","","","punct",""
"","</s>","","","","",""
"","<s number=""23"">","","","","",""
"1","jambūdvīpo","JAMBŪDVĪP","o","jambūdvīpa","noun-adj",""
"2","hy","","","hi","ind",""
"3","ānanda","ĀNAND","a","ānanda","noun-adj",""
"4","dvīpaḥ","DVĪP","aḥ","dvīpa","noun-adj",""
"5","sapta","SAPT","a@","sapta","noun-adj",""
"6","yojana","YOJAN","a@","yojana","noun-adj",""
"7","sahasrāṇy","SAHASR","āṇy","sa_saha","ind",""
"8","āyāma","ĀYĀM","a@","āyāma","noun-adj",""
"9","vistāreṇa","VISTĀR","eṇa","vistāra","noun-adj",""
"10","uttara","UTTAR","a@","uttara","noun-adj",""
"11","viśālo","VIŚĀL","o","viśāla","noun-adj",""
"12","dakṣiṇena","DAKṢIṆ","ena","dakṣiṇa","noun-adj",""
"13","śakaṭa","ŚAKAṬ","a@","śakaṭa","noun-adj",""
"14","āmukhaḥ","ĀMUKH","aḥ","āmukha","noun-adj",""
"15","tam","","","tad","pron",""
"16","enam","","","ena","ind",""
"17","kāscic","KĀS","cic","kimcit","noun-adj",""
"18","chrāddhaḥ","ŚRĀDDH","aḥ","śrāddha","noun-adj",""
"19","kulaputro","KULAPUTR","o","kulaputra","noun-adj",""
"20","vā","","","vā","ind",""
"21","kuladuhitā","KULADUHIT","ā","kuladuhitṛ","noun-adj",""
"22","vā","","","vā","ind",""
"23","saptaratnamayaṃ","SAPTARATNAMAY","aṃ","saptaratnamaya","noun-adj",""
"24","kṛtvā","KṚT","vā","kṛta","noun-adj",""
"25","srotāpannebhyaḥ","SROTĀPANN","ebhyaḥ","srotāpanna","noun-adj",""
"26","sakṛdāgāmibhyo","SAKṚDĀGĀM","ibhyo","sakṛdāgāmin","noun-adj",""
"27","an","","","alpha_privativum","ind",""
"28","āgāmibhyo","ĀGĀM","ibhyo","āgāmin","noun-adj",""
"29","arhadbhyaḥ","ARH","adbhyaḥ","arhat","noun-adj",""
"30","pratyekabuddhebhyaś","PRATYEKABUDDH","ebhyaś","pratyekabuddha","noun-adj",""
"31","cāturdiśe","CĀTURDIŚ","e","cāturdiśa","noun-adj",""
"32","vā","","","vā","ind",""
"33","bhkiṣu","","","","ind",""
"34","saṃghe","SAṂGH","e","saṃgha","noun-adj",""
"35","niryātayet","NIRYĀTAY","et","niryāta","verb",""
"36","/","","","","punct",""
"","</s>","","","","",""
"","<s number=""24"">","","","","",""
"1","yo","","","yad","pron",""
"2","vā","","","vā","ind",""
"3","tathāgatasy","TATHĀGAT","asy","tathāgata","noun-adj",""
"4","ārhataḥ","ĀRHAT","aḥ","ārhata","noun-adj",""
"5","samyak","SAMYA","k","samyak","noun-adj",""
"6","a","","","alpha_privativum","ind",""
"7","saṃbuddhasya","SAṂBUDDH","asya","saṃbuddha","noun-adj",""
"8","parinirvṛtasya","PARINIRVṚT","asya","parinirvṛta","noun-adj",""
"9","mṛttikā","MṚTTIK","ā@","mṛttikā","noun-adj",""
"10","piṇḍād","PIṆḌ","ād","piṇḍa","noun-adj",""
"11","āmalaka","ĀMALAK","a@","āmalaka","noun-adj",""
"12","phala","PHAL","a@","phala","noun-adj",""
"13","pramāṇaṃ","PRAMĀṆ","aṃ","pramāṇa","noun-adj",""
"14","stūpaṃ","STŪP","aṃ","stūpa","noun-adj",""
"15","pratiṣṭhāpayet","PRATIṢṬHĀPAY","et","pratiṣṭhāpay","verb","pratiṣṭhā"
"16","sūcī","SŪC","ī@","sūcī","noun-adj",""
"17","mātrāṃ","MĀTR","āṃ","mātra","noun-adj",""
"18","vā","","","vā","ind",""
"19","yaṣṭim","YAṢṬ","im","yaṣṭi","noun-adj",""
"20","āropayet","ĀROPAY","et","āropa","verb",""
"21","badarī","BADAR","ī","badarī","noun-adj",""
"22","patra","PATR","a@","patra","noun-adj",""
"23","mātra","MĀTR","a@","mātra","noun-adj",""
"24","cchattram","ŚATTR","am","śattri","noun-adj",""
"25","yava","YAV","a@","yava","noun-adj",""
"26","phala","PHAL","a@","phala","noun-adj",""
"27","pramāṇaṃ","PRAMĀṆ","aṃ","pramāṇa","noun-adj",""
"28","pratimāṃ","PRATIM","āṃ","pratimā","noun-adj",""
"29","kārayet","KĀRAY","et","kāra","verb",""
"30","sarṣapa","SARṢAP","a@","sarṣapa","noun-adj",""
"31","hala","HAL","a@","hala","noun-adj",""
"32","pramāṇaṃ","PRAMĀṆ","aṃ","pramāṇa","noun-adj",""
"33","dhātuṃ","DHĀT","uṃ","dhātu","noun-adj",""
"34","pratiṣṭhāpayet","PRATIṢṬHĀPAY","et","pratiṣṭhāpay","verb","pratiṣṭhā"
"35",";","","","","punct",""
"36","idam","IDAM","","idam","pron",""
"37","ev","","","eva","ind",""
"38","ānanda","ĀNAND","a","ānanda","noun-adj",""
"39","tataḥ","","","tatas","ind",""
"40","prabhūtataraṃ","PRABHŪT","ataraṃ","prabhūta","noun-adj",""
"41","puṇyaṃ","PUṆY","aṃ","puṇya","noun-adj",""
"42","vadāmi","VAD","āmi","vad","verb","vad"
"43","/","","","","punct",""
"","</s>","","","","",""
"","<s number=""25"">","","","","",""
"","</s>","","","","",""
"","<s number=""26"">","","","","",""
"","</page>","","","","",""
"","<page number=""4"">","","","","",""
"3","tiṣṭhatv","TIṢṬH","atv","tiṣṭh","verb","sthā"
"4","ānanda","ĀNAND","a","ānanda","noun-adj",""
"5","jambūdvīpo","JAMBŪDVĪP","o","jambūdvīpa","noun-adj",""
"6","dvīpaḥ","DVĪP","aḥ","dvīpa","noun-adj",""
"7","/","","","","punct",""
"","</s>","","","","",""
"","<s number=""27"">","","","","",""
"1","asty","ASTY","","as","verb","as"
"2","ānanda","ĀNAND","a","ānanda","noun-adj",""
"3","pūrvavideho","PŪRVAVIDEH","o","pūrvavideha","noun-adj",""
"4","nāma","NĀM","a","nāman","noun-adj",""
"5","dvīpo","DVĪP","o","dvīpa","noun-adj",""
"6","aṣṭau","AṢṬ","au","aṣṭa","noun-adj",""
"7","yojana","YOJAN","a@","yojana","noun-adj",""
"8","sahasrāṇy","SAHASR","āṇy","sa_saha","ind",""
"9","āyāma","ĀYĀM","a@","āyāma","noun-adj",""
"10","vistāreṇa","VISTĀR","eṇa","vistāra","noun-adj",""
"11","samantād","SAMANT","ād","samanta","noun-adj",""
"12","ardhacandra","ARDHACANDR","a@","ardhacandra","noun-adj",""
"13","ākāra","ĀKĀR","a@","ākāra","noun-adj",""
"14","pariṇāmitaḥ","PARIṆĀM","itaḥ","pariṇāma","noun-adj",""
"15","/","","","","punct",""
"","</s>","","","","",""
"","<s number=""28"">","","","","",""
"1","tam","","","tad","pron",""
"2","enaṃ","","","ena","ind",""
"3","kaścit","","","kimcit","ind",""
"4","śrāddhaḥ","ŚRĀDDH","aḥ","śrāddha","noun-adj",""
"5","kulaputro","KULAPUTR","o","kulaputra","noun-adj",""
"6","vā","","","vā","ind",""
"7","kuladuhitā","KULADUHIT","ā","kuladuhitṛ","noun-adj",""
"8","vā","","","vā","ind",""
"9","saptaratnamayaṃ","SAPTARATNAMAY","aṃ","saptaratnamaya","noun-adj",""
"10","kṛtvā","KṚT","vā","kṛta","noun-adj",""
"11","cāturdiśe","CĀTURDIŚ","e","cāturdiśa","noun-adj",""
"12","bhkiṣu","","","","ind",""
"13","saṃghe","SAṂGH","e","saṃgha","noun-adj",""
"14","niryātayet","NIRYĀTAY","et","niryāta","verb",""
"15","yo","","","yad","pron",""
"16","vā","","","vā","ind",""
"17","tathāgatasy","TATHĀGAT","asy","tathāgata","noun-adj",""
"18","ārhataḥ","ĀRHAT","aḥ","ārhata","noun-adj",""
"19","samyak","SAMYA","k","samyak","noun-adj",""
"20","a","","","alpha_privativum","ind",""
"21","saṃbuddhasya","SAṂBUDDH","asya","saṃbuddha","noun-adj",""
"22","parinirvṛttasya","PARINIRVṚT","tasya","parinirvṛta","noun-adj",""
"23","mṛta","MṚT","a@","mṛta","noun-adj",""
"24","piṇḍād","PIṆḌ","ād","piṇḍa","noun-adj",""
"25","āmalaka","ĀMALAK","a@","āmalaka","noun-adj",""
"26","phala","PHAL","a@","phala","noun-adj",""
"27","pramāṇaṃ","PRAMĀṆ","aṃ","pramāṇa","noun-adj",""
"28","stūpaṃ","STŪP","aṃ","stūpa","noun-adj",""
"29","pratiṣṭhāpayet","PRATIṢṬHĀPAY","et","pratiṣṭhāpay","verb","pratiṣṭhā"
"30","sūcī","SŪC","ī@","sūcī","noun-adj",""
"31","mātrāṃ","MĀTR","āṃ","mātra","noun-adj",""
"32","yaṣṭim","YAṢṬ","im","yaṣṭi","noun-adj",""
"33","āropayed","ĀROPAY","ed","āropa","verb",""
"34","badarī","BADAR","ī","badarī","noun-adj",""
"35","patra","PATR","a@","patra","noun-adj",""
"36","mātraṃ","MĀTR","aṃ","mātra","noun-adj",""
"37","cchattram","ŚATTR","am","śattri","noun-adj",""
"38","yava","YAV","a@","yava","noun-adj",""
"39","phala","PHAL","a@","phala","noun-adj",""
"40","pramāṇaṃ","PRAMĀṆ","aṃ","pramāṇa","noun-adj",""
"41","pratimāṃ","PRATIM","āṃ","pratimā","noun-adj",""
"42","kārayet","KĀRAY","et","kāra","verb",""
"43","sarṣapa","SARṢAP","a@","sarṣapa","noun-adj",""
"44","hala","HAL","a@","hala","noun-adj",""
"45","pramāṇaṃ","PRAMĀṆ","aṃ","pramāṇa","noun-adj",""
"46","dhātuṃ","DHĀT","uṃ","dhātu","noun-adj",""
"47","pratiṣṭhāpayet","PRATIṢṬHĀPAY","et","pratiṣṭhāpay","verb","pratiṣṭhā"
"48","idam","IDAM","","idam","pron",""
"49","ev","","","eva","ind",""
"50","ānanda","ĀNAND","a","ānanda","noun-adj",""
"51","tataḥ","","","tatas","ind",""
"52","bahutaraṃ","BAH","utaraṃ","bahu","noun-adj",""
"53","puṇyaṃ","PUṆY","aṃ","puṇya","noun-adj",""
"54","vadāmi","VAD","āmi","vad","verb","vad"
"55","/","","","","punct",""
"","</s>","","","","",""
"","<s number=""29"">","","","","",""
"","</s>","","","","",""
"","<s number=""30"">","","","","",""
"","</page>","","","","",""
"","<page number=""5"">","","","","",""
"3","tiṣṭhatv","TIṢṬH","atv","tiṣṭh","verb","sthā"
"4","ānanda","ĀNAND","a","ānanda","noun-adj",""
"5","jambūdvīpo","JAMBŪDVĪP","o","jambūdvīpa","noun-adj",""
"6","dvīpaḥ","DVĪP","aḥ","dvīpa","noun-adj",""
"7","/","","","","punct",""
"","</s>","","","","",""
"","<s number=""31"">","","","","",""
"1","asty","ASTY","","as","verb","as"
"2","ānanda","ĀNAND","a@","ānanda","noun-adj",""
"3","āvaragodānīyo","AVARAGODĀNĪY","o","avaragodānīya","noun-adj",""
"4","nāma","NĀM","a","nāman","noun-adj",""
"5","dvīpo","DVĪP","o","dvīpa","noun-adj",""
"6","nava","NAV","a@","nava","noun-adj",""
"7","yojana","YOJAN","a@","yojana","noun-adj",""
"8","sahasrāṇy","SAHASR","āṇy","sa_saha","ind",""
"9","āyāma","ĀYĀM","a@","āyāma","noun-adj",""
"10","vistāreṇa","VISTĀR","eṇa","vistāra","noun-adj",""
"11","samantāt","SAMANT","āt","samanta","noun-adj",""
"12","pūrṇacandra","PŪRṆACANDR","a@","pūrṇacandra","noun-adj",""
"13","ākāra","ĀKĀR","a@","ākāra","noun-adj",""
"14","pariṇāmitaḥ","PARIṆĀM","itaḥ","pariṇāma","noun-adj",""
"15","/","","","","punct",""
"","</s>","","","","",""
"","<s number=""32"">","","","","",""
"1","tam","","","tad","pron",""
"2","enaṃ","","","ena","ind",""
"3","kaścic","KAŚCI","c","kimcit","noun-adj",""
"4","chrāddhaḥ","ŚRĀDDH","aḥ","śrāddha","noun-adj",""
"5","kulaputro","KULAPUTR","o","kulaputra","noun-adj",""
"6","vā","","","vā","ind",""
"7","kuladuhitā","KULADUHIT","ā","kuladuhitṛ","noun-adj",""
"8","vā","","","vā","ind",""
"9","saptaratnamayaṃ","SAPTARATNAMAY","aṃ","saptaratnamaya","noun-adj",""
"10","kṛtvā","KṚT","vā","kṛta","noun-adj",""
"11","yāvac","YĀV","ac","yāvat","ind",""
"12","cāturdiśe","CĀTURDIŚ","e","cāturdiśa","noun-adj",""
"13","bhikṣṣu","BHIKṢ","ṣu","bhikṣ","verb",""
"14","saṃghe","SAṂGH","e","saṃgha","noun-adj",""
"15","niryātayed","NIRYĀTAY","ed","niryāta","verb",""
"16","yo","","","yad","pron",""
"17","vā","","","vā","ind",""
"18","tathāgatasy","TATHĀGAT","asy","tathāgata","noun-adj",""
"19","ārhataḥ","ĀRHAT","aḥ","ārhata","noun-adj",""
"20","samyak","SAMYA","k","samyak","noun-adj",""
"21","a","","","alpha_privativum","ind",""
"22","saṃbuddhasya","SAṂBUDDH","asya","saṃbuddha","noun-adj",""
"23","parinirvṛttasya","PARINIRVṚT","tasya","parinirvṛta","noun-adj",""
"24","mṛta","MṚT","a@","mṛta","noun-adj",""
"25","piṇḍād","PIṆḌ","ād","piṇḍa","noun-adj",""
"26","āmalaka","ĀMALAK","a@","āmalaka","noun-adj",""
"27","phala","PHAL","a@","phala","noun-adj",""
"28","pramāṇaṃ","PRAMĀṆ","aṃ","pramāṇa","noun-adj",""
"29","stūpaṃ","STŪP","aṃ","stūpa","noun-adj",""
"30","pratiṣṭhāpayet","PRATIṢṬHĀPAY","et","pratiṣṭhāpay","verb","pratiṣṭhā"
"31","sūcī","SŪC","ī@","sūcī","noun-adj",""
"32","mātrāṃ","MĀTR","āṃ","mātra","noun-adj",""
"33","yaṣṭim","YAṢṬ","im","yaṣṭi","noun-adj",""
"34","āropayed","ĀROPAY","ed","āropa","verb",""
"35","badarī","BADAR","ī","badarī","noun-adj",""
"36","patra","PATR","a@","patra","noun-adj",""
"37","mātraṃ","MĀTR","aṃ","mātra","noun-adj",""
"38","cchattram","ŚATTR","am","śattri","noun-adj",""
"39","yava","YAV","a@","yava","noun-adj",""
"40","phala","PHAL","a@","phala","noun-adj",""
"41","pramāṇaṃ","PRAMĀṆ","aṃ","pramāṇa","noun-adj",""
"42","pratimāṃ","PRATIM","āṃ","pratimā","noun-adj",""
"43","kārayet","KĀRAY","et","kāra","verb",""
"44","sarṣapa","SARṢAP","a@","sarṣapa","noun-adj",""
"45","hala","HAL","a@","hala","noun-adj",""
"46","pramāṇaṃ","PRAMĀṆ","aṃ","pramāṇa","noun-adj",""
"47","dhātuṃ","DHĀT","uṃ","dhātu","noun-adj",""
"48","pratiṣṭhāpayet","PRATIṢṬHĀPAY","et","pratiṣṭhāpay","verb","pratiṣṭhā"
"49","idam","IDAM","","idam","pron",""
"50","ev","","","eva","ind",""
"51","ānanda","ĀNAND","a","ānanda","noun-adj",""
"52","tataḥ","","","tatas","ind",""
"53","prabhūtataraṃ","PRABHŪT","ataraṃ","prabhūta","noun-adj",""
"54","puṇyaṃ","PUṆY","aṃ","puṇya","noun-adj",""
"55","vadāmi","VAD","āmi","vad","verb","vad"
"56","/","","","","punct",""
"","</s>","","","","",""
"","<s number=""33"">","","","","",""
"","</s>","","","","",""
"","<s number=""34"">","","","","",""
"","</page>","","","","",""
"","<page number=""6"">","","","","",""
"3","tiṣṭhatv","TIṢṬH","atv","tiṣṭh","verb","sthā"
"4","ānanda","ĀNAND","a","ānanda","noun-adj",""
"5","jambūdvīpo","JAMBŪDVĪP","o","jambūdvīpa","noun-adj",""
"6","dvīpaḥ","DVĪP","aḥ","dvīpa","noun-adj",""
"7","/","","","","punct",""
"","</s>","","","","",""
"","<s number=""35"">","","","","",""
"1","tiṣṭhatu","TIṢṬH","atu","tiṣṭh","verb","sthā"
"2","pūrvavideho","PŪRVAVIDEH","o","pūrvavideha","noun-adj",""
"3","dvīpaḥ","DVĪP","aḥ","dvīpa","noun-adj",""
"4","/","","","","punct",""
"","</s>","","","","",""
"","<s number=""36"">","","","","",""
"1","tiṣṭhatv","TIṢṬH","atv","tiṣṭh","verb","sthā"
"2","avaragodānīyo","AVARAGODĀNĪY","o","avaragodānīya","noun-adj",""
"3","dvīpaḥ","DVĪP","aḥ","dvīpa","noun-adj",""
"4","/","","","","punct",""
"","</s>","","","","",""
"","<s number=""37"">","","","","",""
"1","asty","ASTY","","as","verb","as"
"2","ānanda","ĀNAND","a","ānanda","noun-adj",""
"3","uttarakurur","UTTARAKUR","ur","uttarakuru","noun-adj",""
"4","nāma","NĀM","a","nāman","noun-adj",""
"5","dvīpaḥ","DVĪP","aḥ","dvīpa","noun-adj",""
"6","daśa","DAŚ","a@","daśa","noun-adj",""
"7","yojana","YOJAN","a@","yojana","noun-adj",""
"8","sahasrāṇy","SAHASR","āṇy","sa_saha","ind",""
"9","āyāma","ĀYĀM","a@","āyāma","noun-adj",""
"10","vistāreṇa","VISTĀR","eṇa","vistāra","noun-adj",""
"11","samantāt","SAMANT","āt","samanta","noun-adj",""
"12","samanta","SAMANT","a@","samanta","noun-adj",""
"13","catur","CAT","ur","catur","noun-adj",""
"14","asraḥ","ASR","aḥ","asra","noun-adj",""
"15","/","","","","punct",""
"","</s>","","","","",""
"","<s number=""38"">","","","","",""
"1","tam","","","tad","pron",""
"2","enaṃ","","","ena","ind",""
"3","kaścic","KAŚCI","c","kimcit","noun-adj",""
"4","chrāddhaḥ","ŚRĀDDH","aḥ","śrāddha","noun-adj",""
"5","kulaputro","KULAPUTR","o","kulaputra","noun-adj",""
"6","vā","","","vā","ind",""
"7","kuladuhitā","KULADUHIT","ā","kuladuhitṛ","noun-adj",""
"8","vā","","","vā","ind",""
"9","saptaratnamayaṃ","SAPTARATNAMAY","aṃ","saptaratnamaya","noun-adj",""
"10","kṛtvā","KṚT","vā","kṛta","noun-adj",""
"11","yāvac","YĀV","ac","yāvat","ind",""
"12","cāturdiśe","CĀTURDIŚ","e","cāturdiśa","noun-adj",""
"13","bhkiṣu","","","","ind",""
"14","saṃghe","SAṂGH","e","saṃgha","noun-adj",""
"15","niryātayed","NIRYĀTAY","ed","niryāta","verb",""
"16","yo","","","yad","pron",""
"17","vā","","","vā","ind",""
"18","tathāgatasy","TATHĀGAT","asy","tathāgata","noun-adj",""
"19","ārhataḥ","ĀRHAT","aḥ","ārhata","noun-adj",""
"20","samyak","SAMYA","k","samyak","noun-adj",""
"21","a","","","alpha_privativum","ind",""
"22","saṃbuddhasya","SAṂBUDDH","asya","saṃbuddha","noun-adj",""
"23","parinirvṛttasya","PARINIRVṚT","tasya","parinirvṛta","noun-adj",""
"24","mṛta","MṚT","a@","mṛta","noun-adj",""
"25","piṇḍād","PIṆḌ","ād","piṇḍa","noun-adj",""
"26","āmalaka","ĀMALAK","a@","āmalaka","noun-adj",""
"27","phala","PHAL","a@","phala","noun-adj",""
"28","pramāṇaṃ","PRAMĀṆ","aṃ","pramāṇa","noun-adj",""
"29","stūpaṃ","STŪP","aṃ","stūpa","noun-adj",""
"30","pratiṣṭhāpayet","PRATIṢṬHĀPAY","et","pratiṣṭhāpay","verb","pratiṣṭhā"
"31","sūcī","SŪC","ī@","sūcī","noun-adj",""
"32","mātrāṃ","MĀTR","āṃ","mātra","noun-adj",""
"33","yaṣṭim","YAṢṬ","im","yaṣṭi","noun-adj",""
"34","āropayed","ĀROPAY","ed","āropa","verb",""
"35","badarī","BADAR","ī","badarī","noun-adj",""
"36","patra","PATR","a@","patra","noun-adj",""
"37","mātraṃ","MĀTR","aṃ","mātra","noun-adj",""
"38","cchattram","ŚATTR","am","śattri","noun-adj",""
"39","yava","YAV","a@","yava","noun-adj",""
"40","phala","PHAL","a@","phala","noun-adj",""
"41","pramāṇaṃ","PRAMĀṆ","aṃ","pramāṇa","noun-adj",""
"42","pratimāṃ","PRATIM","āṃ","pratimā","noun-adj",""
"43","kārayet","KĀRAY","et","kāra","verb",""
"44","sarṣapa","SARṢAP","a@","sarṣapa","noun-adj",""
"45","hala","HAL","a@","hala","noun-adj",""
"46","pramāṇaṃ","PRAMĀṆ","aṃ","pramāṇa","noun-adj",""
"47","dhātuṃ","DHĀT","uṃ","dhātu","noun-adj",""
"48","pratiṣṭhāpayet","PRATIṢṬHĀPAY","et","pratiṣṭhāpay","verb","pratiṣṭhā"
"49","tataḥ","","","tatas","ind",""
"50","prabhūtataraṃ","PRABHŪT","ataraṃ","prabhūta","noun-adj",""
"51","puṇyaṃ","PUṆY","aṃ","puṇya","noun-adj",""
"52","vadāmi","VAD","āmi","vad","verb","vad"
"53","/","","","","punct",""
"","</s>","","","","",""
"","<s number=""39"">","","","","",""
"","</s>","","","","",""
"","<s number=""40"">","","","","",""
"","</page>","","","","",""
"","<page number=""7"">","","","","",""
"3","tiṣṭhatv","TIṢṬH","atv","tiṣṭh","verb","sthā"
"4","ānanda","ĀNAND","a","ānanda","noun-adj",""
"5","jambūdvīpo","JAMBŪDVĪP","o","jambūdvīpa","noun-adj",""
"6","dvīpas","DVĪP","as","dvīpa","noun-adj",""
"7","/","","","","punct",""
"","</s>","","","","",""
"","<s number=""41"">","","","","",""
"1","tiṣṭhatu","TIṢṬH","atu","tiṣṭh","verb","sthā"
"2","pūrvavideho","PŪRVAVIDEH","o","pūrvavideha","noun-adj",""
"3","dvīpaḥ","DVĪP","aḥ","dvīpa","noun-adj",""
"4","/","","","","punct",""
"","</s>","","","","",""
"","<s number=""42"">","","","","",""
"1","tiṣṭhatv","TIṢṬH","atv","tiṣṭh","verb","sthā"
"2","avaragodānīyo","AVARAGODĀNĪY","o","avaragodānīya","noun-adj",""
"3","dvīpaḥ","DVĪP","aḥ","dvīpa","noun-adj",""
"4","/","","","","punct",""
"","</s>","","","","",""
"","<s number=""43"">","","","","",""
"1","tiṣṭhat","TIṢṬH","at@","tiṣṭhat","noun-adj",""
"2","ūttarakuru","UTTARAKUR","u@","uttarakuru","noun-adj",""
"3","dvīpaḥ","DVĪP","aḥ","dvīpa","noun-adj",""
"4","/","","","","punct",""
"","</s>","","","","",""
"","<s number=""44"">","","","","",""
"1","asty","ASTY","","as","verb","as"
"2","ānanda","ĀNAND","a","ānanda","noun-adj",""
"3","śakrasya","ŚAKR","asya","śakra","noun-adj",""
"4","devānām","DEV","ānām","deva","noun-adj",""
"5","indrasya","INDR","asya","indra","noun-adj",""
"6","vaijayanto","VAIJAYANT","o","vaijayanta","noun-adj",""
"7","nāma","NĀM","a","nāman","noun-adj",""
"8","prāsādaḥ","PRĀSĀD","aḥ","prāsāda","noun-adj",""
"9","/","","","","punct",""
"","</s>","","","","",""
"","<s number=""45"">","","","","",""
"1","tam","","","tad","pron",""
"2","enaṃ","","","ena","ind",""
"3","kaścic","KAŚCI","c","kimcit","noun-adj",""
"4","chrāddhaḥ","ŚRĀDDH","aḥ","śrāddha","noun-adj",""
"5","kulaputro","KULAPUTR","o","kulaputra","noun-adj",""
"6","vā","","","vā","ind",""
"7","kuladuhitā","KULADUHIT","ā","kuladuhitṛ","noun-adj",""
"8","vā","","","vā","ind",""
"9","saptaratnamayaṃ","SAPTARATNAMAY","aṃ","saptaratnamaya","noun-adj",""
"10","kṛtvā","KṚT","vā","kṛta","noun-adj",""
"11","yāvac","YĀV","ac","yāvat","ind",""
"12","cāturdiśe","CĀTURDIŚ","e","cāturdiśa","noun-adj",""
"13","bhkiṣu","","","","ind",""
"14","saṃghe","SAṂGH","e","saṃgha","noun-adj",""
"15","niryātayed","NIRYĀTAY","ed","niryāta","verb",""
"16","yo","","","yad","pron",""
"17","vā","","","vā","ind",""
"18","tathāgatasy","TATHĀGAT","asy","tathāgata","noun-adj",""
"19","ārhataḥ","ĀRHAT","aḥ","ārhata","noun-adj",""
"20","samyak","SAMYA","k","samyak","noun-adj",""
"21","a","","","alpha_privativum","ind",""
"22","saṃbuddhasya","SAṂBUDDH","asya","saṃbuddha","noun-adj",""
"23","parinirvṛttasya","PARINIRVṚT","tasya","parinirvṛta","noun-adj",""
"24","mṛta","MṚT","a@","mṛta","noun-adj",""
"25","piṇḍād","PIṆḌ","ād","piṇḍa","noun-adj",""
"26","āmalaka","ĀMALAK","a@","āmalaka","noun-adj",""
"27","phala","PHAL","a@","phala","noun-adj",""
"28","pramāṇaṃ","PRAMĀṆ","aṃ","pramāṇa","noun-adj",""
"29","stūpaṃ","STŪP","aṃ","stūpa","noun-adj",""
"30","pratiṣṭhāpayet","PRATIṢṬHĀPAY","et","pratiṣṭhāpay","verb","pratiṣṭhā"
"31","sūcī","SŪC","ī@","sūcī","noun-adj",""
"32","mātrāṃ","MĀTR","āṃ","mātra","noun-adj",""
"33","yaṣṭim","YAṢṬ","im","yaṣṭi","noun-adj",""
"34","āropayed","ĀROPAY","ed","āropa","verb",""
"35","badarī","BADAR","ī","badarī","noun-adj",""
"36","patra","PATR","a@","patra","noun-adj",""
"37","mātraṃ","MĀTR","aṃ","mātra","noun-adj",""
"38","cchattram","ŚATTR","am","śattri","noun-adj",""
"39","yava","YAV","a@","yava","noun-adj",""
"40","phala","PHAL","a@","phala","noun-adj",""
"41","pramāṇaṃ","PRAMĀṆ","aṃ","pramāṇa","noun-adj",""
"42","pratimāṃ","PRATIM","āṃ","pratimā","noun-adj",""
"43","kārayet","KĀRAY","et","kāra","verb",""
"44","sarṣapa","SARṢAP","a@","sarṣapa","noun-adj",""
"45","hala","HAL","a@","hala","noun-adj",""
"46","pramāṇaṃ","PRAMĀṆ","aṃ","pramāṇa","noun-adj",""
"47","dhātuṃ","DHĀT","uṃ","dhātu","noun-adj",""
"48","pratiṣṭhāpayet","PRATIṢṬHĀPAY","et","pratiṣṭhāpay","verb","pratiṣṭhā"
"49","idam","IDAM","","idam","pron",""
"50","ev","","","eva","ind",""
"51","ānanda","ĀNAND","a","ānanda","noun-adj",""
"52","tataḥ","","","tatas","ind",""
"53","prabhūtataraṃ","PRABHŪT","ataraṃ","prabhūta","noun-adj",""
"54","puṇyaṃ","PUṆY","aṃ","puṇya","noun-adj",""
"55","vadāmi","VAD","āmi","vad","verb","vad"
"56","/","","","","punct",""
"","</s>","","","","",""
"","<s number=""46"">","","","","",""
"","</s>","","","","",""
"","<s number=""47"">","","","","",""
"","</page>","","","","",""
"","<page number=""8"">","","","","",""
"3","tiṣṭhatv","TIṢṬH","atv","tiṣṭh","verb","sthā"
"4","ānanda","ĀNAND","a","ānanda","noun-adj",""
"5","jambūdvīpo","JAMBŪDVĪP","o","jambūdvīpa","noun-adj",""
"6","dvīpaḥ","DVĪP","aḥ","dvīpa","noun-adj",""
"7","/","","","","punct",""
"","</s>","","","","",""
"","<s number=""48"">","","","","",""
"1","tiṣṭhatu","TIṢṬH","atu","tiṣṭh","verb","sthā"
"2","pūrvavideho","PŪRVAVIDEH","o","pūrvavideha","noun-adj",""
"3","dvīpaḥ","DVĪP","aḥ","dvīpa","noun-adj",""
"4","/","","","","punct",""
"","</s>","","","","",""
"","<s number=""49"">","","","","",""
"1","tiṣṭhatv","TIṢṬH","atv","tiṣṭh","verb","sthā"
"2","avaragodānīyo","AVARAGODĀNĪY","o","avaragodānīya","noun-adj",""
"3","dvīpaḥ","DVĪP","aḥ","dvīpa","noun-adj",""
"4","/","","","","punct",""
"","</s>","","","","",""
"","<s number=""50"">","","","","",""
"1","tiṣṭhat","TIṢṬH","at@","tiṣṭhat","noun-adj",""
"2","ūttarakuru","UTTARAKUR","u@","uttarakuru","noun-adj",""
"3","dvīpaḥ","DVĪP","aḥ","dvīpa","noun-adj",""
"4","/","","","","punct",""
"","</s>","","","","",""
"","<s number=""51"">","","","","",""
"1","tiṣṭhatu","TIṢṬH","atu","tiṣṭh","verb","sthā"
"2","śakrasya","ŚAKR","asya","śakra","noun-adj",""
"3","devānām","DEV","ānām","deva","noun-adj",""
"4","indrasya","INDR","asya","indra","noun-adj",""
"5","vaijayantaḥ","VAIJAYANT","aḥ","vaijayanta","noun-adj",""
"6","prāsādaḥ","PRĀSĀD","aḥ","prāsāda","noun-adj",""
"7","/","","","","punct",""
"","</s>","","","","",""
"","<s number=""52"">","","","","",""
"1","asty","ASTY","","as","verb","as"
"2","ānanda","ĀNAND","a","ānanda","noun-adj",""
"3","tris","","","","ind",""
"4","āhar","ĀHAR","","āhara","noun-adj",""
"5","sama","SAM","a@","sama","noun-adj",""
"6","hāsā","HĀS","ā@","hāsā","noun-adj",""
"7","hasro","HAS","ro","hasṛ","noun-adj",""
"8","lokadhātuḥ","LOKADHĀT","uḥ","lokadhātu","noun-adj",""
"9","/","","","","punct",""
"","</s>","","","","",""
"","<s number=""53"">","","","","",""
"1","tam","","","tad","pron",""
"2","enaṃ","","","ena","ind",""
"3","kaścic","KAŚCI","c","kimcit","noun-adj",""
"4","chrāddhaḥ","ŚRĀDDH","aḥ","śrāddha","noun-adj",""
"5","kulaputro","KULAPUTR","o","kulaputra","noun-adj",""
"6","vā","","","vā","ind",""
"7","kuladuhitā","KULADUHIT","ā","kuladuhitṛ","noun-adj",""
"8","vā","","","vā","ind",""
"9","saptaratnamayaṃ","SAPTARATNAMAY","aṃ","saptaratnamaya","noun-adj",""
"10","kṛtvā","KṚT","vā","kṛta","noun-adj",""
"11","srotāpannebhyaḥ","SROTĀPANN","ebhyaḥ","srotāpanna","noun-adj",""
"12","sakṛdāgāmibhyo","SAKṚDĀGĀM","ibhyo","sakṛdāgāmin","noun-adj",""
"13","an","","","alpha_privativum","ind",""
"14","āgāmibhyo","ĀGĀM","ibhyo","āgāmin","noun-adj",""
"15","arhadbhyaḥ","ARH","adbhyaḥ","arhat","noun-adj",""
"16","pratyekabuddhebhyaś","PRATYEKABUDDH","ebhyaś","pratyekabuddha","noun-adj",""
"17","yāvac","YĀV","ac","yāvat","ind",""
"18","cāturdiśe","CĀTURDIŚ","e","cāturdiśa","noun-adj",""
"19","vā","","","vā","ind",""
"20","bhkiṣu","","","","ind",""
"21","saṃghe","SAṂGH","e","saṃgha","noun-adj",""
"22","niryātayed","NIRYĀTAY","ed","niryāta","verb",""
"23","yo","","","yad","pron",""
"24","vā","","","vā","ind",""
"25","tathāgatasy","TATHĀGAT","asy","tathāgata","noun-adj",""
"26","ārhataḥ","ĀRHAT","aḥ","ārhata","noun-adj",""
"27","samyak","SAMYA","k","samyak","noun-adj",""
"28","a","","","alpha_privativum","ind",""
"29","saṃbuddhasya","SAṂBUDDH","asya","saṃbuddha","noun-adj",""
"30","parinirvṛttasya","PARINIRVṚT","tasya","parinirvṛta","noun-adj",""
"31","mṛta","MṚT","a@","mṛta","noun-adj",""
"32","piṇḍād","PIṆḌ","ād","piṇḍa","noun-adj",""
"33","āmalaka","ĀMALAK","a@","āmalaka","noun-adj",""
"34","phala","PHAL","a@","phala","noun-adj",""
"35","pramāṇaṃ","PRAMĀṆ","aṃ","pramāṇa","noun-adj",""
"36","stūpaṃ","STŪP","aṃ","stūpa","noun-adj",""
"37","pratiṣṭhāpayet","PRATIṢṬHĀPAY","et","pratiṣṭhāpay","verb","pratiṣṭhā"
"38","sūcī","SŪC","ī@","sūcī","noun-adj",""
"39","mātrāṃ","MĀTR","āṃ","mātra","noun-adj",""
"40","yaṣṭim","YAṢṬ","im","yaṣṭi","noun-adj",""
"41","āropayed","ĀROPAY","ed","āropa","verb",""
"42","badarī","BADAR","ī","badarī","noun-adj",""
"43","patra","PATR","a@","patra","noun-adj",""
"44","mātraṃ","MĀTR","aṃ","mātra","noun-adj",""
"45","cchattram","ŚATTR","am","śattri","noun-adj",""
"46","yava","YAV","a@","yava","noun-adj",""
"47","phala","PHAL","a@","phala","noun-adj",""
"48","pramāṇaṃ","PRAMĀṆ","aṃ","pramāṇa","noun-adj",""
"49","pratimāṃ","PRATIM","āṃ","pratimā","noun-adj",""
"50","kārayet","KĀRAY","et","kāra","verb",""
"51","sarṣapa","SARṢAP","a@","sarṣapa","noun-adj",""
"52","hala","HAL","a@","hala","noun-adj",""
"53","pramāṇaṃ","PRAMĀṆ","aṃ","pramāṇa","noun-adj",""
"54","dhātuṃ","DHĀT","uṃ","dhātu","noun-adj",""
"55","pratiṣṭhāpayet","PRATIṢṬHĀPAY","et","pratiṣṭhāpay","verb","pratiṣṭhā"
"56","idam","IDAM","","idam","pron",""
"57","ev","","","eva","ind",""
"58","ānanda","ĀNAND","a","ānanda","noun-adj",""
"59","tataḥ","","","tatas","ind",""
"60","prabhūtataraṃ","PRABHŪT","ataraṃ","prabhūta","noun-adj",""
"61","puṇyaṃ","PUṆY","aṃ","puṇya","noun-adj",""
"62","vadāmi","VAD","āmi","vad","verb","vad"
"63","/","","","","punct",""
"","</s>","","","","",""
"","<s number=""54"">","","","","",""
"","</s>","","","","",""
"","<s number=""55"">","","","","",""
"","</page>","","","","",""
"","<page number=""9"">","","","","",""
"3","tat","TAT","","tad","pron",""
"4","kasya","","","kim","pron",""
"5","hetoḥ","HET","oḥ","hetu","noun-adj",""
"6","/","","","","punct",""
"","</s>","","","","",""
"","<s number=""56"">","","","","",""
"1","a","","","alpha_privativum","ind",""
"2","prameyo","PRAMEY","o","prameya","noun-adj",""
"3","hy","","","hi","ind",""
"4","ānanda","ĀNAND","a","ānanda","noun-adj",""
"5","tathāgato","TATHĀGAT","o","tathāgata","noun-adj",""
"6","dānena","DĀN","ena","dāna","noun-adj",""
"7","^","","","","",""
"8","a","","","alpha_privativum","ind",""
"9","prameyaḥ","PRAMEY","aḥ","prameya","noun-adj",""
"10","śīlena","ŚĪL","ena","śīla","noun-adj",""
"11","^","","","","",""
"12","a","","","alpha_privativum","ind",""
"13","prameyaḥ","PRAMEY","aḥ","prameya","noun-adj",""
"14","kṣāntyā","KṢĀNT","yā","kṣānti","noun-adj",""
"15","prameyo","PRAMEY","o","prameya","noun-adj",""
"16","vīryeṇā","VĪRY","eṇā","vīrya","noun-adj",""
"17","prameyo","PRAMEY","o","prameya","noun-adj",""
"18","tyāgena","TYĀG","ena","tyāga","noun-adj",""
"19","^","","","","",""
"20","a","","","alpha_privativum","ind",""
"21","prameyo","PRAMEY","o","prameya","noun-adj",""
"22","maitrya","MAITRY","a@","maitrya","noun-adj",""
"23","ā","","","alpha_privativum","ind",""
"24","prameyaḥ","PRAMEY","aḥ","prameya","noun-adj",""
"25","karuṇayā","KARUṆ","ayā","karuṇā","noun-adj",""
"26","prameyo","PRAMEY","o","prameya","noun-adj",""
"27","muditayā","MUDIT","ayā","muditā","noun-adj",""
"28","prameya","PRAMEY","a","prameya","noun-adj",""
"29","upekṣayā","UPEKṢ","ayā","upekṣā","noun-adj",""
"30","caturbhir","CAT","urbhir","catur","noun-adj",""
"31","vaiśāradyais","VAIŚĀRADY","ais","vaiśāradya","noun-adj",""
"32","daśabhis","DAŚ","abhis","daśa","noun-adj",""
"33","tathāgata","TATHĀGAT","a@","tathāgata","noun-adj",""
"34","balaiś","BAL","aiś","bala","noun-adj",""
"35","aṣṭādaśabhir","AṢṬĀDAŚ","abhir","aṣṭādaśa","noun-adj",""
"36","āveṇikair","ĀVEṆIK","air","āveṇika","noun-adj",""
"37","buddha","BUDDH","a@","buddha","noun-adj",""
"38","dharmair","DHARM","air","dharma","noun-adj",""
"39","a","","","alpha_privativum","ind",""
"40","prameya","PRAMEY","a@","prameya","noun-adj",""
"41","ā","","","alpha_privativum","ind",""
"42","prameya","PRAMEY","a@","prameya","noun-adj",""
"43","guṇa","GUṆ","a@","guṇa","noun-adj",""
"44","samanvāgato","SAMANVĀGAT","o","samanvāgata","noun-adj",""
"45","hy","","","hi","ind",""
"46","ānanda","ĀNAND","a","ānanda","noun-adj",""
"47","tathāgato","TATHĀGAT","o","tathāgata","noun-adj",""
"48","arhan","ARH","an","arhat","noun-adj",""
"49","samyaksaṃbuddhaḥ","SAMYAKSAṂBUDDH","aḥ","samyaksaṃbuddha","noun-adj",""
"50","/","","","","punct",""
"","</s>","","","","",""
"","<s number=""57"">","","","","",""
"","</s>","","","","",""
"","<s number=""58"">","","","","",""
"","</page>","","","","",""
"","<page number=""10"">","","","","",""
"3","evam","","","eva","ind",""
"4","ukto","UKT","o","ukta","noun-adj",""
"5","āyuṣmān","ĀYUṢM","ān","āyuṣmat","noun-adj",""
"6","ānando","ĀNAND","o","ānanda","noun-adj",""
"7","bhagavantam","BHAGAV","antam","bhagavat","noun-adj",""
"8","idam","IDAM","","idam","pron",""
"9","avocat","AVOCAT","","vak","verb","vac"
"10",":","","","","punct",""
"11","āścaryaṃ","ĀŚCARY","aṃ","āścarya","noun-adj",""
"12","bhagavann","BHAGAV","ann","bhagavat","noun-adj",""
"13","āścaryaṃ","ĀŚCARY","aṃ","āścarya","noun-adj",""
"14","sugata","SUGAT","a","sugata","noun-adj",""
"15","yāvad","YĀVAD","","yāvat","ind",""
"16","ayaṃ","AYAṂ","","idam","pron",""
"17","dharmaparyāyaḥ","DHARMAPARYĀY","aḥ","dharmaparyāya","noun-adj",""
"18","/","","","","punct",""
"","</s>","","","","",""
"","<s number=""59"">","","","","",""
"1","ko","","","kim","pron",""
"2","nāma","NĀM","a","nāman","noun-adj",""
"3","^","","","","",""
"4","āyaṃ","ĀYAṂ","","idam","pron",""
"5","dharmaparyāyaḥ","DHARMAPARYĀY","aḥ","dharmaparyāya","noun-adj",""
"6","/","","","","punct",""
"","</s>","","","","",""
"","<s number=""60"">","","","","",""
"1","kathaṃ","","","katham","ind",""
"2","c","","","ca","ind",""
"3","^","","","","",""
"4","ainaṃ","","","ena","ind",""
"5","dhārayāmi","DHĀR","ayāmi","dhar","verb","dhṛ"
"6","/","","","","punct",""
"","</s>","","","","",""
"","<s number=""61"">","","","","",""
"1","tasmāt","","","tad","pron",""
"2","tarhi","","","tarhi","ind",""
"3","tvam","","","tvat","pron",""
"4","ānanda","ĀNAND","a","ānanda","noun-adj",""
"5","imaṃ","","","idam","pron",""
"6","dharmaparyāyam","DHARMAPARYĀY","am","dharmaparyāya","noun-adj",""
"7","adbhutam","ADBHUT","am","adbhuta","noun-adj",""
"8","adbhuta","ADBHUT","a@","adbhuta","noun-adj",""
"9","dharmaparyāyaṃ","DHARMAPARYĀY","aṃ","dharmaparyāya","noun-adj",""
"10","iti","","","iti","ind",""
"11","dhāraya","DHĀRAY","a","dhāraya","noun-adj",""
"12","/","","","","punct",""
"","</s>","","","","",""
"","<s number=""62"">","","","","",""
"1","idam","IDAM","","idam","pron",""
"2","avocad","AVOCAD","","vak","verb","vac"
"3","bhagavān","BHAGAV","ān","bhagavat","noun-adj",""
"4","āttamanās","ĀTTAMAN","ās","āttamanas","noun-adj",""
"5","te","","","tad","pron",""
"6","bhikṣava","BHIKṢ","ava","bhikṣu","noun-adj",""
"7","āyuṣmāṃś","ĀYUṢM","āṃś","āyuṣmat","noun-adj",""
"8","c","","","ca","ind",""
"9","^","","","","",""
"10","ānando","ĀNAND","o","ānanda","noun-adj",""
"11","bhagavato","BHAGAV","ato","bhagavat","noun-adj",""
"12","bhāṣitam","BHĀṢIT","am","bhāṣita","noun-adj",""
"13","abhyanandan","ABHYANAND","an","abhyanandat","noun-adj",""
"14","/","","","","punct",""
"","</s>","","","","",""
"","</page>","","","","",""
"","</doc>","","","","",""
