"WordID","word","NormSTEM","suffix","lemma","PoS","Root"
"","<doc textid = ""narayanapariprccha"" genre = ""dhāraṇī"" title = ""nārāyaṇaparipṛcchā"" author = ""n/a"" discourse = ""tantra"" tradition = ""buddh"" period = ""classical"" source = ""dsbc accessed aug 2021"" date_range = ""4. ce"" notes = ""a buddhist dhāraṇī text. contains reconstructions by banerjee based on tibetan translation. full title: nārāyaṇaparipṛcchā-āryamahāmāyāvijayavāhinī-nāma-dhāraṇī; dating uncertain; see: see gergely hidas. 'buddhism; kingship and the protection of the state: the suvarṇaprabhāsottamasūtra and dhāraṇī literature.' in: dominic goodall; shaman hatley; harunaga isācson; and srilata raman. 2020. śaivism and the tantric traditions: essays in honour of alexis g.j.s. sanderson. leiden: brill. p. 237"" religion = ""buddh"" edition = ""based on the ed. by a.c. banerjee. 1941. nārāyaṇaparipṛcchā sutra. calcutta: university of calcutta"" digitization = ""members of the digital sanskrit buddhist canon input project"" segmentation_lemmatization = ""ligeia lugli & buddhist translators workbench team"" metadata_enrichment = ""bruno galasek-hul & buddhist translators workbench team"" proofreader = ""n/a"" permission = """" reconstructions = ""none"">","","","","",""
"","<page number=""0000"">","","","","",""
"","<s number=""1"">","","","","",""
"1","nārāyaṇaparipṛcchā","NĀRĀYAṆAPARIPṚCCH","ā","nārāyaṇaparipṛcchā","noun-adj",""
"2","ārya","ĀRY","a@","ārya","noun-adj",""
"3","mahāmāyā","MAHĀMĀY","ā@","mahāmāyā","noun-adj",""
"4","vijayavāhinī","VIJAYAVĀHIN","ī","vijayavāhinī","noun-adj",""
"5","nāma","NĀM","a","nāman","noun-adj",""
"6","dhāraṇī","DHĀRAṆ","ī","dhāraṇī","noun-adj",""
"","</s>","","","","",""
"","<s number=""2"">","","","","",""
"1","namaḥ","NAM","aḥ","nama","noun-adj",""
"2","sarva","SARV","a@","sarva","noun-adj",""
"3","buddha","BUDDH","a@","buddha","noun-adj",""
"4","bodhisattvebhyaḥ","BODHISATTV","ebhyaḥ","bodhisattva","noun-adj",""
"5","evaṃ","","","eva","ind",""
"6","mayā","","","mat","pron",""
"7","śrutam","ŚRUT","am","śruta","noun-adj",""
"8","ekasmin","EK","asmin","eka","noun-adj",""
"9","samaye","SAMAY","e","samaya","noun-adj",""
"10","bhagavān","BHAGAV","ān","bhagavat","noun-adj",""
"11","svarṇa","SVAR","ṇa","svara","noun-adj",""
"12","śṛṅge","ŚṚṄG","e","śṛṅga","noun-adj",""
"13","parvata","PARVAT","a@","parvata","noun-adj",""
"14","āgre","AGR","e","agra","noun-adj",""
"15","vaiśravaṇasya","VAIŚRAVAṆ","asya","vaiśravaṇa","noun-adj",""
"16","gṛhe","GṚH","e","gṛha","noun-adj",""
"17","viharati","VIHAR","ati","vihar","verb","vihṛ"
"18","sma","","","sma","ind",""
"19","/","","","","punct",""
"","</s>","","","","",""
"","<s number=""3"">","","","","",""
"1","tatra","","","tatra","ind",""
"2","deva","DEV","a@","deva","noun-adj",""
"3","nāga","NĀG","a@","nāga","noun-adj",""
"4","yakṣa","YAKṢ","a@","yakṣa","noun-adj",""
"5","gandharva","GANDHARV","a@","gandharva","noun-adj",""
"6","āsura","ĀSUR","a@","āsura","noun-adj",""
"7","garuḍa","GARUḌ","a@","garuḍa","noun-adj",""
"8","kinnara","KINNAR","a@","kinnara","noun-adj",""
"9","mahoraga","MAHORAG","a@","mahoraga","noun-adj",""
"10","vidyādhara","VIDYĀDHAR","a@","vidyādhara","noun-adj",""
"11","āpsaraḥ","APSAR","aḥ","apsara","noun-adj",""
"12","prabhṛtibhir","PRABHṚT","ibhir","prabhṛti","noun-adj",""
"13","bahubhiḥ","BAH","ubhiḥ","bahu","noun-adj",""
"14","stutaṃ","STUT","aṃ","stuta","noun-adj",""
"15","dharma","DHARM","a@","dharma","noun-adj",""
"16","āloka","ĀLOK","a@","āloka","noun-adj",""
"17","mukhaṃ","MUKH","aṃ","mukha","noun-adj",""
"18","nāma","NĀM","a","nāman","noun-adj",""
"19","dharmaparyāyaṃ","DHARMAPARYĀY","aṃ","dharmaparyāya","noun-adj",""
"20","deśayati","DEŚ","ayati","diś","verb","diś"
"21","sma","","","sma","ind",""
"22","/","","","","punct",""
"","</s>","","","","",""
"","<s number=""4"">","","","","",""
"1","ath","","","atha","ind",""
"2","^","","","","",""
"3","āsurair","ĀSUR","air","āsura","noun-adj",""
"4","nigṛhīto","NIGṚHĪT","o","nigṛhīta","noun-adj",""
"5","vinirdhūtaḥ","VINIRDHŪT","aḥ","vinirdhūta","noun-adj",""
"6","parājitas","PARĀJIT","as","parājita","noun-adj",""
"7","tejo","TEJ","o@","teja","noun-adj",""
"8","hīno","HĪN","o","hīna","noun-adj",""
"9","nārāyaṇo","NĀRĀYAṆ","o","nārāyaṇa","noun-adj",""
"10","yena","","","yad","pron",""
"11","bhagavāṃs","BHAGAV","āṃs","bhagavat","noun-adj",""
"12","tena","TEN","a@","tad","pron",""
"13","opasaṅkrām","UPASAṄKR","ām","upasaṅkrā","noun-adj",""
"14","ad","","","","ind",""
"15","upasaṅkramya","UPASAṄKRAM","ya","upasaṅkrama","noun-adj",""
"16","bhagavataḥ","BHAGAVAT","aḥ","bhagavatī","noun-adj",""
"17","pādau","PĀD","au","pāda","noun-adj",""
"18","śirasa","ŚIRAS","a@","śiras","noun-adj",""
"19","ābhivandy","ABHIVAND","y@","abhivand","verb",""
"20","aikānte","EKĀNT","e","ekānta","noun-adj",""
"21","sthitaḥ","STHIT","aḥ","sthita","noun-adj",""
"22","//1//","","","","punct",""
"","</s>","","","","",""
"","<s number=""5"">","","","","",""
"1","ekānte","EKĀNT","e","ekānta","noun-adj",""
"2","sthitaś","STHIT","aś","sthita","noun-adj",""
"3","ca","","","ca","ind",""
"4","nārāyaṇa","NĀRĀYAṆ","a","nārāyaṇa","noun-adj",""
"5","evaṃ","","","eva","ind",""
"6","prārthayāñ","PRĀRTHAY","āñ","prārthaya","noun-adj",""
"7","cake","CAK","e","caka","noun-adj",""
"8","/","","","","punct",""
"","</s>","","","","",""
"","<s number=""6"">","","","","",""
"1","tad","TAD","","tad","pron",""
"2","evaṃ","","","eva","ind",""
"3","deśayatu","DEŚ","ayatu","deś","verb","diś"
"4","bhagavān","BHAGAV","ān","bhagavat","noun-adj",""
"5","sarvajñaḥ","SARVAJÑ","aḥ","sarvajña","noun-adj",""
"6","sarvadarśī","SARVADARŚ","ī","sarvadarśin","noun-adj",""
"7","sarva","SARV","a@","sarva","noun-adj",""
"8","sattva","SATTV","a@","sattva","noun-adj",""
"9","ānukampaka","ANUKAMP","aka@","anukampaka","noun-adj",""
"10","staṃ","ST","aṃ","sta","noun-adj",""
"11","dharmaparyāyaṃ","DHARMAPARYĀY","aṃ","dharmaparyāya","noun-adj",""
"12","yamete","YAM","ete","yam","verb",""
"13","deva","DEV","a@","deva","noun-adj",""
"14","nāga","NĀG","a@","nāga","noun-adj",""
"15","yakṣa","YAKṢ","a@","yakṣa","noun-adj",""
"16","rākṣasa","RĀKṢAS","a@","rākṣasa","noun-adj",""
"17","ādayo","ĀD","ayo","ādi","noun-adj",""
"18","manuṣyā","MANUṢY","ā","manuṣya","noun-adj",""
"19","vā","","","vā","ind",""
"20","dhāraya","DHĀRAY","a@","dhāraya","noun-adj",""
"21","māṇāḥ","MĀṆ","āḥ","māṇa","noun-adj",""
"22","saṃgrāme","SAṂGRĀM","e","saṃgrāma","noun-adj",""
"23","mahā","MAH","ā@","mahat","noun-adj",""
"24","śūla","ŚŪL","a@","śūla","noun-adj",""
"25","pātebhyo","PĀT","ebhyo","pāta","noun-adj",""
"26","vā","","","vā","ind",""
"27","sarva","SARV","a@","sarva","noun-adj",""
"28","opadravebhyo","UPADRAV","ebhyo","upadrava","noun-adj",""
"29","vā","","","vā","ind",""
"30","sarva","SARV","a@","sarva","noun-adj",""
"31","vitarka","VITARK","a@","vitarka","noun-adj",""
"32","vicārebhyo","VICĀR","ebhyo","vicāra","noun-adj",""
"33","vā","","","vā","ind",""
"34","vijayino","VIJAYIN","o","vijayina","noun-adj",""
"35","bhaviṣy","BHAVIṢ","y@","bhaviṣi","noun-adj",""
"36","anni","ANN","i","anna","noun-adj",""
"37","//2//","","","","punct",""
"","</s>","","","","",""
"","<s number=""7"">","","","","",""
"1","bhagavān","BHAGAV","ān","bhagavat","noun-adj",""
"2","āha","ĀH","a","ah","verb","ah"
"3","asi","","","as","verb","as"
"4","māyā","MĀY","ā@","māyā","noun-adj",""
"5","dharas","DHAR","as","dhara","noun-adj",""
"6","tvaṃ","","","tvat","pron",""
"7","nārāyaṇa","NĀRĀYAṆ","a","nārāyaṇa","noun-adj",""
"8","/","","","","punct",""
"","</s>","","","","",""
"","<s number=""8"">","","","","",""
"1","māyāvāṃs","MĀYĀV","āṃs","māyāva","noun-adj",""
"2","tvaṃ","TVAṂ","","tvat","pron",""
"3","maha","MAH","a@","mahat","noun-adj",""
"4","āvalo","ĀVAL","o","āvala","noun-adj",""
"5","asi","","","as","verb","as"
"6","/","","","","punct",""
"","</s>","","","","",""
"","<s number=""9"">","","","","",""
"1","aneka","ANEK","a@","aneka","noun-adj",""
"2","māyā","MĀY","ā@","māyā","noun-adj",""
"3","jālena","JĀL","ena","jāla","noun-adj",""
"4","sattvān","SATTV","ān","sattva","noun-adj",""
"5","vañca","VAÑC","a@","vañca","noun-adj",""
"6","yasi","YAŚ","i","yaśi","noun-adj",""
"7","/","","","","punct",""
"","</s>","","","","",""
"","<s number=""10"">","","","","",""
"1","kim","","","kim","pron",""
"2","iha","","","iha","ind",""
"3","bhayāt","BHAY","āt","bhaya","noun-adj",""
"4","saṃgrāmavijaya","SAṂGRĀMAVIJAY","a@","saṃgrāmavijaya","noun-adj",""
"5","praśnaṃ","PRAŚN","aṃ","praśna","noun-adj",""
"6","paripṛcchasi","PARIPṚCCH","asi","paripṛcch","verb","pariprach"
"7","//3//","","","","punct",""
"","</s>","","","","",""
"","<s number=""11"">","","","","",""
"1","nārāyaṇa","NĀRĀYAṆ","a","nārāyaṇa","noun-adj",""
"2","evam","","","eva","ind",""
"3","āha","ĀH","a","ah","verb","ah"
"4","/","","","","punct",""
"","</s>","","","","",""
"","<s number=""12"">","","","","",""
"1","iha","","","iha","ind",""
"2","bhagavan","BHAGAV","an","bhagavat","noun-adj",""
"3","kāmā","KĀM","ā@","kāmā","noun-adj",""
"4","surendreṇ","SURENDR","eṇ","surendra","noun-adj",""
"5","āsura","ĀSUR","a@","āsura","noun-adj",""
"6","māyā","MĀY","ā@","māyā","noun-adj",""
"7","jito","JIT","o","jita","noun-adj",""
"8","aham","","","mat","pron",""
"9","/","","","","punct",""
"","</s>","","","","",""
"","<s number=""13"">","","","","",""
"1","mṛtā","MṚT","ā","mṛta","noun-adj",""
"2","devāḥ","DEV","āḥ","deva","noun-adj",""
"3","kecit","","","kimcit","ind",""
"4","pa","","","","ind",""
"5","lāyitāḥ","LĀY","itāḥ","lāya","noun-adj",""
"6","kecid","","","kimcit","ind",""
"7","vidhvaṃsitāḥ","VIDHVAṂSIT","āḥ","vidhvaṃsita","noun-adj",""
"8","/","","","","punct",""
"","</s>","","","","",""
"","<s number=""14"">","","","","",""
"1","tato","","","tatas","ind",""
"2","deśaya","DEŚAY","a","deśayin","noun-adj",""
"3","bhagavan","BHAGAV","an","bhagavat","noun-adj",""
"4","taṃ","","","tad","pron",""
"5","dharmaparyāyaṃ","DHARMAPARYĀY","aṃ","dharmaparyāya","noun-adj",""
"6","yadete","YAD","ete","yada","noun-adj",""
"7","sattvā","SATTV","ā","sattva","noun-adj",""
"8","saṃgrāmavijayino","SAṂGRĀMAVIJAY","ino","saṃgrāmavijayin","noun-adj",""
"9","bhaviṣyanti","BHAV","iṣyanti","bhav","verb","bhū"
"10","/","","","","punct",""
"","</s>","","","","",""
"","<s number=""15"">","","","","",""
"1","asurā","ASUR","ā","asura","noun-adj",""
"2","parājayis","PARĀJAY","is","parājayi","noun-adj",""
"3","yante","","","","ind",""
"4","hīyamāna","H","īyamāna@","ha","noun-adj",""
"5","darpāś","DARP","āś","darpa","noun-adj",""
"6","ca","","","ca","ind",""
"7","parā","PAR","ā","para","noun-adj",""
"8","bhaviṣyanti","BHAV","iṣyanti","bhav","verb","bhū"
"9","//4//","","","","punct",""
"","</s>","","","","",""
"","<s number=""16"">","","","","",""
"1","bhagavān","BHAGAV","ān","bhagavat","noun-adj",""
"2","āha","ĀH","a","ah","verb","ah"
"3","/","","","","punct",""
"","</s>","","","","",""
"","<s number=""17"">","","","","",""
"1","bhūta","BHŪT","a","bhūta""noun-adj",""
"2","pūrvaṃ","PŪRV","aṃ","pūrva","noun-adj",""
"3","nārāyaṇa","NĀRĀYAṆ","a@","nārāyaṇa","noun-adj",""
"4","ātīte","ATĪT","e","atīta","noun-adj",""
"5","adhvani","ADHV","ani","adhvat","noun-adj",""
"6","magadhe","MAGADH","e","magadha","noun-adj",""
"7","rohita","ROH","ita@","roha","noun-adj",""
"8","parvate","PAR","vate","para","noun-adj",""
"9","ratna","RATN","a@","ratna","noun-adj",""
"10","śrīr","ŚR","īr","śra","noun-adj",""
"11","nāma","NĀM","a","nāman","noun-adj",""
"12","rājā","RĀJ","ā","rājan","noun-adj",""
"13","abhūva","aBHŪVA","","bhav","verb","bhū"
"14","/","","","","punct",""
"","</s>","","","","",""
"","<s number=""18"">","","","","",""
"1","tena","","","tad","pron",""
"2","kālena","KĀL","ena","kāla","noun-adj",""
"3","tena","","","tad","pron",""
"4","samayena","SAMAY","ena","samaya","noun-adj",""
"5","sarveśvaro","SARVEŚVAR","o","sarveśvara","noun-adj",""
"6","nāma","NĀM","a","nāman","noun-adj",""
"7","tathāgataḥ","TATHĀGAT","aḥ","tathāgata","noun-adj",""
"8","arhan","ARH","an","arhat","noun-adj",""
"9","samyak","SAMYAK","","samyaka","noun-adj",""
"10","sambuddho","SAMBUDDH","o","sambuddha","noun-adj",""
"11","vidya","VIDY","a@","vidyā","noun-adj",""
"12","ācaraṇa","ĀCARAṆ","a@","ācaraṇa","noun-adj",""
"13","sampannaḥ","SAMPANN","aḥ","sampanna","noun-adj",""
"14","sugato","SUGAT","o","sugata","noun-adj",""
"15","lokavid","LOKAV","id","lokavat","noun-adj",""
"16","anuttaraḥ","ANUTTAR","aḥ","anuttara","noun-adj",""
"17","puruṣadamyasārathiḥ","PURUṢADAMYASĀRATH","iḥ","puruṣadamyasārathi","noun-adj",""
"18","deva","DEV","a@","deva","noun-adj",""
"19","manuṣyāṇāṃ","MANUṢY","āṇāṃ","manuṣya","noun-adj",""
"20","śāstā","ŚĀST","ā","śastṛ","noun-adj",""
"21","bhagavān","BHAGAV","ān","bhagavat","noun-adj",""
"22","buddhaḥ","BUDDH","aḥ","buddha","noun-adj",""
"23","samba","SAMB","a@","samba","noun-adj",""
"24","bhūva","BHŪVA","","bhūvah","noun-adj",""
"25","//5//","","","","punct",""
"","</s>","","","","",""
"","<s number=""19"">","","","","",""
"1","tasya","","","tad","pron",""
"2","bhagavataḥ","BHAGAVAT","aḥ","bhagavatī","noun-adj",""
"3","sarveśvarasya","SARVEŚVAR","asya","sarveśvara","noun-adj",""
"4","sakāśād","SAKĀŚ","ād","sakāśa","noun-adj",""
"5","mayā","","","mat","pron",""
"6","imāni","","","idam","pron",""
"7","mahāmāyā","MAHĀMĀY","ā@","mahāmāyā","noun-adj",""
"8","vijayavāhinī","VIJAYAVĀHIN","ī","vijayavāhinī","noun-adj",""
"9","nāma","NĀM","a","nāman","noun-adj",""
"10","vidyā","VIDY","ā@","vidyā","noun-adj",""
"11","mantrapadāni","MANTRAPAD","āni","mantrapada","noun-adj",""
"12","su","","","su","ind",""
"13","gṛhītāni","GṚHĪT","āni","gṛhīta","noun-adj",""
"14","dhāritāti","DHĀRIT","āti","dhārita","noun-adj",""
"15","ca","","","ca","ind",""
"16","paṭhitāni","PAṬHIT","āni","paṭhita","noun-adj",""
"17","av","","","","ind",""
"18","agatāni","AGAT","āni","agata","noun-adj",""
"19","anumoditāni","ANUMODIT","āni","anumodita","noun-adj",""
"20","parasya","PAR","asya","para","noun-adj",""
"21","ca","","","ca","ind",""
"22","vistareṇa","VISTAREṆ","a","vistareṇa","noun-adj",""
"23","samprakāśitāni","SAMPRAKĀŚIT","āni","samprakāśita","noun-adj",""
"24","/","","","","punct",""
"","</s>","","","","",""
"","<s number=""20"">","","","","",""
"1","asy","","","as","verb","as"
"2","^","","","","",""
"3","ā","","","alpha_privativum","ind",""
"4","dhāraṇyāḥ","DHĀRAṆ","yāḥ","dhāraṇī","noun-adj",""
"5","prabhāveṇa","PRABHĀVEṆ","a","prabhāveṇa","noun-adj",""
"6","nārāyaṇa","NĀRĀYAṆ","a","nārāyaṇa","noun-adj",""
"7","na","","","na","ind",""
"8","jātu","JĀT","u@","jātu","noun-adj",""
"9","ari","ARI","","ari","noun-adj",""
"10","bhayaṃ","BHAY","aṃ","bhaya","noun-adj",""
"11","na","","","na","ind",""
"12","akuśala","AKUŚAL","a@","akuśala","noun-adj",""
"13","bhayaṃ","BHAY","aṃ","bhaya","noun-adj",""
"14","na","","","na","ind",""
"15","cora","COR","a@","cora","noun-adj",""
"16","bhayaṃ","BHAY","aṃ","bhaya","noun-adj",""
"17","vā","","","vā","ind",""
"18","bhavet","BHAV","et","bhav","verb","bhū"
"19","/","","","","punct",""
"","</s>","","","","",""
"","<s number=""21"">","","","","",""
"1","varṣa","VARṢ","a@","varṣa","noun-adj",""
"2","śatasahasrāṇi","ŚATASAHASR","āṇi","śatasahasra","noun-adj",""
"3","ca","","","ca","ind",""
"4","rājyaṃ","RĀJY","aṃ","rājya","noun-adj",""
"5","dharmeṇa","DHARM","eṇa","dharma","noun-adj",""
"6","kṛtvā","KṚT","vā","kṛta","noun-adj",""
"7","paśvāt","PAŚ","vāt","paśvat","noun-adj",""
"8","saukhyena","SAUKHY","ena","saukhya","noun-adj",""
"9","nagarān","NAGAR","ān","nagara","noun-adj",""
"10","nagara","NAGAR","a@","nagara","noun-adj",""
"11","āntaraṃ","ANTAR","aṃ","antara","noun-adj",""
"12","pramoda","PRAMOD","a@","pramoda","noun-adj",""
"13","vanaya","VANAY","a@","vanaya","noun-adj",""
"14","ā","","","alpha_privativum","ind",""
"15","trāmiva","TRĀM","iva","trāman","noun-adj",""
"16","dhāraṇyāḥ","DHĀRAṆ","yāḥ","dhāraṇī","noun-adj",""
"17","prabhāveṇa","PRABHĀVEṆ","a","prabhāveṇa","noun-adj",""
"18","gataḥ","GAT","aḥ","gata","noun-adj",""
"19","/","","","","punct",""
"","</s>","","","","",""
"","<s number=""22"">","","","","",""
"1","janma","JANM","a@","janma","noun-adj",""
"2","āntare","ANTAR","e","antara","noun-adj",""
"3","māndhātā","MĀNDHĀT","ā","māndhātṛ","noun-adj",""
"4","nāma","NĀM","a","nāman","noun-adj",""
"5","bodhisattvaś","BODHISATTV","aś","bodhisattva","noun-adj",""
"6","cakravartī","CAKRAVART","ī","cakravartin","noun-adj",""
"7","rājā","RĀJ","ā","rājan","noun-adj",""
"8","abhūva","aBHŪVA","","bhav","verb","bhū"
"9","/","","","","punct",""
"","</s>","","","","",""
"","<s number=""23"">","","","","",""
"1","sapta","SAPT","a@","sapta","noun-adj",""
"2","ratna","RATN","a@","ratna","noun-adj",""
"3","samanvāgataś","SAMANVĀGAT","aś","samanvāgata","noun-adj",""
"4","ca","","","ca","ind",""
"5","/","","","","punct",""
"","</s>","","","","",""
"","<s number=""24"">","","","","",""
"1","bhuvana","BHUVAN","a@","bhuvana","noun-adj",""
"2","tritayānteṣvā","TRITAY","ānteṣvā","tritaya","noun-adj",""
"3","jñāṃ","JÑĀ","ṃ","jñās","noun-adj",""
"4","pracārit","PRACĀR","it","pracāra","noun-adj",""
"5","avāna","AVĀN","a","avāna","noun-adj",""
"6","/","","","","punct",""
"","</s>","","","","",""
"","<s number=""25"">","","","","",""
"1","pūrvaṃ","PŪRV","aṃ","pūrva","noun-adj",""
"2","dānapāramitā","DĀNAPĀRAMIT","ā@","dānapāramitā","noun-adj",""
"3","niṣpannatayā","NIṢPANN","atayā","niṣpanna","noun-adj",""
"4","sarva","SARV","a@","sarva","noun-adj",""
"5","sattvebhyo","SATTV","ebhyo","sattva","noun-adj",""
"6","hitāya","HIT","āya","hita","noun-adj",""
"7","sukhāya","SUKH","āya","sukha","noun-adj",""
"8","ca","","","ca","ind",""
"9","y","","","","ind",""
"10","atha","ATH","a@","atha","noun-adj",""
"11","ābhilaṣitaṃ","ABHILAṢIT","aṃ","abhilaṣita","noun-adj",""
"12","dhanaṃ","DHAN","aṃ","dhana","noun-adj",""
"13","va","","","vai","ind",""
"14","varṣa","VARṢ","a","varṣa","noun-adj",""
"15","/","","","","punct",""
"","</s>","","","","",""
"","<s number=""26"">","","","","",""
"1","sarva","SARV","a@","sarva","noun-adj",""
"2","sattva","SATTV","a@","sattva","noun-adj",""
"3","sukha","SUKH","a@","sukha","noun-adj",""
"4","karaḥ","KAR","aḥ","kara","noun-adj",""
"5","sarva","SARV","a@","sarva","noun-adj",""
"6","hitakaś","HITAK","aś","hitaka","noun-adj",""
"7","ca","","","ca","ind",""
"8","abhūva","aBHŪVA","","bhav","verb","bhū"
"9","/","","","","punct",""
"","</s>","","","","",""
"","<s number=""27"">","","","","",""
"1","tad","","","tad","pron",""
"2","yathā","","","yathā","ind",""
"3","nārāyaṇa","NĀRĀYAṆ","a@","nārāyaṇa","noun-adj",""
"4","āsyā","ĀSY","ā","idam","pron",""
"5","dhāraṇyāḥ","DHĀRAṆ","yāḥ","dhāraṇī","noun-adj",""
"6","prabhāveṇān","PRABHĀVEṆ","ān","prabhāveṇa","noun-adj",""
"7","eka","EK","a@","eka","noun-adj",""
"8","kalpa","KALP","a@","kalpa","noun-adj",""
"9","śatasahasra","ŚATASAHASR","a@","śatasahasra","noun-adj",""
"10","dānapāramitayā","DĀNAPĀRAMIT","ayā","dānapāramitā","noun-adj",""
"11","paripūriṃ","PARIPŪR","iṃ","paripūri","noun-adj",""
"12","cakāra","CAKĀR","a","cakāra","noun-adj",""
"13","/","","","","punct",""
"","</s>","","","","",""
"","<s number=""28"">","","","","",""
"1","ye","","","yad","pron",""
"2","ca","","","ca","ind",""
"3","deva","DEV","a@","deva","noun-adj",""
"4","nāga","NĀG","a@","nāga","noun-adj",""
"5","yakṣa","YAKṢ","a@","yakṣa","noun-adj",""
"6","gandharva","GANDHARV","a@","gandharva","noun-adj",""
"7","āsura","ĀSUR","a@","āsura","noun-adj",""
"8","garuḍa","GARUḌ","a@","garuḍa","noun-adj",""
"9","kinnara","KINNAR","a@","kinnara","noun-adj",""
"10","mahoraga","MAHORAG","a@","mahoraga","noun-adj",""
"11","vidyādhara","VIDYĀDHAR","a@","vidyādhara","noun-adj",""
"12","manuṣya","MANUṢY","a@","manuṣya","noun-adj",""
"13","ā","","","alpha_privativum","ind",""
"14","manuṣyā","MANUṢY","ā","manuṣya","noun-adj",""
"15","yathā","","","yathā","ind",""
"16","diśaṃ","DIŚ","aṃ","dik","noun-adj",""
"17","tiṣṭhanti","TIṢṬH","anti","tiṣṭh","verb","sthā"
"18","na","","","na","ind",""
"19","ca","","","ca","ind",""
"20","vai","","","vai","ind",""
"21","mukhyaṃ","MUKHY","aṃ","mukhya","noun-adj",""
"22","kurvanti","KUR","vanti","kar","verb","kṛ"
"23","/","","","","punct",""
"","</s>","","","","",""
"","<s number=""29"">","","","","",""
"1","sa","","","sa_saha","ind",""
"2","catuḥ","CAT","uḥ","catur","noun-adj",""
"3","ṣaṣṭi","ṢAṢṬ","i@","ṣaṣṭi","noun-adj",""
"4","kalpa","KALP","a@","kalpa","noun-adj",""
"5","sahasrāṇi","SAHASR","āṇi","sa_saha","ind",""
"6","pūrvaṃ","PŪRV","aṃ","pūrva","noun-adj",""
"7","y","","","","ind",""
"8","āpayitvā","ĀPAYIT","vā","āpayitṛ","noun-adj",""
"9","paścād","PAŚC","ād","paśca","noun-adj",""
"10","ekasmin","EK","asmin","eka","noun-adj",""
"11","janmani","JANM","ani","janmat","noun-adj",""
"12","garuḍa","GARUḌ","a@","garuḍa","noun-adj",""
"13","bhayān","BHAY","ān","bhaya","noun-adj",""
"14","muktaḥ","MUKT","aḥ","mukta","noun-adj",""
"15","saṃsthito","SAṂSTHIT","o","saṃsthita","noun-adj",""
"16","nāga","NĀG","a@","nāga","noun-adj",""
"17","endra","INDR","a","indra","noun-adj",""
"18","iva","","","iva","ind",""
"19","anuttaraḥ","ANUTTAR","aḥ","anuttara","noun-adj",""
"20","samyak","SAMYAK","","samyaka","noun-adj",""
"21","sambuddho","SAMBUDDH","o","sambuddha","noun-adj",""
"22","buddho","BUDDH","o","buddha","noun-adj",""
"23","hi","","","hi","ind",""
"24","loka","LOK","a@","loka","noun-adj",""
"25","ānuttaro","ANUTTAR","o","anuttara","noun-adj",""
"26","arhan","ARH","an","arhat","noun-adj",""
"27","devagururba","DEVAGUR","urba","devaguru","noun-adj",""
"28","bhūva","BHŪVA","","bhūvah","noun-adj",""
"29","//6//","","","","punct",""
"","</s>","","","","",""
"","<s number=""30"">","","","","",""
"1","tena","","","tad","pron",""
"2","nārāyaṇa","NĀRĀYAṆ","a","nārāyaṇa","noun-adj",""
"3","gṛha","GṚH","a@","gṛha","noun-adj",""
"4","āṇatvaṃ","ĀṆ","atvaṃ","āṇi","noun-adj",""
"5","mahāmāyā","MAHĀMĀY","ā@","mahāmāyā","noun-adj",""
"6","vijayavāhinīṃ","VIJAYAVĀHIN","īṃ","vijayavāhinī","noun-adj",""
"7","nāma","NĀM","a","nāman","noun-adj",""
"8","dhāraṇī","DHĀRAṆ","ī@","dhāraṇī","noun-adj",""
"9","mantrapadāṇi","MANTRAPAD","āṇi","mantrapada","noun-adj",""
"10","/","","","","punct",""
"","</s>","","","","",""
"","<s number=""31"">","","","","",""
"1","tad","","","tad","pron",""
"2","yathā","","","yathā","ind",""
"3","namo","NAM","o","namas","noun-adj",""
"4","astv","AST","v","asta","noun-adj",""
"5","adhva","ADHV","a@","adhva","noun-adj",""
"6","ānugata","ANUGAT","a@","anugata","noun-adj",""
"7","pratiṣṭhitebhyaḥ","PRATIṢṬHIT","ebhyaḥ","pratiṣṭhita","noun-adj",""
"8","sarva","SARV","a@","sarva","noun-adj",""
"9","buddha","BUDDH","a@","buddha","noun-adj",""
"10","bodhisattvebhyaḥ","BODHISATTV","ebhyaḥ","bodhisattva","noun-adj",""
"11","/","","","","punct",""
"","</s>","","","","",""
"","<s number=""32"">","","","","",""
"1","sarva","SARV","a@","sarva","noun-adj",""
"2","mudrā","MUDR","ā@","mudrā","noun-adj",""
"3","mantrapadebhyaḥ","MANTRAPAD","ebhyaḥ","mantrapada","noun-adj",""
"4","/","","","","punct",""
"","</s>","","","","",""
"","<s number=""33"">","","","","",""
"1","om","","","oṃ","ind",""
"2","māye","MĀY","e","māyā","noun-adj",""
"3","mahāmāye","MAHĀMĀY","e","mahāmāyā","noun-adj",""
"4","mahāmāya","MAHĀMĀY","a@","mahāmāyā","noun-adj",""
"5","ādhāraṇi","ĀDHĀRAṆ","i","ādhāraṇi","noun-adj",""
"6","iyaṃ","","","idam","pron",""
"7","sā","","","tad","pron",""
"8","mahāmāya","MAHĀMĀY","a@","mahāmāyā","noun-adj",""
"9","āmantreṇa","AMANTR","eṇa","amantra","noun-adj",""
"10","mahāmāyā","MAHĀMĀY","ā@","mahāmāyā","noun-adj",""
"11","rūpeṇa","RŪP","eṇa","rūpa","noun-adj",""
"12","/","","","","punct",""
"","</s>","","","","",""
"","<s number=""34"">","","","","",""
"1","bhrama","BHRAM","a","bhrama","noun-adj",""
"2","bhrama","BHRAM","a","bhrama","noun-adj",""
"3","sattvānāñca","SATTV","ānāñca","sattva","noun-adj",""
"4","ye","","","yad","pron",""
"5","viru","VIR","u@","viru","noun-adj",""
"6","ūdhakaṃ","ŪDH","akaṃ","ūdhaka","noun-adj",""
"7","cintayanti","CINT","ayanti","cint","verb","cint"
"8","sarva","SARV","a@","sarva","noun-adj",""
"9","duṣṭa","DUṢṬ","a@","duṣṭa","noun-adj",""
"10","sattvās","SATTV","ās","sattva","noun-adj",""
"11","tān","","","tad","pron",""
"12","bhrāmaya","BHRĀMAY","a","bhrāmayat","noun-adj",""
"13","bhrāmaya","BHRĀMAY","a","bhrāmayat","noun-adj",""
"14","mohaya","MOH","aya","moha","noun-adj",""
"15","mohaya","MOH","aya","moha","noun-adj",""
"16","mūrcchāpaya","MŪRCCHĀPAY","a","mūrcchāpaya","noun-adj",""
"17","mūrcchāpayam","MŪRCCHĀPAY","am","mūrcchāpaya","noun-adj",""
"18","ārayam","ĀRAY","am","ārayate","noun-adj",""
"19","āraya","ĀRAY","a","ārayate","noun-adj",""
"20","vidhvaṃsaya","VIDHVAṂS","aya","vidhvaṃs","verb",""
"21","vidhvaṃsaya","VIDHVAṂS","aya","vidhvaṃs","verb",""
"22","/","","","","punct",""
"","</s>","","","","",""
"","<s number=""35"">","","","","",""
"1","mara","MAR","a","mara","noun-adj",""
"2","mara","MAR","a","mara","noun-adj",""
"3","mahāmāye","MAHĀMĀY","e","mahāmāyā","noun-adj",""
"4","a","","","alpha_privativum","ind",""
"5","lala","LAL","a@","lala","noun-adj",""
"6","lale","LAL","e","lala","noun-adj",""
"7","mahāmāyā","MAHĀMĀY","ā@","mahāmāyā","noun-adj",""
"8","jāla","JĀL","a@","jāla","noun-adj",""
"9","sahasra","SAHASR","a@","sa_saha","ind",""
"10","mukhi","MUKH","i","mukha","noun-adj",""
"11","sahasra","SAHASR","a@","sa_saha","ind",""
"12","śire","ŚIR","e","śira","noun-adj",""
"13","sahasram","SAHASR","am","sa_saha","ind",""
"14","uje","","","","ind",""
"15","jvalita","JVALIT","a@","jvalita","noun-adj",""
"16","netre","NETR","e","netra","noun-adj",""
"17","sarva","SARV","a@","sarva","noun-adj",""
"18","tathāgata","TATHĀGAT","a@","tathāgata","noun-adj",""
"19","hṛdaya","HṚDAY","a@","hṛdaya","noun-adj",""
"20","garbhe","GARBH","e","garbha","noun-adj",""
"21","asi","","","as","verb","as"
"22","dhanu","DHAN","u@","dhanu","noun-adj",""
"23","paraśu","PARAŚ","u@","paraśu","noun-adj",""
"24","pāśa","PĀŚ","a@","pāśa","noun-adj",""
"25","tomara","TOMAR","a@","tomara","noun-adj",""
"26","kanaya","KANAY","a@","kanaya","noun-adj",""
"27","śaktinṛ","ŚAKT","inṛ","śaktin","noun-adj",""
"28","muṇḍi","MUṆḌ","i@","muṇḍi","noun-adj",""
"29","haste","HAST","e","hasta","noun-adj",""
"30","mudgara","MUDGAR","a@","mudgara","noun-adj",""
"31","cakra","CAKR","a@","cakra","noun-adj",""
"32","haste","HAST","e","hasta","noun-adj",""
"33","ehyehi","","","","ind",""
"34","bhagavati","BHAGAVAT","i","bhagavatī","noun-adj",""
"35","sarva","SARV","a@","sarva","noun-adj",""
"36","tathāgata","TATHĀGAT","a@","tathāgata","noun-adj",""
"37","satyena","SATY","ena","satya","noun-adj",""
"38","devarṣi","DEVARṢ","i@","devarṣi","noun-adj",""
"39","gaṇa","GAṆ","a@","gaṇa","noun-adj",""
"40","satyena","SATY","ena","satya","noun-adj",""
"41","mahāmāyā","MAHĀMĀY","ā@","mahāmāyā","noun-adj",""
"42","vijayavāhinī","VIJAYAVĀHIN","ī","vijayavāhinī","noun-adj",""
"43","smara","SMAR","a","smara","noun-adj",""
"44","smara","SMAR","a","smara","noun-adj",""
"45","sarva","SARV","a@","sarva","noun-adj",""
"46","tathāgata","TATHĀGAT","a@","tathāgata","noun-adj",""
"47","jñāna","JÑĀN","a@","jñāna","noun-adj",""
"48","rūpeṇa","RŪP","eṇa","rūpa","noun-adj",""
"49","gaccha","GACCH","a","gaccha","noun-adj",""
"50","gaccha","GACCH","a","gaccha","noun-adj",""
"51","sarva","SARV","a@","sarva","noun-adj",""
"52","āvaraṇa","ĀVARAṆ","a@","āvaraṇa","noun-adj",""
"53","kṣayaṅ","KṢAY","aṅ","kṣaya","noun-adj",""
"54","kari","KAR","i","karin","noun-adj",""
"55","parasainya","PARASAINY","a@","parasainya","noun-adj",""
"56","vidrāviṇi","VIDRĀV","iṇi","vidrāvin","noun-adj",""
"57","mohaya","MOH","aya","moha","noun-adj",""
"58","mohaya","MOH","aya","moha","noun-adj",""
"59","mama","","","mat","pron",""
"60","sarva","SARV","a@","sarva","noun-adj",""
"61","sattvānāñca","SATTV","ānāñca","sattva","noun-adj",""
"62","sarvad","SARV","ad","sarvat","noun-adj",""
"63","uṣṭān","UṢṬ","ān","uṣṭṛ","noun-adj",""
"64","/","","","","punct",""
"","</s>","","","","",""
"","<s number=""36"">","","","","",""
"1","rakṣa","RAKṢ","a","rakṣa","noun-adj",""
"2","rakṣa","RAKṢ","a","rakṣa","noun-adj",""
"3","māṃ","","","mat","pron",""
"4","sarva","SARV","a@","sarva","noun-adj",""
"5","sattvāṃś","SATTV","āṃś","sattva","noun-adj",""
"6","ca","","","ca","ind",""
"7","yakṣa","YAKṢ","a@","yakṣa","noun-adj",""
"8","bhaya","BHAY","a@","bhaya","noun-adj",""
"9","opadravebhyaḥ","UPADRAV","ebhyaḥ","upadrava","noun-adj",""
"10","svāhā","SVĀH","ā","svāhā","noun-adj",""
"11","/","","","","punct",""
"","</s>","","","","",""
"","<s number=""37"">","","","","",""
"1","om","","","oṃ","ind",""
"2","mahāmāya","MAHĀMĀY","a@","mahāmāyā","noun-adj",""
"3","ādhāraṇīye","ĀDHĀRAṆ","īye","ādhāraṇa","noun-adj",""
"4","svāhā","SVĀH","ā","svāhā","noun-adj",""
"5","/","","","","punct",""
"","</s>","","","","",""
"","<s number=""38"">","","","","",""
"1","om","","","oṃ","ind",""
"2","mahā","MAH","ā@","mahat","noun-adj",""
"3","maṇḍala","MAṆḌAL","a@","maṇḍala","noun-adj",""
"4","ādhiṣṭhite","ADHIṢṬHIT","e","adhiṣṭhita","noun-adj",""
"5","svāhā","SVĀH","ā","svāhā","noun-adj",""
"6","/","","","","punct",""
"","</s>","","","","",""
"","<s number=""39"">","","","","",""
"1","om","","","oṃ","ind",""
"2","vajra","VAJR","a@","vajra","noun-adj",""
"3","dhara","DHAR","a@","dhara","noun-adj",""
"4","vandita","VANDIT","a@","vandita","noun-adj",""
"5","pūjitaye","PŪJIT","aye","pūjita","noun-adj",""
"6","svāhā","SVĀH","ā","svāhā","noun-adj",""
"7","/","","","","punct",""
"","</s>","","","","",""
"","<s number=""40"">","","","","",""
"1","om","","","oṃ","ind",""
"2","padma","PADM","a@","padma","noun-adj",""
"3","pāṇi","PĀṆ","i@","pāṇi","noun-adj",""
"4","priyāya","PRIY","āya","priya","noun-adj",""
"5","svāhā","SVĀH","ā","svāhā","noun-adj",""
"6","/","","","","punct",""
"","</s>","","","","",""
"","<s number=""41"">","","","","",""
"1","om","","","oṃ","ind",""
"2","sarva","SARV","a@","sarva","noun-adj",""
"3","deva","DEV","a","deva","noun-adj",""
"4","^","","","","",""
"5","a","","","alpha_privativum","ind",""
"6","namaskṛte","NAMASKṚT","e","namaskṛti","noun-adj",""
"7","svāhā","SVĀH","ā","svāhā","noun-adj",""
"8","/","","","","punct",""
"","</s>","","","","",""
"","<s number=""42"">","","","","",""
"1","om","","","oṃ","ind",""
"2","mātṛ","MĀT","ṛ@","mātṛ","noun-adj",""
"3","gaṇa","GAṆ","a@","gaṇa","noun-adj",""
"4","vandita","VANDIT","a@","vandita","noun-adj",""
"5","pūjitāyai","PŪJIT","āyai","pūjita","noun-adj",""
"6","svāhā","SVĀH","ā","svāhā","noun-adj",""
"7","/","","","","punct",""
"","</s>","","","","",""
"","<s number=""43"">","","","","",""
"1","om","","","oṃ","ind",""
"2","jaye","JAY","e","jaya","noun-adj",""
"3","svāhā","SVĀH","ā","svāhā","noun-adj",""
"4","/","","","","punct",""
"","</s>","","","","",""
"","<s number=""44"">","","","","",""
"1","om","","","oṃ","ind",""
"2","vijaye","VIJAY","e","vijaya","noun-adj",""
"3","svāhā","SVĀH","ā","svāhā","noun-adj",""
"4","/","","","","punct",""
"","</s>","","","","",""
"","<s number=""45"">","","","","",""
"1","om","","","oṃ","ind",""
"2","svāhā","SVĀH","ā","svāhā","noun-adj",""
"3","/","","","","punct",""
"","</s>","","","","",""
"","<s number=""46"">","","","","",""
"1","om","","","oṃ","ind",""
"2","avidhite","VIDH","ite","vidhas","noun-adj",""
"3","svāhā","SVĀH","ā","svāhā","noun-adj",""
"4","/","","","","punct",""
"","</s>","","","","",""
"","<s number=""47"">","","","","",""
"1","om","","","oṃ","ind",""
"2","aparājite","APARĀJIT","e","aparājita","noun-adj",""
"3","svāhā","SVĀH","ā","svāhā","noun-adj",""
"4","/","","","","punct",""
"","</s>","","","","",""
"","<s number=""48"">","","","","",""
"1","om","","","oṃ","ind",""
"2","mo","","","","ind",""
"3","hanīye","HANĪY","e","hanīyas","noun-adj",""
"4","svāhā","SVĀH","ā","svāhā","noun-adj",""
"5","/","","","","punct",""
"","</s>","","","","",""
"","<s number=""49"">","","","","",""
"1","om","","","oṃ","ind",""
"2","stambha","STAMBH","a@","stambha","noun-adj",""
"3","nāye","NĀY","e","nāya","noun-adj",""
"4","svāhā","SVĀH","ā","svāhā","noun-adj",""
"5","/","","","","punct",""
"","</s>","","","","",""
"","<s number=""50"">","","","","",""
"1","om","","","oṃ","ind",""
"2","jambhanīye","JAMBHAN","īye","jambhana","noun-adj",""
"3","svāhā","SVĀH","ā","svāhā","noun-adj",""
"4","/","","","","punct",""
"","</s>","","","","",""
"","<s number=""51"">","","","","",""
"1","om","","","oṃ","ind",""
"2","jayantiye","JA","yantiye","jā","noun-adj",""
"3","svāhā","SVĀH","ā","svāhā","noun-adj",""
"4","/","","","","punct",""
"","</s>","","","","",""
"","<s number=""52"">","","","","",""
"1","om","","","oṃ","ind",""
"2","bhramaṇīye","BHRAMAṆĪY","e","bhramaṇīya","noun-adj",""
"3","svāhā","SVĀH","ā","svāhā","noun-adj",""
"4","/","","","","punct",""
"","</s>","","","","",""
"","<s number=""53"">","","","","",""
"1","om","","","oṃ","ind",""
"2","bhramaṇīye","BHRAMAṆĪY","e","bhramaṇīya","noun-adj",""
"3","svāhā","SVĀH","ā","svāhā","noun-adj",""
"4","/","","","","punct",""
"","</s>","","","","",""
"","<s number=""54"">","","","","",""
"1","om","","","oṃ","ind",""
"2","sarva","SARV","a@","sarva","noun-adj",""
"3","āsura","ĀSUR","a@","āsura","noun-adj",""
"4","damanīye","DAMANĪY","e","damanīya","noun-adj",""
"5","svāhā","SVĀH","ā","svāhā","noun-adj",""
"6","/","","","","punct",""
"","</s>","","","","",""
"","<s number=""55"">","","","","",""
"1","om","","","oṃ","ind",""
"2","maha","MAH","a@","mahat","noun-adj",""
"3","ākāla","ĀKĀL","a@","ākāla","noun-adj",""
"4","vandita","VANDIT","a@","vandita","noun-adj",""
"5","pūjitāyai","PŪJIT","āyai","pūjita","noun-adj",""
"6","svāhā","SVĀH","ā","svāhā","noun-adj",""
"7","/","","","","punct",""
"","</s>","","","","",""
"","<s number=""56"">","","","","",""
"1","om","","","oṃ","ind",""
"2","kāmarūpiṇīye","KĀMARŪPIṆ","īye","kāmarūpiṇī","noun-adj",""
"3","svāhā","SVĀH","ā","svāhā","noun-adj",""
"4","/","","","","punct",""
"","</s>","","","","",""
"","<s number=""57"">","","","","",""
"1","om","","","oṃ","ind",""
"2","māyā","MĀY","ā@","māyā","noun-adj",""
"3","rākṣasīye","RĀKṢAS","īye","rākṣasa","noun-adj",""
"4","svāhā","SVĀH","ā","svāhā","noun-adj",""
"5","/","","","","punct",""
"","</s>","","","","",""
"","<s number=""58"">","","","","",""
"1","om","","","oṃ","ind",""
"2","rara","","","","ind",""
"3","svāhā","SVĀH","ā","svāhā","noun-adj",""
"4","/","","","","punct",""
"","</s>","","","","",""
"","<s number=""59"">","","","","",""
"1","om","","","oṃ","ind",""
"2","rū","","","","ind",""
"3","rū","","","","ind",""
"4","hūṃ","","","","ind",""
"5","hūṃ","","","","ind",""
"6","phaṭ","PHAṬ","","phaṭa","noun-adj",""
"7","he","","","","ind",""
"8","he","","","","ind",""
"9","jaye","JAY","e","jaya","noun-adj",""
"10","māyā","MĀY","ā","māyā","noun-adj",""
"11","bhagavati","BHAGAVAT","i","bhagavatī","noun-adj",""
"12","mahāmāyā","MAHĀMĀY","ā@","mahāmāyā","noun-adj",""
"13","vijayavāhinī","VIJAYAVĀHIN","ī","vijayavāhinī","noun-adj",""
"14","gṛhāṇa","GṚH","āṇa","gṛha","noun-adj",""
"15","/","","","","punct",""
"","</s>","","","","",""
"","<s number=""60"">","","","","",""
"1","śīghram","ŚĪGHR","am","śīghra","noun-adj",""
"2","ā","","","alpha_privativum","ind",""
"3","vilamba","VILAMB","a@","vilamba","noun-adj",""
"4","sva","SV","a","sva","noun-adj",""
"5","mama","","","mat","pron",""
"6","sarva","SARV","a@","sarva","noun-adj",""
"7","sattvānāṃ","SATTV","ānāṃ","sattva","noun-adj",""
"8","ca","","","ca","ind",""
"9","sarva","SARV","a@","sarva","noun-adj",""
"10","kāryaṃ","KĀRY","aṃ","kārya","noun-adj",""
"11","kuru","KUR","u@","kar","verb","kṛ"
"12","kuru","KUR","u","kar","verb","kṛ"
"13","hūṃ","","","","ind",""
"14","hūṃ","","","","ind",""
"15","phaṭ","PHAṬ","","phaṭa","noun-adj",""
"16","phaṭ","PHAṬ","","phaṭa","noun-adj",""
"17","svāhā","SVĀH","ā","svāhā","noun-adj",""
"18","//7//","","","","punct",""
"","</s>","","","","",""
"","<s number=""61"">","","","","",""
"1","nārāyaṇa","NĀRĀYAṆ","a","nārāyaṇa","noun-adj",""
"2","gṛhītvā","GṚHĪT","vā","gṛhīta","noun-adj",""
"3","tvam","","","tvat","pron",""
"4","evaṃ","","","eva","ind",""
"5","mahāmāyā","MAHĀMĀY","ā@","mahāmāyā","noun-adj",""
"6","vijayavāhinīṃ","VIJAYAVĀHIN","īṃ","vijayavāhinī","noun-adj",""
"7","nāma","NĀM","a","nāman","noun-adj",""
"8","guhya","GUHY","a@","guhya","noun-adj",""
"9","mantrapadāni","MANTRAPAD","āni","mantrapada","noun-adj",""
"10","paṭhitvā","PAṬHIT","vā","paṭhita","noun-adj",""
"11","ca","","","ca","ind",""
"12","parasya","PAR","asya","para","noun-adj",""
"13","vistareṇa","VISTAREṆ","a","vistareṇa","noun-adj",""
"14","upadiśa","UPADIŚ","a","upadiśa","noun-adj",""
"15","/","","","","punct",""
"","</s>","","","","",""
"","<s number=""62"">","","","","",""
"1","nārāyaṇa","NĀRĀYAṆ","a","nārāyaṇa","noun-adj",""
"2","atha","","","atha","ind",""
"3","tasmin","","","tad","pron",""
"4","sampa","SAMP","a@","sampa","noun-adj",""
"5","rāye","RĀY","e","rāya","noun-adj",""
"6","senayor","SEN","ayor","sena","noun-adj",""
"7","ubhayor","UBHAY","or","ubhayu","noun-adj",""
"8","madhye","MADH","ye","madhu","noun-adj",""
"9","pañcasu","PAÑC","asu","pañc","verb",""
"10","sthāneṣu","STHĀN","eṣu","sthāna","noun-adj",""
"11","etad","ETAD","","tad","pron",""
"12","dhāraṇī","DHĀRAṆ","ī@","dhāraṇī","noun-adj",""
"13","cakraṃ","CAKR","aṃ","cakra","noun-adj",""
"14","ratha","RATH","a@","ratha","noun-adj",""
"15","pratikṛtau","PRATIKṚT","au","pratikṛta","noun-adj",""
"16","yuñjyāt","YUÑJ","yāt","yuñjat","noun-adj",""
"17","/","","","","punct",""
"","</s>","","","","",""
"","<s number=""63"">","","","","",""
"1","nārāyaṇa","NĀRĀYAṆ","a","nārāyaṇa","noun-adj",""
"2","ubhayor","UBHAY","or","ubhayu","noun-adj",""
"3","madhye","MADHY","e","madhya","noun-adj",""
"4","pa","","","","ind",""
"5","rase","RAS","e","rasa","noun-adj",""
"6","nāgre","NĀG","re","nāga","noun-adj",""
"7","tasmin","","","tad","pron",""
"8","ratha","RATH","a@","ratha","noun-adj",""
"9","madhye","MADHY","e","madhya","noun-adj",""
"10","mahāmāyā","MAHĀMĀY","ā@","mahāmāyā","noun-adj",""
"11","vijayavā","VIJAYAV","ā@","vijayavat","noun-adj",""
"12","hiṇīṃ","HIṆ","īṃ","hiṇḍ","noun-adj",""
"13","nāma","NĀM","a","nāman","noun-adj",""
"14","vidyā","VIDY","ā@","vidyā","noun-adj",""
"15","rājñīṃ","RĀJ","ñīṃ","rājan","noun-adj",""
"16","aneka","ANEK","a@","aneka","noun-adj",""
"17","śatasahasra","ŚATASAHASR","a@","śatasahasra","noun-adj",""
"18","rūpāṃ","RŪP","āṃ","rūpa","noun-adj",""
"19","aneka","ANEK","a@","aneka","noun-adj",""
"20","śatasahasra","ŚATASAHASR","a@","śatasahasra","noun-adj",""
"21","bhujāṃ","BHUJ","āṃ","bhujā","noun-adj",""
"22","tri","TR","i@","tri","noun-adj",""
"23","netrāṃ","NETR","āṃ","netrā","noun-adj",""
"24","lohita","LOH","ita@","loha","noun-adj",""
"25","kṛṣṇa","KṚṢṆ","a@","kṛṣṇa","noun-adj",""
"26","varṇāṃ","VARṆ","āṃ","varṇā","noun-adj",""
"27","dīptaiś","DĪPT","aiś","dīpta","noun-adj",""
"28","catur","CAT","ur","catur","noun-adj",""
"29","vaktraiḥ","VAKTR","aiḥ","vaktra","noun-adj",""
"30","para","PAR","a@","para","noun-adj",""
"31","senāṃ","SEN","āṃ","sena","noun-adj",""
"32","bhakṣayantīmiva","BHAKṢ","ayantīmiva","bhakṣa","noun-adj",""
"33","cintayet","CINTAY","et","cint","verb","cint"
"34","/","","","","punct",""
"","</s>","","","","",""
"","<s number=""64"">","","","","",""
"1","svayam","SVAY","am","svaya","noun-adj",""
"2","eva","","","eva","ind",""
"3","cakravarty","CAKRAVART","y@","cakravartin","noun-adj",""
"4","ākāraṃ","ĀKĀR","aṃ","ākāra","noun-adj",""
"5","kṛtvā","KṚT","vā","kṛta","noun-adj",""
"6","ma","","","","ind",""
"7","dhyānhe","DHYĀN","he","dhyāna","noun-adj",""
"8","dhāraṇīṃ","DHĀRAṆ","īṃ","dhāraṇī","noun-adj",""
"9","kuṅkumena","KUṄKUM","ena","kuṅkuma","noun-adj",""
"10","likhitvā","LIKHIT","vā","likhita","noun-adj",""
"11","rājā","RĀJ","ā","rājan","noun-adj",""
"12","parasya","PAR","asya","para","noun-adj",""
"13","ca","","","ca","ind",""
"14","senāṃ","SEN","āṃ","sena","noun-adj",""
"15","svabhāvena","SVABHĀV","ena","svabhāva","noun-adj",""
"16","māyā","MĀY","ā@","māyā","noun-adj",""
"17","sadṛśena","SADṚŚ","ena","sadṛśa","noun-adj",""
"18","c","","","ca","ind",""
"19","chādayan","CHĀD","ayan","chāda","noun-adj",""
"20","vividhena","VIVIDH","ena","vividha","noun-adj",""
"21","sāreṇa","SĀR","eṇa","sāra","noun-adj",""
"22","vijayī","VIJAY","ī","vijayin","noun-adj",""
"23","bhaviṣyati","BHAV","iṣyati","bhav","verb","bhū"
"24","/","","","","punct",""
"","</s>","","","","",""
"","<s number=""65"">","","","","",""
"1","nārāyaṇa","NĀRĀYAṆ","a","nārāyaṇa","noun-adj",""
"2","ariya","ARIY","a@","ariya","noun-adj",""
"3","odhāḥ","ODH","āḥ","odhas","noun-adj",""
"4","nirjitāḥ","NIRJIT","āḥ","nirjita","noun-adj",""
"5","parājitāḥ","PARĀJIT","āḥ","parājita","noun-adj",""
"6","kecit","","","kimcit","ind",""
"7","murcchhitā","MURCCHHIT","ā","murcchhitā","noun-adj",""
"8","bhūtale","BHŪTAL","e","bhūtala","noun-adj",""
"9","pa","","","","ind",""
"10","tanti","TANT","i","tad","pron",""
"11","iti","","","iti","ind",""
"12","vadāmi","VAD","āmi","vad","verb","vad"
"13","/","","","","punct",""
"","</s>","","","","",""
"","<s number=""66"">","","","","",""
"1","nārāyaṇa","NĀRĀYAṆ","a","nārāyaṇa","noun-adj",""
"2","evaṃ","","","eva","ind",""
"3","patitāś","PATIT","āś","patita","noun-adj",""
"4","ca","","","ca","ind",""
"5","daśā","DAŚ","ā@","daśā","noun-adj",""
"6","kuśala","KUŚAL","a@","kuśala","noun-adj",""
"7","karm","KARM","","karman","noun-adj",""
"8","abhīḥ","ABHI","iḥ","abhii","noun-adj",""
"9","mārga","MĀRG","a@","mārga","noun-adj",""
"10","occhedād","UCCHED","ād","uccheda","noun-adj",""
"11","hri","","","","ind",""
"12","yante","","","","ind",""
"13","/","","","","punct",""
"","</s>","","","","",""
"","<s number=""67"">","","","","",""
"1","teṣāṃ","","","tad","pron",""
"2","ca","","","ca","ind",""
"3","jīvitaṃ","JĪVIT","aṃ","jīvita","noun-adj",""
"4","pratihata","PRATIHAT","a@","pratihata","noun-adj",""
"5","phalaṃ","PHAL","aṃ","phala","noun-adj",""
"6","na","","","na","ind",""
"7","bhavati","BHAV","ati","bhav","verb","bhū"
"8","/","","","","punct",""
"","</s>","","","","",""
"","<s number=""68"">","","","","",""
"1","nārāyaṇa","NĀRĀYAṆ","a","nārāyaṇa","noun-adj",""
"2","īdṛśaḥ","ĪDṚŚ","aḥ","īdṛśa","noun-adj",""
"3","prabhāvaḥ","PRABHĀV","aḥ","prabhāva","noun-adj",""
"4","praśastāyā","PRAŚAST","āyā","praśasta","noun-adj",""
"5","dhāraṇyāḥ","DHĀRAṆ","yāḥ","dhāraṇī","noun-adj",""
"6","/","","","","punct",""
"","</s>","","","","",""
"","<s number=""69"">","","","","",""
"1","nārāyaṇa","NĀRĀYAṆ","a","nārāyaṇa","noun-adj",""
"2","api","","","api","ind",""
"3","ca","","","ca","ind",""
"4","kasyacide","KASYACID","e","kasyacida","noun-adj",""
"5","tāni","TĀN","i","tad","pron",""
"6","dhāraṇī","DHĀRAṆ","ī@","dhāraṇī","noun-adj",""
"7","mantrapadāni","MANTRAPAD","āni","mantrapada","noun-adj",""
"8","vā","","","vā","ind",""
"9","śuddhyā","ŚUDDH","yā","śuddhi","noun-adj",""
"10","śuddhyā","ŚUDDH","yā","śuddhi","noun-adj",""
"11","yogyāni","YOGY","āni","yogya","noun-adj",""
"12","/","","","","punct",""
"","</s>","","","","",""
"","<s number=""70"">","","","","",""
"1","upavāsenān","UPAVĀS","enān","upavāsa","noun-adj",""
"2","upavāsena","UPAVĀS","ena","upavāsa","noun-adj",""
"3","vā","","","vā","ind",""
"4","yogyāni","YOGY","āni","yogya","noun-adj",""
"5","bhavanti","BHAV","anti","bhav","verb","bhū"
"6","/","","","","punct",""
"","</s>","","","","",""
"","<s number=""71"">","","","","",""
"1","pratidinaṃ","PRATIDIN","aṃ","pratidina","noun-adj",""
"2","tri","TR","i@","tri","noun-adj",""
"3","vāram","VĀR","am","vāra","noun-adj",""
"4","uccārayet","UCCĀRAY","et","uccāraya","noun-adj",""
"5","/","","","","punct",""
"","</s>","","","","",""
"","<s number=""72"">","","","","",""
"1","ten","","","tad","pron",""
"2","^","","","","",""
"3","aiva","","","eva","ind",""
"4","kṛtam","KṚT","am","kṛta","noun-adj",""
"5","api","","","api","ind",""
"6","pañcān","PAÑC","ān","pañca","noun-adj",""
"7","antar","ANTAR","","antara","noun-adj",""
"8","ya","","","yad","pron",""
"9","pāpa","PĀP","a@","pāpa","noun-adj",""
"10","rāśiṃ","RĀŚ","iṃ","rāśi","noun-adj",""
"11","kṣapayitvā","KṢAP","ayitvā","kṣap","verb",""
"12","prāpta","PRĀPT","a@","prāpta","noun-adj",""
"13","puṇya","PUṆY","a@","puṇya","noun-adj",""
"14","rāśir","RĀŚ","ir","rāśi","noun-adj",""
"15","jātis","JĀT","is","jāti","noun-adj",""
"16","maro","MAR","o","mara","noun-adj",""
"17","bhavati","BHAV","ati","bhav","verb","bhū"
"18","/","","","","punct",""
"","</s>","","","","",""
"","<s number=""73"">","","","","",""
"1","sarva","SARV","a@","sarva","noun-adj",""
"2","sattveṣu","SATTV","eṣu","sattva","noun-adj",""
"3","sarvavyā","SARVAV","yā","sarvavat","noun-adj",""
"4","pidhan","PIDH","an","pidhat","noun-adj",""
"5","opabhogī","UPABHOG","ī","upabhogin","noun-adj",""
"6","kuśala","KUŚAL","a@","kuśala","noun-adj",""
"7","dharma","DHARM","a@","dharma","noun-adj",""
"8","bhirato","BHIRAT","o","bhirata","noun-adj",""
"9","akuśala","AKUŚAL","a@","akuśala","noun-adj",""
"10","viparīta","VIPARĪT","a@","viparīta","noun-adj",""
"11","pātakeṣu","PĀT","akeṣu","pāt","verb",""
"12","na","","","na","ind",""
"13","bhavati","BHAV","ati","bhav","verb","bhū"
"14","/","","","","punct",""
"","</s>","","","","",""
"","<s number=""74"">","","","","",""
"1","yaśca","YAŚ","ca","yaśa","noun-adj",""
"2","punar","","","punar","ind",""
"3","nārāyaṇā","NĀRĀYAṆ","ā","nārāyaṇa","noun-adj",""
"4","imāṃ","","","idam","pron",""
"5","yogyāṃ","YOGY","āṃ","yogya","noun-adj",""
"6","dhāraṇīṃ","DHĀRAṆ","īṃ","dhāraṇī","noun-adj",""
"7","dhāraya","DHĀRAY","a@","dhāraya","noun-adj",""
"8","māṇaḥ","MĀṆ","aḥ","māṇa","noun-adj",""
"9","kulaputro","KULAPUTR","o","kulaputra","noun-adj",""
"10","vā","","","vā","ind",""
"11","kuladuhitā","KULADUHIT","ā","kuladuhitṛ","noun-adj",""
"12","vā","","","vā","ind",""
"13","bhikṣa","BHIKṢ","a@","bhikṣa","noun-adj",""
"14","urvā","URV","ā","urva","noun-adj",""
"15","bhikṣuṇī","BHIKṢ","uṇī","bhikṣuṇī","noun-adj",""
"16","vā","","","vā","ind",""
"17","upāsako","UPĀSAK","o","upāsaka","noun-adj",""
"18","vā","","","vā","ind",""
"19","upāsikā","UPĀSIK","ā","upāsikā","noun-adj",""
"20","vā","","","vā","ind",""
"21","rājā","RĀJ","ā","rājan","noun-adj",""
"22","vā","","","vā","ind",""
"23","rāja","RĀJ","a@","rājan","noun-adj",""
"24","putro","PUTR","o","putra","noun-adj",""
"25","vā","","","vā","ind",""
"26","brāhmaṇo","BRĀHMAṆ","o","brāhmaṇa","noun-adj",""
"27","vā","","","vā","ind",""
"28","mṛtaḥ","MṚT","aḥ","mṛta","noun-adj",""
"29","kāla","KĀL","a@","kāla","noun-adj",""
"30","gataḥ","GAT","aḥ","gata","noun-adj",""
"31","sad","SAD","@","sat","noun-adj",""
"32","dharmabhāṇako","DHARMABHĀṆAK","o","dharmabhāṇaka","noun-adj",""
"33","vā","","","vā","ind",""
"34","dagdho","DAGDH","o","dagdha","noun-adj",""
"35","bhasmī","BHASM","ī@","bhasman","noun-adj",""
"36","bhūto","BHŪ","to","bhūta","noun-adj",""
"37","vā","","","vā","ind",""
"38","punaś","PUN","aś","puna","noun-adj",""
"39","ca","","","ca","ind",""
"40","puruṣo","PURUṢ","o","puruṣa","noun-adj",""
"41","vā","","","vā","ind",""
"42","strī","STR","ī","strī","noun-adj",""
"43","vā","","","vā","ind",""
"44","kācit","","","kimcit","ind",""
"45","spṛśet","SPṚŚ","et","spṛś","verb","spṛś"
"46","sa","","","sa_saha","ind",""
"47","eva","","","eva","ind",""
"48","niyato","NIYAT","o","niyata","noun-adj",""
"49","jātismaro","JĀTISMAR","o","jātismara","noun-adj",""
"50","bhaviṣyati","BHAV","iṣyati","bhav","verb","bhū"
"51","/","","","","punct",""
"","</s>","","","","",""
"","<s number=""75"">","","","","",""
"1","tato","","","tatas","ind",""
"2","bodhisattva","BODHISATTV","a@","bodhisattva","noun-adj",""
"3","saṃvarīyo","SAṂVAR","īyo","saṃvara","noun-adj",""
"4","nāra","NĀR","a@","nāra","noun-adj",""
"5","āyanaḥ","ĀYAN","aḥ","āyana","noun-adj",""
"6","aho","","","aho","ind",""
"7","āścaryam","ĀŚCARY","am","āścarya","noun-adj",""
"8","iti","","","iti","ind",""
"9","kṛtvā","KṚT","vā","kṛta","noun-adj",""
"10","śaṅkha","ŚAṄKH","a@","śaṅkha","noun-adj",""
"11","cakra","CAKR","a@","cakra","noun-adj",""
"12","gadā","GAD","ā@","gadā","noun-adj",""
"13","puṣpa","PUṢP","a@","puṣpa","noun-adj",""
"14","mālya","MĀLY","a@","mālya","noun-adj",""
"15","yuktaḥ","YUKT","aḥ","yukta","noun-adj",""
"16","utthāya","UTTHĀY","a@","utthāya","noun-adj",""
"17","āsanāt","ĀSAN","āt","āsana","noun-adj",""
"18","bhagavantaṃ","BHAGAVANT","aṃ","bhagavanta","noun-adj",""
"19","triḥ","","","","ind",""
"20","pradakṣiṇī","PRADAKṢIṆ","ī@","pradakṣiṇa","noun-adj",""
"21","kṛtya","KṚTY","a","kṛtya","noun-adj",""
"22","praṇamya","PRAṆAM","ya","praṇam","verb",""
"23","prahasita","PRAHASIT","a@","prahasita","noun-adj",""
"24","vadano","VADAN","o","vadana","noun-adj",""
"25","bhūt","BHŪT","","bhūta","noun-adj",""
"26","vā","","","vā","ind",""
"27","bhagavantaṃ","BHAGAVANT","aṃ","bhagavanta","noun-adj",""
"28","gāthayā","GĀTH","ayā","gāthā","noun-adj",""
"29","stauti","STAUT","i","stauti","noun-adj",""
"30","sma","","","sma","ind",""
"31","/","","","","punct",""
"","</s>","","","","",""
"","<s number=""76"">","","","","",""
"1","aho","","","aho","ind",""
"2","hy","","","hi","ind",""
"3","asura","ASUR","a@","asura","noun-adj",""
"4","devānāṃ","DEV","ānāṃ","deva","noun-adj",""
"5","lokānāṃ","LOK","ānāṃ","loka","noun-adj",""
"6","jyeṣṭhaṃ","JYEṢṬH","aṃ","jyeṣṭha","noun-adj",""
"7","śreṣṭho","ŚREṢṬH","o","śreṣṭha","noun-adj",""
"8","hy","","","hi","ind",""
"9","anuttarīkaḥ","ANUTTAR","īkaḥ","anuttara","noun-adj",""
"10","/","","","","punct",""
"11","śivaḥ","ŚIV","aḥ","śiva","noun-adj",""
"12","śānto","ŚĀNT","o","śānta","noun-adj",""
"13","athā","ATH","ā@","atha","noun-adj",""
"14","grāhya","GRĀH","ya","grāha","noun-adj",""
"15","loka","LOK","a@","loka","noun-adj",""
"16","ātīto","ATĪT","o","atīta","noun-adj",""
"17","namo","NAM","o","namas","noun-adj",""
"18","astu","","","as","verb","as"
"19","te","","","tad","pron",""
"20","//","","","","punct",""
"","</s>","","","","",""
"","<s number=""77"">","","","","",""
"1","abhāvaḥ","ABHĀV","aḥ","abhāva","noun-adj",""
"2","sarva","SARV","a@","sarva","noun-adj",""
"3","dharmāṇāṃ","DHARM","āṇāṃ","dharma","noun-adj",""
"4","bhūt","BHŪT","@","bhūta","noun-adj",""
"5","adharma","ADHARM","a@","adharma","noun-adj",""
"6","prakāśakaḥ","PRAKĀŚ","akaḥ","prakāśaka","noun-adj",""
"7","/","","","","punct",""
"8","dharmādharma","DHARMĀDHARM","a@","dharmādharma","noun-adj",""
"9","vimuktaustau","VIMUKT","austau","vimukta","noun-adj",""
"10","dharma","DHARM","a","dharma","noun-adj",""
"11","satya","SATY","a","satya","noun-adj",""
"12","namo","NAM","o","namas","noun-adj",""
"13","astu","","","as","verb","as"
"14","te","","","tad","pron",""
"15","//8//","","","","punct",""
"","</s>","","","","",""
"","<s number=""78"">","","","","",""
"1","atha","","","atha","ind",""
"2","nārāyaṇaḥ","NĀRĀYAṆ","aḥ","nārāyaṇa","noun-adj",""
"3","bhagavantaṃ","BHAGAVANT","aṃ","bhagavanta","noun-adj",""
"4","praṇamya","PRAṆAM","ya","praṇam","verb",""
"5","tvaṃ","","","tvat","pron",""
"6","mama","","","mat","pron",""
"7","vibhuḥ","VIBH","uḥ","vibhu","noun-adj",""
"8","bhagavan","BHAGAV","an","bhagavat","noun-adj",""
"9","niti","NIT","i","niti","noun-adj",""
"10","kṛtvā","KṚT","vā","kṛta","noun-adj",""
"11","prakānto","PRAKĀNT","o","prakānta","noun-adj",""
"12","abhūt","ABHŪT","","bhav","verb","bhū"
"13","/","","","","punct",""
"","</s>","","","","",""
"","<s number=""79"">","","","","",""
"1","idam","IDAM","","idam","pron",""
"2","avocad","AVOC","ad","avocat","noun-adj",""
"3","bhagavān","BHAGAV","ān","bhagavat","noun-adj",""
"4","āttamanāḥ","ĀTTAMAN","āḥ","āttamanas","noun-adj",""
"5","te","","","tad","pron",""
"6","ca","","","ca","ind",""
"7","deva","DEV","a@","deva","noun-adj",""
"8","nāga","NĀG","a@","nāga","noun-adj",""
"9","yakṣa","YAKṢ","a@","yakṣa","noun-adj",""
"10","gandharva","GANDHARV","a@","gandharva","noun-adj",""
"11","āsura","ĀSUR","a@","āsura","noun-adj",""
"12","garuḍa","GARUḌ","a@","garuḍa","noun-adj",""
"13","kinnara","KINNAR","a@","kinnara","noun-adj",""
"14","mahoraga","MAHORAG","a@","mahoraga","noun-adj",""
"15","vidyādhara","VIDYĀDHAR","a@","vidyādhara","noun-adj",""
"16","āpsara","APSAR","a@","apsara","noun-adj",""
"17","ādayaḥ","ĀD","ayaḥ","ādi","noun-adj",""
"18","sā","","","tad","pron",""
"19","ca","","","ca","ind",""
"20","sarvāvatī","SARVĀV","atī","sarvāvat","noun-adj",""
"21","parṣat","PARṢ","at","parṣad","noun-adj",""
"22","sa","","","sa_saha","ind",""
"23","devamānuṣāsuera","DEVAMĀN","uṣāsuera","devamāna","noun-adj",""
"24","garuḍa","GARUḌ","a@","garuḍa","noun-adj",""
"25","gandharvaś","GANDHARV","aś","gandharva","noun-adj",""
"26","ca","","","ca","ind",""
"27","loko","LOK","o","loka","noun-adj",""
"28","bhagavato","BHAGAVAT","o","bhagavatī","noun-adj",""
"29","bhāṣitam","BHĀṢIT","am","bhāṣita","noun-adj",""
"30","abhyanandan","ABHYANAND","an","abhyanandat","noun-adj",""
"31","niti","NIT","i","niti","noun-adj",""
"32","//9//","","","","punct",""
"","</s>","","","","",""
"","<s number=""80"">","","","","",""
"1","nārāyaṇaparipṛcchā","NĀRĀYAṆAPARIPṚCCH","ā","nārāyaṇaparipṛcchā","noun-adj",""
"2","ārya","ĀRY","a@","ārya","noun-adj",""
"3","mahāmāyā","MAHĀMĀY","ā@","mahāmāyā","noun-adj",""
"4","vijayavāhinī","VIJAYAVĀHIN","ī","vijayavāhinī","noun-adj",""
"5","nāma","NĀM","a","nāman","noun-adj",""
"6","dhāraṇī","DHĀRAṆ","ī","dhāraṇī","noun-adj",""
"7","samāptā","SAMĀPT","ā","samāpta","noun-adj",""
"8","//","","","","punct",""
"","</s>","","","","",""
"","</page>","","","","",""
"","</doc>","","","","",""
