word1,word2,ScoreA,ScoreB,ScoreC,ScoreD
vicāra,vitarka,4,4,4,4
vitarka,vikalpa,3,3,4,2
vikalpa,nimitta,2,2,3,1
saṃkalpa,dṛṣṭi,2,2,2,0
kalpa,kāla,3,3,4,4
parikalpa,paratantra,2,2,2,0
tarka,saṃkleśa,0,1,1,2
manaskāra,rūpa,1,0,0,4
citta,buddhi,3,4,5,4
saṃjñā,saṃskāra,2,3,1,0
vijñāna,devaputra,0,0,0,0
buddhi,jñāna,4,3,5,5
mati,pratītyasamutpāda,0,0,0,4
cintā,loka,1,0,0,0
nāmadheya,nāman,6,5,6,6
manas,citta,5,4,6,5
prajñā,jñāna,5,5,5,5
smṛti,mūla,0,0,0,3
bhāvanā,smṛti,4,3,2,3
artha,vyañjana,3,1,3,4
eka,samatā,3,3,2,5
kāla,yoga,0,0,0,3
duḥkha,vyādhi,3,2,4,4
bhikṣu,bodhisattva,3,3,4,4
tathāgata,buddha,6,6,6,6
jāti,yojana,0,0,0,0
śūnyatā,utpatti,1,2,1,0
darśana,svarga,1,1,0,1
samudra,nadī,3,3,4,3
vidyā,buddhi,4,4,5,4
dvaya,mahārāja,0,0,0,0
putra,duhitṛ,5,4,4,4
nimitta,lakṣaṇa,5,5,5,4
utpāda,vikṣepa,0,0,0,0
vajra,yāna,1,2,1,1
koṭi,sattva,1,1,0,0
indriya,sattva,1,1,2,0
vihāra,sthiti,3,5,3,4
viśuddhi,ātman,0,0,0,3
pāpa,kleśa,3,2,5,4
sugata,buddha,6,6,6,6
nagara,grāma,4,4,5,4
śrotra,karṇa,6,5,6,6
gocara,gagana,1,1,3,3
kinnara,bodhisattva,2,1,1,0
pratiṣedha,prasaṅga,2,2,0,3
vijñapti,saṃśaya,1,0,1,4
abhijñā,ṛddhi,4,4,4,4
pratibimba,marīci,3,3,5,3
prakāra,prāsāda,0,0,0,2
bodhi,vimukti,4,5,2,4
kuladuhitṛ,candra,0,0,0,0
upalabdhi,upalambha,5,6,6,5
niyama,vrata,5,4,6,4
skandha,sattva,2,3,3,2
yukti,sāmagrya,0,0,2,0
saṃjñā,bheda,0,0,0,0
tuṣṭi,hṛdaya,1,0,1,3
loka,saṃsāra,3,3,4,5
sukha,ānanda,5,5,6,5
sneha,karuṇā,4,3,3,3
samādhi,pramāda,2,1,1,0
nāda,śruta,3,3,2,3
pramāṇa,guṇa,0,0,2,1
tṛṇa,upāya,0,0,0,0
kṣaya,cyuti,4,5,5,6
svabhāva,nairātmya,2,1,3,2
upādāna,dāna,0,1,3,3
cintā,jñāna,3,3,3,3
gātra,śiras,3,4,3,2
prakāśa,ākāśa,2,3,3,0
nidāna,phala,3,2,3,4
patha,ratha,2,3,2,0
gati,mārga,5,2,5,2
muni,ṛṣi,5,3,6,5
ṛddhi,nātha,0,0,0,0
kartṛ,kāraka,4,6,6,4
kāraṇa,hetu,5,6,6,6
parvata,dvīpa,3,3,3,3
kalpanā,āpatti,0,0,0,0
adhiṣṭhāna,ādhāra,4,2,1,5
śūnyatā,pāpa,0,0,0,0
parigraha,svapna,0,0,0,1
dhātu,dharmatā,2,2,4,1
pradakṣiṇa,sevā,4,4,3,2
bhāva,pradeśa,1,1,0,2
bhāsa,raśmi,3,4,5,2
saṃvṛti,satya,2,2,2,1
kusuma,puṣpa,5,6,6,6
gaṅgā,preta,0,0,0,0
netra,kalpa,0,0,1,1
mṛga,āsana,0,0,0,0
pakṣa,kathā,1,0,2,1
rājya,rājan,3,3,3,3
āyuṣmat,dharma,1,1,0,0
daurmanasya,suvarṇa,0,0,0,0
karaṇa,praveśa,0,0,3,3
saṃgraha,vastu,1,1,2,2