"WordID","word","NormSTEM","suffix","lemma","PoS","Root"
"","<doc textid = ""satyasutra"" genre = ""sūtra"" title = ""satyasūtra"" author = ""n/a"" discourse = ""homiletic"" tradition = ""buddh"" period = ""uncertain"" source = ""gretil accessed june 2021 : http://gretil.sub.uni-goettingen.de/gretil/corpustei/sa_satyasutra.xml"" date_range = ""uncertain"" notes = ""very short text on the four noble truths. edited from a central asian brāhmī manuscript fragment. unable to access edition; no information on dating found."" religion = ""buddh"" edition = ""based on the ed. by e. waldschmidt. 'kleine brāhmī-schriftrolle.' nachrichten der akademie der wissenschaften in göttingen 1959; pp. 8-13. reprinted in e. waldschmidt. von ceylon bis turfan; schriften zur geschichte; literatur; religion und kunst des indischen kulturraumes. festgabe zum 70. geburtstag. göttingen 1967; pp. 388-389. contains minor restorations. no pagination available in this digitized version."" digitization = ""klaus wille"" segmentation_lemmatization = ""ligeia lugli & buddhist translators workbench team"" metadata_enrichment = ""bruno galasek-hul & buddhist translators workbench team"" proofreader = ""n/a"" permission = ""permission for derivatives from m. mehner on behalf of gretil"" reconstructions = ""none"">","","","","",""
"","<page number=""0"">","","","","",""
"","<s number=""1"">","","","","",""
"1","satyasūtra","SATYASŪTR","a","satyasūtra","noun-adj",""
"2","śrāvastyāṃ","ŚRĀVAST","yāṃ","śrāvasti","noun-adj",""
"3","nidānam","NIDĀN","am","nidāna","noun-adj",""
"4","/","","","","punct",""
"","</s>","","","","",""
"","<page number=""0000"">","","","","",""
"","<s number=""2"">","","","","",""
"1","ye","","","yad","pron",""
"2","kecid","","","kimcit","ind",""
"3","bhikṣavaḥ","BHIKṢ","avaḥ","bhikṣu","noun-adj",""
"4","samyag","SAMYA","g","samyak","noun-adj",""
"5","eva","","","eva","ind",""
"6","śraddhayā","ŚRADDH","ayā","śraddhā","noun-adj",""
"7","agārād","AGĀR","ād","agāra","noun-adj",""
"8","an","","","alpha_privativum","ind",""
"9","agārikāṃ","AGĀR","ikāṃ","agārika","noun-adj",""
"10","pravraja","PRAVRAJ","a@","pravraja","noun-adj",""
"11","ṃti","ṂT","i","ṃti","noun-adj",""
"12","sarve","SARV","e","sarva","noun-adj",""
"13","te","","","tad","pron",""
"14","caturṇām","CAT","urṇām","catur","noun-adj",""
"15","āryasatyānāṃ","ĀRYASATY","ānāṃ","āryasatya","noun-adj",""
"16","jñānāya","JÑĀN","āya","jñāna","noun-adj",""
"17","/","","","","punct",""
"","</s>","","","","",""
"","<s number=""3"">","","","","",""
"1","katameṣāṃ","KATAM","eṣāṃ","katama","noun-adj",""
"2","caturṇām","CAT","urṇām","catur","noun-adj",""
"3","/","","","","punct",""
"","</s>","","","","",""
"","<s number=""4"">","","","","",""
"1","duḥkham","DUḤKH","am","duḥkha","noun-adj",""
"2","āryasatyasya","ĀRYASATY","asya","āryasatya","noun-adj",""
"3","duḥkha","DUḤKH","a@","duḥkha","noun-adj",""
"4","samudayasya","SAMUDAY","asya","samudaya","noun-adj",""
"5","duḥkha","DUḤKH","a@","duḥkha","noun-adj",""
"6","nirodhasya","NIRODH","asya","nirodha","noun-adj",""
"7","duḥkha","DUḤKH","a@","duḥkha","noun-adj",""
"8","nirodha","NIRODH","a@","nirodha","noun-adj",""
"9","gāminī","GĀM","inī","gāmin","noun-adj",""
"10","pratipad","PRATIPAD","","pratipada","noun-adj",""
"11","āryasatyasya","ĀRYASATY","asya","āryasatya","noun-adj",""
"12","jñānāya","JÑĀN","āya","jñāna","noun-adj",""
"13","/","","","","punct",""
"","</s>","","","","",""
"","<s number=""5"">","","","","",""
"1","tasmāt","","","tad","pron",""
"2","tarhi","","","tarhi","ind",""
"3","caturṇām","CAT","urṇām","catur","noun-adj",""
"4","āryasatyānām","ĀRYASATY","ānām","āryasatya","noun-adj",""
"5","an","","","alpha_privativum","ind",""
"6","abhisamitānām","ABHISAMIT","ānām","abhisamiti","noun-adj",""
"7","abhisamayāya","ABHISAMAY","āya","abhisamaya","noun-adj",""
"8","atimātraṃ","ATIMĀTR","aṃ","atimātra","noun-adj",""
"9","tīvrac","TĪVR","ac","tīvrat","noun-adj",""
"10","chando","CHAND","o","chanda","noun-adj",""
"11","vyāyāmaś","VYĀYĀM","aś","vyāyāma","noun-adj",""
"12","cotsuḍhiś","","","","ind",""
"13","c","","","ca","ind",""
"14","^","","","","",""
"15","ā","","","alpha_privativum","ind",""
"16","prativāṇiś","PRATIVĀṆ","iś","prativāṇi","noun-adj",""
"17","ca","","","ca","ind",""
"18","smṛtyā","SMṚT","yā","smṛti","noun-adj",""
"19","saṃprajanyena","SAṂPRAJANY","ena","saṃprajanya","noun-adj",""
"20","ca","","","ca","ind",""
"21","yogaḥ","YOG","aḥ","yoga","noun-adj",""
"22","karaṇīyaḥ","KARAṆĪY","aḥ","karaṇīya","noun-adj",""
"23","/","","","","punct",""
"","</s>","","","","",""
"","<s number=""6"">","","","","",""
"1","katameṣāṃ","KATAM","eṣāṃ","katama","noun-adj",""
"2","caturṇām","CAT","urṇām","catur","noun-adj",""
"3","/","","","","punct",""
"","</s>","","","","",""
"","<s number=""7"">","","","","",""
"1","duḥkham","DUḤKH","am","duḥkha","noun-adj",""
"2","āryasatyasya","ĀRYASATY","asya","āryasatya","noun-adj",""
"3","duḥkha","DUḤKH","a@","duḥkha","noun-adj",""
"4","samudayasya","SAMUDAY","asya","samudaya","noun-adj",""
"5","duḥkha","DUḤKH","a@","duḥkha","noun-adj",""
"6","nirodhasya","NIRODH","asya","nirodha","noun-adj",""
"7","duḥkha","DUḤKH","a@","duḥkha","noun-adj",""
"8","nirodha","NIRODH","a@","nirodha","noun-adj",""
"9","gāminī","GĀM","inī","gāmin","noun-adj",""
"10","pratipad","PRATIPAD","","pratipada","noun-adj",""
"11","āryasatyasya","ĀRYASATY","asya","āryasatya","noun-adj",""
"12","iti","","","iti","ind",""
"13","/","","","","punct",""
"","</s>","","","","",""
"","<s number=""8"">","","","","",""
"1","x","","","CORRUPTED","ind",""
"2","xo","","","CORRUPTED","ind",""
"3","x","","","CORRUPTED","ind",""
"4","ai","","","","ind",""
"5","x","","","CORRUPTED","ind",""
"6","x","","","CORRUPTED","ind",""
"7","satyasūtraṃ","SATYASŪTR","aṃ","satyasūtra","noun-adj",""
"8","samāptaḥ","SAMĀPT","aḥ","samāpta","noun-adj",""
"9","/","","","","punct",""
"","</s>","","","","",""
"","<s number=""9"">","","","","",""
"1","rakṣaṃ","RAKṢ","aṃ","rakṣa","noun-adj",""
"2","bhavatu","BHAV","atu","bhav","verb","bhū"
"3","//","","","","punct",""
"4","x","","","CORRUPTED","ind",""
"5","x","","","CORRUPTED","ind",""
"6","x","","","CORRUPTED","ind",""
"7","s","","","su","ind",""
"8","yasya","YAŚ","ya","yad","pron",""
"9","svāhā","SVĀH","ā","svāhā","noun-adj",""
"10","//","","","","punct",""
"","</s>","","","","",""
"","</page>","","","","",""
"","</doc>","","","","",""
