"WordID","word","NormSTEM","suffix","lemma","PoS","Root"
"","<doc textid = ""mahamanivipulavimanavizvasupratisthitaguhyaparamarahasyakalparajadharani"" genre = ""tantra"" title = ""mahāmaṇivipulavimānaviśvasupratiṣṭhitaguhyaparamarahasyakalparājadhāraṇī"" author = ""n /a"" discourse = ""tantra"" tradition = ""tantra"" period = ""foundational"" source = ""gretil accessed sept 2020 : http://gretil.sub.uni-goettingen.de/gretil/corpustei/sa_.xml"" date_range = ""unknown"" notes = ""short fragmentary text on use of mantra; mudrā; iconography. dating unknown; dating gilgit manuscripts: c 5th-7th cent ce"" religion = ""buddh"" edition = ""based on the ed. by h. matsumura 1983; page number = folio number gilgit ms; punctuation and § removed"" digitization = ""k. wille"" segmentation_lemmatization = ""ligeia lugli & buddhist translators workbench team"" metadata_enrichment = ""bruno galasek-hul & buddhist translators workbench team"" proofreader = ""n/a"" permission = ""permission for derivatives from m. mehner on behalf of gretil"" reconstructions = ""none"">","","","","",""
"","<page number=""0"">","","","","",""
"","<s number=""1"">","","","","",""
"1","mahā","MAH","ā@","mahat","noun-adj",""
"2","maṇi","MAṆ","i@","maṇi","noun-adj",""
"3","vipula","VIPUL","a@","vipula","noun-adj",""
"4","vimāna","VIMĀN","a@","vimāna","noun-adj",""
"5","viśva","VIŚV","a@","viśva","noun-adj",""
"6","supratiṣṭhita","SUPRATIṢṬHIT","a@","supratiṣṭhita","noun-adj",""
"7","guhya","GUHY","a@","guhya","noun-adj",""
"8","parama","PARAM","a@","parama","noun-adj",""
"9","rahasya","RAHASY","a@","rahasya","noun-adj",""
"10","kalpa","KALP","a@","kalpa","noun-adj",""
"11","rāja","RĀJ","a@","rājan","noun-adj",""
"12","dhāraṇī","DHĀR","aṇī","dhāra","noun-adj",""
"","</page>","","","","",""
"","<page number=""53r"">","","","","",""
"15","xxxyitavyāḥ","","","CORRUPTED","ind",""
"16","//","","","","punct",""
"","</s>","","","","",""
"","<s number=""2"">","","","","",""
"1","dvātṛṃ","DV","ātṛṃ","dva","noun-adj",""
"2","śati","ŚAT","i","śati","noun-adj",""
"3","śarāvā","ŚARĀV","ā","śarāva","noun-adj",""
"4","pūrayitavyāḥ","PŪRAY","itavyāḥ","par","verb","pṛ"
"5","//","","","","punct",""
"","</s>","","","","",""
"","<s number=""3"">","","","","",""
"1","catvāri","CATVĀR","i","catur","noun-adj",""
"2","tailāni","TAIL","āni","taila","noun-adj",""
"3","catvāri","CATVĀR","i","catur","noun-adj",""
"4","ghṛtaṃ","GHṚT","aṃ","ghṛta","noun-adj",""
"5","/","","","","punct",""
"","</s>","","","","",""
"","<s number=""4"">","","","","",""
"1","catvāri","CATVĀR","i@","catur","noun-adj",""
"2","guḍa","GUḌ","a@","guḍa","noun-adj",""
"3","piṇḍāni","PIṆḌ","āni","piṇḍa","noun-adj",""
"4","/","","","","punct",""
"","</s>","","","","",""
"","<s number=""5"">","","","","",""
"1","catvāri","CATVĀR","i","catur","noun-adj",""
"2","tila","TIL","a@","tila","noun-adj",""
"3","pūrṇāni","PŪRṆ","āni","pūrṇa","noun-adj",""
"4","/","","","","punct",""
"","</s>","","","","",""
"","<s number=""6"">","","","","",""
"1","catvāry","CATVĀR","y","catur","noun-adj",""
"2","aṭh","","","","ind",""
"3","alapu","ALAP","u@","alapat","noun-adj",""
"4","ūrṇaṃ","ŪRṆ","aṃ","ūrṇa","noun-adj",""
"5","/","","","","punct",""
"","</s>","","","","",""
"","<s number=""7"">","","","","",""
"1","catvāri","CATVĀR","i","catur","noun-adj",""
"2","sapta","SAPT","a@","sapta","noun-adj",""
"3","vījaka","VĪJAK","a@","vījaka","noun-adj",""
"4","pūrṇaṃ","PŪRṆ","aṃ","pūrṇa","noun-adj",""
"5","nānā","NĀN","ā@","nānā","noun-adj",""
"6","baliḥ","BAL","iḥ","bali","noun-adj",""
"7","kartavyaḥ","KAR","tavyaḥ","kar","verb","kṛ"
"8","bhakṣya","BHAKṢ","ya@","bhakṣa","noun-adj",""
"9","veṣṭi","VEṢṬ","i@","veṣṭi","noun-adj",""
"10","maka","MAK","a@","maka","noun-adj",""
"11","pūpam","PŪP","am","pūpa","noun-adj",""
"12","udga","UDG","a@","udga","noun-adj",""
"13","pūpa","PŪP","a@","pūpa","noun-adj",""
"14","tila","TIL","a@","tila","noun-adj",""
"15","pūpa","PŪP","a","pūpa","noun-adj",""
"16","/","","","","punct",""
"","</s>","","","","",""
"","<s number=""8"">","","","","",""
"1","a","","","alpha_privativum","ind",""
"2","śoka","ŚOK","a@","śoka","noun-adj",""
"3","vartikā","VARTIK","ā@","vartikā","noun-adj",""
"4","lāvaṇaṃ","LĀVAṆ","aṃ","lāvaṇa","noun-adj",""
"5","ghṛta","GHṚT","a@","ghṛta","noun-adj",""
"6","garjakaṃ","GARJ","akaṃ","garjaka","noun-adj",""
"7","guḍa","GUḌ","a@","guḍa","noun-adj",""
"8","pūpaṃ","PŪP","aṃ","pūpa","noun-adj",""
"9","sarva","SARV","a@","sarva","noun-adj",""
"10","su","SU","","su","noun-adj",""
"11","kṛta","KṚT","a@","kṛta","noun-adj",""
"12","kāryāṇi","KĀRY","āṇi","kārya","noun-adj",""
"13","yathā","","","yathā","ind",""
"14","lābhaṃ","LĀBH","aṃ","lābha","noun-adj",""
"15","saṃjñātavyaṃ","SAṂJÑĀ","tavyaṃ","saṃjñā","noun-adj",""
"16","maṇḍalakaṃ","MAṆḌAL","akaṃ","maṇḍalaka","noun-adj",""
"17","su","","","su","ind",""
"18","racitaṃ","RACIT","aṃ","racita","noun-adj",""
"19","kṛtvā","KṚT","vā","kṛta","noun-adj",""
"20","tato","","","tatas","ind",""
"21","praveśa","PRAVEŚ","a@","praveśa","noun-adj",""
"22","dvāreṇa","DVĀR","eṇa","dvāra","noun-adj",""
"23","gatva","GATV","a@","gatva","noun-adj",""
"24","odaka","ODAK","a@","odaka","noun-adj",""
"25","pūrṇaṃ","PŪRṆ","aṃ","pūrṇa","noun-adj",""
"26","dvau","DV","au","dva","noun-adj",""
"27","kalaśau","KALAŚ","au","kalaśa","noun-adj",""
"28","sthāpya","STHĀPY","a","sthāpya","noun-adj",""
"","</page>","","","","",""
"","<page number=""53v"">","","","","",""
"31","tathā","","","tathā","ind",""
"32","lābhaṃ","LĀBH","aṃ","lābha","noun-adj",""
"33","ca","","","ca","ind",""
"34","baliṃ","BAL","iṃ","bali","noun-adj",""
"35","sthāpya","STHĀPY","a","sthāpya","noun-adj",""
"36","tathā","","","tathā","ind",""
"37","vat","","","vat","ind",""
"38","praveśa","PRAVEŚ","a@","praveśa","noun-adj",""
"39","vidhiṃ","VIDH","iṃ","vidhi","noun-adj",""
"40","ca","","","ca","ind",""
"41","kārayet","KĀRAY","et","kāra","verb",""
"42","tataḥ","","","tatas","ind",""
"43","anena","","","idam","pron",""
"44","mantreṇ","MANTR","eṇ","mantra","noun-adj",""
"45","ābhiṣiṃcya","ĀBHIṢIṂC","ya@","ābhiṣiṃca","noun-adj",""
"46","praveśayetoṃ","PRAVEŚ","ayetoṃ","praveśa","noun-adj",""
"47","maṇi","MAṆ","i","maṇi","noun-adj",""
"48","vipula","VIPUL","a","vipula","noun-adj",""
"49","supratiṣṭhita","SUPRATIṢṬHIT","a","supratiṣṭhita","noun-adj",""
"50","siddha","SIDDH","a","siddha","noun-adj",""
"51","abhiṣiṃca","ABHIṢIÑC","a","abhiṣiñca","noun-adj",""
"52","māṃ","","","mat","pron",""
"53","sarva","SARV","a@","sarva","noun-adj",""
"54","tathāgata","TATHĀGAT","a@","tathāgata","noun-adj",""
"55","ābhiṣekai","ABHIṢEK","ai","abhiṣeka","noun-adj",""
"56","bhara","BHAR","a","bhara","noun-adj",""
"57","bhara","BHAR","a","bhara","noun-adj",""
"58","saṃbhara","SAMBHAR","a","sambhara","noun-adj",""
"59","hūṃ","","","","ind",""
"60","hūṃ","","","","ind",""
"61","//","","","","punct",""
"","</s>","","","","",""
"","<s number=""9"">","","","","",""
"1","yath","","","yathā","ind",""
"2","^","","","","",""
"3","ābhiṣikta","ABHIṢIKT","a@","abhiṣikta","noun-adj",""
"4","mātraś","MĀTR","aś","mātra","noun-adj",""
"5","ca","","","ca","ind",""
"6","sarvāṇi","SARV","āṇi","sarva","noun-adj",""
"7","nivaraṇāni","NIVARAṆ","āni","nivaraṇa","noun-adj",""
"8","pūrva","PŪRV","a@","pūrva","noun-adj",""
"9","janma","JANM","a@","janma","noun-adj",""
"10","saṃjātāni","SAṂJĀT","āni","saṃjāta","noun-adj",""
"11","karma","KARM","a@","karman","noun-adj",""
"12","āvaraṇāni","ĀVARAṆ","āni","āvaraṇa","noun-adj",""
"13","vu","","","","ind",""
"14","śuddhāni","ŚUDDH","āni","śuddha","noun-adj",""
"15","bhavanti","BHAV","anti","bhav","verb","bhū"
"16","bhavanti","BHAV","anti","bhav","verb","bhū"
"17","sarva","SARV","a@","sarva","noun-adj",""
"18","śuddha","ŚUDDH","a@","śuddha","noun-adj",""
"19","parigṛhito","PARIGṚH","ito","parigṛhitā","noun-adj",""
"20","bhavati","BHAV","ati","bhav","verb","bhū"
"21","/","","","","punct",""
"","</s>","","","","",""
"","<s number=""10"">","","","","",""
"1","sarva","SARV","a@","sarva","noun-adj",""
"2","tathāgata","TATHĀGAT","a@","tathāgata","noun-adj",""
"3","ādhiṣṭhitaḥ","ADHIṢṬHIT","aḥ","adhiṣṭhita","noun-adj",""
"4","sarva","SARV","a@","sarva","noun-adj",""
"5","tathāgata","TATHĀGAT","a@","tathāgata","noun-adj",""
"6","ābhiṣiktaḥ","ABHIṢIKT","aḥ","abhiṣikta","noun-adj",""
"7","sarva","SARV","a@","sarva","noun-adj",""
"8","tathāgata","TATHĀGAT","a@","tathāgata","noun-adj",""
"9","samāśvastaḥ","SAMĀŚVAST","aḥ","samāśvasta","noun-adj",""
"","</page>","","","","",""
"","<page number=""54r"">","","","","",""
"12","sarva","SARV","a@","sarva","noun-adj",""
"13","siddhiś","SIDDH","iś","siddhi","noun-adj",""
"14","c","","","ca","ind",""
"15","^","","","","",""
"16","ābhyāmukhībhavati","ĀBHYĀMUKHĪBHAV","ati","ābhyāmukhībhavat","noun-adj",""
"17","/","","","","punct",""
"","</s>","","","","",""
"","<s number=""11"">","","","","",""
"1","yaṃ","","","yad","pron",""
"2","cintayati","CINT","ayati","cint","verb","cint"
"3","yaṃ","","","yad","pron",""
"4","prārthayati","PRĀRTH","ayati","prārth","verb",""
"5","tat","TAT","","tad","pron",""
"6","tath","","","tathā","ind",""
"7","^","","","","",""
"8","aiva","","","eva","ind",""
"9","karoti","KAR","oti","kar","verb","kṛ"
"10","//","","","","punct",""
"","</s>","","","","",""
"","<s number=""12"">","","","","",""
"1","sarva","SARV","a@","sarva","noun-adj",""
"2","tathāgata","TATHĀGAT","a@","tathāgata","noun-adj",""
"3","samaya","SAMAY","a@","samaya","noun-adj",""
"4","ānupraviṣṭaḥ","ĀNUPRAVIṢṬ","aḥ","ānupraviṣṭa","noun-adj",""
"5","sarva","SARV","a@","sarva","noun-adj",""
"6","tathāgata","TATHĀGAT","a@","tathāgata","noun-adj",""
"7","bharmat","BHARM","at","bharmat","noun-adj",""
"8","ānugataḥ","ANUGAT","aḥ","anugata","noun-adj",""
"9","gaṃbhir","GAMBH","ir","gambhan","noun-adj",""
"10","adhar","ADHAR","","adhara","noun-adj",""
"11","makṣānti","MAKṢ","ānti","makṣa","noun-adj",""
"12","pratilabdhaḥ","PRATILABDH","aḥ","pratilabdha","noun-adj",""
"13","bodhimaṇḍa","BODHIMAṆḌ","a@","bodhimaṇḍa","noun-adj",""
"14","opasaṃkramaṇo","UPASAṂKRAMAṆ","o","upasaṃkramaṇa","noun-adj",""
"15","bhavati","BHAV","ati","bhav","verb","bhū"
"16","/","","","","punct",""
"","</s>","","","","",""
"","<s number=""13"">","","","","",""
"1","evam","","","eva","ind",""
"2","ādī","ĀD","ī@","ādi","noun-adj",""
"3","niguṇa","NIGUṆ","a@","niguṇa","noun-adj",""
"4","viśeṣāṇi","VIŚEṢ","āṇi","viśeṣa","noun-adj",""
"5","pratilabhate","PRATILABH","ate","pratilabh","verb","pratilabh"
"6","/","","","","punct",""
"","</s>","","","","",""
"","<s number=""14"">","","","","",""
"1","yāvad","YĀVAD","","yāvat","ind",""
"2","avaivartiko","AVAIVARTIK","o","avaivartika","noun-adj",""
"3","bhaviṣyati","BHAV","iṣyati","bhav","verb","bhū"
"4","/","","","","punct",""
"","</s>","","","","",""
"","<s number=""15"">","","","","",""
"1","anuttarā","ANUTTAR","ā","anuttara","noun-adj",""
"2","bodhi","BODH","i@","bodhi","noun-adj",""
"3","mārga","MĀRG","a@","mārga","noun-adj",""
"4","paripūriḥ","PARIPŪR","iḥ","paripūri","noun-adj",""
"5","//","","","","punct",""
"6","//","","","","punct",""
"","</s>","","","","",""
"","<s number=""16"">","","","","",""
"1","maṇḍala","MAṆḌAL","a@","maṇḍala","noun-adj",""
"2","vidhi","VIDH","i@","vidhi","noun-adj",""
"3","sādhanaṃ","SĀDHAN","aṃ","sādhana","noun-adj",""
"4","tritīyo","TRIT","īyo","trita","noun-adj",""
"5","paṭala","PAṬAL","a@","paṭala","noun-adj",""
"6","vidhiḥ","VIDH","iḥ","vidhi","noun-adj",""
"7","//","","","","punct",""
"","</s>","","","","",""
"","<s number=""17"">","","","","",""
"","</page>","","","","",""
"","<page number=""54v"">","","","","",""
"3","at","","","","ind",""
"4","hāto","HĀT","o","hāta","noun-adj",""
"5","mudrā","MUDR","ā@","mudrā","noun-adj",""
"6","lakṣaṇaṃ","LAKṢAṆ","aṃ","lakṣaṇa","noun-adj",""
"7","vakṣye","VAKṢ","ye","vak","verb","vac"
"8","/","","","","punct",""
"","</s>","","","","",""
"","<s number=""18"">","","","","",""
"1","catvāri","CATVĀR","i","catur","noun-adj",""
"2","mahā","MAH","ā@","mahat","noun-adj",""
"3","hṛdaya","HṚDAY","a@","hṛdaya","noun-adj",""
"4","mudrāṇi","MUDR","āṇi","mudrā","noun-adj",""
"5","prayojyā","PRAYOJY","ā","prayojya","noun-adj",""
"6","sarva","SARV","a@","sarva","noun-adj",""
"7","tathāgataiḥ","TATHĀGAT","aiḥ","tathāgata","noun-adj",""
"8","kula","KUL","a@","kula","noun-adj",""
"9","sāmānyaṃ","SĀMĀNY","aṃ","sāmānya","noun-adj",""
"10","prayojayet","PRAYOJAY","et","prayojayat","noun-adj",""
"11","//","","","","punct",""
"","</s>","","","","",""
"","<s number=""19"">","","","","",""
"1","catvāry","CATVĀR","y","catur","noun-adj",""
"2","ārya","ĀRY","a@","ārya","noun-adj",""
"3","vajra","VAJR","a@","vajra","noun-adj",""
"4","hṛdaya","HṚDAY","a@","hṛdaya","noun-adj",""
"5","mudrāṇi","MUDR","āṇi","mudrā","noun-adj",""
"6","upayojyā","UPAYOJY","ā","upayojya","noun-adj",""
"7","sarva","SARV","a@","sarva","noun-adj",""
"8","maṇḍalaiḥ","MAṆḌAL","aiḥ","maṇḍala","noun-adj",""
"9","//","","","","punct",""
"","</s>","","","","",""
"","<s number=""20"">","","","","",""
"1","āśvāsana","ĀŚVĀSAN","a@","āśvāsana","noun-adj",""
"2","mudrā","MUDR","ā","mudrā","noun-adj",""
"3","samā","SAM","ā","samā","noun-adj",""
"4","bāhya","BĀHY","a@","bāhya","noun-adj",""
"5","paśyad","PAŚY","ad","paśyat","noun-adj",""
"6","anya","ANY","a@","anya","noun-adj",""
"7","mudraṃ","MUDR","aṃ","mudrā","noun-adj",""
"8","samārabhe","SAMĀLABH","e","samālabh","verb","samālabh"
"9","eṣ","","","","ind",""
"10","^","","","","",""
"11","aiva","","","eva","ind",""
"12","tathāgata","TATHĀGAT","a@","tathāgata","noun-adj",""
"13","kule","KUL","e","kula","noun-adj",""
"14","mudrā","MUDR","ā","mudrā","noun-adj",""
"15","upayojyā","UPAYOJY","ā","upayojya","noun-adj",""
"16","yathā","","","yathā","ind",""
"17","vidhi","VIDH","i","vidhi","noun-adj",""
"18","//","","","","punct",""
"","</s>","","","","",""
"","<s number=""21"">","","","","",""
"1","bāhya","BĀHY","a@","bāhya","noun-adj",""
"2","mudrā","MUDR","ā","mudrā","noun-adj",""
"3","na","","","na","ind",""
"4","grahetavyā","GRAH","etavyā","graha","noun-adj",""
"5","/","","","","punct",""
"","</s>","","","","",""
"","<s number=""22"">","","","","",""
"1","anya","ANY","a@","anya","noun-adj",""
"2","mudrā","MUDR","ā","mudrā","noun-adj",""
"3","yathā","","","yathā","ind",""
"4","sukhaṃ","SUKH","aṃ","sukha","noun-adj",""
"5","sarvatra","SARVATR","a","sarvatra","noun-adj",""
"6","upayoktavyaḥ","UPAYOK","tavyaḥ","upayoka","noun-adj",""
"7","yathā","","","yathā","ind",""
"8","upayujyate","UPAYUJ","yate","upayuja","noun-adj",""
"9","tathāgata","TATHĀGAT","a@","tathāgata","noun-adj",""
"10","kule","KUL","e","kula","noun-adj",""
"11","//","","","","punct",""
"","</s>","","","","",""
"","<s number=""23"">","","","","",""
"1","oṃ","","","oṃ","ind",""
"2","sarva","SARV","a@","sarva","noun-adj",""
"3","tathāgatahṛdaya","TATHĀGATAHṚDAY","a","tathāgatahṛdaya","noun-adj",""
"","</page>","","","","",""
"","<page number=""55r"">","","","","",""
"6","maṇi","MAṆ","i@","maṇi","noun-adj",""
"7","jvālani","JVĀL","ani","jvālat","noun-adj",""
"8","ā","","","alpha_privativum","ind",""
"9","reṣṭaya","REṢṬ","aya","reṣṭṛ","noun-adj",""
"10","hūṃ","","","","ind",""
"11","//","","","","punct",""
"","</s>","","","","",""
"","<s number=""24"">","","","","",""
"1","tathāgatahṛdaya","TATHĀGATAHṚDAY","a@","tathāgatahṛdaya","noun-adj",""
"2","mudrā","MUDR","ā","mudrā","noun-adj",""
"3","///","","","","punct",""
"","</s>","","","","",""
"","<s number=""25"">","","","","",""
"1","oṃ","","","oṃ","ind",""
"2","sarva","SARV","a@","sarva","noun-adj",""
"3","tathāgata","TATHĀGAT","a","tathāgata","noun-adj",""
"4","pravara","PRAVAR","a@","pravara","noun-adj",""
"5","āgra","AGR","a@","agra","noun-adj",""
"6","maṇi","MAṆ","i","maṇi","noun-adj",""
"7","hūṃ","","","","ind",""
"8","//","","","","punct",""
"","</s>","","","","",""
"","<s number=""26"">","","","","",""
"1","tathāgata","TATHĀGAT","a@","tathāgata","noun-adj",""
"2","samaya","SAMAY","a@","samaya","noun-adj",""
"3","mudrā","MUDR","ā","mudrā","noun-adj",""
"4","///","","","","punct",""
"","</s>","","","","",""
"","<s number=""27"">","","","","",""
"1","oṃ","","","oṃ","ind",""
"2","sarva","SARV","a@","sarva","noun-adj",""
"3","tathāgata","TATHĀGAT","a@","tathāgata","noun-adj",""
"4","ābhisaṃbodhana","ABHISAṂBODHAN","a@","abhisaṃbodhana","noun-adj",""
"5","vajre","VAJR","e","vajra","noun-adj",""
"6","hūṃ","","","","ind",""
"7","hūṃ","","","","ind",""
"8","//","","","","punct",""
"","</s>","","","","",""
"","<s number=""28"">","","","","",""
"1","tathāgata","TATHĀGAT","a@","tathāgata","noun-adj",""
"2","āśvāsana","ĀŚVĀSAN","a@","āśvāsana","noun-adj",""
"3","mudrā","MUDR","ā","mudrā","noun-adj",""
"4","//","","","","punct",""
"","</s>","","","","",""
"","<s number=""29"">","","","","",""
"1","oṃ","","","oṃ","ind",""
"2","sarva","SARV","a@","sarva","noun-adj",""
"3","tathāgata","TATHĀGAT","a@","tathāgata","noun-adj",""
"4","ādhiṣṭhāna","ADHIṢṬHĀN","a@","adhiṣṭhāna","noun-adj",""
"5","maṇi","MAṆ","i","maṇi","noun-adj",""
"6","maṇi","MAṆ","i","maṇi","noun-adj",""
"7","hūṃ","","","","ind",""
"8","hūṃ","","","","ind",""
"9","p","","","api","ind",""
"10","hat","HAT","","hata","noun-adj",""
"11","//","","","","punct",""
"","</s>","","","","",""
"","<s number=""30"">","","","","",""
"1","tathāgata","TATHĀGAT","a@","tathāgata","noun-adj",""
"2","ādhiṣṭhāna","ADHIṢṬHĀN","a@","adhiṣṭhāna","noun-adj",""
"3","mudrā","MUDR","ā","mudrā","noun-adj",""
"4","//","","","","punct",""
"","</s>","","","","",""
"","<s number=""31"">","","","","",""
"1","oṃ","","","oṃ","ind",""
"2","sarva","SARV","a@","sarva","noun-adj",""
"3","tathāgata","TATHĀGAT","a","tathāgata","noun-adj",""
"4","pravara","PRAVAR","a@","pravara","noun-adj",""
"5","maṇi","MAṆ","i@","maṇi","noun-adj",""
"6","rucire","RUCIR","e","rucira","noun-adj",""
"7","hūṃ","","","","ind",""
"8","hūṃ","","","","ind",""
"9","p","","","api","ind",""
"10","hat","HAT","","hata","noun-adj",""
"11","//","","","","punct",""
"","</s>","","","","",""
"","<s number=""32"">","","","","",""
"1","tathāgata","TATHĀGAT","a@","tathāgata","noun-adj",""
"2","vajra","VAJR","a@","vajra","noun-adj",""
"3","siṃha","SIṂH","a@","siṃha","noun-adj",""
"4","āsana","ĀSAN","a@","āsana","noun-adj",""
"5","mudrā","MUDR","ā","mudrā","noun-adj",""
"6","//","","","","punct",""
"","</s>","","","","",""
"","<s number=""33"">","","","","",""
"1","oṃ","","","oṃ","ind",""
"2","sarva","SARV","a@","sarva","noun-adj",""
"3","tathāgata","TATHĀGAT","a","tathāgata","noun-adj",""
"4","vipula","VIPUL","a@","vipula","noun-adj",""
"5","saṃbhave","SAṂBHAV","e","saṃbhava","noun-adj",""
"","</page>","","","","",""
"","<page number=""55v"">","","","","",""
"8","hūṃ","","","","ind",""
"9","hūṃ","","","","ind",""
"10","//","","","","punct",""
"","</s>","","","","",""
"","<s number=""34"">","","","","",""
"1","tathāgata","TATHĀGAT","a@","tathāgata","noun-adj",""
"2","ābhiṣeka","ABHIṢEK","a@","abhiṣeka","noun-adj",""
"3","mudrā","MUDR","ā","mudrā","noun-adj",""
"4","//","","","","punct",""
"","</s>","","","","",""
"","<s number=""35"">","","","","",""
"1","oṃ","","","oṃ","ind",""
"2","sarva","SARV","a@","sarva","noun-adj",""
"3","tathāgata","TATHĀGAT","a","tathāgata","noun-adj",""
"4","samaya","SAMAY","a","samaya","noun-adj",""
"5","maṇi","MAṆ","i","maṇi","noun-adj",""
"6","vajre","VAJR","e","vajra","noun-adj",""
"7","hūṃ","","","","ind",""
"8","hūṃ","","","","ind",""
"9","//","","","","punct",""
"","</s>","","","","",""
"","<s number=""36"">","","","","",""
"1","dharmacakra","DHARMACAKR","a@","dharmacakra","noun-adj",""
"2","mudrā","MUDR","ā","mudrā","noun-adj",""
"3","///","","","","punct",""
"","</s>","","","","",""
"","<s number=""37"">","","","","",""
"1","oṃ","","","oṃ","ind",""
"2","sarva","SARV","a@","sarva","noun-adj",""
"3","tathāgata","TATHĀGAT","a","tathāgata","noun-adj",""
"4","jaya","JAY","a","jaya","noun-adj",""
"5","a","","","alpha_privativum","ind",""
"6","jita","JIT","a@","jita","noun-adj",""
"7","vajre","VAJR","e","vajra","noun-adj",""
"8","hūṃ","","","","ind",""
"9","hūṃ","","","","ind",""
"10","//","","","","punct",""
"","</s>","","","","",""
"","<s number=""38"">","","","","",""
"1","aparājita","APARĀJIT","a@","aparājita","noun-adj",""
"2","mudrā","MUDR","ā","mudrā","noun-adj",""
"3","//","","","","punct",""
"","</s>","","","","",""
"","<s number=""39"">","","","","",""
"1","oṃ","","","oṃ","ind",""
"2","sarva","SARV","a@","sarva","noun-adj",""
"3","tathāgata","TATHĀGAT","a@","tathāgata","noun-adj",""
"4","dharmadhātu","DHARMADHĀT","u@","dharmadhātu","noun-adj",""
"5","mahā","MAH","ā@","mahat","noun-adj",""
"6","maṇi","MAṆ","i","maṇi","noun-adj",""
"7","śikhare","ŚIKHAR","e","śikhara","noun-adj",""
"8","hara","HAR","a","hara","noun-adj",""
"9","hara","HAR","a","hara","noun-adj",""
"10","hūṃ","","","","ind",""
"11","hūṃ","","","","ind",""
"12","//","","","","punct",""
"","</s>","","","","",""
"","<s number=""40"">","","","","",""
"1","tathāgata","TATHĀGAT","a@","tathāgata","noun-adj",""
"2","cakravarti","CAKRAVART","i@","cakravartin","noun-adj",""
"3","mudrā","MUDR","ā","mudrā","noun-adj",""
"4","///","","","","punct",""
"","</s>","","","","",""
"","<s number=""41"">","","","","",""
"1","oṃ","","","oṃ","ind",""
"2","sarva","SARV","a@","sarva","noun-adj",""
"3","tathāgata","TATHĀGAT","a","tathāgata","noun-adj",""
"4","vajrā","VAJR","ā","vajra","noun-adj",""
"5","hvaya","HVAY","a","hvaya","noun-adj",""
"6","dhara","DHAR","a","dhara","noun-adj",""
"7","dhara","DHAR","a","dhara","noun-adj",""
"8","hūṃ","","","","ind",""
"9","hūṃ","","","","ind",""
"10","p","","","api","ind",""
"11","hat","HAT","","hata","noun-adj",""
"12","//","","","","punct",""
"","</s>","","","","",""
"","<s number=""42"">","","","","",""
"1","ārya","ĀRY","a@","ārya","noun-adj",""
"2","vajra","VAJR","a@","vajra","noun-adj",""
"3","maṇi","MAṆ","i@","maṇi","noun-adj",""
"4","grahaṇa","GRAHAṆ","a@","grahaṇa","noun-adj",""
"5","mudrā","MUDR","ā","mudrā","noun-adj",""
"6","//","","","","punct",""
"","</s>","","","","",""
"","<s number=""43"">","","","","",""
"1","oṃ","","","oṃ","ind",""
"2","dhuru","DHUR","u@","dhura","noun-adj",""
"3","dhuru","DHUR","u@","dhura","noun-adj",""
"4","maṇi","MAṆ","i","maṇi","noun-adj",""
"5","mahā","MAH","ā@","mahat","noun-adj",""
"6","vidyuta","VIDYUT","a","vidyuta","noun-adj",""
"7","maṇi","MAṆ","i","maṇi","noun-adj",""
"8","svāhā","SVĀH","ā","svāhā","noun-adj",""
"9","//","","","","punct",""
"","</s>","","","","",""
"","<s number=""44"">","","","","",""
"1","cintā","CINT","ā@","cintā","noun-adj",""
"2","maṇi","MAṆ","i@","maṇi","noun-adj",""
"3","mudrā","MUDR","ā","mudrā","noun-adj",""
"4","ārya","ĀRY","a@","ārya","noun-adj",""
"5","vajrasya","VAJR","asya","vajra","noun-adj",""
"6","mudrā","MUDR","ā","mudrā","noun-adj",""
"7","//","","","","punct",""
"","</s>","","","","",""
"","<s number=""45"">","","","","",""
"1","oṃ","","","oṃ","ind",""
"2","loka","LOK","a@","loka","noun-adj",""
"3","pālite","PĀLIT","e","pālita","noun-adj",""
"","</page>","","","","",""
"","<page number=""56r"">","","","","",""
"6","jaya","JAY","a","jaya","noun-adj",""
"7","jaya","JAY","a","jaya","noun-adj",""
"8","hūṃ","","","","ind",""
"9","hūṃ","","","","ind",""
"10","//","","","","punct",""
"","</s>","","","","",""
"","<s number=""46"">","","","","",""
"1","catur","CAT","ur","catur","noun-adj",""
"2","mahārājānāṃ","MAHĀRĀJ","ānāṃ","mahārāja","noun-adj",""
"3","mudrā","MUDR","ā","mudrā","noun-adj",""
"4","grahetavyā","GRAH","etavyā","graha","noun-adj",""
"5","///","","","","punct",""
"","</s>","","","","",""
"","<s number=""47"">","","","","",""
"1","oṃ","","","oṃ","ind",""
"2","vipulā","VIPUL","ā","vipula","noun-adj",""
"3","g","","","","ind",""
"4","ravati","RAV","ati","rav","verb",""
"5","saṃbhara","SAMBHAR","a","sambhara","noun-adj",""
"6","hūṃ","","","","ind",""
"7","//","","","","punct",""
"","</s>","","","","",""
"","<s number=""48"">","","","","",""
"1","śriyā","ŚRIY","ā","śriyā","noun-adj",""
"2","mahādevyā","MAHĀDEV","yā","mahādevā","noun-adj",""
"3","mudrā","MUDR","ā","mudrā","noun-adj",""
"4","grahetavyā","GRAH","etavyā","graha","noun-adj",""
"5","//","","","","punct",""
"","</s>","","","","",""
"","<s number=""49"">","","","","",""
"1","oṃ","","","oṃ","ind",""
"2","daṃṣṭriṇi","DAṂṢṬR","iṇi","daṃṣṭrin","noun-adj",""
"3","visara","VISAR","a","visara","noun-adj",""
"4","hūṃ","","","","ind",""
"5","//","","","","punct",""
"","</s>","","","","",""
"","<s number=""50"">","","","","",""
"1","tarjanī","TARJAN","ī@","tarjanī","noun-adj",""
"2","mudrā","MUDR","ā@","mudrā","noun-adj",""
"3","śaṃkhinī","ŚAṄKHIN","ī","śaṅkhinī","noun-adj",""
"4","//","","","","punct",""
"","</s>","","","","",""
"","<s number=""51"">","","","","",""
"1","oṃ","","","oṃ","ind",""
"2","āgamaya","ĀGAMAY","a","āgamayati","noun-adj",""
"3","dhīra","DHĪR","a","dhīra","noun-adj",""
"4","mucāṭṭa","MUC","āṭṭa","muca","noun-adj",""
"5","hāsinī","HĀS","inī","hāsin","noun-adj",""
"6","hūṃ","","","","ind",""
"7","dūtī","DŪT","ī@","dūtī","noun-adj",""
"8","mudrā","MUDR","ā","mudrā","noun-adj",""
"9","baddhitavyā","BADDH","itavyā","baddh","verb",""
"10","///","","","","punct",""
"","</s>","","","","",""
"","<s number=""52"">","","","","",""
"1","oṃ","","","oṃ","ind",""
"2","samanta","SAMANT","a@","samanta","noun-adj",""
"3","ākāra","ĀKĀR","a@","ākāra","noun-adj",""
"4","paripūraṇe","PARIPŪRAṆ","e","paripūraṇa","noun-adj",""
"5","dhaka","DHAK","a","dhaka","noun-adj",""
"6","dhaka","DHAK","a","dhaka","noun-adj",""
"7","hūṃ","","","","ind",""
"8","hūṃ","","","","ind",""
"9","p","","","api","ind",""
"10","hat","HAT","","hata","noun-adj",""
"11","maṇḍala","MAṆḌAL","a@","maṇḍala","noun-adj",""
"12","nivāsinīnāṃ","NIVĀS","inīnāṃ","nivāsin","noun-adj",""
"13","mudrā","MUDR","ā","mudrā","noun-adj",""
"14","///","","","","punct",""
"","</s>","","","","",""
"","<s number=""53"">","","","","",""
"1","ā","","","alpha_privativum","ind",""
"2","bāhana","BĀH","ana","bāhat","noun-adj",""
"3","mudra","MUDR","a@","mudrā","noun-adj",""
"4","āgrahetavyā","ĀGRAH","etavyā","āgraha","noun-adj",""
"5","///","","","","punct",""
"","</s>","","","","",""
"","<s number=""54"">","","","","",""
"1","oṃ","","","oṃ","ind",""
"2","sara","SAR","a","sara","noun-adj",""
"3","sara","SAR","a","sara","noun-adj",""
"4","visara","VISAR","a","visara","noun-adj",""
"5","hūṃ","","","","ind",""
"6","hūṃ","","","","ind",""
"7","padma","PADM","a@","padma","noun-adj",""
"8","mudrā","MUDR","ā","mudrā","noun-adj",""
"9","//","","","","punct",""
"","</s>","","","","",""
"","<s number=""55"">","","","","",""
"1","mudrā","MUDR","ā@","mudrā","noun-adj",""
"2","vidhāna","VIDH","āna","vidha","noun-adj",""
"3","caturtho","CATURTH","o@","caturtha","noun-adj",""
"4","paṭala","PAṬAL","a@","paṭala","noun-adj",""
"5","vistaraḥ","VISTAR","aḥ","vistara","noun-adj",""
"6","//","","","","punct",""
"7","//","","","","punct",""
"","</s>","","","","",""
"","<s number=""56"">","","","","",""
"","</page>","","","","",""
"","<page number=""56v"">","","","","",""
"3","ath","","","atha","ind",""
"4","^","","","","",""
"5","āta","","","","ind",""
"6","paṭala","PAṬAL","a@","paṭala","noun-adj",""
"7","vidhānaṃ","VIDH","ānaṃ","vidha","noun-adj",""
"8","vakṣye","VAKṢ","ye","vak","verb","vac"
"9","sarva","SARV","a@","sarva","noun-adj",""
"10","kāryeṣu","KĀRY","eṣu","kārya","noun-adj",""
"11","sādhakaṃ","SĀDH","akaṃ","sādhaka","noun-adj",""
"12","/","","","","punct",""
"","</s>","","","","",""
"","<s number=""57"">","","","","",""
"1","paṭe","PAṬ","e","paṭa","noun-adj",""
"2","acchinna","ACCHINN","a@","acchinna","noun-adj",""
"3","daśake","DAŚAK","e","daśaka","noun-adj",""
"4","keśa","KEŚ","a@","keśa","noun-adj",""
"5","āpagate","APAGAT","e","apagata","noun-adj",""
"6","eka","EK","a@","eka","noun-adj",""
"7","hastaṃ","HAST","aṃ","hasta","noun-adj",""
"8","dvi","DV","i@","dvi","noun-adj",""
"9","hastaṃ","HAST","aṃ","hasta","noun-adj",""
"10","vā","","","vā","ind",""
"11","samantena","SAMANT","ena","samanta","noun-adj",""
"12","catur","CAT","ur","catur","noun-adj",""
"13","aś","","","","ind",""
"14","rakaṃ","RAK","aṃ","raka","noun-adj",""
"15","poṣadhikena","POṢADHIK","ena","poṣadhika","noun-adj",""
"16","citra","CITR","a@","citra","noun-adj",""
"17","kareṇa","KAR","eṇa@","kara","noun-adj",""
"18","nava","NAV","a@","nava","noun-adj",""
"19","bhājane","BHĀJAN","e","bhājana","noun-adj",""
"20","na","","","na","ind",""
"21","śleṣai","ŚLEṢ","ai","śleṣa","noun-adj",""
"22","raṃgair","RAṄG","air","raṅga","noun-adj",""
"23","buddhaṃ","BUDDH","aṃ","buddha","noun-adj",""
"24","bhagavantaṃ","BHAGAV","antaṃ","bhagavat","noun-adj",""
"25","citra","CITR","a@","citra","noun-adj",""
"26","āpayitavyam","ĀPAYIT","avyam","āpayitṛ","noun-adj",""
"27","siṃha","SIṂH","a@","siṃha","noun-adj",""
"28","āsanasya","ĀSAN","asya","āsana","noun-adj",""
"29","^","","","","",""
"30","upari","UPAR","i@","upari","noun-adj",""
"31","niṣaṇṇaṃ","NIṢAṆṆ","aṃ","niṣaṇṇa","noun-adj",""
"32","sarva","SARV","a@","sarva","noun-adj",""
"33","ālaṃkāra","ALAṂKĀR","a@","alaṃkāra","noun-adj",""
"34","vibhūṣitaṃ","VIBHŪṢIT","aṃ","vibhūṣita","noun-adj",""
"35","kūṭāgāra","KŪṬĀGĀR","a@","kūṭāgāra","noun-adj",""
"36","parivṛtaṃ","PARIVṚT","aṃ","parivṛta","noun-adj",""
"37","dharmad","DHARM","ad","dharmat","noun-adj",""
"38","deśayamānaṃ","DEŚ","ayamānaṃ","deś","verb","diś"
"39","/","","","","punct",""
"","</s>","","","","",""
"","<s number=""58"">","","","","",""
"1","dakṣiṇena","DAKṢIṆ","ena","dakṣiṇa","noun-adj",""
"2","vajrapāṇiṃ","VAJRAPĀṆ","iṃ","vajrapāṇi","noun-adj",""
"3","dvādaśa","DVĀDAŚ","a@","dvādaśa","noun-adj",""
"4","bhujaṃ","BHUJ","aṃ","bhuja","noun-adj",""
"5","kāryā","KĀRY","ā","kārya","noun-adj",""
"6","śaratka","ŚARATK","a@","śaratka","noun-adj",""
"7","āṇḍa","ĀṆḌ","a@","āṇḍa","noun-adj",""
"8","gaurā","GAUR","ā","gaurā","noun-adj",""
"9","nānā","NĀN","ā@","nānā","noun-adj",""
"10","praharaṇa","PRAHARAṆ","a","praharaṇa","noun-adj",""
"11","hastaṃ","HAST","aṃ","hasta","noun-adj",""
"12","catur","CAT","ur","catur","noun-adj",""
"13","mukhaṃ","MUKH","aṃ","mukha","noun-adj",""
"14","saumyaṃ","SAUMY","aṃ","saumya","noun-adj",""
"15","dvitīla","DVIT","īla","dvita","noun-adj",""
"16","vistaraḥ","VISTAR","aḥ","vistara","noun-adj",""
"17","//","","","","punct",""
"18","//","","","","punct",""
"","</s>","","","","",""
"","<s number=""59"">","","","","",""
"","</page>","","","","",""
"","<page number=""57r"">","","","","",""
"3","ath","","","atha","ind",""
"4","^","","","","",""
"5","āta","","","","ind",""
"6","paṭala","PAṬAL","a@","paṭala","noun-adj",""
"7","vidhānaṃ","VIDH","ānaṃ","vidha","noun-adj",""
"8","vakṣye","VAKṢ","ye","vak","verb","vac"
"9","sarva","SARV","a@","sarva","noun-adj",""
"10","kāryeṣu","KĀRY","eṣu","kārya","noun-adj",""
"11","sādhakaṃ","SĀDH","akaṃ","sādhaka","noun-adj",""
"12","/","","","","punct",""
"","</s>","","","","",""
"","<s number=""60"">","","","","",""
"1","paṭe","PAṬ","e","paṭa","noun-adj",""
"2","acchinna","ACCHINN","a@","acchinna","noun-adj",""
"3","daśake","DAŚAK","e","daśaka","noun-adj",""
"4","keśa","KEŚ","a@","keśa","noun-adj",""
"5","āpagate","APAGAT","e","apagata","noun-adj",""
"6","eka","EK","a@","eka","noun-adj",""
"7","hastaṃ","HAST","aṃ","hasta","noun-adj",""
"8","dvi","DV","i@","dvi","noun-adj",""
"9","hastaṃ","HAST","aṃ","hasta","noun-adj",""
"10","vā","","","vā","ind",""
"11","samantena","SAMANT","ena","samanta","noun-adj",""
"12","catur","CAT","ur","catur","noun-adj",""
"13","aś","","","","ind",""
"14","rakaṃ","RAK","aṃ","raka","noun-adj",""
"15","poṣadhikena","POṢADHIK","ena","poṣadhika","noun-adj",""
"16","citra","CITR","a@","citra","noun-adj",""
"17","kareṇa","KAR","eṇa@","kara","noun-adj",""
"18","nava","NAV","a@","nava","noun-adj",""
"19","bhājanena","BHĀJAN","ena","bhājana","noun-adj",""
"20","a","","","alpha_privativum","ind",""
"21","śleṣai","ŚLEṢ","ai","śleṣa","noun-adj",""
"22","raṃgair","RAṄG","air","raṅga","noun-adj",""
"23","buddhaṃ","BUDDH","aṃ","buddha","noun-adj",""
"24","bhagavantaṃ","BHAGAV","antaṃ","bhagavat","noun-adj",""
"25","citra","CITR","a@","citra","noun-adj",""
"26","āpayitavyaṃ","ĀPAYIT","avyaṃ","āpayitṛ","noun-adj",""
"27","siṃha","SIṂH","a@","siṃha","noun-adj",""
"28","āsanasya","ĀSAN","asya","āsana","noun-adj",""
"29","^","","","","",""
"30","upari","UPAR","i@","upari","noun-adj",""
"31","niṣaṇṇaṃ","NIṢAṆṆ","aṃ","niṣaṇṇa","noun-adj",""
"32","sarva","SARV","a@","sarva","noun-adj",""
"33","ālaṃkāra","ALAṂKĀR","a@","alaṃkāra","noun-adj",""
"34","vibhūṣitaṃ","VIBHŪṢIT","aṃ","vibhūṣita","noun-adj",""
"35","kūṭāgāra","KŪṬĀGĀR","a@","kūṭāgāra","noun-adj",""
"36","parivṛtaṃ","PARIVṚT","aṃ","parivṛta","noun-adj",""
"37","dharmad","DHARM","ad","dharmat","noun-adj",""
"38","deśayamānaṃ","DEŚ","ayamānaṃ","deś","verb","diś"
"39","/","","","","punct",""
"","</s>","","","","",""
"","<s number=""61"">","","","","",""
"1","dakṣiṇena","DAKṢIṆ","ena","dakṣiṇa","noun-adj",""
"2","vajrapāṇi","VAJRAPĀṆ","i@","vajrapāṇi","noun-adj",""
"3","dvādaśa","DVĀDAŚ","a@","dvādaśa","noun-adj",""
"4","bhujāṃ","BHUJ","āṃ","bhuja","noun-adj",""
"5","kāryā","KĀRY","ā","kārya","noun-adj",""
"6","śaratka","ŚARATK","a@","śaratka","noun-adj",""
"7","āṇḍa","ĀṆḌ","a@","āṇḍa","noun-adj",""
"8","gaurā","GAUR","ā","gaurā","noun-adj",""
"9","nānā","NĀN","ā@","nānā","noun-adj",""
"10","praharaṇa","PRAHARAṆ","a","praharaṇa","noun-adj",""
"11","hastaṃ","HAST","aṃ","hasta","noun-adj",""
"12","catur","CAT","ur","catur","noun-adj",""
"13","mukhaṃ","MUKH","aṃ","mukha","noun-adj",""
"14","saumyaṃ","SAUMY","aṃ","saumya","noun-adj",""
"15","/","","","","punct",""
"","</s>","","","","",""
"","<s number=""62"">","","","","",""
"1","dvitīyaṃ","DVITĪY","aṃ","dvitīya","noun-adj",""
"","</page>","","","","",""
"","<page number=""57v"">","","","","",""
"4","raudraṃ","RAUDR","aṃ","raudra","noun-adj",""
"5","tṛtīyaṃ","TṚTĪY","aṃ","tṛtīya","noun-adj",""
"6","daṃṣṭra","DAṂṢṬR","a@","daṃṣṭra","noun-adj",""
"7","ā","","","alpha_privativum","ind",""
"8","karālaṃ","KARĀL","aṃ","karāla","noun-adj",""
"9","caturthe","CATURTH","e","caturtha","noun-adj",""
"10","mukhe","MUKH","e","mukha","noun-adj",""
"11","bhṛkuṭī","BHṚKUṬ","ī@","bhṛkuṭī","noun-adj",""
"12","jaṭa","JAṬ","a@","jaṭa","noun-adj",""
"13","ā","","","alpha_privativum","ind",""
"14","makuṭā","MAKUṬ","ā@","makuṭa","noun-adj",""
"15","maṇḍitaṃ","MAṆḌIT","aṃ","maṇḍita","noun-adj",""
"16","sarva","SARV","a@","sarva","noun-adj",""
"17","ālaṃkāra","ALAṂKĀR","a@","alaṃkāra","noun-adj",""
"18","vibhūṣitaṃ","VIBHŪṢIT","aṃ","vibhūṣita","noun-adj",""
"19","padmasya","PADM","asya","padma","noun-adj",""
"20","^","","","","",""
"21","upari","UPAR","i@","upari","noun-adj",""
"22","niṣaṇṇaṃ","NIṢAṆṆ","aṃ","niṣaṇṇa","noun-adj",""
"23","ardhaṃ","ARDH","aṃ","ardha","noun-adj",""
"24","paryaṃkayā","PARYAṄK","ayā","paryaṅkā","noun-adj",""
"25","//","","","","punct",""
"","</s>","","","","",""
"","<s number=""63"">","","","","",""
"1","bāma","","","","ind",""
"2","pārśve","PĀRŚV","e","pārśva","noun-adj",""
"3","maṇi","MAṆ","i@","maṇi","noun-adj",""
"4","vajro","VAJR","o","vajra","noun-adj",""
"5","nāma","NĀM","a","nāman","noun-adj",""
"6","bodhisatvo","BODHISATTV","o@","bodhisattva","noun-adj",""
"7","kartavyaḥ","KAR","tavyaḥ","kar","verb","kṛ"
"8","catur","CAT","ur","catur","noun-adj",""
"9","mukhaṃ","MUKH","aṃ","mukha","noun-adj",""
"10","ṣoḍaśa","ṢOḌAŚ","a@","ṣoḍaśa","noun-adj",""
"11","bāhuṃ","BĀH","uṃ","bāh","verb",""
"12","//","","","","punct",""
"","</s>","","","","",""
"","<s number=""64"">","","","","",""
"1","dakṣiṇa","DAKṢIṆ","a@","dakṣiṇa","noun-adj",""
"2","bāhūṃ","BĀH","ūṃ","bāhū","noun-adj",""
"3","cintā","CINT","ā@","cintā","noun-adj",""
"4","maṇ","MAṆ","","maṇa","noun-adj",""
"5","iddha","IDDH","a@","iddha","noun-adj",""
"6","ā","","","alpha_privativum","ind",""
"7","rayaṃ","RAY","aṃ","raya","noun-adj",""
"8","tathāgatasya","TATHĀGAT","asya","tathāgata","noun-adj",""
"9","^","","","","",""
"10","upanāmayati","UPANĀM","ayati","upanam","verb","upanam"
"11","//","","","","punct",""
"","</s>","","","","",""
"","<s number=""65"">","","","","",""
"1","bāma","","","","ind",""
"2","bāhūṃ","BĀH","ūṃ","bāhū","noun-adj",""
"3","padmad","PADM","ad","padmat","noun-adj",""
"4","dhārayantaḥ","DHĀRAY","antaḥ","dhārayat","noun-adj",""
"5","dve","DV","e","dva","noun-adj",""
"6","haste","HAST","e","hasta","noun-adj",""
"7","aṃjaliṃ","AṂJAL","iṃ","aṃjali","noun-adj",""
"8","gṛhītavyaṃ","GṚHĪT","avyaṃ","gṛhīta","noun-adj",""
"9","///","","","","punct",""
"","</s>","","","","",""
"","<s number=""66"">","","","","",""
"1","śeṣaṃ","ŚEṢ","aṃ","śeṣa","noun-adj",""
"2","prahastaṃ","PRAHAS","taṃ","prahasa","noun-adj",""
"3","kartavyaṃ","KAR","tavyaṃ","kar","verb","kṛ"
"4","tṛ","","","","ind",""
"5","śūlaṃ","ŚŪL","aṃ","śūla","noun-adj",""
"6","cakraṃ","CAKR","aṃ","cakra","noun-adj",""
"7","khadgaṃ","KHAD","gaṃ","khadk","noun-adj",""
"8","vajraṃ","VAJR","aṃ","vajra","noun-adj",""
"9","puṣpapuṭaṃ","PUṢPAPUṬ","aṃ","puṣpapuṭa","noun-adj",""
"10","gaṇ","GAṆ","","gaṇa","noun-adj",""
"11","endaka","END","aka@","endh","noun-adj",""
"12","kaṇḍulaṃ","KAṆḌ","ulaṃ","kaṇḍū","noun-adj",""
"13","aṣiḥpuxxx","","","CORRUPTED","ind",""
"","</s>","","","","",""
"","</page>","","","","",""
"","</doc>","","","","",""
