word	synonyms
abhidheya	abhidhī, abhidhitsā, abhidhāyakatva, abhidhāyin, abhidhātu, bhidhāna, vidheya, pratipādakatva, abhidyot, abhidadh
abhilāpa	abhilāṣin, abhivyāhāra, vilāpa, saṃketarutapraveśa, abhiū, saṃketa, pravyāhāra, abhilakṣya, saṃlāpa, pūrvābhilāpin
abhiprāya	abhipū, abhiprasīdati, abhipramodana, abhipanna, abhiprāvarṣat, abhim, abhiāka, abhiyoktṛ, abhiyuñj, abhipralamba
akṣara	ūṣara, kṣarat, akṣakī, ṣaḍakṣari, advaya, bindu, pada, akṣayakaraṇḍa, lakṣa, paramapada
anusmṛti	samanusmṛta, anusmaraṇa, anusmar, vismṛti, saṃsmṛti, mahāsmṛti, anusev, muṣitasmṛti, anusaṃva, pūrvanivāsa
bhrānti	udbhrānta, bhrama, bhrasj, sambhrānta, bhramatva, viplav, adhyāropa, dṛti, nimitti, vibhram
caraṇa	raṇaraṇa, caru, carcā, viśaraṇa, vinīvaraṇa, carasi, bhūcara, karatala, carat, praṇipat
citra	citk, citrīkṛta, śvitra, vicitr, vicitrita, aritra, vaicitrya, pratimaṇḍita, attra, ujjvala
citta	cittīkṛ, citk, cetasika, kāyavāṅa, vikopanatā, paritta, cetas, ekāgratā, saṃtānatā, līnatā
cār	cāl, cāṣa, cāpāla, cālya, muṣita, cāmuṇḍā, paliguddha, cāṅgerī, cālat, anuvrata
datta	dad, datu, āṇatta, dadāmi, dadyā, dadat, pratta, dadrū, dadada, dāpita
deśanā	deśayin, deśat, deśavṛtta, deśita, deśakārī, prakāśanā, ādeś, sūcanā, pratideśanikā, vidarśanā
deśita	deśin, prakāśita, deśā, aśita, vidarśita, deśanā, deśanāpāṭha, dharmadeśanā, viniveśita, śrāvita
dā	ghnat, piya, kuṭumba, dhanat, suhat, ghṛa, kṛpaṇaka, pibat, sutā, tyāgin
dāna	dadat, śīla, pratigrāhaka, dāyaka, kṣāntipāramitā, dauśīla, śīlapāramitā, tyāga, dadyā, pāramitā
eva	api, yadi, tad, idam, iti, na, anyathā, katham, tathā, atra
ghoṣa	ruta, dundubhisvara, nirnāda, ghoṣeśvara, manojñasvara, udghoṣ, ucchoṣa, meghasvara, nigarjita, valgusvara
goṣṭha	prakoṣṭha, uṣṭha, jeṣṭha, oṣṭhī, ṇṭha, āṃguṣṭha, oṣṭhaka, meṇṭha, śvapṛṣṭha, gariṣṭha
hita	hiteṣin, hitvat, anukampita, hiṃsita, anukampāyin, sampālita, praśaṃsita, sukhāvaha, anukamp, samprekṣita
kalpanā	kalpī, vikalpat, kalpataru, nirvikalpa, avikalpaka, saṅkalpa, kalpitatva, mithyāvikalpa, kalpadruma, kalpaśatāyate
kalpataru	kalpadruma, kalpatva, kalpani, kalpaśatāyate, kalpavṛkṣa, akalpa, kalpanāvat, merukalpa, kalpakaṣāya, kalpya
kalpita	viṭhapita, kalpani, samāropita, kalpanāvat, vikalpi, saṅketita, rūpita, parikalpanā, saṅkalpya, adhyāropita
kar	kurvat, kṛta, prakurvat, kṛtaya, kṛttu, upakurvati, kurutha, krii, utkṛtya, kriyat
karaṇa	kartva, raṇaraṇa, karū, pariharaṇa, karat, sādharaṇa, karttṛkā, asmaraṇa, karti, apaharaṇa
kathā	imathā, sāṃkathya, samuttejayati, dhārmya, samuttej, itarathā, sampraharṣi, katividha, saṅkath, saṃdarśya
kāma	kāmin, kāmena, kāmuka, kāmopabhogin, kāmita, stāma, kartu, ājagāma, jayitṛ, jugupsita
kārya	kāraṇa, kāraṇavat, kāraṇābhāva, kāritakāraṇa, sāmagrya, vyāpāraṇa, kādācitkatva, kārkaśya, samavāyikāraṇa, kāri
kṛ	śoca, kilviṣin, duḥkhitā, kurutā, bhṛ, karomi, karhi, roṣin, karaṅka, nirghṛṇa
kṛta	kṛtvat, kṛttu, kṛtin, kar, kṛtopakāra, vidhṛta, kṛtyākṛtya, karaṇa, yanmaya, praṇaśya
lakṣaṇa	atilakṣa, valakṣa, ānupalakṣa, svabhāva, kṣaṇatva, vailakṣaṇya, svabhāvasiddha, samīkṣaṇa, kṣaṇabhaṅga, cittakṣaṇa
maśaka	aṃśaka, keśaka, niraṃśaka, aśakya, tādṛśaka, sparśaka, uggaka, ḍimbhaka, ākrośaka, maśu
nāma	uddāma, imāma, vadāma, thāma, stāma, ācāma, agrima, vāmaka, vāmapārśva, nāmita
nānātva	nānārūpa, nānādhī, nānākaraṇa, nānāgati, nānābhāva, anekatva, nānāvidha, tadrūpatva, vicitratva, bhāvatva
pada	elada, syada, sākṣara, nigada, ākṣarati, tryakṣara, padeśa, paramākṣara, nālada, vyañjana
paricchin	paricchettu, paricchedaka, paricī, paricumb, vicchin, parigaṇ, pariniścita, vicchitti, avicchinna, pariśṝ
paricchinna	paricchedaka, paricchettu, vyavacchinna, vichinna, saṃchinna, avabhinna, anupacchinna, vicchin, nirbhinna, minna
parikalp	vikalp, prativikalpa, saṃkalp, vikalpita, nirvikalpa, upakalp, bhiniveśa, kalpitatva, parikarmin, kalpya
parikalpa	nirvikalpa, prativikalpa, saṅkalpa, vikalpa, mithyāvikalpa, satsaṃkalpa, upakalpa, kalpatā, pariniṣpanna, kalpanāvat
parikalpita	kalpitatva, jalpita, vikalpi, samāropita, prativikalpa, viṭhapita, vipratiṣiddha, nirūpita, paratantra, vikalpana
prajñapti	prajñaptatva, saṃjñapti, prativijñapti, vijñapti, prajñu, jñapta, prajñāsa, prajñākūṭa, vijñapana, lokavyavahāra
pratijñā	pratijāgṛ, prativādin, prativākya, pratijānīte, pratisādhana, pratisiddha, pratie, pratiāṃbādh, pratiroṣ, pratidṛṣṭa
pratijñāta	pratijñākāraka, pratijāgṛ, avajñāta, prativādin, prativākya, prativyūḍha, nujñāta, pratidṛṣṭa, pratisādhana, pratie
pratijān	pratijāgṛta, pratiāṃbādh, pratie, pratiroṣ, pratijñāya, pratijñākāraka, pratidṛṣṭa, pratibrūa, pratiakāṅkṣ, prativāka
saṃjñā	saṃjñotpāda, āsaṃjñika, saṃjīv, saṃskāra, ākiṃcanyāyatana, utāpad, asaṃjñisattva, saṃjānāti, dharmasaṃjñin, vijñānānantyāyatana
saṃketa	abhilāpa, anurodha, anusyūta, vyavahāra, śabda, śabdaviśeṣa, śabdārtha, viṣayī, saṃskārya, saṃkalana
saṃnidhi	saṃnidhāna, saṃnihita, saṃnikāśa, ambhonidhi, jalanidhi, didhi, saṃniveśya, nidhin, saṃniviśat, saṃnirudha
saṃskṛta	anavarāgra, saṃskāravat, saṃskar, abhisaṃskṛ, saṃsṛj, saṃsu, saṃsyandata, śūnyatā, saṃstyāna, sarvaśūnyatā
smṛti	dṛti, smaraṇa, pratismṛta, vismṛta, smṛtyupasthāna, saṃsmṛta, saṃpramoṣa, rddhipāda, pramoṣa, dhṛtimat
tarka	alarka, udarka, vitarkya, samparka, pratarkya, hlīka, īka, karkaśā, arkk, itīka
tathātā	tathārūpa, tatā, tathābhūta, anyatā, vitathatva, opetatā, viparītatā, sarūpatā, bhūtatā, ktā
upalabdhi	upalabdhatva, ānulabdhi, upalabhya, ānupalabh, upalapsyat, rabdhi, dṛśyatva, upalīa, nupalambha, vyāpakatva
upaskara	upaseva, upasṛpta, upasasarpa, akara, āṭakkara, upajīvin, upasthihati, upakūjita, upajighr, kekara
vac	vak, vam, uktat, vrūs, āhu, vadi, bruvat, ābhidadh, vadat, brūte
vacana	vacat, vacasi, vākya, vākovākya, sūcana, vacanīyatā, kecana, abhidhāyin, codana, vivecana
vacanīya	vacanāvat, kathanīya, odanīya, vijñāpanīya, pratideśanīya, nigarhaṇīya, ullokanīya, vacat, saṃmodanīya, nindanīya
vastu	vastvabhāva, vasīa, vastat, vastya, vyāvṛttatva, vyavasta, amastu, vyāvṛtti, saṃsṛṣṭatva, vasāti
vicāra	vicī, pravicār, abhicāra, vitarkaṇa, anucāra, vitarkk, pracāratva, vical, paricāra, cārat
vidhi	vidhavā, vidhānatas, vidhunvat, āvidh, vidhāsyat, vidhāyaka, vidhur, vidhāyin, tṛvidha, vidhatte
vidhā	vidhunvat, vidhur, vidhitsā, vidhin, āvidh, edhā, tridhā, vidadh, vidheyatā, mudhā
vikalpa	saṅkalpa, parikalpa, prakalpanā, kalpanā, prapañca, pratibhāsin, grāhyatva, sadvastu, satsaṃkalpa, viṣayaviṣayin
vitarka	anuvitarkita, pratarkay, tarkay, vitaranti, sarka, alarka, vitatama, vitan, udarka, vicāraṇā
vivṛta	anāvṛta, vivṛṇ, dṛta, vivṛṇvat, āpṛta, parinivṛta, vinisṛta, śīlavṛta, sūnṛta, vivara
vyavahāra	sāṃvyavahārika, vyavahṛti, vyavasyat, vyavas, vyavasāyin, vyavadha, vyavasthāpaka, pratīti, abhyavahārya, vyavadhānena
vyāpāra	vyāpṛti, vyāpṛtatva, vyāpn, vyāpitva, vyāptat, pratyakṣā, kārya, pratyakṣasiddha, prayojakatva, kāraṇa
yathā	yathodita, yatheccha, yathepsita, eva, yadi, athāpi, yadvat, yatnavat, anurūpa, imathā
yuga	sānuga, ghoṣānuga, naddha, yugotpāda, dga, kal, kalama, ṃga, yudha, yusma
yukta	yuktitas, ayukti, anūkta, punarukta, parokta, nairukta, muktatva, bhākta, atiprasakti, śāstrokta
śabda	vācya, goa, apoha, vācaka, abhidheya, vācyatva, vācyavācakabhāva, sambadhyat, saṃketita, śrāvaṇatva
