"WordID","word","NormSTEM","suffix","lemma","PoS","Root"
"","<doc textid = ""navazloki"" genre = ""śāstra"" title = ""navaślokī"" author = ""kambalapāda"" discourse = ""commentary /prajñāpāramitā"" tradition = ""tantra"" period = ""commentarial"" source = ""gretil accessed aug 2019 : http://gretil.sub.uni-goettingen.de/gretil/corpustei/sa_gretilbuddh _ kambalapā_ navasloki _final.xml"" date_range = ""10. ce"" notes = ""alternative author name: kamalāmbarapāda; dating proposed by g. tucci. minor buddhist texts. 1956 p. 214: x. cent. ce; tucci convinced that the author is the mahasiddha kambalapāda tucci; minor buddhist texts; 214 ; dating tentatively based on kambalapada's dates identity perhaps debatable ; name of the author according to the mss.: kamalāmbarapāda. tr. from tibetan in karl brunnhölzl. straight from the heart: buddhist pith instructions. 2014."" religion = ""buddh"" edition = ""based on the ed. by g. tucci 1956 pp. 216-217 page number = verse number"" digitization = ""k. wille"" segmentation_lemmatization = ""ligeia lugli & buddhist translators workbench team"" metadata_enrichment = ""bruno galasek-hul & buddhist translators workbench team"" proofreader = ""n/a"" permission = ""permission for derivatives from m. mehner on behalf of gretil"" reconstructions = ""none"">","","","","",""
"","<page number=""0"">","","","","",""
"","<s number=""0"">","","","","",""
"1","nava","NAV","a@","nava","noun-adj",""
"2","ślokī","ŚLOK","ī","ślokin","noun-adj",""
"3","ārya","ĀRY","a@","ārya","noun-adj",""
"4","āṣṭa","AṢṬ","a@","aṣṭa","noun-adj",""
"5","sāhasrikāyāḥ","SĀHASRIK","āyāḥ","sāhasrika","noun-adj",""
"6","prajñāpāramitāyāḥ","PRAJÑĀPĀRAMIT","āyāḥ","prajñāpāramitā","noun-adj",""
"7","piṇḍārthaḥ","PIṆḌĀRTH","aḥ","piṇḍārtha","noun-adj",""
"8","prajñāpāramitām","PRAJÑĀPĀRAMIT","ām","prajñāpāramitā","noun-adj",""
"9","bodhau","BODH","au","bodh","verb",""
"10","śubha","ŚUBH","a@","śubha","noun-adj",""
"11","ratnākare","RATNĀKAR","e","ratnākara","noun-adj",""
"12","svayam","SVAY","am","svaya","noun-adj",""
"13","/","","","","punct",""
"14","sarvā","SARV","ā","sarva","noun-adj",""
"15","pāramitās","PĀRAMIT","ās","pāramitā","noun-adj",""
"16","tatra","","","tatra","ind",""
"17","tādātmyena","TĀDĀTMY","ena","tādātmya","noun-adj",""
"18","vyavasthitāḥ","VYAVASTHIT","āḥ","vyavasthita","noun-adj",""
"19","//","","","","punct",""
"20","1","","","","ind",""
"21","//","","","","punct",""
"","</s>","","","","",""
"","</page>","","","","",""
"","<page number=""1"">","","","","",""
"","<s number=""1"">","","","","",""
"1","niṣ","","","niḥ_privativum","ind",""
"2","prapañcā","PRAPAÑC","ā","prapañca","noun-adj",""
"3","nir","","","niḥ_privativum","ind",""
"4","ābhāsā","ĀBHĀS","ā","ābhāsa","noun-adj",""
"5","nir","","","niḥ_privativum","ind",""
"6","vikalpā","VIKALP","ā","vikalpa","noun-adj",""
"7","nirālayā","NIRĀLAY","ā","nirālaya","noun-adj",""
"8","/","","","","punct",""
"9","nih","","","niḥ_privativum","ind",""
"10","svabhāvā","SVABHĀV","ā","svabhāva","noun-adj",""
"11","parā","PAR","ā","para","noun-adj",""
"12","sūkṣmā","SŪKṢM","ā","sūkṣmā","noun-adj",""
"13","bindu","BIND","u@","bindu","noun-adj",""
"14","nāda","NĀD","a@","nāda","noun-adj",""
"15","vivarjitā","VIVARJIT","ā","vivarjita","noun-adj",""
"16","//","","","","punct",""
"17","2","","","","ind",""
"18","//","","","","punct",""
"","</s>","","","","",""
"","</page>","","","","",""
"","<page number=""2"">","","","","",""
"","<s number=""2"">","","","","",""
"1","prajñāpāramitā","PRAJÑĀPĀRAMIT","ā","prajñāpāramitā","noun-adj",""
"2","mātā","MĀT","ā","mātṛ","noun-adj",""
"3","sarva","SARV","a@","sarva","noun-adj",""
"4","buddha","BUDDH","a@","buddha","noun-adj",""
"5","odayā","UDAY","ā","udaya","noun-adj",""
"6","parā","PAR","ā","para","noun-adj",""
"7","/","","","","punct",""
"8","traya","TRAY","a@","tri","noun-adj",""
"9","ānupalabdhi","ANUPALABDH","i@","anupalabdhi","noun-adj",""
"10","rūpā","RŪP","ā","rūpa","noun-adj",""
"11","sarvajña","SARVAJÑ","a@","sarvajña","noun-adj",""
"12","jñāna","JÑĀN","a@","jñāna","noun-adj",""
"13","gocarā","GOCAR","ā","gocara","noun-adj",""
"14","//","","","","punct",""
"15","3","","","","ind",""
"16","//","","","","punct",""
"","</s>","","","","",""
"","</page>","","","","",""
"","<page number=""3"">","","","","",""
"","<s number=""3"">","","","","",""
"1","prajñāpāramitāṃ","PRAJÑĀPĀRAMIT","āṃ","prajñāpāramitā","noun-adj",""
"2","saṃyag","SAṂYAG","","saṃyaga","noun-adj",""
"3","yo","","","yad","pron",""
"4","bhāvayitum","BHĀVAY","itum","bhāvaya","noun-adj",""
"5","icchati","ICCH","ati","icch","verb","iṣ1"
"6","/","","","","punct",""
"7","ten","","","tad","pron",""
"8","^","","","","",""
"9","ārthato","ARTH","ato","artha","noun-adj",""
"10","nava","NAV","a@","nava","noun-adj",""
"11","ślokāś","ŚLOK","āś","śloka","noun-adj",""
"12","cintanīyāḥ","CINTANĪY","āḥ","cintanīya","noun-adj",""
"13","samāsataḥ","SAMĀS","ataḥ","samāsa","noun-adj",""
"14","//","","","","punct",""
"15","4","","","","ind",""
"16","//","","","","punct",""
"","</s>","","","","",""
"","</page>","","","","",""
"","<page number=""4"">","","","","",""
"","<s number=""4"">","","","","",""
"1","karma","KARM","a@","karman","noun-adj",""
"2","prabhāva","PRABHĀV","a@","prabhāva","noun-adj",""
"3","saṃbhūtaṃ","SAṂBHŪT","aṃ","saṃbhūta","noun-adj",""
"4","ṣaḍa","ṢAḌ","a@","ṣaṭ","noun-adj",""
"5","āyatana","ĀYATAN","a@","āyatana","noun-adj",""
"6","lakṣaṇam","LAKṢAṆ","am","lakṣaṇa","noun-adj",""
"7","/","","","","punct",""
"8","punar","","","punar","ind",""
"9","bhavam","BHAV","am","bhava","noun-adj",""
"10","iti","","","iti","ind",""
"11","khyātaṃ","KHYĀT","aṃ","khyāta","noun-adj",""
"12","pratibhāsa","PRATIBHĀS","a@","pratibhāsa","noun-adj",""
"13","opamaṃ","UPAM","aṃ","upama","noun-adj",""
"14","hi","","","hi","ind",""
"15","tat","TAT","","tad","pron",""
"16","//","","","","punct",""
"17","51","","","","ind",""
"18","//","","","","punct",""
"","</s>","","","","",""
"","</page>","","","","",""
"","<page number=""51"">","","","","",""
"","<s number=""51"">","","","","",""
"1","nirmitaṃ","NIRMIT","aṃ","nirmita","noun-adj",""
"2","nagaraṃ","NAGAR","aṃ","nagara","noun-adj",""
"3","yadvad","","","yadvat","ind",""
"4","vilokayati","VILOK","ayati","vilok","verb","vilok"
"5","nirmitaḥ","NIRMIT","aḥ","nirmita","noun-adj",""
"6","/","","","","punct",""
"7","tadvan","","","tadvat","ind",""
"8","paśyati","PAŚ","yati","paś","verb","paś"
"9","rūpāṇi","RŪP","āṇi","rūpa","noun-adj",""
"10","karma","KARM","a@","karman","noun-adj",""
"11","bhinirmitaṃ","BHINIRMIT","aṃ","bhinirmita","noun-adj",""
"12","jagat","JAGAT","","jagat","noun-adj",""
"13","//","","","","punct",""
"14","62","","","","ind",""
"15","//","","","","punct",""
"","</s>","","","","",""
"","</page>","","","","",""
"","<page number=""62"">","","","","",""
"","<s number=""62"">","","","","",""
"1","dharmaṃ","DHARM","aṃ","dharma","noun-adj",""
"2","deśayataḥ","DEŚAY","ataḥ","deśayin","noun-adj",""
"3","śabdā","ŚABD","ā","śabda","noun-adj",""
"4","ye","","","yad","pron",""
"5","kecit","","","kimcit","ind",""
"6","śruti","ŚRUT","i@","śruti","noun-adj",""
"7","gocarāḥ","GOCAR","āḥ","gocara","noun-adj",""
"8","/","","","","punct",""
"9","pratiśrutka","PRATIŚRUTK","a@","pratiśrutkā","noun-adj",""
"10","opamāḥ","UPAM","āḥ","upama","noun-adj",""
"11","sarve","SARV","e","sarva","noun-adj",""
"12","prodbhūta","PRODBHŪT","a@","prodbhūta","noun-adj",""
"13","śrutinaḥ","ŚRUT","inaḥ","śruti","noun-adj",""
"14","śrutāḥ","ŚRUT","āḥ","śruta","noun-adj",""
"15","//","","","","punct",""
"16","73","","","","ind",""
"17","//","","","","punct",""
"","</s>","","","","",""
"","</page>","","","","",""
"","<page number=""73"">","","","","",""
"","<s number=""73"">","","","","",""
"1","ā","","","alpha_privativum","ind",""
"2","ghrataṃ","GHRAT","aṃ","ghrata","noun-adj",""
"3","svāditaṃ","SVĀDIT","aṃ","svādita","noun-adj",""
"4","tathā","","","tathā","ind",""
"5","spraṣṭaṃ","SPRAṢṬ","aṃ","spraṣṭṛ","noun-adj",""
"6","viṣaya","VIṢAY","a","viṣaya","noun-adj",""
"7","lālāsaiḥ","LĀL","āsaiḥ","lāla","noun-adj",""
"8","/","","","","punct",""
"9","svapna","SVAPN","a@","svapna","noun-adj",""
"10","tulyam","TULY","am","tulya","noun-adj",""
"11","idaṃ","IDAṂ","","idam","pron",""
"12","sarvam","SARV","am","sarva","noun-adj",""
"13","upalabdhaṃ","UPALABDH","aṃ","upalabdha","noun-adj",""
"14","na","","","na","ind",""
"15","vidyate","VID","yate","vid","verb","vid"
"16","//","","","","punct",""
"17","84","","","","ind",""
"18","//","","","","punct",""
"","</s>","","","","",""
"","</page>","","","","",""
"","<page number=""84"">","","","","",""
"","<s number=""84"">","","","","",""
"1","māyā","MĀY","ā@","māyā","noun-adj",""
"2","yantro","YANTR","o","yantra","noun-adj",""
"3","naro","NAR","o","nara","noun-adj",""
"4","yadvad","","","yadvat","ind",""
"5","bhinnāṃ","BHINN","āṃ","bhinnā","noun-adj",""
"6","ceṣṭāṃ","CEṢṬ","āṃ","ceṣṭā","noun-adj",""
"7","karoti","KAR","oti","kar","verb","kṛ"
"8","vai","","","vai","ind",""
"9","/","","","","punct",""
"10","tadvad","TADVAD","","tadvat","noun-adj",""
"11","ceṣṭāṃ","CEṢṬ","āṃ","ceṣṭā","noun-adj",""
"12","karoty","KAR","oty","kar","verb","kṛ"
"13","eva","","","eva","ind",""
"14","deha","DEH","a@","deha","noun-adj",""
"15","yantro","YANTR","o","yantra","noun-adj",""
"16","nir","","","niḥ_privativum","ind",""
"17","ātmakaḥ","ĀTM","akaḥ","ātman","noun-adj",""
"18","//","","","","punct",""
"19","95","","","","ind",""
"20","//","","","","punct",""
"","</s>","","","","",""
"","</page>","","","","",""
"","<page number=""95"">","","","","",""
"","<s number=""95"">","","","","",""
"1","nāna","NĀN","a@","nāna","noun-adj",""
"2","opalabdhayo","UPALABDH","ayo","upalabdha","noun-adj",""
"3","yāś","","","yad","pron",""
"4","ca","","","ca","ind",""
"5","pratikṣaṇa","PRATIKṢAṆ","a@","pratikṣaṇa","noun-adj",""
"6","samudbhavāḥ","SAMUDBHAV","āḥ","samudbhava","noun-adj",""
"7","/","","","","punct",""
"8","marīci","MARĪC","i@","marīci","noun-adj",""
"9","sadṛśāś","SADṚŚ","āś","sadṛśa","noun-adj",""
"10","c","","","ca","ind",""
"11","^","","","","",""
"12","aite","","","tad","pron",""
"13","dṛṣṭa","DṚṢṬ","a@","dṛṣṭa","noun-adj",""
"14","naṣṭāḥ","NAṢṬ","āḥ","naṣṭa","noun-adj",""
"15","vilakṣaṇāḥ","VILAKṢAṆ","āḥ","vilakṣaṇa","noun-adj",""
"16","//","","","","punct",""
"17","106","","","","ind",""
"18","//","","","","punct",""
"","</s>","","","","",""
"","</page>","","","","",""
"","<page number=""106"">","","","","",""
"","<s number=""106"">","","","","",""
"1","pratibimba","PRATIBIMB","a@","pratibimba","noun-adj",""
"2","nibhaṃ","NIBH","aṃ","nibha","noun-adj",""
"3","grāhyam","GRĀH","yam","grāha","noun-adj",""
"4","an","","","alpha_privativum","ind",""
"5","ādi","ĀD","i@","ādi","noun-adj",""
"6","citta","CITT","a@","citta","noun-adj",""
"7","saṃbhavam","SAṂBHAV","am","saṃbhava","noun-adj",""
"8","/","","","","punct",""
"9","tad","TAD","","tad","pron",""
"10","ākāraṃ","ĀKĀR","aṃ","ākāra","noun-adj",""
"11","ca","","","ca","ind",""
"12","vijñānam","VIJÑĀN","am","vijñāna","noun-adj",""
"13","anyonya","ANYONY","a@","anyonya","noun-adj",""
"14","pratibimbavat","PRATIBIMB","avat","pratibimbavat","noun-adj",""
"15","//","","","","punct",""
"16","117","","","","ind",""
"17","//","","","","punct",""
"","</s>","","","","",""
"","</page>","","","","",""
"","<page number=""117"">","","","","",""
"","<s number=""117"">","","","","",""
"1","dhyāyināṃ","DHYĀY","ināṃ","dhyāyin","noun-adj",""
"2","svaccha","SVACCH","a@","svaccha","noun-adj",""
"3","saṃtāne","SAṂTĀN","e","saṃtāna","noun-adj",""
"4","yaj","YAJ","","yaja","noun-adj",""
"5","jñana","JÑAN","a@","jñana","noun-adj",""
"6","endu","END","u@","endh","noun-adj",""
"7","samudbhavam","SAMUDBHAV","am","samudbhava","noun-adj",""
"8","/","","","","punct",""
"9","udakacandra","UDAKACANDR","a@","udakacandra","noun-adj",""
"10","opamaṃ","UPAM","aṃ","upama","noun-adj",""
"11","tad","TAD","","tad","pron",""
"12","hi","","","hi","ind",""
"13","pratyakṣaṃ","PRATYAKṢ","aṃ","pratyakṣa","noun-adj",""
"14","na","","","na","ind",""
"15","vidyate","VID","yate","vid","verb","vid"
"16","//","","","","punct",""
"17","128","","","","ind",""
"18","//","","","","punct",""
"","</s>","","","","",""
"","</page>","","","","",""
"","<page number=""128"">","","","","",""
"","<s number=""128"">","","","","",""
"1","yoginām","YOG","inām","yogin","noun-adj",""
"2","api","","","api","ind",""
"3","yaj","YAJ","","yaja","noun-adj",""
"4","jñānaṃ","JÑĀN","aṃ","jñāna","noun-adj",""
"5","tad","TAD","","tad","pron",""
"6","apy","","","api","ind",""
"7","ākāśa","ĀKĀŚ","a@","ākāśa","noun-adj",""
"8","lakṣaṇam","LAKṢAṆ","am","lakṣaṇa","noun-adj",""
"9","/","","","","punct",""
"10","tasmāj","","","tad","pron",""
"11","jñānaṃ","JÑĀN","aṃ","jñāna","noun-adj",""
"12","ca","","","ca","ind",""
"13","jñeyaṃ","JÑEY","aṃ","jñeya","noun-adj",""
"14","ca","","","ca","ind",""
"15","sarvam","SARV","am","sarva","noun-adj",""
"16","ākāśa","ĀKĀŚ","a@","ākāśa","noun-adj",""
"17","lakṣaṇam","LAKṢAṆ","am","lakṣaṇa","noun-adj",""
"18","//","","","","punct",""
"19","139","","","","ind",""
"20","//","","","","punct",""
"","</s>","","","","",""
"","</page>","","","","",""
"","<page number=""139"">","","","","",""
"","<s number=""139"">","","","","",""
"1","iti","","","iti","ind",""
"2","cintayataḥ","CINTAY","ataḥ","cintaya","noun-adj",""
"3","tattvaṃ","TATTV","aṃ","tad","pron",""
"4","sarva","SARV","a@","sarva","noun-adj",""
"5","bhāveṣv","BHĀV","eṣv","bhāva","noun-adj",""
"6","an","","","alpha_privativum","ind",""
"7","āśritam","ĀŚRIT","am","āśrita","noun-adj",""
"8","/","","","","punct",""
"9","bodhi","BODH","i@","bodhi","noun-adj",""
"10","praṇidhi","PRAṆIDH","i@","praṇidhi","noun-adj",""
"11","cittena","CITT","ena","citta","noun-adj",""
"12","jñānaṃ","JÑĀN","aṃ","jñāna","noun-adj",""
"13","agraṃ","AGR","aṃ","agra","noun-adj",""
"14","bhaviṣyati","BHAV","iṣyati","bhav","verb","bhū"
"15","//","","","","punct",""
"16","14","","","","ind",""
"17","//","","","","punct",""
"","</s>","","","","",""
"","</page>","","","","",""
"","<page number=""14"">","","","","",""
"","<s number=""14"">","","","","",""
"1","ārya","ĀRY","a@","ārya","noun-adj",""
"2","āṣṭa","AṢṬ","a@","aṣṭa","noun-adj",""
"3","sāhasrikāyāḥ","SĀHASRIKĀY","āḥ","sāhasrikāya","noun-adj",""
"4","prajñāpāramitāyāḥ","PRAJÑĀPĀRAMIT","āyāḥ","prajñāpāramitā","noun-adj",""
"5","piṇḍārthaḥ","PIṆḌĀRTH","aḥ","piṇḍārtha","noun-adj",""
"6","samāptaḥ","SAMĀPT","aḥ","samāpta","noun-adj",""
"7","kṛtir","KṚT","ir","kṛti","noun-adj",""
"8","iyaṃ","","","idam","pron",""
"9","śrī","ŚR","ī@","śrī","noun-adj",""
"10","kambala","KAMBAL","a@","kambala","noun-adj",""
"11","āmbara","AMBAR","a@","ambara","noun-adj",""
"12","pādanām","PĀD","anām","pādat","noun-adj",""
"","</s>","","","","",""
"","</page>","","","","",""
"","</doc>","","","","",""
