"WordID","word","NormSTEM","suffix","lemma","PoS","Root"
"","<doc textid = ""sahajasiddhi"" genre = ""tantra"" title = ""sahajasiddhi"" author = ""ḍombīheruka"" discourse = ""tantra"" tradition = ""tantra"" period = ""commentarial"" source = ""dsbc accessed aug 2021"" date_range = ""before 11. ce"" notes = ""no information on exact dating of date and/ or author found. "" religion = ""buddh"" edition = ""based on the ed. of malati j. shendge. 1967. śrīsahajasiddhi. tokyo: indo-iranian journal."" digitization = ""miroj shakya"" segmentation_lemmatization = ""ligeia lugli & buddhist translators workbench team"" metadata_enrichment = ""bruno galasek-hul & buddhist translators workbench team"" proofreader = ""n/a"" permission = """" reconstructions = ""none"">","","","","",""
"","<page number=""0000"">","","","","",""
"","<s number=""1"">","","","","",""
"1","śrī","ŚRĪ","","śrī","noun-adj",""
"2","sahajasiddhi","SAHAJASIDDH","i","sa_saha","ind",""
"3","namaḥ","NAM","aḥ","nama","noun-adj",""
"4","śrī","ŚRĪ","","śrī","noun-adj",""
"5","vajra","VAJR","a@","vajra","noun-adj",""
"6","nāthāya","NĀTH","āya","nātha","noun-adj",""
"","</s>","","","","",""
"","<s number=""2"">","","","","",""
"1","sahajasiddhiṃ","SAHAJASIDDH","iṃ","sa_saha","ind",""
"2","pravakṣyāmi","PRAVAKṢ","yāmi","pravak","verb","pravac"
"3","sattva","SATTV","a@","sattva","noun-adj",""
"4","ānugraha","ANUGRAH","a@","anugraha","noun-adj",""
"5","hetunā","HET","unā","hetu","noun-adj",""
"6","/","","","","punct",""
"7","homay","HOM","ay","homā","noun-adj",""
"8","āgata","ĀGAT","a@","āgata","noun-adj",""
"9","potītaṃ","POT","ītaṃ","pota","noun-adj",""
"10","ādikarmika","ĀDIKARMIK","a@","ādikarmika","noun-adj",""
"11","varjitaṃ","VARJIT","aṃ","varjita","noun-adj",""
"12","//1//","","","","punct",""
"","</s>","","","","",""
"","<s number=""3"">","","","","",""
"1","sahaja","SAHAJ","a@","sa_saha","ind",""
"2","vastu","VAST","u@","vastu","noun-adj",""
"3","svarūpaṃ","SVARŪP","aṃ","svarūpa","noun-adj",""
"4","tu","","","tu","ind",""
"5","s","","","su","ind",""
"6","āntyad","ĀNTY","ad","āntya","noun-adj",""
"7","iddhir","IDDH","ir","iddhi","noun-adj",""
"8","ucyate","UC","yate","vak","verb","vac"
"9","/","","","","punct",""
"10","sahajasiddhir","SAHAJASIDDH","ir","sa_saha","ind",""
"11","bhavet","BHAV","et","bhav","verb","bhū"
"12","tasmāt","","","tad","pron",""
"13","a","","","alpha_privativum","ind",""
"14","vācyaṃ","VĀCY","aṃ","vācya","noun-adj",""
"15","sahajaṃ","SAHAJ","aṃ","sa_saha","ind",""
"16","smṛtaṃ","SMṚT","aṃ","smṛta","noun-adj",""
"17","//2//","","","","punct",""
"","</s>","","","","",""
"","<s number=""4"">","","","","",""
"1","kha","","","","ind",""
"2","dhātau","DHĀT","au","dhātu","noun-adj",""
"3","ca","","","ca","ind",""
"4","bhagaṃ","BHAG","aṃ","bhaga","noun-adj",""
"5","dhyātvā","DHYĀ","tvā","dhyā","verb",""
"6","madhye","MADHY","e","madhya","noun-adj",""
"7","kurvīta","KURV","īta","kurvat","noun-adj",""
"8","bhāvanā","BHĀVAN","ā","bhāvanā","noun-adj",""
"9","/","","","","punct",""
"10","cakra","CAKR","a@","cakra","noun-adj",""
"11","pūrvaṃ","PŪRV","aṃ","pūrva","noun-adj",""
"12","yathā","","","yathā","ind",""
"13","nyāyaṃ","NYĀY","aṃ","nyāya","noun-adj",""
"14","devatānāṃ","DEVAT","ānāṃ","devatā","noun-adj",""
"15","yathodayaṃ","YATHODAY","aṃ","yathodaya","noun-adj",""
"16","//3//","","","","punct",""
"","</s>","","","","",""
"","<s number=""5"">","","","","",""
"1","kha","","","","ind",""
"2","dhātāv","DHĀT","āv","dhāta","noun-adj",""
"3","iti","","","iti","ind",""
"4","padmeti","PADM","eti","padma","noun-adj",""
"5","jñānaṃ","JÑĀN","aṃ","jñāna","noun-adj",""
"6","bhagam","BHAG","am","bhaga","noun-adj",""
"7","iti","","","iti","ind",""
"8","smṛtam","SMṚT","am","smṛta","noun-adj",""
"9","/","","","","punct",""
"10","bhāva","BHĀV","a@","bhāva","noun-adj",""
"11","n","","","na","ind",""
"12","^","","","","",""
"13","eti","","","iti","ind",""
"14","samāpatti","SAMĀPATT","i","samāpatti","noun-adj",""
"15","tat","TAT","","tad","pron",""
"16","sukhaṃ","SUKH","aṃ","sukha","noun-adj",""
"17","cakram","CAKR","am","cakra","noun-adj",""
"18","ucyate","UC","yate","vak","verb","vac"
"19","//4//","","","","punct",""
"","</s>","","","","",""
"","<s number=""6"">","","","","",""
"1","yathā","","","yathā","ind",""
"2","nyāyaṃ","NYĀY","aṃ","nyāya","noun-adj",""
"3","svasaṃvedyaṃ","SVASAṂVEDY","aṃ","svasaṃvedya","noun-adj",""
"4","bodhicittan","BODHICITT","an","bodhicitta","noun-adj",""
"5","tu","","","tu","ind",""
"6","devatā","DEVAT","ā","devatā","noun-adj",""
"7","/","","","","punct",""
"8","yathodayaṃ","YATHODAY","aṃ","yathodaya","noun-adj",""
"9","bhavet","BHAV","et","bhav","verb","bhū"
"10","śūnyaṃ","ŚŪNY","aṃ","śūnya","noun-adj",""
"11","dvividhaṃ","DVIVIDH","aṃ","dvividha","noun-adj",""
"12","sahajaṃ","SAHAJ","aṃ","sa_saha","ind",""
"13","sthitam","STHIT","am","sthita","noun-adj",""
"14","//5//","","","","punct",""
"","</s>","","","","",""
"","<s number=""7"">","","","","",""
"1","yoṣitā","YOṢIT","ā","yoṣitā","noun-adj",""
"2","tu","","","tu","ind",""
"3","bhavet","BHAV","et","bhav","verb","bhū"
"4","prajñā","PRAJÑ","ā","prajñā","noun-adj",""
"5","upāyaḥ","UPĀY","aḥ","upāya","noun-adj",""
"6","puruṣaḥ","PURUṢ","aḥ","puruṣa","noun-adj",""
"7","smṛtam","SMṚT","am","smṛta","noun-adj",""
"8","/","","","","punct",""
"9","paścād","PAŚC","ād","paśca","noun-adj",""
"10","anayor","","","idam","pron",""
"11","dvaividhyaṃ","DVAIVIDHY","aṃ","dvaividhya","noun-adj",""
"12","saṃvṛti","SAṂVṚT","i@","saṃvṛti","noun-adj",""
"13","bhedataḥ","BHEDAT","aḥ","bhedatas","noun-adj",""
"14","//6//","","","","punct",""
"","</s>","","","","",""
"","<s number=""8"">","","","","",""
"1","pūṃṣi","","","","ind",""
"2","tāvat","TĀVAT","","tāvat","ind",""
"3","dvaividhyaṃ","DVAIVIDHY","aṃ","dvaividhya","noun-adj",""
"4","śukraṃ","ŚUKR","aṃ","śukra","noun-adj",""
"5","tasya","","","tad","pron",""
"6","sukhaṃ","SUKH","aṃ","sukha","noun-adj",""
"7","ca","","","ca","ind",""
"8","vā","","","vā","ind",""
"9","/","","","","punct",""
"10","prajñāyām","PRAJÑ","āyām","prajñā","noun-adj",""
"11","api","","","api","ind",""
"12","yathā","","","yathā","ind",""
"13","pūṃsi","","","","ind",""
"14","śukraṃ","ŚUKR","aṃ","śukra","noun-adj",""
"15","tasya","","","tad","pron",""
"16","sukhaṃ","SUKH","aṃ","sukha","noun-adj",""
"17","ca","","","ca","ind",""
"18","vā","","","vā","ind",""
"19","//7//","","","","punct",""
"","</s>","","","","",""
"","<s number=""9"">","","","","",""
"1","ataḥ","","","atas","ind",""
"2","eva","","","eva","ind",""
"3","hi","","","hi","ind",""
"4","ānandaḥ","ĀNAND","aḥ","ānanda","noun-adj",""
"5","caturṇāṃ","CAT","urṇāṃ","catur","noun-adj",""
"6","saṃprabhedataḥ","SAṂPRABHED","ataḥ","saṃprabheda","noun-adj",""
"7","/","","","","punct",""
"8","sahajaṃ","SAHAJ","aṃ","sa_saha","ind",""
"9","catur","CAT","ur@","catur","noun-adj",""
"10","vidhaṃ","VIDH","aṃ","vidha","noun-adj",""
"11","yasmāt","","","yad","pron",""
"12","samyaksaṃbuddha","SAMYAKSAṂBUDDH","a@","samyaksaṃbuddha","noun-adj",""
"13","bhāṣitaṃ","BHĀṢIT","aṃ","bhāṣita","noun-adj",""
"14","//8//","","","","punct",""
"","</s>","","","","",""
"","<s number=""10"">","","","","",""
"1","ānandena","ĀNAND","ena","ānanda","noun-adj",""
"2","sukhaṃ","SUKH","aṃ","sukha","noun-adj",""
"3","kiñcit","","","kimcit","ind",""
"4","parama","PARAM","a@","parama","noun-adj",""
"5","ānandaṃ","ĀNAND","aṃ","ānanda","noun-adj",""
"6","tad","TAD","","tad","pron",""
"7","adhikam","ADH","ikam","adhika","noun-adj",""
"8","/","","","","punct",""
"9","virama","VIRAM","a@","virama","noun-adj",""
"10","ānandaṃ","ĀNAND","aṃ","ānanda","noun-adj",""
"11","virāgaḥ","VIRĀG","aḥ","virāga","noun-adj",""
"12","syāt","","","as","verb","as"
"13","sahajānandaṃ","SAHAJĀNAND","aṃ","sa_saha","ind",""
"14","tu","","","tu","ind",""
"15","śeṣataḥ","ŚEṢ","ataḥ","śeṣa","noun-adj",""
"16","//9//","","","","punct",""
"","</s>","","","","",""
"","<s number=""11"">","","","","",""
"1","prathamaṃ","PRATHAM","aṃ","prathama","noun-adj",""
"2","sparśa","SPARŚ","a@","sparśa","noun-adj",""
"3","kāṅkṣā","KĀṄKṢ","ā","kāṅkṣā","noun-adj",""
"4","ca","","","ca","ind",""
"5","dvitīyaṃ","DVITĪY","aṃ","dvitīya","noun-adj",""
"6","sukha","SUKH","a@","sukha","noun-adj",""
"7","bodhakam","BODH","akam","bodhaka","noun-adj",""
"8","/","","","","punct",""
"9","tṛtīyaṃ","TṚTĪY","aṃ","tṛtīya","noun-adj",""
"10","rāga","RĀG","a@","rāga","noun-adj",""
"11","nāśatvaṃ","NĀŚ","atvaṃ","nāśatva","noun-adj",""
"12","caturthaṃ","CATURTH","aṃ","caturtha","noun-adj",""
"13","tena","","","tad","pron",""
"14","bhaṇyate","BHAṆ","yate","bhaṇ","verb",""
"15","//10//","","","","punct",""
"","</s>","","","","",""
"","<s number=""12"">","","","","",""
"1","prathamaṃ","PRATHAM","aṃ","prathama","noun-adj",""
"2","uṣma","UṢM","a@","uṣma","noun-adj",""
"3","āyate","ĀYAT","e","āyata","noun-adj",""
"4","prajñā","PRAJÑ","ā","prajñā","noun-adj",""
"5","dvitīyaṃ","DVITĪY","aṃ","dvitīya","noun-adj",""
"6","dhūma","DHŪM","a@","dhūma","noun-adj",""
"7","vatī","VAT","ī","vati","noun-adj",""
"8","bhavet","BHAV","et","bhav","verb","bhū"
"9","/","","","","punct",""
"10","tṛtīye","TṚTĪY","e","tṛtīya","noun-adj",""
"11","tyajati","TYAJ","ati","tyaj","verb","tyaj"
"12","sphalī","SPHAL","ī","sphalī","noun-adj",""
"13","caturthe","CATURTH","e","caturtha","noun-adj",""
"14","jvalitā","JVALIT","ā","jvalita","noun-adj",""
"15","yathā","","","yathā","ind",""
"16","//11//","","","","punct",""
"","</s>","","","","",""
"","<s number=""13"">","","","","",""
"1","caṇḍālī","CAṆḌĀL","ī","caṇḍālī","noun-adj",""
"2","jvalate","JVAL","ate","jval","verb",""
"3","nābhau","NĀBH","au","nābha","noun-adj",""
"4","dahati","DAH","ati","dah","verb","dah"
"5","pañca","PAÑC","a@","pañca","noun-adj",""
"6","tathāgatān","TATHĀGAT","ān","tathāgata","noun-adj",""
"7","/","","","","punct",""
"8","dahati","DAH","ati","dah","verb","dah"
"9","locan","LOC","an@","locat","noun-adj",""
"10","ādīn","ĀD","īn","ādi","noun-adj",""
"11","dagdhe","DAGDH","e","dagdha","noun-adj",""
"12","ham","HAM","","hama","noun-adj",""
"13","sravate","SRAV","ate","srav","verb",""
"14","śaśī","ŚAŚ","ī","śaśin","noun-adj",""
"15","//12//","","","","punct",""
"","</s>","","","","",""
"","<s number=""14"">","","","","",""
"1","pūrvaṃ","PŪRV","aṃ","pūrva","noun-adj",""
"2","yad","","","yadi","ind",""
"3","vac","VAC","","vaca","noun-adj",""
"4","ca","","","ca","ind",""
"5","dvaividhyaṃ","DVAIVIDHY","aṃ","dvaividhya","noun-adj",""
"6","bodhicittaṃ","BODHICITT","aṃ","bodhicitta","noun-adj",""
"7","kṛtaṃ","KṚT","aṃ","kṛta","noun-adj",""
"8","jinaiḥ","JIN","aiḥ","jina","noun-adj",""
"9","/","","","","punct",""
"10","tadvad","TADVAD","","tadvat","noun-adj",""
"11","atr","ATR","","atra","noun-adj",""
"12","^","","","","",""
"13","āpi","","","api","ind",""
"14","draṣṭavyaṃ","DRAṢ","ṭavyaṃ","darś","verb","dṛś"
"15","prajñā","PRAJÑ","ā@","prajñā","noun-adj",""
"16","vajra","VAJR","a@","vajra","noun-adj",""
"17","samāgamaṃ","SAMĀGAM","aṃ","samāgama","noun-adj",""
"18","//13//","","","","punct",""
"","</s>","","","","",""
"","<s number=""15"">","","","","",""
"1","rūpaṃ","RŪP","aṃ","rūpa","noun-adj",""
"2","śabdaḥ","ŚABD","aḥ","śabda","noun-adj",""
"3","tathā","","","tathā","ind",""
"4","gandho","GANDH","o","gandha","noun-adj",""
"5","rasaḥ","RAS","aḥ","rasa","noun-adj",""
"6","sparśas","SPARŚ","as","sparśa","noun-adj",""
"7","t","","","tu","ind",""
"8","^","","","","",""
"9","aiv","","","eva","ind",""
"10","a","","","alpha_privativum","ind",""
"11","ca","","","ca","ind",""
"12","/","","","","punct",""
"","</s>","","","","",""
"","<s number=""16"">","","","","",""
"1","dharmadhātu","DHARMADHĀT","u@","dharmadhātu","noun-adj",""
"2","svabhāvaś","SVABHĀV","aś","svabhāva","noun-adj",""
"3","ca","","","ca","ind",""
"4","yathā","","","yathā","ind",""
"5","īrṣyeṇa","ĪRṢY","eṇa","īrṣyā","noun-adj",""
"6","caryate","CAR","yate","car","verb","car"
"7","/","","","","punct",""
"8","ekaika","EKAIK","a@","ekaika","noun-adj",""
"9","āyatane","ĀYATAN","e","āyatana","noun-adj",""
"10","nandah","NAND","ah","nanda","noun-adj",""
"11","sa","","","sa_saha","ind",""
"12","draṣṭavyaḥ","DRAṢ","ṭavyaḥ","darś","verb","dṛś"
"13","catuś","CAT","uś","catur","noun-adj",""
"14","catuḥ","CAT","uḥ","catur","noun-adj",""
"15","//14//","","","","punct",""
"","</s>","","","","",""
"","<s number=""17"">","","","","",""
"1","n","","","na","ind",""
"2","^","","","","",""
"3","ān","","","alpha_privativum","ind",""
"4","yena","","","yad","pron",""
"5","kathayate","KATH","ayate","kath","verb","kath"
"6","sahajaṃ","SAHAJ","aṃ","sa_saha","ind",""
"7","na","","","na","ind",""
"8","kasminn","","","kim","pron",""
"9","api","","","api","ind",""
"10","labhyate","LABH","yate","labh","verb","labh"
"11","/","","","","punct",""
"12","ātmanā","ĀTM","anā","ātman","noun-adj",""
"13","jñāyate","JÑĀ","yate","jān","verb","jñā"
"14","puṇya","PUṆY","a@","puṇya","noun-adj",""
"15","guruṃ","GUR","uṃ","guru","noun-adj",""
"16","prabodha","PRABODH","a","prabodha","noun-adj",""
"17","s","","","su","ind",""
"18","evayā","EVAY","ā","evayā","noun-adj",""
"19","//15//","","","","punct",""
"","</s>","","","","",""
"","<s number=""18"">","","","","",""
"1","śrī","ŚRĪ","","śrī","noun-adj",""
"2","ḍombi","ḌOMB","i@","ḍombi","noun-adj",""
"3","heruka","HERUK","a@","heruka","noun-adj",""
"4","pāda","PĀDA","","pāda","noun-adj",""
"5","kṛtāyāṃ","KṚT","āyāṃ","kṛta","noun-adj",""
"6","sahajasiddhau","SAHAJASIDDH","au","sa_saha","ind",""
"7","sahaja","SAHAJ","a@","sa_saha","ind",""
"8","nirdeśaḥ","NIRDEŚ","aḥ","nirdeśa","noun-adj",""
"9","prathamaḥ","PRATHAM","aḥ","prathama","noun-adj",""
"10","/","","","","punct",""
"","</s>","","","","",""
"","<s number=""19"">","","","","",""
"1","hīna","HĪN","a@","hīna","noun-adj",""
"2","madhyama","MADHYAM","a@","madhyama","noun-adj",""
"3","otkṛṣṭāni","UTKṚṢṬ","āni","utkṛṣṭa","noun-adj",""
"4","a","","","alpha_privativum","ind",""
"5","nyāni","NYĀN","i","nyān","verb",""
"6","yāni","","","yad","pron",""
"7","tāni","","","tad","pron",""
"8","ca","","","ca","ind",""
"9","/","","","","punct",""
"10","sarve","SARV","e","sarva","noun-adj",""
"11","tāni","","","tad","pron",""
"12","samāni","SAMĀN","i","samāni","noun-adj",""
"13","iti","","","iti","ind",""
"14","draṣṭavyāni","DRAṢ","ṭavyāni","darś","verb","dṛś"
"15","tattva","TATTV","a@","tad","pron",""
"16","bhāvanaiḥ","BHĀVAN","aiḥ","bhāvanā","noun-adj",""
"17","//1//","","","","punct",""
"","</s>","","","","",""
"","<s number=""20"">","","","","",""
"1","hīnaṃ","HĪN","aṃ","hīna","noun-adj",""
"2","sukṣma","SUKṢM","a@","sukṣma","noun-adj",""
"3","pada","PAD","a@","pada","noun-adj",""
"4","ārthaṃ","ARTH","aṃ","artha","noun-adj",""
"5","tu","","","tu","ind",""
"6","utkṛṣṭaṃ","UTKṚṢṬ","aṃ","utkṛṣṭa","noun-adj",""
"7","bhāvam","BHĀV","am","bhāva","noun-adj",""
"8","ucyate","UC","yate","vak","verb","vac"
"9","/","","","","punct",""
"10","madhyamaṃ","MADHYAM","aṃ","madhyama","noun-adj",""
"11","varjitaṃ","VARJIT","aṃ","varjita","noun-adj",""
"12","dvābhyāṃ","DV","ābhyāṃ","dva","noun-adj",""
"13","anyāni","ANY","āni","anya","noun-adj",""
"14","iti","","","iti","ind",""
"15","ṣaḍ","ṢAḌ","@","ṣaḍi","noun-adj",""
"16","indriyam","INDRIY","am","indriya","noun-adj",""
"17","//2//","","","","punct",""
"","</s>","","","","",""
"","<s number=""21"">","","","","",""
"1","sthira","STHIR","a@","sthira","noun-adj",""
"2","calā","CAL","ā","calā","noun-adj",""
"3","yāni","","","yad","pron",""
"4","t","","","tu","ind",""
"5","ānīti","ĀNĪT","i","ānīti","noun-adj",""
"6","hīna","HĪN","a@","hīna","noun-adj",""
"7","kalāni","KAL","āni","kala","noun-adj",""
"8","/","","","","punct",""
"9","samāni","SAMĀN","i","samāni","noun-adj",""
"10","tulya","TUL","ya","tul","verb",""
"11","ceṣṭāni","CEṢṬ","āni","ceṣṭa","noun-adj",""
"12","samarasaṃ","SAMARAS","aṃ","samarasa","noun-adj",""
"13","tattva","TATTV","a@","tad","pron",""
"14","bhāvanaiḥ","BHĀVAN","aiḥ","bhāvanā","noun-adj",""
"15","//3//","","","","punct",""
"","</s>","","","","",""
"","<s number=""22"">","","","","",""
"1","samaṃ","SAM","aṃ","sama","noun-adj",""
"2","tulyaṃ","TULY","aṃ","tulya","noun-adj",""
"3","ity","","","iti","ind",""
"4","uktaṃ","UKT","aṃ","ukta","noun-adj",""
"5","tad","","","tad","pron",""
"6","ev","","","eva","ind",""
"7","aika","EK","a@","eka","noun-adj",""
"8","rasaṃ","RAS","aṃ","rasa","noun-adj",""
"9","smṛtam","SMṚT","am","smṛta","noun-adj",""
"10","/","","","","punct",""
"11","samarasaṃ","SAMARAS","aṃ","samarasa","noun-adj",""
"12","eka","EK","a@","eka","noun-adj",""
"13","bhāvyaṃ","BHĀVY","aṃ","bhāvya","noun-adj",""
"14","tu","","","tu","ind",""
"15","etena","ETEN","a@","tad","pron",""
"16","ārthena","ARTH","ena","artha","noun-adj",""
"17","bhaṇyate","BHAṆ","yate","bhaṇ","verb",""
"18","//4//","","","","punct",""
"","</s>","","","","",""
"","<s number=""23"">","","","","",""
"1","kulāni","KUL","āni","kula","noun-adj",""
"2","bhajate","BHAJ","ate","bhaj","verb","bhaj"
"3","loke","LOK","e","loka","noun-adj",""
"4","pañca","PAÑC","a@","pañca","noun-adj",""
"5","saṃkhyāni","SAṂKHYĀN","i","saṃkhyāna","noun-adj",""
"6","ca","","","ca","ind",""
"7","/","","","","punct",""
"8","kulasa","KULAS","a@","kulasa","noun-adj",""
"9","evayā","EVAY","ā","evayā","noun-adj",""
"10","bhavet","BHAV","et","bhav","verb","bhū"
"11","siddhiḥ","SIDDH","iḥ","siddhi","noun-adj",""
"12","sarva","SARV","a@","sarva","noun-adj",""
"13","kāma","KĀM","a@","kāma","noun-adj",""
"14","pradā","PRAD","ā","pradā","noun-adj",""
"15","śubhā","ŚUBH","ā","śubhā","noun-adj",""
"16","//5//","","","","punct",""
"","</s>","","","","",""
"","<s number=""24"">","","","","",""
"1","akṣobha","AKṢOBH","a@","akṣobha","noun-adj",""
"2","yaś","YAŚ","","yad","pron",""
"3","c","","","ca","ind",""
"4","^","","","","",""
"5","āmitābhaś","AMITĀBH","aś","amitābha","noun-adj",""
"6","ca","","","ca","ind",""
"7","ratnasaṃbhava","RATNASAṂBHAV","a","ratnasaṃbhava","noun-adj",""
"8","bhūpatiḥ","BHŪPAT","iḥ","bhūpati","noun-adj",""
"9","/","","","","punct",""
"10","amoghaś","AMOGH","aś","amogha","noun-adj",""
"11","ca","","","ca","ind",""
"12","tathā","","","tathā","ind",""
"13","proktā","PROKT","ā","prokta","noun-adj",""
"14","sattvānāṃ","SATTV","ānāṃ","sattva","noun-adj",""
"15","siddhi","SIDDH","i@","siddhi","noun-adj",""
"16","hetunā","HET","unā","hetu","noun-adj",""
"17","//6//","","","","punct",""
"","</s>","","","","",""
"","<s number=""25"">","","","","",""
"1","akṣobhyaḥ","AKṢOBH","yaḥ","akṣobha","noun-adj",""
"2","vajram","VAJR","am","vajra","noun-adj",""
"3","ity","","","iti","ind",""
"4","uktaṃ","UKT","aṃ","ukta","noun-adj",""
"5","amitābha","AMITĀBH","a","amitābha","noun-adj",""
"6","padmam","PADM","am","padma","noun-adj",""
"7","eva","","","eva","ind",""
"8","ca","","","ca","ind",""
"9","/","","","","punct",""
"10","ratnasaṃbhavaḥ","RATNASAṂBHAV","aḥ","ratnasaṃbhava","noun-adj",""
"11","ratnaṃ","RATN","aṃ","ratna","noun-adj",""
"12","vairocana","VAIROCAN","a","vairocana","noun-adj",""
"13","tathāgataś","TATHĀGAT","aś","tathāgata","noun-adj",""
"14","ca","","","ca","ind",""
"15","//7//","","","","punct",""
"","</s>","","","","",""
"","<s number=""26"">","","","","",""
"1","amoghaḥ","AMOGH","aḥ","amogha","noun-adj",""
"2","karma","KARM","a","karman","noun-adj",""
"3","ity","","","iti","ind",""
"4","uktam","UKT","am","ukta","noun-adj",""
"5","kulāny","KUL","āny","kula","noun-adj",""
"6","etāni","","","tad","pron",""
"7","saṃkṣipet","SAṄKṢIP","et","saṅkṣip","verb","saṅkṣip"
"8","/","","","","punct",""
"9","kulasa","KULAS","a@","kulasa","noun-adj",""
"10","evayā","EVAY","ā","evayā","noun-adj",""
"11","bhavet","BHAV","et","bhav","verb","bhū"
"12","siddhiḥ","SIDDH","iḥ","siddhi","noun-adj",""
"13","samyaksaṃbuddha","SAMYAKSAṂBUDDH","a@","samyaksaṃbuddha","noun-adj",""
"14","bhāṣitam","BHĀṢIT","am","bhāṣita","noun-adj",""
"15","//8//","","","","punct",""
"","</s>","","","","",""
"","<s number=""27"">","","","","",""
"1","trāse","TRĀS","e","trāsa","noun-adj",""
"2","na","","","na","ind",""
"3","rocate","ROC","ate","roc","verb","ruc"
"4","loke","LOK","e","loka","noun-adj",""
"5","hakāra","HAKĀR","a@","hakāra","noun-adj",""
"6","ādi","ĀD","i@","ādi","noun-adj",""
"7","kulāni","KUL","āni","kula","noun-adj",""
"8","tu","","","tu","ind",""
"9","/","","","","punct",""
"10","mūḍhānām","MŪḌH","ānām","mūḍha","noun-adj",""
"11","upadeśo","UPADEŚ","o","upadeśa","noun-adj",""
"12","hi","","","hi","ind",""
"13","prakopāya","PRAKOP","āya","prakopa","noun-adj",""
"14","na","","","na","ind",""
"15","śāntaye","ŚĀNT","aye","śānti","noun-adj",""
"16","//9//","","","","punct",""
"","</s>","","","","",""
"","<s number=""28"">","","","","",""
"1","hevajro","HEVAJR","o","hevajra","noun-adj",""
"2","jñāyate","JÑĀ","yate","jān","verb","jñā"
"3","tena","","","tad","pron",""
"4","śraddhayā","ŚRADDH","ayā","śraddhā","noun-adj",""
"5","vā","","","vā","ind",""
"6","śrute","ŚRUT","e","śruta","noun-adj",""
"7","sati","","","","ind",""
"8","/","","","","punct",""
"9","go","","","","ind",""
"10","pitaṃ","PIT","aṃ","pitṛ","noun-adj",""
"11","durbhaga","DURBHAG","a@","durbhaga","noun-adj",""
"12","sattveṣu","SATTV","eṣu","sattva","noun-adj",""
"13","subhagebhyaś","SUBHAG","ebhyaś","subhaga","noun-adj",""
"14","ca","","","ca","ind",""
"15","kathyate","KATH","yate","kath","verb","kath"
"16","//10//","","","","punct",""
"","</s>","","","","",""
"","<s number=""29"">","","","","",""
"1","samayāni","SAMAY","āni","samaya","noun-adj",""
"2","sevita","SEVIT","a@","sevita","noun-adj",""
"3","vyāni","VYĀN","i","vyāni","noun-adj",""
"4","daśa","DAŚ","a@","daśa","noun-adj",""
"5","saṃkhyā","SAṂKHY","ā","saṃkhyā","noun-adj",""
"6","kṛtāni","KṚT","āni","kṛta","noun-adj",""
"7","ca","","","ca","ind",""
"8","/","","","","punct",""
"9","sahajatvāt","SAHAJ","atvāt","sa_saha","ind",""
"10","dv","DV","","dva","noun-adj",""
"11","dhā","DH","ā","dhā","noun-adj",""
"12","bhedāt","BHED","āt","bheda","noun-adj",""
"13","pañca","PAÑC","a@","pañca","noun-adj",""
"14","pañca","PAÑC","a","pañca","noun-adj",""
"15","pṛthak","PṚTHAK","","pṛthak","noun-adj",""
"16","pṛthak","PṚTHAK","","pṛthak","noun-adj",""
"17","//11//","","","","punct",""
"","</s>","","","","",""
"","<s number=""30"">","","","","",""
"1","ga","","","","ind",""
"2","kāra","KĀR","a@","kāra","noun-adj",""
"3","ādi","ĀD","i","ādi","noun-adj",""
"4","hakāra","HAKĀR","a@","hakāra","noun-adj",""
"5","ādi","ĀD","i","ādi","noun-adj",""
"6","anta","ANT","a@","anta","noun-adj",""
"7","madhya","MADHY","a@","madhya","noun-adj",""
"8","ādi","ĀD","i","ādi","noun-adj",""
"9","ā","","","alpha_privativum","ind",""
"10","divā","DIV","ā","diva","noun-adj",""
"11","/","","","","punct",""
"12","na","","","na","ind",""
"13","kārād","KĀR","ād","kāra","noun-adj",""
"14","eko","","","eka","ind",""
"15","bhayād","BHAY","ād","bhaya","noun-adj",""
"16","vā","","","vā","ind",""
"17","gupta","GUPT","a","gupta","noun-adj",""
"18","loka","LOK","a@","loka","noun-adj",""
"19","pravādataḥ","PRAVĀD","ataḥ","pravāda","noun-adj",""
"20","//12//","","","","punct",""
"","</s>","","","","",""
"","<s number=""31"">","","","","",""
"1","bāhye","BĀHY","e","bāhya","noun-adj",""
"2","kṛṣṇa","KṚṢṆ","a@","kṛṣṇa","noun-adj",""
"3","varṇaṃ","VARṆ","aṃ","varṇa","noun-adj",""
"4","ca","","","ca","ind",""
"5","śukla","ŚUKL","a@","śukla","noun-adj",""
"6","varṇaṃ","VARṆ","aṃ","varṇa","noun-adj",""
"7","raktaṃ","RAKT","aṃ","rakta","noun-adj",""
"8","ca","","","ca","ind",""
"9","/","","","","punct",""
"10","śyāma","ŚYĀM","a@","śyāma","noun-adj",""
"11","pītaṃ","PĪT","aṃ","pīta","noun-adj",""
"12","ca","","","ca","ind",""
"13","varṇa","VARṆ","a@","varṇa","noun-adj",""
"14","bhedena","BHED","ena","bheda","noun-adj",""
"15","jñāsyante","JÑĀS","yante","jñāsa","noun-adj",""
"16","tathāgatāḥ","TATHĀGAT","āḥ","tathāgata","noun-adj",""
"17","//13//","","","","punct",""
"","</s>","","","","",""
"","<s number=""32"">","","","","",""
"1","sahaja","SAHAJ","a@","sa_saha","ind",""
"2","saṃgataṃ","SAṂGAT","aṃ","saṃgata","noun-adj",""
"3","hi","","","hi","ind",""
"4","jagat","JAGAT","","jagat","noun-adj",""
"5","sarvaṃ","SARV","aṃ","sarva","noun-adj",""
"6","yaduta","","","yaduta","ind",""
"7","bhuvana","BHUVAN","a@","bhuvana","noun-adj",""
"8","trayam","TRAY","am","tri","noun-adj",""
"9","/","","","","punct",""
"10","ten","","","tad","pron",""
"11","^","","","","",""
"12","aiva","","","eva","ind",""
"13","vyāpitaṃ","VYĀP","itaṃ","vyāpa","noun-adj",""
"14","sarvaṃ","SARV","aṃ","sarva","noun-adj",""
"15","pānamaḥ","PĀN","amaḥ","pāna","noun-adj",""
"16","ya","","","yad","pron",""
"17","jagat","JAGAT","","jagat","noun-adj",""
"18","//14//","","","","punct",""
"","</s>","","","","",""
"","<s number=""33"">","","","","",""
"1","evaṃ","","","eva","ind",""
"2","matvā","","","","ind",""
"3","tu","","","tu","ind",""
"4","yogī","YOG","ī","yogin","noun-adj",""
"5","ahaṃ","","","mat","pron",""
"6","etādṛśo","ETĀDṚŚ","o","etādṛśa","noun-adj",""
"7","dhruvam","DHRUV","am","dhruva","noun-adj",""
"8","/","","","","punct",""
"9","vicāryate","VICĀR","yate","vicar","verb","vicar"
"10","mahādh","MAH","ādh","mahat","noun-adj",""
"11","su","","","su","ind",""
"12","rataṃ","RAT","aṃ","rata","noun-adj",""
"13","sahajānanda","SAHAJĀNAND","a@","sa_saha","ind",""
"14","vat","VAT","","vat","noun-adj",""
"15","//15//","","","","punct",""
"","</s>","","","","",""
"","<s number=""34"">","","","","",""
"1","khāne","KHĀN","e","khāna","noun-adj",""
"2","pāne","PĀN","e","pāna","noun-adj",""
"3","tathā","","","tathā","ind",""
"4","snāne","SNĀN","e","snāna","noun-adj",""
"5","jāgra","JĀGR","a@","jāgrat","noun-adj",""
"6","tah","TAH","","tahi","noun-adj",""
"7","svapne","SVAPN","e","svapna","noun-adj",""
"8","api","","","api","ind",""
"9","cintayet","CINTAY","et","cint","verb","cint"
"10","/","","","","punct",""
"11","sātatyaṃ","SĀTATY","aṃ","sātatya","noun-adj",""
"12","tu","","","tu","ind",""
"13","tato","","","tatas","ind",""
"14","yānti","","","","ind",""
"15","sukhāvaty","SUKHĀVAT","y","sukhāvatī","noun-adj",""
"16","abhikāṅkṣiṇaḥ","ABHIKĀṄKṢ","iṇaḥ","abhikāṅkṣin","noun-adj",""
"17","//16//","","","","punct",""
"","</s>","","","","",""
"","<s number=""35"">","","","","",""
"1","śrī","ŚRĪ","","śrī","noun-adj",""
"2","ḍombi","ḌOMB","i@","ḍombi","noun-adj",""
"3","heruka","HERUK","a@","heruka","noun-adj",""
"4","pāda","PĀDA","","pāda","noun-adj",""
"5","kṛtāyāṃ","KṚT","āyāṃ","kṛta","noun-adj",""
"6","sahajasiddhau","SAHAJASIDDH","au","sa_saha","ind",""
"7","samaya","SAMAY","a@","samaya","noun-adj",""
"8","tattva","TATTV","a@","tad","pron",""
"9","nirdeśaḥ","NIRDEŚ","aḥ","nirdeśa","noun-adj",""
"10","dvitīyaḥ","DVITĪY","aḥ","dvitīya","noun-adj",""
"11","/","","","","punct",""
"","</s>","","","","",""
"","<s number=""36"">","","","","",""
"1","yad","","","yadi","ind",""
"2","uktaṃ","UKT","aṃ","ukta","noun-adj",""
"3","bāhyaṃ","BĀHY","aṃ","bāhya","noun-adj",""
"4","ca","","","ca","ind",""
"5","yat","","","yad","pron",""
"6","tu","","","tu","ind",""
"7","samo","SAM","o@","sama","noun-adj",""
"8","mathe","MATH","e","matha","noun-adj",""
"9","vata","VAT","a@","vata","noun-adj",""
"10","āyane","ĀYAN","e","āyana","noun-adj",""
"11","/","","","","punct",""
"12","hevajra","HEVAJR","a@","hevajra","noun-adj",""
"13","yoginī","YOG","inī","yogin","noun-adj",""
"14","tantre","TANTR","e","tad","pron",""
"15","paścād","PAŚC","ād","paśca","noun-adj",""
"16","vīrasya","VĪRASY","a","vīrasya","noun-adj",""
"17","kathyate","KATH","yate","kath","verb","kath"
"18","//1//","","","","punct",""
"","</s>","","","","",""
"","<s number=""37"">","","","","",""
"1","c","","","ca","ind",""
"2","^","","","","",""
"3","ātrasa","ĀTRAS","a@","ātrasati","noun-adj",""
"4","yāta","YĀT","a@","yāta","noun-adj",""
"5","trasyat","TRASY","at","trasyat","noun-adj",""
"6","pātu","PĀT","u@","pātu","noun-adj",""
"7","brahmā","BRAHM","ā","brahma","noun-adj",""
"8","sau","","","","ind",""
"9","catāḥ","CAT","āḥ","catur","noun-adj",""
"10","/","","","","punct",""
"11","sadā","","","sadā","ind",""
"12","śaucyan","ŚAUC","yan","śauca","noun-adj",""
"13","tu","","","tu","ind",""
"14","karta","KART","a@","karta","noun-adj",""
"15","vyaṃ","VYAṂ","","vyaṃs","noun-adj",""
"16","na","","","na","ind",""
"17","kā","","","kim","pron",""
"18","yācita","YĀCIT","a@","yācita","noun-adj",""
"19","vācane","VĀCAN","e","vācana","noun-adj",""
"20","//2//","","","","punct",""
"","</s>","","","","",""
"","<s number=""38"">","","","","",""
"1","puṇya","PUṆY","a@","puṇya","noun-adj",""
"2","jñānena","JÑĀN","ena","jñāna","noun-adj",""
"3","śocyante","ŚOC","yante","śoc","verb","śuc"
"4","svasaṃvedya","SVASAṂVEDY","a@","svasaṃvedya","noun-adj",""
"5","sukhena","SUKH","ena","sukha","noun-adj",""
"6","vā","","","vā","ind",""
"7","/","","","","punct",""
"8","svasaṃvedya","SVASAṂVEDY","a@","svasaṃvedya","noun-adj",""
"9","ātmikā","ĀTM","ikā","ātman","noun-adj",""
"10","śuddhiḥ","ŚUDDH","iḥ","śuddhi","noun-adj",""
"11","n","","","na","ind",""
"12","ānya","ANY","a@","anya","noun-adj",""
"13","śuddhyā","ŚUDDH","yā","śuddhi","noun-adj",""
"14","vimucyate","VIMUC","yate","vimuca","noun-adj",""
"15","//3//","","","","punct",""
"","</s>","","","","",""
"","<s number=""39"">","","","","",""
"1","vedāsā","VED","āsā","veda","noun-adj",""
"2","veda","VED","a@","veda","noun-adj",""
"3","āvṛtena","ĀVṚT","ena","āvṛta","noun-adj",""
"4","caryā","CARY","ā","caryā","noun-adj",""
"5","seti","SET","i","seti","noun-adj",""
"6","nidarśitā","NIDARŚIT","ā","nidarśita","noun-adj",""
"7","/","","","","punct",""
"8","s","","","su","ind",""
"9","evayā","EVAY","ā","evayā","noun-adj",""
"10","seva","SEV","a@","sevā","noun-adj",""
"11","kānāṃ","KĀN","āṃ","kāna","noun-adj",""
"12","tu","","","tu","ind",""
"13","caret","CAR","et","car","verb","car"
"14","sā","","","tad","pron",""
"15","caryeti","CAR","yeti","car","verb",""
"16","smṛta","SMṚT","a","smṛta","noun-adj",""
"17","//4//","","","","punct",""
"","</s>","","","","",""
"","<s number=""40"">","","","","",""
"1","siddhi","SIDDH","i@","siddhi","noun-adj",""
"2","labdho","LABDH","o","labdha","noun-adj",""
"3","api","","","api","ind",""
"4","yaḥ","","","yad","pron",""
"5","śiṣyaḥ","ŚIṢY","aḥ","śiṣya","noun-adj",""
"6","guru","GUR","u@","guru","noun-adj",""
"7","van","VAN","","vat","noun-adj",""
"8","n","","","na","ind",""
"9","ābhivandayet","ABHIVAND","ayet","abhivand","verb",""
"10","/","","","","punct",""
"11","avīcy","AVĪC","y@","avīci","noun-adj",""
"12","ādi","ĀD","i@","ādi","noun-adj",""
"13","viśo","VIŚ","o","viśa","noun-adj",""
"14","api","","","api","ind",""
"15","syāt","","","as","verb","as"
"16","kṣaṇāt","KṢAṆ","āt","kṣaṇa","noun-adj",""
"17","gurūk","GUR","ūk","guru","noun-adj",""
"18","tilaṅ","TIL","aṅ","tila","noun-adj",""
"19","ghanāt","GHAN","āt","ghana","noun-adj",""
"20","//5//","","","","punct",""
"","</s>","","","","",""
"","<s number=""41"">","","","","",""
"1","bhāvyate","BHĀV","yate","bhav","verb","bhū"
"2","hi","","","hi","ind",""
"3","jagat","JAGAT","","jagat","noun-adj",""
"4","sarvaṃ","SARV","aṃ","sarva","noun-adj",""
"5","manasā","MAN","asā","manas","noun-adj",""
"6","yan","","","yad","pron",""
"7","na","","","na","ind",""
"8","bhāvyate","BHĀV","yate","bhav","verb","bhū"
"9","/","","","","punct",""
"10","sarva","SARV","a@","sarva","noun-adj",""
"11","dharma","DHARM","a@","dharma","noun-adj",""
"12","parijñānaṃ","PARIJÑĀN","aṃ","parijñāna","noun-adj",""
"13","bhāvanān","BHĀVAN","ān","bhāvanā","noun-adj",""
"14","^","","","","",""
"15","aiva","","","eva","ind",""
"16","bhāvanā","BHĀVAN","ā","bhāvanā","noun-adj",""
"17","//6//","","","","punct",""
"","</s>","","","","",""
"","<s number=""42"">","","","","",""
"1","sthira","STHIR","a@","sthira","noun-adj",""
"2","calā","CAL","ā","calā","noun-adj",""
"3","ye","","","yad","pron",""
"4","bhāvā","BHĀV","ā","bhāva","noun-adj",""
"5","latā","LAT","ā@","latā","noun-adj",""
"6","gulma","GULM","a@","gulma","noun-adj",""
"7","tṛṇa","TṚṆ","a@","tṛṇa","noun-adj",""
"8","ādayaḥ","ĀD","ayaḥ","ādi","noun-adj",""
"9","/","","","","punct",""
"10","bhāvayet","BHĀVAY","et","bhāvaya","noun-adj",""
"11","vai","","","vai","ind",""
"12","paraṃ","PAR","aṃ","para","noun-adj",""
"13","tattvaṃ","TATTV","aṃ","tad","pron",""
"14","ātma","ĀTM","a@","ātman","noun-adj",""
"15","bhāva","BHĀV","a@","bhāva","noun-adj",""
"16","svarūpakam","SVARŪP","akam","svarūpaka","noun-adj",""
"17","//7//","","","","punct",""
"","</s>","","","","",""
"","<s number=""43"">","","","","",""
"1","teṣām","","","tad","pron",""
"2","evaṃ","","","eva","ind",""
"3","paraṃ","PAR","aṃ","para","noun-adj",""
"4","n","","","na","ind",""
"5","^","","","","",""
"6","ātra","","","atra","ind",""
"7","svasaṃvedya","SVASAṂVEDY","a@","svasaṃvedya","noun-adj",""
"8","mahāsukha","MAHĀSUKH","a","mahāsukha","noun-adj",""
"9","/","","","","punct",""
"10","svasaṃvedyā","SVASAṂVEDY","ā","svasaṃvedya","noun-adj",""
"11","bhavet","BHAV","et","bhav","verb","bhū"
"12","siddhiḥ","SIDDH","iḥ","siddhi","noun-adj",""
"13","svasaṃvedyā","SVASAṂVEDY","ā","svasaṃvedya","noun-adj",""
"14","hi","","","hi","ind",""
"15","bhāvanā","BHĀVAN","ā","bhāvanā","noun-adj",""
"16","//8//","","","","punct",""
"","</s>","","","","",""
"","<s number=""44"">","","","","",""
"1","svasaṃvedyam","SVASAṂVEDY","am","svasaṃvedya","noun-adj",""
"2","ayaṃ","AYAṂ","","idam","pron",""
"3","karma","KARM","a","karman","noun-adj",""
"4","bhāvanā","BHĀVAN","ā","bhāvanā","noun-adj",""
"5","karma","KARM","a","karman","noun-adj",""
"6","jāyate","JĀ","yate","jan","verb","jan"
"7","/","","","","punct",""
"8","svayaṃ","SVAY","aṃ","svaya","noun-adj",""
"9","kartā","KART","ā","kartṛ","noun-adj",""
"10","svayaṃ","SVAY","aṃ","svaya","noun-adj",""
"11","hartā","HART","ā","hartṛ","noun-adj",""
"12","svayaṃ","SVAY","aṃ","svaya","noun-adj",""
"13","rājā","RĀJ","ā","rājan","noun-adj",""
"14","svayaṃ","SVAY","aṃ","svaya","noun-adj",""
"15","prabhūḥ","PRABH","ūḥ","prabhu","noun-adj",""
"16","//","","","","punct",""
"17","9//","","","","punct",""
"","</s>","","","","",""
"","<s number=""45"">","","","","",""
"1","rāga","RĀG","a@","rāga","noun-adj",""
"2","dveṣaṃ","DVEṢ","aṃ","dveṣa","noun-adj",""
"3","t","","","tu","ind",""
"4","^","","","","",""
"5","aiv","","","eva","ind",""
"6","erṣya","IRṢY","a@","irṣyā","noun-adj",""
"7","ā","","","alpha_privativum","ind",""
"8","moho","MOH","o","moha","noun-adj",""
"9","māno","MĀN","o","māna","noun-adj",""
"10","t","","","tu","ind",""
"11","^","","","","",""
"12","aiv","","","eva","ind",""
"13","a","","","alpha_privativum","ind",""
"14","ca","","","ca","ind",""
"15","/","","","","punct",""
"16","pañca","PAÑC","a@","pañca","noun-adj",""
"17","kleśā","KLEŚ","ā","kleśa","noun-adj",""
"18","tu","","","tu","ind",""
"19","draṣṭavyā","DRAṢ","ṭavyā","darś","verb","dṛś"
"20","vidyā","VIDY","ā@","vidyā","noun-adj",""
"21","rājño","RĀJ","ño","rājan","noun-adj",""
"22","mahāsukhāt","MAHĀSUKH","āt","mahāsukha","noun-adj",""
"23","//10//","","","","punct",""
"","</s>","","","","",""
"","<s number=""46"">","","","","",""
"1","ava","","","","ind",""
"2","bhuktām","BHUKT","ām","bhuktā","noun-adj",""
"3","api","","","api","ind",""
"4","xxxxxxxxxxxxxxxxxxxxxxxxxxxxxxxxxxxxxxxxxxxxxxxxxxxxxxxxxxx","","","CORRUPTED","ind",""
"5","/","","","","punct",""
"6","xxxxxxxxxxxxxxxxxxxxxxxxxxxxxxxxxxxxxxxxxxxxxxxxxxxxxxxxxxxxxxxxxxxxxxxxxxxxxxxxxx","","","CORRUPTED","ind",""
"7","//11//","","","","punct",""
"","</s>","","","","",""
"","<s number=""47"">","","","","",""
"1","tato","","","tatas","ind",""
"2","yānti","","","","ind",""
"3","sukhāvatyāṃ","SUKHĀVAT","yāṃ","sukhāvatī","noun-adj",""
"4","siddha","SIDDH","a@","siddha","noun-adj",""
"5","vīro","VĪR","o","vīra","noun-adj",""
"6","mahāsukha","MAHĀSUKH","a","mahāsukha","noun-adj",""
"7","/","","","","punct",""
"8","paramārthaṃ","PARAMĀRTH","aṃ","paramārtha","noun-adj",""
"9","samāśritya","SAMĀŚRIT","ya","samāśrita","noun-adj",""
"10","sarva","SARV","a@","sarva","noun-adj",""
"11","ākāreṇa","ĀKĀR","eṇa","ākāra","noun-adj",""
"12","tiṣṭhati","TIṢṬH","ati","tiṣṭh","verb","sthā"
"13","//12//","","","","punct",""
"","</s>","","","","",""
"","<s number=""48"">","","","","",""
"1","siddhi","SIDDH","i@","siddhi","noun-adj",""
"2","samaye","SAMAY","e","samaya","noun-adj",""
"3","pañca","PAÑC","a@","pañca","noun-adj",""
"4","bhijño","BHIJÑ","o","bhijña","noun-adj",""
"5","api","","","api","ind",""
"6","bhavati","BHAV","ati","bhav","verb","bhū"
"7","/","","","","punct",""
"","</s>","","","","",""
"","<s number=""49"">","","","","",""
"1","divya","DIV","ya","div","verb",""
"2","cakṣuḥ","CAKṢ","uḥ","cakṣu","noun-adj",""
"3","divya","DIV","ya","div","verb",""
"4","śrota","ŚROT","a","śrota","noun-adj",""
"5","divya","DIV","ya@","diva","noun-adj",""
"6","ghrāṇaḥ","GHRĀṆ","aḥ","ghrāṇa","noun-adj",""
"7","divya","DIV","ya","div","verb",""
"8","sparśaḥ","SPARŚ","aḥ","sparśa","noun-adj",""
"9","divya","DIV","ya","div","verb",""
"10","rasaḥ","RAS","aḥ","rasa","noun-adj",""
"11","divya","DIV","ya","div","verb",""
"12","mano","MAN","o@","manas","noun-adj",""
"13","kāyaḥ","KĀY","aḥ","kāya","noun-adj",""
"14","anyatra","ANYATR","a","anyatra","noun-adj",""
"15","sthitā","STHIT","ā","sthita","noun-adj",""
"16","saṃbhoga","SAMBHOG","a@","sambhoga","noun-adj",""
"17","samanvitaś","SAMANVIT","aś","samanvita","noun-adj",""
"18","c","","","ca","ind",""
"19","^","","","","",""
"20","eti","","","iti","ind",""
"21","//","","","","punct",""
"","</s>","","","","",""
"","<s number=""50"">","","","","",""
"1","śrī","ŚRĪ","","śrī","noun-adj",""
"2","ḍombi","ḌOMB","i@","ḍombi","noun-adj",""
"3","heruka","HERUK","a@","heruka","noun-adj",""
"4","pāda","PĀDA","","pāda","noun-adj",""
"5","kṛtāyāṃ","KṚT","āyāṃ","kṛta","noun-adj",""
"6","sahajasiddhau","SAHAJASIDDH","au","sa_saha","ind",""
"7","samaya","SAMAY","a","samaya","noun-adj",""
"8","siddhi","SIDDH","i@","siddhi","noun-adj",""
"9","nirṇaya","NIRṆAY","a@","nirṇaya","noun-adj",""
"10","nirdeśaḥ","NIRDEŚ","aḥ","nirdeśa","noun-adj",""
"11","tṛtīyaḥ","TṚTĪY","aḥ","tṛtīya","noun-adj",""
"12","//","","","","punct",""
"","</s>","","","","",""
"","<s number=""51"">","","","","",""
"1","śrī","ŚRĪ","","śrī","noun-adj",""
"2","ḍombi","ḌOMB","i@","ḍombi","noun-adj",""
"3","heruka","HERUK","a@","heruka","noun-adj",""
"4","pāda","PĀDA","","pāda","noun-adj",""
"5","kṛtīḥ","KṚT","īḥ","kṛta","noun-adj",""
"6","sahajasiddhiḥ","SAHAJASIDDH","iḥ","sa_saha","ind",""
"7","samāptā","SAMĀPT","ā","samāpta","noun-adj",""
"8","//","","","","punct",""
"","</s>","","","","",""
"","</page>","","","","",""
"","</doc>","","","","",""
