"WordID","word","NormSTEM","suffix","lemma","PoS","Root"
"","<doc textid = ""samanyadusana"" genre = ""śāstra"" title = ""sāmānyadūṣaṇa"" author = ""paṇḍita_aśoka"" discourse = ""philosophy"" tradition = ""pramāṇa"" period = ""commentarial"" source = ""sarit accessed dec 2020"" date_range = ""11th cent. ce"" notes = ""for the dates of paṇḍita aśoka: 1st half 11th century; see https://east.ikga.oeaw.ac.at /buddh /ind /31/. cf. also the dates of paṇḍita aśoka given by fernando tola & carmen dragonetti. 1994. the avayavinirākaraṇa of paṇḍita aśoka. tokyo: ībs; p. xvī: 841ce-11th cent. ce"" religion = ""buddh"" edition = ""based on the ed. by anantalal thakur. 1974. aśokanibandhau avayavinirākaraṇaṃ samānyadūṣaṇaṃ ca. patna: kashi prasad jayaswal research institute."" digitization = ""data entry by: aurorachana; auroville; prepared for sarit by liudmila olalde"" segmentation_lemmatization = ""ligeia lugli & buddhist translators workbench team"" metadata_enrichment = ""bruno galasek-hul & buddhist translators workbench team"" proofreader = ""n/a"" permission = ""cc by-sa 4.0"" reconstructions = ""none"">","","","","",""
"","<page number=""11"">","","","","",""
"","<s number=""1"">","","","","",""
"1","//","","","","punct",""
"2","sāmānya","SĀMĀNY","a@","sāmānya","noun-adj",""
"3","dūṣaṇam","DŪṢAṆ","am","dūṣaṇa","noun-adj",""
"4","//","","","","punct",""
"","</s>","","","","",""
"","<s number=""2"">","","","","",""
"1","vyāpakaṃ","VYĀP","akaṃ","vyāpaka","noun-adj",""
"2","nityam","NITY","am","nitya","noun-adj",""
"3","ekaṃ","EK","aṃ","eka","noun-adj",""
"4","ca","","","ca","ind",""
"5","sāmānyaṃ","SĀMĀNY","aṃ","sāmānya","noun-adj",""
"6","yaiḥ","","","yad","pron",""
"7","prakalpitam","PRAKALPIT","am","prakalpita","noun-adj",""
"8","/","","","","punct",""
"","</s>","","","","",""
"","<s number=""3"">","","","","",""
"1","moha","MOH","a@","moha","noun-adj",""
"2","granthi","GRANTH","i@","granthi","noun-adj",""
"3","cchide","CHID","e","chida","noun-adj",""
"4","teṣāṃ","","","tad","pron",""
"5","tad","TAD","","tad","pron",""
"6","a","","","alpha_privativum","ind",""
"7","bhāvaḥ","BHĀV","aḥ","bhāva","noun-adj",""
"8","prasādhyate","PRASĀDH","yate","prasādh","verb","prasādh"
"9","//","","","","punct",""
"","</s>","","","","",""
"","<s number=""4"">","","","","",""
"1","katham","KATHAM","","katham","ind",""
"2","idam","IDAM","","idam","pron",""
"3","avagamyate","AVAGAM","yate","avagacch","verb","avagam"
"4","paraspara","PARASPAR","a@","paraspara","noun-adj",""
"5","vilakṣaṇa","VILAKṢAṆ","a@","vilakṣaṇa","noun-adj",""
"6","kṣaṇeṣu","KṢAṆ","eṣu","kṣaṇa","noun-adj",""
"7","pratyakṣa","PRATYAKṢ","a@","pratyakṣa","noun-adj",""
"8","samīkṣyamāṇeṣv","SAMĪK","ṣyamāṇeṣv","samīka","noun-adj",""
"9","a","","","alpha_privativum","ind",""
"10","bhinna","BHINN","a@","bhinna","noun-adj",""
"11","dhīdhvani","DHĪD","hvani","dhīdā","noun-adj",""
"12","prasava","PRASAV","a@","prasava","noun-adj",""
"13","nibandhanam","NIBANDHAN","am","nibandhana","noun-adj",""
"14","anuyāyi","ANUYĀY","i@","anuyāyin","noun-adj",""
"15","rūpaṃ","RŪP","aṃ","rūpa","noun-adj",""
"16","sāmānyaṃ","SĀMĀNY","aṃ","sāmānya","noun-adj",""
"17","na","","","na","ind",""
"18","mānyaṃ","MĀNY","aṃ","mānya","noun-adj",""
"19","manīṣiṇām","MANĪṢ","iṇām","manīṣin","noun-adj",""
"20","iti","","","iti","ind",""
"21","/","","","","punct",""
"","</s>","","","","",""
"","<s number=""5"">","","","","",""
"1","sādhaka","SĀDH","aka@","sādhaka","noun-adj",""
"2","pramāṇa","PRAMĀṆ","a@","pramāṇa","noun-adj",""
"3","virahād","VIR","ahād","vira","noun-adj",""
"4","bādhaka","BĀDH","aka@","bādhaka","noun-adj",""
"5","pramāṇa","PRAMĀṆ","a@","pramāṇa","noun-adj",""
"6","saṃbhavāc","SAṂBHAV","āc","saṃbhava","noun-adj",""
"7","c","","","ca","ind",""
"8","^","","","","",""
"9","eti","","","iti","ind",""
"10","brūmaḥ","BRŪM","aḥ","brūma","noun-adj",""
"11","/","","","","punct",""
"","</s>","","","","",""
"","<s number=""6"">","","","","",""
"1","tathā","","","tathā","ind",""
"2","hi","","","hi","ind",""
"3","yad","","","yadi","ind",""
"4","idaṃ","IDAṂ","","idam","pron",""
"5","sāmānya","SĀMĀNY","a@","sāmānya","noun-adj",""
"6","sādhanam","SĀDHAN","am","sādhana","noun-adj",""
"7","anumānam","ANUMĀN","am","anumāna","noun-adj",""
"8","abhidhīyate","ABHIDHĪ","yate","abhidhīa","noun-adj",""
"9","paraiḥ","PAR","aiḥ","para","noun-adj",""
"10","yad","","","yadi","ind",""
"11","anugata","ANUGAT","a@","anugata","noun-adj",""
"12","ākāraṃ","ĀKĀR","aṃ","ākāra","noun-adj",""
"13","jnm̐ānaṃ","","","","ind",""
"14","tad","TAD","","tad","pron",""
"15","anugata","ANUGAT","a@","anugata","noun-adj",""
"16","vastu","VAST","u@","vastu","noun-adj",""
"17","nibandhanam","NIBANDHAN","am","nibandhana","noun-adj",""
"18","/","","","","punct",""
"","</s>","","","","",""
"","<s number=""7"">","","","","",""
"1","yathā","","","yathā","ind",""
"2","bahuṣu","BAH","uṣu","bahu","noun-adj",""
"3","puṣpeṣu","PUṢP","eṣu","puṣpa","noun-adj",""
"4","srak","SRAK","","sraka","noun-adj",""
"5","srag","SRAG","","sraga","noun-adj",""
"6","iti","","","iti","ind",""
"7","jnm̐ānam","","","","ind",""
"8","/","","","","punct",""
"","</s>","","","","",""
"","<s number=""8"">","","","","",""
"1","asti","","","as","verb","as"
"2","ca","","","ca","ind",""
"3","paraspara","PARASPAR","a@","paraspara","noun-adj",""
"4","saṃparka","SAMPARK","a@","samparka","noun-adj",""
"5","vikala","VIKAL","a@","vikala","noun-adj",""
"6","kalāsu","KAL","āsu","kal","verb",""
"7","kārya","KĀRY","a@","kārya","noun-adj",""
"8","ādi","ĀD","i@","ādi","noun-adj",""
"9","vyaktiṣv","VYAKT","iṣv","vyakti","noun-adj",""
"10","anugata","ANUGAT","a@","anugata","noun-adj",""
"11","ākāraṃ","ĀKĀR","aṃ","ākāra","noun-adj",""
"12","vijnm̐ānaṃ","VIJ","nm̐ānaṃ","vija","noun-adj",""
"13","tad","TAD","","tad","pron",""
"14","an","","","alpha_privativum","ind",""
"15","aikāntikatā","AIKĀNTIK","atā","aikāntika","noun-adj",""
"16","doṣa","DOṢ","a@","doṣa","noun-adj",""
"17","ākrānta","ĀKRĀNT","a@","ākrānta","noun-adj",""
"18","śarīratvān","ŚARĪR","atvān","śarīratva","noun-adj",""
"19","na","","","na","ind",""
"20","tad","TAD","","tad","pron",""
"21","bhāva","BHĀV","a@","bhāva","noun-adj",""
"22","sādhanāy","SĀDHAN","āy","sādhana","noun-adj",""
"23","^","","","","",""
"24","ālam","","","alam","ind",""
"25","/","","","","punct",""
"","</s>","","","","",""
"","<s number=""9"">","","","","",""
"1","yato","","","yatas","ind",""
"2","bhavati","BHAV","ati","bhav","verb","bhū"
"3","bahuṣu","BAH","uṣu","bahu","noun-adj",""
"4","pācakeṣu","PĀCAK","eṣu","pācaka","noun-adj",""
"5","pācakaḥ","PĀCAK","aḥ","pācaka","noun-adj",""
"6","pācaka","PĀCAK","a","pācaka","noun-adj",""
"7","iti","","","iti","ind",""
"8","ekākāra","EKĀKĀR","a@","ekākāra","noun-adj",""
"9","parāmarśa","PARĀMARŚ","a@","parāmarśa","noun-adj",""
"10","pratyayaḥ","PRATYAY","aḥ","pratyaya","noun-adj",""
"11","/","","","","punct",""
"","</s>","","","","",""
"","<s number=""10"">","","","","",""
"1","na","","","na","ind",""
"2","ca","","","ca","ind",""
"3","teṣv","","","tad","pron",""
"4","anugatam","ANUGAT","am","anugata","noun-adj",""
"5","ekaṃ","EK","aṃ","eka","noun-adj",""
"6","vastu","VAST","u@","vastu","noun-adj",""
"7","samasti","SAMAST","i","samasti","noun-adj",""
"8","/","","","","punct",""
"","</s>","","","","",""
"","<s number=""11"">","","","","",""
"1","tad","TAD","","tad","pron",""
"2","bhāve","BHĀV","e","bhāva","noun-adj",""
"3","hi","","","hi","ind",""
"4","prāgeva","PRĀGEV","a","prāgeva","noun-adj",""
"5","tathā","","","tathā","ind",""
"6","vidha","VIDH","a@","vidha","noun-adj",""
"7","pratyaya","PRATYAY","a@","pratyaya","noun-adj",""
"8","otpāda","UTPĀD","a@","utpāda","noun-adj",""
"9","prasaṅgo","PRASAṄG","o","prasaṅga","noun-adj",""
"10","durvāra","DURVĀR","a@","durvāra","noun-adj",""
"11","pracāraḥ","PRACĀR","aḥ","pracāra","noun-adj",""
"12","/","","","","punct",""
"","</s>","","","","",""
"","<s number=""12"">","","","","",""
"1","kriya","KRIY","a@","kriyā","noun-adj",""
"2","opakāra","UPAKĀR","a@","upakāra","noun-adj",""
"3","āpekṣāṇāṃ","APEKṢ","āṇāṃ","apekṣā","noun-adj",""
"4","sva","SV","a@","sva","noun-adj",""
"5","lakṣaṇānāṃ","LAKṢAṆ","ānāṃ","lakṣaṇa","noun-adj",""
"6","sāmānya","SĀMĀNY","a@","sāmānya","noun-adj",""
"7","vyanm̐","VYAN","m̐","vyana","noun-adj",""
"8","jakatvā","JAK","atvā","jaka","noun-adj",""
"9","dayam","DAY","am","daya","noun-adj",""
"10","a","","","alpha_privativum","ind",""
"11","doṣa","DOṢ","a","doṣa","noun-adj",""
"12","iti","","","iti","ind",""
"13","cet","CET","","ced","noun-adj",""
"14","/","","","","punct",""
"","</s>","","","","",""
"","<s number=""13"">","","","","",""
"1","n","","","na","ind",""
"2","aitad","AITAD","","tad","pron",""
"3","asti","","","as","verb","as"
"4","/","","","","punct",""
"","</s>","","","","",""
"","<s number=""14"">","","","","",""
"1","nityānām","NITY","ānām","nitya","noun-adj",""
"2","an","","","alpha_privativum","ind",""
"3","ādheya","ĀDHEY","a@","ādheya","noun-adj",""
"4","ātiśayatay","ATIŚAY","atay","atiśayat","noun-adj",""
"5","ānupakāriṇi","ANUPAKĀR","iṇi","anupakārin","noun-adj",""
"6","saha","SAH","a@","sa_saha","ind",""
"7","kāriṇy","KĀRIṆ","y@","kāriṇī","noun-adj",""
"8","apekṣā","APEKṢ","ā@","apekṣā","noun-adj",""
"9","yogāt","YOG","āt","yoga","noun-adj",""
"10","/","","","","punct",""
"","</s>","","","","",""
"","<s number=""15"">","","","","",""
"1","sātiśayatve","SĀTIŚAY","atve","sātiśaya","noun-adj",""
"2","vā","","","vā","ind",""
"3","pratikṣaṇaṃ","PRATIKṢAṆ","aṃ","pratikṣaṇa","noun-adj",""
"4","viśarāru","VIŚARĀR","u@","viśarāru","noun-adj",""
"5","śarīratvāt","ŚARĪR","atvāt","śarīratva","noun-adj",""
"6","kriyā","KRIY","ā","kriyā","noun-adj",""
"7","kuta","KUT","a","kuta","noun-adj",""
"8","iti","","","iti","ind",""
"9","doṣo","DOṢ","o","doṣa","noun-adj",""
"10","duṣ","","","duḥ","ind",""
"11","pariharaḥ","PARIHAR","aḥ","parihara","noun-adj",""
"12","/","","","","punct",""
"","</s>","","","","",""
"","<s number=""16"">","","","","",""
"1","kriyā","KRIY","ā@","kriyā","noun-adj",""
"2","nibandhanatvāt","NIBANDHAN","atvāt","nibandhanatva","noun-adj",""
"3","pācakeṣv","PĀCAK","eṣv","pācaka","noun-adj",""
"4","anugata","ANUGAT","a@","anugata","noun-adj",""
"5","ākāra","ĀKĀR","a@","ākāra","noun-adj",""
"6","pratyayasya","PRATYAY","asya","pratyaya","noun-adj",""
"7","n","","","na","ind",""
"8","^","","","","",""
"9","ān","","","alpha_privativum","ind",""
"10","aikāntikatā","AIKĀNTIK","atā","aikāntika","noun-adj",""
"11","doṣa","DOṢ","a","doṣa","noun-adj",""
"12","ity","","","iti","ind",""
"13","api","","","api","ind",""
"14","vārtam","VĀRT","am","vārtā","noun-adj",""
"15","/","","","","punct",""
"","</s>","","","","",""
"","<s number=""17"">","","","","",""
"1","pratibhedaṃ","PRATIBHED","aṃ","pratibheda","noun-adj",""
"2","bhidyamānānāṃ","BHID","yamānānāṃ","bhinat","verb","bhid"
"3","karmaṇāṃ","KARM","aṇāṃ","karman","noun-adj",""
"4","tan","TAN","","tad","pron",""
"5","nibandhanatvā","NIBANDHAN","atvā","nibandhanatvā","noun-adj",""
"6","yogāt","YOG","āt","yoga","noun-adj",""
"7","/","","","","punct",""
"","</s>","","","","",""
"","<s number=""18"">","","","","",""
"1","bhinnānām","BHINN","ānām","bhinna","noun-adj",""
"2","apy","","","api","ind",""
"3","a","","","alpha_privativum","ind",""
"4","bhinnā","BHINN","ā@","bhinna","noun-adj",""
"5","kārajnm̐āna","KĀRAJ","nm̐āna","kāraja","noun-adj",""
"6","nibandhanatve","NIBANDHAN","atve","nibandhanatva","noun-adj",""
"7","vyaktīnām","VYAKT","īnām","vyakti","noun-adj",""
"8","api","","","api","ind",""
"9","tathā","","","tathā","ind",""
"10","bhāvo","BHĀV","o","bhāva","noun-adj",""
"11","na","","","na","ind",""
"12","rāja","RĀJ","a@","rājan","noun-adj",""
"13","daṇḍa","DAṆḌ","a@","daṇḍa","noun-adj",""
"14","nivāritaḥ","NIVĀRIT","aḥ","nivārita","noun-adj",""
"15","/","","","","punct",""
"","</s>","","","","",""
"","<s number=""19"">","","","","",""
"1","tataś","","","tatas","ind",""
"2","ca","","","ca","ind",""
"3","sāmānyam","SĀMĀNY","am","sāmānya","noun-adj",""
"4","eva","","","eva","ind",""
"5","n","","","na","ind",""
"6","opeyaṃ","UPEY","aṃ","upeya","noun-adj",""
"7","syād","","","as","verb","as"
"8","iti","","","iti","ind",""
"9","mūla","MŪL","a@","mūla","noun-adj",""
"10","haraṃ","HAR","aṃ","hara","noun-adj",""
"11","pakṣam","PAKṢ","am","pakṣa","noun-adj",""
"12","āśrayatā","ĀŚRAY","atā","āśrayatā","noun-adj",""
"13","devānāṃ","DEV","ānāṃ","deva","noun-adj",""
"14","priyeṇa","PRIY","eṇa","priya","noun-adj",""
"15","suṣṭhu","SUṢṬH","u@","suṣṭhu","noun-adj",""
"16","anukūlam","ANUKŪL","am","anukūla","noun-adj",""
"17","ācaritam","ĀCARIT","am","ācarita","noun-adj",""
"18","/","","","","punct",""
"","</s>","","","","",""
"","<s number=""20"">","","","","",""
"1","anen","","","idam","pron",""
"2","^","","","","",""
"3","aiva","","","eva","ind",""
"4","nyāyena","NYĀY","ena","nyāya","noun-adj",""
"5","kriyākāraka","KRIYĀKĀR","aka@","kriyākāra","noun-adj",""
"6","saṃbandham","SAṂBANDH","am","saṃbandhati","noun-adj",""
"7","a","","","alpha_privativum","ind",""
"8","bhinna","BHINN","a@","bhinna","noun-adj",""
"9","jnm̐āna","J","nm̐āna","ja","noun-adj",""
"10","nibandhanam","NIBANDHAN","am","nibandhana","noun-adj",""
"11","upakalpayan","UPAKALP","ayan","upakalpa","noun-adj",""
"12","pratikṣiptaḥ","PRATIKṢIPT","aḥ","pratikṣipta","noun-adj",""
"13","/","","","","punct",""
"","</s>","","","","",""
"","<s number=""21"">","","","","",""
"","</page>","","","","",""
"","<page number=""12"">","","","","",""
"3","pāka","PĀK","a@","pāka","noun-adj",""
"4","kriyātva","KRIY","ātva","kriyā","noun-adj",""
"5","nibandhanaḥ","NIBANDHAN","aḥ","nibandhana","noun-adj",""
"6","pācakeṣv","PĀCAK","eṣv","pācaka","noun-adj",""
"7","anugata","ANUGAT","a@","anugata","noun-adj",""
"8","ākāraḥ","ĀKĀR","aḥ","ākāra","noun-adj",""
"9","pratyayaḥ","PRATYAY","aḥ","pratyaya","noun-adj",""
"10","/","","","","punct",""
"","</s>","","","","",""
"","<s number=""22"">","","","","",""
"1","tatā","TAT","ā","tata","noun-adj",""
"2","n","","","na","ind",""
"3","^","","","","",""
"4","ān","","","alpha_privativum","ind",""
"5","aikāntikatā","AIKĀNTIK","atā","aikāntika","noun-adj",""
"6","doṣa","DOṢ","a","doṣa","noun-adj",""
"7","ity","","","iti","ind",""
"8","api","","","api","ind",""
"9","na","","","na","ind",""
"10","mantavyam","MAN","tavyam","man","verb","man"
"11","/","","","","punct",""
"","</s>","","","","",""
"","<s number=""23"">","","","","",""
"1","na","","","na","ind",""
"2","hy","","","hi","ind",""
"3","artha","ARTH","a@","artha","noun-adj",""
"4","āntara","ANTAR","a@","antara","noun-adj",""
"5","saṃbandhinī","SAṂBANDH","inī","saṃbandhati","noun-adj",""
"6","jātir","JĀT","ir","jāti","noun-adj",""
"7","artha","ARTH","a@","artha","noun-adj",""
"8","āntara","ANTAR","a@","antara","noun-adj",""
"9","pratyaya","PRATYAY","a@","pratyaya","noun-adj",""
"10","otpatti","UTPATT","i@","utpatti","noun-adj",""
"11","hetuḥ","HET","uḥ","hetu","noun-adj",""
"12","atiprasaṅgāt","ATIPRASAṄG","āt","atiprasaṅga","noun-adj",""
"13","/","","","","punct",""
"","</s>","","","","",""
"","<s number=""24"">","","","","",""
"1","syād","","","as","verb","as"
"2","etat","ETAT","","tad","pron",""
"3","/","","","","punct",""
"","</s>","","","","",""
"","<s number=""25"">","","","","",""
"1","samaveta","SAMAVET","a@","samaveta","noun-adj",""
"2","samavāya","SAMAVĀY","a@","samavāya","noun-adj",""
"3","saṃbandha","SAṂBANDH","a@","saṃbandhati","noun-adj",""
"4","balāt","BAL","āt","bala","noun-adj",""
"5","pāka","PĀK","a@","pāka","noun-adj",""
"6","kriyā","KRIY","ā@","kriyā","noun-adj",""
"7","sāmānyaṃ","SĀMĀNY","aṃ","sāmānya","noun-adj",""
"8","pācakeṣv","PĀCAK","eṣv","pācaka","noun-adj",""
"9","a","","","alpha_privativum","ind",""
"10","bhinna","BHINN","a@","bhinna","noun-adj",""
"11","ākāraṃ","ĀKĀR","aṃ","ākāra","noun-adj",""
"12","parāmarśa","PARĀMARŚ","a@","parāmarśa","noun-adj",""
"13","pratyayam","PRATYAY","am","pratyaya","noun-adj",""
"14","upajanayati","UPAJAN","ayati","upajan","verb","upajan"
"15","/","","","","punct",""
"","</s>","","","","",""
"","<s number=""26"">","","","","",""
"1","tato","","","tatas","ind",""
"2","na","","","na","ind",""
"3","yath","","","yathā","ind",""
"4","^","","","","",""
"5","okto","UKT","o","ukta","noun-adj",""
"6","doṣaḥ","DOṢ","aḥ","doṣa","noun-adj",""
"7","/","","","","punct",""
"","</s>","","","","",""
"","<s number=""27"">","","","","",""
"1","tad","TAD","","tad","pron",""
"2","idam","IDAM","","idam","pron",""
"3","apy","","","api","ind",""
"4","a","","","alpha_privativum","ind",""
"5","sāram","SĀR","am","sāra","noun-adj",""
"6","/","","","","punct",""
"","</s>","","","","",""
"","<s number=""28"">","","","","",""
"1","yata","","","yatas","ind",""
"2","udayān","UDAY","ān","udaya","noun-adj",""
"3","antara","ANTAR","a@","antara","noun-adj",""
"4","āpavargitayā","APAVARG","itayā","apavarga","noun-adj",""
"5","karmaṇām","KARM","aṇām","karman","noun-adj",""
"6","ev","","","eva","ind",""
"7","^","","","","",""
"8","ā","","","alpha_privativum","ind",""
"9","saṃbhavāt","SAṂBHAV","āt","saṃbhava","noun-adj",""
"10","vinaṣṭe","VINAṢṬ","e","vinaṣṭa","noun-adj",""
"11","karmaṇi","KARM","aṇi","karman","noun-adj",""
"12","tat","TAT","","tad","pron",""
"13","sāmānyaṃ","SĀMĀNY","aṃ","sāmānya","noun-adj",""
"14","na","","","na","ind",""
"15","karmaṇi","KARM","aṇi","karman","noun-adj",""
"16","tad","TAD","","tad","pron",""
"17","a","","","alpha_privativum","ind",""
"18","bhāvād","BHĀV","ād","bhāva","noun-adj",""
"19","eva","","","eva","ind",""
"20","n","","","na","ind",""
"21","^","","","","",""
"22","āpi","","","api","ind",""
"23","kartari","KARTAR","i","kartari","noun-adj",""
"24","iti","","","iti","ind",""
"25","saṃbaddha","SAṂBADDH","a@","saṃbaddhati","noun-adj",""
"26","saṃbandho","SAṂBANDH","o","saṃbandhati","noun-adj",""
"27","apy","","","api","ind",""
"28","asya","","","idam","pron",""
"29","n","","","na","ind",""
"30","^","","","","",""
"31","āsti","","","as","verb","as"
"32","iti","","","iti","ind",""
"33","n","","","na","ind",""
"34","ābhinna","ABHINN","a@","abhinna","noun-adj",""
"35","pratyaya","PRATYAY","a@","pratyaya","noun-adj",""
"36","hetuḥ","HET","uḥ","hetu","noun-adj",""
"37","/","","","","punct",""
"","</s>","","","","",""
"","<s number=""29"">","","","","",""
"1","tasmāt","","","tad","pron",""
"2","sthitam","STHIT","am","sthita","noun-adj",""
"3","etat","ETAT","","tad","pron",""
"4","tad","TAD","","tad","pron",""
"5","an","","","alpha_privativum","ind",""
"6","aikāntikatā","AIKĀNTIK","atā","aikāntika","noun-adj",""
"7","doṣa","DOṢ","a@","doṣa","noun-adj",""
"8","duṣṭatvāt","DUṢṬ","atvāt","duṣṭatva","noun-adj",""
"9","n","","","na","ind",""
"10","edam","EDAM","","idam","pron",""
"11","anumānaṃ","ANUMĀN","aṃ","anumāna","noun-adj",""
"12","sāmānya","SĀMĀNY","a@","sāmānya","noun-adj",""
"13","satta","SATT","a@","satta","noun-adj",""
"14","āsādhanāya","ASĀDHAN","āya","asādhana","noun-adj",""
"15","paryāptam","PARYĀPT","am","paryāpta","noun-adj",""
"16","iti","","","iti","ind",""
"17","/","","","","punct",""
"","</s>","","","","",""
"","<s number=""30"">","","","","",""
"1","itaś","","","","ind",""
"2","c","","","ca","ind",""
"3","^","","","","",""
"4","āpi","","","api","ind",""
"5","na","","","na","ind",""
"6","sāmānya","SĀMĀNY","a@","sāmānya","noun-adj",""
"7","satta","SATT","a@","satta","noun-adj",""
"8","āsādhanam","ASĀDHAN","am","asādhana","noun-adj",""
"9","idam","IDAM","","idam","pron",""
"10","anumānam","ANUMĀN","am","anumāna","noun-adj",""
"11","/","","","","punct",""
"","</s>","","","","",""
"","<s number=""31"">","","","","",""
"1","yath","","","yathā","ind",""
"2","^","","","","",""
"3","aiva","","","eva","ind",""
"4","hi","","","hi","ind",""
"5","paraspara","PARASPAR","a@","paraspara","noun-adj",""
"6","ā","","","alpha_privativum","ind",""
"7","saṅkīrṇa","SAṄKĪRṆ","a@","saṅkīrṇa","noun-adj",""
"8","svabhāvā","SVABHĀV","ā","svabhāva","noun-adj",""
"9","api","","","api","ind",""
"10","śāba","ŚĀV","a@","śāva","noun-adj",""
"11","leya","LEY","a@","leya","noun-adj",""
"12","ādayo","ĀD","ayo","ādi","noun-adj",""
"13","bhāvāḥ","BHĀV","āḥ","bhāva","noun-adj",""
"14","kayāci","KAY","āci","kayā","noun-adj",""
"15","deva","DEV","a","deva","noun-adj",""
"16","tad","TAD","","tad","pron",""
"17","eka","EK","a@","eka","noun-adj",""
"18","kārya","KĀRY","a@","kārya","noun-adj",""
"19","pratiniyama","PRATINIYAM","a@","pratiniyama","noun-adj",""
"20","lakṣaṇayā","LAKṢAṆ","ayā","lakṣaṇa","noun-adj",""
"21","sva","SV","a@","sva","noun-adj",""
"22","hetu","HET","u@","hetu","noun-adj",""
"23","balāyāt","BALĀY","āt","balāya","noun-adj",""
"24","ayā","","","","ind",""
"25","prakṛtyā","PRAKṚT","yā","prakṛti","noun-adj",""
"26","tad","TAD","","tad","pron",""
"27","ekam","EK","am","eka","noun-adj",""
"28","abhimatam","ABHIMAT","am","abhimata","noun-adj",""
"29","anugata","ANUGAT","a@","anugata","noun-adj",""
"30","rūpam","RŪP","am","rūpa","noun-adj",""
"31","upakurvate","UPAKURV","ate","upakar","verb","upakṛ"
"32","tad","TAD","","tad","pron",""
"33","a","","","alpha_privativum","ind",""
"34","para","PAR","a@","para","noun-adj",""
"35","sāmānya","SĀMĀNY","a@","sāmānya","noun-adj",""
"36","āntaram","ANTAR","am","antara","noun-adj",""
"37","antareṇ","ANTAR","eṇ","antara","noun-adj",""
"38","ānyathān","ANYATH","ān","anyathā","noun-adj",""
"39","avasthā","AVASTH","ā@","avasthā","noun-adj",""
"40","prasaṅgāt","PRASAṄG","āt","prasaṅga","noun-adj",""
"41","tathā","","","tathā","ind",""
"42","tav","","","tvat","pron",""
"43","aikaṃ","EK","aṃ","eka","noun-adj",""
"44","parāmarśa","PARĀMARŚ","a@","parāmarśa","noun-adj",""
"45","pratyayam","PRATYAY","am","pratyaya","noun-adj",""
"46","upajanayantu","UPAJANAYANT","u","upajanayantu","noun-adj",""
"47","kim","","","kim","pron",""
"48","antarāla","ANTARĀL","a@","antarāla","noun-adj",""
"49","gaḍunā","GAḌ","unā","gaḍu","noun-adj",""
"50","vyatirekavatā","VYATIREK","avatā","vyatirekavat","noun-adj",""
"51","sāmānyena","SĀMĀNY","ena","sāmānya","noun-adj",""
"52","^","","","","",""
"53","upagatena","UPAGAT","ena","upagata","noun-adj",""
"54","/","","","","punct",""
"","</s>","","","","",""
"","<s number=""32"">","","","","",""
"1","ath","","","atha","ind",""
"2","^","","","","",""
"3","ocyate","UC","yate","vak","verb","vac"
"4","/","","","","punct",""
"","</s>","","","","",""
"","<s number=""33"">","","","","",""
"1","pratiniyata","PRATINIYAT","a@","pratiniyata","noun-adj",""
"2","śaktayaḥ","ŚAKT","ayaḥ","śakti","noun-adj",""
"3","sarva","SARV","a@","sarva","noun-adj",""
"4","bhāvāḥ","BHĀV","āḥ","bhāva","noun-adj",""
"5","/","","","","punct",""
"","</s>","","","","",""
"","<s number=""34"">","","","","",""
"1","etac","ETAC","","tad","pron",""
"2","ca","","","ca","ind",""
"3","sāmānya","SĀMĀNY","a@","sāmānya","noun-adj",""
"4","āpalāpibhir","APALĀP","ibhir","apalāpin","noun-adj",""
"5","api","","","api","ind",""
"6","niyatam","NIYAT","am","niyata","noun-adj",""
"7","abhyupagamanīyam","ABHYUPAGAM","anīyam","abhyupāmgacch","verb","abhyupāmgam"
"8","/","","","","punct",""
"","</s>","","","","",""
"","<s number=""35"">","","","","",""
"1","anyathā","ANYATH","ā","anyathā","ind",""
"2","kutaḥ","KUT","aḥ","kuta","noun-adj",""
"3","śāli","ŚĀL","i@","śāli","noun-adj",""
"4","bījaṃ","BĪJ","aṃ","bīja","noun-adj",""
"5","śāly","ŚĀL","y@","śāli","noun-adj",""
"6","aṅkuram","AṄKUR","am","aṅkura","noun-adj",""
"7","eva","","","eva","ind",""
"8","janayati","JAN","ayati","jan","verb","jan"
"9","na","","","na","ind",""
"10","kodrava","KODRAV","a@","kodrava","noun-adj",""
"11","āṅkuram","AṄKUR","am","aṅkura","noun-adj",""
"12","iti","","","iti","ind",""
"13","para","PAR","a@","para","noun-adj",""
"14","paryanuyoge","PARYANUYOG","e","paryanuyoga","noun-adj",""
"15","bhāva","BHĀV","a@","bhāva","noun-adj",""
"16","prakṛtiṃ","PRAKṚT","iṃ","prakṛti","noun-adj",""
"17","muktvā","MUKTV","ā","muñc","verb","muc"
"18","kim","","","kim","pron",""
"19","a","","","alpha_privativum","ind",""
"20","param","PARAM","","parama","noun-adj",""
"21","iha","","","iha","ind",""
"22","vacanīyam","VACANĪY","am","vacanīya","noun-adj",""
"23","asti","","","as","verb","as"
"24","/","","","","punct",""
"","</s>","","","","",""
"","<s number=""36"">","","","","",""
"1","etacc","ETAC","c","tad","pron",""
"2","^","","","","",""
"3","ottaram","UTTAR","am","uttara","noun-adj",""
"4","asmākam","ASMĀK","am","asmat","pron",""
"5","api","","","api","ind",""
"6","na","","","na","ind",""
"7","vanaukaḥ","VANAUK","aḥ","vanauka","noun-adj",""
"8","kula","KUL","a@","kula","noun-adj",""
"9","kavalitam","KAVALIT","am","kavalita","noun-adj",""
"10","/","","","","punct",""
"","</s>","","","","",""
"","<s number=""37"">","","","","",""
"1","tathā","","","tathā","ind",""
"2","hi","","","hi","ind",""
"3","vayam","VAYAM","","asmat","pron",""
"4","apy","","","api","ind",""
"5","evaṃ","","","eva","ind",""
"6","śaktā","ŚAKT","ā","śakta","noun-adj",""
"7","eva","","","eva","ind",""
"8","vaktum","VAKT","um","vak","verb","vac"
"9","/","","","","punct",""
"","</s>","","","","",""
"","<s number=""38"">","","","","",""
"1","sāmānyam","SĀMĀNY","am","sāmānya","noun-adj",""
"2","ev","","","eva","ind",""
"3","opakartuṃ","UPAKART","uṃ","upakar","verb","upakṛ"
"4","śaktir","ŚAKT","ir","śakti","noun-adj",""
"5","vyaktīnāṃ","VYAKT","īnāṃ","vyakti","noun-adj",""
"6","bheda","BHED","a@","bheda","noun-adj",""
"7","ā","","","alpha_privativum","ind",""
"8","viśeṣe","VIŚEṢ","e","viśeṣa","noun-adj",""
"9","api","","","api","ind",""
"10","na","","","na","ind",""
"11","tad","TAD","","tad","pron",""
"12","ekaṃ","EK","aṃ","eka","noun-adj",""
"13","vijnm̐ānam","VIJ","nm̐ānam","vija","noun-adj",""
"14","upajanayitum","UPAJAN","ayitum","upajan","verb","upajan"
"15","iti","","","iti","ind",""
"16","/","","","","punct",""
"","</s>","","","","",""
"","<s number=""39"">","","","","",""
"1","anuttaraṃ","ANUTTAR","aṃ","anuttara","noun-adj",""
"2","bata","BAT","a","bata","noun-adj",""
"3","doṣa","DOṢ","a@","doṣa","noun-adj",""
"4","saṅkaṭam","SAṄKAṬ","am","saṅkaṭa","noun-adj",""
"5","atra","","","atra","ind",""
"6","bhavān","BHAV","ān","bhava","noun-adj",""
"7","dṛṣṭi","DṚṢṬ","i@","dṛṣṭi","noun-adj",""
"8","doṣeṇa","DOṢ","eṇa","doṣa","noun-adj",""
"9","praveśyamāno","PRAVEŚY","amāno","praveśya","noun-adj",""
"10","api","","","api","ind",""
"11","n","","","na","ind",""
"12","ātmānam","ĀTM","ānam","ātman","noun-adj",""
"13","ātmanā","ĀTM","anā","ātman","noun-adj",""
"14","saṃvedayate","SAṂVED","ayate","saṃveda","noun-adj",""
"15","/","","","","punct",""
"","</s>","","","","",""
"","<s number=""40"">","","","","",""
"1","tathā","","","tathā","ind",""
"2","hi","","","hi","ind",""
"3","śāli","ŚĀL","i@","śāli","noun-adj",""
"4","bīja","BĪJ","a@","bīja","noun-adj",""
"5","tad","TAD","","tad","pron",""
"6","aṅkurayor","AṄKUR","ayor","aṅkura","noun-adj",""
"7","adhyakṣa","ADHYAKṢ","a@","adhyakṣa","noun-adj",""
"8","ānupalambhani","ANUPALAMBHAN","i@","anupalambhana","noun-adj",""
"9","bandhane","BANDHAN","e","bandhana","noun-adj",""
"10","kārya","KĀRY","a@","kārya","noun-adj",""
"11","kāraṇa","KĀRAṆ","a@","kāraṇa","noun-adj",""
"12","bhāve","BHĀV","e","bhāva","noun-adj",""
"13","avagate","AVAGAT","e","avagata","noun-adj",""
"14","śāli","ŚĀL","i@","śāli","noun-adj",""
"15","bījaṃ","BĪJ","aṃ","bīja","noun-adj",""
"16","śāly","ŚĀL","y@","śāli","noun-adj",""
"17","aṅkuraṃ","AṄKUR","aṃ","aṅkura","noun-adj",""
"18","janayituṃ","JANAY","ituṃ","janayat","noun-adj",""
"19","śaktaṃ","ŚAKT","aṃ","śakta","noun-adj",""
"20","na","","","na","ind",""
"21","kodrava","KODRAV","a@","kodrava","noun-adj",""
"22","āṅkuram","AṄKUR","am","aṅkura","noun-adj",""
"23","iti","","","iti","ind",""
"24","śakyam","ŚAKY","am","śakya","noun-adj",""
"25","abhidhātum","ABHIDHĀT","um","abhidadh","verb","abhidhā"
"26","/","","","","punct",""
"","</s>","","","","",""
"","<s number=""41"">","","","","",""
"1","n","","","na","ind",""
"2","^","","","","",""
"3","aivaṃ","","","eva","ind",""
"4","sāmānya","SĀMĀNY","a@","sāmānya","noun-adj",""
"5","tad","TAD","","tad","pron",""
"6","vator","","","","ind",""
"7","upakāryopakā","UPAKĀRY","opakā","upakārya","noun-adj",""
"8","raka","RAK","a@","raka","noun-adj",""
"9","bhāvaḥ","BHĀV","aḥ","bhāva","noun-adj",""
"10","kutaś","KUT","aś","kuta","noun-adj",""
"11","cana","CAN","a","cana","noun-adj",""
"","</page>","","","","",""
"","<page number=""13"">","","","","",""
"14","pramāṇāt","PRAMĀṆ","āt","pramāṇa","noun-adj",""
"15","niścitaḥ","NIŚCIT","aḥ","niścita","noun-adj",""
"16","/","","","","punct",""
"","</s>","","","","",""
"","<s number=""42"">","","","","",""
"1","tat","TAT","","tad","pron",""
"2","katham","KATHAM","","katham","ind",""
"3","idam","IDAM","","idam","pron",""
"4","uttaram","UTTAR","am","uttara","noun-adj",""
"5","abhidhīya","ABHIDHĪ","ya","abhidhīa","noun-adj",""
"6","mānam","MĀN","am","māna","noun-adj",""
"7","ād","","","","ind",""
"8","adhīta","ADHĪT","a","adhīta","noun-adj",""
"9","sādhimānam","SĀDHIMĀN","am","sādhimāna","noun-adj",""
"10","ity","","","iti","ind",""
"11","alam","","","alam","ind",""
"12","alīka","ALĪK","a@","alīka","noun-adj",""
"13","nirbandhanena","NIRBANDH","anena","nirbandhat","noun-adj",""
"14","/","","","","punct",""
"","</s>","","","","",""
"","<s number=""43"">","","","","",""
"1","na","","","na","ind",""
"2","sādhaka","SĀDH","aka@","sādhaka","noun-adj",""
"3","pramāṇavir","PRAMĀṆ","avir","pramāṇa","noun-adj",""
"4","aham","AHAM","","mat","pron",""
"5","ātreṇa","ĀTR","eṇa","ātra","noun-adj",""
"6","prekṣāvatām","PREKṢ","āvatām","prekṣāvat","noun-adj",""
"7","a","","","alpha_privativum","ind",""
"8","sad","SAD","@","sat","noun-adj",""
"9","vyavahāraḥ","VYAVAHĀR","aḥ","vyavahāra","noun-adj",""
"10","/","","","","punct",""
"","</s>","","","","",""
"","<s number=""44"">","","","","",""
"1","tatas","","","tatas","ind",""
"2","tad","TAD","","tad","pron",""
"3","a","","","alpha_privativum","ind",""
"4","bhāva","BHĀV","a@","bhāva","noun-adj",""
"5","sādhakam","SĀDH","akam","sādhaka","noun-adj",""
"6","anumānam","ANUMĀN","am","anumāna","noun-adj",""
"7","abhidhīya","ABHIDHĪ","ya","abhidhīa","noun-adj",""
"8","mānam","MĀN","am","māna","noun-adj",""
"9","asmābhir","ASMĀBH","ir","asmat","pron",""
"10","ā","","","alpha_privativum","ind",""
"11","kalpyatām","KALPY","atām","kalpya","noun-adj",""
"12","/","","","","punct",""
"","</s>","","","","",""
"","<s number=""45"">","","","","",""
"1","yad","","","yadi","ind",""
"2","yad","","","yadi","ind",""
"3","upalabdhi","UPALABDH","i@","upalabdhi","noun-adj",""
"4","lakṣaṇa","LAKṢAṆ","a@","lakṣaṇa","noun-adj",""
"5","prāptaṃ","PRĀPT","aṃ","prāpta","noun-adj",""
"6","sanna","SANN","a@","sanna","noun-adj",""
"7","opalabhyate","UPALABH","yate","upalabh","verb","upalabh"
"8","tat","TAT","","tad","pron",""
"9","tad","TAD","","tad","pron",""
"10","a","","","alpha_privativum","ind",""
"11","sad","SAD","","sat","noun-adj",""
"12","iti","","","iti","ind",""
"13","prekṣā","PREKṢ","ā@","prekṣā","noun-adj",""
"14","vadbhiḥ","VAD","bhiḥ","vada","noun-adj",""
"15","vyavahartavyam","VYAVAHAR","tavyam","vyavāmhar","verb","vyavāmhṛ"
"16","/","","","","punct",""
"","</s>","","","","",""
"","<s number=""46"">","","","","",""
"1","yath","","","yathā","ind",""
"2","^","","","","",""
"3","āmbara","AMBAR","a@","ambara","noun-adj",""
"4","āmbu","ĀMB","u","āmba","noun-adj",""
"5","ruham","RUH","am","ruha","noun-adj",""
"6","/","","","","punct",""
"","</s>","","","","",""
"","<s number=""47"">","","","","",""
"1","n","","","na","ind",""
"2","opalabhyate","UPALABH","yate","upalabh","verb","upalabh"
"3","c","","","ca","ind",""
"4","^","","","","",""
"5","opalabdhi","UPALABDH","i@","upalabdhi","noun-adj",""
"6","lakṣaṇa","LAKṢAṆ","a@","lakṣaṇa","noun-adj",""
"7","prāptaṃ","PRĀPT","aṃ","prāpta","noun-adj",""
"8","sāmānyaṃ","SĀMĀNY","aṃ","sāmānya","noun-adj",""
"9","kvacid","","","kva","ind",""
"10","apīti","APĪT","i","apīti","noun-adj",""
"11","svabhāva","SVABHĀV","a@","svabhāva","noun-adj",""
"12","ānupalabdhiḥ","ANUPALABDH","iḥ","anupalabdhi","noun-adj",""
"13","/","","","","punct",""
"","</s>","","","","",""
"","<s number=""48"">","","","","",""
"1","na","","","na","ind",""
"2","cātra","CĀTR","a@","cātra","noun-adj",""
"3","āsiddhi","ĀSIDDH","i@","āsiddha","noun-adj",""
"4","doṣa","DOṢ","a@","doṣa","noun-adj",""
"5","odbhāvanayā","UDBHĀVAN","ayā","udbhāvana","noun-adj",""
"6","pratyavasthātavyam","PRATYAVASTHĀT","avyam","pratyavasthātṛ","noun-adj",""
"7","/","","","","punct",""
"","</s>","","","","",""
"","<s number=""49"">","","","","",""
"1","tathā","","","tathā","ind",""
"2","hi","","","hi","ind",""
"3","atr","","","atra","ind",""
"4","āsiddhiḥ","ĀSIDDH","iḥ","āsiddha","noun-adj",""
"5","bhavantī","BHAV","antī","bhavat","noun-adj",""
"6","svarūpato","SVARŪP","ato","svarūpa","noun-adj",""
"7","viśeṣaṇato","VIŚEṢAṆ","ato","viśeṣaṇa","noun-adj",""
"8","vā","","","vā","ind",""
"9","bhavet","BHAV","et","bhav","verb","bhū"
"10","/","","","","punct",""
"","</s>","","","","",""
"","<s number=""50"">","","","","",""
"1","tatra","","","tatra","ind",""
"2","na","","","na","ind",""
"3","tāvad","TĀVAD","","tāvat","ind",""
"4","ādyā","ĀD","yā","ādi","noun-adj",""
"5","saṃbhavati","SAṂBHAV","ati","saṃbhav","verb","saṃbhū"
"6","anya","ANY","a@","anya","noun-adj",""
"7","opalambha","UPALAMBH","a@","upalambha","noun-adj",""
"8","rūpasy","RŪP","asy","rūpa","noun-adj",""
"9","ānupalambhasy","ANUPALAMBH","asy","anupalambha","noun-adj",""
"10","ābhyupagamāt","ABHYUPAGAM","āt","abhyupagama","noun-adj",""
"11","/","","","","punct",""
"","</s>","","","","",""
"","<s number=""51"">","","","","",""
"1","tasya","","","tad","pron",""
"2","ca","","","ca","ind",""
"3","sva","SV","a@","sva","noun-adj",""
"4","saṃvedana","SAṂVEDAN","a@","saṃvedana","noun-adj",""
"5","pratyakṣa","PRATYAKṢ","a@","pratyakṣa","noun-adj",""
"6","sākṣāt","SĀKṢĀT","","sākṣāta","noun-adj",""
"7","kṛta","KṚT","a@","kṛta","noun-adj",""
"8","svarūpatvāt","SVARŪP","atvāt","svarūpatva","noun-adj",""
"9","kutaḥ","KUT","aḥ","kuta","noun-adj",""
"10","svarūpa","SVARŪP","a@","svarūpa","noun-adj",""
"11","āsiddhi","ĀSIDDH","i@","āsiddha","noun-adj",""
"12","doṣa","DOṢ","a@","doṣa","noun-adj",""
"13","āvakāśaḥ","AVAKĀŚ","aḥ","avakāśa","noun-adj",""
"14","/","","","","punct",""
"","</s>","","","","",""
"","<s number=""52"">","","","","",""
"1","ath","","","atha","ind",""
"2","^","","","","",""
"3","ocyate","UC","yate","vak","verb","vac"
"4","sva","SV","a@","sva","noun-adj",""
"5","saṃvedanam","SAṂVEDAN","am","saṃvedana","noun-adj",""
"6","eva","","","eva","ind",""
"7","na","","","na","ind",""
"8","saṃbhavati","SAṂBHAV","ati","saṃbhav","verb","saṃbhū"
"9","sv","","","su","ind",""
"10","ātmani","ĀTM","ani","ātman","noun-adj",""
"11","kriyā","KRIY","ā@","kriyā","noun-adj",""
"12","virodhāt","VIRODH","āt","virodha","noun-adj",""
"13","/","","","","punct",""
"","</s>","","","","",""
"","<s number=""53"">","","","","",""
"1","na","","","na","ind",""
"2","hi","","","hi","ind",""
"3","tay","","","tad","pron",""
"4","^","","","","",""
"5","aiv","","","eva","ind",""
"6","āsidhārayā","ĀSIDHĀR","ayā","āsidhāra","noun-adj",""
"7","s","","","su","ind",""
"8","^","","","","",""
"9","aiv","","","eva","ind",""
"10","āsidhārā","ĀSIDHĀR","ā","āsidhāra","noun-adj",""
"11","cchidyate","CHID","yate","chid","verb",""
"12","tad","TAD","","tad","pron",""
"13","ev","","","eva","ind",""
"14","āṅguly","AṄGUL","y@","aṅgula","noun-adj",""
"15","agraṃ","AGR","aṃ","agra","noun-adj",""
"16","ten","","","tad","pron",""
"17","^","","","","",""
"18","aiv","","","eva","ind",""
"19","āṅguly","AṄGUL","y@","aṅgula","noun-adj",""
"20","agreṇa","AGREṆ","a","agreṇa","noun-adj",""
"21","spṛśyata","SPṚŚY","ata","spṛśyat","noun-adj",""
"22","iti","","","iti","ind",""
"23","/","","","","punct",""
"","</s>","","","","",""
"","<s number=""54"">","","","","",""
"1","ato","","","atas","ind",""
"2","a","","","alpha_privativum","ind",""
"3","siddha","SIDDH","a","siddha","noun-adj",""
"4","ev","","","eva","ind",""
"5","āyaṃ","ĀYAṂ","","idam","pron",""
"6","bhetuḥ","BHET","uḥ","bhetu","noun-adj",""
"7","/","","","","punct",""
"","</s>","","","","",""
"","<s number=""55"">","","","","",""
"1","tad","TAD","","tad","pron",""
"2","idaṃ","IDAṂ","","idam","pron",""
"3","sva","SV","a@","sva","noun-adj",""
"4","saṃvedana","SAṂVEDAN","a@","saṃvedana","noun-adj",""
"5","śabda","ŚABD","a@","śabda","noun-adj",""
"6","ārtha","ARTH","a@","artha","noun-adj",""
"7","āpari","APAR","i@","apari","noun-adj",""
"8","jnm̐āna","J","nm̐āna","ja","noun-adj",""
"9","vijṛmbhitam","VIJṚMBHIT","am","vijṛmbhita","noun-adj",""
"10","eva","","","eva","ind",""
"11","prakaṭayati","PRAKAṬ","ayati","prakaṭ","verb",""
"12","vācaḥ","VĀC","aḥ","vāk","noun-adj",""
"13","/","","","","punct",""
"","</s>","","","","",""
"","<s number=""56"">","","","","",""
"1","tathā","","","tathā","ind",""
"2","hi","","","hi","ind",""
"3","kala","KAL","a@","kala","noun-adj",""
"4","sakala","SAKAL","a@","sakala","noun-adj",""
"5","dhauta","DHAUT","a@","dhauta","noun-adj",""
"6","kuvalaya","KUVALAY","a@","kuvalaya","noun-adj",""
"7","ādibhyo","ĀD","ibhyo","ādi","noun-adj",""
"8","vyāvṛttaṃ","VYĀVṚTT","aṃ","vyāvṛtta","noun-adj",""
"9","vijnm̐ānam","VIJ","nm̐ānam","vija","noun-adj",""
"10","upajāyate","UPAJĀ","yate","upajan","verb","upajan"
"11","/","","","","punct",""
"","</s>","","","","",""
"","<s number=""57"">","","","","",""
"1","tena","","","tad","pron",""
"2","bodha","BODH","a@","bodha","noun-adj",""
"3","rūpatay","RŪP","atay","rūpat","noun-adj",""
"4","otpattir","UTPATT","ir","utpatti","noun-adj",""
"5","ev","","","eva","ind",""
"6","^","","","","",""
"7","āsya","","","idam","pron",""
"8","sva","SV","a@","sva","noun-adj",""
"9","saṃvitti","SAṂVITT","i@","saṃvitti","noun-adj",""
"10","rucyate","RUC","yate","ruc","verb","ruc"
"11","prakāśavat","PRAKĀŚ","avat","prakāśavat","noun-adj",""
"12","/","","","","punct",""
"","</s>","","","","",""
"","<s number=""58"">","","","","",""
"1","na","","","na","ind",""
"2","karma","KARM","a@","karman","noun-adj",""
"3","kartṛ","KART","ṛ@","kartṛ","noun-adj",""
"4","kriyā","KRIY","ā","kriyā","noun-adj",""
"5","bhāvāt","BHĀV","āt","bhāva","noun-adj",""
"6","/","","","","punct",""
"","</s>","","","","",""
"","<s number=""59"">","","","","",""
"1","ekasya","EK","asya","eka","noun-adj",""
"2","^","","","","",""
"3","a","","","alpha_privativum","ind",""
"4","naṃśa","NAṂŚ","a@","naṃśa","noun-adj",""
"5","rūpasya","RŪP","asya","rūpa","noun-adj",""
"6","trairūpya","TRAIRŪPY","a@","trairūpya","noun-adj",""
"7","ānupapattitaḥ","ANUPAPATT","itaḥ","anupapatti","noun-adj",""
"8","/","","","","punct",""
"","</s>","","","","",""
"","<s number=""60"">","","","","",""
"1","yath","","","yathā","ind",""
"2","^","","","","",""
"3","aiva","","","eva","ind",""
"4","hi","","","hi","ind",""
"5","praka","PRAK","a@","praka","noun-adj",""
"6","āśaka","ĀŚAK","a@","āśaka","noun-adj",""
"7","āntara","ANTAR","a@","antara","noun-adj",""
"8","nirapekṣaḥ","NIRAPEKṢ","aḥ","nirapekṣa","noun-adj",""
"9","prakāśaḥ","PRAKĀŚ","aḥ","prakāśa","noun-adj",""
"10","prakāśyamāna","PRAKĀŚY","amāna","prakāś","verb","prakāś"
"11","ātmanaḥ","ĀTM","anaḥ","ātman","noun-adj",""
"12","prakāśaka","PRAKĀŚ","aka","prakāśaka","noun-adj",""
"13","ucyate","UC","yate","vak","verb","vac"
"14","tathā","","","tathā","ind",""
"15","jnm̐ānam","","","","ind",""
"16","api","","","api","ind",""
"17","jnm̐","","","","ind",""
"18","^","","","","",""
"19","ān","","","alpha_privativum","ind",""
"20","āntara","ANTAR","a@","antara","noun-adj",""
"21","nirapekṣaṃ","NIRAPEKṢ","aṃ","nirapekṣa","noun-adj",""
"22","prakāśyamānam","PRAKĀŚY","amānam","prakāś","verb","prakāś"
"23","ātmanaḥ","ĀTM","anaḥ","ātman","noun-adj",""
"24","prakāśakam","PRAKĀŚ","akam","prakāśaka","noun-adj",""
"25","ucyate","UC","yate","vak","verb","vac"
"26","/","","","","punct",""
"","</s>","","","","",""
"","<s number=""61"">","","","","",""
"1","tato","","","tatas","ind",""
"2","ayaṃ","AYAṂ","","idam","pron",""
"3","paramārthaḥ","PARAMĀRTH","aḥ","paramārtha","noun-adj",""
"4","/","","","","punct",""
"","</s>","","","","",""
"","<s number=""62"">","","","","",""
"1","na","","","na","ind",""
"2","jnm̐ānaṃ","","","","ind",""
"3","jnm̐","","","","ind",""
"4","^","","","","",""
"5","ān","","","alpha_privativum","ind",""
"6","āntara","ANTAR","a@","antara","noun-adj",""
"7","saṃvedyam","SAṂVEDY","am","saṃvedya","noun-adj",""
"8","upapadyate","UPAPAD","yate","upapad","verb","upapad"
"9","n","","","na","ind",""
"10","āpy","ĀPY","","api","noun-adj",""
"11","a","","","alpha_privativum","ind",""
"12","saṃviditam","SAṂVIDIT","am","saṃvidita","noun-adj",""
"13","ucyate","UC","yate","vak","verb","vac"
"14","/","","","","punct",""
"","</s>","","","","",""
"","<s number=""63"">","","","","",""
"1","yathā","","","yathā","ind",""
"2","prakāre","PRAKĀR","e","prakāra","noun-adj",""
"3","ca","","","ca","ind",""
"4","sva","SV","a@","sva","noun-adj",""
"5","saṃvedana","SAṂVEDAN","a@","saṃvedana","noun-adj",""
"6","śabda","ŚABD","a@","śabda","noun-adj",""
"7","ārthe","ARTH","e","artha","noun-adj",""
"8","vivakṣite","VIVAKṢIT","e","vivakṣita","noun-adj",""
"9","na","","","na","ind",""
"10","kinm̐cid","","","","ind",""
"11","vacanīyam","VACANĪY","am","vacanīya","noun-adj",""
"12","asti","","","as","verb","as"
"13","kuto","KUT","o","kuta","noun-adj",""
"14","yath","","","yathā","ind",""
"15","^","","","","",""
"16","okta","UKT","a@","ukta","noun-adj",""
"17","doṣa","DOṢ","a@","doṣa","noun-adj",""
"18","āvasaraḥ","AVASAR","aḥ","avasara","noun-adj",""
"19","/","","","","punct",""
"","</s>","","","","",""
"","<s number=""64"">","","","","",""
"","</page>","","","","",""
"","<page number=""14"">","","","","",""
"3","n","","","na","ind",""
"4","^","","","","",""
"5","āpi","","","api","ind",""
"6","viśeṣaṇa","VIŚEṢAṆ","a@","viśeṣaṇa","noun-adj",""
"7","āsiddhy","ĀSIDDH","y@","āsiddha","noun-adj",""
"8","āsiddhir","ĀSIDDH","ir","āsiddha","noun-adj",""
"9","udbhāvanīyā","UDBHĀVAN","īyā","udbhāvana","noun-adj",""
"10","/","","","","punct",""
"","</s>","","","","",""
"","<s number=""65"">","","","","",""
"1","upalabdhi","UPALABDH","i@","upalabdhi","noun-adj",""
"2","lakṣaṇa","LAKṢAṆ","a@","lakṣaṇa","noun-adj",""
"3","prāptatayā","PRĀPT","atayā","prāptatā","noun-adj",""
"4","sāmānyasya","SĀMĀNY","asya","sāmānya","noun-adj",""
"5","svayam","SVAY","am","svaya","noun-adj",""
"6","eva","","","eva","ind",""
"7","parair","PAR","air","para","noun-adj",""
"8","upagamāt","UPAGAM","āt","upagama","noun-adj",""
"9","/","","","","punct",""
"","</s>","","","","",""
"","<s number=""66"">","","","","",""
"1","tathā","","","tathā","ind",""
"2","n","","","na","ind",""
"3","abhyupagame","ABHYUPAGAM","e","abhyupagama","noun-adj",""
"4","vā","","","vā","ind",""
"5","na","","","na","ind",""
"6","sāmānya","SĀMĀNY","a@","sāmānya","noun-adj",""
"7","balena","BAL","ena","bala","noun-adj",""
"8","bāhu","BĀH","u@","bāhu","noun-adj",""
"9","leya","LEY","a@","leya","noun-adj",""
"10","ādiṣv","ĀD","iṣv","ādi","noun-adj",""
"11","anugata","ANUGAT","a@","anugata","noun-adj",""
"12","ākārau","ĀKĀR","au","ākār","verb","ākṛ"
"13","dhīdhvanī","DHĪD","hvanī","dhīdā","noun-adj",""
"14","syātām","","","as","verb","as"
"15","/","","","","punct",""
"","</s>","","","","",""
"","<s number=""67"">","","","","",""
"1","na","","","na","ind",""
"2","hi","","","hi","ind",""
"3","yato","","","yatas","ind",""
"4","yatra","","","yatra","ind",""
"5","jnm̐","","","","ind",""
"6","^","","","","",""
"7","ān","","","alpha_privativum","ind",""
"8","ābhidhāna","ABHIDHĀN","a@","abhidhāna","noun-adj",""
"9","pravṛttiḥ","PRAVṚTT","iḥ","pravṛtti","noun-adj",""
"10","tad","TAD","","tad","pron",""
"11","an","","","alpha_privativum","ind",""
"12","upalakṣaṇe","UPALAKṢAṆ","e","upalakṣaṇa","noun-adj",""
"13","tasya","","","tad","pron",""
"14","pratītir","PRATĪT","ir","pratīti","noun-adj",""
"15","bhavati","BHAV","ati","bhav","verb","bhū"
"16","daṇḍivat","DAṆḌ","ivat","daṇḍivat","noun-adj",""
"17","/","","","","punct",""
"","</s>","","","","",""
"","<s number=""68"">","","","","",""
"1","yat","","","yad","pron",""
"2","punar","","","punar","ind",""
"3","idam","IDAM","","idam","pron",""
"4","uddyotitam","UDDYOTIT","am","uddyotita","noun-adj",""
"5","u","","","","ind",""
"6","dadyota","DADY","ota","dadya","noun-adj",""
"7","kareṇa","KAR","eṇa","kara","noun-adj",""
"8","kiṃ","","","kim","pron",""
"9","sāmānyaṃ","SĀMĀNY","aṃ","sāmānya","noun-adj",""
"10","pratipadyase","PRATIPAD","yase","pratipad","verb","pratipad"
"11","na","","","na","ind",""
"12","vā","","","vā","ind",""
"13","/","","","","punct",""
"","</s>","","","","",""
"","<s number=""69"">","","","","",""
"1","yadi","","","yadi","ind",""
"2","pratipadyase","PRATIPAD","yase","pratipad","verb","pratipad"
"3","katham","KATHAM","","katham","ind",""
"4","apahnuṣe","APAH","nuṣe","apaha","noun-adj",""
"5","/","","","","punct",""
"","</s>","","","","",""
"","<s number=""70"">","","","","",""
"1","atha","","","atha","ind",""
"2","na","","","na","ind",""
"3","pratipadyase","PRATIPAD","yase","pratipad","verb","pratipad"
"4","tadā","","","tadā","ind",""
"5","tasy","","","tad","pron",""
"6","āsiddhatvād","ĀSIDDH","atvād","āsiddha","noun-adj",""
"7","āśraya","ĀŚRAY","a@","āśraya","noun-adj",""
"8","āsiddho","ĀSIDDH","o","āsiddha","noun-adj",""
"9","hetuḥ","HET","uḥ","hetu","noun-adj",""
"10","/","","","","punct",""
"","</s>","","","","",""
"","<s number=""71"">","","","","",""
"1","tad","TAD","","tad","pron",""
"2","idaṃ","IDAṂ","","idam","pron",""
"3","tasya","","","tad","pron",""
"4","dharmi","DHARM","i@","dharmin","noun-adj",""
"5","svarūpatān","SVARŪP","atān","svarūpatā","noun-adj",""
"6","abhijnm̐atā","ABHIJ","nm̐atā","abhija","noun-adj",""
"7","vijṛmbhitam","VIJṚMBHIT","am","vijṛmbhita","noun-adj",""
"8","ā","","","alpha_privativum","ind",""
"9","bhāti","BHĀT","i","bhāti","noun-adj",""
"10","yato","","","yatas","ind",""
"11","na","","","na","ind",""
"12","vayaṃ","VAYAṂ","","asmat","pron",""
"13","bahī","BAH","ī@","bahī","noun-adj",""
"14","rūpatayā","RŪP","atayā","rūpatā","noun-adj",""
"15","sāmānyaṃ","SĀMĀNY","aṃ","sāmānya","noun-adj",""
"16","dharmitay","DHARM","itay","dharma","noun-adj",""
"17","āṅgīkur","AṄGĪK","ur","aṅgīkṛ","noun-adj",""
"18","mahe","MAH","e","mahat","noun-adj",""
"19","antar","ANTAR","@","antara","noun-adj",""
"20","mātrā","MĀTR","ā@","mātrā","noun-adj",""
"21","niveśino","NIVEŚ","ino","niveśin","noun-adj",""
"22","bhāva","BHĀV","a@","bhāva","noun-adj",""
"23","ā","","","alpha_privativum","ind",""
"24","bhāva","BHĀV","a@","bhāva","noun-adj",""
"25","obhayān","UBHAY","ān","ubhaya","noun-adj",""
"26","ubhayā","UBHAY","ā@","ubhaya","noun-adj",""
"27","hita","HIT","a@","hita","noun-adj",""
"28","vāsanā","VĀSAN","ā@","vāsanā","noun-adj",""
"29","paripāka","PARIPĀK","a@","paripāka","noun-adj",""
"30","prabhavasy","PRABHAV","asy","prabhava","noun-adj",""
"31","ādhyasta","ADHYAST","a@","adhyasta","noun-adj",""
"32","bahir","BAH","ir","bahi","noun-adj",""
"33","vastuno","VAST","uno","vastu","noun-adj",""
"34","jnm̐","","","","ind",""
"35","^","","","","",""
"36","ān","","","alpha_privativum","ind",""
"37","ākārasya","ĀKĀR","asya","ākāra","noun-adj",""
"38","dharmitay","DHARM","itay","dharma","noun-adj",""
"39","opayogāt","UPAYOG","āt","upayoga","noun-adj",""
"40","/","","","","punct",""
"","</s>","","","","",""
"","<s number=""72"">","","","","",""
"1","sa","","","sa_saha","ind",""
"2","ca","","","ca","ind",""
"3","sva","SV","a@","sva","noun-adj",""
"4","saṃvedana","SAṂVEDAN","a@","saṃvedana","noun-adj",""
"5","pratyakṣa","PRATYAKṢ","a@","pratyakṣa","noun-adj",""
"6","siddhatayā","SIDDH","atayā","siddha","noun-adj",""
"7","na","","","na","ind",""
"8","śakyaḥ","ŚAKY","aḥ","śakya","noun-adj",""
"9","pratikṣeptum","PRATIKṢEPT","um","pratikṣip","verb","pratikṣip"
"10","/","","","","punct",""
"","</s>","","","","",""
"","<s number=""73"">","","","","",""
"1","tad","TAD","","tad","pron",""
"2","atra","","","atra","ind",""
"3","dharmiṇi","DHARM","iṇi","dharmin","noun-adj",""
"4","vyavasthitāḥ","VYAVASTHIT","āḥ","vyavasthita","noun-adj",""
"5","sad","SAD","@","sat","noun-adj",""
"6","a","","","alpha_privativum","ind",""
"7","sattve","SATTV","e","sattva","noun-adj",""
"8","cintayanti","CINT","ayanti","cint","verb","cint"
"9","/","","","","punct",""
"","</s>","","","","",""
"","<s number=""74"">","","","","",""
"1","kim","","","kim","pron",""
"2","ayaṃ","AYAṂ","","idam","pron",""
"3","sāmānya","SĀMĀNY","a@","sāmānya","noun-adj",""
"4","śabda","ŚABD","a@","śabda","noun-adj",""
"5","vikalpa","VIKALP","a@","vikalpa","noun-adj",""
"6","pratibhāsa","PRATIBHĀS","a@","pratibhāsa","noun-adj",""
"7","ārtho","ARTH","o","artha","noun-adj",""
"8","dharmī","DHARM","ī","dharmi","noun-adj",""
"9","para","PAR","a@","para","noun-adj",""
"10","parikalpita","PARIKALPIT","a@","parikalpita","noun-adj",""
"11","bahiḥ","BAH","iḥ","bahi","noun-adj",""
"12","sāmānya","SĀMĀNY","a@","sāmānya","noun-adj",""
"13","nibandhano","NIBANDHAN","o","nibandhana","noun-adj",""
"14","v","","","vā","ind",""
"15","^","","","","",""
"16","eti","","","iti","ind",""
"17","/","","","","punct",""
"","</s>","","","","",""
"","<s number=""75"">","","","","",""
"1","tasya","","","tad","pron",""
"2","bāhya","BĀHY","a@","bāhya","noun-adj",""
"3","ānupādānatve","ANUPĀDĀN","atve","anupādāna","noun-adj",""
"4","sādhyata","SĀDHY","ata","sādhyat","noun-adj",""
"5","yān","YĀN","","yad","pron",""
"6","upalambho","UPALAMBH","o","upalambha","noun-adj",""
"7","hetuḥ","HET","uḥ","hetu","noun-adj",""
"8","/","","","","punct",""
"","</s>","","","","",""
"","<s number=""76"">","","","","",""
"1","na","","","na","ind",""
"2","punas","","","punar","ind",""
"3","tasy","","","tad","pron",""
"4","^","","","","",""
"5","aiv","","","eva","ind",""
"6","^","","","","",""
"7","ā","","","alpha_privativum","ind",""
"8","bhāvaḥ","BHĀV","aḥ","bhāva","noun-adj",""
"9","prasādhyate","PRASĀDH","yate","prasādh","verb","prasādh"
"10","tad","TAD","","tad","pron",""
"11","viṣaya","VIṢAY","a@","viṣaya","noun-adj",""
"12","śabda","ŚABD","a@","śabda","noun-adj",""
"13","ā","","","alpha_privativum","ind",""
"14","prayoga","PRAYOG","a@","prayoga","noun-adj",""
"15","prasaṅgāt","PRASAṄG","āt","prasaṅga","noun-adj",""
"16","/","","","","punct",""
"","</s>","","","","",""
"","<s number=""77"">","","","","",""
"1","evaṃvidhe","EVAṂVIDH","e","evaṃvidha","noun-adj",""
"2","ca","","","ca","ind",""
"3","dharmiṇi","DHARM","iṇi","dharmin","noun-adj",""
"4","vivakṣite","VIVAKṢIT","e","vivakṣita","noun-adj",""
"5","kuta","KUT","a","kuta","noun-adj",""
"6","āśraya","ĀŚRAY","a@","āśraya","noun-adj",""
"7","āsiddhi","ĀSIDDH","i@","āsiddha","noun-adj",""
"8","doṣaḥ","DOṢ","aḥ","doṣa","noun-adj",""
"9","/","","","","punct",""
"","</s>","","","","",""
"","<s number=""78"">","","","","",""
"1","yat","","","yad","pron",""
"2","t","","","tu","ind",""
"3","^","","","","",""
"4","ūcyate","UC","yate","vak","verb","vac"
"5","pratyakṣa","PRATYAKṢ","a@","pratyakṣa","noun-adj",""
"6","pramāṇa","PRAMĀṆ","a@","pramāṇa","noun-adj",""
"7","siddha","SIDDH","a@","siddha","noun-adj",""
"8","svabhāvatayā","SVABHĀV","atayā","svabhāva","noun-adj",""
"9","sāmānyasy","SĀMĀNY","asy","sāmānya","noun-adj",""
"10","āsiddha","ĀSIDDH","a","āsiddha","noun-adj",""
"11","ev","","","eva","ind",""
"12","āyaṃ","ĀYAṂ","","idam","pron",""
"13","hetur","HET","ur","hetu","noun-adj",""
"14","iti","","","iti","ind",""
"15","tad","TAD","","tad","pron",""
"16","a","","","alpha_privativum","ind",""
"17","yuktam","YUKT","am","yukta","noun-adj",""
"18","tasya","","","tad","pron",""
"19","svarūpeṇā","SVARŪP","eṇā","svarūpa","noun-adj",""
"20","pratibhāsanāt","PRATIBHĀSAN","āt","pratibhāsana","noun-adj",""
"21","/","","","","punct",""
"","</s>","","","","",""
"","<s number=""79"">","","","","",""
"1","idam","IDAM","","idam","pron",""
"2","eva","","","eva","ind",""
"3","hi","","","hi","ind",""
"4","pratyakṣasya","PRATYAKṢ","asya","pratyakṣa","noun-adj",""
"5","pratyakṣatvam","PRATYAKṢ","atvam","pratyakṣatva","noun-adj",""
"6","yat","","","yad","pron",""
"7","svarūpasya","SVARŪP","asya","svarūpa","noun-adj",""
"8","sva","SV","a@","sva","noun-adj",""
"9","buddhau","BUDDH","au","buddha","noun-adj",""
"10","samarpaṇam","SAMARPAṆ","am","samarpaṇa","noun-adj",""
"11","/","","","","punct",""
"","</s>","","","","",""
"","<s number=""80"">","","","","",""
"1","idaṃ","IDAṂ","","idam","pron",""
"2","punar","","","punar","ind",""
"3","mūlya","MŪLY","a@","mūlya","noun-adj",""
"4","ādāna","ĀDĀN","a@","ādāna","noun-adj",""
"5","krayi","KRAY","i","krayin","noun-adj",""
"6","sāmānyaṃ","SĀMĀNY","aṃ","sāmānya","noun-adj",""
"7","svarūpaṃ","SVARŪP","aṃ","svarūpa","noun-adj",""
"8","ca","","","ca","ind",""
"9","n","","","na","ind",""
"10","ādarśayati","ĀDARŚ","ayati","ādarś","verb","ādṛś"
"11","pratyakṣatāṃ","PRATYAKṢAT","āṃ","pratyakṣatā","noun-adj",""
"12","ca","","","ca","ind",""
"13","svīkartum","SVĪKART","um","svīkartṛ","noun-adj",""
"14","icchati","ICCH","ati","icch","verb","iṣ1"
"15","/","","","","punct",""
"","</s>","","","","",""
"","<s number=""81"">","","","","",""
"1","tathā","","","tathā","ind",""
"2","hi","","","hi","ind",""
"3","na","","","na","ind",""
"4","vayaṃ","VAYAṂ","","asmat","pron",""
"5","paraspara","PARASPAR","a@","paraspara","noun-adj",""
"6","ā","","","alpha_privativum","ind",""
"7","saṅkīrṇaśā","SAṄKĪRṆ","aśā","saṅkīrṇa","noun-adj",""
"8","baley","BAL","ey","bala","noun-adj",""
"9","ādi","ĀD","i","ādi","noun-adj",""
"10","vyakti","VYAKT","i@","vyakti","noun-adj",""
"11","bheda","BHED","a@","bheda","noun-adj",""
"12","pratibhāsana","PRATIBHĀSAN","a@","pratibhāsana","noun-adj",""
"13","velāyāṃ","VEL","āyāṃ","velā","noun-adj",""
"14","tad","TAD","","tad","pron",""
"15","vilakṣaṇam","VILAKṢAṆ","am","vilakṣaṇa","noun-adj",""
"16","apara","APAR","a@","apara","noun-adj",""
"17","manu","MAN","u@","manu","noun-adj",""
"18","gata","GAT","a@","gata","noun-adj",""
"19","madhy","MADH","y@","madhu","noun-adj",""
"20","akṣeṇe","AKṢ","eṇe","akṣa","noun-adj",""
"21","kṣāmahe","KṢĀM","ahe","kṣāma","noun-adj",""
"22","kaṇṭheguṇam","KAṆṬHEGUṆ","am","kaṇṭheguṇa","noun-adj",""
"23","iva","","","iva","ind",""
"24","bhūteṣu","BHŪT","eṣu","bhūta","noun-adj",""
"25","śāba","ŚĀV","a@","śāva","noun-adj",""
"26","leya","LEY","a@","leya","noun-adj",""
"27","sāmānya","SĀMĀNY","a@","sāmānya","noun-adj",""
"28","buddher","BUDDH","er","buddhi","noun-adj",""
"29","a","","","alpha_privativum","ind",""
"30","siddheḥ","SIDDH","eḥ","siddhi","noun-adj",""
"31","/","","","","punct",""
"","</s>","","","","",""
"","<s number=""82"">","","","","",""
"1","tat","TAT","","tad","pron",""
"2","katham","KATHAM","","katham","ind",""
"3","a","","","alpha_privativum","ind",""
"4","dṛṣṭa","DṚṢṬ","a@","dṛṣṭa","noun-adj",""
"5","kalpanay","KALP","anay","kalpat","noun-adj",""
"6","^","","","","",""
"7","ātmānam","ĀTM","ānam","ātman","noun-adj",""
"8","ātmanā","ĀTM","anā","ātman","noun-adj",""
"9","vipralabhe","VIPRALABH","e","vipralabh","verb",""
"10","mahi","MAH","i","mahat","noun-adj",""
"11","/","","","","punct",""
"","</s>","","","","",""
"","<s number=""83"">","","","","",""
"1","iti","","","iti","ind",""
"2","n","","","na","ind",""
"3","āsiddho","ĀSIDDH","o","āsiddha","noun-adj",""
"4","hetuḥ","HET","uḥ","hetu","noun-adj",""
"5","/","","","","punct",""
"","</s>","","","","",""
"","<s number=""84"">","","","","",""
"1","n","","","na","ind",""
"2","āpy","ĀP","y","api","noun-adj",""
"3","an","","","alpha_privativum","ind",""
"4","aikāntikatā","AIKĀNTIK","atā","aikāntika","noun-adj",""
"5","śaṅkā","ŚAṄK","ā@","śaṅkā","noun-adj",""
"6","viṣayam","VIṢAY","am","viṣaya","noun-adj",""
"7","atipatati","ATIPAT","ati","atipat","verb","atipat"
"8","vipakṣa","VIPAKṢ","a@","vipakṣa","noun-adj",""
"9","vṛttya","VṚTT","ya@","vṛtta","noun-adj",""
"10","darśanāt","DARŚAN","āt","darśana","noun-adj",""
"11","/","","","","punct",""
"","</s>","","","","",""
"","<s number=""85"">","","","","",""
"1","a","","","alpha_privativum","ind",""
"2","sapakṣe","SAPAKṢ","e","sapakṣa","noun-adj",""
"3","saṃbhava","SAṂBHAV","a@","saṃbhava","noun-adj",""
"4","ānupalambhāt","ANUPALAMBH","āt","anupalambha","noun-adj",""
"5","sādhāraṇān","SĀDHĀRAṆ","ān","sādhāraṇa","noun-adj",""
"6","aikāntikatā","AIKĀNTIK","atā","aikāntika","noun-adj",""
"7","mā","","","mā","ind",""
"8","bhūt","BHŪT","","bhūta","noun-adj",""
"9","sandigdha","SANDIGDH","a@","sandigdha","noun-adj",""
"10","vipakṣa","VIPAKṢ","a@","vipakṣa","noun-adj",""
"11","vyāvṛtti","VYĀVṚTT","i@","vyāvṛtti","noun-adj",""
"12","katā","KAT","ā","kata","noun-adj",""
"13","tu","","","tu","ind",""
"14","pratibandha","PRATIBANDH","a@","pratibandha","noun-adj",""
"15","ādarśanād","ĀDARŚAN","ād","ādarśana","noun-adj",""
"16","a","","","alpha_privativum","ind",""
"17","nivārita","NIVĀRIT","a@","nivārita","noun-adj",""
"18","prasara","PRASAR","a","prasara","noun-adj",""
"19","^","","","","",""
"20","aiva","","","eva","ind",""
"21","/","","","","punct",""
"","</s>","","","","",""
"","<s number=""86"">","","","","",""
"","</page>","","","","",""
"","<page number=""15"">","","","","",""
"3","tad","TAD","","tad","pron",""
"4","etad","ETAD","","tad","pron",""
"5","an","","","alpha_privativum","ind",""
"6","ālocita","ĀLOCIT","a@","ālocita","noun-adj",""
"7","tarka","TARK","a@","tarka","noun-adj",""
"8","karkaś","KARK","aś","karka","noun-adj",""
"9","adhiyām","ADHIY","ām","adhiyā","noun-adj",""
"10","abhidhānam","ABHIDHĀN","am","abhidhāna","noun-adj",""
"11","viparyaye","VIPARYAY","e","viparyaya","noun-adj",""
"12","bādhaka","BĀDH","aka@","bādhaka","noun-adj",""
"13","pramāṇa","PRAMĀṆ","a@","pramāṇa","noun-adj",""
"14","sāmarthyād","SĀMARTHY","ād","sāmarthya","noun-adj",""
"15","apasārita","APASĀRIT","a@","apasārita","noun-adj",""
"16","sadbhāvatvāt","SADBHĀV","atvāt","sadbhāva","noun-adj",""
"17","tad","TAD","","tad","pron",""
"18","āśaṅkāyāḥ","ĀŚAṄK","āyāḥ","āśaṅkā","noun-adj",""
"19","/","","","","punct",""
"","</s>","","","","",""
"","<s number=""87"">","","","","",""
"1","tathā","","","tathā","ind",""
"2","hi","","","hi","ind",""
"3","a","","","alpha_privativum","ind",""
"4","sattve","SATTV","e","sattva","noun-adj",""
"5","sādhye","SĀDHY","e","sādhya","noun-adj",""
"6","sattvaṃ","SATTV","aṃ","sattva","noun-adj",""
"7","vipakṣaḥ","VIPAKṢ","aḥ","vipakṣa","noun-adj",""
"8","/","","","","punct",""
"","</s>","","","","",""
"","<s number=""88"">","","","","",""
"1","tatra","","","tatra","ind",""
"2","pratyakṣa","PRATYAKṢ","a@","pratyakṣa","noun-adj",""
"3","vṛttyā","VṚTT","yā","vṛtti","noun-adj",""
"4","bhavitavyam","BHAV","itavyam","bhav","verb","bhū"
"5","yato","","","yatas","ind",""
"6","yad","","","yadi","ind",""
"7","yadā","","","yadā","ind",""
"8","vikalā","VIKAL","ā@","vikala","noun-adj",""
"9","pratihata","PRATIHAT","a@","pratihata","noun-adj",""
"10","sāmarthyam","SĀMARTHY","am","sāmarthya","noun-adj",""
"11","tat","TAT","","tad","pron",""
"12","tadā","","","tadā","ind",""
"13","bhavaty","BHAV","aty","bhav","verb","bhū"
"14","eva","","","eva","ind",""
"15","/","","","","punct",""
"","</s>","","","","",""
"","<s number=""89"">","","","","",""
"1","tad","TAD","","tad","pron",""
"2","yathā","","","yathā","ind",""
"3","a","","","alpha_privativum","ind",""
"4","vikala","VIKAL","a@","vikala","noun-adj",""
"5","bala","BAL","a@","bala","noun-adj",""
"6","sakala","SAKAL","a@","sakala","noun-adj",""
"7","kāraṇa","KĀRAṆ","a@","kāraṇa","noun-adj",""
"8","kalāpo","KALĀP","o@","kalāpa","noun-adj",""
"9","aṅkuraḥ","AṄKUR","aḥ","aṅkura","noun-adj",""
"10","/","","","","punct",""
"","</s>","","","","",""
"","<s number=""90"">","","","","",""
"1","sati","SAT","i","sati","noun-adj",""
"2","ca","","","ca","ind",""
"3","cakṣur","CAKṢ","ur","cakṣu","noun-adj",""
"4","ādi","ĀD","i","ādi","noun-adj",""
"5","sākalye","SĀKALY","e","sākalya","noun-adj",""
"6","dṛśye","DṚŚY","e","dṛśya","noun-adj",""
"7","vastuny","VAST","uny","vastu","noun-adj",""
"8","a","","","alpha_privativum","ind",""
"9","vikalā","VIKAL","ā","vikala","noun-adj",""
"10","pratibaddha","PRATIBADDH","a@","pratibaddha","noun-adj",""
"11","śakti","ŚAKT","i@","śakti","noun-adj",""
"12","kāraṇaṃ","KĀRAṆ","aṃ","kāraṇa","noun-adj",""
"13","pratyakṣaṃ","PRATYAKṢ","aṃ","pratyakṣa","noun-adj",""
"14","jnm̐ānam","","","","ind",""
"15","iti","","","iti","ind",""
"16","svabhāva","SVABHĀV","a@","svabhāva","noun-adj",""
"17","hetuḥ","HET","uḥ","hetu","noun-adj",""
"18","/","","","","punct",""
"","</s>","","","","",""
"","<s number=""91"">","","","","",""
"1","tato","","","tatas","ind",""
"2","viruddha","VIRUDDH","a@","viruddha","noun-adj",""
"3","opalambhād","UPALAMBH","ād","upalambha","noun-adj",""
"4","vipakṣād","VIPAKṢ","ād","vipakṣa","noun-adj",""
"5","vyāvartamāno","VYĀVART","amāno","vyāvart","verb","vyāvṛt"
"6","hetur","HET","ur","hetu","noun-adj",""
"7","a","","","alpha_privativum","ind",""
"8","sad","SAD","@","sat","noun-adj",""
"9","vyavahāra","VYAVAHĀR","a@","vyavahāra","noun-adj",""
"10","yogyatvena","YOGY","atvena","yogyatva","noun-adj",""
"11","vyāpyata","VYĀPY","ata","vyāpya","noun-adj",""
"12","iti","","","iti","ind",""
"13","vyāpti","VYĀPT","i@","vyāpti","noun-adj",""
"14","siddher","SIDDH","er","siddhi","noun-adj",""
"15","n","","","na","ind",""
"16","^","","","","",""
"17","ān","","","alpha_privativum","ind",""
"18","aikāntikaḥ","AIKĀNTIK","aḥ","aikāntika","noun-adj",""
"19","/","","","","punct",""
"","</s>","","","","",""
"","<s number=""92"">","","","","",""
"1","abhimata","ABHIMAT","a@","abhimata","noun-adj",""
"2","sādhya","SĀDHY","a@","sādhya","noun-adj",""
"3","pratibandha","PRATIBANDH","a@","pratibandha","noun-adj",""
"4","siddhestu","SIDDH","estu","siddha","noun-adj",""
"5","viruddhatā","VIRUDDH","atā","viruddhatā","noun-adj",""
"6","dūra","DŪR","a@","dūra","noun-adj",""
"7","tarasam","TARAS","am","tarasa","noun-adj",""
"8","utsārita","UTS","ārita","utsṛ","noun-adj",""
"9","rabhasa","RABHAS","a@","rabhasa","noun-adj",""
"10","prasara","PRASAR","a","prasara","noun-adj",""
"11","^","","","","",""
"12","aiva","","","eva","ind",""
"13","/","","","","punct",""
"","</s>","","","","",""
"","<s number=""93"">","","","","",""
"1","tato","","","tatas","ind",""
"2","a","","","alpha_privativum","ind",""
"3","siddha","SIDDH","a@","siddha","noun-adj",""
"4","tādi","TĀD","i@","tādṛ","noun-adj",""
"5","dūṣaṇa","DŪṢAṆ","a@","dūṣaṇa","noun-adj",""
"6","śaṅkā","ŚAṄK","ā@","śaṅkā","noun-adj",""
"7","kalaṅkān","KALAṄK","ān","kalaṅka","noun-adj",""
"8","aṅkita","AṄKIT","a@","aṅkita","noun-adj",""
"9","āddhetoḥ","ADDH","etoḥ","addha","noun-adj",""
"10","prastuta","PRASTUT","a@","prastuta","noun-adj",""
"11","vastu","VAST","u@","vastu","noun-adj",""
"12","siddhau","SIDDH","au","siddha","noun-adj",""
"13","siddham","SIDDH","am","siddha","noun-adj",""
"14","a","","","alpha_privativum","ind",""
"15","sattvaṃ","SATTV","aṃ","sattva","noun-adj",""
"16","sāmānyasya","SĀMĀNY","asya","sāmānya","noun-adj",""
"17","ety","","","iti","ind",""
"18","alam","","","alam","ind",""
"19","atibahu","ATIBAH","u@","atibahu","noun-adj",""
"20","vistara","VISTAR","a@","vistara","noun-adj",""
"21","visāriṇyā","VISĀRIṆ","yā","visāriṇī","noun-adj",""
"22","kathayeti","KATH","ayeti","kath","verb","kath"
"23","viramyate","VIRAM","yate","viram","verb","viram"
"24","/","","","","punct",""
"","</s>","","","","",""
"","<s number=""94"">","","","","",""
"1","na","","","na","ind",""
"2","ca","","","ca","ind",""
"3","vastu","VAST","u@","vastu","noun-adj",""
"4","saṃsthānavat","SAṂSTHĀN","avat","saṃsthānavat","noun-adj",""
"5","sāmānyaṃ","SĀMĀNY","aṃ","sāmānya","noun-adj",""
"6","vyakter","VYAKT","er","vyakti","noun-adj",""
"7","lakṣaṇam","LAKṢAṆ","am","lakṣaṇa","noun-adj",""
"8","/","","","","punct",""
"","</s>","","","","",""
"","<s number=""95"">","","","","",""
"1","na","","","na","ind",""
"2","c","","","ca","ind",""
"3","^","","","","",""
"4","ānuvṛtta","ANUVṚTT","a@","anuvṛtta","noun-adj",""
"5","vyāvṛtta","VYĀVṚTT","a@","vyāvṛtta","noun-adj",""
"6","varṇa","VARṆ","a@","varṇa","noun-adj",""
"7","ādy","ĀD","y@","ādi","noun-adj",""
"8","ātmake","ĀTM","ake","ātman","noun-adj",""
"9","jāti","JĀT","i@","jāti","noun-adj",""
"10","vyaktī","VYAKT","ī","vyakti","noun-adj",""
"11","varṇa","VARṆ","a@","varṇa","noun-adj",""
"12","ādi","ĀD","i@","ādi","noun-adj",""
"13","niyata","NIYAT","a@","niyata","noun-adj",""
"14","pratibhāsa","PRATIBHĀS","a@","pratibhāsa","noun-adj",""
"15","pratīti","PRATĪT","i@","pratīti","noun-adj",""
"16","prasaṅgāt","PRASAṄG","āt","prasaṅga","noun-adj",""
"17","vyakter","VYAKT","er","vyakti","noun-adj",""
"18","ev","","","eva","ind",""
"19","^","","","","",""
"20","āsau","","","adas","pron",""
"21","pratibhāsa","PRATIBHĀS","a","pratibhāsa","noun-adj",""
"22","iti","","","iti","ind",""
"23","cet","CET","","ced","noun-adj",""
"24","/","","","","punct",""
"","</s>","","","","",""
"","<s number=""96"">","","","","",""
"1","ko","","","kim","pron",""
"2","aparas","APAR","as","apara","noun-adj",""
"3","tarhi","","","tarhi","ind",""
"4","sāmānyasy","SĀMĀNY","asy","sāmānya","noun-adj",""
"5","ānugata","ANUGAT","a@","anugata","noun-adj",""
"6","ākāra","ĀKĀR","a","ākāra","noun-adj",""
"7","iti","","","iti","ind",""
"8","cet","CET","","ced","noun-adj",""
"9","/","","","","punct",""
"","</s>","","","","",""
"","<s number=""97"">","","","","",""
"1","nanu","NAN","u","nanu","noun-adj",""
"2","varṇa","VARṆ","a@","varṇa","noun-adj",""
"3","saṃsthāne","SAṂSTHĀN","e","saṃsthāna","noun-adj",""
"4","virahayya","VIRAHAY","ya","viraha","verb",""
"5","kim","","","kim","pron",""
"6","aparam","APAR","am","apara","noun-adj",""
"7","anugāmi","ANUG","āmi","anug","verb",""
"8","vidyate","VID","yate","vid","verb","vid"
"9","/","","","","punct",""
"","</s>","","","","",""
"","<s number=""98"">","","","","",""
"1","jāti","JĀT","i@","jāti","noun-adj",""
"2","vyaktyoḥ","VYAKT","yoḥ","vyakti","noun-adj",""
"3","samavāya","SAMAVĀY","a@","samavāya","noun-adj",""
"4","balād","BAL","ād","bala","noun-adj",""
"5","a","","","alpha_privativum","ind",""
"6","vibhāvita","VIBHĀVIT","a@","vibhāvita","noun-adj",""
"7","vibhāgayoḥ","VIBHĀG","ayoḥ","vibhāga","noun-adj",""
"8","kṣīrodakayor","KṢĪRODAK","ayor","kṣīrodaka","noun-adj",""
"9","iva","","","iva","ind",""
"10","paraspara","PARASPAR","a@","paraspara","noun-adj",""
"11","miśraṇena","MIŚRAṆ","ena","miśraṇa","noun-adj",""
"12","pratipattir","PRATIPATT","ir","pratipatti","noun-adj",""
"13","iti","","","iti","ind",""
"14","cet","CET","","ced","noun-adj",""
"15","/","","","","punct",""
"","</s>","","","","",""
"","<s number=""99"">","","","","",""
"1","na","","","na","ind",""
"2","tarhi","","","tarhi","ind",""
"3","sāmānya","SĀMĀNY","a@","sāmānya","noun-adj",""
"4","viśeṣayor","VIŚEṢ","ayor","viśeṣa","noun-adj",""
"5","eka","EK","a@","eka","noun-adj",""
"6","tarasy","TARAS","y","tarasi","noun-adj",""
"7","^","","","","",""
"8","āpi","","","api","ind",""
"9","rūpaṃ","RŪP","aṃ","rūpa","noun-adj",""
"10","gṛhītam","GṚHĪT","am","gṛhīta","noun-adj",""
"11","/","","","","punct",""
"","</s>","","","","",""
"","<s number=""100"">","","","","",""
"1","svaru","SVAR","u@","svaru","noun-adj",""
"2","ūpāgrahaṇe","UPĀGRAHAṆ","e","upāgrahaṇa","noun-adj",""
"3","anayor","","","idam","pron",""
"4","apy","","","api","ind",""
"5","a","","","alpha_privativum","ind",""
"6","grahaṇam","GRAHAṆ","am","grahaṇa","noun-adj",""
"7","iti","","","iti","ind",""
"8","nirālambana","NIRĀLAMBAN","a","nirālambana","noun-adj",""
"9","^","","","","",""
"10","aiva","","","eva","ind",""
"11","sā","","","tad","pron",""
"12","tādṛśī","TĀDṚŚ","ī","tādṛśi","noun-adj",""
"13","pratipattir","PRATIPATT","ir","pratipatti","noun-adj",""
"14","iti","","","iti","ind",""
"15","paramārtha","PARAMĀRTH","a","paramārtha","noun-adj",""
"16","āveditas","ĀVEDIT","as","āvedita","noun-adj",""
"17","tāvat","TĀVAT","","tāvat","ind",""
"18","/","","","","punct",""
"","</s>","","","","",""
"","<s number=""101"">","","","","",""
"1","nirālambanayā","NIRĀLAMBAN","ayā","nirālambana","noun-adj",""
"2","ca","","","ca","ind",""
"3","pratītyā","PRATĪTY","ā","pratītya","noun-adj",""
"4","vyavasthāpyamānaṃ","VYAVASTHĀP","yamānaṃ","vyavatiṣṭh","verb","vyavasthā"
"5","sāmānyaṃ","SĀMĀNY","aṃ","sāmānya","noun-adj",""
"6","su","","","su","ind",""
"7","vyavasthāpitam","VYAVASTHĀPIT","am","vyavasthāpita","noun-adj",""
"8","/","","","","punct",""
"","</s>","","","","",""
"","<s number=""102"">","","","","",""
"1","tasmād","TASMĀD","","tad","pron",""
"2","viśeṣya","VIŚEṢY","a@","viśeṣya","noun-adj",""
"3","āsiddhy","ĀSIDDH","y","āsiddha","noun-adj",""
"4","^","","","","",""
"5","āpi","","","api","ind",""
"6","n","","","na","ind",""
"7","āyam","ĀYAM","","idam","pron",""
"8","a","","","alpha_privativum","ind",""
"9","siddho","SIDDH","o","siddha","noun-adj",""
"10","hetuḥ","HET","uḥ","hetu","noun-adj",""
"11","/","","","","punct",""
"","</s>","","","","",""
"","<s number=""103"">","","","","",""
"1","sapakṣe","SAPAKṢ","e","sapakṣa","noun-adj",""
"2","vartamāno","VARTAMĀN","o","vartamāna","noun-adj",""
"3","viruddha","VIRUDDH","a","viruddha","noun-adj",""
"4","ity","","","iti","ind",""
"5","api","","","api","ind",""
"6","na","","","na","ind",""
"7","mantavyaḥ","MAN","tavyaḥ","man","verb","man"
"8","/","","","","punct",""
"","</s>","","","","",""
"","<s number=""104"">","","","","",""
"1","an","","","alpha_privativum","ind",""
"2","aikāntika","AIKĀNTIK","a@","aikāntika","noun-adj",""
"3","tāpyasya","TĀPY","asya","tāpya","noun-adj",""
"4","na","","","na","ind",""
"5","saṃbhāvanām","SAMBHĀVAN","ām","sambhāvanā","noun-adj",""
"6","arhati","ARH","ati","arh","verb","arh"
"7","/","","","","punct",""
"","</s>","","","","",""
"","<s number=""105"">","","","","",""
"1","a","","","alpha_privativum","ind",""
"2","sad","SAD","@","sat","noun-adj",""
"3","vyavahāra","VYAVAHĀR","a@","vyavahāra","noun-adj",""
"4","ānapekṣatvena","ANAPEKṢ","atvena","anapekṣatva","noun-adj",""
"5","hi","","","hi","ind",""
"6","dṛśya","DṚŚY","a@","dṛśya","noun-adj",""
"7","ānupalambho","ANUPALAMBH","o","anupalambha","noun-adj",""
"8","vyāptaḥ","VYĀPT","aḥ","vyāpta","noun-adj",""
"9","/","","","","punct",""
"","</s>","","","","",""
"","<s number=""106"">","","","","",""
"1","yadi","","","yadi","ind",""
"2","hi","","","hi","ind",""
"3","sann","SAN","n","sat","noun-adj",""
"4","api","","","api","ind",""
"5","tatra","","","tatra","ind",""
"6","na","","","na","ind",""
"7","prava","PRAV","a@","prava","noun-adj",""
"8","rtayet","RTAY","et","rtaya","noun-adj",""
"9","iha","","","iha","ind",""
"10","sāpekṣaḥ","SĀPEKṢ","aḥ","sāpekṣa","noun-adj",""
"11","syāt","","","as","verb","as"
"12","/","","","","punct",""
"","</s>","","","","",""
"","<s number=""107"">","","","","",""
"1","tato","","","tatas","ind",""
"2","vipakṣād","VIPAKṢ","ād","vipakṣa","noun-adj",""
"3","vyāpaka","VYĀP","aka@","vyāpaka","noun-adj",""
"4","viruddha","VIRUDDH","a@","viruddha","noun-adj",""
"5","āvaruddhād","AVARUDDH","ād","avaruddha","noun-adj",""
"","</page>","","","","",""
"","<page number=""16"">","","","","",""
"8","vyāvartamāno","VYĀVART","amāno","vyāvart","verb","vyāvṛt"
"9","a","","","alpha_privativum","ind",""
"10","sad","SAD","@","sat","noun-adj",""
"11","vyavahāre","VYAVAHĀR","e","vyavahāra","noun-adj",""
"12","viśrāmyati","VIŚRĀMY","ati","viśrām","verb",""
"13","iti","","","iti","ind",""
"14","/","","","","punct",""
"","</s>","","","","",""
"","<s number=""108"">","","","","",""
"1","atas","","","atas","ind",""
"2","ten","","","tad","pron",""
"3","^","","","","",""
"4","ā","","","alpha_privativum","ind",""
"5","sad","SAD","@","sat","noun-adj",""
"6","vyavahāreṇ","VYAVAHĀR","eṇ","vyavahāra","noun-adj",""
"7","ānupalambho","ANUPALAMBH","o","anupalambha","noun-adj",""
"8","vyāpta","VYĀPT","a","vyāpta","noun-adj",""
"9","iti","","","iti","ind",""
"10","kuto","KUT","o","kuta","noun-adj",""
"11","an","","","alpha_privativum","ind",""
"12","ekāntaḥ","EKĀNT","aḥ","ekānta","noun-adj",""
"13","/","","","","punct",""
"","</s>","","","","",""
"","<s number=""109"">","","","","",""
"1","tataś","","","tatas","ind",""
"2","ca","","","ca","ind",""
"3","sa","","","sa_saha","ind",""
"4","ev","","","eva","ind",""
"5","ārthaḥ","ARTH","aḥ","artha","noun-adj",""
"6","samāyātaḥ","SAMĀYĀT","aḥ","samāyāta","noun-adj",""
"7","/","","","","punct",""
"","</s>","","","","",""
"","<s number=""110"">","","","","",""
"1","etāsu","","","tad","pron",""
"2","panṃcasv","PAN","ṃcasv","pana","noun-adj",""
"3","avabhāsanīṣu","AVABHĀSAN","īṣu","avabhāsana","noun-adj",""
"4","pratyakṣa","PRATYAKṢ","a@","pratyakṣa","noun-adj",""
"5","bodhe","BODH","e","bodha","noun-adj",""
"6","sphuṭa","SPHUṬ","a@","sphuṭa","noun-adj",""
"7","maṅgulīṣu","MAṄGUL","īṣu","maṅgula","noun-adj",""
"8","/","","","","punct",""
"","</s>","","","","",""
"","<s number=""111"">","","","","",""
"1","sādhāraṇaṃ","SĀDHĀRAṆ","aṃ","sādhāraṇa","noun-adj",""
"2","ṣaṣṭham","ṢAṢṬH","am","ṣaṣṭha","noun-adj",""
"3","ihe","","","","ind",""
"4","kṣate","KṢAT","e","kṣata","noun-adj",""
"5","yaḥ","","","yad","pron",""
"6","śṛṅgaṃ","ŚṚṄG","aṃ","śṛṅga","noun-adj",""
"7","śirasya","ŚIRASY","a@","śirasya","noun-adj",""
"8","ātmana","ĀTM","ana","ātman","noun-adj",""
"9","īkṣate","ĪKṢ","ate","īkṣ","verb","īkṣ"
"10","saḥ","","","tad","pron",""
"11","//","","","","punct",""
"","</s>","","","","",""
"","<s number=""112"">","","","","",""
"1","iti","","","iti","ind",""
"2","/","","","","punct",""
"","</s>","","","","",""
"","<s number=""113"">","","","","",""
"1","sarvasya","SARV","asya","sarva","noun-adj",""
"2","ca","","","ca","ind",""
"3","pūrva","PŪRV","a@","pūrva","noun-adj",""
"4","oktasy","UKT","asy","ukta","noun-adj",""
"5","āyaṃ","ĀYAṂ","","idam","pron",""
"6","paramārthaḥ","PARAMĀRTH","aḥ","paramārtha","noun-adj",""
"7","/","","","","punct",""
"","</s>","","","","",""
"","<s number=""114"">","","","","",""
"1","pratyakṣa","PRATYAKṢ","a@","pratyakṣa","noun-adj",""
"2","pratibhāsi","PRATIBHĀS","i@","pratibhāsa","noun-adj",""
"3","varṣmasu","VARṢM","asu","varṣma","noun-adj",""
"4","na","","","na","ind",""
"5","panṃcas","PAN","ṃcas","pana","noun-adj",""
"6","vaṅgulīṣu","VAṄGUL","īṣu","vaṅgulā","noun-adj",""
"7","sthitaṃ","STHIT","aṃ","sthita","noun-adj",""
"8","sāmānyaṃ","SĀMĀNY","aṃ","sāmānya","noun-adj",""
"9","pratibhāsate","PRATIBHĀS","ate","pratibhāsa","noun-adj",""
"10","na","","","na","ind",""
"11","ca","","","ca","ind",""
"12","vikalpa","VIKALP","a@","vikalpa","noun-adj",""
"13","ākāra","ĀKĀR","a@","ākāra","noun-adj",""
"14","buddhau","BUDDH","au","buddha","noun-adj",""
"15","tathā","","","tathā","ind",""
"16","/","","","","punct",""
"","</s>","","","","",""
"","<s number=""115"">","","","","",""
"1","tā","","","tad","pron",""
"2","ev","","","eva","ind",""
"3","āsphuṭa","ĀSPHUṬ","a@","āsphuṭa","noun-adj",""
"4","mūrtayo","MŪRT","ayo","mūrta","noun-adj",""
"5","atra","","","atra","ind",""
"6","hi","","","hi","ind",""
"7","vibhāsante","VIBHĀSANT","e","vibhāsanta","noun-adj",""
"8","na","","","na","ind",""
"9","jātis","JĀT","is","jāti","noun-adj",""
"10","tataḥ","","","tatas","ind",""
"11","sādṛśya","SĀDṚŚY","a@","sādṛśya","noun-adj",""
"12","bhrama","BHRAM","a@","bhrama","noun-adj",""
"13","kāraṇau","KĀRAṆ","au","kāraṇa","noun-adj",""
"14","punarim","PUNAR","im","punari","noun-adj",""
"15","āveka","AVEK","a@","aveka","noun-adj",""
"16","opalabdhidhvanī","UPALABDH","idhvanī","upalabdha","noun-adj",""
"17","//","","","","punct",""
"","</s>","","","","",""
"","<s number=""116"">","","","","",""
"1","iti","","","iti","ind",""
"2","sāmānya","SĀMĀNY","a@","sāmānya","noun-adj",""
"3","siddhi","SIDDH","i@","siddhi","noun-adj",""
"4","dūṣaṇā","DŪṢAṆ","ā","dūṣaṇa","noun-adj",""
"5","dik","DIK","","dik","noun-adj",""
"6","prasādhitā","PRASĀDHIT","ā","prasādhita","noun-adj",""
"7","//","","","","punct",""
"","</s>","","","","",""
"","<s number=""117"">","","","","",""
"1","//","","","","punct",""
"2","kṛtir","KṚT","ir","kṛti","noun-adj",""
"3","iyaṃ","","","idam","pron",""
"4","paṇḍita","PAṆḌIT","a@","paṇḍita","noun-adj",""
"5","ā","","","alpha_privativum","ind",""
"6","śokasya","ŚOK","asya","śoka","noun-adj",""
"7","//","","","","punct",""
"","</s>","","","","",""
"","</page>","","","","",""
"","</doc>","","","","",""
