"WordID","word","NormSTEM","suffix","lemma","PoS","Root"
"","<doc textid = ""izvaravadimatapariksa"" genre = ""śāstra"" title = ""*īśvaravādimataparīkṣā"" author = ""jitāri"" discourse = ""philosophy"" tradition = ""pramāṇa"" period = ""commentarial"" source = ""sarit accessed dec 2020"" date_range = ""10.-11. ce"" notes = ""the sanskrit title was missing from the manuscript and was reconstructed by g. bühnemann. a very similar text edited by iyengar has the title digambaramataparīkṣā; see gudrun bühnemann. 1985. jitāri: kleine texte. wien: arbeitskreis für tibetische und buddhistische studien; universität wien; p. 19."" religion = ""buddh"" edition = ""based on the ed. gudrun bühnemann. 1985. jitāri: kleine texte. wien: arbeitskreis für tibetische und buddhistische studien; universität wien."" digitization = ""data entry by: aurorachana; auroville prepared for sarit by: liudmila olalde"" segmentation_lemmatization = ""ligeia lugli & buddhist translators workbench team"" metadata_enrichment = ""bruno galasek-hul & buddhist translators workbench team"" proofreader = ""n/a"" permission = ""cc by-sa 4.0"" reconstructions = ""none"">","","","","",""
"","<page number=""39"">","","","","",""
"","<s number=""1"">","","","","",""
"1","īśvara","ĪŚVAR","a@","īśvara","noun-adj",""
"2","vādi","VĀD","i@","vādin","noun-adj",""
"3","mata","MAT","a@","mata","noun-adj",""
"4","parīkṣā","PARĪKṢ","ā","parīkṣā","noun-adj",""
"","</s>","","","","",""
"","<s number=""2"">","","","","",""
"1","idānīm","IDĀN","īm","idāni","noun-adj",""
"2","īśvara","ĪŚVAR","a@","īśvara","noun-adj",""
"3","vādi","VĀD","i@","vādin","noun-adj",""
"4","mataṃ","MAT","aṃ","mata","noun-adj",""
"5","parīkṣyate","PARĪKṢ","yate","parīkṣ","verb",""
"6","/","","","","punct",""
"","</s>","","","","",""
"","<s number=""3"">","","","","",""
"1","ihāmī","","","","ind",""
"2","naiyāyika","NAIYĀYIK","a@","naiyāyika","noun-adj",""
"3","ādayas","ĀD","ayas","ādi","noun-adj",""
"4","tarv","","","","ind",""
"5","ādikam","ĀDIK","am","ādika","noun-adj",""
"6","a","","","alpha_privativum","ind",""
"7","khilaṃ","KHIL","aṃ","khila","noun-adj",""
"8","kāryam","KĀRY","am","kārya","noun-adj",""
"9","īśvara","ĪŚVAR","a@","īśvara","noun-adj",""
"10","kṛtam","KṚT","am","kṛta","noun-adj",""
"11","ācakṣate","ĀCAKṢ","ate","ācakṣas","noun-adj",""
"12","/","","","","punct",""
"","</s>","","","","",""
"","<s number=""4"">","","","","",""
"1","kiṃ","","","kim","pron",""
"2","punaḥ","","","punar","ind",""
"3","tatra","","","tatra","ind",""
"4","teṣāṃ","","","tad","pron",""
"5","pramāṇam","PRAMĀṆ","am","pramāṇa","noun-adj",""
"6","/","","","","punct",""
"","</s>","","","","",""
"","<s number=""5"">","","","","",""
"1","anumānam","ANUMĀN","am","anumāna","noun-adj",""
"2","/","","","","punct",""
"","</s>","","","","",""
"","<s number=""6"">","","","","",""
"1","tathā","","","tathā","ind",""
"2","hi","","","hi","ind",""
"3","yat","","","yad","pron",""
"4","kāryaṃ","KĀRY","aṃ","kārya","noun-adj",""
"5","tat","TAT","","tad","pron",""
"6","kartṛ","KART","ṛ@","kartṛ","noun-adj",""
"7","nāntarīyakaṃ","NĀNTARĪYAK","aṃ","nāntarīyaka","noun-adj",""
"8","dṛṣṭaṃ","DṚṢṬ","aṃ","dṛṣṭa","noun-adj",""
"9","/","","","","punct",""
"","</s>","","","","",""
"","<s number=""7"">","","","","",""
"1","tad","TAD","","tadā","ind",""
"2","yathā","","","yathā","ind",""
"3","kalaśa","KALAŚ","a@","kalaśa","noun-adj",""
"4","ādi","ĀD","i@","ādi","noun-adj",""
"5","kāryaṃ","KĀRY","aṃ","kārya","noun-adj",""
"6","/","","","","punct",""
"","</s>","","","","",""
"","<s number=""8"">","","","","",""
"1","tathā","","","tathā","ind",""
"2","ca","","","ca","ind",""
"3","vivāda","VIVĀD","a@","vivāda","noun-adj",""
"4","āspadībhū","ĀSPAD","ībhū","āspada","noun-adj",""
"5","tatara","TATAR","a@","tatara","noun-adj",""
"6","vādi","VĀD","i","vādin","noun-adj",""
"7","iti","","","iti","ind",""
"8","/","","","","punct",""
"","</s>","","","","",""
"","<s number=""9"">","","","","",""
"1","yaś","","","yad","pron",""
"2","c","","","ca","ind",""
"3","^","","","","",""
"4","āsau","","","adas","pron",""
"5","kartā","KART","ā","kartṛ","noun-adj",""
"6","sa","","","sa_saha","ind",""
"7","bhagavān","BHAGAV","ān@","bhagavat","noun-adj",""
"8","īśvara","ĪŚVAR","a","īśvara","noun-adj",""
"9","iti","","","iti","ind",""
"10","/","","","","punct",""
"","</s>","","","","",""
"","<s number=""10"">","","","","",""
"1","atr","","","atra","ind",""
"2","ocyate","UC","yate","vak","verb","vac"
"3","/","","","","punct",""
"","</s>","","","","",""
"","<s number=""11"">","","","","",""
"1","yadi","","","yadi","ind",""
"2","kārya","KĀRY","a@","kārya","noun-adj",""
"3","mātraṃ","MĀTR","aṃ","mātra","noun-adj",""
"4","buddhim","BUDDH","im","buddhi","noun-adj",""
"5","addhetukatvena","ADDH","etukatvena","addha","noun-adj",""
"6","prasiddha","PRASIDDH","a@","prasiddha","noun-adj",""
"7","vyāptikaṃ","VYĀPT","ikaṃ","vyāptika","noun-adj",""
"8","bhavet","BHAV","et","bhav","verb","bhū"
"9","/","","","","punct",""
"","</s>","","","","",""
"","<s number=""12"">","","","","",""
"1","bhavet","BHAV","et","bhav","verb","bhū"
"2","kāryat","KĀRY","at","kāryat","noun-adj",""
"3","ādarśanāt","ĀDARŚAN","āt","ādarśana","noun-adj",""
"4","tar","","","","ind",""
"5","vādīnāṃ","VĀD","īnāṃ","vādin","noun-adj",""
"6","buddhim","BUDDH","im","buddhi","noun-adj",""
"7","addhetukatv","ADDH","etukatv","addha","noun-adj",""
"8","ānumānam","ANUMĀN","am","anumāna","noun-adj",""
"9","/","","","","punct",""
"","</s>","","","","",""
"","<s number=""13"">","","","","",""
"1","kevalam","KEVAL","am","kevala","noun-adj",""
"2","iyam","","","idam","pron",""
"3","eva","","","eva","ind",""
"4","vyāptir","VYĀPT","ir","vyāpti","noun-adj",""
"5","a","","","alpha_privativum","ind",""
"6","śakyā","ŚAKY","ā","śakya","noun-adj",""
"7","pratipattuṃ","PRATIPATT","uṃ","pratipad","verb","pratipad"
"7","pratipattuṃ","PRATIPATT","uṃ","pratipat","verb","pratipat"
"8","/","","","","punct",""
"","</s>","","","","",""
"","<s number=""14"">","","","","",""
"1","tathā","","","tathā","ind",""
"2","hi","","","hi","ind",""
"3","puruṣasya","PURUṢ","asya","puruṣa","noun-adj",""
"4","vyāpāram","VYĀPĀR","am","vyāpāra","noun-adj",""
"5","antareṇ","ANTAR","eṇ","antara","noun-adj",""
"6","^","","","","",""
"7","āpy","","","api","ind",""
"8","upajāyamānās","UPAJĀ","yamānās","upajan","verb","upajan"
"9","tṛṇa","TṚṆ","a@","tṛṇa","noun-adj",""
"10","ādayaḥ","ĀD","ayaḥ","ādi","noun-adj",""
"11","/","","","","punct",""
"","</s>","","","","",""
"","<s number=""15"">","","","","",""
"1","pada","PAD","a@","pada","noun-adj",""
"2","ārthā","ARTH","ā","artha","noun-adj",""
"3","dṛśyante","DṚŚ","yante","darś","verb","dṛś"
"4","/","","","","punct",""
"","</s>","","","","",""
"","<s number=""16"">","","","","",""
"1","tat","TAT","","tad","pron",""
"2","kathaṃ","","","katham","ind",""
"3","prekṣā","PREKṢ","ā@","prekṣā","noun-adj",""
"4","pūrvakāriṇā","PŪRVAKĀR","iṇā","pūrvakārin","noun-adj",""
"5","sarvaṃ","SARV","aṃ","sarva","noun-adj",""
"6","kāryaṃ","KĀRY","aṃ","kārya","noun-adj",""
"7","pauruṣeyam","PAURUṢEY","am","pauruṣeya","noun-adj",""
"8","iti","","","iti","ind",""
"9","niścīyeta","NIŚCĪ","yeta","niścīa","noun-adj",""
"10","/","","","","punct",""
"","</s>","","","","",""
"","<s number=""17"">","","","","",""
"1","nanu","NAN","u","nanu","noun-adj",""
"2","yeṣāṃ","","","yad","pron",""
"3","puruṣa","PURUṢ","a@","puruṣa","noun-adj",""
"4","vyāpāram","VYĀPĀR","am","vyāpāra","noun-adj",""
"5","antareṇ","ANTAR","eṇ","antara","noun-adj",""
"6","otpattir","UTPATT","ir","utpatti","noun-adj",""
"7","dṛśyate","DṚŚ","yate","darś","verb","dṛś"
"8","/","","","","punct",""
"","</s>","","","","",""
"","<s number=""18"">","","","","",""
"1","yeṣāṃ","","","yad","pron",""
"2","c","","","ca","ind",""
"3","^","","","","",""
"4","otpattir","UTPATT","ir","utpatti","noun-adj",""
"5","dṛśyate","DṚŚ","yate","darś","verb","dṛś"
"6","kāryāṇāṃ","KĀRY","āṇāṃ","kārya","noun-adj",""
"7","te","","","tad","pron",""
"8","sarve","SARV","e","sarva","noun-adj",""
"9","tṛṇa","TṚṆ","a@","tṛṇa","noun-adj",""
"10","ādayo","ĀD","ayo","ādi","noun-adj",""
"11","bhūd","BHŪD","@","bhūda","noun-adj",""
"12","hara","HAR","a@","hara","noun-adj",""
"13","ādayaś","ĀD","ayaś","ādi","noun-adj",""
"14","ca","","","ca","ind",""
"15","pakṣī","PAKṢ","ī@","pakṣī","noun-adj",""
"16","kṛtā","KṚT","ā","kṛta","noun-adj",""
"17","eva","","","eva","ind",""
"18","/","","","","punct",""
"","</s>","","","","",""
"","<s number=""19"">","","","","",""
"1","na","","","na","ind",""
"2","ca","","","ca","ind",""
"3","pakṣī","PAKṢ","ī@","pakṣī","noun-adj",""
"4","kṛte","KṚT","e","kṛta","noun-adj",""
"5","vyāpti","VYĀPT","i@","vyāpti","noun-adj",""
"6","grahaṇam","GRAHAṆ","am","grahaṇa","noun-adj",""
"7","upapadyate","UPAPAD","yate","upapad","verb","upapad"
"8","/","","","","punct",""
"","</s>","","","","",""
"","<s number=""20"">","","","","",""
"1","kvacit","","","kva","ind",""
"2","/","","","","punct",""
"","</s>","","","","",""
"","<s number=""21"">","","","","",""
"1","parokṣatayā","PAROKṢ","atayā","parokṣatā","noun-adj",""
"2","vyāpakasya","VYĀPAK","asya","vyāpaka","noun-adj",""
"3","vyāpter","VYĀPT","er","vyāpti","noun-adj",""
"4","grahītum","GRAH","ītum","graha","noun-adj",""
"5","a","","","alpha_privativum","ind",""
"6","śakyatvāt","ŚAKY","atvāt","śakyatva","noun-adj",""
"7","kvacic","KVAC","ic","kva","noun-adj",""
"8","ca","","","ca","ind",""
"9","vyāpti","VYĀPT","i@","vyāpti","noun-adj",""
"10","grāhiṇa","GRĀH","iṇa","grāhin","noun-adj",""
"11","eva","","","eva","ind",""
"12","pramāṇasy","PRAMĀṆ","asy","pramāṇa","noun-adj",""
"13","^","","","","",""
"14","āpy","","","api","ind",""
"15","a","","","alpha_privativum","ind",""
"16","siddher","SIDDH","er","siddhi","noun-adj",""
"17","anumāna","ANUMĀN","a","anumāna","noun-adj",""
"18","^","","","","",""
"19","ān","","","alpha_privativum","ind",""
"20","avatāra","AVATĀR","a@","avatāra","noun-adj",""
"21","prasaṅgāt","PRASAṄG","āt","prasaṅga","noun-adj",""
"22","/","","","","punct",""
"","</s>","","","","",""
"","<s number=""22"">","","","","",""
"1","tasmād","TASMĀD","","tad","pron",""
"2","yathā","","","yathā","ind",""
"3","mahāna","MAH","āna","mahat","noun-adj",""
"4","sādau","SĀD","au","sād","verb",""
"5","dhūmasya","DHŪMAS","ya","dhūmasa","noun-adj",""
"6","vahninā","VAHN","inā","vahni","noun-adj",""
"7","vyāptiḥ","VYĀPT","iḥ","vyāpti","noun-adj",""
"8","pratīyate","PRATĪ","yate","pratīa","noun-adj",""
"9","/","","","","punct",""
"","</s>","","","","",""
"","<s number=""23"">","","","","",""
"1","tath","","","tathā","ind",""
"2","^","","","","",""
"3","eh","","","iha","ind",""
"4","āpi","ĀPI","","api","noun-adj",""
"5","ghaṭa","GHAṬ","a@","ghaṭa","noun-adj",""
"6","ādau","ĀD","au","ād","verb",""
"7","kāryasya","KĀRY","asya","kārya","noun-adj",""
"8","buddhim","BUDDH","im","buddhi","noun-adj",""
"9","addhetukatvena","ADDH","etukatvena","addha","noun-adj",""
"10","vyāptiḥ","VYĀPT","iḥ","vyāpti","noun-adj",""
"11","pratīyate","PRATĪ","yate","pratīa","noun-adj",""
"12","/","","","","punct",""
"","</s>","","","","",""
"","<s number=""24"">","","","","",""
"1","yathā","","","yathā","ind",""
"2","v","","","vā","ind",""
"3","ānyatra","ANYATR","a","anyatra","noun-adj",""
"4","gṛhīta","GṚHĪT","a@","gṛhīta","noun-adj",""
"5","vyāptikaḥ","VYĀPT","ikaḥ","vyāptika","noun-adj",""
"6","puruṣaḥ","PURUṢ","aḥ","puruṣa","noun-adj",""
"7","parvata","PARVAT","a@","parvata","noun-adj",""
"8","ādau","ĀD","au","ād","verb",""
"9","dhūma","DHŪM","a@","dhūma","noun-adj",""
"10","darśanād","DARŚAN","ād","darśana","noun-adj",""
"11","vahnim","VAHN","im","vahni","noun-adj",""
"12","anumimīte","ANUMIM","īte","anumimāti","noun-adj",""
"13","/","","","","punct",""
"","</s>","","","","",""
"","<s number=""25"">","","","","",""
"1","tathā","","","tathā","ind",""
"2","tṛṇa","TṚṆ","a@","tṛṇa","noun-adj",""
"3","ādau","ĀD","au","ād","verb",""
"4","kāryat","KĀRY","at","kāryat","noun-adj",""
"5","ādarśanāt","ĀDARŚAN","āt","ādarśana","noun-adj",""
"6","kartāram","KART","āram","kartṛ","noun-adj",""
"7","anumimīta","ANUMIM","īta","anumimāti","noun-adj",""
"8","iti","","","iti","ind",""
"9","na","","","na","ind",""
"10","kiṃcid","","","kimcit","ind",""
"11","anupapannaṃ","ANUPAPANN","aṃ","anupapanna","noun-adj",""
"12","nāma","NĀM","a","nāman","noun-adj",""
"13","/","","","","punct",""
"","</s>","","","","",""
"","<s number=""26"">","","","","",""
"","</page>","","","","",""
"","<page number=""40"">","","","","",""
"3","tad","TAD","","tadā","ind",""
"4","a","","","alpha_privativum","ind",""
"5","sat","SAT","","sat","noun-adj",""
"6","/","","","","punct",""
"","</s>","","","","",""
"","<s number=""27"">","","","","",""
"1","tathā","","","tathā","ind",""
"2","hi","","","hi","ind",""
"3","puruṣa","PURUṢ","a@","puruṣa","noun-adj",""
"4","vyāpāram","VYĀPĀR","am","vyāpāra","noun-adj",""
"5","antareṇ","ANTAR","eṇ","antara","noun-adj",""
"6","^","","","","",""
"7","āpi","","","api","ind",""
"8","tṛṇa","TṚṆ","a@","tṛṇa","noun-adj",""
"9","ādīn","ĀD","īn","ādi","noun-adj",""
"10","udaya","UDAY","a@","udaya","noun-adj",""
"11","māna","MĀN","a","māna","noun-adj",""
"12","^","","","","",""
"13","ān","","","alpha_privativum","ind",""
"14","avalokayaṃ","AVALOKAY","aṃ","avalokayati","noun-adj",""
"15","lokaḥ","LOK","aḥ","loka","noun-adj",""
"16","kārya","KĀRY","a@","kārya","noun-adj",""
"17","mātraṃ","MĀTR","aṃ","mātra","noun-adj",""
"18","puruṣa","PURUṢ","a@","puruṣa","noun-adj",""
"19","pūrvakam","PŪRV","akam","pūrvaka","noun-adj",""
"20","iti","","","iti","ind",""
"21","vyāptim","VYĀPT","im","vyāpti","noun-adj",""
"22","eva","","","eva","ind",""
"23","na","","","na","ind",""
"24","pratipadyata","PRATIPADYAT","a","pratipadyata","noun-adj",""
"25","iti","","","iti","ind",""
"26","proktam","PROKT","am","prokta","noun-adj",""
"27","/","","","","punct",""
"","</s>","","","","",""
"","<s number=""28"">","","","","",""
"1","tatr","","","tatra","ind",""
"2","^","","","","",""
"3","ānen","","","idam","pron",""
"4","ākarṇa","ĀKARṆ","a@","ākarṇa","noun-adj",""
"5","hṛdayena","HṚDAY","ena","hṛdaya","noun-adj",""
"6","tṛṇa","TṚṆ","a@","tṛṇa","noun-adj",""
"7","ādayo","ĀD","ayo","ādi","noun-adj",""
"8","asmābhiḥ","ASMĀBH","iḥ","asmat","pron",""
"9","sarva","SARV","a","sarva","noun-adj",""
"10","eva","","","eva","ind",""
"11","pakṣī","PAKṢ","ī@","pakṣī","noun-adj",""
"12","kṛtā","KṚT","ā","kṛta","noun-adj",""
"13","iti","","","iti","ind",""
"14","bruvatā","BRUV","atā","bruvat","noun-adj",""
"15","kiṃ","","","kim","pron",""
"16","nāma","NĀM","a","nāman","noun-adj",""
"17","samādhānaṃ","SAMĀDHĀN","aṃ","samādhāna","noun-adj",""
"18","dattam","DATT","am","datta","noun-adj",""
"19","iti","","","iti","ind",""
"20","na","","","na","ind",""
"21","pratīmaḥ","PRAT","īmaḥ","prata","noun-adj",""
"22","/","","","","punct",""
"","</s>","","","","",""
"","<s number=""29"">","","","","",""
"1","yadi","","","yadi","ind",""
"2","hi","","","hi","ind",""
"3","dhūmo","DHŪM","o","dhūma","noun-adj",""
"4","vahnim","VAHN","im","vahni","noun-adj",""
"5","antareṇ","ANTAR","eṇ","antara","noun-adj",""
"6","^","","","","",""
"7","āpy","","","api","ind",""
"8","upajāyamāno","UPAJĀ","yamāno","upajan","verb","upajan"
"9","dṛśyeta","DṚŚ","yeta","darś","verb","dṛś"
"10","kiṃ","","","kim","pron",""
"11","tasya","","","tad","pron",""
"12","kaścit","","","kimcit","ind",""
"13","tato","","","tatas","ind",""
"14","vyāptiṃ","VYĀPT","iṃ","vyāpti","noun-adj",""
"15","pratipadyeta","PRATIPAD","yeta","pratipad","verb","pratipad"
"16","/","","","","punct",""
"","</s>","","","","",""
"","<s number=""30"">","","","","",""
"1","atha","","","atha","ind",""
"2","matam","MAT","am","mata","noun-adj",""
"3","/","","","","punct",""
"","</s>","","","","",""
"","<s number=""31"">","","","","",""
"1","a","","","alpha_privativum","ind",""
"2","dṛśyo","DṚŚY","o","dṛśya","noun-adj",""
"3","asāv","","","","ind",""
"4","atīndriyaḥ","ATĪNDRIY","aḥ","atīndriya","noun-adj",""
"5","puruṣa","PURUṢ","a@","puruṣa","noun-adj",""
"6","viśeṣas","VIŚEṢ","as","viśeṣa","noun-adj",""
"7","/","","","","punct",""
"","</s>","","","","",""
"","<s number=""32"">","","","","",""
"1","tena","","","tad","pron",""
"2","tad","TAD","","tadā","ind",""
"3","vyāpāra","VYĀPĀR","a@","vyāpāra","noun-adj",""
"4","puraḥsara","PURAḤSAR","a@","puraḥsara","noun-adj",""
"5","prasūtir","PRASŪT","ir","prasūti","noun-adj",""
"6","api","","","api","ind",""
"7","tṛṇa","TṚṆ","a@","tṛṇa","noun-adj",""
"8","ādis","ĀD","is","ādi","noun-adj",""
"9","tathātvena","TATHĀTV","ena","tathātva","noun-adj",""
"10","na","","","na","ind",""
"11","pratīyate","PRATĪ","yate","pratīa","noun-adj",""
"12","/","","","","punct",""
"","</s>","","","","",""
"","<s number=""33"">","","","","",""
"1","na","","","na","ind",""
"2","c","","","ca","ind",""
"3","^","","","","",""
"4","ādṛśya","ADṚŚY","a@","adṛśya","noun-adj",""
"5","ānupalambho","ANUPALAMBH","o","anupalambha","noun-adj",""
"6","artha","ARTH","a@","artha","noun-adj",""
"7","ā","","","alpha_privativum","ind",""
"8","bhāvaṃ","BHĀV","aṃ","bhāva","noun-adj",""
"9","sādhayati","SĀDH","ayati","sādh","verb","sādh"
"10","/","","","","punct",""
"","</s>","","","","",""
"","<s number=""34"">","","","","",""
"1","tato","","","tatas","ind",""
"2","yady","","","yadi","ind",""
"3","api","","","api","ind",""
"4","tṛṇa","TṚṆ","a@","tṛṇa","noun-adj",""
"5","ādayaḥ","ĀD","ayaḥ","ādi","noun-adj",""
"6","puruṣa","PURUṢ","a@","puruṣa","noun-adj",""
"7","pūrvakā","PŪRV","akā","pūrvaka","noun-adj",""
"8","na","","","na","ind",""
"9","pratīyante","PRATĪ","yante","pratīa","noun-adj",""
"10","tath","","","tathā","ind",""
"11","^","","","","",""
"12","āpi","","","api","ind",""
"13","na","","","na","ind",""
"14","teṣām","","","tad","pron",""
"15","a","","","alpha_privativum","ind",""
"16","pauruṣeyat","PAURUṢEY","at","pauruṣeya","noun-adj",""
"17","^","","","","",""
"18","aiva","","","eva","ind",""
"19","yato","","","yatas","ind",""
"20","vyāpter","VYĀPT","er","vyāpti","noun-adj",""
"21","a","","","alpha_privativum","ind",""
"22","grahaṇaṃ","GRAHAṆ","aṃ","grahaṇa","noun-adj",""
"23","syāt","","","as","verb","as"
"24","/","","","","punct",""
"","</s>","","","","",""
"","<s number=""35"">","","","","",""
"1","etad","ETAD","","tad","pron",""
"2","apy","","","api","ind",""
"3","a","","","alpha_privativum","ind",""
"4","sat","SAT","","sat","noun-adj",""
"5","/","","","","punct",""
"","</s>","","","","",""
"","<s number=""36"">","","","","",""
"1","yato","","","yatas","ind",""
"2","na","","","na","ind",""
"3","tāvad","TĀVAD","","tāvat","ind",""
"4","iha","","","iha","ind",""
"5","puruṣa","PURUṢ","a@","puruṣa","noun-adj",""
"6","vyāpāra","VYĀPĀR","a@","vyāpāra","noun-adj",""
"7","pūrvakatā","PŪRV","akatā","pūrvaka","noun-adj",""
"8","pratīyate","PRATĪ","yate","pratīa","noun-adj",""
"9","tṛṇa","TṚṆ","a@","tṛṇa","noun-adj",""
"10","ādīnām","ĀD","īnām","ādi","noun-adj",""
"11","/","","","","punct",""
"","</s>","","","","",""
"","<s number=""37"">","","","","",""
"1","sā","","","tad","pron",""
"2","ca","","","ca","ind",""
"3","puruṣasy","PURUṢ","asy","puruṣa","noun-adj",""
"4","ādṛśyatvād","ĀDṚŚY","atvād","ādṛśyatva","noun-adj",""
"5","a","","","alpha_privativum","ind",""
"6","sattvād","SATTV","ād","sattva","noun-adj",""
"7","vā","","","vā","ind",""
"8","na","","","na","ind",""
"9","pratīyatāṃ","PRATĪYAT","āṃ","pratīyatā","noun-adj",""
"10","/","","","","punct",""
"","</s>","","","","",""
"","<s number=""38"">","","","","",""
"1","kim","","","kim","pron",""
"2","anena","","","idam","pron",""
"3","vicāritena","VICĀRIT","ena","vicārita","noun-adj",""
"4","/","","","","punct",""
"","</s>","","","","",""
"","<s number=""39"">","","","","",""
"1","sarvathā","SARVATH","ā","sarvathā","noun-adj",""
"2","kiṃcit","","","kimcit","ind",""
"3","kāryaṃ","KĀRY","aṃ","kārya","noun-adj",""
"4","puruṣa","PURUṢ","a@","puruṣa","noun-adj",""
"5","pūrvakam","PŪRV","akam","pūrvaka","noun-adj",""
"6","apaśyann","APAŚ","yann","apaśu","noun-adj",""
"7","a","","","alpha_privativum","ind",""
"8","vyāptim","VYĀPT","im","vyāpti","noun-adj",""
"9","/","","","","punct",""
"","</s>","","","","",""
"","<s number=""40"">","","","","",""
"1","kārya","KĀRY","a@","kārya","noun-adj",""
"2","mātrasya","MĀTR","asya","mātra","noun-adj",""
"3","puruṣeṇa","PURUṢ","eṇa","puruṣa","noun-adj",""
"4","kaścid","","","kimcit","ind",""
"5","avagacchati","AVAGACCH","ati","avagacch","verb","avagam"
"6","/","","","","punct",""
"","</s>","","","","",""
"","<s number=""41"">","","","","",""
"1","vyāpter","VYĀPT","er","vyāpti","noun-adj",""
"2","an","","","alpha_privativum","ind",""
"3","avagame","AVAGAM","e","avagama","noun-adj",""
"4","ca","","","ca","ind",""
"5","kuto","KUT","o","kuta","noun-adj",""
"6","anumāna","ANUMĀN","a@","anumāna","noun-adj",""
"7","vārta","VĀRT","a","vārtā","noun-adj",""
"8","^","","","","",""
"9","āpi","","","api","ind",""
"10","/","","","","punct",""
"","</s>","","","","",""
"","<s number=""42"">","","","","",""
"1","syād","","","as","verb","as"
"2","etat","ETAT","","tad","pron",""
"3","/","","","","punct",""
"","</s>","","","","",""
"","<s number=""43"">","","","","",""
"1","yadi","","","yadi","ind",""
"2","na","","","na","ind",""
"3","buddhi","BUDDH","i@","buddhi","noun-adj",""
"4","mata","MAT","a@","mata","noun-adj",""
"5","pūrvakaṃ","PŪRV","akaṃ","pūrvaka","noun-adj",""
"6","kāryaṃ","KĀRY","aṃ","kārya","noun-adj",""
"7","ghaṭa","GHAṬ","a@","ghaṭa","noun-adj",""
"8","ādikam","ĀDIK","am","ādika","noun-adj",""
"9","api","","","api","ind",""
"10","tathā","","","tathā","ind",""
"11","bhūtaṃ","BHŪT","aṃ","bhūta","noun-adj",""
"12","na","","","na","ind",""
"13","syāt","","","as","verb","as"
"14","/","","","","punct",""
"","</s>","","","","",""
"","<s number=""44"">","","","","",""
"1","a","","","alpha_privativum","ind",""
"2","kāraṇāt","KĀRAṆ","āt","kāraṇa","noun-adj",""
"3","sakṛd","SAKṚ","d","sakṛt","noun-adj",""
"4","apy","","","api","ind",""
"5","anutpatteḥ","ANUTPATT","eḥ","anutpatti","noun-adj",""
"6","/","","","","punct",""
"","</s>","","","","",""
"","<s number=""45"">","","","","",""
"1","tasmād","TASMĀD","","tad","pron",""
"2","ekam","EK","am","eka","noun-adj",""
"3","api","","","api","ind",""
"4","kāryaṃ","KĀRY","aṃ","kārya","noun-adj",""
"5","puruṣa","PURUṢ","a@","puruṣa","noun-adj",""
"6","kāraṇakaṃ","KĀRAṆ","akaṃ","kāraṇaka","noun-adj",""
"7","pratiyan","PRATI","yan","pratia","noun-adj",""
"8","viśeṣa","VIŚEṢ","a@","viśeṣa","noun-adj",""
"9","ā","","","alpha_privativum","ind",""
"10","bhāvāt","BHĀV","āt","bhāva","noun-adj",""
"11","/","","","","punct",""
"","</s>","","","","",""
"","<s number=""46"">","","","","",""
"1","sarvam","SARV","am","sarva","noun-adj",""
"2","eva","","","eva","ind",""
"3","kāryaṃ","KĀRY","aṃ","kārya","noun-adj",""
"4","buddhi","BUDDH","i@","buddhi","noun-adj",""
"5","mata","MAT","a@","mata","noun-adj",""
"6","pūrvakatvena","PŪRV","akatvena","pūrvaka","noun-adj",""
"7","pratipadyate","PRATIPAD","yate","pratipad","verb","pratipad"
"8","/","","","","punct",""
"","</s>","","","","",""
"","<s number=""47"">","","","","",""
"1","yathā","","","yathā","ind",""
"2","mahānase","MAH","ānase","mahat","noun-adj",""
"3","vahni","VAHN","i@","vahni","noun-adj",""
"4","hetukaṃ","HET","ukaṃ","hetu","noun-adj",""
"5","dhūmam","DHŪM","am","dhūma","noun-adj",""
"6","upalabhamānaḥ","UPALABH","amānaḥ","upalabh","verb","upalabh"
"7","sarvam","SARV","am","sarva","noun-adj",""
"8","eva","","","eva","ind",""
"9","dhūmaṃ","DHŪM","aṃ","dhūma","noun-adj",""
"10","tadd","TAD","d@","tadā","ind",""
"11","hetukam","HET","ukam","hetu","noun-adj",""
"12","ākalayati","ĀKAL","ayati","ākal","verb",""
"13","/","","","","punct",""
"","</s>","","","","",""
"","<s number=""48"">","","","","",""
"1","etad","ETAD","","tad","pron",""
"2","apy","","","api","ind",""
"3","a","","","alpha_privativum","ind",""
"4","yuktam","YUKT","am","yukta","noun-adj",""
"5","/","","","","punct",""
"","</s>","","","","",""
"","<s number=""49"">","","","","",""
"1","viśeṣa","VIŚEṢ","a@","viśeṣa","noun-adj",""
"2","ā","","","alpha_privativum","ind",""
"3","bhāvasy","BHĀV","asy","bhāva","noun-adj",""
"4","^","","","","",""
"5","aiv","","","eva","ind",""
"6","āsiddheḥ","ĀSIDDH","eḥ","āsiddha","noun-adj",""
"7","/","","","","punct",""
"","</s>","","","","",""
"","<s number=""50"">","","","","",""
"1","anyādṛśam","ANYĀDṚŚ","am","anyādṛśa","noun-adj",""
"2","eva","","","eva","ind",""
"3","hi","","","hi","ind",""
"4","kāryaṃ","KĀRY","aṃ","kārya","noun-adj",""
"5","puruṣa","PURUṢ","a@","puruṣa","noun-adj",""
"6","nibandhanaṃ","NIBANDHAN","aṃ","nibandhana","noun-adj",""
"7","ghaṭa","GHAṬ","a@","ghaṭa","noun-adj",""
"8","ādi","ĀD","i","ādi","noun-adj",""
"9","dṛṣṭam","DṚṢṬ","am","dṛṣṭa","noun-adj",""
"10","/","","","","punct",""
"","</s>","","","","",""
"","<s number=""51"">","","","","",""
"1","anyādṛśaṃ","ANYĀDṚŚ","aṃ","anyādṛśa","noun-adj",""
"2","c","","","ca","ind",""
"3","edam","EDAM","","idam","pron",""
"4","/","","","","punct",""
"","</s>","","","","",""
"","<s number=""52"">","","","","",""
"1","tanu","TAN","u@","tanu","noun-adj",""
"2","taru","TAR","u","tar","verb","tṛ"
"3","prabhṛti","PRABHṚT","i","prabhṛti","noun-adj",""
"4","/","","","","punct",""
"","</s>","","","","",""
"","<s number=""53"">","","","","",""
"1","kāryam","KĀRY","am","kārya","noun-adj",""
"2","iti","","","iti","ind",""
"3","abhidhānam","ABHIDHĀN","am","abhidhāna","noun-adj",""
"","</page>","","","","",""
"","<page number=""41"">","","","","",""
"6","eva","","","eva","ind",""
"7","samānaṃ","SAMĀN","aṃ","samāna","noun-adj",""
"8","pralāpaḥ","PRALĀP","aḥ","pralāpa","noun-adj",""
"9","/","","","","punct",""
"","</s>","","","","",""
"","<s number=""54"">","","","","",""
"1","tato","","","tatas","ind",""
"2","vyāpti","VYĀPT","i@","vyāpti","noun-adj",""
"3","pratīti","PRATĪT","i@","pratīti","noun-adj",""
"4","kāle","KĀL","e","kāla","noun-adj",""
"5","pratikṣiptam","PRATIKṢIPT","am","pratikṣipta","noun-adj",""
"6","ev","","","eva","ind",""
"7","edṛśam","EDṚŚ","am","edṛśa","noun-adj",""
"8","/","","","","punct",""
"","</s>","","","","",""
"","<s number=""55"">","","","","",""
"1","na","","","na","ind",""
"2","hi","","","hi","ind",""
"3","vahni","VAHN","i@","vahni","noun-adj",""
"4","vyāptaṃ","VYĀPT","aṃ","vyāpta","noun-adj",""
"5","dhūmaṃ","DHŪM","aṃ","dhūma","noun-adj",""
"6","pratipadyamānaḥ","PRATIPAD","yamānaḥ","pratipad","verb","pratipad"
"7","kaścic","KAŚCI","c","kimcit","noun-adj",""
"8","citra","CITR","a@","citra","noun-adj",""
"9","nyastam","NYAST","am","nyasta","noun-adj",""
"10","api","","","api","ind",""
"11","dhūmaṃ","DHŪM","aṃ","dhūma","noun-adj",""
"12","dhūma","DHŪM","a@","dhūma","noun-adj",""
"13","śabda","ŚABD","a@","śabda","noun-adj",""
"14","ābhidheyata","ABHIDHEYAT","a@","abhidheyatā","noun-adj",""
"15","ā","","","alpha_privativum","ind",""
"16","mātra","MĀTR","a@","mātra","noun-adj",""
"17","sāmyād","SĀMY","ād","sāmya","noun-adj",""
"18","vahni","VAHN","i@","vahni","noun-adj",""
"19","vyāptaṃ","VYĀPT","aṃ","vyāpta","noun-adj",""
"20","pratipadyate","PRATIPAD","yate","pratipad","verb","pratipad"
"21","/","","","","punct",""
"","</s>","","","","",""
"","<s number=""56"">","","","","",""
"1","nanu","NAN","u","nanu","noun-adj",""
"2","ghaṭa","GHAṬ","a@","ghaṭa","noun-adj",""
"3","ādikam","ĀDIK","am","ādika","noun-adj",""
"4","api","","","api","ind",""
"5","kāraṇe","KĀRAṆ","e","kāraṇa","noun-adj",""
"6","sati","SAT","i","sati","noun-adj",""
"7","bhāvāt","BHĀV","āt","bhāva","noun-adj",""
"8","/","","","","punct",""
"","</s>","","","","",""
"","<s number=""57"">","","","","",""
"1","kāryam","KĀRY","am","kārya","noun-adj",""
"2","ity","","","iti","ind",""
"3","ucyate","UC","yate","vak","verb","vac"
"4","/","","","","punct",""
"","</s>","","","","",""
"","<s number=""58"">","","","","",""
"1","tarv","","","","ind",""
"2","ādikam","ĀDIK","am","ādika","noun-adj",""
"3","api","","","api","ind",""
"4","sati","SAT","i","sati","noun-adj",""
"5","kāraṇe","KĀRAṆ","e","kāraṇa","noun-adj",""
"6","bhavat","BHAV","at","bhavat","noun-adj",""
"7","kārya","KĀRY","a@","kārya","noun-adj",""
"8","vyavahāra","VYAVAHĀR","a@","vyavahāra","noun-adj",""
"9","yogyam","YOGY","am","yogya","noun-adj",""
"10","iti","","","iti","ind",""
"11","kāryatvena","KĀRY","atvena","kāryatva","noun-adj",""
"12","vivāda","VIVĀD","a@","vivāda","noun-adj",""
"13","āspadī","ĀSPAD","ī@","āspada","noun-adj",""
"14","bhūta","BHŪT","a@","bhūta","noun-adj",""
"15","etarayor","ITAR","ayor","itara","noun-adj",""
"16","a","","","alpha_privativum","ind",""
"17","viśeṣād","VIŚEṢ","ād","viśeṣa","noun-adj",""
"18","ekatra","EKATR","a","ekatra","noun-adj",""
"19","buddhi","BUDDH","i@","buddhi","noun-adj",""
"20","mata","MAT","a@","mata","noun-adj",""
"21","pūrvakatā","PŪRV","akatā","pūrvaka","noun-adj",""
"22","pratipādyaḥ","PRATIPĀDY","aḥ","pratipādya","noun-adj",""
"23","sarvatra","SARVATR","a","sarvatra","noun-adj",""
"24","tathā","","","tathā","ind",""
"25","bhāvaḥ","BHĀV","aḥ","bhāva","noun-adj",""
"26","pratīyate","PRATĪ","yate","pratīa","noun-adj",""
"27","/","","","","punct",""
"","</s>","","","","",""
"","<s number=""59"">","","","","",""
"1","atr","","","atra","ind",""
"2","ocyate","UC","yate","vak","verb","vac"
"3","/","","","","punct",""
"","</s>","","","","",""
"","<s number=""60"">","","","","",""
"1","dhūmā","DHŪM","ā@","dhūma","noun-adj",""
"2","dhūmayor","DHŪM","ayor","dhūma","noun-adj",""
"3","api","","","api","ind",""
"4","kāryatvenā","KĀRY","atvenā","kāryatva","noun-adj",""
"5","viśeṣād","VIŚEṢ","ād","viśeṣa","noun-adj",""
"6","dhūma","DHŪM","a@","dhūma","noun-adj",""
"7","kāryasya","KĀRY","asya","kārya","noun-adj",""
"8","huta","HUT","a@","huta","noun-adj",""
"9","āśana","ĀŚAN","a@","āśana","noun-adj",""
"10","hetu","HET","u@","hetu","noun-adj",""
"11","kata","KAT","a@","kata","noun-adj",""
"12","ā","","","alpha_privativum","ind",""
"13","pratītyā","PRATĪTY","ā","pratītya","noun-adj",""
"14","sarvasya","SARV","asya","sarva","noun-adj",""
"15","kāryasya","KĀRY","asya","kārya","noun-adj",""
"16","tadd","TAD","d@","tadā","ind",""
"17","hetu","HET","u@","hetu","noun-adj",""
"18","kata","KAT","a@","kata","noun-adj",""
"19","ānumānam","ANUMĀN","am","anumāna","noun-adj",""
"20","apy","","","api","ind",""
"21","evaṃ","","","eva","ind",""
"22","vādiri","VĀDIR","i","vādira","noun-adj",""
"23","ityā","","","","ind",""
"24","devānāṃ","DEV","ānāṃ","deva","noun-adj",""
"25","priyasya","PRIY","asya","priya","noun-adj",""
"26","prasajyate","PRASAJ","yate","prasaj","verb",""
"27","/","","","","punct",""
"","</s>","","","","",""
"","<s number=""61"">","","","","",""
"1","atha","","","atha","ind",""
"2","manyase","MAN","yase","man","verb","man"
"3","na","","","na","ind",""
"4","kārya","KĀRY","a@","kārya","noun-adj",""
"5","mātraṃ","MĀTR","aṃ","mātra","noun-adj",""
"6","vahni","VAHN","i@","vahni","noun-adj",""
"7","mātra","MĀTR","a@","mātra","noun-adj",""
"8","vyāptaṃ","VYĀPT","aṃ","vyāpta","noun-adj",""
"9","pratipannaṃ","PRATIPANN","aṃ","pratipanna","noun-adj",""
"10","kiṃ","","","kim","pron",""
"11","tu","","","tu","ind",""
"12","kārya","KĀRY","a@","kārya","noun-adj",""
"13","viśeṣo","VIŚEṢ","o","viśeṣa","noun-adj",""
"14","dhūma","DHŪM","a","dhūma","noun-adj",""
"15","iti","","","iti","ind",""
"16","tata","","","tatas","ind",""
"17","eva","","","eva","ind",""
"18","tasy","","","tad","pron",""
"19","ānumānaṃ","ANUMĀN","aṃ","anumāna","noun-adj",""
"20","na","","","na","ind",""
"21","kārya","KĀRY","a@","kārya","noun-adj",""
"22","mātrād","MĀTR","ād","mātra","noun-adj",""
"23","iti","","","iti","ind",""
"24","/","","","","punct",""
"","</s>","","","","",""
"","<s number=""62"">","","","","",""
"1","kasmāt","KASMĀT","","kim","pron",""
"2","punaḥ","","","punar","ind",""
"3","kārya","KĀRY","a@","kārya","noun-adj",""
"4","mātraṃ","MĀTR","aṃ","mātra","noun-adj",""
"5","puruṣa","PURUṢ","a@","puruṣa","noun-adj",""
"6","vyāptam","VYĀPT","am","vyāpta","noun-adj",""
"7","iv","","","iva","ind",""
"8","āgni","AGN","i@","agni","noun-adj",""
"9","vyāptam","VYĀPT","am","vyāpta","noun-adj",""
"10","api","","","api","ind",""
"11","na","","","na","ind",""
"12","pratīyata","PRATĪYAT","a","pratīyata","noun-adj",""
"13","ity","","","iti","ind",""
"14","etad","ETAD","","tad","pron",""
"15","ev","","","eva","ind",""
"16","ocyate","UC","yate","vak","verb","vac"
"17","/","","","","punct",""
"","</s>","","","","",""
"","<s number=""63"">","","","","",""
"1","tatr","","","tatra","ind",""
"2","^","","","","",""
"3","āpi","","","api","ind",""
"4","hi","","","hi","ind",""
"5","śakyam","ŚAKY","am","śakya","noun-adj",""
"6","etad","ETAD","","tad","pron",""
"7","abhidhātum","ABHIDHĀT","um","abhidadh","verb","abhidhā"
"8","/","","","","punct",""
"","</s>","","","","",""
"","<s number=""64"">","","","","",""
"1","yadi","","","yadi","ind",""
"2","kiṃcid","","","kimcit","ind",""
"3","kāryam","KĀRY","am","kārya","noun-adj",""
"4","agni","AGN","i@","agni","noun-adj",""
"5","pūrvakaṃ","PŪRV","akaṃ","pūrvaka","noun-adj",""
"6","na","","","na","ind",""
"7","syāt","","","as","verb","as"
"8","/","","","","punct",""
"","</s>","","","","",""
"","<s number=""65"">","","","","",""
"1","dhūmo","DHŪM","o","dhūma","noun-adj",""
"2","apy","","","api","ind",""
"3","agni","AGN","i@","agni","noun-adj",""
"4","pūrvako","PŪRV","ako","pūrvaka","noun-adj",""
"5","na","","","na","ind",""
"6","syāt","","","as","verb","as"
"7","/","","","","punct",""
"","</s>","","","","",""
"","<s number=""66"">","","","","",""
"1","a","","","alpha_privativum","ind",""
"2","kāraṇasya","KĀRAṆ","asya","kāraṇa","noun-adj",""
"3","sakṛd","SAKṚ","d","sakṛt","noun-adj",""
"4","apy","","","api","ind",""
"5","a","","","alpha_privativum","ind",""
"6","janakatvād","JANAK","atvād","janakatva","noun-adj",""
"7","iti","","","iti","ind",""
"8","/","","","","punct",""
"","</s>","","","","",""
"","<s number=""67"">","","","","",""
"1","atha","","","atha","ind",""
"2","kārya","KĀRY","a@","kārya","noun-adj",""
"3","āntaram","ANTAR","am","antara","noun-adj",""
"4","agnim","AGN","im","agni","noun-adj",""
"5","antareṇ","ANTAR","eṇ","antara","noun-adj",""
"6","^","","","","",""
"7","āpi","","","api","ind",""
"8","jāyamānaṃ","JĀ","yamānaṃ","jan","verb","jan"
"9","dṛṣṭam","DṚṢṬ","am","dṛṣṭa","noun-adj",""
"10","iti","","","iti","ind",""
"11","na","","","na","ind",""
"12","kārya","KĀRY","a@","kārya","noun-adj",""
"13","mātrasy","MĀTR","asy","mātra","noun-adj",""
"14","āgninā","AGN","inā","agni","noun-adj",""
"15","vyāptir","VYĀPT","ir","vyāpti","noun-adj",""
"16","iti","","","iti","ind",""
"17","/","","","","punct",""
"","</s>","","","","",""
"","<s number=""68"">","","","","",""
"1","yady","","","yadi","ind",""
"2","evaṃ","","","eva","ind",""
"3","tṛṇa","TṚṆ","a@","tṛṇa","noun-adj",""
"4","ādikam","ĀDIK","am","ādika","noun-adj",""
"5","api","","","api","ind",""
"6","puruṣam","PURUṢ","am","puruṣa","noun-adj",""
"7","antareṇa","ANTAR","eṇa","antara","noun-adj",""
"8","jāyamānaṃ","JĀ","yamānaṃ","jan","verb","jan"
"9","dṛṣṭam","DṚṢṬ","am","dṛṣṭa","noun-adj",""
"10","iti","","","iti","ind",""
"11","/","","","","punct",""
"","</s>","","","","",""
"","<s number=""69"">","","","","",""
"1","na","","","na","ind",""
"2","kārya","KĀRY","a@","kārya","noun-adj",""
"3","mātrasya","MĀTR","asya","mātra","noun-adj",""
"4","puruṣa","PURUṢ","a@","puruṣa","noun-adj",""
"5","vyāptatā","VYĀPT","atā","vyāptatā","noun-adj",""
"6","pratyetuṃ","PRATYET","uṃ","pratye","verb","pratī"
"7","śakyā","ŚAKY","ā","śakya","noun-adj",""
"8","/","","","","punct",""
"","</s>","","","","",""
"","<s number=""70"">","","","","",""
"1","atha","","","atha","ind",""
"2","yādṛśam","YĀDṚŚ","am","yādṛśa","noun-adj",""
"3","eva","","","eva","ind",""
"4","kāryam","KĀRY","am","kārya","noun-adj",""
"5","anvaya","ANVAY","a@","anvaya","noun-adj",""
"6","vyatirekābhyām","VYATIREK","ābhyām","vyatireka","noun-adj",""
"7","tat","TAT","","tad","pron",""
"8","pūrvakam","PŪRV","akam","pūrvaka","noun-adj",""
"9","upalabhyate","UPALABH","yate","upalabh","verb","upalabh"
"10","tādṛśam","TĀDṚŚ","am","tādṛśa","noun-adj",""
"11","eva","","","eva","ind",""
"12","tad","TAD","","tadā","ind",""
"13","vyāptam","VYĀPT","am","vyāpta","noun-adj",""
"14","avadhāryata","AVADHĀRY","ata","avadhārya","noun-adj",""
"15","iti","","","iti","ind",""
"16","kārya","KĀRY","a@","kārya","noun-adj",""
"17","mātrād","MĀTR","ād","mātra","noun-adj",""
"18","eṣyam","","","","ind",""
"19","anumānam","ANUMĀN","am","anumāna","noun-adj",""
"20","/","","","","punct",""
"","</s>","","","","",""
"","<s number=""71"">","","","","",""
"1","evaṃ","","","eva","ind",""
"2","tarhi","","","tarhi","ind",""
"3","yādṛśam","YĀDṚŚ","am","yādṛśa","noun-adj",""
"4","eva","","","eva","ind",""
"5","kāryam","KĀRY","am","kārya","noun-adj",""
"6","anvaya","ANVAY","a@","anvaya","noun-adj",""
"7","vyatirekābhyāṃ","VYATIREK","ābhyāṃ","vyatireka","noun-adj",""
"8","puruṣa","PURUṢ","a@","puruṣa","noun-adj",""
"9","pūrvakam","PŪRV","akam","pūrvaka","noun-adj",""
"10","upalabhyate","UPALABH","yate","upalabh","verb","upalabh"
"11","tādṛśam","TĀDṚŚ","am","tādṛśa","noun-adj",""
"12","eva","","","eva","ind",""
"13","tad","TAD","","tadā","ind",""
"14","vyāptam","VYĀPT","am","vyāpta","noun-adj",""
"15","avadhāryata","AVADHĀRY","ata","avadhārya","noun-adj",""
"","</page>","","","","",""
"","<page number=""42"">","","","","",""
"18","iti","","","iti","ind",""
"19","na","","","na","ind",""
"20","kārya","KĀRY","a@","kārya","noun-adj",""
"21","mātrāt","MĀTR","āt","mātra","noun-adj",""
"22","puruṣa","PURUṢ","a@","puruṣa","noun-adj",""
"23","ānumānam","ANUMĀN","am","anumāna","noun-adj",""
"24","/","","","","punct",""
"","</s>","","","","",""
"","<s number=""72"">","","","","",""
"1","anyādṛśam","ANYĀDṚŚ","am","anyādṛśa","noun-adj",""
"2","eva","","","eva","ind",""
"3","ca","","","ca","ind",""
"4","kāryaṃ","KĀRY","aṃ","kārya","noun-adj",""
"5","ghaṭa","GHAṬ","a@","ghaṭa","noun-adj",""
"6","ādi","ĀD","i","ādi","noun-adj",""
"7","puruṣa","PURUṢ","a@","puruṣa","noun-adj",""
"8","ānvaya","ANVAY","a@","anvaya","noun-adj",""
"9","vyatireka","VYATIREK","a@","vyatireka","noun-adj",""
"10","ānuvidhāyi","ANUVIDHĀY","i","anuvidhāyin","noun-adj",""
"11","pratipannam","PRATIPANN","am","pratipanna","noun-adj",""
"12","ity","","","iti","ind",""
"13","a","","","alpha_privativum","ind",""
"14","kāmen","KĀM","en","kāma","noun-adj",""
"15","^","","","","",""
"16","āpi","","","api","ind",""
"17","pareṇ","PAR","eṇ","para","noun-adj",""
"18","ābhyupagantavyaṃ.","ĀBHYUPAGAN","tavyaṃ.","ābhyupagana","punct",""
"19","..","","","","punct",""
"20","dibhyo","","","","ind",""
"21","a","","","alpha_privativum","ind",""
"22","kriya","KRIY","a@","kriyā","noun-adj",""
"23","ādarśino","ĀDARŚ","ino","ādarśin","noun-adj",""
"24","api","","","api","ind",""
"25","kṛta","KṚT","a@","kṛta","noun-adj",""
"26","buddhi","BUDDH","i@","buddhi","noun-adj",""
"27","janakebhyo","JANAK","ebhyo","janaka","noun-adj",""
"28","vṛkṣa","VṚKṢ","a@","vṛkṣa","noun-adj",""
"29","ādīnāṃ","ĀD","īnāṃ","ādi","noun-adj",""
"30","vaisādṛśyam","VAISĀDṚŚY","am","vaisādṛśya","noun-adj",""
"31","/","","","","punct",""
"","</s>","","","","",""
"","<s number=""73"">","","","","",""
"1","a","","","alpha_privativum","ind",""
"2","sati","SAT","i","sati","noun-adj",""
"3","ca","","","ca","ind",""
"4","vivāda","VIVĀD","a@","vivāda","noun-adj",""
"5","āspadī","ĀSPAD","ī@","āspada","noun-adj",""
"6","bhūta","BHŪT","a@","bhūta","noun-adj",""
"7","etaratvād","ITAR","atvād","itaratva","noun-adj",""
"8","anyādṛśatve","ANYĀDṚŚ","atve","anyādṛśa","noun-adj",""
"9","śūnya","ŚŪNY","a@","śūnya","noun-adj",""
"10","nagara","NAGAR","a@","nagara","noun-adj",""
"11","dṛṣṭasya","DṚṢṬ","asya","dṛṣṭa","noun-adj",""
"12","deva","DEV","a@","deva","noun-adj",""
"13","kula","KUL","a@","kula","noun-adj",""
"14","āder","ĀD","er","ādi","noun-adj",""
"15","iva","","","iva","ind",""
"16","vṛkṣa","VṚKṢ","a@","vṛkṣa","noun-adj",""
"17","āder","ĀD","er","ādi","noun-adj",""
"18","api","","","api","ind",""
"19","n","","","na","ind",""
"20","^","","","","",""
"21","āsma","","","","ind",""
"22","dādi","DĀD","i@","dādi","noun-adj",""
"23","vilakṣaṇa","VILAKṢAṆ","a@","vilakṣaṇa","noun-adj",""
"24","kartṛ","KART","ṛ@","kartṛ","noun-adj",""
"25","pūrvak","PŪRV","ak@","pūrvaka","noun-adj",""
"26","ānumānam","ANUMĀN","am","anumāna","noun-adj",""
"27","an","","","alpha_privativum","ind",""
"28","avaśyaṃ","AVAŚY","aṃ","avaśya","noun-adj",""
"29","syāt","","","as","verb","as"
"30","/","","","","punct",""
"","</s>","","","","",""
"","<s number=""74"">","","","","",""
"1","ath","","","atha","ind",""
"2","^","","","","",""
"3","ādṛśyatvād","ĀDṚŚY","atvād","ādṛśyatva","noun-adj",""
"4","ev","","","eva","ind",""
"5","^","","","","",""
"6","āsma","","","","ind",""
"7","dāder","DĀD","er","dādi","noun-adj",""
"8","v","","","vā","ind",""
"9","ailakṣa","AILAK","ṣa","ailaka","noun-adj",""
"10","nyaṃ","NYAṂ","","nyaṃa","noun-adj",""
"11","vṛkṣa","VṚKṢ","a@","vṛkṣa","noun-adj",""
"12","ādi","ĀD","i@","ādi","noun-adj",""
"13","vidhātur","VIDHĀT","ur","vidhātṛ","noun-adj",""
"14","abhidhīyate","ABHIDHĪ","yate","abhidhīa","noun-adj",""
"15","/","","","","punct",""
"","</s>","","","","",""
"","<s number=""75"">","","","","",""
"1","tad","TAD","","tadā","ind",""
"2","api","","","api","ind",""
"3","na","","","na","ind",""
"4","yukti","YUKT","i@","yukti","noun-adj",""
"5","mat","MAT","","mat","pron",""
"6","/","","","","punct",""
"","</s>","","","","",""
"","<s number=""76"">","","","","",""
"1","na","","","na","ind",""
"2","hi","","","hi","ind",""
"3","ghaṭa","GHAṬ","a@","ghaṭa","noun-adj",""
"4","viṭapi","VIṬAP","i@","viṭapin","noun-adj",""
"5","kāraṇayor","KĀRAṆ","ayor","kāraṇa","noun-adj",""
"6","dṛśya","DṚŚY","a@","dṛśya","noun-adj",""
"7","ādṛśyatā","ĀDṚŚY","atā","ādṛśyatā","noun-adj",""
"8","mātreṇa","MĀTR","eṇa","mātra","noun-adj",""
"9","vailakṣaṇyam","VAILAKṢAṆY","am","vailakṣaṇya","noun-adj",""
"10","īśvara","ĪŚVAR","a@","īśvara","noun-adj",""
"11","kāraṇa","KĀRAṆ","a@","kāraṇa","noun-adj",""
"12","vādinām","VĀD","inām","vādin","noun-adj",""
"13","iṣṭam","IṢṬ","am","iṣṭa","noun-adj",""
"14","/","","","","punct",""
"","</s>","","","","",""
"","<s number=""77"">","","","","",""
"1","piśa","PIŚ","a@","piśa","noun-adj",""
"2","ā","","","alpha_privativum","ind",""
"3","cāder","CĀD","er","cādi","noun-adj",""
"4","a","","","alpha_privativum","ind",""
"5","dṛśyasya","DṚŚY","asya","dṛśya","noun-adj",""
"6","saṃbhavāt","SAṂBHAV","āt","saṃbhava","noun-adj",""
"7","/","","","","punct",""
"","</s>","","","","",""
"","<s number=""78"">","","","","",""
"1","na","","","na","ind",""
"2","ca","","","ca","ind",""
"3","ya","","","yad","pron",""
"4","eva","","","eva","ind",""
"5","vṛkṣa","VṚKṢ","a@","vṛkṣa","noun-adj",""
"6","ādikārī","ĀDIK","ārī","ādika","noun-adj",""
"7","puruṣo","PURUṢ","o","puruṣa","noun-adj",""
"8","asmad","","","asmat","pron",""
"9","ādīnām","ĀD","īnām","ādi","noun-adj",""
"10","a","","","alpha_privativum","ind",""
"11","dṛśyaḥ","DṚŚY","aḥ","dṛśya","noun-adj",""
"12","sa","","","sa_saha","ind",""
"13","ev","","","eva","ind",""
"14","eśvara","EŚVAR","a","eśvara","noun-adj",""
"15","iti","","","iti","ind",""
"16","/","","","","punct",""
"","</s>","","","","",""
"","<s number=""79"">","","","","",""
"1","śakyate","ŚAK","yate","śakn","verb","śak"
"2","vaktum","VAKT","um","vak","verb","vac"
"3","/","","","","punct",""
"","</s>","","","","",""
"","<s number=""80"">","","","","",""
"1","ka","","","kim","pron",""
"2","eva","","","eva","ind",""
"3","hi","","","hi","ind",""
"4","viśva","VIŚV","a@","viśva","noun-adj",""
"5","nirmāṇa","NIRMĀṆ","a@","nirmāṇa","noun-adj",""
"6","pravīṇaḥ","PRAVĪṆ","aḥ","pravīṇa","noun-adj",""
"7","sarva","SARV","a@","sarva","noun-adj",""
"8","pada","PAD","a@","pada","noun-adj",""
"9","ārtha","ARTH","a@","artha","noun-adj",""
"10","paramārthañaḥ","PARAMĀRTH","añaḥ","paramārtha","noun-adj",""
"11","puruṣa","PURUṢ","a@","puruṣa","noun-adj",""
"12","viśeṣo","VIŚEṢ","o","viśeṣa","noun-adj",""
"13","maheśvara","MAHEŚVAR","a","maheśvara","noun-adj",""
"14","iti","","","iti","ind",""
"15","teṣām","","","tad","pron",""
"16","abhipretam","ABHIPRET","am","abhipreta","noun-adj",""
"17","/","","","","punct",""
"","</s>","","","","",""
"","<s number=""81"">","","","","",""
"1","na","","","na","ind",""
"2","c","","","ca","ind",""
"3","^","","","","",""
"4","ādṛśya","ADṚŚY","a@","adṛśya","noun-adj",""
"5","kartṛka","KARTṚK","a@","kartṛka","noun-adj",""
"6","pūrvakatā","PŪRV","akatā","pūrvaka","noun-adj",""
"7","prasiddhāv","PRASIDDH","āv","prasiddha","noun-adj",""
"8","api","","","api","ind",""
"9","sajātīyānām","SAJĀTĪY","ānām","sajātīya","noun-adj",""
"10","api","","","api","ind",""
"11","tarūṇām","","","","ind",""
"12","eka","EK","a@","eka","noun-adj",""
"13","kartṛkatā","KARTṚK","atā","kartṛka","noun-adj",""
"14","sidhyati","SIDH","yati","sidh","verb",""
"15","/","","","","punct",""
"","</s>","","","","",""
"","<s number=""82"">","","","","",""
"1","prāg","PRĀG","","prāñc","noun-adj",""
"2","eva","","","eva","ind",""
"3","nagara","NAGAR","a@","nagara","noun-adj",""
"4","nadī","NAD","ī@","nadī","noun-adj",""
"5","parvata","PARVAT","a@","parvata","noun-adj",""
"6","ādīnām","ĀD","īnām","ādi","noun-adj",""
"7","ekāntena","EKĀNT","ena","ekānta","noun-adj",""
"8","paraspara","PARASPAR","a@","paraspara","noun-adj",""
"9","vijātīyānāṃ","VIJĀTĪY","ānāṃ","vijātīya","noun-adj",""
"10","/","","","","punct",""
"","</s>","","","","",""
"","<s number=""83"">","","","","",""
"1","na","","","na","ind",""
"2","hi","","","hi","ind",""
"3","dṛśya","DṚŚY","a@","dṛśya","noun-adj",""
"4","kartṛ","KART","ṛ@","kartṛ","noun-adj",""
"5","pūrvakāṇām","PŪRV","akāṇām","pūrvaka","noun-adj",""
"6","api","","","api","ind",""
"7","ghaṭa","GHAṬ","a@","ghaṭa","noun-adj",""
"8","ādīnām","ĀD","īnām","ādi","noun-adj",""
"9","eka","EK","a@","eka","noun-adj",""
"10","kartṛkatā","KARTṚK","atā","kartṛka","noun-adj",""
"11","pratīyate","PRATĪ","yate","pratīa","noun-adj",""
"12","/","","","","punct",""
"","</s>","","","","",""
"","<s number=""84"">","","","","",""
"1","atha","","","atha","ind",""
"2","manyeta","MAN","yeta","man","verb","man"
"3","/","","","","punct",""
"","</s>","","","","",""
"","<s number=""85"">","","","","",""
"1","jānīma","JĀN","īma","jāna","noun-adj",""
"2","eva","","","eva","ind",""
"3","vayam","VAYAM","","asmat","pron",""
"4","ātma","ĀTM","a@","ātman","noun-adj",""
"5","ātmamānānāṃ","ĀTMAMĀN","ānāṃ","ātmamāna","noun-adj",""
"6","sāmarthya","SĀMARTHY","a@","sāmarthya","noun-adj",""
"7","gocaram","GOCAR","am","gocara","noun-adj",""
"8","/","","","","punct",""
"","</s>","","","","",""
"","<s number=""86"">","","","","",""
"1","na","","","na","ind",""
"2","c","","","ca","ind",""
"3","^","","","","",""
"4","āsma","","","","ind",""
"5","dādi","DĀD","i@","dādi","noun-adj",""
"6","janena","JAN","ena","jana","noun-adj",""
"7","śakten","ŚAKT","en","śakta","noun-adj",""
"8","^","","","","",""
"9","āpi","","","api","ind",""
"10","nirmātum","NIRMĀT","um","nirmātu","noun-adj",""
"11","amī","","","adas","pron",""
"12","pāryante","PĀR","yante","pāra","noun-adj",""
"13","parvata","PARVAT","a@","parvata","noun-adj",""
"14","ādayaḥ","ĀD","ayaḥ","ādi","noun-adj",""
"15","/","","","","punct",""
"","</s>","","","","",""
"","<s number=""87"">","","","","",""
"1","tataḥ","","","tatas","ind",""
"2","parvata","PARVAT","a@","parvata","noun-adj",""
"3","ādīnāṃ","ĀD","īnāṃ","ādi","noun-adj",""
"4","racayitā","RACAYIT","ā","racayitṛ","noun-adj",""
"5","sidhyann","SIDH","yann","sidh","verb",""
"6","asma","","","","ind",""
"7","dādi","DĀD","i@","dādi","noun-adj",""
"8","vilakṣaṇa","VILAKṢAṆ","a","vilakṣaṇa","noun-adj",""
"9","eva","","","eva","ind",""
"10","sidhyati","SIDHY","ati","sidh","verb",""
"11","iti","","","iti","ind",""
"12","/","","","","punct",""
"","</s>","","","","",""
"","<s number=""88"">","","","","",""
"1","vismaraṇa","VISMARAṆ","a@","vismaraṇa","noun-adj",""
"2","śīlo","ŚĪL","o","śīla","noun-adj",""
"3","devānāṃ","DEV","ānāṃ","deva","noun-adj",""
"4","priyaḥ","PRIY","aḥ","priya","noun-adj",""
"5","prakaraṇaṃ","PRAKARAṆ","aṃ","prakaraṇa","noun-adj",""
"6","na","","","na","ind",""
"7","lakṣayati","LAKṢ","ayati","lakṣ","verb","lakṣ"
"8","/","","","","punct",""
"","</s>","","","","",""
"","<s number=""89"">","","","","",""
"1","tathā","","","tathā","ind",""
"2","h","","","hi","ind",""
"3","īdam","ĪDAM","","idam","pron",""
"4","atra","","","atra","ind",""
"5","prakṛtam","PRAKṚT","am","prakṛta","noun-adj",""
"6","/","","","","punct",""
"7","īśvara","ĪŚVAR","a@","īśvara","noun-adj",""
"8","vādin","VĀD","in","vādin","noun-adj",""
"9","^","","","","",""
"10","āpi","","","api","ind",""
"11","vṛkṣa","VṚKṢ","a@","vṛkṣa","noun-adj",""
"12","ādīnāṃ","ĀD","īnāṃ","ādi","noun-adj",""
"13","ghaṭa","GHAṬ","a@","ghaṭa","noun-adj",""
"14","ādibhyo","ĀD","ibhyo","ādi","noun-adj",""
"15","vailakṣaṇyaṃ","VAILAKṢAṆY","aṃ","vailakṣaṇya","noun-adj",""
"16","niyamen","NIYAM","en","niyama","noun-adj",""
"17","ābhyupagantavyam","ĀBHYUPAGAN","tavyam","ābhyupagana","noun-adj",""
"18","/","","","","punct",""
"","</s>","","","","",""
"","<s number=""90"">","","","","",""
"1","anya","ANY","a@","anya","noun-adj",""
"2","puruṣa","PURUṢ","a@","puruṣa","noun-adj",""
"3","kāryebhyo","KĀRY","ebhyo","kārya","noun-adj",""
"4","viśeṣam","VIŚEṢ","am","viśeṣa","noun-adj",""
"5","anubhavantaḥ","ANUBHAV","antaḥ","anubhavat","noun-adj",""
"6","katham","KATHAM","","katham","ind",""
"7","amī","","","adas","pron",""
"8","tad","TAD","","tadā","ind",""
"9","vilakṣaṇena","VILAKṢAṆ","ena","vilakṣaṇa","noun-adj",""
"10","kartrā","KARTR","ā","kartra","noun-adj",""
"","</page>","","","","",""
"","<page number=""43"">","","","","",""
"13","kṛtāḥ","KṚT","āḥ","kṛta","noun-adj",""
"14","sādhyerann","SĀDHY","erann","sādhya","noun-adj",""
"15","iti","","","iti","ind",""
"16","/","","","","punct",""
"","</s>","","","","",""
"","<s number=""91"">","","","","",""
"1","tato","","","tatas","ind",""
"2","yady","","","yadi","ind",""
"3","ayam","AYAM","","idam","pron",""
"4","idānīm","IDĀN","īm","idāni","noun-adj",""
"5","asmad","","","asmat","pron",""
"6","ādyati","ĀD","yati","ād","verb",""
"7","śāyi","ŚĀY","i@","śāyin","noun-adj",""
"8","puruṣa","PURUṢ","a@","puruṣa","noun-adj",""
"9","prasiddhi","PRASIDDH","i@","prasiddhi","noun-adj",""
"10","pratyāśayā","PRATYĀŚ","ayā","pratyāśā","noun-adj",""
"11","asmad","","","asmat","pron",""
"12","ādya","ĀDY","a@","ādya","noun-adj",""
"13","śakya","ŚAKY","a@","śakya","noun-adj",""
"14","kriyatayā","KRIY","atayā","kriyā","noun-adj",""
"15","asma","","","","ind",""
"16","dādi","DĀD","i@","dādi","noun-adj",""
"17","kāryebhyo","KĀRY","ebhyo","kārya","noun-adj",""
"18","vṛkṣa","VṚKṢ","a@","vṛkṣa","noun-adj",""
"19","ādīnāṃ","ĀD","īnāṃ","ādi","noun-adj",""
"20","vailakṣaṇyam","VAILAKṢAṆY","am","vailakṣaṇya","noun-adj",""
"21","ācakṣīta","ĀCAKṢ","īta","ācakṣas","noun-adj",""
"22","/","","","","punct",""
"","</s>","","","","",""
"","<s number=""92"">","","","","",""
"1","tadā","","","tadā","ind",""
"2","siddham","SIDDH","am","siddha","noun-adj",""
"3","eṣām","","","idam","pron",""
"4","anyādṛśatvam","ANYĀDṚŚ","atvam","anyādṛśa","noun-adj",""
"5","/","","","","punct",""
"","</s>","","","","",""
"","<s number=""93"">","","","","",""
"1","siddhe","SIDDH","e","siddha","noun-adj",""
"2","c","","","ca","ind",""
"3","^","","","","",""
"4","ān","","","alpha_privativum","ind",""
"5","yādṛśatve","YĀDṚŚ","atve","yādṛśa","noun-adj",""
"6","na","","","na","ind",""
"7","ghaṭa","GHAṬ","a@","ghaṭa","noun-adj",""
"8","ādīnāṃ","ĀD","īnāṃ","ādi","noun-adj",""
"9","kāryāṇāṃ","KĀRY","āṇāṃ","kārya","noun-adj",""
"10","pauruṣeyatva","PAURUṢEY","atva","pauruṣeya","noun-adj",""
"11","prasiddhā","PRASIDDH","ā","prasiddha","noun-adj",""
"12","sarvasya","SARV","asya","sarva","noun-adj",""
"13","kāryasya","KĀRY","asya","kārya","noun-adj",""
"14","pauruṣeyatā","PAURUṢEY","atā","pauruṣeya","noun-adj",""
"15","vyāptiḥ","VYĀPT","iḥ","vyāpti","noun-adj",""
"16","sidhyati","SIDHY","ati","sidh","verb",""
"17","iti","","","iti","ind",""
"18","salila","SALIL","a@","salila","noun-adj",""
"19","āñjalir","AÑJAL","ir","añjali","noun-adj",""
"20","īśvara","ĪŚVAR","a@","īśvara","noun-adj",""
"21","siddhaye","SIDDH","aye","siddhi","noun-adj",""
"22","deyaḥ","DEY","aḥ","deya","noun-adj",""
"23","/","","","","punct",""
"","</s>","","","","",""
"","<s number=""94"">","","","","",""
"1","atha","","","atha","ind",""
"2","pratyakṣa","PRATYAKṢ","a@","pratyakṣa","noun-adj",""
"3","bādhi","BĀDH","i@","bādhi","noun-adj",""
"4","tatvān","TATV","ān","tatva","noun-adj",""
"5","na","","","na","ind",""
"6","kārya","KĀRY","a@","kārya","noun-adj",""
"7","mātram","MĀTR","am","mātra","noun-adj",""
"8","agni","AGN","i@","agni","noun-adj",""
"9","vyāptaṃ","VYĀPT","aṃ","vyāpta","noun-adj",""
"10","pratīyate","PRATĪ","yate","pratīa","noun-adj",""
"11","/","","","","punct",""
"","</s>","","","","",""
"","<s number=""95"">","","","","",""
"1","puruṣeṇa","PURUṢ","eṇa","puruṣa","noun-adj",""
"2","vyāptiḥ","VYĀPT","iḥ","vyāpti","noun-adj",""
"3","punar","","","punar","ind",""
"4","a","","","alpha_privativum","ind",""
"5","dṛśyatvāt","DṚŚY","atvāt","dṛśyatva","noun-adj",""
"6","tasya","","","tad","pron",""
"7","na","","","na","ind",""
"8","pratyakṣeṇa","PRATYAKṢ","eṇa","pratyakṣa","noun-adj",""
"9","bādhyate","BĀDH","yate","bādh","verb","bādh"
"10","tṛṇa","TṚṆ","a@","tṛṇa","noun-adj",""
"11","ādau","ĀD","au","ād","verb",""
"12","/","","","","punct",""
"","</s>","","","","",""
"","<s number=""96"">","","","","",""
"1","tad","TAD","","tadā","ind",""
"2","etad","ETAD","","tad","pron",""
"3","api","","","api","ind",""
"4","nyāya","NYĀY","a@","nyāya","noun-adj",""
"5","ācāryasya","ĀCĀRY","asya","ācārya","noun-adj",""
"6","bhāṣitam","BHĀṢIT","am","bhāṣita","noun-adj",""
"7","/","","","","punct",""
"","</s>","","","","",""
"","<s number=""97"">","","","","",""
"1","tathā","","","tathā","ind",""
"2","hy","","","hi","ind",""
"3","atra","","","atra","ind",""
"4","vikalpa","VIKALP","a@","vikalpa","noun-adj",""
"5","dvayam","DVAY","am","dvaya","noun-adj",""
"6","/","","","","punct",""
"","</s>","","","","",""
"","<s number=""98"">","","","","",""
"1","yad","","","yadi","ind",""
"2","yad","","","yadi","ind",""
"3","agni","AGN","i@","agni","noun-adj",""
"4","vyāptiṃ","VYĀPT","iṃ","vyāpti","noun-adj",""
"5","kāryasya","KĀRY","asya","kārya","noun-adj",""
"6","gṛhṇāti","GṚHṆ","āti","gṛhṇa","noun-adj",""
"7","tat","TAT","","tad","pron",""
"8","pratyakṣaṃ","PRATYAKṢ","aṃ","pratyakṣa","noun-adj",""
"9","pramāṇam","PRAMĀṆ","am","pramāṇa","noun-adj",""
"10","a","","","alpha_privativum","ind",""
"11","pramāṇaṃ","PRAMĀṆ","aṃ","pramāṇa","noun-adj",""
"12","vā","","","vā","ind",""
"13","syāt","","","as","verb","as"
"14","/","","","","punct",""
"","</s>","","","","",""
"","<s number=""99"">","","","","",""
"1","yadi","","","yadi","ind",""
"2","tāvat","TĀVAT","","tāvat","ind",""
"3","tat","TAT","","tad","pron",""
"4","pramāṇaṃ","PRAMĀṆ","aṃ","pramāṇa","noun-adj",""
"5","kathaṃ","","","katham","ind",""
"6","tasya","","","tad","pron",""
"7","pramāṇa","PRAMĀṆ","a@","pramāṇa","noun-adj",""
"8","āntareṇa","ANTAR","eṇa","antara","noun-adj",""
"9","bādhaḥ","BĀDH","aḥ","bādha","noun-adj",""
"10","/","","","","punct",""
"","</s>","","","","",""
"","<s number=""100"">","","","","",""
"1","athā","","","","ind",""
"2","pramāṇaṃ","PRAMĀṆ","aṃ","pramāṇa","noun-adj",""
"3","dhūmasy","DHŪMAS","y","dhūmasi","noun-adj",""
"4","^","","","","",""
"5","āpi","","","api","ind",""
"6","tena","","","tad","pron",""
"7","vahni","VAHN","i@","vahni","noun-adj",""
"8","vyāptir","VYĀPT","ir","vyāpti","noun-adj",""
"9","a","","","alpha_privativum","ind",""
"10","śakyā","ŚAKY","ā","śakya","noun-adj",""
"11","sādhayitum","SĀDH","ayitum","sādh","verb","sādh"
"12","/","","","","punct",""
"","</s>","","","","",""
"","<s number=""101"">","","","","",""
"1","atha","","","atha","ind",""
"2","dhūma","DHŪM","a@","dhūma","noun-adj",""
"3","kāryasya","KĀRY","asya","kārya","noun-adj",""
"4","vahni","VAHN","i@","vahni","noun-adj",""
"5","vyāptiṃ","VYĀPT","iṃ","vyāpti","noun-adj",""
"6","sādhayati","SĀDH","ayati","sādh","verb","sādh"
"7","kāryatvenā","KĀRY","atvenā","kāryatva","noun-adj",""
"8","viśeṣād","VIŚEṢ","ād","viśeṣa","noun-adj",""
"9","anyasy","ANY","asy","anya","noun-adj",""
"10","^","","","","",""
"11","āpi","","","api","ind",""
"12","kiṃ","","","kim","pron",""
"13","na","","","na","ind",""
"14","sādhayati","SĀDH","ayati","sādh","verb","sādh"
"15","iti","","","iti","ind",""
"16","dus","","","duḥ","ind",""
"17","tara","TAR","a@","tara","noun-adj",""
"18","vyasana","VYASAN","a@","vyasana","noun-adj",""
"19","śaṃka","ŚAṄK","a@","śaṅkā","noun-adj",""
"20","ā","","","alpha_privativum","ind",""
"21","praveśaḥ","PRAVEŚ","aḥ","praveśa","noun-adj",""
"22","/","","","","punct",""
"","</s>","","","","",""
"","<s number=""102"">","","","","",""
"1","atha","","","atha","ind",""
"2","viśiṣṭam","VIŚIṢṬ","am","viśiṣṭa","noun-adj",""
"3","eva","","","eva","ind",""
"4","kāryaṃ","KĀRY","aṃ","kārya","noun-adj",""
"5","vahni","VAHN","i@","vahni","noun-adj",""
"6","nāntarīyakam","NĀNTARĪYAK","am","nāntarīyaka","noun-adj",""
"7","iti","","","iti","ind",""
"8","na","","","na","ind",""
"9","tad","TAD","","tadā","ind",""
"10","vijātīyasya","VIJĀTĪY","asya","vijātīya","noun-adj",""
"11","kāryasya","KĀRY","asya","kārya","noun-adj",""
"12","vahni","VAHN","i@","vahni","noun-adj",""
"13","vyāptatv","VYĀPT","atv","vyāptatva","noun-adj",""
"14","āvasāyaḥ","ĀVASĀY","aḥ","āvasāyin","noun-adj",""
"15","/","","","","punct",""
"","</s>","","","","",""
"","<s number=""103"">","","","","",""
"1","viśiṣṭam","VIŚIṢṬ","am","viśiṣṭa","noun-adj",""
"2","eva","","","eva","ind",""
"3","tarhi","","","tarhi","ind",""
"4","kāryaṃ","KĀRY","aṃ","kārya","noun-adj",""
"5","puruṣa","PURUṢ","a@","puruṣa","noun-adj",""
"6","nāntarīyakam","NĀNTARĪYAK","am","nāntarīyaka","noun-adj",""
"7","iti","","","iti","ind",""
"8","na","","","na","ind",""
"9","tad","TAD","","tadā","ind",""
"10","vijātīyasya","VIJĀTĪY","asya","vijātīya","noun-adj",""
"11","puruṣa","PURUṢ","a@","puruṣa","noun-adj",""
"12","vyāptatv","VYĀPT","atv","vyāptatva","noun-adj",""
"13","āvasāya","ĀVASĀY","a","āvasāyin","noun-adj",""
"14","iti","","","iti","ind",""
"15","na","","","na","ind",""
"16","pratyakṣa","PRATYAKṢ","a@","pratyakṣa","noun-adj",""
"17","bādha","BĀDH","a@","bādha","noun-adj",""
"18","ābādhayor","ĀBĀDH","ayor","ābādha","noun-adj",""
"19","upakṣepaḥ","UPAKṢEP","aḥ","upakṣepa","noun-adj",""
"20","s","","","su","ind",""
"21","ādhīyān","ADHĪYĀN","","adhīyāna","noun-adj",""
"22","/","","","","punct",""
"","</s>","","","","",""
"","<s number=""104"">","","","","",""
"1","asmad","","","asmat","pron",""
"2","ādya","ĀDY","a@","ādya","noun-adj",""
"3","sāmarthyam","SĀMARTHY","am","sāmarthya","noun-adj",""
"4","a","","","alpha_privativum","ind",""
"5","tattvam","TATTV","am","tad","pron",""
"6","/","","","","punct",""
"","</s>","","","","",""
"","<s number=""105"">","","","","",""
"1","yadi","","","yadi","ind",""
"2","bhaved","BHAV","ed","bhav","verb","bhū"
"3","darśana","DARŚAN","a@","darśana","noun-adj",""
"4","ādarśanābhyāṃ","ĀDARŚAN","ābhyāṃ","ādarśana","noun-adj",""
"5","vyāptiḥ","VYĀPT","iḥ","vyāpti","noun-adj",""
"6","/","","","","punct",""
"","</s>","","","","",""
"","<s number=""106"">","","","","",""
"1","sādhya","SĀDHY","a@","sādhya","noun-adj",""
"2","sādhanayor","SĀDHAN","ayor","sādhana","noun-adj",""
"3","a","","","alpha_privativum","ind",""
"4","pratibandhavatāṃ","PRATIBANDH","avatāṃ","pratibandhavat","noun-adj",""
"5","tadā","","","tadā","ind",""
"6","na","","","na","ind",""
"7","kārya","KĀRY","a@","kārya","noun-adj",""
"8","mātrasya","MĀTR","asya","mātra","noun-adj",""
"9","puruṣa","PURUṢ","a@","puruṣa","noun-adj",""
"10","pūrvakatayā","PŪRV","akatayā","pūrvaka","noun-adj",""
"11","vyāptir","VYĀPT","ir","vyāpti","noun-adj",""
"12","upavarṇayituṃ","UPAVARṆ","ayituṃ","upavarṇ","verb",""
"13","yuktā","YUKT","ā","yukta","noun-adj",""
"14","/","","","","punct",""
"","</s>","","","","",""
"","<s number=""107"">","","","","",""
"1","puruṣa","PURUṢ","a@","puruṣa","noun-adj",""
"2","vyāpāra","VYĀPĀR","a@","vyāpāra","noun-adj",""
"3","ādarśane","ĀDARŚAN","e","ādarśana","noun-adj",""
"4","api","","","api","ind",""
"5","tṛṇa","TṚṆ","a@","tṛṇa","noun-adj",""
"6","ādīnām","ĀD","īnām","ādi","noun-adj",""
"7","udaya","UDAY","a@","udaya","noun-adj",""
"8","mānānām","MĀN","ānām","māna","noun-adj",""
"9","upalambhāt","UPALAMBH","āt","upalambha","noun-adj",""
"10","/","","","","punct",""
"","</s>","","","","",""
"","<s number=""108"">","","","","",""
"1","atha","","","atha","ind",""
"2","pratibandhani","PRATIBANDHAN","i@","pratibandhana","noun-adj",""
"3","bandhanā","BANDHAN","ā","bandhana","noun-adj",""
"4","tada","TAD","a","tadā","ind",""
"5","^","","","","",""
"6","āpi","","","api","ind",""
"7","na","","","na","ind",""
"8","kārya","KĀRY","a@","kārya","noun-adj",""
"9","mātrasya","MĀTR","asya","mātra","noun-adj",""
"10","puruṣa","PURUṢ","a@","puruṣa","noun-adj",""
"11","pūrvakatayā","PŪRV","akatayā","pūrvaka","noun-adj",""
"12","vyāptir","VYĀPT","ir","vyāpti","noun-adj",""
"13","upavarṇayituṃ","UPAVARṆ","ayituṃ","upavarṇ","verb",""
"14","yuktā","YUKT","ā","yukta","noun-adj",""
"15","/","","","","punct",""
"","</s>","","","","",""
"","<s number=""109"">","","","","",""
"1","tasy","","","tad","pron",""
"2","^","","","","",""
"3","aiva","","","eva","ind",""
"4","pratibandha","PRATIBANDH","a@","pratibandha","noun-adj",""
"5","siddher","SIDDH","er","siddhi","noun-adj",""
"6","a","","","alpha_privativum","ind",""
"7","siddher","SIDDH","er","siddhi","noun-adj",""
"8","ity","","","iti","ind",""
"9","alaṃ","","","alam","ind",""
"10","bahu","BAH","u@","bahu","noun-adj",""
"11","bhāṣitayā","BHĀṢIT","ayā","bhāṣitā","noun-adj",""
"12","/","","","","punct",""
"","</s>","","","","",""
"","<s number=""110"">","","","","",""
"1","tasmād","TASMĀD","","tad","pron",""
"2","avasthitam","AVASTHIT","am","avasthita","noun-adj",""
"3","etat","ETAT","","tad","pron",""
"4","/","","","","punct",""
"","</s>","","","","",""
"","<s number=""111"">","","","","",""
"1","a","","","alpha_privativum","ind",""
"2","kartṛkam","KARTṚK","am","kartṛka","noun-adj",""
"3","idam","IDAM","","idam","pron",""
"4","//","","","","punct",""
"","</s>","","","","",""
"","</page>","","","","",""
"","</doc>","","","","",""
