"WordID","word","NormSTEM","suffix","lemma","PoS","Root"
"","<doc textid = ""hevajrasahajasadyoga"" genre = ""tantra"" title = ""hevajrasahajasadyoga"" author = ""ratnākaraśānti"" discourse = ""tantra"" tradition = ""tantra"" period = ""commentarial"" source = ""cts accessed july 2021"" date_range = ""11. ce"" notes = """" religion = ""buddh"" edition = ""based on isācson. 2002a. ratnākaraśānti. hevajrasahajasadyoga. utf8-encoded e-text. hamburg: centre for tantric studies 2007. http://www.tantric-studies.uni-hamburg.de/e-texts/bauddha/hesasa.txt. source: raffaele torella; ed. 2001. le parole e i marmi: studi in onore di raniero gnoli nel suo 70° compleanno. serie orientale roma xcī. vol.1. roma: istituto italiano per l’africa e l’oriente. isio; pp.457–487."" digitization = ""h. isācson; revision 1.0 input may 7 2007"" segmentation_lemmatization = ""ligeia lugli & buddhist translators workbench team"" metadata_enrichment = ""bruno galasek-hul & buddhist translators workbench team"" proofreader = ""n/a"" permission = ""permission for segmentation & lemmatization from h. isācson for cts hamburg"" reconstructions = ""none"">","","","","",""
"","<page number=""463"">","","","","",""
"","<s number=""1"">","","","","",""
"1","namo","NAM","o","namas","noun-adj",""
"2","vajraḍākāya","VAJRAḌĀK","āya","vajraḍāka","noun-adj",""
"3","//","","","","punct",""
"","</s>","","","","",""
"","<page number=""0000"">","","","","",""
"","<s number=""2"">","","","","",""
"1","hevajrasa","HEVAJR","asa","hevajra","noun-adj",""
"2","niṣyandaṃ","NIṢYAND","aṃ","niṣyanda","noun-adj",""
"3","paramaṃ","PARAM","aṃ","parama","noun-adj",""
"4","praṇipatya","PRAṆIPAT","ya","praṇipat","verb",""
"5","yoginī","YOG","inī","yogin","noun-adj",""
"6","cakram","CAKR","am","cakra","noun-adj",""
"7","/","","","","punct",""
"8","syād","","","as","verb","as"
"9","utpannaka","UTPANN","aka@","utpanna","noun-adj",""
"10","pakṣe","PAKṢ","e","pakṣa","noun-adj",""
"11","yath","","","yathā","ind",""
"12","ābhisamayas","ABHISAMAY","as","abhisamaya","noun-adj",""
"13","tathā","","","tathā","ind",""
"14","vakṣye","VAKṢ","ye","vak","verb","vac"
"15","//","","","","punct",""
"16","1","","","","ind",""
"17","//","","","","punct",""
"","</s>","","","","",""
"","<s number=""3"">","","","","",""
"1","kha","","","","ind",""
"2","dhātau","DHĀT","au","dhātu","noun-adj",""
"3","ca","","","ca","ind",""
"4","bhagaṃ","BHAG","aṃ","bhaga","noun-adj",""
"5","dh","","","","ind",""
"6","yātvā","YĀT","vā","yāta","noun-adj",""
"7","madhye","MADHY","e","madhya","noun-adj",""
"8","kurvīta","KURV","īta","kurvat","noun-adj",""
"9","bhāvanām","BHĀVAN","ām","bhāvanā","noun-adj",""
"10","/","","","","punct",""
"11","cakraṃ","CAKR","aṃ","cakra","noun-adj",""
"12","pūrvaṃ","PŪRV","aṃ","pūrva","noun-adj",""
"13","yathā","","","yathā","ind",""
"14","nyāyaṃ","NYĀY","aṃ","nyāya","noun-adj",""
"15","devatānāṃ","DEVAT","ānāṃ","devatā","noun-adj",""
"16","yath","","","yathā","ind",""
"17","odayam","UDAY","am","udaya","noun-adj",""
"18","//","","","","punct",""
"19","2","","","","ind",""
"20","//","","","","punct",""
"","</s>","","","","",""
"","<s number=""4"">","","","","",""
"1","ity","","","iti","ind",""
"2","uddeśaḥ","UDDEŚ","aḥ","uddeśa","noun-adj",""
"3","/","","","","punct",""
"","</s>","","","","",""
"","<s number=""5"">","","","","",""
"1","ayam","","","idam","pron",""
"2","asy","","","as","verb","as"
"3","ārthaḥ","ARTH","aḥ","artha","noun-adj",""
"4","/","","","","punct",""
"","</s>","","","","",""
"","<s number=""6"">","","","","",""
"1","sthāne","STHĀN","e","sthāna","noun-adj",""
"2","karaṇam","KARAṆ","am","karaṇa","noun-adj",""
"3","āveśya","ĀVEŚ","ya","āveś","verb","āviś"
"4","kriyāṃ","KRIY","āṃ","kriyā","noun-adj",""
"5","kurvīta","KURV","īta","kurvat","noun-adj",""
"6","sādhakaḥ","SĀDH","akaḥ","sādhaka","noun-adj",""
"7","/","","","","punct",""
"8","phalaṃ","PHAL","aṃ","phala","noun-adj",""
"9","tu","","","tu","ind",""
"10","yoginī","YOG","inī","yogin","noun-adj",""
"11","cakraṃ","CAKR","aṃ","cakra","noun-adj",""
"12","tan","TAN","","tad","pron",""
"13","niṣyandaś","NIṢYAND","aś","niṣyanda","noun-adj",""
"14","ca","","","ca","ind",""
"15","herukaḥ","HERUK","aḥ","heruka","noun-adj",""
"16","//","","","","punct",""
"17","3","","","","ind",""
"18","//","","","","punct",""
"","</s>","","","","",""
"","<s number=""7"">","","","","",""
"1","iti","","","iti","ind",""
"2","/","","","","punct",""
"3","utpatti","UTPATT","i@","utpatti","noun-adj",""
"4","pakṣe","PAKṢ","e","pakṣa","noun-adj",""
"5","ya","","","yad","pron",""
"6","ānandāś","ĀNAND","āś","ānanda","noun-adj",""
"7","catvāras","CATVĀR","as","catur","noun-adj",""
"8","teṣāṃ","","","tad","pron",""
"9","yas","","","yad","pron",""
"10","tṛtīyaḥ","TṚTĪY","aḥ","tṛtīya","noun-adj",""
"11","paramāt","PARAM","āt","parama","noun-adj",""
"12","paro","PAR","o","para","noun-adj",""
"13","viramāt","VIRAM","āt","virama","noun-adj",""
"14","pūrvaḥ","PŪRV","aḥ","pūrva","noun-adj",""
"15","sa","","","sa_saha","ind",""
"16","khalu","KHAL","u","khal","verb",""
"17","sahaja","SAHAJ","a@","sa_saha","ind",""
"18","ānandaḥ","ĀNAND","aḥ","ānanda","noun-adj",""
"19","/","","","","punct",""
"","</s>","","","","",""
"","<s number=""8"">","","","","",""
"1","sa","","","sa_saha","ind",""
"2","ev","","","eva","ind",""
"3","ātra","ĀTR","a","atra","noun-adj",""
"4","dvividho","DVIVIDH","o","dvividha","noun-adj",""
"5","dvividhaṃ","DVIVIDH","aṃ","dvividha","noun-adj",""
"6","phalam","PHAL","am","phala","noun-adj",""
"7","iṣyate","IṢ","yate","icch","verb","iṣ1"
"7","iṣyate","IṢ","yate","eṣ","verb","iṣ2"
"8","/","","","","punct",""
"9","eka","EK","a@","eka","noun-adj",""
"10","m","M","","ma","noun-adj",""
"11","ākāśa","ĀKĀŚ","a@","ākāśa","noun-adj",""
"12","saṃkā","SAṂK","ā@","saṃkā","noun-adj",""
"13","śam","ŚAM","","śama","noun-adj",""
"14","anyat","ANY","at","anyat","noun-adj",""
"15","pūrṇa","PŪRṆ","a@","pūrṇa","noun-adj",""
"16","endu","END","u@","endh","noun-adj",""
"17","saṃnibham","SAṂNIBH","am","saṃnibha","noun-adj",""
"18","//","","","","punct",""
"19","4","","","","ind",""
"20","//","","","","punct",""
"","</s>","","","","",""
"","<s number=""9"">","","","","",""
"1","nabhon","NABH","on","nabha","noun-adj",""
"2","ibhaṃ","IBH","aṃ","ibha","noun-adj",""
"3","yad","","","yadi","ind",""
"4","anayor","","","idam","pron",""
"5","dharmakāyaḥ","DHARMAKĀY","aḥ","dharmakāya","noun-adj",""
"6","sa","","","sa_saha","ind",""
"7","tāyinām","TĀY","inām","tāyin","noun-adj",""
"8","/","","","","punct",""
"9","yat","","","yad","pron",""
"10","punaḥ","","","punar","ind",""
"11","pūrṇacandra","PŪRṆACANDR","a@","pūrṇacandra","noun-adj",""
"12","ābhaḥ","ĀBH","aḥ","ābha","noun-adj",""
"13","s","","","su","ind",""
"14","^","","","","",""
"15","aiva","","","eva","ind",""
"16","sāma","SĀM","a@","sāma","noun-adj",""
"17","bhogikī","BHOGIK","ī","bhogika","noun-adj",""
"18","tan","TAN","","tad","pron",""
"19","uḥ","","","","ind",""
"20","//","","","","punct",""
"21","5","","","","ind",""
"22","//","","","","punct",""
"","</s>","","","","",""
"","<s number=""10"">","","","","",""
"1","tad","","","tad","pron",""
"2","eva","","","eva","ind",""
"3","yoginī","YOG","inī","yogin","noun-adj",""
"4","cakraṃ","CAKR","aṃ","cakra","noun-adj",""
"5","yad","","","yadi","ind",""
"6","eva","","","eva","ind",""
"7","jñānam","JÑĀN","am","jñāna","noun-adj",""
"8","advayam","ADVAY","am","advaya","noun-adj",""
"9","/","","","","punct",""
"10","mahāsukhaṃ","MAHĀSUKH","aṃ","mahāsukha","noun-adj",""
"11","yathā","","","yathā","ind",""
"12","nte","","","","ind",""
"13","tat","","","tad","pron",""
"14","tathā","","","tathā","ind",""
"15","dāv","DĀV","","dāva","noun-adj",""
"16","apy","","","api","ind",""
"17","a","","","alpha_privativum","ind",""
"18","bhedataḥ","BHED","ataḥ","bheda","noun-adj",""
"19","//","","","","punct",""
"20","6","","","","ind",""
"21","//","","","","punct",""
"","</s>","","","","",""
"","<s number=""11"">","","","","",""
"","</page>","","","","",""
"","<page number=""464"">","","","","",""
"3","prakṛtiḥ","PRAKṚT","iḥ","prakṛti","noun-adj",""
"4","sarva","SARV","a@","sarva","noun-adj",""
"5","dharmāṇāṃ","DHARM","āṇāṃ","dharma","noun-adj",""
"6","tad","","","tad","pron",""
"7","eva","","","eva","ind",""
"8","jñānam","JÑĀN","am","jñāna","noun-adj",""
"9","advayam","ADVAY","am","advaya","noun-adj",""
"10","/","","","","punct",""
"11","mahāsukhaṃ","MAHĀSUKH","aṃ","mahāsukha","noun-adj",""
"12","ca","","","ca","ind",""
"13","tat","","","tad","pron",""
"14","tasmāj","","","tad","pron",""
"15","jagat","JAGAT","","jagat","noun-adj",""
"16","sarvaṃ","SARV","aṃ","sarva","noun-adj",""
"17","mahāsukham","MAHĀSUKH","am","mahāsukha","noun-adj",""
"18","//","","","","punct",""
"19","7","","","","ind",""
"20","//","","","","punct",""
"","</s>","","","","",""
"","<s number=""12"">","","","","",""
"1","a","","","alpha_privativum","ind",""
"2","trāyam","TRĀY","am","trāya","noun-adj",""
"3","abhisamayaḥ","ABHISAMAY","aḥ","abhisamaya","noun-adj",""
"4","/","","","","punct",""
"","</s>","","","","",""
"","<s number=""13"">","","","","",""
"1","asyāṃ","","","idam","pron",""
"2","bhāvanāyām","BHĀVAN","āyām","bhāvanā","noun-adj",""
"3","adhikṛto","ADHIKṚT","o","adhikṛta","noun-adj",""
"4","vīraḥ","VĪR","aḥ","vīra","noun-adj",""
"5","kvacid","","","kva","ind",""
"6","ekākī","EKĀK","ī","ekākin","noun-adj",""
"7","raho","RAH","o@","raha","noun-adj",""
"8","gata","GAT","a","gata","noun-adj",""
"9","āsane","ĀSAN","e","āsana","noun-adj",""
"10","niṣadya","NIṢAD","ya","niṣad","verb","nisad"
"11","svabhāva","SVABHĀV","a@","svabhāva","noun-adj",""
"12","śuddhāḥ","ŚUDDH","āḥ","śuddha","noun-adj",""
"13","sarva","SARV","a@","sarva","noun-adj",""
"14","dharmā","DHARM","ā","dharma","noun-adj",""
"15","iti","","","iti","ind",""
"16","niścity","NIŚCIT","y@","niściti","noun-adj",""
"17","ātmānaṃ","ĀTM","ānaṃ","ātman","noun-adj",""
"18","heruka","HERUK","a@","heruka","noun-adj",""
"19","rūpam","RŪP","am","rūpa","noun-adj",""
"20","adhimucya","ADHIMUCY","a","adhimucyate","noun-adj",""
"21","manasā","MAN","asā","manas","noun-adj",""
"22","kāṃcid","","","kimcit","ind",""
"23","ānīya","ĀNĪY","a","ānīya","noun-adj",""
"24","nir","NIR","","niḥ_privativum","ind",""
"25","ātmikāṃ","ĀTM","ikāṃ","ātman","noun-adj",""
"26","tām","","","tad","pron",""
"27","adhimucya","ADHIMUCY","a","adhimucyate","noun-adj",""
"28","kakkole","KAKKOL","e","kakkola","noun-adj",""
"29","bola","BOL","a@","bol","verb",""
"30","vilāsaṃ","VILĀS","aṃ","vilāsa","noun-adj",""
"31","yadi","","","yadi","ind",""
"32","vā","","","vā","ind",""
"33","bola","BOL","a@","bol","verb",""
"34","bile","BIL","e","bila","noun-adj",""
"35","svana","SVAN","a@","svana","noun-adj",""
"36","ābhihṛdayād","ĀBHIHṚDAY","ād","ābhihṛdaya","noun-adj",""
"37","avatīrṇa","AVATĪRṆ","a@","avatīrṇa","noun-adj",""
"38","prajña","PRAJÑ","a@","prajñā","noun-adj",""
"39","opāya","UPĀY","a@","upāya","noun-adj",""
"40","vilāsaṃ","VILĀS","aṃ","vilāsa","noun-adj",""
"41","bhāvayan","BHĀV","ayan","bhāva","noun-adj",""
"42","bhāvana","BHĀVAN","a@","bhāvanā","noun-adj",""
"43","ābalena","ĀBAL","ena","ābala","noun-adj",""
"44","paramārtham","PARAMĀRTH","am","paramārtha","noun-adj",""
"45","abhimukhīkur","ABHIMUKHĪK","ur","abhimukhīku","noun-adj",""
"46","yāt","YĀT","","yāta","noun-adj",""
"47","/","","","","punct",""
"","</s>","","","","",""
"","<s number=""14"">","","","","",""
"1","kathaṃ","","","katham","ind",""
"2","cid","","","cid","ind",""
"3","abhimukhī","ABHIMUKHĪ","","abhimukhī","noun-adj",""
"4","kṛtaṃ","KṚT","aṃ","kṛta","noun-adj",""
"5","ca","","","ca","ind",""
"6","sarva","SARV","a@","sarva","noun-adj",""
"7","āṅga","AṄG","a@","aṅga","noun-adj",""
"8","pratyaṅgeṣu","PRATYAṄG","eṣu","pratyaṅga","noun-adj",""
"9","daśa","DAŚ","a@","daśa","noun-adj",""
"10","dik","DI","k@","dik","noun-adj",""
"11","sarvabhāveṣu","SARVABHĀV","eṣu","sarvabhāva","noun-adj",""
"12","ca","","","ca","ind",""
"13","visphārayet","VISPHĀRAY","et","visphāra","verb",""
"14","/","","","","punct",""
"","</s>","","","","",""
"","<s number=""15"">","","","","",""
"1","nir","NIR","","niḥ_privativum","ind",""
"2","ābhāsa","ĀBHĀS","a@","ābhāsa","noun-adj",""
"3","prakāśa","PRAKĀŚ","a@","prakāśa","noun-adj",""
"4","mātraṃ","MĀTR","aṃ","mātra","noun-adj",""
"5","mahāsukham","MAHĀSUKH","am","mahāsukha","noun-adj",""
"6","anantaṃ","ANANT","aṃ","ananta","noun-adj",""
"7","nirantaraṃ","NIRANTAR","aṃ","nirantara","noun-adj",""
"8","tāvat","TĀVAT","","tāvat","ind",""
"9","paśyed","PAŚY","ed","paś","verb","paś"
"10","y","","","","ind",""
"11","āvac","ĀVAC","","āvac","verb",""
"12","chaknoti","ŚAKN","oti","śakn","verb","śak"
"13","/","","","","punct",""
"","</s>","","","","",""
"","<s number=""16"">","","","","",""
"1","vyutthito","VYUTTHIT","o","vyutthita","noun-adj",""
"2","api","","","api","ind",""
"3","sarvabhāvān","SARVABHĀV","ān","sarvabhāva","noun-adj",""
"4","mahā","MAH","ā@","mahat","noun-adj",""
"5","sukha","SUKH","a@","sukha","noun-adj",""
"6","mayatvena","MAY","atvena","mayatva","noun-adj",""
"7","yoginī","YOG","inī","yogin","noun-adj",""
"8","cakra","CAKR","a@","cakra","noun-adj",""
"9","ātmakān","ĀTM","akān","ātman","noun-adj",""
"10","ad","","","","ind",""
"11","himuñ","HIM","uñ","himu","noun-adj",""
"12","cet","CET","","ced","noun-adj",""
"13","/","","","","punct",""
"","</s>","","","","",""
"","<s number=""17"">","","","","",""
"1","ten","","","tad","pron",""
"2","^","","","","",""
"3","aiva","","","eva","ind",""
"4","ca","","","ca","ind",""
"5","svasaṃvedyena","SVASAṂVEDY","ena","svasaṃvedya","noun-adj",""
"6","mahā","MAH","ā@","mahat","noun-adj",""
"7","sukhen","SUKH","en","sukha","noun-adj",""
"8","ābhyarcayet","ABHYARC","ayet","abhyarc","verb",""
"9","punaḥ","","","punar","ind",""
"10","punar","","","punar","ind",""
"11","āśu","","","","ind",""
"12","puṇya","PUṆY","a@","puṇya","noun-adj",""
"13","jñāna","JÑĀN","a@","jñāna","noun-adj",""
"14","sambhāra","SAMBHĀR","a@","sambhāra","noun-adj",""
"15","opacaya","UPACAY","a@","upacaya","noun-adj",""
"16","ārtham","ARTH","am","artha","noun-adj",""
"17","/","","","","punct",""
"","</s>","","","","",""
"","<s number=""18"">","","","","",""
"1","upacita","UPACIT","a@","upacita","noun-adj",""
"2","sambhārasya","SAMBHĀR","asya","sambhāra","noun-adj",""
"3","bhāvanā","BHĀVAN","ā@","bhāvanā","noun-adj",""
"4","viśeṣād","VIŚEṢ","ād","viśeṣa","noun-adj",""
"5","a","","","alpha_privativum","ind",""
"6","cirād","CIR","ād","cira","noun-adj",""
"7","iṣṭa","IṢṬ","a@","iṣṭa","noun-adj",""
"8","siddheḥ","SIDDH","eḥ","siddhi","noun-adj",""
"9","//","","","","punct",""
"","</s>","","","","",""
"","<s number=""19"">","","","","",""
"1","ma","","","","ind",""
"2","dbhavāḥ","DBHAV","āḥ","dbhava","noun-adj",""
"3","prāṇinaḥ","PRĀṆ","inaḥ","prāṇin","noun-adj",""
"4","sarve","SARV","e","sarva","noun-adj",""
"5","madbhavaṃ","MADBH","avaṃ","madbhū","noun-adj",""
"6","bhuvana","BHUVAN","a@","bhuvana","noun-adj",""
"7","trayam","TRAY","am","tri","noun-adj",""
"8","/","","","","punct",""
"9","mayā","","","mat","pron",""
"10","vyāptam","VYĀPT","am","vyāpta","noun-adj",""
"11","idaṃ","","","idam","pron",""
"12","sarvaṃ","SARV","aṃ","sarva","noun-adj",""
"13","n","","","na","ind",""
"14","ānyam","ANY","am","anya","noun-adj",""
"15","ayaṃ","","","idam","pron",""
"16","dṛśyate","DṚŚ","yate","darś","verb","dṛś"
"17","jagat","JAGAT","","jagat","noun-adj",""
"18","//","","","","punct",""
"19","8","","","","ind",""
"20","//","","","","punct",""
"","</s>","","","","",""
"","<s number=""20"">","","","","",""
"1","evaṃ","","","eva","ind",""
"2","matvā","","","","ind",""
"3","tu","","","tu","ind",""
"4","vai","","","vai","ind",""
"5","yogī","YOG","ī","yogin","noun-adj",""
"6","yo","","","yad","pron",""
"7","abhya","ABHY","a@","abhya","noun-adj",""
"8","set","SET","","seta","noun-adj",""
"9","su","","","su","ind",""
"10","samāhitaḥ","SAMĀHIT","aḥ","samāhita","noun-adj",""
"11","/","","","","punct",""
"12","sa","","","sa_saha","ind",""
"13","siddhyati","SIDDH","yati","siddha","noun-adj",""
"14","na","","","na","ind",""
"15","saṃdeho","SAṂDEH","o","saṃdeha","noun-adj",""
"16","manda","MAND","a@","manda","noun-adj",""
"17","puṇyo","PUṆY","o","puṇya","noun-adj",""
"18","api","","","api","ind",""
"19","mānavaḥ","MĀNAV","aḥ","mānava","noun-adj",""
"20","//","","","","punct",""
"21","9","","","","ind",""
"22","//","","","","punct",""
"","</s>","","","","",""
"","<s number=""21"">","","","","",""
"","</page>","","","","",""
"","<page number=""465"">","","","","",""
"3","punaḥ","","","punar","ind",""
"4","samāhita","SAMĀHIT","a@","samāhita","noun-adj",""
"5","yogaḥ","YOG","aḥ","yoga","noun-adj",""
"6","punar","","","punar","ind",""
"7","vyutthita","VYUTTHIT","a@","vyutthita","noun-adj",""
"8","yogo","YOG","o","yoga","noun-adj",""
"9","yathā","","","yathā","ind",""
"10","balam","BAL","am","bala","noun-adj",""
"11","evaṃ","","","eva","ind",""
"12","yoga","YOG","a@","yoga","noun-adj",""
"13","dvayena","DVAY","ena","dvaya","noun-adj",""
"14","nadī","NAD","ī@","nadī","noun-adj",""
"15","srotaḥ","SROT","aḥ","srota","noun-adj",""
"16","pravāhena","PRAVĀH","ena","pravāha","noun-adj",""
"17","dīpa","DĪP","a@","dīpa","noun-adj",""
"18","jyotiḥ","JYOT","iḥ","jyoti","noun-adj",""
"19","prabandha","PRABANDH","a@","prabandha","noun-adj",""
"20","vat","VAT","","vat","noun-adj",""
"21","/","","","","punct",""
"22","satataṃ","SATAT","aṃ","satata","noun-adj",""
"23","tattva","TATTV","a@","tad","pron",""
"24","yogena","YOG","ena","yoga","noun-adj",""
"25","sthātavyam","STHĀ","tavyam","tiṣṭh","verb","sthā"
"26","aho","","","aho","ind",""
"27","rātrataḥ","RĀTR","ataḥ","rātra","noun-adj",""
"28","//","","","","punct",""
"29","10","","","","ind",""
"30","//","","","","punct",""
"","</s>","","","","",""
"","<s number=""22"">","","","","",""
"1","svasaṃvedyam","SVASAṂVEDY","am","svasaṃvedya","noun-adj",""
"2","idaṃ","","","idam","pron",""
"3","jñānaṃ","JÑĀN","aṃ","jñāna","noun-adj",""
"4","vāk","VĀK","@","vāk","noun-adj",""
"5","patha","PATH","a@","patha","noun-adj",""
"6","ātīta","ATĪT","a@","atīta","noun-adj",""
"7","gocaram","GOCAR","am","gocara","noun-adj",""
"8","/","","","","punct",""
"9","adhiṣṭhāna","ADHIṢṬHĀN","a@","adhiṣṭhāna","noun-adj",""
"10","kramo","KRAM","o","krama","noun-adj",""
"11","hy","","","hi","ind",""
"12","eṣa","","","tad","pron",""
"13","sarvajña","SARVAJÑ","a@","sarvajña","noun-adj",""
"14","jñāna","JÑĀN","a@","jñāna","noun-adj",""
"15","tanmayam","TANMAY","am","tanmaya","noun-adj",""
"16","//","","","","punct",""
"17","11","","","","ind",""
"18","//","","","","punct",""
"","</s>","","","","",""
"","<s number=""23"">","","","","",""
"1","pṛthivī","PṚTHIV","ī","pṛthivī","noun-adj",""
"2","āpa","ĀP","a","āpa","noun-adj",""
"3","vāyuś","VĀY","uś","vāyu","noun-adj",""
"4","ca","","","ca","ind",""
"5","teja","TEJ","a","teja","noun-adj",""
"6","ākāśa","ĀKĀŚ","a","ākāśa","noun-adj",""
"7","eva","","","eva","ind",""
"8","ca","","","ca","ind",""
"9","/","","","","punct",""
"10","kṣaṇāt","KṢAṆ","āt","kṣaṇa","noun-adj",""
"11","sarve","SARV","e","sarva","noun-adj",""
"12","na","","","na","ind",""
"13","bādhante","BĀDH","ante","bādh","verb","bādh"
"14","svapara","SVAPAR","a@","svapara","noun-adj",""
"15","saṃvitti","SAṂVITT","i@","saṃvitti","noun-adj",""
"16","vedanam","VEDAN","am","vedanā","noun-adj",""
"17","//","","","","punct",""
"18","12","","","","ind",""
"19","//","","","","punct",""
"","</s>","","","","",""
"","<s number=""24"">","","","","",""
"1","svarga","SVARG","a@","svarga","noun-adj",""
"2","martyaiś","MARTY","aiś","martya","noun-adj",""
"3","ca","","","ca","ind",""
"4","pātālair","PĀTĀL","air","pātāla","noun-adj",""
"5","eka","EK","a@","eka","noun-adj",""
"6","mūrtir","MŪRT","ir","mūrti","noun-adj",""
"7","bhavet","BHAV","et","bhav","verb","bhū"
"8","kṣaṇāt","KṢAṆ","āt","kṣaṇa","noun-adj",""
"9","/","","","","punct",""
"10","svapara","SVAPAR","a@","svapara","noun-adj",""
"11","bhāga","BHĀG","a@","bhāga","noun-adj",""
"12","vikalpena","VIKALP","ena","vikalpa","noun-adj",""
"13","bādhituṃ","BĀDH","ituṃ","bādh","verb","bādh"
"14","n","","","na","ind",""
"15","^","","","","",""
"16","aiva","","","eva","ind",""
"17","śakyate","ŚAK","yate","śakn","verb","śak"
"18","//","","","","punct",""
"19","13","","","","ind",""
"20","//","","","","punct",""
"","</s>","","","","",""
"","<s number=""25"">","","","","",""
"1","ayaṃ","","","idam","pron",""
"2","ca","","","ca","ind",""
"3","yogo","YOG","o","yoga","noun-adj",""
"4","avasthā","AVASTH","ā@","avasthā","noun-adj",""
"5","bhedāc","BHED","āc","bheda","noun-adj",""
"6","caturdhā","CATURDH","ā","caturdhā","noun-adj",""
"7","bhavati","BHAV","ati","bhav","verb","bhū"
"8","megha","MEGH","a@","megha","noun-adj",""
"9","opamo","UPAM","o","upama","noun-adj",""
"10","māyopamaḥ","MĀYOPAM","aḥ","māyopama","noun-adj",""
"11","svapnopamaḥ","SVAPNOPAM","aḥ","svapnopama","noun-adj",""
"12","svapnaja","SVAPNAJ","a@","svapnaja","noun-adj",""
"13","āgara","ĀGAR","a@","āgara","noun-adj",""
"14","opamaś","UPAM","aś","upama","noun-adj",""
"15","c","","","ca","ind",""
"16","^","","","","",""
"17","eti","","","iti","ind",""
"18","/","","","","punct",""
"","</s>","","","","",""
"","<s number=""26"">","","","","",""
"1","prāk","PRĀK","","prāñc","noun-adj",""
"2","siddher","SIDDH","er","siddhi","noun-adj",""
"3","megha","MEGH","a@","megha","noun-adj",""
"4","opamas","UPAM","as","upama","noun-adj",""
"5","tanu","TAN","u@","tanu","noun-adj",""
"6","meghac","MEGH","ac","meghat","noun-adj",""
"7","channa","CHANN","a@","channa","noun-adj",""
"8","pūrṇacandravad","PŪRṆACANDR","avad","pūrṇacandra","noun-adj",""
"9","a","","","alpha_privativum","ind",""
"10","parisphuṭatvāt","PARISPHUṬ","atvāt","parisphuṭa","noun-adj",""
"11","/","","","","punct",""
"","</s>","","","","",""
"","<s number=""27"">","","","","",""
"1","siddhau","SIDDH","au","siddha","noun-adj",""
"2","māyopamo","MĀYOPAM","o","māyopama","noun-adj",""
"3","mano","MAN","o@","manas","noun-adj",""
"4","nirmita","NIRMIT","a@","nirmita","noun-adj",""
"5","vidya","VIDY","a@","vidyā","noun-adj",""
"6","ābalena","ĀBAL","ena","ābala","noun-adj",""
"7","vyaktam","VYAKT","am","vyakta","noun-adj",""
"8","udayāt","UDAY","āt","udaya","noun-adj",""
"9","/","","","","punct",""
"","</s>","","","","",""
"","<s number=""28"">","","","","",""
"1","tataḥ","","","tatas","ind",""
"2","svapnopamo","SVAPNOPAM","o","svapnopama","noun-adj",""
"3","bola","BOL","a@","bol","verb",""
"4","ā","","","alpha_privativum","ind",""
"5","kṣara","KṢAR","a@","kṣara","noun-adj",""
"6","yoga","YOG","a@","yoga","noun-adj",""
"7","balena","BAL","ena","bala","noun-adj",""
"8","yoga","YOG","a@","yoga","noun-adj",""
"9","nidra","NIDR","a@","nidrā","noun-adj",""
"10","āgatasya","ĀGAT","asya","āgata","noun-adj",""
"11","saha","SAH","a","sa_saha","ind",""
"12","s","","","su","ind",""
"13","otpatteḥ","UTPATT","eḥ","utpatti","noun-adj",""
"14","/","","","","punct",""
"","</s>","","","","",""
"","<s number=""29"">","","","","",""
"1","tad","","","tad","pron",""
"2","anu","ANU","","anu","noun-adj",""
"3","svapnaja","SVAPNAJ","a@","svapnaja","noun-adj",""
"4","āgara","ĀGAR","a@","āgara","noun-adj",""
"5","opamaḥ","UPAM","aḥ","upama","noun-adj",""
"6","/","","","","punct",""
"","</s>","","","","",""
"","<s number=""30"">","","","","",""
"1","kathaṃ","","","katham","ind",""
"2","jāgara","JĀGAR","a@","jāgara","noun-adj",""
"3","opamaḥ","UPAM","aḥ","upama","noun-adj",""
"4","/","","","","punct",""
"","</s>","","","","",""
"","<s number=""31"">","","","","",""
"1","bahir","BAH","ir","bahi","noun-adj",""
"2","vidyā","VIDY","ā@","vidyā","noun-adj",""
"3","yoga","YOG","a@","yoga","noun-adj",""
"4","janitatvāt","JANIT","atvāt","janitatva","noun-adj",""
"5","/","","","","punct",""
"","</s>","","","","",""
"","<s number=""32"">","","","","",""
"1","kathaṃ","","","katham","ind",""
"2","svapnopamaḥ","SVAPNOPAM","aḥ","svapnopama","noun-adj",""
"3","/","","","","punct",""
"","</s>","","","","",""
"","<s number=""33"">","","","","",""
"1","svaparayor","SVAPAR","ayor","svapara","noun-adj",""
"2","anupalambhāt","ANUPALAMBH","āt","anupalambha","noun-adj",""
"3","/","","","","punct",""
"","</page>","","","","",""
"","<page number=""466"">","","","","",""
"","</s>","","","","",""
"","<s number=""34"">","","","","",""
"1","ete","","","tad","pron",""
"2","ca","","","ca","ind",""
"3","yath","","","yathā","ind",""
"4","ottaraṃ","UTTAR","aṃ","uttara","noun-adj",""
"5","viśiṣyante","VIŚIṢ","yante","viśiṣ","verb",""
"6","/","","","","punct",""
"","</s>","","","","",""
"","<s number=""35"">","","","","",""
"1","pūrva","PŪRV","a@","pūrva","noun-adj",""
"2","pūrva","PŪRV","a@","pūrva","noun-adj",""
"3","balād","BAL","ād","bala","noun-adj",""
"4","uttara","UTTAR","a@","uttara","noun-adj",""
"5","ottara","UTTAR","a@","uttara","noun-adj",""
"6","niṣpatteḥ","NIṢPATT","eḥ","niṣpatti","noun-adj",""
"7","/","","","","punct",""
"","</s>","","","","",""
"","<s number=""36"">","","","","",""
"1","katham","KATHAM","","katham","ind",""
"2","an","","","alpha_privativum","ind",""
"3","timaḥ","TIM","aḥ","tima","noun-adj",""
"4","sarva","SARV","a@","sarva","noun-adj",""
"5","ottaraḥ","UTTAR","aḥ","uttara","noun-adj",""
"6","/","","","","punct",""
"","</s>","","","","",""
"","<s number=""37"">","","","","",""
"1","saty","SATY","","satya","noun-adj",""
"2","api","","","api","ind",""
"3","vikṣepa","VIKṢEP","a@","vikṣepa","noun-adj",""
"4","hetāv","HET","āv","heta","noun-adj",""
"5","atyanta","ATYANT","a@","atyanta","noun-adj",""
"6","samāhitatvāt","SAMĀHIT","atvāt","samāhita","noun-adj",""
"7","samagra","SAMAGR","a@","samagra","noun-adj",""
"8","samayatvāc","SAMAY","atvāc","samayatva","noun-adj",""
"9","c","","","ca","ind",""
"10","^","","","","",""
"11","eti","","","iti","ind",""
"12","//","","","","punct",""
"","</s>","","","","",""
"","<s number=""38"">","","","","",""
"1","hevajrād","HEVAJR","ād","hevajra","noun-adj",""
"2","atigahanād","ATIGAHAN","ād","atigahana","noun-adj",""
"3","avikalam","AVIKAL","am","avikala","noun-adj",""
"4","uddhṛtya","UDDHṚT","ya","uddhṛta","noun-adj",""
"5","sahaja","SAHAJ","a@","sa_saha","ind",""
"6","sadyo","SADY","o@","sadya","noun-adj",""
"7","gam","GAM","","gama","noun-adj",""
"8","/","","","","punct",""
"9","yad","","","yadi","ind",""
"10","upacitaṃ","UPACIT","aṃ","upacita","noun-adj",""
"11","mama","","","mat","pron",""
"12","kuśalaṃ","KUŚAL","aṃ","kuśala","noun-adj",""
"13","bhavatu","BHAVAT","u@","bhavatī","noun-adj",""
"14","jagat","JAGAT","","jagat","noun-adj",""
"15","tena","","","tad","pron",""
"16","vajra","VAJR","a@","vajra","noun-adj",""
"17","dharaḥ","DHAR","aḥ","dhara","noun-adj",""
"18","//","","","","punct",""
"19","14","","","","ind",""
"20","//","","","","punct",""
"","</s>","","","","",""
"","<s number=""39"">","","","","",""
"1","śrī","ŚRĪ","","śrī","noun-adj",""
"2","hevajra","HEVAJR","a@","hevajra","noun-adj",""
"3","sahaja","SAHAJ","a@","sa_saha","ind",""
"4","sad","SAD","@","sat","noun-adj",""
"5","yogaḥ","YOG","aḥ","yoga","noun-adj",""
"6","samāptaḥ","SAMĀPT","aḥ","samāpta","noun-adj",""
"7","//","","","","punct",""
"","</s>","","","","",""
"","<s number=""40"">","","","","",""
"1","kṛtir","KṚT","ir","kṛti","noun-adj",""
"2","iyaṃ","","","idam","pron",""
"3","ratnākaraśānti","RATNĀKARAŚĀNT","i@","ratnākaraśānti","noun-adj",""
"4","pādānām","PĀDĀN","ām","pādānā","noun-adj",""
"5","//","","","","punct",""
"","</s>","","","","",""
"","</page>","","","","",""
"","</doc>","","","","",""
