"WordID","word","NormSTEM","suffix","lemma","PoS","Root"
"","<doc textid = ""jatakastava"" genre = ""stotra"" title = ""jātakastava"" author = ""jñānayaśas"" discourse = ""stotra"" tradition = ""buddh"" period = ""n /a"" source = ""gretil accessed feb 2021 : http://gretil.sub.uni-goettingen.de/gretil/corpustei/sa_jatakastava.xml"" date_range = ""n/a"" notes = ""there is also a khotanese version of this text the content of which is very different from the skt. according to bailey; no info on dating found."" religion = ""buddh"" edition = ""based on the ed. by d. r. shackleton bailey: jātakastava of jñānayaśas. in friedrich weller. asiatica: festschrift friedrich weller. leipzig 1954; pp. 22-29. page number = verse number"" digitization = ""klaus wille"" segmentation_lemmatization = ""ligeia lugli & buddhist translators workbench team"" metadata_enrichment = ""bruno galasek-hul & buddhist translators workbench team"" proofreader = ""n/a"" permission = ""permission for derivatives from m. mehner on behalf of gretil"" reconstructions = ""none"">","","","","",""
"","<page number=""1"">","","","","",""
"","<s number=""1"">","","","","",""
"1","kv","","","","ind",""
"2","edaṃ","EDAṂ","","idam","pron",""
"3","dāśa","DĀŚ","a@","dāśa","noun-adj",""
"4","balaṃ","BAL","aṃ","bala","noun-adj",""
"5","guṇair","GUṆ","air","guṇa","noun-adj",""
"6","a","","","alpha_privativum","ind",""
"7","śabalaṃ","ŚABAL","aṃ","śabala","noun-adj",""
"8","caryā","CARY","ā@","caryā","noun-adj",""
"9","vibhutvaṃ","VIBHU","tvaṃ","vibhua","noun-adj",""
"10","vibho","VIBH","o","vibhu","noun-adj",""
"11","janma","JANM","a@","janma","noun-adj",""
"12","syandanikā","SYANDANIK","ā@","syandanikā","noun-adj",""
"13","vivartana","VIVARTAN","a@","vivartana","noun-adj",""
"14","jaḍaṃ","JAḌ","aṃ","jaḍa","noun-adj",""
"15","cetaḥ","CET","aḥ","cetas","noun-adj",""
"16","kva","","","kva","ind",""
"17","c","","","ca","ind",""
"18","edaṃ","EDAṂ","","idam","pron",""
"19","mama","MAM","a","mat","pron",""
"20","yen","","","yad","pron",""
"21","āvandhya","AVANDHY","a@","avandhya","noun-adj",""
"22","phala","PHAL","a@","phala","noun-adj",""
"23","odayās","UDAY","ās","udaya","noun-adj",""
"24","tvayi","","","tvat","pron",""
"25","bhavanty","BHAV","anty","bhav","verb","bhū"
"26","abhyāhitāḥ","ABHYĀHIT","āḥ","abhyāhita","noun-adj",""
"27","pāṃsavas","PĀṂSAV","as","pāṃsava","noun-adj",""
"28","tena","","","tad","pron",""
"29","stuty","STUT","y@","stuti","noun-adj",""
"30","anubandhinā","ANUBANDH","inā","anubandhin","noun-adj",""
"31","mukha","MUKH","a@","mukha","noun-adj",""
"32","ratām","RAT","ām","ratā","noun-adj",""
"33","ālambate","ĀLAMB","ate","ālamb","verb",""
"34","bhāratī","BHĀRAT","ī","bhāratī","noun-adj",""
"35","//","","","","punct",""
"","</page>","","","","",""
"","<page number=""2"">","","","","",""
"","</s>","","","","",""
"","<s number=""2"">","","","","",""
"1","citta","CITT","a@","citta","noun-adj",""
"2","ālambana","ĀLAMBAN","a@","ālambana","noun-adj",""
"3","laṅghinaḥ","LAṄGH","inaḥ","laṅghin","noun-adj",""
"4","śama","ŚAM","a@","śama","noun-adj",""
"5","dṛśām","DṚŚ","ām","dṛśā","noun-adj",""
"6","āveṇikāḥ","ĀVEṆIK","āḥ","āveṇika","noun-adj",""
"7","sad","SAD","","sat","noun-adj",""
"8","guṇā","GUṆ","ā","guṇa","noun-adj",""
"9","vācāṃ","VĀC","āṃ","vāk","noun-adj",""
"10","gocaratāṃ","GOCAR","atāṃ","gocaratā","noun-adj",""
"11","tu","","","tu","ind",""
"12","yānti","YĀ","nti","yā","noun-adj",""
"13","kalayā","KALAY","ā","kalayati","noun-adj",""
"14","sthūlā","STHŪL","ā","sthūlā","noun-adj",""
"15","hi","","","hi","ind",""
"16","vo","","","yuṣmat","pron",""
"17","mādṛśām","MĀDṚŚ","ām","mādṛśa","noun-adj",""
"18","ratnāny","RATN","āny","ratna","noun-adj",""
"19","ambu","AMB","u@","ambu","noun-adj",""
"20","nidher","NIDH","er","nidhi","noun-adj",""
"21","u","","","","ind",""
"22","pāmbu","PĀM","bu","pāma","noun-adj",""
"23","pulineṣv","PULIN","eṣv","pulina","noun-adj",""
"24","ā","","","alpha_privativum","ind",""
"25","vir","VIR","","vira","noun-adj",""
"26","bhavanty","BHAV","anty","bhav","verb","bhū"
"27","arthinām","ARTH","inām","arthin","noun-adj",""
"28","antar","ANTAR","","antara","noun-adj",""
"29","bhinnat","BHINN","at","bhinnat","noun-adj",""
"30","araṅga","ARAṄG","a@","araṅgin","noun-adj",""
"31","dyota","DYOT","a@","dyota","noun-adj",""
"32","rucaka","RUCAK","a@","rucaka","noun-adj",""
"33","jyotsnāni","JYOTSN","āni","jyotsna","noun-adj",""
"34","gṛhṇāti","GṚHṆ","āti","gṛhṇa","noun-adj",""
"35","kaḥ","","","kim","pron",""
"36","//","","","","punct",""
"","</page>","","","","",""
"","<page number=""3"">","","","","",""
"","</s>","","","","",""
"","<s number=""3"">","","","","",""
"1","yā","","","yad","pron",""
"2","vo","","","yuṣmat","pron",""
"3","bodhi","BODH","i@","bodhi","noun-adj",""
"4","patha","PATH","a@","patha","noun-adj",""
"5","ānuyāna","ANUYĀN","a@","anuyāna","noun-adj",""
"6","mahatām","MAHAT","ām","mahat","noun-adj",""
"7","utsāhinī","UTSĀH","inī","utsāhin","noun-adj",""
"8","karmaṇām","KARM","aṇām","karman","noun-adj",""
"9","ā","","","alpha_privativum","ind",""
"10","sīl","SĪL","","sīla","noun-adj",""
"11","loka","LOK","a@","loka","noun-adj",""
"12","hita","HIT","a@","hita","noun-adj",""
"13","odaye","UDAY","e","udaya","noun-adj",""
"14","jina","JIN","a","jina","noun-adj",""
"15","kṛpā","KṚP","ā@","kṛpā","noun-adj",""
"16","viṣyandinī","VIṢYAND","inī","viṣyandin","noun-adj",""
"17","santatiḥ","SAṂTAT","iḥ","saṃtati","noun-adj",""
"18","sāne","SĀN","e","sāna","noun-adj",""
"19","kāpa","KĀP","a@","kāpa","noun-adj",""
"20","citaḥ","CIT","aḥ","cita","noun-adj",""
"21","punāti","PUN","āti","puna","noun-adj",""
"22","bhagavan","BHAGAV","an","bhagavat","noun-adj",""
"23","saṃkīrtyamāna","SAṄKĪRTYAMĀN","a@","saṅkīrtyamāna","noun-adj",""
"24","ādhunā","ĀDHUN","ā","ādhuan","noun-adj",""
"25","jñeya","JÑEY","a@","jñeya","noun-adj",""
"26","ābhoga","ĀBHOG","a@","ābhoga","noun-adj",""
"27","visāriṇo","VISĀRIṆ","o","visāriṇī","noun-adj",""
"28","gata","GAT","a@","gata","noun-adj",""
"29","malāḥ","MAL","āḥ","mala","noun-adj",""
"30","prāg","PRĀG","","prāñc","noun-adj",""
"31","eva","","","eva","ind",""
"32","bodhau","BODH","au","bodh","verb",""
"33","guṇāḥ","GUṆ","āḥ","guṇa","noun-adj",""
"34","//","","","","punct",""
"","</page>","","","","",""
"","<page number=""4"">","","","","",""
"","</s>","","","","",""
"","<s number=""4"">","","","","",""
"1","uddāma","UDDĀM","a@","uddāma","noun-adj",""
"2","dviradasya","DVIRAD","asya","dvirada","noun-adj",""
"3","rāga","RĀG","a@","rāga","noun-adj",""
"4","vaśino","VAŚ","ino","vaśin","noun-adj",""
"5","vṛttiṃ","VṚTT","iṃ","vṛtti","noun-adj",""
"6","pura","PUR","a@","pura","noun-adj",""
"7","onmādinīm","UNMĀD","inīm","unmādin","noun-adj",""
"8","ālokyā","ĀLOKY","ā@","ālokya","noun-adj",""
"9","vyativartinā","VYATIVART","inā","vyativart","verb","vyativṛt"
"10","praṇihitā","PRAṆIHIT","ā","praṇihita","noun-adj",""
"11","bodhau","BODH","au","bodh","verb",""
"12","dhiyo","DHIY","o","dhiyāyate","noun-adj",""
"13","yat","","","yad","pron",""
"14","tvayā","","","tvat","pron",""
"15","vinyasyanta","VINYASY","anta","vinyas","verb",""
"16","ivā","","","","ind",""
"17","marās","MAR","ās","mara","noun-adj",""
"18","tvayi","","","tvat","pron",""
"19","ciraṃ","CIR","aṃ","cira","noun-adj",""
"20","dharma","DHARM","a@","dharma","noun-adj",""
"21","ābhiṣeka","ABHIṢEK","a@","abhiṣeka","noun-adj",""
"22","śriyaṃ","ŚRIY","aṃ","śriya","noun-adj",""
"23","ten","","","tad","pron",""
"24","^","","","","",""
"25","ākampita","ĀKAMPIT","a@","ākampita","noun-adj",""
"26","keśara","KEŚAR","a@","keśara","noun-adj",""
"27","āntam","ANTAM","","antama","noun-adj",""
"28","a","","","alpha_privativum","ind",""
"29","sṛjan","SṚJ","an","sṛjat","noun-adj",""
"30","puṣpa","PUṢP","a@","puṣpa","noun-adj",""
"31","opahāraṃ","UPAHĀR","aṃ","upahāra","noun-adj",""
"32","divaḥ","DIV","aḥ","diva","noun-adj",""
"33","//","","","","punct",""
"","</page>","","","","",""
"","<page number=""5"">","","","","",""
"","</s>","","","","",""
"","<s number=""5"">","","","","",""
"1","kṣuda","KṢUD","a@","kṣuda","noun-adj",""
"2","duḥkhag","DUḤKH","ag@","duḥkha","noun-adj",""
"3","lapita","LAPIT","a@","lapita","noun-adj",""
"4","odarīṃ","UDAR","īṃ","udarī","noun-adj",""
"5","giri","GIR","i@","giri","noun-adj",""
"6","darī","DAR","ī@","darī","noun-adj",""
"7","randhra","RANDHR","a@","randhra","noun-adj",""
"8","āntarāla","ĀNTARĀL","a@","āntarāla","noun-adj",""
"9","sthitāṃ","STHIT","āṃ","sthitā","noun-adj",""
"10","dṛṣtvā","DṚṢ","tvā","dṛṣa","noun-adj",""
"11","śāvakag","ŚĀV","akag","śāvaka","noun-adj",""
"12","hāla","HĀL","a@","hāla","noun-adj",""
"13","naika","NAIK","a@","naika","noun-adj",""
"14","rabhasāṃ","RABHAS","āṃ","rabhasā","noun-adj",""
"15","vyāghrīṃ","VYĀGHR","īṃ","vyāghrī","noun-adj",""
"16","daya","DAY","a@","daya","noun-adj",""
"17","āghrāta","ĀGHRĀT","a@","āghrāta","noun-adj",""
"18","dhīḥ","DH","īḥ","dha","noun-adj",""
"19","yat","","","yad","pron",""
"20","tvaṃ","","","tvat","pron",""
"21","valkalinīṃ","VALKAL","inīṃ","valkalin","noun-adj",""
"22","jaṭā","JAṬ","ā@","jaṭā","noun-adj",""
"23","janavatīṃ","JAN","avatīṃ","janavat","noun-adj",""
"24","mūrtiṃ","MŪRT","iṃ","mūrti","noun-adj",""
"25","samutsṛṣṭavāṃs","SAMUTSṚṢṬ","avāṃs","samutsṛṣṭa","noun-adj",""
"26","trāṇaṃ","TRĀṆ","aṃ","trāṇa","noun-adj",""
"27","tena","","","tad","pron",""
"28","bhavān","BHAV","ān","bhava","noun-adj",""
"29","bhava","BHAV","a@","bhava","noun-adj",""
"30","ādri","ADR","i@","adri","noun-adj",""
"31","vivara","VIVAR","a@","vivara","noun-adj",""
"32","vyāvartināṃ","VYĀVART","ināṃ","vyāvartin","noun-adj",""
"33","dehinām","DEH","inām","dehin","noun-adj",""
"34","//","","","","punct",""
"","</page>","","","","",""
"","<page number=""6"">","","","","",""
"","</s>","","","","",""
"","<s number=""6"">","","","","",""
"1","yat","","","yad","pron",""
"2","prāleya","PRĀLEY","a@","prāleya","noun-adj",""
"3","sita","SIT","a@","sita","noun-adj",""
"4","opala","UPAL","a@","upala","noun-adj",""
"5","ādri","ADR","i@","adri","noun-adj",""
"6","bahalāṃ","BAHAL","āṃ","bahalā","noun-adj",""
"7","mātaṅgatāṃ","MĀTAṄG","atāṃ","mātaṅga","noun-adj",""
"8","bibhratā","BIBHR","atā","bibhrat","noun-adj",""
"9","kāntāra","KĀNTĀR","a@","kāntāra","noun-adj",""
"10","āntar","ANTAR","","antara","noun-adj",""
"11","avartināṃ","AVART","ināṃ","avartin","noun-adj",""
"12","tanu","TAN","u","tan","verb","tan"
"13","bhṛtām","BHṚT","ām","bhṛtā","noun-adj",""
"14","ucchittaye","UCCHITT","aye","ucchitti","noun-adj",""
"15","vyāpa","VYĀP","a@","vyāpa","noun-adj",""
"16","dām","DĀM","","dāma","noun-adj",""
"17","śaila","ŚAIL","a@","śaila","noun-adj",""
"18","endraṃ","INDR","aṃ","indra","noun-adj",""
"19","pṛthula","PṚTHUL","a@","pṛthula","noun-adj",""
"20","opalaṃ","UPAL","aṃ","upala","noun-adj",""
"21","ca","","","ca","ind",""
"22","layatā","LAY","atā","layā","noun-adj",""
"23","muktas","MUKT","as","mukta","noun-adj",""
"24","tvay","","","tvat","pron",""
"25","ātmā","ĀTM","ā","ātman","noun-adj",""
"26","taṭān","TAṬ","ān","taṭa","noun-adj",""
"27","manye","MANY","e","manya","noun-adj",""
"28","matsariṇāṃ","MATSAR","iṇāṃ","matsarin","noun-adj",""
"29","nitānta","NITĀNT","a@","nitānta","noun-adj",""
"30","malinās","MALIN","ās","malina","noun-adj",""
"31","tena","","","tad","pron",""
"32","kṣatā","KṢAT","ā","kṣata","noun-adj",""
"33","vṛttayaḥ","VṚTT","ayaḥ","vṛtti","noun-adj",""
"34","//","","","","punct",""
"","</page>","","","","",""
"","<page number=""7"">","","","","",""
"","</s>","","","","",""
"","<s number=""7"">","","","","",""
"1","yal","","","","ind",""
"2","loka","LOK","a@","loka","noun-adj",""
"3","āmbara","AMBAR","a@","ambara","noun-adj",""
"4","candra","CANDR","a@","candra","noun-adj",""
"5","candra","CANDR","a@","candra","noun-adj",""
"6","vapuṣā","VAPUṢ","ā","vapuṣā","noun-adj",""
"7","candraprabhatve","CANDRAPRABH","atve","candraprabhatva","noun-adj",""
"8","tvayā","","","tvat","pron",""
"9","kalmāṣa","KALMĀṢ","a@","kalmāṣa","noun-adj",""
"10","ānta","ANT","a@","anta","noun-adj",""
"11","śikhaṃ","ŚIKH","aṃ","śikha","noun-adj",""
"12","śikhā","ŚIKH","ā@","śikhā","noun-adj",""
"13","maṇi","MAṆ","i@","maṇi","noun-adj",""
"14","rucā","RUC","ā","rucā","noun-adj",""
"15","dattaṃ","DATT","aṃ","datta","noun-adj",""
"16","dvijāy","DVIJ","āy","dvija","noun-adj",""
"17","ārthine","ARTH","ine","arthin","noun-adj",""
"18","nālāl","NĀL","āl","nāla","noun-adj",""
"19","lūnam","LŪN","am","lūna","noun-adj",""
"20","ivā","","","","ind",""
"21","ravindam","RAVIND","am","ravinda","noun-adj",""
"22","a","","","alpha_privativum","ind",""
"23","sinā","SIN","ā","sina","noun-adj",""
"24","vyutkṛtta","VYUTKṚT","ta","vyutkṛta","noun-adj",""
"25","mūlaṃ","MŪL","aṃ","mūla","noun-adj",""
"26","śiras","ŚIRAS","","śiras","noun-adj",""
"27","ten","","","tad","pron",""
"28","aiṣāṃ","AIṢ","āṃ","idam","pron",""
"29","jagatāṃ","JAGAT","āṃ","jagat","noun-adj",""
"30","gato","GAT","o","gata","noun-adj",""
"31","asi","","","as","verb","as"
"32","gurutām","GUR","utām","guru","noun-adj",""
"33","usṇīṣavan","","","usṇīṣavat","ind",""
"34","mūrdhani","MŪRDH","ani","mūrdhat","noun-adj",""
"35","//","","","","punct",""
"","</page>","","","","",""
"","<page number=""8"">","","","","",""
"","</s>","","","","",""
"","<s number=""8"">","","","","",""
"1","bālān","BĀL","ān","bāla","noun-adj",""
"2","bāla","BĀL","a@","bāla","noun-adj",""
"3","saroja","SAROJ","a@","saroja","noun-adj",""
"4","komala","KOMAL","a@","komala","noun-adj",""
"5","tan","TAN","","tad","pron",""
"6","ūn","","","","ind",""
"7","yat","","","yad","pron",""
"8","putrakān","PUTR","akān","putraka","noun-adj",""
"9","arthine","ARTH","ine","arthin","noun-adj",""
"10","paryasta","PARYAST","a@","paryasta","noun-adj",""
"11","ākṣa","ĀKṢ","a@","ākṣa","noun-adj",""
"12","cala","CAL","a@","cala","noun-adj",""
"13","cchikhaṇḍaka","ŚIKHAṆḌ","aka@","śikhaṇḍaka","noun-adj",""
"14","bhṛto","BHṚT","o","bhṛta","noun-adj",""
"15","dārāṃs","DĀR","āṃs","dāra","noun-adj",""
"16","ca","","","ca","ind",""
"17","bhāvanu","BHĀVAN","u@","bhāvanā","noun-adj",""
"18","gān","GĀN","","gāna","noun-adj",""
"19","prādās","PRĀD","ās","prāda","noun-adj",""
"20","tvaṃ","","","tvat","pron",""
"21","jina","JIN","a","jina","noun-adj",""
"22","tena","","","tad","pron",""
"23","nūnam","NŪN","am","nūna","noun-adj",""
"24","ah","","","","ind",""
"25","havan","HAVAN","","havat","noun-adj",""
"26","māra","MĀR","a@","māra","noun-adj",""
"27","āṅganānāṃ","AṄGAN","ānāṃ","aṅgana","noun-adj",""
"28","mukhaṃ","MUKH","aṃ","mukha","noun-adj",""
"29","saṃkoca","SAṂKOC","a@","saṃkoca","noun-adj",""
"30","āñcita","AÑCIT","a@","añcita","noun-adj",""
"31","pakṣma","PAKṢM","a@","pakṣma","noun-adj",""
"32","locana","LOCAN","a@","locana","noun-adj",""
"33","dalaṃ","DAL","aṃ","dala","noun-adj",""
"34","lajjālasā","LAJJĀL","asā","lajjālu","noun-adj",""
"35","mantharam","MANTHAR","am","manthara","noun-adj",""
"36","//","","","","punct",""
"","</page>","","","","",""
"","<page number=""9"">","","","","",""
"","</s>","","","","",""
"","<s number=""9"">","","","","",""
"1","śayyā","ŚAYY","ā@","śayyā","noun-adj",""
"2","svapna","SVAPN","a@","svapna","noun-adj",""
"3","vicāriṇā","VICĀR","iṇā","vicārin","noun-adj",""
"4","vana","VAN","a@","vana","noun-adj",""
"5","bhuvāṃ","BHUV","āṃ","bhuvā","noun-adj",""
"6","bhūtvā","BHŪTV","ā","bhūtvā","noun-adj",""
"7","purā","PUR","ā","pura","noun-adj",""
"8","pakṣiṇā","PAKṢ","iṇā","pakṣin","noun-adj",""
"9","bhinnāś","BHINN","āś","bhinna","noun-adj",""
"10","eṣakale","EṢAK","ale","eṣakat","noun-adj",""
"11","jagat","JAGAT","","jagat","noun-adj",""
"12","y","","","","ind",""
"13","a","","","alpha_privativum","ind",""
"14","vikale","VIKAL","e","vikala","noun-adj",""
"15","jyāyaḥ","JYĀY","aḥ","jyāya","noun-adj",""
"16","patha","PATH","a@","patha","noun-adj",""
"17","āśaṃsinā","ĀŚAṂS","inā","āśaṃsin","noun-adj",""
"18","vistāraṃ","VISTĀR","aṃ","vistāra","noun-adj",""
"19","gamitaṃ","GAMIT","aṃ","gamita","noun-adj",""
"20","vrataṃ","VRAT","aṃ","vrata","noun-adj",""
"21","vrata","VRAT","a@","vrata","noun-adj",""
"22","bhṛtāṃ","BHṚT","āṃ","bhṛtā","noun-adj",""
"23","yan","","","yad","pron",""
"24","nātha","NĀTH","a","nātha","noun-adj",""
"25","kāpiñ","KĀP","iñ","kāpa","noun-adj",""
"26","jalaṃ","JAL","aṃ","jala","noun-adj",""
"27","ten","","","tad","pron",""
"28","^","","","","",""
"29","ājñāna","ĀJÑĀN","a@","ājñāna","noun-adj",""
"30","rujāṃ","RUJ","āṃ","rujā","noun-adj",""
"31","kirīṭa","KIRĪṬ","a@","kirīṭa","noun-adj",""
"32","kiraṇa","KIRAṆ","a@","kiraṇa","noun-adj",""
"33","cchāyās","ŚĀY","ās","śāya","noun-adj",""
"34","padaṃ","PAD","aṃ","pada","noun-adj",""
"35","vo","","","yuṣmat","pron",""
"36","gatāḥ","GAT","āḥ","gata","noun-adj",""
"37","//","","","","punct",""
"","</page>","","","","",""
"","<page number=""10"">","","","","",""
"","</s>","","","","",""
"","<s number=""10"">","","","","",""
"1","yat","","","yad","pron",""
"2","parṇa","PARṆ","a@","parṇa","noun-adj",""
"3","āmbu","ĀMB","u@","āmba","noun-adj",""
"4","phala","PHAL","a@","phala","noun-adj",""
"5","āśinīṃ","ĀŚIN","īṃ","āśinī","noun-adj",""
"6","śaśa","ŚAŚ","a@","śaśa","noun-adj",""
"7","tan","TAN","","tad","pron",""
"8","uṃ","","","","ind",""
"9","tvaṃ","","","tvat","pron",""
"10","nātha","NĀTH","a","nātha","noun-adj",""
"11","bibhrat","BIBHR","at","bibhrat","noun-adj",""
"12","purā","PUR","ā","pura","noun-adj",""
"13","tat","TAT","","tad","pron",""
"14","kāla","KĀL","a@","kāla","noun-adj",""
"15","ātithaye","ATITH","aye","atithi","noun-adj",""
"16","kṛpā","KṚP","ā@","kṛpā","noun-adj",""
"17","paricayād","PARICAY","ād","paricaya","noun-adj",""
"18","ātithyam","ĀTITHY","am","ātithya","noun-adj",""
"19","āvedayan","ĀVED","ayan","āveda","noun-adj",""
"20","ārūḍhaḥ","ĀRŪḌH","aḥ","ārūḍha","noun-adj",""
"21","sphuṭa","SPHUṬ","a@","sphuṭa","noun-adj",""
"22","visphuliṅgam","VISPHULIṄG","am","visphuliṅga","noun-adj",""
"23","a","","","alpha_privativum","ind",""
"24","nalaṃ","NAL","aṃ","nala","noun-adj",""
"25","ten","","","tad","pron",""
"26","^","","","","",""
"27","ādhun","ĀDHUN","","dadh","verb","dhā"
"28","^","","","","",""
"29","āpi","","","api","ind",""
"30","kṣitāv","KṢIT","āv","kṣita","noun-adj",""
"31","indor","IND","or","indu","noun-adj",""
"32","maṇḍala","MAṆḌAL","a@","maṇḍala","noun-adj",""
"33","lāñchanaṃ","LĀÑCHAN","aṃ","lāñchana","noun-adj",""
"34","śaśam","ŚAŚ","am","śaśa","noun-adj",""
"35","ayaṃ","AYAṂ","","idam","pron",""
"36","yuṣ","","","","ind",""
"37","madyaśo","MADY","aśo","madya","noun-adj",""
"38","laksyate","LAK","syate","lak","verb",""
"39","//","","","","punct",""
"","</page>","","","","",""
"","<page number=""11"">","","","","",""
"","</s>","","","","",""
"","<s number=""11"">","","","","",""
"1","yat","","","yad","pron",""
"2","kopa","KOP","a@","kopa","noun-adj",""
"3","āruṇa","ĀRUṆ","a@","āruṇa","noun-adj",""
"4","dṛṣṭinā","DṚṢṬ","inā","dṛṣṭi","noun-adj",""
"5","kala","KAL","a@","kala","noun-adj",""
"6","bhuvā","BHUV","ā","bhuva","noun-adj",""
"7","kṛtvā","KṚTV","ā","kṛtvā","noun-adj",""
"8","bhruvor","BHRUV","or","bhruva","noun-adj",""
"9","bhaṅginīṃ","BHAṄG","inīṃ","bhaṅgin","noun-adj",""
"10","lekhām","LEKH","ām","lekhā","noun-adj",""
"11","ullasita","ULLASIT","a@","ullasita","noun-adj",""
"12","āsinā","ĀSIN","ā","āsinā","noun-adj",""
"13","vidalita","VIDALIT","a@","vidalita","noun-adj",""
"14","pratyaṅgam","PRATYAṄG","am","pratyaṅga","noun-adj",""
"15","āśaṅkinā","ĀŚAṄK","inā","āśaṅkin","noun-adj",""
"16","tvām","","","tvat","pron",""
"17","āsīt","ĀSĪT","","as","verb","as"
"18","kṣaṇam","KṢAṆ","am","kṣaṇa","noun-adj",""
"19","apy","","","api","ind",""
"20","a","","","alpha_privativum","ind",""
"21","vikṣat","VIKṢAT","","vikṣata","noun-adj",""
"22","adhiyaṃ","ADHIY","aṃ","adhiya","noun-adj",""
"23","tyaktu","TYAKT","u@","tyakta","noun-adj",""
"24","kṣamā","KṢAM","ā","kṣamā","noun-adj",""
"25","na","","","na","ind",""
"26","kṣamā","KṢAM","ā","kṣamā","noun-adj",""
"27","manye","MANY","e","manya","noun-adj",""
"28","tena","","","tad","pron",""
"29","niraṅkuśāḥ","NIRAṄKUŚ","āḥ","niraṅkuśa","noun-adj",""
"30","smara","SMAR","a@","smara","noun-adj",""
"31","śarāḥ","ŚAR","āḥ","śara","noun-adj",""
"32","puṅkheṣu","PUṄKH","eṣu","puṅkha","noun-adj",""
"33","bhaṅgaṃ","BHAṄG","aṃ","bhaṅga","noun-adj",""
"34","gatāḥ","GAT","āḥ","gata","noun-adj",""
"35","//","","","","punct",""
"","</page>","","","","",""
"","<page number=""12"">","","","","",""
"","</s>","","","","",""
"","<s number=""12"">","","","","",""
"1","yad","","","yadi","ind",""
"2","dveṣī","DVEṢ","ī","dveṣin","noun-adj",""
"3","kariṇā","KARIṆ","ā","kariṇa","noun-adj",""
"4","cira","CIR","a@","cira","noun-adj",""
"5","ātata","ĀTAT","a@","ātata","noun-adj",""
"6","dhanur","DHAN","ur","dhanu","noun-adj",""
"7","dantais","DANT","ais","danta","noun-adj",""
"8","tvay","","","tvat","pron",""
"9","ābhyarcitaḥ","ABHYARCIT","aḥ","abhyarcita","noun-adj",""
"10","ṣaḍ","ṢAḌ","","ṣaṭ","noun-adj",""
"11","dantena","DANT","ena","danta","noun-adj",""
"12","satā","SAT","ā","sat","noun-adj",""
"13","sita","SIT","a@","sita","noun-adj",""
"14","onnat","UNN","at","unnat","noun-adj",""
"15","abṛhaj","ABṚH","aj","abṛha","noun-adj",""
"16","jīmūta","JĪMŪT","a@","jīmūta","noun-adj",""
"17","puñja","PUÑJ","a@","puñja","noun-adj",""
"18","tviṣā","TVIṢ","ā","tviṣā","noun-adj",""
"19","kośa","KOŚ","a@","kośa","noun-adj",""
"20","ākarṣaṇa","ĀKARṢAṆ","a@","ākarṣaṇa","noun-adj",""
"21","vānta","VĀNT","a@","vānta","noun-adj",""
"22","bhūri","BHŪR","i@","bhūri","noun-adj",""
"23","rudhi","RUDH","i@","rudha","noun-adj",""
"24","rakṣo","RAKṢ","o@","rakṣa","noun-adj",""
"25","dāruṇais","DĀRUṆ","ais","dāruṇa","noun-adj",""
"26","tena","","","tad","pron",""
"27","vaḥ","","","yuṣmat","pron",""
"28","pātāle","PĀTĀL","e","pātāla","noun-adj",""
"29","api","","","api","ind",""
"30","bhujaṃ","BHUJ","aṃ","bhuja","noun-adj",""
"31","gamaiḥ","GAM","aiḥ","gama","noun-adj",""
"32","ślatha","ŚLATH","a@","ślatha","noun-adj",""
"33","phaṇair","PHAṆ","air","phaṇa","noun-adj",""
"34","ady","ADY","","adya","noun-adj",""
"35","^","","","","",""
"36","āpi","","","api","ind",""
"37","daṃṣtr","","","","ind",""
"38","ārcyate","ĀRC","yate","ārca","noun-adj",""
"39","//","","","","punct",""
"","</page>","","","","",""
"","<page number=""13"">","","","","",""
"","</s>","","","","",""
"","<s number=""13"">","","","","",""
"1","saṃrambhāt","SAṂRAMBH","āt","saṃrambha","noun-adj",""
"2","phaṇināṃ","PHAṆ","ināṃ","phaṇin","noun-adj",""
"3","phaṇā","PHAṆ","ā@","phaṇa","noun-adj",""
"4","hati","HAT","i@","hati","noun-adj",""
"5","calād","CAL","ād","cala","noun-adj",""
"6","bhīmor","BHĪM","or","bhīmu","noun-adj",""
"7","mi","","","","ind",""
"8","mālād","MĀL","ād","māla","noun-adj",""
"9","apāṃ","APĀṂ","","apāṃa","noun-adj",""
"10","patyur","PATY","ur","patyu","noun-adj",""
"11","yan","","","yad","pron",""
"12","makara","MAKAR","a@","makara","noun-adj",""
"13","cchaṭā","ŚAṬ","ā@","śaṭā","noun-adj",""
"14","vilulitāt","VILULIT","āt","vilulita","noun-adj",""
"15","paryasta","PARYAST","a@","paryasta","noun-adj",""
"16","naukā","NAUK","ā","naukā","noun-adj",""
"17","narāḥ","NAR","āḥ","nara","noun-adj",""
"18","premṇā","PREM","ṇā","prema","noun-adj",""
"19","kāyam","KĀY","am","kāya","noun-adj",""
"20","ah","","","","ind",""
"21","āplavena","APLAV","ena","aplava","noun-adj",""
"22","bhavatā","BHAV","atā","bhavat","noun-adj",""
"23","tīra","TĪR","a@","tīra","noun-adj",""
"24","āntam","ANTAM","","antama","noun-adj",""
"25","āpāditās","ĀPĀD","itās","āpāda","noun-adj",""
"26","tat","","","tad","pron",""
"27","karma","KARM","a@","karman","noun-adj",""
"28","ātiśayena","ATIŚAY","ena","atiśaya","noun-adj",""
"29","tena","","","tad","pron",""
"30","nikhilā","NIKHIL","ā","nikhila","noun-adj",""
"31","lokāḥ","LOK","āḥ","loka","noun-adj",""
"32","kalatrīkrtāḥ","KALATR","īkrtāḥ","kalatrīka","noun-adj",""
"33","//","","","","punct",""
"","</page>","","","","",""
"","<page number=""14"">","","","","",""
"","</s>","","","","",""
"","<s number=""14"">","","","","",""
"1","śailān","ŚAIL","ān","śaila","noun-adj",""
"2","maṇḍalino","MAṆḌAL","ino","maṇḍalin","noun-adj",""
"3","vilaṅghya","VILAṄGHY","a","vilaṅghya","noun-adj",""
"4","viṣayāṃs","VIṢAY","āṃs","viṣaya","noun-adj",""
"5","toya","TOY","a@","toya","noun-adj",""
"6","āvalī","ĀVAL","ī@","āvalī","noun-adj",""
"7","mekhalān","MEKHAL","ān","mekhala","noun-adj",""
"8","yac","","","yad","pron",""
"9","cintā","CINT","ā@","cintā","noun-adj",""
"10","maṇinā","MAṆ","inā","maṇi","noun-adj",""
"11","narendra","NARENDR","a","narendra","noun-adj",""
"12","badaradvīpa","BADARADVĪP","a@","badaradvīpa","noun-adj",""
"13","āntarāla","ĀNTARĀL","a@","āntarāla","noun-adj",""
"14","odarāt","UDAR","āt","udara","noun-adj",""
"15","labdhvā","LABDH","vā","labdha","noun-adj",""
"16","pūrṇa","PŪRṆ","a@","pūrṇa","noun-adj",""
"17","phalās","PHAL","ās","phala","noun-adj",""
"18","tvayā","","","tvat","pron",""
"19","praṇayinām","PRAṆAY","inām","praṇayin","noun-adj",""
"20","āś","","","","ind",""
"21","āvabandhāḥ","AVABANDH","āḥ","avabandha","noun-adj",""
"22","kṛtās","KṚT","ās","kṛta","noun-adj",""
"23","tvattas","TVAT","tas","tvata","pron",""
"24","tena","","","tad","pron",""
"25","samudbhavanti","SAMUDBHAV","anti","samudbhav","verb","samudbhū"
"26","viduṣāṃ","VIDUṢ","āṃ","viduṣā","noun-adj",""
"27","sad","SAD","","sat","noun-adj",""
"28","dharma","DHARM","a@","dharma","noun-adj",""
"29","ratna","RATN","a@","ratna","noun-adj",""
"30","āṅkurāḥ","AṄKUR","āḥ","aṅkura","noun-adj",""
"31","//","","","","punct",""
"","</page>","","","","",""
"","<page number=""15"">","","","","",""
"","</s>","","","","",""
"","<s number=""15"">","","","","",""
"1","sāndrā","SĀNDR","ā@","sāndra","noun-adj",""
"2","bhrānta","BHRĀNT","a@","bhrānta","noun-adj",""
"3","vitāna","VITĀN","a@","vitāna","noun-adj",""
"4","nīla","NĪL","a@","nīla","noun-adj",""
"5","vapuṣām","VAPUṢ","ām","vapuṣā","noun-adj",""
"6","ojo","OJ","o@","oja","noun-adj",""
"7","muṣāṃ","MUṢ","āṃ","muṣā","noun-adj",""
"8","rakṣasāṃ","RAKṢ","asāṃ","rakṣas","noun-adj",""
"9","khaḍga","KHAḌG","a@","khaḍga","noun-adj",""
"10","otkṛta","UTKṚT","a@","utkṛti","noun-adj",""
"11","tad","TAD","","tad","pron",""
"12","alair","","","","ind",""
"13","vipāṭita","VIPĀṬIT","a@","vipāṭita","noun-adj",""
"14","śirā","ŚIR","ā@","śirā","noun-adj",""
"15","randhra","RANDHR","a@","randhra","noun-adj",""
"16","srava","SRAV","a@","srava","noun-adj",""
"17","allo","ALL","o@","allā","noun-adj",""
"18","hitaiḥ","HIT","aiḥ","hita","noun-adj",""
"19","yan","","","yad","pron",""
"20","māṃsair","MĀṂS","air","māṃsa","noun-adj",""
"21","a","","","alpha_privativum","ind",""
"22","kṛthāḥ","KṚ","thāḥ","kṛ","verb",""
"23","kṣudhā","KṢUDH","ā@","kṣudhā","noun-adj",""
"24","vyupaśamaṃ","VYUPAŚAM","aṃ","vyupaśama","noun-adj",""
"25","svair","SVAIR","","svaira","noun-adj",""
"26","a","","","alpha_privativum","ind",""
"27","vyapeta","VYAPET","a@","vyapeta","noun-adj",""
"28","oṣmabhir","UṢM","abhir","uṣma","noun-adj",""
"29","yogā","YOG","ā","yogā","noun-adj",""
"30","janma","JANM","a@","janma","noun-adj",""
"31","rudho","RUDH","o","rudha","noun-adj",""
"32","bhava","BHAV","a@","bhava","noun-adj",""
"33","odbhava","UDBHAV","a@","udbhava","noun-adj",""
"34","tṛṣām","TṚṢ","ām","tṛṣā","noun-adj",""
"35","ucchedinas","UCCHED","inas","ucchedin","noun-adj",""
"36","tena","","","tad","pron",""
"37","vaḥ","","","yuṣmat","pron",""
"38","//","","","","punct",""
"","</page>","","","","",""
"","<page number=""16"">","","","","",""
"","</s>","","","","",""
"","<s number=""16"">","","","","",""
"1","śyena","ŚYEN","a@","śyena","noun-adj",""
"2","ottrāsa","UTTRĀS","a@","uttrāsa","noun-adj",""
"3","viśuṣka","VIŚUṢK","a@","viśuṣka","noun-adj",""
"4","kampitaga","KAMP","itaga","kampa","noun-adj",""
"5","lasy","LAS","y@","lasi","noun-adj",""
"6","otsaṅga","UTSAṄG","a@","utsaṅga","noun-adj",""
"7","saṃsarpiṇo","SAṂSARP","iṇo","saṃsarpin","noun-adj",""
"8","yan","","","yad","pron",""
"9","niḥsaṅga","NIḤSAṄG","a@","niḥsaṅga","noun-adj",""
"10","ratā","RAT","ā","ratā","noun-adj",""
"11","śivāya","ŚIV","āya","śiva","noun-adj",""
"12","śibinā","ŚIB","inā","śibi","noun-adj",""
"13","rājñā","RĀJÑ","ā","rājan","noun-adj",""
"14","satā","SAT","ā","sat","noun-adj",""
"15","pakṣiṇaḥ","PAKṢ","iṇaḥ","pakṣin","noun-adj",""
"16","rakta","RAKT","a@","rakta","noun-adj",""
"17","odgāra","UDGĀR","a@","udgāra","noun-adj",""
"18","kalaṅkita","KALAṄKIT","a@","kalaṅkita","noun-adj",""
"19","ātula","ATUL","a","atula","noun-adj",""
"20","tulām","TUL","ām","tulā","noun-adj",""
"21","āropitā","ĀROPIT","ā","āropita","noun-adj",""
"22","te","","","tad","pron",""
"23","tanur","TAN","ur","tanu","noun-adj",""
"24","māras","MĀR","as","māra","noun-adj",""
"25","tena","","","tad","pron",""
"26","dukūla","DUKŪL","a@","dukūla","noun-adj",""
"27","pakṣma","PAKṢM","a@","pakṣma","noun-adj",""
"28","taralaṃ","TARAL","aṃ","tarala","noun-adj",""
"29","nītas","NĪT","as","nīta","noun-adj",""
"30","tulā","TUL","ā@","tulā","noun-adj",""
"31","lāghavam","LĀGHAV","am","lāghava","noun-adj",""
"32","//","","","","punct",""
"","</page>","","","","",""
"","<page number=""17"">","","","","",""
"","</s>","","","","",""
"","<s number=""17"">","","","","",""
"1","lakṣmīm","LAKṢM","īm","lakṣmī","noun-adj",""
"2","apy","","","api","ind",""
"3","avadhūya","AVADHŪY","a","avadhūya","noun-adj",""
"4","vāñchita","VĀÑCHIT","a@","vāñchita","noun-adj",""
"5","phalām","PHAL","ām","phala","noun-adj",""
"6","ākhaṇa","ĀKHAṆ","a@","ākhaṇa","noun-adj",""
"7","ḍam","ḌAM","","ḍama","noun-adj",""
"8","ādhvaṃ","ADHV","aṃ","adhva","noun-adj",""
"9","sinīṃ","SIN","īṃ","sinī","noun-adj",""
"10","yat","","","yad","pron",""
"11","tiryak","TIRYA","k@","tiryak","noun-adj",""
"12","pratisandhi","PRATISANDH","i@","pratisandhi","noun-adj",""
"13","bandham","BANDH","am","bandha","noun-adj",""
"14","a","","","alpha_privativum","ind",""
"15","dhamaṃ","DHAM","aṃ","dhama","noun-adj",""
"16","kṛtvā","KṚTV","ā","kṛtvā","noun-adj",""
"17","bhavāñ","BHAV","āñ","bhava","noun-adj",""
"18","janma","JANM","a@","janma","noun-adj",""
"19","nām","NĀM","","nāman","noun-adj",""
"20","cakre","CAKR","e","cakra","noun-adj",""
"21","marma","MARM","a@","marman","noun-adj",""
"22","bhidāṃ","BHID","āṃ","bhidā","noun-adj",""
"23","rujāṃ","RUJ","āṃ","rujā","noun-adj",""
"24","sva","SV","a@","sva","noun-adj",""
"25","piśitaiḥ","PIŚIT","aiḥ","piśita","noun-adj",""
"26","prābandha","PRĀBANDH","a@","prābandha","noun-adj",""
"27","kīnāṃ","KĪN","āṃ","kīna","noun-adj",""
"28","śamaṃ","ŚAM","aṃ","śama","noun-adj",""
"29","tena","","","tad","pron",""
"30","kleśa","KLEŚ","a@","kleśa","noun-adj",""
"31","viṣa","VIṢ","a@","viṣa","noun-adj",""
"32","cchidāṃ","CHID","āṃ","chidā","noun-adj",""
"33","tava","","","tvat","pron",""
"34","dhiyāṃ","DHIY","āṃ","dhiyāyate","noun-adj",""
"35","a","","","alpha_privativum","ind",""
"36","vyāhatāḥ","VYĀHAT","āḥ","vyāhata","noun-adj",""
"37","śaktayaḥ","ŚAKT","ayaḥ","śakti","noun-adj",""
"38","//","","","","punct",""
"","</page>","","","","",""
"","<page number=""18"">","","","","",""
"","</s>","","","","",""
"","<s number=""18"">","","","","",""
"1","yat","","","yad","pron",""
"2","sandoham","SAND","oham","sanda","noun-adj",""
"3","iva","","","iva","ind",""
"4","śriyāḥ","ŚRIY","āḥ","śriya","noun-adj",""
"5","phalam","PHAL","am","phala","noun-adj",""
"6","iva","","","iva","ind",""
"7","procchrāyi","PROCCHR","āyi","procchra","noun-adj",""
"8","puṇya","PUṆY","a@","puṇya","noun-adj",""
"9","aujasāṃ","AUJAS","āṃ","aujasa","noun-adj",""
"10","digdhaṃ","DIGDH","aṃ","digdha","noun-adj",""
"11","rakta","RAKT","a@","rakta","noun-adj",""
"12","kaṇaiḥ","KAṆ","aiḥ","kaṇa","noun-adj",""
"13","sphurat","SPHUR","at","sphurat","noun-adj",""
"14","kuvala","KUVAL","a@","kuvala","noun-adj",""
"15","yacchā","YACCH","ā@","yacchā","noun-adj",""
"16","yābhi","YĀBH","i@","yad","pron",""
"17","nīla","NĪL","a@","nīla","noun-adj",""
"18","āyitam","ĀYIT","am","āyita","noun-adj",""
"19","utpāṭyā","UTPĀṬY","ā@","utpāṭya","noun-adj",""
"20","kṣata","KṢAT","a@","kṣata","noun-adj",""
"21","locana","LOCAN","a@","locana","noun-adj",""
"22","dvayam","DVAY","am","dvaya","noun-adj",""
"23","a","","","alpha_privativum","ind",""
"24","dād","DĀD","","dāda","noun-adj",""
"25","viprāya","VIPR","āya","vipra","noun-adj",""
"26","niścakṣuṣe","NIŚCAKṢ","uṣe","niścakṣu","noun-adj",""
"27","ten","","","tad","pron",""
"28","^","","","","",""
"29","āndhasya","ĀNDHAS","ya","āndhasa","noun-adj",""
"30","tamasvato","TAMAS","vato","tamasvat","noun-adj",""
"31","jagatas","JAGAT","as","jagat","noun-adj",""
"32","tuṅg","TUṄG","","tuṅga","noun-adj",""
"33","aika","EK","a@","eka","noun-adj",""
"34","dīpo","DĪP","o","dīpa","noun-adj",""
"35","bhavān","BHAV","ān","bhava","noun-adj",""
"36","//","","","","punct",""
"","</page>","","","","",""
"","<page number=""19"">","","","","",""
"","</s>","","","","",""
"","<s number=""19"">","","","","",""
"1","ity","","","iti","ind",""
"2","ātma","ĀTM","a@","ātman","noun-adj",""
"3","ārtha","ARTH","a@","artha","noun-adj",""
"4","nibandhin","NIBANDH","in","nibandhin","noun-adj",""
"5","edam","EDAM","","idam","pron",""
"6","ṛṣi","ṚṢ","i@","ṛṣi","noun-adj",""
"7","vākya","VĀKY","a@","vākya","noun-adj",""
"8","ālaṃkṛtaṃ","ALAṂKṚT","aṃ","alaṃkṛta","noun-adj",""
"9","darśitaṃ","DARŚIT","aṃ","darśita","noun-adj",""
"10","leśasy","LEŚ","asy","leśa","noun-adj",""
"11","^","","","","",""
"12","āpi","","","api","ind",""
"13","na","","","na","ind",""
"14","kīrtanaṃ","KĪRTAN","aṃ","kīrtana","noun-adj",""
"15","jina","JIN","a","jina","noun-adj",""
"16","kṛtaṃ","KṚT","aṃ","kṛta","noun-adj",""
"17","tvad","","","tvat","pron",""
"18","varṇa","VARṆ","a@","varṇa","noun-adj",""
"19","rāśer","RĀŚ","er","rāśi","noun-adj",""
"20","mama","MAM","a","mat","pron",""
"21","tāra","TĀR","a@","tāra","noun-adj",""
"22","ābdhā","ABDH","ā@","abdhi","noun-adj",""
"23","navatāṃ","NAVAT","āṃ","navatā","noun-adj",""
"24","jalaṃ","JAL","aṃ","jala","noun-adj",""
"25","jala","JAL","a@","jala","noun-adj",""
"26","purām","PUR","ām","pura","noun-adj",""
"27","ākarṣatā","ĀKARṢ","atā","ākarṣatā","noun-adj",""
"28","vāri","VĀR","i@","vāri","noun-adj",""
"29","dher","DH","er","dhī","noun-adj",""
"30","velān","VEL","ān","velā","noun-adj",""
"31","teṣv","","","tad","pron",""
"32","iva","","","iva","ind",""
"33","rodhasāṃ","RODH","asāṃ","rodhas","noun-adj",""
"34","jala","JAL","a@","jala","noun-adj",""
"35","lava","LAV","a@","lava","noun-adj",""
"36","cchedo","CHED","o","cheda","noun-adj",""
"37","hi","","","hi","ind",""
"38","saṃlakṣyate","SAṂLAKṢ","yate","saṃlakṣ","verb","saṃlakṣ"
"39","//","","","","punct",""
"","</page>","","","","",""
"","<page number=""20"">","","","","",""
"","</s>","","","","",""
"","<s number=""20"">","","","","",""
"1","tvac","TVAC","","tvaca","noun-adj",""
"2","caryāti","CAR","yāti","cara","noun-adj",""
"3","śaya","ŚAY","a@","śaya","noun-adj",""
"4","āṃśaleśa","AṂŚAL","eśa","aṃśala","noun-adj",""
"5","racanād","RACAN","ād","racanā","noun-adj",""
"6","yaḥ","","","yad","pron",""
"7","śreyasām","ŚREYAS","ām","śreyasā","noun-adj",""
"8","udbhavaḥ","UDBHAV","aḥ","udbhava","noun-adj",""
"9","sambhāro","SAMBHĀR","o","sambhāra","noun-adj",""
"10","vipula","VIPUL","a@","vipula","noun-adj",""
"11","prasāda","PRASĀD","a@","prasāda","noun-adj",""
"12","vikasad","VIKAS","ad","vikasat","noun-adj",""
"13","bhakta","BHAKT","a@","bhakta","noun-adj",""
"14","yācitāṃ","YĀCIT","āṃ","yācitā","noun-adj",""
"15","śasya","ŚASY","a","śasya","noun-adj",""
"16","me","","","mat","pron",""
"17","ten","","","tad","pron",""
"18","^","","","","",""
"19","ātyanta","ATYANT","a@","atyanta","noun-adj",""
"20","para","PAR","a@","para","noun-adj",""
"21","opakāra","UPAKĀR","a@","upakāra","noun-adj",""
"22","nirataḥ","NIRAT","aḥ","nirata","noun-adj",""
"23","svārthe","SVĀRTH","e","svārtha","noun-adj",""
"24","api","","","api","ind",""
"25","manda","MAND","a@","manda","noun-adj",""
"26","ādaro","ĀDAR","o","ādara","noun-adj",""
"27","bhūyāt","BHŪY","āt","bhūya","noun-adj",""
"28","sarva","SARV","a@","sarva","noun-adj",""
"29","vidāṃ","VID","āṃ","vidā","noun-adj",""
"30","parārtha","PARĀRTH","a@","parārtha","noun-adj",""
"31","viduṣāṃ","VIDUṢ","āṃ","viduṣā","noun-adj",""
"32","yān","","","yad","pron",""
"33","aikatāno","EKAT","āno","ekata","noun-adj",""
"34","janaḥ","JAN","aḥ","jana","noun-adj",""
"35","//","","","","punct",""
"","</s>","","","","",""
"","<s number=""21"">","","","","",""
"1","jātaka","JĀTAK","a@","jātaka","noun-adj",""
"2","stava","STAV","a","stava","noun-adj",""
"3","ācārya","ĀCĀRY","a@","ācārya","noun-adj",""
"4","jñāna","JÑĀN","a@","jñāna","noun-adj",""
"5","yaśasaḥ","YAŚAS","aḥ","yaśasa","noun-adj",""
"","</s>","","","","",""
"","</page>","","","","",""
"","</doc>","","","","",""
