"WordID","word","NormSTEM","suffix","lemma","PoS","Root"
NA,"<doc textid = ""mrtyuvajcanatarasadhana"" genre = ""sādhana"" title = ""mṛtyuvañcanatārāsādhana"" author = ""vāgīśvarakīrti"" discourse = ""tantra"" tradition = ""tantra"" period = ""commentarial"" source = ""gretil accessed aug 2019 : http://gretil.sub.uni-goettingen.de/gretil/corpustei/sa_gretilbuddh _ mrtyuvancanatarasahana _final.xml"" date_range = ""10.-11. ce"" notes = ""alternative genre: tantra; tantric sādhana"" religion = ""buddh"" edition = ""based on the ed. by j. schneider 2010 page number = verse number"" digitization = ""j. schneider"" segmentation_lemmatization = ""ligeia lugli & buddhist translators workbench team"" metadata_enrichment = ""bruno galasek-hul & buddhist translators workbench team"" proofreader = ""n/a"" permission = ""permission for derivatives from m. mehner on behalf of gretil"" reconstructions = ""none"">","","","","",NA
NA,"<page number=""0"">","","","","",NA
NA,"<s number=""0"">","","","","",NA
1,"mṛtyu","MṚTY","u@","mṛtyu","noun-adj",NA
2,"vañcana","VAÑCAN","a@","vañcana","noun-adj",NA
3,"tāra","TĀR","a@","tāra","noun-adj",NA
4,"āsādhana","ASĀDHAN","a","asādhana","noun-adj",NA
5,"//","","","","punct",NA
6,"namaḥ","NAM","aḥ","nama","noun-adj",NA
7,"sitatārāyai","SITATĀR","āyai","sitatārā","noun-adj",NA
8,"//","","","","punct",NA
9,"pūrvavac","PŪRV","avac","pūrvu","noun-adj",NA
10,"chūnyata","ŚŪNYAT","a@","śūnyatā","noun-adj",NA
11,"ā","","","alpha_privativum","ind",NA
12,"paryantaṃ","PARYANT","aṃ","paryanta","noun-adj",NA
13,"vibhāvya","VIBHĀVY","a","vibhāvya","noun-adj",NA
14,"sitā","SIT","ā@","sita","noun-adj",NA
15,"ravindam","RAVIND","am","ravinda","noun-adj",NA
16,"adhyasthāṃ","ADHYASTH","āṃ","adhyasthā","noun-adj",NA
17,"tāṃ","","","tad","pron",NA
18,"bhūtāṃ","BHŪT","āṃ","bhūtā","noun-adj",NA
19,"candra","CANDR","a@","candra","noun-adj",NA
20,"viṣṭarām","VIṢṬAR","ām","viṣṭara","noun-adj",NA
21,"/","","","","punct",NA
22,"ābaddha","ĀBADDH","a@","ābaddha","noun-adj",NA
23,"vajra","VAJR","a@","vajra","noun-adj",NA
24,"paryaṅkāṃ","PARYAṄK","āṃ","paryaṅkā","noun-adj",NA
25,"varad","VAR","ad","varat","noun-adj",NA
26,"otpala","UTPAL","a@","utpala","noun-adj",NA
27,"dhāriṇīm","DHĀRIṆ","īm","dhāriṇī","noun-adj",NA
28,"//","","","","punct",NA
29,"1","","","","ind",NA
30,"//","","","","punct",NA
NA,"</s>","","","","",NA
NA,"</page>","","","","",NA
NA,"<page number=""1"">","","","","",NA
NA,"<s number=""1"">","","","","",NA
1,"śarac","ŚAR","ac","śarat","noun-adj",NA
2,"candrakar","CANDRAK","ar","candraka","noun-adj",NA
3,"ākārāṃ","ĀKĀR","āṃ","ākārā","noun-adj",NA
4,"pṛṣṭha","PṚṢṬH","a@","pṛṣṭha","noun-adj",NA
5,"candra","CANDR","a@","candra","noun-adj",NA
6,"samāśritām","SAMĀŚRIT","ām","samāśrita","noun-adj",NA
7,"/","","","","punct",NA
8,"sarva","SARV","a@","sarva","noun-adj",NA
9,"ālaṅkāra","ALAṄKĀR","a@","alaṅkāra","noun-adj",NA
10,"saṃpūrṇāṃ","SAṂPŪRṆ","āṃ","saṃpūrṇa","noun-adj",NA
11,"ṣoḍaśa","ṢOḌAŚ","a@","ṣoḍaśa","noun-adj",NA
12,"ābda","ABD","a@","abda","noun-adj",NA
13,"vapuḥ","VAP","uḥ","vapu","noun-adj",NA
14,"kramām","KRAM","ām","kramā","noun-adj",NA
15,"//","","","","punct",NA
16,"2","","","","ind",NA
17,"//","","","","punct",NA
NA,"</s>","","","","",NA
NA,"</page>","","","","",NA
NA,"<page number=""2"">","","","","",NA
NA,"<s number=""2"">","","","","",NA
1,"dhyātva","DHYĀTV","a@","dhyātva","noun-adj",NA
2,"ārya","ĀRY","a@","ārya","noun-adj",NA
3,"tārāṃ","TĀR","āṃ","tāra","noun-adj",NA
4,"hṛdaye","HṚDAY","e","hṛdaya","noun-adj",NA
5,"tasyāś","","","tad","pron",NA
6,"cakraṃ","CAKR","aṃ","cakra","noun-adj",NA
7,"sita","SIT","a@","sita","noun-adj",NA
8,"dyuti","DYUT","i","dyuti","noun-adj",NA
9,"/","","","","punct",NA
10,"aṣṭa","AṢṬ","a@","aṣṭa","noun-adj",NA
11,"koṣṭhakam","KOṢṬH","akam","koṣṭhaka","noun-adj",NA
12,"aṣṭābhir","AṢṬ","ābhir","aṣṭā","noun-adj",NA
13,"akṣaraiḥ","AKṢAR","aiḥ","akṣara","noun-adj",NA
14,"paripūritam","PARIPŪR","itam","paripūra","noun-adj",NA
15,"//","","","","punct",NA
16,"3","","","","ind",NA
17,"//","","","","punct",NA
NA,"</s>","","","","",NA
NA,"</page>","","","","",NA
NA,"<page number=""3"">","","","","",NA
NA,"<s number=""3"">","","","","",NA
1,"oṃh","","","","ind",NA
2,"āvyañ","AVY","añ@","avya","noun-adj",NA
3,"jana","JAN","a@","jana","noun-adj",NA
4,"madhya","MADH","ya@","madhu","noun-adj",NA
5,"stha","STH","a@","stha","noun-adj",NA
6,"sādhyanā","SĀDHY","anā","sādhyā","noun-adj",NA
7,"mādya","MĀDY","a@","mādya","noun-adj",NA
8,"nābhikam","NĀBHIK","am","nābhika","noun-adj",NA
9,"/","","","","punct",NA
10,"dhyāyād","DHYĀY","ād","dhyāya","noun-adj",NA
11,"ekāgra","EKĀGR","a@","ekāgra","noun-adj",NA
12,"cittaḥ","CITT","aḥ","citta","noun-adj",NA
13,"san","SAN","","sat","noun-adj",NA
14,"ṣaṇm","","","","ind",NA
15,"āsān","ĀSĀN","","āsāna","noun-adj",NA
16,"dṛḍha","DṚḌH","a@","dṛḍha","noun-adj",NA
17,"niścayaḥ","NIŚCAY","aḥ","niścaya","noun-adj",NA
18,"//","","","","punct",NA
19,"4","","","","ind",NA
20,"//","","","","punct",NA
NA,"</s>","","","","",NA
NA,"</page>","","","","",NA
NA,"<page number=""4"">","","","","",NA
NA,"<s number=""4"">","","","","",NA
1,"japed","JAP","ed","jap","verb",NA
2,"a","","","alpha_privativum","ind",NA
3,"khinna","KHINN","a@","khinna","noun-adj",NA
4,"cittaḥ","CITT","aḥ","citta","noun-adj",NA
5,"san","SAN","","sat","noun-adj",NA
6,"mantram","MANTR","am","mantra","noun-adj",NA
7,"enaṃ","","","ena","ind",NA
8,"daśa","DAŚ","a@","daśa","noun-adj",NA
9,"ākṣaram","ĀKṢAR","am","ākṣarati","noun-adj",NA
10,"//","","","","punct",NA
11,"tatrāiṣa","","","","ind",NA
12,"mantraḥoṃ","MANTR","aḥoṃ","mantra","noun-adj",NA
13,"tāret","TĀR","et","tār","verb",NA
14,"uttāre","UTTĀR","e","uttāra","noun-adj",NA
15,"ture","TUR","e","tura","noun-adj",NA
16,"svāhā","SVĀH","ā","svāhā","noun-adj",NA
17,"//","","","","punct",NA
18,"5","","","","ind",NA
19,"//","","","","punct",NA
NA,"</s>","","","","",NA
NA,"</page>","","","","",NA
NA,"<page number=""5"">","","","","",NA
NA,"<s number=""5"">","","","","",NA
1,"mṛtyu","MṚTY","u@","mṛtyu","noun-adj",NA
2,"doṣair","DOṢ","air","doṣa","noun-adj",NA
3,"na","","","na","ind",NA
4,"liptaḥ","LIPT","aḥ","lipta","noun-adj",NA
5,"syāt","","","as","verb","as"
6,"tārāhṛc","TĀR","āhṛc","tāra","noun-adj",NA
7,"cakra","CAKR","a@","cakra","noun-adj",NA
8,"bhāvakaḥ","BHĀV","akaḥ","bhāvaka","noun-adj",NA
9,"/","","","","punct",NA
10,"lābhī","LĀBH","ī","lābhin","noun-adj",NA
11,"ca","","","ca","ind",NA
12,"sarva","SARV","a@","sarva","noun-adj",NA
13,"siddhīnāṃ","SIDDH","īnāṃ","siddhi","noun-adj",NA
14,"ṣaṇmā","","","","ind",NA
15,"sāvadhi","SĀVADH","i","sāvadhi","noun-adj",NA
16,"tat","TAT","","tad","pron",NA
17,"paraḥ","PAR","aḥ","para","noun-adj",NA
18,"//","","","","punct",NA
19,"6","","","","ind",NA
20,"//","","","","punct",NA
NA,"</s>","","","","",NA
NA,"</page>","","","","",NA
NA,"</doc>","","","","",NA
