"WordID","word","NormSTEM","suffix","lemma","PoS","Root"
"","<doc textid = ""tattvaratnavali"" genre = ""tantra"" title = ""tattvaratnāvalī"" author = ""advayavajra"" discourse = ""tantra"" tradition = ""tantra"" period = ""commentarial"" source = ""dsbc accessed aug 2021"" date_range = ""11. ce"" notes = ""author ascription: maitrīpa alias advayavajra"" religion = ""buddh"" edition = ""based on ? ?"" digitization = ""miroj shakya"" segmentation_lemmatization = ""ligeia lugli & buddhist translators workbench team"" metadata_enrichment = ""bruno galasek-hul & buddhist translators workbench team"" proofreader = ""n/a"" permission = """" reconstructions = ""none"">","","","","",""
"","<page number=""0000"">","","","","",""
"","<s number=""1"">","","","","",""
"1","advaya","ADVAY","a@","advaya","noun-adj",""
"2","vajra","VAJR","a","vajra","noun-adj",""
"3","tattva","TATTV","a@","tad","pron",""
"4","ratnāvalī","RATNĀVAL","ī","ratnāvalī","noun-adj",""
"5","namaḥ","NAM","aḥ","nama","noun-adj",""
"6","śri","ŚRI","","śrī","noun-adj",""
"7","vajrasattvāya","VAJRASATTV","āya","vajrasattva","noun-adj",""
"8","/","","","","punct",""
"","</s>","","","","",""
"","<s number=""2"">","","","","",""
"1","praṇamya","PRAṆAM","ya","praṇam","verb",""
"2","vajrasattvasya","VAJRASATTV","asya","vajrasattva","noun-adj",""
"3","caraṇa","CARAṆ","a@","caraṇa","noun-adj",""
"4","āmbho","ĀMBH","o@","āmbhi","noun-adj",""
"5","ruha","RUH","a@","ruha","noun-adj",""
"6","dvayam","DVAY","am","dvaya","noun-adj",""
"7","/","","","","punct",""
"8","tattva","TATTV","a@","tad","pron",""
"9","ratnāvalīṃ","RATNĀVAL","īṃ","ratnāvalī","noun-adj",""
"10","brūmaḥ","BRŪM","aḥ","brūma","noun-adj",""
"11","śarac","ŚAR","ac","śarat","noun-adj",""
"12","candra","CANDR","a@","candra","noun-adj",""
"13","āmala","ĀMAL","a@","āmalate","noun-adj",""
"14","dyuteḥ","DYUT","eḥ","dyuti","noun-adj",""
"15","//","","","","punct",""
"16","1","","","","ind",""
"17","//","","","","punct",""
"","</s>","","","","",""
"","<s number=""3"">","","","","",""
"1","sad","","","sat","ind",""
"2","āmnāya","ĀMNĀY","a@","āmnāya","noun-adj",""
"3","paribhraṣṭa","PARIBHRAṢṬ","a@","paribhraṣṭa","noun-adj",""
"4","tamo","TAM","o","tama","noun-adj",""
"5","vṛta","VṚT","a@","vṛta","noun-adj",""
"6","dṛśām","DṚŚ","ām","dṛśā","noun-adj",""
"7","iyam","","","idam","pron",""
"8","/","","","","punct",""
"9","tattva","TATTV","a@","tad","pron",""
"10","ratnāvalī","RATNĀVAL","ī","ratnāvalī","noun-adj",""
"11","samyak","SAMYAK","","samyaka","noun-adj",""
"12","puṃsāṃ","PUṂS","āṃ","puṃsā","noun-adj",""
"13","tattva","TATTV","a@","tad","pron",""
"14","prakāśinī","PRAKĀŚ","inī","prakāśin","noun-adj",""
"15","//","","","","punct",""
"16","2","","","","ind",""
"17","//","","","","punct",""
"","</s>","","","","",""
"","<s number=""4"">","","","","",""
"1","tatra","","","tatra","ind",""
"2","trīni","","","tri","ind",""
"3","yā","","","yad","pron",""
"4","nāni","NĀN","i","nāni","noun-adj",""
"5","śrāvakayānaṃ","ŚRĀVAKAYĀN","aṃ","śrāvakayāna","noun-adj",""
"6","pratyekabuddha","PRATYEKABUDDH","a@","pratyekabuddha","noun-adj",""
"7","yānaṃ","YĀN","aṃ","yāna","noun-adj",""
"8","mahāyānaṃ","MAHĀYĀN","aṃ","mahāyāna","noun-adj",""
"9","c","","","ca","ind",""
"10","^","","","","",""
"11","eti","","","iti","ind",""
"12","/","","","","punct",""
"","</s>","","","","",""
"","<s number=""5"">","","","","",""
"1","sthita","STHIT","a@","sthita","noun-adj",""
"2","yaś","YAŚ","","yad","pron",""
"3","catasraḥ","CATASR","aḥ","catasra","noun-adj",""
"4","vaibhāṣika","VAIBHĀṢIK","a@","vaibhāṣika","noun-adj",""
"5","sautrāntika","SAUTRĀNTIK","a@","sautrāntika","noun-adj",""
"6","yogācāra","YOGĀCĀR","a","yogācāra","noun-adj",""
"7","mādhyamika","MĀDHYAMIK","a@","mādhyamika","noun-adj",""
"8","bhedena","BHED","ena","bheda","noun-adj",""
"9","/","","","","punct",""
"","</s>","","","","",""
"","<s number=""6"">","","","","",""
"1","tatra","","","tatra","ind",""
"2","vaibhāṣika","VAIBHĀṢIK","a@","vaibhāṣika","noun-adj",""
"3","sthityā","STHIT","yā","sthiti","noun-adj",""
"4","śrāvakayānaṃ","ŚRĀVAKAYĀN","aṃ","śrāvakayāna","noun-adj",""
"5","pratyekabuddha","PRATYEKABUDDH","a@","pratyekabuddha","noun-adj",""
"6","yānaṃ","YĀN","aṃ","yāna","noun-adj",""
"7","ca","","","ca","ind",""
"8","vyākhyāyate","VYĀKHYĀ","yate","vyākhyā","verb",""
"9","/","","","","punct",""
"","</s>","","","","",""
"","<s number=""7"">","","","","",""
"1","mahāyānaṃ","MAHĀYĀN","aṃ","mahāyāna","noun-adj",""
"2","ca","","","ca","ind",""
"3","dvividhaṃ","DVIVIDH","aṃ","dvividha","noun-adj",""
"4","pāramitā","PĀRAMIT","ā@","pāramitā","noun-adj",""
"5","nayo","NAY","o","naya","noun-adj",""
"6","mantra","MANTR","a@","mantra","noun-adj",""
"7","nayaś","NAY","aś","naya","noun-adj",""
"8","c","","","ca","ind",""
"9","^","","","","",""
"10","eti","","","iti","ind",""
"11","/","","","","punct",""
"","</s>","","","","",""
"","<s number=""8"">","","","","",""
"1","tatra","","","tatra","ind",""
"2","ca","","","ca","ind",""
"3","pāramitā","PĀRAMIT","ā@","pāramitā","noun-adj",""
"4","nayaḥ","NAY","aḥ","naya","noun-adj",""
"5","sautrāntika","SAUTRĀNTIK","a@","sautrāntika","noun-adj",""
"6","yogācāra","YOGĀCĀR","a@","yogācāra","noun-adj",""
"7","mādhyamika","MĀDHYAMIK","a@","mādhyamika","noun-adj",""
"8","sthityā","STHIT","yā","sthiti","noun-adj",""
"9","vyākhyāyate","VYĀKHYĀ","yate","vyākhyā","verb",""
"10","/","","","","punct",""
"","</s>","","","","",""
"","<s number=""9"">","","","","",""
"1","mantra","MANTR","a@","mantra","noun-adj",""
"2","nayas","NAY","as","naya","noun-adj",""
"3","tu","","","tu","ind",""
"4","yogācāra","YOGĀCĀR","a@","yogācāra","noun-adj",""
"5","mādhyamika","MĀDHYAMIK","a@","mādhyamika","noun-adj",""
"6","sthityā","STHIT","yā","sthiti","noun-adj",""
"7","vyākhyāyate","VYĀKHYĀ","yate","vyākhyā","verb",""
"8","/","","","","punct",""
"","</s>","","","","",""
"","<s number=""10"">","","","","",""
"1","yogācāraś","YOGĀCĀR","aś","yogācāra","noun-adj",""
"2","ca","","","ca","ind",""
"3","dvividhaḥ","DVIVIDH","aḥ","dvividha","noun-adj",""
"4","sākāra","SĀKĀR","a@","sākāra","noun-adj",""
"5","nirākāra","NIRĀKĀR","a@","nirākāra","noun-adj",""
"6","bhedena","BHED","ena","bheda","noun-adj",""
"7","/","","","","punct",""
"","</s>","","","","",""
"","<s number=""11"">","","","","",""
"1","evaṃ","","","eva","ind",""
"2","mādhyamiko","MĀDHYAMIK","o","mādhyamika","noun-adj",""
"3","api","","","api","ind",""
"4","māyopama","MĀYOPAM","a@","māyopama","noun-adj",""
"5","ādvayavādi","ADVAYAVĀD","i@","advayavādin","noun-adj",""
"6","sarva","SARV","a@","sarva","noun-adj",""
"7","dharma","DHARM","a@","dharma","noun-adj",""
"8","ā","","","alpha_privativum","ind",""
"9","pratiṣṭhāna","PRATIṢṬHĀN","a@","pratiṣṭhāna","noun-adj",""
"10","vādi","VĀD","i","vādin","noun-adj",""
"11","bhedāt","BHED","āt","bheda","noun-adj",""
"12","dvividhaḥ","DVIVIDH","aḥ","dvividha","noun-adj",""
"13","/","","","","punct",""
"","</s>","","","","",""
"","<s number=""12"">","","","","",""
"1","tatra","","","tatra","ind",""
"2","śrāvakaḥ","ŚRĀVAK","aḥ","śrāvaka","noun-adj",""
"3","trividhaḥ","TRIVIDH","aḥ","trividha","noun-adj",""
"4","mṛdumadhya","MṚDUMADHY","a@","mṛdumadhyā","noun-adj",""
"5","ādhimātra","ADHIMĀTR","a@","adhimātra","noun-adj",""
"6","bhedāt","BHED","āt","bheda","noun-adj",""
"7","/","","","","punct",""
"","</s>","","","","",""
"","<s number=""13"">","","","","",""
"1","atra","","","atra","ind",""
"2","ca","","","ca","ind",""
"3","mṛdumadhya","MṚDUMADHY","a","mṛdumadhyā","noun-adj",""
"4","upāścātya","UPĀŚCĀTY","a@","upāścātya","noun-adj",""
"5","vaibhāṣikau","VAIBHĀṢIK","au","vaibhāṣika","noun-adj",""
"6","adhimātras","ADHIMĀTR","as","adhimātra","noun-adj",""
"7","tu","","","tu","ind",""
"8","kaś","","","kim","pron",""
"9","mīra","MĪR","a@","mīra","noun-adj",""
"10","vaibhāṣikaḥ","VAIBHĀṢIK","aḥ","vaibhāṣika","noun-adj",""
"11","/","","","","punct",""
"","</s>","","","","",""
"","<s number=""14"">","","","","",""
"1","tatra","","","tatra","ind",""
"2","mṛdu","MṚD","u@","mṛdu","noun-adj",""
"3","śrāvakasya","ŚRĀVAK","asya","śrāvaka","noun-adj",""
"4","vicāraḥ","VICĀR","aḥ","vicāra","noun-adj",""
"5","/","","","","punct",""
"","</s>","","","","",""
"","<s number=""15"">","","","","",""
"1","nīla","NĪL","a@","nīla","noun-adj",""
"2","pīta","PĪT","a@","pīta","noun-adj",""
"3","ādi","ĀD","i@","ādi","noun-adj",""
"4","bāhya","BĀHY","a@","bāhya","noun-adj",""
"5","ārtha","ARTH","a@","artha","noun-adj",""
"6","āṅgīkāra","AṄGĪKĀR","a@","aṅgīkāra","noun-adj",""
"7","pūrvakaṃ","PŪRV","akaṃ","pūrvaka","noun-adj",""
"8","pudgalasya","PUDGAL","asya","pudgala","noun-adj",""
"9","nityānityatv","NITYĀNITY","atv","nityānitya","noun-adj",""
"10","aviyuktim","AVIYUKT","im","aviyukta","noun-adj",""
"11","ā","","","alpha_privativum","ind",""
"12","heti","HET","i","heti","noun-adj",""
"13","vivṛtiḥ","VIVṚT","iḥ","vivṛti","noun-adj",""
"14","/","","","","punct",""
"","</s>","","","","",""
"","<s number=""16"">","","","","",""
"1","tad","","","tad","pron",""
"2","uktam","UKT","am","ukta","noun-adj",""
"3","asti","","","as","verb","as"
"4","khalv","","","khalu","ind",""
"5","iti","","","iti","ind",""
"6","nīlādi","NĪLĀD","i","nīlāda","noun-adj",""
"7","jagad","JAGAD","","jagat","noun-adj",""
"8","iti","","","iti","ind",""
"9","jaḍīyase","JAḌ","īyase","jaḍ","verb",""
"10","/","","","","punct",""
"11","bhāva","BHĀV","a@","bhāva","noun-adj",""
"12","graha","GRAH","a@","graha","noun-adj",""
"13","graha","GRAH","a@","graha","noun-adj",""
"14","ā","","","alpha_privativum","ind",""
"15","veśa","VEŚ","a@","veśa","noun-adj",""
"16","gambhīra","GAMBHĪR","a@","gambhīra","noun-adj",""
"17","nayabhī","NAY","abhī","naya","noun-adj",""
"18","rave","RAV","e","rava","noun-adj",""
"19","//","","","","punct",""
"20","3","","","","ind",""
"21","//","","","","punct",""
"","</s>","","","","",""
"","<s number=""17"">","","","","",""
"1","asti","","","as","verb","as"
"2","pudgalo","PUDGAL","o","pudgala","noun-adj",""
"3","bhāra","BHĀR","a@","bhāra","noun-adj",""
"4","vāho","VĀH","o","vāha","noun-adj",""
"5","ṇa","","","","ind",""
"6","ṇiccaṃ","","","","ind",""
"7","bhaṇāmi","BHAṆ","āmi","bhaṇ","verb",""
"8","ṇāṇic","","","","ind",""
"9","cam","CAM","","cama","noun-adj",""
"10","bhaṇāmī""ti","BHAṆ","āmī%ti","bhaṇa","noun-adj",""
"11","pudgalaś","PUDGAL","aś","pudgala","noun-adj",""
"12","ca","","","ca","ind",""
"13","rāga","RĀG","a@","rāga","noun-adj",""
"14","vān","VĀN","","vāna","noun-adj",""
"15","saṃsarati","SAṂSAR","ati","saṃsar","verb",""
"16","iti","","","iti","ind",""
"17","rāga","RĀG","a@","rāga","noun-adj",""
"18","prahāṇāyā","PRAHĀṆ","āyā","prahāṇa","noun-adj",""
"19","śudhā","ŚUDH","ā","śudhā","noun-adj",""
"20","bhāvanā","BHĀVAN","ā","bhāvanā","noun-adj",""
"21","dhyānam","DHYĀN","am","dhyāna","noun-adj",""
"22","/","","","","punct",""
"","</s>","","","","",""
"","<s number=""18"">","","","","",""
"1","a","","","alpha_privativum","ind",""
"2","śubhā","ŚUBH","ā","śubhā","noun-adj",""
"3","bhāvanā","BHĀVAN","ā","bhāvanā","noun-adj",""
"4","tu","","","tu","ind",""
"5","śarīrasya","ŚARĪR","asya","śarīra","noun-adj",""
"6","biṇ","","","","ind",""
"7","mūtraśukra","MŪTRAŚUKR","a@","mūtraśukra","noun-adj",""
"8","śoṇitaślesmān","ŚOṆIT","aślesmān","śoṇita","noun-adj",""
"9","tāntra","TĀNTR","a@","tāntra","noun-adj",""
"10","siṃha","SIṂH","a@","siṃha","noun-adj",""
"11","ānaka","ĀNAK","a@","ānaka","noun-adj",""
"12","cikkiṇak","CIKKIṆ","ak@","cikkiṇaka","noun-adj",""
"13","lomakaplī","LOMAK","aplī","lomaka","noun-adj",""
"14","hāya","HĀYA","","hāya","noun-adj",""
"15","kṛta","KṚT","a@","kṛta","noun-adj",""
"16","prabhṛti","PRABHṚT","i@","prabhṛti","noun-adj",""
"17","samudāya","SAMUDĀY","a@","samudāya","noun-adj",""
"18","rūpatā","RŪPAT","ā@","rūpatā","noun-adj",""
"19","nirūpaṇam","NIRŪPAṆ","am","nirūpaṇa","noun-adj",""
"20","/","","","","punct",""
"","</s>","","","","",""
"","<s number=""19"">","","","","",""
"1","tad","","","tad","pron",""
"2","uktam","UKT","am","ukta","noun-adj",""
"3","imaṃ","","","idam","pron",""
"4","carma","CARM","a@","carma","noun-adj",""
"5","puṭaṃ","PUṬ","aṃ","puṭa","noun-adj",""
"6","tāvat","TĀVAT","","tāvat","ind",""
"7","sv","","","su","ind",""
"8","abuddhau","ABUDDH","au","abuddha","noun-adj",""
"9","ca","","","ca","ind",""
"10","pṛthak","PṚTHAK","","pṛthak","noun-adj",""
"11","kuru","KUR","u","kar","verb","kṛ"
"12","/","","","","punct",""
"13","asthi","ASTH","i@","asthi","noun-adj",""
"14","pañjarato","PAÑJAR","ato","pañjara","noun-adj",""
"15","māṃsaṃ","MĀṂS","aṃ","māṃsa","noun-adj",""
"16","prajñā","PRAJÑ","ā@","prajñā","noun-adj",""
"17","śastreṇa","ŚASTR","eṇa","śastra","noun-adj",""
"18","mocaya","MOCAY","a","mocaya","noun-adj",""
"19","//","","","","punct",""
"20","4","","","","ind",""
"21","//","","","","punct",""
"","</s>","","","","",""
"","<s number=""20"">","","","","",""
"1","asthīny","ASTH","īny","asthin","noun-adj",""
"2","api","","","api","ind",""
"3","pṛthak","PṚTHAK","","pṛthak","noun-adj",""
"4","kṛtvā","KṚT","vā","kṛta","noun-adj",""
"5","paśya","PAŚ","ya","paś","verb","paś"
"6","majja","MAJJ","a@","majja","noun-adj",""
"7","ānam","ĀNAM","","ānama","noun-adj",""
"8","antataḥ","ANTAT","aḥ","antatas","noun-adj",""
"9","/","","","","punct",""
"10","kim","","","kim","pron",""
"11","atra","","","atra","ind",""
"12","s","","","su","ind",""
"13","āram","ĀRAM","","ārama","noun-adj",""
"14","asti","","","as","verb","as"
"15","iti","","","iti","ind",""
"16","svayam","SVAY","am","svaya","noun-adj",""
"17","eva","","","eva","ind",""
"18","vicāraya","VICĀR","aya","vicār","verb",""
"19","//","","","","punct",""
"20","5","","","","ind",""
"21","//","","","","punct",""
"","</s>","","","","",""
"","<s number=""21"">","","","","",""
"1","iti","","","iti","ind",""
"2","/","","","","punct",""
"","</s>","","","","",""
"","<s number=""22"">","","","","",""
"1","pudgalasya","PUDGAL","asya","pudgala","noun-adj",""
"2","nityatva","NITYATV","a@","nityatva","noun-adj",""
"3","darśana","DARŚAN","a@","darśana","noun-adj",""
"4","pūrva","PŪRV","a@","pūrva","noun-adj",""
"5","ārohaḥ","ĀROH","aḥ","āroha","noun-adj",""
"6","samādhi","SAMĀDH","i@","samādhi","noun-adj",""
"7","malam","MAL","am","mala","noun-adj",""
"8","/","","","","punct",""
"","</s>","","","","",""
"","<s number=""23"">","","","","",""
"1","yāvaj","YĀV","aj","yāvat","ind",""
"2","jīvaṃ","JĪV","aṃ","jīva","noun-adj",""
"3","buddhaṃ","BUDDH","aṃ","buddha","noun-adj",""
"4","dharmaṃ","DHARM","aṃ","dharma","noun-adj",""
"5","saṃghaṃ","SAṂGH","aṃ","saṃgha","noun-adj",""
"6","śaraṇaṃ","ŚARAṆ","aṃ","śaraṇa","noun-adj",""
"7","gacchāmi","GACCH","āmi","gacch","verb","gam"
"8","kiṃ","","","kim","pron",""
"9","punar","","","punar","ind",""
"10","vandyau","VANDY","au","vandya","noun-adj",""
"11","sugatautha","SUGAT","autha","sugata","noun-adj",""
"12","buddhau","BUDDH","au","buddha","noun-adj",""
"13","yāvat","YĀVAT","","yāvat","ind",""
"14","kuśala","KUŚAL","a@","kuśala","noun-adj",""
"15","mūlaṃ","MŪL","aṃ","mūla","noun-adj",""
"16","tam","","","tad","pron",""
"17","eka","EK","a@","eka","noun-adj",""
"18","m","M","","ma","noun-adj",""
"19","ātmānaṃ","ĀTM","ānaṃ","ātman","noun-adj",""
"20","da","","","","ind",""
"21","mayiṣyāmy","M","ayiṣyāmy@","smar","verb",""
"22","eka","EK","a","eka","noun-adj",""
"23","at","","","","ind",""
"24","mānaṃ","MĀN","aṃ","māna","noun-adj",""
"25","śamayiṣyāmy","ŚAM","ayiṣyāmy","śam","verb",""
"26","eka","EK","a@","eka","noun-adj",""
"27","m","M","","ma","noun-adj",""
"28","āt","","","","ind",""
"29","amānaṃ","AMĀN","aṃ","amāna","noun-adj",""
"30","parinirvāpayi","PARINIRVĀPAY","i","parinirvāpayi","noun-adj",""
"31","ṣ","","","","ind",""
"32","yāmi","YĀM","i","yāmi","noun-adj",""
"33","iti","","","iti","ind",""
"34","dṛṣṭiḥ","DṚṢṬ","iḥ","dṛṣṭi","noun-adj",""
"35","/","","","","punct",""
"","</s>","","","","",""
"","<s number=""24"">","","","","",""
"1","madhyasyā","MADHY","asyā","madhya","noun-adj",""
"2","dṛṣṭi","DṚṢṬ","i@","dṛṣṭi","noun-adj",""
"3","vivṛtiḥ","VIVṚT","iḥ","vivṛti","noun-adj",""
"4","pūrvavat","PŪRVAV","at","pūrvavat","noun-adj",""
"5","/","","","","punct",""
"","</s>","","","","",""
"","<s number=""25"">","","","","",""
"1","kiñcit","","","kimcit","ind",""
"2","parārtha","PARĀRTH","a@","parārtha","noun-adj",""
"3","rucir","RUCIR","","rucira","noun-adj",""
"4","asau","","","adas","pron",""
"5","ān","","","alpha_privativum","ind",""
"6","āpāna","ĀPĀN","a@","āpāna","noun-adj",""
"7","samādhinā","SAMĀDH","inā","samādhi","noun-adj",""
"8","nityānityatv","NITYĀNITY","atv","nityānitya","noun-adj",""
"9","aviyukta","AVIYUKT","a@","aviyukta","noun-adj",""
"10","pudgala","PUDGAL","a@","pudgala","noun-adj",""
"11","darśanaṃ","DARŚAN","aṃ","darśana","noun-adj",""
"12","dhyānam","DHYĀN","am","dhyāna","noun-adj",""
"13","/","","","","punct",""
"","</s>","","","","",""
"","<s number=""26"">","","","","",""
"1","kumbha","KUMBH","a","kumbha","noun-adj",""
"2","kena","","","kim","pron",""
"3","niśce","NIŚC","e","niści","noun-adj",""
"4","ṣṭhī","ṢṬH","ī@","ṣṭhā","noun-adj",""
"5","bhāvaḥ","BHĀV","aḥ","bhāva","noun-adj",""
"6","samādhi","SAMĀDH","i@","samādhi","noun-adj",""
"7","malaṃ","MAL","aṃ","mala","noun-adj",""
"8","jāḍya","JĀḌY","a@","jāḍya","noun-adj",""
"9","āvāhakatvāt","ĀVĀHAK","atvāt","āvāhaka","noun-adj",""
"10","/","","","","punct",""
"","</s>","","","","",""
"","<s number=""27"">","","","","",""
"1","śrāvaka","ŚRĀVAK","a@","śrāvaka","noun-adj",""
"2","adhimātrasya","ADHIMĀTR","asya","adhimātra","noun-adj",""
"3","bāhyārtha","BĀHYĀRTH","a@","bāhyārtha","noun-adj",""
"4","āṅgīkāriṇaḥ","AṄGĪKĀR","iṇaḥ","aṅgīkārin","noun-adj",""
"5","śarīrasya","ŚARĪR","asya","śarīra","noun-adj",""
"6","nairātmyatā","NAIRĀTMY","atā","nairātmya","noun-adj",""
"7","vyavasthāpanaṃ","VYAVASTHĀPAN","aṃ","vyavasthāpana","noun-adj",""
"8","vivṛtiḥ","VIVṚT","iḥ","vivṛti","noun-adj",""
"9","/","","","","punct",""
"","</s>","","","","",""
"","<s number=""28"">","","","","",""
"1","catur","CAT","ur","catur","noun-adj",""
"2","āryasatya","ĀRYASATY","a@","āryasatya","noun-adj",""
"3","parijñāne","PARIJÑĀN","e","parijñāna","noun-adj",""
"4","pudgalasya","PUDGAL","asya","pudgala","noun-adj",""
"5","śūnyata","ŚŪNYAT","a@","śūnyatā","noun-adj",""
"6","ādarśanaṃ","ĀDARŚAN","aṃ","ādarśana","noun-adj",""
"7","dhyānaṃ","DHYĀN","aṃ","dhyāna","noun-adj",""
"8","/","","","","punct",""
"","</s>","","","","",""
"","<s number=""29"">","","","","",""
"1","atra","","","atra","ind",""
"2","ca","","","ca","ind",""
"3","duḥkhaṃ","DUḤKH","aṃ","duḥkha","noun-adj",""
"4","pañca","PAÑC","a@","pañca","noun-adj",""
"5","skandha","SKANDH","a@","skandha","noun-adj",""
"6","svarūpaṃ","SVARŪP","aṃ","svarūpa","noun-adj",""
"7","jñātavyaṃ","JÑĀ","tavyaṃ","jān","verb","jñā"
"8","/","","","","punct",""
"","</s>","","","","",""
"","<s number=""30"">","","","","",""
"1","samudayo","SAMUDAY","o","samudaya","noun-adj",""
"2","vikalpaḥ","VIKALP","aḥ","vikalpa","noun-adj",""
"3","prahātavyaḥ","PRAHĀ","tavyaḥ","prahā","noun-adj",""
"4","nirodho","NIRODH","o","nirodha","noun-adj",""
"5","vipaśyanā","VIPAŚYAN","ā","vipaśyana","noun-adj",""
"6","sākṣātkartavyaḥ","SĀKṢĀTKAR","tavyaḥ","sākṣātkar","verb","sākṣātkṛ"
"7","mārgaḥ","MĀRG","aḥ","mārga","noun-adj",""
"8","śūnyatā","ŚŪNYAT","ā","śūnyatā","noun-adj",""
"9","bhāvayitavy","BHĀVAY","itavy","bhāvaya","noun-adj",""
"10","^","","","","",""
"11","eti","","","iti","ind",""
"12","śūnyatāyāḥ","ŚŪNYAT","āyāḥ","śūnyatā","noun-adj",""
"13","sadadā","","","","ind",""
"14","śiva","ŚIV","a@","śiva","noun-adj",""
"15","rūpata","RŪPAT","a@","rūpatā","noun-adj",""
"16","ādhya","ĀDHY","a@","ādhya","noun-adj",""
"17","āropo","ĀROP","o","āropa","noun-adj",""
"18","dhyāna","DHYĀN","a@","dhyāna","noun-adj",""
"19","malam","MAL","am","mala","noun-adj",""
"20","/","","","","punct",""
"","</s>","","","","",""
"","<s number=""31"">","","","","",""
"1","dṛṣṭau","DṚṢṬ","au","dṛṣṭa","noun-adj",""
"2","punarasya","PUNAR","asya","punara","noun-adj",""
"3","parārtha","PARĀRTH","a@","parārtha","noun-adj",""
"4","kāritā","KĀRIT","ā@","kāritā","noun-adj",""
"5","viśeṣaḥ","VIŚEṢ","aḥ","viśeṣa","noun-adj",""
"6","/","","","","punct",""
"","</s>","","","","",""
"","<s number=""32"">","","","","",""
"1","atra","","","atra","ind",""
"2","ca","","","ca","ind",""
"3","mṛdu","MṚD","u@","mṛdu","noun-adj",""
"4","śrāvako","ŚRĀVAK","o","śrāvaka","noun-adj",""
"5","niyata","NIYAT","a@","niyata","noun-adj",""
"6","gotratvād","GOTR","atvād","gotratva","noun-adj",""
"7","a","","","alpha_privativum","ind",""
"8","kāruṇikatvāt","KĀRUṆIK","atvāt","kāruṇika","noun-adj",""
"9","śākya","ŚĀKY","a@","śākya","noun-adj",""
"10","buddha","BUDDH","a","buddha","noun-adj",""
"11","ev","","","eva","ind",""
"12","ety","","","iti","ind",""
"13","eke","EK","e","eka","noun-adj",""
"14","/","","","","punct",""
"","</s>","","","","",""
"","<s number=""33"">","","","","",""
"1","anye","ANY","e","anya","noun-adj",""
"2","tu","","","tu","ind",""
"3","sarve","SARV","e","sarva","noun-adj",""
"4","buddhā","BUDDH","ā","buddha","noun-adj",""
"5","bhaviṣyanti","BHAV","iṣyanti","bhav","verb","bhū"
"6","n","","","na","ind",""
"7","^","","","","",""
"8","ā","","","alpha_privativum","ind",""
"9","bhavyo","BHAVY","o","bhavya","noun-adj",""
"10","bhuvi","BHUV","i","bhuvi","noun-adj",""
"11","vidyate","VID","yate","vid","verb","vid"
"12","/","","","","punct",""
"13","na","","","na","ind",""
"14","kartavyo","KAR","tavyo","kar","verb","kṛ"
"15","avasādo","AVASĀD","o","avasāda","noun-adj",""
"16","asmāt","","","idam","pron",""
"17","samyaksambodhi","SAMYAKSAMBODH","i@","samyaksambodhi","noun-adj",""
"18","sādhane","SĀDHAN","e","sādhana","noun-adj",""
"19","//","","","","punct",""
"20","6","","","","ind",""
"21","//","","","","punct",""
"","</s>","","","","",""
"","<s number=""34"">","","","","",""
"1","iti","","","iti","ind",""
"2","sattvānāṃ","SATTV","ānāṃ","sattva","noun-adj",""
"3","mṛdu","MṚD","u@","mṛdu","noun-adj",""
"4","śrāvako","ŚRĀVAK","o","śrāvaka","noun-adj",""
"5","api","","","api","ind",""
"6","samyaksambuddho","SAMYAKSAMBUDDH","o","samyaksambuddha","noun-adj",""
"7","bhaviṣyati","BHAVIṢY","ati","bhaviṣyat","noun-adj",""
"8","iti","","","iti","ind",""
"9","/","","","","punct",""
"","</s>","","","","",""
"","<s number=""35"">","","","","",""
"1","niyata","NIYAT","a@","niyata","noun-adj",""
"2","gotraṃ","GOTR","aṃ","gotra","noun-adj",""
"3","tu","","","tu","ind",""
"4","kiñcit","","","kimcit","ind",""
"5","buddham","BUDDH","am","buddha","noun-adj",""
"6","apekṣata","APEKṢ","ata","apekṣ","verb",""
"7","iti","","","iti","ind",""
"8","manyate","MAN","yate","man","verb","man"
"9","/","","","","punct",""
"","</s>","","","","",""
"","<s number=""36"">","","","","",""
"1","madhyas","MADHY","as","madhya","noun-adj",""
"2","tu","","","tu","ind",""
"3","bhāvi","BHĀV","i@","bhāvin","noun-adj",""
"4","pratyekabuddhaḥ","PRATYEKABUDDH","aḥ","pratyekabuddha","noun-adj",""
"5","/","","","","punct",""
"","</s>","","","","",""
"","<s number=""37"">","","","","",""
"1","adhimātras","ADHIMĀTR","as","adhimātra","noun-adj",""
"2","tu","","","tu","ind",""
"3","catuḥ","CAT","uḥ","catur","noun-adj",""
"4","kalpa","KALP","a@","kalpa","noun-adj",""
"5","āsaṃkhyeya","ASAṂKHYEY","a@","asaṃkhyeya","noun-adj",""
"6","ābhinirvartya","ABHINIRVART","ya@","abhinirvart","verb","abhinirvṛt"
"7","buddha","BUDDH","a","buddha","noun-adj",""
"8","iti","","","iti","ind",""
"9","/","","","","punct",""
"","</s>","","","","",""
"","<s number=""38"">","","","","",""
"1","pratyekabuddha","PRATYEKABUDDH","a@","pratyekabuddha","noun-adj",""
"2","yānasya","YĀN","asya","yāna","noun-adj",""
"3","vivṛtir","VIVṚT","ir","vivṛti","noun-adj",""
"4","adhimātra","ADHIMĀTR","a@","adhimātra","noun-adj",""
"5","śrāvakasy","ŚRĀVAK","asy","śrāvaka","noun-adj",""
"6","^","","","","",""
"7","aiva","","","eva","ind",""
"8","/","","","","punct",""
"","</s>","","","","",""
"","<s number=""39"">","","","","",""
"1","ayaṃ","","","idam","pron",""
"2","ca","","","ca","ind",""
"3","pratipanna","PRATIPANN","a@","pratipanna","noun-adj",""
"4","pudgala","PUDGAL","a@","pudgala","noun-adj",""
"5","śūnyā","ŚŪNY","ā@","śūnyā","noun-adj",""
"6","cintyatā","CINTY","atā","cintya","noun-adj",""
"7","lakṣaṇānā","LAKṢAṆ","ānā","lakṣaṇa","noun-adj",""
"8","cārya","CĀRY","a@","cārya","noun-adj",""
"9","svayambhū","SVAYAMBH","ū","svayambhū","noun-adj",""
"10","jñāna","JÑĀN","a@","jñāna","noun-adj",""
"11","vipaśyana","VIPAŚYAN","a@","vipaśyana","noun-adj",""
"12","ā","","","alpha_privativum","ind",""
"13","śamathaḥ","ŚAMATH","aḥ","śamatha","noun-adj",""
"14","/","","","","punct",""
"","</s>","","","","",""
"","<s number=""40"">","","","","",""
"1","tatra","","","tatra","ind",""
"2","indriyān","INDRIY","ān","indriya","noun-adj",""
"3","nirodho","NIRODH","o","nirodha","noun-adj",""
"4","vipaśyanā","VIPAŚYAN","ā","vipaśyana","noun-adj",""
"5","pudgalasy","PUDGAL","asy","pudgala","noun-adj",""
"6","ānupalabdhiḥ","ANUPALABDH","iḥ","anupalabdhi","noun-adj",""
"7","kāya","KĀY","a@","kāya","noun-adj",""
"8","vāk","VĀK","","vāk","noun-adj",""
"9","cetasāṃ","CETAS","āṃ","cetas","noun-adj",""
"10","saṃyamaḥ","SAṂYAM","aḥ","saṃyama","noun-adj",""
"11","śamathaḥ","ŚAMATH","aḥ","śamatha","noun-adj",""
"12","/","","","","punct",""
"","</s>","","","","",""
"","<s number=""41"">","","","","",""
"1","idamasya","IDAM","asya","idama","noun-adj",""
"2","dhyānam","DHYĀN","am","dhyāna","noun-adj",""
"3","/","","","","punct",""
"","</s>","","","","",""
"","<s number=""42"">","","","","",""
"1","atra","ATR","a@","atra","noun-adj",""
"2","āsanna","ĀSANN","a@","āsanna","noun-adj",""
"3","nidrasya","NIDR","asya","nidrā","noun-adj",""
"4","cetasaḥ","CETAS","aḥ","cetas","noun-adj",""
"5","sukha","SUKH","a@","sukha","noun-adj",""
"6","āvastha","AVASTH","a@","avasthā","noun-adj",""
"7","ādhyānam","ĀDHYĀN","am","ādhyāna","noun-adj",""
"8","cetasaḥ","CETAS","aḥ","cetas","noun-adj",""
"9","suṣupta","SUṢUPT","a@","suṣupta","noun-adj",""
"10","āvastha","AVASTH","a@","avasthā","noun-adj",""
"11","ādhyānaṃ","ĀDHYĀN","aṃ","ādhyāna","noun-adj",""
"12","ca","","","ca","ind",""
"13","samādhi","SAMĀDH","i@","samādhi","noun-adj",""
"14","malam","MAL","am","mala","noun-adj",""
"15","/","","","","punct",""
"","</s>","","","","",""
"","<s number=""43"">","","","","",""
"1","tatra","","","tatra","ind",""
"2","pūrvasmin","PŪRV","asmin","pūrva","noun-adj",""
"3","bhāskara","BHĀSKAR","a@","bhāskara","noun-adj",""
"4","mata","MAT","a@","mata","noun-adj",""
"5","ānupraveśaḥ","ANUPRAVEŚ","aḥ","anupraveśa","noun-adj",""
"6","/","","","","punct",""
"","</s>","","","","",""
"","<s number=""44"">","","","","",""
"1","tad","","","tad","pron",""
"2","uktam","UKT","am","ukta","noun-adj",""
"3","anāgatāyāṃ","ANĀGAT","āyāṃ","anāgatā","noun-adj",""
"4","nidrāyāṃ","NIDR","āyāṃ","nidrā","noun-adj",""
"5","pranaṣṭe","PRANAṢṬ","e","pranaṣṭa","noun-adj",""
"6","bāhya","BĀHY","a@","bāhya","noun-adj",""
"7","gocare","GOCAR","e","gocara","noun-adj",""
"8","/","","","","punct",""
"9","yā","","","yad","pron",""
"10","bhaven","BHAV","en","bhava","noun-adj",""
"11","manaso","MANAS","o","manasa","noun-adj",""
"12","avasthā","AVASTH","ā","avasthā","noun-adj",""
"13","bhāvayet","BHĀVAY","et","bhāvaya","noun-adj",""
"14","tāṃ","","","tad","pron",""
"15","prayatnataḥ","PRAYATN","ataḥ","prayatna","noun-adj",""
"16","//","","","","punct",""
"17","7","","","","ind",""
"18","//","","","","punct",""
"","</s>","","","","",""
"","<s number=""45"">","","","","",""
"1","iti","","","iti","ind",""
"2","/","","","","punct",""
"","</s>","","","","",""
"","<s number=""46"">","","","","",""
"1","aparasmin","APAR","asmin","apara","noun-adj",""
"2","tu","","","tu","ind",""
"3","vaiśeṣika","VAIŚEṢIK","a@","vaiśeṣika","noun-adj",""
"4","mata","MAT","a@","mata","noun-adj",""
"5","ānupraveśaḥ","ANUPRAVEŚ","aḥ","anupraveśa","noun-adj",""
"6","/","","","","punct",""
"","</s>","","","","",""
"","<s number=""47"">","","","","",""
"1","tad","","","tad","pron",""
"2","āhuḥ","","","","ind",""
"3","nāgārjuna","NĀGĀRJUN","a@","nāgārjuna","noun-adj",""
"4","pādāḥa","PĀD","āḥa","pāda","noun-adj",""
"5","jānānaṃ","JĀNĀN","aṃ","jānāna","noun-adj",""
"6","hi","","","hi","ind",""
"7","prajñānaṃ","PRAJÑĀN","aṃ","prajñāna","noun-adj",""
"8","nidrā","NIDR","ā@","nidrā","noun-adj",""
"9","dṛṣṭānta","DṚṢṬĀNT","a@","dṛṣṭānta","noun-adj",""
"10","sādhitam","SĀDHIT","am","sādhita","noun-adj",""
"11","/","","","","punct",""
"12","indriya","INDRIY","a@","indriya","noun-adj",""
"13","oparataṃ","UPAR","ataṃ","uparat","noun-adj",""
"14","yadvaj","YADV","aj","yadvat","noun-adj",""
"15","jñānaṃ","JÑĀN","aṃ","jñāna","noun-adj",""
"16","vaiśeṣikaṃ","VAIŚEṢIK","aṃ","vaiśeṣika","noun-adj",""
"17","ma","","","","ind",""
"18","tam","TAM","","tad","pron",""
"19","//","","","","punct",""
"20","8","","","","ind",""
"21","//","","","","punct",""
"","</s>","","","","",""
"","<s number=""48"">","","","","",""
"1","bhagavataḥ","BHAGAVAT","aḥ","bhagavatī","noun-adj",""
"2","pravacanam","PRAVACAN","am","pravacana","noun-adj",""
"3","api","","","api","ind",""
"4","varaṃ","VAR","aṃ","vara","noun-adj",""
"5","jeta","JET","a@","jetṛ","noun-adj",""
"6","vane","VAN","e","vana","noun-adj",""
"7","ramye","RAMY","e","ramya","noun-adj",""
"8","śṛgālatvaṃ","ŚṚGĀL","atvaṃ","śṛgāla","noun-adj",""
"9","vrajāmy","VRAJ","āmy","vraj","verb",""
"10","aham","","","mat","pron",""
"11","/","","","","punct",""
"12","na","","","na","ind",""
"13","tu","","","tu","ind",""
"14","vaiśeṣikaṃ","VAIŚEṢIK","aṃ","vaiśeṣika","noun-adj",""
"15","mokṣaṃ","MOKṢ","aṃ","mokṣa","noun-adj",""
"16","gotvam","GOTV","am","gotva","noun-adj",""
"17","ā","","","alpha_privativum","ind",""
"18","gantum","GANT","um","gacch","verb","gam"
"19","arhati","ARHAT","i","arhat","noun-adj",""
"20","//","","","","punct",""
"21","9","","","","ind",""
"22","//","","","","punct",""
"","</s>","","","","",""
"","<s number=""49"">","","","","",""
"1","iti","","","iti","ind",""
"2","/","","","","punct",""
"","</s>","","","","",""
"","<s number=""50"">","","","","",""
"1","dṛṣṭir","DṚṢṬ","ir","dṛṣṭi","noun-adj",""
"2","api","","","api","ind",""
"3","pūrvavat","PŪRVAV","at","pūrvavat","noun-adj",""
"4","/","","","","punct",""
"","</s>","","","","",""
"","<s number=""51"">","","","","",""
"1","ayam","","","idam","pron",""
"2","api","","","api","ind",""
"3","catuḥ","CAT","uḥ","catur","noun-adj",""
"4","kalpa","KALP","a@","kalpa","noun-adj",""
"5","āsaṃkhyeya","ASAṂKHYEY","a@","asaṃkhyeya","noun-adj",""
"6","ābhinirvartya","ABHINIRVART","ya@","abhinirvart","verb","abhinirvṛt"
"7","buddha","BUDDH","a@","buddha","noun-adj",""
"8","bhāvaḥ","BHĀV","aḥ","bhāva","noun-adj",""
"9","/","","","","punct",""
"","</s>","","","","",""
"","<s number=""52"">","","","","",""
"1","karuṇā","KARUṆ","ā","karuṇā","noun-adj",""
"2","c","","","ca","ind",""
"3","^","","","","",""
"4","ānayoḥ","ĀN","ayoḥ","idam","pron",""
"5","śrāvaka","ŚRĀVAK","a@","śrāvaka","noun-adj",""
"6","pratyekabuddhayoḥ","PRATYEKABUDDH","ayoḥ","pratyekabuddha","noun-adj",""
"7","sttv","","","","ind",""
"8","āvalambanā","AVALAMBAN","ā","avalambanā","noun-adj",""
"9","duḥkhaduḥkhatā","DUḤKHADUḤKHAT","ā@","duḥkhaduḥkhatā","noun-adj",""
"10","vipariṇāma","VIPARIṆĀM","a@","vipariṇāma","noun-adj",""
"11","duḥkhata","DUḤKHAT","a@","duḥkhatā","noun-adj",""
"12","ābha","ĀBH","a@","ābha","noun-adj",""
"13","yām","YĀM","","yad","pron",""
"14","ah","","","","ind",""
"15","anya","ANY","a@","anya","noun-adj",""
"16","hani","HAN","i","hani","noun-adj",""
"17","sattvān","SATTV","ān","sattva","noun-adj",""
"18","ālambya","ĀLAMB","ya","ālamb","verb",""
"19","yā","","","yad","pron",""
"20","ka","","","kim","pron",""
"21","ruṇot","RUṆ","ot","ruṇa","noun-adj",""
"22","padyate","PAD","yate","pad","verb","pad"
"23","sā","","","tad","pron",""
"24","sattva","SATTV","a@","sattva","noun-adj",""
"25","āvalambanā","AVALAMBAN","ā","avalambanā","noun-adj",""
"26","/","","","","punct",""
"","</s>","","","","",""
"","<s number=""53"">","","","","",""
"1","śrāvakasya","ŚRĀVAK","asya","śrāvaka","noun-adj",""
"2","deśanā","DEŚAN","ā","deśanā","noun-adj",""
"3","vācakī","VĀCAK","ī","vācaka","noun-adj",""
"4","pratyekabuddhasya","PRATYEKABUDDH","asya","pratyekabuddha","noun-adj",""
"5","tu","","","tu","ind",""
"6","kāyikī","KĀYIK","ī","kāyikī","noun-adj",""
"7","/","","","","punct",""
"","</s>","","","","",""
"","<s number=""54"">","","","","",""
"1","tad","","","tad","pron",""
"2","uktam","UKT","am","ukta","noun-adj",""
"3","sambuddhānām","SAMBUDDH","ānām","sambuddha","noun-adj",""
"4","an","","","alpha_privativum","ind",""
"5","utpāde","UTPĀD","e","utpāda","noun-adj",""
"6","śrāvakānāṃ","ŚRĀVAK","ānāṃ","śrāvaka","noun-adj",""
"7","punaḥ","","","punar","ind",""
"8","kṣaye","KṢAY","e","kṣaya","noun-adj",""
"9","/","","","","punct",""
"10","jñānaṃ","JÑĀN","aṃ","jñāna","noun-adj",""
"11","pratyekabuddhānām","PRATYEKABUDDH","ānām","pratyekabuddha","noun-adj",""
"12","a","","","alpha_privativum","ind",""
"13","saṃsargāt","SAṂSARG","āt","saṃsarga","noun-adj",""
"14","pravartate","PRAVART","ate","pravart","verb","pravṛt"
"15","//","","","","punct",""
"16","10","","","","ind",""
"17","//","","","","punct",""
"","</s>","","","","",""
"","<s number=""55"">","","","","",""
"1","idānīṃ","IDĀN","īṃ","idāni","noun-adj",""
"2","pāramitā","PĀRAMIT","ā@","pāramitā","noun-adj",""
"3","naya","NAY","a@","naya","noun-adj",""
"4","yogina","YOG","ina","yogin","noun-adj",""
"5","ucyante","UC","yante","vak","verb","vac"
"6","/","","","","punct",""
"","</s>","","","","",""
"","<s number=""56"">","","","","",""
"1","tatra","","","tatra","ind",""
"2","mṛduḥ","MṚD","uḥ","mṛdu","noun-adj",""
"3","sautrāntikaḥ","SAUTRĀNTIK","aḥ","sautrāntika","noun-adj",""
"4","asya","","","idam","pron",""
"5","khalu","KHAL","u","khal","verb",""
"6","paramāṇu","PARAMĀṆ","u@","paramāṇu","noun-adj",""
"7","sañcaya","SAÑC","aya","sañca","noun-adj",""
"8","rupo","RUP","o","rupa","noun-adj",""
"9","arthaḥ","ARTH","aḥ","artha","noun-adj",""
"10","sākāra","SĀKĀR","a@","sākāra","noun-adj",""
"11","jñāna","JÑĀN","a@","jñāna","noun-adj",""
"12","janakaḥ","JANAK","aḥ","janaka","noun-adj",""
"13","/","","","","punct",""
"","</s>","","","","",""
"","<s number=""57"">","","","","",""
"1","tasya","","","tad","pron",""
"2","c","","","ca","ind",""
"3","^","","","","",""
"4","eyam","","","idam","pron",""
"5","eva","","","eva","ind",""
"6","pratyavekṣaṇā","PRATYAVEKṢAṆ","ā","pratyavekṣaṇā","noun-adj",""
"7","yaduta","","","yaduta","ind",""
"8","s","","","su","ind",""
"9","ākāra","ĀKĀR","a@","ākāra","noun-adj",""
"10","jñāna","JÑĀN","a","jñāna","noun-adj",""
"11","janakatvaṃ","JAN","akatvaṃ","janaka","noun-adj",""
"12","nāma","NĀM","a","nāman","noun-adj",""
"13","/","","","","punct",""
"","</s>","","","","",""
"","<s number=""58"">","","","","",""
"1","tad","","","tad","pron",""
"2","āhuḥ","","","","ind",""
"3","bhinna","BHINN","a@","bhinna","noun-adj",""
"4","kālaṃ","KĀL","aṃ","kāla","noun-adj",""
"5","kathaṃ","","","katham","ind",""
"6","grāhyam","GRĀHY","am","grāhya","noun-adj",""
"7","iti","","","iti","ind",""
"8","ced","","","ced","ind",""
"9","grāhyatāṃ","GRĀHY","atāṃ","grāhyatā","noun-adj",""
"10","viduḥ","VID","uḥ","vidu","noun-adj",""
"11","/","","","","punct",""
"12","hetutvam","HETUTV","am","hetutva","noun-adj",""
"13","eva","","","eva","ind",""
"14","yukti","YUKT","i@","yukti","noun-adj",""
"15","jñā","JÑ","ā","jñā","noun-adj",""
"16","jñāna","JÑĀN","a@","jñāna","noun-adj",""
"17","ākāra","ĀKĀR","a@","ākāra","noun-adj",""
"18","ārpaṇa","ARPAṆ","a@","arpaṇa","noun-adj",""
"19","kṣamam","KṢAM","am","kṣama","noun-adj",""
"20","//","","","","punct",""
"21","11","","","","ind",""
"22","//","","","","punct",""
"","</s>","","","","",""
"","<s number=""59"">","","","","",""
"1","iti","","","iti","ind",""
"2","vivṛtiḥ","VIVṚT","iḥ","vivṛti","noun-adj",""
"3","/","","","","punct",""
"","</s>","","","","",""
"","<s number=""60"">","","","","",""
"1","viṣaye","VIṢAY","e","viṣaya","noun-adj",""
"2","bhayḥ","BHAY","ḥ","bhaya","noun-adj",""
"3","parāvṛtta","PARĀVṚTT","a@","parāvṛtta","noun-adj",""
"4","endriya","INDRIY","a@","indriya","noun-adj",""
"5","grāmasya","GRĀM","asya","grāma","noun-adj",""
"6","^","","","","",""
"7","a","","","alpha_privativum","ind",""
"8","cintyatā","CINTY","atā","cintya","noun-adj",""
"9","dhaya","DHAY","a@","dhaya","noun-adj",""
"10","ānam","ĀNAM","","ānama","noun-adj",""
"11","/","","","","punct",""
"","</s>","","","","",""
"","<s number=""61"">","","","","",""
"1","tad","","","tad","pron",""
"2","uktam","UKT","am","ukta","noun-adj",""
"3","abhyā","ABH","yā","abhi","noun-adj",""
"4","sasyeyaṃ","SASY","eyaṃ","sasya","noun-adj",""
"5","kalanā","KALAN","ā","kalanā","noun-adj",""
"6","yat","","","yad","pron",""
"7","kālaḥ","KĀL","aḥ","kāla","noun-adj",""
"8","saṃkhyā","SAṂKHY","ā","saṃkhyā","noun-adj",""
"9","kriyāyāḥ","KRIY","āyāḥ","kriyā","noun-adj",""
"10","/","","","","punct",""
"","</s>","","","","",""
"","<s number=""62"">","","","","",""
"1","tasmāt","","","tad","pron",""
"2","paricayaḥ","PARICAY","aḥ","paricaya","noun-adj",""
"3","kartavyaḥ","KAR","tavyaḥ","kar","verb","kṛ"
"4","/","","","","punct",""
"","</s>","","","","",""
"","<s number=""63"">","","","","",""
"1","paricayaś","PARICAY","aś","paricaya","noun-adj",""
"2","ca","","","ca","ind",""
"3","cittaṃ","CITT","aṃ","citta","noun-adj",""
"4","niścitya","NIŚCIT","ya","niścita","noun-adj",""
"5","bodhena","BODH","ena","bodha","noun-adj",""
"6","abhyāsaṃ","ABHYĀS","aṃ","abhyāsa","noun-adj",""
"7","kurute","KUR","ute","kar","verb","kṛ"
"8","yadā","","","yadā","ind",""
"9","/","","","","punct",""
"10","tadā","","","tadā","ind",""
"11","cittaṃ","CITT","aṃ","citta","noun-adj",""
"12","na","","","na","ind",""
"13","paśyāmi","PAŚ","yāmi","paś","verb","paś"
"14","kva","","","kva","ind",""
"15","gataṃ","GAT","aṃ","gata","noun-adj",""
"16","sthitaṃ","STHIT","aṃ","sthita","noun-adj",""
"17","bhavet","BHAV","et","bhav","verb","bhū"
"18","//","","","","punct",""
"19","12","","","","ind",""
"20","//","","","","punct",""
"","</s>","","","","",""
"","<s number=""64"">","","","","",""
"1","bhāvayed","BHĀVAY","ed","bhāvaya","noun-adj",""
"2","gṛhi","GṚH","i@","gṛhi","noun-adj",""
"3","bhūte","BHŪT","e","bhūta","noun-adj",""
"4","api","","","api","ind",""
"5","xxx","","","CORRUPTED","ind",""
"6","ṣi","","","","ind",""
"7","labdha","LABDH","a@","labdha","noun-adj",""
"8","ākṣaṇam","ĀKṢAṆ","am","ākṣaṇoti","noun-adj",""
"9","vajra","VAJR","a@","vajra","noun-adj",""
"10","paryaṅkam","PARYAṄK","am","paryaṅka","noun-adj",""
"11","ādhāya","ĀDHĀY","a","ādhāya","noun-adj",""
"12","nāsa","NĀS","a@","nāsā","noun-adj",""
"13","āgre","AGR","e","agra","noun-adj",""
"14","cañcalaṃ","CAÑCAL","aṃ","cañcala","noun-adj",""
"15","manaḥ","MAN","aḥ","manas","noun-adj",""
"16","//","","","","punct",""
"17","13","","","","ind",""
"18","//","","","","punct",""
"","</s>","","","","",""
"","<s number=""65"">","","","","",""
"1","malam","MAL","am","mala","noun-adj",""
"2","asya","","","idam","pron",""
"3","samādheḥ","SAMĀDH","eḥ","samādhi","noun-adj",""
"4","pūrvavat","PŪRVAV","at","pūrvavat","noun-adj",""
"5","/","","","","punct",""
"","</s>","","","","",""
"","<s number=""66"">","","","","",""
"1","tritaya","TRITAY","a@","tritaya","noun-adj",""
"2","ānupalabdhyā","ANUPALABDH","yā","anupalabdhi","noun-adj",""
"3","prajñāpāramitā","PRAJÑĀPĀRAMIT","ā@","prajñāpāramitā","noun-adj",""
"4","svabhāvena","SVABHĀV","ena","svabhāva","noun-adj",""
"5","pañca","PAÑC","a@","pañca","noun-adj",""
"6","pāramita","PĀRAMIT","a@","pāramitā","noun-adj",""
"7","ācaraṇaṃ","ĀCARAṆ","aṃ","ācaraṇa","noun-adj",""
"8","phala","PHAL","a@","phala","noun-adj",""
"9","vaimukhyena","VAIMUKHY","ena","vaimukhya","noun-adj",""
"10","sattva","SATTV","a@","sattva","noun-adj",""
"11","ārtha","ARTH","a@","artha","noun-adj",""
"12","pariṇāmanā","PARIṆĀMAN","ā","pariṇāmana","noun-adj",""
"13","tad","","","tad","pron",""
"14","dṛṣṭir","DṚṢṬ","ir","dṛṣṭi","noun-adj",""
"15","iti","","","iti","ind",""
"16","/","","","","punct",""
"17","madhyo","MADHY","o","madhya","noun-adj",""
"18","yogācāraḥ","YOGĀCĀR","aḥ","yogācāra","noun-adj",""
"19","/","","","","punct",""
"","</s>","","","","",""
"","<s number=""67"">","","","","",""
"1","tatra","","","tatra","ind",""
"2","s","","","su","ind",""
"3","ākāra","ĀKĀR","a@","ākāra","noun-adj",""
"4","ā","","","alpha_privativum","ind",""
"5","ravi","RAV","i@","ravi","noun-adj",""
"6","jñāna","JÑĀN","a@","jñāna","noun-adj",""
"7","vādī","VĀD","ī","vāda","noun-adj",""
"8","ṣaṭkena","ṢAṬK","ena","ṣaṭka","noun-adj",""
"9","yugapad","YUGAP","ad","yugapa","noun-adj",""
"10","yogāt","YOG","āt","yoga","noun-adj",""
"11","paramāṇoḥ","PARAMĀṆ","oḥ","paramāṇu","noun-adj",""
"12","ṣaḍ","ṢAḌ","","ṣaṭ","noun-adj",""
"13","aṅ","","","","ind",""
"14","gate""ty","GAT","e%ty","gata","noun-adj",""
"15","ādinā","ĀD","inā","ādi","noun-adj",""
"16","nyāyena","NYĀY","ena","nyāya","noun-adj",""
"17","paramāṇūnām","PARAMĀṆ","ūnām","paramāṇu","noun-adj",""
"18","apy","","","api","ind",""
"19","an","","","alpha_privativum","ind",""
"20","upapatteḥ","UPAPATT","eḥ","upapatti","noun-adj",""
"21","/","","","","punct",""
"","</s>","","","","",""
"","<s number=""68"">","","","","",""
"1","citta","CITT","a@","citta","noun-adj",""
"2","mātram","MĀTR","am","mātra","noun-adj",""
"3","ev","","","eva","ind",""
"4","edaṃ","EDAṂ","","idam","pron",""
"5","citta","CITT","a@","citta","noun-adj",""
"6","ā","","","alpha_privativum","ind",""
"7","kāra","KĀR","a@","kāra","noun-adj",""
"8","dhāri","DHĀR","i","dhārin","noun-adj",""
"9","grāhya","GRĀHY","a@","grāhya","noun-adj",""
"10","grāhaka","GRĀH","aka@","grāhaka","noun-adj",""
"11","bhāva","BHĀV","a@","bhāva","noun-adj",""
"12","vinirmuktaṃ","VINIRMUKT","aṃ","vinirmukta","noun-adj",""
"13","prakāśaṃ","PRAKĀŚ","aṃ","prakāśa","noun-adj",""
"14","prakāśata","PRAKĀŚAT","a","prakāśatā","noun-adj",""
"15","iti","","","iti","ind",""
"16","pratipanna","PRATIPANN","a@","pratipanna","noun-adj",""
"17","vān","VĀN","","vāna","noun-adj",""
"18","/","","","","punct",""
"","</s>","","","","",""
"","<s number=""69"">","","","","",""
"1","tad","","","tad","pron",""
"2","uktaṃ","UKT","aṃ","ukta","noun-adj",""
"3","citta","CITT","a@","citta","noun-adj",""
"4","mātraṃ","MĀTR","aṃ","mātra","noun-adj",""
"5","bho","BHO","","bho","noun-adj",""
"6","jinaputrā!","JINAPUTR","ā!","jinaputra","punct",""
"7","yaduta","","","yaduta","ind",""
"8","traidhātukam","TRAIDHĀTUK","am","traidhātuka","noun-adj",""
"9","iti","","","iti","ind",""
"10","/","","","","punct",""
"","</s>","","","","",""
"","<s number=""70"">","","","","",""
"1","tathā","","","tathā","ind",""
"2","c","","","ca","ind",""
"3","^","","","","",""
"4","āhuḥ","","","","ind",""
"5","kīrti","KĪRT","i@","kīrti","noun-adj",""
"6","pādāḥ","PĀD","āḥ","pāda","noun-adj",""
"7","dhiyo","DHIY","o","dhiyāyate","noun-adj",""
"8","nīlādi","NĪLĀD","i@","nīlāda","noun-adj",""
"9","rūpatve","RŪPATV","e","rūpatva","noun-adj",""
"10","bāhyo","BĀHY","o","bāhya","noun-adj",""
"11","arthaḥ","ARTH","aḥ","artha","noun-adj",""
"12","kiṃ","","","kim","pron",""
"13","nibandhanaḥ","NIBANDHAN","aḥ","nibandhana","noun-adj",""
"14","/","","","","punct",""
"15","dhiyo","DHIY","o","dhiyāyate","noun-adj",""
"16","a","","","alpha_privativum","ind",""
"17","nīlādi","NĪLĀD","i@","nīlāda","noun-adj",""
"18","rūpatve","RŪPATV","e","rūpatva","noun-adj",""
"19","bāhyo","BĀHY","o","bāhya","noun-adj",""
"20","arthaṃ","ARTH","aṃ","artha","noun-adj",""
"21","kiṃ","","","kim","pron",""
"22","nibandhanaḥ","NIBANDHAN","aḥ","nibandhana","noun-adj",""
"23","//","","","","punct",""
"24","14","","","","ind",""
"25","//","","","","punct",""
"","</s>","","","","",""
"","<s number=""71"">","","","","",""
"1","iti","","","iti","ind",""
"2","/","","","","punct",""
"","</s>","","","","",""
"","<s number=""72"">","","","","",""
"1","anyatr","ANYATR","","anyatra","noun-adj",""
"2","^","","","","",""
"3","āpy","","","api","ind",""
"4","uktam","UKT","am","ukta","noun-adj",""
"5","na","","","na","ind",""
"6","citteṣu","CITT","eṣu","citta","noun-adj",""
"7","bhari","BHAR","i@","bhari","noun-adj",""
"8","bhūtā","BHŪ","tā","bhūta","noun-adj",""
"9","indriya","INDRIY","a@","indriya","noun-adj",""
"10","ārthāḥ","ARTH","āḥ","artha","noun-adj",""
"11","svabhāvataḥ","SVABHĀV","ataḥ","svabhāva","noun-adj",""
"12","/","","","","punct",""
"13","rūpa","RŪP","a@","rūpa","noun-adj",""
"14","ādi","ĀD","i@","ādi","noun-adj",""
"15","pratibhāsena","PRATIBHĀS","ena","pratibhāsa","noun-adj",""
"16","cittam","CITT","am","citta","noun-adj",""
"17","eva","","","eva","ind",""
"18","hi","","","hi","ind",""
"19","bhāsate","BHĀSAT","e","bhāsatā","noun-adj",""
"20","//","","","","punct",""
"21","15","","","","ind",""
"22","//","","","","punct",""
"","</s>","","","","",""
"","<s number=""73"">","","","","",""
"1","tasmāt","","","tad","pron",""
"2","cittam","CITT","am","citta","noun-adj",""
"3","eva","","","eva","ind",""
"4","citra","CITR","a@","citra","noun-adj",""
"5","ākāraṃ","ĀKĀR","aṃ","ākāra","noun-adj",""
"6","paraṃ","PAR","aṃ","para","noun-adj",""
"7","nirapekṣa","NIRAPEKṢ","a@","nirapekṣa","noun-adj",""
"8","prakāśyaṃ","PRAKĀŚY","aṃ","prakāśya","noun-adj",""
"9","prakāśata","PRAKĀŚAT","a","prakāśatā","noun-adj",""
"10","iti","","","iti","ind",""
"11","sākāra","SĀKĀR","a@","sākāra","noun-adj",""
"12","vijñānavādi","VIJÑĀNAVĀD","i@","vijñānavādin","noun-adj",""
"13","yogācārasya","YOGĀCĀR","asya","yogācāra","noun-adj",""
"14","vivṛtiḥ","VIVṚT","iḥ","vivṛti","noun-adj",""
"15","/","","","","punct",""
"","</s>","","","","",""
"","<s number=""74"">","","","","",""
"1","nirākāra","NIRĀKĀR","a@","nirākāra","noun-adj",""
"2","vādi","VĀD","i@","vādin","noun-adj",""
"3","yoga","YOG","a@","yoga","noun-adj",""
"4","ācaras","ĀCAR","as","ācara","noun-adj",""
"5","tu","","","tu","ind",""
"6","cittam","CITT","am","citta","noun-adj",""
"7","eva","","","eva","ind",""
"8","idam","","","idam","pron",""
"9","an","","","alpha_privativum","ind",""
"10","ākāra","ĀKĀR","a@","ākāra","noun-adj",""
"11","sva","SV","a@","sva","noun-adj",""
"12","samvedana","SAMVEDAN","a@","samvedana","noun-adj",""
"13","rūpaṃ","RŪP","aṃ","rūpa","noun-adj",""
"14","iti","","","iti","ind",""
"15","manyate","MAN","yate","man","verb","man"
"16","/","","","","punct",""
"","</s>","","","","",""
"","<s number=""75"">","","","","",""
"1","tad","","","tad","pron",""
"2","uktam","UKT","am","ukta","noun-adj",""
"3","b","","","","ind",""
"4","hāhye","HĀH","ye","hāha","noun-adj",""
"5","na","","","na","ind",""
"6","vidyate","VID","yate","vid","verb","vid"
"7","hy","","","hi","ind",""
"8","artho","ARTH","o","artha","noun-adj",""
"9","yathā","","","yathā","ind",""
"10","bālair","BĀL","air","bāla","noun-adj",""
"11","vikalpyate","VIKALP","yate","vikalp","verb","vikḷp"
"12","/","","","","punct",""
"13","v","","","vā","ind",""
"14","āsanā","ĀSAN","ā@","āsanā","noun-adj",""
"15","luṭhitaṃ","LUṬHIT","aṃ","luṭhita","noun-adj",""
"16","cittam","CITT","am","citta","noun-adj",""
"17","artha","ARTH","a@","artha","noun-adj",""
"18","bhāsaṃ","BHĀS","aṃ","bhāsa","noun-adj",""
"19","pravartate","PRAVART","ate","pravart","verb","pravṛt"
"20","//","","","","punct",""
"21","16","","","","ind",""
"22","//","","","","punct",""
"","</s>","","","","",""
"","<s number=""76"">","","","","",""
"1","yāvadā","YĀVAD","ā","yāvadā","noun-adj",""
"2","bhāsate","BHĀSAT","e","bhāsatā","noun-adj",""
"3","yac","","","yad","pron",""
"4","ca","","","ca","ind",""
"5","tan","","","tad","pron",""
"6","māya","MĀY","a","māyā","noun-adj",""
"7","^","","","","",""
"8","aiva","","","eva","ind",""
"9","ca","","","ca","ind",""
"10","bhāsate","BHĀSAT","e","bhāsatā","noun-adj",""
"11","/","","","","punct",""
"12","tattvato","TATTV","ato","tad","pron",""
"13","hi","","","hi","ind",""
"14","nirābhāsaḥ","NIRĀBHĀS","aḥ","nirābhāsa","noun-adj",""
"15","śuddhānanta","ŚUDDHĀN","anta","śuddhānat","noun-adj",""
"16","nabho","NABH","o@","nabha","noun-adj",""
"17","nibhaḥ","NIBH","aḥ","nibha","noun-adj",""
"18","//","","","","punct",""
"19","17","","","","ind",""
"20","//","","","","punct",""
"","</s>","","","","",""
"","<s number=""77"">","","","","",""
"1","niṣ","","","niḥ_privativum","ind",""
"2","prapañco","PRAPAÑC","o","prapañca","noun-adj",""
"3","nirābhāso","NIRĀBHĀS","o","nirābhāsa","noun-adj",""
"4","dharmakāyo","DHARMAKĀY","o","dharmakāya","noun-adj",""
"5","mahāmuneḥ","MAHĀMUN","eḥ","mahāmuni","noun-adj",""
"6","/","","","","punct",""
"7","rūpakāyau","RŪPAKĀY","au","rūpakāya","noun-adj",""
"8","tad","TAD","","tad","pron",""
"9","udbhūtau","UDBHŪT","au","udbhūta","noun-adj",""
"10","pṛṣṭhe","PṚṢṬH","e","pṛṣṭha","noun-adj",""
"11","māya","MĀY","a","māyā","noun-adj",""
"12","^","","","","",""
"13","aiva","","","eva","ind",""
"14","tiṣṭhate","TIṢṬH","ate","sthā","verb",""
"15","//","","","","punct",""
"16","18","","","","ind",""
"17","//","","","","punct",""
"","</s>","","","","",""
"","<s number=""78"">","","","","",""
"1","iti","","","iti","ind",""
"2","vivṛtiḥ","VIVṚT","iḥ","vivṛti","noun-adj",""
"3","/","","","","punct",""
"","</s>","","","","",""
"","<s number=""79"">","","","","",""
"1","vidhūtasa","VIDHŪT","asa","vidhūta","noun-adj",""
"2","kalavikala","KALAVIKAL","a@","kalavikala","noun-adj",""
"3","pasac","PAS","ac","pasat","noun-adj",""
"4","citta","CITT","a@","citta","noun-adj",""
"5","ā","","","alpha_privativum","ind",""
"6","dvaita","DVAIT","a@","dvaita","noun-adj",""
"7","sākṣātkaraṇaṃ","SĀKṢĀTKARAṆ","aṃ","sākṣātkaraṇa","noun-adj",""
"8","dhyānaṃ","DHYĀN","aṃ","dhyāna","noun-adj",""
"9","s","","","su","ind",""
"10","ākārava","ĀKĀRAV","a@","ākāravat","noun-adj",""
"11","ā","","","alpha_privativum","ind",""
"12","dinaḥ","DIN","aḥ","dina","noun-adj",""
"13","/","","","","punct",""
"","</s>","","","","",""
"","<s number=""80"">","","","","",""
"1","tad","","","tad","pron",""
"2","uktam","UKT","am","ukta","noun-adj",""
"3","yatra","","","yatra","ind",""
"4","yatra","","","yatra","ind",""
"5","mano","MAN","o","manas","noun-adj",""
"6","yāti","","","","ind",""
"7","jñeye","JÑEY","e","jñeya","noun-adj",""
"8","tatr","","","tatra","ind",""
"9","^","","","","",""
"10","aiva","","","eva","ind",""
"11","yojayet","YOJAY","et","yoja","verb",""
"12","/","","","","punct",""
"13","calitvā","CALIT","vā","calita","noun-adj",""
"14","yāsyate","YĀS","yate","yā","verb","yā"
"15","kutra","KUTR","a","kutra","noun-adj",""
"16","sarvam","SARV","am","sarva","noun-adj",""
"17","eva","","","eva","ind",""
"18","hi","","","hi","ind",""
"19","tanmayam","TANMAY","am","tanmaya","noun-adj",""
"20","//","","","","punct",""
"21","19","","","","ind",""
"22","//","","","","punct",""
"","</s>","","","","",""
"","<s number=""81"">","","","","",""
"1","iti","","","iti","ind",""
"2","/","","","","punct",""
"","</s>","","","","",""
"","<s number=""82"">","","","","",""
"1","śāta","ŚĀT","a@","śāta","noun-adj",""
"2","ā","","","alpha_privativum","ind",""
"3","dvayā","DVAY","ā@","dvaya","noun-adj",""
"4","cintya","CINTY","a@","cintya","noun-adj",""
"5","niṣ","","","niḥ_privativum","ind",""
"6","prapañca","PRAPAÑC","a@","prapañca","noun-adj",""
"7","nirābhāsa","NIRĀBHĀS","a@","nirābhāsa","noun-adj",""
"8","citta","CITT","a@","citta","noun-adj",""
"9","sākṣātkaraṇaṃ","SĀKṢĀTKARAṆ","aṃ","sākṣātkaraṇa","noun-adj",""
"10","dhyānaṃ","DHYĀN","aṃ","dhyāna","noun-adj",""
"11","nirākāra","NIRĀKĀR","a@","nirākāra","noun-adj",""
"12","vādinaḥ","VĀDIN","aḥ","vādin","noun-adj",""
"13","/","","","","punct",""
"","</s>","","","","",""
"","<s number=""83"">","","","","",""
"1","tathā","","","tathā","ind",""
"2","ca","","","ca","ind",""
"3","rūpam","RŪP","am","rūpa","noun-adj",""
"4","asya","","","idam","pron",""
"5","mataṃ","MAT","aṃ","mata","noun-adj",""
"6","svacchaṃ","SVACCH","aṃ","svaccha","noun-adj",""
"7","nirākāraṃ","NIRĀKĀR","aṃ","nirākāra","noun-adj",""
"8","nir","NIR","","niḥ_privativum","ind",""
"9","a","","","alpha_privativum","ind",""
"10","ñjanam","ÑJAN","am","ñjana","noun-adj",""
"11","/","","","","punct",""
"12","śakyaṃ","ŚAKY","aṃ","śakya","noun-adj",""
"13","tena","","","tad","pron",""
"14","na","","","na","ind",""
"15","hi","","","hi","ind",""
"16","jñātum","JÑĀT","um","jān","verb","jñā"
"17","abuddhena","ABUDDH","ena","abuddha","noun-adj",""
"18","kadā","","","kadā","ind",""
"19","cana","","","","ind",""
"20","//","","","","punct",""
"21","20","","","","ind",""
"22","//","","","","punct",""
"","</s>","","","","",""
"","<s number=""84"">","","","","",""
"1","vijñapti","VIJÑAPT","i@","vijñapti","noun-adj",""
"2","mātram","MĀTR","am","mātra","noun-adj",""
"3","eva","","","eva","ind",""
"4","dam","DAM","","dama","noun-adj",""
"5","ity","","","iti","ind",""
"6","api","","","api","ind",""
"7","hy","","","hi","ind",""
"8","upalambhataḥ","UPALAMBH","ataḥ","upalambha","noun-adj",""
"9","/","","","","punct",""
"10","sthāpayann","STHĀP","ayann","sthāpa","noun-adj",""
"11","agrataḥ","AGRAT","aḥ","agratas","noun-adj",""
"12","kiñcit","","","kimcit","ind",""
"13","tanmātre","TANMĀTR","e","tanmātra","noun-adj",""
"14","n","","","na","ind",""
"15","āvatiṣṭhate","AVATIṢṬH","ate","avatiṣṭh","verb","avasthā"
"16","//21","","","","punct",""
"17","yadā","","","yadā","ind",""
"18","tv","","","tu","ind",""
"19","ālambanaṃ","ĀLAMBAN","aṃ","ālambana","noun-adj",""
"20","jñānaṃ","JÑĀN","aṃ","jñāna","noun-adj",""
"21","naiv","NAIV","","naiva","noun-adj",""
"22","opalabhate","UPALABH","ate","upalabh","verb","upalabh"
"23","tadā","","","tadā","ind",""
"24","/","","","","punct",""
"25","sthitaṃ","STHIT","aṃ","sthita","noun-adj",""
"26","vijñāna","VIJÑĀN","a@","vijñāna","noun-adj",""
"27","mātratve","MĀTRATV","e","mātratva","noun-adj",""
"28","grāhya","GRĀHY","a@","grāhya","noun-adj",""
"29","ābhāve","ĀBHĀV","e","ābhāvati","noun-adj",""
"30","tad","","","tad","pron",""
"31","agrahāt","AGRAH","āt","agraha","noun-adj",""
"32","//","","","","punct",""
"33","22","","","","ind",""
"34","//","","","","punct",""
"","</s>","","","","",""
"","<s number=""85"">","","","","",""
"1","paramārtha","PARAMĀRTH","a@","paramārtha","noun-adj",""
"2","sannity","SANN","ity","sannas","noun-adj",""
"3","a","","","alpha_privativum","ind",""
"4","sākāra","SĀKĀR","a@","sākāra","noun-adj",""
"5","vijñāna","VIJÑĀN","a@","vijñāna","noun-adj",""
"6","samādhau","SAMĀDH","au","samādhi","noun-adj",""
"7","bhagavataḥ","BHAGAVAT","aḥ","bhagavatī","noun-adj",""
"8","saṃsthita","SAṂSTHIT","a@","saṃsthita","noun-adj",""
"9","vedāntavādi","VEDĀNTAVĀD","i@","vedāntavādi","noun-adj",""
"10","mata","MAT","a@","mata","noun-adj",""
"11","ānupraveśaḥ","ANUPRAVEŚ","aḥ","anupraveśa","noun-adj",""
"12","/","","","","punct",""
"","</s>","","","","",""
"","<s number=""86"">","","","","",""
"1","sa","","","sa_saha","ind",""
"2","hi","","","hi","ind",""
"3","paramārtha","PARAMĀRTH","a@","paramārtha","noun-adj",""
"4","sannityaṃ","SANN","ityaṃ","sanna","noun-adj",""
"5","s","","","su","ind",""
"6","vacid","VAC","id","vaca","noun-adj",""
"7","rūpa","RŪP","a@","rūpa","noun-adj",""
"8","brahma","BRAHM","a@","brahma","noun-adj",""
"9","ābhi","ĀBH","i","idam","pron",""
"10","nna","","","","ind",""
"11","pariṇāma","PARIṆĀM","a@","pariṇāma","noun-adj",""
"12","rūpaṃ","RŪP","aṃ","rūpa","noun-adj",""
"13","jagad","JAGAD","","jagat","noun-adj",""
"14","icchati","ICCH","ati","icch","verb","iṣ1"
"15","/","","","","punct",""
"","</s>","","","","",""
"","<s number=""87"">","","","","",""
"1","tathā","","","tathā","ind",""
"2","c","","","ca","ind",""
"3","^","","","","",""
"4","oktam","UKT","am","ukta","noun-adj",""
"5","yad","","","yadi","ind",""
"6","yad","","","yadi","ind",""
"7","vai","","","vai","ind",""
"8","dṛśyate","DṚŚ","yate","darś","verb","dṛś"
"9","kiñcit","","","kimcit","ind",""
"10","tat","","","tad","pron",""
"11","tat","","","tad","pron",""
"12","brahmeti","BRAHM","eti","brahm","verb",""
"13","kalpayet","KALP","ayet","kalp","verb","kḷp"
"14","/","","","","punct",""
"15","tato","","","tatas","ind",""
"16","n","","","na","ind",""
"17","ānya","ANY","a@","anya","noun-adj",""
"18","gataṃ","GAT","aṃ","gata","noun-adj",""
"19","cittaṃ","CITT","aṃ","citta","noun-adj",""
"20","brahmaṇy","BRAHMAṆY","","brahmaṇya","noun-adj",""
"21","ev","","","eva","ind",""
"22","āvatiṣṭhate","AVATIṢṬH","ate","avatiṣṭh","verb","avasthā"
"23","//","","","","punct",""
"24","23","","","","ind",""
"25","//","","","","punct",""
"","</s>","","","","",""
"","<s number=""88"">","","","","",""
"1","iti","","","iti","ind",""
"2","samāhi","SAMĀH","i@","samāhi","noun-adj",""
"3","malaṃ","MAL","aṃ","mala","noun-adj",""
"4","s","","","su","ind",""
"5","ākārava","ĀKĀRAV","a@","ākāravat","noun-adj",""
"6","ā","","","alpha_privativum","ind",""
"7","dinaḥ","DIN","aḥ","dina","noun-adj",""
"8","/","","","","punct",""
"","</s>","","","","",""
"","<s number=""89"">","","","","",""
"1","evaṃ","","","eva","ind",""
"2","nirākāra","NIRĀKĀR","a@","nirākāra","noun-adj",""
"3","vādin","VĀDIN","","vādinī","noun-adj",""
"4","^","","","","",""
"5","āpi","","","api","ind",""
"6","nitya","NITY","a@","nitya","noun-adj",""
"7","nirābhāsa","NIRĀBHĀS","a@","nirābhāsa","noun-adj",""
"8","niṣ","","","niḥ_privativum","ind",""
"9","prapañca","PRAPAÑC","a@","prapañca","noun-adj",""
"10","sva","SV","a@","sva","noun-adj",""
"11","samvedana","SAMVEDAN","a@","samvedana","noun-adj",""
"12","vijñāna","VIJÑĀN","a@","vijñāna","noun-adj",""
"13","bhāvanāyāṃ","BHĀVAN","āyāṃ","bhāvanā","noun-adj",""
"14","bhāskara","BHĀSKAR","a@","bhāskara","noun-adj",""
"15","mata","MAT","a@","mata","noun-adj",""
"16","sthita","STHIT","a@","sthita","noun-adj",""
"17","vedāntavādi","VEDĀNTAVĀD","i@","vedāntavādi","noun-adj",""
"18","mata","MAT","a@","mata","noun-adj",""
"19","ānupraveśa","ANUPRAVEŚ","a@","anupraveśa","noun-adj",""
"20","prasaṅgaḥ","PRASAṄG","aḥ","prasaṅga","noun-adj",""
"21","/","","","","punct",""
"","</s>","","","","",""
"","<s number=""90"">","","","","",""
"1","so","","","tad","pron",""
"2","api","","","api","ind",""
"3","vyapagata","VYAPAGAT","a@","vyapagata","noun-adj",""
"4","sakala","SAKAL","a@","sakala","noun-adj",""
"5","nāmarūpa","NĀMARŪP","a@","nāmarūpa","noun-adj",""
"6","prapañca","PRAPAÑC","a@","prapañca","noun-adj",""
"7","opaplava","UPAPLAV","a@","upaplava","noun-adj",""
"8","viśuddha","VIŚUDDH","a@","viśuddha","noun-adj",""
"9","prakāśa","PRAKĀŚ","a@","prakāśa","noun-adj",""
"10","ānanda","ĀNAND","a@","ānanda","noun-adj",""
"11","ghana","GHAN","a@","ghana","noun-adj",""
"12","nitya","NITY","a@","nitya","noun-adj",""
"13","brahma","BRAHM","a@","brahma","noun-adj",""
"14","ābhyupagaccha","ABHYUPAGACCH","a@","abhyupagaccha","noun-adj",""
"15","ti","TI","","ti","noun-adj",""
"16","/","","","","punct",""
"","</s>","","","","",""
"","<s number=""91"">","","","","",""
"1","bodha","BODH","a@","bodha","noun-adj",""
"2","āmbha","ĀMBH","a@","āmbhi","noun-adj",""
"3","odhau","ODH","au","odhas","noun-adj",""
"4","mayi","","","mat","pron",""
"5","svacchaṃ","SVACCH","aṃ","svaccha","noun-adj",""
"6","tac","","","tad","pron",""
"7","chāyam","CHĀY","am","chāyā","noun-adj",""
"8","viśva","VIŚV","a@","viśva","noun-adj",""
"9","buddhayaḥ","BUDDH","ayaḥ","buddhi","noun-adj",""
"10","/","","","","punct",""
"11","udito","UDIT","o","udita","noun-adj",""
"12","vā","","","vā","ind",""
"13","pralīno","PRALĪN","o","pralīna","noun-adj",""
"14","vā","","","vā","ind",""
"15","na","","","na","ind",""
"16","vikalpāya","VIKALP","āya","vikalpa","noun-adj",""
"17","kalpate","KALP","ate","kalp","verb","kḷp"
"18","//","","","","punct",""
"19","24","","","","ind",""
"20","//","","","","punct",""
"","</s>","","","","",""
"","<s number=""92"">","","","","",""
"1","iti","","","iti","ind",""
"2","nirākāra","NIRĀKĀR","a@","nirākāra","noun-adj",""
"3","vādinaḥ","VĀDIN","aḥ","vādin","noun-adj",""
"4","samādhi","SAMĀDH","i@","samādhi","noun-adj",""
"5","malam","MAL","am","mala","noun-adj",""
"6","/","","","","punct",""
"","</s>","","","","",""
"","<s number=""93"">","","","","",""
"1","dṛṣṭir","DṚṢṬ","ir","dṛṣṭi","noun-adj",""
"2","anayoḥ","","","idam","pron",""
"3","pūrvavat","PŪRVAV","at","pūrvavat","noun-adj",""
"4","/","","","","punct",""
"","</s>","","","","",""
"","<s number=""94"">","","","","",""
"1","adhimātro","ADHIMĀTR","o","adhimātra","noun-adj",""
"2","mādhyamikaḥ","MĀDHYAMIK","aḥ","mādhyamika","noun-adj",""
"3","/","","","","punct",""
"","</s>","","","","",""
"","<s number=""95"">","","","","",""
"1","tatra","","","tatra","ind",""
"2","māyopama","MĀYOPAM","a@","māyopama","noun-adj",""
"3","ādvayavādinaḥ","ADVAYAVĀD","inaḥ","advayavādin","noun-adj",""
"4","vivṛtiḥ","VIVṚT","iḥ","vivṛti","noun-adj",""
"5","na","","","na","ind",""
"6","san","SAN","","sat","noun-adj",""
"7","n","","","na","ind",""
"8","āsan","ĀSAN","","āsana","noun-adj",""
"9","na","","","na","ind",""
"10","sad","SAD","@","sat","noun-adj",""
"11","asan","ASAN","","asana","noun-adj",""
"12","na","","","na","ind",""
"13","c","","","ca","ind",""
"14","^","","","","",""
"15","āpy","","","api","ind",""
"16","anubhaya","ANUBHAY","a@","anubhaya","noun-adj",""
"17","ātmakam","ĀTM","akam","ātman","noun-adj",""
"18","/","","","","punct",""
"19","catuṣ","CAT","uṣ","catur","noun-adj",""
"20","koṭi","KOṬ","i@","koṭi","noun-adj",""
"21","vinirmuktaṃ","VINIRMUKT","aṃ","vinirmukta","noun-adj",""
"22","tattvaṃ","TATTV","aṃ","tad","pron",""
"23","mādhyamikā","MĀDHYAMIK","ā","mādhyamika","noun-adj",""
"24","viduḥ","VID","uḥ","vidu","noun-adj",""
"25","//","","","","punct",""
"26","25","","","","ind",""
"27","//","","","","punct",""
"","</s>","","","","",""
"","<s number=""96"">asya","","asya","","",""
"1","c","","","ca","ind",""
"2","^","","","","",""
"3","āyam","ĀYAM","","idam","pron",""
"4","arthaḥ","ARTH","aḥ","artha","noun-adj",""
"5","/","","","","punct",""
"","</s>","","","","",""
"","<s number=""97"">","","","","",""
"1","na","","","na","ind",""
"2","sad","","","sat","ind",""
"3","bādhā","BĀDH","ā","bādha","noun-adj",""
"4","yogāt","YOG","āt","yoga","noun-adj",""
"5","a","","","alpha_privativum","ind",""
"6","sad","SAD","","sat","noun-adj",""
"7","api","","","api","ind",""
"8","na","","","na","ind",""
"9","c","","","ca","ind",""
"10","^","","","","",""
"11","ābhāsana","ĀBHĀSAN","a@","ābhāsana","noun-adj",""
"12","vaśāt","VAŚ","āt","vaśa","noun-adj",""
"13","tathā","","","tathā","ind",""
"14","doṣād","DOṢ","ād","doṣa","noun-adj",""
"15","dvandvāt","DVANDV","āt","dvandva","noun-adj",""
"16","ubhayam","UBHAY","am","ubhaya","noun-adj",""
"17","api","","","api","ind",""
"18","na","","","na","ind",""
"19","n","","","na","ind",""
"20","^","","","","",""
"21","āpy","","","api","ind",""
"22","anubhayaṃ","ANUBHAY","aṃ","anubhaya","noun-adj",""
"23","tathā","","","tathā","ind",""
"24","bodha","BODH","a@","bodha","noun-adj",""
"25","ābhāvād","ĀBHĀV","ād","ābhāvati","noun-adj",""
"26","iti","","","iti","ind",""
"27","/","","","","punct",""
"28","api","","","api","ind",""
"29","ca","","","ca","ind",""
"30","pūrva","PŪRV","a@","pūrva","noun-adj",""
"31","etara","ITAR","a@","itara","noun-adj",""
"32","parāmarśāt","PARĀMARŚ","āt","parāmarśa","noun-adj",""
"33","mūrtiś","MŪRT","iś","mūrti","noun-adj",""
"34","citre","CITR","e","citra","noun-adj",""
"35","yathā","","","yathā","ind",""
"36","vastu","VAST","u@","vastu","noun-adj",""
"37","śakti","ŚAKT","i","śakti","noun-adj",""
"38","s","","","su","ind",""
"39","kava","KAV","a@","kava","noun-adj",""
"40","āsaṅgaḥ","ĀSAṄG","aḥ","āsaṅga","noun-adj",""
"41","//","","","","punct",""
"42","26","","","","ind",""
"43","//","","","","punct",""
"","</s>","","","","",""
"","<s number=""98"">","","","","",""
"1","sa","","","sa_saha","ind",""
"2","hi","","","hi","ind",""
"3","māyopama","MĀYOPAM","a@","māyopama","noun-adj",""
"4","ādevayeti","DEV","ayeti","dev","verb",""
"5","vivṛtiḥ","VIVṚT","iḥ","vivṛti","noun-adj",""
"6","/","","","","punct",""
"","</s>","","","","",""
"","<s number=""99"">","","","","",""
"1","asy","","","as","verb","as"
"2","^","","","","",""
"3","aiva","","","eva","ind",""
"4","ca","","","ca","ind",""
"5","māyopama","MĀYOPAM","a@","māyopama","noun-adj",""
"6","ā","","","alpha_privativum","ind",""
"7","dvayasya","DVAY","asya","dvaya","noun-adj",""
"8","bhāvanā","BHĀVAN","ā","bhāvanā","noun-adj",""
"9","dhyānam","DHYĀN","am","dhyāna","noun-adj",""
"10","/","","","","punct",""
"","</s>","","","","",""
"","<s number=""100"">","","","","",""
"1","yas","","","yad","pron",""
"2","tatr","","","tatra","ind",""
"3","occheda","UCCHED","a@","uccheda","noun-adj",""
"4","ābhiniveśas","ABHINIVEŚ","as","abhiniveśa","noun-adj",""
"5","tad","","","tad","pron",""
"6","dhyāna","DHYĀN","a@","dhyāna","noun-adj",""
"7","malam","MAL","am","mala","noun-adj",""
"8","/","","","","punct",""
"","</s>","","","","",""
"","<s number=""101"">","","","","",""
"1","māyopama","MĀYOPAM","a@","māyopama","noun-adj",""
"2","ā","","","alpha_privativum","ind",""
"3","dvaya","DVAY","a@","dvaya","noun-adj",""
"4","ādhimokṣataḥ","ADHIMOKṢ","ataḥ","adhimokṣa","noun-adj",""
"5","ṣaṭa","ṢAṬ","a@","ṣaṭ","noun-adj",""
"6","pāramitā","PĀRAMIT","ā@","pāramitā","noun-adj",""
"7","paripūriṇī","PARIPŪR","iṇī","paripūrin","noun-adj",""
"8","dṛṣṭiḥ","DṚṢṬ","iḥ","dṛṣṭi","noun-adj",""
"9","/","","","","punct",""
"","</s>","","","","",""
"","<s number=""102"">","","","","",""
"1","sarva","SARV","a@","sarva","noun-adj",""
"2","dharma","DHARM","a@","dharma","noun-adj",""
"3","ā","","","alpha_privativum","ind",""
"4","pratiṣṭhāna","PRATIṢṬHĀN","a@","pratiṣṭhāna","noun-adj",""
"5","vādināṃ","VĀDIN","āṃ","vādinī","noun-adj",""
"6","tv","","","tu","ind",""
"7","ayaṃ","","","idam","pron",""
"8","vicāraḥ","VICĀR","aḥ","vicāra","noun-adj",""
"9","na","","","na","ind",""
"10","ma","","","","ind",""
"11","tam","TAM","","tad","pron",""
"12","śāśvataṃ","ŚĀŚVAT","aṃ","śāśvata","noun-adj",""
"13","viśvaṃ","VIŚV","aṃ","viśva","noun-adj",""
"14","na","","","na","ind",""
"15","c","","","ca","ind",""
"16","^","","","","",""
"17","occhedi","UCCHED","i@","ucchedin","noun-adj",""
"18","samī","SAM","ī@","samī","noun-adj",""
"19","hitam","HIT","am","hita","noun-adj",""
"20","/","","","","punct",""
"21","śāśvata","ŚĀŚVAT","a@","śāśvata","noun-adj",""
"22","occhedino","UCCHED","ino","ucchedin","noun-adj",""
"23","yugmāṃ","YUGM","āṃ","yugmā","noun-adj",""
"24","n","","","na","ind",""
"25","ānubha","ANUBH","a@","anubha","noun-adj",""
"26","yaṃ","YAM","","yad","pron",""
"27","vin","","","vinā","ind",""
"28","^","","","","",""
"29","obhayam","UBHAY","am","ubhaya","noun-adj",""
"30","//","","","","punct",""
"31","27","","","","ind",""
"32","//","","","","punct",""
"","</s>","","","","",""
"","<s number=""103"">","","","","",""
"1","savasmin","SAV","asmin","sava","noun-adj",""
"2","n","","","na","ind",""
"3","a","","","alpha_privativum","ind",""
"4","praṭi","PRAṬ","i@","praṭi","noun-adj",""
"5","ṣṭhāne","ṢṬHĀN","e","ṣṭhāna","noun-adj",""
"6","vastu","VAST","u@","vastu","noun-adj",""
"7","tattvaṃ","TATTV","aṃ","tad","pron",""
"8","vidur","VID","ur","vidu","noun-adj",""
"9","buddhāḥ","BUDDH","āḥ","buddha","noun-adj",""
"10","/","","","","punct",""
"11","atha","ATH","a","atha","noun-adj",""
"12","^","","","","",""
"13","eṣā","","","tad","pron",""
"14","kalpanān","KALPAN","ān","kalpanā","noun-adj",""
"15","^","","","","",""
"16","aiva","","","eva","ind",""
"17","yac","","","yad","pron",""
"18","cid","","","cid","ind",""
"19","vetti","VET","ti","vid","verb","vid"
"20","na","","","na","ind",""
"21","cittatām","CITT","atām","cittatā","noun-adj",""
"22","//","","","","punct",""
"23","28","","","","ind",""
"24","//","","","","punct",""
"","</s>","","","","",""
"","<s number=""104"">","","","","",""
"1","yo","","","yad","pron",""
"2","vit","VIT","","vita","noun-adj",""
"3","sarva","SARV","a@","sarva","noun-adj",""
"4","samāropaḥ","SAMĀROP","aḥ","samāropa","noun-adj",""
"5","sa","","","sa_saha","ind",""
"6","sarvaḥ","SARV","aḥ","sarva","noun-adj",""
"7","sarvathā","SARVATH","ā","sarvathā","noun-adj",""
"8","na","","","na","ind",""
"9","hi","","","hi","ind",""
"10","/","","","","punct",""
"11","madhyama","MADHYAM","a@","madhyama","noun-adj",""
"12","ārtho","ARTH","o","artha","noun-adj",""
"13","nir","NIR","","niḥ_privativum","ind",""
"14","āropas","ĀROP","as","āropa","noun-adj",""
"15","tatr","","","tatra","ind",""
"16","āpoha","APOH","a@","apoha","noun-adj",""
"17","vidhī","VIDH","ī","vidhi","noun-adj",""
"18","kutaḥ","KUT","aḥ","kuta","noun-adj",""
"19","//","","","","punct",""
"20","29","","","","ind",""
"21","//","","","","punct",""
"","</s>","","","","",""
"","<s number=""105"">","","","","",""
"1","anābhogaṃ","ANĀBHOG","aṃ","anābhoga","noun-adj",""
"2","hi","","","hi","ind",""
"3","yad","","","yadi","ind",""
"4","jñānaṃ","JÑĀN","aṃ","jñāna","noun-adj",""
"5","tac","","","tad","pron",""
"6","c","","","ca","ind",""
"7","^","","","","",""
"8","āintyaṃ","","","","ind",""
"9","pracakṣate","PRACAKṢ","ate","pracakṣas","noun-adj",""
"10","/","","","","punct",""
"11","sañcinti","SAÑCINT","i","sañcint","verb",""
"12","yad","","","yadi","ind",""
"13","acintyaṃ","ACINTY","aṃ","acintya","noun-adj",""
"14","vai","","","vai","ind",""
"15","tad","","","tad","pron",""
"16","acintyaṃ","ACINTY","aṃ","acintya","noun-adj",""
"17","bhaven","BHAV","en","bhava","noun-adj",""
"18","na","","","na","ind",""
"19","hi","","","hi","ind",""
"20","//","","","","punct",""
"21","30","","","","ind",""
"22","//","","","","punct",""
"","</s>","","","","",""
"","<s number=""106"">","","","","",""
"1","yena","YEN","a@","yad","pron",""
"2","ā","","","alpha_privativum","ind",""
"3","jātaṃ","JĀT","aṃ","jāta","noun-adj",""
"4","jagad","JAGAD","","jagat","noun-adj",""
"5","buddhaṃ","BUDDH","aṃ","buddha","noun-adj",""
"6","buddhiḥ","BUDDH","iḥ","buddhi","noun-adj",""
"7","śuddha","ŚUDDH","a","śuddha","noun-adj",""
"8","^","","","","",""
"9","aiva","","","eva","ind",""
"10","bodhataḥ","BODH","ataḥ","bodha","noun-adj",""
"11","/","","","","punct",""
"12","nijaṃ","NIJ","aṃ","nija","noun-adj",""
"13","tasya","","","tad","pron",""
"14","jagat","JAGAT","","jagat","noun-adj",""
"15","satyam","SATY","am","satya","noun-adj",""
"16","anābhogena","ANĀBHOG","ena","anābhoga","noun-adj",""
"17","dhīmataḥ","DHĪM","ataḥ","dhīmat","noun-adj",""
"18","//","","","","punct",""
"19","31","","","","ind",""
"20","//","","","","punct",""
"","</s>","","","","",""
"","<s number=""107"">","","","","",""
"1","tad","","","tad","pron",""
"2","uktam","UKT","am","ukta","noun-adj",""
"3","sarva","SARV","a@","sarva","noun-adj",""
"4","āropa","ĀROP","a@","āropa","noun-adj",""
"5","vinirmukte","VINIRMUKT","e","vinirmukta","noun-adj",""
"6","sv","","","su","ind",""
"7","atas","ATAS","","atas","noun-adj",""
"8","tattve","TATTV","e","tad","pron",""
"9","caka","CAK","a@","caka","noun-adj",""
"10","ā","","","alpha_privativum","ind",""
"11","sati","SAT","i","sati","noun-adj",""
"12","/","","","","punct",""
"13","śūnyata","ŚŪNYAT","a@","śūnyatā","noun-adj",""
"14","ādy","ĀD","y@","ādi","noun-adj",""
"15","abhidhānais","ABHIDHĀN","ais","abhidhāna","noun-adj",""
"16","tu","","","tu","ind",""
"17","tatrā","","","","ind",""
"18","ropa","ROP","a@","ropa","noun-adj",""
"19","nirākriyā","NIRĀKRIY","ā","nirākriyā","noun-adj",""
"20","//","","","","punct",""
"21","32","","","","ind",""
"22","//","","","","punct",""
"","</s>","","","","",""
"","<s number=""108"">asya","","asya","","",""
"1","ca","","","ca","ind",""
"2","vicārāya","VICĀR","āya","vicāra","noun-adj",""
"3","āyātasya","ĀYĀT","asya","āyāta","noun-adj",""
"4","arthasya","ARTH","asya","artha","noun-adj",""
"5","a","","","alpha_privativum","ind",""
"6","nāra","NĀR","a@","nāra","noun-adj",""
"7","opar","UPAR","","upara","noun-adj",""
"8","ūpasya","ŪPAS","ya","ūpasa","noun-adj",""
"9","an","","","alpha_privativum","ind",""
"10","abhiniveśa","ABHINIVEŚ","a@","abhiniveśa","noun-adj",""
"11","vihāreṇa","VIHĀR","eṇa","vihāra","noun-adj",""
"12","sākṣātkriyā","SĀKṢĀTKRIY","ā","sākṣātkriyā","noun-adj",""
"13","dhyānaṃ","DHYĀN","aṃ","dhyāna","noun-adj",""
"14","/","","","","punct",""
"","</s>","","","","",""
"","<s number=""109"">","","","","",""
"1","sarva","SARV","a@","sarva","noun-adj",""
"2","ārtha","ARTH","a@","artha","noun-adj",""
"3","occhedo","UCCHED","o","uccheda","noun-adj",""
"4","jaḍī","JAḌ","ī@","jaḍī","noun-adj",""
"5","bhāvaḥ","BHĀV","aḥ","bhāva","noun-adj",""
"6","samādhi","SAMĀDH","i@","samādhi","noun-adj",""
"7","malam","MAL","am","mala","noun-adj",""
"8","/","","","","punct",""
"","</s>","","","","",""
"","<s number=""110"">","","","","",""
"1","an","","","alpha_privativum","ind",""
"2","āropeṇa","ĀROP","eṇa","āropa","noun-adj",""
"3","ṣaṭa","ṢAṬ","a@","ṣaṭ","noun-adj",""
"4","pāramitā","PĀRAMIT","ā@","pāramitā","noun-adj",""
"5","paripūraṇaṃ","PARIPŪRAṆ","aṃ","paripūraṇa","noun-adj",""
"6","dṛṣṭiḥ","DṚṢṬ","iḥ","dṛṣṭi","noun-adj",""
"7","/","","","","punct",""
"","</s>","","","","",""
"","<s number=""111"">","","","","",""
"1","atra","","","atra","ind",""
"2","mṛdumadhyayor","MṚDUMADHY","ayor","mṛdumadhyā","noun-adj",""
"3","dharma","DHARM","a@","dharma","noun-adj",""
"4","āvalambanā","AVALAMBAN","ā","avalambanā","noun-adj",""
"5","karuṇā","KARUṆ","ā","karuṇā","noun-adj",""
"6","/","","","","punct",""
"","</s>","","","","",""
"","<s number=""112"">","","","","",""
"1","dharma","DHARM","a@","dharma","noun-adj",""
"2","āvalambanā","AVALAMBAN","ā","avalambanā","noun-adj",""
"3","c","","","ca","ind",""
"4","^","","","","",""
"5","ānityatā","ANITY","atā","anityatā","noun-adj",""
"6","vyasana","VYASAN","a@","vyasana","noun-adj",""
"7","sampātinaḥ","SAMPĀT","inaḥ","sampātin","noun-adj",""
"8","sarva","SARV","a@","sarva","noun-adj",""
"9","dharmān","DHARM","ān","dharma","noun-adj",""
"10","ālambya","ĀLAMB","ya","ālamb","verb",""
"11","utpadyate","UTPAD","yate","utpad","verb","utpad"
"12","yā","","","yad","pron",""
"13","sā","","","tad","pron",""
"14","boddhavyā","BODDHAVY","ā","boddhavya","noun-adj",""
"15","/","","","","punct",""
"","</s>","","","","",""
"","<s number=""113"">","","","","",""
"1","ab","","","","ind",""
"2","hima","HIM","a@","hima","noun-adj",""
"3","ātrasya","ĀTRAS","ya","ātras","verb",""
"4","ca","","","ca","ind",""
"5","ālambana","ĀLAMBAN","a","ālambana","noun-adj",""
"6","niḥ","","","niḥ_privativum","ind",""
"7","svabhāvā","SVABHĀV","ā","svabhāva","noun-adj",""
"8","manaskāra","MANASKĀR","a@","manaskāra","noun-adj",""
"9","dharma","DHARM","a@","dharma","noun-adj",""
"10","ādhigamān","ADHIGAM","ān","adhigama","noun-adj",""
"11","ālambanā","ĀLAMBAN","ā","ālambana","noun-adj",""
"12","karuṇā","KARUṆ","ā","karuṇā","noun-adj",""
"13","/","","","","punct",""
"","</s>","","","","",""
"","<s number=""114"">","","","","",""
"1","kāya","KĀY","a@","kāya","noun-adj",""
"2","traya","TRAY","a@","tri","noun-adj",""
"3","vyavasthā","VYAVASTH","ā","vyavasthā","noun-adj",""
"4","c","","","ca","ind",""
"5","^","","","","",""
"6","āsya","ĀS","ya","ās","verb",""
"7","maitreya","MAITREY","a@","maitreya","noun-adj",""
"8","nāthair","NĀTH","air","nātha","noun-adj",""
"9","uktā","UKT","ā","ukta","noun-adj",""
"10","/","","","","punct",""
"","</s>","","","","",""
"","<s number=""115"">","","","","",""
"1","tathā","","","tathā","ind",""
"2","ca","","","ca","ind",""
"3","karoti","KAR","oti","kar","verb","kṛ"
"4","yena","","","yad","pron",""
"5","citrāṇi","CITR","āṇi","citra","noun-adj",""
"6","hitāni","HIT","āni","hita","noun-adj",""
"7","jagataḥ","JAGAT","aḥ","jagat","noun-adj",""
"8","samam","SAM","am","sama","noun-adj",""
"9","/ā","","","","punct",""
"10","bhavāt","BHAV","āt","bhava","noun-adj",""
"11","so","","","tad","pron",""
"12","an","","","alpha_privativum","ind",""
"13","upacchannaḥ","UPACCHANN","aḥ","upacchanna","noun-adj",""
"14","kāyo","KĀY","o","kāya","noun-adj",""
"15","nair","","","niḥ_privativum","ind",""
"16","māṇiko","MĀṆIK","o","māṇika","noun-adj",""
"17","muneḥ","MUN","eḥ","muni","noun-adj",""
"18","//","","","","punct",""
"19","33","","","","ind",""
"20","//","","","","punct",""
"","</s>","","","","",""
"","<s number=""116"">","","","","",""
"1","dvātriṃśal","DVĀTRIṂŚ","al","dvātriṃśat","noun-adj",""
"2","lakṣaṇā","LAKṢAṆ","ā@","lakṣaṇa","noun-adj",""
"3","śīti","ŚĪT","i@","śīti","noun-adj",""
"4","vyañjana","VYAÑJAN","a@","vyañjana","noun-adj",""
"5","ātmā","ĀTM","ā","ātman","noun-adj",""
"6","muner","MUN","er","muni","noun-adj",""
"7","ayam","","","idam","pron",""
"8","/","","","","punct",""
"9","sāma","SĀM","a@","sāma","noun-adj",""
"10","bhogiko","BHOGIK","o","bhogika","noun-adj",""
"11","mataḥ","MAT","aḥ","mata","noun-adj",""
"12","kāyo","KĀY","o","kāya","noun-adj",""
"13","mahāyāna","MAHĀYĀN","a@","mahāyāna","noun-adj",""
"14","opabhogataḥ","UPABHOG","ataḥ","upabhoga","noun-adj",""
"15","//","","","","punct",""
"16","34","","","","ind",""
"17","//","","","","punct",""
"","</s>","","","","",""
"","<s number=""117"">","","","","",""
"1","sarva","SARV","a@","sarva","noun-adj",""
"2","ākārāṃ","ĀKĀR","āṃ","ākārā","noun-adj",""
"3","viśuddhiṃ","VIŚUDDH","iṃ","viśuddhi","noun-adj",""
"4","ye","","","yad","pron",""
"5","dharmāḥ","DHARM","āḥ","dharma","noun-adj",""
"6","prāptā","PRĀPT","ā","prāpta","noun-adj",""
"7","nir","NIR","","niḥ_privativum","ind",""
"8","āsravāḥ","ĀSRAV","āḥ","āsrava","noun-adj",""
"9","/","","","","punct",""
"10","svābhāviko","SVĀBHĀVIK","o","svābhāvika","noun-adj",""
"11","muneḥ","MUN","eḥ","muni","noun-adj",""
"12","kāyas","KĀY","as","kāya","noun-adj",""
"13","teṣāṃ","","","tad","pron",""
"14","prakṛti","PRAKṚT","i@","prakṛti","noun-adj",""
"15","lakṣaṇaḥ","LAKṢAṆ","aḥ","lakṣaṇa","noun-adj",""
"16","//","","","","punct",""
"17","35","","","","ind",""
"18","//","","","","punct",""
"","</s>","","","","",""
"","<s number=""118"">","","","","",""
"1","iti","","","iti","ind",""
"2","/","","","","punct",""
"3","mantra","MANTR","a@","mantra","noun-adj",""
"4","nayas","NAY","as","naya","noun-adj",""
"5","tu","","","tu","ind",""
"6","asmābhir","","","asmat","pron",""
"7","i","","","","ind",""
"8","hāti","HĀT","i@","hāti","noun-adj",""
"9","gambhīratvād","GAMBHĪRATV","ād","gambhīratva","noun-adj",""
"10","gambhīra","GAMBHĪR","a@","gambhīra","noun-adj",""
"11","naya","NAY","a@","naya","noun-adj",""
"12","ādhimuktika","ADHIMUKTIK","a@","adhimuktika","noun-adj",""
"13","puruṣa","PURUṢ","a@","puruṣa","noun-adj",""
"14","viṣayatvāt","VIṢAY","atvāt","viṣayatva","noun-adj",""
"15","catur","CAT","ur","catur","noun-adj",""
"16","mudra","MUDR","a@","mudrā","noun-adj",""
"17","ādi","ĀD","i@","ādi","noun-adj",""
"18","sādhana","SĀDH","ana","sādhat","noun-adj",""
"19","prakāśana","PRAKĀŚ","ana","prakāśat","noun-adj",""
"20","vistaratvāc","VISTAR","atvāc","vistaratva","noun-adj",""
"21","ca","","","ca","ind",""
"22","na","","","na","ind",""
"23","vyākriyate","VYĀKRI","yate","vyākria","noun-adj",""
"24","/","","","","punct",""
"","</s>","","","","",""
"","<s number=""119"">","","","","",""
"1","tathā","","","tathā","ind",""
"2","ca","","","ca","ind",""
"3","ekārthatve","EKĀRTHATV","e","ekārthatva","noun-adj",""
"4","apy","","","api","ind",""
"5","a","","","alpha_privativum","ind",""
"6","saṃmohāt","SAMMOH","āt","sammoha","noun-adj",""
"7","bahu","BAH","u@","bahu","noun-adj",""
"8","ūpāyād","UPĀY","ād","upāya","noun-adj",""
"9","a","","","alpha_privativum","ind",""
"10","duṣ","","","duḥ","ind",""
"11","karāt","KAR","āt","kara","noun-adj",""
"12","/","","","","punct",""
"13","tīkṣṇendriya","TĪKṢṆENDRIY","a@","tīkṣṇendriya","noun-adj",""
"14","ādhikārāc","ADHIKĀR","āc","adhikāra","noun-adj",""
"15","ca","","","ca","ind",""
"16","mantra","MANTR","a@","mantra","noun-adj",""
"17","śāstraṃ","ŚĀSTR","aṃ","śāstra","noun-adj",""
"18","viśiṣyate","VIŚIṢ","yate","viśiṣ","verb",""
"19","//","","","","punct",""
"20","36","","","","ind",""
"21","//","","","","punct",""
"","</s>","","","","",""
"","<s number=""120"">","","","","",""
"1","kṛtaś","KṚTAŚ","","kṛtaśas","noun-adj",""
"2","c","","","ca","ind",""
"3","^","","","","",""
"4","āsmā","","","","ind",""
"5","bhir","BHIR","","bhiru","noun-adj",""
"6","atra","","","atra","ind",""
"7","seka","SEK","a@","seka","noun-adj",""
"8","nirṇayo","NIRṆAY","o","nirṇaya","noun-adj",""
"9","nāma","NĀM","a","nāman","noun-adj",""
"10","granthaḥ","GRANTH","aḥ","grantha","noun-adj",""
"11","/","","","","punct",""
"","</s>","","","","",""
"","<s number=""121"">","","","","",""
"1","nanu","NAN","u","nanu","noun-adj",""
"2","yadi","","","yadi","ind",""
"3","mahāyāna","MAHĀYĀN","a@","mahāyāna","noun-adj",""
"4","nirṇīta","NIRṆĪT","a","nirṇīta","noun-adj",""
"5","ev","","","eva","ind",""
"6","ārthaḥ","ARTH","aḥ","artha","noun-adj",""
"7","paramārtho","PARAMĀRTH","o","paramārtha","noun-adj",""
"8","asti","","","as","verb","as"
"9","atra","","","atra","ind",""
"10","kim","","","kim","pron",""
"11","arthaṃ","ARTH","aṃ","artha","noun-adj",""
"12","tarhi","","","tarhi","ind",""
"13","śrāvaka","ŚRĀVAK","a@","śrāvaka","noun-adj",""
"14","pratyekabuddha","PRATYEKABUDDH","a@","pratyekabuddha","noun-adj",""
"15","yāne","YĀN","e","yāna","noun-adj",""
"16","bhagavān","BHAGAV","ān","bhagavat","noun-adj",""
"17","deśita","DEŚIT","a@","deśita","noun-adj",""
"18","vān","VĀN","","vāna","noun-adj",""
"19","tan","","","tad","pron",""
"20","na","","","na","ind",""
"21","mahāyāna","MAHĀYĀN","a@","mahāyāna","noun-adj",""
"22","prāpya","PRĀPY","a@","prāpya","noun-adj",""
"23","prāpan","PRĀP","an","prāpat","noun-adj",""
"24","ārtham","ARTH","am","artha","noun-adj",""
"25","eva","","","eva","ind",""
"26","śrāvaka","ŚRĀVAK","a@","śrāvaka","noun-adj",""
"27","pratyekabuddha","PRATYEKABUDDH","a@","pratyekabuddha","noun-adj",""
"28","yāna","YĀN","a@","yāna","noun-adj",""
"29","sopānayor","SOPĀN","ayor","sopāna","noun-adj",""
"30","nirmāṇāt","NIRMĀṆ","āt","nirmāṇa","noun-adj",""
"31","/","","","","punct",""
"","</s>","","","","",""
"","<s number=""122"">","","","","",""
"1","tad","","","tad","pron",""
"2","uktam","UKT","am","ukta","noun-adj",""
"3","ādhi","ĀDH","i@","ādhi","noun-adj",""
"4","karmika","KARM","ika@","karman","noun-adj",""
"5","sattvasya","SATTV","asya","sattva","noun-adj",""
"6","paramārtha","PARAMĀRTH","a@","paramārtha","noun-adj",""
"7","āvatāraṇe","AVATĀRAṆ","e","avatāraṇa","noun-adj",""
"8","/","","","","punct",""
"9","upāyas","UPĀY","as","upāya","noun-adj",""
"10","tv","","","tu","ind",""
"11","ayaṃ","","","idam","pron",""
"12","sambuddhaiḥ","SAMBUDDH","aiḥ","sambuddha","noun-adj",""
"13","sopānam","SOPĀN","am","sopāna","noun-adj",""
"14","iva","","","iva","ind",""
"15","nirmitaḥ","NIRMIT","aḥ","nirmita","noun-adj",""
"16","//","","","","punct",""
"17","37","","","","ind",""
"18","//","","","","punct",""
"","</s>","","","","",""
"","<s number=""123"">","","","","",""
"1","saddharma","SADDHARM","a@","saddharma","noun-adj",""
"2","puṇḍarīke","PUṆḌARĪK","e","puṇḍarīka","noun-adj",""
"3","apy","","","api","ind",""
"4","uktam","UKT","am","ukta","noun-adj",""
"5","ekaṃ","EK","aṃ","eka","noun-adj",""
"6","tu","","","tu","ind",""
"7","yānaṃ","YĀN","aṃ","yāna","noun-adj",""
"8","hi","","","hi","ind",""
"9","na","","","na","ind",""
"10","yaś","YAŚ","","yad","pron",""
"11","ca","","","ca","ind",""
"12","eka","EK","a@","eka","noun-adj",""
"13","ekā","EK","ā","eka","noun-adj",""
"14","c","","","ca","ind",""
"15","iyaṃ","IYAṂ","","idam","pron",""
"16","deśana","DEŚAN","a","deśanā","noun-adj",""
"17","nāyakānāṃ","NĀYAK","ānāṃ","nāyaka","noun-adj",""
"18","/","","","","punct",""
"19","upāya","UPĀY","a@","upāya","noun-adj",""
"20","kauśalya","KAUŚALY","a","kauśalya","noun-adj",""
"21","mama","MAM","a","mat","pron",""
"22","^","","","","",""
"23","aiva","","","eva","ind",""
"24","rūpaṃ","RŪP","aṃ","rūpa","noun-adj",""
"25","yat","","","yad","pron",""
"26","trīṇi","TRĪṆ","i","tri","noun-adj",""
"27","yān","","","yad","pron",""
"28","āny","ANY","","anya","noun-adj",""
"29","upadarśayāmi","UPADARŚ","ayāmi","upadarś","verb","upadṛś"
"30","//","","","","punct",""
"31","38","","","","ind",""
"32","//","","","","punct",""
"","</s>","","","","",""
"","<s number=""124"">","","","","",""
"1","nāgārjuna","NĀGĀRJUN","a@","nāgārjuna","noun-adj",""
"2","pādair","PĀD","air","pāda","noun-adj",""
"3","apy","","","api","ind",""
"4","uktam","UKT","am","ukta","noun-adj",""
"5","dharmadhātor","DHARMADHĀT","or","dharmadhātu","noun-adj",""
"6","a","","","alpha_privativum","ind",""
"7","saṃbhedād","SAMBHED","ād","sambheda","noun-adj",""
"8","dhyāna","DHYĀN","a@","dhyāna","noun-adj",""
"9","bhedo","BHED","o","bheda","noun-adj",""
"10","asti","","","as","verb","as"
"11","na","","","na","ind",""
"12","prabho","PRABH","o","prabha","noun-adj",""
"13","/","","","","punct",""
"14","yāna","YĀN","a@","yāna","noun-adj",""
"15","tritayam","TRITAY","am","tritaya","noun-adj",""
"16","ākhyātaṃ","ĀKHYĀT","aṃ","ākhyāta","noun-adj",""
"17","tvayā","","","tvat","pron",""
"18","sattva","SATTV","a@","sattva","noun-adj",""
"19","āvatārataḥ","AVATĀR","ataḥ","avatāra","noun-adj",""
"20","//","","","","punct",""
"21","39","","","","ind",""
"22","//","","","","punct",""
"","</s>","","","","",""
"","<s number=""125"">","","","","",""
"1","anyatr","ANYATR","","anyatra","noun-adj",""
"2","^","","","","",""
"3","āpy","","","api","ind",""
"4","uktam","UKT","am","ukta","noun-adj",""
"5","muktis","MUKT","is","mukti","noun-adj",""
"6","tu","","","tu","ind",""
"7","śūnyatā","ŚŪNYAT","ā@","śūnyatā","noun-adj",""
"8","dṛṣṭis","DṚṢṬ","is","dṛṣṭi","noun-adj",""
"9","tad","TAD","","tad","pron",""
"10","artha","ARTH","a@","artha","noun-adj",""
"11","ā","","","alpha_privativum","ind",""
"12","śeṣa","ŚEṢ","a@","śeṣa","noun-adj",""
"13","bhāvaṇā","BHĀV","aṇā","bhāva","noun-adj",""
"14","/","","","","punct",""
"15","40","","","","ind",""
"16","iti","","","iti","ind",""
"17","/","","","","punct",""
"","</s>","","","","",""
"","<s number=""126"">","","","","",""
"1","idaṃ","","","idam","pron",""
"2","ca","","","ca","ind",""
"3","yāna","YĀN","a@","yāna","noun-adj",""
"4","tritaya","TRITAY","a@","tritaya","noun-adj",""
"5","prakāśanaṃ","PRAKĀŚAN","aṃ","prakāśana","noun-adj",""
"6","manyamāna","MAN","yamāna","man","verb","man"
"7","śūnyatā","ŚŪNYAT","ā","śūnyatā","noun-adj",""
"8","s","","","su","ind",""
"9","^","","","","",""
"10","aiva","","","eva","ind",""
"11","bhagavato","BHAGAVAT","o","bhagavatī","noun-adj",""
"12","avagantavyaḥ","AVAGANT","avyaḥ","avaganta","noun-adj",""
"13","/","","","","punct",""
"","</s>","","","","",""
"","<s number=""127"">","","","","",""
"1","tathā","","","tathā","ind",""
"2","hi","","","hi","ind",""
"3","n","","","na","ind",""
"4","odāhṛtaṃ","UDĀHṚT","aṃ","udāhṛta","noun-adj",""
"5","tvayā","","","tvat","pron",""
"6","kiñcid","","","kimcit","ind",""
"7","eka","EK","a@","eka","noun-adj",""
"8","m","M","","ma","noun-adj",""
"9","apy","","","api","ind",""
"10","akṣaraṃ","AKṢAR","aṃ","akṣara","noun-adj",""
"11","vibho","VIBH","o","vibhu","noun-adj",""
"12","/","","","","punct",""
"13","kṛtsnaś","KṚTSN","aś","kṛtsna","noun-adj",""
"14","ca","","","ca","ind",""
"15","vaineya","VAINEY","a@","vaineya","noun-adj",""
"16","jano","JAN","o","jana","noun-adj",""
"17","dharma","DHARM","a@","dharma","noun-adj",""
"18","varṣana","VARṢ","ana","varṣat","noun-adj",""
"19","tarpitaḥ","TARPIT","aḥ","tarpita","noun-adj",""
"20","//","","","","punct",""
"21","41","","","","ind",""
"22","//","","","","punct",""
"","</s>","","","","",""
"","<s number=""128"">","","","","",""
"1","cintā","CINT","ā@","cintā","noun-adj",""
"2","maṇir","MAṆ","ir","maṇi","noun-adj",""
"3","iv","","","iva","ind",""
"4","ākampyaḥ","AKAMPY","aḥ","akampya","noun-adj",""
"5","sarva","SARV","a@","sarva","noun-adj",""
"6","saṅkalpa","SAṄKALP","a@","saṅkalpa","noun-adj",""
"7","vāyubhiḥ","VĀY","ubhiḥ","vāyu","noun-adj",""
"8","/","","","","punct",""
"9","tath","","","tathā","ind",""
"10","^","","","","",""
"11","āpi","","","api","ind",""
"12","sarva","SARV","a@","sarva","noun-adj",""
"13","sattvānām","SATTV","ānām","sattva","noun-adj",""
"14","a","","","alpha_privativum","ind",""
"15","śeṣāśā","ŚEṢ","āśā","śeṣa","noun-adj",""
"16","prapū","PRAP","ū","prapū","noun-adj",""
"17","rakaḥ","RAK","aḥ","raka","noun-adj",""
"18","//","","","","punct",""
"19","42","","","","ind",""
"20","//","","","","punct",""
"","</s>","","","","",""
"","<s number=""129"">","","","","",""
"1","cakra","CAKR","a@","cakra","noun-adj",""
"2","bhramaṇ","BHRAM","aṇ","bhrama","noun-adj",""
"3","ayogena","AYOG","ena","ayoga","noun-adj",""
"4","nir","","","niḥ_privativum","ind",""
"5","vikalpe","VIKALP","e","vikalpa","noun-adj",""
"6","api","","","api","ind",""
"7","tāyinaḥ","TĀY","inaḥ","tāyin","noun-adj",""
"8","/","","","","punct",""
"9","sambhāro","SAMBHĀR","o","sambhāra","noun-adj",""
"10","vedha","VEDH","a@","vedha","noun-adj",""
"11","sāmarthyāt","SĀMARTHY","āt","sāmarthya","noun-adj",""
"12","deśanā","DEŚAN","ā","deśanā","noun-adj",""
"13","sampravartate","SAMPRAVART","ate","sampravart","verb","sampravṛt"
"14","//","","","","punct",""
"15","43","","","","ind",""
"16","//","","","","punct",""
"","</s>","","","","",""
"","<s number=""130"">","","","","",""
"1","yā","","","yad","pron",""
"2","nānāṃ","NĀN","āṃ","nānā","noun-adj",""
"3","n","","","na","ind",""
"4","^","","","","",""
"5","āsti","","","as","verb","as"
"6","vai","","","vai","ind",""
"7","niṣṭhā","NIṢṬH","ā","niṣṭhā","noun-adj",""
"8","y","","","","ind",""
"9","āvac","ĀVAC","","āvac","verb",""
"10","cittaṃ","CITT","aṃ","citta","noun-adj",""
"11","pravartate","PRAVART","ate","pravart","verb","pravṛt"
"12","/","","","","punct",""
"13","parāvṛtte","PARĀVṚTT","e","parāvṛtta","noun-adj",""
"14","tu","","","tu","ind",""
"15","vai","","","vai","ind",""
"16","citte","CITT","e","citta","noun-adj",""
"17","na","","","na","ind",""
"18","yānaṃ","YĀN","aṃ","yāna","noun-adj",""
"19","n","","","na","ind",""
"20","^","","","","",""
"21","āpi","","","api","ind",""
"22","yāyinaḥ","YĀY","inaḥ","yāyin","noun-adj",""
"23","//","","","","punct",""
"24","44","","","","ind",""
"25","//","","","","punct",""
"","</s>","","","","",""
"","<s number=""131"">","","","","",""
"1","saddharma","SADDHARM","a@","saddharma","noun-adj",""
"2","ratna","RATN","a@","ratna","noun-adj",""
"3","ghaṭikā","GHAṬIK","ā","ghaṭikā","noun-adj",""
"4","vāg","VĀG","","vāk","noun-adj",""
"5","hy","","","hi","ind",""
"6","atra","","","atra","ind",""
"7","grathita","GRATHIT","a@","grathita","noun-adj",""
"8","ā","","","alpha_privativum","ind",""
"9","malā","MAL","ā","mala","noun-adj",""
"10","/","","","","punct",""
"11","hṛdaye","HṚDAY","e","hṛdaya","noun-adj",""
"12","kriyatāṃ","KRIY","atāṃ","kriyatā","noun-adj",""
"13","dhīrās","DHĪR","ās","dhīra","noun-adj",""
"14","tattva","TATTV","a@","tad","pron",""
"15","ratnāvalī","RATNĀVAL","ī","ratnāvalī","noun-adj",""
"16","mude","MUD","e","muda","noun-adj",""
"17","//","","","","punct",""
"18","45","","","","ind",""
"19","//","","","","punct",""
"","</s>","","","","",""
"","<s number=""132"">","","","","",""
"1","saṃgrahe","SAṂGRAH","e","saṃgraha","noun-adj",""
"2","tu","","","tu","ind",""
"3","priyatvena","PRIY","atvena","priyatva","noun-adj",""
"4","vistara","VISTAR","a@","vistara","noun-adj",""
"5","dveṣiṇā","DVEṢ","iṇā","dveṣin","noun-adj",""
"6","mayā","","","mat","pron",""
"7","/","","","","punct",""
"8","bhūrir","BHŪR","ir","bhūri","noun-adj",""
"9","anuttame","ANUTTAM","e","anuttama","noun-adj",""
"10","tasmin","","","tad","pron",""
"11","kṣantavyo","KṢAN","tavyo","kṣana","noun-adj",""
"12","vistara","VISTAR","a@","vistara","noun-adj",""
"13","priyaḥ","PRIY","aḥ","priya","noun-adj",""
"14","//","","","","punct",""
"15","46","","","","ind",""
"16","//","","","","punct",""
"","</s>","","","","",""
"","<s number=""133"">","","","","",""
"1","vidhāya","VIDHĀY","a","vidhāya","noun-adj",""
"2","bhavya","BHAVY","a@","bhavya","noun-adj",""
"3","ārtha","ARTH","a@","artha","noun-adj",""
"4","nāya","NĀY","a@","nāya","noun-adj",""
"5","prayatnād","PRAYATN","ād","prayatna","noun-adj",""
"6","imaṃ","","","idam","pron",""
"7","mayā","","","mat","pron",""
"8","grantham","GRANTH","am","grantha","noun-adj",""
"9","anuttara","ANUTTAR","a@","anuttara","noun-adj",""
"10","ārtham","ARTH","am","artha","noun-adj",""
"11","/","","","","punct",""
"12","ālambhi","ĀLAMBH","i","ālambhi","noun-adj",""
"13","yat","","","yad","pron",""
"14","puṇyam","PUṆY","am","puṇya","noun-adj",""
"15","anena","","","idam","pron",""
"16","lokas","LOK","as","loka","noun-adj",""
"17","tathāgatatvaṃ","TATHĀGAT","atvaṃ","tathāgata","noun-adj",""
"18","labhatām","LABH","atām","labhatā","noun-adj",""
"19","a","","","alpha_privativum","ind",""
"20","labhyam","LABHY","am","labhya","noun-adj",""
"21","//","","","","punct",""
"22","47","","","","ind",""
"23","//","","","","punct",""
"","</s>","","","","",""
"","<s number=""134"">","","","","",""
"1","tattva","TATTV","a@","tad","pron",""
"2","ratnāvalī","RATNĀVAL","ī","ratnāvalī","noun-adj",""
"3","samāptā","SAMĀPT","ā","samāpta","noun-adj",""
"4","/","","","","punct",""
"","</s>","","","","",""
"","<s number=""135"">","","","","",""
"1","kṛtir","KṚT","ir","kṛti","noun-adj",""
"2","iyaṃ","","","idam","pron",""
"3","paṇḍit","PAṆḌIT","","paṇḍit","noun-adj",""
"4","āvadhūta","AVADHŪT","a@","avadhūta","noun-adj",""
"5","ā","","","alpha_privativum","ind",""
"6","dvaya","DVAY","a@","dvaya","noun-adj",""
"7","vajrapādānām","VAJRAPĀD","ānām","vajrapāda","noun-adj",""
"8","//","","","","punct",""
"","</s>","","","","",""
"","</page>","","","","",""
"","</doc>","","","","",""
