"WordID","word","NormSTEM","suffix","lemma","PoS","Root"
"","<doc textid = ""bodhisattvapratimoksasutra"" genre = ""vinaya"" title = ""bodhisattvaprātimokṣasūtra"" author = ""n/a"" discourse = ""vinaya"" tradition = ""buddh"" period = ""commentarial"" source = ""gretil accessed feb 2021 : http://gretil.sub.uni-goettingen.de/gretil/corpustei/sa_bodhisattvapratimoksasutra.xml"" date_range = ""10.-11. ce"" notes = ""dating only tentative: 10th-11th cent. ce; based on dating of the manuscript; dutt: 'hence; we shall not be wide of the marked if we put the date of the present manuscript as the 12th century a.d. and it s composition; say; about a century or two earlier; i;e.; about the 10th or 11th century a.d..' dutt writes in introduction to his edition: 'the whole manuscript is really a compilation of extracts from different works; two of which evidently are the bodhisattvabhumi and the upalipariprcchasutra ... the first part corresponds roughly to the first chapter ordination service of the kammavacam; detailing the formalities through which a candidate is to pass to undertake the discipline of a bodhisattva. in the bodhicaryavatara we have an account of the ceremony of initiation of a bodhisattva but it is written not in the characterstic form and style of manual of initiation-the form and style in which the present ms. is written. it is in this manuscript that we of the first time come across the formal request and announcements necessary for the initiation of a devotee into the mahayanic rules of discipline and i think this is the earliest book of its kind so far discovered.' http://enlight.lib.ntu.edu.tw/fulltext/jr-bh/bh117539.htm "" religion = ""buddh"" edition = ""based on the ed. by nalinaksa dutt. 1931. bodhisattva-prātimokṣa-sūtram. calcutta: calcutta oriental press; 1931; p 11-19. pagination not available"" digitization = ""members of the sanskrit buddhist input project"" segmentation_lemmatization = ""ligeia lugli & buddhist translators workbench team"" metadata_enrichment = ""bruno galasek-hul & buddhist translators workbench team"" proofreader = ""n/a"" permission = ""permission for derivatives from m. mehner on behalf of gretil"" reconstructions = ""none"">","","","","",""
"","<page number=""0"">","","","","",""
"","<s number=""1"">","","","","",""
"1","bodhisattva","BODHISATTV","a@","bodhisattva","noun-adj",""
"2","prātimokṣa","PRĀTIMOKṢ","a@","prātimokṣa","noun-adj",""
"3","sūtramom","SŪTR","amom","sūtra","noun-adj",""
"4","namaḥ","NAM","aḥ","nama","noun-adj",""
"5","sarvv","SARV","v","sarva","noun-adj",""
"6","abuddha","ABUDDH","a@","abuddha","noun-adj",""
"7","bodhisattvebhyaḥ","BODHISATTV","ebhyaḥ","bodhisattva","noun-adj",""
"8","/","","","","punct",""
"","</s>","","","","",""
"","<page number=""0000"">","","","","",""
"","<s number=""2"">","","","","",""
"1","ye","","","yad","pron",""
"2","ca","","","ca","ind",""
"3","te","","","tad","pron",""
"4","bodhisattvānāṃ","BODHISATTV","ānāṃ","bodhisattva","noun-adj",""
"5","trayaḥ","TRAY","aḥ","tri","noun-adj",""
"6","śīla","ŚĪL","a@","śīla","noun-adj",""
"7","skandhā","SKANDH","ā","skandhā","noun-adj",""
"8","uktāḥ","UKT","āḥ","ukta","noun-adj",""
"9","/","","","","punct",""
"","</s>","","","","",""
"","<s number=""3"">","","","","",""
"1","saṃvara","SAṂVAR","a","saṃvara","noun-adj",""
"2","śīlaṃ","ŚĪL","aṃ","śīla","noun-adj",""
"3","kuśala","KUŚAL","a@","kuśala","noun-adj",""
"4","dharma","DHARM","a","dharma","noun-adj",""
"5","saṃgrāhaka","SAṂGRĀHAK","a@","saṃgrāhaka","noun-adj",""
"6","śīlaṃ","ŚĪL","aṃ","śīla","noun-adj",""
"7","sattva","SATTV","a@","sattva","noun-adj",""
"8","ārthakriya","ARTHAKRIY","a@","arthakriyā","noun-adj",""
"9","ā","","","alpha_privativum","ind",""
"10","śīlaṃ","ŚĪL","aṃ","śīla","noun-adj",""
"11","ca","","","ca","ind",""
"12","teṣu","","","tad","pron",""
"13","śikṣitu","ŚIKṢIT","u@","śikṣita","noun-adj",""
"14","kāmena","KĀM","ena","kāma","noun-adj",""
"15","gṛhiṇā","GṚH","iṇā","gṛhin","noun-adj",""
"16","vā","","","vā","ind",""
"17","pravrajitena","PRAVRAJIT","ena","pravrajita","noun-adj",""
"18","vān","","","","ind",""
"19","uttarāyāṃ","UTTAR","āyāṃ","uttarā","noun-adj",""
"20","samyaksaṃbodhau","SAMYAKSAṂBODH","au","samyaksaṃbodhi","noun-adj",""
"21","kṛta","KṚT","a@","kṛta","noun-adj",""
"22","praṇidhānena","PRAṆIDHĀN","ena","praṇidhāna","noun-adj",""
"23","saha","SAH","a@","sa_saha","ind",""
"24","dhārmmi","DHĀRM","mi","dhārma","noun-adj",""
"25","kasya","KAS","ya","kas","verb",""
"26","bodhisattvasya","BODHISATTV","asya","bodhisattva","noun-adj",""
"27","mahāpuṇya","MAHĀPUṆY","a@","mahāpuṇya","noun-adj",""
"28","nidhānasya","NIDHĀN","asya","nidhāna","noun-adj",""
"29","vāg","VĀG","@","vāk","noun-adj",""
"30","vijñapty","VIJÑAPT","y@","vijñapti","noun-adj",""
"31","artha","ARTH","a","artha","noun-adj",""
"32","grahaṇa","GRAHAṆ","a@","grahaṇa","noun-adj",""
"33","āvabodha","AVABODH","a@","avabodha","noun-adj",""
"34","samarthasya","SAMARTH","asya","samartha","noun-adj",""
"35","pādayor","PĀD","ayor","pāda","noun-adj",""
"36","nipaty","NIPAT","y","nipat","verb",""
"37","^","","","","",""
"38","ādhyeṣaṇā","ADHYEṢAṆ","ā","adhyeṣaṇa","noun-adj",""
"39","kāryā","KĀRY","ā","kāryā","noun-adj",""
"40","/","","","","punct",""
"","</s>","","","","",""
"","<s number=""4"">","","","","",""
"1","ta","","","tad","pron",""
"2","vāhaṃ","VĀH","aṃ","vāha","noun-adj",""
"3","kulaputra","KULAPUTR","a@","kulaputra","noun-adj",""
"4","āyuṣman","ĀYUṢM","an","āyuṣmat","noun-adj",""
"5","bhadanta","BHADANT","a","bhadanta","noun-adj",""
"6","^","","","","",""
"7","eti","","","iti","ind",""
"8","v","","","vā","ind",""
"9","^","","","","",""
"10","āntikāt","ANTIK","āt","antikā","noun-adj",""
"11","bodhisattva","BODHISATTV","a@","bodhisattva","noun-adj",""
"12","śīla","ŚĪL","a@","śīla","noun-adj",""
"13","saṃvara","SAṂVAR","a@","saṃvara","noun-adj",""
"14","samādānam","SAMĀDĀN","am","samādāna","noun-adj",""
"15","ākāṅkṣābhyā","ĀKĀṄKṢ","ābhyā","ākāṅkṣa","noun-adj",""
"16","dātum","DĀT","um","dad","verb","dā"
"17","/","","","","punct",""
"","</s>","","","","",""
"","<s number=""5"">","","","","",""
"1","tad","TAD","","tad","pron",""
"2","arhasya","ARH","asya","arhat","noun-adj",""
"3","n","","","na","ind",""
"4","uparodhena","UPARODH","ena","uparodha","noun-adj",""
"5","muhūrtta","MUHŪRT","a","muhūrta","noun-adj",""
"6","mad","","","mat","pron",""
"7","anukampayā","ANUKAMPAY","ā","anukampayati","noun-adj",""
"8","dātuṃ","DĀT","uṃ","dad","verb","dā"
"9","śrotuñ","ŚROT","uñ","śṛṇ","verb","śru"
"10","c","","","ca","ind",""
"11","^","","","","",""
"12","eti","","","iti","ind",""
"13","//","","","","punct",""
"","</s>","","","","",""
"","<s number=""6"">","","","","",""
"1","trir","TR","ir","tri","noun-adj",""
"2","evam","","","eva","ind",""
"3","adhyeṣya","ADHYEṢ","ya@","adhyeṣa","noun-adj",""
"4","ekāṃ","EK","āṃ","eka","noun-adj",""
"5","samuttara","SAMUTTAR","a@","samuttara","noun-adj",""
"6","āṅgaṃ","AṄG","aṃ","aṅga","noun-adj",""
"7","kṛtvā","KṚT","vā@","kṛta","noun-adj",""
"8","daśasu","DAŚ","asu@","daśa","noun-adj",""
"9","dikṣv","DIKṢ","v","dik","noun-adj",""
"10","atīta","ATĪT","a@","atīta","noun-adj",""
"11","ān","","","alpha_privativum","ind",""
"12","āgata","ĀGAT","a@","āgata","noun-adj",""
"13","pratyutpannānāṃ","PRATYUTPANN","ānāṃ","pratyutpanna","noun-adj",""
"14","buddhānāṃ","BUDDH","ānāṃ","buddha","noun-adj",""
"15","bhagavatāṃ","BHAGAVAT","āṃ","bhagavatī","noun-adj",""
"16","mahābhūmi","MAHĀBHŪM","i@","mahābhūmi","noun-adj",""
"17","praviṣṭānāṃ","PRAVIṢṬ","ānāṃ","praviṣṭa","noun-adj",""
"18","ca","","","ca","ind",""
"19","bodhisattvānāṃ","BODHISATTV","ānāṃ","bodhisattva","noun-adj",""
"20","sāmīcīṃ","SĀMĪC","īṃ","sāmīcī","noun-adj",""
"21","kṛttvā","KṚT","tvā","kṛt","verb",""
"22","teṣāṃ","","","tad","pron",""
"23","guṇān","GUṆ","ān","guṇa","noun-adj",""
"24","āmukhī","ĀMUKH","ī@","āmukhī","noun-adj",""
"25","kṛtya","KṚTY","a","kṛtya","noun-adj",""
"26","ghana","GHAN","a@","ghana","noun-adj",""
"27","rasaṃ","RAS","aṃ","rasa","noun-adj",""
"28","cetaḥ","CET","aḥ","cetas","noun-adj",""
"29","prasādaṃ","PRASĀD","aṃ","prasāda","noun-adj",""
"30","saṃjanayya","SAṂJANAY","ya","saṃjanaya","noun-adj",""
"31","nīcair","NĪC","air","nīca","noun-adj",""
"32","jānumaṇḍalena","JĀNUMAṆḌAL","ena","jānumaṇḍala","noun-adj",""
"33","^","","","","",""
"34","utkuṭukena","UTKUṬUK","ena","utkuṭuka","noun-adj",""
"35","vā","","","vā","ind",""
"36","sthitvā","STH","itvā","sthā","noun-adj",""
"37","tathāgata","TATHĀGAT","a@","tathāgata","noun-adj",""
"38","pratimāṃ","PRATIM","āṃ","pratimā","noun-adj",""
"39","purataḥ","PURAT","aḥ","puratas","noun-adj",""
"40","saṃsthāpya","SAṂSTHĀP","ya","saṃsthāp","verb",""
"41","saṃpūjya","SAMPŪJY","a","sampūjya","noun-adj",""
"42","puraskṛty","PURASKṚT","y","puraskṛta","noun-adj",""
"43","^","","","","",""
"44","aivaṃ","","","eva","ind",""
"45","syād","","","as","verb","as"
"46","vacanīyaḥ","VACANĪY","aḥ","vacanīya","noun-adj",""
"47","/","","","","punct",""
"","</s>","","","","",""
"","<s number=""7"">","","","","",""
"1","anuprayaccha","ANUPRAYACCH","a","anuprayacch","verb",""
"2","me","","","mat","pron",""
"3","kulaputra","KULAPUTR","a@","kulaputra","noun-adj",""
"4","āyuṣmān","ĀYUṢM","ān","āyuṣmat","noun-adj",""
"5","bhadanta","BHADANT","a","bhadanta","noun-adj",""
"6","^","","","","",""
"7","eti","","","iti","ind",""
"8","vā","","","vā","ind",""
"9","bodhisattva","BODHISATTV","a@","bodhisattva","noun-adj",""
"10","śīla","ŚĪL","a@","śīla","noun-adj",""
"11","saṃvara","SAṂVAR","a","saṃvara","noun-adj",""
"12","samādānam","SAMĀDĀN","am","samādāna","noun-adj",""
"13","iti","","","iti","ind",""
"14","/","","","","punct",""
"","</s>","","","","",""
"","<s number=""8"">","","","","",""
"1","tat","","","tad","pron",""
"2","ekāgrāṃ","EKĀGR","āṃ","ekāgra","noun-adj",""
"3","smṛtim","SMṚT","im","smṛti","noun-adj",""
"4","upasthāpya","UPASTHĀP","ya","upasthāp","verb",""
"5","citta","CITT","a","citta","noun-adj",""
"6","prasādame","PRASĀD","ame","prasāda","noun-adj",""
"7","vānu","VĀN","u@","vāna","noun-adj",""
"8","vṛṃha","VṚṂH","a@","vṛṃhat","noun-adj",""
"9","yata","YAT","a","yatas","noun-adj",""
"10","/","","","","punct",""
"","</s>","","","","",""
"","<s number=""9"">","","","","",""
"1","na","","","na","ind",""
"2","cirasy","CIRAS","y@","cirasi","noun-adj",""
"3","edānīme","IDĀN","īme","idāni","noun-adj",""
"4","a","","","alpha_privativum","ind",""
"5","kṣayasya","KṢAY","asya","kṣaya","noun-adj",""
"6","^","","","","",""
"7","a","","","alpha_privativum","ind",""
"8","prameyasya","PRAMEY","asya","prameya","noun-adj",""
"9","niruttarasya","NIRUTTAR","asya","niruttara","noun-adj",""
"10","mahāpuṇya","MAHĀPUṆY","a@","mahāpuṇya","noun-adj",""
"11","nidhānasya","NIDHĀN","asya","nidhāna","noun-adj",""
"12","prāptir","PRĀPT","ir","prāpti","noun-adj",""
"13","bhaviṣyati","BHAVIṢY","ati","bhav","noun-adj","bhū"
"14","iti","","","iti","ind",""
"15","/","","","","punct",""
"","</s>","","","","",""
"","<s number=""10"">","","","","",""
"1","evam","","","eva","ind",""
"2","ev","","","eva","ind",""
"3","ārtham","ARTH","am","artha","noun-adj",""
"4","anuvicintayatā","ANUVICINTAY","atā","anuvicintayatā","noun-adj",""
"5","tūṣṇīṃ","TŪṢṆ","īṃ","tūṣṇī","noun-adj",""
"6","bhavitavyam","BHAVIT","avyam","bhavita","noun-adj",""
"7","/","","","","punct",""
"","</s>","","","","",""
"","<s number=""11"">","","","","",""
"1","tena","","","tad","pron",""
"2","punar","","","punar","ind",""
"3","v","","","vā","ind",""
"4","vijñena","VIJÑ","ena","vijña","noun-adj",""
"5","bodhisattvena","BODHISATTV","ena","bodhisattva","noun-adj",""
"6","sa","","","sa_saha","ind",""
"7","tathā","","","tathā","ind",""
"8","pratipanno","PRATIPANN","o","pratipanna","noun-adj",""
"9","bodhisattvo","BODHISATTV","o","bodhisattva","noun-adj",""
"10","a","","","alpha_privativum","ind",""
"11","vikṣiptena","VIKṢIPT","ena","vikṣipta","noun-adj",""
"12","cetasā","CETAS","ā","cetas","noun-adj",""
"13","sthitena","STHIT","ena","sthita","noun-adj",""
"14","vā","","","vā","ind",""
"15","niṣaṇṇena","NIṢAṆṆ","ena","niṣaṇṇa","noun-adj",""
"16","vā","","","vā","ind",""
"17","evaṃ","","","eva","ind",""
"18","syād","","","as","verb","as"
"19","vacanīyaḥ","VACANĪY","aḥ","vacanīya","noun-adj",""
"20","/","","","","punct",""
"","</s>","","","","",""
"","<s number=""12"">","","","","",""
"1","śṛṇu","ŚṚṆ","u","śṛṇ","verb","śru"
"2","tvam","","","tvat","pron",""
"3","evan","","","eva","ind",""
"4","nāman","NĀMAN","","nāmana","noun-adj",""
"5","kulaputra","KULAPUTR","a@","kulaputra","noun-adj",""
"6","āyuṣman","ĀYUṢM","an","āyuṣmat","noun-adj",""
"7","bhadanta","BHADANT","a","bhadanta","noun-adj",""
"8","^","","","","",""
"9","eti","","","iti","ind",""
"10","vā","","","vā","ind",""
"11","bodhisattvo","BODHISATTV","o","bodhisattva","noun-adj",""
"12","asi","","","as","verb","as"
"13","bodhau","BODH","au","bodh","verb",""
"14","ca","","","ca","ind",""
"15","kṛta","KṚT","a@","kṛta","noun-adj",""
"16","praṇidhānaḥ","PRAṆIDHĀN","aḥ","praṇidhāna","noun-adj",""
"17","/","","","","punct",""
"","</s>","","","","",""
"","<s number=""13"">","","","","",""
"1","tena","","","tad","pron",""
"2","om","","","oṃ","ind",""
"3","iti","","","iti","ind",""
"4","pratijñātavyaṃ","PRATIJÑĀ","tavyaṃ","pratijñā","noun-adj",""
"5","/","","","","punct",""
"","</s>","","","","",""
"","<s number=""14"">","","","","",""
"1","sa","","","sa_saha","ind",""
"2","punar","","","punar","ind",""
"3","uttari","UTTAR","i","uttari","noun-adj",""
"4","evaṃ","","","eva","ind",""
"5","syād","","","as","verb","as"
"6","vacanīyaḥ","VACANĪY","aḥ","vacanīya","noun-adj",""
"7","/","","","","punct",""
"","</s>","","","","",""
"","<s number=""15"">","","","","",""
"1","pratīcchasi","PRATĪCCH","asi","pratīcch","verb",""
"2","tvam","","","tvat","pron",""
"3","evan","","","eva","ind",""
"4","nāman","NĀMAN","","nāmana","noun-adj",""
"5","kulaputra","KULAPUTR","a@","kulaputra","noun-adj",""
"6","āyuṣmān","ĀYUṢM","ān","āyuṣmat","noun-adj",""
"7","bhadanta","BHADANT","a","bhadanta","noun-adj",""
"8","^","","","","",""
"9","eti","","","iti","ind",""
"10","vā","","","vā","ind",""
"11","bodhisattvo","BODHISATTV","o","bodhisattva","noun-adj",""
"12","asi","","","as","verb","as"
"13","bodhau","BODH","au","bodh","verb",""
"14","kṛta","KṚT","a@","kṛta","noun-adj",""
"15","praṇidhāno","PRAṆIDHĀN","o","praṇidhāna","noun-adj",""
"16","mama","MAM","a@","mat","pron",""
"17","āntikāt","ANTIK","āt","antikā","noun-adj",""
"18","sarvvāṇi","SARV","āṇi","sarva","noun-adj",""
"19","bodhisattva","BODHISATTV","a@","bodhisattva","noun-adj",""
"20","śikṣāpadāni","ŚIKṢĀPAD","āni","śikṣāpada","noun-adj",""
"21","sarvvañ","SARV","añ","sarva","noun-adj",""
"22","ca","","","ca","ind",""
"23","bodhisattva","BODHISATTV","a@","bodhisattva","noun-adj",""
"24","śīlaṃ","ŚĪL","aṃ","śīla","noun-adj",""
"25","saṃvara","SAṂVAR","a@","saṃvara","noun-adj",""
"26","śīlaṃ","ŚĪL","aṃ","śīla","noun-adj",""
"27","kuśala","KUŚAL","a@","kuśala","noun-adj",""
"28","dharma","DHARM","a","dharma","noun-adj",""
"29","saṃgrāhaka","SAṂGRĀHAK","a@","saṃgrāhaka","noun-adj",""
"30","śīlaṃ","ŚĪL","aṃ","śīla","noun-adj",""
"31","sattv","SATT","v","sattu","noun-adj",""
"32","ārthakriya","ARTHAKRIY","a@","arthakriyā","noun-adj",""
"33","ā","","","alpha_privativum","ind",""
"34","śīlaṃ","ŚĪL","aṃ","śīla","noun-adj",""
"35","ca","","","ca","ind",""
"36","yacchīlam","YACCHĪL","am","yacchīla","noun-adj",""
"37","atītānāṃ","ATĪT","ānāṃ","atīta","noun-adj",""
"38","bodhisattvanām","BODHISATTV","anām","bodhisattva","noun-adj",""
"39","abhūt","aBHŪT","","bhav","verb","bhū"
"40","yāni","","","yad","pron",""
"41","ca","","","ca","ind",""
"42","śikṣāpadāni","ŚIKṢĀPAD","āni","śikṣāpada","noun-adj",""
"43","/","","","","punct",""
"","</s>","","","","",""
"","<s number=""16"">","","","","",""
"1","yacchīlam","YACCHĪL","am","yacchīla","noun-adj",""
"2","anāgatānām","ANĀGAT","ānām","anāgata","noun-adj",""
"3","bodhisattvānāṃ","BODHISATTV","ānāṃ","bodhisattva","noun-adj",""
"4","bhaviṣyati","BHAV","iṣyati","bhav","verb","bhū"
"5","yāni","","","yad","pron",""
"6","ca","","","ca","ind",""
"7","śikṣāpadāni","ŚIKṢĀPAD","āni","śikṣāpada","noun-adj",""
"8","/","","","","punct",""
"","</s>","","","","",""
"","<s number=""17"">","","","","",""
"1","yacchīlam","YACCHĪL","am","yacchīla","noun-adj",""
"2","etarhi","ETARH","i","etarhi","noun-adj",""
"3","daśasu","DAŚ","asu@","daśa","noun-adj",""
"4","dikṣu","DIKṢ","u@","dik","noun-adj",""
"5","pratyutpannānāṃ","PRATYUTPANN","ānāṃ","pratyutpanna","noun-adj",""
"6","bodhisattvānāṃ","BODHISATTV","ānāṃ","bodhisattva","noun-adj",""
"7","bhavati","BHAV","ati","bhav","verb","bhū"
"8","yāni","","","yad","pron",""
"9","ca","","","ca","ind",""
"10","śikṣāpadāni","ŚIKṢĀPAD","āni","śikṣāpada","noun-adj",""
"11","/","","","","punct",""
"","</s>","","","","",""
"","<s number=""18"">","","","","",""
"1","yeṣu","","","yad","pron",""
"2","ca","","","ca","ind",""
"3","śikṣāpadeṣu","ŚIKṢĀPAD","eṣu","śikṣāpada","noun-adj",""
"4","yeṣu","","","yad","pron",""
"5","śīleṣv","ŚĪL","eṣv","śīla","noun-adj",""
"6","atītāḥ","ATĪT","āḥ","atīta","noun-adj",""
"7","sarvva","SARV","va","sarvu","noun-adj",""
"8","bodhisattvāḥ","BODHISATTV","āḥ","bodhisattva","noun-adj",""
"9","śikṣitavantaḥ","ŚIKṢIT","avantaḥ","śikṣitavat","noun-adj",""
"10","/","","","","punct",""
"","</s>","","","","",""
"","<s number=""19"">","","","","",""
"1","anāgatāḥ","ANĀGAT","āḥ","anāgata","noun-adj",""
"2","sarvva","SARV","va","sarvu","noun-adj",""
"3","bodhisattvāḥ","BODHISATTV","āḥ","bodhisattva","noun-adj",""
"4","śikṣiṣyante","ŚIKṢ","iṣyante","śikṣ","verb",""
"5","/","","","","punct",""
"","</s>","","","","",""
"","<s number=""20"">","","","","",""
"1","pratyutpannāḥ","PRATYUTPANN","āḥ","pratyutpanna","noun-adj",""
"2","sarvva","SARV","va","sarvu","noun-adj",""
"3","bodhisattvāḥ","BODHISATTV","āḥ","bodhisattva","noun-adj",""
"4","śikṣante","ŚIKṢ","ante","śikṣ","verb","śikṣ"
"5","/","","","","punct",""
"","</s>","","","","",""
"","<s number=""21"">","","","","",""
"1","tena","","","tad","pron",""
"2","pratigṛṇhāmi","PRATIGṚṆH","āmi","pratigṛṇha","noun-adj",""
"3","iti","","","iti","ind",""
"4","pratijñātavyaṃ","PRATIJÑĀ","tavyaṃ","pratijñā","noun-adj",""
"5","//","","","","punct",""
"","</s>","","","","",""
"","<s number=""22"">","","","","",""
"1","trir","TR","ir","tri","noun-adj",""
"2","evam","","","eva","ind",""
"3","//","","","","punct",""
"","</s>","","","","",""
"","<s number=""23"">","","","","",""
"1","samanvāharantu","SAMANVĀHAR","antu","samanvāhar","verb",""
"2","māṃ","","","mat","pron",""
"3","daśa","DAŚ","a@","daśa","noun-adj",""
"4","dig","DI","g@","dik","noun-adj",""
"5","loka","LOK","a@","loka","noun-adj",""
"6","dhānu","DHĀN","u@","dhāna","noun-adj",""
"7","sannipatitā","SANNIPATIT","ā","sannipatita","noun-adj",""
"8","buddhā","BUDDH","ā","buddha","noun-adj",""
"9","bhagavanto","BHAGAVANT","o","bhagavanta","noun-adj",""
"10","bodhisattvāḥ","BODHISATTV","āḥ","bodhisattva","noun-adj",""
"11","/","","","","punct",""
"","</s>","","","","",""
"","<s number=""24"">","","","","",""
"1","samanvāharatv","SAMANVĀHAR","atv","samanvāharati","noun-adj",""
"2","ācāryyo","ĀCĀRY","yo","ācārya","noun-adj",""
"3","aham","AHAM","","mat","pron",""
"4","evan","","","eva","ind",""
"5","nāmā","NĀM","ā","nāman","noun-adj",""
"6","yat","YAT","","yad","pron",""
"7","kiñcit","","","kimcit","ind",""
"8","kāya","KĀY","a@","kāya","noun-adj",""
"9","vāṅ","VĀṄ","","vāk","noun-adj",""
"10","manobhir","MANOBH","ir","manobhū","noun-adj",""
"11","buddha","BUDDH","a","buddha","noun-adj",""
"12","bodhisattvān","BODHISATTV","ān","bodhisattva","noun-adj",""
"13","mātāpitarau","MĀTĀPIT","arau","mātāpitṛ","noun-adj",""
"14","tadanyān","TADANY","ān","tadanya","noun-adj",""
"15","vā","","","vā","ind",""
"16","sattvān","SATTV","ān","sattva","noun-adj",""
"17","samāgamyeh","SAMĀGAMY","eh","samāgamya","noun-adj",""
"18","a","","","alpha_privativum","ind",""
"19","janman","JANM","an","janmat","noun-adj",""
"20","yan","","","yad","pron",""
"21","yeṣu","","","yad","pron",""
"22","vā","","","vā","ind",""
"23","janmāṃ","JANM","āṃ","janmā","noun-adj",""
"24","tareṣu","TAR","eṣu","tar","verb",""
"25","maya","MAY","a@","maya","noun-adj",""
"26","āpāyaṃ","ĀPĀY","aṃ","āpāya","noun-adj",""
"27","kṛtaṃ","KṚT","aṃ","kṛta","noun-adj",""
"28","kāritam","KĀRIT","am","kārita","noun-adj",""
"29","anumoditam","ANUMODIT","am","anumodita","noun-adj",""
"30","vā","","","vā","ind",""
"31","tat","","","tad","pron",""
"32","sarvvam","SARV","am","sarva","noun-adj",""
"33","aikadhyam","AIKADHY","am","aikadhya","noun-adj",""
"34","abhisaṃkṣipya","ABHISAṂKṢIP","ya","abhisaṃkṣip","verb","abhisaṃkṣip"
"35","piṇḍayitvā","PIṆḌ","ayitvā","piṇḍ","verb",""
"36","tulayitvā","TUL","ayitvā","tul","verb",""
"37","sarvva","SARV","a@","sarva","noun-adj",""
"38","buddha","BUDDH","a@","buddha","noun-adj",""
"39","bodhisattvānām","BODHISATTV","ānām","bodhisattva","noun-adj",""
"40","ācāryyasya","ĀCĀRY","yasya","ācārya","noun-adj",""
"41","c","","","ca","ind",""
"42","^","","","","",""
"43","āntike","ANTIK","e","antikā","noun-adj",""
"44","agrayā","AGR","ayā","agrā","noun-adj",""
"45","pravarayā","PRAVAR","ayā","pravara","noun-adj",""
"46","pratideśanayā","PRATIDEŚAN","ayā","pratideśanā","noun-adj",""
"47","pratideśayāmi","PRATIDEŚ","ayāmi","pratidiś","verb","pratidiś"
"48","jānan","JĀN","an","jānat","noun-adj",""
"49","smaran","SMAR","an","smarat","noun-adj",""
"50","na","","","na","ind",""
"51","praticchādayāmi","PRATICCHĀD","ayāmi","praticchād","verb",""
"52","//","","","","punct",""
"","</s>","","","","",""
"","<s number=""25"">","","","","",""
"1","trir","TR","ir","tri","noun-adj",""
"2","evam","","","eva","ind",""
"3","//","","","","punct",""
"","</s>","","","","",""
"","<s number=""26"">","","","","",""
"1","so","","","tad","pron",""
"2","hama","HAM","a@","hama","noun-adj",""
"3","evaṃnāmā","EVAṂNĀM","ā","evaṃnāman","noun-adj",""
"4","evaṃ","","","eva","ind",""
"5","deśita","DEŚIT","a@","deśita","noun-adj",""
"6","ātyaya","ATYAY","a","atyaya","noun-adj",""
"7","imaṃ","","","idam","pron",""
"8","diva","DIV","a@","diva","noun-adj",""
"9","samupādāya","SAMUPĀDĀY","a","samupādāya","noun-adj",""
"10","ā","","","alpha_privativum","ind",""
"11","bodhi","BODH","i@","bodhi","noun-adj",""
"12","maṇḍa","MAṆḌ","a@","maṇḍa","noun-adj",""
"13","niṣadanāt","NIṢADAN","āt","niṣadana","noun-adj",""
"14","buddhaṃ","BUDDH","aṃ","buddha","noun-adj",""
"15","bhagavantaṃ","BHAGAVANT","aṃ","bhagavanta","noun-adj",""
"16","mahākārūṇikaṃ","MAHĀKĀR","ūṇikaṃ","mahākāra","noun-adj",""
"17","sarvva","SARV","va@","sarvu","noun-adj",""
"18","jñaṃ","JÑ","aṃ","jña","noun-adj",""
"19","sarvva","SARV","va","sarvu","noun-adj",""
"20","darśinaṃ","DARŚ","inaṃ","darśin","noun-adj",""
"21","sarvva","SARV","va","sarvu","noun-adj",""
"22","vaira","VAIR","a@","vaira","noun-adj",""
"23","bhaya","BHAY","a@","bhaya","noun-adj",""
"24","ātītaṃ","ATĪT","aṃ","atīta","noun-adj",""
"25","mahāpuruṣam","MAHĀPURUṢ","am","mahāpuruṣa","noun-adj",""
"26","a","","","alpha_privativum","ind",""
"27","bhedya","BHEDY","a@","bhedya","noun-adj",""
"28","kāyam","KĀY","am","kāya","noun-adj",""
"29","anuttara","ANUTTAR","a@","anuttara","noun-adj",""
"30","kāyaṃ","KĀY","aṃ","kāya","noun-adj",""
"31","dharmma","DHARM","a@","dharma","noun-adj",""
"32","kāyaṃ","KĀY","aṃ","kāya","noun-adj",""
"33","śaraṇaṃ","ŚARAṆ","aṃ","śaraṇa","noun-adj",""
"34","gacchāmi","GACCH","āmi","gacch","verb","gam"
"35","dvipadānām","DVIPAD","ānām","dvipada","noun-adj",""
"36","agryam","AGRY","am","agrya","noun-adj",""
"37","//","","","","punct",""
"","</s>","","","","",""
"","<s number=""27"">","","","","",""
"1","so","","","tad","pron",""
"2","aham","AHAM","","mat","pron",""
"3","evaṃnāmā","EVAṂNĀM","ā","evaṃnāman","noun-adj",""
"4","evaṃ","","","eva","ind",""
"5","deśita","DEŚIT","a@","deśita","noun-adj",""
"6","ātyaya","ATYAY","a","atyaya","noun-adj",""
"7","imaṃ","","","idam","pron",""
"8","diva","DIV","a@","diva","noun-adj",""
"9","samupādāya","SAMUPĀDĀY","a","samupādāya","noun-adj",""
"10","ā","","","alpha_privativum","ind",""
"11","bodhimaṇḍa","BODHIMAṆḌ","a@","bodhimaṇḍa","noun-adj",""
"12","niṣadanād","NIṢADAN","ād","niṣadana","noun-adj",""
"13","dharma","DHARM","a","dharma","noun-adj",""
"14","śaraṇaṃ","ŚARAṆ","aṃ","śaraṇa","noun-adj",""
"15","gacchāmi","GACCH","āmi","gacch","verb","gam"
"16","śāntaṃ","ŚĀNT","aṃ","śānta","noun-adj",""
"17","virāgāṇāṃ","VIRĀG","āṇāṃ","virāga","noun-adj",""
"18","pravaram","PRAVAR","am","pravara","noun-adj",""
"19","/","","","","punct",""
"","</s>","","","","",""
"","<s number=""28"">","","","","",""
"1","so","","","tad","pron",""
"2","aham","AHAM","","mat","pron",""
"3","evaṃnāmā","EVAṂNĀM","ā","evaṃnāman","noun-adj",""
"4","evaṃ","","","eva","ind",""
"5","deśita","DEŚIT","a@","deśita","noun-adj",""
"6","ātyaya","ATYAY","a","atyaya","noun-adj",""
"7","imaṃ","","","idam","pron",""
"8","diva","DIV","a@","diva","noun-adj",""
"9","samupādāya","SAMUPĀDĀY","a","samupādāya","noun-adj",""
"10","ā","","","alpha_privativum","ind",""
"11","bodhimaṇḍa","BODHIMAṆḌ","a@","bodhimaṇḍa","noun-adj",""
"12","niṣadanād","NIṢADAN","ād","niṣadana","noun-adj",""
"13","avaivarttika","AVAIVARTIK","a@","avaivartika","noun-adj",""
"14","bodhisattva","BODHISATTV","a@","bodhisattva","noun-adj",""
"15","saṃghaṃ","SAṂGH","aṃ","saṃgha","noun-adj",""
"16","śaraṇaṃ","ŚARAṆ","aṃ","śaraṇa","noun-adj",""
"17","gacchāmi","GACCH","āmi","gacch","verb","gam"
"18","gaṇāṇāṃ","GAṆ","āṇāṃ","gaṇa","noun-adj",""
"19","śreṣṭham","ŚREṢṬH","am","śreṣṭha","noun-adj",""
"20","//","","","","punct",""
"","</s>","","","","",""
"","<s number=""29"">","","","","",""
"1","trir","TR","ir","tri","noun-adj",""
"2","evam","","","eva","ind",""
"3","//","","","","punct",""
"","</s>","","","","",""
"","<s number=""30"">","","","","",""
"1","so","","","tad","pron",""
"2","hama","HAM","a@","hama","noun-adj",""
"3","evaṃnāmā","EVAṂNĀM","ā","evaṃnāman","noun-adj",""
"4","evaṃ","","","eva","ind",""
"5","deśita","DEŚIT","a@","deśita","noun-adj",""
"6","ātyayas","ATYAY","as","atyaya","noun-adj",""
"7","triśaraṇa","TRIŚARAṆ","a@","triśaraṇa","noun-adj",""
"8","gato","GAT","o","gata","noun-adj",""
"9","an","","","alpha_privativum","ind",""
"10","anta","ANT","a@","anta","noun-adj",""
"11","sattvadhātu","SATTVADHĀT","u@","sattvadhātu","noun-adj",""
"12","ūttāraṇāy","UTTĀRAṆ","āy","uttāraṇa","noun-adj",""
"13","ābhyuddharaṇāya","ABHYUDDHARAṆ","āya","abhyuddharaṇa","noun-adj",""
"14","saṃsāra","SAṂSĀR","a@","saṃsāra","noun-adj",""
"15","duḥkhāt","DUḤKH","āt","duḥkha","noun-adj",""
"16","paritrāṇāya","PARITRĀṆ","āya","paritrāṇa","noun-adj",""
"17","sarvva","SARV","va@","sarvu","noun-adj",""
"18","jña","JÑ","a@","jña","noun-adj",""
"19","jñāne","JÑĀN","e","jñāna","noun-adj",""
"20","anuttare","ANUTTAR","e","anuttara","noun-adj",""
"21","pratiṣṭhāpanāya","PRATIṢṬHĀPAN","āya","pratiṣṭhāpana","noun-adj",""
"22","/","","","","punct",""
"","</s>","","","","",""
"","<s number=""31"">","","","","",""
"1","yathā","","","yathā","ind",""
"2","te","","","tad","pron",""
"3","atīta","ATĪT","a@","atīta","noun-adj",""
"4","ānāgata","ANĀGAT","a@","anāgata","noun-adj",""
"5","pratyutpannā","PRATYUTPANN","ā","pratyutpanna","noun-adj",""
"6","bodhisattvā","BODHISATTV","ā","bodhisattva","noun-adj",""
"7","bodhicittam","BODHICITT","am","bodhicitta","noun-adj",""
"8","utpādya","UTPĀD","ya","utpad","verb","utpad"
"9","buddhatvam","BUDDH","atvam","buddhatva","noun-adj",""
"10","adhigatavanto","ADHIGAT","avanto","adhigata","noun-adj",""
"11","adhigamiṣyanti","ADHIGAM","iṣyanti","adhigacch","verb","adhigam"
"12","adhigacchanti","ADHIGACCH","anti","adhigacch","verb","adhigam"
"13","ca","","","ca","ind",""
"14","/","","","","punct",""
"","</s>","","","","",""
"","<s number=""32"">","","","","",""
"1","yathā","","","yathā","ind",""
"2","sarvv","SARV","v","sarva","noun-adj",""
"3","abuddhā","ABUDDH","ā","abuddha","noun-adj",""
"4","anāvaraṇena","ANĀVARAṆ","ena","anāvaraṇin","noun-adj",""
"5","buddha","BUDDH","a@","buddha","noun-adj",""
"6","jñānena","JÑĀN","ena","jñāna","noun-adj",""
"7","buddha","BUDDH","a@","buddha","noun-adj",""
"8","cakṣuṣā","CAKṢUṢ","ā","cakṣuṣa","noun-adj",""
"9","jananti","JAN","anti","jan","verb","jan"
"10","paśyanti","PAŚ","yanti","paś","verb","paś"
"11","yathā","","","yathā","ind",""
"12","dharmmāṇāṃ","DHARM","āṇāṃ","dharma","noun-adj",""
"13","niḥ","","","niḥ_privativum","ind",""
"14","svabhāvatām","SVABHĀV","atām","svabhāvatā","noun-adj",""
"15","tāma","TĀM","a","tāma","noun-adj",""
"16","x","","","CORRUPTED","ind",""
"17","nu","","","nu","ind",""
"18","jananti","JAN","anti","jan","verb","jan"
"19","/","","","","punct",""
"","</s>","","","","",""
"","<s number=""33"">","","","","",""
"1","tena","","","tad","pron",""
"2","vidhinā","VIDH","inā","vidhi","noun-adj",""
"3","aham","AHAM","","mat","pron",""
"4","evaṃnāmā","EVAṂNĀM","ā","evaṃnāman","noun-adj",""
"5","evaṃnāmna","EVAṂNĀM","na","evaṃnāman","noun-adj",""
"6","ācāryyasyā","ĀCĀRY","yasyā","ācārya","noun-adj",""
"7","ntikāt","NTIK","āt","ntika","noun-adj",""
"8","sarvva","SARV","va@","sarvu","noun-adj",""
"9","buddha","BUDDH","a@","buddha","noun-adj",""
"10","bodhisattvānāṃ","BODHISATTV","ānāṃ","bodhisattva","noun-adj",""
"11","ca","","","ca","ind",""
"12","purato","PURAT","o","puratas","noun-adj",""
"13","anuttarāyāṃ","ANUTTARĀY","āṃ","anuttarāyā","noun-adj",""
"14","samyaksambodhau","SAMYAKSAMBODH","au","samyaksambodha","noun-adj",""
"15","cittam","CITT","am","citta","noun-adj",""
"16","utpādayāmi","UTPĀD","ayāmi","utpad","verb","utpad"
"17","//","","","","punct",""
"","</s>","","","","",""
"","<s number=""34"">","","","","",""
"1","trir","TR","ir","tri","noun-adj",""
"2","evam","","","eva","ind",""
"3","//","","","","punct",""
"","</s>","","","","",""
"","<s number=""35"">","","","","",""
"1","idaṃ","","","idam","pron",""
"2","c","","","ca","ind",""
"3","^","","","","",""
"4","āham","ĀHAM","","mat","pron",""
"5","atyayadeśana","ATYAYADEŚAN","a@","atyayadeśana","noun-adj",""
"6","ā","","","alpha_privativum","ind",""
"7","triśaraṇa","TRIŚARAṆ","a@","triśaraṇa","noun-adj",""
"8","gamana","GAMAN","a@","gamana","noun-adj",""
"9","bodhicitta","BODHICITT","a@","bodhicitta","noun-adj",""
"10","otpāda","UTPĀD","a@","utpāda","noun-adj",""
"11","janitaṃ","JANIT","aṃ","janita","noun-adj",""
"12","kuśala","KUŚAL","a@","kuśala","noun-adj",""
"13","mūlam","MŪL","am","mūla","noun-adj",""
"14","anuttarāyāṃ","ANUTTARĀY","āṃ","anuttarāyā","noun-adj",""
"15","samyaksaṃbodha","SAMYAKSAṂBODH","a","samyaksaṃbodhi","noun-adj",""
"16","upariṇāmayāmi","UPARIṆĀM","ayāmi","upariṇāma","noun-adj",""
"17","yad","","","yadi","ind",""
"18","ahaṃ","AHAṂ","","mat","pron",""
"19","loke","LOK","e","loka","noun-adj",""
"20","a","","","alpha_privativum","ind",""
"21","śaraṇe","ŚARAṆ","e","śaraṇa","noun-adj",""
"22","a","","","alpha_privativum","ind",""
"23","layane","LAYAN","e","layana","noun-adj",""
"24","a","","","alpha_privativum","ind",""
"25","parāyaṇe","PARĀYAṆ","e","parāyaṇa","noun-adj",""
"26","a","","","alpha_privativum","ind",""
"27","dvipe","DVIP","e","dvipa","noun-adj",""
"28","trāṇaṃ","TRĀṆ","aṃ","trāṇa","noun-adj",""
"29","śaraṇaṃ","ŚARAṆ","aṃ","śaraṇa","noun-adj",""
"30","layaṇaṃ","LAY","aṇaṃ","laya","noun-adj",""
"31","parāyaṇaṃ","PARĀYAṆ","aṃ","parāyaṇa","noun-adj",""
"32","dvīpo","DVĪP","o","dvīpa","noun-adj",""
"33","bhaveyam","BHAV","eyam","bhav","verb","bhū"
"34","/","","","","punct",""
"","</s>","","","","",""
"","<s number=""36"">","","","","",""
"1","sarvva","SARV","va@","sarvu","noun-adj",""
"2","sattvāṃś","SATTV","āṃś","sattva","noun-adj",""
"3","ca","","","ca","ind",""
"4","bhavārṇa","BHAVĀR","ṇa","bhavāri","noun-adj",""
"5","vādu","VĀD","u@","vāda","noun-adj",""
"6","tīrṇas","TĪRṆ","as","tīrṇa","noun-adj",""
"7","tārayeyam","TĀRAY","eyam","tāra","verb",""
"8","/","","","","punct",""
"","</s>","","","","",""
"","<s number=""37"">","","","","",""
"1","a","","","alpha_privativum","ind",""
"2","parinirvṛtān","PARINIRVṚT","ān","parinirvṛta","noun-adj",""
"3","anāvaraṇena","ANĀVARAṆ","ena","anāvaraṇin","noun-adj",""
"4","dharma","DHARM","a","dharma","noun-adj",""
"5","dhātu","DHĀT","u@","dhātu","noun-adj",""
"6","parinirvāṇena","PARINIRVĀṆ","ena","parinirvāṇa","noun-adj",""
"7","parinirvvāpayeyam","PARINIRVVĀPAY","eyam","parinirvvāpaya","noun-adj",""
"8","/","","","","punct",""
"","</s>","","","","",""
"","<s number=""38"">","","","","",""
"1","an","","","alpha_privativum","ind",""
"2","āśvastā","ĀŚVAS","tā","āśvasa","noun-adj",""
"3","n","","","na","ind",""
"4","^","","","","",""
"5","āśvāśayeyam","ĀŚVĀŚ","ayeyam","āśvāśa","noun-adj",""
"6","//","","","","punct",""
"","</s>","","","","",""
"","<s number=""39"">","","","","",""
"1","tri","TR","i","tri","noun-adj",""
"2","api","","","api","ind",""
"3","//","","","","punct",""
"","</s>","","","","",""
"","<s number=""40"">","","","","",""
"1","so","","","tad","pron",""
"2","hama","HAM","a@","hama","noun-adj",""
"3","evaṃnāmā","EVAṂNĀM","ā","evaṃnāman","noun-adj",""
"4","evam","","","eva","ind",""
"5","utpādita","UTPĀDIT","a@","utpādita","noun-adj",""
"6","bodhicitto","BODHICITT","o","bodhicitta","noun-adj",""
"7","ananta","ANANT","a@","ananta","noun-adj",""
"8","sattvadhātuṃ","SATTVADHĀT","uṃ","sattvadhāt","verb",""
"9","yathā","","","yathā","ind",""
"10","mātāpitṛ","MĀTĀPIT","ṛ@","mātāpitṛ","noun-adj",""
"11","bhaginī","BHAGIN","ī@","bhaginī","noun-adj",""
"12","bhrātṛ","BHRĀT","ṛ@","bhrātṛ","noun-adj",""
"13","putra","PUTR","a@","putra","noun-adj",""
"14","duhitr","DUHIT","r","duhitṛ","noun-adj",""
"15","anyatama","ANYATAM","a@","anyatama","noun-adj",""
"16","ānyatama","ANYATAM","a@","anyatama","noun-adj",""
"17","jñāti","JÑĀT","i@","jñāti","noun-adj",""
"18","sālohita","SĀLOHIT","a@","sālohita","noun-adj",""
"19","sthānīyāṃs","STHĀNĪY","āṃs","sthānīya","noun-adj",""
"20","tathā","","","tathā","ind",""
"21","pratigṛṇhāmi","PRATIGṚṆH","āmi","pratigṛṇha","noun-adj",""
"22","/","","","","punct",""
"","</s>","","","","",""
"","<s number=""41"">","","","","",""
"1","pratigṛhya","PRATIGṚH","ya","pratigṛha","noun-adj",""
"2","ca","","","ca","ind",""
"3","yathā","","","yathā","ind",""
"4","śakti","ŚAKT","i","śakti","noun-adj",""
"5","yathā","","","yathā","ind",""
"6","balam","BAL","am","bala","noun-adj",""
"7","yath","","","yathā","ind",""
"8","ājñānaṃ","ĀJÑĀN","aṃ","ājñāna","noun-adj",""
"9","kuśala","KUŚAL","a@","kuśala","noun-adj",""
"10","mūlaṃ","MŪL","aṃ","mūla","noun-adj",""
"11","samāropayāmi","SAMĀROP","ayāmi","samāropa","noun-adj",""
"12","/","","","","punct",""
"","</s>","","","","",""
"","<s number=""42"">","","","","",""
"1","itaḥ","","","","ind",""
"2","prabhṛti","PRABHṚT","i","prabhṛti","noun-adj",""
"3","yat","","","yad","pron",""
"4","kiñcit","","","kimcit","ind",""
"5","dānaṃ","DĀN","aṃ","dāna","noun-adj",""
"6","dāsyāmi","DĀS","yāmi","dad","verb","dā"
"7","śīlaṃ","ŚĪL","aṃ","śīla","noun-adj",""
"8","rakṣiṣyāmi","RAKṢ","iṣyāmi","rakṣ","verb","rakṣ"
"9","kṣānti","KṢĀNT","i","kṣānti","noun-adj",""
"10","saṃpādayiṣyāmi","SAMPĀD","ayiṣyāmi","sampad","verb","sampad"
"11","vīryam","VĪRY","am","vīrya","noun-adj",""
"12","ārabhya","ĀLABH","ya","ālabh","verb","ālabh"
"13","dhyānaṃ","DHYĀN","aṃ","dhyāna","noun-adj",""
"14","samāpatsye","SAMĀPATS","ye","samāpatsa","noun-adj",""
"15","prajñayā","PRAJÑ","ayā","prajñā","noun-adj",""
"16","vyavacāryya","VYAVACĀRY","ya","vyavacārya","noun-adj",""
"17","upāya","UPĀY","a@","upāya","noun-adj",""
"18","kauśalyaṃ","KAUŚALY","aṃ","kauśalya","noun-adj",""
"19","vā","","","vā","ind",""
"20","śikṣiṣye","ŚIKṢ","iṣye","śikṣ","verb",""
"21","tat","","","tad","pron",""
"22","sarvva","SARV","va","sarvu","noun-adj",""
"23","sattvānām","SATTV","ānām","sattva","noun-adj",""
"24","arthāya","ARTH","āya","artha","noun-adj",""
"25","hitāya","HIT","āya","hita","noun-adj",""
"26","sukhāya","SUKH","āya","sukha","noun-adj",""
"27","//","","","","punct",""
"","</s>","","","","",""
"","<s number=""43"">","","","","",""
"1","uttarāṃ","UTTAR","āṃ","uttarā","noun-adj",""
"2","ca","","","ca","ind",""
"3","samyaksaṃbodhim","SAMYAKSAṂBODH","im","samyaksaṃbodhi","noun-adj",""
"4","ārabhya","ĀLABH","ya","ālabh","verb","ālabh"
"5","teṣāṃ","","","tad","pron",""
"6","mahābhūmi","MAHĀBHŪM","i@","mahābhūmi","noun-adj",""
"7","praviṣṭānāṃ","PRAVIṢṬ","ānāṃ","praviṣṭa","noun-adj",""
"8","bodhisattvānāṃ","BODHISATTV","ānāṃ","bodhisattva","noun-adj",""
"9","mahākāruṇikāṇāṃ","MAHĀKĀRUṆIK","āṇāṃ","mahākāruṇika","noun-adj",""
"10","mahāyāne","MAHĀYĀN","e","mahāyāna","noun-adj",""
"11","sāmicīm","SĀMIC","īm","sāmicī","noun-adj",""
"12","anupravrajāmi","ANUPRAVRAJ","āmi","anupravraj","verb",""
"13","/","","","","punct",""
"","</s>","","","","",""
"","<s number=""44"">","","","","",""
"1","anupravrajya","ANUPRAVRAJ","ya","anupravraj","verb",""
"2","bodhisattvo","BODHISATTV","o","bodhisattva","noun-adj",""
"3","ahaṃ","","","mat","pron",""
"4","bodhisattva","BODHISATTV","a","bodhisattva","noun-adj",""
"5","iti","","","iti","ind",""
"6","māmitaḥ","MĀM","itaḥ","māma","noun-adj",""
"7","prabhṛty","PRABHṚT","y@","prabhṛti","noun-adj",""
"8","ācāryyo","ĀCĀRY","yo","ācārya","noun-adj",""
"9","dhārayatu","DHĀR","ayatu","dhār","verb","dhṛ"
"10","//","","","","punct",""
"","</s>","","","","",""
"","<s number=""45"">","","","","",""
"1","trir","TR","ir","tri","noun-adj",""
"2","evam","","","eva","ind",""
"3","//","","","","punct",""
"","</s>","","","","",""
"","<s number=""46"">","","","","",""
"1","tatas","","","tatas","ind",""
"2","ten","","","tad","pron",""
"3","^","","","","",""
"4","ācāryyeṇa","ĀCĀRY","yeṇa","ācārya","noun-adj",""
"5","tasyāḥ","","","tad","pron",""
"6","pratimāyāḥ","PRATIMĀY","āḥ","pratimāyā","noun-adj",""
"7","purato","PURAT","o","puratas","noun-adj",""
"8","daśasu","DAŚ","asu@","daśa","noun-adj",""
"9","dikṣu","DIKṢ","u@","dik","noun-adj",""
"10","buddha","BUDDH","a@","buddha","noun-adj",""
"11","bodhisattvānāṃ","BODHISATTV","ānāṃ","bodhisattva","noun-adj",""
"12","tiṣṭhatāṃ","TIṢṬH","atāṃ","tiṣṭhat","noun-adj",""
"13","dhriyatāṃ","DHRIYAT","āṃ","dhriyatā","noun-adj",""
"14","yāpayatāṃ","YĀPAY","atāṃ","yāpayat","noun-adj",""
"15","pādayor","PĀD","ayor","pāda","noun-adj",""
"16","nipatya","NIPAT","ya","nipat","verb","nipat"
"17","sāmicīṃ","SĀMIC","īṃ","sāmicī","noun-adj",""
"18","kṛtvā","KṚT","vā","kṛta","noun-adj",""
"19","evam","","","eva","ind",""
"20","ārocayitavyam","ĀROCAY","itavyam","āroca","verb",""
"21","/","","","","punct",""
"","</s>","","","","",""
"","<s number=""47"">","","","","",""
"1","gṛhītam","GṚHĪT","am","gṛhīta","noun-adj",""
"2","anen","","","idam","pron",""
"3","^","","","","",""
"4","aivaṃ","","","eva","ind",""
"5","nāmnā","NĀMN","ā","nāmnā","noun-adj",""
"6","bodhisattvena","BODHISATTV","ena","bodhisattva","noun-adj",""
"7","mama","MAM","a","mat","pron",""
"8","^","","","","",""
"9","aivaṃ","","","eva","ind",""
"10","nāmno","NĀM","no","nāman","noun-adj",""
"11","bodhisattvasy","BODHISATTV","asy","bodhisattva","noun-adj",""
"12","āntikāt","ANTIK","āt","antikā","noun-adj",""
"13","yāvat","YĀVAT","","yāvat","ind",""
"14","tri","TR","i","tri","noun-adj",""
"15","api","","","api","ind",""
"16","bodhisatva","BODHISATTV","a@","bodhisattva","noun-adj",""
"17","śīla","ŚĪL","a@","śīla","noun-adj",""
"18","saṃvara","SAṂVAR","a@","saṃvara","noun-adj",""
"19","samādānam","SAMĀDĀN","am","samādāna","noun-adj",""
"20","/","","","","punct",""
"","</s>","","","","",""
"","<s number=""48"">","","","","",""
"1","so","","","tad","pron",""
"2","hama","HAM","a@","hama","noun-adj",""
"3","evaṃnāmā","EVAṂNĀM","ā","evaṃnāman","noun-adj",""
"4","bodhisattva","BODHISATTV","a","bodhisattva","noun-adj",""
"5","ātmānaṃ","ĀTM","ānaṃ","ātman","noun-adj",""
"6","sākṣi","SĀKṢ","i@","sākṣin","noun-adj",""
"7","bhūtaṃ","BHŪT","aṃ","bhūta","noun-adj",""
"8","prajānan","PRAJĀN","an","prajānat","noun-adj",""
"9","asy","","","as","verb","as"
"10","^","","","","",""
"11","aivaṃ","","","eva","ind",""
"12","nāmno","NĀMN","o","nāmnā","noun-adj",""
"13","bodhisattvasya","BODHISATTV","asya","bodhisattva","noun-adj",""
"14","paramāryyāṇāṃ","PARAMĀRY","yāṇāṃ","paramārya","noun-adj",""
"15","viparokṣāṇām","VIPAROKṢ","āṇām","viparokṣa","noun-adj",""
"16","api","","","api","ind",""
"17","sarvatra","","","sarvatra","ind",""
"18","sarvv","SARV","v","sarva","noun-adj",""
"19","asattvānāṃ","ASATTV","ānāṃ","asattva","noun-adj",""
"20","viparokṣa","VIPAROKṢ","a@","viparokṣa","noun-adj",""
"21","buddhīnāṃ","BUDDH","īnāṃ","buddhi","noun-adj",""
"22","daśa","DAŚ","a@","daśa","noun-adj",""
"23","dikṣu","DIK","ṣu","dik","noun-adj",""
"24","an","","","alpha_privativum","ind",""
"25","anta","ANT","a@","anta","noun-adj",""
"26","ā","","","alpha_privativum","ind",""
"27","paryyanteṣu","PARYANT","eṣu","paryanta","noun-adj",""
"28","lokadhātuṣv","LOKADHĀT","uṣv","lokadhātu","noun-adj",""
"29","ārocayāmi","ĀROC","ayāmi","āroc","verb","āruc"
"30","/","","","","punct",""
"","</s>","","","","",""
"","<s number=""49"">","","","","",""
"1","asmin","","","idam","pron",""
"2","bodhisattva","BODHISATTV","a@","bodhisattva","noun-adj",""
"3","śīla","ŚĪL","a@","śīla","noun-adj",""
"4","saṃvara","SAṂVAR","a@","saṃvara","noun-adj",""
"5","samādānam","SAMĀDĀN","am","samādāna","noun-adj",""
"6","//","","","","punct",""
"","</s>","","","","",""
"","<s number=""50"">","","","","",""
"1","trir","TR","ir","tri","noun-adj",""
"2","evam","","","eva","ind",""
"3","//","","","","punct",""
"","</s>","","","","",""
"","<s number=""51"">","","","","",""
"1","evaṃ","","","eva","ind",""
"2","punaḥ","","","punar","ind",""
"3","śīla","ŚĪL","a@","śīla","noun-adj",""
"4","saṃvara","SAṂVAR","a@","saṃvara","noun-adj",""
"5","samādāna","SAMĀDĀN","a@","samādāna","noun-adj",""
"6","karmma","KARM","ma","karman","noun-adj",""
"7","samāpty","SAMĀPT","y@","samāpti","noun-adj",""
"8","anantaraṃ","ANANTAR","aṃ","anantara","noun-adj",""
"9","dharmmatā","DHARMAT","ā","dharmatā","noun-adj",""
"10","khalv","KHAL","v","khalu","noun-adj",""
"11","eṣā","","","tad","pron",""
"12","yad","","","yadi","ind",""
"13","daśasu","DAŚ","asu","daś","verb",""
"14","dikṣv","DIKṢ","v","dik","noun-adj",""
"15","anantā","ANANT","ā@","ananta","noun-adj",""
"16","paryyanteṣu","PARYANT","eṣu@","paryanta","noun-adj",""
"17","lokadhātuṣu","LOKADHĀT","uṣu","lokadhātu","noun-adj",""
"18","tathāgatānāṃ","TATHĀGAT","ānāṃ","tathāgata","noun-adj",""
"19","tiṣṭhatāṃ","TIṢṬH","atāṃ","tiṣṭhat","noun-adj",""
"20","dhriyatāṃ","DHRIYAT","āṃ","dhriyatā","noun-adj",""
"21","yāpayatāṃ","YĀPAY","atāṃ","yāpayat","noun-adj",""
"22","mahābhūmi","MAHĀBHŪM","i@","mahābhūmi","noun-adj",""
"23","praviṣṭānāṃ","PRAVIṢṬ","ānāṃ","praviṣṭa","noun-adj",""
"24","ca","","","ca","ind",""
"25","bodhisattvānāṃ","BODHISATTV","ānāṃ","bodhisattva","noun-adj",""
"26","tad","TAD","","tad","pron",""
"27","rupaṃ","RUP","aṃ","rupa","noun-adj",""
"28","nimittam","NIMITT","am","nimitta","noun-adj",""
"29","prādurbhavati","PRĀDURBHAV","ati","prādurbhavat","noun-adj",""
"30","yena","","","yad","pron",""
"31","teṣām","","","tad","pron",""
"32","evaṃ","","","eva","ind",""
"33","bhavati","BHAV","ati","bhav","verb","bhū"
"34","/","","","","punct",""
"","</s>","","","","",""
"","<s number=""52"">","","","","",""
"1","evaṃnāmnā","EVAṂNĀM","nā","evaṃnāman","noun-adj",""
"2","bodhisattvena","BODHISATTV","ena","bodhisattva","noun-adj",""
"3","evaṃnāmno","EVAṂNĀM","no","evaṃnāman","noun-adj",""
"4","bodhisattvasy","BODHISATTV","asy","bodhisattva","noun-adj",""
"5","āntikāt","ANTIK","āt","antikā","noun-adj",""
"6","bodhisattva","BODHISATTV","a@","bodhisattva","noun-adj",""
"7","śīla","ŚĪL","a@","śīla","noun-adj",""
"8","saṃvara","SAṂVAR","a","saṃvara","noun-adj",""
"9","samādānaṃ","SAMĀDĀN","aṃ","samādāna","noun-adj",""
"10","samāttam","SAMĀTT","am","samātta","noun-adj",""
"11","iti","","","iti","ind",""
"12","//","","","","punct",""
"","</s>","","","","",""
"","<s number=""53"">","","","","",""
"1","evaṃ","","","eva","ind",""
"2","tāvat","TĀVAT","","tāvat","ind",""
"3","parataḥ","PAR","ataḥ","para","noun-adj",""
"4","samādāna","SAMĀDĀN","a@","samādāna","noun-adj",""
"5","vidhir","VIDH","ir","vidhi","noun-adj",""
"6","uktaḥ","UKT","aḥ","ukta","noun-adj",""
"7","//","","","","punct",""
"","</s>","","","","",""
"","<s number=""54"">","","","","",""
"1","yadi","","","yadi","ind",""
"2","tair","","","tad","pron",""
"3","guṇair","GUṆ","air","guṇa","noun-adj",""
"4","yuktaḥ","YUKT","aḥ","yukta","noun-adj",""
"5","pudgalo","PUDGAL","o","pudgala","noun-adj",""
"6","na","","","na","ind",""
"7","sannihitaḥ","SANNIḤIT","aḥ","sanniḥita","noun-adj",""
"8","syāt","","","as","verb","as"
"9","tato","","","tatas","ind",""
"10","bodhisattvena","BODHISATTV","ena","bodhisattva","noun-adj",""
"11","tathāgata","TATHĀGAT","a@","tathāgata","noun-adj",""
"12","pratimāyāḥ","PRATIMĀY","āḥ","pratimāyā","noun-adj",""
"13","purataḥ","PURAT","aḥ","puratas","noun-adj",""
"14","svayam","SVAY","am","svaya","noun-adj",""
"15","api","","","api","ind",""
"16","bodhisattva","BODHISATTV","a@","bodhisattva","noun-adj",""
"17","śīla","ŚĪL","a@","śīla","noun-adj",""
"18","saṃvara","SAṂVAR","a@","saṃvara","noun-adj",""
"19","samādāne","SAMĀDĀN","e","samādāna","noun-adj",""
"20","vacanīyam","VACANĪY","am","vacanīya","noun-adj",""
"21","/","","","","punct",""
"","</s>","","","","",""
"","<s number=""55"">","","","","",""
"1","evaṃ","","","eva","ind",""
"2","ca","","","ca","ind",""
"3","karaṇīyam","KARAṆĪY","am","karaṇīya","noun-adj",""
"4","/","","","","punct",""
"","</s>","","","","",""
"","<s number=""56"">","","","","",""
"1","ekāṃ","EK","āṃ","eka","noun-adj",""
"2","samuttara","SAMUTTAR","a@","samuttara","noun-adj",""
"3","āsaṅgaṃ","ĀSAṄG","aṃ","āsaṅga","noun-adj",""
"4","kṛtvā","KṚT","vā","kṛta","noun-adj",""
"5","daśasu","DAŚ","asu@","daśa","noun-adj",""
"6","dikṣv","DIKṢ","v","dik","noun-adj",""
"7","atīta","ATĪT","a@","atīta","noun-adj",""
"8","ānāgata","ANĀGAT","a@","anāgata","noun-adj",""
"9","pratyutpannānāṃ","PRATYUTPANN","ānāṃ","pratyutpanna","noun-adj",""
"10","buddhānāṃ","BUDDH","ānāṃ","buddha","noun-adj",""
"11","bhagavatāṃ","BHAGAVAT","āṃ","bhagavatī","noun-adj",""
"12","mahābhūmi","MAHĀBHŪM","i@","mahābhūmi","noun-adj",""
"13","praviṣṭānāṃ","PRAVIṢṬ","ānāṃ","praviṣṭa","noun-adj",""
"14","ca","","","ca","ind",""
"15","bodhisattvānāṃ","BODHISATTV","ānāṃ","bodhisattva","noun-adj",""
"16","sāmīcīṃ","SĀMĪC","īṃ","sāmīcī","noun-adj",""
"17","kṛtvā","KṚT","vā","kṛta","noun-adj",""
"18","dakṣiṇaṃ","DAKṢIṆ","aṃ","dakṣiṇa","noun-adj",""
"19","jānumaṇḍalaṃ","JĀNUMAṆḌAL","aṃ","jānumaṇḍala","noun-adj",""
"20","pṛthivyāṃ","PṚTHIV","yāṃ","pṛthivī","noun-adj",""
"21","pratiṣṭhāpya","PRATIṢṬHĀPY","a","pratiṣṭhāpya","noun-adj",""
"22","utkuṭu","UTKUṬ","u","utkuṭa","noun-adj",""
"23","kena","","","kim","pron",""
"24","vā","","","vā","ind",""
"25","idam","","","idam","pron",""
"26","syād","","","as","verb","as"
"27","vacanīyam","VACANĪY","am","vacanīya","noun-adj",""
"28","/","","","","punct",""
"","</s>","","","","",""
"","<s number=""57"">","","","","",""
"1","aham","AHAM","","mat","pron",""
"2","evaṃnāmā","EVAṂNĀM","ā","evaṃnāman","noun-adj",""
"3","daśasu","DAŚ","asu@","daśa","noun-adj",""
"4","dikṣu","DIKṢ","u@","dik","noun-adj",""
"5","sarva","SARV","a@","sarva","noun-adj",""
"6","tathāgatān","TATHĀGAT","ān","tathāgata","noun-adj",""
"7","mahābhūmi","MAHĀBHŪM","i@","mahābhūmi","noun-adj",""
"8","praviṣṭāṃś","PRAVIṢṬ","āṃś","praviṣṭa","noun-adj",""
"9","ca","","","ca","ind",""
"10","bodhisattvān","BODHISATTV","ān","bodhisattva","noun-adj",""
"11","vijñāpayāmi","VIJÑĀP","ayāmi","vijñāpin","noun-adj",""
"12","/","","","","punct",""
"","</s>","","","","",""
"","<s number=""58"">","","","","",""
"1","teṣāṃ","","","tad","pron",""
"2","purataḥ","PURAT","aḥ","puratas","noun-adj",""
"3","sarvvāṇi","SARV","āṇi","sarva","noun-adj",""
"4","bodhisatva","BODHISATTV","a@","bodhisattva","noun-adj",""
"5","śikṣāpadāni","ŚIKṢĀPAD","āni","śikṣāpada","noun-adj",""
"6","sarvvaṃ","SARV","vaṃ","sarvu","noun-adj",""
"7","ca","","","ca","ind",""
"8","bodhisattva","BODHISATTV","a@","bodhisattva","noun-adj",""
"9","śīlaṃ","ŚĪL","aṃ","śīla","noun-adj",""
"10","samādade","SAMĀDAD","e","samādadāti","noun-adj",""
"11","/","","","","punct",""
"","</s>","","","","",""
"","<s number=""59"">","","","","",""
"1","yacchīlam","YACCHĪL","am","yacchīla","noun-adj",""
"2","ity","","","iti","ind",""
"3","ādi","ĀD","i","ādi","noun-adj",""
"4","pūrvvavat","PŪRV","avat","pūrvavat","noun-adj",""
"5","yāvat","YĀVAT","","yāvat","ind",""
"6","bodhisattvo","BODHISATTV","o","bodhisattva","noun-adj",""
"7","bodhisattva","BODHISATTV","a","bodhisattva","noun-adj",""
"8","iti","","","iti","ind",""
"9","/","","","","punct",""
"","</s>","","","","",""
"","<s number=""60"">","","","","",""
"1","māmitaḥ","MĀM","itaḥ","māma","noun-adj",""
"2","prabhṛti","PRABHṚT","i","prabhṛti","noun-adj",""
"3","buddha","BUDDH","a","buddha","noun-adj",""
"4","bhagavanto","BHAGAVANT","o","bhagavanta","noun-adj",""
"5","bodhisattvāś","BODHISATTV","āś","bodhisattva","noun-adj",""
"6","ca","","","ca","ind",""
"7","dhārayantv","DHĀRAY","antv","dhārayat","noun-adj",""
"8","iti","","","iti","ind",""
"9","vijñaptiḥ","VIJÑAPT","iḥ","vijñapti","noun-adj",""
"10","//","","","","punct",""
"11","//","","","","punct",""
"","</s>","","","","",""
"","</page>","","","","",""
"","</doc>","","","","",""
