"WordID","word","NormSTEM","suffix","lemma","PoS","Root"
"","<doc textid = ""buddhamata"" genre = ""lit"" title = ""buddhamata"" author = ""n/a"" discourse = ""nāṭya/alaṃkāraśastra"" tradition = ""secular"" period = ""uncertain"" source = ""dsbc accessed aug 2021"" date_range = ""uncertain"" notes = ""appears to be a drama/ nāṭya. no information on this text found. "" religion = ""buddh"" edition = ""based on the ed. by ? ?"" digitization = ""miroj shakya"" segmentation_lemmatization = ""ligeia lugli & buddhist translators workbench team"" metadata_enrichment = ""bruno galasek-hul & buddhist translators workbench team"" proofreader = ""n/a"" permission = """" reconstructions = ""none"">","","","","",""
"","<page number=""78"">","","","","",""
"","<s number=""0"">","","","","",""
"1","buddhamatam","BUDDHAMAT","am","buddhamata","noun-adj",""
"2","nāṭyam","NĀṬY","am","nāṭya","noun-adj",""
"","</s>","","","","",""
"","<page number=""0000"">","","","","",""
"","<s number=""1"">","","","","",""
"1","nṛttaṃ","NṚTT","aṃ","nṛtta","noun-adj",""
"2","gītaṃ","GĪT","aṃ","gīta","noun-adj",""
"3","vādyam","VĀDY","am","vādya","noun-adj",""
"4","iti","","","iti","ind",""
"5","trayaṃ","TRAY","aṃ","tri","noun-adj",""
"6","nāṭyam","NĀṬY","am","nāṭya","noun-adj",""
"7","ity","","","iti","ind",""
"8","ucyate","UC","yate","vak","verb","vac"
"9","/","","","","punct",""
"","</s>","","","","",""
"","<s number=""2"">","","","","",""
"1","taurya","TAURY","a@","taurya","noun-adj",""
"2","trikam","TRIK","am","trika","noun-adj",""
"3","iti","","","iti","ind",""
"4","ca","","","ca","ind",""
"5","/","","","","punct",""
"","</s>","","","","",""
"","<s number=""3"">","","","","",""
"1","jarat","JAR","at","jarat","noun-adj",""
"2","tam","TAM","","tad","pron",""
"3","āryāḥ","ĀRY","āḥ","ārya","noun-adj",""
"4","sā","","","tad","pron",""
"5","hitya","HIT","ya@","hita","noun-adj",""
"6","vidyāyā","VIDYĀY","ā","vidyāyati","noun-adj",""
"7","iva","","","iva","ind",""
"8","nāṭya","NĀṬY","a@","nāṭya","noun-adj",""
"9","vidyāyā","VIDYĀY","ā","vidyāyati","noun-adj",""
"10","api","","","api","ind",""
"11","rasa","RAS","a@","rasa","noun-adj",""
"12","jñā","JÑ","ā","jñā","noun-adj",""
"13","ba","","","","ind",""
"14","bhūvuḥ","BHŪV","uḥ","bhūvu","noun-adj",""
"15","/","","","","punct",""
"","</s>","","","","",""
"","<s number=""4"">","","","","",""
"1","asy","","","as","verb","as"
"2","^","","","","",""
"3","ā","","","alpha_privativum","ind",""
"4","ākara","ĀKAR","a@","ākara","noun-adj",""
"5","grantho","GRANTH","o","grantha","noun-adj",""
"6","nāṭya","NĀṬY","a@","nāṭya","noun-adj",""
"7","veda","VED","a","veda","noun-adj",""
"8","ity","","","iti","ind",""
"9","ucyate","UC","yate","vak","verb","vac"
"10","/","","","","punct",""
"","</s>","","","","",""
"","<s number=""5"">","","","","",""
"1","sa","","","sa_saha","ind",""
"2","dvisahasra","DVISAHASR","a@","dvisahasra","noun-adj",""
"3","varṣa","VARṢ","a@","varṣa","noun-adj",""
"4","prācīnena","PRĀCĪN","ena","prācīna","noun-adj",""
"5","bharata","BHARAT","a@","bharata","noun-adj",""
"6","muninā","MUN","inā","muni","noun-adj",""
"7","praṇītaḥ","PRAṆĪT","aḥ","praṇīta","noun-adj",""
"8","/","","","","punct",""
"","</s>","","","","",""
"","<s number=""6"">","","","","",""
"1","abhinava","ABHINAV","a@","abhinava","noun-adj",""
"2","gupta","GUPT","a@","gupta","noun-adj",""
"3","ācāryaḥ","ĀCĀRY","aḥ","ācārya","noun-adj",""
"4","4100","","","","ind",""
"5","tam","","","tad","pron",""
"6","avarṣa","AVARṢ","a","avarṣa","noun-adj",""
"7","jīvī","JĪV","ī","jīvin","noun-adj",""
"8","vistṛtām","VISTṚT","ām","vistṛtā","noun-adj",""
"9","asya","","","idam","pron",""
"10","vivṛtiṃ","VIVṚT","iṃ","vivṛti","noun-adj",""
"11","viraci","VIRAC","i@","virac","verb",""
"12","tavān","","","","ind",""
"13","abhinava","ABHINAV","a@","abhinava","noun-adj",""
"14","bhāratīṃ","BHĀRAT","īṃ","bhāratī","noun-adj",""
"15","nāma","NĀM","a","nāman","noun-adj",""
"16","//","","","","punct",""
"","</s>","","","","",""
"","<s number=""7"">","","","","",""
"1","buddhamatam","BUDDHAMAT","am","buddhamata","noun-adj",""
"2","ukte","UKT","e","ukta","noun-adj",""
"3","jāti","JĀT","i@","jāti","noun-adj",""
"4","niyame","NIYAM","e","niyama","noun-adj",""
"5","niraṅkuśam","NIRAṄKUŚ","am","niraṅkuśa","noun-adj",""
"6","anuvartamāne","ANUVART","amāne","anuvart","verb","anuvṛt"
"7","gateṣu","GAT","eṣu","gata","noun-adj",""
"8","paras","PAR","as","para","noun-adj",""
"9","sahastreṣu","SAHASTR","eṣu","sa_saha","ind",""
"10","vatsareṣu","VATSAR","eṣu","vatsara","noun-adj",""
"11","kṣatriyā","KṢATRIY","ā","kṣatriya","noun-adj",""
"12","vīra","VĪR","a@","vīra","noun-adj",""
"13","vṛttau","VṚTT","au","vṛtta","noun-adj",""
"14","vaiśyā","VAIŚY","ā","vaiśyā","noun-adj",""
"15","vāṇijya","VĀṆIJY","a@","vāṇijya","noun-adj",""
"16","vṛttau","VṚTT","au","vṛtta","noun-adj",""
"17","c","","","ca","ind",""
"18","^","","","","",""
"19","āsaktāḥ","ĀSAKT","āḥ","āsakta","noun-adj",""
"20","santo","SANT","o","sat","noun-adj",""
"21","vai","","","vai","ind",""
"22","dikeṣu","DIK","eṣu","dik","noun-adj",""
"23","yajña","YAJÑ","a@","yajña","noun-adj",""
"24","karmasu","KARM","asu","karman","noun-adj",""
"25","brāhmaṇān","BRĀHMAṆ","ān","brāhmaṇa","noun-adj",""
"26","prāyaḥ","PRĀY","aḥ","prāya","noun-adj",""
"27","pratinidhātum","PRATINIDHĀT","um","pratinidhātu","noun-adj",""
"28","ārebhir","ĀREBH","ir","ārebhi","noun-adj",""
"29","e","","","","ind",""
"30","/","","","","punct",""
"","</s>","","","","",""
"","<s number=""8"">","","","","",""
"1","pracīyamāne","PRAC","īyamāne","praca","noun-adj",""
"2","pratinidhāna","PRATINIDHĀN","a","pratinidhāna","noun-adj",""
"3","pakṣe","PAKṢ","e","pakṣa","noun-adj",""
"4","teṣāṃ","","","tad","pron",""
"5","brāhmaṇeṣv","BRĀHMAṆ","eṣv","brāhmaṇa","noun-adj",""
"6","ati","","","","ind",""
"7","bahumāna","BAHUMĀN","a","bahumāna","noun-adj",""
"8","āsīt","ĀSĪT","","as","verb","as"
"9","/","","","","punct",""
"","</s>","","","","",""
"","<s number=""9"">","","","","",""
"1","vedā","VED","ā@","veda","noun-adj",""
"2","dhya","DHY","a@","dhya","noun-adj",""
"3","yane","YAN","e","yana","noun-adj",""
"4","c","","","ca","ind",""
"5","^","","","","",""
"6","āvaśyakatv","ĀVAŚYAKAT","v","āvaśyakatā","noun-adj",""
"7","abuddhya","ABUDDHY","a@","abuddhyā","noun-adj",""
"8","bhāvād","BHĀV","ād","bhāva","noun-adj",""
"9","apravṛtti","APRAVṚTT","i@","apravṛtti","noun-adj",""
"10","rāsīt","RĀS","īt","rāsa","noun-adj",""
"11","/","","","","punct",""
"","</s>","","","","",""
"","<s number=""10"">","","","","",""
"","</page>","","","","",""
"","<page number=""79"">","","","","",""
"3","veda","VED","a@","veda","noun-adj",""
"4","śāstra","ŚĀSTR","a@","śāstra","noun-adj",""
"5","vijñānaṃ","VIJÑĀN","aṃ","vijñāna","noun-adj",""
"6","brāhmaṇa","BRĀHMAṆ","a@","brāhmaṇa","noun-adj",""
"7","mātra","MĀTR","a@","mātra","noun-adj",""
"8","śaraṇaṃ","ŚARAṆ","aṃ","śaraṇa","noun-adj",""
"9","ba","","","","ind",""
"10","bhūva","BHŪV","a","bhūva","noun-adj",""
"11","/","","","","punct",""
"","</s>","","","","",""
"","<s number=""11"">","","","","",""
"1","brāhmaṇāś","BRĀHMAṆ","āś","brāhmaṇa","noun-adj",""
"2","ca","","","ca","ind",""
"3","vahavaḥ","VAH","avaḥ","vahu","noun-adj",""
"4","sulabhayā","SULABH","ayā","sulabhā","noun-adj",""
"5","pūjayā","PŪJAY","ā","pūjayati","noun-adj",""
"6","saṃtṛptā","SAṂTṚPT","ā","saṃtṛptā","noun-adj",""
"7","vidyā","VIDY","ā@","vidyā","noun-adj",""
"8","pariśīlane","PARIŚĪLAN","e","pariśīlana","noun-adj",""
"9","yathāpūrvaṃ","YATHĀPŪRV","aṃ","yathāpūrva","noun-adj",""
"10","śraddhāṃ","ŚRADDH","āṃ","śraddhā","noun-adj",""
"11","na","","","na","ind",""
"12","ba","","","","ind",""
"13","bandhuḥ","BANDH","uḥ","bandhu","noun-adj",""
"14","/","","","","punct",""
"","</s>","","","","",""
"","<s number=""12"">","","","","",""
"1","evaṃ","","","eva","ind",""
"2","kṣīyamāṇe","KṢ","īyamāṇe","kṣa","noun-adj",""
"3","vidyā","VIDY","ā@","vidyā","noun-adj",""
"4","pracāre","PRACĀR","e","pracāra","noun-adj",""
"5","sarveṣāṃ","SARV","eṣāṃ","sarva","noun-adj",""
"6","varṇānāṃ","VARṆ","ānāṃ","varṇa","noun-adj",""
"7","vidyā","VIDY","ā@","vidyā","noun-adj",""
"8","mūlāḥ","MŪL","āḥ","mūla","noun-adj",""
"9","sad","SAD","@","sat","noun-adj",""
"10","guṇā","GUṆ","ā","guṇa","noun-adj",""
"11","viralā","VIRAL","ā","virala","noun-adj",""
"12","āsan","ĀSAN","","āsana","noun-adj",""
"13","/","","","","punct",""
"","</s>","","","","",""
"","<s number=""13"">","","","","",""
"1","krameṇa","KRAM","eṇa","krama","noun-adj",""
"2","teṣāṃ","","","tad","pron",""
"3","paraspara","PARASPAR","a@","paraspara","noun-adj",""
"4","snehaḥ","SNEH","aḥ","sneha","noun-adj",""
"5","samadṛṣṭitvaṃ","SAMADṚṢṬ","itvaṃ","samadṛṣṭi","noun-adj",""
"6","cāturvarṇyam","CĀTURVARṆY","am","cāturvarṇya","noun-adj",""
"7","ekaṃ","EK","aṃ","eka","noun-adj",""
"8","kuḍumbam","KUḌUMB","am","kuḍumba","noun-adj",""
"9","iti","","","iti","ind",""
"10","buddhiś","BUDDH","iś","buddhi","noun-adj",""
"11","c","","","ca","ind",""
"12","^","","","","",""
"13","āstaṃ","","","as","verb","as"
"14","agāma","AGĀM","a","agāma","noun-adj",""
"15","/","","","","punct",""
"","</s>","","","","",""
"","<s number=""14"">","","","","",""
"1","pratyuta","PRATYUT","a@","pratyuta","noun-adj",""
"2","ottama","UTTAM","a@","uttama","noun-adj",""
"3","varṇānām","VARṆ","ānām","varṇa","noun-adj",""
"4","avaravarṇoṣv","AVARAVARṆ","oṣv","avaravarṇa","noun-adj",""
"5","avajñā","AVAJÑ","ā","avajñā","noun-adj",""
"6","teṣām","","","tad","pron",""
"7","uttama","UTTAM","a@","uttama","noun-adj",""
"8","varṇeṣv","VARṆ","eṣv","varṇa","noun-adj",""
"9","īrṣyā","ĪRṢY","ā","īrṣyā","noun-adj",""
"10","c","","","ca","ind",""
"11","^","","","","",""
"12","āṅkuritā","AṄKURIT","ā","aṅkurita","noun-adj",""
"13","ba","","","","ind",""
"14","bhūva","BHŪV","a","bhūva","noun-adj",""
"15","/","","","","punct",""
"","</s>","","","","",""
"","<s number=""15"">","","","","",""
"1","doṣa","DOṢ","a@","doṣa","noun-adj",""
"2","kulaṣāś","KUL","aṣāś","kula","noun-adj",""
"3","ca","","","ca","ind",""
"4","varṇānām","VARṆ","ānām","varṇa","noun-adj",""
"5","ācārā","ĀCĀR","ā","ācāra","noun-adj",""
"6","bahuli","BAHUL","i","bahuli","noun-adj",""
"7","iva","","","iva","ind",""
"8","bhūbuḥ","BHŪB","uḥ","bhūbu","noun-adj",""
"9","/","","","","punct",""
"","</s>","","","","",""
"","<s number=""16"">","","","","",""
"1","asminn","","","idam","pron",""
"2","avasare","AVASAR","e","avasara","noun-adj",""
"3","buddhamataṃ","BUDDHAMAT","aṃ","buddhamata","noun-adj",""
"4","bhārate","BHĀRAT","e","bhārata","noun-adj",""
"5","prādura","PRĀDUR","a@","prāduras","noun-adj",""
"6","āsīt","ĀSĪT","","as","verb","as"
"7","/","","","","punct",""
"","</s>","","","","",""
"","<s number=""17"">","","","","",""
"1","idaṃ","","","idam","pron",""
"2","mataṃ","MAT","aṃ","mata","noun-adj",""
"3","jāti","JĀT","i@","jāti","noun-adj",""
"4","niyama","NIYAM","a@","niyama","noun-adj",""
"5","ā","","","alpha_privativum","ind",""
"6","bhāvāj","BHĀV","āj","bhāva","noun-adj",""
"7","jāti","JĀT","i@","jāti","noun-adj",""
"8","niyama","NIYAM","a@","niyama","noun-adj",""
"9","kleśam","KLEŚ","am","kleśa","noun-adj",""
"10","anubhavatāṃ","ANUBHAV","atāṃ","anubhavatā","noun-adj",""
"11","janānāṃ","JAN","ānāṃ","jana","noun-adj",""
"12","kāra","KĀR","a@","kāra","noun-adj",""
"13","ābandha","ĀBANDH","a@","ābandha","noun-adj",""
"14","mocanam","MOCAN","am","mocana","noun-adj",""
"15","iva","","","iva","ind",""
"16","mahad","MAH","ad","mahat","noun-adj",""
"17","āśvāsa","ĀŚVĀS","a@","āśvāsa","noun-adj",""
"18","sthānam","STHĀN","am","sthāna","noun-adj",""
"19","abhavat","ABHAV","at","abhava","noun-adj",""
"20","/","","","","punct",""
"","</s>","","","","",""
"","<s number=""18"">","","","","",""
"1","brāhmaṇā","BRĀHMAṆ","ā","brāhmaṇa","noun-adj",""
"2","api","","","api","ind",""
"3","kecit","","","kimcit","ind",""
"4","tat","TAT","","tad","pron",""
"5","kāle","KĀL","e","kāla","noun-adj",""
"6","guṇa","GUṆ","a@","guṇa","noun-adj",""
"7","darśanād","DARŚAN","ād","darśana","noun-adj",""
"8","matam","MAT","am","mata","noun-adj",""
"9","idam","IDAM","","idam","pron",""
"10","aṅgī","AṄG","ī@","aṅgī","noun-adj",""
"11","cakruḥ","CAKR","uḥ","cakru","noun-adj",""
"12","/","","","","punct",""
"","</s>","","","","",""
"","<s number=""19"">","","","","",""
"1","kim","","","kim","pron",""
"2","utānye","UTĀNY","e","utānya","noun-adj",""
"3","/","","","","punct",""
"","</s>","","","","",""
"","<s number=""20"">","","","","",""
"1","aihika","AIHIK","a@","aihika","noun-adj",""
"2","sukha","SUKH","a@","sukha","noun-adj",""
"3","vairāgyam","VAIRĀGY","am","vairāgya","noun-adj",""
"4","a","","","alpha_privativum","ind",""
"5","hiṃsā","HIṂS","ā","hiṃsā","noun-adj",""
"6","satyam","SATY","am","satya","noun-adj",""
"7","asteyaṃ","AST","eyaṃ","asta","noun-adj",""
"8","śāntiḥ","ŚĀNT","iḥ","śānti","noun-adj",""
"9","samadṛṣṭitā","SAMADṚṢṬ","itā","samadṛṣṭi","noun-adj",""
"10","bhut","BHUT","","bhuta","noun-adj",""
"11","a","","","alpha_privativum","ind",""
"12","dayā","DAY","ā","dayā","noun-adj",""
"13","para","PAR","a@","para","noun-adj",""
"14","opakāraḥ","UPAKĀR","aḥ","upakāra","noun-adj",""
"15","śaraṇa","ŚARAṆ","a@","śaraṇa","noun-adj",""
"16","āgata","ĀGAT","a@","āgata","noun-adj",""
"17","paritrāṇam","PARITRĀṆ","am","paritrāṇa","noun-adj",""
"18","ity","","","iti","ind",""
"19","ete","","","tad","pron",""
"20","guṇā","GUṆ","ā","guṇa","noun-adj",""
"21","ācārāś","ĀCĀR","āś","ācāra","noun-adj",""
"22","ca","","","ca","ind",""
"23","sāra","SĀR","a@","sāra","noun-adj",""
"24","bhūtā","BHŪT","ā","bhūtā","noun-adj",""
"","</page>","","","","",""
"","<page number=""80"">","","","","",""
"27","mate","MAT","e","mata","noun-adj",""
"28","asmin","ASMIN","","idam","pron",""
"29","brāhmaṇam","BRĀHMAṆ","am","brāhmaṇa","noun-adj",""
"30","a","","","alpha_privativum","ind",""
"31","tavad","TAV","ad","tavas","noun-adj",""
"32","upadiṣṭāḥ","UPADIṢṬ","āḥ","upadiṣṭa","noun-adj",""
"33","/","","","","punct",""
"","</s>","","","","",""
"","<s number=""21"">","","","","",""
"1","tathā","","","tathā","ind",""
"2","svarga","SVARG","a@","svarga","noun-adj",""
"3","narakau","NARAK","au","naraka","noun-adj",""
"4","devāḥ","DEV","āḥ","deva","noun-adj",""
"5","punar","","","punar","ind",""
"6","janma","JANM","a","janma","noun-adj",""
"7","nirvāṇa","NIRVĀṆ","a@","nirvāṇa","noun-adj",""
"8","āpara","APAR","a@","apara","noun-adj",""
"9","nāmā","NĀM","ā","nāman","noun-adj",""
"10","mokṣaś","MOKṢ","aś","mokṣa","noun-adj",""
"11","ca","","","ca","ind",""
"12","mate","MAT","e","mata","noun-adj",""
"13","asminn","","","idam","pron",""
"14","abhyupagamyante","ABHYUPAGAM","yante","abhyupagacch","verb","abhyupagam"
"15","/","","","","punct",""
"","</s>","","","","",""
"","<s number=""22"">","","","","",""
"1","kintu","KIṂT","u@","kiṃtu","noun-adj",""
"2","jantu","JANT","u@","jantu","noun-adj",""
"3","hiṃsay","HIṂS","ay","hiṃsā","noun-adj",""
"4","eśvara","EŚVAR","a@","eśvara","noun-adj",""
"5","yajanaṃ","YAJAN","aṃ","yajana","noun-adj",""
"6","yad","","","yadi","ind",""
"7","brāhmaṇa","BRĀHMAṆ","a@","brāhmaṇa","noun-adj",""
"8","mate","MAT","e","mata","noun-adj",""
"9","aṅgī","AṄG","ī@","aṅgī","noun-adj",""
"10","kṛtaṃ","KṚT","aṃ","kṛta","noun-adj",""
"11","tad","","","tad","pron",""
"12","asmin","","","idam","pron",""
"13","mate","MAT","e","mata","noun-adj",""
"14","atyantaṃ","ATYANT","aṃ","atyanta","noun-adj",""
"15","ninditam","NINDIT","am","nindita","noun-adj",""
"16","/","","","","punct",""
"","</s>","","","","",""
"","<s number=""23"">","","","","",""
"1","sṛgāla","SṚGĀL","a@","sṛgāla","noun-adj",""
"2","vāda","VĀD","a@","vāda","noun-adj",""
"3","sūtre","SŪTR","e","sūtra","noun-adj",""
"4","mahā","MAH","ā@","mahat","noun-adj",""
"5","rāhula","RĀHUL","a@","rāhula","noun-adj",""
"6","sūtre","SŪTR","e","sūtra","noun-adj",""
"7","ca","","","ca","ind",""
"8","buddhamatasya","BUDDHAMAT","asya","buddhamata","noun-adj",""
"9","tattvāny","TATTV","āny","tad","pron",""
"10","upadiṣṭāni","UPADIṢṬ","āni","upadiṣṭa","noun-adj",""
"11","/","","","","punct",""
"","</s>","","","","",""
"","<s number=""24"">","","","","",""
"1","idaṃ","","","idam","pron",""
"2","mataṃ","MAT","aṃ","mata","noun-adj",""
"3","kali","KAL","i@","kali","noun-adj",""
"4","varṣī","VARṢ","ī","varṣin","noun-adj",""
"5","yasya","","","yad","pron",""
"6","ṣaḍ","ṢAḌ","@","ṣaḍi","noun-adj",""
"7","viṃśa","VIṂŚ","a@","viṃśa","noun-adj",""
"8","śatakasy","ŚAT","akasy","śataka","noun-adj",""
"9","ottara","UTTAR","a@","uttara","noun-adj",""
"10","ārdhe","ARDH","e","ardha","noun-adj",""
"11","aṅkuritaṃ","AṄKUR","itaṃ","aṅkura","noun-adj",""
"12","bhikṣu","BHIKṢ","u@","bhikṣu","noun-adj",""
"13","saṅghasya","SAṂGH","asya","saṃgha","noun-adj",""
"14","mahatāṃ","MAHAT","āṃ","mahat","noun-adj",""
"15","rājñāṃ","RĀJ","ñāṃ","rājan","noun-adj",""
"16","ca","","","ca","ind",""
"17","prayatnād","PRAYATN","ād","prayatna","noun-adj",""
"18","bhāratam","BHĀRAT","am","bhārata","noun-adj",""
"19","a","","","alpha_privativum","ind",""
"20","khilam","KHIL","am","khila","noun-adj",""
"21","ākramya","ĀKRAM","ya","ākrām","verb","ākram"
"22","cīneṣu","CĪN","eṣu","cīna","noun-adj",""
"23","jāpāna","JĀPĀN","a@","jāpāna","noun-adj",""
"24","deśe","DEŚ","e","deśa","noun-adj",""
"25","laṅkāyāṃ","LAṄK","āyāṃ","laṅkā","noun-adj",""
"26","ca","","","ca","ind",""
"27","pracāram","PRACĀR","am","pracāra","noun-adj",""
"28","alabhata","LABH","ata","labh","verb","labh"
"29","/","","","","punct",""
"","</s>","","","","",""
"","<s number=""25"">","","","","",""
"1","tad","","","tad","pron",""
"2","adhyatve","ADHY","atve","adhyatva","noun-adj",""
"3","bhārate","BHĀRAT","e","bhārata","noun-adj",""
"4","paraṃ","PAR","aṃ","para","noun-adj",""
"5","viralaṃ","VIRAL","aṃ","virala","noun-adj",""
"6","pracarati","PRACAR","ati","pracar","verb","pracar"
"7","//","","","","punct",""
"","</s>","","","","",""
"","<s number=""26"">","","","","",""
"1","buddha","BUDDH","a@","buddha","noun-adj",""
"2","muniḥ","MUN","iḥ","muni","noun-adj",""
"3","purā","PUR","ā","purā","noun-adj",""
"4","nepāleṣu","NEPĀL","eṣu","nepāla","noun-adj",""
"5","kapilavastu","KAPILAVAST","u@","kapilavastu","noun-adj",""
"6","nagare","NAGAR","e","nagara","noun-adj",""
"7","śākyānāṃ","ŚĀKY","ānāṃ","śākya","noun-adj",""
"8","kṣatriyāṇāṃ","KṢATRIY","āṇāṃ","kṣatriya","noun-adj",""
"9","vaṃśe","VAṂŚ","e","vaṃśa","noun-adj",""
"10","śuddha","ŚUDDH","a@","śuddha","noun-adj",""
"11","odano","ODAN","o","odana","noun-adj",""
"12","nāma","NĀM","a","nāman","noun-adj",""
"13","rājā","RĀJ","ā","rājan","noun-adj",""
"14","ba","","","","ind",""
"15","bhūva","BHŪV","a","bhūva","noun-adj",""
"16","/","","","","punct",""
"","</s>","","","","",""
"","<s number=""27"">","","","","",""
"1","tasya","","","tad","pron",""
"2","cirāya","CIR","āya","cira","noun-adj",""
"3","santatim","SAṂTAT","im","saṃtati","noun-adj",""
"4","abhilaṣato","ABHILAṢ","ato","abhilaṣ","verb",""
"5","māyā","MĀY","ā@","māyā","noun-adj",""
"6","devyāṃ","DEV","yāṃ","devī","noun-adj",""
"7","siddhārtho","SIDDHĀRTH","o","siddhārtha","noun-adj",""
"8","nāma","NĀM","a","nāman","noun-adj",""
"9","sūnuḥ","SŪN","uḥ","sūnu","noun-adj",""
"10","kali","KAL","i@","kali","noun-adj",""
"11","varṣe","VARṢ","e","varṣa","noun-adj",""
"12","2544","","","","ind",""
"13","tam","TAM","","tad","pron",""
"14","ea","","","","ind",""
"15","jāyata","JĀYAT","a","jāyata","noun-adj",""
"16","/","","","","punct",""
"","</s>","","","","",""
"","<s number=""28"">","","","","",""
"1","ayaṃ","","","idam","pron",""
"2","vaṃśa","VAṂŚ","a","vaṃśa","noun-adj",""
"","</page>","","","","",""
"","<page number=""81"">","","","","",""
"5","nāmnā","NĀMN","ā","nāmnā","noun-adj",""
"6","gautama","GAUTAM","a","gautama","noun-adj",""
"7","iti","","","iti","ind",""
"8","jāti","JĀT","i@","jāti","noun-adj",""
"9","nāmnā","NĀMN","ā","nāmnā","noun-adj",""
"10","śākyamunir","ŚĀKYAMUN","ir","śākyamuni","noun-adj",""
"11","iti","","","iti","ind",""
"12","mata","MAT","a@","mata","noun-adj",""
"13","darśanād","DARŚAN","ād","darśana","noun-adj",""
"14","buddha","BUDDH","a","buddha","noun-adj",""
"15","iti","","","iti","ind",""
"16","ca","","","ca","ind",""
"17","prasiddha","PRASIDDH","a","prasiddha","noun-adj",""
"18","āsīt","ĀSĪT","","as","verb","as"
"19","/","","","","punct",""
"","</s>","","","","",""
"","<s number=""29"">","","","","",""
"1","saptame","SAPTAM","e","saptama","noun-adj",""
"2","ahni","AHN","i","ahni","noun-adj",""
"3","mātrā","MĀTR","ā","mātra","noun-adj",""
"4","viyuktam","VIYUKT","am","viyukta","noun-adj",""
"5","enaṃ","","","ena","ind",""
"6","mātṛ","MĀT","ṛ@","mātṛ","noun-adj",""
"7","ṣvasā","ṢVAS","ā","ṣvasā","noun-adj",""
"8","gautamī","GAUTAM","ī","gautamī","noun-adj",""
"9","parivardhayā","PARIVARDH","ayā","parivardh","verb",""
"10","māsa","","","","ind",""
"11","/","","","","punct",""
"","</s>","","","","",""
"","<s number=""30"">","","","","",""
"1","ayam","","","idam","pron",""
"2","adhīta","ADH","īta","samadṛṣṭitā","noun-adj",""
"3","vidyaḥ","VIDY","aḥ","vidyā","noun-adj",""
"4","prāpte","PRĀPT","e","prāpta","noun-adj",""
"5","yauvane","YAUVAN","e","yauvana","noun-adj",""
"6","gopāṃ","GOP","āṃ","gopā","noun-adj",""
"7","nāma","NĀM","a","nāman","noun-adj",""
"8","śākya","ŚĀKY","a@","śākya","noun-adj",""
"9","kanyakāṃ","KANY","akāṃ","kanyaka","noun-adj",""
"10","pariṇīya","PARIṆ","īya","pariṇa","noun-adj",""
"11","tasyāṃ","","","tad","pron",""
"12","rāhula","RĀHUL","a@","rāhula","noun-adj",""
"13","ābhidhaṃ","ĀBHIDH","aṃ","ābhidhā","noun-adj",""
"14","putraṃ","PUTR","aṃ","putra","noun-adj",""
"15","janayā","JANAY","ā@","janayat","noun-adj",""
"16","māsa","MĀS","a","māsa","noun-adj",""
"17","/","","","","punct",""
"","</s>","","","","",""
"","<s number=""31"">","","","","",""
"1","eṣa","","","tad","pron",""
"2","mānuṣa","MĀNUṢ","a@","mānuṣa","noun-adj",""
"3","bhogeṣv","BHOG","eṣv","bhoga","noun-adj",""
"4","ati","","","","ind",""
"5","dṛḍhayā","DṚḌH","ayā","dṛḍhā","noun-adj",""
"6","naśvaratva","NAŚVAR","atva","naśvaratva","noun-adj",""
"7","bhāvanayā","BHĀVAN","ayā","bhāvanā","noun-adj",""
"8","rājya","RĀJY","a@","rājya","noun-adj",""
"9","bhogād","BHOG","ād","bhoga","noun-adj",""
"10","virajya","VIRAJ","ya","viraj","verb","viraj"
"10","virajya","VIRAJ","ya","virañj","verb","virañj"
"11","kva","","","kva","ind",""
"12","cana","","","","ind",""
"13","rātrau","RĀTR","au","rātra","noun-adj",""
"14","prasupta","PRASUPT","a@","prasupta","noun-adj",""
"15","śāntād","ŚĀNT","ād","śānta","noun-adj",""
"16","antaḥpurāt","ANTAḤPUR","āt","antaḥpura","noun-adj",""
"17","pravavrāja","PRAVAVRĀJ","a","pravavrāja","noun-adj",""
"18","/","","","","punct",""
"","</s>","","","","",""
"","<s number=""32"">","","","","",""
"1","prathamaṃ","PRATHAM","aṃ","prathama","noun-adj",""
"2","giri","GIR","i@","giri","noun-adj",""
"3","vrajam","VRAJ","am","vraja","noun-adj",""
"4","āsādya","ĀSĀD","ya","āṣad","verb","āsad"
"5","tatra","","","tatra","ind",""
"6","tyāsu","TY","āsu","tyā","noun-adj",""
"7","guhāsu","GUH","āsu","guh","verb",""
"8","vasabhdyaḥ","VASABHDY","aḥ","vasabhdya","noun-adj",""
"9","parivrājakebhya","PARIVRĀJAK","ebhya","parivrājaka","noun-adj",""
"10","ārya","ĀRY","a@","ārya","noun-adj",""
"11","mata","MAT","a@","mata","noun-adj",""
"12","tattvāni","TATTV","āni","tad","pron",""
"13","samyag","SAMYA","g","samyak","noun-adj",""
"14","jagrāha","JAGRĀH","a","jagrāha","noun-adj",""
"15","/","","","","punct",""
"","</s>","","","","",""
"","<s number=""33"">","","","","",""
"1","tāvatā","TĀVAT","ā","tāvatā","noun-adj",""
"2","sv","","","su","ind",""
"3","ābhīṣṭaṃ","ABHĪṢṬ","aṃ","abhīṣṭa","noun-adj",""
"4","sukham","SUKH","am","sukha","noun-adj",""
"5","a","","","alpha_privativum","ind",""
"6","labdhaṃ","LABDH","aṃ","labdha","noun-adj",""
"7","paśyan","PAŚ","yan","paśa","noun-adj",""
"8","sa","","","sa_saha","ind",""
"9","buddha","BUDDH","a@","buddha","noun-adj",""
"10","gayāyāṃ","GAY","āyāṃ","gayā","noun-adj",""
"11","ghoraṃ","GHOR","aṃ","ghora","noun-adj",""
"12","tapaś","TAP","aś","tapas","noun-adj",""
"13","caritum","CAR","itum","car","verb","car"
"14","ārebhe","ĀREBH","e","ārebha","noun-adj",""
"15","/","","","","punct",""
"","</s>","","","","",""
"","<s number=""34"">","","","","",""
"1","tathā","","","tathā","ind",""
"2","tapas","TAP","as","tapas","noun-adj",""
"3","yann","","","yad","pron",""
"4","ayaṃ","AYAṂ","","idam","pron",""
"5","ṣaṭsu","ṢAṬ","su","ṣaṭ","noun-adj",""
"6","varṣeṣv","VARṢ","eṣv","varṣa","noun-adj",""
"7","atīteṣu","ATĪT","eṣu","atīta","noun-adj",""
"8","kva","","","kva","ind",""
"9","sid","","","","ind",""
"10","dine","DIN","e","dina","noun-adj",""
"11","śrama","ŚRAM","a@","śrama","noun-adj",""
"12","ātiśayād","ATIŚAY","ād","atiśaya","noun-adj",""
"13","mūrcchito","MŪRCH","ito","samadṛṣṭitā","noun-adj",""
"14","ba","","","","ind",""
"15","bhūva","BHŪV","a","bhūva","noun-adj",""
"16","/","","","","punct",""
"","</s>","","","","",""
"","<s number=""35"">","","","","",""
"1","kṣeṇena","KṢEṆ","ena","kṣeṇa","noun-adj",""
"2","ca","","","ca","ind",""
"3","pratilabdhāyāṃ","PRATILABDH","āyāṃ","pratilabdhā","noun-adj",""
"4","saṃjñāyāṃ","SAṂJÑ","āyāṃ","saṃjñā","noun-adj",""
"5","tapaḥ","TAP","aḥ","tapas","noun-adj",""
"6","parisamāpayā","PARISAMĀPAY","ā","parisamāpayā","noun-adj",""
"7","māsa","","","","ind",""
"8","/","","","","punct",""
"","</s>","","","","",""
"","<s number=""36"">","","","","",""
"1","atha","","","atha","ind",""
"2","phalgunī","PHALGUN","ī@","phalgunī","noun-adj",""
"3","nadya","NADY","a@","nadya","noun-adj",""
"4","āstīraṃ","ĀSTĪR","aṃ","āstīra","noun-adj",""
"5","prāpya","PRĀP","ya","prāpn","verb","prāp"
"6","kasy","","","kim","pron",""
"7","^","","","","",""
"8","āpi","","","api","ind",""
"9","bodhi","BODH","i@","bodhi","noun-adj",""
"10","drumasya","DRUM","asya","druma","noun-adj",""
"11","mūle","MŪL","e","mūla","noun-adj",""
"12","yed","","","","ind",""
"13","āyaṃ","ĀYAṂ","","idam","pron",""
"14","niṣasāda","NIṢASĀD","a","niṣasāda","noun-adj",""
"15","tadā","","","tadā","ind",""
"16","sarvaṃ","SARV","aṃ","sarva","noun-adj",""
"17","pūrva","PŪRV","a@","pūrva","noun-adj",""
"18","janma","JANM","a@","janma","noun-adj",""
"19","vṛttam","VṚTT","am","vṛtta","noun-adj",""
"","</page>","","","","",""
"","<page number=""82"">","","","","",""
"22","asya","","","idam","pron",""
"23","pratibhā","PRATIBH","ā@","pratibhā","noun-adj",""
"24","tam","TAM","","tad","pron",""
"25","āsīt","ĀSĪT","","as","verb","as"
"26","/","","","","punct",""
"","</s>","","","","",""
"","<s number=""37"">","","","","",""
"1","tattva","TATTV","a@","tad","pron",""
"2","jñānaṃ","JÑĀN","aṃ","jñāna","noun-adj",""
"3","c","","","ca","ind",""
"4","^","","","","",""
"5","odbuddham","UDBUDDH","am","udbuddha","noun-adj",""
"6","abhavat","ABHAV","at","abhava","noun-adj",""
"7","/","","","","punct",""
"","</s>","","","","",""
"","<s number=""38"">","","","","",""
"1","tato","","","tatas","ind",""
"2","buddhaḥ","BUDDH","aḥ","buddha","noun-adj",""
"3","kāśyām","KĀŚY","ām","kāśyā","noun-adj",""
"4","urubilve","URUBILV","e","urubilvā","noun-adj",""
"5","ca","","","ca","ind",""
"6","bahun","BAH","un","bahu","noun-adj",""
"7","śiṣyān","ŚIṢY","ān","śiṣya","noun-adj",""
"8","avindata","VIND","ata","vid","verb","vid"
"9","/","","","","punct",""
"","</s>","","","","",""
"","<s number=""39"">","","","","",""
"1","sa","","","sa_saha","ind",""
"2","śiṣya","ŚIṢY","a","śiṣya","noun-adj",""
"3","eṣa","","","tad","pron",""
"4","vītarāgo","VĪTARĀG","o","vītarāga","noun-adj",""
"5","muniḥ","MUN","iḥ","muni","noun-adj",""
"6","parārtha","PARĀRTH","a@","parārtha","noun-adj",""
"7","parāṇy","PARĀṆ","y@","parāṇi","noun-adj",""
"8","avadātāni","AVADĀT","āni","avadāta","noun-adj",""
"9","karmāṇy","KARM","āṇy","karman","noun-adj",""
"10","ācaran","ĀCAR","an","ācarat","noun-adj",""
"11","guṇa","GUṆ","a@","guṇa","noun-adj",""
"12","aika","EK","a@","eka","noun-adj",""
"13","sārair","SĀR","air","sāra","noun-adj",""
"14","upadeśair","UPADEŚ","air","upadeśa","noun-adj",""
"15","janān","JAN","ān","jana","noun-adj",""
"16","jāti","JĀT","i@","jāti","noun-adj",""
"17","bhedam","BHED","am","bheda","noun-adj",""
"18","an","","","alpha_privativum","ind",""
"19","ādṛtya","ĀDṚTY","a","ādṛtya","noun-adj",""
"20","tata","","","tatas","ind",""
"21","itaḥ","","","","ind",""
"22","sva","SV","a@","sva","noun-adj",""
"23","mate","MAT","e","mata","noun-adj",""
"24","praveśayā","PRAVEŚ","ayā","praveśā","noun-adj",""
"25","māsa","","","","ind",""
"26","/","","","","punct",""
"","</s>","","","","",""
"","<s number=""40"">","","","","",""
"1","sa","","","sa_saha","ind",""
"2","magadheṣu","MAGADH","eṣu","magadha","noun-adj",""
"3","rājñā","RĀJ","ñā","rājan","noun-adj",""
"4","bimbisāreṇ","BIMBISĀR","eṇ","bimbisāra","noun-adj",""
"5","ātivelaṃ","ATIVEL","aṃ","ativela","noun-adj",""
"6","pūjyamānaś","PŪJ","yamānaś","pūj","verb","pūj"
"7","ciram","CIRA","m","cirā","noun-adj",""
"8","uvāsa","UVĀS","a","uvāsa","noun-adj",""
"9","/","","","","punct",""
"","</s>","","","","",""
"","<s number=""41"">","","","","",""
"1","punar","","","punar","ind",""
"2","utsukasya","UTS","ukasya","utsu","noun-adj",""
"3","pitur","PIT","ur","pitṛ","noun-adj",""
"4","darśanāya","DARŚAN","āya","darśana","noun-adj",""
"5","kapilavastu","KAPILAVAST","u@","kapilavastu","noun-adj",""
"6","nagaraṃ","NAGAR","aṃ","nagara","noun-adj",""
"7","gatvā","GAT","vā","gata","noun-adj",""
"8","sva","SV","a@","sva","noun-adj",""
"9","putraṃ","PUTR","aṃ","putra","noun-adj",""
"10","rāhulaṃ","RĀHUL","aṃ","rāhula","noun-adj",""
"11","sva","SV","a@","sva","noun-adj",""
"12","mate","MAT","e","mata","noun-adj",""
"13","prāveśayat","PRĀVEŚAY","at","prāveśayat","noun-adj",""
"14","/","","","","punct",""
"","</s>","","","","",""
"","<s number=""42"">","","","","",""
"1","pitṛ","PIT","ṛ@","pitṛ","noun-adj",""
"2","niryāṇāt","NIRYĀṆ","āt","niryāṇa","noun-adj",""
"3","parato","PAR","ato","para","noun-adj",""
"4","mātṛṣv","MĀT","ṛṣv","mātṛ","noun-adj",""
"5","a","","","alpha_privativum","ind",""
"6","sāraṃ","SĀR","aṃ","sāra","noun-adj",""
"7","bhāryāṃ","BHĀRY","āṃ","bhāryā","noun-adj",""
"8","ca","","","ca","ind",""
"9","sa","","","sa_saha","ind",""
"10","kāṣāyaṃ","KĀṢĀY","aṃ","kāṣāya","noun-adj",""
"11","grāhayā","GRĀH","ayā","grāhā","noun-adj",""
"12","māsa","","","","ind",""
"13","/","","","","punct",""
"","</s>","","","","",""
"","<s number=""43"">","","","","",""
"1","atha","","","atha","ind",""
"2","munir","MUN","ir","muni","noun-adj",""
"3","an","","","alpha_privativum","ind",""
"4","apāyinīṃ","APĀY","inīṃ","apāyin","noun-adj",""
"5","kīrtti","KĪRTT","i","kīrtti","noun-adj",""
"6","jagati","JAGAT","i","jagat","noun-adj",""
"7","pratiṣṭhāpya","PRATIṢṬHĀP","ya","prasthā","verb","pratiṣṭhā"
"8","2624","","","","ind",""
"9","tame","TAM","e","tama","noun-adj",""
"10","kali","KAL","i@","kali","noun-adj",""
"11","varṣe","VARṢ","e","varṣa","noun-adj",""
"12","nirvāṇaṃ","NIRVĀṆ","aṃ","nirvāṇa","noun-adj",""
"13","prapede","PRAPED","e","prapeda","noun-adj",""
"14","/","","","","punct",""
"","</s>","","","","",""
"","<s number=""44"">","","","","",""
"1","enaṃ","","","ena","ind",""
"2","muniṃ","MUN","iṃ","muni","noun-adj",""
"3","viṣṇa","VIṢṆ","a@","viṣṇa","noun-adj",""
"4","orava","ORAV","a@","orava","noun-adj",""
"5","tāraṃ","TĀR","aṃ","tāra","noun-adj",""
"6","purāṇāni","PURĀṆ","āni","purāṇa","noun-adj",""
"7","kīrtayanti","KĪRT","ayanti","kīrt","verb",""
"8","//","","","","punct",""
"","</s>","","","","",""
"","</page>","","","","",""
"","</doc>","","","","",""
