"WordID","word","NormSTEM","suffix","lemma","PoS","Root"
"","<doc textid = ""svalpaksaraprajjaparamita"" genre = ""sūtra"" title = ""svalpākṣaraprajñāpāramitā"" author = ""n /a"" discourse = ""prajñāpāramitā"" tradition = ""tantra"" period = ""commentarial"" source = ""gretil accessed aug 2019 : http://gretil.sub.uni-goettingen.de/gretil/corpustei/sa_gretilbuddh _ svalpaksara prajnaparamita base on the e. by p.l. vaiya in_ mahayana-sutra-samgrahah_final.xml"" date_range = ""uncertain"" notes = ""alternative genre: tantra or dhāraṇī"" religion = ""buddh"" edition = ""based on the ed. by p.l. vaidya 1961"" digitization = ""members of the sanskrit buddhist input project"" segmentation_lemmatization = ""ligeia lugli & buddhist translators workbench team"" metadata_enrichment = ""bruno galasek-hul & buddhist translators workbench team"" proofreader = ""n/a"" permission = ""permission for derivatives from m. mehner on behalf of gretil"" reconstructions = ""none"">","","","","",""
"","<page number=""93"">","","","","",""
"","<s number=""1"">","","","","",""
"1","svalpa","SVALP","a@","svalpa","noun-adj",""
"2","ākṣarā","ĀKṢAR","ā","ākṣarati","noun-adj",""
"3","prajñāpāramitā","PRAJÑĀPĀRAMIT","ā","prajñāpāramitā","noun-adj",""
"4","/","","","","punct",""
"","</s>","","","","",""
"","<s number=""2"">","","","","",""
"1","namaḥ","NAM","aḥ","nama","noun-adj",""
"2","sarva","SARV","a@","sarva","noun-adj",""
"3","buddha","BUDDH","a@","buddha","noun-adj",""
"4","bodhisattvebhyaḥ","BODHISATTV","ebhyaḥ","bodhisattva","noun-adj",""
"5","//","","","","punct",""
"","</s>","","","","",""
"","<s number=""3"">","","","","",""
"1","evaṃ","","","eva","ind",""
"2","mayā","","","mat","pron",""
"3","śrutam","ŚRUT","am","śruta","noun-adj",""
"4","/","","","","punct",""
"","</s>","","","","",""
"","<s number=""4"">","","","","",""
"1","ekasmin","EK","asmin","eka","noun-adj",""
"2","samaye","SAMAY","e","samaya","noun-adj",""
"3","bhagavān","BHAGAV","ān","bhagavat","noun-adj",""
"4","rājagṛhe","RĀJAGṚH","e","rājagṛha","noun-adj",""
"5","viharati","VIHAR","ati","vihar","verb","vihṛ"
"6","sma","","","sma","ind",""
"7","gṛdhra","GṚDHR","a@","gṛdhra","noun-adj",""
"8","kūṭe","KŪṬ","e","kūṭa","noun-adj",""
"9","parvate","PARVAT","e","parvata","noun-adj",""
"10","mahatā","MAHAT","ā","mahat","noun-adj",""
"11","bhikṣu","BHIKṢ","u@","bhikṣu","noun-adj",""
"12","saṃghena","SAṂGH","ena","saṃgha","noun-adj",""
"13","sārdhaṃ","SĀRDH","aṃ","sārdha","noun-adj",""
"14","dvādaśa","DVĀDAŚ","a@","dvādaśa","noun-adj",""
"15","sāhasra","SĀHASR","a@","sāhasra","noun-adj",""
"16","pañca","PAÑC","a@","pañca","noun-adj",""
"17","śatair","ŚAT","air","śata","noun-adj",""
"18","bodhisattva","BODHISATTV","a@","bodhisattva","noun-adj",""
"19","koṭi","KOṬ","i@","koṭi","noun-adj",""
"20","niyuta","NIYUT","a@","niyuta","noun-adj",""
"21","śatasahasraiḥ","ŚATASAHASR","aiḥ","śatasahasra","noun-adj",""
"22","sārdhaṃ","SĀRDH","aṃ","sārdha","noun-adj",""
"23","viharati","VIHAR","ati","vihar","verb","vihṛ"
"24","sma","","","sma","ind",""
"25","/","","","","punct",""
"","</s>","","","","",""
"","<s number=""5"">","","","","",""
"1","loka","LOK","a@","loka","noun-adj",""
"2","pāla","PĀL","a@","pāla","noun-adj",""
"3","ādi","ĀD","i@","ādi","noun-adj",""
"4","deva","DEV","a@","deva","noun-adj",""
"5","koṭi","KOṬ","i","koṭi","noun-adj",""
"6","niyuta","NIYUT","a@","niyuta","noun-adj",""
"7","sahasraiḥ","SAHASR","aiḥ","sa_saha","ind",""
"8","parivṛtaḥ","PARIVṚT","aḥ","parivṛta","noun-adj",""
"9","puraskṛtaḥ","PURASKṚT","aḥ","puraskṛta","noun-adj",""
"10","śrī","ŚRĪ","","śrī","noun-adj",""
"11","siṃha","SIṂH","a@","siṃha","noun-adj",""
"12","āsane","ĀSAN","e","āsana","noun-adj",""
"13","viharati","VIHAR","ati","vihar","verb","vihṛ"
"14","sma","","","sma","ind",""
"15","//","","","","punct",""
"","</s>","","","","",""
"","<s number=""6"">","","","","",""
"1","atha","","","atha","ind",""
"2","khalu","KHAL","u","khal","verb",""
"3","bodhisattvo","BODHISATTV","o","bodhisattva","noun-adj",""
"4","mahāsattvo","MAHĀSATTV","o","mahāsattva","noun-adj",""
"5","ārya","ĀRY","a@","ārya","noun-adj",""
"6","āvalokiteśvaro","AVALOKITEŚVAR","o","avalokiteśvara","noun-adj",""
"7","utthāya","UTTHĀY","a","utthāya","noun-adj",""
"8","āsanād","ĀSAN","ād","āsana","noun-adj",""
"9","ekam","EK","am","eka","noun-adj",""
"10","aṃ","","","","ind",""
"11","samuttara","SAMUTTAR","a@","samuttara","noun-adj",""
"12","āsaṅgaṃ","ĀSAṄG","aṃ","āsaṅga","noun-adj",""
"13","kṛtvā","KṚT","vā","kṛta","noun-adj",""
"14","dakṣiṇaṃ","DAKṢIṆ","aṃ","dakṣiṇa","noun-adj",""
"15","jānumaṇḍalaṃ","JĀNUMAṆḌAL","aṃ","jānumaṇḍala","noun-adj",""
"16","pṛthivyāṃ","PṚTHIV","yāṃ","pṛthivī","noun-adj",""
"17","pratiṣṭhāpya","PRATIṢṬHĀPY","a","pratiṣṭhāpya","noun-adj",""
"18","yena","","","yad","pron",""
"19","bhagavāṃs","BHAGAV","āṃs","bhagavat","noun-adj",""
"20","ten","","","tad","pron",""
"21","^","","","","",""
"22","āñjaliṃ","AÑJAL","iṃ","añjali","noun-adj",""
"23","praṇamya","PRAṆAMY","a","praṇamya","noun-adj",""
"24","prahasita","PRAHASIT","a@","prahasita","noun-adj",""
"25","vadano","VADAN","o","vadana","noun-adj",""
"26","bhūtvā","BHŪ","tvā","bhav","verb","bhū"
"27","bhagavantam","BHAGAV","antam","bhagavat","noun-adj",""
"28","etad","ETAD","","tad","pron",""
"29","avocat","AVOCAT","","vak","verb","vac"
"30","—","","","","punct",""
"31","deśayatu","DEŚ","ayatu","deś","verb","diś"
"32","bhagavān","BHAGAV","ān","bhagavat","noun-adj",""
"33","prajñāpāramitāṃ","PRAJÑĀPĀRAMIT","āṃ","prajñāpāramitā","noun-adj",""
"34","svalpa","SVALP","a@","svalpa","noun-adj",""
"35","ākṣarāṃ","ĀKṢAR","āṃ","ākṣarati","noun-adj",""
"36","mahā","MAH","ā@","mahat","noun-adj",""
"37","puṇyām","PUṆY","ām","puṇyā","noun-adj",""
"38","/","","","","punct",""
"","</s>","","","","",""
"","<s number=""7"">","","","","",""
"1","yasyāḥ","","","yad","pron",""
"2","śravaṇa","ŚRAVAṆ","a@","śravaṇa","noun-adj",""
"3","mātreṇa","MĀTR","eṇa","mātra","noun-adj",""
"4","sarva","SARV","a@","sarva","noun-adj",""
"5","sattvāḥ","SATTV","āḥ","sattva","noun-adj",""
"6","sarva","SARV","a@","sarva","noun-adj",""
"7","karma","KARM","a@","karman","noun-adj",""
"8","āvaraṇāni","ĀVARAṆ","āni","āvaraṇa","noun-adj",""
"9","kṣapayiṣyanti","KṢAP","ayiṣyanti","kṣap","verb",""
"10","/","","","","punct",""
"","</s>","","","","",""
"","<s number=""8"">","","","","",""
"1","niyataṃ","NIYAT","aṃ","niyata","noun-adj",""
"2","ca","","","ca","ind",""
"3","bodhi","BODH","i@","bodhi","noun-adj",""
"4","parāyaṇā","PARĀYAṆ","ā","parāyaṇa","noun-adj",""
"5","bhaviṣyanti","BHAV","iṣyanti","bhav","verb","bhū"
"6","/","","","","punct",""
"","</s>","","","","",""
"","<s number=""9"">","","","","",""
"1","ye","","","yad","pron",""
"2","ca","","","ca","ind",""
"3","sattvā","SATTV","ā","sattva","noun-adj",""
"4","mantra","MANTR","a@","mantra","noun-adj",""
"5","sādhane","SĀDHAN","e","sādhana","noun-adj",""
"6","udyuktās","UDYUKT","ās","udyukta","noun-adj",""
"7","teṣāṃ","","","tad","pron",""
"8","c","","","ca","ind",""
"9","^","","","","",""
"10","ā","","","alpha_privativum","ind",""
"11","vighnena","VIGHN","ena","vighna","noun-adj",""
"12","mantrāḥ","MANTR","āḥ","mantra","noun-adj",""
"13","sidhyanti","SIDH","yanti","sidh","verb",""
"14","//","","","","punct",""
"","</s>","","","","",""
"","<s number=""10"">","","","","",""
"1","atha","","","atha","ind",""
"2","khalu","KHAL","u","khal","verb",""
"3","bhagavān","BHAGAV","ān","bhagavat","noun-adj",""
"4","ārya","ĀRY","a@","ārya","noun-adj",""
"5","āvalokiteśvarāya","AVALOKITEŚVAR","āya","avalokiteśvara","noun-adj",""
"6","bodhisattvāya","BODHISATTV","āya","bodhisattva","noun-adj",""
"7","mahāsattvāya","MAHĀSATTV","āya","mahāsattva","noun-adj",""
"8","mahākaruṇi","MAHĀKARUṆ","i@","mahākaruṇi","noun-adj",""
"9","kāya","KĀY","a","kāya","noun-adj",""
"10","sādhukāram","SĀDHUKĀR","am","sādhukāra","noun-adj",""
"11","a","","","alpha_privativum","ind",""
"12","dāt","DĀT","","dāta","noun-adj",""
"13","—","","","","punct",""
"14","sādhu","SĀDH","u@","sādhu","noun-adj",""
"15","sādhu","SĀDH","u@","sādhu","noun-adj",""
"16","kulaputra","KULAPUTR","a","kulaputra","noun-adj",""
"17","/","","","","punct",""
"","</s>","","","","",""
"","<s number=""11"">","","","","",""
"1","yas","","","yad","pron",""
"2","tvaṃ","","","tvat","pron",""
"3","sarva","SARV","a@","sarva","noun-adj",""
"4","sattvānām","SATTV","ānām","sattva","noun-adj",""
"5","arthāya","ARTH","āya","artha","noun-adj",""
"6","hitāya","HIT","āya","hita","noun-adj",""
"7","sukhāya","SUKH","āya","sukha","noun-adj",""
"8","pradhānāya","PRADHĀN","āya","pradhāna","noun-adj",""
"9","ca","","","ca","ind",""
"10","dīrgharātraṃ","DĪRGHARĀTR","aṃ","dīrgharātra","noun-adj",""
"11","niyuktaḥ","NIYUKT","aḥ","niyukta","noun-adj",""
"12","/","","","","punct",""
"","</s>","","","","",""
"","<s number=""12"">","","","","",""
"1","tena","","","tad","pron",""
"2","hi","","","hi","ind",""
"3","tvaṃ","","","tvat","pron",""
"4","kulaputra","KULAPUTR","a","kulaputra","noun-adj",""
"5","śṛṇu","ŚṚṆ","u","śṛṇ","verb","śru"
"6","/","","","","punct",""
"","</s>","","","","",""
"","<s number=""13"">","","","","",""
"1","sādhu","SĀDH","u","sādh","verb",""
"2","ca","","","ca","ind",""
"3","suṣṭhu","SUṢṬH","u","suṣṭhu","noun-adj",""
"4","ca","","","ca","ind",""
"5","manasi","MANAS","i","manas","noun-adj",""
"6","kuru","KUR","u","kar","verb","kṛ"
"7","/","","","","punct",""
"","</s>","","","","",""
"","<s number=""14"">","","","","",""
"1","bhāṣiṣye","BHĀṢ","iṣye","bhāṣ","verb","bhāṣ"
"2","ahaṃ","AHAṂ","","mat","pron",""
"3","te","","","tad","pron",""
"4","prajñāpāramitāṃ","PRAJÑĀPĀRAMIT","āṃ","prajñāpāramitā","noun-adj",""
"5","svalpa","SVALP","a@","svalpa","noun-adj",""
"6","ākṣarāṃ","ĀKṢAR","āṃ","ākṣarati","noun-adj",""
"7","mahā","MAH","ā@","mahat","noun-adj",""
"8","puṇyām","PUṆY","ām","puṇyā","noun-adj",""
"9","/","","","","punct",""
"","</s>","","","","",""
"","<s number=""15"">","","","","",""
"1","yasyāḥ","","","yad","pron",""
"2","śravaṇa","ŚRAVAṆ","a@","śravaṇa","noun-adj",""
"3","mātreṇa","MĀTR","eṇa","mātra","noun-adj",""
"4","sarva","SARV","a@","sarva","noun-adj",""
"5","sattvāḥ","SATTV","āḥ","sattva","noun-adj",""
"6","sarva","SARV","a@","sarva","noun-adj",""
"7","karma","KARM","a@","karman","noun-adj",""
"8","āvaraṇāni","ĀVARAṆ","āni","āvaraṇa","noun-adj",""
"9","kṣapayiṣyanti","KṢAP","ayiṣyanti","kṣap","verb",""
"10","/","","","","punct",""
"","</s>","","","","",""
"","<s number=""16"">","","","","",""
"1","niyataṃ","NIYAT","aṃ","niyata","noun-adj",""
"2","ca","","","ca","ind",""
"3","bodhi","BODH","i@","bodhi","noun-adj",""
"4","parāyaṇā","PARĀYAṆ","ā","parāyaṇa","noun-adj",""
"5","bhaviṣyanti","BHAV","iṣyanti","bhav","verb","bhū"
"6","/","","","","punct",""
"","</s>","","","","",""
"","<s number=""17"">","","","","",""
"1","ye","","","yad","pron",""
"2","ca","","","ca","ind",""
"3","sattvā","SATTV","ā","sattva","noun-adj",""
"4","mantra","MANTR","a@","mantra","noun-adj",""
"5","sādhane","SĀDHAN","e","sādhana","noun-adj",""
"6","udyuktās","UDYUKT","ās","udyukta","noun-adj",""
"7","teṣāṃ","","","tad","pron",""
"8","c","","","ca","ind",""
"9","^","","","","",""
"10","ā","","","alpha_privativum","ind",""
"11","vighnenaḥ","VIGHN","enaḥ","vighna","noun-adj",""
"12","mantrāḥ","MANTR","āḥ","mantra","noun-adj",""
"13","sidhyanti","SIDH","yanti","sidh","verb",""
"14","//","","","","punct",""
"","</s>","","","","",""
"","<s number=""18"">","","","","",""
"1","atha","","","atha","ind",""
"2","khalu","KHAL","u","khal","verb",""
"3","ārya","ĀRY","a@","ārya","noun-adj",""
"4","āvalokiteśvaro","AVALOKITEŚVAR","o","avalokiteśvara","noun-adj",""
"5","bodhisattvo","BODHISATTV","o","bodhisattva","noun-adj",""
"6","mahāsattvo","MAHĀSATTV","o","mahāsattva","noun-adj",""
"7","bhagavantam","BHAGAV","antam","bhagavat","noun-adj",""
"8","etad","ETAD","","tad","pron",""
"9","avocat","AVOCAT","","vak","verb","vac"
"10","—","","","","punct",""
"11","tena","","","tad","pron",""
"12","hi","","","hi","ind",""
"13","sugata","SUGAT","a","sugata","noun-adj",""
"14","bhāṣatu","BHĀṢ","atu","bhāṣ","verb","bhāṣ"
"15","sarva","SARV","a@","sarva","noun-adj",""
"16","sattvānām","SATTV","ānām","sattva","noun-adj",""
"17","arthāya","ARTH","āya","artha","noun-adj",""
"18","hitāya","HIT","āya","hita","noun-adj",""
"19","sukhāya","SUKH","āya","sukha","noun-adj",""
"20","ca","","","ca","ind",""
"21","//","","","","punct",""
"","</s>","","","","",""
"","<s number=""19"">","","","","",""
"1","atha","","","atha","ind",""
"2","khalu","KHAL","u","khal","verb",""
"3","bhagavāṃs","BHAGAV","āṃs","bhagavat","noun-adj",""
"4","tasyāṃ","","","tad","pron",""
"5","velāyāṃ","VEL","āyāṃ","velā","noun-adj",""
"6","sarva","SARV","a@","sarva","noun-adj",""
"7","duḥkha","DUḤKH","a@","duḥkha","noun-adj",""
"8","pramocano","PRAMOCAN","o","pramocana","noun-adj",""
"9","nāma","NĀM","a","nāman","noun-adj",""
"10","samādhiṃ","SAMĀDH","iṃ","samādhi","noun-adj",""
"11","samāpadyate","SAMĀPAD","yate","samāpad","verb","samāpad"
"12","sma","","","sma","ind",""
"13","/","","","","punct",""
"","</s>","","","","",""
"","<s number=""20"">","","","","",""
"1","yasya","","","yad","pron",""
"2","ca","","","ca","ind",""
"3","samādhiṃ","SAMĀDH","iṃ","samādhi","noun-adj",""
"4","samāpannasya","SAMĀPANN","asya","samāpanna","noun-adj",""
"5","bhagavata","BHAGAV","ata","bhagavat","noun-adj",""
"6","ūrṇākośa","ŪRṆĀKOŚ","a@","ūrṇākośa","noun-adj",""
"7","vivarālla","VIVAR","ālla","vivara","noun-adj",""
"8","vādan","VĀD","an@","vādat","noun-adj",""
"9","ekāni","EK","āni","eka","noun-adj",""
"10","raśmi","RAŚM","i@","raśmi","noun-adj",""
"11","koṭi","KOṬ","i@","koṭi","noun-adj",""
"12","niyuta","NIYUT","a@","niyuta","noun-adj",""
"13","śatasahasrāṇi","ŚATASAHASR","āṇi","śatasahasra","noun-adj",""
"14","niścaranti","NIŚCAR","anti","niścar","verb","niścar"
"15","sma","","","sma","ind",""
"16","/","","","","punct",""
"","</s>","","","","",""
"","<s number=""21"">","","","","",""
"1","taiś","","","","ind",""
"2","ca","","","ca","ind",""
"3","raśmibhiḥ","RAŚM","ibhiḥ","raśmi","noun-adj",""
"4","sarva","SARV","a@","sarva","noun-adj",""
"5","buddha","BUDDH","a@","buddha","noun-adj",""
"6","kṣetrāṇi","KṢETR","āṇi","kṣetra","noun-adj",""
"7","parisphuṭāny","PARISPHUṬ","āny","parisphuṭa","noun-adj",""
"8","abhūvan","ABHŪ","van","abhūvat","noun-adj",""
"9","/","","","","punct",""
"","</s>","","","","",""
"","<s number=""22"">","","","","",""
"1","ye","","","yad","pron",""
"2","ca","","","ca","ind",""
"3","sattvās","SATTV","ās","sattva","noun-adj",""
"4","tayā","","","tad","pron",""
"5","prabhayā","PRABHAY","ā","prabhayā","noun-adj",""
"6","spṛṣṭāḥ","SPṚṢṬ","āḥ","spṛṣṭa","noun-adj",""
"7","/","","","","punct",""
"","</s>","","","","",""
"","<s number=""23"">","","","","",""
"1","te","","","tad","pron",""
"2","sarve","SARV","e","sarva","noun-adj",""
"3","niyatā","NIYAT","ā","niyata","noun-adj",""
"4","abhūvann","ABHŪ","vann","abhūvat","noun-adj",""
"5","anuttarāya","ANUTTARĀY","a","anuttarāya","noun-adj",""
"6","samyaksaṃbodhau","SAMYAKSAṂBODH","au","samyaksaṃbodhi","noun-adj",""
"7","/","","","","punct",""
"","</s>","","","","",""
"","<s number=""24"">","","","","",""
"1","yāvan","YĀVAN","","yāvat","ind",""
"2","nārakāḥ","NĀRAK","āḥ","nāraka","noun-adj",""
"3","sattvāḥ","SATTV","āḥ","sattva","noun-adj",""
"4","sarve","SARV","e","sarva","noun-adj",""
"5","ca","","","ca","ind",""
"6","buddha","BUDDH","a@","buddha","noun-adj",""
"7","kṣetrāṇi","KṢETR","āṇi","kṣetra","noun-adj",""
"8","ṣaḍ","ṢAḌ","@","ṣaḍi","noun-adj",""
"9","vikāraṃ","VIKĀR","aṃ","vikāra","noun-adj",""
"10","pravi","PRAV","i@","pravi","noun-adj",""
"11","celuḥ","CEL","uḥ","celu","noun-adj",""
"12","/","","","","punct",""
"","</s>","","","","",""
"","<s number=""25"">","","","","",""
"1","divyāni","DIVY","āni","divya","noun-adj",""
"2","ca","","","ca","ind",""
"3","candana","CANDAN","a@","candana","noun-adj",""
"4","cūrṇa","CŪRṆ","a@","cūrṇa","noun-adj",""
"5","varṣāṇi","VARṢ","āṇi","varṣa","noun-adj",""
"6","tathāgata","TATHĀGAT","a@","tathāgata","noun-adj",""
"7","pāda","PĀD","a@","pāda","noun-adj",""
"8","mūlaṃ","MŪL","aṃ","mūla","noun-adj",""
"9","va","","","vai","ind",""
"10","varṣuḥ","VARṢ","uḥ","varṣu","noun-adj",""
"11","//","","","","punct",""
"","</s>","","","","",""
"","<s number=""26"">","","","","",""
"1","atha","","","atha","ind",""
"2","khalu","KHAL","u","khal","verb",""
"3","bhagavāṃs","BHAGAV","āṃs","bhagavat","noun-adj",""
"4","tasyāṃ","","","tad","pron",""
"5","velāyāṃ","VEL","āyāṃ","velā","noun-adj",""
"6","prajñāpāramitāṃ","PRAJÑĀPĀRAMIT","āṃ","prajñāpāramitā","noun-adj",""
"7","bhāṣate","BHĀṢ","ate","bhāṣ","verb","bhāṣ"
"8","sma","","","sma","ind",""
"9","/","","","","punct",""
"","</s>","","","","",""
"","<s number=""27"">","","","","",""
"1","tadyathā","","","tadyathā","ind",""
"2","—","","","","punct",""
"3","bodhisattvena","BODHISATTV","ena","bodhisattva","noun-adj",""
"4","mahāsattvena","MAHĀSATTV","ena","mahāsattva","noun-adj",""
"5","sama","SAM","a@","sama","noun-adj",""
"6","cittena","CITT","ena","citta","noun-adj",""
"7","bhavitavyam","BHAV","itavyam","bhav","verb","bhū"
"8","/","","","","punct",""
"","</s>","","","","",""
"","<s number=""28"">","","","","",""
"1","sarva","SARV","a@","sarva","noun-adj",""
"2","sattveṣu","SATTV","eṣu","sattva","noun-adj",""
"3","maitra","MAITR","a@","maitra","noun-adj",""
"4","cittena","CITT","ena","citta","noun-adj",""
"5","bhavitavyam","BHAV","itavyam","bhav","verb","bhū"
"6","/","","","","punct",""
"","</s>","","","","",""
"","<s number=""29"">","","","","",""
"1","kṛtajñena","KṚTAJÑ","ena","kṛtajña","noun-adj",""
"2","bhavitavyam","BHAV","itavyam","bhav","verb","bhū"
"3","/","","","","punct",""
"","</s>","","","","",""
"","<s number=""30"">","","","","",""
"1","kṛta","KṚT","a@","kṛta","noun-adj",""
"2","vedinā","VED","inā","vedi","noun-adj",""
"3","ca","","","ca","ind",""
"4","bhavitavyam","BHAV","itavyam","bhav","verb","bhū"
"5","/","","","","punct",""
"","</s>","","","","",""
"","<s number=""31"">","","","","",""
"1","sarva","SARV","a@","sarva","noun-adj",""
"2","pāpa","PĀP","a@","pāpa","noun-adj",""
"3","virata","VIRAT","a@","virata","noun-adj",""
"4","cittena","CITT","ena","citta","noun-adj",""
"5","bhavitavyam","BHAV","itavyam","bhav","verb","bhū"
"6","/","","","","punct",""
"","</s>","","","","",""
"","<s number=""32"">","","","","",""
"1","idaṃ","IDAṂ","","idam","pron",""
"2","ca","","","ca","ind",""
"3","prajñāpāramitā","PRAJÑĀPĀRAMIT","ā@","prajñāpāramitā","noun-adj",""
"4","hṛdayam","HṚDAY","am","hṛdaya","noun-adj",""
"5","āgrahītavyam","ĀGRAH","ītavyam","āgraha","noun-adj",""
"6","—","","","","punct",""
"7","namo","NAM","o","namas","noun-adj",""
"8","ratnatrayāya","RATNATRAY","āya","ratnatraya","noun-adj",""
"9","/","","","","punct",""
"","</s>","","","","",""
"","<s number=""33"">","","","","",""
"1","namaḥ","NAM","aḥ","nama","noun-adj",""
"2","śākyamunaye","ŚĀKYAMUN","aye","śākyamuni","noun-adj",""
"3","tathāgatāya","TATHĀGAT","āya","tathāgata","noun-adj",""
"4","arhate","ARHAT","e","arhat","noun-adj",""
"5","samyaksaṃbuddhāya","SAMYAKSAṂBUDDH","āya","samyaksaṃbuddha","noun-adj",""
"6","/","","","","punct",""
"","</s>","","","","",""
"","<s number=""34"">","","","","",""
"1","tadyathā","","","tadyathā","ind",""
"2","—oṃ","","","","punct",""
"3","mune","MUN","e","muni","noun-adj",""
"4","mune","MUN","e","muni","noun-adj",""
"5","mahāmunaye","MAHĀMUN","aye","mahāmuni","noun-adj",""
"6","svāhā","SVĀH","ā","svāhā","noun-adj",""
"7","//","","","","punct",""
"","</s>","","","","",""
"","<s number=""35"">","","","","",""
"1","asyāḥ","","","idam","pron",""
"2","prajñāpāramitāyā","PRAJÑĀPĀRAMIT","āyā","prajñāpāramitā","noun-adj",""
"3","lābhāt","LĀBH","āt","lābha","noun-adj",""
"4","mayā","","","mat","pron",""
"5","anuttarā","ANUTTAR","ā","anuttara","noun-adj",""
"6","samyaksaṃbodhir","SAMYAKSAṂBODH","ir","samyaksaṃbodhi","noun-adj",""
"7","anuprāptā","ANUPRĀPT","ā","anuprāpta","noun-adj",""
"8","/","","","","punct",""
"","</s>","","","","",""
"","<s number=""36"">","","","","",""
"1","sarva","SARV","a@","sarva","noun-adj",""
"2","buddhāś","BUDDH","āś","buddha","noun-adj",""
"3","ca","","","ca","ind",""
"4","ato","","","atas","ind",""
"5","niryātāḥ","NIRYĀT","āḥ","niryāta","noun-adj",""
"6","//","","","","punct",""
"","</s>","","","","",""
"","<s number=""37"">","","","","",""
"1","mayā","","","mat","pron",""
"2","api","","","api","ind",""
"3","iyam","","","idam","pron",""
"4","eva","EVA","","eva","ind",""
"5","svalp","SVALP","","svalpa","noun-adj",""
"6","/","","","","punct",""
"","</s>","","","","",""
"","<s number=""38"">","","","","",""
"","</page>","","","","",""
"","<page number=""94"">","","","","",""
"3","prajñāpāramitā","PRAJÑĀPĀRAMIT","ā","prajñāpāramitā","noun-adj",""
"4","śrutā","ŚRUT","ā","śruta","noun-adj",""
"5","mahā","MAH","ā@","mahat","noun-adj",""
"6","śākyamunes","ŚĀKYAMUN","es","śākyamuni","noun-adj",""
"7","tathāgatasya","TATHĀGAT","asya","tathāgata","noun-adj",""
"8","sākṣāt","SĀKṢĀT","","sākṣāta","noun-adj",""
"9","/","","","","punct",""
"","</s>","","","","",""
"","<s number=""39"">","","","","",""
"1","tena","","","tad","pron",""
"2","hi","","","hi","ind",""
"3","tvaṃ","","","tvat","pron",""
"4","sarva","SARV","a@","sarva","noun-adj",""
"5","bodhisattvānām","BODHISATTV","ānām","bodhisattva","noun-adj",""
"6","agrato","AGRAT","o","agratas","noun-adj",""
"7","buddhatve","BUDDH","atve","buddhatva","noun-adj",""
"8","ca","","","ca","ind",""
"9","vyākṛtaḥ","VYĀKṚT","aḥ","vyākṛta","noun-adj",""
"10","—","","","","punct",""
"11","bhaviṣyasi","BHAV","iṣyasi","bhav","verb","bhū"
"12","tvaṃ","","","tvat","pron",""
"13","māṇava","MĀṆAV","a","māṇava","noun-adj",""
"14","anāgate","ANĀGAT","e","anāgata","noun-adj",""
"15","adhvani","ADHV","ani","adhvat","noun-adj",""
"16","samantaraśmi","SAMANTARAŚM","i@","samantaraśmi","noun-adj",""
"17","samudgataḥ","SAMUDGAT","aḥ","samudgata","noun-adj",""
"18","śrīkūṭa","ŚRĪKŪṬ","a@","śrīkūṭa","noun-adj",""
"19","rājā","RĀJ","ā","rājan","noun-adj",""
"20","nāma","NĀM","a","nāman","noun-adj",""
"21","tathāgato","TATHĀGAT","o","tathāgata","noun-adj",""
"22","arhan","ARH","an","arhat","noun-adj",""
"23","samyaksaṃbuddho","SAMYAKSAṂBUDDH","o","samyaksaṃbuddha","noun-adj",""
"24","vidyācaraṇasaṃpannaḥ","VIDYĀCARAṆASAṂPANN","aḥ","vidyācaraṇasaṃpanna","noun-adj",""
"25","sugato","SUGAT","o","sugata","noun-adj",""
"26","loka","LOK","a@","loka","noun-adj",""
"27","vid","VID","","vid","noun-adj",""
"28","anuttaraḥ","ANUTTAR","aḥ","anuttara","noun-adj",""
"29","puruṣadamyasārathiḥ","PURUṢADAMYASĀRATH","iḥ","puruṣadamyasārathi","noun-adj",""
"30","śāstā","ŚĀST","ā","śastṛ","noun-adj",""
"31","devānāṃ","DEV","ānāṃ","deva","noun-adj",""
"32","ca","","","ca","ind",""
"33","manuṣyāṇāṃ","MANUṢY","āṇāṃ","manuṣya","noun-adj",""
"34","ca","","","ca","ind",""
"35","buddho","BUDDH","o","buddha","noun-adj",""
"36","bhagavān","BHAGAV","ān","bhagavat","noun-adj",""
"37","/","","","","punct",""
"","</s>","","","","",""
"","<s number=""40"">","","","","",""
"1","ba","","","","ind",""
"2","diyam","DIY","am","diya","noun-adj",""
"3","api","","","api","ind",""
"4","/","","","","punct",""
"","</s>","","","","",""
"","<s number=""41"">","","","","",""
"1","ye","","","yad","pron",""
"2","idaṃ","IDAṂ","","idam","pron",""
"3","nāmadheyaṃ","NĀMADHEY","aṃ","nāmadheya","noun-adj",""
"4","śroṣyanti","ŚROṢ","yanti","śroṣa","noun-adj",""
"5","dhārayiṣyanti","DHĀR","ayiṣyanti","dhar","verb","dhṛ"
"6","vācayiṣyanti","VĀC","ayiṣyanti","vāc","noun-adj",""
"7","likha","LIKH","a@","likha","noun-adj",""
"8","yayiṣyanti","Y","ayiṣyanti","","verb",""
"9","/","","","","punct",""
"","</s>","","","","",""
"","<s number=""42"">","","","","",""
"1","parebhyaś","PAR","ebhyaś","para","noun-adj",""
"2","ca","","","ca","ind",""
"3","vistareṇa","VISTAR","eṇa","vistara","noun-adj",""
"4","saṃprakāśayiṣyanti","SAMPRAKĀŚ","ayiṣyanti","samprakāśa","noun-adj",""
"5","/","","","","punct",""
"","</s>","","","","",""
"","<s number=""43"">","","","","",""
"1","pustaka","PUSTAK","a@","pustaka","noun-adj",""
"2","likhitam","LIKHIT","am","likhita","noun-adj",""
"3","api","","","api","ind",""
"4","kṛtvā","KṚT","vā","kṛta","noun-adj",""
"5","gṛhe","GṚH","e","gṛha","noun-adj",""
"6","dhārayiṣyanti","DHĀR","ayiṣyanti","dhar","verb","dhṛ"
"7","pūjayiṣyanti","PŪJ","ayiṣyanti","pūj","verb","pūj"
"8","/","","","","punct",""
"","</s>","","","","",""
"","<s number=""44"">","","","","",""
"1","te","","","tad","pron",""
"2","sarve","SARV","e","sarva","noun-adj",""
"3","alpa","ALP","a@","alpa","noun-adj",""
"4","opāyena","UPĀY","ena","upāya","noun-adj",""
"5","alpa","ALP","a@","alpa","noun-adj",""
"6","śravaṇena","ŚRAVAṆ","ena","śravaṇa","noun-adj",""
"7","ca","","","ca","ind",""
"8","tathāgatā","TATHĀGAT","ā","tathāgata","noun-adj",""
"9","bhaviṣyanti","BHAV","iṣyanti","bhav","verb","bhū"
"10","/","","","","punct",""
"","</s>","","","","",""
"","<s number=""45"">","","","","",""
"1","tadyathā","","","tadyathā","ind",""
"2","—oṃ","","","","punct",""
"3","jeya","JEY","a","jeya","noun-adj",""
"4","jeya","JEY","a","jeya","noun-adj",""
"5","padmābhe","PADMĀBH","e","padmābha","noun-adj",""
"6","avame","","","","ind",""
"7","avame","","","","ind",""
"8","sara","SAR","a","sara","noun-adj",""
"9","saraṇi","SARAṆ","i","saraṇi","noun-adj",""
"10","dhiridhiri","","","","ind",""
"11","devatā","DEVAT","ā","devatā","noun-adj",""
"12","anupālani","ANUPĀLAN","i","anupālani","noun-adj",""
"13","yuddh","YUDDH","","yuddha","noun-adj",""
"14","ottāriṇi","UTTĀR","iṇi","uttārin","noun-adj",""
"15","para","PAR","a@","para","noun-adj",""
"16","cakra","CAKR","a@","cakra","noun-adj",""
"17","nivāriṇi","NIVĀR","iṇi","nivārin","noun-adj",""
"18","pūraya","PŪRAY","a","pūrayati","noun-adj",""
"19","pūraya","PŪRAY","a","pūrayati","noun-adj",""
"20","bhagavati","BHAGAV","ati","bhagavat","noun-adj",""
"21","sarva","SARV","a","sarva","noun-adj",""
"22","āśā","","","","ind",""
"23","mama","MAM","a","mat","pron",""
"24","ca","","","ca","ind",""
"25","sarva","SARV","a@","sarva","noun-adj",""
"26","sattvānāṃ","SATTV","ānāṃ","sattva","noun-adj",""
"27","ca","","","ca","ind",""
"28","/","","","","punct",""
"","</s>","","","","",""
"","<s number=""46"">","","","","",""
"1","sarva","SARV","a@","sarva","noun-adj",""
"2","karma","KARM","a@","karman","noun-adj",""
"3","āvaraṇāni","ĀVARAṆ","āni","āvaraṇa","noun-adj",""
"4","viśodhaya","VIŚODHAY","a","viśodhayati","noun-adj",""
"5","/","","","","punct",""
"","</s>","","","","",""
"","<s number=""47"">","","","","",""
"1","buddha","BUDDH","a@","buddha","noun-adj",""
"2","ādhiṣṭhite","ADHIṢṬHIT","e","adhiṣṭhita","noun-adj",""
"3","svāhā","SVĀH","ā","svāhā","noun-adj",""
"4","//","","","","punct",""
"","</s>","","","","",""
"","<s number=""48"">","","","","",""
"1","iyaṃ","","","idam","pron",""
"2","sā","","","tad","pron",""
"3","kulaputra","KULAPUTR","a","kulaputra","noun-adj",""
"4","paramārtha","PARAMĀRTH","a@","paramārtha","noun-adj",""
"5","prajñāpāramitā","PRAJÑĀPĀRAMIT","ā","prajñāpāramitā","noun-adj",""
"6","sarva","SARV","a@","sarva","noun-adj",""
"7","buddhānāṃ","BUDDH","ānāṃ","buddha","noun-adj",""
"8","jananī","JANAN","ī","jananī","noun-adj",""
"9","bodhisattva","BODHISATTV","a@","bodhisattva","noun-adj",""
"10","mātā","MĀT","ā","mātṛ","noun-adj",""
"11","bodhi","BODH","i@","bodhi","noun-adj",""
"12","dātrī","DĀTR","ī","dātra","noun-adj",""
"13","pāpa","PĀP","a@","pāpa","noun-adj",""
"14","hārakā","HĀRAK","ā","hāraka","noun-adj",""
"15","/","","","","punct",""
"","</s>","","","","",""
"","<s number=""49"">","","","","",""
"1","sarva","SARV","a@","sarva","noun-adj",""
"2","buddhair","BUDDH","air","buddha","noun-adj",""
"3","api","","","api","ind",""
"4","na","","","na","ind",""
"5","śaknoti","ŚAKN","oti","śakn","verb","śak"
"6","asy","","","as","verb","as"
"7","ānuśaṃsā","ĀNUŚAṂS","ā","ānuśaṃsa","noun-adj",""
"8","vaktuṃ","VAKT","uṃ","vak","verb","vac"
"9","yāvat","YĀVAT","","yāvat","ind",""
"10","kalpa","KALP","a@","kalpa","noun-adj",""
"11","koṭi","KOṬ","i@","koṭi","noun-adj",""
"12","śatair","ŚAT","air","śata","noun-adj",""
"13","api","","","api","ind",""
"14","/","","","","punct",""
"","</s>","","","","",""
"","<s number=""50"">","","","","",""
"1","a","","","alpha_privativum","ind",""
"2","nayā","NAY","ā","naya","noun-adj",""
"3","paṭhita","PAṬHIT","a@","paṭhita","noun-adj",""
"4","mātreṇa","MĀTR","eṇa","mātra","noun-adj",""
"5","sarva","SARV","a@","sarva","noun-adj",""
"6","parṣan","PARṢ","an","parṣad","noun-adj",""
"7","maṇḍala","MAṆḌAL","a@","maṇḍala","noun-adj",""
"8","ābhiṣiktā","ABHIṢIKT","ā","abhiṣikta","noun-adj",""
"9","bhavanti","BHAV","anti","bhav","verb","bhū"
"10","/","","","","punct",""
"","</s>","","","","",""
"","<s number=""51"">","","","","",""
"1","sarve","SARV","e","sarva","noun-adj",""
"2","ca","","","ca","ind",""
"3","mantrāḥ","MANTR","āḥ","mantra","noun-adj",""
"4","abhimukhā","ABHIMUKH","ā","abhimukha","noun-adj",""
"5","bhavanti","BHAV","anti","bhav","verb","bhū"
"6","//","","","","punct",""
"","</s>","","","","",""
"","<s number=""52"">","","","","",""
"1","atha","","","atha","ind",""
"2","ārya","ĀRY","a@","ārya","noun-adj",""
"3","āvalokiteśvaro","AVALOKITEŚVAR","o","avalokiteśvara","noun-adj",""
"4","bodhisattvo","BODHISATTV","o","bodhisattva","noun-adj",""
"5","mahāsattvo","MAHĀSATTV","o","mahāsattva","noun-adj",""
"6","bhagavantam","BHAGAV","antam","bhagavat","noun-adj",""
"7","etad","ETAD","","tad","pron",""
"8","avocat","AVOCAT","","vak","verb","vac"
"9","—","","","","punct",""
"10","kena","","","kim","pron",""
"11","kāraṇena","KĀRAṆ","ena","kāraṇa","noun-adj",""
"12","bhagavan","BHAGAV","an","bhagavat","noun-adj",""
"13","iyaṃ","","","idam","pron",""
"14","svalpa","SVALP","a@","svalpa","noun-adj",""
"15","ākṣarā","ĀKṢAR","ā","ākṣarati","noun-adj",""
"16","prajñāpāramitā","PRAJÑĀPĀRAMIT","ā","prajñāpāramitā","noun-adj",""
"17","/","","","","punct",""
"","</s>","","","","",""
"","<s number=""53"">","","","","",""
"1","bhagavān","BHAGAV","ān","bhagavat","noun-adj",""
"2","āha","ĀH","a","ah","verb","ah"
"3","—","","","","punct",""
"4","alpa","ALP","a@","alpa","noun-adj",""
"5","opāyatvāt","UPĀY","atvāt","upāyatva","noun-adj",""
"6","/","","","","punct",""
"","</s>","","","","",""
"","<s number=""54"">","","","","",""
"1","ye","","","yad","pron",""
"2","api","","","api","ind",""
"3","sattvā","SATTV","ā","sattva","noun-adj",""
"4","manda","MAND","a@","manda","noun-adj",""
"5","āsvādāḥ","ĀSVĀD","āḥ","āsvāda","noun-adj",""
"6","/","","","","punct",""
"","</s>","","","","",""
"","<s number=""55"">","","","","",""
"1","te","","","tad","pron",""
"2","api","","","api","ind",""
"3","imāṃ","","","idam","pron",""
"4","prajñāpāramitāṃ","PRAJÑĀPĀRAMIT","āṃ","prajñāpāramitā","noun-adj",""
"5","svalpa","SVALP","a@","svalpa","noun-adj",""
"6","ākṣarāṃ","ĀKṢAR","āṃ","ākṣarati","noun-adj",""
"7","dhārayiṣyanti","DHĀR","ayiṣyanti","dhar","verb","dhṛ"
"8","vācayiṣyanti","VĀC","ayiṣyanti","vāc","noun-adj",""
"9","likhiṣyanti","LIKH","iṣyanti","likh","verb","likh"
"10","likhayiṣyanti","LIKH","ayiṣyanti","likh","verb",""
"11","/","","","","punct",""
"","</s>","","","","",""
"","<s number=""56"">","","","","",""
"1","te","","","tad","pron",""
"2","sarve","SARV","e","sarva","noun-adj",""
"3","alpa","ALP","a@","alpa","noun-adj",""
"4","opāyena","UPĀY","ena","upāya","noun-adj",""
"5","bodhi","BODH","i@","bodhi","noun-adj",""
"6","parāyaṇā","PARĀYAṆ","ā","parāyaṇa","noun-adj",""
"7","bhaviṣyanti","BHAV","iṣyanti","bhav","verb","bhū"
"8","/","","","","punct",""
"","</s>","","","","",""
"","<s number=""57"">","","","","",""
"1","anena","","","idam","pron",""
"2","kāraṇena","KĀRAṆ","ena","kāraṇa","noun-adj",""
"3","kulaputra","KULAPUTR","a","kulaputra","noun-adj",""
"4","iyaṃ","","","idam","pron",""
"5","saṃkṣiptā","SAṂKṢIPT","ā","saṃkṣiptā","noun-adj",""
"6","svalpa","SVALP","a@","svalpa","noun-adj",""
"7","ākṣarā","ĀKṢAR","ā","ākṣarati","noun-adj",""
"8","prajñāpāramitā","PRAJÑĀPĀRAMIT","ā","prajñāpāramitā","noun-adj",""
"9","//","","","","punct",""
"","</s>","","","","",""
"","<s number=""58"">","","","","",""
"1","evam","","","eva","ind",""
"2","ukte","UKT","e","ukta","noun-adj",""
"3","ārya","ĀRY","a@","ārya","noun-adj",""
"4","āvalokiteśvaro","AVALOKITEŚVAR","o","avalokiteśvara","noun-adj",""
"5","bodhisattvo","BODHISATTV","o","bodhisattva","noun-adj",""
"6","mahāsattvo","MAHĀSATTV","o","mahāsattva","noun-adj",""
"7","bhagavantam","BHAGAV","antam","bhagavat","noun-adj",""
"8","etad","ETAD","","tad","pron",""
"9","avocat","AVOCAT","","vak","verb","vac"
"10","—","","","","punct",""
"11","āścaryaṃ","ĀŚCARY","aṃ","āścarya","noun-adj",""
"12","bhagavan","BHAGAV","an","bhagavat","noun-adj",""
"13","/","","","","punct",""
"","</s>","","","","",""
"","<s number=""59"">","","","","",""
"1","parama","PARAM","a@","parama","noun-adj",""
"2","āścaryaṃ","ĀŚCARY","aṃ","āścarya","noun-adj",""
"3","sugata","SUGAT","a","sugata","noun-adj",""
"4","/","","","","punct",""
"","</s>","","","","",""
"","<s number=""60"">","","","","",""
"1","yāvad","YĀVAD","","yāvat","ind",""
"2","eva","","","eva","ind",""
"3","bhagavān","BHAGAV","ān","bhagavat","noun-adj",""
"4","sarva","SARV","a@","sarva","noun-adj",""
"5","sattva","SATTV","a@","sattva","noun-adj",""
"6","hitāya","HIT","āya","hita","noun-adj",""
"7","ayaṃ","AYAṂ","","idam","pron",""
"8","dharmaparyāyo","DHARMAPARYĀY","o","dharmaparyāya","noun-adj",""
"9","bhāṣito","BHĀṢIT","o","bhāṣita","noun-adj",""
"10","manda","MAND","a@","manda","noun-adj",""
"11","pudgalānām","PUDGAL","ānām","pudgala","noun-adj",""
"12","eva","","","eva","ind",""
"13","arthāya","ARTH","āya","artha","noun-adj",""
"14","hitāya","HIT","āya","hita","noun-adj",""
"15","sukhāya","SUKH","āya","sukha","noun-adj",""
"16","c","","","ca","ind",""
"17","^","","","","",""
"18","eti","","","iti","ind",""
"19","//","","","","punct",""
"","</s>","","","","",""
"","<s number=""61"">","","","","",""
"1","idam","IDAM","","idam","pron",""
"2","avocad","AVOCAD","","vak","verb","vac"
"3","bhagavān","BHAGAV","ān","bhagavat","noun-adj",""
"4","/","","","","punct",""
"","</s>","","","","",""
"","<s number=""62"">","","","","",""
"1","āttamanā","ĀTTAMAN","ā","āttamanas","noun-adj",""
"2","ārya","ĀRY","a@","ārya","noun-adj",""
"3","āvalokiteśvaro","AVALOKITEŚVAR","o","avalokiteśvara","noun-adj",""
"4","bodhisattvo","BODHISATTV","o","bodhisattva","noun-adj",""
"5","mahāsattvaḥ","MAHĀSATTV","aḥ","mahāsattva","noun-adj",""
"6","/","","","","punct",""
"","</s>","","","","",""
"","<s number=""63"">","","","","",""
"1","te","","","tad","pron",""
"2","ca","","","ca","ind",""
"3","bhikṣavas","BHIKṢ","avas","bhikṣu","noun-adj",""
"4","te","","","tad","pron",""
"5","ca","","","ca","ind",""
"6","bodhisattvāḥ","BODHISATTV","āḥ","bodhisattva","noun-adj",""
"7","sā","","","tad","pron",""
"8","ca","","","ca","ind",""
"9","sarvāvatī","SARV","āvatī","sarvāvat","noun-adj",""
"10","parṣat","PARṢ","at","parṣad","noun-adj",""
"11","sad","SAD","","sat","noun-adj",""
"12","eva","","","eva","ind",""
"13","mānuṣa","MĀNUṢ","a@","mānuṣa","noun-adj",""
"14","āsura","ĀSUR","a@","āsura","noun-adj",""
"15","gandharvaś","GANDHARV","aś","gandharva","noun-adj",""
"16","ca","","","ca","ind",""
"17","loko","LOK","o","loka","noun-adj",""
"18","bhagavato","BHAGAV","ato","bhagavat","noun-adj",""
"19","bhāṣitam","BHĀṢIT","am","bhāṣita","noun-adj",""
"20","abhyanandann","ABHYANAND","ann","abhyanandat","noun-adj",""
"21","iti","","","iti","ind",""
"22","//","","","","punct",""
"","</s>","","","","",""
"","<s number=""64"">","","","","",""
"","</s>","","","","",""
"","</page>","","","","",""
"","</doc>","","","","",""
