"WordID","word","NormSTEM","suffix","lemma","PoS","Root"
"","<doc textid = ""namastazatakaya"" genre = ""lit"" title = ""nāmāṣṭaśatakaya"" author = ""n/a "" discourse = ""poetry"" tradition = ""buddh"" period = ""commentarial"" source = ""dsbc accessed aug 2021"" date_range = ""11.-13. ce"" notes = ""see rangama chandawimala. 2016. heterodox buddhism: the school of abhayagiri. colombo. revised phd thesis; p. 206: the nāmāṣṭaśataka is believed to have been composed in sri lanka in the polonnaruva period by an unknown author."" religion = ""buddh"" edition = ""based on ? ? "" digitization = ""miroj skakya"" segmentation_lemmatization = ""ligeia lugli & buddhist translators workbench team"" metadata_enrichment = ""bruno galasek-hul & buddhist translators workbench team"" proofreader = ""n/a"" permission = """" reconstructions = ""none"">","","","","",""
"","<page number=""0000"">","","","","",""
"","<s number=""1"">","","","","",""
"1","nāma","NĀM","a@","nāman","noun-adj",""
"2","āṣṭa","AṢṬ","a@","aṣṭa","noun-adj",""
"3","śata","ŚAT","a@","śata","noun-adj",""
"4","kaya","KAY","a","kayā","noun-adj",""
"5","namaḥ","NAM","aḥ","nama","noun-adj",""
"6","śākyasiṃhāya","ŚĀKYASIṂH","āya","śākyasiṃha","noun-adj",""
"","</s>","","","","",""
"","<s number=""2"">","","","","",""
"1","sambuddha","SAMBUDDH","a","sambuddha","noun-adj",""
"2","puṇḍarīka","PUṆḌARĪK","a@","puṇḍarīka","noun-adj",""
"3","ākṣa","ĀKṢ","a","ākṣa","noun-adj",""
"4","sarvajña","SARVAJÑ","a","sarvajña","noun-adj",""
"5","karuṇa","KARUṆ","a@","karuṇā","noun-adj",""
"6","āspadam","ĀSPAD","am","āspada","noun-adj",""
"7","samantabhadra","SAMANTABHADR","a","samantabhadra","noun-adj",""
"8","śāstāra","ŚĀST","āra","śāstṛ","noun-adj",""
"9","śākyasiṃham","ŚĀKYASIṂH","am","śākyasiṃha","noun-adj",""
"10","namāmy","NAM","āmy","nam","verb","nam"
"11","aham","AHAM","","mat","pron",""
"12","/","","","","punct",""
"","</s>","","","","",""
"","<s number=""3"">","","","","",""
"1","śrī","ŚRĪ","","śrī","noun-adj",""
"2","ghana","GHAN","a","ghana","noun-adj",""
"3","śrī","ŚRĪ","","śrī","noun-adj",""
"4","mati","MAT","i","mati","noun-adj",""
"5","śreṣṭha","ŚREṢṬH","a","śreṣṭha","noun-adj",""
"6","śīla","ŚĪL","a@","śīla","noun-adj",""
"7","rāśi","RĀŚ","i","rāśi","noun-adj",""
"8","śivaṅ","ŚIV","aṅ","śiva","noun-adj",""
"9","karam","KAR","am","kara","noun-adj",""
"10","śrī","ŚRĪ","","śrī","noun-adj",""
"11","manta","MANT","a","manta","noun-adj",""
"12","śrī","ŚRĪ","","śrī","noun-adj",""
"13","kara","KAR","a","kara","noun-adj",""
"14","śānta","ŚĀNT","a","śānta","noun-adj",""
"15","śānta","ŚĀNT","a@","śānta","noun-adj",""
"16","veśa","VEŚ","a","veśa","noun-adj",""
"17","namāmy","NAM","āmy","nam","verb","nam"
"18","aham","AHAM","","mat","pron",""
"19","/","","","","punct",""
"","</s>","","","","",""
"","<s number=""4"">","","","","",""
"1","nairātmya","NAIRĀTMY","a@","nairātmya","noun-adj",""
"2","vādina","VĀD","ina","vādin","noun-adj",""
"3","siddha","SIDDH","a","siddha","noun-adj",""
"4","niravadya","NIRAVADY","a","niravadya","noun-adj",""
"5","nir","NIR","@","niḥ_privativum","ind",""
"6","āśravam","ĀŚRAV","am","āśrava","noun-adj",""
"7","nītijña","NĪTIJÑ","a","nītijña","noun-adj",""
"8","nirmala","NIRMAL","a@","nirmala","noun-adj",""
"9","ātmāna","ĀTM","āna","ātman","noun-adj",""
"10","niṣkalaṅkam","NIṢKALAṄK","am","niṣkalaṅka","noun-adj",""
"11","namāmy","NAM","āmy","nam","verb","nam"
"12","aham","AHAM","","mat","pron",""
"13","/","","","","punct",""
"","</s>","","","","",""
"","<s number=""5"">","","","","",""
"1","nirvāda","NIRVĀ","da","nirvā","noun-adj",""
"2","nir","NIR","","niḥ_privativum","ind",""
"3","a","","","alpha_privativum","ind",""
"4","haṅkāra","HAṄKĀR","a","haṅkāra","noun-adj",""
"5","nir","NIR","@","niḥ_privativum","ind",""
"6","vikalpa","VIKALP","a","vikalpa","noun-adj",""
"7","tathāgatām","TATHĀGAT","ām","tathāgata","noun-adj",""
"8","nirdhūta","NIRDHŪT","a@","nirdhūta","noun-adj",""
"9","nikhila","NIKHIL","a@","nikhila","noun-adj",""
"10","kleśa","KLEŚ","a","kleśa","noun-adj",""
"11","niṣ","NIṢ","@","niḥ_privativum","ind",""
"12","prpañca","PRPAÑC","a","prpañca","noun-adj",""
"13","namāmy","NAM","āmy","nam","verb","nam"
"14","aham","AHAM","","mat","pron",""
"15","/","","","","punct",""
"","</s>","","","","",""
"","<s number=""6"">","","","","",""
"1","viśveśvara","VIŚVEŚVAR","a","viśveśvara","noun-adj",""
"2","vimukti","VIMUKT","i","vimukti","noun-adj",""
"3","jña","JÑ","a","jña","noun-adj",""
"4","viśvarūpa","VIŚVARŪP","a","viśvarūpa","noun-adj",""
"5","vināyakam","VINĀYAK","am","vināyaka","noun-adj",""
"6","viśva","VIŚV","a@","viśva","noun-adj",""
"7","lakṣaṇa","LAKṢAṆ","a@","lakṣaṇa","noun-adj",""
"8","sampūrṇa","SAMPŪRṆ","a","sampūrṇa","noun-adj",""
"9","vītarāga","VĪTARĀG","a","vītarāga","noun-adj",""
"10","namāmy","NAM","āmy","nam","verb","nam"
"11","aham","AHAM","","mat","pron",""
"12","/","","","","punct",""
"","</s>","","","","",""
"","<s number=""7"">","","","","",""
"1","vidya","VIDY","a@","vidyā","noun-adj",""
"2","ācaraṇa","ĀCARAṆ","a@","ācaraṇa","noun-adj",""
"3","sampanna","SAMPANN","a","sampanna","noun-adj",""
"4","viśveśa","VIŚVEŚ","a","viśveśa","noun-adj",""
"5","vimala","VIMAL","a@","vimala","noun-adj",""
"6","prabham","PRABH","am","prabha","noun-adj",""
"7","vinīta","VINĪT","a@","vinīta","noun-adj",""
"8","veśa","VEŚ","a","veśa","noun-adj",""
"9","vipula","VIPUL","a","vipula","noun-adj",""
"10","vīta","VĪT","a@","vīta","noun-adj",""
"11","doṣa","DOṢ","a","doṣa","noun-adj",""
"12","namāmy","NAM","āmy","nam","verb","nam"
"13","aham","AHAM","","mat","pron",""
"14","/","","","","punct",""
"","</s>","","","","",""
"","<s number=""8"">","","","","",""
"1","durdānta","DURDĀNT","a@","durdānta","noun-adj",""
"2","damaka","DAM","aka","damaka","noun-adj",""
"3","sarvya","SARV","ya","sarv","verb",""
"4","śuddha","ŚUDDH","a","śuddha","noun-adj",""
"5","śauddhodani","ŚAUDDHODAN","i","śauddhodani","noun-adj",""
"6","munim","MUN","im","muni","noun-adj",""
"7","sugata","SUGAT","a","sugata","noun-adj",""
"8","sugati","SUGAT","i","sugati","noun-adj",""
"9","saumya","SAUMY","a","saumya","noun-adj",""
"10","śubhra","ŚUBH","ra","śubha","noun-adj",""
"11","kīrtri","KĪRTR","i","kīrtri","noun-adj",""
"12","namāmy","NAM","āmy","nam","verb","nam"
"13","aham","AHAM","","mat","pron",""
"14","/","","","","punct",""
"","</s>","","","","",""
"","<s number=""9"">","","","","",""
"1","yogi","YOG","i@","yogin","noun-adj",""
"2","īśvara","ĪŚVAR","a","īśvara","noun-adj",""
"3","daśabala","DAŚABAL","a","daśabala","noun-adj",""
"4","loka","LOK","a@","loka","noun-adj",""
"5","jña","JÑ","a","jña","noun-adj",""
"6","loka","LOK","a@","loka","noun-adj",""
"7","pūjitam","PŪJIT","am","pūjita","noun-adj",""
"8","loka","LOK","a@","loka","noun-adj",""
"9","ācāryya","ĀCĀRY","ya","ācārya","noun-adj",""
"10","nir","NIR","@","niḥ_privativum","ind",""
"11","ācāryya","ĀCĀRY","ya","ācārya","noun-adj",""
"12","lokanātha","LOKANĀTH","a","lokanātha","noun-adj",""
"13","namāmy","NAM","āmy","nam","verb","nam"
"14","aham","AHAM","","mat","pron",""
"15","/","","","","punct",""
"","</s>","","","","",""
"","<s number=""10"">","","","","",""
"1","kalaṅka","KALAṄK","a@","kalaṅka","noun-adj",""
"2","mukta","MUKT","a","mukta","noun-adj",""
"3","kāmārim","KĀMĀR","im","kāmāri","noun-adj",""
"4","a","","","alpha_privativum","ind",""
"5","kalaṅka","KALAṄK","a","kalaṅka","noun-adj",""
"6","kala","KAL","a@","kala","noun-adj",""
"7","ādharam","ĀDHAR","am","ādhara","noun-adj",""
"8","kānta","KĀNT","a@","kānta","noun-adj",""
"9","mūrtti","MŪRT","i","mūrti","noun-adj",""
"10","dayā","DAY","ā@","dayā","noun-adj",""
"11","pātra","PĀTR","a","pātra","noun-adj",""
"12","kanaka","KANAK","a@","kanaka","noun-adj",""
"13","ābha","ĀBH","a","ābha","noun-adj",""
"14","namāmy","NAM","āmy","nam","verb","nam"
"15","aham","AHAM","","mat","pron",""
"16","/","","","","punct",""
"","</s>","","","","",""
"","<s number=""11"">","","","","",""
"1","parama","PARAM","a@","parama","noun-adj",""
"2","ārttha","ARTH","a","artha","noun-adj",""
"3","para","PAR","a@","para","noun-adj",""
"4","jyoti","JYOT","i","jyoti","noun-adj",""
"5","parama","PARAM","a","parama","noun-adj",""
"6","parama","PARAM","a@","parama","noun-adj",""
"7","eśvaram","EŚVAR","am","eśvara","noun-adj",""
"8","bhava","BHAV","a@","bhava","noun-adj",""
"9","ābhava","ĀBHAV","a@","ābhav","verb","ābhū"
"10","kara","KAR","a","kara","noun-adj",""
"11","bhavya","BHAV","ya","bhav","verb","bhū"
"12","bhagavanta","BHAGAV","anta","bhagavat","noun-adj",""
"13","namāmy","NAM","āmy","nam","verb","nam"
"14","aham","AHAM","","mat","pron",""
"15","/","","","","punct",""
"","</s>","","","","",""
"","<s number=""12"">","","","","",""
"1","mahāmati","MAHĀMAT","i","mahāmati","noun-adj",""
"2","mahāvīryya","MAHĀVĪRY","ya","mahāvīrya","noun-adj",""
"3","maha","MAH","a@","mahat","noun-adj",""
"4","ābhijña","ABHIJÑ","a","abhijña","noun-adj",""
"5","mahābalam","MAHĀBAL","am","mahābala","noun-adj",""
"6","maha","MAH","a@","mahat","noun-adj",""
"7","odyama","UDYAM","a","udyama","noun-adj",""
"8","mahā","MAH","ā@","mahat","noun-adj",""
"9","dhairyya","DHAIRY","ya","dhairya","noun-adj",""
"10","mahā","MAH","ā@","mahat","noun-adj",""
"11","bāhu","BĀH","u@","bāhu","noun-adj",""
"12","namāmy","NAM","āmy","nam","verb","nam"
"13","aham","AHAM","","mat","pron",""
"14","/","","","","punct",""
"","</s>","","","","",""
"","<s number=""13"">","","","","",""
"1","ādya","ĀD","ya","ād","verb",""
"2","pavitra","PAVITR","a","pavitra","noun-adj",""
"3","sarvīyam","SARVĪY","am","sarvīya","noun-adj",""
"4","aparājitam","APARĀJIT","am","aparājita","noun-adj",""
"5","a","","","alpha_privativum","ind",""
"6","cyutam","CYUT","am","cyuta","noun-adj",""
"7","mita","MIT","a","mita","noun-adj",""
"8","parahita","PARAHIT","a","parahita","noun-adj",""
"9","nātham","NĀTH","am","nātha","noun-adj",""
"10","amitābha","AMITĀBH","a","amitābha","noun-adj",""
"11","namāmy","NAM","āmy","nam","verb","nam"
"12","aham","AHAM","","mat","pron",""
"13","/","","","","punct",""
"","</s>","","","","",""
"","<s number=""14"">","","","","",""
"1","catur","CAT","ur","catur","noun-adj",""
"2","mārāri","MĀRĀR","i@","mārāri","noun-adj",""
"3","vijita","VIJIT","a","vijita","noun-adj",""
"4","tatva","TATV","a@","tatva","noun-adj",""
"5","jña","JÑ","a","jña","noun-adj",""
"6","śaṅkara","ŚAṄKAR","a","śaṅkara","noun-adj",""
"7","śivam","ŚIV","am","śiva","noun-adj",""
"8","satva","SATTV","a@","sattva","noun-adj",""
"9","sāra","SĀR","a","sāra","noun-adj",""
"10","sada","SAD","a@","sadā","noun-adj",""
"11","ācāra","ĀCĀR","a","ācāra","noun-adj",""
"12","sārtthavāha","SĀRTHAVĀH","a","sārthavāha","noun-adj",""
"13","namāmy","NAM","āmy","nam","verb","nam"
"14","aham","AHAM","","mat","pron",""
"15","/","","","","punct",""
"","</s>","","","","",""
"","<s number=""15"">","","","","",""
"1","deva","DEV","a@","deva","noun-adj",""
"2","deva","DEV","a","deva","noun-adj",""
"3","mahā","MAH","ā@","mahat","noun-adj",""
"4","deva","DEV","a","deva","noun-adj",""
"5","deva","DEV","a@","deva","noun-adj",""
"6","vanditam","VANDIT","am","vandita","noun-adj",""
"7","avyayam","AVYAY","am","avyaya","noun-adj",""
"8","pramāṇa","PRAMĀṆ","a@","pramāṇa","noun-adj",""
"9","ātīta","ATĪT","a@","atīta","noun-adj",""
"10","deva","DEV","a@","deva","noun-adj",""
"11","eśa","EŚ","a","eśa","noun-adj",""
"12","divya","DIVY","a@","divya","noun-adj",""
"13","rūpa","RŪP","a","rūpa","noun-adj",""
"14","namāmy","NAM","āmy","nam","verb","nam"
"15","aham","AHAM","","mat","pron",""
"16","/","","","","punct",""
"","</s>","","","","",""
"","<s number=""16"">","","","","",""
"1","jita","JIT","a@","jita","noun-adj",""
"2","endriya","INDRIY","a","indriya","noun-adj",""
"3","jita","JIT","a@","jita","noun-adj",""
"4","kleśa","KLEŚ","a","kleśa","noun-adj",""
"5","jinendra","JINENDR","a","jinendra","noun-adj",""
"6","puruṣa","PURUṢ","a@","puruṣa","noun-adj",""
"7","ottamam","UTTAM","am","uttama","noun-adj",""
"8","uttama","UTTAM","a","uttama","noun-adj",""
"9","sattama","SATTAM","a","sattama","noun-adj",""
"10","brāhma","BRĀHM","a","brāhma","noun-adj",""
"11","puṇya","PUṆY","a@","puṇya","noun-adj",""
"12","kṣetra","KṢETR","a","kṣetra","noun-adj",""
"13","namāmy","NAM","āmy","nam","verb","nam"
"14","aham","AHAM","","mat","pron",""
"15","/","","","","punct",""
"","</s>","","","","",""
"","<s number=""17"">","","","","",""
"1","bhaktyed","BHAKTY","ed","bhaktyā","noun-adj",""
"2","ayaḥ","","","","ind",""
"3","paṭhen","PAṬH","en","paṭha","noun-adj",""
"4","nitya","NITY","a","nitya","noun-adj",""
"5","prātar","PRĀT","ar","prāta","noun-adj",""
"6","utthāya","UTTHĀY","a","utthāya","noun-adj",""
"7","mānavaḥ","MĀNAV","aḥ","mānava","noun-adj",""
"8","nāma","NĀM","a@","nāman","noun-adj",""
"9","āṣṭa","AṢṬ","a@","aṣṭa","noun-adj",""
"10","śataka","ŚATAK","a","śataka","noun-adj",""
"11","puṇya","PUṆ","ya","puṇ","verb",""
"12","pavitra","PAVITR","a","pavitra","noun-adj",""
"13","pāpa","PĀP","a@","pāpa","noun-adj",""
"14","nāśanam","NĀŚAN","am","nāśana","noun-adj",""
"15","/","","","","punct",""
"","</s>","","","","",""
"","<s number=""18"">","","","","",""
"1","sa","","","sa_saha","ind",""
"2","labhet","LABH","et","labh","verb","labh"
"3","amitān","AMIT","ān","amita","noun-adj",""
"4","bhogān","BHOG","ān","bhoga","noun-adj",""
"5","bhaumān","BHAUM","ān","bhauma","noun-adj",""
"6","svarga","SVARG","a@","svarga","noun-adj",""
"7","odbhvās","UDBH","vās","udbha","noun-adj",""
"8","tathā","","","tathā","ind",""
"9","vyādhayas","VYĀDHAY","as","vyādhaya","noun-adj",""
"10","ta","","","tad","pron",""
"11","na","","","na","ind",""
"12","bādhante","BĀDH","ante","bādh","verb","bādh"
"13","duḥsvapna","DUḤSVAPN","a","duḥsvapna","noun-adj",""
"14","tasya","","","tad","pron",""
"15","naśyati","NAŚ","yati","naśy","verb","naś"
"16","/","","","","punct",""
"","</s>","","","","",""
"","<s number=""19"">","","","","",""
"1","āyur","ĀY","ur","āyu","noun-adj",""
"2","ārogya","ĀROGY","a@","ārogya","noun-adj",""
"3","sampannas","SAMPANN","as","sampanna","noun-adj",""
"4","sarva","SARV","a@","sarva","noun-adj",""
"5","aiśvaryya","AIŚVARY","ya@","aiśvarya","noun-adj",""
"6","samanvitaḥ","SAMANVIT","aḥ","samanvita","noun-adj",""
"7","medhāvī","MEDHĀV","ī","medhāvin","noun-adj",""
"8","kulajo","KULAJ","o","kulaja","noun-adj",""
"9","vāgmī","VĀGM","ī","vāgmin","noun-adj",""
"10","bhavej","BHAV","ej","bhav","verb","bhū"
"11","janmani","JANM","ani","janmat","noun-adj",""
"12","janmani","JANM","ani","janmat","noun-adj",""
"13","/","","","","punct",""
"","</s>","","","","",""
"","<s number=""20"">","","","","",""
"1","nāma","NĀM","a@","nāman","noun-adj",""
"2","āṣṭa","AṢṬ","a@","aṣṭa","noun-adj",""
"3","śata","ŚAT","a@","śata","noun-adj",""
"4","kaya","KAY","a","kayā","noun-adj",""
"5","nimi","NIM","i","nimi","noun-adj",""
"6","/","","","","punct",""
"","</s>","","","","",""
"","</page>","","","","",""
"","</doc>","","","","",""
