"WordID","word","NormSTEM","suffix","lemma","PoS","Root"
"","<doc textid = ""nairatmyapariprcchamahayanasutra"" genre = ""sūtra"" title = ""nairātmyaparipṛcchā"" author = ""n /a"" discourse = ""vyākaraṇa"" tradition = ""buddh"" period = ""uncertain"" source = ""gretil accessed aug 2019 : http://gretil.sub.uni-goettingen.de/gretil/corpustei/sa_#ocr levi ed. gretilbuddh _ nairatmyapariprcchamahayanasutra base on the e. by p.l. vaiya in_ mahayana-sutra-samgrahah_final.xml"" date_range = ""10. ce uncertain "" notes = ""traditional attribution: aśvaghoṣa; dating uncertain; chin. tr. by fa-t'ien: 7th month; 3rd year of yung hsi 雍熙 ; northern sung dynasty 北宋 a.d. 986 . don't know which text vaidya's ed. is based on. lévi's text is certainly preferable; since it's edited from an original ms. pandit project website writes: 'year: 950 year derived from data on author whom potter defines as unknown.' what kind of miracle is that; giving dates for unknown authors?? https://www.panditproject.org/entity/89011/work"" religion = ""buddh"" edition = ""based on the ed. by p.l. vaidya 1961"" digitization = ""members of the sanskrit buddhist input project"" segmentation_lemmatization = ""ligeia lugli & buddhist translators workbench team"" metadata_enrichment = ""bruno galasek-hul & buddhist translators workbench team"" proofreader = ""n/a"" permission = ""permission for derivatives from m. mehner on behalf of gretil"" reconstructions = ""none"">","","","","",""
"","<page number=""174"">","","","","",""
"","<s number=""1"">","","","","",""
"1","nairātmya","NAIRĀTMY","a@","nairātmya","noun-adj",""
"2","paripṛcchā","PARIPṚCCH","ā","paripṛcchā","noun-adj",""
"3","nāma","NĀM","a","nāman","noun-adj",""
"4","mahāyāna","MAHĀYĀN","a@","mahāyāna","noun-adj",""
"5","sūtram","SŪTR","am","sūtra","noun-adj",""
"6","/","","","","punct",""
"","</s>","","","","",""
"","<s number=""2"">","","","","",""
"1","atha","","","atha","ind",""
"2","te","","","tad","pron",""
"3","tīrthikā","TĪRTHIK","ā","tīrthika","noun-adj",""
"4","upalambha","UPALAMBH","a@","upalambha","noun-adj",""
"5","dṛṣṭayaḥ","DṚṢṬ","ayaḥ","dṛṣṭi","noun-adj",""
"6","sa","","","sa_saha","ind",""
"7","vikalpāḥ","VIKALP","āḥ","vikalpa","noun-adj",""
"8","sa","","","sa_saha","ind",""
"9","vitarkā","VITARK","ā","vitarka","noun-adj",""
"10","mahāyānikam","MAHĀYĀNIK","am","mahāyānika","noun-adj",""
"11","upasṛtya","UPASṚTY","a","upasṛtya","noun-adj",""
"12","sādara","SĀDAR","a@","sādara","noun-adj",""
"13","kṛta","KṚT","a@","kṛta","noun-adj",""
"14","āñjali","AÑJAL","i@","añjali","noun-adj",""
"15","puṭā","PUṬ","ā","puṭa","noun-adj",""
"16","nairātmya","NAIRĀTMY","a@","nairātmya","noun-adj",""
"17","praśnaṃ","PRAŚN","aṃ","praśna","noun-adj",""
"18","paripṛcchanti","PARIPṚCCH","anti","paripṛcch","verb","pariprach"
"19","sma","","","sma","ind",""
"20","—","","","","punct",""
"21","nairātmakaṃ","NAIRĀTM","akaṃ","nairātma","noun-adj",""
"22","śarīram","ŚARĪR","am","śarīra","noun-adj",""
"23","iti","","","iti","ind",""
"24","kulaputra","KULAPUTR","a","kulaputra","noun-adj",""
"25","sarvajñena","SARVAJÑ","ena","sarvajña","noun-adj",""
"26","nirdiśyate","NIRDIŚ","yate","nirdiś","verb","nirdiś"
"27","/","","","","punct",""
"28","yadi","","","yadi","ind",""
"29","śarīraṃ","ŚARĪR","aṃ","śarīra","noun-adj",""
"30","nairātmakam","NAIRĀTM","akam","nairātma","noun-adj",""
"31","/","","","","punct",""
"32","parama","PARAM","a@","parama","noun-adj",""
"33","ātmā","ĀTM","ā","ātman","noun-adj",""
"34","na","","","na","ind",""
"35","vidyate","VID","yate","vid","verb","vid"
"36","/","","","","punct",""
"37","tat","TAT","","tad","pron",""
"38","kasmāt","KASMĀT","","kim","pron",""
"39","saka","SAK","a@","saka","noun-adj",""
"40","ā","","","alpha_privativum","ind",""
"41","śādete","ŚĀD","ete","śāda","noun-adj",""
"42","hasita","HASIT","a@","hasita","noun-adj",""
"43","rudita","RUDIT","a@","rudita","noun-adj",""
"44","krīḍita","KRĪḌIT","a@","krīḍita","noun-adj",""
"45","krodham","KRODH","am","krodha","noun-adj",""
"46","^","","","","",""
"47","ān","","","alpha_privativum","ind",""
"48","erṣyāṃ","IRṢY","āṃ","irṣyā","noun-adj",""
"49","paiśunya","PAIŚUNY","a@","paiśunya","noun-adj",""
"50","ādayaḥ","ĀD","ayaḥ","ādi","noun-adj",""
"51","samutpadyante","SAMUTPAD","yante","samutpad","verb","samutpad"
"52","/","","","","punct",""
"53","tad","TAD","","tad","pron",""
"54","asmākaṃ","ASMĀK","aṃ","asmat","pron",""
"55","saṃdehaṃ","SAṂDEH","aṃ","saṃdeha","noun-adj",""
"56","mocayitum","MOCAY","itum","mocaya","noun-adj",""
"57","arhati","ARH","ati","arh","verb","arh"
"58","bhagavān","BHAGAV","ān","bhagavat","noun-adj",""
"59","—","","","","punct",""
"60","kim","","","kim","pron",""
"61","asti","","","as","verb","as"
"62","śarīre","ŚARĪR","e","śarīra","noun-adj",""
"63","parama","PARAM","a@","parama","noun-adj",""
"64","ātmā","ĀTM","ā","ātman","noun-adj",""
"65","/","","","","punct",""
"66","kiṃ","","","kim","pron",""
"67","vā","","","vā","ind",""
"68","n","","","na","ind",""
"69","^","","","","",""
"70","āsti","","","as","verb","as"
"71","/","","","","punct",""
"","</s>","","","","",""
"","<s number=""3"">","","","","",""
"1","mahāyānikāḥ","MAHĀYĀNIK","āḥ","mahāyānika","noun-adj",""
"2","prāhuḥ","PRĀH","uḥ","prāhu","noun-adj",""
"3","—","","","","punct",""
"4","mārṣāḥ","MĀRṢ","āḥ","mārṣa","noun-adj",""
"5","/","","","","punct",""
"6","śarīre","ŚARĪR","e","śarīra","noun-adj",""
"7","parama","PARAM","a@","parama","noun-adj",""
"8","ātmā","ĀTM","ā","ātman","noun-adj",""
"9","asti","","","as","verb","as"
"10","ity","","","iti","ind",""
"11","ucyate","UC","yate","vak","verb","vac"
"12","/","","","","punct",""
"13","na","","","na","ind",""
"14","hi","","","hi","ind",""
"15","n","","","na","ind",""
"16","^","","","","",""
"17","āsti","","","as","verb","as"
"18","iti","","","iti","ind",""
"19","/","","","","punct",""
"20","dvayamatra","DVAYAMAT","ra","dvayamata","noun-adj",""
"21","n","","","na","ind",""
"22","ocyate","UC","yate","vak","verb","vac"
"23","/","","","","punct",""
"24","asti","","","as","verb","as"
"25","parama","PARAM","a@","parama","noun-adj",""
"26","ātma","ĀTM","a","ātman","noun-adj",""
"27","^","","","","",""
"28","ety","","","iti","ind",""
"29","ucyamāne","UC","yamāne","vak","verb","vac"
"30","mārṣā","MĀRṢ","ā","mārṣa","noun-adj",""
"31","mithyā","MITHY","ā@","mithyā","noun-adj",""
"32","pralāpaḥ","PRALĀP","aḥ","pralāpa","noun-adj",""
"33","/","","","","punct",""
"34","yady","","","yadi","ind",""
"35","asti","","","as","verb","as"
"36","/","","","","punct",""
"37","tat","TAT","","tad","pron",""
"38","kathaṃ","","","katham","ind",""
"39","mārṣāḥ","MĀRṢ","āḥ","mārṣa","noun-adj",""
"40","keśa","KEŚ","a@","keśa","noun-adj",""
"41","naka","NAK","a@","naka","noun-adj",""
"42","hadanta","HAD","anta","had","verb",""
"43","carmaroma","CARMAR","oma","carmara","noun-adj",""
"44","sirā","SIR","ā@","sirā","noun-adj",""
"45","māṃsāst","MĀṂS","āst","māṃsa","noun-adj",""
"46","hima","HIM","a@","hima","noun-adj",""
"47","edam","EDAM","","idam","pron",""
"48","ajjā","","","","ind",""
"49","snāyuplī","SNĀY","uplī","snāyu","noun-adj",""
"50","hāntra","HĀNTR","a@","hāntra","noun-adj",""
"51","nāla","NĀL","a@","nāla","noun-adj",""
"52","śiraḥ","ŚIR","aḥ","śiras","noun-adj",""
"53","kara","KAR","a@","kara","noun-adj",""
"54","caraṇa","CARAṆ","a@","caraṇa","noun-adj",""
"55","āṅga","AṄG","a@","aṅga","noun-adj",""
"56","sakala","SAKAL","a@","sakala","noun-adj",""
"57","śarīre","ŚARĪR","e","śarīra","noun-adj",""
"58","sa","","","sa_saha","ind",""
"59","bāhya","BĀHY","a@","bāhya","noun-adj",""
"60","ābhyantare","ĀBHYANTAR","e","ābhyantara","noun-adj",""
"61","vicāryamāṇe","VICĀR","yamāṇe","vicār","verb",""
"62","na","","","na","ind",""
"63","dṛśyate","DṚŚ","yate","darś","verb","dṛś"
"64","parama","PARAM","a@","parama","noun-adj",""
"65","ātmā","ĀTM","ā","ātman","noun-adj",""
"66","/","","","","punct",""
"","</s>","","","","",""
"","<s number=""4"">","","","","",""
"1","tīrthikāḥ","TĪRTHIK","āḥ","tīrthika","noun-adj",""
"2","prāhuḥ","PRĀH","uḥ","prāhu","noun-adj",""
"3","—","","","","punct",""
"4","na","","","na","ind",""
"5","dṛśyate","DṚŚ","yate","darś","verb","dṛś"
"6","kulaputra","KULAPUTR","a","kulaputra","noun-adj",""
"7","parama","PARAM","a@","parama","noun-adj",""
"8","ātmā","ĀTM","ā","ātman","noun-adj",""
"9","/","","","","punct",""
"10","māṃsa","MĀṂS","a@","māṃsa","noun-adj",""
"11","cakṣuṣā","CAKṢUṢ","ā","cakṣuṣa","noun-adj",""
"12","vayaṃ","VAYAṂ","","asmat","pron",""
"13","na","","","na","ind",""
"14","paśyāmaḥ","PAŚY","āmaḥ","paś","verb","paś"
"15","/","","","","punct",""
"16","kadācid","","","kadā","ind",""
"17","divya","DIVY","a@","divya","noun-adj",""
"18","cakṣuṣaḥ","CAKṢUṢ","aḥ","cakṣuṣa","noun-adj",""
"19","paśyanti","PAŚ","yanti","paś","verb","paś"
"20","/","","","","punct",""
"","</s>","","","","",""
"","<s number=""5"">","","","","",""
"1","mahāyānikāḥ","MAHĀYĀNIK","āḥ","mahāyānika","noun-adj",""
"2","prāhuḥ","PRĀH","uḥ","prāhu","noun-adj",""
"3","—","","","","punct",""
"4","na","","","na","ind",""
"5","mārṣā","MĀRṢ","ā","mārṣa","noun-adj",""
"6","divya","DIVY","a@","divya","noun-adj",""
"7","cakṣuṣo","CAKṢUṢ","o","cakṣuṣa","noun-adj",""
"8","api","","","api","ind",""
"9","paśyanti","PAŚ","yanti","paś","verb","paś"
"10","/","","","","punct",""
"11","yasya","","","yad","pron",""
"12","na","","","na","ind",""
"13","varṇo","VARṆ","o","varṇa","noun-adj",""
"14","na","","","na","ind",""
"15","rūpaṃ","RŪP","aṃ","rūpa","noun-adj",""
"16","na","","","na","ind",""
"17","saṃskāraḥ","SAṂSKĀR","aḥ","saṃskāra","noun-adj",""
"18","/","","","","punct",""
"19","tat","TAT","","tad","pron",""
"20","kathaṃ","","","katham","ind",""
"21","dṛśyate","DṚŚ","yate","darś","verb","dṛś"
"22","/","","","","punct",""
"","</s>","","","","",""
"","<s number=""6"">","","","","",""
"1","tīrthikāḥ","TĪRTHIK","āḥ","tīrthika","noun-adj",""
"2","prāhuḥ","PRĀH","uḥ","prāhu","noun-adj",""
"3","—","","","","punct",""
"4","kiṃ","","","kim","pron",""
"5","n","","","na","ind",""
"6","^","","","","",""
"7","āsti","","","as","verb","as"
"8","/","","","","punct",""
"","</s>","","","","",""
"","<s number=""7"">","","","","",""
"1","mahāyānikāḥ","MAHĀYĀNIK","āḥ","mahāyānika","noun-adj",""
"2","prāhuḥ","PRĀH","uḥ","prāhu","noun-adj",""
"3","—","","","","punct",""
"4","n","","","na","ind",""
"5","^","","","","",""
"6","āsti","","","as","verb","as"
"7","ity","","","iti","ind",""
"8","ucyamāne","UC","yamāne","vak","verb","vac"
"9","mārṣā","MĀRṢ","ā","mārṣa","noun-adj",""
"10","mithyā","MITHY","ā@","mithyā","noun-adj",""
"11","pralāpaḥ","PRALĀP","aḥ","pralāpa","noun-adj",""
"12","/","","","","punct",""
"13","yadi","","","yadi","ind",""
"14","n","","","na","ind",""
"15","^","","","","",""
"16","āsti","","","as","verb","as"
"17","/","","","","punct",""
"18","tat","TAT","","tad","pron",""
"19","kathamasya","KATHAM","asya","kathama","noun-adj",""
"20","ete","","","tad","pron",""
"21","hasita","HASIT","a@","hasita","noun-adj",""
"22","rudita","RUDIT","a@","rudita","noun-adj",""
"23","krīḍita","KRĪḌIT","a@","krīḍita","noun-adj",""
"24","krodham","KRODH","am","krodha","noun-adj",""
"25","^","","","","",""
"26","ān","","","alpha_privativum","ind",""
"27","erṣya","IRṢY","a@","irṣyā","noun-adj",""
"28","ā","","","alpha_privativum","ind",""
"29","paiśunya","PAIŚUNY","a@","paiśunya","noun-adj",""
"30","ādayaḥ","ĀD","ayaḥ","ādi","noun-adj",""
"31","saṃbhavanti","SAṂBHAV","anti","saṃbhav","verb","saṃbhū"
"32","/","","","","punct",""
"33","tena","","","tad","pron",""
"34","n","","","na","ind",""
"35","^","","","","",""
"36","āsti","","","as","verb","as"
"37","iti","","","iti","ind",""
"38","vaktuṃ","VAKT","uṃ","vak","verb","vac"
"39","na","","","na","ind",""
"40","pāryate","PĀR","yate","pāra","noun-adj",""
"41","/","","","","punct",""
"42","ubhāv","UBH","āv","ubha","noun-adj",""
"43","etau","","","tad","pron",""
"44","dvau","DV","au","dva","noun-adj",""
"45","nocyete","","","","ind",""
"46","/","","","","punct",""
"","</s>","","","","",""
"","<s number=""8"">","","","","",""
"1","tīrthikāḥ","TĪRTHIK","āḥ","tīrthika","noun-adj",""
"2","prāhuḥ","PRĀH","uḥ","prāhu","noun-adj",""
"3","—","","","","punct",""
"4","yadi","","","yadi","ind",""
"5","kulaputra","KULAPUTR","a","kulaputra","noun-adj",""
"6","n","","","na","ind",""
"7","ocyate","UC","yate","vak","verb","vac"
"8","asti","","","as","verb","as"
"9","iti","","","iti","ind",""
"10","vā","","","vā","ind",""
"11","n","","","na","ind",""
"12","^","","","","",""
"13","āsti","","","as","verb","as"
"14","iti","","","iti","ind",""
"15","vā","","","vā","ind",""
"16","/","","","","punct",""
"17","tat","TAT","","tad","pron",""
"18","kim","","","kim","pron",""
"19","atr","","","atra","ind",""
"20","^","","","","",""
"21","ālambanaṃ","ĀLAMBAN","aṃ","ālambana","noun-adj",""
"22","bhavatu","BHAV","atu","bhav","verb","bhū"
"23","/","","","","punct",""
"","</s>","","","","",""
"","<s number=""9"">","","","","",""
"1","mahāyānikāḥ","MAHĀYĀNIK","āḥ","mahāyānika","noun-adj",""
"2","prāhuḥ","PRĀH","uḥ","prāhu","noun-adj",""
"3","—","","","","punct",""
"4","na","","","na","ind",""
"5","mārṣāḥ","MĀRṢ","āḥ","mārṣa","noun-adj",""
"6","kiṃcid","","","kimcit","ind",""
"7","ālambanaṃ","ĀLAMBAN","aṃ","ālambana","noun-adj",""
"8","bhavati","BHAV","ati","bhav","verb","bhū"
"9","/","","","","punct",""
"","</s>","","","","",""
"","<s number=""10"">","","","","",""
"1","tīrthikāḥ","TĪRTHIK","āḥ","tīrthika","noun-adj",""
"2","prāhuḥ","PRĀH","uḥ","prāhu","noun-adj",""
"3","—","","","","punct",""
"4","kiṃ","","","kim","pron",""
"5","śūnyam","ŚŪNY","am","śūnya","noun-adj",""
"6","ākāśam","ĀKĀŚ","am","ākāśa","noun-adj",""
"7","iva","","","iva","ind",""
"8","/","","","","punct",""
"","</s>","","","","",""
"","<s number=""11"">","","","","",""
"1","mahāyānikāḥ","MAHĀYĀNIK","āḥ","mahāyānika","noun-adj",""
"2","prāhuḥ","PRĀH","uḥ","prāhu","noun-adj",""
"3","—","","","","punct",""
"4","evam","","","eva","ind",""
"5","etan","ETAN","","tad","pron",""
"6","mārṣāḥ","MĀRṢ","āḥ","mārṣa","noun-adj",""
"7","/","","","","punct",""
"","</s>","","","","",""
"","<s number=""12"">","","","","",""
"1","evam","","","eva","ind",""
"2","etat","ETAT","","tad","pron",""
"3","/","","","","punct",""
"4","śūnyam","ŚŪNY","am","śūnya","noun-adj",""
"5","ākāśam","ĀKĀŚ","am","ākāśa","noun-adj",""
"6","iva","","","iva","ind",""
"7","/","","","","punct",""
"","</s>","","","","",""
"","<s number=""13"">","","","","",""
"1","tīrthikāḥ","TĪRTHIK","āḥ","tīrthika","noun-adj",""
"2","prāhuḥ","PRĀH","uḥ","prāhu","noun-adj",""
"3","—","","","","punct",""
"4","yady","","","yadi","ind",""
"5","evaṃ","","","eva","ind",""
"6","kulaputra","KULAPUTR","a","kulaputra","noun-adj",""
"7","/","","","","punct",""
"8","tad","TAD","","tad","pron",""
"9","ete","","","tad","pron",""
"10","hasita","HASIT","a@","hasita","noun-adj",""
"11","rudita","RUDIT","a@","rudita","noun-adj",""
"12","krīḍita","KRĪḌIT","a@","krīḍita","noun-adj",""
"13","krodham","KRODH","am","krodha","noun-adj",""
"14","^","","","","",""
"15","ān","","","alpha_privativum","ind",""
"16","erṣya","IRṢY","a@","irṣyā","noun-adj",""
"17","ā","","","alpha_privativum","ind",""
"18","paiśunya","PAIŚUNY","a@","paiśunya","noun-adj",""
"19","ādayaḥ","ĀD","ayaḥ","ādi","noun-adj",""
"20","kathaṃ","","","katham","ind",""
"21","draṣṭavyāḥ","DRAṢ","ṭavyāḥ","darś","verb","dṛś"
"22","/","","","","punct",""
"","</s>","","","","",""
"","<s number=""14"">","","","","",""
"1","mahāyānikāḥ","MAHĀYĀNIK","āḥ","mahāyānika","noun-adj",""
"2","prāhuḥ","PRĀH","uḥ","prāhu","noun-adj",""
"3","—","","","","punct",""
"4","svapna","SVAPN","a@","svapna","noun-adj",""
"5","māya","MĀY","a@","māyā","noun-adj",""
"6","endrajāla","INDRAJĀL","a@","indrajāla","noun-adj",""
"7","sadṛśā","SADṚŚ","ā","sadṛśa","noun-adj",""
"8","draṣṭavyāḥ","DRAṢ","ṭavyāḥ","darś","verb","dṛś"
"9","/","","","","punct",""
"","</s>","","","","",""
"","<s number=""15"">","","","","",""
"1","tīrthikāḥ","TĪRTHIK","āḥ","tīrthika","noun-adj",""
"2","prāhuḥ","PRĀH","uḥ","prāhu","noun-adj",""
"3","—","","","","punct",""
"4","kīdṛśī","KĪDṚŚ","ī","kīdṛśa","noun-adj",""
"5","maya","MAY","a","maya","noun-adj",""
"6","/","","","","punct",""
"7","kīdṛśaḥ","KĪDṚŚ","aḥ","kīdṛśa","noun-adj",""
"8","svapnaḥ","SVAPN","aḥ","svapna","noun-adj",""
"9","/","","","","punct",""
"10","kidṛśa","KIDṚŚ","a","kidṛśa","noun-adj",""
"11","indrajāla","INDRAJĀL","a","indrajāla","noun-adj",""
"12","iti","","","iti","ind",""
"13","/","","","","punct",""
"","</s>","","","","",""
"","<s number=""16"">","","","","",""
"1","mahāyānikāḥ","MAHĀYĀNIK","āḥ","mahāyānika","noun-adj",""
"2","prāhuḥ","PRĀH","uḥ","prāhu","noun-adj",""
"3","—","","","","punct",""
"4","upalakṣaṇa","UPALAKṢAṆ","a@","upalakṣaṇa","noun-adj",""
"5","mātraṃ","MĀTR","aṃ","mātra","noun-adj",""
"6","mayā","","","mat","pron",""
"7","a","","","alpha_privativum","ind",""
"8","grāhā","GRĀH","ā","grāha","noun-adj",""
"9","/","","","","punct",""
"10","pratibhāsa","PRATIBHĀS","a@","pratibhāsa","noun-adj",""
"11","mātraṃ","MĀTR","aṃ","mātra","noun-adj",""
"12","svapnaḥ","SVAPN","aḥ","svapna","noun-adj",""
"13","prakṛti","PRAKṚT","i@","prakṛti","noun-adj",""
"14","śūnyatā","ŚŪNYAT","ā@","śūnyatā","noun-adj",""
"15","svarūpaḥ","SVARŪP","aḥ","svarūpa","noun-adj",""
"16","/","","","","punct",""
"","</s>","","","","",""
"","<s number=""17"">","","","","",""
"1","indrajālaḥ","INDRAJĀL","aḥ","indrajāla","noun-adj",""
"2","kṛtrima","KṚTRIM","a@","kṛtrima","noun-adj",""
"3","prayogaḥ","PRAYOG","aḥ","prayoga","noun-adj",""
"4","/","","","","punct",""
"5","evaṃ","","","eva","ind",""
"6","mārṣāḥ","MĀRṢ","āḥ","mārṣa","noun-adj",""
"7","sarve","SARV","e","sarva","noun-adj",""
"8","svapna","SVAPN","a@","svapna","noun-adj",""
"9","māya","MĀY","a@","māyā","noun-adj",""
"10","endrajāla","INDRAJĀL","a@","indrajāla","noun-adj",""
"11","sadṛśā","SADṚŚ","ā","sadṛśa","noun-adj",""
"12","draṣṭavyāḥ","DRAṢ","ṭavyāḥ","darś","verb","dṛś"
"13","/","","","","punct",""
"14","punar","","","punar","ind",""
"15","aparaṃ","","","","ind",""
"16","dvau","DV","au","dva","noun-adj",""
"17","bhedau","BHED","au","bheda","noun-adj",""
"18","vinirdiṣṭau","VINIRDIṢṬ","au","vinirdiṣṭa","noun-adj",""
"19","yaduta","","","yaduta","ind",""
"20","saṃvṛtiḥ","SAṂVṚT","iḥ","saṃvṛti","noun-adj",""
"21","paramārthaś","PARAMĀRTH","aś","paramārtha","noun-adj",""
"22","ca","","","ca","ind",""
"23","/","","","","punct",""
"","</s>","","","","",""
"","<s number=""18"">","","","","",""
"1","tatra","","","tatra","ind",""
"2","saṃvṛtir","SAṂVṚT","ir","saṃvṛti","noun-adj",""
"3","nāma","NĀM","a","nāman","noun-adj",""
"4","ayam","AYAM","","idam","pron",""
"5","ātmā","ĀTM","ā","ātman","noun-adj",""
"6","/","","","","punct",""
"7","ayaṃ","AYAṂ","","idam","pron",""
"8","npa","","","","ind",""
"9","ripṛ","RIP","ṛ","ripṛ","noun-adj",""
"10","/","","","","punct",""
"","</s>","","","","",""
"","<s number=""19"">","","","","",""
"","</page>","","","","",""
"","<page number=""175"">","","","","",""
"3","paraḥ","PAR","aḥ","para","noun-adj",""
"4","/","","","","punct",""
"5","evaṃ","","","eva","ind",""
"6","jīvaḥ","JĪV","aḥ","jīva","noun-adj",""
"7","puruṣaḥ","PURUṢ","aḥ","puruṣa","noun-adj",""
"8","pudgalaḥ","PUDGAL","aḥ","pudgala","noun-adj",""
"9","kārakaḥ","KĀRAK","aḥ","kāraka","noun-adj",""
"10","vedakaḥ","VEDAK","aḥ","vedaka","noun-adj",""
"11","/","","","","punct",""
"12","dhana","DHAN","a@","dhana","noun-adj",""
"13","putra","PUTR","a@","putra","noun-adj",""
"14","kalatra","KALATR","a@","kalatra","noun-adj",""
"15","ādi","ĀD","i@","ādi","noun-adj",""
"16","kalpanā","KALPAN","ā","kalpanā","noun-adj",""
"17","yā","","","yad","pron",""
"18","/","","","","punct",""
"","</s>","","","","",""
"","<s number=""20"">","","","","",""
"1","sā","","","tad","pron",""
"2","saṃvṛtir","SAṂVṚT","ir","saṃvṛti","noun-adj",""
"3","nāma","NĀM","a","nāman","noun-adj",""
"4","/","","","","punct",""
"","</s>","","","","",""
"","<s number=""21"">","","","","",""
"1","yatra","","","yatra","ind",""
"2","n","","","na","ind",""
"3","ātmā","ĀTM","ā","ātman","noun-adj",""
"4","na","","","na","ind",""
"5","paraḥ","PAR","aḥ","para","noun-adj",""
"6","/","","","","punct",""
"7","evaṃ","","","eva","ind",""
"8","na","","","na","ind",""
"9","jīvo","JĪV","o","jīva","noun-adj",""
"10","na","","","na","ind",""
"11","pudgalaḥ","PUDGAL","aḥ","pudgala","noun-adj",""
"12","na","","","na","ind",""
"13","puruṣaḥ","PURUṢ","aḥ","puruṣa","noun-adj",""
"14","na","","","na","ind",""
"15","kārakaḥ","KĀRAK","aḥ","kāraka","noun-adj",""
"16","na","","","na","ind",""
"17","vedakaḥ","VEDAK","aḥ","vedaka","noun-adj",""
"18","na","","","na","ind",""
"19","dhanaṃ","DHAN","aṃ","dhana","noun-adj",""
"20","—","","","","punct",""
"21","—","","","","punct",""
"22","—","","","","punct",""
"23","—","","","","punct",""
"24","—","","","","punct",""
"25","sā","","","tad","pron",""
"26","madhyamā","MADHYAM","ā","madhyamā","noun-adj",""
"27","pratipattir","PRATIPATT","ir","pratipatti","noun-adj",""
"28","dharmāṇām","DHARM","āṇām","dharma","noun-adj",""
"29","/","","","","punct",""
"","</s>","","","","",""
"","<s number=""22"">","","","","",""
"1","tatr","","","tatra","ind",""
"2","edam","EDAM","","idam","pron",""
"3","ucyate","UC","yate","vak","verb","vac"
"4","—","","","","punct",""
"","</s>","","","","",""
"","<s number=""23"">","","","","",""
"1","saṃvṛtiḥ","SAṂVṚT","iḥ","saṃvṛti","noun-adj",""
"2","paramārthaś","PARAMĀRTH","aś","paramārtha","noun-adj",""
"3","ca","","","ca","ind",""
"4","dvau","DV","au","dva","noun-adj",""
"5","bhedau","BHED","au","bheda","noun-adj",""
"6","saṃprakāśitau","SAMPRAKĀŚIT","au","samprakāśita","noun-adj",""
"7","/","","","","punct",""
"8","saṃvṛtir","SAṂVṚT","ir","saṃvṛti","noun-adj",""
"9","laukiko","LAUKIK","o","laukika","noun-adj",""
"10","dharmaḥ","DHARM","aḥ","dharma","noun-adj",""
"11","paramārthaś","PARAMĀRTH","aś","paramārtha","noun-adj",""
"12","ca","","","ca","ind",""
"13","lokottaraḥ","LOKOTTAR","aḥ","lokottara","noun-adj",""
"14","//","","","","punct",""
"15","1","","","","ind",""
"16","//","","","","punct",""
"","</s>","","","","",""
"","<s number=""24"">","","","","",""
"1","saṃvṛti","SAṂVṚT","i@","saṃvṛti","noun-adj",""
"2","dharmam","DHARM","am","dharma","noun-adj",""
"3","āpannāḥ","ĀPANN","āḥ","āpanna","noun-adj",""
"4","sattvāḥ","SATTV","āḥ","sattva","noun-adj",""
"5","kleśa","KLEŚ","a@","kleśa","noun-adj",""
"6","vaśa","VAŚ","a@","vaśa","noun-adj",""
"7","ānugāḥ","ANUG","āḥ","anuga","noun-adj",""
"8","/","","","","punct",""
"9","ciraṃ","CIR","aṃ","cira","noun-adj",""
"10","bhramanti","BHRAM","anti","bhram","verb",""
"11","saṃsāre","SAṂSĀR","e","saṃsāra","noun-adj",""
"12","paramārtham","PARAMĀRTH","am","paramārtha","noun-adj",""
"13","a","","","alpha_privativum","ind",""
"14","jānakāḥ","JĀNAK","āḥ","jānaka","noun-adj",""
"15","//","","","","punct",""
"16","2","","","","ind",""
"17","//","","","","punct",""
"","</s>","","","","",""
"","<s number=""25"">","","","","",""
"1","saṃvṛtir","SAṂVṚT","ir","saṃvṛti","noun-adj",""
"2","laukiko","LAUKIK","o","laukika","noun-adj",""
"3","dharmas","DHARM","as","dharma","noun-adj",""
"4","taṃ","","","tad","pron",""
"5","kalpayanty","KALP","ayanty","kalp","verb","kḷp"
"6","apaṇḍitāḥ","APAṆḌIT","āḥ","apaṇḍita","noun-adj",""
"7","/","","","","punct",""
"8","a","","","alpha_privativum","ind",""
"9","bhūta","BHŪT","a@","bhūta","noun-adj",""
"10","parikalpanād","PARIKALPAN","ād","parikalpana","noun-adj",""
"11","duḥkhāny","DUḤKH","āny","duḥkha","noun-adj",""
"12","anubhavanti","ANUBHAV","anti","anubhav","verb","anubhū"
"13","te","","","tad","pron",""
"14","//","","","","punct",""
"15","3","","","","ind",""
"16","//","","","","punct",""
"","</s>","","","","",""
"","<s number=""26"">","","","","",""
"1","mukti","MUKT","i@","mukti","noun-adj",""
"2","mārgaṃ","MĀRG","aṃ","mārga","noun-adj",""
"3","na","","","na","ind",""
"4","paśyanti","PAŚ","yanti","paś","verb","paś"
"5","andhā","ANDH","ā","andha","noun-adj",""
"6","bālāḥ","BĀL","āḥ","bāla","noun-adj",""
"7","pṛthagjanāḥ","PṚTHAGJAN","āḥ","pṛthagjana","noun-adj",""
"8","/","","","","punct",""
"9","utpadyante","UTPAD","yante","utpad","verb","utpad"
"10","nirudhyante","NIRUDH","yante","nirodh","verb","nirudh"
"11","a","","","alpha_privativum","ind",""
"12","jasraṃ","JASR","aṃ","jasra","noun-adj",""
"13","gati","GAT","i@","gati","noun-adj",""
"14","pañcasu","PAÑC","asu","pañc","verb",""
"15","//","","","","punct",""
"16","4","","","","ind",""
"17","//","","","","punct",""
"","</s>","","","","",""
"","<s number=""27"">","","","","",""
"1","bhramanti","BHRAM","anti","bhram","verb",""
"2","cakravan","CAKR","avan","cakravat","noun-adj",""
"3","mūḍhā","MŪḌH","ā","mūḍha","noun-adj",""
"4","lokadharma","LOKADHARM","a@","lokadharma","noun-adj",""
"5","samāvṛtāḥ","SAMĀVṚT","āḥ","samāvṛta","noun-adj",""
"6","/","","","","punct",""
"7","paramārthaṃ","PARAMĀRTH","aṃ","paramārtha","noun-adj",""
"8","na","","","na","ind",""
"9","jananti","JAN","anti","jan","verb","jan"
"10","bhavo","BHAV","o","bhava","noun-adj",""
"11","yatra","","","yatra","ind",""
"12","nirudhyate","NIRUDH","yate","nirodh","verb","nirudh"
"13","/","","","","punct",""
"14","veṣṭitā","VEṢṬIT","ā","veṣṭita","noun-adj",""
"15","bhava","BHAV","a@","bhava","noun-adj",""
"16","jālena","JĀL","ena","jāla","noun-adj",""
"17","saṃsaranti","SAṂSAR","anti","saṃsar","verb",""
"18","punaḥ","","","punar","ind",""
"19","punaḥ","","","punar","ind",""
"20","//","","","","punct",""
"21","5","","","","ind",""
"22","//","","","","punct",""
"","</s>","","","","",""
"","<s number=""28"">","","","","",""
"1","yathā","","","yathā","ind",""
"2","candraś","CANDR","aś","candra","noun-adj",""
"3","ca","","","ca","ind",""
"4","sūryaś","SŪRY","aś","sūrya","noun-adj",""
"5","ca","","","ca","ind",""
"6","pratyāgacchati","PRATYĀGACCH","ati","pratyāgacch","verb","pratyāgam"
"7","gacchati","GACCH","ati","gacch","verb","gam"
"8","/","","","","punct",""
"9","bhavaṃ","BHAV","aṃ","bhava","noun-adj",""
"10","cyutiṃ","CYUT","iṃ","cyuti","noun-adj",""
"11","tathā","","","tathā","ind",""
"12","loke","LOK","e","loka","noun-adj",""
"13","puna","PUN","a@","puna","noun-adj",""
"14","rāyān","RĀYĀN","","rāyāna","noun-adj",""
"15","ti","","","","ind",""
"16","yānti","YĀ","nti","yā","noun-adj",""
"17","ca","","","ca","ind",""
"18","//","","","","punct",""
"19","6","","","","ind",""
"20","//","","","","punct",""
"","</s>","","","","",""
"","<s number=""29"">","","","","",""
"1","a","","","alpha_privativum","ind",""
"2","nityāḥ","NITY","āḥ","nitya","noun-adj",""
"3","sarva","SARV","a@","sarva","noun-adj",""
"4","saṃskārā","SAṂSKĀR","ā","saṃskāra","noun-adj",""
"5","a","","","alpha_privativum","ind",""
"6","dhruvāḥ","DHRUV","āḥ","dhruva","noun-adj",""
"7","kṣaṇa","KṢAṆ","a@","kṣaṇa","noun-adj",""
"8","bhaṅgurāḥ","BHAṄGUR","āḥ","bhaṅgura","noun-adj",""
"9","/","","","","punct",""
"10","ataś","","","atas","ind",""
"11","ca","","","ca","ind",""
"12","paramārtha","PARAMĀRTH","a@","paramārtha","noun-adj",""
"13","jño","JÑ","o","jña","noun-adj",""
"14","varjayet","VARJAY","et","varja","verb",""
"15","saṃvṛteḥ","SAṂVṚT","eḥ","saṃvṛti","noun-adj",""
"16","padam","PAD","am","pada","noun-adj",""
"17","//","","","","punct",""
"18","7","","","","ind",""
"19","//","","","","punct",""
"","</s>","","","","",""
"","<s number=""30"">","","","","",""
"1","svarga","SVARG","a@","svarga","noun-adj",""
"2","sthāne","STHĀN","e","sthāna","noun-adj",""
"3","tu","","","tu","ind",""
"4","ye","","","yad","pron",""
"5","devā","DEV","ā","devā","noun-adj",""
"6","gandharva","GANDHARV","a@","gandharva","noun-adj",""
"7","āpsarasa","ĀPSARAS","a@","āpsarasa","noun-adj",""
"8","ādayaḥ","ĀD","ayaḥ","ādi","noun-adj",""
"9","/","","","","punct",""
"10","cyutir","CYUT","ir","cyuti","noun-adj",""
"11","asti","","","as","verb","as"
"12","ca","","","ca","ind",""
"13","sarveṣāṃ","SARV","eṣāṃ","sarva","noun-adj",""
"14","tat","TAT","","tad","pron",""
"15","sarvaṃ","SARV","aṃ","sarva","noun-adj",""
"16","saṃvṛteḥ","SAṂVṚT","eḥ","saṃvṛti","noun-adj",""
"17","phalam","PHAL","am","phala","noun-adj",""
"18","//","","","","punct",""
"19","8","","","","ind",""
"20","//","","","","punct",""
"","</s>","","","","",""
"","<s number=""31"">","","","","",""
"1","siddhā","SIDDH","ā","siddhā","noun-adj",""
"2","vidyādharā","VIDYĀDHAR","ā","vidyādharā","noun-adj",""
"3","yakṣāḥ","YAKṢ","āḥ","yakṣa","noun-adj",""
"4","kinnarāś","KINNAR","āś","kinnara","noun-adj",""
"5","ca","","","ca","ind",""
"6","mahoragāḥ","MAHORAG","āḥ","mahoraga","noun-adj",""
"7","/","","","","punct",""
"8","punas","","","punar","ind",""
"9","te","","","tad","pron",""
"10","narakaṃ","NARAK","aṃ","naraka","noun-adj",""
"11","yānti","YĀ","nti","yā","noun-adj",""
"12","tat","TAT","","tad","pron",""
"13","sarvaṃ","SARV","aṃ","sarva","noun-adj",""
"14","saṃvṛteḥ","SAṂVṚT","eḥ","saṃvṛti","noun-adj",""
"15","phalam","PHAL","am","phala","noun-adj",""
"16","//","","","","punct",""
"17","9","","","","ind",""
"18","//","","","","punct",""
"","</s>","","","","",""
"","<s number=""32"">","","","","",""
"1","śakratvaṃ","ŚAKR","atvaṃ","śakratva","noun-adj",""
"2","cakravartitvaṃ","CAKRAVART","itvaṃ","cakravartin","noun-adj",""
"3","saṃprāpya","SAMPRĀPY","a","samprāpya","noun-adj",""
"4","c","","","ca","ind",""
"5","^","","","","",""
"6","ottamaṃ","UTTAM","aṃ","uttama","noun-adj",""
"7","padam","PAD","am","pada","noun-adj",""
"8","/","","","","punct",""
"9","tiryagyonau","TIRYAGYON","au","tiryagyona","noun-adj",""
"10","punar","","","punar","ind",""
"11","janma","JANM","a","janma","noun-adj",""
"12","tat","TAT","","tad","pron",""
"13","sarvaṃ","SARV","aṃ","sarva","noun-adj",""
"14","saṃvṛteḥ","SAṂVṚT","eḥ","saṃvṛti","noun-adj",""
"15","phalam","PHAL","am","phala","noun-adj",""
"16","//","","","","punct",""
"17","10","","","","ind",""
"18","//","","","","punct",""
"","</s>","","","","",""
"","<s number=""33"">","","","","",""
"1","ataḥ","","","atas","ind",""
"2","sarvam","SARV","am","sarva","noun-adj",""
"3","idaṃ","IDAṂ","","idam","pron",""
"4","tyaktvā","TYAKT","vā","tyakta","noun-adj",""
"5","divyaṃ","DIVY","aṃ","divya","noun-adj",""
"6","svarga","SVARG","a@","svarga","noun-adj",""
"7","mahā","MAH","ā@","mahat","noun-adj",""
"8","sukham","SUKH","am","sukha","noun-adj",""
"9","/","","","","punct",""
"10","bhāvayet","BHĀVAY","et","bhāvaya","noun-adj",""
"11","satataṃ","SATAT","aṃ","satata","noun-adj",""
"12","prājño","PRĀJÑ","o","prājña","noun-adj",""
"13","bodhicittaṃ","BODHICITT","aṃ","bodhicitta","noun-adj",""
"14","prabhāsvaram","PRABHĀSVAR","am","prabhāsvara","noun-adj",""
"15","//","","","","punct",""
"16","11","","","","ind",""
"17","//","","","","punct",""
"","</s>","","","","",""
"","<s number=""34"">","","","","",""
"1","nih","","","niḥ_privativum","ind",""
"2","svabhāvaṃ","SVABHĀV","aṃ","svabhāva","noun-adj",""
"3","nirālambaṃ","NIRĀLAMB","aṃ","nirālamba","noun-adj",""
"4","sarva","SARV","a@","sarva","noun-adj",""
"5","śūnyaṃ","ŚŪNY","aṃ","śūnya","noun-adj",""
"6","nirālayam","NIRĀLAY","am","nirālaya","noun-adj",""
"7","/","","","","punct",""
"8","prapañca","PRAPAÑC","a@","prapañca","noun-adj",""
"9","samatikrāntaṃ","SAMATIKRĀNT","aṃ","samatikrānta","noun-adj",""
"10","bodhicittasya","BODHICITT","asya","bodhicitta","noun-adj",""
"11","lakṣaṇam","LAKṢAṆ","am","lakṣaṇa","noun-adj",""
"12","//","","","","punct",""
"13","12","","","","ind",""
"14","//","","","","punct",""
"","</s>","","","","",""
"","<s number=""35"">","","","","",""
"1","na","","","na","ind",""
"2","kāṭhinyaṃ","KĀṬHINY","aṃ","kāṭhinya","noun-adj",""
"3","na","","","na","ind",""
"4","ca","","","ca","ind",""
"5","mṛdutvaṃ","MṚD","utvaṃ","mṛdu","noun-adj",""
"6","na","","","na","ind",""
"7","c","","","ca","ind",""
"8","^","","","","",""
"9","oṣṇaṃ","OṢṆ","aṃ","oṣṇa","noun-adj",""
"10","n","","","na","ind",""
"11","^","","","","",""
"12","aiva","","","eva","ind",""
"13","śītalam","ŚĪTAL","am","śītala","noun-adj",""
"14","/","","","","punct",""
"15","na","","","na","ind",""
"16","saṃsparśaṃ","SAṂSPARŚ","aṃ","saṃsparśa","noun-adj",""
"17","na","","","na","ind",""
"18","ca","","","ca","ind",""
"19","grāhyaṃ","GRĀH","yaṃ","grāha","noun-adj",""
"20","bodhicittasya","BODHICITT","asya","bodhicitta","noun-adj",""
"21","lakṣaṇam","LAKṢAṆ","am","lakṣaṇa","noun-adj",""
"22","//","","","","punct",""
"23","13","","","","ind",""
"24","//","","","","punct",""
"","</s>","","","","",""
"","<s number=""36"">","","","","",""
"1","na","","","na","ind",""
"2","dīrghaṃ","DĪRGH","aṃ","dīrgha","noun-adj",""
"3","n","","","na","ind",""
"4","^","","","","",""
"5","āpi","","","api","ind",""
"6","vā","","","vā","ind",""
"7","hrasvaṃ","HRASV","aṃ","hrasva","noun-adj",""
"8","na","","","na","ind",""
"9","piṇḍaṃ","PIṆḌ","aṃ","piṇḍa","noun-adj",""
"10","na","","","na","ind",""
"11","tri","","","","ind",""
"12","koṇakam","KOṆ","akam","koṇaka","noun-adj",""
"13","/","","","","punct",""
"14","na","","","na","ind",""
"15","kṛśaṃ","KṚŚ","aṃ","kṛśa","noun-adj",""
"16","n","","","na","ind",""
"17","^","","","","",""
"18","āpi","","","api","ind",""
"19","na","","","na","ind",""
"20","sthūlaṃ","STHŪL","aṃ","sthūla","noun-adj",""
"21","bodhicittasya","BODHICITT","asya","bodhicitta","noun-adj",""
"22","lakṣaṇam","LAKṢAṆ","am","lakṣaṇa","noun-adj",""
"23","//","","","","punct",""
"24","14","","","","ind",""
"25","//","","","","punct",""
"26","npa","","","","ind",""
"27","ripṛ","RIP","ṛ","ripṛ","noun-adj",""
"28","/","","","","punct",""
"","</page>","","","","",""
"","<page number=""176"">","","","","",""
"","</s>","","","","",""
"","<s number=""37"">","","","","",""
"1","na","","","na","ind",""
"2","śveta","ŚVET","a","śveta","noun-adj",""
"3","n","","","na","ind",""
"4","^","","","","",""
"5","āpi","","","api","ind",""
"6","raktaṃ","RAKT","aṃ","rakta","noun-adj",""
"7","ca","","","ca","ind",""
"8","na","","","na","ind",""
"9","kṛṣṇaṃ","KṚṢṆ","aṃ","kṛṣṇa","noun-adj",""
"10","na","","","na","ind",""
"11","ca","","","ca","ind",""
"12","pītakam","PĪTAK","am","pītaka","noun-adj",""
"13","/","","","","punct",""
"14","a","","","alpha_privativum","ind",""
"15","varṇaṃ","VARṆ","aṃ","varṇa","noun-adj",""
"16","ca","","","ca","ind",""
"17","nirākāraṃ","NIRĀKĀR","aṃ","nirākāra","noun-adj",""
"18","bodhicittasya","BODHICITT","asya","bodhicitta","noun-adj",""
"19","lakṣaṇam","LAKṢAṆ","am","lakṣaṇa","noun-adj",""
"20","//","","","","punct",""
"21","15","","","","ind",""
"22","//","","","","punct",""
"","</s>","","","","",""
"","<s number=""38"">","","","","",""
"1","nir","","","niḥ_privativum","ind",""
"2","vikāraṃ","VIKĀR","aṃ","vikāra","noun-adj",""
"3","nir","","","niḥ_privativum","ind",""
"4","ābhāsaṃ","ĀBHĀS","aṃ","ābhāsa","noun-adj",""
"5","nirūhaṃ","","","","ind",""
"6","nir","","","niḥ_privativum","ind",""
"7","vibandhakam","VIBANDH","akam","vibandhaka","noun-adj",""
"8","/","","","","punct",""
"9","a","","","alpha_privativum","ind",""
"10","rūpaṃ","RŪP","aṃ","rūpa","noun-adj",""
"11","vyoma","VYOM","a@","vyoma","noun-adj",""
"12","saṃkāśaṃ","SAṂKĀŚ","aṃ","saṃkāśa","noun-adj",""
"13","bodhicittasya","BODHICITT","asya","bodhicitta","noun-adj",""
"14","lakṣaṇam","LAKṢAṆ","am","lakṣaṇa","noun-adj",""
"15","//","","","","punct",""
"16","16","","","","ind",""
"17","//","","","","punct",""
"","</s>","","","","",""
"","<s number=""39"">","","","","",""
"1","bhāvanā","BHĀVAN","ā@","bhāvanā","noun-adj",""
"2","samatikrāntaṃ","SAMATIKRĀNT","aṃ","samatikrānta","noun-adj",""
"3","tīrthikānām","TĪRTHIK","ānām","tīrthika","noun-adj",""
"4","a","","","alpha_privativum","ind",""
"5","gocaram","GOCAR","am","gocara","noun-adj",""
"6","/","","","","punct",""
"7","prajñāpāramitā","PRAJÑĀPĀRAMIT","ā@","prajñāpāramitā","noun-adj",""
"8","rūpaṃ","RŪP","aṃ","rūpa","noun-adj",""
"9","bodhicittasya","BODHICITT","asya","bodhicitta","noun-adj",""
"10","lakṣaṇam","LAKṢAṆ","am","lakṣaṇa","noun-adj",""
"11","//","","","","punct",""
"12","17","","","","ind",""
"13","//","","","","punct",""
"","</s>","","","","",""
"","<s number=""40"">","","","","",""
"1","an","","","alpha_privativum","ind",""
"2","aupamyam","AUPAMY","am","aupamya","noun-adj",""
"3","an","","","alpha_privativum","ind",""
"4","ābhāsaṃ","ĀBHĀS","aṃ","ābhāsa","noun-adj",""
"5","a","","","alpha_privativum","ind",""
"6","dṛśaṃ","DṚŚ","aṃ","dṛśa","noun-adj",""
"7","śāntam","ŚĀNT","am","śānta","noun-adj",""
"8","eva","","","eva","ind",""
"9","ca","","","ca","ind",""
"10","/","","","","punct",""
"11","prakṛti","PRAKṚT","i@","prakṛti","noun-adj",""
"12","śuddham","ŚUDDH","am","śuddha","noun-adj",""
"13","a","","","alpha_privativum","ind",""
"14","dravyaṃ","DRAVY","aṃ","dravya","noun-adj",""
"15","bodhicittasya","BODHICITT","asya","bodhicitta","noun-adj",""
"16","lakṣaṇam","LAKṢAṆ","am","lakṣaṇa","noun-adj",""
"17","//","","","","punct",""
"18","18","","","","ind",""
"19","//","","","","punct",""
"","</s>","","","","",""
"","<s number=""41"">","","","","",""
"1","sarvaṃ","SARV","aṃ","sarva","noun-adj",""
"2","ca","","","ca","ind",""
"3","tena","","","tad","pron",""
"4","sādṛśyaṃ","SĀDṚŚY","aṃ","sādṛśya","noun-adj",""
"5","niḥ","","","niḥ_privativum","ind",""
"6","sāraṃ","SĀR","aṃ","sāra","noun-adj",""
"7","budbuda","BUDBUD","a@","budbuda","noun-adj",""
"8","opamam","UPAM","am","upama","noun-adj",""
"9","/","","","","punct",""
"10","aśāśvataṃ","AŚĀŚVAT","aṃ","aśāśvata","noun-adj",""
"11","ca","","","ca","ind",""
"12","nairātmyaṃ","NAIRĀTMY","aṃ","nairātmya","noun-adj",""
"13","māyā","MĀY","ā@","māyā","noun-adj",""
"14","marīci","MARĪC","i@","marīci","noun-adj",""
"15","saṃnibham","SAṂNIBH","am","saṃnibha","noun-adj",""
"16","//","","","","punct",""
"17","19","","","","ind",""
"18","//","","","","punct",""
"","</s>","","","","",""
"","<s number=""42"">","","","","",""
"1","mṛptiṇḍa","","","","ind",""
"2","vad","VAD","","vat","noun-adj",""
"3","ghaṭī","GHAṬ","ī@","ghaṭī","noun-adj",""
"4","bhūtaṃ","BHŪT","aṃ","bhūta","noun-adj",""
"5","bahu","BAH","u@","bahu","noun-adj",""
"6","prapañca","PRAPAÑC","a@","prapañca","noun-adj",""
"7","pūritam","PŪRIT","am","pūrita","noun-adj",""
"8","/","","","","punct",""
"9","rāga","RĀG","a@","rāga","noun-adj",""
"10","dveṣa","DVEṢ","a@","dveṣa","noun-adj",""
"11","ādi","ĀD","i@","ādi","noun-adj",""
"12","saṃyuktaṃ","SAṂYUKT","aṃ","saṃyukta","noun-adj",""
"13","svapna","SVAPN","a@","svapna","noun-adj",""
"14","māyā","MĀY","ā","māyā","noun-adj",""
"15","tu","","","tu","ind",""
"16","kevalam","KEVAL","am","kevala","noun-adj",""
"17","//","","","","punct",""
"18","20","","","","ind",""
"19","//","","","","punct",""
"","</s>","","","","",""
"","<s number=""43"">","","","","",""
"1","abhra","ABHR","a@","abhra","noun-adj",""
"2","āntare","ANTAR","e","antara","noun-adj",""
"3","yathā","","","yathā","ind",""
"4","vidyut","VIDYUT","","vidyuta","noun-adj",""
"5","kṣaṇād","KṢAṆ","ād","kṣaṇa","noun-adj",""
"6","api","","","api","ind",""
"7","na","","","na","ind",""
"8","dṛśyate","DṚŚ","yate","darś","verb","dṛś"
"9","/","","","","punct",""
"10","prajñāpāramitā","PRAJÑĀPĀRAMIT","ā@","prajñāpāramitā","noun-adj",""
"11","dṛṣṭyā","DṚṢṬ","yā","dṛṣṭi","noun-adj",""
"12","bhāvayet","BHĀVAY","et","bhāvaya","noun-adj",""
"13","paramaṃ","PARAM","aṃ","parama","noun-adj",""
"14","padam","PAD","am","pada","noun-adj",""
"15","//","","","","punct",""
"16","21","","","","ind",""
"17","//","","","","punct",""
"","</s>","","","","",""
"","<s number=""44"">","","","","",""
"1","krīḍitaṃ","KRĪḌIT","aṃ","krīḍita","noun-adj",""
"2","hasitaṃ","HASIT","aṃ","hasita","noun-adj",""
"3","nityaṃ","NITY","aṃ","nitya","noun-adj",""
"4","jalpitaṃ","JALPIT","aṃ","jalpita","noun-adj",""
"5","ruditaṃ","RUDIT","aṃ","rudita","noun-adj",""
"6","tathā","","","tathā","ind",""
"7","/","","","","punct",""
"8","nṛtyaṃ","NṚTY","aṃ","nṛtya","noun-adj",""
"9","gītaṃ","GĪT","aṃ","gīta","noun-adj",""
"10","tathā","","","tathā","ind",""
"11","vādyaṃ","VĀDY","aṃ","vādya","noun-adj",""
"12","sarvaṃ","SARV","aṃ","sarva","noun-adj",""
"13","svapna","SVAPN","a@","svapna","noun-adj",""
"14","opamaṃ","UPAM","aṃ","upama","noun-adj",""
"15","hi","","","hi","ind",""
"16","tat","TAT","","tad","pron",""
"17","//","","","","punct",""
"18","22","","","","ind",""
"19","//","","","","punct",""
"","</s>","","","","",""
"","<s number=""45"">","","","","",""
"1","māyā","MĀY","ā@","māyā","noun-adj",""
"2","svapna","SVAPN","a@","svapna","noun-adj",""
"3","opamaṃ","UPAM","aṃ","upama","noun-adj",""
"4","sarvaṃ","SARV","aṃ","sarva","noun-adj",""
"5","saṃskāraṃ","SAṂSKĀR","aṃ","saṃskāra","noun-adj",""
"6","sarva","SARV","a@","sarva","noun-adj",""
"7","dehinām","DEH","inām","dehin","noun-adj",""
"8","/","","","","punct",""
"9","svapnaṃ","SVAPN","aṃ","svapna","noun-adj",""
"10","ca","","","ca","ind",""
"11","citta","CITT","a@","citta","noun-adj",""
"12","saṃkalpaṃ","SAṂKALP","aṃ","saṃkalpa","noun-adj",""
"13","cittaṃ","CITT","aṃ","citta","noun-adj",""
"14","ca","","","ca","ind",""
"15","gagana","GAGAN","a@","gagana","noun-adj",""
"16","opamam","UPAM","am","upama","noun-adj",""
"17","//","","","","punct",""
"18","23","","","","ind",""
"19","//","","","","punct",""
"","</s>","","","","",""
"","<s number=""46"">","","","","",""
"1","bhāvayedya","BHĀVAY","edya","bhāvaya","noun-adj",""
"2","imaṃ","","","idam","pron",""
"3","nityaṃ","NITY","aṃ","nitya","noun-adj",""
"4","prajñāpāramita","PRAJÑĀPĀRAMIT","a","prajñāpāramitā","noun-adj",""
"5","^","","","","",""
"6","ān","","","alpha_privativum","ind",""
"7","ayam","AYAM","","idam","pron",""
"8","/","","","","punct",""
"9","sa","","","sa_saha","ind",""
"10","sarva","SARV","a@","sarva","noun-adj",""
"11","pāpa","PĀP","a","pāpa","noun-adj",""
"12","nirmuktaḥ","NIRMUKT","aḥ","nirmukta","noun-adj",""
"13","prāpnoti","PRĀPN","oti","prāpn","verb","prāp"
"14","paramaṃ","PARAM","aṃ","parama","noun-adj",""
"15","padam","PAD","am","pada","noun-adj",""
"16","//","","","","punct",""
"17","24","","","","ind",""
"18","//","","","","punct",""
"","</s>","","","","",""
"","<s number=""47"">","","","","",""
"1","iyaṃ","","","idam","pron",""
"2","s","","","su","ind",""
"3","ānuttarā","ANUTTAR","ā","anuttara","noun-adj",""
"4","bodhiḥ","BODH","iḥ","bodhi","noun-adj",""
"5","sarva","SARV","a@","sarva","noun-adj",""
"6","buddhaiḥ","BUDDH","aiḥ","buddha","noun-adj",""
"7","prakāśitā","PRAKĀŚIT","ā","prakāśitā","noun-adj",""
"8","/","","","","punct",""
"9","bhāvanāṃ","BHĀVAN","āṃ","bhāvanā","noun-adj",""
"10","bhāvayita","BHĀVAYIT","a@","bhāvayitṛ","noun-adj",""
"11","veha","VEH","a","veha","noun-adj",""
"12","nirvāṇaṃ","NIRVĀṆ","aṃ","nirvāṇa","noun-adj",""
"13","labhate","LABH","ate","labh","verb","labh"
"14","śivam","ŚIV","am","śiva","noun-adj",""
"15","//","","","","punct",""
"16","25","","","","ind",""
"17","//","","","","punct",""
"","</s>","","","","",""
"","<s number=""48"">","","","","",""
"1","yāvantaḥ","","","","ind",""
"2","saṃvṛter","SAṂVṚT","er","saṃvṛti","noun-adj",""
"3","doṣās","DOṢ","ās","doṣa","noun-adj",""
"4","tavanto","","","","ind",""
"5","nirvṛter","NIRVṚT","er","nirvṛti","noun-adj",""
"6","guṇāḥ","GUṆ","āḥ","guṇa","noun-adj",""
"7","/","","","","punct",""
"8","nirvṛtiḥ","NIRVṚT","iḥ","nirvṛti","noun-adj",""
"9","syād","","","as","verb","as"
"10","anutpattiḥ","ANUTPATT","iḥ","anutpatti","noun-adj",""
"11","sarva","SARV","a@","sarva","noun-adj",""
"12","doṣair","DOṢ","air","doṣa","noun-adj",""
"13","na","","","na","ind",""
"14","lipyate","LIP","yate","lipa","noun-adj",""
"15","//","","","","punct",""
"16","26","","","","ind",""
"17","//","","","","punct",""
"","</s>","","","","",""
"","<s number=""49"">","","","","",""
"1","atha","","","atha","ind",""
"2","te","","","tad","pron",""
"3","tīrthikās","TĪRTHIK","ās","tīrthika","noun-adj",""
"4","tuṣṭā","TUṢṬ","ā","tuṣṭa","noun-adj",""
"5","vikalpa","VIKALP","a@","vikalpa","noun-adj",""
"6","rahitās","RAHIT","ās","rahita","noun-adj",""
"7","tadā","","","tadā","ind",""
"8","bhāvanāṃ","BHĀVAN","āṃ","bhāvanā","noun-adj",""
"9","samādhāya","SAMĀDHĀY","a","samādhāya","noun-adj",""
"10","mahāyāna","MAHĀYĀN","a@","mahāyāna","noun-adj",""
"11","yajña","YAJÑ","a@","yajña","noun-adj",""
"12","lābhino","LĀBH","ino","lābhin","noun-adj",""
"13","abhūvan","ABHŪ","van","abhūvat","noun-adj",""
"14","niti","NIT","i","niti","noun-adj",""
"15","//","","","","punct",""
"","</s>","","","","",""
"","</page>","","","","",""
"","</doc>","","","","",""
"","<","","","","",""
