"WordID","word","NormSTEM","suffix","lemma","PoS","Root"
"","<doc textid = ""madhyamakavatarach6verses"" genre = ""śāstra"" title = ""madhyamakāvatārach6verses"" author = ""candrakīrti"" discourse = ""philosophy"" tradition = ""madhyamaka"" period = ""commentarial"" source = ""bibliotheca polyglotta aug 2019"" date_range = ""7. ce"" notes = ""see also li xuezhu. madhyamakāvatārakārikā chapter 6. in journal of indian philosophy 2015 43 pp. 1-30"" religion = ""buddh"" edition = ""based on the ed. by li xuezhu 2012 page number = verse number - 1"" digitization = ""n /a"" segmentation_lemmatization = ""ligeia lugli & buddhist translators workbench team"" metadata_enrichment = ""bruno galasek-hul & buddhist translators workbench team"" proofreader = ""n/a"" permission = ""open access"" reconstructions = ""none"">","","","","",""
"","<page number=""6"">","","","","",""
"","<s number=""1"">","","","","",""
"1","samāhite","SAMĀHIT","e","samāhita","noun-adj",""
"2","cetasi","CETAS","i","cetas","noun-adj",""
"3","saṃsthito","SAṂSTHIT","o","saṃsthita","noun-adj",""
"4","asau","","","adas","pron",""
"5","saṃbuddha","SAṂBUDDH","a@","saṃbuddha","noun-adj",""
"6","dharmābhimukho","DHARMĀBHIMUKH","o","dharmābhimukha","noun-adj",""
"7","abhimukhyām","ABHIMUKH","yām","abhimukhī","noun-adj",""
"8","/","","","","punct",""
"9","idaṃ","IDAṂ","","idam","pron",""
"10","pratītya","PRATĪTY","a@","pratītya","noun-adj",""
"11","odaya","UDAY","a@","udaya","noun-adj",""
"12","dṛṣṭa","DṚṢṬ","a@","dṛṣṭa","noun-adj",""
"13","tattvaḥ","TATTV","aḥ","tad","pron",""
"14","prajñā","PRAJÑ","ā@","prajñā","noun-adj",""
"15","vihārāt","VIHĀR","āt","vihāra","noun-adj",""
"16","tu","","","tu","ind",""
"17","nirodham","NIRODH","am","nirodha","noun-adj",""
"18","eti","","","iti","ind",""
"19","//","","","","punct",""
"","</s>","","","","",""
"","</page>","","","","",""
"","<page number=""6.1"">","","","","",""
"","<s number=""2"">","","","","",""
"1","ekena","EK","ena","eka","noun-adj",""
"2","puṃsa","PUṂS","a@","puṃsa","noun-adj",""
"3","ākṣi","ĀKṢ","i@","ākṣi","noun-adj",""
"4","matā","MAT","ā","mata","noun-adj",""
"5","yath","","","yathā","ind",""
"6","^","","","","",""
"7","eṣṭaṃ","EṢṬ","aṃ","eṣṭa","noun-adj",""
"8","deśaṃ","DEŚ","aṃ","deśa","noun-adj",""
"9","samasto","SAMAST","o","samasta","noun-adj",""
"10","andha","ANDH","a@","andha","noun-adj",""
"11","gaṇaḥ","GAṆ","aḥ","gaṇa","noun-adj",""
"12","sukhena","SUKH","ena","sukha","noun-adj",""
"13","/","","","","punct",""
"14","ākṛṣyate","ĀKṚṢ","yate","ākṛṣ","verb",""
"15","tadvad","TADVAD","","tadvat","noun-adj",""
"16","ih","","","iha","ind",""
"17","ākṣi","ĀKṢ","i@","ākṣi","noun-adj",""
"18","hīna","HĪN","a","hīna","noun-adj",""
"19","^","","","","",""
"20","ān","","","alpha_privativum","ind",""
"21","ādāya","ĀDĀY","a","ādāya","noun-adj",""
"22","dhīr","DHĪR","","dhīra","noun-adj",""
"23","yāti","","","","ind",""
"24","guṇān","GUṆ","ān","guṇa","noun-adj",""
"25","jinatvam","JIN","atvam","jinatva","noun-adj",""
"26","//","","","","punct",""
"","</s>","","","","",""
"","</page>","","","","",""
"","<page number=""6.2"">","","","","",""
"","<s number=""3"">","","","","",""
"1","dharmān","DHARM","ān","dharma","noun-adj",""
"2","sa","","","sa_saha","ind",""
"3","gambhīratarān","GAMBHĪR","atarān","gambhīra","noun-adj",""
"4","ava","","","","ind",""
"5","iti","","","iti","ind",""
"6","yath","","","yathā","ind",""
"7","^","","","","",""
"8","āgamen","ĀGAM","en","āgama","noun-adj",""
"9","^","","","","",""
"10","āpi","ĀPI","","api","noun-adj",""
"11","ca","","","ca","ind",""
"12","yuktitaś","YUKT","itaś","yukta","noun-adj",""
"13","ca","","","ca","ind",""
"14","/","","","","punct",""
"15","tath","","","tathā","ind",""
"16","^","","","","",""
"17","ārya","ĀRY","a@","ārya","noun-adj",""
"18","nāga","NĀG","a@","nāga","noun-adj",""
"19","ārjuna","ARJUN","a@","arjuna","noun-adj",""
"20","nītitas","NĪT","itas","nīta","noun-adj",""
"21","tān","","","tad","pron",""
"22","yath","","","yathā","ind",""
"23","^","","","","",""
"24","āsthita","ĀSTHIT","a@","āsthita","noun-adj",""
"25","prakriyayā","PRAKRIY","ayā","prakriyā","noun-adj",""
"26","bravīmi","BRAV","īmi","brava","noun-adj","brū"
"27","//","","","","punct",""
"","</s>","","","","",""
"","</page>","","","","",""
"","<page number=""6.3"">","","","","",""
"","<s number=""4"">","","","","",""
"1","pṛthagjanatve","PṚTHAGJAN","atve","pṛthagjana","noun-adj",""
"2","api","","","api","ind",""
"3","niśamya","NIŚAMY","a","niśamya","noun-adj",""
"4","śūnyatāṃ","ŚŪNYAT","āṃ","śūnyatā","noun-adj",""
"5","pramodam","PRAMOD","am","pramoda","noun-adj",""
"6","antar","ANTAR","@","antara","noun-adj",""
"7","labhate","LABH","ate","labh","verb","labh"
"8","muhur","MUH","ur","muhu","noun-adj",""
"9","muhuḥ","MUH","uḥ","muhu","noun-adj",""
"10","/","","","","punct",""
"11","prasādaj","PRASĀD","aj","prasādat","noun-adj",""
"12","āsrāvila","ĀSRĀV","ila","āsrāva","noun-adj",""
"13","jāta","JĀT","a@","jāta","noun-adj",""
"14","locanas","LOCAN","as","locana","noun-adj",""
"15","tanū","TAN","ū","tanū","noun-adj",""
"16","ruha","RUH","a@","ruha","noun-adj",""
"17","otphulla","UTPHULL","a@","utphulla","noun-adj",""
"18","tan","TAN","","tad","pron",""
"19","uś","","","","ind",""
"20","ca","","","ca","ind",""
"21","jāyate","JĀ","yate","jan","verb","jan"
"22","//","","","","punct",""
"23","6.4","","","","punct",""
"24","yas","","","yad","pron",""
"25","tasya","","","tad","pron",""
"26","saṃbuddha","SAṂBUDDH","a@","saṃbuddha","noun-adj",""
"27","dhiyo","DHIY","o","dhiyāyate","noun-adj",""
"28","asti","","","as","verb","as"
"29","bījaṃ","BĪJ","aṃ","bīja","noun-adj",""
"30","tattva","TATTV","a@","tad","pron",""
"31","opadeśasya","UPADEŚ","asya","upadeśa","noun-adj",""
"32","ca","","","ca","ind",""
"33","bhājanaṃ","BHĀJAN","aṃ","bhājana","noun-adj",""
"34","saḥ","","","tad","pron",""
"35","/","","","","punct",""
"36","ākhyeyam","ĀKHYEY","am","ākhyeya","noun-adj",""
"37","asmai","","","idam","pron",""
"38","paramārtha","PARAMĀRTH","a@","paramārtha","noun-adj",""
"39","satyaṃ","SATY","aṃ","satya","noun-adj",""
"40","tad","TAD","","tadā","ind",""
"41","avn","","","","ind",""
"42","vayās","VAY","ās","vaya","noun-adj",""
"43","tasya","","","tad","pron",""
"44","guṇā","GUṆ","ā","guṇa","noun-adj",""
"45","bhavanti","BHAV","anti","bhav","verb","bhū"
"46","//","","","","punct",""
"47","6.5","","","","punct",""
"48","śīlaṃ","ŚĪL","aṃ","śīla","noun-adj",""
"49","samādāya","SAMĀDĀY","a","samādāya","noun-adj",""
"50","sad","","","sat","ind",""
"51","^","","","","",""
"52","aiva","","","eva","ind",""
"53","vartate","VART","ate","vart","verb","vṛt"
"54","dadāti","DAD","āti","dadat","noun-adj",""
"55","dānaṃ","DĀN","aṃ","dāna","noun-adj",""
"56","karuṇāṃ","KARUṆ","āṃ","karuṇā","noun-adj",""
"57","ca","","","ca","ind",""
"58","sevate","SEV","ate","sev","verb","sev"
"59","/","","","","punct",""
"60","titikṣate","TITIKṢ","ate","titikṣat","noun-adj",""
"61","tat","TAT","","tad","pron",""
"62","kuśalaṃ","KUŚAL","aṃ","kuśala","noun-adj",""
"63","ca","","","ca","ind",""
"64","bodhaye","BODHAY","e","bodhayat","noun-adj",""
"65","praṇāmayaty","PRAṆĀM","ayaty","praṇām","verb",""
"66","eva","","","eva","ind",""
"67","jada","","","","ind",""
"68","vimuktaye","VIMUKT","aye","vimukti","noun-adj",""
"69","//","","","","punct",""
"70","6.6","","","","punct",""
"71","saṃbodhisattveṣu","SAṂBODHISATTV","eṣu","saṃbodhisattva","noun-adj",""
"72","karoti","KAR","oti","kar","verb","kṛ"
"73","gauravam","GAURAV","am","gaurava","noun-adj",""
"74","udāra","UDĀR","a@","udāra","noun-adj",""
"75","gaṃbhīra","GAMBHĪR","a@","gambhīra","noun-adj",""
"76","naye","NAY","e","naya","noun-adj",""
"77","vici","VIC","i@","vici","noun-adj",""
"78","kṣaṇaḥ","KṢAṆ","aḥ","kṣaṇa","noun-adj",""
"79","/","","","","punct",""
"80","labheta","LABH","eta","labh","verb","labh"
"81","bhūmiṃ","BHŪM","iṃ","bhūmi","noun-adj",""
"82","muditāṃ","MUDIT","āṃ","muditā","noun-adj",""
"83","janaḥ","JAN","aḥ","jana","noun-adj",""
"84","kramāt","KRAM","āt","krama","noun-adj",""
"85","tad","TAD","","tadā","ind",""
"86","arthin","ARTH","in","arthin","noun-adj",""
"87","^","","","","",""
"88","eṣā","","","tad","pron",""
"89","padavī","PAD","avī","pada","noun-adj",""
"90","niśāmyatām","NIŚĀMY","atām","niśāmyatā","noun-adj",""
"91","//","","","","punct",""
"","</s>","","","","",""
"","</page>","","","","",""
"","<page number=""6.7"">","","","","",""
"","<s number=""5"">","","","","",""
"1","tebhyas","","","","ind",""
"2","ta","","","tad","pron",""
"3","eva","","","eva","ind",""
"4","na","","","na","ind",""
"5","bhavanti","BHAV","anti","bhav","verb","bhū"
"6","kutaḥ","KUT","aḥ","kuta","noun-adj",""
"7","parebhyo","PAR","ebhyo","para","noun-adj",""
"8","dvābhyāṃ","DV","ābhyāṃ","dva","noun-adj",""
"9","na","","","na","ind",""
"10","c","","","ca","ind",""
"11","^","","","","",""
"12","āpi","","","api","ind",""
"13","kuta","KUT","a","kuta","noun-adj",""
"14","eva","","","eva","ind",""
"15","vina","VIN","a","vinā","noun-adj",""
"16","^","","","","",""
"17","aiva","","","eva","ind",""
"18","hetum","HET","um","hetu","noun-adj",""
"19","/","","","","punct",""
"20","tasmād","TASMĀD","","tad","pron",""
"21","hi","","","hi","ind",""
"22","tasya","","","tad","pron",""
"23","bhavane","BHAVAN","e","bhavana","noun-adj",""
"24","na","","","na","ind",""
"25","guṇo","GUṆ","o","guṇa","noun-adj",""
"26","asti","","","as","verb","as"
"27","kaścij","KAŚCI","j","kimcit","noun-adj",""
"28","jātasya","JĀT","asya","jāta","noun-adj",""
"29","janma","JANM","a","janma","noun-adj",""
"30","punar","","","punar","ind",""
"31","eva","","","eva","ind",""
"32","ca","","","ca","ind",""
"33","n","","","na","ind",""
"34","^","","","","",""
"35","aiva","","","eva","ind",""
"36","yuktam","YUKT","am","yukta","noun-adj",""
"37","//","","","","punct",""
"38","jātasya","JĀT","asya","jāta","noun-adj",""
"39","janmani","JANM","ani","janmat","noun-adj",""
"40","punaḥ","","","punar","ind",""
"41","parikalpyamane","PARIKALPY","amane","parikalpya","noun-adj",""
"42","n","","","na","ind",""
"43","^","","","","",""
"44","aiv","","","eva","ind",""
"45","āṅkura","AṄKUR","a@","aṅkura","noun-adj",""
"46","ādaya","ĀD","aya","ād","verb",""
"47","iha","","","iha","ind",""
"48","prabhavaṃ","PRABHAV","aṃ","prabhava","noun-adj",""
"49","labheran","LABH","eran","labh","verb","labh"
"50","/","","","","punct",""
"51","bījasya","BĪJ","asya","bīja","noun-adj",""
"52","ca","","","ca","ind",""
"53","prabhava","PRABHAV","a","prabhava","noun-adj",""
"54","eva","","","eva","ind",""
"55","bhaved","BHAV","ed","bhav","verb","bhū"
"56","bhava","BHAV","a@","bhava","noun-adj",""
"57","āntaṃ","ANT","aṃ","anta","noun-adj",""
"58","ten","","","tad","pron",""
"59","^","","","","",""
"60","aiva","","","eva","ind",""
"61","tasya","","","tad","pron",""
"62","hi","","","hi","ind",""
"63","kathaṃ","","","katham","ind",""
"64","ca","","","ca","ind",""
"65","bhaved","BHAV","ed","bhav","verb","bhū"
"66","vināśaḥ","VINĀŚ","aḥ","vināśa","noun-adj",""
"67","//","","","","punct",""
"","</s>","","","","",""
"","</page>","","","","",""
"","<page number=""6.9"">","","","","",""
"","<s number=""6"">","","","","",""
"1","saṃsthāna","SAṂSTHĀN","a@","saṃsthāna","noun-adj",""
"2","varṇa","VARṆ","a@","varṇa","noun-adj",""
"3","rasa","RAS","a@","rasa","noun-adj",""
"4","vīrya","VĪRY","a@","vīrya","noun-adj",""
"5","vipāka","VIPĀK","a@","vipāka","noun-adj",""
"6","bhedāḥ","BHED","āḥ","bheda","noun-adj",""
"7","syur","","","as","verb","as"
"8","n","","","na","ind",""
"9","āṅkurasya","AṄKUR","asya","aṅkura","noun-adj",""
"10","tava","","","tvat","pron",""
"11","kāraṇato","KĀRAṆ","ato","kāraṇa","noun-adj",""
"12","vibhinna","VIBHINN","a","vibhinna","noun-adj",""
"13","/","","","","punct",""
"14","prāgāma","PRĀGĀM","a@","prāgāma","noun-adj",""
"15","bhāvam","BHĀV","am","bhāva","noun-adj",""
"16","avadhūya","AVADHŪY","a","avadhūya","noun-adj",""
"17","tad","TAD","","tadā","ind",""
"18","anya","ANY","a@","anya","noun-adj",""
"19","rūpam","RŪP","am","rūpa","noun-adj",""
"20","āpadyate","ĀPAD","yate","āpad","verb","āpad"
"21","yadi","","","yadi","ind",""
"22","tadāsya","TAD","āsya","tadā","ind",""
"23","kathaṃ","","","katham","ind",""
"24","hi","","","hi","ind",""
"25","tattvam","TATTV","am","tad","pron",""
"26","//","","","","punct",""
"","</s>","","","","",""
"","</page>","","","","",""
"","<page number=""6.10"">","","","","",""
"","<s number=""7"">","","","","",""
"1","bījād","BĪJ","ād","bīja","noun-adj",""
"2","ananya","ANANY","a","ananya","noun-adj",""
"3","iha","","","iha","ind",""
"4","te","","","tad","pron",""
"5","yadi","","","yadi","ind",""
"6","c","","","ca","ind",""
"7","^","","","","",""
"8","āṅkuraḥ","AṄKUR","aḥ","aṅkura","noun-adj",""
"9","syād","","","as","verb","as"
"10","gṛhyeta","GṚH","yeta","gṛhṇ","verb","grah"
"11","n","","","na","ind",""
"12","^","","","","",""
"13","aiva","","","eva","ind",""
"14","hi","","","hi","ind",""
"15","sa","","","sa_saha","ind",""
"16","bījam","BĪJ","am","bīja","noun-adj",""
"17","iv","","","iva","ind",""
"18","āṅkura","AṄKUR","a@","aṅkura","noun-adj",""
"19","ākhyaḥ","ĀKHY","aḥ","ākhya","noun-adj",""
"20","/","","","","punct",""
"21","gṛhyeta","GṚH","yeta","gṛhṇ","verb","grah"
"22","vā","","","vā","ind",""
"23","tad","TAD","","tadā","ind",""
"24","api","","","api","ind",""
"25","nāma","NĀM","a","nāman","noun-adj",""
"26","yath","","","yathā","ind",""
"27","^","","","","",""
"28","āṅkuro","AṄKUR","o","aṅkura","noun-adj",""
"29","ayaṃ","AYAṂ","","idam","pron",""
"30","tattvāt","TATTV","āt","tad","pron",""
"31","tayor","","","tad","pron",""
"32","iti","","","iti","ind",""
"33","na","","","na","ind",""
"34","c","","","ca","ind",""
"35","aitad","AITAD","","tad","pron",""
"36","ato","","","atas","ind",""
"37","aby","","","","ind",""
"38","upeyam","UPEY","am","upeya","noun-adj",""
"39","//","","","","punct",""
"","</s>","","","","",""
"","</page>","","","","",""
"","<page number=""6.11"">","","","","",""
"","<s number=""8"">","","","","",""
"1","loko","LOK","o","loka","noun-adj",""
"2","api","","","api","ind",""
"3","c","","","ca","ind",""
"4","aikyam","AIKY","am","aikya","noun-adj",""
"5","anayor","","","idam","pron",""
"6","iti","","","iti","ind",""
"7","n","","","na","ind",""
"8","ābhyupaiti","ĀBHYUPAIT","i","ābhyupai","verb","ābhyupe"
"8","ābhyupaiti","ĀBHYUPAIT","i","ābhyupe","verb","ābhyupi"
"9","naṣṭe","NAṢṬ","e","naṣṭa","noun-adj",""
"10","api","","","api","ind",""
"11","paśyati","PAŚ","yati","paś","verb","paś"
"12","yataḥ","","","yatas","ind",""
"13","phalam","PHAL","am","phala","noun-adj",""
"14","eṣa","","","tad","pron",""
"15","hetau","HET","au","heti","noun-adj",""
"16","/","","","","punct",""
"17","tasmān","","","tad","pron",""
"18","na","","","na","ind",""
"19","tattvata","TATTV","ata","tad","pron",""
"20","idaṃ","IDAṂ","","idam","pron",""
"21","na","","","na","ind",""
"22","ca","","","ca","ind",""
"23","lokataś","LOK","ataś","loka","noun-adj",""
"24","ca","","","ca","ind",""
"25","yuktaṃ","YUKT","aṃ","yukta","noun-adj",""
"26","svato","SVAT","o","svata","noun-adj",""
"27","bhavati","BHAV","ati","bhav","verb","bhū"
"28","bhāva","BHĀV","a","bhāva","noun-adj",""
"29","iti","","","iti","ind",""
"30","prakalpam","PRAKALP","am","prkalp","verb","prkḷp"
"31","//","","","","punct",""
"","</s>","","","","",""
"","</page>","","","","",""
"","<page number=""6.12"">","","","","",""
"","<s number=""9"">","","","","",""
"1","janyasya","JANY","asya","janya","noun-adj",""
"2","c","","","ca","ind",""
"3","^","","","","",""
"4","aiva","","","eva","ind",""
"5","janakasya","JANAK","asya","janaka","noun-adj",""
"6","ca","","","ca","ind",""
"7","karmaṇaś","KARM","aṇaś","karman","noun-adj",""
"8","ca","","","ca","ind",""
"9","kartuś","KART","uś","kartu","noun-adj",""
"10","ca","","","ca","ind",""
"11","janmani","JANM","ani","janmat","noun-adj",""
"12","bhavet","BHAV","et","bhav","verb","bhū"
"13","svata","","","","ind",""
"14","iṣyamāṇe","IṢ","yamāṇe","icch","verb","iṣ1"
"14","iṣyamāṇe","IṢ","yamāṇe","eṣ","verb","iṣ2"
"15","/","","","","punct",""
"16","aikyaṃ","AIKY","aṃ","aikya","noun-adj",""
"17","na","","","na","ind",""
"18","c","","","ca","ind",""
"19","aikyam","AIKY","am","aikya","noun-adj",""
"20","anayor","","","idam","pron",""
"21","iti","","","iti","ind",""
"22","nābhyu","NĀBHY","u@","nābhya","noun-adj",""
"23","peyaṃ","PEY","aṃ","peya","noun-adj",""
"24","janma","JANM","a","janma","noun-adj",""
"25","svato","SVAT","o","svata","noun-adj",""
"26","vihita","VIHIT","a@","vihita","noun-adj",""
"27","vistara","VISTAR","a@","vistara","noun-adj",""
"28","doṣa","DOṢ","a@","doṣa","noun-adj",""
"29","sakteḥ","SAKT","eḥ","sakti","noun-adj",""
"30","//","","","","punct",""
"","</s>","","","","",""
"","</page>","","","","",""
"","<page number=""6.13"">","","","","",""
"","<s number=""10"">","","","","",""
"1","anyat","ANY","at","anyat","noun-adj",""
"2","pratītya","PRATĪTY","a","pratītya","noun-adj",""
"3","yadi","","","yadi","ind",""
"4","nāma","NĀM","a","nāman","noun-adj",""
"5","paro","PAR","o","para","noun-adj",""
"6","a","","","alpha_privativum","ind",""
"7","bhaviṣyaj","BHAVIṢY","aj","bhaviṣyat","noun-adj",""
"8","jāyeta","JĀ","yeta","jan","verb","jan"
"9","tarhi","","","tarhi","ind",""
"10","bahulaḥ","BAHUL","aḥ","bahula","noun-adj",""
"11","śikhino","ŚIKH","ino","śikhin","noun-adj",""
"12","andhakāraḥ","ANDHAKĀR","aḥ","andhakāra","noun-adj",""
"13","/","","","","punct",""
"14","sarvasya","SARV","asya","sarva","noun-adj",""
"15","janma","JANM","a","janma","noun-adj",""
"16","ca","","","ca","ind",""
"17","bhavet","BHAV","et","bhav","verb","bhū"
"18","khalu","KHAL","u","khal","verb",""
"19","sarvataś","SARVAT","aś","sarvata","noun-adj",""
"20","ca","","","ca","ind",""
"21","tulyaṃ","TULY","aṃ","tulya","noun-adj",""
"22","paratvam","PAR","atvam","para","noun-adj",""
"23","a","","","alpha_privativum","ind",""
"24","khile","KHIL","e","khila","noun-adj",""
"25","a","","","alpha_privativum","ind",""
"26","janake","JANAK","e","janaka","noun-adj",""
"27","api","","","api","ind",""
"28","yasmāt","YASMĀT","","yad","pron",""
"29","//","","","","punct",""
"","</s>","","","","",""
"","</page>","","","","",""
"","<page number=""6.14"">","","","","",""
"","<s number=""11"">","","","","",""
"1","śakyaṃ","ŚAKY","aṃ","śakya","noun-adj",""
"2","prakartum","PRAKART","um","prakartu","noun-adj",""
"3","iti","","","iti","ind",""
"4","kārya","KĀRY","a","kārya","noun-adj",""
"5","ato","","","atas","ind",""
"6","niruktaṃ","NIRUKT","aṃ","nirukta","noun-adj",""
"7","śaktaṃ","ŚAKT","aṃ","śakta","noun-adj",""
"8","yad","","","yadi","ind",""
"9","asya","","","idam","pron",""
"10","janane","JANAN","e","janana","noun-adj",""
"11","sa","","","sa_saha","ind",""
"12","paro","PAR","o","para","noun-adj",""
"13","api","","","api","ind",""
"14","hetuḥ","HET","uḥ","hetu","noun-adj",""
"15","/","","","","punct",""
"16","janm","JANM","","janma","noun-adj",""
"17","aika","EK","a@","eka","noun-adj",""
"18","santati","SAṂTAT","i@","saṃtati","noun-adj",""
"19","gatāj","GAT","āj","gata","noun-adj",""
"20","janakāc","JANAK","āc","janaka","noun-adj",""
"21","ca","","","ca","ind",""
"22","tas","","","","ind",""
"23","māc","MĀC","","māca","noun-adj",""
"24","chāly","CHĀL","y@","chāla","noun-adj",""
"25","aṅkurasya","AṄKUR","asya","aṅkura","noun-adj",""
"26","na","","","na","ind",""
"27","tathā","","","tathā","ind",""
"28","ca","","","ca","ind",""
"29","yava","YAV","a@","yava","noun-adj",""
"30","āditaś","ĀDIT","aś","ādita","noun-adj",""
"31","cet","CET","","ced","noun-adj",""
"32","//","","","","punct",""
"","</s>","","","","",""
"","</page>","","","","",""
"","<page number=""6.15"">","","","","",""
"","<s number=""12"">","","","","",""
"1","iṣṭā","IṢṬ","ā","iṣṭā","noun-adj",""
"2","yathā","","","yathā","ind",""
"3","na","","","na","ind",""
"4","janakā","JANAK","ā","janaka","noun-adj",""
"5","na","","","na","ind",""
"6","ca","","","ca","ind",""
"7","śakti","ŚAKT","i@","śakti","noun-adj",""
"8","yuktā","YUKT","ā","yukta","noun-adj",""
"9","n","","","na","ind",""
"10","^","","","","",""
"11","aiv","","","eva","ind",""
"12","aika","EK","a@","eka","noun-adj",""
"13","santati","SAṂTAT","i@","saṃtati","noun-adj",""
"14","gatāḥ","GAT","āḥ","gata","noun-adj",""
"15","sadṛśā","SADṚŚ","ā","sadṛśa","noun-adj",""
"16","na","","","na","ind",""
"17","c","","","ca","ind",""
"18","^","","","","",""
"19","aiva","","","eva","ind",""
"20","/","","","","punct",""
"21","śāly","ŚĀL","y@","śāli","noun-adj",""
"22","aṅkurasya","AṄKUR","asya","aṅkura","noun-adj",""
"23","yavake","YAVAK","e","yavaka","noun-adj",""
"24","sarakiṃ","SARAK","iṃ","saraka","noun-adj",""
"25","śuka","ŚUK","a@","śuka","noun-adj",""
"26","ādyā","ĀD","yā","ādi","noun-adj",""
"27","no","","","asmat","pron",""
"28","śāli","ŚĀL","i@","śāli","noun-adj",""
"29","bījam","BĪJ","am","bīja","noun-adj",""
"30","api","","","api","ind",""
"31","tasya","","","tad","pron",""
"32","tathā","","","tathā","ind",""
"33","paratvāt","PAR","atvāt","para","noun-adj",""
"34","//","","","","punct",""
"","</s>","","","","",""
"","</page>","","","","",""
"","<page number=""6.16"">","","","","",""
"","<s number=""13"">","","","","",""
"1","asty","ASTY","","as","verb","as"
"2","aṅkuraś","AṄKUR","aś","aṅkura","noun-adj",""
"3","ca","","","ca","ind",""
"4","na","","","na","ind",""
"5","hi","","","hi","ind",""
"6","bīja","BĪJ","a@","bīja","noun-adj",""
"7","samāna","SAMĀN","a@","samāna","noun-adj",""
"8","kālo","KĀL","o","kāla","noun-adj",""
"9","bījaṃ","BĪJ","aṃ","bīja","noun-adj",""
"10","kutaḥ","KUT","aḥ","kuta","noun-adj",""
"11","paratay","PAR","atay","para","noun-adj",""
"12","^","","","","",""
"13","āstu","","","as","verb","as"
"14","vinā","","","vinā","ind",""
"15","paratvam","PAR","atvam","para","noun-adj",""
"16","/","","","","punct",""
"17","janma","JANM","a@","janma","noun-adj",""
"18","āṅkurasya","AṄKUR","asya","aṅkura","noun-adj",""
"19","na","","","na","ind",""
"20","hi","","","hi","ind",""
"21","sidhyati","SIDH","yati","sidh","verb",""
"22","tena","","","tad","pron",""
"23","bījāt","BĪJ","āt","bīja","noun-adj",""
"24","saṃtyajyatāṃ","SAṂTYAJ","yatāṃ","saṃtyaja","noun-adj",""
"25","parata","PAR","ata","para","noun-adj",""
"26","udbhavati","UDBHAV","ati","udbhav","verb","udbhū"
"27","iti","","","iti","ind",""
"28","pakṣaḥ","PAKṢ","aḥ","pakṣa","noun-adj",""
"29","//","","","","punct",""
"","</s>","","","","",""
"","</page>","","","","",""
"","<page number=""6.17"">","","","","",""
"","<s number=""14"">","","","","",""
"1","an","","","alpha_privativum","ind",""
"2","tad","TAD","","tadā","ind",""
"3","vayasya","VAYASY","a","vayasya","noun-adj",""
"4","naman","NAM","an","namat","noun-adj",""
"5","onnamane","UNNAMAN","e","unnamana","noun-adj",""
"6","tu","","","tu","ind",""
"7","lāyā","LĀY","ā","lāya","noun-adj",""
"8","dṛṣṭe","DṚṢṬ","e","dṛṣṭa","noun-adj",""
"9","yathā","","","yathā","ind",""
"10","na","","","na","ind",""
"11","khalu","KHAL","u","khal","verb",""
"12","n","","","na","ind",""
"13","^","","","","",""
"14","aiva","","","eva","ind",""
"15","samāna","SAMĀN","a@","samāna","noun-adj",""
"16","kāle","KĀL","e","kāla","noun-adj",""
"17","/","","","","punct",""
"18","syātāṃ","","","as","verb","as"
"19","tathā","","","tathā","ind",""
"20","janaka","JANAK","a@","janaka","noun-adj",""
"21","janya","JANY","a@","janya","noun-adj",""
"22","nirodha","NIRODH","a@","nirodha","noun-adj",""
"23","jātī","JĀT","ī","jātī","noun-adj",""
"24","yady","","","yadi","ind",""
"25","ekadā","EKAD","ā","ekadā","noun-adj",""
"26","tad","TAD","","tadā","ind",""
"27","a","","","alpha_privativum","ind",""
"28","sad","SAD","","sat","noun-adj",""
"29","atra","","","atra","ind",""
"30","vin","VIN","","vinā","noun-adj",""
"31","aika","EK","a@","eka","noun-adj",""
"32","kālam","KĀL","am","kāla","noun-adj",""
"33","//","","","","punct",""
"","</s>","","","","",""
"","</page>","","","","",""
"","<page number=""6.18"">","","","","",""
"","<s number=""15"">","","","","",""
"1","janma","JANM","a@","janma","noun-adj",""
"2","onmukhaṃ","UNMUKH","aṃ","unmukha","noun-adj",""
"3","na","","","na","ind",""
"4","sad","SAD","@","sat","noun-adj",""
"5","idaṃ","IDAṂ","","idam","pron",""
"6","yadi","","","yadi","ind",""
"7","jāyamānaṃ","JĀ","yamānaṃ","jan","verb","jan"
"8","nāśa","NĀŚ","a@","nāśa","noun-adj",""
"9","onmukhaṃ","UNMUKH","aṃ","unmukha","noun-adj",""
"10","sad","SAD","","sat","noun-adj",""
"11","api","","","api","ind",""
"12","nāma","NĀM","a","nāman","noun-adj",""
"13","niruddhyamānam","NIRUDDH","yamānam","niruddha","noun-adj",""
"14","/","","","","punct",""
"15","iṣṭaṃ","IṢṬ","aṃ","iṣṭa","noun-adj",""
"16","tadā","","","tadā","ind",""
"17","katham","KATHAM","","katham","ind",""
"18","idaṃ","IDAṂ","","idam","pron",""
"19","tulayā","TULAY","ā","tulayati","noun-adj",""
"20","samānaṃ","SAMĀN","aṃ","samāna","noun-adj",""
"21","kartrā","KARTR","ā","kartra","noun-adj",""
"22","vinā","","","vinā","ind",""
"23","janir","JAN","ir","jani","noun-adj",""
"24","iyaṃ","","","idam","pron",""
"25","na","","","na","ind",""
"26","ca","","","ca","ind",""
"27","y","","","","ind",""
"28","ukarūpā","UKAR","ūpā","ukara","noun-adj",""
"29","//","","","","punct",""
"","</s>","","","","",""
"","</page>","","","","",""
"","<page number=""6.19"">","","","","",""
"","<s number=""16"">","","","","",""
"1","cakṣa","CAKṢ","a@","cakṣu","noun-adj",""
"2","urdhiyaḥ","URD","hiyaḥ","urdi","noun-adj",""
"3","sva","SV","a@","sva","noun-adj",""
"4","janakaiḥ","JANAK","aiḥ","janaka","noun-adj",""
"5","khalu","KHAL","u","khal","verb",""
"6","cakṣur","CAKṢ","ur","cakṣu","noun-adj",""
"7","ādyaiḥ","ĀDY","aiḥ","ādya","noun-adj",""
"8","saṃjña","SAṂJÑ","a@","saṃjñā","noun-adj",""
"9","ādibhiś","ĀD","ibhiś","ādi","noun-adj",""
"10","ca","","","ca","ind",""
"11","saha","SAH","a@","sa_saha","ind",""
"12","bhāvibhir","BHĀV","ibhir","bhāvin","noun-adj",""
"13","eka","EK","a@","eka","noun-adj",""
"14","kālaiḥ","KĀL","aiḥ","kāla","noun-adj",""
"15","/","","","","punct",""
"16","anyatvam","ANY","atvam","anyatva","noun-adj",""
"17","asti","","","as","verb","as"
"18","yadi","","","yadi","ind",""
"19","kiṃ","","","kim","pron",""
"20","bhavanena","BHAVAN","ena","bhavana","noun-adj",""
"21","satyāṃ","SATY","āṃ","satya","noun-adj",""
"22","n","","","na","ind",""
"23","^","","","","",""
"24","āsyāḥ","","","idam","pron",""
"25","satītvam","SAT","ītvam","sat","noun-adj",""
"26","atha","","","atha","ind",""
"27","ced","","","ced","ind",""
"28","vihito","VIHIT","o","vihita","noun-adj",""
"29","atra","","","atra","ind",""
"30","doṣaḥ","DOṢ","aḥ","doṣa","noun-adj",""
"31","//","","","","punct",""
"","</s>","","","","",""
"","</page>","","","","",""
"","<page number=""6.20"">","","","","",""
"","<s number=""17"">","","","","",""
"1","janyaṃ","JANY","aṃ","janya","noun-adj",""
"2","paraṃ","PAR","aṃ","para","noun-adj",""
"3","ca","","","ca","ind",""
"4","janayej","JANAY","ej","janayat","noun-adj",""
"5","janakaḥ","JANAK","aḥ","janaka","noun-adj",""
"6","sa","","","sa_saha","ind",""
"7","hetuḥ","HET","uḥ","hetu","noun-adj",""
"8","sad","SAD","","sat","noun-adj",""
"9","v","","","vā","ind",""
"10","^","","","","",""
"11","ātha","","","","ind",""
"12","c","","","ca","ind",""
"13","^","","","","",""
"14","ā","","","alpha_privativum","ind",""
"15","sad","SAD","@","sat","noun-adj",""
"16","ubhayaṃ","UBHAY","aṃ","ubhaya","noun-adj",""
"17","vigata","VIGAT","a@","vigata","noun-adj",""
"18","dvayaṃ","DVAY","aṃ","dvaya","noun-adj",""
"19","vā","","","vā","ind",""
"20","/","","","","punct",""
"21","sac","SAC","","saca","noun-adj",""
"22","cet","CET","","ced","noun-adj",""
"23","kim","","","kim","pron",""
"24","asya","","","idam","pron",""
"25","janakair","JANAK","air","janaka","noun-adj",""
"26","a","","","alpha_privativum","ind",""
"27","sato","SAT","o","sat","noun-adj",""
"28","api","","","api","ind",""
"29","kiṃ","","","kim","pron",""
"30","tair","","","tad","pron",""
"31","dvaite","DVAIT","e","dvaita","noun-adj",""
"32","api","","","api","ind",""
"33","taiḥ","","","tad","pron",""
"34","kim","","","kim","pron",""
"35","atha","","","atha","ind",""
"36","kiṃ","","","kim","pron",""
"37","vigata","VIGAT","a@","vigata","noun-adj",""
"38","dvaye","DVAY","e","dvaya","noun-adj",""
"39","taiḥ","","","tad","pron",""
"40","//","","","","punct",""
"","</s>","","","","",""
"","</page>","","","","",""
"","<page number=""6.21"">","","","","",""
"","<s number=""18"">","","","","",""
"","</s>","","","","",""
"","</page>","","","","",""
"","</doc>","","","","",""
