"WordID","word","NormSTEM","suffix","lemma","PoS","Root"
"","<doc textid = ""mahayanavimzika"" genre = ""śāstra"" title = ""mahāyānaviṃśikā"" author = ""vasubandhu"" discourse = ""philosophy"" tradition = ""madhyamaka"" period = ""uncertain"" source = ""gretil accessed aug 2019 : http://gretil.sub.uni-goettingen.de/gretil/corpustei/sa_nagarjuna mahayanavimsika _final.xml"" date_range = ""4.-5. ce"" notes = ""alternative titles: viṃśatikāvijñaptimātratāsiddhikārikā; viṃśikā; k.h. potter. 2003. buddhist philosophy from 350 to 600 a.d. eip vol. 9. delhi: motilal barnasidass; pp. 180-81 states that the sanskrit text was edited from a śārada manuscript found at ngor monastery in tibet; see giuseppe tucci; minor buddhist texts roma 1956; 1958; japan 1978; delhi 1986 ; pp. 193-208. for a new critical editions of the sanskrit and tibetan texts see jonathan a. silk. 2016. materials toward the study of vasubandhu’s viṃśikā i sanskrit and tibetan critical editions of the verses and autocommentary; an english translation and annotations. cambridge mass: harvard harvard university department of south asian studies."" religion = ""buddh"" edition = ""based on the ed. by g. tucci 1956 pp. 201-203 page number = verse number"" digitization = ""members of the sanskrit buddhist input project"" segmentation_lemmatization = ""ligeia lugli & buddhist translators workbench team"" metadata_enrichment = ""bruno galasek-hul & buddhist translators workbench team"" proofreader = ""n/a"" permission = ""permission for derivatives from m. mehner on behalf of gretil"" reconstructions = ""none"">","","","","",""
"","<page number=""0"">","","","","",""
"","<s number=""0"">","","","","",""
"1","na","","","na","ind",""
"2","jñānāc","JÑĀN","āc","jñāna","noun-adj",""
"3","chūnyatā","ŚŪNYAT","ā","śūnyatā","noun-adj",""
"4","nāma","NĀM","a","nāman","noun-adj",""
"5","kācid","KĀC","id","kimcit","noun-adj",""
"6","anyā","ANY","ā","anyā","noun-adj",""
"7","hi","","","hi","ind",""
"8","vidyate","VID","yate","vid","verb","vid"
"9","/","","","","punct",""
"10","vivikta","VIVIKT","a@","vivikta","noun-adj",""
"11","ā","","","alpha_privativum","ind",""
"12","vyatirekitvaṃ","VYATIREK","itvaṃ","vyatireka","noun-adj",""
"13","vivekasya","VIVEK","asya","viveka","noun-adj",""
"14","yato","","","yatas","ind",""
"15","matam","MAT","am","mata","noun-adj",""
"","</s>","","","","",""
"","</page>","","","","",""
"","<page number=""1"">","","","","",""
"","<s number=""1"">","","","","",""
"1","dvaya","DVAY","a@","dvaya","noun-adj",""
"2","śūnyam","ŚŪNY","am","śūnya","noun-adj",""
"3","hi","","","hi","ind",""
"4","vijñānam","VIJÑĀN","am","vijñāna","noun-adj",""
"5","anyathā","ANYATH","ā","anyathā","ind",""
"6","na","","","na","ind",""
"7","prasajyate","PRASAJ","yate","prasaj","verb",""
"8","/","","","","punct",""
"9","dvaya","DVAY","a@","dvaya","noun-adj",""
"10","ā","","","alpha_privativum","ind",""
"11","sattvān","SATTV","ān","sattva","noun-adj",""
"12","nivṛttasya","NIVṚTT","asya","nivṛtta","noun-adj",""
"13","dvaya","DVAY","a@","dvaya","noun-adj",""
"14","ātmatva","ĀTM","atva","ātman","noun-adj",""
"15","prasan","PRAS","an","prasat","noun-adj",""
"16","gataḥ","GAT","aḥ","gata","noun-adj",""
"","</s>","","","","",""
"","</page>","","","","",""
"","<page number=""2"">","","","","",""
"","<s number=""2"">","","","","",""
"1","tac","","","tad","pron",""
"2","churu","CHUR","u@","churu","noun-adj",""
"3","tat","TAT","","tad","pron",""
"4","at","","","","ind",""
"5","hatā","HAT","ā@","hatā","noun-adj",""
"6","rūpo","RŪP","o","rūpa","noun-adj",""
"7","bhagavān","BHAGAV","ān","bhagavat","noun-adj",""
"8","eva","","","eva","ind",""
"9","bhaṇyate","BHAṆ","yate","bhaṇ","verb",""
"10","/","","","","punct",""
"11","vedya","VEDY","a@","vedya","noun-adj",""
"12","vedaka","VEDAK","a@","vedaka","noun-adj",""
"13","sadbhāva","SADBHĀV","a@","sadbhāva","noun-adj",""
"14","vikalpa","VIKALP","a@","vikalpa","noun-adj",""
"15","ādya","ĀDY","a@","ādya","noun-adj",""
"16","samāśrayaḥ","SAMĀŚRAY","aḥ","samāśraya","noun-adj",""
"","</s>","","","","",""
"","</page>","","","","",""
"","<page number=""3"">","","","","",""
"","<s number=""3"">","","","","",""
"1","citta","CITT","a@","citta","noun-adj",""
"2","mātraṃ","MĀTR","aṃ","mātra","noun-adj",""
"3","nir","","","niḥ_privativum","ind",""
"4","ābhāsaṃ","ĀBHĀS","aṃ","ābhāsa","noun-adj",""
"5","vihāro","VIHĀR","o","vihāra","noun-adj",""
"6","buddhabhūs","BUDDH","abhūs","buddha","noun-adj",""
"7","tathā","","","tathā","ind",""
"8","/","","","","punct",""
"9","etad","ETAD","","tad","pron",""
"10","hi","","","hi","ind",""
"11","bhāṣitaṃ","BHĀṢIT","aṃ","bhāṣita","noun-adj",""
"12","buddhair","BUDDH","air","buddha","noun-adj",""
"13","bhāsante","BHĀSANT","e","bhāsanta","noun-adj",""
"14","bhāṣayanti","BHĀṢ","ayanti","bhāṣ","verb","bhāṣ"
"15","ca","","","ca","ind",""
"","</s>","","","","",""
"","</page>","","","","",""
"","<page number=""4"">","","","","",""
"","<s number=""4"">","","","","",""
"1","cittaṃ","CITT","aṃ","citta","noun-adj",""
"2","hi","","","hi","ind",""
"3","bhūmayaḥ","BHŪMAY","aḥ","bhūmaya","noun-adj",""
"4","sapta","SAPT","a","sapta","noun-adj",""
"5","nir","","","niḥ_privativum","ind",""
"6","ābhāsāt","ĀBHĀS","āt","ābhāsa","noun-adj",""
"7","viha","VIH","a@","viha","noun-adj",""
"8","āṣṭamī","ĀṢṬAM","ī","āṣṭama","noun-adj",""
"9","/","","","","punct",""
"10","dve","DV","e","dva","noun-adj",""
"11","bhūmayo","BHŪMAY","o","bhūmaya","noun-adj",""
"12","vihāro","VIHĀR","o","vihāra","noun-adj",""
"13","atra","","","atra","ind",""
"14","a","","","alpha_privativum","ind",""
"15","śeṣā","ŚEṢ","ā","śeṣā","noun-adj",""
"16","bhūmir","BHŪM","ir","bhūmi","noun-adj",""
"17","mama","MAM","a@","mat","pron",""
"18","ātmikā","ĀTM","ikā","ātman","noun-adj",""
"","</s>","","","","",""
"","</page>","","","","",""
"","<page number=""5"">","","","","",""
"","<s number=""5"">","","","","",""
"1","deśyante","DEŚ","yante","diś","verb","diś"
"2","bhūmayaḥ","BHŪMAY","aḥ","bhūmaya","noun-adj",""
"3","sapta","SAPT","a","sapta","noun-adj",""
"4","buddhaiś","BUDDH","aiś","buddha","noun-adj",""
"5","citta","CITT","a@","citta","noun-adj",""
"6","vaśaṃ","VAŚ","aṃ","vaśa","noun-adj",""
"7","gatāḥ","GAT","āḥ","gata","noun-adj",""
"8","/","","","","punct",""
"9","kāyavāk","KĀYAVĀK","","kāyavāka","noun-adj",""
"10","citta","CITT","a@","citta","noun-adj",""
"11","dauṣṭhulyaṃ","DAUṢṬHULY","aṃ","dauṣṭhulya","noun-adj",""
"12","saptamyāṃ","SAPTAM","yāṃ","saptami","noun-adj",""
"13","na","","","na","ind",""
"14","pravartate","PRAVART","ate","pravart","verb","pravṛt"
"","</s>","","","","",""
"","</page>","","","","",""
"","<page number=""6"">","","","","",""
"","<s number=""6"">","","","","",""
"1","aṣṭamyāṃ","AṢṬAM","yāṃ","aṣṭama","noun-adj",""
"2","āśrayas","ĀŚRAY","as","āśraya","noun-adj",""
"3","tasya","","","tad","pron",""
"4","svapno","SVAPN","o","svapna","noun-adj",""
"5","apy","","","api","ind",""
"6","sukha","SUKH","a@","sukha","noun-adj",""
"7","saṃbhavaḥ","SAṂBHAV","aḥ","saṃbhava","noun-adj",""
"8","/","","","","punct",""
"9","xxxxxxxxxxxxxxxxxxxxxxx","","","CORRUPTED","ind",""
"10","//","","","","punct",""
"11","7","","","","ind",""
"12","1.","","","","punct",""
"13","a","","","alpha_privativum","ind",""
"14","vācyo","VĀCY","o","vācya","noun-adj",""
"15","vācakair","VĀC","akair","vāc","noun-adj",""
"16","dharmaḥ","DHARM","aḥ","dharma","noun-adj",""
"17","kṛpayā","KṚPAY","ā","kṛpayati","noun-adj",""
"18","yena","","","yad","pron",""
"19","deśitaḥ","DEŚIT","aḥ","deśita","noun-adj",""
"20","/","","","","punct",""
"21","namo","NAM","o","namas","noun-adj",""
"22","a","","","alpha_privativum","ind",""
"23","cintya","CINTY","a@","cintya","noun-adj",""
"24","prabhavāya","PRABHAV","āya","prabhava","noun-adj",""
"25","buddhāy","BUDDH","āy","buddha","noun-adj",""
"26","āsaṅgabuddhaye","ASAṄGABUDDH","aye","asaṅgabuddhi","noun-adj",""
"","</s>","","","","",""
"","</page>","","","","",""
"","<page number=""8"">","","","","",""
"","<s number=""8"">","","","","",""
"1","2.","","","","punct",""
"2","svabhāvena","SVABHĀV","ena","svabhāva","noun-adj",""
"3","na","","","na","ind",""
"4","c","","","ca","ind",""
"5","^","","","","",""
"6","otpannā","UTPANN","ā","utpanna","noun-adj",""
"7","nirvṛtāś","NIRVṚT","āś","nirvṛta","noun-adj",""
"8","ca","","","ca","ind",""
"9","na","","","na","ind",""
"10","tattvataḥ","TATTV","ataḥ","tad","pron",""
"11","/","","","","punct",""
"12","yath","","","yathā","ind",""
"13","^","","","","",""
"14","ākāśaṃ","ĀKĀŚ","aṃ","ākāśa","noun-adj",""
"15","tathā","","","tathā","ind",""
"16","buddhāḥ","BUDDH","āḥ","buddha","noun-adj",""
"17","sattvāś","SATTV","āś","sattva","noun-adj",""
"18","c","","","ca","ind",""
"19","^","","","","",""
"20","aiv","","","eva","ind",""
"21","aika","EK","a@","eka","noun-adj",""
"22","lakṣaṇāḥ","LAKṢAṆ","āḥ","lakṣaṇa","noun-adj",""
"","</s>","","","","",""
"","</page>","","","","",""
"","<page number=""9"">","","","","",""
"","<s number=""9"">","","","","",""
"1","3.","","","","punct",""
"2","pāra","PĀR","a@","pāra","noun-adj",""
"3","āvāraṃ","AVĀR","aṃ","avāra","noun-adj",""
"4","na","","","na","ind",""
"5","c","","","ca","ind",""
"6","^","","","","",""
"7","otpannāḥ","UTPANN","āḥ","utpanna","noun-adj",""
"8","svabhāvena","SVABHĀV","ena","svabhāva","noun-adj",""
"9","pratitya","PRATITY","a@","pratitya","noun-adj",""
"10","jāḥ","J","āḥ","ja","noun-adj",""
"11","/","","","","punct",""
"12","te","","","tad","pron",""
"13","api","","","api","ind",""
"14","śūnyā","ŚŪNY","ā","śūnya","noun-adj",""
"15","hi","","","hi","ind",""
"16","saṃskārāḥ","SAṂSKĀR","āḥ","saṃskāra","noun-adj",""
"17","sarvajña","SARVAJÑ","a@","sarvajña","noun-adj",""
"18","jñāna","JÑĀN","a@","jñāna","noun-adj",""
"19","gocarāḥ","GOCAR","āḥ","gocara","noun-adj",""
"","</s>","","","","",""
"","</page>","","","","",""
"","<page number=""10"">","","","","",""
"","<s number=""10"">","","","","",""
"1","4.","","","","punct",""
"2","sarva","SARV","a@","sarva","noun-adj",""
"3","bhāvāḥ","BHĀV","āḥ","bhāva","noun-adj",""
"4","svabhāvena","SVABHĀV","ena","svabhāva","noun-adj",""
"5","pratibimba","PRATIBIMB","a@","pratibimba","noun-adj",""
"6","samā","SAM","ā","sama","noun-adj",""
"7","matāḥ","MAT","āḥ","mata","noun-adj",""
"8","/","","","","punct",""
"9","śuddhāḥ","ŚUDDH","āḥ","śuddha","noun-adj",""
"10","śiva","ŚIV","a@","śiva","noun-adj",""
"11","svabhāvāś","SVABHĀV","āś","svabhāva","noun-adj",""
"12","ca","","","ca","ind",""
"13","a","","","alpha_privativum","ind",""
"14","dvayās","DVAY","ās","dvaya","noun-adj",""
"15","tathata","TATHAT","a@","tathatā","noun-adj",""
"16","ā","","","alpha_privativum","ind",""
"17","samāḥ","SAM","āḥ","sama","noun-adj",""
"","</s>","","","","",""
"","</page>","","","","",""
"","<page number=""11"">","","","","",""
"","<s number=""11"">","","","","",""
"1","5.","","","","punct",""
"2","a","","","alpha_privativum","ind",""
"3","satya","SATY","a@","satya","noun-adj",""
"4","ātmani","ĀTM","ani","ātman","noun-adj",""
"5","c","","","ca","ind",""
"6","^","","","","",""
"7","ātmatvaṃ","","","","ind",""
"8","kalpayitvā","KALP","ayitvā","kalp","verb","kḷp"
"9","pṛthagjanāḥ","PṚTHAGJAN","āḥ","pṛthagjana","noun-adj",""
"10","/","","","","punct",""
"11","sukha","SUKH","a@","sukha","noun-adj",""
"12","duḥkham","DUḤKH","am","duḥkha","noun-adj",""
"13","abhijñāś","ABHIJÑ","āś","abhijña","noun-adj",""
"14","ca","","","ca","ind",""
"15","sarvam","SARV","am","sarva","noun-adj",""
"16","eṣāṃ","","","idam","pron",""
"17","ca","","","ca","ind",""
"18","tattvataḥ","TATTV","ataḥ","tad","pron",""
"","</s>","","","","",""
"","</page>","","","","",""
"","<page number=""12"">","","","","",""
"","<s number=""12"">","","","","",""
"1","6.","","","","punct",""
"2","ṣaḍ","ṢAḌ","@","ṣaḍi","noun-adj",""
"3","gatir","GAT","ir","gati","noun-adj",""
"4","yaś","","","yad","pron",""
"5","ca","","","ca","ind",""
"6","saṃsāraḥ","SAṂSĀR","aḥ","saṃsāra","noun-adj",""
"7","svargaś","SVARG","aś","svarga","noun-adj",""
"8","ca","","","ca","ind",""
"9","paramaṃ","PARAM","aṃ","parama","noun-adj",""
"10","sukham","SUKH","am","sukha","noun-adj",""
"11","/","","","","punct",""
"12","narake","NARAK","e","naraka","noun-adj",""
"13","ca","","","ca","ind",""
"14","mahad","MAH","ad","mahat","noun-adj",""
"15","duḥkhaṃ","DUḤKH","aṃ","duḥkha","noun-adj",""
"16","jara","JAR","a@","jarā","noun-adj",""
"17","āvyādhir","ĀVYĀDH","ir","āvyādhi","noun-adj",""
"18","apī","","","api","ind",""
"19","yatām","","","","ind",""
"","</s>","","","","",""
"","</page>","","","","",""
"","<page number=""13"">","","","","",""
"","<s number=""13"">","","","","",""
"1","7.","","","","punct",""
"2","a","","","alpha_privativum","ind",""
"3","bhūtāṃ","BHŪT","āṃ","bhūtā","noun-adj",""
"4","kalpanāṃ","KALPAN","āṃ","kalpanā","noun-adj",""
"5","kṛtvā","KṚT","vā","kṛta","noun-adj",""
"6","pacyante","PAC","yante","pac","verb",""
"7","naraka","NARAK","a@","naraka","noun-adj",""
"8","ādiṣu","ĀD","iṣu","ād","verb",""
"9","/","","","","punct",""
"10","s","","","su","ind",""
"11","vadoṣen","VAD","oṣen","vada","noun-adj",""
"12","^","","","","",""
"13","aiva","","","eva","ind",""
"14","dahyante","","","","ind",""
"15","veṇavo","VEṆAV","o","veṇavin","noun-adj",""
"16","vahninā","VAHN","inā","vahni","noun-adj",""
"17","yathā","","","yathā","ind",""
"","</s>","","","","",""
"","</page>","","","","",""
"","<page number=""14"">","","","","",""
"","<s number=""14"">","","","","",""
"1","8.","","","","punct",""
"2","yathā","","","yathā","ind",""
"3","māyā","MĀY","ā","māyā","noun-adj",""
"4","tathā","","","tathā","ind",""
"5","sattvā","SATTV","ā","sattva","noun-adj",""
"6","viṣayān","VIṢAY","ān","viṣaya","noun-adj",""
"7","paribhuñjate","PARIBHUÑJ","ate","paribhuñj","verb",""
"8","//","","","","punct",""
"9","māyām","MĀY","ām","māyā","noun-adj",""
"10","ayīṃ","","","","ind",""
"11","gatiṃ","GAT","iṃ","gati","noun-adj",""
"12","yānti","YĀ","nti","yā","noun-adj",""
"13","pratītya","PRATĪTY","a@","pratītya","noun-adj",""
"14","otpāda","UTPĀD","a@","utpāda","noun-adj",""
"15","rūpiṇīm","RŪP","iṇīm","rūpin","noun-adj",""
"","</s>","","","","",""
"","</page>","","","","",""
"","<page number=""15"">","","","","",""
"","<s number=""15"">","","","","",""
"1","9.","","","","punct",""
"2","yathā","","","yathā","ind",""
"3","citra","CITR","a@","citra","noun-adj",""
"4","karo","KAR","o","kara","noun-adj",""
"5","rūpaṃ","RŪP","aṃ","rūpa","noun-adj",""
"6","yakṣasyāti","YAKṢ","asyāti","yakṣa","noun-adj",""
"7","bhayaṅ","BHAY","aṅ","bhaya","noun-adj",""
"8","karaṃ","KAR","aṃ","kara","noun-adj",""
"9","/","","","","punct",""
"10","bibha","BIBH","a","bibha","noun-adj",""
"11","^","","","","",""
"12","eti","","","iti","ind",""
"13","svayam","SVAY","am","svaya","noun-adj",""
"14","ālikhya","ĀLIKHY","a","ālikhya","noun-adj",""
"15","saṃsāre","SAṂSĀR","e","saṃsāra","noun-adj",""
"16","apy","","","api","ind",""
"17","a","","","alpha_privativum","ind",""
"18","budhas","BUDH","as","budha","noun-adj",""
"19","tathā","","","tathā","ind",""
"","</s>","","","","",""
"","</page>","","","","",""
"","<page number=""16"">","","","","",""
"","<s number=""16"">","","","","",""
"1","10.","","","","punct",""
"2","yathā","","","yathā","ind",""
"3","paṅkaṃ","PAṄK","aṃ","paṅka","noun-adj",""
"4","svayaṃ","SVAY","aṃ","svaya","noun-adj",""
"5","kṛtvā","KṚT","vā","kṛta","noun-adj",""
"6","kaścit","","","kimcit","ind",""
"7","patati","PAT","ati","pat","verb","pat"
"8","bāliśaḥ","BĀLIŚ","aḥ","bāliśa","noun-adj",""
"9","/","","","","punct",""
"10","tathā","","","tathā","ind",""
"11","sat","SAT","@","sat","noun-adj",""
"12","kalpanā","KALPAN","ā@","kalpanā","noun-adj",""
"13","paṅke","PAṄK","e","paṅka","noun-adj",""
"14","magnāḥ","MAGN","āḥ","magna","noun-adj",""
"15","sattvā","SATTV","ā","sattva","noun-adj",""
"16","duruttare","DURUTTAR","e","duruttara","noun-adj",""
"","</s>","","","","",""
"","</page>","","","","",""
"","<page number=""17"">","","","","",""
"","<s number=""17"">","","","","",""
"1","11.","","","","punct",""
"2","a","","","alpha_privativum","ind",""
"3","bhāvaṃ","BHĀV","aṃ","bhāva","noun-adj",""
"4","bhavato","BHAV","ato","bhava","noun-adj",""
"5","dṛṣṭvā","DṚṢṬ","vā","darś","verb","dṛś"
"6","duḥkhāṃ","DUḤKH","āṃ","duḥkhā","noun-adj",""
"7","vindati","VIND","ati","vid","verb","vid"
"8","vedanām","VEDAN","ām","vedanā","noun-adj",""
"9","/","","","","punct",""
"10","śaṅkāviṣeṇa","ŚAṄKĀVIṢ","eṇa","śaṅkāviṣa","noun-adj",""
"11","bādhante","BĀDH","ante","bādh","verb","bādh"
"12","viṣayā","VIṢAY","ā","viṣaya","noun-adj",""
"13","vitathās","VITATH","ās","vitatha","noun-adj",""
"14","tathā","","","tathā","ind",""
"","</s>","","","","",""
"","</page>","","","","",""
"","<page number=""18"">","","","","",""
"","<s number=""18"">","","","","",""
"1","12.","","","","punct",""
"2","tāṃsc","","","","ind",""
"3","^","","","","",""
"4","aiv","","","eva","ind",""
"5","^","","","","",""
"6","ā","","","alpha_privativum","ind",""
"7","śaraṇān","ŚARAṆ","ān","śaraṇa","noun-adj",""
"8","dṛṣṭvā","DṚṢṬ","vā","darś","verb","dṛś"
"9","karuṇa","KARUṆ","a@","karuṇā","noun-adj",""
"10","ādhīra","ADHĪR","a@","adhīra","noun-adj",""
"11","mānasāḥ","MĀNAS","āḥ","mānasa","noun-adj",""
"12","/","","","","punct",""
"13","niyojayanti","NIYOJ","ayanti","niyunak","verb","niyuj"
"14","saṃbodhau","SAṂBODH","au","saṃbodhi","noun-adj",""
"15","sattvān","SATTV","ān","sattva","noun-adj",""
"16","buddhā","BUDDH","ā","buddha","noun-adj",""
"17","hitaṃkarāḥ","HITAṂKAR","āḥ","hitaṃkara","noun-adj",""
"","</s>","","","","",""
"","</page>","","","","",""
"","<page number=""19"">","","","","",""
"","<s number=""19"">","","","","",""
"1","13.","","","","punct",""
"2","te","","","tad","pron",""
"3","api","","","api","ind",""
"4","saṃbhṛta","SAMBHṚT","a@","sambhṛta","noun-adj",""
"5","saṃbhārāḥ","SAṂBHĀR","āḥ","saṃbhāra","noun-adj",""
"6","prāpya","PRĀPY","a","prāpya","noun-adj",""
"7","jñānam","JÑĀN","am","jñāna","noun-adj",""
"8","anuttaram","ANUTTAR","am","anuttara","noun-adj",""
"9","/","","","","punct",""
"10","kalpanā","KALPAN","ā@","kalpanā","noun-adj",""
"11","jāla","JĀL","a@","jāla","noun-adj",""
"12","nirmuktā","NIRMUKT","ā","nirmukta","noun-adj",""
"13","buddhā","BUDDH","ā","buddha","noun-adj",""
"14","syur","","","as","verb","as"
"15","loka","LOK","a@","loka","noun-adj",""
"16","bandhavaḥ","BANDH","avaḥ","bandhu","noun-adj",""
"","</s>","","","","",""
"","</page>","","","","",""
"","<page number=""20"">","","","","",""
"","<s number=""20"">","","","","",""
"1","14.","","","","punct",""
"2","yato","","","yatas","ind",""
"3","a","","","alpha_privativum","ind",""
"4","jātam","JĀT","am","jāta","noun-adj",""
"5","an","","","alpha_privativum","ind",""
"6","utpannaṃ","UTPANN","aṃ","utpanna","noun-adj",""
"7","samyak","SAMYA","k","samyak","noun-adj",""
"8","sattva","SATTV","a@","sattva","noun-adj",""
"9","ārthadarśinaḥ","ARTHADARŚ","inaḥ","arthadarśin","noun-adj",""
"10","/","","","","punct",""
"11","tataḥ","","","tatas","ind",""
"12","śūnyaṃ","ŚŪNY","aṃ","śūnya","noun-adj",""
"13","jagad","JAGAD","@","jagat","noun-adj",""
"14","dṛṣṭvā","DṚṢṬ","vā","darś","verb","dṛś"
"15","ādi","ĀD","i@","ādi","noun-adj",""
"16","madhya","MADHY","a@","madhya","noun-adj",""
"17","ānta","ANT","a@","anta","noun-adj",""
"18","varjitam","VARJIT","am","varjita","noun-adj",""
"","</s>","","","","",""
"","</page>","","","","",""
"","<page number=""21"">","","","","",""
"","<s number=""21"">","","","","",""
"1","15.","","","","punct",""
"2","tena","","","tad","pron",""
"3","paśyanti","PAŚ","yanti","paś","verb","paś"
"4","saṃsāraṃ","SAṂSĀR","aṃ","saṃsāra","noun-adj",""
"5","nirvāṇaṃ","NIRVĀṆ","aṃ","nirvāṇa","noun-adj",""
"6","ca","","","ca","ind",""
"7","na","","","na","ind",""
"8","c","","","ca","ind",""
"9","^","","","","",""
"10","ātmanaḥ","ĀTM","anaḥ","ātman","noun-adj",""
"11","/","","","","punct",""
"12","nirlepaṃ","NIRLEP","aṃ","nirlepa","noun-adj",""
"13","nir","","","niḥ_privativum","ind",""
"14","vikāraṃ","VIKĀR","aṃ","vikāra","noun-adj",""
"15","ca","","","ca","ind",""
"16","ādim","ĀDIM","","ādima","noun-adj",""
"17","adhya","ADHY","a@","adhya","noun-adj",""
"18","ānta","ANT","a@","anta","noun-adj",""
"19","bhāsva","BHĀSV","a@","bhāsvat","noun-adj",""
"20","ram","RAM","","rama","noun-adj",""
"","</s>","","","","",""
"","</page>","","","","",""
"","<page number=""22"">","","","","",""
"","<s number=""22"">","","","","",""
"1","16.","","","","punct",""
"2","svapna","SVAPN","a@","svapna","noun-adj",""
"3","ānubhūta","ANUBHŪT","a@","anubhūta","noun-adj",""
"4","viṣayaṃ","VIṢAY","aṃ","viṣaya","noun-adj",""
"5","pratibuddho","PRATIBUDDH","o","pratibuddha","noun-adj",""
"6","na","","","na","ind",""
"7","paśyati","PAŚ","yati","paś","verb","paś"
"8","/","","","","punct",""
"9","moha","MOH","a@","moha","noun-adj",""
"10","nidrā","NIDR","ā@","nidrā","noun-adj",""
"11","vibuddhaś","VIBUDDH","aś","vibuddha","noun-adj",""
"12","ca","","","ca","ind",""
"13","saṃsāraṃ","SAṂSĀR","aṃ","saṃsāra","noun-adj",""
"14","n","","","na","ind",""
"15","^","","","","",""
"16","aiva","","","eva","ind",""
"17","paśyati","PAŚ","yati","paś","verb","paś"
"","</s>","","","","",""
"","</page>","","","","",""
"","<page number=""23"">","","","","",""
"","<s number=""23"">","","","","",""
"1","17.","","","","punct",""
"2","māyāṃ","MĀY","āṃ","māyā","noun-adj",""
"3","vidhāya","VIDHĀY","a","vidhāya","noun-adj",""
"4","māyavī","MĀYAV","ī","māyavī","noun-adj",""
"5","upasaṃharate","UPASAṂHAR","ate","upasaṃhar","verb","upasaṃhṛ"
"6","yadā","","","yadā","ind",""
"7","/","","","","punct",""
"8","tadā","","","tadā","ind",""
"9","na","","","na","ind",""
"10","vidyate","VID","yate","vid","verb","vid"
"11","kiṃcid","","","kimcit","ind",""
"12","dharmāṇāṃ","DHARM","āṇāṃ","dharma","noun-adj",""
"13","sā","","","tad","pron",""
"14","hi","","","hi","ind",""
"15","dharmatā","DHARMAT","ā","dharmatā","noun-adj",""
"","</s>","","","","",""
"","</page>","","","","",""
"","<page number=""24"">","","","","",""
"","<s number=""24"">","","","","",""
"1","18.","","","","punct",""
"2","citta","CITT","a@","citta","noun-adj",""
"3","mātram","MĀTR","am","mātra","noun-adj",""
"4","idaṃ","IDAṂ","","idam","pron",""
"5","sarvaṃ","SARV","aṃ","sarva","noun-adj",""
"6","māyākāravad","MĀYĀKĀR","avad","māyākāra","noun-adj",""
"7","utthitam","UTTHIT","am","utthita","noun-adj",""
"8","/","","","","punct",""
"9","tataḥ","","","tatas","ind",""
"10","śubha","ŚUBH","a@","śubha","noun-adj",""
"11","ā","","","alpha_privativum","ind",""
"12","śubhaṃ","ŚUBH","aṃ","śubha","noun-adj",""
"13","karma","KARM","a","karman","noun-adj",""
"14","tato","","","tatas","ind",""
"15","janma","JANM","a","janma","noun-adj",""
"16","śubha","ŚUBH","a@","śubha","noun-adj",""
"17","ā","","","alpha_privativum","ind",""
"18","śubham","ŚUBH","am","śubha","noun-adj",""
"","</s>","","","","",""
"","</page>","","","","",""
"","<page number=""25"">","","","","",""
"","<s number=""25"">","","","","",""
"1","19.","","","","punct",""
"2","kalpayanti","KALP","ayanti","kalp","verb","kḷp"
"3","yathā","","","yathā","ind",""
"4","lokaṃ","LOK","aṃ","loka","noun-adj",""
"5","n","","","na","ind",""
"6","otpannāś","UTPANN","āś","utpanna","noun-adj",""
"7","ca","","","ca","ind",""
"8","svayaṃ","SVAY","aṃ","svaya","noun-adj",""
"9","janāḥ","JAN","āḥ","jana","noun-adj",""
"10","/","","","","punct",""
"11","utpādo","UTPĀD","o","utpāda","noun-adj",""
"12","hi","","","hi","ind",""
"13","vikalpo","VIKALP","o","vikalpa","noun-adj",""
"14","ayaṃ","AYAṂ","","idam","pron",""
"15","artho","ARTH","o","artha","noun-adj",""
"16","bāhyo","BĀHY","o","bāhya","noun-adj",""
"17","na","","","na","ind",""
"18","vidyate","VID","yate","vid","verb","vid"
"","</s>","","","","",""
"","</page>","","","","",""
"","<page number=""26"">","","","","",""
"","<s number=""26"">","","","","",""
"1","20.","","","","punct",""
"2","a","","","alpha_privativum","ind",""
"3","svabhāveṣu","SVABHĀV","eṣu","svabhāva","noun-adj",""
"4","bhāveṣu","BHĀV","eṣu","bhāv","verb","bhū"
"5","nitya","NITY","a@","nitya","noun-adj",""
"6","ātma","ĀTM","a@","ātman","noun-adj",""
"7","sukha","SUKH","a@","sukha","noun-adj",""
"8","saṃjñinaḥ","SAṂJÑ","inaḥ","saṃjñin","noun-adj",""
"9","/","","","","punct",""
"10","bhava","BHAV","a@","bhava","noun-adj",""
"11","ārṇave","ARṆAV","e","arṇava","noun-adj",""
"12","bhramanty","BHRAM","anty","bhram","verb",""
"13","asmin","ASMIN","","idam","pron",""
"14","bālā","BĀL","ā","bālā","noun-adj",""
"15","moha","MOH","a@","moha","noun-adj",""
"16","tamo","TAMO","a@","tamoa","noun-adj",""
"17","vṛtāḥ","VṚT","āḥ","vṛta","noun-adj",""
"","</s>","","","","",""
"","</page>","","","","",""
"","<page number=""27"">","","","","",""
"","<s number=""27"">","","","","",""
"1","kalpanāj","KALPAN","āj","kalpanā","noun-adj",""
"2","alapu","ALAP","u@","alapat","noun-adj",""
"3","ūrṇasya","ŪRṆ","asya","ūrṇa","noun-adj",""
"4","saṃsa","SAṂS","a@","saṃsa","noun-adj",""
"5","ārasu","ĀRAS","u@","ārasa","noun-adj",""
"6","maha","MAH","a@","mahat","noun-adj",""
"7","odadheḥ","ODADH","eḥ","odadhati","noun-adj",""
"8","/","","","","punct",""
"9","an","","","alpha_privativum","ind",""
"10","ākramya","ĀKRAMY","a","ākramya","noun-adj",""
"11","mahāyānaṃ","MAHĀYĀN","aṃ","mahāyāna","noun-adj",""
"12","ko","","","kim","pron",""
"13","vā","","","vā","ind",""
"14","pāraṃ","PĀR","aṃ","pāra","noun-adj",""
"15","tariṣyati","","","","ind",""
"","</s>","","","","",""
"","</page>","","","","",""
"","<page number=""28"">","","","","",""
"","<s number=""28"">","","","","",""
"1","mahāyāna","MAHĀYĀN","a@","mahāyāna","noun-adj",""
"2","viṃśikā","VIṂŚ","ikā","viṃśika","noun-adj",""
"3","kṛtir","KṚT","ir","kṛti","noun-adj",""
"4","ārya","ĀRY","a@","ārya","noun-adj",""
"5","nāga","NĀG","a@","nāga","noun-adj",""
"6","ārjuna","ARJUN","a@","arjuna","noun-adj",""
"7","pādānāṃ","PĀD","ānāṃ","pāda","noun-adj",""
"8","/","","","","punct",""
"","</s>","","","","",""
"","</page>","","","","",""
"","</doc>","","","","",""
