"WordID","word","NormSTEM","suffix","lemma","PoS","Root"
"","<doc textid = ""rastrapalasutra_withreconstructions"" genre = ""sūtra"" title = ""rāṣṭrapālasūtra"" author = ""n/a"" discourse = ""homiletic"" tradition = ""buddh"" period = ""uncertain"" source = ""gretil accessed jan 2021 : http://gretil.sub.uni-goettingen.de/gretil/corpustei/sa_rastrapalasutra.xml"" date_range = ""uncertain"" notes = ""skt. manuscript onl fragments; text consists essentially of reconstructions which is why we have not included it; waldschmidt’s publication was not accessible to me as of jan 2021"" religion = ""buddh"" edition = ""based on the ed. by e. waldschmidt. 'the rāṣṭrapālasūtra in sanskrit remnants from central asia.' indianisme et bouddhisme; mélanges offerts à mgr étienne lamotte. louvain-la-neuve 1980 publications de l'institut orientaliste de louvain; 23 ; pp. 359-374 - reprint in: e. waldschmidt. ausgewählte kleine schriften; hg. von h. bechert und p. kieffer-pülz. stuttgart 1989 glasenapp-stiftung; 29 ; pp. 346ff. - ."" digitization = ""klaus wille"" segmentation_lemmatization = ""ligeia lugli & buddhist translators workbench team"" metadata_enrichment = ""bruno galasek-hul & buddhist translators workbench team"" proofreader = ""n/a"" permission = ""permission for derivatives from m. mehner on behalf of gretil"" reconstructions = ""partly reconstituted"">","","","","",""
"","<page number=""0"">","","","","",""
"","<s number=""1"">","","","","",""
"1","ekaṃ","EK","aṃ","eka","noun-adj",""
"2","samayaṃ","SAMAY","aṃ","samaya","noun-adj",""
"3","bhagavāṃ","BHAGAV","āṃ","bhagavat","noun-adj",""
"4","kuruṣu","KUR","uṣu","kar","verb","kṛ"
"5","janapadeṣu","JANAPAD","eṣu","janapada","noun-adj",""
"6","caryāṃ","CARY","āṃ","caryā","noun-adj",""
"7","caran","CAR","an","carat","noun-adj",""
"8","sthūlakoṣṭhakam","STHŪLAKOṢṬHAK","am","sthūlakoṣṭhaka","noun-adj",""
"9","anuprāptaḥ","ANUPRĀPT","aḥ","anuprāpta","noun-adj",""
"10","/","","","","punct",""
"","</s>","","","","",""
"","<s number=""2"">","","","","",""
"1","sthūlakoṣṭhake","STHŪLAKOṢṬHAK","e","sthūlakoṣṭhaka","noun-adj",""
"2","viharati","VIHAR","ati","vihar","verb","vihṛ"
"3","sthūlaka","STHŪLAK","a@","sthūlaka","noun-adj",""
"4","oṣṭhi","OṢṬH","i@","oṣṭhi","noun-adj",""
"5","īyake","IYAK","e","iyakṣ","noun-adj",""
"6","vana","VAN","a@","vana","noun-adj",""
"7","ṣaṇḍe","ṢAṆḌ","e","ṣaṇḍa","noun-adj",""
"8","/","","","","punct",""
"","</s>","","","","",""
"","<s number=""3"">","","","","",""
"1","a","","","alpha_privativum","ind",""
"2","śrauṣuḥ","ŚRAUṢ","uḥ","śrauṣu","noun-adj",""
"3","sthūlaka","STHŪLAK","a@","sthūlaka","noun-adj",""
"4","oṣṭhi","OṢṬH","i@","oṣṭhi","noun-adj",""
"5","īyakā","IYAK","ā","iyakṣ","noun-adj",""
"6","brāhmaṇagṛha","BRĀHMAṆAGṚH","a@","brāhmaṇagṛha","noun-adj",""
"7","patayo","PAT","ayo","pata","noun-adj",""
"8","buddho","BUDDH","o","buddha","noun-adj",""
"9","bhagavān","BHAGAV","ān","bhagavat","noun-adj",""
"10","xxx","","","CORRUPTED","ind",""
"11","sthūlakoṣṭhake","STHŪLAKOṢṬHAK","e","sthūlakoṣṭhaka","noun-adj",""
"12","viharati","VIHAR","ati","vihar","verb","vihṛ"
"13","sthūlaka","STHŪLAK","a@","sthūlaka","noun-adj",""
"14","oṣṭhi","OṢṬH","i@","oṣṭhi","noun-adj",""
"15","īyake","IYAK","e","iyakṣ","noun-adj",""
"16","vana","VAN","a@","vana","noun-adj",""
"17","ṣaṇḍe","ṢAṆḌ","e","ṣaṇḍa","noun-adj",""
"18","/","","","","punct",""
"","</s>","","","","",""
"","<s number=""4"">","","","","",""
"","</page>","","","","",""
"","<page number=""1"">","","","","",""
"3","śrutvā","ŚRUT","vā","śruta","noun-adj",""
"4","ca","","","ca","ind",""
"5","punaḥ","","","punar","ind",""
"6","saṃghāt","SAṂGHĀT","","saṃghāta","noun-adj",""
"7","saṃghaṃ","SAṂGH","aṃ","saṃgha","noun-adj",""
"8","pūgāt","PŪG","āt","pūga","noun-adj",""
"9","pūgaṃ","PŪG","aṃ","pūga","noun-adj",""
"10","saṃgamya","SAṂGAM","ya","saṃgama","noun-adj",""
"11","samāgamya","SAMĀGAM","ya","samāgama","noun-adj",""
"12","sthūlakoṣṭhakān","STHŪLAKOṢṬHAK","ān","sthūlakoṣṭhaka","noun-adj",""
"13","niṣkramya","NIṢKRAM","ya","niṣkrām","verb","niṣkram"
"14","yena","","","yad","pron",""
"15","bhagavāṃs","BHAGAV","āṃs","bhagavat","noun-adj",""
"16","ten","","","tad","pron",""
"17","opajagmur","UPAJAGM","ur","upajagmu","noun-adj",""
"18","upetya","UPETY","a","upetya","noun-adj",""
"19","bha","","","","ind",""
"20","gavat","GAV","at","gavat","noun-adj",""
"21","pādau","PĀD","au","pāda","noun-adj",""
"22","śirasā","ŚIRAS","ā","śiras","noun-adj",""
"23","vanditvā","VANDIT","vā","vandita","noun-adj",""
"24","ekānte","EKĀNT","e","ekānta","noun-adj",""
"25","nyaṣīdaṃ","NYAṢĪD","aṃ","nyaṣīda","noun-adj",""
"26","/","","","","punct",""
"","</s>","","","","",""
"","<s number=""5"">","","","","",""
"","</page>","","","","",""
"","<page number=""2"">","","","","",""
"3","ekānta","EKĀNT","a@","ekānta","noun-adj",""
"4","niṣaṇṇāṃ","NIṢAṆṆ","āṃ","niṣaṇṇa","noun-adj",""
"5","sthūlaka","STHŪLAK","a@","sthūlaka","noun-adj",""
"6","oṣṭhi","OṢṬH","i@","oṣṭhi","noun-adj",""
"7","īyakāṃ","IYAK","āṃ","iyakṣ","noun-adj",""
"8","brāhmaṇagṛha","BRĀHMAṆAGṚH","a@","brāhmaṇagṛha","noun-adj",""
"9","patīṃ","PATĪ","ṃ","patī","verb",""
"10","bhagavāṃ","BHAGAV","āṃ","bhagavat","noun-adj",""
"11","dhārmyā","DHĀRMY","ā","dhārmya","noun-adj",""
"12","kathayā","KATH","ayā","kathā","noun-adj",""
"13","saṃdarśayati","SAṂDARŚ","ayati","saṃdarś","verb","saṃdṛś"
"14","samādāpayati","SAMĀDĀP","ayati","samādad","verb","samādā"
"15","samuttejayati","SAMUTTEJ","ayati","samuttej","verb","samuttij"
"16","saṃpraharṣayati","SAMPRAHARṢ","ayati","sampraharṣa","noun-adj",""
"17","/","","","","punct",""
"","</s>","","","","",""
"","<s number=""6"">","","","","",""
"","</page>","","","","",""
"","<page number=""3"">","","","","",""
"3","tena","","","tad","pron",""
"4","khalu","KHAL","u","khal","verb",""
"5","samayena","SAMAY","ena","samaya","noun-adj",""
"6","rāṣṭrapālo","RĀṢṬRAPĀL","o","rāṣṭrapāla","noun-adj",""
"7","gṛha","GṚH","a@","gṛha","noun-adj",""
"8","patiputras","PATIPUTR","as","patiputra","noun-adj",""
"9","tasmiṃ","","","tad","pron",""
"10","samāje","SAMĀJ","e","samāja","noun-adj",""
"11","saṃniṣaṇṇo","SAṂNIṢAṆṆ","o","saṃniṣaṇṇa","noun-adj",""
"12","abhūt","ABHŪT","","bhav","verb","bhū"
"13","saṃnipatitaḥ","SAṂNIPAT","itaḥ","saṃnipat","verb",""
"14","/","","","","punct",""
"","</s>","","","","",""
"","<s number=""7"">","","","","",""
"","</page>","","","","",""
"","<page number=""4"">","","","","",""
"3","atha","","","atha","ind",""
"4","rāṣṭrapālasya","RĀṢṬRAPĀL","asya","rāṣṭrapāla","noun-adj",""
"5","gṛha","GṚH","a@","gṛha","noun-adj",""
"6","patiputrasy","PATIPUTR","asy","patiputra","noun-adj",""
"7","aitad","AITAD","","tad","pron",""
"8","abhavad","ABHAV","ad","abhava","noun-adj",""
"9","yathā","","","yathā","ind",""
"10","khalv","","","khalu","ind",""
"11","ahaṃ","","","mat","pron",""
"12","bhagavato","BHAGAVAT","o","bhagavatī","noun-adj",""
"13","bhāṣitasy","BHĀṢIT","asy","bhāṣita","noun-adj",""
"14","ārtham","ARTH","am","artha","noun-adj",""
"15","ājānāmi","ĀJĀN","āmi","ājāna","noun-adj",""
"16","nai","","","","ind",""
"17","tat","TAT","","tad","pron",""
"18","su","","","su","ind",""
"19","karam","KARAM","","karama","noun-adj",""
"20","ag","","","","ind",""
"21","āram","ĀRAM","","ārama","noun-adj",""
"22","adhyāvasatā","ADHYĀVAS","atā","adhyāvasatā","noun-adj",""
"23","ekāntaś","EKĀNT","aś","ekānta","noun-adj",""
"24","aṃka","AṄK","a@","aṅka","noun-adj",""
"25","lī","LĪ","","lī","noun-adj",""
"26","kṛtaṃ","KṚT","aṃ","kṛta","noun-adj",""
"27","yāvaj","YĀV","aj","yāvat","ind",""
"28","jīvaṃ","JĪV","aṃ","jīva","noun-adj",""
"29","kevalaṃ","KEVAL","aṃ","kevala","noun-adj",""
"30","paripūrṇaṃ","PARIPŪRṆ","aṃ","paripūrṇa","noun-adj",""
"31","pariśuddhaṃ","PARIŚUDDH","aṃ","pariśuddha","noun-adj",""
"32","paryavadātaṃ","PARYAVADĀT","aṃ","paryavadāta","noun-adj",""
"33","brahmacaryaṃ","BRAHMACARY","aṃ","brahmacarya","noun-adj",""
"34","caritum","CAR","itum","car","verb","car"
"35","/","","","","punct",""
"","</s>","","","","",""
"","<s number=""8"">","","","","",""
"1","yanv","","","","ind",""
"2","ahaṃ","","","mat","pron",""
"3","keśa","KEŚ","a@","keśa","noun-adj",""
"4","śma","ŚM","a@","śman","noun-adj",""
"5","śrūṇy","ŚRŪṆ","y","śrūṇi","noun-adj",""
"6","avatārya","AVATĀR","ya","avatār","verb",""
"7","kāṣāyāṇi","KĀṢĀY","āṇi","kāṣāya","noun-adj",""
"8","vastrāṇy","VASTR","āṇy","vastra","noun-adj",""
"9","āccha","ĀCCH","a@","āccho","noun-adj",""
"10","dya","DY","a","dya","noun-adj",""
"11","samyag","SAMYA","g","samyak","noun-adj",""
"12","eva","","","eva","ind",""
"13","śraddhayā","ŚRADDH","ayā","śraddhā","noun-adj",""
"14","agārād","AGĀR","ād","agāra","noun-adj",""
"15","anagārikāṃ","ANAGĀRIK","āṃ","anagārikā","noun-adj",""
"16","pravrajeyaṃ","PRAVRAJ","eyaṃ","pravraj","verb",""
"17","/","","","","punct",""
"","</s>","","","","",""
"","<s number=""9"">","","","","",""
"","</page>","","","","",""
"","<page number=""5"">","","","","",""
"3","atha","","","atha","ind",""
"4","bhagavāṃ","BHAGAV","āṃ","bhagavat","noun-adj",""
"5","sthūlaka","STHŪLAK","a@","sthūlaka","noun-adj",""
"6","oṣṭhi","OṢṬH","i@","oṣṭhi","noun-adj",""
"7","īyakāṃ","IYAK","āṃ","iyakṣ","noun-adj",""
"8","brāhmaṇagṛha","BRĀHMAṆAGṚH","a@","brāhmaṇagṛha","noun-adj",""
"9","patīṃ","PATĪ","ṃ","patī","verb",""
"10","dhārmyā","DHĀRMY","ā","dhārmya","noun-adj",""
"11","kathayā","KATH","ayā","kathā","noun-adj",""
"12","saṃdarśayitvā","SAṂDARŚ","ayitvā","saṃdarśa","noun-adj",""
"13","samādāpayitvā","SAMĀDĀP","ayitvā","samādad","verb","samādā"
"14","samuttejayitvā","SAMUTTEJ","ayitvā","samuttej","verb","samuttij"
"15","saṃpraharṣayitvā","SAMPRAHARṢ","ayitvā","sampraharṣa","noun-adj",""
"16","t","","","tu","ind",""
"17","ūṣṇīm","UṢṆ","īm","uṣṇī","noun-adj",""
"18","a","","","alpha_privativum","ind",""
"19","bhavat","BHAVAT","","bhavat","noun-adj",""
"20","/","","","","punct",""
"","</s>","","","","",""
"","<s number=""10"">","","","","",""
"","</page>","","","","",""
"","<page number=""6"">","","","","",""
"3","atha","","","atha","ind",""
"4","sthūlaka","STHŪLAK","a@","sthūlaka","noun-adj",""
"5","oṣṭhi","OṢṬH","i@","oṣṭhi","noun-adj",""
"6","īyakā","IYAK","ā","iyakṣ","noun-adj",""
"7","brāhmaṇagṛha","BRĀHMAṆAGṚH","a@","brāhmaṇagṛha","noun-adj",""
"8","patayo","PAT","ayo","pata","noun-adj",""
"9","bhagavato","BHAGAVAT","o","bhagavatī","noun-adj",""
"10","bhāṣitam","BHĀṢIT","am","bhāṣita","noun-adj",""
"11","abhinandya","ABHINANDY","a@","abhinandya","noun-adj",""
"12","ānumodya","ANUMOD","ya","anumod","verb","anumud"
"13","bha","","","","ind",""
"14","gavat","GAV","at","gavat","noun-adj",""
"15","pādau","PĀD","au","pāda","noun-adj",""
"16","śirasā","ŚIRAS","ā","śiras","noun-adj",""
"17","vanditvā","VANDIT","vā","vandita","noun-adj",""
"18","bhagavato","BHAGAVAT","o","bhagavatī","noun-adj",""
"19","antikāt","ANTIK","āt","antika","noun-adj",""
"20","prakrāntāḥ","PRAKRĀNT","āḥ","prakrānta","noun-adj",""
"21","/","","","","punct",""
"","</s>","","","","",""
"","<s number=""11"">","","","","",""
"1","rāṣṭrapālo","RĀṢṬRAPĀL","o","rāṣṭrapāla","noun-adj",""
"2","gṛha","GṚH","a@","gṛha","noun-adj",""
"3","patiputras","PATIPUTR","as","patiputra","noun-adj",""
"4","tu","","","tu","ind",""
"5","tatr","","","tatra","ind",""
"6","^","","","","",""
"7","aiva","","","eva","ind",""
"8","viharati","VIHAR","ati","vihar","verb","vihṛ"
"9","/","","","","punct",""
"","</s>","","","","",""
"","<s number=""12"">","","","","",""
"","</page>","","","","",""
"","<page number=""7"">","","","","",""
"3","atha","","","atha","ind",""
"4","rāṣṭrapālo","RĀṢṬRAPĀL","o","rāṣṭrapāla","noun-adj",""
"5","gṛha","GṚH","a@","gṛha","noun-adj",""
"6","patiputraḥ","PATIPUTR","aḥ","patiputra","noun-adj",""
"7","a","","","alpha_privativum","ind",""
"8","cira","CIR","a@","cira","noun-adj",""
"9","prakrāntān","PRAKRĀNT","ān","prakrānta","noun-adj",""
"10","sthūlaka","STHŪLAK","a@","sthūlaka","noun-adj",""
"11","oṣṭhi","OṢṬH","i@","oṣṭhi","noun-adj",""
"12","īyakāṃ","IYAK","āṃ","iyakṣ","noun-adj",""
"13","brāhmaṇagṛha","BRĀHMAṆAGṚH","a@","brāhmaṇagṛha","noun-adj",""
"14","patīṃ","PATĪ","ṃ","patī","verb",""
"15","viditvā","VID","itvā","vid","verb","vid"
"16","utthāya","UTTHĀY","a","utthāya","noun-adj",""
"17","āsanād","ĀSAN","ād","āsana","noun-adj",""
"18","ekāṃsam","EKĀṂŚ","am","ekāṃśa","noun-adj",""
"19","uttara","UTTAR","a@","uttara","noun-adj",""
"20","āsaṅgaṃ","ĀSAṄG","aṃ","āsaṅga","noun-adj",""
"21","kṛtvā","KṚT","vā","kṛta","noun-adj",""
"22","yena","","","yad","pron",""
"23","bhagavāṃs","BHAGAV","āṃs","bhagavat","noun-adj",""
"24","tenāṃ","TEN","āṃ","tena","noun-adj",""
"25","jaliṃ","JAL","iṃ","jali","noun-adj",""
"26","praṇamya","PRAṆAM","ya","praṇam","verb",""
"27","bhagavantam","BHAGAVANT","am","bhagavanta","noun-adj",""
"28","idam","","","idam","pron",""
"29","avocat","AVOCAT","","vak","verb","vac"
"30","/","","","","punct",""
"","</s>","","","","",""
"","<s number=""13"">","","","","",""
"1","labhey","LABH","ey","labha","noun-adj",""
"2","āhaṃ","ĀHAṂ","","mat","pron",""
"3","bhadanta","BHADANT","a","bhadanta","noun-adj",""
"4","svākhyāte","SVĀKHYĀT","e","svākhyāta","noun-adj",""
"5","dharma","DHARM","a@","dharma","noun-adj",""
"6","vinaye","VINAY","e","vinaya","noun-adj",""
"7","pravrajyām","PRAVRAJY","ām","pravrajyā","noun-adj",""
"8","upasaṃpadaṃ","UPASAṂPAD","aṃ","upasaṃpadā","noun-adj",""
"9","bhikṣubhāvaṃ","BHIKṢUBHĀV","aṃ","bhikṣubhāva","noun-adj",""
"10","/","","","","punct",""
"","</s>","","","","",""
"","<s number=""14"">","","","","",""
"1","care","CAR","e","cara","noun-adj",""
"2","yam","YAM","","yad","pron",""
"3","ahaṃ","","","mat","pron",""
"4","bhagavato","BHAGAVAT","o","bhagavatī","noun-adj",""
"5","antike","ANTIK","e","antika","noun-adj",""
"6","brahmacaryaṃ","BRAHMACARY","aṃ","brahmacarya","noun-adj",""
"7","/","","","","punct",""
"","</s>","","","","",""
"","<s number=""15"">","","","","",""
"","</page>","","","","",""
"","<page number=""8"">","","","","",""
"3","anujñāto","ANUJÑĀT","o","anujñāta","noun-adj",""
"4","asy","","","as","verb","as"
"5","āryaputra","ĀRYAPUTR","a","āryaputra","noun-adj",""
"6","mā","","","mā","ind",""
"7","tāpitṛ","TĀPIT","ṛ@","tāpita","noun-adj",""
"8","bhyāṃ","BHY","āṃ","bhyā","noun-adj",""
"9","/","","","","punct",""
"","</s>","","","","",""
"","<s number=""16"">","","","","",""
"","</page>","","","","",""
"","<page number=""9"">","","","","",""
"3","no","","","asmat","pron",""
"4","bhadanta","BHADANT","a","bhadanta","noun-adj",""
"5","/","","","","punct",""
"","</s>","","","","",""
"","<s number=""17"">","","","","",""
"","</page>","","","","",""
"","<page number=""10"">","","","","",""
"3","na","","","na","ind",""
"4","hy","","","hi","ind",""
"5","āryaputra","ĀRYAPUTR","a","āryaputra","noun-adj",""
"6","tathāgatā","TATHĀGAT","ā","tathāgata","noun-adj",""
"7","vā","","","vā","ind",""
"8","tathāgata","TATHĀGAT","a@","tathāgata","noun-adj",""
"9","śrāvakā","ŚRĀVAK","ā","śrāvaka","noun-adj",""
"10","vā","","","vā","ind",""
"11","na","","","na","ind",""
"12","anujñātaṃ","ANUJÑĀT","aṃ","anujñāta","noun-adj",""
"13","mā","","","mā","ind",""
"14","tāpitṛ","TĀPIT","ṛ@","tāpita","noun-adj",""
"15","bhyāṃ","BHY","āṃ","bhyā","noun-adj",""
"16","pravrājayanti","PRAVRĀJ","ayanti","pravrāj","verb",""
"17","upasaṃpādayanti","UPASAṂPĀD","ayanti","upasaṃpad","verb","upasaṃpad"
"18","vā","","","vā","ind",""
"19","/","","","","punct",""
"","</s>","","","","",""
"","<s number=""18"">","","","","",""
"","</page>","","","","",""
"","<page number=""11"">","","","","",""
"3","tathā","","","tathā","ind",""
"4","bhadanta","BHADANT","a","bhadanta","noun-adj",""
"5","kariṣyāmi","KAR","iṣyāmi","kar","verb","kṛ"
"6","yathā","","","yathā","ind",""
"7","mātā","MĀT","ā@","mātṛ","noun-adj",""
"8","pitarau","PITAR","au","pitara","noun-adj",""
"9","mām","","","mat","pron",""
"10","anujñās","ANUJÑĀ","s","anujānāti","noun-adj",""
"11","yataḥ","YAT","aḥ","yatas","noun-adj",""
"12","pravrajitum","PRAVRAJ","itum","pravraj","verb",""
"13","/","","","","punct",""
"","</s>","","","","",""
"","<s number=""19"">","","","","",""
"","</page>","","","","",""
"","<page number=""12"">","","","","",""
"3","atha","","","atha","ind",""
"4","rāṣṭrapālo","RĀṢṬRAPĀL","o","rāṣṭrapāla","noun-adj",""
"5","gṛha","GṚH","a@","gṛha","noun-adj",""
"6","patiputro","PATIPUTR","o","patiputra","noun-adj",""
"7","bha","","","","ind",""
"8","gavat","GAV","at","gavat","noun-adj",""
"9","pādau","PĀD","au","pāda","noun-adj",""
"10","śirasā","ŚIRAS","ā","śiras","noun-adj",""
"11","vanditvā","VANDIT","vā","vandita","noun-adj",""
"12","bhagavato","BHAGAVAT","o","bhagavatī","noun-adj",""
"13","antikāt","ANTIK","āt","antika","noun-adj",""
"14","prakrāntaḥ","PRAKRĀNT","aḥ","prakrānta","noun-adj",""
"15","/","","","","punct",""
"","</s>","","","","",""
"","<s number=""20"">","","","","",""
"","</page>","","","","",""
"","<page number=""13"">","","","","",""
"3","atha","","","atha","ind",""
"4","rāṣṭrapālo","RĀṢṬRAPĀL","o","rāṣṭrapāla","noun-adj",""
"5","gṛha","GṚH","a@","gṛha","noun-adj",""
"6","patiputraḥ","PATIPUTR","aḥ","patiputra","noun-adj",""
"7","svakaṃ","SVAK","aṃ","svaka","noun-adj",""
"8","niveśanaṃ","NIVEŚAN","aṃ","niveśana","noun-adj",""
"9","gatvā","GAT","vā","gata","noun-adj",""
"10","mātā","MĀT","ā@","mātṛ","noun-adj",""
"11","pitaraṃ","PITAR","aṃ","pitara","noun-adj",""
"12","āmantrayati","AMANTR","ayati","amantra","noun-adj",""
"13","/","","","","punct",""
"","</s>","","","","",""
"","<s number=""21"">","","","","",""
"","</page>","","","","",""
"","<page number=""14"">","","","","",""
"3","aṃba","AMB","a","amba","noun-adj",""
"4","tāta","TĀT","a","tāta","noun-adj",""
"5","anujā","ANUJ","ā@","anujā","noun-adj",""
"6","nīdhvaṃ","NĪDH","vaṃ","nīdhayati","noun-adj",""
"7","māṃ","","","mat","pron",""
"8","pravrajiṣyāmi","PRAVRAJ","iṣyāmi","pravraj","verb",""
"9","samyag","SAMYA","g","samyak","noun-adj",""
"10","eva","","","eva","ind",""
"11","śraddhayā","ŚRADDH","ayā","śraddhā","noun-adj",""
"12","agārād","AGĀR","ād","agāra","noun-adj",""
"13","anagārikām","ANAGĀRIK","ām","anagārikā","noun-adj",""
"14","/","","","","punct",""
"","</s>","","","","",""
"","<s number=""22"">","","","","",""
"","</page>","","","","",""
"","<page number=""15"">","","","","",""
"3","yat","","","yad","pron",""
"4","khalu","KHAL","u","khal","verb",""
"5","tāta","TĀT","a","tāta","noun-adj",""
"6","rāṣṭrapāla","RĀṢṬRAPĀL","a","rāṣṭrapāla","noun-adj",""
"7","jānīyāḥ","JĀNĪY","āḥ","jānīya","noun-adj",""
"8","asmākam","","","asmat","pron",""
"9","ekaputrakaḥ","EKAPUTRAK","aḥ","ekaputraka","noun-adj",""
"10","priyo","PRIY","o","priya","noun-adj",""
"11","manāpaḥ","MANĀP","aḥ","manāpa","noun-adj",""
"12","kṣānta","KṢĀNT","a","kṣānta","noun-adj",""
"13","a","","","alpha_privativum","ind",""
"14","pratikūlaḥ","PRATIKŪL","aḥ","pratikūla","noun-adj",""
"15","/","","","","punct",""
"","</s>","","","","",""
"","<s number=""23"">","","","","",""
"1","maraṇena","MARAṆ","ena","maraṇa","noun-adj",""
"2","te","","","tad","pron",""
"3","vayam","","","asmat","pron",""
"4","a","","","alpha_privativum","ind",""
"5","kāmakā","KĀM","akā","kāma","noun-adj",""
"6","viyujyema","VIYUJY","ema","viyujya","noun-adj",""
"7","/","","","","punct",""
"","</s>","","","","",""
"","<s number=""24"">","","","","",""
"1","kutaḥ","KUT","aḥ","kuta","noun-adj",""
"2","punar","","","punar","ind",""
"3","jīvaṃ","JĪV","aṃ","jīva","noun-adj",""
"4","tam","TAM","","tad","pron",""
"5","utsa","UTS","a@","utsa","noun-adj",""
"6","rakṣyāmaḥ","RAKṢY","āmaḥ","rakṣya","noun-adj",""
"7","/","","","","punct",""
"","</s>","","","","",""
"","<s number=""25"">","","","","",""
"","</page>","","","","",""
"","<page number=""16"">","","","","",""
"3","saced","","","saced","ind",""
"4","anujñās","ANUJÑĀ","s","anujānāti","noun-adj",""
"5","yatha","","","yathā","ind",""
"6","ity","","","iti","ind",""
"7","evaṃ","","","eva","ind",""
"8","kuśalaṃ","KUŚAL","aṃ","kuśala","noun-adj",""
"9","nānu","NĀN","u@","nāna","noun-adj",""
"10","jñās","JÑĀ","s","jñās","noun-adj",""
"11","yatha","","","yathā","ind",""
"12","adya","ADY","a@","adya","noun-adj",""
"13","āgreṇa","AGREṆ","a","agreṇa","noun-adj",""
"14","na","","","na","ind",""
"15","bhokṣye","BHOKṢ","ye","bhokṣ","verb",""
"16","na","","","na","ind",""
"17","pāsyāmīti","PĀSY","āmiiti","pāsyati","noun-adj",""
"","</page>","","","","",""
"","<page number=""17"">","","","","",""
"20","atha","","","atha","ind",""
"21","rāṣṭrapālo","RĀṢṬRAPĀL","o","rāṣṭrapāla","noun-adj",""
"22","gṛha","GṚH","a@","gṛha","noun-adj",""
"23","patiputraḥ","PATIPUTR","aḥ","patiputra","noun-adj",""
"24","ekam","EK","am","eka","noun-adj",""
"25","api","","","api","ind",""
"26","bhaktac","BHAKT","ac","bhaktat","noun-adj",""
"27","chedam","CHED","am","cheda","noun-adj",""
"28","a","","","alpha_privativum","ind",""
"29","kārṣīt","KĀRṢ","īt","kārṣa","noun-adj",""
"30","/","","","","punct",""
"","</s>","","","","",""
"","<s number=""26"">","","","","",""
"1","dvau","DV","au","dva","noun-adj",""
"2","trīn","","","tri","ind",""
"3","yāvat","","","yāvat","ind",""
"4","sapta","SAPT","a","sapta","noun-adj",""
"5","bhaktac","BHAKT","ac","bhaktat","noun-adj",""
"6","chedānām","CHED","ānām","cheda","noun-adj",""
"7","a","","","alpha_privativum","ind",""
"8","kārṣīt","KĀRṢ","īt","kārṣa","noun-adj",""
"9","/","","","","punct",""
"","</s>","","","","",""
"","<s number=""27"">","","","","",""
"","</page>","","","","",""
"","<page number=""18"">","","","","",""
"3","atha","","","atha","ind",""
"4","rāṣṭrapālasya","RĀṢṬRAPĀL","asya","rāṣṭrapāla","noun-adj",""
"5","gṛha","GṚH","a@","gṛha","noun-adj",""
"6","patiputrasya","PATIPUTR","asya","patiputra","noun-adj",""
"7","mātā","MĀT","ā@","mātṛ","noun-adj",""
"8","pitaraṃ","PITAR","aṃ","pitara","noun-adj",""
"9","rāṣṭrapālaṃ","RĀṢṬRAPĀL","aṃ","rāṣṭrapāla","noun-adj",""
"10","gṛha","GṚH","a@","gṛha","noun-adj",""
"11","patiputram","PATIPUTR","am","patiputra","noun-adj",""
"12","idam","","","idam","pron",""
"13","avocat","AVOCAT","","vak","verb","vac"
"14","/","","","","punct",""
"","</s>","","","","",""
"","<s number=""28"">","","","","",""
"","</page>","","","","",""
"","<page number=""19"">","","","","",""
"3","yat","","","yad","pron",""
"4","khalu","KHAL","u","khal","verb",""
"5","tāta","TĀT","a","tāta","noun-adj",""
"6","rāṣṭrapāla","RĀṢṬRAPĀL","a","rāṣṭrapāla","noun-adj",""
"7","jānīyāḥ","JĀNĪY","āḥ","jānīya","noun-adj",""
"8","/","","","","punct",""
"","</s>","","","","",""
"","<s number=""29"">","","","","",""
"1","tvaṃ","","","tvat","pron",""
"2","hi","","","hi","ind",""
"3","sukumāraḥ","SUKUMĀR","aḥ","sukumāra","noun-adj",""
"4","sukhaiṣī","SUKHAIṢ","ī","sukhaiṣin","noun-adj",""
"5","na","","","na","ind",""
"6","tvaṃ","","","tvat","pron",""
"7","jānīṣe","JĀN","īṣe","jāna","noun-adj",""
"8","duḥkhasya","DUḤKH","asya","duḥkha","noun-adj",""
"9","duṣ","","","duḥ","ind",""
"10","karaṃ","KAR","aṃ","kara","noun-adj",""
"11","brahmacaryaṃ","BRAHMACARY","aṃ","brahmacarya","noun-adj",""
"12","duṣ","","","duḥ","ind",""
"13","karaṃ","KAR","aṃ","kara","noun-adj",""
"14","prā","","","","ind",""
"15","vivekyaṃ","VIVEK","yaṃ","viveka","noun-adj",""
"16","duṣ","","","duḥ","ind",""
"17","karam","KAR","am","kara","noun-adj",""
"18","ekatvaṃ","EK","atvaṃ","eka","noun-adj",""
"19","dura","DUR","a@","dura","noun-adj",""
"20","bhisaṃbodhāny","BHISAṂBODH","āny","bhisaṃbodha","noun-adj",""
"21","araṇya","ARAṆY","a@","araṇya","noun-adj",""
"22","vana","VAN","a@","vana","noun-adj",""
"23","prasthāni","PRASTHĀN","i","prasthāna","noun-adj",""
"24","prāntāni","PRĀNT","āni","prānta","noun-adj",""
"25","śayanāsanāny","ŚAYANĀSAN","āny","śayanāsana","noun-adj",""
"26","adhya","ADHY","a@","adhya","noun-adj",""
"27","ā","","","alpha_privativum","ind",""
"28","vastum","VAST","um","vastu","noun-adj",""
"29","/","","","","punct",""
"","</s>","","","","",""
"","<s number=""30"">","","","","",""
"1","ih","","","iha","ind",""
"2","^","","","","",""
"3","aiva","","","eva","ind",""
"4","tvaṃ","","","tvat","pron",""
"5","tāta","TĀT","a","tāta","noun-adj",""
"6","rāṣṭrapāla","RĀṢṬRAPĀL","a","rāṣṭrapāla","noun-adj",""
"7","niṣadya","NIṢAD","ya","niṣad","verb","nisad"
"8","kāmāṃś","KĀM","āṃś","kāma","noun-adj",""
"9","ca","","","ca","ind",""
"10","paribhuṅ","PARIBHU","ṅ@","paribhuk","noun-adj",""
"11","kṣva","KṢV","a","kṣva","noun-adj",""
"12","dānāni","DĀN","āni","dāna","noun-adj",""
"13","ca","","","ca","ind",""
"14","dehi","DEH","i","dehin","noun-adj",""
"15","puṇyāni","PUṆY","āni","puṇya","noun-adj",""
"16","ca","","","ca","ind",""
"17","kuru","KUR","u","kar","verb","kṛ"
"18","/","","","","punct",""
"","</s>","","","","",""
"","<s number=""31"">","","","","",""
"","</page>","","","","",""
"","<page number=""20"">","","","","",""
"3","evam","","","eva","ind",""
"4","ukto","UKT","o","ukta","noun-adj",""
"5","rāṣṭrapālo","RĀṢṬRAPĀL","o","rāṣṭrapāla","noun-adj",""
"6","gṛha","GṚH","a@","gṛha","noun-adj",""
"7","patiputras","PATIPUTR","as","patiputra","noun-adj",""
"8","t","","","tu","ind",""
"9","ūṣṇīm","UṢṆ","īm","uṣṇī","noun-adj",""
"10","/","","","","punct",""
"","</s>","","","","",""
"","<s number=""32"">","","","","",""
"","</page>","","","","",""
"","<page number=""21"">","","","","",""
"3","atha","","","atha","ind",""
"4","rāṣṭrapālasya","RĀṢṬRAPĀL","asya","rāṣṭrapāla","noun-adj",""
"5","gṛha","GṚH","a@","gṛha","noun-adj",""
"6","patiputrasya","PATIPUTR","asya","patiputra","noun-adj",""
"7","mātā","MĀT","ā@","mātṛ","noun-adj",""
"8","pitaraṃ","PITAR","aṃ","pitara","noun-adj",""
"9","jñātīm","JÑĀT","īm","jñātī","noun-adj",""
"10","udyojati","UDYOJ","ati","udyoj","verb","udyuj"
"11","/","","","","punct",""
"","</s>","","","","",""
"","<s number=""33"">","","","","",""
"1","aṃga","AṄG","a","aṅga","noun-adj",""
"2","tā","","","tad","pron",""
"3","vaj","BAJ","","baja","noun-adj",""
"4","jñatayaḥ","JÑAT","ayaḥ","jñati","noun-adj",""
"5","tātaṃ","TĀT","aṃ","tāta","noun-adj",""
"6","rāṣṭrapālam","RĀṢṬRAPĀL","am","rāṣṭrapāla","noun-adj",""
"7","utthāpayata","UTTHĀPAY","ata","utthāpa","verb",""
"8","/","","","","punct",""
"","</s>","","","","",""
"","<s number=""34"">","","","","",""
"","</page>","","","","",""
"","<page number=""22"">","","","","",""
"3","atha","","","atha","ind",""
"4","jñātayo","JÑĀT","ayo","jñāta","noun-adj",""
"5","yena","","","yad","pron",""
"6","rāṣṭrapālo","RĀṢṬRAPĀL","o","rāṣṭrapāla","noun-adj",""
"7","gṛha","GṚH","a@","gṛha","noun-adj",""
"8","patiputras","PATIPUTR","as","patiputra","noun-adj",""
"9","tena","TEN","a@","tena","noun-adj",""
"10","opasaṃkrāntāḥ","UPASAṂKRĀNT","āḥ","upasaṃkrānta","noun-adj",""
"11","/","","","","punct",""
"","</s>","","","","",""
"","<s number=""35"">","","","","",""
"1","upetya","UPETY","a","upetya","noun-adj",""
"2","rāṣṭrapālaṃ","RĀṢṬRAPĀL","aṃ","rāṣṭrapāla","noun-adj",""
"3","gṛha","GṚH","a@","gṛha","noun-adj",""
"4","patiputram","PATIPUTR","am","patiputra","noun-adj",""
"5","idam","","","idam","pron",""
"6","avocaṃ","AVOC","aṃ","avoca","noun-adj",""
"7","/","","","","punct",""
"","</s>","","","","",""
"","<s number=""36"">","","","","",""
"","</page>","","","","",""
"","<page number=""23"">","","","","",""
"3","yat","","","yad","pron",""
"4","khalu","KHAL","u","khal","verb",""
"5","tāta","TĀT","a","tāta","noun-adj",""
"6","rāṣṭrapāla","RĀṢṬRAPĀL","a","rāṣṭrapāla","noun-adj",""
"7","jānīyās","JĀNĪY","ās","jānīya","noun-adj",""
"8","tvaṃ","","","tvat","pron",""
"9","hi","","","hi","ind",""
"10","sukumāraḥ","SUKUMĀR","aḥ","sukumāra","noun-adj",""
"11","sukhaiṣī","SUKHAIṢ","ī","sukhaiṣin","noun-adj",""
"12","na","","","na","ind",""
"13","tvaṃ","","","tvat","pron",""
"14","jānīṣe","JĀN","īṣe","jāna","noun-adj",""
"15","duḥkhasya","DUḤKH","asya","duḥkha","noun-adj",""
"16","pūrvavat","PŪRVAV","at","pūrvavat","noun-adj",""
"17","puṇyāni","PUṆY","āni","puṇya","noun-adj",""
"18","ca","","","ca","ind",""
"19","kuru","KUR","u","kar","verb","kṛ"
"20","/","","","","punct",""
"","</s>","","","","",""
"","<s number=""37"">","","","","",""
"","</page>","","","","",""
"","<page number=""24"">","","","","",""
"3","evam","","","eva","ind",""
"4","ukto","UKT","o","ukta","noun-adj",""
"5","rāṣṭrapālo","RĀṢṬRAPĀL","o","rāṣṭrapāla","noun-adj",""
"6","gṛha","GṚH","a@","gṛha","noun-adj",""
"7","patiputras","PATIPUTR","as","patiputra","noun-adj",""
"8","t","","","tu","ind",""
"9","ūṣṇīm","UṢṆ","īm","uṣṇī","noun-adj",""
"10","/","","","","punct",""
"","</s>","","","","",""
"","<s number=""38"">","","","","",""
"","</page>","","","","",""
"","<page number=""25"">","","","","",""
"3","atha","","","atha","ind",""
"4","rāṣṭrapālasya","RĀṢṬRAPĀL","asya","rāṣṭrapāla","noun-adj",""
"5","gṛha","GṚH","a@","gṛha","noun-adj",""
"6","patiputrasya","PATIPUTR","asya","patiputra","noun-adj",""
"7","mātā","MĀT","ā@","mātṛ","noun-adj",""
"8","pitaraṃ","PITAR","aṃ","pitara","noun-adj",""
"9","vayasyakān","VAYASYAK","ān","vayasyaka","noun-adj",""
"10","udyojayati","UDYOJ","ayati","udyunak","verb","udyuj"
"11","/","","","","punct",""
"","</s>","","","","",""
"","<s number=""39"">","","","","",""
"1","aṃga","AṄG","a","aṅga","noun-adj",""
"2","tāvad","","","tāvat","ind",""
"3","vayasyakāḥ","VAYASYAK","āḥ","vayasyaka","noun-adj",""
"4","tātaṃ","TĀT","aṃ","tāta","noun-adj",""
"5","rāṣṭrapālam","RĀṢṬRAPĀL","am","rāṣṭrapāla","noun-adj",""
"6","utthāpayata:","UTTHĀPAY","ata:","utthāpayati","punct",""
"","</page>","","","","",""
"","<page number=""26"">","","","","",""
"9","atha","","","atha","ind",""
"10","rāṣṭrapālasya","RĀṢṬRAPĀL","asya","rāṣṭrapāla","noun-adj",""
"11","gṛha","GṚH","a@","gṛha","noun-adj",""
"12","patiputrasya","PATIPUTR","asya","patiputra","noun-adj",""
"13","vayasyakāḥ","VAYASYAK","āḥ","vayasyaka","noun-adj",""
"14","yena","","","yad","pron",""
"15","rāṣṭrapālo","RĀṢṬRAPĀL","o","rāṣṭrapāla","noun-adj",""
"16","gṛha","GṚH","a@","gṛha","noun-adj",""
"17","patiputras","PATIPUTR","as","patiputra","noun-adj",""
"18","tena","TEN","a@","tena","noun-adj",""
"19","opasaṃkrāntāḥ","UPASAṂKRĀNT","āḥ","upasaṃkrānta","noun-adj",""
"20","/","","","","punct",""
"","</s>","","","","",""
"","<s number=""40"">","","","","",""
"1","upetya","UPETY","a","upetya","noun-adj",""
"2","rāṣṭrapālaṃ","RĀṢṬRAPĀL","aṃ","rāṣṭrapāla","noun-adj",""
"3","gṛha","GṚH","a@","gṛha","noun-adj",""
"4","patiputram","PATIPUTR","am","patiputra","noun-adj",""
"5","idam","","","idam","pron",""
"6","avocan","AVOC","an","avocat","noun-adj",""
"7","/","","","","punct",""
"","</s>","","","","",""
"","<s number=""41"">","","","","",""
"","</page>","","","","",""
"","<page number=""27"">","","","","",""
"3","yat","","","yad","pron",""
"4","khalu","KHAL","u","khal","verb",""
"5","saumya","SAUMY","a","saumya","noun-adj",""
"6","rāṣṭrapāla","RĀṢṬRAPĀL","a","rāṣṭrapāla","noun-adj",""
"7","jānīyās","JĀNĪY","ās","jānīya","noun-adj",""
"8","tvaṃ","","","tvat","pron",""
"9","hi","","","hi","ind",""
"10","sukumāraḥ","SUKUMĀR","aḥ","sukumāra","noun-adj",""
"11","sukhaiṣī","SUKHAIṢ","ī","sukhaiṣin","noun-adj",""
"12","na","","","na","ind",""
"13","tvaṃ","","","tvat","pron",""
"14","jānīṣe","JĀN","īṣe","jāna","noun-adj",""
"15","duḥkhasya","DUḤKH","asya","duḥkha","noun-adj",""
"16","pūrvavat","PŪRVAV","at","pūrvavat","noun-adj",""
"17","puṇyāni","PUṆY","āni","puṇya","noun-adj",""
"18","ca","","","ca","ind",""
"19","kuru","KUR","u","kar","verb","kṛ"
"20","/","","","","punct",""
"","</s>","","","","",""
"","<s number=""42"">","","","","",""
"","</page>","","","","",""
"","<page number=""28"">","","","","",""
"3","evam","","","eva","ind",""
"4","ukto","UKT","o","ukta","noun-adj",""
"5","rāṣṭrapālo","RĀṢṬRAPĀL","o","rāṣṭrapāla","noun-adj",""
"6","gṛha","GṚH","a@","gṛha","noun-adj",""
"7","patiputras","PATIPUTR","as","patiputra","noun-adj",""
"8","t","","","tu","ind",""
"9","ūṣṇīm","UṢṆ","īm","uṣṇī","noun-adj",""
"10","/","","","","punct",""
"","</s>","","","","",""
"","<s number=""43"">","","","","",""
"","</page>","","","","",""
"","<page number=""29"">","","","","",""
"3","atha","","","atha","ind",""
"4","rāṣṭrapālasya","RĀṢṬRAPĀL","asya","rāṣṭrapāla","noun-adj",""
"5","gṛha","GṚH","a@","gṛha","noun-adj",""
"6","patiputrasya","PATIPUTR","asya","patiputra","noun-adj",""
"7","vayasyakā","VAYASYAK","ā","vayasyaka","noun-adj",""
"8","yena","","","yad","pron",""
"9","rāṣṭrapālasya","RĀṢṬRAPĀL","asya","rāṣṭrapāla","noun-adj",""
"10","gṛha","GṚH","a@","gṛha","noun-adj",""
"11","patiputrasya","PATIPUTR","asya","patiputra","noun-adj",""
"12","mātā","MĀT","ā@","mātṛ","noun-adj",""
"13","pitaraṃ","PITAR","aṃ","pitara","noun-adj",""
"14","tena","TEN","a@","tena","noun-adj",""
"15","opasaṃkrāntāḥ","UPASAṂKRĀNT","āḥ","upasaṃkrānta","noun-adj",""
"16","/","","","","punct",""
"","</s>","","","","",""
"","<s number=""44"">","","","","",""
"1","upetya","UPETY","a","upetya","noun-adj",""
"2","rāṣṭrapālasya","RĀṢṬRAPĀL","asya","rāṣṭrapāla","noun-adj",""
"3","gṛha","GṚH","a@","gṛha","noun-adj",""
"4","patiputrasya","PATIPUTR","asya","patiputra","noun-adj",""
"5","mātāpita","MĀTĀPIT","a@","mātāpitṛ","noun-adj",""
"6","ram","RAM","","rama","noun-adj",""
"7","idam","","","idam","pron",""
"8","avocan","AVOC","an","avocat","noun-adj",""
"9","/","","","","punct",""
"","</s>","","","","",""
"","<s number=""45"">","","","","",""
"","</page>","","","","",""
"","<page number=""30"">","","","","",""
"3","aṃba","AMB","a","amba","noun-adj",""
"4","tāta","TĀT","a","tāta","noun-adj",""
"5","anujā","ANUJ","ā@","anujā","noun-adj",""
"6","nīdhvaṃ","NĪDH","vaṃ","nīdhayati","noun-adj",""
"7","saumyaṃ","SAUMY","aṃ","saumya","noun-adj",""
"8","rāṣṭrapālaṃ","RĀṢṬRAPĀL","aṃ","rāṣṭrapāla","noun-adj",""
"9","pravrajitum","PRAVRAJ","itum","pravraj","verb",""
"10","/","","","","punct",""
"","</s>","","","","",""
"","<s number=""46"">","","","","",""
"1","pravrajyāṃ","PRAVRAJY","āṃ","pravrajyā","noun-adj",""
"2","saced","","","saced","ind",""
"3","abhiramiṣyati","ABHIRAM","iṣyati","abhiram","verb",""
"4","jīvantam","JĪVANT","am","jīvanta","noun-adj",""
"5","enaṃ","","","ena","ind",""
"6","drakṣya","DRAKṢY","a@","drakṣya","noun-adj",""
"7","dhve","DHV","e","dhvas","noun-adj",""
"8","sacen","","","saced","ind",""
"9","n","","","na","ind",""
"10","ābhikramiṣyati","ABHIKRAM","iṣyati","abhikrām","verb","abhikram"
"11","kānyā","KĀN","yā","kāna","noun-adj",""
"12","putrasya","PUTRAS","ya","putrasū","noun-adj",""
"13","gatir","GAT","ir","gati","noun-adj",""
"14","anyatra","ANYATR","a","anyatra","noun-adj",""
"15","mātāpita","MĀTĀPIT","a@","mātāpitṛ","noun-adj",""
"16","ram","RAM","","rama","noun-adj",""
"17","eva","","","eva","ind",""
"18","/","","","","punct",""
"","</s>","","","","",""
"","<s number=""47"">","","","","",""
"","</page>","","","","",""
"","<page number=""31"">","","","","",""
"3","evam","","","eva","ind",""
"4","āvāṃ","","","asmat","pron",""
"5","kumāra","KUMĀR","a@","kumāra","noun-adj",""
"6","kās","KĀS","","kim","pron",""
"7","tātaṃ","TĀT","aṃ","tāta","noun-adj",""
"8","rāṣṭrapālam","RĀṢṬRAPĀL","am","rāṣṭrapāla","noun-adj",""
"9","anujānī","ANUJĀN","ī@","anujānī","noun-adj",""
"10","yāvaḥ","YĀV","aḥ","yāva","noun-adj",""
"11","/","","","","punct",""
"","</s>","","","","",""
"","<s number=""48"">","","","","",""
"1","sacet","","","saced","ind",""
"2","pravrajiṣyaty","PRAVRAJ","iṣyaty","pravraj","verb",""
"3","uddarśayitavyam","UDDARŚAY","itavyam","uddarś","verb","uddṛś"
"4","/","","","","punct",""
"","</s>","","","","",""
"","<s number=""49"">","","","","",""
"","</page>","","","","",""
"","<page number=""32"">","","","","",""
"3","atha","","","atha","ind",""
"4","rāṣṭrapālasya","RĀṢṬRAPĀL","asya","rāṣṭrapāla","noun-adj",""
"5","gṛha","GṚH","a@","gṛha","noun-adj",""
"6","patiputrasya","PATIPUTR","asya","patiputra","noun-adj",""
"7","vayasyakā","VAYASYAK","ā","vayasyaka","noun-adj",""
"8","yena","","","yad","pron",""
"9","rāṣṭrapālo","RĀṢṬRAPĀL","o","rāṣṭrapāla","noun-adj",""
"10","gṛha","GṚH","a@","gṛha","noun-adj",""
"11","patiputras","PATIPUTR","as","patiputra","noun-adj",""
"12","tena","TEN","a@","tena","noun-adj",""
"13","opasaṃkrāntāḥ","UPASAṂKRĀNT","āḥ","upasaṃkrānta","noun-adj",""
"14","/","","","","punct",""
"","</s>","","","","",""
"","<s number=""50"">","","","","",""
"1","upetya","UPETY","a","upetya","noun-adj",""
"2","rāṣṭrapālaṃ","RĀṢṬRAPĀL","aṃ","rāṣṭrapāla","noun-adj",""
"3","gṛha","GṚH","a@","gṛha","noun-adj",""
"4","patiputram","PATIPUTR","am","patiputra","noun-adj",""
"5","idam","","","idam","pron",""
"6","avocan","AVOC","an","avocat","noun-adj",""
"7","/","","","","punct",""
"","</s>","","","","",""
"","<s number=""51"">","","","","",""
"","</page>","","","","",""
"","<page number=""33"">","","","","",""
"3","yat","","","yad","pron",""
"4","khalu","KHAL","u","khal","verb",""
"5","saumya","SAUMY","a","saumya","noun-adj",""
"6","rāṣṭrapāla","RĀṢṬRAPĀL","a","rāṣṭrapāla","noun-adj",""
"7","jānīyāḥ","JĀNĪY","āḥ","jānīya","noun-adj",""
"8","/","","","","punct",""
"","</s>","","","","",""
"","<s number=""52"">","","","","",""
"1","anujñātas","ANUJÑĀT","as","anujñāta","noun-adj",""
"2","tvaṃ","","","tvat","pron",""
"3","mā","","","mā","ind",""
"4","tāpitṛ","TĀPIT","ṛ@","tāpita","noun-adj",""
"5","bhyāṃ","BHY","āṃ","bhyā","noun-adj",""
"6","pravrajitum","PRAVRAJ","itum","pravraj","verb",""
"7","/","","","","punct",""
"","</s>","","","","",""
"","<s number=""53"">","","","","",""
"1","pravrājayatā","PRAVRĀJAY","atā","pravrājayati","noun-adj",""
"2","uddarśayitavyaṃ","UDDARŚAY","itavyaṃ","uddarś","verb","uddṛś"
"3","mātāpita","MĀTĀPIT","a@","mātāpitṛ","noun-adj",""
"4","ram","RAM","","rama","noun-adj",""
"5","/","","","","punct",""
"","</s>","","","","",""
"","<s number=""54"">","","","","",""
"","</page>","","","","",""
"","<page number=""34"">","","","","",""
"3","atha","","","atha","ind",""
"4","rāṣṭrapālo","RĀṢṬRAPĀL","o","rāṣṭrapāla","noun-adj",""
"5","gṛhapati","GṚHAP","ati","gṛhapa","noun-adj",""
"6","pūtro","PŪTR","o","pūtra","noun-adj",""
"7","anupūrveṇa","ANUPŪRV","eṇa","anupūrva","noun-adj",""
"8","kāyasya","KĀY","asya","kāya","noun-adj",""
"9","sthāmaṃ","STHĀM","aṃ","sthāma","noun-adj",""
"10","ca","","","ca","ind",""
"11","balaṃ","BAL","aṃ","bala","noun-adj",""
"12","ca","","","ca","ind",""
"13","saṃjanayya","SAṂJANAY","ya","saṃjanaya","noun-adj",""
"14","yena","","","yad","pron",""
"15","bhagavāṃs","BHAGAV","āṃs","bhagavat","noun-adj",""
"16","ten","","","tad","pron",""
"17","opajagāma","UPAJAGĀM","a","upajagāma","noun-adj",""
"18","/","","","","punct",""
"","</s>","","","","",""
"","<s number=""55"">","","","","",""
"1","upetya","UPETY","a","upetya","noun-adj",""
"2","bha","","","","ind",""
"3","gavat","GAV","at","gavat","noun-adj",""
"4","pādau","PĀD","au","pāda","noun-adj",""
"5","śirasā","ŚIRAS","ā","śiras","noun-adj",""
"6","vanditvā","VANDIT","vā","vandita","noun-adj",""
"7","ekānte","EKĀNT","e","ekānta","noun-adj",""
"8","asthād","ASTH","ād","astha","noun-adj",""
"9","ekānta","EKĀNT","a@","ekānta","noun-adj",""
"10","sthito","STHIT","o","sthita","noun-adj",""
"11","rāṣṭrapālo","RĀṢṬRAPĀL","o","rāṣṭrapāla","noun-adj",""
"12","gṛha","GṚH","a@","gṛha","noun-adj",""
"13","patiputro","PATIPUTR","o","patiputra","noun-adj",""
"14","bhagavantam","BHAGAVANT","am","bhagavanta","noun-adj",""
"15","idam","","","idam","pron",""
"16","avocat","AVOCAT","","vak","verb","vac"
"17","/","","","","punct",""
"","</s>","","","","",""
"","<s number=""56"">","","","","",""
"","</page>","","","","",""
"","<page number=""35"">","","","","",""
"3","anujñāto","ANUJÑĀT","o","anujñāta","noun-adj",""
"4","asmi","","","as","verb","as"
"5","bhadanta","BHADANT","a","bhadanta","noun-adj",""
"6","mātāpitṛ","MĀTĀPIT","ṛ@","mātāpitṛ","noun-adj",""
"7","bhyām","BHY","ām","bhyā","noun-adj",""
"8","/","","","","punct",""
"","</s>","","","","",""
"","<s number=""57"">","","","","",""
"1","labhey","LABH","ey","labha","noun-adj",""
"2","āhaṃ","ĀHAṂ","","mat","pron",""
"3","svākhyāte","SVĀKHYĀT","e","svākhyāta","noun-adj",""
"4","dharma","DHARM","a@","dharma","noun-adj",""
"5","vinaye","VINAY","e","vinaya","noun-adj",""
"6","pravrajyām","PRAVRAJY","ām","pravrajyā","noun-adj",""
"7","upasaṃpadaṃ","UPASAṂPAD","aṃ","upasaṃpadā","noun-adj",""
"8","bhikṣubhāvaṃ","BHIKṢUBHĀV","aṃ","bhikṣubhāva","noun-adj",""
"9","carey","CAR","ey","cara","noun-adj",""
"10","āhaṃ","ĀHAṂ","","mat","pron",""
"11","bhagavato","BHAGAVAT","o","bhagavatī","noun-adj",""
"12","antike","ANTIK","e","antika","noun-adj",""
"13","brahmacaryam","BRAHMACARY","am","brahmacarya","noun-adj",""
"14","/","","","","punct",""
"","</s>","","","","",""
"","<s number=""58"">","","","","",""
"","</page>","","","","",""
"","<page number=""36"">","","","","",""
"3","labdhav","LABDH","av","labdha","noun-adj",""
"4","^","","","","",""
"5","ān","","","alpha_privativum","ind",""
"6","rāṣṭrapālo","RĀṢṬRAPĀL","o","rāṣṭrapāla","noun-adj",""
"7","gṛha","GṚH","a@","gṛha","noun-adj",""
"8","patiputraḥ","PATIPUTR","aḥ","patiputra","noun-adj",""
"9","svākhyāte","SVĀKHYĀT","e","svākhyāta","noun-adj",""
"10","dharma","DHARM","a@","dharma","noun-adj",""
"11","vinaye","VINAY","e","vinaya","noun-adj",""
"12","pravrajyām","PRAVRAJY","ām","pravrajyā","noun-adj",""
"13","upasaṃpadaṃ","UPASAṂPAD","aṃ","upasaṃpadā","noun-adj",""
"14","bhikṣubhāvam","BHIKṢUBHĀV","am","bhikṣubhāva","noun-adj",""
"15","/","","","","punct",""
"","</s>","","","","",""
"","<s number=""59"">","","","","",""
"","</page>","","","","",""
"","<page number=""37"">","","","","",""
"3","atha","","","atha","ind",""
"4","bhagavān","BHAGAV","ān","bhagavat","noun-adj",""
"5","āyuṣmantaṃ","ĀYUṢM","antaṃ","āyuṣmat","noun-adj",""
"6","rāṣṭrapālaṃ","RĀṢṬRAPĀL","aṃ","rāṣṭrapāla","noun-adj",""
"7","pravrājayitvā","PRAVRĀJ","ayitvā","pravrāja","verb",""
"8","upasaṃpādayitvā","UPASAṂPĀD","ayitvā","upasaṃpād","verb","upasaṃpad"
"9","yathā","","","yathā","ind",""
"10","bhi","","","","ind",""
"11","ramyaṃ","RAMY","aṃ","ramya","noun-adj",""
"12","sthūlakoṣṭhake","STHŪLAKOṢṬHAK","e","sthūlakoṣṭhaka","noun-adj",""
"13","vihṛtya","VIHṚT","ya","vihṛta","noun-adj",""
"14","yena","","","yad","pron",""
"15","śrāvastī","ŚRĀVAST","ī","śrāvastī","noun-adj",""
"16","tena","","","tad","pron",""
"17","caryāṃ","CARY","āṃ","caryā","noun-adj",""
"18","prakrāntaḥ","PRAKRĀNT","aḥ","prakrānta","noun-adj",""
"19","/","","","","punct",""
"","</s>","","","","",""
"","<s number=""60"">","","","","",""
"1","anupūrveṇa","ANUPŪRV","eṇa","anupūrva","noun-adj",""
"2","caryāṃ","CARY","āṃ","caryā","noun-adj",""
"3","carañ","CAR","añ","cara","noun-adj",""
"4","śrāvastīm","ŚRĀVAST","īm","śrāvastī","noun-adj",""
"5","anuprāptaḥ","ANUPRĀPT","aḥ","anuprāpta","noun-adj",""
"6","/","","","","punct",""
"","</s>","","","","",""
"","<s number=""61"">","","","","",""
"1","śrāvastyāṃ","ŚRĀVAST","yāṃ","śrāvasti","noun-adj",""
"2","viharati","VIHAR","ati","vihar","verb","vihṛ"
"3","jeta","JET","a@","jetṛ","noun-adj",""
"4","vana","VAN","a","vana","noun-adj",""
"5","anāthapiṇḍa","ANĀTHAPIṆḌ","a@","anāthapiṇḍa","noun-adj",""
"6","dasya","DAS","ya","das","verb",""
"7","ārāme","ĀRĀM","e","ārāma","noun-adj",""
"8","/","","","","punct",""
"","</s>","","","","",""
"","<s number=""62"">","","","","",""
"","</page>","","","","",""
"","<page number=""fragment-of-fourth-leaf-sht-iv-412/15","","","","",""
"3",";-restoration-by-matsumura"">","","","","",""
"4",":","","","","punct",""
"5","tena","","","tad","pron",""
"6","khalu","KHAL","u","khal","verb",""
"7","samayen","SAMAY","en","samaya","noun-adj",""
"8","āyuṣmato","ĀYUṢM","ato","āyuṣmat","noun-adj",""
"9","rāṣṭrapālasya","RĀṢṬRAPĀL","asya","rāṣṭrapāla","noun-adj",""
"10","pitā","PIT","ā","pitṛ","noun-adj",""
"11","madhyame","MADHYAM","e","madhyama","noun-adj",""
"12","dvāra","DVĀR","a@","dvāra","noun-adj",""
"13","sāle","SĀL","e","sāla","noun-adj",""
"14","muṇḍi","MUṆḌ","i@","muṇḍi","noun-adj",""
"15","nam","NAM","","nama","noun-adj",""
"16","ulla","ULL","a@","ulla","noun-adj",""
"17","ekayati","EK","ayati","eka","noun-adj",""
"18","a","","","alpha_privativum","ind",""
"19","drākṣīd","DRĀKṢ","īd","drākṣa","noun-adj",""
"20","āyuṣmato","ĀYUṢM","ato","āyuṣmat","noun-adj",""
"21","rāṣṭrapālasya","RĀṢṬRAPĀL","asya","rāṣṭrapāla","noun-adj",""
"22","pita","PIT","a@","pitṛ","noun-adj",""
"23","āyuṣmantaṃ","ĀYUṢM","antaṃ","āyuṣmat","noun-adj",""
"24","rāṣṭrapālaṃ","RĀṢṬRAPĀL","aṃ","rāṣṭrapāla","noun-adj",""
"25","dvāra","DVĀR","a@","dvāra","noun-adj",""
"26","samīpe","SAMĪP","e","samīpa","noun-adj",""
"27","dṛṣṭva","DṚṢṬV","a@","dṛṣṭvā","noun-adj",""
"28","aitad","AITAD","","tad","pron",""
"29","avocat","AVOCAT","","vak","verb","vac"
"30","tair","","","tad","pron",""
"31","muṇḍakaiḥ","MUṆḌAK","aiḥ","muṇḍaka","noun-adj",""
"32","śramaṇakair","ŚRAMAṆAK","air","śramaṇaka","noun-adj",""
"33","asmākaṃ","","","asmat","pron",""
"34","kulam","KUL","am","kula","noun-adj",""
"35","uddāyādaṃ","UDDĀY","ādaṃ","uddāya","noun-adj",""
"36","kṛtaṃ","KṚT","aṃ","kṛta","noun-adj",""
"37","/","","","","punct",""
"","</s>","","","","",""
"","<s number=""63"">","","","","",""
"1","yair","","","yad","pron",""
"2","asmākam","","","asmat","pron",""
"3","ekaputrakaḥ","EKAPUTRAK","aḥ","ekaputraka","noun-adj",""
"4","priyo","PRIY","o","priya","noun-adj",""
"5","manāpaḥ","MANĀP","aḥ","manāpa","noun-adj",""
"6","kṣānto","KṢĀNT","o","kṣānta","noun-adj",""
"7","a","","","alpha_privativum","ind",""
"8","pratikulo","PRATIKUL","o","pratikula","noun-adj",""
"9","rāṣṭrapālaḥ","RĀṢṬRAPĀL","aḥ","rāṣṭrapāla","noun-adj",""
"10","pravrājayita","PRAVRĀJ","ita","pravrājin","noun-adj",""
"11","upasaṃpādayitas","UPASAṂPĀDAY","itas","upasaṃpādayati","noun-adj",""
"12","teṣāṃ","","","tad","pron",""
"13","muṇḍakānāṃ","MUṆḌAK","ānāṃ","muṇḍaka","noun-adj",""
"14","śramaṇakānāṃ","ŚRAMAṆAK","ānāṃ","śramaṇaka","noun-adj",""
"15","kena","","","kim","pron",""
"16","piṇḍaṃ","PIṆḌ","aṃ","piṇḍa","noun-adj",""
"17","dātavyaṃ","DĀ","tavyaṃ","dad","verb","dā"
"18","kartavyaṃ","KAR","tavyaṃ","kar","verb","kṛ"
"19","manyate","MAN","yate","man","verb","man"
"20","atha","ATH","a@","atha","noun-adj",""
"21","āyuṣmān","ĀYUṢM","ān","āyuṣmat","noun-adj",""
"22","rāṣṭrapālaḥ","RĀṢṬRAPĀL","aḥ","rāṣṭrapāla","noun-adj",""
"23","svake","SVAK","e","svaka","noun-adj",""
"24","niveśane","NIVEŚAN","e","niveśana","noun-adj",""
"25","ākrośād","ĀKROŚ","ād","ākrośa","noun-adj",""
"26","anyaṃ","ANY","aṃ","anya","noun-adj",""
"27","n","","","na","ind",""
"28","^","","","","",""
"29","aiva","","","eva","ind",""
"30","dānam","DĀN","am","dāna","noun-adj",""
"31","a","","","alpha_privativum","ind",""
"32","labdha","LABDH","a","labdha","noun-adj",""
"33","pravāsayitas","PRAVĀSAY","itas","pravāsaya","noun-adj",""
"34","tvarita","TVARIT","a@","tvarita","noun-adj",""
"35","tvaritaṃ","TVARIT","aṃ","tvarita","noun-adj",""
"36","pratiniṣkrāntaḥ","PRATINIṢKRĀNT","aḥ","pratiniṣkrānta","noun-adj",""
"37","tena","","","tad","pron",""
"38","khalu","KHAL","u","khal","verb",""
"39","samayen","SAMAY","en","samaya","noun-adj",""
"40","āyuṣmato","ĀYUṢM","ato","āyuṣmat","noun-adj",""
"41","rāṣṭrapālasya","RĀṢṬRAPĀL","asya","rāṣṭrapāla","noun-adj",""
"42","purāṇa","PURĀṆ","a@","purāṇa","noun-adj",""
"43","jīrṇa","JĪRṆ","a@","jīrṇa","noun-adj",""
"44","dāsī","DĀS","ī","dāsī","noun-adj",""
"45","paryuṣitaṃ","PARYUṢIT","aṃ","paryuṣita","noun-adj",""
"46","pūtiku","PŪTIK","u@","pūtika","noun-adj",""
"47","māṣam","MĀṢ","am","māṣa","noun-adj",""
"48","ākīrya","ĀKĪL","ya","ākīl","verb",""
"49","bahir","BAH","ir","bahi","noun-adj",""
"50","nirgatā","NIRGAT","ā","nirgata","noun-adj",""
"51","c","","","ca","ind",""
"52","chorayitum","CHOR","ayitum","chor","verb",""
"53","āyuṣmān","ĀYUṢM","ān","āyuṣmat","noun-adj",""
"54","rāṣṭrapālas","RĀṢṬRAPĀL","as","rāṣṭrapāla","noun-adj",""
"55","tāṃ","","","tad","pron",""
"56","purāṇa","PURĀṆ","a@","purāṇa","noun-adj",""
"57","jīrṇa","JĪRṆ","a@","jīrṇa","noun-adj",""
"58","dāsīm","DĀS","īm","dāsī","noun-adj",""
"59","a","","","alpha_privativum","ind",""
"60","drākṣīt","DRĀKṢ","īt","drākṣa","noun-adj",""
"61","dṛṣṭvā","DṚṢṬ","vā","darś","verb","dṛś"
"62","tāṃ","","","tad","pron",""
"63","jīrṇa","JĪRṆ","a@","jīrṇa","noun-adj",""
"64","dāsīm","DĀS","īm","dāsī","noun-adj",""
"65","etad","","","tad","pron",""
"66","avocat","AVOCAT","","vak","verb","vac"
"67","bhagini","BHAGIN","i","bhaginī","noun-adj",""
"68","sacet","","","saced","ind",""
"69","paryuṣitāḥ","PARYUṢIT","āḥ","paryuṣita","noun-adj",""
"70","pūti","PŪT","i@","pūti","noun-adj",""
"71","kulmāṣāḥ","KULMĀṢ","āḥ","kulmāṣa","noun-adj",""
"72","parityaktāḥ","PARITYAKT","āḥ","parityakta","noun-adj",""
"73","asmākaṃ","","","asmat","pron",""
"74","pātre","PĀTR","e","pātra","noun-adj",""
"75","ākira","ĀKIR","a","ākir","verb",""
"76","āryaṃ","ĀRY","aṃ","ārya","noun-adj",""
"77","yāca","YĀC","a","yāca","noun-adj",""
"78","atha","","","atha","ind",""
"79","sā","","","tad","pron",""
"80","purāṇa","PURĀṆ","a@","purāṇa","noun-adj",""
"81","jīrṇa","JĪRṆ","a@","jīrṇa","noun-adj",""
"82","dāsī","DĀS","ī","dāsī","noun-adj",""
"83","paryuṣitaṃ","PARYUṢIT","aṃ","paryuṣita","noun-adj",""
"84","pūti","PŪT","i@","pūti","noun-adj",""
"85","kulmāṣaṃ","KULMĀṢ","aṃ","kulmāṣa","noun-adj",""
"86","pātra","PĀTR","a","pātra","noun-adj",""
"87","ākirantī","ĀKIR","antī","ākir","verb",""
"88","āyuṣmato","ĀYUṢM","ato","āyuṣmat","noun-adj",""
"89","rāṣṭrapālasya","RĀṢṬRAPĀL","asya","rāṣṭrapāla","noun-adj",""
"90","hastataś","HAST","ataś","hasta","noun-adj",""
"91","ca","","","ca","ind",""
"92","pādataś","PĀD","ataś","pāda","noun-adj",""
"93","ca","","","ca","ind",""
"94","ghrāṇataś","GHRĀṆ","ataś","ghrāṇa","noun-adj",""
"95","ca","","","ca","ind",""
"96","/","","","","punct",""
"","</s>","","","","",""
"","<s number=""64"">","","","","",""
"1","mukhataś","MUKH","ataś","mukha","noun-adj",""
"2","ca","","","ca","ind",""
"3","svara","SVAR","a@","svara","noun-adj",""
"4","guptitaś","GUPT","itaś","gupta","noun-adj",""
"5","ca","","","ca","ind",""
"6","nimittaṃ","NIMITT","aṃ","nimitta","noun-adj",""
"7","pratyabhijñāy","PRATYABHIJÑ","āy","pratyabhijñā","noun-adj",""
"8","edam","EDAM","","idam","pron",""
"9","avocat","AVOCAT","","vak","verb","vac"
"10","āryaputra","ĀRYAPUTR","a","āryaputra","noun-adj",""
"11","kiṃ","","","kim","pron",""
"12","rāṣṭrapālaḥ","RĀṢṬRAPĀL","aḥ","rāṣṭrapāla","noun-adj",""
"13","bhagini","BHAGIN","i","bhaginī","noun-adj",""
"14","māṃ","","","mat","pron",""
"15","tathā","","","tathā","ind",""
"16","janaḥ","JAN","aḥ","jana","noun-adj",""
"17","saṃjānāti","SAṂJĀN","āti","saṃjāna","noun-adj",""
"18","/","","","","punct",""
"","</s>","","","","",""
"","<s number=""65"">","","","","",""
"1","atha","","","atha","ind",""
"2","sā","","","tad","pron",""
"3","purāṇa","PURĀṆ","a@","purāṇa","noun-adj",""
"4","jīrṇa","JĪRṆ","a@","jīrṇa","noun-adj",""
"5","dāsī","DĀS","ī","dāsī","noun-adj",""
"6","śīghraṃ","ŚĪGHR","aṃ","śīghra","noun-adj",""
"7","śīghraṃ","ŚĪGHR","aṃ","śīghra","noun-adj",""
"8","yena","YEN","a@","yad","pron",""
"9","āyuṣmato","ĀYUṢM","ato","āyuṣmat","noun-adj",""
"10","rāṣṭrapālasya","RĀṢṬRAPĀL","asya","rāṣṭrapāla","noun-adj",""
"11","mahallakas","MAHALLAK","as","mahallaka","noun-adj",""
"12","tena","TEN","a@","tena","noun-adj",""
"13","opasaṃkrāntā","UPASAṂKRĀNT","ā","upasaṃkrānta","noun-adj",""
"14","upetya","UPETY","a@","upetya","noun-adj",""
"15","āyuṣmato","ĀYUṢM","ato","āyuṣmat","noun-adj",""
"16","rāṣṭrapālasya","RĀṢṬRAPĀL","asya","rāṣṭrapāla","noun-adj",""
"17","mahallikām","MAHALLIK","ām","mahallikā","noun-adj",""
"18","idam","","","idam","pron",""
"19","avocat","AVOCAT","","vak","verb","vac"
"20","svāmi","SVĀM","i","svāmin","noun-adj",""
"21","jānīyāḥ","JĀNĪY","āḥ","jānīya","noun-adj",""
"","","","","","",""
"23","saumyo","SAUMY","o","saumya","noun-adj",""
"24","rāṣṭrapālaḥ","RĀṢṬRAPĀL","aḥ","rāṣṭrapāla","noun-adj",""
"25","sthūlakoṣṭhakaṃ","STHŪLAKOṢṬHAK","aṃ","sthūlakoṣṭhaka","noun-adj",""
"26","cira","CIR","a@","cira","noun-adj",""
"27","prāptaḥ","PRĀPT","aḥ","prāpta","noun-adj",""
"","","","","","",""
"29","sva","SV","a@","sva","noun-adj",""
"30","niveśanaṃ","NIVEŚAN","aṃ","niveśana","noun-adj",""
"31","tu","","","tu","ind",""
"32","prāptuṃ","PRĀPT","uṃ","prāpn","verb","prāp"
"33","n","","","na","ind",""
"34","ecchati","ICCHAT","i","icchatā","noun-adj",""
"35","atha","ATH","a@","atha","noun-adj",""
"36","āyuṣmato","ĀYUṢM","ato","āyuṣmat","noun-adj",""
"37","rāṣṭrapālasya","RĀṢṬRAPĀL","asya","rāṣṭrapāla","noun-adj",""
"38","mahallako","MAHALLAK","o","mahallaka","noun-adj",""
"39","vāma","VĀM","a@","vāma","noun-adj",""
"40","hastena","HAST","ena","hasta","noun-adj",""
"41","keśaṃ","KEŚ","aṃ","keśa","noun-adj",""
"42","saṃnipāta","SAṂNIPĀT","a","saṃnipāta","noun-adj",""
"43","yan","","","yad","pron",""
"44","paṭakam","PAṬ","akam","paṭaka","noun-adj",""
"45","eka","EK","a@","eka","noun-adj",""
"46","nivāsaṃ","NIVĀS","aṃ","nivāsa","noun-adj",""
"47","nivāsayya","NIVĀSAY","ya","nivas","verb","nivas"
"48","yena","YEN","a@","yad","pron",""
"49","āyuṣmān","ĀYUṢM","ān","āyuṣmat","noun-adj",""
"50","rāṣṭrapālo","RĀṢṬRAPĀL","o","rāṣṭrapāla","noun-adj",""
"51","tena","TEN","a@","tena","noun-adj",""
"52","opasaṃkrāntaḥ","UPASAṂKRĀNT","aḥ","upasaṃkrānta","noun-adj",""
"53","tena","","","tad","pron",""
"54","khalu","KHAL","u","khal","verb",""
"55","samayen","SAMAY","en","samaya","noun-adj",""
"56","āyuṣmān","ĀYUṢM","ān","āyuṣmat","noun-adj",""
"57","rāṣṭrapālaḥ","RĀṢṬRAPĀL","aḥ","rāṣṭrapāla","noun-adj",""
"58","prakāra","PRAKĀR","a@","prakāra","noun-adj",""
"59","kaṇṭake","KAṆṬAK","e","kaṇṭaka","noun-adj",""
"60","sthitas","STHIT","as","sthita","noun-adj",""
"61","taṃ","","","tad","pron",""
"62","paryuṣitaṃ","PARYUṢIT","aṃ","paryuṣita","noun-adj",""
"63","pūti","PŪT","i@","pūti","noun-adj",""
"64","kulmāṣaṃ","KULMĀṢ","aṃ","kulmāṣa","noun-adj",""
"65","paribhuñjati","PARIBHUÑJ","ati","paribhuñj","verb",""
"","</page>","","","","",""
"","<page number=""38"">","","","","",""
"68","///","","","","punct",""
"69","yatra","","","yatra","ind",""
"70","nadyā","NADY","ā","nadya","noun-adj",""
"71","gaṅgāyāḥ","GAṄG","āyāḥ","gaṅgā","noun-adj",""
"72","sroto","SROT","o","srota","noun-adj",""
"73","gaṃbhīra","GAMBHĪR","a@","gambhīra","noun-adj",""
"74","taraṃ","TAR","aṃ","tara","noun-adj",""
"75","ca","","","ca","ind",""
"76","śīghra","ŚĪGHR","a@","śīghra","noun-adj",""
"77","taraṃ","TAR","aṃ","tara","noun-adj",""
"78","ca","","","ca","ind",""
"79","tatra","","","tatra","ind",""
"80","prakṣipa","PRAKṢIP","a","prakṣipa","noun-adj",""
"81","/","","","","punct",""
"","</s>","","","","",""
"","<s number=""66"">","","","","",""
"1","mā","","","mā","ind",""
"2","te","","","tad","pron",""
"3","ato","","","atas","ind",""
"4","nidānaṃ","NIDĀN","aṃ","nidāna","noun-adj",""
"5","bhaviṣyanti","BHAV","iṣyanti","bhav","verb","bhū"
"6","śoka","ŚOK","a@","śoka","noun-adj",""
"7","parideva","PARIDEV","a@","parideva","noun-adj",""
"8","duḥkha","DUḤKH","a@","duḥkha","noun-adj",""
"9","daurmanasya","DAURMANASY","a@","daurmanasya","noun-adj",""
"10","opāyāsāḥ","UPĀYĀS","āḥ","upāyāsa","noun-adj",""
"11","/","","","","punct",""
"","</s>","","","","",""
"","<s number=""67"">","","","","",""
"","</page>","","","","",""
"","<page number=""39"">","","","","",""
"3","atha","ATH","a@","atha","noun-adj",""
"4","āyuṣmato","ĀYUṢM","ato","āyuṣmat","noun-adj",""
"5","rāṣṭrapālasya","RĀṢṬRAPĀL","asya","rāṣṭrapāla","noun-adj",""
"6","mahallikāyāḥ","MAHALLIK","āyāḥ","mahallikā","noun-adj",""
"7","etad","","","tad","pron",""
"8","a","","","alpha_privativum","ind",""
"9","bhavat","BHAVAT","","bhavat","noun-adj",""
"10","/","","","","punct",""
"","</s>","","","","",""
"","<s number=""68"">","","","","",""
"1","evam","","","eva","ind",""
"2","apy","","","api","ind",""
"3","aham","","","mat","pron",""
"4","kurvatī","KUR","vatī","kar","verb","kṛ"
"5","na","","","na","ind",""
"6","śakya","ŚAKY","a@","śakya","noun-adj",""
"7","āyuṣmantaṃ","ĀYUṢM","antaṃ","āyuṣmat","noun-adj",""
"8","rāṣṭrapālam","RĀṢṬRAPĀL","am","rāṣṭrapāla","noun-adj",""
"9","anva","ANV","a@","anva","noun-adj",""
"10","āvartitum","ĀVART","itum","āvart","verb","āvṛt"
"11","/","","","","punct",""
"","</s>","","","","",""
"","<s number=""69"">","","","","",""
"1","yanv","","","","ind",""
"2","ahaṃ","","","mat","pron",""
"3","vadhukā","VADHUK","ā","vadhukā","noun-adj",""
"4","udyojaye","UDYOJAY","e","udyojayati","noun-adj",""
"5","yam","YAM","","yad","pron",""
"6","/","","","","punct",""
"","</s>","","","","",""
"","<s number=""70"">","","","","",""
"","</page>","","","","",""
"","<page number=""40"">","","","","",""
"3","atha","ATH","a@","atha","noun-adj",""
"4","āyuṣmato","ĀYUṢM","ato","āyuṣmat","noun-adj",""
"5","rāṣṭrapālasya","RĀṢṬRAPĀL","asya","rāṣṭrapāla","noun-adj",""
"6","mahallikā","MAHALLIK","ā","mahallikā","noun-adj",""
"7","vadhukā","VADHUK","ā","vadhukā","noun-adj",""
"8","udyojayantī","UDYOJ","ayantī","udyoj","verb","udyuj"
"9","dam","DAM","","dama","noun-adj",""
"10","avocat","AVOCAT","","vak","verb","vac"
"11","/","","","","punct",""
"","</s>","","","","",""
"","<s number=""71"">","","","","",""
"","</page>","","","","",""
"","<page number=""41"">","","","","",""
"3","vadhukā","VADHUK","ā","vadhukā","noun-adj",""
"4","/","","","","punct",""
"","</s>","","","","",""
"","<s number=""72"">","","","","",""
"1","yad","","","yadi","ind",""
"2","rūpeṇa","RŪP","eṇa","rūpa","noun-adj",""
"3","pūrvaṃ","PŪRVA","ṃ","pūrvam","noun-adj",""
"4","snānena","SNĀN","ena","snāna","noun-adj",""
"5","snātāḥ","SNĀT","āḥ","snāta","noun-adj",""
"6","vastraiḥ","VASTR","aiḥ","vastra","noun-adj",""
"7","pravṛtāḥ","PRAVṚT","āḥ","pravṛta","noun-adj",""
"8","alaṃkāreṇ","ALAṂKĀR","eṇ","alaṃkāra","noun-adj",""
"9","ālaṃkṛtāḥ","ALAṂKṚT","āḥ","alaṃkṛta","noun-adj",""
"10","dhūpair","DHŪP","air","dhūpa","noun-adj",""
"11","dhūpitāḥ","DHŪPIT","āḥ","dhūpita","noun-adj",""
"12","cūrṇair","CŪRṆ","air","cūrṇa","noun-adj",""
"13","avacūrṇitāḥ","AVACŪRṆIT","āḥ","avacūrṇita","noun-adj",""
"14","rāṣṭrapālasya","RĀṢṬRAPĀL","asya","rāṣṭrapāla","noun-adj",""
"15","pūrve","PŪRV","e","pūrva","noun-adj",""
"16","āgārikasya","ĀGĀRIK","asya","āgārika","noun-adj",""
"17","sataḥ","SAT","aḥ","sat","noun-adj",""
"18","priyāś","PRIY","āś","priya","noun-adj",""
"19","c","","","ca","ind",""
"20","^","","","","",""
"21","ābhūta","ABHŪT","a","abhūta","noun-adj",""
"22","manāpāś","MANĀP","āś","manāpa","noun-adj",""
"23","ca","","","ca","ind",""
"24","tadrūpaiḥ","TADRŪP","aiḥ","tadrūpa","noun-adj",""
"25","s","S","","su","noun-adj",""
"26","n","","","na","ind",""
"27","^","","","","",""
"28","ātraiḥ","","","","ind",""
"29","snātāḥ","SNĀT","āḥ","snāta","noun-adj",""
"30","vastraiḥ","VASTR","aiḥ","vastra","noun-adj",""
"31","prāvṛtāḥ","PRĀVṚT","āḥ","prāvṛta","noun-adj",""
"32","alaṃkāreṇ","ALAṂKĀR","eṇ","alaṃkāra","noun-adj",""
"33","ālaṃkṛtāḥ","ALAṂKṚT","āḥ","alaṃkṛta","noun-adj",""
"34","dhūpair","DHŪP","air","dhūpa","noun-adj",""
"35","dhūpitāḥ","DHŪPIT","āḥ","dhūpita","noun-adj",""
"36","cūrṇair","CŪRṆ","air","cūrṇa","noun-adj",""
"37","avacūrṇitāḥ","AVACŪRṆIT","āḥ","avacūrṇita","noun-adj",""
"38","ekā","EK","ā","eka","noun-adj",""
"39","ekasmiṃ","EK","asmiṃ","eka","noun-adj",""
"40","pāde","PĀD","e","pāda","noun-adj",""
"41","nipatitvā","NIPATIT","vā","nipatita","noun-adj",""
"42","dvitīyā","DVITĪY","ā","dvitīya","noun-adj",""
"43","dvitīye","DVITĪY","e","dvitīya","noun-adj",""
"44","nipatitvā","NIPATIT","vā","nipatita","noun-adj",""
"45","evaṃ","","","eva","ind",""
"46","vadata","VAD","ata","vadad","verb","vadā"
"46","vadata","VAD","ata","vad","verb","vad"
"47","/","","","","punct",""
"","</s>","","","","",""
"","<s number=""73"">","","","","",""
"1","kathaṃ","","","katham","ind",""
"2","rūpās","RŪP","ās","rūpa","noun-adj",""
"3","tā","","","tad","pron",""
"4","ap","","","api","ind",""
"5","saraso","SARAS","o","sarasa","noun-adj",""
"6","yāsām","","","yad","pron",""
"7","arthe","ARTH","e","artha","noun-adj",""
"8","āryaputro","ĀRYAPUTR","o","āryaputra","noun-adj",""
"9","bhagavato","BHAGAVAT","o","bhagavatī","noun-adj",""
"10","antike","ANTIK","e","antika","noun-adj",""
"11","brahmacaryaṃ","BRAHMACARY","aṃ","brahmacarya","noun-adj",""
"12","carati","CALAT","i","calati","noun-adj",""
"13","/","","","","punct",""
"","</s>","","","","",""
"","<s number=""74"">","","","","",""
"","</page>","","","","",""
"","<page number=""42"">","","","","",""
"3","atha","ATH","a@","atha","noun-adj",""
"4","āyuṣmato","ĀYUṢM","ato","āyuṣmat","noun-adj",""
"5","rāṣṭrapālasya","RĀṢṬRAPĀL","asya","rāṣṭrapāla","noun-adj",""
"6","purāṇadvitīyā","PURĀṆADVITĪY","ā","purāṇadvitīyā","noun-adj",""
"7","yad","","","yadi","ind",""
"8","rūpaiḥ","RŪP","aiḥ","rūpa","noun-adj",""
"9","snānaiḥ","SNĀN","aiḥ","snāna","noun-adj",""
"10","snātāḥ","SNĀT","āḥ","snāta","noun-adj",""
"11","pūrvavad","PŪRVAVA","d","pūrvavah","noun-adj",""
"12","y","","","","ind",""
"13","āvac","ĀVAC","","āvac","verb",""
"14","cūrṇair","CŪRṆ","air","cūrṇa","noun-adj",""
"15","avacūrṇitā","AVACŪRṆIT","ā","avacūrṇita","noun-adj",""
"16","rāṣṭrapālasya","RĀṢṬRAPĀL","asya","rāṣṭrapāla","noun-adj",""
"17","/","","","","punct",""
"","</s>","","","","",""
"","<s number=""75"">","","","","",""
"1","āgārikasya","ĀGĀRIK","asya","āgārika","noun-adj",""
"2","sataḥ","SAT","aḥ","sat","noun-adj",""
"3","priyāś","PRIY","āś","priya","noun-adj",""
"4","c","","","ca","ind",""
"5","^","","","","",""
"6","ābhū","ĀBH","ū","ābhū","noun-adj",""
"7","van","VAN","","vat","noun-adj",""
"8","manāpāś","MANĀP","āś","manāpa","noun-adj",""
"9","ca","","","ca","ind",""
"10","tadrūpaiḥ","TADRŪP","aiḥ","tadrūpa","noun-adj",""
"11","snānaiḥ","SNĀN","aiḥ","snāna","noun-adj",""
"12","snātāḥ","SNĀT","āḥ","snāta","noun-adj",""
"13","pūrvavad","PŪRVAVA","d","pūrvavah","noun-adj",""
"14","y","","","","ind",""
"15","āvac","ĀVAC","","āvac","verb",""
"16","cūrṇair","CŪRṆ","air","cūrṇa","noun-adj",""
"17","avacūrṇitāḥ","AVACŪRṆIT","āḥ","avacūrṇita","noun-adj",""
"18","ekā","EK","ā","eka","noun-adj",""
"19","ekasmiṃ","EK","asmiṃ","eka","noun-adj",""
"20","pāde","PĀD","e","pāda","noun-adj",""
"21","nipatitā","NIPATIT","ā","nipatita","noun-adj",""
"22","dvitīyā","DVITĪY","ā","dvitīya","noun-adj",""
"23","dvitīye","DVITĪY","e","dvitīya","noun-adj",""
"24","evam","","","eva","ind",""
"25","avocan","AVOC","an","avocat","noun-adj",""
"26","/","","","","punct",""
"","</s>","","","","",""
"","<s number=""76"">","","","","",""
"1","kathaṃ","","","katham","ind",""
"2","rūpās","RŪP","ās","rūpa","noun-adj",""
"3","tā","","","tad","pron",""
"4","ap","","","api","ind",""
"5","saraso","SARAS","o","sarasa","noun-adj",""
"6","yāsām","","","yad","pron",""
"7","arthe","ARTH","e","artha","noun-adj",""
"8","āryaputro","ĀRYAPUTR","o","āryaputra","noun-adj",""
"9","bhagavato","BHAGAVAT","o","bhagavatī","noun-adj",""
"10","antike","ANTIK","e","antika","noun-adj",""
"11","brahmacaryaṃ","BRAHMACARY","aṃ","brahmacarya","noun-adj",""
"12","carati","CALAT","i","calati","noun-adj",""
"13","/","","","","punct",""
"","</s>","","","","",""
"","<s number=""77"">","","","","",""
"","</page>","","","","",""
"","<page number=""43"">","","","","",""
"3","n","","","na","ind",""
"4","āhaṃ","ĀHAṂ","","mat","pron",""
"5","bhaginyaḥ","BHAGIN","yaḥ","bhaginī","noun-adj",""
"6","ap","","","api","ind",""
"7","sarasāṃ","SARAS","āṃ","sarasa","noun-adj",""
"8","hetor","HET","or","hetu","noun-adj",""
"9","bhagavato","BHAGAVAT","o","bhagavatī","noun-adj",""
"10","antike","ANTIK","e","antika","noun-adj",""
"11","brahmacaryaṃ","BRAHMACARY","aṃ","brahmacarya","noun-adj",""
"12","carāmi","CAR","āmi","car","verb","car"
"13","/","","","","punct",""
"","</s>","","","","",""
"","<s number=""78"">","","","","",""
"","</page>","","","","",""
"","<page number=""44"">","","","","",""
"3","atha","ATH","a@","atha","noun-adj",""
"4","āyuṣmato","ĀYUṢM","ato","āyuṣmat","noun-adj",""
"5","rāṣṭrapālasya","RĀṢṬRAPĀL","asya","rāṣṭrapāla","noun-adj",""
"6","purāṇadvitīyā","PURĀṆADVITĪY","ā","purāṇadvitīyā","noun-adj",""
"7","bhaginī","BHAGIN","ī@","bhaginī","noun-adj",""
"8","vādena","VĀD","ena","vāda","noun-adj",""
"9","samuda","SAMUD","a@","samudi","noun-adj",""
"10","ā","","","alpha_privativum","ind",""
"11","cīrṇe","CĪRṆ","e","cīrṇa","noun-adj",""
"12","/","","","","punct",""
"","</s>","","","","",""
"","<s number=""79"">","","","","",""
"1","mūrcchitā","MŪRCH","itā","mūrchat","noun-adj",""
"2","bhūmyāṃ","BHŪM","yāṃ","bhūmi","noun-adj",""
"3","nipatitāḥ","NIPATIT","āḥ","nipatita","noun-adj",""
"4","/","","","","punct",""
"","</s>","","","","",""
"","<s number=""80"">","","","","",""
"","</page>","","","","",""
"","<page number=""45"">","","","","",""
"3","atha","ATH","a@","atha","noun-adj",""
"4","āyuṣmāṃ","ĀYUṢM","āṃ","āyuṣmat","noun-adj",""
"5","rāṣṭrapālo","RĀṢṬRAPĀL","o","rāṣṭrapāla","noun-adj",""
"6","mātāpita","MĀTĀPIT","a@","mātāpitṛ","noun-adj",""
"7","ram","RAM","","rama","noun-adj",""
"8","āmantrayati","AMANTR","ayati","amantra","noun-adj",""
"9","/","","","","punct",""
"","</s>","","","","",""
"","<s number=""81"">","","","","",""
"1","aṃba","AMB","a","amba","noun-adj",""
"2","tāta","TĀT","a","tāta","noun-adj",""
"3","saced","","","saced","ind",""
"4","vāṃ","","","yuṣmat","pron",""
"5","parityaktaṃ","PARITYAKT","aṃ","parityakta","noun-adj",""
"6","kiṃ","","","kim","pron",""
"7","na","","","na","ind",""
"8","dī","","","","ind",""
"9","yate","","","","ind",""
"10","kiṃ","","","kim","pron",""
"11","viheṭhīyate","VIHEṬH","īyate","viheṭh","verb",""
"12","/","","","","punct",""
"","</s>","","","","",""
"","<s number=""82"">","","","","",""
"","</page>","","","","",""
"","<page number=""46"">","","","","",""
"3","sadyo","SADY","o","sadya","noun-adj",""
"4","bhaktaṃ","BHAKT","aṃ","bhakta","noun-adj",""
"5","bhuṃ","","","","ind",""
"6","kṣva","KṢV","a","kṣva","noun-adj",""
"7","tāta","TĀT","a","tāta","noun-adj",""
"8","rāṣṭrapāla","RĀṢṬRAPĀL","a","rāṣṭrapāla","noun-adj",""
"9","/","","","","punct",""
"","</s>","","","","",""
"","<s number=""83"">","","","","",""
"","</page>","","","","",""
"","<page number=""47"">","","","","",""
"3","atha","ATH","a@","atha","noun-adj",""
"4","āyuṣmato","ĀYUṢM","ato","āyuṣmat","noun-adj",""
"5","rāṣṭrapālasya","RĀṢṬRAPĀL","asya","rāṣṭrapāla","noun-adj",""
"6","mahallikā","MAHALLIK","ā","mahallikā","noun-adj",""
"7","utthāya","UTTHĀY","a@","utthāya","noun-adj",""
"8","āsanād","ĀSAN","ād","āsana","noun-adj",""
"9","āyuṣmantaṃ","ĀYUṢM","antaṃ","āyuṣmat","noun-adj",""
"10","rāṣṭrapālaṃ","RĀṢṬRAPĀL","aṃ","rāṣṭrapāla","noun-adj",""
"11","śucinā","ŚUC","inā","śuci","noun-adj",""
"12","praṇītena","PRAṆĪT","ena","praṇīta","noun-adj",""
"13","khādanīya","KHĀDANĪY","a@","khādanīya","noun-adj",""
"14","bhojanīyena","BHOJANĪY","ena","bhojanīya","noun-adj",""
"15","svahastaṃ","SVAHAST","aṃ","svahasta","noun-adj",""
"16","sana","SAN","a@","sana","noun-adj",""
"17","tarpayanti","TARP","ayanti","tarpin","noun-adj",""
"18","saṃpravārayanti","SAṂPRAVĀR","ayanti","saṃpravār","verb",""
"19","/","","","","punct",""
"","</s>","","","","",""
"","<s number=""84"">","","","","",""
"1","th","","","","ind",""
"2","āyuṣmato","ĀYUṢM","ato","āyuṣmat","noun-adj",""
"3","rāṣṭrapālasya","RĀṢṬRAPĀL","asya","rāṣṭrapāla","noun-adj",""
"4","mahallako","MAHALLAK","o","mahallaka","noun-adj",""
"5","mahallikā","MAHALLIK","ā","mahallikā","noun-adj",""
"6","c","","","ca","ind",""
"7","^","","","","",""
"8","āyuṣmantaṃ","ĀYUṢM","antaṃ","āyuṣmat","noun-adj",""
"9","rāṣṭrapālaṃ","RĀṢṬRAPĀL","aṃ","rāṣṭrapāla","noun-adj",""
"10","śucinā","ŚUC","inā","śuci","noun-adj",""
"11","praṇītena","PRAṆĪT","ena","praṇīta","noun-adj",""
"12","khādanīya","KHĀDANĪY","a@","khādanīya","noun-adj",""
"13","bhojanīyena","BHOJANĪY","ena","bhojanīya","noun-adj",""
"14","svahastaṃ","SVAHAST","aṃ","svahasta","noun-adj",""
"15","sana","SAN","a@","sana","noun-adj",""
"16","tarpayanti","TARP","ayanti","tarpin","noun-adj",""
"17","saṃpravārayanti","SAṂPRAVĀR","ayanti","saṃpravār","verb",""
"18","aneka","ANEK","a@","aneka","noun-adj",""
"19","paryāyeṇa","PARYĀY","eṇa","paryāya","noun-adj",""
"20","śucinā","ŚUC","inā","śuci","noun-adj",""
"21","praṇītena","PRAṆĪT","ena","praṇīta","noun-adj",""
"22","khādanīya","KHĀDANĪY","a@","khādanīya","noun-adj",""
"23","bhojanīyena","BHOJANĪY","ena","bhojanīya","noun-adj",""
"24","svahastaṃ","SVAHAST","aṃ","svahasta","noun-adj",""
"25","santarp","SANTAR","p","santara","noun-adj",""
"26","ayitvā","AYIT","vā","ayita","noun-adj",""
"27","saṃpravārayitvā","SAṂPRAVĀR","ayitvā","saṃpravār","verb",""
"","</page>","","","","",""
"","<page number=""48"">","","","","",""
"30","āyuṣmantaṃ","ĀYUṢM","antaṃ","āyuṣmat","noun-adj",""
"31","rāṣṭrapālaṃ","RĀṢṬRAPĀL","aṃ","rāṣṭrapāla","noun-adj",""
"32","bhukta","BHUKT","a@","bhukta","noun-adj",""
"33","vantaṃ","VANT","aṃ","vanti","noun-adj",""
"34","viditvā","VID","itvā","vid","verb","vid"
"35","dhauta","DHAUT","a@","dhauta","noun-adj",""
"36","hastam","HAST","am","hasta","noun-adj",""
"37","a","","","alpha_privativum","ind",""
"38","panīta","PAN","īta@","pana","noun-adj",""
"39","pātraṃ","PĀTR","aṃ","pātra","noun-adj",""
"40","nīca","NĪC","a@","nīca","noun-adj",""
"41","tarakam","TAR","akam","taraka","noun-adj",""
"42","āsanaṃ","ĀSAN","aṃ","āsana","noun-adj",""
"43","gṛhītvā","GṚHĪT","vā","gṛhīta","noun-adj",""
"44","niṣaṇṇā","NIṢAṆṆ","ā","niṣaṇṇa","noun-adj",""
"45","dharmaśravaṇāya","DHARMAŚRAVAṆ","āya","dharmaśravaṇa","noun-adj",""
"","</page>","","","","",""
"","<page number=""49"">","","","","",""
"48","atha","ATH","a@","atha","noun-adj",""
"49","āyuṣmān","ĀYUṢM","ān","āyuṣmat","noun-adj",""
"50","rāṣṭrapālas","RĀṢṬRAPĀL","as","rāṣṭrapāla","noun-adj",""
"51","tasyāṃ","","","tad","pron",""
"52","velāyāṃ","VELĀY","āṃ","velāyā","noun-adj",""
"53","gāthā","GĀTH","ā","gāthā","noun-adj",""
"54","abhāṣe","ABHĀṢ","e","abhāṣa","noun-adj",""
"55","xxxxxxxxxxxx","","","CORRUPTED","ind",""
"56","prahāya","PRAHĀY","a","prahāya","noun-adj",""
"57","kāmāñ","KĀM","āñ","kāma","noun-adj",""
"58","chrāmaṇyam","ŚRĀMAṆY","am","śrāmaṇya","noun-adj",""
"59","eva","","","eva","ind",""
"60","śreyaḥ","ŚREY","aḥ","śreyas","noun-adj",""
"61","//","","","","punct",""
"","</s>","","","","",""
"","<s number=""85"">","","","","",""
"1","atha","","","atha","ind",""
"2","mahārāja","MAHĀRĀJ","a","mahārāja","noun-adj",""
"3","k","","","kim","pron",""
"4","auravya","AUR","avya","aurā","noun-adj",""
"5","āyuṣmato","ĀYUṢM","ato","āyuṣmat","noun-adj",""
"6","rāṣṭrapālasya","RĀṢṬRAPĀL","asya","rāṣṭrapāla","noun-adj",""
"7","bhāṣitam","BHĀṢIT","am","bhāṣita","noun-adj",""
"8","abhinandya","ABHINANDY","a@","abhinandya","noun-adj",""
"9","ānumody","ANUMOD","y@","anumodi","noun-adj",""
"10","āyuṣmat","ĀYUṢM","at","āyuṣmat","noun-adj",""
"11","pādau","PĀD","au","pāda","noun-adj",""
"12","śirasā","ŚIRAS","ā","śiras","noun-adj",""
"13","vandit","VAND","it","vanda","noun-adj",""
"14","vāsanād","VĀSAN","ād","vāsana","noun-adj",""
"15","utthāya","UTTHĀY","a","utthāya","noun-adj",""
"16","prakrāntaḥ","PRAKRĀNT","aḥ","prakrānta","noun-adj",""
"","</s>","","","","",""
"","</page>","","","","",""
"","</doc>","","","","",""
