"WordID","word","NormSTEM","suffix","lemma","PoS","Root"
"","<doc textid = ""prajjaparamitahrdayasutravistaramatrka"" genre = ""sūtra"" title = ""prajñāpāramitāhṛdayasūtra"" author = ""n/a"" discourse = ""homiletic"" tradition = ""prajñāpāramitā"" period = ""foundational"" source = ""gretil accessed may 2021 : http://gretil.sub.uni-goettingen.de/gretil/corpustei/sa_prajjaparamitahrdayasutravistaramatrka.xml"" date_range = ""1st-4th cent. ce"" notes = ""date range = 1st-4th cent. ce alternative genre: tantra in tibetan kanjur . this version vistaramātṛkā is the longer and later version of the pphṛdayasūtra which was more widely known in india. the shorter and possibly earlier recension was better known in east asia translated into chinese by xuanzang in 649 ce . the pphṛdayasūtra may be a chinese apocryphon but no scholarly consensus on the provenance and origin of this sūtra has been reached. more indian commentaries 8 on this sūtra exist than on any other mahāyāna sūtra. oldest known skt. manuscripts date from beginning of 7th cent. ce; see buswell & lopez. 2014. princeton dictionary of buddhism. p. 657. dating: c. 350 ce according to conze; c. 50 ce according to h. nakamura indian buddhism ; see donald s. lopez. 1988. the heart sutra explained: indian and tibetan commentaries. albany: state university of new york press; p. 5."" religion = ""buddh"" edition = ""based on the ed. by p.l. vaidya in: mahayana-sutra-samgrahah part 1. darbhanga: the mithila institute 1961 buddhist sanskrit texts 17 ."" digitization = ""members of the sanskrit buddhist input project"" segmentation_lemmatization = ""ligeia lugli & buddhist translators workbench team"" metadata_enrichment = ""bruno galasek-hul & buddhist translators workbench team"" proofreader = ""n/a"" permission = ""permission for derivatives from m. mehner on behalf of gretil"" reconstructions = ""none"">","","","","",""
"","<page number=""98"">","","","","",""
"","<s number=""1"">","","","","",""
"1","prajñāpāramitā","PRAJÑĀPĀRAMIT","ā@","prajñāpāramitā","noun-adj",""
"2","hṛdaya","HṚDAY","a","hṛdaya","noun-adj",""
"3","s","","","su","ind",""
"4","utram","UTRAM","","utrama","noun-adj",""
"5","/","","","","punct",""
"","</s>","","","","",""
"","<s number=""2"">","","","","",""
"1","vistara","VISTAR","a@","vistara","noun-adj",""
"2","mātṛkā","MĀTṚK","ā","mātṛkā","noun-adj",""
"","</s>","","","","",""
"","<s number=""3"">","","","","",""
"1","namaḥ","NAM","aḥ","nama","noun-adj",""
"2","sarvajñāya","SARVAJÑ","āya","sarvajña","noun-adj",""
"3","//","","","","punct",""
"","</s>","","","","",""
"","<s number=""4"">","","","","",""
"1","evaṃ","","","eva","ind",""
"2","mayā","","","mat","pron",""
"3","śrutam","ŚRUT","am","śruta","noun-adj",""
"4","/","","","","punct",""
"5","ekasmin","EK","asmin","eka","noun-adj",""
"6","samaye","SAMAY","e","samaya","noun-adj",""
"7","bhagavān","BHAGAV","ān","bhagavat","noun-adj",""
"8","rājagṛhe","RĀJAGṚH","e","rājagṛha","noun-adj",""
"9","viharati","VIHAR","ati","vihar","verb","vihṛ"
"10","sma","","","sma","ind",""
"11","gṛdhrakūṭe","GṚDHRAKŪṬ","e","gṛdhrakūṭa","noun-adj",""
"12","parvate","PARVAT","e","parvata","noun-adj",""
"13","mahatā","MAHAT","ā","mahat","noun-adj",""
"14","bhikṣusaṃghena","BHIKṢUSAṂGH","ena","bhikṣusaṃgha","noun-adj",""
"15","sārdhaṃ","SĀRDH","aṃ","sārdha","noun-adj",""
"16","mahatā","MAHAT","ā","mahat","noun-adj",""
"17","ca","","","ca","ind",""
"18","bodhisattva","BODHISATTV","a@","bodhisattva","noun-adj",""
"19","saṃghena","SAṂGH","ena","saṃgha","noun-adj",""
"20","/","","","","punct",""
"21","tena","","","tad","pron",""
"22","khalu","KHAL","u","khal","verb",""
"23","samayena","SAMAY","ena","samaya","noun-adj",""
"24","bhagavān","BHAGAV","ān","bhagavat","noun-adj",""
"25","gambhīra","GAMBHĪR","a@","gambhīra","noun-adj",""
"26","āvasaṃ","ĀVAS","aṃ","vas","verb","vas"
"27","bodhaṃ","BODH","aṃ","bodha","noun-adj",""
"28","nāma","NĀM","a","nāman","noun-adj",""
"29","samādhiṃ","SAMĀDH","iṃ","samādhi","noun-adj",""
"30","samāpannaḥ","SAMĀPANN","aḥ","samāpanna","noun-adj",""
"31","/","","","","punct",""
"32","tena","","","tad","pron",""
"33","ca","","","ca","ind",""
"34","samayena","SAMAY","ena","samaya","noun-adj",""
"35","ārya","ĀRY","a@","ārya","noun-adj",""
"36","āvalokiteśvaro","AVALOKITEŚVAR","o","avalokiteśvara","noun-adj",""
"37","bodhisattvo","BODHISATTV","o","bodhisattva","noun-adj",""
"38","mahāsattvo","MAHĀSATTV","o","mahāsattva","noun-adj",""
"39","gambhīrāyāṃ","GAMBHĪR","āyāṃ","gambhīra","noun-adj",""
"40","prajñāpāramitāyāṃ","PRAJÑĀPĀRAMIT","āyāṃ","prajñāpāramitā","noun-adj",""
"41","caryāṃ","CARY","āṃ","caryā","noun-adj",""
"42","caramāṇaḥ","CAR","amāṇaḥ","car","verb","car"
"43","evaṃ","","","eva","ind",""
"44","vyavalokayati","VYAVALOK","ayati","vyavalok","verb","vyavalok"
"45","sma","","","sma","ind",""
"46","/","","","","punct",""
"47","pañca","PAÑC","a","pañca","noun-adj",""
"48","skandhāṃs","SKANDH","āṃs","skandha","noun-adj",""
"49","tāṃś","","","tad","pron",""
"50","ca","","","ca","ind",""
"51","svabhāva","SVABHĀV","a","svabhāva","noun-adj",""
"52","śūnyaṃ","ŚŪNY","aṃ","śūnya","noun-adj",""
"53","vyavalokayati","VYAVALOK","ayati","vyavalok","verb","vyavalok"
"54","//","","","","punct",""
"","</s>","","","","",""
"","<s number=""5"">","","","","",""
"1","atha","ATH","a@","atha","noun-adj",""
"2","āyuṣmān","ĀYUṢM","ān","āyuṣmat","noun-adj",""
"3","śāriputro","ŚĀRIPUTR","o","śāriputra","noun-adj",""
"4","buddha","BUDDH","a@","buddha","noun-adj",""
"5","ānubhāvena","ANUBHĀV","ena","anubhāva","noun-adj",""
"6","ārya","ĀRY","a@","ārya","noun-adj",""
"7","āvalokiteśvaraṃ","AVALOKITEŚVAR","aṃ","avalokiteśvara","noun-adj",""
"8","bodhisattvam","BODHISATTV","am","bodhisattva","noun-adj",""
"9","etad","ETAD","","tad","pron",""
"10","avocat","AVOC","at","avocat","noun-adj",""
"11","/","","","","punct",""
"12","yaḥ","","","yad","pron",""
"13","kaścit","","","kimcit","ind",""
"14","kulaputro","KULAPUTR","o","kulaputra","noun-adj",""
"15","vā","","","vā","ind",""
"16","kuladuhitā","KULADUHIT","ā","kuladuhitṛ","noun-adj",""
"17","vā","","","vā","ind",""
"18","asyāṃ","","","idam","pron",""
"19","gambhīrāyāṃ","GAMBHĪR","āyāṃ","gambhīra","noun-adj",""
"20","prajñāpāramitāyāṃ","PRAJÑĀPĀRAMIT","āyāṃ","prajñāpāramitā","noun-adj",""
"21","caryāṃ","CARY","āṃ","caryā","noun-adj",""
"22","cartu","CART","u@","cartu","noun-adj",""
"23","kāmaḥ","KĀM","aḥ","kāma","noun-adj",""
"24","kathaṃ","","","katham","ind",""
"25","śikṣitavyaḥ","ŚIKṢ","itavyaḥ","śikṣ","verb","śikṣ"
"25","śikṣitavyaḥ","ŚIKṢ","itavyaḥ","śakn","verb","śak"
"26","/","","","","punct",""
"27","evam","","","eva","ind",""
"28","ukte","UKT","e","ukta","noun-adj",""
"29","ārya","ĀRY","a@","ārya","noun-adj",""
"30","āvalokiteśvaro","AVALOKITEŚVAR","o","avalokiteśvara","noun-adj",""
"31","bodhisattvo","BODHISATTV","o","bodhisattva","noun-adj",""
"32","mahāsattvaḥ","MAHĀSATTV","aḥ","mahāsattva","noun-adj",""
"33","āyuṣmantaṃ","ĀYUṢM","antaṃ","āyuṣmat","noun-adj",""
"34","śāriputram","ŚĀRIPUTR","am","śāriputra","noun-adj",""
"35","etad","ETAD","","tad","pron",""
"36","avocat","AVOC","at","avocat","noun-adj",""
"37","/","","","","punct",""
"38","yaḥ","","","yad","pron",""
"39","kaścic","","","kimcit","ind",""
"40","chāriputra","ŚĀRIPUTR","a","śāriputra","noun-adj",""
"41","kulaputro","KULAPUTR","o","kulaputra","noun-adj",""
"42","va","","","vai","ind",""
"43","kuladuhitā","KULADUHIT","ā","kuladuhitṛ","noun-adj",""
"44","vā","","","vā","ind",""
"45","asyāṃ","","","idam","pron",""
"46","gambhīrāyāṃ","GAMBHĪR","āyāṃ","gambhīra","noun-adj",""
"47","prajñāpāramitāyāṃ","PRAJÑĀPĀRAMIT","āyāṃ","prajñāpāramitā","noun-adj",""
"48","caryāṃ","CARY","āṃ","caryā","noun-adj",""
"49","cartu","CART","u@","cartu","noun-adj",""
"50","kāmaḥ","KĀM","aḥ","kāma","noun-adj",""
"51","ten","","","tad","pron",""
"52","^","","","","",""
"53","aivaṃ","","","eva","ind",""
"54","vyavalokitavyam","VYAVALOKIT","avyam","vyavalokita","noun-adj",""
"55","/","","","","punct",""
"56","pañca","PAÑC","a@","pañca","noun-adj",""
"57","skandhāṃs","SKANDH","āṃs","skandha","noun-adj",""
"58","tāṃś","","","tad","pron",""
"59","ca","","","ca","ind",""
"60","svabhāva","SVABHĀV","a@","svabhāva","noun-adj",""
"61","śūnyān","ŚŪNY","ān","śūnya","noun-adj",""
"62","samanupaśyati","SAMANUPAŚ","yati","samanupaśa","noun-adj",""
"63","sma","","","sma","ind",""
"64","/","","","","punct",""
"65","rūpaṃ","RŪP","aṃ","rūpa","noun-adj",""
"66","śūnyatā","ŚŪNYAT","ā","śūnyatā","noun-adj",""
"67","śūnyata","ŚŪNYAT","a","śūnyatā","noun-adj",""
"68","^","","","","",""
"69","aiva","","","eva","ind",""
"70","rūpam","RŪP","am","rūpa","noun-adj",""
"71","/","","","","punct",""
"72","rūpān","RŪP","ān","rūpa","noun-adj",""
"73","na","","","na","ind",""
"74","pṛthak","PṚTHAK","","pṛthak","noun-adj",""
"75","śūnyatā","ŚŪNYAT","ā","śūnyatā","noun-adj",""
"76","śūnyatāyā","ŚŪNYAT","āyā","śūnyatā","noun-adj",""
"77","na","","","na","ind",""
"78","pṛthag","PṚTH","ag","pṛtha","noun-adj",""
"79","rūpam","RŪP","am","rūpa","noun-adj",""
"80","/","","","","punct",""
"81","yad","","","yadi","ind",""
"82","rūpaṃ","RŪP","aṃ","rūpa","noun-adj",""
"83","sā","","","tad","pron",""
"84","śūnyatā","ŚŪNYAT","ā","śūnyatā","noun-adj",""
"85","yā","","","yad","pron",""
"86","śūnyatā","ŚŪNYAT","ā","śūnyatā","noun-adj",""
"87","tad","TAD","","tad","pron",""
"88","rūpam","RŪP","am","rūpa","noun-adj",""
"89","/","","","","punct",""
"90","evaṃ","","","eva","ind",""
"91","vedanā","VEDAN","ā@","vedanā","noun-adj",""
"92","saṃjñā","SAṂJÑ","ā@","saṃjñā","noun-adj",""
"93","saṃskāra","SAṂSKĀR","a@","saṃskāra","noun-adj",""
"94","vijñānāni","VIJÑĀN","āni","vijñāna","noun-adj",""
"95","ca","","","ca","ind",""
"96","śūnyatā","ŚŪNYAT","ā","śūnyatā","noun-adj",""
"97","/","","","","punct",""
"98","evaṃ","","","eva","ind",""
"99","śāriputra","ŚĀRIPUTR","a","śāriputra","noun-adj",""
"100","sarva","SARV","a@","sarva","noun-adj",""
"101","dharmāḥ","DHARM","āḥ","dharma","noun-adj",""
"102","śūnyatā","ŚŪNYAT","ā@","śūnyatā","noun-adj",""
"103","lakṣaṇā","LAKṢAṆ","ā","lakṣaṇā","noun-adj",""
"104","an","","","alpha_privativum","ind",""
"105","utpannā","UTPANN","ā","utpanna","noun-adj",""
"106","aniruddhā","ANIRUDDH","ā","aniruddha","noun-adj",""
"107","amalā","AMAL","ā","amalā","noun-adj",""
"108","vimalā","VIMAL","ā","vimalā","noun-adj",""
"109","anūnā","ANŪN","ā","anūnā","noun-adj",""
"110","asaṃpūrṇāḥ","ASAṂPŪRṆ","āḥ","asaṃpūrṇa","noun-adj",""
"111","/","","","","punct",""
"112","tasmāt","","","tad","pron",""
"113","tarhi","","","tarhi","ind",""
"114","śāriputra","ŚĀRIPUTR","a","śāriputra","noun-adj",""
"115","śūnyatāyāṃ","ŚŪNYAT","āyāṃ","śūnyatā","noun-adj",""
"116","na","","","na","ind",""
"117","rūpam","RŪP","am","rūpa","noun-adj",""
"118","na","","","na","ind",""
"119","vedanā","VEDAN","ā","vedanā","noun-adj",""
"120","na","","","na","ind",""
"121","saṃjñā","SAṂJÑ","ā","saṃjñā","noun-adj",""
"122","na","","","na","ind",""
"123","saṃskārāḥ","SAṂSKĀR","āḥ","saṃskāra","noun-adj",""
"124","na","","","na","ind",""
"125","vijñānam","VIJÑĀN","am","vijñāna","noun-adj",""
"126","na","","","na","ind",""
"127","cakṣur","CAKṢ","ur","cakṣu","noun-adj",""
"128","na","","","na","ind",""
"129","śrotraṃ","ŚROTR","aṃ","śrotra","noun-adj",""
"130","na","","","na","ind",""
"131","ghrāṇaṃ","GHRĀṆ","aṃ","ghrāṇa","noun-adj",""
"132","na","","","na","ind",""
"133","jihvā","JIHV","ā","jihvā","noun-adj",""
"134","na","","","na","ind",""
"135","kāyo","KĀY","o","kāya","noun-adj",""
"136","na","","","na","ind",""
"137","mano","MAN","o","manas","noun-adj",""
"138","na","","","na","ind",""
"139","rūpaṃ","RŪP","aṃ","rūpa","noun-adj",""
"140","na","","","na","ind",""
"141","śabdo","ŚABD","o","śabda","noun-adj",""
"142","na","","","na","ind",""
"143","gandho","GANDH","o","gandha","noun-adj",""
"144","na","","","na","ind",""
"145","raso","RAS","o","rasa","noun-adj",""
"146","na","","","na","ind",""
"147","spraṣṭavyaṃ","SPRAṢ","ṭavyaṃ","spraṣa","noun-adj",""
"148","na","","","na","ind",""
"149","dharmaḥ","DHARM","aḥ","dharma","noun-adj",""
"150","/","","","","punct",""
"151","na","","","na","ind",""
"152","cakṣur","CAKṢ","ur","cakṣu","noun-adj",""
"153","dhātur","DHĀT","ur@","dhātu","noun-adj",""
"154","yāvan","YĀVAN","","yāvat","ind",""
"155","na","","","na","ind",""
"156","mano","MAN","o@","manas","noun-adj",""
"157","dhātur","DHĀT","ur","dhātu","noun-adj",""
"158","na","","","na","ind",""
"159","dharma","DHARM","a@","dharma","noun-adj",""
"160","dhātur","DHĀT","ur","dhātu","noun-adj",""
"161","na","","","na","ind",""
"162","mano","MAN","o@","manas","noun-adj",""
"163","vijñāna","VIJÑĀN","a@","vijñāna","noun-adj",""
"164","dhātuḥ","DHĀT","uḥ","dhātu","noun-adj",""
"165","/","","","","punct",""
"166","na","","","na","ind",""
"167","vidyā","VIDY","ā","vidyā","noun-adj",""
"168","n","","","na","ind",""
"169","^","","","","",""
"170","ā","","","alpha_privativum","ind",""
"171","vidyā","VIDY","ā","vidyā","noun-adj",""
"172","na","","","na","ind",""
"173","kṣayo","KṢAY","o","kṣaya","noun-adj",""
"174","yāvan","YĀVAN","","yāvat","ind",""
"175","na","","","na","ind",""
"176","jarā","JAR","ā@","jarā","noun-adj",""
"177","maraṇaṃ","MARAṆ","aṃ","maraṇa","noun-adj",""
"178","na","","","na","ind",""
"179","jarā","JAR","ā@","jarā","noun-adj",""
"180","maraṇa","MARAṆ","a@","maraṇa","noun-adj",""
"181","kṣayaḥ","KṢAY","aḥ","kṣaya","noun-adj",""
"182","na","","","na","ind",""
"183","duḥkha","DUḤKH","a@","duḥkha","noun-adj",""
"184","samudaya","SAMUDAY","a@","samudaya","noun-adj",""
"185","nirodha","NIRODH","a@","nirodha","noun-adj",""
"186","mārgā","MĀRG","ā","mārga","noun-adj",""
"187","na","","","na","ind",""
"188","jñānaṃ","JÑĀN","aṃ","jñāna","noun-adj",""
"189","na","","","na","ind",""
"190","prāptir","PRĀPT","ir","prāpti","noun-adj",""
"191","n","","","na","ind",""
"192","^","","","","",""
"193","ā","","","alpha_privativum","ind",""
"194","prāptiḥ","PRĀPT","iḥ","prāpti","noun-adj",""
"195","/","","","","punct",""
"196","tasmāc","","","tad","pron",""
"197","chāriputra","ŚĀRIPUTR","a","śāriputra","noun-adj",""
"198","a","","","alpha_privativum","ind",""
"199","prāptitvena","PRĀPT","itvena","prāpta","noun-adj",""
"200","bodhisattvānāṃ","BODHISATTV","ānāṃ","bodhisattva","noun-adj",""
"201","prajñāpāramitām","PRAJÑĀPĀRAMIT","ām","prajñāpāramitā","noun-adj",""
"202","āśritya","ĀŚRIT","ya","āśrita","noun-adj",""
"","</page>","","","","",""
"","<page number=""99"">","","","","",""
"205","viharati","VIHAR","ati","vihar","verb","vihṛ"
"206","citta","CITT","a@","citta","noun-adj",""
"207","āvaraṇaḥ","ĀVARAṆ","aḥ","āvaraṇa","noun-adj",""
"208","/","","","","punct",""
"","</s>","","","","",""
"","<s number=""6"">","","","","",""
"1","citta","CITT","a@","citta","noun-adj",""
"2","āvaraṇa","ĀVARAṆ","a@","āvaraṇa","noun-adj",""
"3","nāstitvād","NĀSTITV","ād","nāstitva","noun-adj",""
"4","a","","","alpha_privativum","ind",""
"5","trasto","TRAST","o","trasta","noun-adj",""
"6","viparyāsa","VIPARYĀS","a@","viparyāsa","noun-adj",""
"7","ātkrānto","ĀTKRĀNT","o","ātkrānta","noun-adj",""
"8","niṣṭha","NIṢṬH","a@","niṣṭha","noun-adj",""
"9","nirvāṇaḥ","NIRVĀṆ","aḥ","nirvāṇa","noun-adj",""
"10","/","","","","punct",""
"","</s>","","","","",""
"","<s number=""7"">","","","","",""
"1","tryadhva","TRYADHV","a@","tryadhva","noun-adj",""
"2","vyavasthitāḥ","VYAVASTHIT","āḥ","vyavasthita","noun-adj",""
"3","sarva","SARV","a@","sarva","noun-adj",""
"4","buddhāḥ","BUDDH","āḥ","buddha","noun-adj",""
"5","prajñāpāramitām","PRAJÑĀPĀRAMIT","ām","prajñāpāramitā","noun-adj",""
"6","āśritya","ĀŚRIT","ya","āśrita","noun-adj",""
"7","anuttarāṃ","ANUTTAR","āṃ","anuttara","noun-adj",""
"8","samyak","SAMYA","k@","samyak","noun-adj",""
"9","saṃbodhim","SAṂBODH","im","saṃbodhi","noun-adj",""
"10","abhisaṃbuddhāḥ","ABHISAMBUDDH","āḥ","abhisambuddha","noun-adj",""
"11","/","","","","punct",""
"","</s>","","","","",""
"","<s number=""8"">","","","","",""
"1","tasmād","","","tad","pron",""
"2","jñātavyaḥ","JÑĀ","tavyaḥ","jān","verb","jñā"
"3","prajñāpāramitā","PRAJÑĀPĀRAMIT","ā@","prajñāpāramitā","noun-adj",""
"4","mahāmantraḥ","MAHĀMANTR","aḥ","mahāmantra","noun-adj",""
"5","an","","","alpha_privativum","ind",""
"6","uttaramantraḥ","UTTARAMANTR","aḥ","uttaramantrin","noun-adj",""
"7","a","","","alpha_privativum","ind",""
"8","samasam","SAMAS","am","samas","verb",""
"9","amantraḥ","AMANTR","aḥ","amantra","noun-adj",""
"10","sarvaduḥkhapraśamana","SARVADUḤKHAPRAŚAMAN","a@","sarvaduḥkhapraśamana","noun-adj",""
"11","mantraḥ","MANTR","aḥ","mantra","noun-adj",""
"12","satyam","SATY","am","satya","noun-adj",""
"13","a","","","alpha_privativum","ind",""
"14","mithyatvāt","MITHYATV","āt","mithyatva","noun-adj",""
"15","prajñāpāramitāyā","PRAJÑĀPĀRAMIT","āyā","prajñāpāramitā","noun-adj",""
"16","mukto","MUKT","o","mukta","noun-adj",""
"17","mantraḥ","MANTR","aḥ","mantra","noun-adj",""
"18","/","","","","punct",""
"19","tad","","","tad","pron",""
"20","yathā","","","yathā","ind",""
"21","/","","","","punct",""
"22","gate","GAT","e","gata","noun-adj",""
"23","gate","GAT","e","gata","noun-adj",""
"24","pāragate","PĀRAGAT","e","pāragata","noun-adj",""
"25","pāra","PĀR","a@","pāra","noun-adj",""
"26","saṃgate","SAṂGAT","e","saṃgata","noun-adj",""
"27","bodhi","BODH","i","bodhi","noun-adj",""
"28","svāhā","SVĀH","ā","svāhā","noun-adj",""
"29","/","","","","punct",""
"30","evaṃ","","","eva","ind",""
"31","śāriputra","ŚĀRIPUTR","a","śāriputra","noun-adj",""
"32","gambhīrāyāṃ","GAMBHĪR","āyāṃ","gambhīra","noun-adj",""
"33","prajñāpāramitāyāṃ","PRAJÑĀPĀRAMIT","āyāṃ","prajñāpāramitā","noun-adj",""
"34","caryāyāṃ","CARY","āyāṃ","caryā","noun-adj",""
"35","śikṣitavyaṃ","ŚIKṢ","itavyaṃ","śikṣ","verb","śikṣ"
"35","śikṣitavyaṃ","ŚIKṢ","itavyaṃ","śakn","verb","śak"
"36","bodhisattvena","BODHISATTV","ena","bodhisattva","noun-adj",""
"37","//","","","","punct",""
"","</s>","","","","",""
"","<s number=""9"">","","","","",""
"1","atha","ATH","a","atha","noun-adj",""
"2","khalu","KHAL","u","khal","verb",""
"3","bhagavān","BHAGAV","ān","bhagavat","noun-adj",""
"4","tasmāt","","","tad","pron",""
"5","samādher","SAMĀDH","er","samādhi","noun-adj",""
"6","vyutthāya","VYUTTH","āya","vyutthā","noun-adj",""
"7","ārya","ĀRY","a@","ārya","noun-adj",""
"8","āvalokiteśvarasya","AVALOKITEŚVAR","asya","avalokiteśvara","noun-adj",""
"9","bodhisattvasya","BODHISATTV","asya","bodhisattva","noun-adj",""
"10","sādhukāramam","SĀDHUKĀRAM","am","sādhukārama","noun-adj",""
"11","adāt","","","dad","verb","dā"
"12","/","","","","punct",""
"13","sādhu","SĀDH","u@","sādhu","noun-adj",""
"14","sādhu","SĀDH","u@","sādhu","noun-adj",""
"15","kulaputra","KULAPUTR","a","kulaputra","noun-adj",""
"16","/","","","","punct",""
"17","evam","","","eva","ind",""
"18","etat","ETAT","","tad","pron",""
"19","kulaputra","KULAPUTR","a","kulaputra","noun-adj",""
"20","evam","","","eva","ind",""
"21","etad","ETAD","","tad","pron",""
"22","gambhīrāyāṃ","GAMBHĪR","āyāṃ","gambhīra","noun-adj",""
"23","prajñāpāramitāyāṃ","PRAJÑĀPĀRAMIT","āyāṃ","prajñāpāramitā","noun-adj",""
"24","caryaṃ","CARY","aṃ","caryā","noun-adj",""
"25","cartavyaṃ","CAR","tavyaṃ","car","verb","car"
"26","yathā","","","yathā","ind",""
"27","tvayā","","","tvat","pron",""
"28","nirdiṣṭam","NIRDIṢṬ","am","nirdiṣṭa","noun-adj",""
"29","/","","","","punct",""
"30","anumodyate","ANUMOD","yate","anumod","verb","anumud"
"31","tathāgatair","TATHĀGAT","air","tathāgata","noun-adj",""
"32","arhadbhiḥ","ARH","adbhiḥ","arhat","noun-adj",""
"33","//","","","","punct",""
"","</s>","","","","",""
"","<s number=""10"">","","","","",""
"1","idam","IDAM","","idam","pron",""
"2","avocad","AVOC","ad","avocat","noun-adj",""
"3","bhagavān","BHAGAV","ān","bhagavat","noun-adj",""
"4","/","","","","punct",""
"5","ānanda","ĀNAND","a@","ānanda","noun-adj",""
"6","manā","MAN","ā","manā","noun-adj",""
"7","āyuṣmān","ĀYUṢM","ān","āyuṣmat","noun-adj",""
"8","śāriputraḥ","ŚĀRIPUTR","aḥ","śāriputra","noun-adj",""
"9","ārya","ĀRY","a@","ārya","noun-adj",""
"10","āvalokiteśvaraś","AVALOKITEŚVAR","aś","avalokiteśvara","noun-adj",""
"11","ca","","","ca","ind",""
"12","bodhisattvaḥ","BODHISATTV","aḥ","bodhisattva","noun-adj",""
"13","sā","","","tad","pron",""
"14","ca","","","ca","ind",""
"15","sarvāvatī","SARVĀV","atī","sarvāvat","noun-adj",""
"16","pariṣat","PARIṢ","at","pariṣat","noun-adj",""
"17","sa","","","sa_saha","ind",""
"18","deva","DEV","a@","deva","noun-adj",""
"19","mānuṣa","MĀNUṢ","a@","mānuṣa","noun-adj",""
"20","āsura","ĀSUR","a@","āsura","noun-adj",""
"21","gandharvaś","GANDHARV","aś","gandharva","noun-adj",""
"22","ca","","","ca","ind",""
"23","loko","LOK","o","loka","noun-adj",""
"24","bhagavato","BHAGAVAT","o","bhagavatī","noun-adj",""
"25","bhāṣitam","BHĀṢIT","am","bhāṣita","noun-adj",""
"26","abhyanandan","ABHYANAND","an","abhyanandat","noun-adj",""
"27","//","","","","punct",""
"","</s>","","","","",""
"","<s number=""11"">","","","","",""
"1","iti","","","iti","ind",""
"2","prajñāpāramitā","PRAJÑĀPĀRAMIT","ā@","prajñāpāramitā","noun-adj",""
"3","hṛdaya","HṚDAY","a@","hṛdaya","noun-adj",""
"4","sūtraṃ","SŪTR","aṃ","sūtra","noun-adj",""
"5","samāptam","SAMĀPT","am","samāpta","noun-adj",""
"6","/","","","","punct",""
"","</s>","","","","",""
"","</page>","","","","",""
"","</doc>","","","","",""
