"WordID","word","NormSTEM","suffix","lemma","PoS","Root"
"","<doc textid = ""mrtyuvajcanasitatarasadhana"" genre = ""sādhana"" title = ""mṛtyuvañcanasitatārāsādhana"" author = ""vāgīśvarakīrti"" discourse = ""tantra"" tradition = ""tantra"" period = ""commentarial"" source = ""gretil accessed aug 2019 : http://gretil.sub.uni-goettingen.de/gretil/corpustei/sa_gretilbuddh _ mrtyuvancanasitatarasahana _final.xml"" date_range = ""10.-11. ce"" notes = ""alternative genre: tantra; tantric sādhana"" religion = ""buddh"" edition = ""based on the ed. by j. schneider 2010 page number = verse number"" digitization = ""j. schneider"" segmentation_lemmatization = ""ligeia lugli & buddhist translators workbench team"" metadata_enrichment = ""bruno galasek-hul & buddhist translators workbench team"" proofreader = ""n/a"" permission = ""permission for derivatives from m. mehner on behalf of gretil"" reconstructions = ""none"">","","","","",""
"","<page number=""0"">","","","","",""
"","<s number=""0"">","","","","",""
"1","mṛtyu","MṚTY","u@","mṛtyu","noun-adj",""
"2","vañcana","VAÑCAN","a@","vañcana","noun-adj",""
"3","sitatāra","SITATĀR","a@","sitatārā","noun-adj",""
"4","āsādhana","ASĀDHAN","a","asādhana","noun-adj",""
"5","mṛtyu","MṚTY","u@","mṛtyu","noun-adj",""
"6","doṣair","DOṢ","air","doṣa","noun-adj",""
"7","a","","","alpha_privativum","ind",""
"8","liptaḥ","LIPT","aḥ","lipta","noun-adj",""
"9","syāt","","","as","verb","as"
"10","tārāhṛc","TĀR","āhṛc","tāra","noun-adj",""
"11","cakra","CAKR","a@","cakra","noun-adj",""
"12","bhāvakaḥ","BHĀV","akaḥ","bhāvaka","noun-adj",""
"13","/","","","","punct",""
"14","lābhī","LĀBH","ī","lābhin","noun-adj",""
"15","ca","","","ca","ind",""
"16","sarva","SARV","a@","sarva","noun-adj",""
"17","siddhīnāṃ","SIDDH","īnāṃ","siddhi","noun-adj",""
"18","ṣaṇmā","","","","ind",""
"19","sāvadhi","SĀVADH","i","sāvadhi","noun-adj",""
"20","tat","TAT","","tad","pron",""
"21","paraḥ","PAR","aḥ","para","noun-adj",""
"22","//","","","","punct",""
"23","1","","","","ind",""
"24","//","","","","punct",""
"","</s>","","","","",""
"","</page>","","","","",""
"","<page number=""1"">","","","","",""
"","<s number=""1"">","","","","",""
"1","vāgīśvara","VĀGĪŚVAR","a@","vāgīśvara","noun-adj",""
"2","kṛta","KṚT","a@","kṛta","noun-adj",""
"3","ādeśān","ĀDEŚ","ān","ādeśa","noun-adj",""
"4","mṛtyu","MṚTY","u@","mṛtyu","noun-adj",""
"5","vañcana","VAÑCAN","a@","vañcana","noun-adj",""
"6","saṃgrahāt","SAṂGRAH","āt","saṃgraha","noun-adj",""
"7","/","","","","punct",""
"8","uddhṛtā","UDDHṚT","ā","uddhṛta","noun-adj",""
"9","sitatārāyā","SITATĀR","āyā","sitatārā","noun-adj",""
"10","bhāvanā","BHĀVAN","ā","bhāvanā","noun-adj",""
"11","bhay","BH","ay","bhā","noun-adj",""
"12","an","","","alpha_privativum","ind",""
"13","āśinī","ĀŚIN","ī","āśinī","noun-adj",""
"14","//","","","","punct",""
"15","2","","","","ind",""
"16","//","","","","punct",""
"","</s>","","","","",""
"","</page>","","","","",""
"","<page number=""2"">","","","","",""
"","<s number=""2"">","","","","",""
"1","turya","TURY","a@","turya","noun-adj",""
"2","varga","VARG","a@","varga","noun-adj",""
"3","ādya","ĀDY","a@","ādya","noun-adj",""
"4","sākāra","SĀKĀR","a@","sākāra","noun-adj",""
"5","tviṣā","TVIṢ","ā","tviṣā","noun-adj",""
"6","visphurita","VISPHURIT","a@","visphurita","noun-adj",""
"7","āmbare","AMBAR","e","ambara","noun-adj",""
"8","/","","","","punct",""
"9","sita","SIT","a@","sita","noun-adj",""
"10","ābja","ABJ","a@","abja","noun-adj",""
"11","endv","END","v","endh","noun-adj",""
"12","āsanāṃ","ĀSAN","āṃ","āsana","noun-adj",""
"13","dṛṣṭvā","DṚṢṬ","vā","darś","verb","dṛś"
"14","puras","PUR","as","pura","noun-adj",""
"15","tri","TR","i@","tri","noun-adj",""
"16","śaraṇaṃ","ŚARAṆ","aṃ","śaraṇa","noun-adj",""
"17","paṭhet","PAṬH","et","paṭh","verb",""
"18","//","","","","punct",""
"19","3","","","","ind",""
"20","//","","","","punct",""
"","</s>","","","","",""
"","</page>","","","","",""
"","<page number=""3"">","","","","",""
"","<s number=""3"">","","","","",""
"1","muhūrtaṃ","MUHŪRT","aṃ","muhūrta","noun-adj",""
"2","śūnyatāṃ","ŚŪNYAT","āṃ","śūnyatā","noun-adj",""
"3","paśyet","PAŚY","et","paś","verb","paś"
"4","prākṛta","PRĀKṚT","a@","prākṛta","noun-adj",""
"5","āropa","ĀROP","a@","āropa","noun-adj",""
"6","hānaye","HĀN","aye","hāni","noun-adj",""
"7","/","","","","punct",""
"8","tataḥ","","","tatas","ind",""
"9","praṇidhi","PRAṆIDH","i@","praṇidhi","noun-adj",""
"10","sāmarthyād","SĀMARTHY","ād","sāmarthya","noun-adj",""
"11","bodhicitta","BODHICITT","a@","bodhicitta","noun-adj",""
"12","ākṣaraṃ","ĀKṢAR","aṃ","ākṣarati","noun-adj",""
"13","bhavet","BHAV","et","bhav","verb","bhū"
"14","//","","","","punct",""
"15","4","","","","ind",""
"16","//","","","","punct",""
"","</s>","","","","",""
"","</page>","","","","",""
"","<page number=""4"">","","","","",""
"","<s number=""4"">","","","","",""
"1","sitā","SIT","ā@","sita","noun-adj",""
"2","ravindam","RAVIND","am","ravinda","noun-adj",""
"3","adhyastha","ADHYASTH","a@","adhyastha","noun-adj",""
"4","candra","CANDR","a@","candra","noun-adj",""
"5","bimba","BIMB","a@","bimba","noun-adj",""
"6","āsana","ĀSAN","a@","āsana","noun-adj",""
"7","opari","UPAR","i","upari","noun-adj",""
"8","/","","","","punct",""
"9","ābaddha","ĀBADDH","a@","ābaddha","noun-adj",""
"10","vajra","VAJR","a@","vajra","noun-adj",""
"11","paryaṅkāṃ","PARYAṄK","āṃ","paryaṅkā","noun-adj",""
"12","varad","VAR","ad","varat","noun-adj",""
"13","otpala","UTPAL","a@","utpala","noun-adj",""
"14","dhāriṇīm","DHĀRIṆ","īm","dhāriṇī","noun-adj",""
"15","//","","","","punct",""
"16","5","","","","ind",""
"17","//","","","","punct",""
"","</s>","","","","",""
"","</page>","","","","",""
"","<page number=""5"">","","","","",""
"","<s number=""5"">","","","","",""
"1","śarac","ŚAR","ac","śarat","noun-adj",""
"2","candrakar","CANDRAK","ar","candraka","noun-adj",""
"3","ākārāṃ","ĀKĀR","āṃ","ākārā","noun-adj",""
"4","pṛṣṭha","PṚṢṬH","a@","pṛṣṭha","noun-adj",""
"5","candra","CANDR","a@","candra","noun-adj",""
"6","samāśritām","SAMĀŚRIT","ām","samāśrita","noun-adj",""
"7","/","","","","punct",""
"8","sarva","SARV","a@","sarva","noun-adj",""
"9","ālaṅkāra","ALAṄKĀR","a@","alaṅkāra","noun-adj",""
"10","saṃpūrṇāṃ","SAṂPŪRṆ","āṃ","saṃpūrṇa","noun-adj",""
"11","ṣoḍaśa","ṢOḌAŚ","a@","ṣoḍaśa","noun-adj",""
"12","ābda","ABD","a@","abda","noun-adj",""
"13","vapuṣmatīm","VAPUṢMAT","īm","vapuṣmatī","noun-adj",""
"14","//","","","","punct",""
"15","6","","","","ind",""
"16","//","","","","punct",""
"","</s>","","","","",""
"","</page>","","","","",""
"","<page number=""6"">","","","","",""
"","<s number=""6"">","","","","",""
"1","sarva","SARV","a@","sarva","noun-adj",""
"2","saṃbuddha","SAṂBUDDH","a@","saṃbuddha","noun-adj",""
"3","tat","TAT","","tad","pron",""
"4","putram","PUTR","am","putra","noun-adj",""
"5","ātaraṃ","ĀTAR","aṃ","ātara","noun-adj",""
"6","kāmarūpa","KĀMARŪP","a@","kāmarūpa","noun-adj",""
"7","dhām","DHĀM","","dhāma","noun-adj",""
"8","/","","","","punct",""
"9","dhyātva","DHYĀTV","a@","dhyātva","noun-adj",""
"10","ārya","ĀRY","a@","ārya","noun-adj",""
"11","tārāṃ","TĀR","āṃ","tāra","noun-adj",""
"12","hṛdaye","HṚDAY","e","hṛdaya","noun-adj",""
"13","tasyāś","","","tad","pron",""
"14","cakraṃ","CAKR","aṃ","cakra","noun-adj",""
"15","sita","SIT","a@","sita","noun-adj",""
"16","dyuti","DYUT","i","dyuti","noun-adj",""
"17","//","","","","punct",""
"18","7","","","","ind",""
"19","//","","","","punct",""
"","</s>","","","","",""
"","</page>","","","","",""
"","<page number=""7"">","","","","",""
"","<s number=""7"">","","","","",""
"1","aṣṭa","AṢṬ","a@","aṣṭa","noun-adj",""
"2","koṣṭhakam","KOṢṬH","akam","koṣṭhaka","noun-adj",""
"3","aṣṭābhir","AṢṬ","ābhir","aṣṭā","noun-adj",""
"4","akṣaraiḥ","AKṢAR","aiḥ","akṣara","noun-adj",""
"5","paripūritam","PARIPŪR","itam","paripūra","noun-adj",""
"6","/oṃh","","","","punct",""
"7","āvyañ","AVY","añ@","avya","noun-adj",""
"8","jana","JAN","a@","jana","noun-adj",""
"9","madhya","MADH","ya@","madhu","noun-adj",""
"10","stha","STH","a@","stha","noun-adj",""
"11","sādhyanā","SĀDHY","anā","sādhyā","noun-adj",""
"12","mādya","MĀDY","a@","mādya","noun-adj",""
"13","nābhikam","NĀBHIK","am","nābhika","noun-adj",""
"14","//","","","","punct",""
"15","8","","","","ind",""
"16","//","","","","punct",""
"","</s>","","","","",""
"","</page>","","","","",""
"","<page number=""8"">","","","","",""
"","<s number=""8"">","","","","",""
"1","dhyāyād","DHYĀY","ād","dhyāya","noun-adj",""
"2","ekāgra","EKĀGR","a@","ekāgra","noun-adj",""
"3","cittaḥ","CITT","aḥ","citta","noun-adj",""
"4","san","SAN","","sat","noun-adj",""
"5","ṣaṇm","","","","ind",""
"6","āsān","ĀSĀN","","āsāna","noun-adj",""
"7","dṛḍha","DṚḌH","a@","dṛḍha","noun-adj",""
"8","niścayaḥ","NIŚCAY","aḥ","niścaya","noun-adj",""
"9","/","","","","punct",""
"10","japed","JAP","ed","jap","verb",""
"11","a","","","alpha_privativum","ind",""
"12","khinna","KHINN","a@","khinna","noun-adj",""
"13","cittaḥ","CITT","aḥ","citta","noun-adj",""
"14","san","SAN","","sat","noun-adj",""
"15","mantram","MANTR","am","mantra","noun-adj",""
"16","enaṃ","","","ena","ind",""
"17","daśa","DAŚ","a@","daśa","noun-adj",""
"18","ākṣaram","ĀKṢAR","am","ākṣarati","noun-adj",""
"19","//","","","","punct",""
"20","9","","","","ind",""
"21","//","","","","punct",""
"","</s>","","","","",""
"","</page>","","","","",""
"","<page number=""9"">","","","","",""
"","<s number=""9"">","","","","",""
"1","oṅkāram","OṄKĀR","am","oṅkāra","noun-adj",""
"2","ādito","ĀDIT","o","ādita","noun-adj",""
"3","dattvā","DATT","vā","datta","noun-adj",""
"4","paścāt","PAŚCĀT","","paścāta","noun-adj",""
"5","tāre","TĀR","e","tāra","noun-adj",""
"6","prayojayet","PRAYOJAY","et","prayojayat","noun-adj",""
"7","/","","","","punct",""
"8","t","","","tu","ind",""
"9","uttāre","UTTĀR","e","uttāra","noun-adj",""
"10","syāt","","","as","verb","as"
"11","ture","TUR","e","tura","noun-adj",""
"12","paścāt","PAŚCĀT","","paścāta","noun-adj",""
"13","svāha","SVĀH","a@","svāha","noun-adj",""
"14","āntaḥ","ANT","aḥ","anta","noun-adj",""
"15","sārva","SĀRV","a@","sārva","noun-adj",""
"16","karmikaḥ","KARMIK","aḥ","karmika","noun-adj",""
"17","//","","","","punct",""
"18","10","","","","ind",""
"19","//","","","","punct",""
"","</s>","","","","",""
"","</page>","","","","",""
"","<page number=""10"">","","","","",""
"","<s number=""10"">","","","","",""
"1","brahma","BRAHM","a@","brahma","noun-adj",""
"2","endra","INDR","a@","indra","noun-adj",""
"3","viṣṇu","VIṢṆ","u@","viṣṇu","noun-adj",""
"4","candra","CANDR","a@","candra","noun-adj",""
"5","ārka","ARK","a@","arka","noun-adj",""
"6","rudra","RUDR","a@","rudra","noun-adj",""
"7","dik","DI","k@","dik","noun-adj",""
"8","pāla","PĀL","a@","pāla","noun-adj",""
"9","manmathaiḥ","MANMATH","aiḥ","manmatha","noun-adj",""
"10","/","","","","punct",""
"11","apy","","","api","ind",""
"12","a","","","alpha_privativum","ind",""
"13","khaṇḍita","KHAṆḌIT","a@","khaṇḍita","noun-adj",""
"14","roma","ROM","a@","roma","noun-adj",""
"15","āgro","AGR","o","agra","noun-adj",""
"16","mṛtyuṃ","MṚTY","uṃ","mṛtyu","noun-adj",""
"17","jayati","JA","yati","jā","noun-adj",""
"18","muktavat","MUKT","avat","muktavat","noun-adj",""
"19","//","","","","punct",""
"20","11","","","","ind",""
"21","//","","","","punct",""
"","</s>","","","","",""
"","</page>","","","","",""
"","<page number=""11"">","","","","",""
"","<s number=""11"">","","","","",""
"1","valī","VAL","ī@","valī","noun-adj",""
"2","palita","PALIT","a@","palita","noun-adj",""
"3","daurbhāgya","DAURBHĀGY","a@","daurbhāgya","noun-adj",""
"4","vyādhi","VYĀDH","i@","vyādhi","noun-adj",""
"5","dāridrya","DĀRIDRY","a@","dāridrya","noun-adj",""
"6","saṃkṣayaḥ","SAṂKṢAY","aḥ","saṃkṣaya","noun-adj",""
"7","/","","","","punct",""
"8","siṃhād","SIṂH","ād","siṃha","noun-adj",""
"9","yaṣṭa","YAṢṬ","a@","yaṣṭa","noun-adj",""
"10","maha","MAH","a@","mahat","noun-adj",""
"11","ābhīti","ABHĪT","i@","abhīti","noun-adj",""
"12","duḥkha","DUḤKH","a@","duḥkha","noun-adj",""
"13","saṃdoha","SAṂDOH","a@","saṃdoha","noun-adj",""
"14","nāśanam","NĀŚAN","am","nāśana","noun-adj",""
"15","//","","","","punct",""
"16","12","","","","ind",""
"17","//","","","","punct",""
"","</s>","","","","",""
"","</page>","","","","",""
"","<page number=""12"">","","","","",""
"","<s number=""12"">","","","","",""
"1","a","","","alpha_privativum","ind",""
"2","yācita","YĀCIT","a@","yācita","noun-adj",""
"3","āmbara","AMBAR","a@","ambara","noun-adj",""
"4","pāna","PĀN","a@","pāna","noun-adj",""
"5","harmya","HARMY","a@","harmya","noun-adj",""
"6","ratna","RATN","a@","ratna","noun-adj",""
"7","ādi","ĀD","i@","ādi","noun-adj",""
"8","saṃgamaḥ","SAṂGAM","aḥ","saṃgama","noun-adj",""
"9","/","","","","punct",""
"10","khaḍga","KHAḌG","a@","khaḍga","noun-adj",""
"11","āñjan","AÑJ","an","añjat","noun-adj",""
"12","apāda","APĀD","a@","apāda","noun-adj",""
"13","lepa","LEP","a@","lepa","noun-adj",""
"14","bhadra","BHADR","a@","bhadra","noun-adj",""
"15","kumbha","KUMBH","a@","kumbha","noun-adj",""
"16","ādi","ĀD","i@","ādi","noun-adj",""
"17","siddhayaḥ","SIDDH","ayaḥ","siddhi","noun-adj",""
"18","//","","","","punct",""
"19","13","","","","ind",""
"20","//","","","","punct",""
"","</s>","","","","",""
"","</page>","","","","",""
"","<page number=""13"">","","","","",""
"","<s number=""13"">","","","","",""
"1","kavitā","KAVIT","ā","kavitā","noun-adj",""
"2","vaktṛtā","VAKT","ṛtā","vaktṛ","noun-adj",""
"3","medhā","MEDH","ā","medhā","noun-adj",""
"4","prajñā","PRAJÑ","ā","prajñā","noun-adj",""
"5","c","","","ca","ind",""
"6","aikānta","EKĀNT","a@","ekānta","noun-adj",""
"7","nirmalā","NIRMAL","ā","nirmala","noun-adj",""
"8","/","","","","punct",""
"9","anyā","ANY","ā","anyā","noun-adj",""
"10","ca","","","ca","ind",""
"11","vāñchitā","VĀÑCHIT","ā","vāñchita","noun-adj",""
"12","siddhiś","SIDDH","iś","siddhi","noun-adj",""
"13","cakrād","CAKR","ād","cakra","noun-adj",""
"14","asmāt","ASMĀT","","idam","pron",""
"15","prajāyate","PRAJĀ","yate","prajan","verb","prajan"
"16","//","","","","punct",""
"17","14","","","","ind",""
"18","//","","","","punct",""
"","</s>","","","","",""
"","</page>","","","","",""
"","<page number=""14"">","","","","",""
"","<s number=""14"">","","","","",""
"1","sādhanaṃ","SĀDHAN","aṃ","sādhana","noun-adj",""
"2","sitatārāyā","SITATĀR","āyā","sitatārā","noun-adj",""
"3","mṛtyu","MṚTY","u@","mṛtyu","noun-adj",""
"4","vyādhi","VYĀDH","i@","vyādhi","noun-adj",""
"5","vināśanam","VINĀŚAN","am","vināśana","noun-adj",""
"6","/","","","","punct",""
"7","uddhṛtya","UDDHṚTY","a","uddhṛtya","noun-adj",""
"8","yac","","","yad","pron",""
"9","chubhaṃ","ŚUBH","aṃ","śubha","noun-adj",""
"10","tena","","","tad","pron",""
"11","jagat","JAGAT","@","jagat","noun-adj",""
"12","tārā","TĀR","ā","tāra","noun-adj",""
"13","svayaṃ","SVAY","aṃ","svaya","noun-adj",""
"14","bhavet","BHAV","et","bhav","verb","bhū"
"15","//","","","","punct",""
"16","15","","","","ind",""
"17","//","","","","punct",""
"","</s>","","","","",""
"","</page>","","","","",""
"","</doc>","","","","",""
