"WordID","word","NormSTEM","suffix","lemma","PoS","Root"
"","<doc textid = ""trisvabhavanirdeza"" genre = ""śāstra"" title = ""trisvabhāvanirdeśa"" author = ""vasubandhu"" discourse = ""philosophy"" tradition = ""yogācāra"" period = ""classical"" source = ""gretil accessed feb 2017 : http://gretil.sub.uni-goettingen.de/gretil/corpustei/sa_.xml"" date_range = ""4.-5. ce"" notes = """" religion = ""buddh"" edition = ""based on the ed. by s. anacker 1986"" digitization = ""members of the sanskrit buddhist input project"" segmentation_lemmatization = ""ligeia lugli & buddhist translators workbench team"" metadata_enrichment = ""bruno galasek-hul & buddhist translators workbench team"" proofreader = ""n/a"" permission = ""permission for derivatives from m. mehner on behalf of gretil"" reconstructions = ""none"">","","","","",""
"","<page number=""1"">","","","","",""
"","<s number=""1"">","","","","",""
"1","//","","","","punct",""
"2","namo","NAM","o","namas","noun-adj",""
"3","mañjuśriye","MAÑJUŚR","iye","mañjuśrī","noun-adj",""
"4","kumāra","KUMĀR","a@","kumāra","noun-adj",""
"5","bhūtāya","BHŪT","āya","bhūta","noun-adj",""
"6","//","","","","punct",""
"7","ācārya","ĀCĀRY","a@","ācārya","noun-adj",""
"8","vasubandhu","VASUBANDH","u@","vasubandhu","noun-adj",""
"9","praṇītaḥ","PRAṆĪT","aḥ","praṇīta","noun-adj",""
"10","tri","TR","i@","tri","noun-adj",""
"11","svabhāva","SVABHĀV","a@","svabhāva","noun-adj",""
"12","nirdeśaḥ","NIRDEŚ","aḥ","nirdeśa","noun-adj",""
"13","kalpitaḥ","KALPIT","aḥ","kalpita","noun-adj",""
"14","paratantraś","PARATANTR","aś","paratantra","noun-adj",""
"15","ca","","","ca","ind",""
"16","pariniṣpanna","PARINIṢPANN","a","pariniṣpanna","noun-adj",""
"17","eva","","","eva","ind",""
"18","ca","","","ca","ind",""
"19","/","","","","punct",""
"20","trayaḥ","TRAY","aḥ","tri","noun-adj",""
"21","svabhāvā","SVABHĀV","ā","svabhāva","noun-adj",""
"22","dhīrāṇāṃ","DHĪR","āṇāṃ","dhīra","noun-adj",""
"23","gambhīra","GAMBHĪR","a@","gambhīra","noun-adj",""
"24","jñeyam","JÑEY","am","jñeya","noun-adj",""
"25","iṣyate","IṢ","yate","icch","verb","iṣ1"
"25","iṣyate","IṢ","yate","eṣ","verb","iṣ2"
"26","//","","","","punct",""
"27","1","","","","ind",""
"28","//","","","","punct",""
"29","yat","","","yad","pron",""
"30","khyāti","KHYĀ","ti","khyā","verb","khyā"
"31","paratantro","PARATANTR","o","paratantra","noun-adj",""
"32","asau","","","adas","pron",""
"33","yathā","","","yathā","ind",""
"34","khyāti","KHYĀ","ti","khyā","verb","khyā"
"35","sa","","","sa_saha","ind",""
"36","kalpitaḥ","KALPIT","aḥ","kalpita","noun-adj",""
"37","/","","","","punct",""
"38","pratyaya","PRATYAY","a@","pratyaya","noun-adj",""
"39","ādhīna","ADHĪN","a@","adhīna","noun-adj",""
"40","vṛttitvāt","VṚTT","itvāt","vṛtta","noun-adj",""
"41","kalpanā","KALPAN","ā@","kalpanā","noun-adj",""
"42","mātra","MĀTR","a@","mātra","noun-adj",""
"43","bhāvataḥ","BHĀV","ataḥ","bhāva","noun-adj",""
"44","//","","","","punct",""
"45","2","","","","ind",""
"46","//","","","","punct",""
"","</s>","","","","",""
"","</page>","","","","",""
"","<page number=""2"">","","","","",""
"","<s number=""2"">","","","","",""
"1","tasya","","","tad","pron",""
"2","khyātur","KHYĀT","ur","khyāta","noun-adj",""
"3","yathā","","","yathā","ind",""
"4","khyānaṃ","KHYĀN","aṃ","khyāna","noun-adj",""
"5","yā","","","yad","pron",""
"6","sadadā","","","","ind",""
"7","vidyamānatā","VID","yamānatā","vid","verb","vid"
"8","/","","","","punct",""
"9","jñeyaḥ","JÑEY","aḥ","jñeya","noun-adj",""
"10","sa","","","sa_saha","ind",""
"11","pariniṣpanna","PARINIṢPANN","a@","pariniṣpanna","noun-adj",""
"12","svabhāvo","SVABHĀV","o","svabhāva","noun-adj",""
"13","an","","","alpha_privativum","ind",""
"14","anyathātvataḥ","ANYATHĀTV","ataḥ","anyathātva","noun-adj",""
"15","//","","","","punct",""
"16","3","","","","ind",""
"17","//","","","","punct",""
"","</s>","","","","",""
"","</page>","","","","",""
"","<page number=""3"">","","","","",""
"","<s number=""3"">","","","","",""
"1","tatra","","","tatra","ind",""
"2","kiṃ","","","kim","pron",""
"3","khyātya","KHYĀT","ya@","khyāta","noun-adj",""
"4","sat","SAT","@","sat","noun-adj",""
"5","kalpaḥ","KALP","aḥ","kalpa","noun-adj",""
"6","kathaṃ","","","katham","ind",""
"7","khyāti","KHYĀT","i","khyā","noun-adj","khyā"
"8","dvaya","DVAY","a@","dvaya","noun-adj",""
"9","ātmanā","ĀTM","anā","ātman","noun-adj",""
"10","/","","","","punct",""
"11","tasya","","","tad","pron",""
"12","kā","","","kim","pron",""
"13","n","","","na","ind",""
"14","^","","","","",""
"15","āsti","","","as","verb","as"
"16","tā","","","tad","pron",""
"17","tena","","","tad","pron",""
"18","yā","","","yad","pron",""
"19","tatr","","","tatra","ind",""
"20","^","","","","",""
"21","ā","","","alpha_privativum","ind",""
"22","dvaya","DVAY","a@","dvaya","noun-adj",""
"23","dharmatā","DHARMAT","ā","dharmatā","noun-adj",""
"24","//","","","","punct",""
"25","4","","","","ind",""
"26","//","","","","punct",""
"","</s>","","","","",""
"","</page>","","","","",""
"","<page number=""4"">","","","","",""
"","<s number=""4"">","","","","",""
"1","a","","","alpha_privativum","ind",""
"2","sat","SAT","@","sat","noun-adj",""
"3","kalpo","KALP","o","kalpa","noun-adj",""
"4","atra","","","atra","ind",""
"5","kaścit","","","kimcit","ind",""
"6","taṃ","","","tad","pron",""
"7","yatas","","","yatas","ind",""
"8","tena","","","tad","pron",""
"9","hi","","","hi","ind",""
"10","kalpyate","KALP","yate","kalp","verb","kḷp"
"11","/","","","","punct",""
"12","yathā","","","yathā","ind",""
"13","ca","","","ca","ind",""
"14","kalpayaty","KALP","ayaty","kalp","verb","kḷp"
"15","artha","ARTH","a","artha","noun-adj",""
"16","tath","","","tathā","ind",""
"17","^","","","","",""
"18","ātyantaṃ","ATYANT","aṃ","atyanta","noun-adj",""
"19","na","","","na","ind",""
"20","vidyate","VID","yate","vid","verb","vid"
"21","//","","","","punct",""
"22","5","","","","ind",""
"23","//","","","","punct",""
"","</s>","","","","",""
"","</page>","","","","",""
"","<page number=""5"">","","","","",""
"","<s number=""5"">","","","","",""
"1","tadd","TAD","d@","tadā","ind",""
"2","hetu","HET","u@","hetu","noun-adj",""
"3","phala","PHAL","a@","phala","noun-adj",""
"4","bhāvena","BHĀV","ena","bhāva","noun-adj",""
"5","cittaṃ","CITT","aṃ","citta","noun-adj",""
"6","dvividham","DVIVIDH","am","dvividha","noun-adj",""
"7","iṣyate","IṢ","yate","icch","verb","iṣ1"
"7","iṣyate","IṢ","yate","eṣ","verb","iṣ2"
"8","/","","","","punct",""
"9","yad","","","yadi","ind",""
"10","ālaya","ĀLAY","a@","ālaya","noun-adj",""
"11","ākhyaṃ","ĀKHY","aṃ","ākhya","noun-adj",""
"12","vijñānaṃ","VIJÑĀN","aṃ","vijñāna","noun-adj",""
"13","pravṛtty","PRAVṚTT","y@","pravṛtti","noun-adj",""
"14","ākhyaṃ","ĀKHY","aṃ","ākhya","noun-adj",""
"15","ca","","","ca","ind",""
"16","saptadhā","SAPTADH","ā","saptadhā","noun-adj",""
"17","//","","","","punct",""
"18","6","","","","ind",""
"19","//","","","","punct",""
"","</s>","","","","",""
"","</page>","","","","",""
"","<page number=""6"">","","","","",""
"","<s number=""6"">","","","","",""
"1","saṃkleśa","SAṂKLEŚ","a@","saṃkleśa","noun-adj",""
"2","vāsanā","VĀSAN","ā@","vāsanā","noun-adj",""
"3","bījaiś","BĪJ","aiś","bīja","noun-adj",""
"4","ci","","","cid","ind",""
"5","tatvāc","TATV","āc","tatva","noun-adj",""
"6","cittam","CITT","am","citta","noun-adj",""
"7","ucyate","UC","yate","vak","verb","vac"
"8","/","","","","punct",""
"9","citta","CITT","a@","citta","noun-adj",""
"10","mādyaṃ","MĀDY","aṃ","mādya","noun-adj",""
"11","dvitīyaṃ","DVITĪY","aṃ","dvitīya","noun-adj",""
"12","tu","","","tu","ind",""
"13","citra","CITR","a@","citra","noun-adj",""
"14","ākāra","ĀKĀR","a@","ākāra","noun-adj",""
"15","pravṛttitaḥ","PRAVṚTT","itaḥ","pravṛtta","noun-adj",""
"16","//","","","","punct",""
"17","7","","","","ind",""
"18","//","","","","punct",""
"","</s>","","","","",""
"","</page>","","","","",""
"","<page number=""7"">","","","","",""
"","<s number=""7"">","","","","",""
"1","samāsato","SAMĀS","ato","samāsa","noun-adj",""
"2","a","","","alpha_privativum","ind",""
"3","bhūta","BHŪT","a@","bhūta","noun-adj",""
"4","kalpaḥ","KALP","aḥ","kalpa","noun-adj",""
"5","sa","","","sa_saha","ind",""
"6","c","","","ca","ind",""
"7","^","","","","",""
"8","eṣa","","","tad","pron",""
"9","trividho","TRIVIDH","o","trividha","noun-adj",""
"10","mataḥ","MAT","aḥ","mata","noun-adj",""
"11","/","","","","punct",""
"12","vaipākikas","VAIPĀKIK","as","vaipākika","noun-adj",""
"13","tathā","","","tathā","ind",""
"14","naimittiko","NAIMITTIK","o","naimittika","noun-adj",""
"15","anyaḥ","ANY","aḥ","anya","noun-adj",""
"16","prātibhāsikaḥ","PRĀTIBHĀSIK","aḥ","prātibhāsika","noun-adj",""
"17","//","","","","punct",""
"18","8","","","","ind",""
"19","//","","","","punct",""
"","</s>","","","","",""
"","</page>","","","","",""
"","<page number=""8"">","","","","",""
"","<s number=""8"">","","","","",""
"1","prathamo","PRATHAM","o","prathama","noun-adj",""
"2","mūla","MŪL","a@","mūla","noun-adj",""
"3","vijñānaṃ","VIJÑĀN","aṃ","vijñāna","noun-adj",""
"4","tad","TAD","","tadā","ind",""
"5","vipāka","VIPĀK","a@","vipāka","noun-adj",""
"6","ātmakaṃ","ĀTM","akaṃ","ātman","noun-adj",""
"7","yataḥ","","","yatas","ind",""
"8","/","","","","punct",""
"9","anyaḥ","ANY","aḥ","anya","noun-adj",""
"10","pravṛttivijñānaṃ","PRAVṚTTIVIJÑĀN","aṃ","pravṛttivijñāna","noun-adj",""
"11","dṛśya","DṚŚY","a@","dṛśya","noun-adj",""
"12","dṛg","DṚG","","dṛga","noun-adj",""
"13","vitti","VITT","i@","vitti","noun-adj",""
"14","vṛttitaḥ","VṚTT","itaḥ","vṛtta","noun-adj",""
"15","//","","","","punct",""
"16","9","","","","ind",""
"17","//","","","","punct",""
"","</s>","","","","",""
"","</page>","","","","",""
"","<page number=""9"">","","","","",""
"","<s number=""9"">","","","","",""
"1","sad","SAD","@","sat","noun-adj",""
"2","a","","","alpha_privativum","ind",""
"3","sattvād","SATTV","ād","sattva","noun-adj",""
"4","dvaya","DVAY","a@","dvaya","noun-adj",""
"5","aikatvāt","EK","atvāt","eka","noun-adj",""
"6","saṃkleśa","SAṂKLEŚ","a@","saṃkleśa","noun-adj",""
"7","vyavadānayoḥ","VYAVADĀN","ayoḥ","vyavadāna","noun-adj",""
"8","/","","","","punct",""
"9","lakṣaṇā","LAKṢAṆ","ā@","lakṣaṇa","noun-adj",""
"10","bhedataś","BHED","ataś","bheda","noun-adj",""
"11","ceṣṭā","CEṢṬ","ā","ceṣṭa","noun-adj",""
"12","svabhāvānāṃ","SVABHĀV","ānāṃ","svabhāva","noun-adj",""
"13","gaṃbhīratā","GAMBHĪR","atā","gambhīratā","noun-adj",""
"14","//","","","","punct",""
"15","10","","","","ind",""
"16","//","","","","punct",""
"","</s>","","","","",""
"","</page>","","","","",""
"","<page number=""10"">","","","","",""
"","<s number=""10"">","","","","",""
"1","sattvena","SATTV","ena","sattva","noun-adj",""
"2","gṛhyate","GṚH","yate","gṛhṇ","verb","grah"
"3","yasmād","YASMĀD","","yad","pron",""
"4","atyanta","ATYANT","a@","atyanta","noun-adj",""
"5","ā","","","alpha_privativum","ind",""
"6","bhāva","BHĀV","a","bhāva","noun-adj",""
"7","eva","","","eva","ind",""
"8","ca","","","ca","ind",""
"9","/","","","","punct",""
"10","svabhāvaḥ","SVABHĀV","aḥ","svabhāva","noun-adj",""
"11","kalpitas","KALPIT","as","kalpita","noun-adj",""
"12","tena","","","tad","pron",""
"13","sad","SAD","@","sat","noun-adj",""
"14","a","","","alpha_privativum","ind",""
"15","sal","SAL","@","sala","noun-adj",""
"16","lakṣaṇo","LAKṢAṆ","o","lakṣaṇa","noun-adj",""
"17","mataḥ","MAT","aḥ","mata","noun-adj",""
"18","//","","","","punct",""
"19","11","","","","ind",""
"20","//","","","","punct",""
"","</s>","","","","",""
"","</page>","","","","",""
"","<page number=""11"">","","","","",""
"","<s number=""11"">","","","","",""
"1","vidyate","VID","yate","vid","verb","vid"
"2","bhrānti","BHRĀNT","i@","bhrānti","noun-adj",""
"3","bhāvena","BHĀV","ena","bhāva","noun-adj",""
"4","yath","","","yathā","ind",""
"5","^","","","","",""
"6","ākhyānaṃ","ĀKHYĀN","aṃ","ākhyāna","noun-adj",""
"7","na","","","na","ind",""
"8","vidyate","VID","yate","vid","verb","vid"
"9","/","","","","punct",""
"10","paratantro","PARATANTR","o","paratantra","noun-adj",""
"11","yatas","","","yatas","ind",""
"12","tena","","","tad","pron",""
"13","sad","SAD","@","sat","noun-adj",""
"14","a","","","alpha_privativum","ind",""
"15","sal","SAL","@","sala","noun-adj",""
"16","lakṣaṇo","LAKṢAṆ","o","lakṣaṇa","noun-adj",""
"17","mataḥ","MAT","aḥ","mata","noun-adj",""
"18","//","","","","punct",""
"19","12","","","","ind",""
"20","//","","","","punct",""
"","</s>","","","","",""
"","</page>","","","","",""
"","<page number=""12"">","","","","",""
"","<s number=""12"">","","","","",""
"1","a","","","alpha_privativum","ind",""
"2","dvayatvena","DVAY","atvena","dvayatva","noun-adj",""
"3","yac","","","yad","pron",""
"4","c","","","ca","ind",""
"5","^","","","","",""
"6","āsti","","","as","verb","as"
"7","dvayasya","DVAY","asya","dvaya","noun-adj",""
"8","^","","","","",""
"9","a","","","alpha_privativum","ind",""
"10","bhāva","BHĀV","a","bhāva","noun-adj",""
"11","eva","","","eva","ind",""
"12","ca","","","ca","ind",""
"13","/","","","","punct",""
"14","svabhāvas","SVABHĀV","as","svabhāva","noun-adj",""
"15","tena","","","tad","pron",""
"16","niṣpannaḥ","NIṢPANN","aḥ","niṣpanna","noun-adj",""
"17","sad","SAD","@","sat","noun-adj",""
"18","a","","","alpha_privativum","ind",""
"19","sal","SAL","@","sala","noun-adj",""
"20","lakṣaṇo","LAKṢAṆ","o","lakṣaṇa","noun-adj",""
"21","mataḥ","MAT","aḥ","mata","noun-adj",""
"22","//","","","","punct",""
"23","13","","","","ind",""
"24","//","","","","punct",""
"","</s>","","","","",""
"","</page>","","","","",""
"","<page number=""13"">","","","","",""
"","<s number=""13"">","","","","",""
"1","dvaividhyāt","DVAIVIDHY","āt","dvaividhya","noun-adj",""
"2","kalpita","KALPIT","a@","kalpita","noun-adj",""
"3","ārthasya","ARTH","asya","artha","noun-adj",""
"4","tad","TAD","","tadā","ind",""
"5","a","","","alpha_privativum","ind",""
"6","sattva","SATTV","a@","sattva","noun-adj",""
"7","aika","EK","a@","eka","noun-adj",""
"8","bhavataḥ","BHAV","ataḥ","bhava","noun-adj",""
"9","/","","","","punct",""
"10","svabhāvaḥ","SVABHĀV","aḥ","svabhāva","noun-adj",""
"11","kalpito","KALPIT","o","kalpita","noun-adj",""
"12","bālair","BĀL","air","bāla","noun-adj",""
"13","dvaya","DVAY","a@","dvaya","noun-adj",""
"14","aikatv-a","EK","atv-a@","eka","noun-adj",""
"15","ātmako","ĀTM","ako","ātman","noun-adj",""
"16","mataḥ","MAT","aḥ","mata","noun-adj",""
"17","//","","","","punct",""
"18","14","","","","ind",""
"19","//","","","","punct",""
"","</s>","","","","",""
"","</page>","","","","",""
"","<page number=""14"">","","","","",""
"","<s number=""14"">","","","","",""
"1","prakhyānād","PRAKHYĀN","ād","prakhyāna","noun-adj",""
"2","dvaya","DVAY","a@","dvaya","noun-adj",""
"3","bhāvena","BHĀV","ena","bhāva","noun-adj",""
"4","bhrānti","BHRĀNT","i@","bhrānti","noun-adj",""
"5","mātra","MĀTR","a@","mātra","noun-adj",""
"6","aika","EK","a@","eka","noun-adj",""
"7","bhavataḥ","BHAV","ataḥ","bhava","noun-adj",""
"8","/","","","","punct",""
"9","svabhāvaḥ","SVABHĀV","aḥ","svabhāva","noun-adj",""
"10","paratantra","PARATANTR","a@","paratantra","noun-adj",""
"11","ākhyo","ĀKHY","o","ākhya","noun-adj",""
"12","dvaya","DVAY","a@","dvaya","noun-adj",""
"13","aikatv-a","EK","atv-a@","eka","noun-adj",""
"14","ātmako","ĀTM","ako","ātman","noun-adj",""
"15","mataḥ","MAT","aḥ","mata","noun-adj",""
"16","//","","","","punct",""
"17","15","","","","ind",""
"18","//","","","","punct",""
"","</s>","","","","",""
"","</page>","","","","",""
"","<page number=""15"">","","","","",""
"","<s number=""15"">","","","","",""
"1","dvaya","DVAY","a@","dvaya","noun-adj",""
"2","ā","","","alpha_privativum","ind",""
"3","bhāva","BHĀV","a@","bhāva","noun-adj",""
"4","svabhāvatvād","SVABHĀV","atvād","svabhāva","noun-adj",""
"5","a","","","alpha_privativum","ind",""
"6","dvaya","DVAY","a@","dvaya","noun-adj",""
"7","aika","EK","a@","eka","noun-adj",""
"8","svabhāvataḥ","SVABHĀV","ataḥ","svabhāva","noun-adj",""
"9","/","","","","punct",""
"10","svabhāvaḥ","SVABHĀV","aḥ","svabhāva","noun-adj",""
"11","pariniṣpanno","PARINIṢPANN","o","pariniṣpanna","noun-adj",""
"12","dvaya","DVAY","a@","dvaya","noun-adj",""
"13","aikatv-a","EK","atv-a@","eka","noun-adj",""
"14","ātmako","ĀTM","ako","ātman","noun-adj",""
"15","mataḥ","MAT","aḥ","mata","noun-adj",""
"16","//","","","","punct",""
"17","16","","","","ind",""
"18","//","","","","punct",""
"","</s>","","","","",""
"","</page>","","","","",""
"","<page number=""16"">","","","","",""
"","<s number=""16"">","","","","",""
"1","kalpitaḥ","KALPIT","aḥ","kalpita","noun-adj",""
"2","paratantraś","PARATANTR","aś","paratantra","noun-adj",""
"3","ca","","","ca","ind",""
"4","jñeyaṃ","JÑEY","aṃ","jñeya","noun-adj",""
"5","saṃkleśa","SAṂKLEŚ","a@","saṃkleśa","noun-adj",""
"6","lakṣaṇam","LAKṢAṆ","am","lakṣaṇa","noun-adj",""
"7","/","","","","punct",""
"8","pariniṣpanna","PARINIṢPANN","a","pariniṣpanna","noun-adj",""
"9","iṣṭas","IṢṬ","as","iṣṭa","noun-adj",""
"10","tu","","","tu","ind",""
"11","vyavadānasya","VYAVADĀN","asya","vyavadāna","noun-adj",""
"12","lakṣaṇam","LAKṢAṆ","am","lakṣaṇa","noun-adj",""
"13","//","","","","punct",""
"14","17","","","","ind",""
"15","//","","","","punct",""
"","</s>","","","","",""
"","</page>","","","","",""
"","<page number=""17"">","","","","",""
"","<s number=""17"">","","","","",""
"1","a","","","alpha_privativum","ind",""
"2","sad","SAD","@","sat","noun-adj",""
"3","dvaya","DVAY","a@","dvaya","noun-adj",""
"4","svabhāvatvāt","SVABHĀV","atvāt","svabhāva","noun-adj",""
"5","tad","TAD","","tadā","ind",""
"6","a","","","alpha_privativum","ind",""
"7","bhāva","BHĀV","a@","bhāva","noun-adj",""
"8","svabhāvataḥ","SVABHĀV","ataḥ","svabhāva","noun-adj",""
"9","/","","","","punct",""
"10","svabhāvāt","SVABHĀV","āt","svabhāva","noun-adj",""
"11","kalpitāj","KALPIT","āj","kalpita","noun-adj",""
"12","jñeyo","JÑEY","o","jñeya","noun-adj",""
"13","niṣpanno","NIṢPANN","o","niṣpanna","noun-adj",""
"14","a","","","alpha_privativum","ind",""
"15","bhinna","BHINN","a@","bhinna","noun-adj",""
"16","lakṣaṇaḥ","LAKṢAṆ","aḥ","lakṣaṇa","noun-adj",""
"17","//","","","","punct",""
"18","18","","","","ind",""
"19","//","","","","punct",""
"","</s>","","","","",""
"","</page>","","","","",""
"","<page number=""18"">","","","","",""
"","<s number=""18"">","","","","",""
"1","a","","","alpha_privativum","ind",""
"2","dvayatva","DVAY","atva","dvayatva","noun-adj",""
"3","svabhāvatvād","SVABHĀV","atvād","svabhāva","noun-adj",""
"4","dvaya","DVAY","a@","dvaya","noun-adj",""
"5","ā","","","alpha_privativum","ind",""
"6","bhāva","BHĀV","a@","bhāva","noun-adj",""
"7","svabhāvataḥ","SVABHĀV","ataḥ","svabhāva","noun-adj",""
"8","/","","","","punct",""
"9","niṣpannāt","NIṢPANN","āt","niṣpanna","noun-adj",""
"10","kalpitaś","KALPIT","aś","kalpita","noun-adj",""
"11","c","","","ca","ind",""
"12","^","","","","",""
"13","aiva","","","eva","ind",""
"14","vijñeyo","VIJÑEY","o","vijñeya","noun-adj",""
"15","a","","","alpha_privativum","ind",""
"16","bhinna","BHINN","a@","bhinna","noun-adj",""
"17","lakṣaṇaḥ","LAKṢAṆ","aḥ","lakṣaṇa","noun-adj",""
"18","//","","","","punct",""
"19","19","","","","ind",""
"20","//","","","","punct",""
"","</s>","","","","",""
"","</page>","","","","",""
"","<page number=""19"">","","","","",""
"","<s number=""19"">","","","","",""
"1","yath","","","yathā","ind",""
"2","^","","","","",""
"3","ākhyānam","ĀKHYĀN","am","ākhyāna","noun-adj",""
"4","a","","","alpha_privativum","ind",""
"5","sadbhāvāt","SADBHĀV","āt","sadbhāva","noun-adj",""
"6","tathā","","","tathā","ind",""
"7","sattva","SATTV","a@","sattva","noun-adj",""
"8","svabhāvataḥ","SVABHĀV","ataḥ","svabhāva","noun-adj",""
"9","/","","","","punct",""
"10","svabhāvāt","SVABHĀV","āt","svabhāva","noun-adj",""
"11","paratantra","PARATANTR","a@","paratantra","noun-adj",""
"12","ākhyāna","ĀKHYĀN","a@","ākhyāna","noun-adj",""
"13","niṣpanno","NIṢPANN","o","niṣpanna","noun-adj",""
"14","a","","","alpha_privativum","ind",""
"15","bhinna","BHINN","a@","bhinna","noun-adj",""
"16","lakṣaṇaḥ","LAKṢAṆ","aḥ","lakṣaṇa","noun-adj",""
"17","//","","","","punct",""
"18","20","","","","ind",""
"19","//","","","","punct",""
"","</s>","","","","",""
"","</page>","","","","",""
"","<page number=""20"">","","","","",""
"","<s number=""20"">","","","","",""
"1","a","","","alpha_privativum","ind",""
"2","sad","SAD","@","sat","noun-adj",""
"3","dvaya","DVAY","a@","dvaya","noun-adj",""
"4","svabhāvatvād","SVABHĀV","atvād","svabhāva","noun-adj",""
"5","yath","","","yathā","ind",""
"6","^","","","","",""
"7","ākhyāna","ĀKHYĀN","a@","ākhyāna","noun-adj",""
"8","ā","","","alpha_privativum","ind",""
"9","svabhāvataḥ","SVABHĀV","ataḥ","svabhāva","noun-adj",""
"10","/","","","","punct",""
"11","niṣpannāt","NIṢPANN","āt","niṣpanna","noun-adj",""
"12","paratantro","PARATANTR","o","paratantra","noun-adj",""
"13","api","","","api","ind",""
"14","vijñeyo","VIJÑEY","o","vijñeya","noun-adj",""
"15","a","","","alpha_privativum","ind",""
"16","bhinna","BHINN","a@","bhinna","noun-adj",""
"17","lakṣaṇaḥ","LAKṢAṆ","aḥ","lakṣaṇa","noun-adj",""
"18","//","","","","punct",""
"19","21","","","","ind",""
"20","//","","","","punct",""
"","</s>","","","","",""
"","</page>","","","","",""
"","<page number=""21"">","","","","",""
"","<s number=""21"">","","","","",""
"1","krama","KRAM","a@","krama","noun-adj",""
"2","bhedaḥ","BHED","aḥ","bheda","noun-adj",""
"3","svabhāvānāṃ","SVABHĀV","ānāṃ","svabhāva","noun-adj",""
"4","vyavahāra","VYAVAHĀR","a@","vyavahāra","noun-adj",""
"5","ādhikārataḥ","ADHIKĀR","ataḥ","adhikāra","noun-adj",""
"6","/","","","","punct",""
"7","tat","TAT","","tad","pron",""
"8","praveśa","PRAVEŚ","a@","praveśa","noun-adj",""
"9","ādhikārāc","ADHIKĀR","āc","adhikāra","noun-adj",""
"10","ca","","","ca","ind",""
"11","vyutpatty","VYUTPATT","y@","vyutpatti","noun-adj",""
"12","arthaṃ","ARTH","aṃ","artha","noun-adj",""
"13","vidhīyate","VIDHĪ","yate","vidhīa","noun-adj",""
"14","//","","","","punct",""
"15","22","","","","ind",""
"16","//","","","","punct",""
"","</s>","","","","",""
"","</page>","","","","",""
"","<page number=""22"">","","","","",""
"","<s number=""22"">","","","","",""
"1","kalpito","KALPIT","o","kalpita","noun-adj",""
"2","vyavahāra","VYAVAHĀR","a@","vyavahāra","noun-adj",""
"3","ātmā","ĀTM","ā","ātman","noun-adj",""
"4","vyavahartr","VYAVAHART","r@","vyavaharta","noun-adj",""
"5","ātmako","ĀTM","ako","ātman","noun-adj",""
"6","aparaḥ","APAR","aḥ","apara","noun-adj",""
"7","/","","","","punct",""
"8","vyavahāra","VYAVAHĀR","a@","vyavahāra","noun-adj",""
"9","samuccheda","SAMUCCHED","a@","samuccheda","noun-adj",""
"10","svabhāvaś","SVABHĀV","aś","svabhāva","noun-adj",""
"11","c","","","ca","ind",""
"12","^","","","","",""
"13","ānya","ANY","a","anya","noun-adj",""
"14","iṣyate","IṢ","yate","icch","verb","iṣ1"
"14","iṣyate","IṢ","yate","eṣ","verb","iṣ2"
"15","//","","","","punct",""
"16","23","","","","ind",""
"17","//","","","","punct",""
"","</s>","","","","",""
"","</page>","","","","",""
"","<page number=""23"">","","","","",""
"","<s number=""23"">","","","","",""
"1","dvaya","DVAY","a@","dvaya","noun-adj",""
"2","ā","","","alpha_privativum","ind",""
"3","bhāva","BHĀV","a@","bhāva","noun-adj",""
"4","ātmakaḥ","ĀTM","akaḥ","ātman","noun-adj",""
"5","pūrvaṃ","PŪRV","aṃ","pūrva","noun-adj",""
"6","paratantraḥ","PARATANTR","aḥ","paratantra","noun-adj",""
"7","praviśyate","PRAVIŚ","yate","praviś","verb","praviś"
"8","/","","","","punct",""
"9","tataḥ","","","tatas","ind",""
"10","praviśyate","PRAVIŚ","yate","praviś","verb","praviś"
"11","tatra","","","tatra","ind",""
"12","kalpa","KALP","a@","kalpa","noun-adj",""
"13","mātram","MĀTR","am","mātra","noun-adj",""
"14","a","","","alpha_privativum","ind",""
"15","sad","SAD","@","sat","noun-adj",""
"16","dvayam","DVAY","am","dvaya","noun-adj",""
"17","//","","","","punct",""
"18","24","","","","ind",""
"19","//","","","","punct",""
"","</s>","","","","",""
"","</page>","","","","",""
"","<page number=""24"">","","","","",""
"","<s number=""24"">","","","","",""
"1","tato","","","tatas","ind",""
"2","dva","","","","ind",""
"3","yābha","YĀBH","a@","yābha","noun-adj",""
"4","āvabhāvo","AVABH","āvo","avabhu","noun-adj",""
"5","niṣpanno","NIṢPANN","o","niṣpanna","noun-adj",""
"6","atra","","","atra","ind",""
"7","praviśyate","PRAVIŚ","yate","praviś","verb","praviś"
"8","/","","","","punct",""
"9","tathā","","","tathā","ind",""
"10","hy","","","hi","ind",""
"11","asāv","","","","ind",""
"12","eva","","","eva","ind",""
"13","tadā","","","tadā","ind",""
"14","asti","","","as","verb","as"
"15","n","","","na","ind",""
"16","^","","","","",""
"17","āsti","","","as","verb","as"
"18","iti","","","iti","ind",""
"19","c","","","ca","ind",""
"20","^","","","","",""
"21","ocyate","UC","yate","vak","verb","vac"
"22","//","","","","punct",""
"23","25","","","","ind",""
"24","//","","","","punct",""
"","</s>","","","","",""
"","</page>","","","","",""
"","<page number=""25"">","","","","",""
"","<s number=""25"">","","","","",""
"1","trayo","TRAY","o","tri","noun-adj",""
"2","apy","","","api","ind",""
"3","ete","","","tad","pron",""
"4","svabhāvā","SVABHĀV","ā","svabhāva","noun-adj",""
"5","hi","","","hi","ind",""
"6","a","","","alpha_privativum","ind",""
"7","dvaya","DVAY","a@","dvaya","noun-adj",""
"8","ālamba","ĀLAMB","a@","ālamba","noun-adj",""
"9","lakṣaṇāḥ","LAKṢAṆ","āḥ","lakṣaṇa","noun-adj",""
"10","/","","","","punct",""
"11","abhā","","","","ind",""
"12","vāda","VĀD","a","vāda","noun-adj",""
"13","tathā","","","tathā","ind",""
"14","bhāvāt","BHĀV","āt","bhāva","noun-adj",""
"15","tad","TAD","","tadā","ind",""
"16","a","","","alpha_privativum","ind",""
"17","bhāva","BHĀV","a@","bhāva","noun-adj",""
"18","svabhāvataḥ","SVABHĀV","ataḥ","svabhāva","noun-adj",""
"19","//","","","","punct",""
"20","26","","","","ind",""
"21","//","","","","punct",""
"","</s>","","","","",""
"","</page>","","","","",""
"","<page number=""26"">","","","","",""
"","<s number=""26"">","","","","",""
"1","māyā","MĀY","ā@","māyā","noun-adj",""
"2","kṛtaṃ","KṚT","aṃ","kṛta","noun-adj",""
"3","mantra","MANTR","a@","mantra","noun-adj",""
"4","vaśāt","VAŚ","āt","vaśa","noun-adj",""
"5","khyāti","KHYĀT","i","khyā","noun-adj","khyā"
"6","hasty","HAST","y@","hasti","noun-adj",""
"7","ātmanā","ĀTM","anā","ātman","noun-adj",""
"8","yathā","","","yathā","ind",""
"9","/","","","","punct",""
"10","ākāra","ĀKĀR","a@","ākāra","noun-adj",""
"11","mātraṃ","MĀTR","aṃ","mātra","noun-adj",""
"12","tatr","","","tatra","ind",""
"13","^","","","","",""
"14","ā","","","alpha_privativum","ind",""
"15","sti","","","","ind",""
"16","hastī","HAST","ī","hasti","noun-adj",""
"17","n","","","na","ind",""
"18","^","","","","",""
"19","āsti","","","as","verb","as"
"20","tu","","","tu","ind",""
"21","sarvathā","SARVATH","ā","sarvathā","noun-adj",""
"22","//","","","","punct",""
"23","27","","","","ind",""
"24","//","","","","punct",""
"","</s>","","","","",""
"","</page>","","","","",""
"","<page number=""27"">","","","","",""
"","<s number=""27"">","","","","",""
"1","svabhāvaḥ","SVABHĀV","aḥ","svabhāva","noun-adj",""
"2","kalpito","KALPIT","o","kalpita","noun-adj",""
"3","hastī","HAST","ī","hasti","noun-adj",""
"4","paratantras","PARATANTR","as","paratantra","noun-adj",""
"5","tad","TAD","","tadā","ind",""
"6","ākṛtiḥ","ĀKṚT","iḥ","ākṛti","noun-adj",""
"7","/","","","","punct",""
"8","yas","","","yad","pron",""
"9","tatra","","","tatra","ind",""
"10","hastya","HASTY","a@","hastya","noun-adj",""
"11","bhāvo","BHĀV","o","bhāva","noun-adj",""
"12","asau","","","adas","pron",""
"13","pariniṣpanna","PARINIṢPANN","a","pariniṣpanna","noun-adj",""
"14","iṣyate","IṢ","yate","icch","verb","iṣ1"
"14","iṣyate","IṢ","yate","eṣ","verb","iṣ2"
"15","//","","","","punct",""
"16","28","","","","ind",""
"17","//","","","","punct",""
"","</s>","","","","",""
"","</page>","","","","",""
"","<page number=""28"">","","","","",""
"","<s number=""28"">","","","","",""
"1","a","","","alpha_privativum","ind",""
"2","sat","SAT","@","sat","noun-adj",""
"3","kalpas","KALP","as","kalpa","noun-adj",""
"4","tathā","","","tathā","ind",""
"5","khyāti","KHYĀT","i","khyā","noun-adj","khyā"
"6","mūla","MŪL","a@","mūla","noun-adj",""
"7","cittād","CITT","ād","citta","noun-adj",""
"8","dvaya","DVAY","a@","dvaya","noun-adj",""
"9","ātmanā","ĀTM","anā","ātman","noun-adj",""
"10","/","","","","punct",""
"11","dvayam","DVAY","am","dvaya","noun-adj",""
"12","atyantato","ATYANTAT","o","atyantatā","noun-adj",""
"13","n","","","na","ind",""
"14","^","","","","",""
"15","āsti","","","as","verb","as"
"16","tatr","","","tatra","ind",""
"17","^","","","","",""
"18","āstya","ASTY","a@","astya","noun-adj",""
"19","ākṛti","ĀKṚT","i@","ākṛti","noun-adj",""
"20","mātrakam","MĀTR","akam","mātraka","noun-adj",""
"21","//","","","","punct",""
"22","29","","","","ind",""
"23","//","","","","punct",""
"","</s>","","","","",""
"","</page>","","","","",""
"","<page number=""29"">","","","","",""
"","<s number=""29"">","","","","",""
"1","mantravan","MANTR","avan","mantravat","noun-adj",""
"2","mūla","MŪL","a@","mūla","noun-adj",""
"3","vijñānaṃ","VIJÑĀN","aṃ","vijñāna","noun-adj",""
"4","kāṣṭhavat","KĀṢṬH","avat","kāṣṭhavat","noun-adj",""
"5","tathatā","TATHAT","ā","tathatā","noun-adj",""
"6","matā","MAT","ā","mata","noun-adj",""
"7","/","","","","punct",""
"8","hastya","HASTY","a@","hastya","noun-adj",""
"9","ākārav","ĀKĀR","av","ākāra","noun-adj",""
"10","a","","","alpha_privativum","ind",""
"11","deṣṭavyo","DEṢṬAVY","o","deṣṭavya","noun-adj",""
"12","vikalpo","VIKALP","o","vikalpa","noun-adj",""
"13","hastivad","HAST","ivad","hastivat","noun-adj",""
"14","dvayam","DVAY","am","dvaya","noun-adj",""
"15","//","","","","punct",""
"16","30","","","","ind",""
"17","//","","","","punct",""
"","</s>","","","","",""
"","</page>","","","","",""
"","<page number=""30"">","","","","",""
"","<s number=""30"">","","","","",""
"1","artha","ARTH","a@","artha","noun-adj",""
"2","tattva","TATTV","a@","tad","pron",""
"3","prativedhe","PRATIVEDH","e","prativedha","noun-adj",""
"4","yugapal","YUGAP","al","yugapa","noun-adj",""
"5","lakṣaṇatr","LAKṢAṆ","atr","lakṣaṇat","noun-adj",""
"6","ayam","AYAM","","idam","pron",""
"7","/","","","","punct",""
"8","parijñā","PARIJÑ","ā","parijñā","noun-adj",""
"9","ca","","","ca","ind",""
"10","prahāṇaṃ","PRAHĀṆ","aṃ","prahāṇa","noun-adj",""
"11","ca","","","ca","ind",""
"12","prāptiś","PRĀPT","iś","prāpti","noun-adj",""
"13","ceṣṭā","CEṢṬ","ā","ceṣṭa","noun-adj",""
"14","yathākramam","YATHĀKRAM","am","yathākrama","noun-adj",""
"15","//","","","","punct",""
"16","31","","","","ind",""
"17","//","","","","punct",""
"","</s>","","","","",""
"","</page>","","","","",""
"","<page number=""31"">","","","","",""
"","<s number=""31"">","","","","",""
"1","parijña","PARIJÑ","a@","parijñā","noun-adj",""
"2","ānupalambho","ANUPALAMBH","o","anupalambha","noun-adj",""
"3","atra","","","atra","ind",""
"4","hānir","HĀN","ir","hāni","noun-adj",""
"5","a","","","alpha_privativum","ind",""
"6","khyānam","KHYĀN","am","khyāna","noun-adj",""
"7","iṣyate","IṢ","yate","icch","verb","iṣ1"
"7","iṣyate","IṢ","yate","eṣ","verb","iṣ2"
"8","/","","","","punct",""
"9","upalambha","UPALAMBH","a@","upalambha","noun-adj",""
"10","nimittā","NIMITT","ā","nimitta","noun-adj",""
"11","tu","","","tu","ind",""
"12","prāptiḥ","PRĀPT","iḥ","prāpti","noun-adj",""
"13","sākṣātkriya","SĀKṢĀTKRIY","a","sākṣātkriyā","noun-adj",""
"14","^","","","","",""
"15","āpi","","","api","ind",""
"16","sā","","","tad","pron",""
"17","//","","","","punct",""
"18","32","","","","ind",""
"19","//","","","","punct",""
"","</s>","","","","",""
"","</page>","","","","",""
"","<page number=""32"">","","","","",""
"","<s number=""32"">","","","","",""
"1","dvayasy","DVAY","asy","dvaya","noun-adj",""
"2","ānupalambhena","ANUPALAMBH","ena","anupalambha","noun-adj",""
"3","dvayākāro","DVAY","ākāro","dvayāka","noun-adj",""
"4","vigacchati","VIGACCH","ati","vigacch","verb","vigam"
"5","/","","","","punct",""
"6","vigamāt","VIGAM","āt","vigama","noun-adj",""
"7","tasya","","","tad","pron",""
"8","niṣpanno","NIṢPANN","o","niṣpanna","noun-adj",""
"9","dvaya","DVAY","a@","dvaya","noun-adj",""
"10","ā","","","alpha_privativum","ind",""
"11","bhāvo","BHĀV","o","bhāva","noun-adj",""
"12","adhigamyate","ADHIGAM","yate","adhigacch","verb","adhigam"
"13","//","","","","punct",""
"14","33","","","","ind",""
"15","//","","","","punct",""
"","</s>","","","","",""
"","</page>","","","","",""
"","<page number=""33"">","","","","",""
"","<s number=""33"">","","","","",""
"1","hastino","HAST","ino","hasti","noun-adj",""
"2","anupalambhaś","ANUPALAMBH","aś","anupalambha","noun-adj",""
"3","ca","","","ca","ind",""
"4","vigamaś","VIGAM","aś","vigama","noun-adj",""
"5","ca","","","ca","ind",""
"6","tad","TAD","","tadā","ind",""
"7","ākṛteḥ","ĀKṚT","eḥ","ākṛti","noun-adj",""
"8","/","","","","punct",""
"9","upalambhaś","UPALAMBH","aś","upalambha","noun-adj",""
"10","ca","","","ca","ind",""
"11","kāṣṭhasya","KĀṢṬH","asya","kāṣṭha","noun-adj",""
"12","māyāyāṃ","MĀYĀY","āṃ","māyāyin","noun-adj",""
"13","yugapad","YUGAP","ad","yugapa","noun-adj",""
"14","yathā","","","yathā","ind",""
"15","//","","","","punct",""
"16","34","","","","ind",""
"17","//","","","","punct",""
"","</s>","","","","",""
"","</page>","","","","",""
"","<page number=""34"">","","","","",""
"","<s number=""34"">","","","","",""
"1","viruddha","VIRUDDH","a@","viruddha","noun-adj",""
"2","dhī","DH","ī","dhī","noun-adj",""
"3","vāraṇatvād","VĀRAṆ","atvād","vāraṇatva","noun-adj",""
"4","buddhyā","BUDDH","yā","buddhi","noun-adj",""
"5","vaiyarthya","VAIYARTHY","a@","vaiyarthya","noun-adj",""
"6","darśanāt","DARŚAN","āt","darśana","noun-adj",""
"7","/","","","","punct",""
"8","jñānatray","JÑĀNAT","ray","jñānatā","noun-adj",""
"9","ānuvṛtteś","ANUVṚTT","eś","anuvṛtti","noun-adj",""
"10","ca","","","ca","ind",""
"11","mokṣa","MOKṢ","a@","mokṣa","noun-adj",""
"12","āpattir","ĀPATT","ir","āpatti","noun-adj",""
"13","a","","","alpha_privativum","ind",""
"14","yatnataḥ","YATN","ataḥ","yatna","noun-adj",""
"15","//","","","","punct",""
"16","35","","","","ind",""
"17","//","","","","punct",""
"","</s>","","","","",""
"","</page>","","","","",""
"","<page number=""35"">","","","","",""
"","<s number=""35"">","","","","",""
"1","citta","CITT","a@","citta","noun-adj",""
"2","mātra","MĀTR","a@","mātra","noun-adj",""
"3","opalambhena","UPALAMBH","ena","upalambha","noun-adj",""
"4","jñeya","JÑEY","a@","jñeya","noun-adj",""
"5","ārtha","ARTH","a@","artha","noun-adj",""
"6","ānupalambhatā","ANUPALAMBH","atā","anupalambha","noun-adj",""
"7","/","","","","punct",""
"8","jñeya","JÑEY","a@","jñeya","noun-adj",""
"9","ārtha","ARTH","a@","artha","noun-adj",""
"10","ānupalambhena","ANUPALAMBH","ena","anupalambha","noun-adj",""
"11","syāc","","","as","verb","as"
"12","citta","CITT","a@","citta","noun-adj",""
"13","ānupalambhatā","ANUPALAMBH","atā","anupalambha","noun-adj",""
"14","//","","","","punct",""
"15","36","","","","ind",""
"16","//","","","","punct",""
"","</s>","","","","",""
"","</page>","","","","",""
"","<page number=""36"">","","","","",""
"","<s number=""36"">","","","","",""
"1","dvayor","DVAY","or","dvayu","noun-adj",""
"2","anupalambhena","ANUPALAMBH","ena","anupalambha","noun-adj",""
"3","dharmadhātu","DHARMADHĀT","u@","dharmadhātu","noun-adj",""
"4","ūpalabhb","UPALABH","b","upalabha","noun-adj",""
"5","hatā","HAT","ā","hatā","noun-adj",""
"6","/","","","","punct",""
"7","dharmadhātu","DHARMADHĀT","u@","dharmadhātu","noun-adj",""
"8","ūpalambhena","UPALAMBH","ena","upalambha","noun-adj",""
"9","syād","","","as","verb","as"
"10","vibhutv","VIBHU","tv","vibhua","noun-adj",""
"11","opalambhatā","UPALAMBH","atā","upalambhatā","noun-adj",""
"12","//","","","","punct",""
"13","37","","","","ind",""
"14","//","","","","punct",""
"","</s>","","","","",""
"","</page>","","","","",""
"","<page number=""37"">","","","","",""
"","<s number=""37"">","","","","",""
"1","upalabdha","UPALABDH","a@","upalabdha","noun-adj",""
"2","vibhut","VIBHUT","","vibhutā","noun-adj",""
"3","vaśca","VAŚ","ca","vaśa","noun-adj",""
"4","sva","SV","a@","sva","noun-adj",""
"5","parārtha","PARĀRTH","a@","parārtha","noun-adj",""
"6","prasiddhitaḥ","PRASIDDH","itaḥ","prasiddha","noun-adj",""
"7","/","","","","punct",""
"8","prāpnoty","PRĀPN","oty","prāpn","verb","prāp"
"9","anuttarāṃ","ANUTTAR","āṃ","anuttara","noun-adj",""
"10","bodhiṃ","BODH","iṃ","bodhi","noun-adj",""
"11","dhīmān","DHĪM","ān","dhīmat","noun-adj",""
"12","kāya","KĀY","a@","kāya","noun-adj",""
"13","traya","TRAY","a@","tri","noun-adj",""
"14","ātmi","ĀTM","i@","ātman","noun-adj",""
"15","kām","KĀM","","kim","pron",""
"16","//","","","","punct",""
"17","38","","","","ind",""
"18","//","","","","punct",""
"","</s>","","","","",""
"","</page>","","","","",""
"","<page number=""38"">","","","","",""
"","<s number=""38"">","","","","",""
"1","iti","","","iti","ind",""
"2","tri","TR","i@","tri","noun-adj",""
"3","svabhāva","SVABHĀV","a@","svabhāva","noun-adj",""
"4","nirdeśaḥ","NIRDEŚ","aḥ","nirdeśa","noun-adj",""
"5","samāptaḥ","SAMĀPT","aḥ","samāpta","noun-adj",""
"6","//","","","","punct",""
"7","kṛtir","KṚT","ir","kṛti","noun-adj",""
"8","ācārya","ĀCĀRY","a@","ācārya","noun-adj",""
"9","vasubandha","VASUBANDH","a@","vasubandhu","noun-adj",""
"10","upādānām","UPĀDĀN","ām","upādāna","noun-adj",""
"11","iti","","","iti","ind",""
"12","//","","","","punct",""
"","</s>","","","","",""
"","</page>","","","","",""
"","</doc>","","","","",""
