"WordID","word","NormSTEM","suffix","lemma","PoS","Root"
"","<doc textid = ""advayasiddhi"" genre = ""tantra"" title = ""advayasiddhi"" author = ""lakṣmīṅkarā"" discourse = ""tantra"" tradition = ""tantra"" period = ""commentarial"" source = ""gretil accessed sept 2020 : http://gretil.sub.uni-goettingen.de/gretil/corpustei/sa_.xml"" date_range = ""9. ce"" notes = ""dating = date of lakṣmīṅkarā; see e. english.2002. vajrayoginī. a study of her visualizations; rituals & forms: a study of the cult of vajrayoginī in india. boston: wisdom publications. p. 12"" religion = ""buddh"" edition = ""based on the ed. by samdhong rinpoche and vrajvallabh dwivedi 1987; page number = verse number"" digitization = ""peter gäng"" segmentation_lemmatization = ""ligeia lugli & buddhist translators workbench team"" metadata_enrichment = ""bruno galasek-hul & buddhist translators workbench team"" proofreader = ""n/a"" permission = ""permission for derivatives from m. mehner on behalf of gretil"" reconstructions = ""none"">","","","","",""
"","<page number=""0"">","","","","",""
"","<s number=""1"">","","","","",""
"1","a","","","alpha_privativum","ind",""
"2","dvaya","DVAY","a@","dvaya","noun-adj",""
"3","siddhi","SIDDH","i","siddhi","noun-adj",""
"4","yoginī","YOG","inī","yogin","noun-adj",""
"5","lakṣmīṅ","LAKṢM","īṅ","lakṣmī","noun-adj",""
"6","karā","KAR","ā","kara","noun-adj",""
"7","viracitā","VIRACIT","ā","viracitā","noun-adj",""
"8","oṃ","","","oṃ","ind",""
"9","namaḥ","NAM","aḥ","nama","noun-adj",""
"10","śrī","ŚRĪ","","śrī","noun-adj",""
"11","vajra","VAJR","a@","vajra","noun-adj",""
"12","sattvāya","SATTV","āya","sattva","noun-adj",""
"","</s>","","","","",""
"","<s number=""2"">","","","","",""
"","</page>","","","","",""
"","<page number=""1"">","","","","",""
"3","prakṛti","PRAKṚT","i@","prakṛti","noun-adj",""
"4","prabhāsvaraṃ","PRABHĀSVAR","aṃ","prabhāsvara","noun-adj",""
"5","nāthaṃ","NĀTH","aṃ","nātha","noun-adj",""
"6","sarvajñaṃ","SARVAJÑ","aṃ","sarvajña","noun-adj",""
"7","tribhava","TRIBHAV","a@","tribhava","noun-adj",""
"8","odbhavam","UDBHAV","am","udbhava","noun-adj",""
"9","/","","","","punct",""
"10","praṇamya","PRAṆAMY","a","praṇamya","noun-adj",""
"11","śirasā","ŚIRAS","ā","śiras","noun-adj",""
"12","vajram","VAJR","am","vajra","noun-adj",""
"13","īpsita","ĪPSIT","a@","īpsita","noun-adj",""
"14","ārtha","ARTH","a@","artha","noun-adj",""
"15","phala","PHAL","a@","phala","noun-adj",""
"16","pradam","PRAD","am","prada","noun-adj",""
"17","//","","","","punct",""
"","</s>","","","","",""
"","<s number=""3"">","","","","",""
"","</page>","","","","",""
"","<page number=""2"">","","","","",""
"3","deśa","DEŚ","a@","deśa","noun-adj",""
"4","kāl","KĀL","","kāla","noun-adj",""
"5","atithivāra","ATITHIV","āra","atithivat","noun-adj",""
"6","nakṣatrair","NAKṢATR","air","nakṣatra","noun-adj",""
"7","maṇḍalair","MAṆḌAL","air","maṇḍala","noun-adj",""
"8","vinā","","","vinā","ind",""
"9","/","","","","punct",""
"10","vakṣye","VAKṢ","ye","vak","verb","vac"
"11","haṃ","","","","ind",""
"12","vajra","VAJR","a@","vajra","noun-adj",""
"13","sattvasya","SATTV","asya","sattva","noun-adj",""
"14","saṃkṣepāt","SAṂKṢEP","āt","saṃkṣepa","noun-adj",""
"15","sādhanaṃ","SĀDHAN","aṃ","sādhana","noun-adj",""
"16","param","PARAM","","parama","noun-adj",""
"17","//","","","","punct",""
"","</s>","","","","",""
"","<s number=""4"">","","","","",""
"","</page>","","","","",""
"","<page number=""3"">","","","","",""
"3","niyama","NIYAM","a@","niyama","noun-adj",""
"4","vrata","VRAT","a@","vrata","noun-adj",""
"5","opavāsair","UPAVĀS","air","upavāsa","noun-adj",""
"6","akṣara","AKṢAR","a@","akṣara","noun-adj",""
"7","occāraṇa","UCCĀRAṆ","a@","uccāraṇa","noun-adj",""
"8","bhāvanaiḥ","BHĀVAN","aiḥ","bhāvanā","noun-adj",""
"9","/","","","","punct",""
"10","a","","","alpha_privativum","ind",""
"11","tattva","TATTV","a@","tad","pron",""
"12","yogo","YOG","o","yoga","noun-adj",""
"13","na","","","na","ind",""
"14","siddhyet","SIDDHY","et","siddhya","noun-adj",""
"15","kalpa","KALP","a@","kalpa","noun-adj",""
"16","koṭi","KOṬ","i@","koṭi","noun-adj",""
"17","śatair","ŚAT","air","śata","noun-adj",""
"18","api","","","api","ind",""
"19","//","","","","punct",""
"","</s>","","","","",""
"","<s number=""5"">","","","","",""
"","</page>","","","","",""
"","<page number=""4"">","","","","",""
"3","viḍa","VIḌ","a@","viḍa","noun-adj",""
"4","vajra","VAJR","a@","vajra","noun-adj",""
"5","odaka","ODAK","a@","odaka","noun-adj",""
"6","bīja","BĪJ","a@","bīja","noun-adj",""
"7","ādyair","ĀDY","air","ādya","noun-adj",""
"8","nāsika","NĀSIK","a@","nāsika","noun-adj",""
"9","ābhyantara","ĀBHYANTAR","a@","ābhyantara","noun-adj",""
"10","odbhavaiḥ","UDBHAV","aiḥ","udbhava","noun-adj",""
"11","/","","","","punct",""
"12","pūjayed","PŪJAY","ed","pūjay","verb","pūj"
"13","satataṃ","SATAT","aṃ","satata","noun-adj",""
"14","mantrī","MANTR","ī","mantrin","noun-adj",""
"15","ātmānaṃ","ĀTM","ānaṃ","ātman","noun-adj",""
"16","tattva","TATTV","a@","tad","pron",""
"17","bhāvanaiḥ","BHĀVAN","aiḥ","bhāvanā","noun-adj",""
"18","//","","","","punct",""
"","</s>","","","","",""
"","<s number=""6"">","","","","",""
"","</page>","","","","",""
"","<page number=""5"">","","","","",""
"3","jananīṃ","JANAN","īṃ","jananī","noun-adj",""
"4","bhaginīś","BHAGIN","īś","bhaginī","noun-adj",""
"5","c","","","ca","ind",""
"6","^","","","","",""
"7","aiva","","","eva","ind",""
"8","duhitṛ","DUHIT","ṛ@","duhitṛ","noun-adj",""
"9","bhāgineyikān","BHĀGINEY","ikān","bhāgineyika","noun-adj",""
"10","/","","","","punct",""
"11","prajñn","PRAJÑ","n","prajñā","noun-adj",""
"12","opāya","UPĀY","a@","upāya","noun-adj",""
"13","vidha","VIDH","a","vidha","noun-adj",""
"14","^","","","","",""
"15","ānena","","","idam","pron",""
"16","pūjayed","PŪJAY","ed","pūjay","verb","pūj"
"17","yoga","YOG","a@","yoga","noun-adj",""
"18","vit","VIT","","vita","noun-adj",""
"19","sadā","","","sadā","ind",""
"20","//","","","","punct",""
"","</s>","","","","",""
"","<s number=""7"">","","","","",""
"","</page>","","","","",""
"","<page number=""6"">","","","","",""
"3","e","","","","ind",""
"4","kāṅga","KĀṄG","a@","kāṅga","noun-adj",""
"5","vikalāṃ","VIKAL","āṃ","vikalā","noun-adj",""
"6","hīnāṃ","HĪN","āṃ","hīnā","noun-adj",""
"7","śilpanīṃ","ŚILP","anīṃ","śilpat","noun-adj",""
"8","śv","","","","ind",""
"9","apacīṃ","APAC","īṃ","apacī","noun-adj",""
"10","tathā","","","tathā","ind",""
"11","/","","","","punct",""
"12","yoṣitāṃ","YOṢIT","āṃ","yoṣitā","noun-adj",""
"13","pūjayen","PŪJAY","en","pūjayati","noun-adj",""
"14","nityaṃ","NITY","aṃ","nitya","noun-adj",""
"15","jñāna","JÑĀN","a@","jñāna","noun-adj",""
"16","vajra","VAJR","a@","vajra","noun-adj",""
"17","prabhāvanaiḥ","PRABHĀVAN","aiḥ","prabhāvana","noun-adj",""
"18","//","","","","punct",""
"","</s>","","","","",""
"","<s number=""8"">","","","","",""
"1","tatr","","","tatra","ind",""
"2","^","","","","",""
"3","emāni","","","idam","pron",""
"4","bīja","BĪJ","a@","bīja","noun-adj",""
"5","padānioṃāḥ","PAD","ānioṃāḥ","pada","noun-adj",""
"6","hūṃ","","","","ind",""
"","</s>","","","","",""
"","<s number=""9"">","","","","",""
"","</page>","","","","",""
"","<page number=""7"">","","","","",""
"3","yena","","","yad","pron",""
"4","yena","","","yad","pron",""
"5","hi","","","hi","ind",""
"6","baddhyante","BADDH","yante","baddh","verb",""
"7","jantavo","JANT","avo","jantu","noun-adj",""
"8","raudra","RAUDR","a@","raudra","noun-adj",""
"9","karmaṇā","KARM","aṇā","karman","noun-adj",""
"10","/","","","","punct",""
"11","s","","","su","ind",""
"12","opāyena","UPĀY","ena","upāya","noun-adj",""
"13","tu","","","tu","ind",""
"14","ten","","","tad","pron",""
"15","^","","","","",""
"16","aiva","","","eva","ind",""
"17","mucyante","MUC","yante","muñc","verb","muc"
"18","bhava","BHAV","a@","bhava","noun-adj",""
"19","bandhanāt","BANDHAN","āt","bandhana","noun-adj",""
"20","//","","","","punct",""
"","</s>","","","","",""
"","<s number=""10"">","","","","",""
"","</page>","","","","",""
"","<page number=""8"">","","","","",""
"3","samayān","SAMAY","ān","samaya","noun-adj",""
"4","ah","","","","ind",""
"5","arahaḥ","ARAH","aḥ","araha","noun-adj",""
"6","kuryād","KUR","yād","kar","verb","kṛ"
"7","divyān","DIVY","ān","divya","noun-adj",""
"8","pañca","PAÑC","a@","pañca","noun-adj",""
"9","kula","KUL","a@","kula","noun-adj",""
"10","odbhavān","UDBHAV","ān","udbhava","noun-adj",""
"11","/","","","","punct",""
"12","pūjayec","PŪJAY","ec","pūjay","verb","pūj"
"13","ca","","","ca","ind",""
"14","pradīpa","PRADĪP","a@","pradīpa","noun-adj",""
"15","ādyaiḥ","ĀDY","aiḥ","ādya","noun-adj",""
"16","sa","","","sa_saha","ind",""
"17","kṣīrair","KṢĪR","air","kṣīra","noun-adj",""
"18","viśva","VIŚV","a@","viśva","noun-adj",""
"19","sambhavaiḥ","SAMBHAV","aiḥ","sambhava","noun-adj",""
"20","//","","","","punct",""
"","</s>","","","","",""
"","<s number=""11"">","","","","",""
"","</page>","","","","",""
"","<page number=""9"">","","","","",""
"3","protphulla","PROTPHULL","a@","protphulla","noun-adj",""
"4","nayano","NAYAN","o","nayana","noun-adj",""
"5","mantrī","MANTR","ī","mantrin","noun-adj",""
"6","nityaṃ","NITY","aṃ","nitya","noun-adj",""
"7","prahasita","PRAHASIT","a@","prahasita","noun-adj",""
"8","ānanaḥ","ĀNAN","aḥ","ānana","noun-adj",""
"9","/","","","","punct",""
"10","cittam","CITT","am","citta","noun-adj",""
"11","āropya","ĀROPY","a","āropya","noun-adj",""
"12","saṃbodhau","SAṂBODH","au","saṃbodhi","noun-adj",""
"13","bhāvayej","BHĀVAY","ej","bhāvaya","noun-adj",""
"14","jñāna","JÑĀN","a@","jñāna","noun-adj",""
"15","sāgaram","SĀGAR","am","sāgara","noun-adj",""
"16","//","","","","punct",""
"","</s>","","","","",""
"","<s number=""12"">","","","","",""
"","</page>","","","","",""
"","<page number=""10"">","","","","",""
"3","yāvat","YĀVAT","","yāvat","ind",""
"4","sthira","STHIR","a@","sthira","noun-adj",""
"5","calā","CAL","ā","calā","noun-adj",""
"6","bhāvā","BHĀV","ā","bhāva","noun-adj",""
"7","santy","SANT","y","as","verb","as"
"8","atra","","","atra","ind",""
"9","tribhava","TRIBHAV","a@","tribhava","noun-adj",""
"10","ālaye","ĀLAY","e","ālaya","noun-adj",""
"11","/","","","","punct",""
"12","sarve","SARV","e","sarva","noun-adj",""
"13","te","","","tad","pron",""
"14","tattva","TATTV","a@","tad","pron",""
"15","yogena","YOG","ena","yoga","noun-adj",""
"16","draṣṭavyā","DRAṢ","ṭavyā","darś","verb","dṛś"
"17","vajra","VAJR","a@","vajra","noun-adj",""
"18","dhṛg","DHṚ","g","dhṛk","noun-adj",""
"19","yathā","","","yathā","ind",""
"20","//","","","","punct",""
"","</s>","","","","",""
"","<s number=""13"">","","","","",""
"","</page>","","","","",""
"","<page number=""11"">","","","","",""
"3","paravādinaś","PARAVĀD","inaś","paravādin","noun-adj",""
"4","ca","","","ca","ind",""
"5","kecil","KECI","l","kimcit","noun-adj",""
"6","linga","","","","ind",""
"7","bhedair","BHED","air","bheda","noun-adj",""
"8","vyavastitāḥ","VYAVAST","itāḥ","vyavasta","noun-adj",""
"9","/","","","","punct",""
"10","te","","","tad","pron",""
"11","apy","","","api","ind",""
"12","atra","","","atra","ind",""
"13","n","","","na","ind",""
"14","āvamantavyā","AVAMAN","tavyā","avāman","verb","avāman"
"15","vajra","VAJR","a@","vajra","noun-adj",""
"16","sattva","SATTV","a@","sattva","noun-adj",""
"17","vikurvitaiḥ","VIKURVIT","aiḥ","vikurvita","noun-adj",""
"18","//","","","","punct",""
"","</s>","","","","",""
"","<s number=""14"">","","","","",""
"","</page>","","","","",""
"","<page number=""12"">","","","","",""
"3","sarvān","SARV","ān","sarva","noun-adj",""
"4","samara","SAMAR","a@","samara","noun-adj",""
"5","sīkrty","SĪK","rty","sīka","noun-adj",""
"6","a","","","alpha_privativum","ind",""
"7","bhāvān","BHĀV","ān","bhāva","noun-adj",""
"8","nairātmya","NAIRĀTMY","a@","nairātmya","noun-adj",""
"9","niḥsṛtān","NIḤSṚT","ān","niḥsṛta","noun-adj",""
"10","/","","","","punct",""
"11","bhāvayet","BHĀVAY","et","bhāvaya","noun-adj",""
"12","satataṃ","SATAT","aṃ","satata","noun-adj",""
"13","mantrī","MANTR","ī","mantrin","noun-adj",""
"14","dehaṃ","DEH","aṃ","deha","noun-adj",""
"15","prakṛti","PRAKṚT","i@","prakṛti","noun-adj",""
"16","nirmalam","NIRMAL","am","nirmala","noun-adj",""
"17","//","","","","punct",""
"","</s>","","","","",""
"","<s number=""15"">","","","","",""
"","</page>","","","","",""
"","<page number=""13"">","","","","",""
"3","gandha","GANDH","a@","gandha","noun-adj",""
"4","mālya","MĀLY","a@","mālya","noun-adj",""
"5","ādibhir","ĀD","ibhir","ādi","noun-adj",""
"6","vastrair","VASTR","air","vastra","noun-adj",""
"7","dhūpa","DHŪP","a@","dhūpa","noun-adj",""
"8","naivedyakais","NAIVEDY","akais","naivedya","noun-adj",""
"9","tathā","","","tathā","ind",""
"10","/","","","","punct",""
"11","gīta","GĪT","a@","gīta","noun-adj",""
"12","vādyais","VĀDY","ais","vādya","noun-adj",""
"13","tathā","","","tathā","ind",""
"14","nṛtyaiḥ","NṚTY","aiḥ","nṛtya","noun-adj",""
"15","s","","","su","ind",""
"16","opāyair","UPĀY","air","upāya","noun-adj",""
"17","bhajate","BHAJ","ate","bhaj","verb","bhaj"
"18","vibhuḥ","VIBH","uḥ","vibhu","noun-adj",""
"19","//","","","","punct",""
"","</s>","","","","",""
"","<s number=""16"">","","","","",""
"","</page>","","","","",""
"","<page number=""14"">","","","","",""
"3","na","","","na","ind",""
"4","kaṣṭa","KAṢṬ","a@","kaṣṭa","noun-adj",""
"5","kalpanāṃ","KALPAN","āṃ","kalpanā","noun-adj",""
"6","kuryān","KUR","yān","kar","verb","kṛ"
"7","n","","","na","ind",""
"8","opavāsaṃ","UPAVĀS","aṃ","upavāsa","noun-adj",""
"9","na","","","na","ind",""
"10","ca","","","ca","ind",""
"11","kriyām","KRIY","ām","kriyā","noun-adj",""
"12","/","","","","punct",""
"13","snānaṃ","SNĀN","aṃ","snāna","noun-adj",""
"14","śaucaṃ","ŚAUC","aṃ","śauca","noun-adj",""
"15","na","","","na","ind",""
"16","c","","","ca","ind",""
"17","aivātra","AIVĀTR","a","aivātra","noun-adj",""
"18","grāma","GRĀM","a@","grāma","noun-adj",""
"19","dharma","DHARM","a@","dharma","noun-adj",""
"20","vivarjanaṃ","VIVARJAN","aṃ","vivarjana","noun-adj",""
"21","//","","","","punct",""
"","</s>","","","","",""
"","<s number=""17"">","","","","",""
"","</page>","","","","",""
"","<page number=""15"">","","","","",""
"3","na","","","na","ind",""
"4","c","","","ca","ind",""
"5","^","","","","",""
"6","āpi","","","api","ind",""
"7","vandayed","VANDAY","ed","vandaya","noun-adj",""
"8","devān","DEV","ān","deva","noun-adj",""
"9","kāṣṭha","KĀṢṬH","a@","kāṣṭha","noun-adj",""
"10","pāṣāṇa","PĀṢĀṆ","a@","pāṣāṇa","noun-adj",""
"11","mṛṇmayān","MṚṆMAY","ān","mṛṇmaya","noun-adj",""
"12","/","","","","punct",""
"13","pūjām","PŪJ","ām","pūjā","noun-adj",""
"14","asy","","","as","verb","as"
"15","^","","","","",""
"16","aiva","","","eva","ind",""
"17","kāyasya","KĀY","asya","kāya","noun-adj",""
"18","kurvān","KURV","ān","kurvat","noun-adj",""
"19","nityaṃ","NITY","aṃ","nitya","noun-adj",""
"20","smā","","","","ind",""
"21","hitaḥ","HIT","aḥ","hita","noun-adj",""
"22","//","","","","punct",""
"","</s>","","","","",""
"","<s number=""18"">","","","","",""
"","</page>","","","","",""
"","<page number=""16"">","","","","",""
"3","makṣikā","MAKṢIK","ā@","makṣikā","noun-adj",""
"4","cchardi","CHARD","i@","chardi","noun-adj",""
"5","saṃmiśrair","SAMMIŚR","air","sammiśra","noun-adj",""
"6","viṇmūtra","VIṆMŪTR","a@","viṇmūtra","noun-adj",""
"7","ādyaiś","ĀDY","aiś","ādya","noun-adj",""
"8","ca","","","ca","ind",""
"9","bhāvitaiḥ","BHĀVIT","aiḥ","bhāvita","noun-adj",""
"10","/","","","","punct",""
"11","pañca","PAÑC","a@","pañca","noun-adj",""
"12","pradīpa","PRADĪP","a@","pradīpa","noun-adj",""
"13","saṃyuktaiḥ","SAṂYUKT","aiḥ","saṃyukta","noun-adj",""
"14","pūjayed","PŪJAY","ed","pūjay","verb","pūj"
"15","vajra","VAJR","a@","vajra","noun-adj",""
"16","dhāriṇam","DHĀRIṆ","am","dhāriṇī","noun-adj",""
"17","//","","","","punct",""
"","</s>","","","","",""
"","<s number=""19"">","","","","",""
"","</page>","","","","",""
"","<page number=""17"">","","","","",""
"3","a","","","alpha_privativum","ind",""
"4","balā","BAL","ā","balā","noun-adj",""
"5","svayambhu","SVAYAMBH","u@","svayambhu","noun-adj",""
"6","kusumaiḥ","KUSUM","aiḥ","kusuma","noun-adj",""
"7","sa","","","sa_saha","ind",""
"8","kṣīrair","KṢĪR","air","kṣīra","noun-adj",""
"9","viśva","VIŚV","a@","viśva","noun-adj",""
"10","sambhavaiḥ","SAMBHAV","aiḥ","sambhava","noun-adj",""
"11","/","","","","punct",""
"12","pūjayed","PŪJAY","ed","pūjay","verb","pūj"
"13","devatāṃ","DEVAT","āṃ","devatā","noun-adj",""
"14","tena","","","tad","pron",""
"15","deha","DEH","a@","deha","noun-adj",""
"16","sthāṃ","STH","āṃ","sthā","noun-adj",""
"17","tattva","TATTV","a@","tad","pron",""
"18","bhāvanaiḥ","BHĀVAN","aiḥ","bhāvanā","noun-adj",""
"19","//","","","","punct",""
"","</s>","","","","",""
"","<s number=""20"">","","","","",""
"","</page>","","","","",""
"","<page number=""18"">","","","","",""
"3","parasva","PARASV","a@","parasva","noun-adj",""
"4","haraṇaṃ","HARAṆ","aṃ","haraṇa","noun-adj",""
"5","kuryāt","KUR","yāt","kar","verb","kṛ"
"6","paradāra","PARADĀR","a@","paradāra","noun-adj",""
"7","niṣevaṇam","NIṢEVAṆ","am","niṣevaṇa","noun-adj",""
"8","/","","","","punct",""
"9","vaktavyaṃ","VAK","tavyaṃ","vak","verb","vac"
"10","ca","","","ca","ind",""
"11","mṛṣā","MṚṢ","ā@","mṛṣā","noun-adj",""
"12","vākyaṃ","VĀKY","aṃ","vākya","noun-adj",""
"13","sarva","SARV","a@","sarva","noun-adj",""
"14","buddhāṃś","BUDDH","āṃś","buddha","noun-adj",""
"15","ca","","","ca","ind",""
"16","ghātayet","GHĀTAY","et","ghātayat","noun-adj",""
"17","//","","","","punct",""
"","</s>","","","","",""
"","<s number=""21"">","","","","",""
"","</page>","","","","",""
"","<page number=""19"">","","","","",""
"3","śaila","ŚAIL","a@","śaila","noun-adj",""
"4","mṛṇmaya","MṚṆMAY","a@","mṛṇmaya","noun-adj",""
"5","caitya","CAITY","a@","caitya","noun-adj",""
"6","ādīn","ĀD","īn","ādi","noun-adj",""
"7","na","","","na","ind",""
"8","kuryāt","KUR","yāt","kar","verb","kṛ"
"9","pustake","PUSTAK","e","pustaka","noun-adj",""
"10","ratim","RAT","im","rati","noun-adj",""
"11","/","","","","punct",""
"12","na","","","na","ind",""
"13","maṇḍalāni","MAṆḌAL","āni","maṇḍala","noun-adj",""
"14","svapne","SVAPN","e","svapna","noun-adj",""
"15","api","","","api","ind",""
"16","kāya","KĀY","a","kāya","noun-adj",""
"17","vāk","VĀK","","vāk","noun-adj",""
"18","citta","CITT","a@","citta","noun-adj",""
"19","karmaṇā","KARM","aṇā","karman","noun-adj",""
"20","//","","","","punct",""
"","</s>","","","","",""
"","<s number=""22"">","","","","",""
"","</page>","","","","",""
"","<page number=""20"">","","","","",""
"3","jugupsāṃ","JUGUPS","āṃ","jugupsā","noun-adj",""
"4","n","","","na","ind",""
"5","^","","","","",""
"6","aiva","","","eva","ind",""
"7","kurvīta","KURV","īta","kurvat","noun-adj",""
"8","sarva","SARV","a@","sarva","noun-adj",""
"9","vastuṣu","VAST","uṣu","vast","verb",""
"10","mantravit","MANTR","avit","mantra","noun-adj",""
"11","/","","","","punct",""
"12","vajra","VAJR","a@","vajra","noun-adj",""
"13","sattvaḥ","SATTV","aḥ","sattva","noun-adj",""
"14","svayaṃ","SVAY","aṃ","svaya","noun-adj",""
"15","tatra","","","tatra","ind",""
"16","sākṣād","SĀKṢĀD","","sākṣāda","noun-adj",""
"17","rūpeṇa","RŪP","eṇa","rūpa","noun-adj",""
"18","saṃsthitaḥ","SAṂSTHIT","aḥ","saṃsthita","noun-adj",""
"19","//","","","","punct",""
"","</s>","","","","",""
"","<s number=""23"">","","","","",""
"","</page>","","","","",""
"","<page number=""21"">","","","","",""
"3","gamya","GAMY","a@","gamya","noun-adj",""
"4","āgamya","ĀGAMY","a@","āgamya","noun-adj",""
"5","vikalpaṃ","VIKALP","aṃ","vikalpa","noun-adj",""
"6","tu","","","tu","ind",""
"7","bhakṣya","BHAKṢY","a@","bhakṣya","noun-adj",""
"8","ā","","","alpha_privativum","ind",""
"9","bhakṣyaṃ","BHAKṢY","aṃ","bhakṣya","noun-adj",""
"10","tath","","","tathā","ind",""
"11","^","","","","",""
"12","aiva","","","eva","ind",""
"13","ca","","","ca","ind",""
"14","/","","","","punct",""
"15","peyā","PEY","ā@","peya","noun-adj",""
"16","peyaṃ","PEY","aṃ","peya","noun-adj",""
"17","tathā","","","tathā","ind",""
"18","mantrī","MANTR","ī","mantrin","noun-adj",""
"19","kuryān","KUR","yān","kar","verb","kṛ"
"20","n","","","na","ind",""
"21","^","","","","",""
"22","aiva","","","eva","ind",""
"23","samāhitaḥ","SAMĀHIT","aḥ","samāhita","noun-adj",""
"24","//","","","","punct",""
"","</s>","","","","",""
"","<s number=""24"">","","","","",""
"","</page>","","","","",""
"","<page number=""22"">","","","","",""
"3","vairocana","VAIROCAN","a@","vairocana","noun-adj",""
"4","samudbhūtān","SAMUDBHŪT","ān","samudbhūta","noun-adj",""
"5","sarva","SARV","a@","sarva","noun-adj",""
"6","prāṇy","PRĀṆ","y@","prāṇin","noun-adj",""
"7","aṅga","AṄG","a@","aṅga","noun-adj",""
"8","sambhavān","SAMBHAV","ān","sambhava","noun-adj",""
"9","/","","","","punct",""
"10","prāṇakān","PRĀṆAK","ān","prāṇaka","noun-adj",""
"11","guhya","GUHY","a@","guhya","noun-adj",""
"12","tattva","TATTV","a@","tad","pron",""
"13","jño","JÑ","o","jña","noun-adj",""
"14","bhakṣayet","BHAKṢAY","et","bhakṣa","verb",""
"15","siddhi","SIDDH","i@","siddhi","noun-adj",""
"16","hetunā","HET","unā","hetu","noun-adj",""
"17","//","","","","punct",""
"","</s>","","","","",""
"","<s number=""25"">","","","","",""
"","</page>","","","","",""
"","<page number=""23"">","","","","",""
"3","sarva","SARV","a@","sarva","noun-adj",""
"4","varṇa","VARṆ","a@","varṇa","noun-adj",""
"5","samudbhūtā","SAMUDBHŪT","ā","samudbhūta","noun-adj",""
"6","jugupsyā","JUGUPS","yā","jugupsā","noun-adj",""
"7","n","","","na","ind",""
"8","^","","","","",""
"9","aiva","","","eva","ind",""
"10","yoṣitaḥ","YOṢIT","aḥ","yoṣitā","noun-adj",""
"11","/","","","","punct",""
"12","s","","","su","ind",""
"13","^","","","","",""
"14","aiva","","","eva","ind",""
"15","bhagavatī","BHAGAV","atī","bhagavat","noun-adj",""
"16","prajñā","PRAJÑ","ā","prajñā","noun-adj",""
"17","saṃvṛtyā","SAṂVṚT","yā","saṃvṛti","noun-adj",""
"18","rūpam","RŪP","am","rūpa","noun-adj",""
"19","āśrityā","ĀŚRITY","ā","āśritya","noun-adj",""
"20","//","","","","punct",""
"","</s>","","","","",""
"","<s number=""26"">","","","","",""
"","</page>","","","","",""
"","<page number=""24"">","","","","",""
"3","na","","","na","ind",""
"4","tithir","TITH","ir","tithi","noun-adj",""
"5","na","","","na","ind",""
"6","ca","","","ca","ind",""
"7","nakṣatraṃ","NAKṢATR","aṃ","nakṣatra","noun-adj",""
"8","n","","","na","ind",""
"9","opavāso","UPAVĀS","o","upavāsa","noun-adj",""
"10","vidhīyate","VIDHĪ","yate","vidhīa","noun-adj",""
"11","/","","","","punct",""
"12","a","","","alpha_privativum","ind",""
"13","dvaya","DVAY","a@","dvaya","noun-adj",""
"14","jñāna","JÑĀN","a@","jñāna","noun-adj",""
"15","yuktasya","YUKT","asya","yukta","noun-adj",""
"16","siddhir","SIDDH","ir","siddhi","noun-adj",""
"17","bhavati","BHAV","ati","bhav","verb","bhū"
"18","saugatī","SAUGAT","ī","saugata","noun-adj",""
"19","//","","","","punct",""
"","</s>","","","","",""
"","<s number=""27"">","","","","",""
"","</page>","","","","",""
"","<page number=""25"">","","","","",""
"3","bahu","BAH","u@","bahu","noun-adj",""
"4","n","","","na","ind",""
"5","^","","","","",""
"6","ātra","","","atra","ind",""
"7","kim","","","kim","pron",""
"8","uktena","UKT","ena","ukta","noun-adj",""
"9","yad","","","yadi","ind",""
"10","bhaved","BHAV","ed","bhav","verb","bhū"
"11","upalabdhikam","UPALABDH","ikam","upalabdhika","noun-adj",""
"12","/","","","","punct",""
"13","tat","TAT","","tad","pron",""
"14","sarvaṃ","SARV","aṃ","sarva","noun-adj",""
"15","tattva","TATTV","a@","tad","pron",""
"16","yogena","YOG","ena","yoga","noun-adj",""
"17","draṣṭavyaṃ","DRAṢ","ṭavyaṃ","darś","verb","dṛś"
"18","tattva","TATTV","a@","tad","pron",""
"19","vedinā","VED","inā","vedi","noun-adj",""
"20","//","","","","punct",""
"","</s>","","","","",""
"","<s number=""28"">","","","","",""
"","</page>","","","","",""
"","<page number=""26"">","","","","",""
"3","hasty","HAST","y@","hasti","noun-adj",""
"4","aśva","AŚV","a@","aśva","noun-adj",""
"5","khara","KHAR","a@","khara","noun-adj",""
"6","gāva","GĀV","a@","gāvī","noun-adj",""
"7","oṣṭra","UṢṬR","a@","uṣṭra","noun-adj",""
"8","pradīpaṃ","PRADĪP","aṃ","pradīpa","noun-adj",""
"9","śvāna","ŚVĀN","a@","śvāna","noun-adj",""
"10","sambhavam","SAMBHAV","am","sambhava","noun-adj",""
"11","/","","","","punct",""
"12","mahāpradīpa","MAHĀPRADĪP","a@","mahāpradīpa","noun-adj",""
"13","saṃmiśraṃ","SAMMIŚR","aṃ","sammiśra","noun-adj",""
"14","bhakṣayed","BHAKṢAY","ed","bhakṣa","verb",""
"15","yoga","YOG","a@","yoga","noun-adj",""
"16","vit","VIT","","vita","noun-adj",""
"17","sadā","","","sadā","ind",""
"18","//","","","","punct",""
"","</s>","","","","",""
"","<s number=""29"">","","","","",""
"","</page>","","","","",""
"","<page number=""27"">","","","","",""
"3","na","","","na","ind",""
"4","c","","","ca","ind",""
"5","^","","","","",""
"6","ādhya","ĀDHY","a@","ādhya","noun-adj",""
"7","āsaktiṃ","ĀSAKT","iṃ","āsakti","noun-adj",""
"8","kurvīta","KURV","īta","kurvat","noun-adj",""
"9","ek","EK","","eka","noun-adj",""
"10","asminn","","","idam","pron",""
"11","api","","","api","ind",""
"12","yogavit","YOG","avit","yoga","noun-adj",""
"13","/","","","","punct",""
"14","samatā","SAMAT","ā@","samatā","noun-adj",""
"15","citta","CITT","a@","citta","noun-adj",""
"16","yogena","YOG","ena","yoga","noun-adj",""
"17","bhāvanīyo","BHĀVANĪY","o","bhāvanīya","noun-adj",""
"18","bhava","BHAV","a@","bhava","noun-adj",""
"19","ārṇavaḥ","ARṆAV","aḥ","arṇava","noun-adj",""
"20","//","","","","punct",""
"","</s>","","","","",""
"","<s number=""30"">","","","","",""
"","</page>","","","","",""
"","<page number=""28"">","","","","",""
"3","utpatti","UTPATT","i@","utpatti","noun-adj",""
"4","sthiti","STHIT","i@","sthiti","noun-adj",""
"5","nirodhaṃ","NIRODH","aṃ","nirodha","noun-adj",""
"6","c","","","ca","ind",""
"7","^","","","","",""
"8","ā","","","alpha_privativum","ind",""
"9","sampṛktaṃ","SAMPṚKT","aṃ","sampṛkta","noun-adj",""
"10","pṛthagjanaiḥ","PṚTHAGJAN","aiḥ","pṛthagjana","noun-adj",""
"11","/","","","","punct",""
"12","tasya","","","tad","pron",""
"13","bhāve","BHĀV","e","bhāva","noun-adj",""
"14","tu","","","tu","ind",""
"15","saṃsāro","SAṂSĀR","o","saṃsāra","noun-adj",""
"16","n","","","na","ind",""
"17","ānyatra","ANYATR","a","anyatra","noun-adj",""
"18","pralaya","PRALAY","a@","pralaya","noun-adj",""
"19","odbhavaḥ","UDBHAV","aḥ","udbhava","noun-adj",""
"20","//","","","","punct",""
"","</s>","","","","",""
"","<s number=""31"">","","","","",""
"","</page>","","","","",""
"","<page number=""29"">","","","","",""
"3","dinaṃ","DIN","aṃ","dina","noun-adj",""
"4","tu","","","tu","ind",""
"5","bhagavān","BHAGAV","ān","bhagavat","noun-adj",""
"6","vajrī","VAJR","ī","vajrin","noun-adj",""
"7","naktaṃ","NAKT","aṃ","nakta","noun-adj",""
"8","prajñā","PRAJÑ","ā","prajñā","noun-adj",""
"9","vidhīyate","VIDHĪ","yate","vidhīa","noun-adj",""
"10","/","","","","punct",""
"11","evaṃ","","","eva","ind",""
"12","tu","","","tu","ind",""
"13","bhāvayed","BHĀVAY","ed","bhāvaya","noun-adj",""
"14","yogī","YOG","ī","yogin","noun-adj",""
"15","laghu","LAGH","u@","laghu","noun-adj",""
"16","siddhim","SIDDH","im","siddhi","noun-adj",""
"17","avāpnuyāt","AVĀPN","uyāt","avāpn","verb",""
"18","//","","","","punct",""
"","</s>","","","","",""
"","<s number=""32"">","","","","",""
"","</page>","","","","",""
"","<page number=""30"">","","","","",""
"3","yat","","","yad","pron",""
"4","tad","TAD","","tad","pron",""
"5","a","","","alpha_privativum","ind",""
"6","vyakta","VYAKT","a@","vyakta","noun-adj",""
"7","rūpaṃ","RŪP","aṃ","rūpa","noun-adj",""
"8","tu","","","tu","ind",""
"9","sarva","SARV","a@","sarva","noun-adj",""
"10","sattveṣu","SATTV","eṣu","sattva","noun-adj",""
"11","saṃsthitam","SAṂSTHIT","am","saṃsthita","noun-adj",""
"12","/","","","","punct",""
"13","guru","GUR","u@","guru","noun-adj",""
"14","vaktrāt","VAKTR","āt","vaktra","noun-adj",""
"15","paraṃ","PAR","aṃ","para","noun-adj",""
"16","tattvaṃ","TATTV","aṃ","tad","pron",""
"17","prāpyate","PRĀP","yate","prāpn","verb","prāp"
"18","n","","","na","ind",""
"19","^","","","","",""
"20","ātra","","","atra","ind",""
"21","samśayaḥ","SAMŚAY","aḥ","samśaya","noun-adj",""
"22","//","","","","punct",""
"","</s>","","","","",""
"","<s number=""33"">","","","","",""
"","</page>","","","","",""
"","<page number=""31"">","","","","",""
"3","a","","","alpha_privativum","ind",""
"4","pratiṣṭhita","PRATIṢṬHIT","a@","pratiṣṭhita","noun-adj",""
"5","nirvāṇaṃ","NIRVĀṆ","aṃ","nirvāṇa","noun-adj",""
"6","nirnimittaṃ","NIRNIMITT","aṃ","nirnimitta","noun-adj",""
"7","nirālayam","NIRĀLAY","am","nirālaya","noun-adj",""
"8","/","","","","punct",""
"9","vyāpakaṃ","VYĀP","akaṃ","vyāpaka","noun-adj",""
"10","sarva","SARV","a@","sarva","noun-adj",""
"11","sattveṣu","SATTV","eṣu","sattva","noun-adj",""
"12","saṃbodhiḥ","SAṂBODH","iḥ","saṃbodhi","noun-adj",""
"13","paramaṃ","PARAM","aṃ","parama","noun-adj",""
"14","padam","PAD","am","pada","noun-adj",""
"15","//","","","","punct",""
"","</s>","","","","",""
"","<s number=""34"">","","","","",""
"","</page>","","","","",""
"","<page number=""32"">","","","","",""
"3","evaṃ","","","eva","ind",""
"4","matvā","","","","ind",""
"5","tu","","","tu","ind",""
"6","vai","","","vai","ind",""
"7","yogī","YOG","ī","yogin","noun-adj",""
"8","yo","","","yad","pron",""
"9","abhya","ABHY","a@","abhya","noun-adj",""
"10","sed","SED","","sedi","noun-adj",""
"11","buddhimān","BUDDH","imān","buddhimat","noun-adj",""
"12","sadā","","","sadā","ind",""
"13","/","","","","punct",""
"14","sa","","","sa_saha","ind",""
"15","siddhyati","SIDDH","yati","siddha","noun-adj",""
"16","na","","","na","ind",""
"17","sandeho","SANDEH","o","sandeha","noun-adj",""
"18","manda","MAND","a@","manda","noun-adj",""
"19","puṇyo","PUṆY","o","puṇya","noun-adj",""
"20","api","","","api","ind",""
"21","mānavaḥ","MĀNAV","aḥ","mānava","noun-adj",""
"22","//","","","","punct",""
"","</s>","","","","",""
"","<s number=""35"">","","","","",""
"","</page>","","","","",""
"","<page number=""33"">","","","","",""
"3","ācāryāt","ĀCĀRY","āt","ācārya","noun-adj",""
"4","parataraṃ","PARATAR","aṃ","paratara","noun-adj",""
"5","n","","","na","ind",""
"6","^","","","","",""
"7","āsti","","","as","verb","as"
"8","trailokye","TRAILOKY","e","trailokya","noun-adj",""
"9","sacarācare","SACARĀCAR","e","sacarācara","noun-adj",""
"10","/","","","","punct",""
"11","yasya","","","yad","pron",""
"12","prasādāt","PRASĀD","āt","prasāda","noun-adj",""
"13","prāpyante","PRĀP","yante","prāpn","verb","prāp"
"14","siddhayo","SIDDH","ayo","siddha","noun-adj",""
"15","an","","","alpha_privativum","ind",""
"16","ekadhā","EKADH","ā","ekadhā","noun-adj",""
"17","budhaiḥ","BUDH","aiḥ","budha","noun-adj",""
"18","//","","","","punct",""
"","</s>","","","","",""
"","<s number=""36"">","","","","",""
"","</page>","","","","",""
"","<page number=""34"">","","","","",""
"3","vajra","VAJR","a@","vajra","noun-adj",""
"4","sattvaḥ","SATTV","aḥ","sattva","noun-adj",""
"5","sa","","","sa_saha","ind",""
"6","vai","","","vai","ind",""
"7","jñeyaḥ","JÑEY","aḥ","jñeya","noun-adj",""
"8","sarva","SARV","a@","sarva","noun-adj",""
"9","buddhair","BUDDH","air","buddha","noun-adj",""
"10","namaskṛtaḥ","NAMASKṚT","aḥ","namaskṛti","noun-adj",""
"11","/","","","","punct",""
"12","ācāryaḥ","ĀCĀRY","aḥ","ācārya","noun-adj",""
"13","paramo","PARAM","o","parama","noun-adj",""
"14","devaḥ","DEV","aḥ","deva","noun-adj",""
"15","pūjanīyaḥ","PŪJANĪY","aḥ","pūjanīya","noun-adj",""
"16","prayatnataḥ","PRAYATN","ataḥ","prayatna","noun-adj",""
"17","//","","","","punct",""
"","</s>","","","","",""
"","<s number=""37"">","","","","",""
"","</page>","","","","",""
"","<page number=""35"">","","","","",""
"3","sa","","","sa_saha","ind",""
"4","eva","","","eva","ind",""
"5","tathata","TATHAT","a@","tathatā","noun-adj",""
"6","ā","","","alpha_privativum","ind",""
"7","rūpī","RŪP","ī","rūpin","noun-adj",""
"8","loka","LOK","a@","loka","noun-adj",""
"9","ānugraha","ANUGRAH","a@","anugraha","noun-adj",""
"10","hetunā","HET","unā","hetu","noun-adj",""
"11","/","","","","punct",""
"12","rūpam","RŪP","am","rūpa","noun-adj",""
"13","āśritya","ĀŚRIT","ya","āśrita","noun-adj",""
"14","saṃvṛtyā","SAṂVṚT","yā","saṃvṛti","noun-adj",""
"15","saṃsthito","SAṂSTHIT","o","saṃsthita","noun-adj",""
"16","yoga","YOG","a@","yoga","noun-adj",""
"17","pīṭhake","PĪṬH","ake","pīṭhaka","noun-adj",""
"18","//","","","","punct",""
"","</s>","","","","",""
"","<s number=""38"">","","","","",""
"","</page>","","","","",""
"","<page number=""36"">","","","","",""
"3","mṛtyur","MṚTY","ur","mṛtyu","noun-adj",""
"4","eṣa","","","tad","pron",""
"5","vikalpo","VIKALP","o","vikalpa","noun-adj",""
"6","yaṃ","","","yad","pron",""
"7","na","","","na","ind",""
"8","bhāvaḥ","BHĀV","aḥ","bhāva","noun-adj",""
"9","sarva","SARV","a@","sarva","noun-adj",""
"10","vastuṣu","VAST","uṣu","vast","verb",""
"11","/","","","","punct",""
"12","hanyate","HAN","yate","han","verb","han"
"13","sva","SV","a@","sva","noun-adj",""
"14","vikalpena","VIKALP","ena","vikalpa","noun-adj",""
"15","pṛthagjana","PṚTHAGJAN","a@","pṛthagjana","noun-adj",""
"16","vijṛmbhitaiḥ","VIJṚMBHIT","aiḥ","vijṛmbhita","noun-adj",""
"17","//","","","","punct",""
"","</s>","","","","",""
"","<s number=""39"">","","","","",""
"1","śrīmad","ŚRĪMAD","","śrīmada","noun-adj",""
"2","oḍīyāna","OḌĪYĀN","a@","oḍīyāna","noun-adj",""
"3","vinirgatā","VINIRGAT","ā","vinirgata","noun-adj",""
"4","mahā","MAH","ā@","mahat","noun-adj",""
"5","yoga","YOG","a@","yoga","noun-adj",""
"6","pīṭha","PĪṬH","a@","pīṭha","noun-adj",""
"7","āgatā","ĀGAT","ā","āgata","noun-adj",""
"8","a","","","alpha_privativum","ind",""
"9","khila","KHIL","a@","khila","noun-adj",""
"10","yoga","YOG","a@","yoga","noun-adj",""
"11","tantra","TANTR","a@","tad","pron",""
"12","tattva","TATTV","a@","tad","pron",""
"13","garbhā","GARBH","ā","garbha","noun-adj",""
"14","śrī","ŚRĪ","","śrī","noun-adj",""
"15","lakṣmī","LAKṢM","ī@","lakṣmī","noun-adj",""
"16","mukha","MUKH","a@","mukha","noun-adj",""
"17","kamalād","KAMAL","ād","kamala","noun-adj",""
"","</s>","","","","",""
"","<s number=""40"">","","","","",""
"1","viniḥsṛtā","VINIḤSṚT","ā","viniḥsṛta","noun-adj",""
"2","sv","","","su","ind",""
"3","ādhiṣṭhāna","ADHIṢṬHĀN","a@","adhiṣṭhāna","noun-adj",""
"4","krama","KRAM","a@","krama","noun-adj",""
"5","odayā","UDAY","ā","udaya","noun-adj",""
"6","a","","","alpha_privativum","ind",""
"7","dvaya","DVAY","a@","dvaya","noun-adj",""
"8","siddhir","SIDDH","ir","siddhi","noun-adj",""
"9","nāma","NĀM","a","nāman","noun-adj",""
"10","sādhana","SĀDHAN","a@","sādhana","noun-adj",""
"11","opāyikā","UPĀYIK","ā","upāyikā","noun-adj",""
"12","samāpta","SAMĀPT","a","samāpta","noun-adj",""
"13","^","","","","",""
"14","eti","","","iti","ind",""
"","</s>","","","","",""
"","</page>","","","","",""
"","</doc>","","","","",""
