"WordID","word","NormSTEM","suffix","lemma","PoS","Root"
"","<doc textid = ""buddhagadyaya"" genre = ""stotra"" title = ""buddhagadyaya"" author = ""unknown"" discourse = ""tantra"" tradition = ""tantra"" period = ""commentarial"" source = ""dsbc accessed aug 2021"" date_range = ""after 6. ce"" notes = ""no detailed information on this work or dating found. this seems to be a sri lankan vajrayana poem. see however rangama chandawimala. heterodox buddhism: the school of abhayagiri. revised phd dissertation. university of hongkong. colombo 2016; pp. 210-11. there is also a buddhagajjaya mentioned in this wikipedia article https://en.wikipedia.org/wiki/thotagamuwe_sri_rahula_thera#cite_ref-cas_3-0 dated to 1430 and ascribed to one thotagamuwe sri rahula thero. it's not clear at all whether this is the same work or not."" religion = ""buddh"" edition = ""based on the ed. by ? ?"" digitization = ""miroj shakya"" segmentation_lemmatization = ""ligeia lugli & buddhist translators workbench team"" metadata_enrichment = ""bruno galasek-hul & buddhist translators workbench team"" proofreader = ""n/a"" permission = """" reconstructions = ""none"">","","","","",""
"","<page number=""0000"">","","","","",""
"","<s number=""1"">","","","","",""
"1","buddha","BUDDH","a@","buddha","noun-adj",""
"2","gadyaya","GADY","aya","gadya","noun-adj",""
"3","buddha","BUDDH","a@","buddha","noun-adj",""
"4","gaja","GAJ","a@","gaja","noun-adj",""
"5","jaya","JAY","a","jaya","noun-adj",""
"","</s>","","","","",""
"","<s number=""2"">","","","","",""
"1","namo","NAM","o","namas","noun-adj",""
"2","buddhāya","BUDDH","āya","buddha","noun-adj",""
"3","//","","","","punct",""
"","</s>","","","","",""
"","<s number=""3"">","","","","",""
"1","namas","NAM","as","nama","noun-adj",""
"2","samantabhadrāya","SAMANTABHADR","āya","samantabhadra","noun-adj",""
"3","sarva","SARV","a@","sarva","noun-adj",""
"4","gocara","GOCAR","a@","gocara","noun-adj",""
"5","cakṣue","CAKṢ","ue","cakṣu","noun-adj",""
"6","karuṇā","KAR","uṇā","karu","noun-adj",""
"7","mṛta","MṚT","a@","mṛta","noun-adj",""
"8","kallola­","KAL","lola­","kala","noun-adj",""
"9","sindhave","SINDHAV","e","sindhava","noun-adj",""
"10","sūryya","SŪRY","a@","sūrya","noun-adj",""
"11","bandhave","BANDHAV","e","bandhava","noun-adj",""
"12","//","","","","punct",""
"","</s>","","","","",""
"","<s number=""4"">","","","","",""
"1","jaya","JAY","a","jaya","noun-adj",""
"2","jaya","JAY","a","jaya","noun-adj",""
"3","dharmma","DHARM","a@","dharma","noun-adj",""
"4","rāja","RĀJ","a","rājan","noun-adj",""
"5","jana","JAN","a@","jana","noun-adj",""
"6","kṛtaśarmm","KṚTAŚARM","m","kṛtaśarman","noun-adj",""
"7","apūja","APŪJ","a","apūjā","noun-adj",""
"8","a","","","alpha_privativum","ind",""
"9","sadṛśa","SADṚŚ","a@","sadṛśa","noun-adj",""
"10","buddha","BUDDH","a@","buddha","noun-adj",""
"11","līla","LĪL","a","līlā","noun-adj",""
"12","atipariśuddha","ATIPARIŚUDDH","a@","atipariśuddha","noun-adj",""
"13","śila","ŚIL","a","śilā","noun-adj",""
"14","//","","","","punct",""
"","</s>","","","","",""
"","<s number=""5"">","","","","",""
"1","sphuṭita","SPHUṬIT","a@","sphuṭita","noun-adj",""
"2","gabhasti","GABHAST","i@","gabhasti","noun-adj",""
"3","jāla","JĀL","a","jāla","noun-adj",""
"4","bahuvidha","BAHUVIDH","a@","bahuvidha","noun-adj",""
"5","visva","VISV","a@","visvan","noun-adj",""
"6","pala","PAL","a","pala","noun-adj",""
"7","jagati","JAGAT","i","jagat","noun-adj",""
"8","nirastadosa","NIRAST","adosa","nirastat","noun-adj",""
"9","praṇamita","PRAṆAMIT","a@","praṇamita","noun-adj",""
"10","śasta","ŚAST","a@","śasta","noun-adj",""
"11","veṣa","VEṢ","a","veṣa","noun-adj",""
"12","//","","","","punct",""
"","</s>","","","","",""
"","<s number=""6"">","","","","",""
"1","rucira","RUCIR","a@","rucira","noun-adj",""
"2","vimukti","VIMUKT","i@","vimukti","noun-adj",""
"3","bhūṣa","BHŪṢ","a","bhūṣa","noun-adj",""
"4","magadha","MAGADH","a@","magadha","noun-adj",""
"5","viśiṣṭa","VIŚIṢṬ","a@","viśiṣṭa","noun-adj",""
"6","bhāṣa","BHĀṢ","a","bhāṣa","noun-adj",""
"7","daṇḍit","DAṆḌ","it","daṇḍa","noun-adj",""
"8","abahu","ABAH","u@","abahu","noun-adj",""
"9","māra","MĀR","a","māra","noun-adj",""
"10","khaṇḍit","KHAṆḌ","it","khaṇḍa","noun-adj",""
"11","abhava","ABHAV","a@","abhava","noun-adj",""
"12","bhāra","BHĀR","a","bhāra","noun-adj",""
"13","//","","","","punct",""
"","</s>","","","","",""
"","<s number=""7"">","","","","",""
"1","maṇḍita","MAṆḌIT","a@","maṇḍita","noun-adj",""
"2","śubha","ŚUBH","a@","śubha","noun-adj",""
"3","gātha","GĀTH","a","gāthā","noun-adj",""
"4","paṇḍita","PAṆḌIT","a@","paṇḍita","noun-adj",""
"5","janana","JANAN","a@","janana","noun-adj",""
"6","ātha","ĀTH","a","āthati","noun-adj",""
"7","a","","","alpha_privativum","ind",""
"8","ñcita","ÑCIT","a@","ñcita","noun-adj",""
"9","pada","PAD","a@","pada","noun-adj",""
"10","pāta","PĀT","a","pāta","noun-adj",""
"11","sañcita","SAṂCIT","a@","saṃcita","noun-adj",""
"12","hita","HIT","a@","hita","noun-adj",""
"13","jāta","JĀT","a","jāta","noun-adj",""
"14","//","","","","punct",""
"","</s>","","","","",""
"","<s number=""8"">","","","","",""
"1","sāra","SĀR","a@","sāra","noun-adj",""
"2","hari","HAR","i@","hari","noun-adj",""
"3","vara","VAR","a@","vara","noun-adj",""
"4","śayana","ŚAYAN","a","śayana","noun-adj",""
"5","tāma","TĀM","a@","tāma","noun-adj",""
"6","rasa","RAS","a@","rasa","noun-adj",""
"7","nibha","NIBH","a@","nibha","noun-adj",""
"8","nayana","NAYAN","a","nayana","noun-adj",""
"9","loka","LOK","a@","loka","noun-adj",""
"10","jana","JAN","a@","jana","noun-adj",""
"11","sukha","SUKH","a@","sukha","noun-adj",""
"12","karaṇa","KARAṆ","a","karaṇa","noun-adj",""
"13","lola","LOL","a@","lola","noun-adj",""
"14","sura","SUR","a@","sura","noun-adj",""
"15","nata","NAT","a@","nata","noun-adj",""
"16","caraṇa","CARAṆ","a","caraṇa","noun-adj",""
"17","//","","","","punct",""
"","</s>","","","","",""
"","<s number=""9"">","","","","",""
"1","k","","","kim","pron",""
"2","ālajaya","ĀLAJ","aya","ālaji","noun-adj",""
"3","catur","CAT","ur","catur","noun-adj",""
"4","atara","ATAR","a","atara","noun-adj",""
"5","śila","ŚIL","a@","śilā","noun-adj",""
"6","dhara","DHAR","a@","dhara","noun-adj",""
"7","divasa","DIVAS","a@","divasa","noun-adj",""
"8","kara","KAR","a","kara","noun-adj",""
"9","bāla","BĀL","a@","bāla","noun-adj",""
"10","janaku","JANAK","u@","janaka","noun-adj",""
"11","mati","MAT","i@","mati","noun-adj",""
"12","hara","HAR","a","hara","noun-adj",""
"13","ā","","","alpha_privativum","ind",""
"14","lavaka","LAVAK","a@","lavaka","noun-adj",""
"15","damana","DAMAN","a@","damana","noun-adj",""
"16","kara","KAR","a","kara","noun-adj",""
"17","//","","","","punct",""
"","</s>","","","","",""
"","<s number=""10"">","","","","",""
"1","sura","","","","ind",""
"2","nara","NAR","a@","nara","noun-adj",""
"3","pūjanīya","PŪJANĪY","a@","pūjanīya","noun-adj",""
"4","āryya","ĀRY","ya","ārya","noun-adj",""
"5","budhajana","BUDHAJAN","a@","budhajana","noun-adj",""
"6","bodhana","BODHAN","a@","bodhana","noun-adj",""
"7","ā","","","alpha_privativum","ind",""
"8","vīryya","VĪRY","ya","vīrya","noun-adj",""
"9","pa","","","","ind",""
"10","rahita","RAHIT","a@","rahita","noun-adj",""
"11","sādhana","SĀDHAN","a@","sādhana","noun-adj",""
"12","ākāryya","AKĀRY","ya","akārya","noun-adj",""
"13","tribhuvana","TRIBHUVAN","a@","tribhuvana","noun-adj",""
"14","śāsana","ŚĀSAN","a@","śāsana","noun-adj",""
"15","ācāryya","ĀCĀRY","ya","ācārya","noun-adj",""
"16","//","","","","punct",""
"","</s>","","","","",""
"","<s number=""11"">","","","","",""
"1","dānava","DĀNAV","a@","dānava","noun-adj",""
"2","ā","","","alpha_privativum","ind",""
"3","ripad","RIP","ad","ripat","noun-adj",""
"4","māsana","MĀSAN","a@","māsana","noun-adj",""
"5","stha","STH","a","stha","noun-adj",""
"6","dhīra","DHĪR","a@","dhīra","noun-adj",""
"7","pūta","PŪT","a@","pūta","noun-adj",""
"8","citra","CITR","a@","citra","noun-adj",""
"9","āsanastha","ĀSANASTH","a","āsanastha","noun-adj",""
"10","vītamoha","VĪTAMOH","a@","vītamoha","noun-adj",""
"11","rudra","RUDR","a@","rudra","noun-adj",""
"12","āsana","ĀSAN","a@","āsana","noun-adj",""
"13","stha","STH","a","stha","noun-adj",""
"14","bodhi","BODH","i@","bodhi","noun-adj",""
"15","mūla","MŪL","a@","mūla","noun-adj",""
"16","vajra","VAJR","a@","vajra","noun-adj",""
"17","āsanastha","ĀSANASTH","a","āsanastha","noun-adj",""
"18","//","","","","punct",""
"","</s>","","","","",""
"","<s number=""12"">","","","","",""
"1","yajña","YAJÑ","a@","yajña","noun-adj",""
"2","ādhīśa","ADHĪŚ","a@","adhīśa","noun-adj",""
"3","guṇa","GUṆ","a@","guṇa","noun-adj",""
"4","praṇati","PRAṆAT","i","praṇati","noun-adj",""
"5","jña","JÑ","a","jña","noun-adj",""
"6","vijña","VIJÑ","a@","vijña","noun-adj",""
"7","ādhāra","ĀDHĀR","a@","ādhāra","noun-adj",""
"8","vara","VAR","a@","vara","noun-adj",""
"9","sphuṭa","SPHUṬ","a@","sphuṭa","noun-adj",""
"10","vijña","VIJÑ","a","vijña","noun-adj",""
"11","a","","","alpha_privativum","ind",""
"12","jñā","JÑĀ","a@","jñās","noun-adj",""
"13","nāri","NĀR","i@","nārī","noun-adj",""
"14","bala","BAL","a@","bala","noun-adj",""
"15","prahara","PRAHAR","a@","prahara","noun-adj",""
"16","jña","JÑ","a","jña","noun-adj",""
"17","prajña","PRAJÑ","a@","prajñā","noun-adj",""
"18","ādhāna","ĀDHĀN","a@","ādhāna","noun-adj",""
"19","mahat","MAHAT","","mahat","noun-adj",""
"20","ṣaḍabhijña","ṢAḌABHIJÑ","a","ṣaḍabhijña","noun-adj",""
"21","//","","","","punct",""
"","</s>","","","","",""
"","<s number=""13"">","","","","",""
"1","dhiṣaṇa","DHIṢAṆ","a@","dhiṣaṇa","noun-adj",""
"2","āmaya","ĀMAY","a","āmaya","noun-adj",""
"3","s","","","su","ind",""
"4","ārasa","ĀRAS","a@","ārasa","noun-adj",""
"5","āyaka","ĀYAK","a","āyaka","noun-adj",""
"6","vipadā","VIPAD","ā@","vipadā","noun-adj",""
"7","kula","KUL","a@","kula","noun-adj",""
"8","hetu","HET","u@","hetu","noun-adj",""
"9","hāyaka","HĀY","aka","hāyaka","noun-adj",""
"10","a","","","alpha_privativum","ind",""
"11","jarā","JAR","ā@","jarā","noun-adj",""
"12","mara","MAR","a@","mara","noun-adj",""
"13","bhūti","BHŪT","i","bhūti","noun-adj",""
"14","dāyaka","DĀYAK","a","dāyaka","noun-adj",""
"15","sacarācara","SACARĀCAR","a@","sacarācara","noun-adj",""
"16","loka","LOK","a@","loka","noun-adj",""
"17","nāyaka","NĀYAK","a","nāyaka","noun-adj",""
"18","//","","","","punct",""
"","</s>","","","","",""
"","<s number=""14"">","","","","",""
"1","praśruta","PRAŚRUT","a","praśruta","noun-adj",""
"2","mṛdu","MṚD","u@","mṛdu","noun-adj",""
"3","vācā","VĀC","ā@","vāk","noun-adj",""
"4","candana","CANDAN","a","candana","noun-adj",""
"5","niśruta","NIŚRUT","a","niśruta","noun-adj",""
"6","sura","SUR","a@","sura","noun-adj",""
"7","pūja","PŪJ","a@","pūjā","noun-adj",""
"8","āvindana","ĀVIND","ana","āvind","verb",""
"9","su","","","su","ind",""
"10","śruta","ŚRUT","a@","śruta","noun-adj",""
"11","jana","JAN","a@","jana","noun-adj",""
"12","māya","MĀY","a@","māyā","noun-adj",""
"13","ānandana","ĀNANDAN","a","ānandana","noun-adj",""
"14","viśruta","VIŚRUT","a@","viśruta","noun-adj",""
"15","kula","KUL","a@","kula","noun-adj",""
"16","māya","MĀY","a@","māyā","noun-adj",""
"17","ānandana","ĀNANDAN","a","ānandana","noun-adj",""
"18","//","","","","punct",""
"","</s>","","","","",""
"","<s number=""15"">","","","","",""
"1","iṣṭa","IṢṬ","a@","iṣṭa","noun-adj",""
"2","vinaṣṭa","VINAṢṬ","a@","vinaṣṭa","noun-adj",""
"3","samujjhita","SAMUJJHIT","a@","samujjhita","noun-adj",""
"4","kopa","KOP","a","kopa","noun-adj",""
"5","tuṣṭa","TUṢ","ṭa","tuṣa","noun-adj",""
"6","variṣṭha","VARIṢṬH","a@","variṣṭha","noun-adj",""
"7","vivarj","VIVAR","j","vivara","noun-adj",""
"8","jita","JIT","a@","jita","noun-adj",""
"9","pāpa","PĀP","a","pāpa","noun-adj",""
"10","śiṣṭa","ŚIṢṬ","a@","śiṣṭa","noun-adj",""
"11","viśiṣṭa","VIŚIṢṬ","a@","viśiṣṭa","noun-adj",""
"12","vinir","VIN","ir","vini","noun-adj",""
"13","jita","JIT","a@","jita","noun-adj",""
"14","tāpa","TĀP","a","tāpa","noun-adj",""
"15","aṣṭa","AṢṬ","a@","aṣṭa","noun-adj",""
"16","catuṣṭaya","CATUṢṬAY","a@","catuṣṭaya","noun-adj",""
"17","lakṣaṇa","LAKṢAṆ","a@","lakṣaṇa","noun-adj",""
"18","rūpa","RŪP","a","rūpa","noun-adj",""
"19","//","","","","punct",""
"","</s>","","","","",""
"","<s number=""16"">","","","","",""
"1","yogya","YOGY","a@","yogya","noun-adj",""
"2","bhāva","BHĀV","a@","bhāva","noun-adj",""
"3","gaṇanā","GAṆAN","ā@","gaṇanā","noun-adj",""
"4","hṛta","HṚT","a@","hṛta","noun-adj",""
"5","sīma","SĪM","a","sīmā","noun-adj",""
"6","bhāgyad","BHĀGY","ad","bhāgya","noun-adj",""
"7","āyajana","ĀYAJ","ana","āyajat","noun-adj",""
"8","modana","MODAN","a@","modana","noun-adj",""
"9","rāma","RĀM","a","rāma","noun-adj",""
"10","vākya","VĀKY","a@","vākya","noun-adj",""
"11","leśa","LEŚ","a@","leśa","noun-adj",""
"12","pariśa","PARIŚ","a@","pariśṝ","noun-adj",""
"13","oṣita","OṢIT","a@","oṣita","noun-adj",""
"14","kāma","KĀM","a","kāma","noun-adj",""
"15","sākya","SĀK","ya@","sāka","noun-adj",""
"16","rājakula","RĀJAKUL","a@","rājakula","noun-adj",""
"17","sāgara","SĀGAR","a@","sāgara","noun-adj",""
"18","soma","SOM","a","soma","noun-adj",""
"19","//","","","","punct",""
"","</s>","","","","",""
"","<s number=""17"">","","","","",""
"1","prerita","PRERIT","a@","prerita","noun-adj",""
"2","śāsana","ŚĀSAN","a@","śāsana","noun-adj",""
"3","nīti","NĪT","i@","nīti","noun-adj",""
"4","viśāla","VIŚĀL","a","viśāla","noun-adj",""
"5","dhārita","DHĀRIT","a@","dhārita","noun-adj",""
"6","bodhi","BODH","i@","bodhi","noun-adj",""
"7","mano","MAN","o@","manas","noun-adj",""
"8","hara","HAR","a@","hara","noun-adj",""
"9","mūla","MŪL","a","mūla","noun-adj",""
"10","vārita","VĀRIT","a@","vārita","noun-adj",""
"11","māra","MĀR","a@","māra","noun-adj",""
"12","vadhūjana","VADHŪJAN","a@","vadhūjana","noun-adj",""
"13","līla","LĪL","a","līlā","noun-adj",""
"14","pūrita","PŪRIT","a@","pūrita","noun-adj",""
"15","pāramitā","PĀRAMIT","ā@","pāramitā","noun-adj",""
"16","daśa","DAŚ","a@","daśa","noun-adj",""
"17","śīla","ŚĪL","a","śīla","noun-adj",""
"18","//","","","","punct",""
"","</s>","","","","",""
"","<s number=""18"">","","","","",""
"1","kāma","KĀM","a@","kāma","noun-adj",""
"2","prabhāta","PRABHĀT","a@","prabhāta","noun-adj",""
"3","āraro","ARAR","o@","arara","noun-adj",""
"4","cird","CIR","d","cira","noun-adj",""
"5","dineśa","DINEŚ","a","dineśa","noun-adj",""
"6","hema","HEM","a@","hema","noun-adj",""
"7","prabhā","PRABH","ā@","prabha","noun-adj",""
"8","śobhamāna","ŚOBH","amāna@","śobh","verb",""
"9","pradeśa","PRADEŚ","a","pradeśa","noun-adj",""
"10","śyāma","ŚYĀM","a@","śyāma","noun-adj",""
"11","prabhā","PRABH","ā@","prabha","noun-adj",""
"12","pūraṇān","PŪRAṆ","ān","pūraṇa","noun-adj",""
"13","argha","ARGH","a@","argha","noun-adj",""
"14","keśa","KEŚ","a","keśa","noun-adj",""
"15","vyāmaprabha","VYĀMAPRABH","a@","vyāmaprabhā","noun-adj",""
"16","ālokaka","ĀLOK","aka@","ālokaka","noun-adj",""
"17","prakāśa","PRAKĀŚ","a","prakāśa","noun-adj",""
"18","//","","","","punct",""
"","</s>","","","","",""
"","<s number=""19"">","","","","",""
"1","cīrṇā","CĪR","ṇā","cīra","noun-adj",""
"2","khila","KHIL","a@","khila","noun-adj",""
"3","jñānayo","JÑĀN","ayo","jñāna","noun-adj",""
"4","garddhi","GARDH","i@","gardhi","noun-adj",""
"5","candra","CANDR","a","candra","noun-adj",""
"6","pūrṇā","PŪR","ṇā","pūra","noun-adj",""
"7","dharac","DHAR","ac","dharat","noun-adj",""
"8","ced","","","ced","ind",""
"9","ane","","","","ind",""
"10","rāddha","RĀDDH","a@","rāddha","noun-adj",""
"11","candra","CANDR","a","candra","noun-adj",""
"12","pūrṇa","PŪRṆ","a@","pūrṇa","noun-adj",""
"13","āgama","ĀGAM","a@","āgama","noun-adj",""
"14","khyāta","KHYĀT","a@","khyāta","noun-adj",""
"15","dhīra","DHĪR","a@","dhīra","noun-adj",""
"16","ārddha","ĀRDDH","a@","ārddha","noun-adj",""
"17","candra","CANDR","a","candra","noun-adj",""
"18","ūrṇā","ŪRṆ","ā@","ūrṇā","noun-adj",""
"19","ruci","RUC","i@","ruci","noun-adj",""
"20","ccheda","CHED","a@","cheda","noun-adj",""
"21","bāla","BĀL","a@","bāla","noun-adj",""
"22","ārddha","ĀRDDH","a@","ārddha","noun-adj",""
"23","candra","CANDR","a","candra","noun-adj",""
"24","//","","","","punct",""
"","</s>","","","","",""
"","<s number=""20"">","","","","",""
"1","kumbha","KUMBH","a@","kumbha","noun-adj",""
"2","odaya","UDAY","a@","udaya","noun-adj",""
"3","ādhīśa","ADHĪŚ","a@","adhīśa","noun-adj",""
"4","viśva","VIŚV","a@","viśva","noun-adj",""
"5","tya","TY","a@","tya","noun-adj",""
"6","rāja","RĀJ","a","rājan","noun-adj",""
"7","dambholi","DAMBHOL","i@","dambholi","noun-adj",""
"8","śālī","ŚĀL","ī@","śālī","noun-adj",""
"9","śavi","ŚAV","i@","śavi","noun-adj",""
"10","stutya","STUTY","a@","stutya","noun-adj",""
"11","rāja","RĀJ","a","rājan","noun-adj",""
"12","ambhodhi","AMBHODH","i@","ambhodhi","noun-adj",""
"13","nīkāśa","NĪKĀŚ","a@","nīkāśa","noun-adj",""
"14","satkarmm","SATKARM","m","satkarman","noun-adj",""
"15","arājaś","ARĀJ","aś","arāja","noun-adj",""
"16","ambhodhi","AMBHODH","i@","ambhodhi","noun-adj",""
"17","vāgīśa","VĀGĪŚ","a@","vāgīśa","noun-adj",""
"18","saddharm","SADDHARM","","saddharma","noun-adj",""
"19","arāja","ARĀJ","a","arāja","noun-adj",""
"20","//","","","","punct",""
"","</s>","","","","",""
"","<s number=""21"">","","","","",""
"1","nikuñcad","NIKUÑC","ad","nikuñcat","noun-adj",""
"2","bhava","BHAV","a@","bhava","noun-adj",""
"3","ādīnava","ĀDĪNAV","a@","ādīnava","noun-adj",""
"4","ā","","","alpha_privativum","ind",""
"5","śeṣa","ŚEṢ","a@","śeṣa","noun-adj",""
"6","buddha","BUDDH","a","buddha","noun-adj",""
"7","sad","SAD","@","sat","noun-adj",""
"8","añcad","AÑC","ad","añc","verb",""
"9","guṇa","GUṆ","a@","guṇa","noun-adj",""
"10","āveśa","ĀVEŚ","a@","āveśa","noun-adj",""
"11","śīla","ŚĪL","a@","śīla","noun-adj",""
"12","ādi","ĀD","i@","ādi","noun-adj",""
"13","śuddha","ŚUDDH","a","śuddha","noun-adj",""
"14","viriñcat","VIRIÑCAT","","viriñcatā","noun-adj",""
"15","prabhā","PRABH","ā@","prabha","noun-adj",""
"16","bheda","BHED","a@","bheda","noun-adj",""
"17","śobha","ŚOBH","a@","śobha","noun-adj",""
"18","ādi","ĀD","i@","ādi","noun-adj",""
"19","siddha","SIDDH","a","siddha","noun-adj",""
"20","udañcad","UDAÑC","ad","udañcat","noun-adj",""
"21","mahā","MAH","ā@","mahat","noun-adj",""
"22","ketu","KET","u@","ketu","noun-adj",""
"23","māla","MĀL","a@","māla","noun-adj",""
"24","ānubaddha","ANUBADDH","a","anubaddha","noun-adj",""
"25","//","","","","punct",""
"","</s>","","","","",""
"","<s number=""22"">","","","","",""
"1","anusamaya","ANUSAM","aya","anusama","noun-adj",""
"2","śubha","ŚUBH","a@","śubha","noun-adj",""
"3","sāra","SĀR","a@","sāra","noun-adj",""
"4","bhāṣaṇa","BHĀṢ","aṇa","bhāṣa","noun-adj",""
"5","atula","ATUL","a@","atula","noun-adj",""
"6","guṇa","GUṆ","a@","guṇa","noun-adj",""
"7","dhara","DHAR","a","dhara","noun-adj",""
"8","vīta","VĪT","a@","vīta","noun-adj",""
"9","bhīṣaṇa","BHĪṢAṆ","a","bhīṣaṇa","noun-adj",""
"10","atimalina","ATIMAL","ina","atimalate","noun-adj",""
"11","bhava","BHAV","a@","bhava","noun-adj",""
"12","rāga","RĀG","a@","rāga","noun-adj",""
"13","roṣaṇa","ROṢ","aṇa","roṣa","noun-adj",""
"14","a","","","alpha_privativum","ind",""
"15","parami","PARAM","i@","parama","noun-adj",""
"16","tavara","TAVAR","a@","tavara","noun-adj",""
"17","śīla","ŚĪL","a@","śīla","noun-adj",""
"18","bhūṣaṇa","BHŪṢAṆ","a","bhūṣaṇa","noun-adj",""
"19","//","","","","punct",""
"","</s>","","","","",""
"","<s number=""23"">","","","","",""
"1","prasuta","PRAS","uta","prasu","noun-adj",""
"2","prahita","PRAHIT","a","prahita","noun-adj",""
"3","prasava","PRASAV","a","prasava","noun-adj",""
"4","pracala","PRACAL","a","pracala","noun-adj",""
"5","prathita","PRATHIT","a","prathita","noun-adj",""
"6","praguṇa","PRAGUṆ","a","praguṇa","noun-adj",""
"7","pramada","PRAMAD","a","pramadā","noun-adj",""
"8","praphala","PRAPHAL","a","praphalati","noun-adj",""
"9","praṇata","PRAṆAT","a@","praṇata","noun-adj",""
"10","pracura","PRACUR","a","pracura","noun-adj",""
"11","prabha","PRABH","a@","prabha","noun-adj",""
"12","vapra","VAPR","a@","vapra","noun-adj",""
"13","dala","DAL","a","dala","noun-adj",""
"14","prakaṭa","PRAKAṬ","a@","prakaṭa","noun-adj",""
"15","praṇaya","PRAṆAY","a","praṇaya","noun-adj",""
"16","pratima","PRATIM","a","pratima","noun-adj",""
"17","prabala","PRABAL","a","prabala","noun-adj",""
"18","//","","","","punct",""
"","</s>","","","","",""
"","<s number=""24"">","","","","",""
"1","nistāri","NISTĀR","i@","nistāra","noun-adj",""
"2","vikhyāta","VIKHYĀT","a@","vikhyāta","noun-adj",""
"3","viśvajana","VIŚVAJ","ana","viśvajū","noun-adj",""
"4","śaraṇa","ŚARAṆ","a","śaraṇa","noun-adj",""
"5","as","","","","ind",""
"6","tāri","TĀR","i@","tāri","noun-adj",""
"7","sad","SAD","@","sat","noun-adj",""
"8","dhīra","DHĪR","a@","dhīra","noun-adj",""
"9","vṛnda","VṚND","a@","vṛnda","noun-adj",""
"10","śiva","ŚIV","a@","śiva","noun-adj",""
"11","karaṇa","KARAṆ","a","karaṇa","noun-adj",""
"12","śasta","ŚAST","a@","śasta","noun-adj",""
"13","āria","ĀRI","a@","āria","noun-adj",""
"14","sat","SAT","@","sat","noun-adj",""
"15","tyāga","TYĀG","a@","tyāga","noun-adj",""
"16","siddha","SIDDH","a@","siddha","noun-adj",""
"17","kara","KAR","a@","kara","noun-adj",""
"18","caraṇa","CARAṆ","a","caraṇa","noun-adj",""
"19","vistāri","VISTĀR","i@","vistārin","noun-adj",""
"20","ṣaḍ","ṢAḌ","@","ṣaḍi","noun-adj",""
"21","bheda","BHED","a@","bheda","noun-adj",""
"22","varṇa","VARṆ","a@","varṇa","noun-adj",""
"23","vara","VAR","a@","vara","noun-adj",""
"24","kiraṇa","KIRAṆ","a","kiraṇa","noun-adj",""
"25","//","","","","punct",""
"","</s>","","","","",""
"","<s number=""25"">","","","","",""
"1","vyaktika","VYAKT","ika@","vyaktika","noun-adj",""
"2","ravi","RAV","i@","ravi","noun-adj",""
"3","nyāsa","NYĀS","a@","nyāsa","noun-adj",""
"4","sādhu","SĀDH","u@","sādhu","noun-adj",""
"5","jana","JAN","a@","jana","noun-adj",""
"6","saṅga","SAṄG","a","saṅga","noun-adj",""
"7","bhakti","BHAK","ti","bhakṣ","noun-adj",""
"8","kara","KAR","a@","kara","noun-adj",""
"9","sammānana","SAMMĀNAN","a@","sammānana","noun-adj",""
"10","ādi","ĀD","i@","ādi","noun-adj",""
"11","madhu","MADH","u@","madhu","noun-adj",""
"12","bhṛṅga","BHṚṄG","a","bhṛṅga","noun-adj",""
"13","bhakti","BHAKT","i@","bhakti","noun-adj",""
"14","dhara","DHAR","a@","dhara","noun-adj",""
"15","saṃsāra","SAṂSĀR","a@","saṃsāra","noun-adj",""
"16","bheda","BHED","a@","bheda","noun-adj",""
"17","raṇa","RAṆ","a@","raṇa","noun-adj",""
"18","raṅga","RAṄG","a","raṅga","noun-adj",""
"19","mukti","MUKT","i@","mukti","noun-adj",""
"20","pura","PUR","a@","pura","noun-adj",""
"21","kalyāṇa","KALYĀṆ","a@","kalyāṇa","noun-adj",""
"22","moda","MOD","a@","moda","noun-adj",""
"23","muni","MUN","i@","muni","noun-adj",""
"24","tuṅga","TUṄG","a","tuṅga","noun-adj",""
"25","//","","","","punct",""
"","</s>","","","","",""
"","<s number=""26"">","","","","",""
"1","sa","","","sa_saha","ind",""
"2","rasi","RAS","i@","rasi","noun-adj",""
"3","ja","J","a","ja","noun-adj",""
"4","niśruta","NIŚRUT","a","niśruta","noun-adj",""
"5","viracita","VIRACIT","a@","viracita","noun-adj",""
"6","tantra","TANTR","a","tad","pron",""
"7","sapadi","SAPAD","i@","sapadi","noun-adj",""
"8","tiraskṛtabh","TIRASKṚT","abh","tiraskṛta","noun-adj",""
"9","avabhaya","AVABH","aya","avabh","verb",""
"10","yantra","YANTR","a","yantra","noun-adj",""
"11","budhajana","BUDHAJAN","a@","budhajana","noun-adj",""
"12","śikṣita","ŚIKṢIT","a@","śikṣita","noun-adj",""
"13","bahuvidha","BAHUVIDH","a@","bahuvidha","noun-adj",""
"14","tantra","TANTR","a","tad","pron",""
"15","tribhuvana","TRIBHUVAN","a@","tribhuvana","noun-adj",""
"16","viśruta","VIŚRUT","a@","viśruta","noun-adj",""
"17","nava","NAV","a@","nava","noun-adj",""
"18","guṇa","GUṆ","a@","guṇa","noun-adj",""
"19","mantra","MANTR","a","mantra","noun-adj",""
"20","//","","","","punct",""
"","</s>","","","","",""
"","<s number=""27"">","","","","",""
"1","bahu","BAH","u@","bahu","noun-adj",""
"2","lola","LOL","a@","lola","noun-adj",""
"3","katha","","","","ind",""
"4","nīya","NĪY","a@","nīya","noun-adj",""
"5","rāva","RĀV","a@","rāva","noun-adj",""
"6","ādhi","ĀDH","i@","ādhi","noun-adj",""
"7","rāva","RĀV","a","rāva","noun-adj",""
"8","guṇa","GUṆ","a@","guṇa","noun-adj",""
"9","śīlam","ŚĪL","am","śīla","noun-adj",""
"10","a","","","alpha_privativum","ind",""
"11","hanīyase","HANĪ","yase","hanīa","noun-adj",""
"12","vādhi","VĀDH","i@","vādhi","noun-adj",""
"13","seva","SEV","a","sevā","noun-adj",""
"14","a","","","alpha_privativum","ind",""
"15","vipāka","VIPĀK","a@","vipāka","noun-adj",""
"16","ramaṇīya","RAMAṆĪY","a@","ramaṇīya","noun-adj",""
"17","bhāva","BHĀV","a@","bhāva","noun-adj",""
"18","ādhi","ĀDH","i@","ādhi","noun-adj",""
"19","bhāva","BHĀV","a","bhāva","noun-adj",""
"20","jagada","JAGAD","a@","jagat","noun-adj",""
"21","ekaga","EKAG","a@","ekaga","noun-adj",""
"22","raṇī","RAṆ","ī@","raṇī","noun-adj",""
"23","yade","YAD","e","yadi","noun-adj",""
"24","vādhi","VĀDH","i@","vādhi","noun-adj",""
"25","deva","DEV","a","deva","noun-adj",""
"26","//","","","","punct",""
"","</s>","","","","",""
"","<s number=""28"">","","","","",""
"1","tapana","TAPAN","a@","tapana","noun-adj",""
"2","śaśi","ŚAŚ","i@","śaśi","noun-adj",""
"3","śikhi","ŚIKH","i@","śikhi","noun-adj",""
"4","mahas","MAH","as","mahat","noun-adj",""
"5","satya","SATY","a@","satya","noun-adj",""
"6","āvabodhana","AVABODHAN","a","avabodhana","noun-adj",""
"7","a","","","alpha_privativum","ind",""
"8","naya","NAY","a@","naya","noun-adj",""
"9","kula","KUL","a@","kula","noun-adj",""
"10","maya","MAY","a@","maya","noun-adj",""
"11","tapas","TAP","as","tapas","noun-adj",""
"12","sat","SAT","@","sat","noun-adj",""
"13","yāva","YĀV","a@","yāva","noun-adj",""
"14","bādhana","BĀDH","ana","bādhat","noun-adj",""
"15","aparimita","APARIMIT","a@","aparimita","noun-adj",""
"16","guṇa","GUṆ","a@","guṇa","noun-adj",""
"17","vacasa","VACAS","a@","vacasa","noun-adj",""
"18","sat","SAT","@","sat","noun-adj",""
"19","yāva","YĀV","a@","yāva","noun-adj",""
"20","sādhana","SĀDHAN","a","sādhana","noun-adj",""
"21","sakala","SAKAL","a@","sakala","noun-adj",""
"22","jana","JAN","a@","jana","noun-adj",""
"23","hita","HIT","a@","hita","noun-adj",""
"24","catus","CAT","us","catur","noun-adj",""
"25","satya","SATY","a@","satya","noun-adj",""
"26","āvabodhana","AVABODHAN","a","avabodhana","noun-adj",""
"27","//","","","","punct",""
"","</s>","","","","",""
"","<s number=""29"">","","","","",""
"1","a","","","alpha_privativum","ind",""
"2","gatilaka","GAT","ilaka","gata","noun-adj",""
"3","tala","TAL","a@","tala","noun-adj",""
"4","narmm","NARM","m","narma","noun-adj",""
"5","acakra","ACAKR","a@","acakra","noun-adj",""
"6","pramarddana","PRAMARDAN","a","pramardana","noun-adj",""
"7","suga","SUG","a@","suga","noun-adj",""
"8","tikara","TIKAR","a@","tikara","noun-adj",""
"9","bahukarmm","BAHUKARM","m","bahukarma","noun-adj",""
"10","acakra","ACAKR","a@","acakra","noun-adj",""
"11","pravard","PRAVAR","d","pravara","noun-adj",""
"12","dhana","DHAN","a","dhana","noun-adj",""
"13","dug","","","","ind",""
"14","atimay","ATIMAY","","atimaya","noun-adj",""
"15","abhia","ABHI","a@","abhia","noun-adj",""
"16","vakarmm","VAKARM","m","vakarma","noun-adj",""
"17","acakra","ACAKR","a@","acakra","noun-adj",""
"18","pramarddana","PRAMARDAN","a","pramardana","noun-adj",""
"19","agati","AGATI","","agati","noun-adj",""
"20","kṛta","KṚT","a@","kṛta","noun-adj",""
"21","varadharm","VARADHARM","","varadharma","noun-adj",""
"22","acakra","ACAKR","a@","acakra","noun-adj",""
"23","pravarttana","PRAVARTAN","a","pravartana","noun-adj",""
"24","//","","","","punct",""
"","</s>","","","","",""
"","<s number=""30"">","","","","",""
"1","siddha","SIDDH","a@","siddha","noun-adj",""
"2","āgama","ĀGAM","a@","āgama","noun-adj",""
"3","sadbhāva","SADBHĀV","a@","sadbhāva","noun-adj",""
"4","nasu","NAS","u@","nasa","noun-adj",""
"5","jñāpita","JÑĀPIT","a@","jñāpita","noun-adj",""
"6","pāka","PĀK","a","pāka","noun-adj",""
"7","buddha","BUDDH","a@","buddha","noun-adj",""
"8","āgamavi","ĀGAMAV","i@","āgamavat","noun-adj",""
"9","khyā","KHY","ā@","khyā","noun-adj",""
"10","pana","PAN","a@","pana","noun-adj",""
"11","vijñāpita","VIJÑĀPIT","a@","vijñāpita","noun-adj",""
"12","nāka","NĀK","a","nāka","noun-adj",""
"13","śuddha","ŚUDDH","a@","śuddha","noun-adj",""
"14","āgamavi","ĀGAMAV","i@","āgamavat","noun-adj",""
"15","spha","SPH","a@","spha","noun-adj",""
"16","āraṇa","ĀRAṆ","a@","āraṇa","noun-adj",""
"17","vidhmā","VIDH","mā","vidha","noun-adj",""
"18","pita","PIT","a@","pitṛ","noun-adj",""
"19","śoka","ŚOK","a","śoka","noun-adj",""
"20","ṛddhy","ṚDDH","y@","ṛddhi","noun-adj",""
"21","āgama","ĀGAM","a@","āgama","noun-adj",""
"22","vistāraṇa","VISTĀR","aṇa","vistāra","noun-adj",""
"23","vijñāpita","VIJÑĀPIT","a@","vijñāpita","noun-adj",""
"24","loka","LOK","a","loka","noun-adj",""
"25","//","","","","punct",""
"","</s>","","","","",""
"","<s number=""31"">","","","","",""
"1","mṛtasa","MṚT","asa","mṛta","noun-adj",""
"2","mṛnmayānn","MṚNMAY","ānn","mṛnmaya","noun-adj",""
"3","apātra","APĀTR","a@","apātra","noun-adj",""
"4","labdha","LABDH","a@","labdha","noun-adj",""
"5","devata","DEVAT","a@","devatā","noun-adj",""
"6","āñcana","ĀÑCAN","a","āñcana","noun-adj",""
"7","vatsalat","VATSAL","at","vatsala","noun-adj",""
"8","vadhām","VADH","ām","vadhā","noun-adj",""
"9","a","","","alpha_privativum","ind",""
"10","gātra","GĀTR","a@","gātra","noun-adj",""
"11","lupta","LUPT","a@","lupta","noun-adj",""
"12","śobha","ŚOBH","a@","śobha","noun-adj",""
"13","kāñcana","KĀÑCAN","a","kāñcana","noun-adj",""
"14","utsa","UTS","a@","utsa","noun-adj",""
"15","vṛndaśīta","VṚNDAŚ","īta@","vṛndaśas","noun-adj",""
"16","mañju","MAÑJ","u@","mañju","noun-adj",""
"17","citra","CITR","a@","citra","noun-adj",""
"18","jātiv","JĀT","iv","jāta","noun-adj",""
"19","āñcana","ĀÑCAN","a","āñcana","noun-adj",""
"20","sat","SAT","@","sat","noun-adj",""
"21","samanta","SAM","anta","sam","verb",""
"22","kūṭa","KŪṬ","a@","kūṭa","noun-adj",""
"23","śṛṅga","ŚṚṄG","a@","śṛṅga","noun-adj",""
"24","datta","DATT","a@","datta","noun-adj",""
"25","pāda","PĀD","a@","pāda","noun-adj",""
"26","lāñchana","LĀÑCHAN","a","lāñchana","noun-adj",""
"27","//","","","","punct",""
"","</s>","","","","",""
"","<s number=""32"">","","","","",""
"1","prathita","PRATHIT","a@","prathita","noun-adj",""
"2","carita","CARIT","a@","carita","noun-adj",""
"3","saṅga","SAṄG","a@","saṅga","noun-adj",""
"4","gīti","GĪT","i@","gīti","noun-adj",""
"5","vītaka","VĪTAK","a@","vītaka","noun-adj",""
"6","dana","DAN","a","danu","noun-adj",""
"7","amita","AMIT","a@","amita","noun-adj",""
"8","vimala","VIMAL","a@","vimala","noun-adj",""
"9","dharmma","DHARM","a@","dharma","noun-adj",""
"10","śīlani","ŚĪLAN","i","śīlana","noun-adj",""
"11","iti","","","iti","ind",""
"12","sadana","SADAN","a","sadana","noun-adj",""
"13","ba","","","","ind",""
"14","hula","HUL","a@","hula","noun-adj",""
"15","dhavala","DHAVAL","a@","dhavala","noun-adj",""
"16","puñja","PUÑJ","a@","puñja","noun-adj",""
"17","hāra","HĀR","a@","hāra","noun-adj",""
"18","cāru","CĀR","u@","cāru","noun-adj",""
"19","radana","RADAN","a","radana","noun-adj",""
"20","śiśira","ŚIŚIR","a@","śiśira","noun-adj",""
"21","kiraṇa","KIRAṆ","a@","kiraṇa","noun-adj",""
"22","maṇḍala","MAṆḌAL","a@","maṇḍala","noun-adj",""
"23","ābhirāma","ABHIRĀM","a@","abhirāma","noun-adj",""
"24","vadana","VADAN","a","vadana","noun-adj",""
"25","//","","","","punct",""
"","</s>","","","","",""
"","<s number=""33"">","","","","",""
"1","jāta","JĀT","a@","jāta","noun-adj",""
"2","divasī","DIVAS","ī@","divasa","noun-adj",""
"3","yama","YAM","a@","yama","noun-adj",""
"4","hama","HAM","a@","hama","noun-adj",""
"5","odita","UDIT","a@","udita","noun-adj",""
"6","pitā","PIT","ā@","pitṛ","noun-adj",""
"7","maha","MAH","a","mahat","noun-adj",""
"8","vīta","VĪT","a@","vīta","noun-adj",""
"9","mala","MAL","a@","mala","noun-adj",""
"10","loka","LOK","a@","loka","noun-adj",""
"11","hita","HIT","a@","hita","noun-adj",""
"12","pūta","PŪT","a@","pūta","noun-adj",""
"13","kuśala","KUŚAL","a@","kuśala","noun-adj",""
"14","āvaha","ĀVAH","a","āvaha","noun-adj",""
"15","bāhu","BĀH","u@","bāhu","noun-adj",""
"16","bala","BAL","a@","bala","noun-adj",""
"17","ghora","GHOR","a@","ghora","noun-adj",""
"18","raṇa","RAṆ","a@","raṇa","noun-adj",""
"19","māraba","MĀR","aba","māra","noun-adj",""
"20","huvī","HUV","ī@","huvā","noun-adj",""
"21","raha","RAH","a","raha","noun-adj",""
"22","rāhu","RĀH","u@","rāhu","noun-adj",""
"23","nayanā","NAYAN","ā@","nayana","noun-adj",""
"24","viṣaya","VIṢAY","a@","viṣaya","noun-adj",""
"25","pāda","PĀD","a@","pāda","noun-adj",""
"26","sarasī","SARAS","ī@","sarasī","noun-adj",""
"27","ruha","RUH","a","ruha","noun-adj",""
"28","//","","","","punct",""
"","</s>","","","","",""
"","<s number=""34"">","","","","",""
"1","prema","PREM","a@","prema","noun-adj",""
"2","pūga","PŪG","a@","pūga","noun-adj",""
"3","sīma","SĪM","a@","sīmā","noun-adj",""
"4","bhūri","BHŪR","i@","bhūri","noun-adj",""
"5","soma","SOM","a@","soma","noun-adj",""
"6","sāra","SĀR","a@","sāra","noun-adj",""
"7","vācana","VĀCAN","a","vācana","noun-adj",""
"8","bhīma","BHĪM","a@","bhīma","noun-adj",""
"9","bhiāvabhām","BHIĀVABH","ām","bhiāvabhā","noun-adj",""
"10","a","","","alpha_privativum","ind",""
"11","rāga","RĀG","a@","rāga","noun-adj",""
"12","nāmarūpa","NĀMARŪP","a@","nāmarūpa","noun-adj",""
"13","sūdana","SŪDAN","a","sūdana","noun-adj",""
"14","vāma","VĀM","a@","vāma","noun-adj",""
"15","deva","DEV","a@","deva","noun-adj",""
"16","kāmanāt","KĀM","anāt","kāmat","noun-adj",""
"17","hasām","HAS","ām","hasā","noun-adj",""
"18","ap","","","api","ind",""
"19","ādaro","ĀDAR","o@","ādara","noun-adj",""
"20","dhana","DHAN","a","dhana","noun-adj",""
"21","he","","","","ind",""
"22","marāś","MAR","āś","mara","noun-adj",""
"23","idhām","IDH","ām","idhā","noun-adj",""
"24","a","","","alpha_privativum","ind",""
"25","cāru","CĀR","u@","cāru","noun-adj",""
"26","nāmarūpa","NĀMARŪP","a@","nāmarūpa","noun-adj",""
"27","śobhana","ŚOBHAN","a","śobhana","noun-adj",""
"28","//","","","","punct",""
"","</s>","","","","",""
"","<s number=""35"">","","","","",""
"1","vāda","VĀD","a@","vāda","noun-adj",""
"2","baddha","BADDH","a@","baddha","noun-adj",""
"3","visphurat","VISPHUR","at","visphurat","noun-adj",""
"4","kudṛṣṭi","KUDṚṢṬ","i@","kudṛṣṭi","noun-adj",""
"5","dṛṣṭi","DṚṢṬ","i@","dṛṣṭi","noun-adj",""
"6","sañcaya","SAṂCAY","a","saṃcaya","noun-adj",""
"7","bheda","BHED","a@","bheda","noun-adj",""
"8","citta","CITT","a@","citta","noun-adj",""
"9","sambhava","SAMBHAV","a@","sambhava","noun-adj",""
"10","prapañca","PRAPAÑC","a@","prapañca","noun-adj",""
"11","patti","PATT","i@","patti","noun-adj",""
"12","sañcaya","SAṂCAY","a","saṃcaya","noun-adj",""
"13","pādapadma","PĀDAPADM","a@","pādapadma","noun-adj",""
"14","sañcarat","SAÑCAR","at","sañcarat","noun-adj",""
"15","praphulla","PRAPHULL","a@","praphulla","noun-adj",""
"16","padma","PADM","a@","padma","noun-adj",""
"17","sañcaya","SAṂCAY","a","saṃcaya","noun-adj",""
"18","veda","VED","a@","veda","noun-adj",""
"19","siddha","SIDDH","a@","siddha","noun-adj",""
"20","śemuṣī","ŚEMUṢ","ī@","śemuṣī","noun-adj",""
"21","prabha","PRABH","a@","prabha","noun-adj",""
"22","gna","GN","a@","gnā","noun-adj",""
"23","bhedya","BHEDY","a@","bhedya","noun-adj",""
"24","sañcaya","SAṂCAY","a","saṃcaya","noun-adj",""
"25","//","","","","punct",""
"","</s>","","","","",""
"","<s number=""36"">","","","","",""
"1","a","","","alpha_privativum","ind",""
"2","khila","KHIL","a@","khila","noun-adj",""
"3","loka","LOK","a@","loka","noun-adj",""
"4","pūjita","PŪJIT","a@","pūjita","noun-adj",""
"5","prahita","PRAHIT","a@","prahita","noun-adj",""
"6","sarvaśo","SARV","aśo","sarva","noun-adj",""
"7","cana","CAN","a","cana","noun-adj",""
"8","sa","","","sa_saha","ind",""
"9","kalata","KALAT","a@","kalata","noun-adj",""
"10","āpave","APAV","e","apava","noun-adj",""
"11","dana","DAN","a@","danu","noun-adj",""
"12","prabhava","PRABHAV","a@","prabhava","noun-adj",""
"13","saṅgamo","SAṂGAM","o@","saṃgama","noun-adj",""
"14","cana","CAN","a","cana","noun-adj",""
"15","madhura","MADHUR","a@","madhura","noun-adj",""
"16","sāra","SĀR","a@","sāra","noun-adj",""
"17","śītala","ŚĪTAL","a@","śītala","noun-adj",""
"18","prakaṭa","PRAKAṬ","a@","prakaṭa","noun-adj",""
"19","bhavya","BHAVY","a@","bhavya","noun-adj",""
"20","vācana","VĀCAN","a","vācana","noun-adj",""
"21","nirva","NIRV","a@","nirva","noun-adj",""
"22","śeṣa","ŚEṢ","a@","śeṣa","noun-adj",""
"23","gocara","GOCAR","a@","gocara","noun-adj",""
"24","pratat","PRAT","at","pratat","noun-adj",""
"25","abuddhi","ABUDDH","i@","abuddhi","noun-adj",""
"26","locana","LOCAN","a","locana","noun-adj",""
"27","//","","","","punct",""
"","</s>","","","","",""
"","<s number=""37"">","","","","",""
"1","kiraṇani","KIRAṆ","ani","kiraṇat","noun-adj",""
"2","vaha","VAH","a@","vaha","noun-adj",""
"3","pramaṇḍita","PRAMAṆḌIT","a@","pramaṇḍita","noun-adj",""
"4","vitata","VITAT","a@","vitata","noun-adj",""
"5","puṣkara","PUṢKAR","a","puṣkara","noun-adj",""
"6","kaluṣa","KALUṢ","a@","kaluṣa","noun-adj",""
"7","haraṇa","HARAṆ","a@","haraṇa","noun-adj",""
"8","sphuran","SPHUR","an","sphurat","noun-adj",""
"9","nava","NAV","a@","nava","noun-adj",""
"10","lalita","LALIT","a@","lalita","noun-adj",""
"11","puṣkara","PUṢKAR","a","puṣkara","noun-adj",""
"12","gamana","GAMAN","a@","gamana","noun-adj",""
"13","samaya","SAMAY","a@","samaya","noun-adj",""
"14","svayan","SV","ayan","sva","noun-adj",""
"15","nadad","NAD","ad","nadat","noun-adj",""
"16","amita","AMIT","a@","amita","noun-adj",""
"17","puṣkara","PUṢKAR","a","puṣkara","noun-adj",""
"18","sakala","SAKAL","a@","sakala","noun-adj",""
"19","bhuvana","BHUVAN","a@","bhuvana","noun-adj",""
"20","priyaṅ","PRIY","aṅ","priya","noun-adj",""
"21","kara","KAR","a@","kara","noun-adj",""
"22","caraṇa","CARAṆ","a@","caraṇa","noun-adj",""
"23","puṣkara","PUṢKAR","a","puṣkara","noun-adj",""
"24","//","","","","punct",""
"","</s>","","","","",""
"","<s number=""38"">","","","","",""
"1","nitya","NITY","a@","nitya","noun-adj",""
"2","peśalan","PEŚAL","an","peśala","noun-adj",""
"3","ity","","","iti","ind",""
"4","a","","","alpha_privativum","ind",""
"5","dakṣiṇa","DAKṢIṆ","a@","dakṣiṇa","noun-adj",""
"6","nitya","NITY","a@","nitya","noun-adj",""
"7","bhāva","BHĀV","a@","bhāva","noun-adj",""
"8","tathāgata","TATHĀGAT","a","tathāgata","noun-adj",""
"9","nity","NITY","","nitya","noun-adj",""
"10","abhia","ABHI","a@","abhia","noun-adj",""
"11","āsura","ĀSUR","a@","āsura","noun-adj",""
"12","nityade","NITYAD","e","nityadā","noun-adj",""
"13","śita","ŚIT","a@","śita","noun-adj",""
"14","nityabhāva","NITYABHĀV","a@","nityabhāva","noun-adj",""
"15","tathāgata","TATHĀGAT","a","tathāgata","noun-adj",""
"16","nitya","NITY","a@","nitya","noun-adj",""
"17","vismaya","VISMAY","a@","vismaya","noun-adj",""
"18","nitya","NITY","a@","nitya","noun-adj",""
"19","vatsala","VATSAL","a@","vatsala","noun-adj",""
"20","nitya","NITY","a@","nitya","noun-adj",""
"21","moda","MOD","a@","moda","noun-adj",""
"22","tathāgata","TATHĀGAT","a","tathāgata","noun-adj",""
"23","nitya","NITY","a@","nitya","noun-adj",""
"24","maṅgalan","MAṄGAL","an","maṅgalat","noun-adj",""
"25","ity","","","iti","ind",""
"26","a","","","alpha_privativum","ind",""
"27","sundaran","SUNDAR","an","sundarat","noun-adj",""
"28","ity","","","iti","ind",""
"29","apūjya","","","","ind",""
"30","tathāgata","TATHĀGAT","a","tathāgata","noun-adj",""
"31","//","","","","punct",""
"","</s>","","","","",""
"","<s number=""39"">","","","","",""
"1","trividhaś","TRIVIDH","aś","trividha","noun-adj",""
"2","ubha","UBH","a@","ubha","noun-adj",""
"3","calana","CALAN","a@","calana","noun-adj",""
"4","vara","VAR","a@","vara","noun-adj",""
"5","jala","JAL","a@","jala","noun-adj",""
"6","ja","J","a","ja","noun-adj",""
"7","nibha","NIBH","a@","nibha","noun-adj",""
"8","yugala","YUGAL","a","yugala","noun-adj",""
"9","vinaya","VINAY","a@","vinaya","noun-adj",""
"10","maya","MAY","a@","maya","noun-adj",""
"11","vividham","VIVIDH","am","vividha","noun-adj",""
"12","anusamita","ANUSAM","ita@","anusama","noun-adj",""
"13","durita","DURIT","a@","durita","noun-adj",""
"14","gala","GAL","a","gala","noun-adj",""
"15","mathita","MATHIT","a@","mathita","noun-adj",""
"16","bahu","BAH","u@","bahu","noun-adj",""
"17","viṣaya","VIṢAY","a@","viṣaya","noun-adj",""
"18","bhara","BHAR","a@","bhara","noun-adj",""
"19","bharita","BHARIT","a@","bharita","noun-adj",""
"20","bhavani","BHAVAN","i@","bhavani","noun-adj",""
"21","gala","GAL","a","gala","noun-adj",""
"22","praṇata","PRAṆA","ta","praṇā","noun-adj",""
"23","sura","SUR","a@","sura","noun-adj",""
"24","makuṭa","MAKUṬ","a@","makuṭa","noun-adj",""
"25","maṇi","MAṆ","i@","maṇi","noun-adj",""
"26","ghaṭita","GHAṬIT","a@","ghaṭita","noun-adj",""
"27","pada","PAD","a@","pada","noun-adj",""
"28","yugala","YUGAL","a","yugala","noun-adj",""
"29","//","","","","punct",""
"","</s>","","","","",""
"","<s number=""40"">","","","","",""
"1","he","","","","ind",""
"2","lāvi","LĀV","i@","lāvi","noun-adj",""
"3","racita","RACIT","a@","racita","noun-adj",""
"4","dola","DOL","a@","dola","noun-adj",""
"5","āyita","ĀYIT","a@","āyita","noun-adj",""
"6","jana","JAN","a@","jana","noun-adj",""
"7","mūla","MŪL","a@","mūla","noun-adj",""
"8","āgama","ĀGAM","a@","āgama","noun-adj",""
"9","vidhi","VIDH","i@","vidhi","noun-adj",""
"10","dīpana","DĪPAN","a@","dīpana","noun-adj",""
"11","vāṭa","VĀṬ","a","vāṭa","noun-adj",""
"12","hālāhala","HĀLĀHAL","a@","hālāhala","noun-adj",""
"13","nibhaśā","NIBH","aśā","nibha","noun-adj",""
"14","lābhava","LĀBHAV","a@","lābhavat","noun-adj",""
"15","śubha","ŚUBH","a@","śubha","noun-adj",""
"16","līlā","LĪL","ā@","līlā","noun-adj",""
"17","vidalana","VIDALAN","a@","vidalana","noun-adj",""
"18","śāsana","ŚĀSAN","a@","śāsana","noun-adj",""
"19","jhāṭa","JHĀṬ","a","jhāṭa","noun-adj",""
"20","bālāna","BĀL","āna","bāla","noun-adj",""
"21","yamati","YAMAT","i@","yamatā","noun-adj",""
"22","jāla","JĀL","a@","jāla","noun-adj",""
"23","ādara","ĀDAR","a@","ādara","noun-adj",""
"24","hara","HAR","a@","hara","noun-adj",""
"25","śīla","ŚĪL","a@","śīla","noun-adj",""
"26","āyudha","ĀYUDH","a@","āyudha","noun-adj",""
"27","dhara","DHAR","a@","dhara","noun-adj",""
"28","vārida","VĀRID","a@","vārida","noun-adj",""
"29","kūṭa","KŪṬ","a","kūṭa","noun-adj",""
"30","kolāhala","KOLĀHAL","a@","kolāhala","noun-adj",""
"31","kara","KAR","a@","kara","noun-adj",""
"32","nālā","NĀL","ā@","nālā","noun-adj",""
"33","giri","GIR","i@","giri","noun-adj",""
"34","gaja","GAJ","a@","gaja","noun-adj",""
"35","kāla","KĀL","a@","kāla","noun-adj",""
"36","ākṛtimad","ĀKṚT","imad","ākṛtimat","noun-adj",""
"37","avega","AVEG","a@","avegāyati","noun-adj",""
"38","vighāṭa","VIGHĀṬ","a","vighāṭ","verb",""
"39","//","","","","punct",""
"","</s>","","","","",""
"","<s number=""41"">","","","","",""
"1","vana","VAN","a@","vana","noun-adj",""
"2","mudita","MUDIT","a@","mudita","noun-adj",""
"3","vispaṣṭa","VISPAṢṬ","a@","vispaṣṭa","noun-adj",""
"4","madhura","MADHUR","a@","madhura","noun-adj",""
"5","tara","TAR","a@","tara","noun-adj",""
"6","nāda","NĀD","a","nāda","noun-adj",""
"7","jana","JAN","a@","jana","noun-adj",""
"8","hṛdayam","HṚDAY","am","hṛdaya","noun-adj",""
"9","addhy","ADDH","y@","addhi","noun-adj",""
"10","astha","ASTH","a@","astha","noun-adj",""
"11","kamala","KAMAL","a@","kamala","noun-adj",""
"12","mṛdu","MṚD","u@","mṛdu","noun-adj",""
"13","pāda","PĀD","a","pāda","noun-adj",""
"14","vinaya","VINAY","a@","vinaya","noun-adj",""
"15","balavic","BALAV","ic","balavat","noun-adj",""
"16","cin","","","cid","ind",""
"17","na","","","na","ind",""
"18","durita","DUR","ita@","dura","noun-adj",""
"19","kulabheda","KULABH","eda","kulabha","noun-adj",""
"20","an","","","alpha_privativum","ind",""
"21","avarata","AVARAT","a@","avarata","noun-adj",""
"22","sad","SAD","@","sat","noun-adj",""
"23","dharmma","DHARM","a@","dharma","noun-adj",""
"24","vitaraṇa","VITARAṆ","a@","vitaraṇa","noun-adj",""
"25","vinoda","VINOD","a","vinoda","noun-adj",""
"26","//","","","","punct",""
"","</s>","","","","",""
"","<s number=""42"">","","","","",""
"1","aruṇa","ARUṆ","a@","aruṇa","noun-adj",""
"2","pada","PAD","a@","pada","noun-adj",""
"3","tala","TAL","a@","tala","noun-adj",""
"4","sakala","SAKAL","a@","sakala","noun-adj",""
"5","viṣayaka","VIṢAY","aka@","viṣayaka","noun-adj",""
"6","vimala","VIMAL","a@","vimala","noun-adj",""
"7","daśa","DAŚ","a@","daśa","noun-adj",""
"8","vidham","VIDH","am","vidha","noun-adj",""
"9","ati","","","","ind",""
"10","bala","BAL","a","bala","noun-adj",""
"11","karuṇa","KARUṆ","a@","karuṇā","noun-adj",""
"12","jalanidhi","JALANIDH","i@","jalanidhi","noun-adj",""
"13","lahari","LAHAR","i@","lahari","noun-adj",""
"14","parikara","PARIKAR","a@","parikara","noun-adj",""
"15","satatakuśa","SATATAK","uśa","satataka","noun-adj",""
"16","lita","LIT","a@","lita","noun-adj",""
"17","mahitala","MAHIT","ala","mahitat","noun-adj",""
"18","viśada","VIŚAD","a@","viśada","noun-adj",""
"19","dina","DIN","a@","dina","noun-adj",""
"20","maṇi","MAṆ","i@","maṇi","noun-adj",""
"21","kiraṇa","KIRAṆ","a@","kiraṇa","noun-adj",""
"22","vikasita","VIKASIT","a@","vikasita","noun-adj",""
"23","kamala","KAMAL","a@","kamala","noun-adj",""
"24","mṛdu","MṚD","u@","mṛdu","noun-adj",""
"25","tala","TAL","a@","tala","noun-adj",""
"26","kara","KAR","a@","kara","noun-adj",""
"27","tala","TAL","a","tala","noun-adj",""
"28","daśa","DAŚ","a@","daśa","noun-adj",""
"29","dig","DI","g@","dik","noun-adj",""
"30","upagata","UPAGAT","a@","upagata","noun-adj",""
"31","surabhi","SURABH","i@","surabhi","noun-adj",""
"32","kula","KUL","a@","kula","noun-adj",""
"33","vara","VAR","a@","vara","noun-adj",""
"34","vadana","VADAN","a@","vadana","noun-adj",""
"35","vikasita","VIKASIT","a@","vikasita","noun-adj",""
"36","parimala","PARIMAL","a","parimala","noun-adj",""
"37","//","","","","punct",""
"","</s>","","","","",""
"","<s number=""43"">","","","","",""
"1","ana","","","","ind",""
"2","gham","GHAM","","ghama","noun-adj",""
"3","atimanojñaṃ","ATIMANOJÑ","aṃ","atimanojña","noun-adj",""
"4","dharmma","DHARM","a@","dharma","noun-adj",""
"5","rājasya","RĀJAS","ya","rājasa","noun-adj",""
"6","gadyaṃ","GADY","aṃ","gadya","noun-adj",""
"7","likhati","LIKH","ati","likh","verb","likh"
"8","paṭhati","PAṬH","ati","paṭh","verb",""
"9","yo","","","yad","pron",""
"10","vā","","","vā","ind",""
"11","sādaraṃ","SĀDAR","aṃ","sādara","noun-adj",""
"12","yaś","","","yad","pron",""
"13","śruṇoti","ŚRUṆ","oti","śruṇ","verb",""
"14","tribhuvana","TRIBHUVAN","a@","tribhuvana","noun-adj",""
"15","bhavana","BHAVAN","a@","bhavana","noun-adj",""
"16","āntaḥ","ANT","aḥ","anta","noun-adj",""
"17","prāpya","PRĀP","ya","prāpn","verb","prāp"
"18","bhogān","BHOG","ān","bhoga","noun-adj",""
"19","aśeṣān","AŚEṢ","ān","aśeṣa","noun-adj",""
"20","anubhavati","ANUBHAV","ati","anubhav","verb","anubhū"
"21","sa","","","sa_saha","ind",""
"22","nityaṃ","NITY","aṃ","nitya","noun-adj",""
"23","śānta","ŚĀNT","a@","śānta","noun-adj",""
"24","nirvāṇa","NIRVĀṆ","a@","nirvāṇa","noun-adj",""
"25","saukhyam","SAUKHY","am","saukhya","noun-adj",""
"26","//","","","","punct",""
"","</s>","","","","",""
"","<s number=""44"">","","","","",""
"1","siddhir","SIDDH","ir","siddhi","noun-adj",""
"2","astu","","","as","verb","as"
"3","/","","","","punct",""
"","</s>","","","","",""
"","<s number=""45"">","","","","",""
"1","śubham","ŚUBH","am","śubha","noun-adj",""
"2","astu","","","as","verb","as"
"3","/","","","","punct",""
"","</s>","","","","",""
"","<s number=""46"">","","","","",""
"1","buddha","BUDDH","a@","buddha","noun-adj",""
"2","gadyaya","GADY","aya","gadya","noun-adj",""
"3","nimi","NIM","i","nimi","noun-adj",""
"4","/","","","","punct",""
"","</s>","","","","",""
"","</page>","","","","",""
"","</doc>","","","","",""
