"WordID","word","NormSTEM","suffix","lemma","PoS","Root"
"","<doc textid = ""prajjaparamitastotra"" genre = ""stotra"" title = ""prajñāpāramitāstotra"" author = ""rāhulabhadra"" discourse = ""stotra"" tradition = ""prajñāpāramitā"" period = ""foundational"" source = ""gretil accessed may 2021 : http://gretil.sub.uni-goettingen.de/gretil/corpustei/sa_rahulabhadra-prajjaparamitastotra.xml"" date_range = ""3rd cent. ce"" notes = ""m. hahn mentioned in m. hahn. 'bemerkungen zu zwei texten aus dem phudrag-kanjur.' in: indology and indo-tibetology. ed. by h. eimer. bonn: indica et tibetica. 1988 that this stotra is included at the beginning of many prajñāpāramitā manuscripts and that his edition is based on the one found in the aṣṭa of vaidya’s 1960 edition but i cannot find the text there. in any case it is absent from the electronic gretil version of the aṣṭa. on the activity date of rāhulabhadra: c. 225 ce see potter k. 'rāhulabhadra.' pandit. panditproject.org/entity/85102/person. updated on march 18 2017. on the prajñāpāramitāstotra see potter. 1999. eip vol. 8; pp. 236-7."" religion = ""buddh"" edition = ""based on the ed. by michael hahn. 1988. 'bemerkungen zu zwei texten aus dem phudrag-kanjur.' in: indology and indo-tibetology. thirty years of indian and indo-tibetan studies in bonn. ed. by h. eimer. indica et tibetica 13 . bonn: indica et tibetica; pp. 53-80."" digitization = ""lennart hartmann and jens-uwe hartmann"" segmentation_lemmatization = ""ligeia lugli & buddhist translators workbench team"" metadata_enrichment = ""bruno galasek-hul & buddhist translators workbench team"" proofreader = ""n/a"" permission = ""permission for derivatives from m. mehner on behalf of gretil"" reconstructions = ""none"">","","","","",""
"","<page number=""1"">","","","","",""
"","<s number=""1"">","","","","",""
"1","nir","","","niḥ_privativum","ind",""
"2","vikalpe","VIKALP","e","vikalpa","noun-adj",""
"3","namas","NAM","as","nama","noun-adj",""
"4","tubhyaṃ","TUBH","yaṃ","tubh","verb",""
"5","prajñāpāramite","PRAJÑĀPĀRAMIT","e","prajñāpāramitā","noun-adj",""
"6","amite","AMIT","e","amita","noun-adj",""
"7","yā","","","yad","pron",""
"8","tvaṃ","TVAṂ","","tvat","pron",""
"9","sarvānavadyāṅgi","SARVĀNAVADYĀṄG","i","sarvānavadyāṅga","noun-adj",""
"10","niravadyair","NIRAVADY","air","niravadya","noun-adj",""
"11","nirīkṣyase","NIRĪKṢ","yase","nirīkṣ","verb","nirīkṣ"
"12","//","","","","punct",""
"","</s>","","","","",""
"","<s number=""2"">","","","","",""
"","</page>","","","","",""
"","<page number=""2"">","","","","",""
"3","ākāśam","ĀKĀŚ","am","ākāśa","noun-adj",""
"4","iva","","","iva","ind",""
"5","nirlepāṃ","NIRLEP","āṃ","nirlepā","noun-adj",""
"6","niṣ","","","niḥ_privativum","ind",""
"7","prapañcāṃ","PRAPAÑC","āṃ","prapañcā","noun-adj",""
"8","nirakṣarām","NIRAKṢAR","ām","nirakṣara","noun-adj",""
"9","yas","","","yad","pron",""
"10","tvāṃ","","","tvat","pron",""
"11","paśyati","PAŚ","yati","paś","verb","paś"
"12","bhāvena","BHĀV","ena","bhāva","noun-adj",""
"13","sa","","","sa_saha","ind",""
"14","paśyati","PAŚ","yati","paś","verb","paś"
"15","tathāgatam","TATHĀGAT","am","tathāgata","noun-adj",""
"16","//","","","","punct",""
"","</s>","","","","",""
"","<s number=""3"">","","","","",""
"","</page>","","","","",""
"","<page number=""3"">","","","","",""
"3","tava","TAV","a","tvat","pron",""
"4","cārye","CĀRY","e","cārya","noun-adj",""
"5","guṇāḍhyāyā","GUṆĀḌHY","āyā","guṇāḍhya","noun-adj",""
"6","buddhasya","BUDDH","asya","buddha","noun-adj",""
"7","ca","","","ca","ind",""
"8","jagadguroḥ","JAGADGUR","oḥ","jagadguru","noun-adj",""
"9","na","","","na","ind",""
"10","paśyanty","PAŚ","yanty","paś","verb","paś"
"11","antaraṃ","ANTAR","aṃ","antara","noun-adj",""
"12","santaś","SANT","aś","sat","noun-adj",""
"13","candra","CANDR","a@","candra","noun-adj",""
"14","candrikayor","CANDRIK","ayor","candrikā","noun-adj",""
"15","iva","","","iva","ind",""
"16","//","","","","punct",""
"","</s>","","","","",""
"","<s number=""4"">","","","","",""
"","</page>","","","","",""
"","<page number=""4"">","","","","",""
"3","kṛpātmakāḥ","KṚPĀTM","akāḥ","kṛpātman","noun-adj",""
"4","prapadya","PRAPAD","ya","prapad","verb","prapad"
"5","tvāṃ","","","tvat","pron",""
"6","buddhadharma","BUDDHADHARM","a@","buddhadharma","noun-adj",""
"7","puraḥsarīm","PURAḤSAR","īm","puraḥsara","noun-adj",""
"8","sukhen","SUKH","en","sukha","noun-adj",""
"9","āyānti","ĀYĀ","nti","āyā","noun-adj",""
"10","māhātmyam","MĀHĀTMY","am","māhātmya","noun-adj",""
"11","atulaṃ","ATUL","aṃ","atula","noun-adj",""
"12","bhaktivat","BHAKTIV","at","bhaktivat","noun-adj",""
"13","sale","SAL","e","sala","noun-adj",""
"14","//","","","","punct",""
"","</s>","","","","",""
"","<s number=""5"">","","","","",""
"","</page>","","","","",""
"","<page number=""5"">","","","","",""
"3","sakṛd","SAKṚ","d","sakṛt","noun-adj",""
"4","apy","","","api","ind",""
"5","āśaye","ĀŚAY","e","āśaya","noun-adj",""
"6","śuddhe","ŚUDDH","e","śuddha","noun-adj",""
"7","yas","","","yad","pron",""
"8","tvāṃ","","","tvat","pron",""
"9","vidhivad","VIDHIV","ad","vidhivat","noun-adj",""
"10","īkṣate","ĪKṢ","ate","īkṣ","verb","īkṣ"
"11","tena","TEN","a","tad","pron",""
"12","^","","","","",""
"13","āpi","","","api","ind",""
"14","niyataṃ","NIYAT","aṃ","niyata","noun-adj",""
"15","siddhiḥ","SIDDH","iḥ","siddhi","noun-adj",""
"16","prāpyate","PRĀP","yate","prāpn","verb","prāp"
"17","amoghadarśane","AMOGHADARŚAN","e","amoghadarśana","noun-adj",""
"18","//","","","","punct",""
"","</s>","","","","",""
"","<s number=""6"">","","","","",""
"","</page>","","","","",""
"","<page number=""6"">","","","","",""
"3","sarveṣām","SARV","eṣām","sarva","noun-adj",""
"4","api","","","api","ind",""
"5","vīrāṇāṃ","VĪRĀṆ","āṃ","vīrāṇā","noun-adj",""
"6","parārtha","PARĀRTH","a@","parārtha","noun-adj",""
"7","nirata","NIRAT","a@","nirata","noun-adj",""
"8","ātma","ĀTM","a@","ātman","noun-adj",""
"9","nām","NĀM","","nāman","noun-adj",""
"10","poṣikā","POṢ","ikā","poṣika","noun-adj",""
"11","janayitrī","JANAYITR","ī","janayitrī","noun-adj",""
"12","ca","","","ca","ind",""
"13","mātā","MĀT","ā","mātṛ","noun-adj",""
"14","tvam","","","tvat","pron",""
"15","asi","","","as","verb","as"
"16","vatsalā","VATSAL","ā","vatsala","noun-adj",""
"17","//","","","","punct",""
"","</s>","","","","",""
"","<s number=""7"">","","","","",""
"","</page>","","","","",""
"","<page number=""7"">","","","","",""
"3","yad","YAD","","yadi","noun-adj",""
"4","buddhā","BUDDH","ā","buddha","noun-adj",""
"5","lokaguravaḥ","LOKAGUR","avaḥ","lokaguru","noun-adj",""
"6","putrās","PUTR","ās","putra","noun-adj",""
"7","tava","TAV","a","tvat","pron",""
"8","kṛpālavaḥ","KṚPĀLAV","aḥ","kṛpālava","noun-adj",""
"9","tena","TEN","a","tad","pron",""
"10","tvam","","","tvat","pron",""
"11","api","","","api","ind",""
"12","kalyāṇi","KALYĀṆ","i","kalyāṇī","noun-adj",""
"13","sarva","SARV","a@","sarva","noun-adj",""
"14","sattva","SATTV","a@","sattva","noun-adj",""
"15","pitāmahī","PITĀMAH","ī","pitāmahī","noun-adj",""
"16","//","","","","punct",""
"","</s>","","","","",""
"","<s number=""8"">","","","","",""
"","</page>","","","","",""
"","<page number=""8"">","","","","",""
"3","sarva","SARV","a@","sarva","noun-adj",""
"4","pāramitābhis","PĀRAMIT","ābhis","pāramitā","noun-adj",""
"5","tvaṃ","TVAṂ","","tvat","pron",""
"6","nirmalābhir","NIRMAL","ābhir","nirmalā","noun-adj",""
"7","anindite","ANINDIT","e","anindita","noun-adj",""
"8","candralekhe","CANDRALEKH","e","candralekha","noun-adj",""
"9","vatārābhir","AVATĀR","ābhir","avatārā","noun-adj",""
"10","anuyātāsi","ANUYĀT","āsi","anuyāta","noun-adj",""
"11","sarvadā","SARVAD","ā","sarvadā","ind",""
"12","//","","","","punct",""
"","</s>","","","","",""
"","<s number=""9"">","","","","",""
"","</page>","","","","",""
"","<page number=""9"">","","","","",""
"3","vineyaṃ","VINEY","aṃ","vineya","noun-adj",""
"4","janam","JAN","am","jana","noun-adj",""
"5","āsādya","ĀSĀD","ya","āṣad","verb","āsad"
"6","tatra","","","tatra","ind",""
"7","tatra","","","tatra","ind",""
"8","tathāgataiḥ","TATHĀGAT","aiḥ","tathāgata","noun-adj",""
"9","bahurūpā","BAHURŪP","ā","bahurūpā","noun-adj",""
"10","tvam","","","tvat","pron",""
"11","eva","","","eva","ind",""
"12","ikā","","","","ind",""
"13","nānānām","NĀNĀN","ām","nānānā","noun-adj",""
"14","abhir","ABHIR","","abhirāyati","noun-adj",""
"15","īḍyase","ĪḌ","yase","īḍ","verb",""
"16","//","","","","punct",""
"","</s>","","","","",""
"","<s number=""10"">","","","","",""
"","</page>","","","","",""
"","<page number=""10"">","","","","",""
"3","prabhāṃ","PRABH","āṃ","prabhā","noun-adj",""
"4","prāpy","PRĀPY","","prāpya","noun-adj",""
"5","eva","","","eva","ind",""
"6","dīptāṃśor","DĪPTĀṂŚ","or","dīptāṃśu","noun-adj",""
"7","avaśya","AVAŚY","a@","avaśya","noun-adj",""
"8","āyoda","ĀYOD","a@","āyoda","noun-adj",""
"9","bindavaḥ","BIND","avaḥ","bindu","noun-adj",""
"10","tvāṃ","","","tvat","pron",""
"11","prāpya","PRĀPY","a","prāpya","noun-adj",""
"12","pralayaṃ","PRALAY","aṃ","pralaya","noun-adj",""
"13","yānti","","","","ind",""
"14","doṣā","DOṢ","ā","doṣā","noun-adj",""
"15","vādāś","VĀD","āś","vāda","noun-adj",""
"16","ca","","","ca","ind",""
"17","vādinām","VĀDIN","ām","vādinī","noun-adj",""
"18","//","","","","punct",""
"","</s>","","","","",""
"","<s number=""11"">","","","","",""
"","</page>","","","","",""
"","<page number=""11"">","","","","",""
"3","tvam","","","tvat","pron",""
"4","eva","","","eva","ind",""
"5","trāsa","TRĀS","a@","trāsa","noun-adj",""
"6","jananī","JANAN","ī","jananī","noun-adj",""
"7","bālānāṃ","BĀL","ānāṃ","bāla","noun-adj",""
"8","bhīmadarśanā","BHĪMADARŚAN","ā","bhīmadarśanā","noun-adj",""
"9","āśvāsa","ĀŚVĀS","a@","āśvāsa","noun-adj",""
"10","jananī","JANAN","ī","jananī","noun-adj",""
"11","c","","","ca","ind",""
"12","^","","","","",""
"13","āsi","","","as","verb","as"
"14","viduṣāṃ","VIDUṢ","āṃ","viduṣā","noun-adj",""
"15","saumyadarśanā","SAUMYADARŚAN","ā","saumyadarśanā","noun-adj",""
"16","//","","","","punct",""
"","</s>","","","","",""
"","<s number=""12"">","","","","",""
"","</page>","","","","",""
"","<page number=""12"">","","","","",""
"3","yasya","YAŚ","ya","yad","pron",""
"4","tvayy","TVA","yy","tvat","pron",""
"5","apy","","","api","ind",""
"6","abhiṣvaṅgas","ABHIṢVAṄG","as","abhiṣvaṅga","noun-adj",""
"7","tv","","","tu","ind",""
"8","anna","ANN","a@","anna","noun-adj",""
"9","āthasya","ĀTH","asya","āthati","noun-adj",""
"10","na","","","na","ind",""
"11","vidyate","VID","yate","vid","verb","vid"
"12","tasy","","","tad","pron",""
"13","āmba","ĀMB","a","āmba","noun-adj",""
"14","katham","KATHAM","","katham","ind",""
"15","anyatra","ANYATR","a","anyatra","noun-adj",""
"16","rāgadveṣau","RĀGADVEṢ","au","rāgadveṣa","noun-adj",""
"17","bhaviṣyataḥ","BHAVIṢ","yataḥ","bhaviṣa","noun-adj",""
"18","//","","","","punct",""
"","</s>","","","","",""
"","<s number=""13"">","","","","",""
"","</page>","","","","",""
"","<page number=""13"">","","","","",""
"3","n","","","na","ind",""
"4","āgacchasi","ĀGACCH","asi","āgacch","verb","āgam"
"5","kutaś","KUT","aś","kuta","noun-adj",""
"6","cit","CIT","","cid","noun-adj",""
"7","tvaṃ","TVAṂ","","tvat","pron",""
"8","na","","","na","ind",""
"9","ca","","","ca","ind",""
"10","kva","","","kva","ind",""
"11","cana","CAN","a","cana","noun-adj",""
"12","gacchasi","GACCH","asi","gacch","verb","gam"
"13","sthāneṣv","STHĀN","eṣv","sthāna","noun-adj",""
"14","api","","","api","ind",""
"15","ca","","","ca","ind",""
"16","sarveṣu","SARV","eṣu","sarva","noun-adj",""
"17","vidvadbhir","VIDV","adbhir","vidvat","noun-adj",""
"18","n","","","na","ind",""
"19","opalabhyase","UPALABH","yase","upalabh","verb","upalabh"
"20","//","","","","punct",""
"","</s>","","","","",""
"","<s number=""14"">","","","","",""
"","</page>","","","","",""
"","<page number=""14"">","","","","",""
"3","ye","","","yad","pron",""
"4","tvām","","","tvat","pron",""
"5","evaṃ","","","eva","ind",""
"6","na","","","na","ind",""
"7","paśyanti","PAŚ","yanti","paś","verb","paś"
"8","prapadyante","PRAPAD","yante","prapad","verb","prapad"
"9","ca","","","ca","ind",""
"10","bhavataḥ","BHAV","ataḥ","bhava","noun-adj",""
"11","prapadya","PRAPAD","ya","prapad","verb","prapad"
"12","ca","","","ca","ind",""
"13","vimucyante","VIMUC","yante","vimuca","noun-adj",""
"14","tad","TAD","","tad","pron",""
"15","idaṃ","IDAṂ","","idam","pron",""
"16","mahad","MAHAD","","mahat","noun-adj",""
"17","adbhutam","ADBHUT","am","adbhuta","noun-adj",""
"18","//","","","","punct",""
"","</s>","","","","",""
"","<s number=""15"">","","","","",""
"","</page>","","","","",""
"","<page number=""15"">","","","","",""
"3","tvām","","","tvat","pron",""
"4","eva","","","eva","ind",""
"5","badhyate","BADH","yate","badha","noun-adj",""
"6","paśyann","PAŚ","yann","paśa","noun-adj",""
"7","apaśyann","APAŚ","yann","apaśu","noun-adj",""
"8","api","","","api","ind",""
"9","badhyate","BADH","yate","badha","noun-adj",""
"10","tvām","","","tvat","pron",""
"11","eva","","","eva","ind",""
"12","mucyate","MUC","yate","muñc","verb","muc"
"13","paśyann","PAŚ","yann","paśa","noun-adj",""
"14","apaśyann","APAŚ","yann","apaśu","noun-adj",""
"15","api","","","api","ind",""
"16","mucyate","MUC","yate","muñc","verb","muc"
"17","//","","","","punct",""
"","</s>","","","","",""
"","<s number=""16"">","","","","",""
"","</page>","","","","",""
"","<page number=""16"">","","","","",""
"3","aho","","","aho","ind",""
"4","vismayanīyāsi","VISMAYANĪ","yāsi","vismayanīa","noun-adj",""
"5","gambhīrāsi","GAMBHĪR","āsi","gambhīra","noun-adj",""
"6","yaśasvini","YAŚASVIN","i","yaśasvinī","noun-adj",""
"7","su","","","su","ind",""
"8","durbodhāsi","DURBODH","āsi","durbodha","noun-adj",""
"9","māy","MĀY","","māyā","noun-adj",""
"10","eva","","","eva","ind",""
"11","dṛśyase","DṚŚ","yase","darś","verb","dṛś"
"12","na","","","na","ind",""
"13","ca","","","ca","ind",""
"14","dṛśyase","DṚŚ","yase","darś","verb","dṛś"
"15","//","","","","punct",""
"","</s>","","","","",""
"","<s number=""17"">","","","","",""
"","</page>","","","","",""
"","<page number=""17"">","","","","",""
"3","buddhaiḥ","BUDDH","aiḥ","buddha","noun-adj",""
"4","pratyekabuddhaiś","PRATYEKABUDDH","aiś","pratyekabuddha","noun-adj",""
"5","ca","","","ca","ind",""
"6","śrāvakaiś","ŚRĀVAK","aiś","śrāvaka","noun-adj",""
"7","ca","","","ca","ind",""
"8","niṣevitā","NIṢEVIT","ā","niṣevitṛ","noun-adj",""
"9","mārgas","MĀRG","as","mārga","noun-adj",""
"10","tvam","","","tvat","pron",""
"11","ekā","EK","ā","eka","noun-adj",""
"12","mokṣasya","MOKṢ","asya","mokṣa","noun-adj",""
"13","n","","","na","ind",""
"14","^","","","","",""
"15","āsty","","","as","verb","as"
"16","anya","ANY","a","anya","noun-adj",""
"17","iti","","","iti","ind",""
"18","niścayaḥ","NIŚCAY","aḥ","niścaya","noun-adj",""
"19","//","","","","punct",""
"","</s>","","","","",""
"","<s number=""18"">","","","","",""
"","</page>","","","","",""
"","<page number=""18"">","","","","",""
"3","vyavahāraṃ","VYAVAHĀR","aṃ","vyavahāra","noun-adj",""
"4","puraskṛtya","PURASKṚTY","a","puraskṛtya","noun-adj",""
"5","prajñapty","PRAJÑAPT","y@","prajñapti","noun-adj",""
"6","arthaṃ","ARTH","aṃ","artha","noun-adj",""
"7","śarīriṇām","ŚARĪR","iṇām","śarīrin","noun-adj",""
"8","kṛpayā","KṚPAY","ā","kṛpayati","noun-adj",""
"9","lokanāthais","LOKANĀTH","ais","lokanātha","noun-adj",""
"10","tvam","","","tvat","pron",""
"11","ucyase","UC","yase","vak","verb","vac"
"12","ca","","","ca","ind",""
"13","na","","","na","ind",""
"14","cocyase","COC","yase","coca","noun-adj",""
"15","//","","","","punct",""
"","</s>","","","","",""
"","<s number=""19"">","","","","",""
"","</page>","","","","",""
"","<page number=""19"">","","","","",""
"3","śaktaḥ","ŚAKT","aḥ","śakta","noun-adj",""
"4","kas","KAS","","kim","pron",""
"5","tvām","","","tvat","pron",""
"6","iha","","","iha","ind",""
"7","stotuṃ","STOT","uṃ","stotṛ","noun-adj",""
"8","nirnimittāṃ","NIRNIMITT","āṃ","nirnimitta","noun-adj",""
"9","nirañjanām","NIRAÑJAN","ām","nirañjanā","noun-adj",""
"10","sarvavāgvi","SARVAV","āgvi","sarvavat","noun-adj",""
"11","śaya","ŚAY","a@","śaya","noun-adj",""
"12","ātītāṃ","ATĪT","āṃ","atīta","noun-adj",""
"13","yā","","","yad","pron",""
"14","tvaṃ","TVAṂ","","tvat","pron",""
"15","kva","","","kva","ind",""
"16","cid","","","cid","ind",""
"17","a","","","alpha_privativum","ind",""
"18","niśritā","NIŚRIT","ā","niśrita","noun-adj",""
"19","//","","","","punct",""
"","</s>","","","","",""
"","<s number=""20"">","","","","",""
"","</page>","","","","",""
"","<page number=""20"">","","","","",""
"3","saty","SATY","","satya","noun-adj",""
"4","evam","","","eva","ind",""
"5","api","","","api","ind",""
"6","saṃvṛtyā","SAṂVṚT","yā","saṃvṛti","noun-adj",""
"7","vākpathair","VĀKPATH","air","vākpatha","noun-adj",""
"8","vayam","VAYAM","","asmat","pron",""
"9","īdṛśaiḥ","ĪDṚŚ","aiḥ","īdṛśa","noun-adj",""
"10","tvām","","","tvat","pron",""
"11","astutyām","ASTUTY","ām","astutya","noun-adj",""
"12","api","","","api","ind",""
"13","satīṃ","SAT","īṃ","satī","noun-adj",""
"14","tuṣṭūṣ","TUṢṬ","ūṣ","tuṣṭu","noun-adj",""
"15","antaḥ","ANT","aḥ","anta","noun-adj",""
"16","sunirvṛtāḥ","SUNIRVṚT","āḥ","sunirvṛta","noun-adj",""
"17","//","","","","punct",""
"","</s>","","","","",""
"","<s number=""21"">","","","","",""
"","</page>","","","","",""
"","<page number=""21"">","","","","",""
"3","prajñāpāramitāṃ","PRAJÑĀPĀRAMIT","āṃ","prajñāpāramitā","noun-adj",""
"4","stutvā","STUTV","ā","stutvā","noun-adj",""
"5","yan","","","yad","pron",""
"6","maya","MAY","a@","maya","noun-adj",""
"7","opacitaṃ","UPACIT","aṃ","upacita","noun-adj",""
"8","śubham","ŚUBH","am","śubha","noun-adj",""
"9","tenās","TEN","ās","tena","noun-adj",""
"10","tv","","","tu","ind",""
"11","āśu","","","","ind",""
"12","jagat","JAGAT","","jagat","noun-adj",""
"13","kṛtsnaṃ","KṚTSN","aṃ","kṛtsna","noun-adj",""
"14","prajñāpa","PRAJÑĀP","a@","prajñāp","verb","prajñā"
"15","ā","","","alpha_privativum","ind",""
"16","rapa","RAP","a@","rapas","noun-adj",""
"17","rāyaṇam","RĀYAṆ","am","rāyaṇa","noun-adj",""
"18","//","","","","punct",""
"","</s>","","","","",""
"","</page>","","","","",""
"","</doc>","","","","",""
