"WordID","word","NormSTEM","suffix","lemma","PoS","Root"
"","<doc textid = ""mrtyuvajcanopadezatarasadhana"" genre = ""sādhana"" title = ""mṛtyuvañcanopadeśatārāsādhana"" author = ""vāgīśvarakīrti"" discourse = ""tantra"" tradition = ""tantra"" period = ""commentarial"" source = ""gretil accessed aug 2019 : http://gretil.sub.uni-goettingen.de/gretil/corpustei/sa_gretilbuddh _ mrtyuvancanopaesatarasahana _final.xml"" date_range = ""10.-11. ce"" notes = ""alternative genre: tantra; tantric sādhana"" religion = ""buddh"" edition = ""based on the ed. by j. schneider 2010 page number = verse number"" digitization = ""j. schneider"" segmentation_lemmatization = ""ligeia lugli & buddhist translators workbench team"" metadata_enrichment = ""bruno galasek-hul & buddhist translators workbench team"" proofreader = ""n/a"" permission = ""permission for derivatives from m. mehner on behalf of gretil"" reconstructions = ""none"">","","","","",""
"","<page number=""0"">","","","","",""
"","<s number=""0"">","","","","",""
"1","mṛtyu","MṚTY","u@","mṛtyu","noun-adj",""
"2","vañcana","VAÑCAN","a@","vañcana","noun-adj",""
"3","opadeśa","UPADEŚ","a@","upadeśa","noun-adj",""
"4","tāra","TĀR","a@","tāra","noun-adj",""
"5","āsādhana","ASĀDHAN","a","asādhana","noun-adj",""
"6","utthāya","UTTHĀY","a","utthāya","noun-adj",""
"7","pūrva","PŪRV","a@","pūrva","noun-adj",""
"8","saṃdhyāyāṃ","SAṂDHY","āyāṃ","saṃdhyā","noun-adj",""
"9","bhū","","","","ind",""
"10","pradeśe","PRADEŚ","e","pradeśa","noun-adj",""
"11","manohare","MANOHAR","e","manohara","noun-adj",""
"12","/","","","","punct",""
"13","mṛda","MṚD","a@","mṛda","noun-adj",""
"14","vāsana","VĀSAN","a@","vāsana","noun-adj",""
"15","opaviṣṭaḥ","UPAVIṢṬ","aḥ","upaviṣṭa","noun-adj",""
"16","san","SAN","","sat","noun-adj",""
"17","s","","","su","ind",""
"18","vahṛdi","VAH","ṛdi","vahṛ","noun-adj",""
"19","candra","CANDR","a@","candra","noun-adj",""
"20","maṇḍale","MAṆḌAL","e","maṇḍala","noun-adj",""
"21","//","","","","punct",""
"22","1","","","","ind",""
"23","//","","","","punct",""
"","</s>","","","","",""
"","</page>","","","","",""
"","<page number=""1"">","","","","",""
"","<s number=""1"">","","","","",""
"1","pañcamasya","PAÑCAM","asya","pañcama","noun-adj",""
"2","prathamaṃ","PRATHAM","aṃ","prathama","noun-adj",""
"3","tu","","","tu","ind",""
"4","dvitīya","DVITĪY","a@","dvitīya","noun-adj",""
"5","svara","SVAR","a@","svara","noun-adj",""
"6","yojitam","YOJIT","am","yojita","noun-adj",""
"7","/","","","","punct",""
"8","ardha","ARDH","a@","ardha","noun-adj",""
"9","endu","END","u@","endh","noun-adj",""
"10","bindu","BIND","u@","bindu","noun-adj",""
"11","saṃyuktaṃ","SAṂYUKT","aṃ","saṃyukta","noun-adj",""
"12","sita","SIT","a@","sita","noun-adj",""
"13","raśmi","RAŚM","i@","raśmi","noun-adj",""
"14","vibhūṣitam","VIBHŪṢIT","am","vibhūṣita","noun-adj",""
"15","//","","","","punct",""
"16","2","","","","ind",""
"17","//","","","","punct",""
"","</s>","","","","",""
"","</page>","","","","",""
"","<page number=""2"">","","","","",""
"","<s number=""2"">","","","","",""
"1","tasya","","","tad","pron",""
"2","śukla","ŚUKL","a@","śukla","noun-adj",""
"3","mayūkhais","MAYŪKH","ais","mayūkha","noun-adj",""
"4","tu","","","tu","ind",""
"5","tārām","TĀR","ām","tāra","noun-adj",""
"6","ākṛṣya","ĀKṚṢ","ya","ākṛṣ","verb",""
"7","vyomani","VYOM","ani","vyomat","noun-adj",""
"8","/","","","","punct",""
"9","dvi","DV","i@","dvi","noun-adj",""
"10","bhujāṃ","BHUJ","āṃ","bhujā","noun-adj",""
"11","sita","SIT","a@","sita","noun-adj",""
"12","dehāṃ","DEH","āṃ","dehā","noun-adj",""
"13","tu","","","tu","ind",""
"14","varad","VAR","ad","varat","noun-adj",""
"15","otpala","UTPAL","a@","utpala","noun-adj",""
"16","dhāriṇīm","DHĀRIṆ","īm","dhāriṇī","noun-adj",""
"17","//","","","","punct",""
"18","3","","","","ind",""
"19","//","","","","punct",""
"","</s>","","","","",""
"","</page>","","","","",""
"","<page number=""3"">","","","","",""
"","<s number=""3"">","","","","",""
"1","pañca","PAÑC","a@","pañca","noun-adj",""
"2","opacāra","UPACĀR","a@","upacāra","noun-adj",""
"3","pūjābhiḥ","PŪJ","ābhiḥ","pūjā","noun-adj",""
"4","pūjayitvā","PŪJ","ayitvā","pūj","verb","pūj"
"5","tu","","","tu","ind",""
"6","bhaktitaḥ","BHAKT","itaḥ","bhakta","noun-adj",""
"7","/","","","","punct",""
"8","pāpānāṃ","PĀP","ānāṃ","pāpa","noun-adj",""
"9","deśanāṃ","DEŚAN","āṃ","deśanā","noun-adj",""
"10","paścāt","PAŚCĀT","","paścāta","noun-adj",""
"11","tataḥ","","","tatas","ind",""
"12","puṇya","PUṆY","a@","puṇya","noun-adj",""
"13","ānumodanam","ANUMODAN","am","anumodana","noun-adj",""
"14","//","","","","punct",""
"15","4","","","","ind",""
"16","//","","","","punct",""
"","</s>","","","","",""
"","</page>","","","","",""
"","<page number=""4"">","","","","",""
"","<s number=""4"">","","","","",""
"1","tat","TAT","","tad","pron",""
"2","pariṇāmanāṃ","PARIṆĀMAN","āṃ","pariṇāmana","noun-adj",""
"3","c","","","ca","ind",""
"4","^","","","","",""
"5","aiva","","","eva","ind",""
"6","tri","TR","i@","tri","noun-adj",""
"7","śaraṇa","ŚARAṆ","a@","śaraṇa","noun-adj",""
"8","gamanaṃ","GAMAN","aṃ","gamana","noun-adj",""
"9","tathā","","","tathā","ind",""
"10","/oṃ","","","","punct",""
"11","śūnyata","ŚŪNYAT","a@","śūnyatā","noun-adj",""
"12","ājñāna","ĀJÑĀN","a@","ājñāna","noun-adj",""
"13","vajra","VAJR","a@","vajra","noun-adj",""
"14","svabhāva","SVABHĀV","a@","svabhāva","noun-adj",""
"15","ātmako","ĀTM","ako","ātman","noun-adj",""
"16","aham","AHAM","","mat","pron",""
"17","iti","","","iti","ind",""
"18","paṭhet","PAṬH","et","paṭh","verb",""
"19","//","","","","punct",""
"20","5","","","","ind",""
"21","//","","","","punct",""
"","</s>","","","","",""
"","</page>","","","","",""
"","<page number=""5"">","","","","",""
"","<s number=""5"">","","","","",""
"1","iti","","","iti","ind",""
"2","svapara","SVAPAR","a@","svapara","noun-adj",""
"3","śūnyaṃ","ŚŪNY","aṃ","śūnya","noun-adj",""
"4","vai","","","vai","ind",""
"5","dhyātvā","DHYĀTV","ā","dhyā","verb",""
"6","yogī","YOG","ī","yogin","noun-adj",""
"7","vidhānavit","VIDHĀN","avit","vidhāna","noun-adj",""
"8","/","","","","punct",""
"9","sitā","SIT","ā@","sita","noun-adj",""
"10","ravindam","RAVIND","am","ravinda","noun-adj",""
"11","adhyastha","ADHYASTH","a@","adhyastha","noun-adj",""
"12","candra","CANDR","a@","candra","noun-adj",""
"13","bimba","BIMB","a@","bimba","noun-adj",""
"14","āsana","ĀSAN","a@","āsana","noun-adj",""
"15","opari","UPAR","i","upari","noun-adj",""
"16","//","","","","punct",""
"17","6","","","","ind",""
"18","//","","","","punct",""
"","</s>","","","","",""
"","</page>","","","","",""
"","<page number=""6"">","","","","",""
"","<s number=""6"">","","","","",""
"1","pūrva","PŪRV","a@","pūrva","noun-adj",""
"2","okta","UKT","a@","ukta","noun-adj",""
"3","bīja","BĪJ","a@","bīja","noun-adj",""
"4","niṣpannāṃ","NIṢPANN","āṃ","niṣpanna","noun-adj",""
"5","tārā","TĀR","ā@","tāra","noun-adj",""
"6","devīṃ","DEV","īṃ","devī","noun-adj",""
"7","manoramām","MANORAM","ām","manoramā","noun-adj",""
"8","/","","","","punct",""
"9","ābaddha","ĀBADDH","a@","ābaddha","noun-adj",""
"10","vajra","VAJR","a@","vajra","noun-adj",""
"11","paryaṅkāṃ","PARYAṄK","āṃ","paryaṅkā","noun-adj",""
"12","varad","VAR","ad","varat","noun-adj",""
"13","otpala","UTPAL","a@","utpala","noun-adj",""
"14","dhāriṇīm","DHĀRIṆ","īm","dhāriṇī","noun-adj",""
"15","//","","","","punct",""
"16","7","","","","ind",""
"17","//","","","","punct",""
"","</s>","","","","",""
"","</page>","","","","",""
"","<page number=""7"">","","","","",""
"","<s number=""7"">","","","","",""
"1","śarac","ŚAR","ac","śarat","noun-adj",""
"2","candrakar","CANDRAK","ar","candraka","noun-adj",""
"3","ākārāṃ","ĀKĀR","āṃ","ākārā","noun-adj",""
"4","pṛṣṭha","PṚṢṬH","a@","pṛṣṭha","noun-adj",""
"5","candra","CANDR","a@","candra","noun-adj",""
"6","samāśritām","SAMĀŚRIT","ām","samāśrita","noun-adj",""
"7","/","","","","punct",""
"8","sarva","SARV","a@","sarva","noun-adj",""
"9","ālaṅkāra","ALAṄKĀR","a@","alaṅkāra","noun-adj",""
"10","sampūrṇāṃ","SAMPŪRṆ","āṃ","sampūrṇā","noun-adj",""
"11","ṣoḍaśa","ṢOḌAŚ","a@","ṣoḍaśa","noun-adj",""
"12","ābda","ABD","a@","abda","noun-adj",""
"13","vapuṣmatīm","VAPUṢMAT","īm","vapuṣmatī","noun-adj",""
"14","//","","","","punct",""
"15","8","","","","ind",""
"16","//","","","","punct",""
"","</s>","","","","",""
"","</page>","","","","",""
"","<page number=""8"">","","","","",""
"","<s number=""8"">","","","","",""
"1","sarva","SARV","a@","sarva","noun-adj",""
"2","saṃbuddha","SAṂBUDDH","a@","saṃbuddha","noun-adj",""
"3","tat","TAT","","tad","pron",""
"4","putram","PUTR","am","putra","noun-adj",""
"5","ātaraṃ","ĀTAR","aṃ","ātara","noun-adj",""
"6","kāmarūpa","KĀMARŪP","a@","kāmarūpa","noun-adj",""
"7","dhām","DHĀM","","dhāma","noun-adj",""
"8","/","","","","punct",""
"9","dhyātva","DHYĀTV","a@","dhyātva","noun-adj",""
"10","ārya","ĀRY","a@","ārya","noun-adj",""
"11","tārāṃ","TĀR","āṃ","tāra","noun-adj",""
"12","hṛdaye","HṚDAY","e","hṛdaya","noun-adj",""
"13","tasyāś","","","tad","pron",""
"14","cakraṃ","CAKR","aṃ","cakra","noun-adj",""
"15","sita","SIT","a@","sita","noun-adj",""
"16","dyuti","DYUT","i","dyuti","noun-adj",""
"17","//","","","","punct",""
"18","9","","","","ind",""
"19","//","","","","punct",""
"","</s>","","","","",""
"","</page>","","","","",""
"","<page number=""9"">","","","","",""
"","<s number=""9"">","","","","",""
"1","aṣṭa","AṢṬ","a@","aṣṭa","noun-adj",""
"2","koṣṭhakam","KOṢṬH","akam","koṣṭhaka","noun-adj",""
"3","aṣṭābhir","AṢṬ","ābhir","aṣṭā","noun-adj",""
"4","akṣaraiḥ","AKṢAR","aiḥ","akṣara","noun-adj",""
"5","paripūritam","PARIPŪR","itam","paripūra","noun-adj",""
"6","/oṃh","","","","punct",""
"7","āvyañ","AVY","añ@","avya","noun-adj",""
"8","jana","JAN","a@","jana","noun-adj",""
"9","madhya","MADH","ya@","madhu","noun-adj",""
"10","stha","STH","a@","stha","noun-adj",""
"11","sādhyanā","SĀDHY","anā","sādhyā","noun-adj",""
"12","mādya","MĀDY","a@","mādya","noun-adj",""
"13","nābhikam","NĀBHIK","am","nābhika","noun-adj",""
"14","//","","","","punct",""
"15","10","","","","ind",""
"16","//","","","","punct",""
"","</s>","","","","",""
"","</page>","","","","",""
"","<page number=""10"">","","","","",""
"","<s number=""10"">","","","","",""
"1","dhyāyād","DHYĀY","ād","dhyāya","noun-adj",""
"2","ekāgra","EKĀGR","a@","ekāgra","noun-adj",""
"3","cittaḥ","CITT","aḥ","citta","noun-adj",""
"4","san","SAN","","sat","noun-adj",""
"5","ṣaṇm","","","","ind",""
"6","āsān","ĀSĀN","","āsāna","noun-adj",""
"7","dṛḍha","DṚḌH","a@","dṛḍha","noun-adj",""
"8","niścayaḥ","NIŚCAY","aḥ","niścaya","noun-adj",""
"9","/","","","","punct",""
"10","japed","JAP","ed","jap","verb",""
"11","a","","","alpha_privativum","ind",""
"12","khinna","KHINN","a@","khinna","noun-adj",""
"13","cittaḥ","CITT","aḥ","citta","noun-adj",""
"14","san","SAN","","sat","noun-adj",""
"15","mantram","MANTR","am","mantra","noun-adj",""
"16","enaṃ","","","ena","ind",""
"17","daśa","DAŚ","a@","daśa","noun-adj",""
"18","ākṣaram","ĀKṢAR","am","ākṣarati","noun-adj",""
"19","//","","","","punct",""
"20","11","","","","ind",""
"21","//","","","","punct",""
"","</s>","","","","",""
"","</page>","","","","",""
"","<page number=""11"">","","","","",""
"","<s number=""11"">","","","","",""
"1","oṅkāram","OṄKĀR","am","oṅkāra","noun-adj",""
"2","ādito","ĀDIT","o","ādita","noun-adj",""
"3","dattvā","DATT","vā","datta","noun-adj",""
"4","paścāt","PAŚCĀT","","paścāta","noun-adj",""
"5","tāre","TĀR","e","tāra","noun-adj",""
"6","prayojayet","PRAYOJAY","et","prayojayat","noun-adj",""
"7","/","","","","punct",""
"8","t","","","tu","ind",""
"9","uttāre","UTTĀR","e","uttāra","noun-adj",""
"10","syāt","","","as","verb","as"
"11","ture","TUR","e","tura","noun-adj",""
"12","paścāt","PAŚCĀT","","paścāta","noun-adj",""
"13","svāha","SVĀH","a@","svāha","noun-adj",""
"14","āntaṃ","ANT","aṃ","anta","noun-adj",""
"15","sārva","SĀRV","a@","sārva","noun-adj",""
"16","karmikaḥ","KARMIK","aḥ","karmika","noun-adj",""
"17","//","","","","punct",""
"18","12","","","","ind",""
"19","//","","","","punct",""
"","</s>","","","","",""
"","</page>","","","","",""
"","<page number=""12"">","","","","",""
"","<s number=""12"">","","","","",""
"1","brahma","BRAHM","a@","brahma","noun-adj",""
"2","endra","INDR","a@","indra","noun-adj",""
"3","viṣṇu","VIṢṆ","u@","viṣṇu","noun-adj",""
"4","candra","CANDR","a@","candra","noun-adj",""
"5","ārka","ARK","a@","arka","noun-adj",""
"6","rudra","RUDR","a@","rudra","noun-adj",""
"7","dik","DI","k@","dik","noun-adj",""
"8","pāla","PĀL","a@","pāla","noun-adj",""
"9","manmathaiḥ","MANMATH","aiḥ","manmatha","noun-adj",""
"10","/","","","","punct",""
"11","apy","","","api","ind",""
"12","a","","","alpha_privativum","ind",""
"13","khaṇḍita","KHAṆḌIT","a@","khaṇḍita","noun-adj",""
"14","roma","ROM","a@","roma","noun-adj",""
"15","āgro","AGR","o","agra","noun-adj",""
"16","mṛtyuṃ","MṚTY","uṃ","mṛtyu","noun-adj",""
"17","jayati","JA","yati","jā","noun-adj",""
"18","muktavat","MUKT","avat","muktavat","noun-adj",""
"19","//","","","","punct",""
"20","13","","","","ind",""
"21","//","","","","punct",""
"","</s>","","","","",""
"","</page>","","","","",""
"","<page number=""13"">","","","","",""
"","<s number=""13"">","","","","",""
"1","valī","VAL","ī@","valī","noun-adj",""
"2","palita","PALIT","a@","palita","noun-adj",""
"3","daurbhāgya","DAURBHĀGY","a@","daurbhāgya","noun-adj",""
"4","vyādhi","VYĀDH","i@","vyādhi","noun-adj",""
"5","dāridrya","DĀRIDRY","a@","dāridrya","noun-adj",""
"6","saṃkṣayaḥ","SAṂKṢAY","aḥ","saṃkṣaya","noun-adj",""
"7","/","","","","punct",""
"8","siṃhād","SIṂH","ād","siṃha","noun-adj",""
"9","yaṣṭa","YAṢṬ","a@","yaṣṭa","noun-adj",""
"10","maha","MAH","a@","mahat","noun-adj",""
"11","ābhīti","ABHĪT","i@","abhīti","noun-adj",""
"12","duḥkha","DUḤKH","a@","duḥkha","noun-adj",""
"13","saṃdoha","SAṂDOH","a@","saṃdoha","noun-adj",""
"14","nāśanam","NĀŚAN","am","nāśana","noun-adj",""
"15","//","","","","punct",""
"16","14","","","","ind",""
"17","//","","","","punct",""
"","</s>","","","","",""
"","</page>","","","","",""
"","<page number=""14"">","","","","",""
"","<s number=""14"">","","","","",""
"1","a","","","alpha_privativum","ind",""
"2","yācita","YĀCIT","a@","yācita","noun-adj",""
"3","ānnapāna","ĀNNAPĀN","a@","ānnapāna","noun-adj",""
"4","ādi","ĀD","i@","ādi","noun-adj",""
"5","harmya","HARMY","a@","harmya","noun-adj",""
"6","vastra","VASTR","a@","vastra","noun-adj",""
"7","ādi","ĀD","i@","ādi","noun-adj",""
"8","saṃgamaḥ","SAṂGAM","aḥ","saṃgama","noun-adj",""
"9","/","","","","punct",""
"10","khaḍga","KHAḌG","a@","khaḍga","noun-adj",""
"11","āñjan","AÑJ","an","añjat","noun-adj",""
"12","apāda","APĀD","a@","apāda","noun-adj",""
"13","lepa","LEP","a@","lepa","noun-adj",""
"14","bhadra","BHADR","a@","bhadra","noun-adj",""
"15","kumbha","KUMBH","a@","kumbha","noun-adj",""
"16","ādi","ĀD","i@","ādi","noun-adj",""
"17","siddhayaḥ","SIDDH","ayaḥ","siddhi","noun-adj",""
"18","//","","","","punct",""
"19","15","","","","ind",""
"20","//","","","","punct",""
"","</s>","","","","",""
"","</page>","","","","",""
"","<page number=""15"">","","","","",""
"","<s number=""15"">","","","","",""
"1","kavitā","KAVIT","ā","kavitā","noun-adj",""
"2","vaktṛtā","VAKT","ṛtā","vaktṛ","noun-adj",""
"3","medhā","MEDH","ā","medhā","noun-adj",""
"4","prajñā","PRAJÑ","ā","prajñā","noun-adj",""
"5","c","","","ca","ind",""
"6","aikānta","EKĀNT","a@","ekānta","noun-adj",""
"7","nirmalā","NIRMAL","ā","nirmala","noun-adj",""
"8","/","","","","punct",""
"9","anyā","ANY","ā","anyā","noun-adj",""
"10","ca","","","ca","ind",""
"11","vāñchitā","VĀÑCHIT","ā","vāñchita","noun-adj",""
"12","siddhiś","SIDDH","iś","siddhi","noun-adj",""
"13","cakrād","CAKR","ād","cakra","noun-adj",""
"14","asmāt","ASMĀT","","idam","pron",""
"15","prajāyate","PRAJĀ","yate","prajan","verb","prajan"
"16","//","","","","punct",""
"17","16","","","","ind",""
"18","//","","","","punct",""
"","</s>","","","","",""
"","</page>","","","","",""
"","</doc>","","","","",""
