"WordID","word","NormSTEM","suffix","lemma","PoS","Root"
"","<doc textid = ""maricinamadharani"" genre = ""dhāraṇī"" title = ""mārīcīnāmadhāraṇī"" author = ""n /a"" discourse = ""tantra"" tradition = ""buddh"" period = ""uncertain"" source = ""gretil accessed aug 2019 : http://gretil.sub.uni-goettingen.de/gretil/corpustei/sa_gretilbuddh _ maricinamaharani base on the eition_ āryamārīcī-nāma-hāraṇī_final.xml"" date_range = ""uncertain"" notes = ""caveat: dhīḥ vol. 42 p. 162: edited from nepalese ms. collection called dhāraṇyādisaṃgraha with the help of the tibetan translation; may contain restorations from tib."" religion = ""buddh"" edition = ""dhīḥ 42 2006 pp. 157-158"" digitization = ""k. wille"" segmentation_lemmatization = ""ligeia lugli & buddhist translators workbench team"" metadata_enrichment = ""bruno galasek-hul & buddhist translators workbench team"" proofreader = ""n/a"" permission = ""permission for derivatives from m. mehner on behalf of gretil"" reconstructions = ""none"">","","","","",""
"","<page number=""157"">","","","","",""
"","<s number=""1"">","","","","",""
"1","mārīcīnām","MĀRĪC","īnām","mārīci","noun-adj",""
"2","a","","","alpha_privativum","ind",""
"3","dhāraṇī","DHĀRAṆ","ī","dhāraṇī","noun-adj",""
"4","oṃ","","","oṃ","ind",""
"5","namo","NAM","o","namas","noun-adj",""
"6","bhagavatyai","BHAGAV","atyai","bhagavat","noun-adj",""
"7","ārya","ĀRY","a@","ārya","noun-adj",""
"8","mārīcī","MĀRĪC","ī@","mārīci","noun-adj",""
"9","devatāyai","DEVAT","āyai","devatā","noun-adj",""
"10","/","","","","punct",""
"","</s>","","","","",""
"","<s number=""2"">","","","","",""
"1","evaṃ","","","eva","ind",""
"2","mayā","","","mat","pron",""
"3","śrutam","ŚRUT","am","śruta","noun-adj",""
"4","ekasmin","EK","asmin","eka","noun-adj",""
"5","samaye","SAMAY","e","samaya","noun-adj",""
"6","bhagavān","BHAGAV","ān","bhagavat","noun-adj",""
"7","śrāvastyāṃ","ŚRĀVAST","yāṃ","śrāvasti","noun-adj",""
"8","viharati","VIHAR","ati","vihar","verb","vihṛ"
"9","sma","","","sma","ind",""
"10","/","","","","punct",""
"","</s>","","","","",""
"","<s number=""3"">","","","","",""
"1","jetavane","JETAVAN","e","jetavana","noun-adj",""
"2","anāthapiṇḍadasy","ANĀTHAPIṆḌAD","asy","anāthapiṇḍada","noun-adj",""
"3","ārāme","ĀRĀM","e","ārāma","noun-adj",""
"4","mahatā","MAHAT","ā","mahat","noun-adj",""
"5","bhikṣu","BHIKṢ","u@","bhikṣu","noun-adj",""
"6","saṃghena","SAṂGH","ena","saṃgha","noun-adj",""
"7","sārdha","SĀRDH","a@","sārdha","noun-adj",""
"8","trayo","TRAY","o@","tri","noun-adj",""
"9","daśa","DAŚ","a@","daśa","noun-adj",""
"10","bhikṣu","BHIKṢ","u@","bhikṣu","noun-adj",""
"11","śataiḥ","ŚAT","aiḥ","śata","noun-adj",""
"12","saṃbahulaiś","SAṂBAHUL","aiś","saṃbahula","noun-adj",""
"13","ca","","","ca","ind",""
"14","mahā","MAH","ā@","mahat","noun-adj",""
"15","śrāvakabodhi","ŚRĀVAKABODH","i@","śrāvakabodhi","noun-adj",""
"16","satva","SATTV","a@","sattva","noun-adj",""
"17","mahā","MAH","ā@","mahat","noun-adj",""
"18","satvaiḥ","SATTV","aiḥ","sattva","noun-adj",""
"19","/","","","","punct",""
"","</s>","","","","",""
"","<s number=""4"">","","","","",""
"1","tatra","","","tatra","ind",""
"2","khalu","KHAL","u","khal","verb",""
"3","bhagavān","BHAGAV","ān","bhagavat","noun-adj",""
"4","bhikṣūn","BHIKṢ","ūn","bhikṣu","noun-adj",""
"5","āmantrayate","AMANTR","ayate","amantra","noun-adj",""
"6","sma","","","sma","ind",""
"7","/","","","","punct",""
"","</s>","","","","",""
"","<s number=""5"">","","","","",""
"1","asti","","","as","verb","as"
"2","bhikṣavo","BHIKṢ","avo","bhikṣu","noun-adj",""
"3","mārīcī","MĀRĪC","ī","mārīci","noun-adj",""
"4","nāma","NĀM","a","nāman","noun-adj",""
"5","devatā","DEVAT","ā","devatā","noun-adj",""
"6","sā","","","tad","pron",""
"7","sūrya","SŪRY","a@","sūrya","noun-adj",""
"8","candramāsoḥ","CANDRAM","āsoḥ","candrama","noun-adj",""
"9","purato","PURAT","o","puratas","noun-adj",""
"10","opagacchati","UPAGACCH","ati","upagacch","verb","upagam"
"11","/","","","","punct",""
"","</s>","","","","",""
"","<s number=""6"">","","","","",""
"1","sā","","","tad","pron",""
"2","na","","","na","ind",""
"3","dṛśyate","DṚŚ","yate","darś","verb","dṛś"
"4","na","","","na","ind",""
"5","gṛhyate","GṚH","yate","gṛhṇ","verb","grah"
"6","na","","","na","ind",""
"7","badhyate","BADH","yate","badha","noun-adj",""
"8","na","","","na","ind",""
"9","nirudhyate","NIRUDH","yate","nirodh","verb","nirudh"
"10","na","","","na","ind",""
"11","virudhyate","VIRUDH","yate","virudha","noun-adj",""
"12","na","","","na","ind",""
"13","muṣyate","MUṢ","yate","muṣ","verb",""
"14","na","","","na","ind",""
"15","muhyate","MUH","yate","muh","verb",""
"16","na","","","na","ind",""
"17","daṇḍyate","DAṆḌ","yate","daṇḍ","verb",""
"18","na","","","na","ind",""
"19","muṇḍyate","MUṆḌ","yate","muṇḍ","verb",""
"20","na","","","na","ind",""
"21","dahyate","DAH","yate","dah","verb","dah"
"22","na","","","na","ind",""
"23","śatror","ŚATR","or","śatru","noun-adj",""
"24","opagacchati","UPAGACCH","ati","upagacch","verb","upagam"
"25","/","","","","punct",""
"","</s>","","","","",""
"","<s number=""7"">","","","","",""
"1","yo","","","yad","pron",""
"2","api","","","api","ind",""
"3","tasya","","","tad","pron",""
"4","bhikṣavo","BHIKṢ","avo","bhikṣu","noun-adj",""
"5","mārīcīnām","MĀRĪC","īnām","mārīci","noun-adj",""
"6","a","","","alpha_privativum","ind",""
"7","devatāyā","DEVAT","āyā","devatā","noun-adj",""
"8","nāma","NĀM","a","nāman","noun-adj",""
"9","jānāti","JĀN","āti","jāna","noun-adj",""
"10","so","","","tad","pron",""
"11","api","","","api","ind",""
"12","na","","","na","ind",""
"13","dṛśyate","DṚŚ","yate","darś","verb","dṛś"
"14","na","","","na","ind",""
"15","gṛhyate","GṚH","yate","gṛhṇ","verb","grah"
"16","na","","","na","ind",""
"17","badhyate","BADH","yate","badha","noun-adj",""
"18","na","","","na","ind",""
"19","nirudhyate","NIRUDH","yate","nirodh","verb","nirudh"
"20","na","","","na","ind",""
"21","virudhyate","VIRUDH","yate","virudha","noun-adj",""
"22","na","","","na","ind",""
"23","muṣyate","MUṢ","yate","muṣ","verb",""
"24","na","","","na","ind",""
"25","muhyate","MUH","yate","muh","verb",""
"26","na","","","na","ind",""
"27","daṇḍyate","DAṆḌ","yate","daṇḍ","verb",""
"28","na","","","na","ind",""
"29","muṇḍyate","MUṆḌ","yate","muṇḍ","verb",""
"30","na","","","na","ind",""
"31","dahyate","DAH","yate","dah","verb","dah"
"32","na","","","na","ind",""
"33","śatror","ŚATR","or","śatru","noun-adj",""
"34","opagacchati","UPAGACCH","ati","upagacch","verb","upagam"
"35","/","","","","punct",""
"","</s>","","","","",""
"","<s number=""8"">","","","","",""
"1","so","","","tad","pron",""
"2","ahaṃ","AHAṂ","","mat","pron",""
"3","bhikṣavo","BHIKṢ","avo","bhikṣu","noun-adj",""
"4","mārīcīnām","MĀRĪC","īnām","mārīci","noun-adj",""
"5","a","","","alpha_privativum","ind",""
"6","devatāyā","DEVAT","āyā","devatā","noun-adj",""
"7","nāma","NĀM","a","nāman","noun-adj",""
"8","jānāmi","JĀN","āmi","jān","verb","jñā"
"9","/","","","","punct",""
"","</s>","","","","",""
"","<s number=""9"">","","","","",""
"1","aham","AHAM","","mat","pron",""
"2","api","","","api","ind",""
"3","ayam","AYAM","","idam","pron",""
"4","api","","","api","ind",""
"5","na","","","na","ind",""
"6","dṛśyate","DṚŚ","yate","darś","verb","dṛś"
"7","na","","","na","ind",""
"8","badhyate","BADH","yate","badha","noun-adj",""
"9","na","","","na","ind",""
"10","nirudhyate","NIRUDH","yate","nirodh","verb","nirudh"
"11","na","","","na","ind",""
"12","virudhyate","VIRUDH","yate","virudha","noun-adj",""
"13","na","","","na","ind",""
"14","muhyate","MUH","yate","muh","verb",""
"15","na","","","na","ind",""
"16","daṇḍyate","DAṆḌ","yate","daṇḍ","verb",""
"17","na","","","na","ind",""
"18","muṇḍyate","MUṆḌ","yate","muṇḍ","verb",""
"19","na","","","na","ind",""
"20","dahyate","DAH","yate","dah","verb","dah"
"21","na","","","na","ind",""
"22","śatror","ŚATR","or","śatru","noun-adj",""
"23","opagacchati","UPAGACCH","ati","upagacch","verb","upagam"
"24","/","","","","punct",""
"","</s>","","","","",""
"","<s number=""10"">","","","","",""
"1","imāni","","","idam","pron",""
"2","mantra","MANTR","a@","mantra","noun-adj",""
"3","padāni","PAD","āni","pada","noun-adj",""
"4","bhavanti","BHAV","anti","bhav","verb","bhū"
"5","/","","","","punct",""
"","</s>","","","","",""
"","<s number=""11"">","","","","",""
"1","tadyathā","","","tadyathā","ind",""
"2","ḥoṃ","","","","ind",""
"3","pada","PAD","a@","pada","noun-adj",""
"4","ākramasi","ĀKRAM","asi","ākrām","verb","ākram"
"5","parākramasi","PARĀKRAM","asi","parākram","verb",""
"6","udayamasi","UDAYAM","asi","udayama","noun-adj",""
"7","nai","","","","ind",""
"8","ramasi","RAM","asi","ram","verb","ram"
"9","arkam","ARK","am","arka","noun-adj",""
"10","asi","","","as","verb","as"
"11","markam","MARK","am","marka","noun-adj",""
"12","asi","","","as","verb","as"
"13","urmasi","","","","ind",""
"14","va","","","vai","ind",""
"15","namasi","NAM","asi","nam","verb","nam"
"16","gulmam","GULM","am","gulma","noun-adj",""
"17","asi","","","as","verb","as"
"18","cīvaram","CĪVAR","am","cīvara","noun-adj",""
"19","asi","","","as","verb","as"
"20","mahā","MAH","ā@","mahat","noun-adj",""
"21","cīvaram","CĪVAR","am","cīvara","noun-adj",""
"22","asi","","","as","verb","as"
"23","antardhā","ANTARDH","ā@","antardhā","noun-adj",""
"24","namasi","NAMAS","i","nam","noun-adj","nam"
"25","svāhā","SVĀH","ā","svāhā","noun-adj",""
"26","/","","","","punct",""
"","</s>","","","","",""
"","<s number=""12"">","","","","",""
"1","oṃ","","","oṃ","ind",""
"2","mārīcī","MĀRĪC","ī@","mārīci","noun-adj",""
"3","devatā","DEVAT","ā","devatā","noun-adj",""
"4","pathe","PATH","e","patha","noun-adj",""
"5","māṃ","","","mat","pron",""
"6","gopaya","GOPAY","a","gopaya","noun-adj",""
"7","/","","","","punct",""
"","</s>","","","","",""
"","<s number=""13"">","","","","",""
"1","utpathe","UTPATH","e","utpatha","noun-adj",""
"2","māṃ","","","mat","pron",""
"3","gopaya","GOPAY","a","gopaya","noun-adj",""
"4","/","","","","punct",""
"","</s>","","","","",""
"","<s number=""14"">","","","","",""
"1","puruṣa","PURUṢ","a@","puruṣa","noun-adj",""
"2","bhayato","BHAY","ato","bhaya","noun-adj",""
"3","māṃ","","","mat","pron",""
"4","gopaya","GOPAY","a","gopaya","noun-adj",""
"5","/","","","","punct",""
"","</s>","","","","",""
"","<s number=""15"">","","","","",""
"1","rāja","RĀJ","a@","rājan","noun-adj",""
"2","bhayato","BHAY","ato","bhaya","noun-adj",""
"3","māṃ","","","mat","pron",""
"4","gopaya","GOPAY","a","gopaya","noun-adj",""
"5","/","","","","punct",""
"","</s>","","","","",""
"","<s number=""16"">","","","","",""
"1","hasti","HAST","i@","hasti","noun-adj",""
"2","bhayato","BHAY","ato","bhaya","noun-adj",""
"3","māṃ","","","mat","pron",""
"4","gopaya","GOPAY","a","gopaya","noun-adj",""
"5","/","","","","punct",""
"","</s>","","","","",""
"","<s number=""17"">","","","","",""
"1","caura","CAUR","a@","caura","noun-adj",""
"2","bhayato","BHAY","ato","bhaya","noun-adj",""
"3","māṃ","","","mat","pron",""
"4","gopaya","GOPAY","a","gopaya","noun-adj",""
"5","/","","","","punct",""
"","</s>","","","","",""
"","<s number=""18"">","","","","",""
"1","nāga","NĀG","a@","nāga","noun-adj",""
"2","bhayato","BHAY","ato","bhaya","noun-adj",""
"3","māṃ","","","mat","pron",""
"4","gopaya","GOPAY","a","gopaya","noun-adj",""
"5","/","","","","punct",""
"","</s>","","","","",""
"","<s number=""19"">","","","","",""
"1","siṃha","SIṂH","a@","siṃha","noun-adj",""
"2","bhayato","BHAY","ato","bhaya","noun-adj",""
"3","māṃ","","","mat","pron",""
"4","gopaya","GOPAY","a","gopaya","noun-adj",""
"5","/","","","","punct",""
"","</s>","","","","",""
"","<s number=""20"">","","","","",""
"1","vyāghra","VYĀGHR","a@","vyāghra","noun-adj",""
"2","bhayato","BHAY","ato","bhaya","noun-adj",""
"3","māṃ","","","mat","pron",""
"4","gopaya","GOPAY","a","gopaya","noun-adj",""
"5","/","","","","punct",""
"","</s>","","","","",""
"","<s number=""21"">","","","","",""
"1","a","","","alpha_privativum","ind",""
"2","śvabhayato","ŚVABH","ayato","śvabhr","noun-adj",""
"3","māṃ","","","mat","pron",""
"4","gopaya","GOPAY","a","gopaya","noun-adj",""
"5","/","","","","punct",""
"","</s>","","","","",""
"","<s number=""22"">","","","","",""
"","</page>","","","","",""
"","<page number=""158"">","","","","",""
"3","agni","AGN","i@","agni","noun-adj",""
"4","bhayato","BHAY","ato","bhaya","noun-adj",""
"5","māṃ","","","mat","pron",""
"6","gopaya","GOPAY","a","gopaya","noun-adj",""
"7","/","","","","punct",""
"","</s>","","","","",""
"","<s number=""23"">","","","","",""
"1","udaka","UDAK","a@","udaka","noun-adj",""
"2","bhayato","BHAY","ato","bhaya","noun-adj",""
"3","māṃ","","","mat","pron",""
"4","gopaya","GOPAY","a","gopaya","noun-adj",""
"5","/","","","","punct",""
"","</s>","","","","",""
"","<s number=""24"">","","","","",""
"1","sarpa","SARP","a@","sarpa","noun-adj",""
"2","bhayato","BHAY","ato","bhaya","noun-adj",""
"3","māṃ","","","mat","pron",""
"4","gopaya","GOPAY","a","gopaya","noun-adj",""
"5","/","","","","punct",""
"","</s>","","","","",""
"","<s number=""25"">","","","","",""
"1","viṣa","VIṢ","a@","viṣa","noun-adj",""
"2","bhayato","BHAY","ato","bhaya","noun-adj",""
"3","māṃ","","","mat","pron",""
"4","gopaya","GOPAY","a","gopaya","noun-adj",""
"5","/","","","","punct",""
"","</s>","","","","",""
"","<s number=""26"">","","","","",""
"1","sarva","SARV","a@","sarva","noun-adj",""
"2","praty","PRAT","y@","prati","noun-adj",""
"3","arthika","ARTH","ika@","arthika","noun-adj",""
"4","pratya","PRAT","ya@","prata","noun-adj",""
"5","mitra","MITR","a@","mitra","noun-adj",""
"6","bhayato","BHAY","ato","bhaya","noun-adj",""
"7","māṃ","","","mat","pron",""
"8","gopaya","GOPAY","a","gopaya","noun-adj",""
"9","/","","","","punct",""
"","</s>","","","","",""
"","<s number=""27"">","","","","",""
"1","ākuleṣu","ĀKUL","eṣu","ākula","noun-adj",""
"2","māṃ","","","mat","pron",""
"3","gopaya","GOPAY","a","gopaya","noun-adj",""
"4","/","","","","punct",""
"","</s>","","","","",""
"","<s number=""28"">","","","","",""
"1","a","","","alpha_privativum","ind",""
"2","nākuleṣu","NĀKUL","eṣu","nākula","noun-adj",""
"3","māṃ","","","mat","pron",""
"4","gopaya","GOPAY","a","gopaya","noun-adj",""
"5","/","","","","punct",""
"","</s>","","","","",""
"","<s number=""29"">","","","","",""
"1","mūrchiteṣu","MŪRCHIT","eṣu","mūrchita","noun-adj",""
"2","māṃ","","","mat","pron",""
"3","gopaya","GOPAY","a","gopaya","noun-adj",""
"4","/","","","","punct",""
"","</s>","","","","",""
"","<s number=""30"">","","","","",""
"1","a","","","alpha_privativum","ind",""
"2","mūrchiteṣu","MŪRCHIT","eṣu","mūrchita","noun-adj",""
"3","māṃ","","","mat","pron",""
"4","gopaya","GOPAY","a","gopaya","noun-adj",""
"5","/","","","","punct",""
"","</s>","","","","",""
"","<s number=""31"">","","","","",""
"1","n","","","na","ind",""
"2","āgato","ĀGAT","o","āgata","noun-adj",""
"3","me","","","mat","pron",""
"4","rakṣa","RAKṢ","a","rakṣa","noun-adj",""
"5","/","","","","punct",""
"","</s>","","","","",""
"","<s number=""32"">","","","","",""
"1","caṇḍamṛgato","CAṆḌAMṚG","ato","caṇḍamṛga","noun-adj",""
"2","me","","","mat","pron",""
"3","rakṣa","RAKṢ","a","rakṣa","noun-adj",""
"4","/","","","","punct",""
"","</s>","","","","",""
"","<s number=""33"">","","","","",""
"1","rakṣa","RAKṢ","a","rakṣa","noun-adj",""
"2","2","","","","ind",""
"3","mama","MAM","a","mat","pron",""
"4","sarva","SARV","a@","sarva","noun-adj",""
"5","satvānāṃ","SATTV","ānāṃ","sattva","noun-adj",""
"6","ca","","","ca","ind",""
"7","sarva","SARV","a@","sarva","noun-adj",""
"8","duṣṭa","DUṢṬ","a@","duṣṭa","noun-adj",""
"9","praduṣṭebhyaḥ","PRADUṢṬ","ebhyaḥ","praduṣṭa","noun-adj",""
"10","/","","","","punct",""
"","</s>","","","","",""
"","<s number=""34"">","","","","",""
"1","tadyathāḥ","","","","ind",""
"2","namo","NAM","o","namas","noun-adj",""
"3","ratnatrayāya","RATNATRAY","āya","ratnatraya","noun-adj",""
"4","oṃ","","","oṃ","ind",""
"5","ālo","","","","ind",""
"6","tālo","TĀL","o","tāla","noun-adj",""
"7","kālo","KĀL","o","kāla","noun-adj",""
"8","sa","","","sa_saha","ind",""
"9","cchalo","ŚAL","o","śala","noun-adj",""
"10","satva","SATTV","a@","sattva","noun-adj",""
"11","mudrati","MUDR","ati","mudr","verb",""
"12","rakṣa","RAKṢ","a","rakṣa","noun-adj",""
"13","rakṣa","RAKṢ","a","rakṣa","noun-adj",""
"14","māṃ","","","mat","pron",""
"15","saparivārasya","SAPARIVĀR","asya","saparivāra","noun-adj",""
"16","sarva","SARV","a@","sarva","noun-adj",""
"17","satvānāṃ","SATTV","ānāṃ","sattva","noun-adj",""
"18","ca","","","ca","ind",""
"19","sarva","SARV","a@","sarva","noun-adj",""
"20","bhaya","BHAY","a@","bhaya","noun-adj",""
"21","opadravebhyaḥ","UPADRAV","ebhyaḥ","upadrava","noun-adj",""
"22","svāhā","SVĀH","ā","svāhā","noun-adj",""
"23","/","","","","punct",""
"","</s>","","","","",""
"","<s number=""35"">","","","","",""
"1","namo","NAM","o","namas","noun-adj",""
"2","ratnatrayāya","RATNATRAY","āya","ratnatraya","noun-adj",""
"3","/","","","","punct",""
"","</s>","","","","",""
"","<s number=""36"">","","","","",""
"1","namo","NAM","o","namas","noun-adj",""
"2","bhagavatyai","BHAGAV","atyai","bhagavat","noun-adj",""
"3","ārya","ĀRY","a@","ārya","noun-adj",""
"4","mārīcī","MĀRĪC","ī@","mārīci","noun-adj",""
"5","devatāyai","DEVAT","āyai","devatā","noun-adj",""
"6","/","","","","punct",""
"","</s>","","","","",""
"","<s number=""37"">","","","","",""
"1","tasyā","","","tad","pron",""
"2","hṛdayam","HṚDAY","am","hṛdaya","noun-adj",""
"3","āvartayiṣyāmi","ĀVART","ayiṣyāmi","āvart","verb","āvṛt"
"4","/","","","","punct",""
"","</s>","","","","",""
"","<s number=""38"">","","","","",""
"1","tadyathā","","","tadyathā","ind",""
"2","ḥoṃ","","","","ind",""
"3","vattālī","VATTĀL","ī","vattālī","noun-adj",""
"4","vadālī","VADĀL","ī","vadālī","noun-adj",""
"5","varālī","VARĀL","ī","varālī","noun-adj",""
"6","varāhamukhī","VARĀHAMUKH","ī","varāhamukhī","noun-adj",""
"7","/","","","","punct",""
"","</s>","","","","",""
"","<s number=""39"">","","","","",""
"1","sarva","SARV","a@","sarva","noun-adj",""
"2","duṣṭa","DUṢṬ","a@","duṣṭa","noun-adj",""
"3","praduṣṭānāṃ","PRADUṢṬ","ānāṃ","praduṣṭa","noun-adj",""
"4","cakṣur","CAKṢ","ur","cakṣu","noun-adj",""
"5","mukhaṃ","MUKH","aṃ","mukha","noun-adj",""
"6","bandha","BANDH","a","bandha","noun-adj",""
"7","bandha","BANDH","a","bandha","noun-adj",""
"8","/","","","","punct",""
"","</s>","","","","",""
"","<s number=""40"">","","","","",""
"1","bandha","BANDH","a","bandha","noun-adj",""
"2","mukhaṃ","MUKH","aṃ","mukha","noun-adj",""
"3","jambhaya","JAMBH","aya","jambh","verb",""
"4","stambhaya","STAMBHAY","a","stambhayati","noun-adj",""
"5","mohaya","MOH","aya","moha","noun-adj",""
"6","svāhā","SVĀH","ā","svāhā","noun-adj",""
"7","/","","","","punct",""
"","</s>","","","","",""
"","<s number=""41"">","","","","",""
"1","oṃ","","","oṃ","ind",""
"2","mārīcyai","MĀRĪC","yai","mārīca","noun-adj",""
"3","svāhā","SVĀH","ā","svāhā","noun-adj",""
"4","/","","","","punct",""
"","</s>","","","","",""
"","<s number=""42"">","","","","",""
"1","oṃ","","","oṃ","ind",""
"2","varālī","VARĀL","ī","varālī","noun-adj",""
"3","vadālī","VADĀL","ī","vadālī","noun-adj",""
"4","vattālī","VATTĀL","ī","vattālī","noun-adj",""
"5","varāhamukhī","VARĀHAMUKH","ī","varāhamukhī","noun-adj",""
"6","sarva","SARV","a@","sarva","noun-adj",""
"7","duṣṭa","DUṢṬ","a@","duṣṭa","noun-adj",""
"8","praduṣṭānāṃ","PRADUṢṬ","ānāṃ","praduṣṭa","noun-adj",""
"9","cakṣur","CAKṢ","ur","cakṣu","noun-adj",""
"10","mukhaṃ","MUKH","aṃ","mukha","noun-adj",""
"11","bandha","BANDH","a","bandha","noun-adj",""
"12","bandha","BANDH","a","bandha","noun-adj",""
"13","jambhaya","JAMBH","aya","jambh","verb",""
"14","jambhaya","JAMBH","aya","jambh","verb",""
"15","stambhaya","STAMBHAY","a","stambhayati","noun-adj",""
"16","stambhaya","STAMBHAY","a","stambhayati","noun-adj",""
"17","mohaya","MOH","aya","moha","noun-adj",""
"18","mohaya","MOH","aya","moha","noun-adj",""
"19","bhañjaya","BHAÑJ","aya","bhañja","verb",""
"20","bhañjaya","BHAÑJ","aya","bhañja","verb",""
"21","tarjaya","TARJAY","a","tarjayati","noun-adj",""
"22","tarjaya","TARJAY","a","tarjayati","noun-adj",""
"23","hrīṃ","HR","īṃ","hrī","noun-adj",""
"24","hrīṃ","HR","īṃ","hrī","noun-adj",""
"25","hūṃ","","","","ind",""
"26","hūṃ","","","","ind",""
"27","phaṭ","PHAṬ","","phaṭa","noun-adj",""
"28","svāhā","SVĀH","ā","svāhā","noun-adj",""
"29","/","","","","punct",""
"","</s>","","","","",""
"","<s number=""43"">","","","","",""
"1","oṃ","","","oṃ","ind",""
"2","mārīcyai","MĀRĪC","yai","mārīca","noun-adj",""
"3","sara","SAR","a","sara","noun-adj",""
"4","sara","SAR","a","sara","noun-adj",""
"5","muhya","MUHY","a","muhyati","noun-adj",""
"6","muhya","MUHY","a","muhyati","noun-adj",""
"7","vimuhya","VIMUHY","a","vimuhya","noun-adj",""
"8","vimuhya","VIMUHY","a","vimuhya","noun-adj",""
"9","apakrāmy","APAKR","āmy","apakrī","noun-adj",""
"10","a","","","alpha_privativum","ind",""
"11","apakrāmy","APAKR","āmy","apakrī","noun-adj",""
"12","a","","","alpha_privativum","ind",""
"13","sarva","SARV","a@","sarva","noun-adj",""
"14","duṣṭa","DUṢṬ","a@","duṣṭa","noun-adj",""
"15","satvān","SATTV","ān","sattva","noun-adj",""
"16","pathe","PATH","e","patha","noun-adj",""
"17","utpathe","UTPATH","e","utpatha","noun-adj",""
"18","sarva","SARV","a@","sarva","noun-adj",""
"19","vighna","VIGHN","a","vighna","noun-adj",""
"20","vināyakā","VINĀYAK","ā","vināyaka","noun-adj",""
"21","apasarantu","APASAR","antu","apasara","noun-adj",""
"22","mā","","","mā","ind",""
"23","tiṣṭhantu","TIṢṬH","antu","tiṣṭh","verb","sthā"
"24","triratna","TRIRATN","a@","triratna","noun-adj",""
"25","satyena","SATY","ena","satya","noun-adj",""
"26","svāhā","SVĀH","ā","svāhā","noun-adj",""
"27","/","","","","punct",""
"","</s>","","","","",""
"","<s number=""44"">","","","","",""
"1","oṃ","","","oṃ","ind",""
"2","caṇḍa","CAṆḌ","a","caṇḍa","noun-adj",""
"3","parama","PARAM","a@","parama","noun-adj",""
"4","caṇḍa","CAṆḌ","a","caṇḍa","noun-adj",""
"5","svāhā","SVĀH","ā","svāhā","noun-adj",""
"6","/","","","","punct",""
"","</s>","","","","",""
"","<s number=""45"">","","","","",""
"1","oṃ","","","oṃ","ind",""
"2","a","","","alpha_privativum","ind",""
"3","gali","GAL","i","gali","noun-adj",""
"4","pa","","","","ind",""
"5","gali","GAL","i","gali","noun-adj",""
"6","pañca","PAÑC","a@","pañca","noun-adj",""
"7","gali","GAL","i","gali","noun-adj",""
"8","sarva","SARV","a@","sarva","noun-adj",""
"9","duṣṭa","DUṢṬ","a@","duṣṭa","noun-adj",""
"10","praduṣṭānāṃ","PRADUṢṬ","ānāṃ","praduṣṭa","noun-adj",""
"11","kāyavāk","KĀYAVĀK","","kāyavāka","noun-adj",""
"12","cittaṃ","CITT","aṃ","citta","noun-adj",""
"13","mukhaṃ","MUKH","aṃ","mukha","noun-adj",""
"14","cakṣuṣi","CAKṢUṢ","i","cakṣuṣa","noun-adj",""
"15","bandha","BANDH","a","bandha","noun-adj",""
"16","bandha","BANDH","a","bandha","noun-adj",""
"17","hūṃ","","","","ind",""
"18","hūṃ","","","","ind",""
"19","hūṃ","","","","ind",""
"20","phaṭ","PHAṬ","","phaṭa","noun-adj",""
"21","phaṭ","PHAṬ","","phaṭa","noun-adj",""
"22","phaṭ","PHAṬ","","phaṭa","noun-adj",""
"23","svāhā","SVĀH","ā","svāhā","noun-adj",""
"24","/","","","","punct",""
"","</s>","","","","",""
"","<s number=""46"">","","","","",""
"1","idam","IDAM","","idam","pron",""
"2","avocad","AVOCAD","","vak","verb","vac"
"3","bhagavān","BHAGAV","ān@","bhagavat","noun-adj",""
"4","āttamanās","ĀTTAMAN","ās","āttamanas","noun-adj",""
"5","te","","","tad","pron",""
"6","ca","","","ca","ind",""
"7","bhikṣavas","BHIKṢ","avas","bhikṣu","noun-adj",""
"8","te","","","tad","pron",""
"9","ca","","","ca","ind",""
"10","bodhisatvāḥ","BODHISATTV","āḥ","bodhisattva","noun-adj",""
"11","sā","","","tad","pron",""
"12","ca","","","ca","ind",""
"13","sarvāvatī","SARV","āvatī","sarvāvat","noun-adj",""
"14","parṣat","PARṢ","at","parṣad","noun-adj",""
"15","sad","SAD","","sat","noun-adj",""
"16","eva","","","eva","ind",""
"17","mānuṣa","MĀNUṢ","a@","mānuṣa","noun-adj",""
"18","āsura","ĀSUR","a@","āsura","noun-adj",""
"19","garuḍa","GARUḌ","a@","garuḍa","noun-adj",""
"20","gandharvaś","GANDHARV","aś","gandharva","noun-adj",""
"21","ca","","","ca","ind",""
"22","loko","LOK","o","loka","noun-adj",""
"23","bhagavato","BHAGAV","ato","bhagavat","noun-adj",""
"24","bhāṣitam","BHĀṢIT","am","bhāṣita","noun-adj",""
"25","abhyanandann","ABHYANAND","ann","abhyanandat","noun-adj",""
"26","iti","","","iti","ind",""
"27","/","","","","punct",""
"","</s>","","","","",""
"","</page>","","","","",""
"","</doc>","","","","",""
