"WordID","word","NormSTEM","suffix","lemma","PoS","Root"
"","<doc textid = ""advayazatikaprajjaparamitasutra"" genre = ""dhāraṇī"" title = ""advayaśatikāprajñāpāramitāsūtra"" author = ""n /a"" discourse = ""prajñapāramitā"" tradition = ""buddh"" period = ""uncertain"" source = ""gretil accessed aug 2019 : http://gretil.sub.uni-goettingen.de/gretil/corpustei/sa_gretilbuddh _ avayasatika prajnaparamitasutra aśpp base on the eition by m.b. shakya_ buhist himalaya 1_final.xml"" date_range = ""uncertain"" notes = ""alternative title: advayaśatikā. no information on this text found. conze does not mention it. the only references found was: seiren matsunami. 1965. a catalogue of the sanskrit manuscripts in the tokyo university library. tokyo: suzuki research foundation; and to the edition by shakya: ārya advayaśatikā prajñāpāramitā sūtra. 2004. rosemead calif: digital sankrit buddhist canon. http://www.dsbcproject.org/canon-text/book/67."" religion = ""buddh"" edition = ""based on the ed. by m.b. shakya 1988"" digitization = ""sanskrit buddhist input project"" segmentation_lemmatization = ""ligeia lugli & buddhist translators workbench team"" metadata_enrichment = ""bruno galasek-hul & buddhist translators workbench team"" proofreader = ""n/a"" permission = ""permission for derivatives from m. mehner on behalf of gretil"" reconstructions = ""none"">","","","","",""
"","<page number=""0000"">","","","","",""
"","<s number=""1"">","","","","",""
"1","ārya","ĀRY","a","ārya","noun-adj",""
"2","a","","","alpha_privativum","ind",""
"3","dvaya","DVAY","a@","dvaya","noun-adj",""
"4","śatikā","ŚATIK","ā","śatikā","noun-adj",""
"5","prajñāpāramitā","PRAJÑĀPĀRAMIT","ā","prajñāpāramitā","noun-adj",""
"6","sūtra","SŪTR","a","sūtra","noun-adj",""
"7","namo","NAM","o","namas","noun-adj",""
"8","bhagavatyai","BHAGAV","atyai","bhagavat","noun-adj",""
"9","ārya","ĀRY","a@","ārya","noun-adj",""
"10","prajñāpāramitāyai","PRAJÑĀPĀRAMIT","āyai","prajñāpāramitā","noun-adj",""
"11","//","","","","punct",""
"","</s>","","","","",""
"","<s number=""2"">","","","","",""
"1","evaṃ","","","eva","ind",""
"2","mayā","","","mat","pron",""
"3","śrutam","ŚRUT","am","śruta","noun-adj",""
"4","/","","","","punct",""
"5","ekasmin","EK","asmin","eka","noun-adj",""
"6","samaye","SAMAY","e","samaya","noun-adj",""
"7","bhagavān","BHAGAV","ān","bhagavat","noun-adj",""
"8","rājagṛhe","RĀJAGṚH","e","rājagṛha","noun-adj",""
"9","viharatisma","VIHAR","atisma","viharat","noun-adj",""
"10","gṛdhra","GṚDHR","a@","gṛdhra","noun-adj",""
"11","kūṭe","KŪṬ","e","kūṭa","noun-adj",""
"12","parvate","PARVAT","e","parvata","noun-adj",""
"13","mahatā","MAHAT","ā","mahat","noun-adj",""
"14","bhikṣu","BHIKṢ","u@","bhikṣu","noun-adj",""
"15","saṃghena","SAṂGH","ena","saṃgha","noun-adj",""
"16","sārdha","SĀRDH","a@","sārdha","noun-adj",""
"17","mardha","MARDH","a@","mardha","noun-adj",""
"18","trayodaśabhir","TRAYODAŚ","abhir","tri","noun-adj",""
"19","bhikṣu","BHIKṢ","u@","bhikṣu","noun-adj",""
"20","śatair","ŚAT","air","śata","noun-adj",""
"21","an","","","alpha_privativum","ind",""
"22","ekair","EK","air","eka","noun-adj",""
"23","brahma","BRAHM","a@","brahma","noun-adj",""
"24","śakra","ŚAKR","a@","śakra","noun-adj",""
"25","loka","LOK","a@","loka","noun-adj",""
"26","pālair","PĀL","air","pāla","noun-adj",""
"27","deva","DEV","a@","deva","noun-adj",""
"28","nāga","NĀG","a@","nāga","noun-adj",""
"29","yakṣa","YAKṢ","a@","yakṣa","noun-adj",""
"30","gandharva","GANDHARV","a@","gandharva","noun-adj",""
"31","āsura","ĀSUR","a@","āsura","noun-adj",""
"32","garūḍa","GARŪḌ","a@","garūḍa","noun-adj",""
"33","kinnara","KINNAR","a@","kinnara","noun-adj",""
"34","mahoragai","MAHORAG","ai","mahoraga","noun-adj",""
"35","rūpāsak","RŪP","āsak","rūpa","noun-adj",""
"36","opāsikābhiḥ","UPĀSIK","ābhiḥ","upāsikā","noun-adj",""
"37","sārdham","SĀRDH","am","sārdha","noun-adj",""
"38","/","","","","punct",""
"","</s>","","","","",""
"","<s number=""3"">","","","","",""
"1","tatra","","","tatra","ind",""
"2","khalu","KHAL","u","khal","verb",""
"3","bhagavān","BHAGAV","ān","bhagavat","noun-adj",""
"4","āyuṣmantaṃ","ĀYUṢM","antaṃ","āyuṣmat","noun-adj",""
"5","subhūtiṃm","SUBHŪT","iṃm","subhūta","noun-adj",""
"6","āmantrayate","AMANTR","ayate","amantra","noun-adj",""
"7","sma","","","sma","ind",""
"8","/","","","","punct",""
"","</s>","","","","",""
"","<s number=""4"">","","","","",""
"1","ye","","","yad","pron",""
"2","kecit","","","kimcit","ind",""
"3","subhūte","SUBHŪT","e","subhūta","noun-adj",""
"4","śrāvaka","ŚRĀVAK","a@","śrāvaka","noun-adj",""
"5","mārgaḥ","MĀRG","aḥ","mārga","noun-adj",""
"6","śikṣitu","ŚIKṢIT","u@","śikṣita","noun-adj",""
"7","kāmena","KĀM","ena","kāma","noun-adj",""
"8","prajñāpāramitā","PRAJÑĀPĀRAMIT","ā","prajñāpāramitā","noun-adj",""
"9","śrotavyā","ŚRO","tavyā","śṛṇ","verb","śru"
"10","udgṛhītavyā","UDGṚHĪT","avyā","udgṛhīta","noun-adj",""
"11","dhārayitavyā","DHĀRAY","itavyā","dhar","verb","dhṛ"
"12","vācayitavyāde","VĀCAY","itavyāde","vācaya","noun-adj",""
"13","śayitavyā","ŚAY","itavyā","śaya","noun-adj",""
"14","paryavāptavyā","PARYAVĀPT","avyā","paryavāpti","noun-adj",""
"15","/","","","","punct",""
"","</s>","","","","",""
"","<s number=""5"">","","","","",""
"1","ih","","","iha","ind",""
"2","^","","","","",""
"3","aiva","","","eva","ind",""
"4","prajñāpāramitāyām","PRAJÑĀPĀRAMIT","āyām","prajñāpāramitā","noun-adj",""
"5","upāya","UPĀY","a@","upāya","noun-adj",""
"6","kauśalya","KAUŚALY","a@","kauśalya","noun-adj",""
"7","samanvāgatena","SAMANVĀGAT","ena","samanvāgata","noun-adj",""
"8","bodhisattvena","BODHISATTV","ena","bodhisattva","noun-adj",""
"9","mahāsattvena","MAHĀSATTV","ena","mahāsattva","noun-adj",""
"10","sarva","SARV","a@","sarva","noun-adj",""
"11","buddha","BUDDH","a@","buddha","noun-adj",""
"12","dharma","DHARM","a@","dharma","noun-adj",""
"13","samudāgamāya","SAMUDĀGAM","āya","samudāgama","noun-adj",""
"14","yogaḥ","YOG","aḥ","yoga","noun-adj",""
"15","karaṇīyaḥ","KARAṆĪY","aḥ","karaṇīya","noun-adj",""
"16","/","","","","punct",""
"","</s>","","","","",""
"","<s number=""6"">","","","","",""
"1","tat","TAT","","tad","pron",""
"2","kasya","","","kim","pron",""
"3","hetoḥ?","HET","oḥ?","heta","punct",""
"4","iha","","","iha","ind",""
"5","prajñāpāramitāyāṃ","PRAJÑĀPĀRAMIT","āyāṃ","prajñāpāramitā","noun-adj",""
"6","vistareṇa","VISTAR","eṇa","vistara","noun-adj",""
"7","sarva","SARV","a@","sarva","noun-adj",""
"8","buddha","BUDDH","a@","buddha","noun-adj",""
"9","dharmā","DHARM","ā","dharma","noun-adj",""
"10","nirdiṣṭāḥ","NIRDIṢṬ","āḥ","nirdiṣṭa","noun-adj",""
"11","/","","","","punct",""
"","</s>","","","","",""
"","<s number=""7"">","","","","",""
"1","yatra","","","yatra","ind",""
"2","bodhisattvena","BODHISATTV","ena","bodhisattva","noun-adj",""
"3","śikṣitavyam","ŚIKṢ","itavyam","śikṣ","verb","śikṣ"
"3","śikṣitavyam","ŚIKṢ","itavyam","śakn","verb","śak"
"4","ye","","","yad","pron",""
"5","kecit","","","kimcit","ind",""
"6","subhūte","SUBHŪT","e","subhūta","noun-adj",""
"7","kuśala","KUŚAL","a@","kuśala","noun-adj",""
"8","dharmā","DHARM","ā","dharma","noun-adj",""
"9","bodhipakṣāḥ","BODHIPAKṢ","āḥ","bodhipakṣa","noun-adj",""
"10","śrāvaka","ŚRĀVAK","a@","śrāvaka","noun-adj",""
"11","dharmā","DHARM","ā","dharma","noun-adj",""
"12","vā","","","vā","ind",""
"13","pratyeka","PRATYEK","a","pratyeka","noun-adj",""
"14","buddha","BUDDH","a@","buddha","noun-adj",""
"15","dharmā","DHARM","ā","dharma","noun-adj",""
"16","vā","","","vā","ind",""
"17","bodhisatva","BODHISATTV","a@","bodhisattva","noun-adj",""
"18","dharmā","DHARM","ā","dharma","noun-adj",""
"19","vā","","","vā","ind",""
"20","buddha","BUDDH","a@","buddha","noun-adj",""
"21","dharmā","DHARM","ā","dharma","noun-adj",""
"22","vā","","","vā","ind",""
"23","/","","","","punct",""
"","</s>","","","","",""
"","<s number=""8"">","","","","",""
"1","bodhipakṣāḥ","BODHIPAKṢ","āḥ","bodhipakṣa","noun-adj",""
"2","śrāvaka","ŚRĀVAK","a@","śrāvaka","noun-adj",""
"3","dharmāḥ","DHARM","āḥ","dharma","noun-adj",""
"4","pratyekabuddha","PRATYEKABUDDH","a@","pratyekabuddha","noun-adj",""
"5","dharmā","DHARM","ā","dharma","noun-adj",""
"6","bodhisatva","BODHISATTV","a@","bodhisattva","noun-adj",""
"7","dharmāstvaṃ","DHARM","āstvaṃ","dharma","noun-adj",""
"8","te","","","tad","pron",""
"9","prajñāpāramitāyām","PRAJÑĀPĀRAMIT","āyām","prajñāpāramitā","noun-adj",""
"10","antargatām","ANTARGAT","ām","antargata","noun-adj",""
"11","anupraviṣṭāḥ","ANUPRAVIṢṬ","āḥ","anupraviṣṭa","noun-adj",""
"12","saṃgraha","SAṂGRAH","a@","saṃgraha","noun-adj",""
"13","samavasaraṇaṃ","SAMAVASARAṆ","aṃ","samavasaraṇa","noun-adj",""
"14","gacchanti","GACCH","anti","gacch","verb","gam"
"15","/","","","","punct",""
"","</s>","","","","",""
"","<s number=""9"">","","","","",""
"1","bhagavān","BHAGAV","ān","bhagavat","noun-adj",""
"2","āha","ĀH","a","ah","verb","ah"
"3","—","","","","punct",""
"4","tadyathā","","","tadyathā","ind",""
"5","subhūte","SUBHŪT","e","subhūta","noun-adj",""
"6","dāna","DĀN","a@","dāna","noun-adj",""
"7","pāramiutā","PĀRAM","iutā","pārama","noun-adj",""
"8","śīla","ŚĪL","a@","śīla","noun-adj",""
"9","pāramitā","PĀRAMIT","ā","pāramitā","noun-adj",""
"10","kṣānti","KṢĀNT","i@","kṣānti","noun-adj",""
"11","pāramitā","PĀRAMIT","ā","pāramitā","noun-adj",""
"12","vīrya","VĪRY","a@","vīrya","noun-adj",""
"13","pāramitā","PĀRAMIT","ā","pāramitā","noun-adj",""
"14","dhyāna","DHYĀN","a@","dhyāna","noun-adj",""
"15","pāramitā","PĀRAMIT","ā","pāramitā","noun-adj",""
"16","prajñāpāramitā","PRAJÑĀPĀRAMIT","ā","prajñāpāramitā","noun-adj",""
"17","/","","","","punct",""
"","</s>","","","","",""
"","<s number=""10"">","","","","",""
"1","adhyātma","ADHYĀTM","a@","adhyātma","noun-adj",""
"2","śūnyatā","ŚŪNYAT","ā","śūnyatā","noun-adj",""
"3","vahir","VAH","ir","vahi","noun-adj",""
"4","dhā","","","","ind",""
"5","śūnyatā","ŚŪNYAT","ā","śūnyatā","noun-adj",""
"6","adhyātmavahirdhā","ADHYĀTMAV","ahirdhā","adhyātmava","noun-adj",""
"7","śūnyatā","ŚŪNYAT","ā","śūnyatā","noun-adj",""
"8","śūnyatā","ŚŪNYAT","ā","śūnyatā","noun-adj",""
"9","śūnyatā","ŚŪNYAT","ā","śūnyatā","noun-adj",""
"10","mahā","MAH","ā@","mahat","noun-adj",""
"11","śūnyatā","ŚŪNYAT","ā","śūnyatā","noun-adj",""
"12","paramārtha","PARAMĀRTH","a@","paramārtha","noun-adj",""
"13","śūnyatā","ŚŪNYAT","ā","śūnyatā","noun-adj",""
"14","saṃskṛta","SAṂSKṚT","a@","saṃskṛta","noun-adj",""
"15","śūnyatā","ŚŪNYAT","ā","śūnyatā","noun-adj",""
"16","a","","","alpha_privativum","ind",""
"17","saṃskṛta","SAṂSKṚT","a@","saṃskṛta","noun-adj",""
"18","śūnyatā","ŚŪNYAT","ā","śūnyatā","noun-adj",""
"19","atyanta","ATYANT","a","atyanta","noun-adj",""
"20","śūnyatā","ŚŪNYAT","ā","śūnyatā","noun-adj",""
"21","anavarāgra","ANAVARĀGR","a@","anavarāgra","noun-adj",""
"22","śūnyatā","ŚŪNYAT","ā","śūnyatā","noun-adj",""
"23","a","","","alpha_privativum","ind",""
"24","nava","NAV","a@","nava","noun-adj",""
"25","kāra","KĀR","a@","kāra","noun-adj",""
"26","śūnyatā","ŚŪNYAT","ā","śūnyatā","noun-adj",""
"27","prakṛti","PRAKṚT","i@","prakṛti","noun-adj",""
"28","śūnyatā","ŚŪNYAT","ā","śūnyatā","noun-adj",""
"29","sarva","SARV","a@","sarva","noun-adj",""
"30","dharma","DHARM","a@","dharma","noun-adj",""
"31","śūnyatā","ŚŪNYAT","ā","śūnyatā","noun-adj",""
"32","sva","SV","a@","sva","noun-adj",""
"33","lakṣaṇa","LAKṢAṆ","a@","lakṣaṇa","noun-adj",""
"34","śūnyatā","ŚŪNYAT","ā","śūnyatā","noun-adj",""
"35","anupalambha","ANUPALAMBH","a@","anupalambha","noun-adj",""
"36","śūnyatā","ŚŪNYAT","ā","śūnyatā","noun-adj",""
"37","a","","","alpha_privativum","ind",""
"38","bhāva","BHĀV","a@","bhāva","noun-adj",""
"39","śūnyatā","ŚŪNYAT","ā","śūnyatā","noun-adj",""
"40","svabhāva","SVABHĀV","a@","svabhāva","noun-adj",""
"41","śūnyatā","ŚŪNYAT","ā","śūnyatā","noun-adj",""
"42","a","","","alpha_privativum","ind",""
"43","bhāva","BHĀV","a@","bhāva","noun-adj",""
"44","svabhāva","SVABHĀV","a@","svabhāva","noun-adj",""
"45","śūnyatā","ŚŪNYAT","ā","śūnyatā","noun-adj",""
"46","/","","","","punct",""
"","</s>","","","","",""
"","<s number=""11"">","","","","",""
"1","catvāri","CATVĀR","i","catur","noun-adj",""
"2","smṛutyupa","","","","ind",""
"3","sthānāni","STHĀN","āni","sthāna","noun-adj",""
"4","/","","","","punct",""
"5","catvāri","CATVĀR","i","catur","noun-adj",""
"6","samyak","SAMYA","k@","samyak","noun-adj",""
"7","prahāṇāni","PRAHĀṆ","āni","prahāṇa","noun-adj",""
"8","/","","","","punct",""
"9","catvāri","CATVĀR","i","catur","noun-adj",""
"10","ṛddhipādāni","ṚDDHIPĀD","āni","ṛddhipāda","noun-adj",""
"11","/","","","","punct",""
"12","pañca","PAÑC","a@","pañca","noun-adj",""
"13","endriyāṇi","INDRIY","āṇi","indriya","noun-adj",""
"14","/","","","","punct",""
"15","pañca","PAÑC","a@","pañca","noun-adj",""
"16","balāni","BAL","āni","bala","noun-adj",""
"17","/","","","","punct",""
"18","sapta","SAPT","a@","sapta","noun-adj",""
"19","bodhyaṅgāni","BODHYAṄG","āni","bodhyaṅga","noun-adj",""
"20","/","","","","punct",""
"21","ārya","ĀRY","a@","ārya","noun-adj",""
"22","āṣṭāṅgika","AṢṬĀṄGIK","a@","aṣṭāṅgika","noun-adj",""
"23","mārgāḥ","MĀRG","āḥ","mārga","noun-adj",""
"24","//","","","","punct",""
"","</s>","","","","",""
"","<s number=""12"">","","","","",""
"1","catvāri","CATVĀR","i","catur","noun-adj",""
"2","dhyānāni","DHYĀN","āni","dhyāna","noun-adj",""
"3","/","","","","punct",""
"4","catvāri","CATVĀR","i","catur","noun-adj",""
"5","pramāṇāni","PRAMĀṆ","āni","pramāṇa","noun-adj",""
"6","/","","","","punct",""
"7","catasra","CATASR","a","catasra","noun-adj",""
"8","ārūpya","ĀRŪPY","a@","ārūpya","noun-adj",""
"9","samāpattayaḥ","SAMĀPATT","ayaḥ","samāpatti","noun-adj",""
"10","/","","","","punct",""
"11","aṣṭau","AṢṬ","au","aṣṭa","noun-adj",""
"12","vimokṣāḥ","VIMOKṢ","āḥ","vimokṣa","noun-adj",""
"13","/","","","","punct",""
"14","nava","NAV","a@","nava","noun-adj",""
"15","ānupūrva","ANUPŪRV","a@","anupūrva","noun-adj",""
"16","vihāra","VIHĀR","a@","vihāra","noun-adj",""
"17","samāpattayaḥ","SAMĀPATT","ayaḥ","samāpatti","noun-adj",""
"18","/","","","","punct",""
"19","sarva","SARV","a@","sarva","noun-adj",""
"20","dhāraṇī","DHĀRAṆ","ī@","dhāraṇī","noun-adj",""
"21","mukhāni","MUKH","āni","mukha","noun-adj",""
"22","/","","","","punct",""
"23","daśa","DAŚ","a@","daśa","noun-adj",""
"24","tathāgata","TATHĀGAT","a@","tathāgata","noun-adj",""
"25","balāni","BAL","āni","bala","noun-adj",""
"26","/","","","","punct",""
"27","catvāri","CATVĀR","i","catur","noun-adj",""
"28","vaiśāradyāni","VAIŚĀRADY","āni","vaiśāradya","noun-adj",""
"29","/","","","","punct",""
"30","catasraḥ","CATASR","aḥ","catasra","noun-adj",""
"31","pratisaṃvidaḥ","PRATISAṂVID","aḥ","pratisaṃvidā","noun-adj",""
"32","/","","","","punct",""
"33","maha","MAH","a@","mahat","noun-adj",""
"34","maitrī","MAITR","ī","maitrī","noun-adj",""
"35","mahākarūṇā","MAHĀKAR","ūṇā","mahākara","noun-adj",""
"36","/","","","","punct",""
"37","aṣṭādaśa","AṢṬĀDAŚ","a@","aṣṭādaśa","noun-adj",""
"38","āveṇika","ĀVEṆIK","a@","āveṇika","noun-adj",""
"39","buddha","BUDDH","a@","buddha","noun-adj",""
"40","dharmāḥ","DHARM","āḥ","dharma","noun-adj",""
"41","śrotāpatti","ŚROTĀPATT","i@","śrotāpatti","noun-adj",""
"42","phalaṃ","PHAL","aṃ","phala","noun-adj",""
"43","sakṛdāgāmi","SAKṚDĀGĀM","i@","sakṛdāgāmin","noun-adj",""
"44","phalaṃ","PHAL","aṃ","phala","noun-adj",""
"45","an","","","alpha_privativum","ind",""
"46","āgāmi","ĀGĀM","i@","āgāmin","noun-adj",""
"47","phalaṃ","PHAL","aṃ","phala","noun-adj",""
"48","sarvajñatā","SARVAJÑAT","ā","sarvajñatā","noun-adj",""
"49","ca","","","ca","ind",""
"50","/","","","","punct",""
"","</s>","","","","",""
"","<s number=""13"">","","","","",""
"1","iyam","","","idam","pron",""
"2","eva","EVA","","eva","ind",""
"3","subhūte","SUBHŪT","e","subhūta","noun-adj",""
"4","kuśala","KUŚAL","a@","kuśala","noun-adj",""
"5","dharmā","DHARM","ā","dharma","noun-adj",""
"6","bodhipakṣāḥ","BODHIPAKṢ","āḥ","bodhipakṣa","noun-adj",""
"7","śrāvaka","ŚRĀVAK","a@","śrāvaka","noun-adj",""
"8","dharmāḥ","DHARM","āḥ","dharma","noun-adj",""
"9","pratyekabuddha","PRATYEKABUDDH","a@","pratyekabuddha","noun-adj",""
"10","dharmāḥ","DHARM","āḥ","dharma","noun-adj",""
"11","/","","","","punct",""
"","</s>","","","","",""
"","<s number=""14"">","","","","",""
"1","yatra","","","yatra","ind",""
"2","prajñāpāramitāyām","PRAJÑĀPĀRAMIT","āyām","prajñāpāramitā","noun-adj",""
"3","antargatā","ANTARGAT","ā","antargata","noun-adj",""
"4","anupraviṣṭāḥ","ANUPRAVIṢṬ","āḥ","anupraviṣṭa","noun-adj",""
"5","sa","","","sa_saha","ind",""
"6","graha","GRAH","a@","graha","noun-adj",""
"7","samavasaraṇaṃ","SAMAVASARAṆ","aṃ","samavasaraṇa","noun-adj",""
"8","gacchanti","GACCH","anti","gacch","verb","gam"
"9","/","","","","punct",""
"","</s>","","","","",""
"","<s number=""15"">","","","","",""
"1","subhūtir","SUBHŪT","ir","subhūti","noun-adj",""
"2","āha","ĀH","a","ah","verb","ah"
"3","—","","","","punct",""
"4","aho!","","","","punct",""
"5","aho!","","","","punct",""
"6","duravagāhā","DURAVAGĀH","ā","duravagāha","noun-adj",""
"7","vateyaṃ","","","","ind",""
"8","prajñāpāramitā","PRAJÑĀPĀRAMIT","ā","prajñāpāramitā","noun-adj",""
"9","/","","","","punct",""
"","</s>","","","","",""
"","<s number=""16"">","","","","",""
"1","yatra","","","yatra","ind",""
"2","hi","","","hi","ind",""
"3","nāma","NĀM","a","nāman","noun-adj",""
"4","kuśala","KUŚAL","a@","kuśala","noun-adj",""
"5","dharmā","DHARM","ā","dharma","noun-adj",""
"6","bodhipakṣāḥ","BODHIPAKṢ","āḥ","bodhipakṣa","noun-adj",""
"7","śrāvaka","ŚRĀVAK","a@","śrāvaka","noun-adj",""
"8","dharmāḥ","DHARM","āḥ","dharma","noun-adj",""
"9","pratyekabuddha","PRATYEKABUDDH","a@","pratyekabuddha","noun-adj",""
"10","dharmā","DHARM","ā","dharma","noun-adj",""
"11","bodhisatva","BODHISATTV","a@","bodhisattva","noun-adj",""
"12","dharmā","DHARM","ā","dharma","noun-adj",""
"13","buddha","BUDDH","a@","buddha","noun-adj",""
"14","dharmā","DHARM","ā","dharma","noun-adj",""
"15","iti","","","iti","ind",""
"16","/","","","","punct",""
"","</s>","","","","",""
"","<s number=""17"">","","","","",""
"1","yato","","","yatas","ind",""
"2","prajñāpāramitāyām","PRAJÑĀPĀRAMIT","āyām","prajñāpāramitā","noun-adj",""
"3","antargatā","ANTARGAT","ā","antargata","noun-adj",""
"4","anupraviṣṭāḥ","ANUPRAVIṢṬ","āḥ","anupraviṣṭa","noun-adj",""
"5","saṃgraha","SAṂGRAH","a@","saṃgraha","noun-adj",""
"6","samavasaraṇaṃ","SAMAVASARAṆ","aṃ","samavasaraṇa","noun-adj",""
"7","gacchanti","GACCH","anti","gacch","verb","gam"
"8","/","","","","punct",""
"","</s>","","","","",""
"","<s number=""18"">","","","","",""
"1","bhagavān","BHAGAV","ān","bhagavat","noun-adj",""
"2","āha","ĀH","a","ah","verb","ah"
"3","—","","","","punct",""
"4","atyanta","ATYANT","a@","atyanta","noun-adj",""
"5","muktatvāt","MUKT","atvāt","muktatva","noun-adj",""
"6","subhūte","SUBHŪT","e","subhūta","noun-adj",""
"7","prajñāpāramitā","PRAJÑĀPĀRAMIT","ā","prajñāpāramitā","noun-adj",""
"8","/","","","","punct",""
"","</s>","","","","",""
"","<s number=""19"">","","","","",""
"1","subhūtir","SUBHŪT","ir","subhūti","noun-adj",""
"2","āha","ĀH","a","ah","verb","ah"
"3","—","","","","punct",""
"4","aho!","","","","punct",""
"5","aho!","","","","punct",""
"6","duravagāhā","DURAVAGĀH","ā","duravagāha","noun-adj",""
"7","vateyaṃ","","","","ind",""
"8","prajñāpāramitā","PRAJÑĀPĀRAMIT","ā","prajñāpāramitā","noun-adj",""
"9","/","","","","punct",""
"","</s>","","","","",""
"","<s number=""20"">","","","","",""
"1","bhagavān","BHAGAV","ān","bhagavat","noun-adj",""
"2","āha","ĀH","a","ah","verb","ah"
"3","—","","","","punct",""
"4","atyanta","ATYANT","a@","atyanta","noun-adj",""
"5","viśuddhatvāt","VIŚUDDH","atvāt","viśuddhatva","noun-adj",""
"6","subhūte","SUBHŪT","e","subhūta","noun-adj",""
"7","prajñāpāramitā","PRAJÑĀPĀRAMIT","ā","prajñāpāramitā","noun-adj",""
"8","/","","","","punct",""
"","</s>","","","","",""
"","<s number=""21"">","","","","",""
"1","subhūtir","SUBHŪT","ir","subhūti","noun-adj",""
"2","āha","ĀH","a","ah","verb","ah"
"3","—","","","","punct",""
"4","aho!","","","","punct",""
"5","aho!","","","","punct",""
"6","duravagāhā","DURAVAGĀH","ā","duravagāha","noun-adj",""
"7","vateyaṃ","","","","ind",""
"8","bhagavan","BHAGAV","an","bhagavat","noun-adj",""
"9","prajñāpāramitā","PRAJÑĀPĀRAMIT","ā","prajñāpāramitā","noun-adj",""
"10","/","","","","punct",""
"","</s>","","","","",""
"","<s number=""22"">","","","","",""
"1","bhagavān","BHAGAV","ān","bhagavat","noun-adj",""
"2","āha","ĀH","a","ah","verb","ah"
"3","—","","","","punct",""
"4","atyanta","ATYANT","a@","atyanta","noun-adj",""
"5","śuddhatvāt","ŚUDDH","atvāt","śuddhatva","noun-adj",""
"6","subhūte","SUBHŪT","e","subhūta","noun-adj",""
"7","prajñāpāramitā","PRAJÑĀPĀRAMIT","ā","prajñāpāramitā","noun-adj",""
"8","/","","","","punct",""
"","</s>","","","","",""
"","<s number=""23"">","","","","",""
"1","tasmāt","","","tad","pron",""
"2","tarhi","","","tarhi","ind",""
"3","subhūte","SUBHŪT","e","subhūta","noun-adj",""
"4","ākāśa","ĀKĀŚ","a@","ākāśa","noun-adj",""
"5","opamā","UPAM","ā","upamā","noun-adj",""
"6","prajñāpāramitā","PRAJÑĀPĀRAMIT","ā","prajñāpāramitā","noun-adj",""
"7","/","","","","punct",""
"","</s>","","","","",""
"","<s number=""24"">","","","","",""
"1","subhūtir","SUBHŪT","ir","subhūti","noun-adj",""
"2","āha","ĀH","a","ah","verb","ah"
"3","—","","","","punct",""
"4","aho!","","","","punct",""
"5","aho!","","","","punct",""
"6","duravagāhā","DURAVAGĀH","ā","duravagāha","noun-adj",""
"7","vateya","","","","ind",""
"8","prajñāpāramitā","PRAJÑĀPĀRAMIT","ā","prajñāpāramitā","noun-adj",""
"9","bhagavan","BHAGAV","an","bhagavat","noun-adj",""
"10","abhiyuktena","ABHIYUKT","ena","abhiyukta","noun-adj",""
"11","/","","","","punct",""
"","</s>","","","","",""
"","<s number=""25"">","","","","",""
"1","bhagavān","BHAGAV","ān","bhagavat","noun-adj",""
"2","āha","ĀH","a","ah","verb","ah"
"3","—","","","","punct",""
"4","evam","","","eva","ind",""
"5","eva","","","eva","ind",""
"6","tadyathā","","","tadyathā","ind",""
"7","vadasi","VAD","asi","vad","verb","vad"
"8","/","","","","punct",""
"","</s>","","","","",""
"","<s number=""26"">","","","","",""
"1","duradhimocā","DURADHIMOC","ā","duradhimoca","noun-adj",""
"2","prajñāpāramitā","PRAJÑĀPĀRAMIT","ā","prajñāpāramitā","noun-adj",""
"3","an","","","alpha_privativum","ind",""
"4","abhiyuktena","ABHIYUKT","ena","abhiyukta","noun-adj",""
"5","parīta","PARĪT","a@","parīta","noun-adj",""
"6","kuśala","KUŚAL","a@","kuśala","noun-adj",""
"7","mūlena","MŪL","ena","mūla","noun-adj",""
"8","durmedhasa","DURMEDHAS","a","durmedhasa","noun-adj",""
"9","an","","","alpha_privativum","ind",""
"10","āvilena","ĀVIL","ena","āvila","noun-adj",""
"11","subhūtinā","SUBHŪT","inā","subhūti","noun-adj",""
"12","/","","","","punct",""
"","</s>","","","","",""
"","<s number=""27"">","","","","",""
"1","na","","","na","ind",""
"2","hi","","","hi","ind",""
"3","na","","","na","ind",""
"4","yady","","","yadi","ind",""
"5","ena","","","ena","ind",""
"6","pāpa","PĀP","a@","pāpa","noun-adj",""
"7","mitra","MITR","a@","mitra","noun-adj",""
"8","sahitena","SAHIT","ena","sa_saha","ind",""
"9","pāpa","PĀP","a@","pāpa","noun-adj",""
"10","mitra","MITR","a@","mitra","noun-adj",""
"11","savargeṇa","SAVAR","geṇa","savara","noun-adj",""
"12","bahulena","BAHUL","ena","bahula","noun-adj",""
"13","pāpa","PĀP","a@","pāpa","noun-adj",""
"14","mitra","MITR","a@","mitra","noun-adj",""
"15","samādāyena","SAMĀDĀY","ena","samādāya","noun-adj",""
"16","sad","SAD","@","sat","noun-adj",""
"17","dharma","DHARM","a@","dharma","noun-adj",""
"18","āntaka","ANTAK","a","antaka","noun-adj",""
"19","samanvāgatena","SAMANVĀGAT","ena","samanvāgata","noun-adj",""
"20","ādikarmikeṇa","ĀDIKARMIK","eṇa","ādikarmika","noun-adj",""
"21","atyanta","ATYANT","a@","atyanta","noun-adj",""
"22","rūpeṇa","RŪP","eṇa","rūpa","noun-adj",""
"23","a","","","alpha_privativum","ind",""
"24","paripṛcchaka","PARIPṚCCH","aka@","paripṛcchaka","noun-adj",""
"25","jātīyena","JĀTĪY","ena","jātīya","noun-adj",""
"26","duṣ","","","duḥ","ind",""
"27","prajña","PRAJÑ","a@","prajñā","noun-adj",""
"28","saṃvarttanīyena","SAṂVARTANĪY","ena","saṃvartanīya","noun-adj",""
"29","kusīdena","KUSĪD","ena","kusīda","noun-adj",""
"30","hīna","HĪN","a@","hīna","noun-adj",""
"31","satvena","SATTV","ena","sattva","noun-adj",""
"32","n","","","na","ind",""
"33","ādhimuktena","ADHIMUKT","ena","adhimukta","noun-adj",""
"34","kuśaleṣu","KUŚAL","eṣu","kuśala","noun-adj",""
"35","dharmeṣu","DHARM","eṣu","dharma","noun-adj",""
"36","an","","","alpha_privativum","ind",""
"37","abhiyuktena","ABHIYUKT","ena","abhiyukta","noun-adj",""
"38","tasy","","","tad","pron",""
"39","^","","","","",""
"40","aiva","","","eva","ind",""
"41","hi","","","hi","ind",""
"42","subhūte","SUBHŪT","e","subhūta","noun-adj",""
"43","duradhimocāṃ","DURADHIMOC","āṃ","duradhimoca","noun-adj",""
"44","prajñāpāramitām","PRAJÑĀPĀRAMIT","ām","prajñāpāramitā","noun-adj",""
"45","ucyate","UC","yate","vak","verb","vac"
"46","/","","","","punct",""
"","</s>","","","","",""
"","<s number=""28"">","","","","",""
"1","punar","","","punar","ind",""
"2","aparaṃ","","","","ind",""
"3","subhūte","SUBHŪT","e","subhūta","noun-adj",""
"4","yaḥ","","","yad","pron",""
"5","kaścit","","","kimcit","ind",""
"6","kulaputro","KULAPUTR","o","kulaputra","noun-adj",""
"7","vā","","","vā","ind",""
"8","kuladuhitā","KULADUHIT","ā","kuladuhitṛ","noun-adj",""
"9","vā","","","vā","ind",""
"10","imāṃ","","","idam","pron",""
"11","prajñāpāramitāṃ","PRAJÑĀPĀRAMIT","āṃ","prajñāpāramitā","noun-adj",""
"12","gambhīrāṃ","GAMBHĪR","āṃ","gambhīrā","noun-adj",""
"13","bhāṣanti","BHĀṢ","anti","bhāṣ","verb","bhāṣ"
"14","dhārayi","DHĀRAY","i","dhārayi","noun-adj",""
"15","vācayi","VĀCAY","i","vācayi","noun-adj",""
"16","deśayi","DEŚAY","i","deśayin","noun-adj",""
"17","paryavāpsyanti","PARYAVĀPS","yanti","paryavāpsa","noun-adj",""
"18","so","","","tad","pron",""
"19","atīta","ATĪT","a@","atīta","noun-adj",""
"20","ānāgata","ANĀGAT","a@","anāgata","noun-adj",""
"21","pratyutpannānāṃ","PRATYUTPANN","ānāṃ","pratyutpanna","noun-adj",""
"22","bhagavatāṃ","BHAGAV","atāṃ","bhagavat","noun-adj",""
"23","buddha","BUDDH","a@","buddha","noun-adj",""
"24","bodhiṃ","BODH","iṃ","bodhi","noun-adj",""
"25","bodhisattvā","BODHISATTV","ā","bodhisattva","noun-adj",""
"26","dhārayiṣyanti","DHĀR","ayiṣyanti","dhar","verb","dhṛ"
"27","/","","","","punct",""
"","</s>","","","","",""
"","<s number=""29"">","","","","",""
"1","tasmāt","","","tad","pron",""
"2","tarhi","","","tarhi","ind",""
"3","subhūte","SUBHŪT","e","subhūta","noun-adj",""
"4","adhyāśayena","ADHYĀŚAY","ena","adhyāśaya","noun-adj",""
"5","bhikṣavo","BHIKṢ","avo","bhikṣu","noun-adj",""
"6","anuttarāyāṃ","ANUTTAR","āyāṃ","anuttara","noun-adj",""
"7","samyaksambodhi","SAMYAKSAMBODH","i@","samyaksambodhi","noun-adj",""
"8","kāmen","KĀM","en","kāma","noun-adj",""
"9","ābhijñya","ABHIJÑ","ya@","abhijña","noun-adj",""
"10","prajñāpāramitā","PRAJÑĀPĀRAMIT","ā","prajñāpāramitā","noun-adj",""
"11","udgṛhītavyā","UDGṚHĪT","avyā","udgṛhīta","noun-adj",""
"12","/","","","","punct",""
"","</s>","","","","",""
"","<s number=""30"">","","","","",""
"1","idam","IDAM","","idam","pron",""
"2","avocad","AVOCAD","","vak","verb","vac"
"3","bhagavān","BHAGAV","ān","bhagavat","noun-adj",""
"4","n","","","na","ind",""
"5","āttamanā","ĀTTAMAN","ā","āttamanas","noun-adj",""
"6","sā","","","tad","pron",""
"7","ca","","","ca","ind",""
"8","sarvāvatī","SARV","āvatī","sarvāvat","noun-adj",""
"9","parvadīyaṃ","PARV","adīyaṃ","parvat","noun-adj",""
"10","bhagavato","BHAGAV","ato","bhagavat","noun-adj",""
"11","bhāṣitam","BHĀṢIT","am","bhāṣita","noun-adj",""
"12","abhinandan","ABHINAND","an","abhinandat","noun-adj",""
"13","niti","NIT","i","niti","noun-adj",""
"14","//","","","","punct",""
"","</s>","","","","",""
"","<s number=""31"">","","","","",""
"1","a","","","alpha_privativum","ind",""
"2","dvaya","DVAY","a@","dvaya","noun-adj",""
"3","śatikā","ŚATIK","ā","śatikā","noun-adj",""
"4","prajñāpāramitā","PRAJÑĀPĀRAMIT","ā","prajñāpāramitā","noun-adj",""
"5","dhāraṇī","DHĀRAṆ","ī","dhāraṇī","noun-adj",""
"6","sūtra","SŪTR","a","sūtra","noun-adj",""
"7","samāptā","SAMĀPT","ā","samāpta","noun-adj",""
"8","//","","","","punct",""
"9","0","","","","ind",""
"10","//","","","","punct",""
"","</s>","","","","",""
"","</page>","","","","",""
"","</doc>","","","","",""
