[23:09:16.003] [ INFO] base.BaseTest - Log4J2 properties file loaded
[23:09:16.008] [ INFO] base.BaseTest - Config properties file loaded
[23:09:16.017] [ INFO] extentlisteners.ExtentListeners - Test Suite Login started
[23:09:20.919] [ INFO] base.BaseTest - Google Chrome launched
[23:09:21.748] [ INFO] extentlisteners.ExtentListeners - Running test method testForgotPasswordFail of class LoginTest
[23:09:22.404] [ INFO] extentlisteners.ExtentListeners - Test passed: testForgotPasswordFail
[23:09:23.482] [ INFO] extentlisteners.ExtentListeners - Running test method testForgotPasswordSuccess of class LoginTest
[23:09:25.797] [ INFO] extentlisteners.ExtentListeners - Test passed: testForgotPasswordSuccess
[23:09:26.841] [ INFO] extentlisteners.ExtentListeners - Running test method testLoginFail of class LoginTest
[23:09:27.277] [ INFO] extentlisteners.ExtentListeners - Test passed: testLoginFail
[23:09:28.288] [ INFO] extentlisteners.ExtentListeners - Running test method testLoginSuccess of class LoginTest
[23:09:29.317] [ INFO] extentlisteners.ExtentListeners - Test passed: testLoginSuccess
[23:09:30.536] [ INFO] extentlisteners.ExtentListeners - Test Suite Login ending
[23:09:31.325] [ INFO] extentlisteners.ExtentListeners - Test Suite Partners started
[23:09:32.317] [ INFO] base.BaseTest - Google Chrome launched
[23:09:33.590] [ INFO] extentlisteners.ExtentListeners - Running test method testPartnersABCFilter of class PartnersTest
[23:09:35.996] [ INFO] extentlisteners.ExtentListeners - Test passed: testPartnersABCFilter
[23:09:37.001] [ INFO] extentlisteners.ExtentListeners - Running test method testColumnSort of class PartnersTest
[23:09:38.635] [ INFO] extentlisteners.ExtentListeners - Test passed: testColumnSort
[23:09:39.636] [ INFO] extentlisteners.ExtentListeners - Running test method testColumnMove of class PartnersTest
[23:09:43.338] [ INFO] extentlisteners.ExtentListeners - Test passed: testColumnMove
[23:09:44.357] [ INFO] extentlisteners.ExtentListeners - Running test method testPartnersFilter of class PartnersTest
[23:09:46.442] [ INFO] extentlisteners.ExtentListeners - Test passed: testPartnersFilter
[23:09:47.444] [ INFO] extentlisteners.ExtentListeners - Running test method testPartnersFilterDelete of class PartnersTest
[23:09:47.578] [ INFO] extentlisteners.ExtentListeners - Test passed: testPartnersFilterDelete
[23:09:48.592] [ INFO] extentlisteners.ExtentListeners - Running test method testPartnersFilterSave of class PartnersTest
[23:09:51.494] [ INFO] extentlisteners.ExtentListeners - Test passed: testPartnersFilterSave
[23:09:52.506] [ INFO] extentlisteners.ExtentListeners - Running test method testbulkEdit of class PartnersTest
[23:09:54.665] [ INFO] extentlisteners.ExtentListeners - Test passed: testbulkEdit
[23:09:55.679] [ INFO] extentlisteners.ExtentListeners - Running test method testCreatePartner of class PartnersTest
[23:09:59.586] [ INFO] extentlisteners.ExtentListeners - Test passed: testCreatePartner
[23:10:01.796] [ INFO] base.BaseTest - Google Chrome launched
[23:10:03.916] [ INFO] extentlisteners.ExtentListeners - Running test method testWriteHistoryMessage of class PartnersDetailsTest
[23:10:04.476] [ INFO] extentlisteners.ExtentListeners - Test passed: testWriteHistoryMessage
[23:10:05.477] [ INFO] extentlisteners.ExtentListeners - Running test method testShowFullHistory of class PartnersDetailsTest
[23:10:07.126] [ INFO] extentlisteners.ExtentListeners - Test passed: testShowFullHistory
[23:10:08.135] [ INFO] extentlisteners.ExtentListeners - Running test method testCreateProject of class PartnersDetailsTest
[23:10:11.581] [ INFO] extentlisteners.ExtentListeners - Test passed: testCreateProject
[23:10:12.586] [ INFO] extentlisteners.ExtentListeners - Running test method testSwitch of class PartnersDetailsTest
[23:10:13.206] [ INFO] extentlisteners.ExtentListeners - Test passed: testSwitch
[23:10:14.218] [ INFO] extentlisteners.ExtentListeners - Running test method testEditPartner of class PartnersDetailsTest
[23:10:16.733] [ INFO] extentlisteners.ExtentListeners - Test passed: testEditPartner
[23:10:17.748] [ INFO] extentlisteners.ExtentListeners - Running test method testDeleteProject of class PartnersDetailsTest
[23:10:18.655] [ INFO] extentlisteners.ExtentListeners - Test passed: testDeleteProject
[23:10:19.830] [ INFO] extentlisteners.ExtentListeners - Test Suite Partners ending
[23:10:19.893] [ INFO] extentlisteners.ExtentListeners - Test Suite Positions started
[23:10:20.866] [ INFO] base.BaseTest - Google Chrome launched
[23:10:22.832] [ INFO] extentlisteners.ExtentListeners - Running test method testPositionsABCFilter of class PositionsTest
[23:10:25.532] [ INFO] extentlisteners.ExtentListeners - Test passed: testPositionsABCFilter
[23:10:26.537] [ INFO] extentlisteners.ExtentListeners - Running test method testColumnSort of class PositionsTest
[23:10:28.178] [ INFO] extentlisteners.ExtentListeners - Test passed: testColumnSort
[23:10:29.189] [ INFO] extentlisteners.ExtentListeners - Running test method testColumnMove of class PositionsTest
[23:10:32.884] [ INFO] extentlisteners.ExtentListeners - Test passed: testColumnMove
[23:10:33.902] [ INFO] extentlisteners.ExtentListeners - Running test method testPositionsFilter of class PositionsTest
[23:10:45.804] [ INFO] extentlisteners.ExtentListeners - Test passed: testPositionsFilter
[23:10:46.805] [ INFO] extentlisteners.ExtentListeners - Running test method testPositionsFilterDelete of class PositionsTest
[23:10:46.924] [ INFO] extentlisteners.ExtentListeners - Test passed: testPositionsFilterDelete
[23:10:47.940] [ INFO] extentlisteners.ExtentListeners - Running test method testPositionsFilterSave of class PositionsTest
[23:10:50.898] [ INFO] extentlisteners.ExtentListeners - Test passed: testPositionsFilterSave
[23:10:51.905] [ INFO] extentlisteners.ExtentListeners - Running test method testbulkEdit of class PositionsTest
[23:10:55.983] [ INFO] extentlisteners.ExtentListeners - Test passed: testbulkEdit
[23:10:56.994] [ INFO] extentlisteners.ExtentListeners - Running test method testCreatePosition of class PositionsTest
[23:11:00.603] [ INFO] extentlisteners.ExtentListeners - Test passed: testCreatePosition
[23:11:02.543] [ INFO] base.BaseTest - Google Chrome launched
[23:11:05.011] [ INFO] extentlisteners.ExtentListeners - Running test method testWriteHistoryMessage of class PositionsDetailsTest
[23:11:05.492] [ INFO] extentlisteners.ExtentListeners - Test passed: testWriteHistoryMessage
[23:11:06.496] [ INFO] extentlisteners.ExtentListeners - Running test method testShowFullHistory of class PositionsDetailsTest
[23:11:08.150] [ INFO] extentlisteners.ExtentListeners - Test passed: testShowFullHistory
[23:11:09.158] [ INFO] extentlisteners.ExtentListeners - Running test method testEditPosition of class PositionsDetailsTest
[23:11:11.076] [ INFO] extentlisteners.ExtentListeners - Test passed: testEditPosition
[23:11:13.050] [ INFO] base.BaseTest - Google Chrome launched
[23:11:15.784] [ INFO] extentlisteners.ExtentListeners - Running test method testCreateKanbanCandidate of class PositionsDetailsKanbanTest
[23:11:19.640] [ INFO] extentlisteners.ExtentListeners - Test passed: testCreateKanbanCandidate
[23:11:20.647] [ INFO] extentlisteners.ExtentListeners - Running test method testSortKanban of class PositionsDetailsKanbanTest
[23:11:20.805] [ INFO] extentlisteners.ExtentListeners - Test passed: testSortKanban
[23:11:21.813] [ INFO] extentlisteners.ExtentListeners - Running test method testchangeKanbanView of class PositionsDetailsKanbanTest
[23:11:23.572] [ INFO] extentlisteners.ExtentListeners - Test passed: testchangeKanbanView
[23:11:25.514] [ INFO] base.BaseTest - Google Chrome launched
[23:11:28.242] [ INFO] extentlisteners.ExtentListeners - Running test method testCreateAd of class PositionsDetailsAdsTest
[23:11:30.151] [ERROR] extentlisteners.ExtentListeners - Test failed: testCreateAd
org.openqa.selenium.ElementClickInterceptedException: element click intercepted: Element <button _ngcontent-mgb-c107="" type="button" variation="hint" class="close-button text-right" ng-reflect-variation="hint" ng-reflect-ng-class="[object Object]" ng-reflect-placement="bottom" ng-reflect-is-enabled="false" ng-reflect-inline-s-v-g="assets/image/calendar.svg">...</button> is not clickable at point (947, 380). Other element would receive the click: <div class="cdk-overlay-backdrop mat-overlay-transparent-backdrop mat-datepicker-0-backdrop cdk-overlay-backdrop-showing"></div>
  (Session info: chrome=124.0.6367.61)
Build info: version: '4.19.1', revision: 'abe0ee07dc'
System info: os.name: 'Windows 11', os.arch: 'amd64', os.version: '10.0', java.version: '11.0.19'
Driver info: org.openqa.selenium.chrome.ChromeDriver
Command: [a6842cd01f5471f31888a451f3314625, clickElement {id=f.7088F0FB12AEB54BECDB40A5D617B7DF.d.08FFB776015797D2DA5415A7B9720FD1.e.200}]
Capabilities {acceptInsecureCerts: false, browserName: chrome, browserVersion: 124.0.6367.61, chrome: {chromedriverVersion: 124.0.6367.91 (51df0e5e17a8..., userDataDir: C:\Users\user\AppData\Local...}, fedcm:accounts: true, goog:chromeOptions: {debuggerAddress: localhost:61334}, networkConnectionEnabled: false, pageLoadStrategy: normal, platformName: windows, proxy: Proxy(), se:cdp: ws://localhost:61334/devtoo..., se:cdpVersion: 124.0.6367.61, setWindowRect: true, strictFileInteractability: false, timeouts: {implicit: 0, pageLoad: 300000, script: 30000}, unhandledPromptBehavior: dismiss and notify, webauthn:extension:credBlob: true, webauthn:extension:largeBlob: true, webauthn:extension:minPinLength: true, webauthn:extension:prf: true, webauthn:virtualAuthenticators: true}
Element: [[ChromeDriver: chrome on windows (a6842cd01f5471f31888a451f3314625)] -> xpath: //app-datepicker[@formcontrolname='endDate']//button]
Session ID: a6842cd01f5471f31888a451f3314625
	at java.base/jdk.internal.reflect.NativeConstructorAccessorImpl.newInstance0(Native Method) ~[?:?]
	at java.base/jdk.internal.reflect.NativeConstructorAccessorImpl.newInstance(NativeConstructorAccessorImpl.java:62) ~[?:?]
	at java.base/jdk.internal.reflect.DelegatingConstructorAccessorImpl.newInstance(DelegatingConstructorAccessorImpl.java:45) ~[?:?]
	at java.base/java.lang.reflect.Constructor.newInstance(Constructor.java:490) ~[?:?]
	at org.openqa.selenium.remote.ErrorCodec.decode(ErrorCodec.java:167) ~[selenium-remote-driver-4.19.1.jar:?]
	at org.openqa.selenium.remote.codec.w3c.W3CHttpResponseCodec.decode(W3CHttpResponseCodec.java:138) ~[selenium-remote-driver-4.19.1.jar:?]
	at org.openqa.selenium.remote.codec.w3c.W3CHttpResponseCodec.decode(W3CHttpResponseCodec.java:50) ~[selenium-remote-driver-4.19.1.jar:?]
	at org.openqa.selenium.remote.HttpCommandExecutor.execute(HttpCommandExecutor.java:190) ~[selenium-remote-driver-4.19.1.jar:?]
	at org.openqa.selenium.remote.service.DriverCommandExecutor.invokeExecute(DriverCommandExecutor.java:216) ~[selenium-remote-driver-4.19.1.jar:?]
	at org.openqa.selenium.remote.service.DriverCommandExecutor.execute(DriverCommandExecutor.java:174) ~[selenium-remote-driver-4.19.1.jar:?]
	at org.openqa.selenium.remote.RemoteWebDriver.execute(RemoteWebDriver.java:518) ~[selenium-remote-driver-4.19.1.jar:?]
	at org.openqa.selenium.remote.RemoteWebElement.execute(RemoteWebElement.java:223) ~[selenium-remote-driver-4.19.1.jar:?]
	at org.openqa.selenium.remote.RemoteWebElement.click(RemoteWebElement.java:76) ~[selenium-remote-driver-4.19.1.jar:?]
	at jdk.internal.reflect.GeneratedMethodAccessor7.invoke(Unknown Source) ~[?:?]
	at java.base/jdk.internal.reflect.DelegatingMethodAccessorImpl.invoke(DelegatingMethodAccessorImpl.java:43) ~[?:?]
	at java.base/java.lang.reflect.Method.invoke(Method.java:566) ~[?:?]
	at org.openqa.selenium.support.pagefactory.internal.LocatingElementHandler.invoke(LocatingElementHandler.java:51) ~[selenium-support-4.19.1.jar:?]
	at com.sun.proxy.$Proxy31.click(Unknown Source) ~[?:?]
	at pages.PositionsDetailsAdsPage.createAd(PositionsDetailsAdsPage.java:39) ~[classes/:?]
	at testcases.PositionsDetailsAdsTest.testCreateAd(PositionsDetailsAdsTest.java:23) ~[test-classes/:?]
	at java.base/jdk.internal.reflect.NativeMethodAccessorImpl.invoke0(Native Method) ~[?:?]
	at java.base/jdk.internal.reflect.NativeMethodAccessorImpl.invoke(NativeMethodAccessorImpl.java:62) ~[?:?]
	at java.base/jdk.internal.reflect.DelegatingMethodAccessorImpl.invoke(DelegatingMethodAccessorImpl.java:43) ~[?:?]
	at java.base/java.lang.reflect.Method.invoke(Method.java:566) ~[?:?]
	at org.testng.internal.invokers.MethodInvocationHelper.invokeMethod(MethodInvocationHelper.java:141) ~[testng-7.10.0.jar:7.10.0]
	at org.testng.internal.invokers.TestInvoker.invokeMethod(TestInvoker.java:686) ~[testng-7.10.0.jar:7.10.0]
	at org.testng.internal.invokers.TestInvoker.invokeTestMethod(TestInvoker.java:230) ~[testng-7.10.0.jar:7.10.0]
	at org.testng.internal.invokers.MethodRunner.runInSequence(MethodRunner.java:63) ~[testng-7.10.0.jar:7.10.0]
	at org.testng.internal.invokers.TestInvoker$MethodInvocationAgent.invoke(TestInvoker.java:992) ~[testng-7.10.0.jar:7.10.0]
	at org.testng.internal.invokers.TestInvoker.invokeTestMethods(TestInvoker.java:203) ~[testng-7.10.0.jar:7.10.0]
	at org.testng.internal.invokers.TestMethodWorker.invokeTestMethods(TestMethodWorker.java:154) ~[testng-7.10.0.jar:7.10.0]
	at org.testng.internal.invokers.TestMethodWorker.run(TestMethodWorker.java:134) ~[testng-7.10.0.jar:7.10.0]
	at java.base/java.util.ArrayList.forEach(ArrayList.java:1541) [?:?]
	at org.testng.TestRunner.privateRun(TestRunner.java:739) [testng-7.10.0.jar:7.10.0]
	at org.testng.TestRunner.run(TestRunner.java:614) [testng-7.10.0.jar:7.10.0]
	at org.testng.SuiteRunner.runTest(SuiteRunner.java:421) [testng-7.10.0.jar:7.10.0]
	at org.testng.SuiteRunner.runSequentially(SuiteRunner.java:413) [testng-7.10.0.jar:7.10.0]
	at org.testng.SuiteRunner.privateRun(SuiteRunner.java:373) [testng-7.10.0.jar:7.10.0]
	at org.testng.SuiteRunner.run(SuiteRunner.java:312) [testng-7.10.0.jar:7.10.0]
	at org.testng.SuiteRunnerWorker.runSuite(SuiteRunnerWorker.java:52) [testng-7.10.0.jar:7.10.0]
	at org.testng.SuiteRunnerWorker.run(SuiteRunnerWorker.java:95) [testng-7.10.0.jar:7.10.0]
	at org.testng.TestNG.runSuitesSequentially(TestNG.java:1274) [testng-7.10.0.jar:7.10.0]
	at org.testng.TestNG.runSuitesLocally(TestNG.java:1208) [testng-7.10.0.jar:7.10.0]
	at org.testng.TestNG.runSuites(TestNG.java:1112) [testng-7.10.0.jar:7.10.0]
	at org.testng.TestNG.run(TestNG.java:1079) [testng-7.10.0.jar:7.10.0]
	at com.intellij.rt.testng.IDEARemoteTestNG.run(IDEARemoteTestNG.java:66) [testng-rt.jar:?]
	at com.intellij.rt.testng.RemoteTestNGStarter.main(RemoteTestNGStarter.java:105) [testng-rt.jar:?]
[23:11:30.309] [ERROR] base.BaseTest - Error in test: testCreateAd
[23:11:30.309] [ERROR] base.BaseTest - Error message: element click intercepted: Element <button _ngcontent-mgb-c107="" type="button" variation="hint" class="close-button text-right" ng-reflect-variation="hint" ng-reflect-ng-class="[object Object]" ng-reflect-placement="bottom" ng-reflect-is-enabled="false" ng-reflect-inline-s-v-g="assets/image/calendar.svg">...</button> is not clickable at point (947, 380). Other element would receive the click: <div class="cdk-overlay-backdrop mat-overlay-transparent-backdrop mat-datepicker-0-backdrop cdk-overlay-backdrop-showing"></div>
  (Session info: chrome=124.0.6367.61)
Build info: version: '4.19.1', revision: 'abe0ee07dc'
System info: os.name: 'Windows 11', os.arch: 'amd64', os.version: '10.0', java.version: '11.0.19'
Driver info: org.openqa.selenium.chrome.ChromeDriver
Command: [a6842cd01f5471f31888a451f3314625, clickElement {id=f.7088F0FB12AEB54BECDB40A5D617B7DF.d.08FFB776015797D2DA5415A7B9720FD1.e.200}]
Capabilities {acceptInsecureCerts: false, browserName: chrome, browserVersion: 124.0.6367.61, chrome: {chromedriverVersion: 124.0.6367.91 (51df0e5e17a8..., userDataDir: C:\Users\user\AppData\Local...}, fedcm:accounts: true, goog:chromeOptions: {debuggerAddress: localhost:61334}, networkConnectionEnabled: false, pageLoadStrategy: normal, platformName: windows, proxy: Proxy(), se:cdp: ws://localhost:61334/devtoo..., se:cdpVersion: 124.0.6367.61, setWindowRect: true, strictFileInteractability: false, timeouts: {implicit: 0, pageLoad: 300000, script: 30000}, unhandledPromptBehavior: dismiss and notify, webauthn:extension:credBlob: true, webauthn:extension:largeBlob: true, webauthn:extension:minPinLength: true, webauthn:extension:prf: true, webauthn:virtualAuthenticators: true}
Element: [[ChromeDriver: chrome on windows (a6842cd01f5471f31888a451f3314625)] -> xpath: //app-datepicker[@formcontrolname='endDate']//button]
Session ID: a6842cd01f5471f31888a451f3314625
[23:11:31.321] [ INFO] extentlisteners.ExtentListeners - Running test method testEditAd of class PositionsDetailsAdsTest
[23:11:41.364] [ERROR] extentlisteners.ExtentListeners - Test failed: testEditAd
org.openqa.selenium.NoSuchElementException: no such element: Unable to locate element: {"method":"xpath","selector":"//app-dot-menu[@ng-reflect-menu-items='[object Object],[object Object']//button[@type='button']//*[name()='svg']"}
  (Session info: chrome=124.0.6367.61)
For documentation on this error, please visit: https://www.selenium.dev/documentation/webdriver/troubleshooting/errors#no-such-element-exception
Build info: version: '4.19.1', revision: 'abe0ee07dc'
System info: os.name: 'Windows 11', os.arch: 'amd64', os.version: '10.0', java.version: '11.0.19'
Driver info: org.openqa.selenium.chrome.ChromeDriver
Command: [a6842cd01f5471f31888a451f3314625, findElement {value=//app-dot-menu[@ng-reflect-menu-items='[object Object],[object Object']//button[@type='button']//*[name()='svg'], using=xpath}]
Capabilities {acceptInsecureCerts: false, browserName: chrome, browserVersion: 124.0.6367.61, chrome: {chromedriverVersion: 124.0.6367.91 (51df0e5e17a8..., userDataDir: C:\Users\user\AppData\Local...}, fedcm:accounts: true, goog:chromeOptions: {debuggerAddress: localhost:61334}, networkConnectionEnabled: false, pageLoadStrategy: normal, platformName: windows, proxy: Proxy(), se:cdp: ws://localhost:61334/devtoo..., se:cdpVersion: 124.0.6367.61, setWindowRect: true, strictFileInteractability: false, timeouts: {implicit: 0, pageLoad: 300000, script: 30000}, unhandledPromptBehavior: dismiss and notify, webauthn:extension:credBlob: true, webauthn:extension:largeBlob: true, webauthn:extension:minPinLength: true, webauthn:extension:prf: true, webauthn:virtualAuthenticators: true}
Session ID: a6842cd01f5471f31888a451f3314625
	at java.base/jdk.internal.reflect.NativeConstructorAccessorImpl.newInstance0(Native Method) ~[?:?]
	at java.base/jdk.internal.reflect.NativeConstructorAccessorImpl.newInstance(NativeConstructorAccessorImpl.java:62) ~[?:?]
	at java.base/jdk.internal.reflect.DelegatingConstructorAccessorImpl.newInstance(DelegatingConstructorAccessorImpl.java:45) ~[?:?]
	at java.base/java.lang.reflect.Constructor.newInstance(Constructor.java:490) ~[?:?]
	at org.openqa.selenium.remote.ErrorCodec.decode(ErrorCodec.java:167) ~[selenium-remote-driver-4.19.1.jar:?]
	at org.openqa.selenium.remote.codec.w3c.W3CHttpResponseCodec.decode(W3CHttpResponseCodec.java:138) ~[selenium-remote-driver-4.19.1.jar:?]
	at org.openqa.selenium.remote.codec.w3c.W3CHttpResponseCodec.decode(W3CHttpResponseCodec.java:50) ~[selenium-remote-driver-4.19.1.jar:?]
	at org.openqa.selenium.remote.HttpCommandExecutor.execute(HttpCommandExecutor.java:190) ~[selenium-remote-driver-4.19.1.jar:?]
	at org.openqa.selenium.remote.service.DriverCommandExecutor.invokeExecute(DriverCommandExecutor.java:216) ~[selenium-remote-driver-4.19.1.jar:?]
	at org.openqa.selenium.remote.service.DriverCommandExecutor.execute(DriverCommandExecutor.java:174) ~[selenium-remote-driver-4.19.1.jar:?]
	at org.openqa.selenium.remote.RemoteWebDriver.execute(RemoteWebDriver.java:518) ~[selenium-remote-driver-4.19.1.jar:?]
	at org.openqa.selenium.remote.ElementLocation$ElementFinder$2.findElement(ElementLocation.java:165) ~[selenium-remote-driver-4.19.1.jar:?]
	at org.openqa.selenium.remote.ElementLocation.findElement(ElementLocation.java:59) ~[selenium-remote-driver-4.19.1.jar:?]
	at org.openqa.selenium.remote.RemoteWebDriver.findElement(RemoteWebDriver.java:355) ~[selenium-remote-driver-4.19.1.jar:?]
	at org.openqa.selenium.remote.RemoteWebDriver.findElement(RemoteWebDriver.java:349) ~[selenium-remote-driver-4.19.1.jar:?]
	at org.openqa.selenium.support.pagefactory.DefaultElementLocator.findElement(DefaultElementLocator.java:68) ~[selenium-support-4.19.1.jar:?]
	at org.openqa.selenium.support.pagefactory.internal.LocatingElementHandler.invoke(LocatingElementHandler.java:38) ~[selenium-support-4.19.1.jar:?]
	at com.sun.proxy.$Proxy31.click(Unknown Source) ~[?:?]
	at pages.PositionsDetailsAdsPage.editAd(PositionsDetailsAdsPage.java:53) ~[classes/:?]
	at testcases.PositionsDetailsAdsTest.testEditAd(PositionsDetailsAdsTest.java:37) ~[test-classes/:?]
	at java.base/jdk.internal.reflect.NativeMethodAccessorImpl.invoke0(Native Method) ~[?:?]
	at java.base/jdk.internal.reflect.NativeMethodAccessorImpl.invoke(NativeMethodAccessorImpl.java:62) ~[?:?]
	at java.base/jdk.internal.reflect.DelegatingMethodAccessorImpl.invoke(DelegatingMethodAccessorImpl.java:43) ~[?:?]
	at java.base/java.lang.reflect.Method.invoke(Method.java:566) ~[?:?]
	at org.testng.internal.invokers.MethodInvocationHelper.invokeMethod(MethodInvocationHelper.java:141) ~[testng-7.10.0.jar:7.10.0]
	at org.testng.internal.invokers.TestInvoker.invokeMethod(TestInvoker.java:686) ~[testng-7.10.0.jar:7.10.0]
	at org.testng.internal.invokers.TestInvoker.invokeTestMethod(TestInvoker.java:230) ~[testng-7.10.0.jar:7.10.0]
	at org.testng.internal.invokers.MethodRunner.runInSequence(MethodRunner.java:63) ~[testng-7.10.0.jar:7.10.0]
	at org.testng.internal.invokers.TestInvoker$MethodInvocationAgent.invoke(TestInvoker.java:992) ~[testng-7.10.0.jar:7.10.0]
	at org.testng.internal.invokers.TestInvoker.invokeTestMethods(TestInvoker.java:203) ~[testng-7.10.0.jar:7.10.0]
	at org.testng.internal.invokers.TestMethodWorker.invokeTestMethods(TestMethodWorker.java:154) ~[testng-7.10.0.jar:7.10.0]
	at org.testng.internal.invokers.TestMethodWorker.run(TestMethodWorker.java:134) ~[testng-7.10.0.jar:7.10.0]
	at java.base/java.util.ArrayList.forEach(ArrayList.java:1541) [?:?]
	at org.testng.TestRunner.privateRun(TestRunner.java:739) [testng-7.10.0.jar:7.10.0]
	at org.testng.TestRunner.run(TestRunner.java:614) [testng-7.10.0.jar:7.10.0]
	at org.testng.SuiteRunner.runTest(SuiteRunner.java:421) [testng-7.10.0.jar:7.10.0]
	at org.testng.SuiteRunner.runSequentially(SuiteRunner.java:413) [testng-7.10.0.jar:7.10.0]
	at org.testng.SuiteRunner.privateRun(SuiteRunner.java:373) [testng-7.10.0.jar:7.10.0]
	at org.testng.SuiteRunner.run(SuiteRunner.java:312) [testng-7.10.0.jar:7.10.0]
	at org.testng.SuiteRunnerWorker.runSuite(SuiteRunnerWorker.java:52) [testng-7.10.0.jar:7.10.0]
	at org.testng.SuiteRunnerWorker.run(SuiteRunnerWorker.java:95) [testng-7.10.0.jar:7.10.0]
	at org.testng.TestNG.runSuitesSequentially(TestNG.java:1274) [testng-7.10.0.jar:7.10.0]
	at org.testng.TestNG.runSuitesLocally(TestNG.java:1208) [testng-7.10.0.jar:7.10.0]
	at org.testng.TestNG.runSuites(TestNG.java:1112) [testng-7.10.0.jar:7.10.0]
	at org.testng.TestNG.run(TestNG.java:1079) [testng-7.10.0.jar:7.10.0]
	at com.intellij.rt.testng.IDEARemoteTestNG.run(IDEARemoteTestNG.java:66) [testng-rt.jar:?]
	at com.intellij.rt.testng.RemoteTestNGStarter.main(RemoteTestNGStarter.java:105) [testng-rt.jar:?]
[23:11:41.521] [ERROR] base.BaseTest - Error in test: testEditAd
[23:11:41.521] [ERROR] base.BaseTest - Error message: no such element: Unable to locate element: {"method":"xpath","selector":"//app-dot-menu[@ng-reflect-menu-items='[object Object],[object Object']//button[@type='button']//*[name()='svg']"}
  (Session info: chrome=124.0.6367.61)
For documentation on this error, please visit: https://www.selenium.dev/documentation/webdriver/troubleshooting/errors#no-such-element-exception
Build info: version: '4.19.1', revision: 'abe0ee07dc'
System info: os.name: 'Windows 11', os.arch: 'amd64', os.version: '10.0', java.version: '11.0.19'
Driver info: org.openqa.selenium.chrome.ChromeDriver
Command: [a6842cd01f5471f31888a451f3314625, findElement {value=//app-dot-menu[@ng-reflect-menu-items='[object Object],[object Object']//button[@type='button']//*[name()='svg'], using=xpath}]
Capabilities {acceptInsecureCerts: false, browserName: chrome, browserVersion: 124.0.6367.61, chrome: {chromedriverVersion: 124.0.6367.91 (51df0e5e17a8..., userDataDir: C:\Users\user\AppData\Local...}, fedcm:accounts: true, goog:chromeOptions: {debuggerAddress: localhost:61334}, networkConnectionEnabled: false, pageLoadStrategy: normal, platformName: windows, proxy: Proxy(), se:cdp: ws://localhost:61334/devtoo..., se:cdpVersion: 124.0.6367.61, setWindowRect: true, strictFileInteractability: false, timeouts: {implicit: 0, pageLoad: 300000, script: 30000}, unhandledPromptBehavior: dismiss and notify, webauthn:extension:credBlob: true, webauthn:extension:largeBlob: true, webauthn:extension:minPinLength: true, webauthn:extension:prf: true, webauthn:virtualAuthenticators: true}
Session ID: a6842cd01f5471f31888a451f3314625
[23:11:42.522] [ INFO] extentlisteners.ExtentListeners - Running test method testDeleteAd of class PositionsDetailsAdsTest
[23:11:52.571] [ERROR] extentlisteners.ExtentListeners - Test failed: testDeleteAd
org.openqa.selenium.NoSuchElementException: no such element: Unable to locate element: {"method":"xpath","selector":"//app-dot-menu[@ng-reflect-menu-items='[object Object],[object Object']//button[@type='button']//*[name()='svg']"}
  (Session info: chrome=124.0.6367.61)
For documentation on this error, please visit: https://www.selenium.dev/documentation/webdriver/troubleshooting/errors#no-such-element-exception
Build info: version: '4.19.1', revision: 'abe0ee07dc'
System info: os.name: 'Windows 11', os.arch: 'amd64', os.version: '10.0', java.version: '11.0.19'
Driver info: org.openqa.selenium.chrome.ChromeDriver
Command: [a6842cd01f5471f31888a451f3314625, findElement {value=//app-dot-menu[@ng-reflect-menu-items='[object Object],[object Object']//button[@type='button']//*[name()='svg'], using=xpath}]
Capabilities {acceptInsecureCerts: false, browserName: chrome, browserVersion: 124.0.6367.61, chrome: {chromedriverVersion: 124.0.6367.91 (51df0e5e17a8..., userDataDir: C:\Users\user\AppData\Local...}, fedcm:accounts: true, goog:chromeOptions: {debuggerAddress: localhost:61334}, networkConnectionEnabled: false, pageLoadStrategy: normal, platformName: windows, proxy: Proxy(), se:cdp: ws://localhost:61334/devtoo..., se:cdpVersion: 124.0.6367.61, setWindowRect: true, strictFileInteractability: false, timeouts: {implicit: 0, pageLoad: 300000, script: 30000}, unhandledPromptBehavior: dismiss and notify, webauthn:extension:credBlob: true, webauthn:extension:largeBlob: true, webauthn:extension:minPinLength: true, webauthn:extension:prf: true, webauthn:virtualAuthenticators: true}
Session ID: a6842cd01f5471f31888a451f3314625
	at java.base/jdk.internal.reflect.NativeConstructorAccessorImpl.newInstance0(Native Method) ~[?:?]
	at java.base/jdk.internal.reflect.NativeConstructorAccessorImpl.newInstance(NativeConstructorAccessorImpl.java:62) ~[?:?]
	at java.base/jdk.internal.reflect.DelegatingConstructorAccessorImpl.newInstance(DelegatingConstructorAccessorImpl.java:45) ~[?:?]
	at java.base/java.lang.reflect.Constructor.newInstance(Constructor.java:490) ~[?:?]
	at org.openqa.selenium.remote.ErrorCodec.decode(ErrorCodec.java:167) ~[selenium-remote-driver-4.19.1.jar:?]
	at org.openqa.selenium.remote.codec.w3c.W3CHttpResponseCodec.decode(W3CHttpResponseCodec.java:138) ~[selenium-remote-driver-4.19.1.jar:?]
	at org.openqa.selenium.remote.codec.w3c.W3CHttpResponseCodec.decode(W3CHttpResponseCodec.java:50) ~[selenium-remote-driver-4.19.1.jar:?]
	at org.openqa.selenium.remote.HttpCommandExecutor.execute(HttpCommandExecutor.java:190) ~[selenium-remote-driver-4.19.1.jar:?]
	at org.openqa.selenium.remote.service.DriverCommandExecutor.invokeExecute(DriverCommandExecutor.java:216) ~[selenium-remote-driver-4.19.1.jar:?]
	at org.openqa.selenium.remote.service.DriverCommandExecutor.execute(DriverCommandExecutor.java:174) ~[selenium-remote-driver-4.19.1.jar:?]
	at org.openqa.selenium.remote.RemoteWebDriver.execute(RemoteWebDriver.java:518) ~[selenium-remote-driver-4.19.1.jar:?]
	at org.openqa.selenium.remote.ElementLocation$ElementFinder$2.findElement(ElementLocation.java:165) ~[selenium-remote-driver-4.19.1.jar:?]
	at org.openqa.selenium.remote.ElementLocation.findElement(ElementLocation.java:59) ~[selenium-remote-driver-4.19.1.jar:?]
	at org.openqa.selenium.remote.RemoteWebDriver.findElement(RemoteWebDriver.java:355) ~[selenium-remote-driver-4.19.1.jar:?]
	at org.openqa.selenium.remote.RemoteWebDriver.findElement(RemoteWebDriver.java:349) ~[selenium-remote-driver-4.19.1.jar:?]
	at org.openqa.selenium.support.pagefactory.DefaultElementLocator.findElement(DefaultElementLocator.java:68) ~[selenium-support-4.19.1.jar:?]
	at org.openqa.selenium.support.pagefactory.internal.LocatingElementHandler.invoke(LocatingElementHandler.java:38) ~[selenium-support-4.19.1.jar:?]
	at com.sun.proxy.$Proxy31.click(Unknown Source) ~[?:?]
	at pages.PositionsDetailsAdsPage.deleteAd(PositionsDetailsAdsPage.java:48) ~[classes/:?]
	at testcases.PositionsDetailsAdsTest.testDeleteAd(PositionsDetailsAdsTest.java:30) ~[test-classes/:?]
	at java.base/jdk.internal.reflect.NativeMethodAccessorImpl.invoke0(Native Method) ~[?:?]
	at java.base/jdk.internal.reflect.NativeMethodAccessorImpl.invoke(NativeMethodAccessorImpl.java:62) ~[?:?]
	at java.base/jdk.internal.reflect.DelegatingMethodAccessorImpl.invoke(DelegatingMethodAccessorImpl.java:43) ~[?:?]
	at java.base/java.lang.reflect.Method.invoke(Method.java:566) ~[?:?]
	at org.testng.internal.invokers.MethodInvocationHelper.invokeMethod(MethodInvocationHelper.java:141) ~[testng-7.10.0.jar:7.10.0]
	at org.testng.internal.invokers.TestInvoker.invokeMethod(TestInvoker.java:686) ~[testng-7.10.0.jar:7.10.0]
	at org.testng.internal.invokers.TestInvoker.invokeTestMethod(TestInvoker.java:230) ~[testng-7.10.0.jar:7.10.0]
	at org.testng.internal.invokers.MethodRunner.runInSequence(MethodRunner.java:63) ~[testng-7.10.0.jar:7.10.0]
	at org.testng.internal.invokers.TestInvoker$MethodInvocationAgent.invoke(TestInvoker.java:992) ~[testng-7.10.0.jar:7.10.0]
	at org.testng.internal.invokers.TestInvoker.invokeTestMethods(TestInvoker.java:203) ~[testng-7.10.0.jar:7.10.0]
	at org.testng.internal.invokers.TestMethodWorker.invokeTestMethods(TestMethodWorker.java:154) ~[testng-7.10.0.jar:7.10.0]
	at org.testng.internal.invokers.TestMethodWorker.run(TestMethodWorker.java:134) ~[testng-7.10.0.jar:7.10.0]
	at java.base/java.util.ArrayList.forEach(ArrayList.java:1541) [?:?]
	at org.testng.TestRunner.privateRun(TestRunner.java:739) [testng-7.10.0.jar:7.10.0]
	at org.testng.TestRunner.run(TestRunner.java:614) [testng-7.10.0.jar:7.10.0]
	at org.testng.SuiteRunner.runTest(SuiteRunner.java:421) [testng-7.10.0.jar:7.10.0]
	at org.testng.SuiteRunner.runSequentially(SuiteRunner.java:413) [testng-7.10.0.jar:7.10.0]
	at org.testng.SuiteRunner.privateRun(SuiteRunner.java:373) [testng-7.10.0.jar:7.10.0]
	at org.testng.SuiteRunner.run(SuiteRunner.java:312) [testng-7.10.0.jar:7.10.0]
	at org.testng.SuiteRunnerWorker.runSuite(SuiteRunnerWorker.java:52) [testng-7.10.0.jar:7.10.0]
	at org.testng.SuiteRunnerWorker.run(SuiteRunnerWorker.java:95) [testng-7.10.0.jar:7.10.0]
	at org.testng.TestNG.runSuitesSequentially(TestNG.java:1274) [testng-7.10.0.jar:7.10.0]
	at org.testng.TestNG.runSuitesLocally(TestNG.java:1208) [testng-7.10.0.jar:7.10.0]
	at org.testng.TestNG.runSuites(TestNG.java:1112) [testng-7.10.0.jar:7.10.0]
	at org.testng.TestNG.run(TestNG.java:1079) [testng-7.10.0.jar:7.10.0]
	at com.intellij.rt.testng.IDEARemoteTestNG.run(IDEARemoteTestNG.java:66) [testng-rt.jar:?]
	at com.intellij.rt.testng.RemoteTestNGStarter.main(RemoteTestNGStarter.java:105) [testng-rt.jar:?]
[23:11:52.697] [ERROR] base.BaseTest - Error in test: testDeleteAd
[23:11:52.697] [ERROR] base.BaseTest - Error message: no such element: Unable to locate element: {"method":"xpath","selector":"//app-dot-menu[@ng-reflect-menu-items='[object Object],[object Object']//button[@type='button']//*[name()='svg']"}
  (Session info: chrome=124.0.6367.61)
For documentation on this error, please visit: https://www.selenium.dev/documentation/webdriver/troubleshooting/errors#no-such-element-exception
Build info: version: '4.19.1', revision: 'abe0ee07dc'
System info: os.name: 'Windows 11', os.arch: 'amd64', os.version: '10.0', java.version: '11.0.19'
Driver info: org.openqa.selenium.chrome.ChromeDriver
Command: [a6842cd01f5471f31888a451f3314625, findElement {value=//app-dot-menu[@ng-reflect-menu-items='[object Object],[object Object']//button[@type='button']//*[name()='svg'], using=xpath}]
Capabilities {acceptInsecureCerts: false, browserName: chrome, browserVersion: 124.0.6367.61, chrome: {chromedriverVersion: 124.0.6367.91 (51df0e5e17a8..., userDataDir: C:\Users\user\AppData\Local...}, fedcm:accounts: true, goog:chromeOptions: {debuggerAddress: localhost:61334}, networkConnectionEnabled: false, pageLoadStrategy: normal, platformName: windows, proxy: Proxy(), se:cdp: ws://localhost:61334/devtoo..., se:cdpVersion: 124.0.6367.61, setWindowRect: true, strictFileInteractability: false, timeouts: {implicit: 0, pageLoad: 300000, script: 30000}, unhandledPromptBehavior: dismiss and notify, webauthn:extension:credBlob: true, webauthn:extension:largeBlob: true, webauthn:extension:minPinLength: true, webauthn:extension:prf: true, webauthn:virtualAuthenticators: true}
Session ID: a6842cd01f5471f31888a451f3314625
[23:11:53.889] [ INFO] extentlisteners.ExtentListeners - Test Suite Positions ending
[23:11:53.983] [ INFO] extentlisteners.ExtentListeners - Test Suite Candidates started
[23:11:55.033] [ INFO] base.BaseTest - Google Chrome launched
[23:11:56.947] [ INFO] extentlisteners.ExtentListeners - Running test method testCandidatesABCFilter of class CandidatesTest
[23:11:59.284] [ INFO] extentlisteners.ExtentListeners - Test passed: testCandidatesABCFilter
[23:12:00.296] [ INFO] extentlisteners.ExtentListeners - Running test method testColumnSort of class CandidatesTest
[23:12:01.984] [ INFO] extentlisteners.ExtentListeners - Test passed: testColumnSort
[23:12:02.991] [ INFO] extentlisteners.ExtentListeners - Running test method testColumnMove of class CandidatesTest
[23:12:06.692] [ INFO] extentlisteners.ExtentListeners - Test passed: testColumnMove
[23:12:07.705] [ INFO] extentlisteners.ExtentListeners - Running test method testCandidatesFilter of class CandidatesTest
[23:12:19.670] [ INFO] extentlisteners.ExtentListeners - Test passed: testCandidatesFilter
[23:12:20.671] [ INFO] extentlisteners.ExtentListeners - Running test method testCandidatesFilterDelete of class CandidatesTest
[23:12:20.913] [ INFO] extentlisteners.ExtentListeners - Test passed: testCandidatesFilterDelete
[23:12:21.942] [ INFO] extentlisteners.ExtentListeners - Running test method testCandidatesFilterSave of class CandidatesTest
[23:12:25.648] [ INFO] extentlisteners.ExtentListeners - Test passed: testCandidatesFilterSave
[23:12:26.654] [ INFO] extentlisteners.ExtentListeners - Running test method testbulkEdit of class CandidatesTest
[23:12:32.774] [ INFO] extentlisteners.ExtentListeners - Test passed: testbulkEdit
[23:12:33.783] [ INFO] extentlisteners.ExtentListeners - Running test method testCreateCandidate of class CandidatesTest
[23:12:38.777] [ INFO] extentlisteners.ExtentListeners - Test passed: testCreateCandidate
[23:12:40.649] [ INFO] base.BaseTest - Google Chrome launched
[23:12:43.338] [ INFO] extentlisteners.ExtentListeners - Running test method testWriteHistoryMessage of class CandidatesDetailsTest
[23:12:44.112] [ INFO] extentlisteners.ExtentListeners - Test passed: testWriteHistoryMessage
[23:12:45.115] [ INFO] extentlisteners.ExtentListeners - Running test method testShowFullHistory of class CandidatesDetailsTest
[23:12:46.772] [ INFO] extentlisteners.ExtentListeners - Test passed: testShowFullHistory
[23:12:47.786] [ INFO] extentlisteners.ExtentListeners - Running test method testEditCandidate of class CandidatesDetailsTest
[23:12:50.407] [ INFO] extentlisteners.ExtentListeners - Test passed: testEditCandidate
[23:12:51.414] [ INFO] extentlisteners.ExtentListeners - Running test method testAddCandidateToPosition of class CandidatesDetailsTest
[23:12:54.006] [ INFO] extentlisteners.ExtentListeners - Test passed: testAddCandidateToPosition
[23:12:55.013] [ INFO] extentlisteners.ExtentListeners - Running test method testStatusChange of class CandidatesDetailsTest
[23:12:55.927] [ INFO] extentlisteners.ExtentListeners - Test passed: testStatusChange
[23:12:56.928] [ INFO] extentlisteners.ExtentListeners - Running test method testDetachCandidate of class CandidatesDetailsTest
[23:12:58.893] [ INFO] extentlisteners.ExtentListeners - Test passed: testDetachCandidate
[23:12:59.893] [ INFO] extentlisteners.ExtentListeners - Running test method testDeleteCandidate of class CandidatesDetailsTest
[23:13:01.131] [ INFO] extentlisteners.ExtentListeners - Test passed: testDeleteCandidate
[23:13:02.353] [ INFO] extentlisteners.ExtentListeners - Test Suite Candidates ending
[23:13:02.447] [ INFO] extentlisteners.ExtentListeners - Test Suite Contacts started
[23:13:03.247] [ INFO] base.BaseTest - Google Chrome launched
[23:13:05.030] [ INFO] extentlisteners.ExtentListeners - Running test method testContactsABCFilter of class ContactsTest
[23:13:07.501] [ INFO] extentlisteners.ExtentListeners - Test passed: testContactsABCFilter
[23:13:08.517] [ INFO] extentlisteners.ExtentListeners - Running test method testColumnSort of class ContactsTest
[23:13:10.136] [ INFO] extentlisteners.ExtentListeners - Test passed: testColumnSort
[23:13:11.139] [ INFO] extentlisteners.ExtentListeners - Running test method testColumnMove of class ContactsTest
[23:13:14.804] [ INFO] extentlisteners.ExtentListeners - Test passed: testColumnMove
[23:13:15.811] [ INFO] extentlisteners.ExtentListeners - Running test method testContactsFilter of class ContactsTest
[23:13:27.628] [ INFO] extentlisteners.ExtentListeners - Test passed: testContactsFilter
[23:13:28.632] [ INFO] extentlisteners.ExtentListeners - Running test method testContactsFilterDelete of class ContactsTest
[23:13:28.786] [ INFO] extentlisteners.ExtentListeners - Test passed: testContactsFilterDelete
[23:13:29.798] [ INFO] extentlisteners.ExtentListeners - Running test method testContactsFilterSave of class ContactsTest
[23:13:32.709] [ INFO] extentlisteners.ExtentListeners - Test passed: testContactsFilterSave
[23:13:33.712] [ INFO] extentlisteners.ExtentListeners - Running test method testCreateCandidate of class ContactsTest
[23:13:39.251] [ INFO] extentlisteners.ExtentListeners - Test passed: testCreateCandidate
[23:13:40.252] [ INFO] extentlisteners.ExtentListeners - Running test method testChangeView of class ContactsTest
[23:13:40.410] [ INFO] extentlisteners.ExtentListeners - Test passed: testChangeView
[23:13:41.426] [ INFO] extentlisteners.ExtentListeners - Running test method testAddColumns of class ContactsTest
[23:13:42.650] [ERROR] extentlisteners.ExtentListeners - Test failed: testAddColumns
org.openqa.selenium.ElementClickInterceptedException: element click intercepted: Element <span _ngcontent-jmp-c236="" class="checkbox-custom"></span> is not clickable at point (1257, 244). Other element would receive the click: <div id="cdk-overlay-4" class="cdk-overlay-pane" style="position: static;">...</div>
  (Session info: chrome=124.0.6367.61)
Build info: version: '4.19.1', revision: 'abe0ee07dc'
System info: os.name: 'Windows 11', os.arch: 'amd64', os.version: '10.0', java.version: '11.0.19'
Driver info: org.openqa.selenium.chrome.ChromeDriver
Command: [c2f18a1eb1815ca7329ca6a303ae490b, clickElement {id=f.F79BE2C183FC4F2DEC989FA87FAAA21F.d.B4418FC51CD240A89A99474CFC1670EE.e.398}]
Capabilities {acceptInsecureCerts: false, browserName: chrome, browserVersion: 124.0.6367.61, chrome: {chromedriverVersion: 124.0.6367.91 (51df0e5e17a8..., userDataDir: C:\Users\user\AppData\Local...}, fedcm:accounts: true, goog:chromeOptions: {debuggerAddress: localhost:62427}, networkConnectionEnabled: false, pageLoadStrategy: normal, platformName: windows, proxy: Proxy(), se:cdp: ws://localhost:62427/devtoo..., se:cdpVersion: 124.0.6367.61, setWindowRect: true, strictFileInteractability: false, timeouts: {implicit: 0, pageLoad: 300000, script: 30000}, unhandledPromptBehavior: dismiss and notify, webauthn:extension:credBlob: true, webauthn:extension:largeBlob: true, webauthn:extension:minPinLength: true, webauthn:extension:prf: true, webauthn:virtualAuthenticators: true}
Element: [[ChromeDriver: chrome on windows (c2f18a1eb1815ca7329ca6a303ae490b)] -> xpath: //app-checkbox[@ng-reflect-label='Születési dátum']//span[@class='checkbox-custom']]
Session ID: c2f18a1eb1815ca7329ca6a303ae490b
	at java.base/jdk.internal.reflect.NativeConstructorAccessorImpl.newInstance0(Native Method) ~[?:?]
	at java.base/jdk.internal.reflect.NativeConstructorAccessorImpl.newInstance(NativeConstructorAccessorImpl.java:62) ~[?:?]
	at java.base/jdk.internal.reflect.DelegatingConstructorAccessorImpl.newInstance(DelegatingConstructorAccessorImpl.java:45) ~[?:?]
	at java.base/java.lang.reflect.Constructor.newInstance(Constructor.java:490) ~[?:?]
	at org.openqa.selenium.remote.ErrorCodec.decode(ErrorCodec.java:167) ~[selenium-remote-driver-4.19.1.jar:?]
	at org.openqa.selenium.remote.codec.w3c.W3CHttpResponseCodec.decode(W3CHttpResponseCodec.java:138) ~[selenium-remote-driver-4.19.1.jar:?]
	at org.openqa.selenium.remote.codec.w3c.W3CHttpResponseCodec.decode(W3CHttpResponseCodec.java:50) ~[selenium-remote-driver-4.19.1.jar:?]
	at org.openqa.selenium.remote.HttpCommandExecutor.execute(HttpCommandExecutor.java:190) ~[selenium-remote-driver-4.19.1.jar:?]
	at org.openqa.selenium.remote.service.DriverCommandExecutor.invokeExecute(DriverCommandExecutor.java:216) ~[selenium-remote-driver-4.19.1.jar:?]
	at org.openqa.selenium.remote.service.DriverCommandExecutor.execute(DriverCommandExecutor.java:174) ~[selenium-remote-driver-4.19.1.jar:?]
	at org.openqa.selenium.remote.RemoteWebDriver.execute(RemoteWebDriver.java:518) ~[selenium-remote-driver-4.19.1.jar:?]
	at org.openqa.selenium.remote.RemoteWebElement.execute(RemoteWebElement.java:223) ~[selenium-remote-driver-4.19.1.jar:?]
	at org.openqa.selenium.remote.RemoteWebElement.click(RemoteWebElement.java:76) ~[selenium-remote-driver-4.19.1.jar:?]
	at jdk.internal.reflect.GeneratedMethodAccessor7.invoke(Unknown Source) ~[?:?]
	at java.base/jdk.internal.reflect.DelegatingMethodAccessorImpl.invoke(DelegatingMethodAccessorImpl.java:43) ~[?:?]
	at java.base/java.lang.reflect.Method.invoke(Method.java:566) ~[?:?]
	at org.openqa.selenium.support.pagefactory.internal.LocatingElementHandler.invoke(LocatingElementHandler.java:51) ~[selenium-support-4.19.1.jar:?]
	at com.sun.proxy.$Proxy31.click(Unknown Source) ~[?:?]
	at pages.ContactsPage.columnAdder(ContactsPage.java:133) ~[classes/:?]
	at testcases.ContactsTest.testAddColumns(ContactsTest.java:72) ~[test-classes/:?]
	at java.base/jdk.internal.reflect.NativeMethodAccessorImpl.invoke0(Native Method) ~[?:?]
	at java.base/jdk.internal.reflect.NativeMethodAccessorImpl.invoke(NativeMethodAccessorImpl.java:62) ~[?:?]
	at java.base/jdk.internal.reflect.DelegatingMethodAccessorImpl.invoke(DelegatingMethodAccessorImpl.java:43) ~[?:?]
	at java.base/java.lang.reflect.Method.invoke(Method.java:566) ~[?:?]
	at org.testng.internal.invokers.MethodInvocationHelper.invokeMethod(MethodInvocationHelper.java:141) ~[testng-7.10.0.jar:7.10.0]
	at org.testng.internal.invokers.TestInvoker.invokeMethod(TestInvoker.java:686) ~[testng-7.10.0.jar:7.10.0]
	at org.testng.internal.invokers.TestInvoker.invokeTestMethod(TestInvoker.java:230) ~[testng-7.10.0.jar:7.10.0]
	at org.testng.internal.invokers.MethodRunner.runInSequence(MethodRunner.java:63) ~[testng-7.10.0.jar:7.10.0]
	at org.testng.internal.invokers.TestInvoker$MethodInvocationAgent.invoke(TestInvoker.java:992) ~[testng-7.10.0.jar:7.10.0]
	at org.testng.internal.invokers.TestInvoker.invokeTestMethods(TestInvoker.java:203) ~[testng-7.10.0.jar:7.10.0]
	at org.testng.internal.invokers.TestMethodWorker.invokeTestMethods(TestMethodWorker.java:154) ~[testng-7.10.0.jar:7.10.0]
	at org.testng.internal.invokers.TestMethodWorker.run(TestMethodWorker.java:134) ~[testng-7.10.0.jar:7.10.0]
	at java.base/java.util.ArrayList.forEach(ArrayList.java:1541) [?:?]
	at org.testng.TestRunner.privateRun(TestRunner.java:739) [testng-7.10.0.jar:7.10.0]
	at org.testng.TestRunner.run(TestRunner.java:614) [testng-7.10.0.jar:7.10.0]
	at org.testng.SuiteRunner.runTest(SuiteRunner.java:421) [testng-7.10.0.jar:7.10.0]
	at org.testng.SuiteRunner.runSequentially(SuiteRunner.java:413) [testng-7.10.0.jar:7.10.0]
	at org.testng.SuiteRunner.privateRun(SuiteRunner.java:373) [testng-7.10.0.jar:7.10.0]
	at org.testng.SuiteRunner.run(SuiteRunner.java:312) [testng-7.10.0.jar:7.10.0]
	at org.testng.SuiteRunnerWorker.runSuite(SuiteRunnerWorker.java:52) [testng-7.10.0.jar:7.10.0]
	at org.testng.SuiteRunnerWorker.run(SuiteRunnerWorker.java:95) [testng-7.10.0.jar:7.10.0]
	at org.testng.TestNG.runSuitesSequentially(TestNG.java:1274) [testng-7.10.0.jar:7.10.0]
	at org.testng.TestNG.runSuitesLocally(TestNG.java:1208) [testng-7.10.0.jar:7.10.0]
	at org.testng.TestNG.runSuites(TestNG.java:1112) [testng-7.10.0.jar:7.10.0]
	at org.testng.TestNG.run(TestNG.java:1079) [testng-7.10.0.jar:7.10.0]
	at com.intellij.rt.testng.IDEARemoteTestNG.run(IDEARemoteTestNG.java:66) [testng-rt.jar:?]
	at com.intellij.rt.testng.RemoteTestNGStarter.main(RemoteTestNGStarter.java:105) [testng-rt.jar:?]
[23:13:42.901] [ERROR] base.BaseTest - Error in test: testAddColumns
[23:13:42.901] [ERROR] base.BaseTest - Error message: element click intercepted: Element <span _ngcontent-jmp-c236="" class="checkbox-custom"></span> is not clickable at point (1257, 244). Other element would receive the click: <div id="cdk-overlay-4" class="cdk-overlay-pane" style="position: static;">...</div>
  (Session info: chrome=124.0.6367.61)
Build info: version: '4.19.1', revision: 'abe0ee07dc'
System info: os.name: 'Windows 11', os.arch: 'amd64', os.version: '10.0', java.version: '11.0.19'
Driver info: org.openqa.selenium.chrome.ChromeDriver
Command: [c2f18a1eb1815ca7329ca6a303ae490b, clickElement {id=f.F79BE2C183FC4F2DEC989FA87FAAA21F.d.B4418FC51CD240A89A99474CFC1670EE.e.398}]
Capabilities {acceptInsecureCerts: false, browserName: chrome, browserVersion: 124.0.6367.61, chrome: {chromedriverVersion: 124.0.6367.91 (51df0e5e17a8..., userDataDir: C:\Users\user\AppData\Local...}, fedcm:accounts: true, goog:chromeOptions: {debuggerAddress: localhost:62427}, networkConnectionEnabled: false, pageLoadStrategy: normal, platformName: windows, proxy: Proxy(), se:cdp: ws://localhost:62427/devtoo..., se:cdpVersion: 124.0.6367.61, setWindowRect: true, strictFileInteractability: false, timeouts: {implicit: 0, pageLoad: 300000, script: 30000}, unhandledPromptBehavior: dismiss and notify, webauthn:extension:credBlob: true, webauthn:extension:largeBlob: true, webauthn:extension:minPinLength: true, webauthn:extension:prf: true, webauthn:virtualAuthenticators: true}
Element: [[ChromeDriver: chrome on windows (c2f18a1eb1815ca7329ca6a303ae490b)] -> xpath: //app-checkbox[@ng-reflect-label='Születési dátum']//span[@class='checkbox-custom']]
Session ID: c2f18a1eb1815ca7329ca6a303ae490b
[23:13:44.127] [ INFO] extentlisteners.ExtentListeners - Test Suite Contacts ending
[23:13:44.189] [ INFO] extentlisteners.ExtentListeners - Test Suite Applications started
[23:13:45.294] [ INFO] base.BaseTest - Google Chrome launched
[23:13:47.257] [ INFO] extentlisteners.ExtentListeners - Running test method testApplicationsABCFilter of class ApplicationsTest
[23:13:47.693] [ERROR] extentlisteners.ExtentListeners - Test failed: testApplicationsABCFilter
org.openqa.selenium.StaleElementReferenceException: stale element reference: stale element not found in the current frame
  (Session info: chrome=124.0.6367.61)
For documentation on this error, please visit: https://www.selenium.dev/documentation/webdriver/troubleshooting/errors#stale-element-reference-exception
Build info: version: '4.19.1', revision: 'abe0ee07dc'
System info: os.name: 'Windows 11', os.arch: 'amd64', os.version: '10.0', java.version: '11.0.19'
Driver info: org.openqa.selenium.chrome.ChromeDriver
Command: [d0ca795f0619c3b4c261c96e7a35353c, clickElement {id=f.01F076F7378C8AE949144D8C5A1D122F.d.F15585A7DB9D56E424B2A220D73CDDD8.e.30}]
Capabilities {acceptInsecureCerts: false, browserName: chrome, browserVersion: 124.0.6367.61, chrome: {chromedriverVersion: 124.0.6367.91 (51df0e5e17a8..., userDataDir: C:\Users\user\AppData\Local...}, fedcm:accounts: true, goog:chromeOptions: {debuggerAddress: localhost:62923}, networkConnectionEnabled: false, pageLoadStrategy: normal, platformName: windows, proxy: Proxy(), se:cdp: ws://localhost:62923/devtoo..., se:cdpVersion: 124.0.6367.61, setWindowRect: true, strictFileInteractability: false, timeouts: {implicit: 0, pageLoad: 300000, script: 30000}, unhandledPromptBehavior: dismiss and notify, webauthn:extension:credBlob: true, webauthn:extension:largeBlob: true, webauthn:extension:minPinLength: true, webauthn:extension:prf: true, webauthn:virtualAuthenticators: true}
Element: [[ChromeDriver: chrome on windows (d0ca795f0619c3b4c261c96e7a35353c)] -> xpath: //span[normalize-space()='A']]
Session ID: d0ca795f0619c3b4c261c96e7a35353c
	at java.base/jdk.internal.reflect.NativeConstructorAccessorImpl.newInstance0(Native Method) ~[?:?]
	at java.base/jdk.internal.reflect.NativeConstructorAccessorImpl.newInstance(NativeConstructorAccessorImpl.java:62) ~[?:?]
	at java.base/jdk.internal.reflect.DelegatingConstructorAccessorImpl.newInstance(DelegatingConstructorAccessorImpl.java:45) ~[?:?]
	at java.base/java.lang.reflect.Constructor.newInstance(Constructor.java:490) ~[?:?]
	at org.openqa.selenium.remote.ErrorCodec.decode(ErrorCodec.java:167) ~[selenium-remote-driver-4.19.1.jar:?]
	at org.openqa.selenium.remote.codec.w3c.W3CHttpResponseCodec.decode(W3CHttpResponseCodec.java:138) ~[selenium-remote-driver-4.19.1.jar:?]
	at org.openqa.selenium.remote.codec.w3c.W3CHttpResponseCodec.decode(W3CHttpResponseCodec.java:50) ~[selenium-remote-driver-4.19.1.jar:?]
	at org.openqa.selenium.remote.HttpCommandExecutor.execute(HttpCommandExecutor.java:190) ~[selenium-remote-driver-4.19.1.jar:?]
	at org.openqa.selenium.remote.service.DriverCommandExecutor.invokeExecute(DriverCommandExecutor.java:216) ~[selenium-remote-driver-4.19.1.jar:?]
	at org.openqa.selenium.remote.service.DriverCommandExecutor.execute(DriverCommandExecutor.java:174) ~[selenium-remote-driver-4.19.1.jar:?]
	at org.openqa.selenium.remote.RemoteWebDriver.execute(RemoteWebDriver.java:518) ~[selenium-remote-driver-4.19.1.jar:?]
	at org.openqa.selenium.remote.RemoteWebElement.execute(RemoteWebElement.java:223) ~[selenium-remote-driver-4.19.1.jar:?]
	at org.openqa.selenium.remote.RemoteWebElement.click(RemoteWebElement.java:76) ~[selenium-remote-driver-4.19.1.jar:?]
	at jdk.internal.reflect.GeneratedMethodAccessor7.invoke(Unknown Source) ~[?:?]
	at java.base/jdk.internal.reflect.DelegatingMethodAccessorImpl.invoke(DelegatingMethodAccessorImpl.java:43) ~[?:?]
	at java.base/java.lang.reflect.Method.invoke(Method.java:566) ~[?:?]
	at org.openqa.selenium.support.pagefactory.internal.LocatingElementHandler.invoke(LocatingElementHandler.java:51) ~[selenium-support-4.19.1.jar:?]
	at com.sun.proxy.$Proxy31.click(Unknown Source) ~[?:?]
	at pages.ApplicationsPage.applicationsFilterByCharacter(ApplicationsPage.java:88) ~[classes/:?]
	at testcases.ApplicationsTest.testApplicationsABCFilter(ApplicationsTest.java:43) ~[test-classes/:?]
	at java.base/jdk.internal.reflect.NativeMethodAccessorImpl.invoke0(Native Method) ~[?:?]
	at java.base/jdk.internal.reflect.NativeMethodAccessorImpl.invoke(NativeMethodAccessorImpl.java:62) ~[?:?]
	at java.base/jdk.internal.reflect.DelegatingMethodAccessorImpl.invoke(DelegatingMethodAccessorImpl.java:43) ~[?:?]
	at java.base/java.lang.reflect.Method.invoke(Method.java:566) ~[?:?]
	at org.testng.internal.invokers.MethodInvocationHelper.invokeMethod(MethodInvocationHelper.java:141) ~[testng-7.10.0.jar:7.10.0]
	at org.testng.internal.invokers.TestInvoker.invokeMethod(TestInvoker.java:686) ~[testng-7.10.0.jar:7.10.0]
	at org.testng.internal.invokers.TestInvoker.invokeTestMethod(TestInvoker.java:230) ~[testng-7.10.0.jar:7.10.0]
	at org.testng.internal.invokers.MethodRunner.runInSequence(MethodRunner.java:63) ~[testng-7.10.0.jar:7.10.0]
	at org.testng.internal.invokers.TestInvoker$MethodInvocationAgent.invoke(TestInvoker.java:992) ~[testng-7.10.0.jar:7.10.0]
	at org.testng.internal.invokers.TestInvoker.invokeTestMethods(TestInvoker.java:203) ~[testng-7.10.0.jar:7.10.0]
	at org.testng.internal.invokers.TestMethodWorker.invokeTestMethods(TestMethodWorker.java:154) ~[testng-7.10.0.jar:7.10.0]
	at org.testng.internal.invokers.TestMethodWorker.run(TestMethodWorker.java:134) ~[testng-7.10.0.jar:7.10.0]
	at java.base/java.util.ArrayList.forEach(ArrayList.java:1541) [?:?]
	at org.testng.TestRunner.privateRun(TestRunner.java:739) [testng-7.10.0.jar:7.10.0]
	at org.testng.TestRunner.run(TestRunner.java:614) [testng-7.10.0.jar:7.10.0]
	at org.testng.SuiteRunner.runTest(SuiteRunner.java:421) [testng-7.10.0.jar:7.10.0]
	at org.testng.SuiteRunner.runSequentially(SuiteRunner.java:413) [testng-7.10.0.jar:7.10.0]
	at org.testng.SuiteRunner.privateRun(SuiteRunner.java:373) [testng-7.10.0.jar:7.10.0]
	at org.testng.SuiteRunner.run(SuiteRunner.java:312) [testng-7.10.0.jar:7.10.0]
	at org.testng.SuiteRunnerWorker.runSuite(SuiteRunnerWorker.java:52) [testng-7.10.0.jar:7.10.0]
	at org.testng.SuiteRunnerWorker.run(SuiteRunnerWorker.java:95) [testng-7.10.0.jar:7.10.0]
	at org.testng.TestNG.runSuitesSequentially(TestNG.java:1274) [testng-7.10.0.jar:7.10.0]
	at org.testng.TestNG.runSuitesLocally(TestNG.java:1208) [testng-7.10.0.jar:7.10.0]
	at org.testng.TestNG.runSuites(TestNG.java:1112) [testng-7.10.0.jar:7.10.0]
	at org.testng.TestNG.run(TestNG.java:1079) [testng-7.10.0.jar:7.10.0]
	at com.intellij.rt.testng.IDEARemoteTestNG.run(IDEARemoteTestNG.java:66) [testng-rt.jar:?]
	at com.intellij.rt.testng.RemoteTestNGStarter.main(RemoteTestNGStarter.java:105) [testng-rt.jar:?]
[23:13:47.926] [ERROR] base.BaseTest - Error in test: testApplicationsABCFilter
[23:13:47.926] [ERROR] base.BaseTest - Error message: stale element reference: stale element not found in the current frame
  (Session info: chrome=124.0.6367.61)
For documentation on this error, please visit: https://www.selenium.dev/documentation/webdriver/troubleshooting/errors#stale-element-reference-exception
Build info: version: '4.19.1', revision: 'abe0ee07dc'
System info: os.name: 'Windows 11', os.arch: 'amd64', os.version: '10.0', java.version: '11.0.19'
Driver info: org.openqa.selenium.chrome.ChromeDriver
Command: [d0ca795f0619c3b4c261c96e7a35353c, clickElement {id=f.01F076F7378C8AE949144D8C5A1D122F.d.F15585A7DB9D56E424B2A220D73CDDD8.e.30}]
Capabilities {acceptInsecureCerts: false, browserName: chrome, browserVersion: 124.0.6367.61, chrome: {chromedriverVersion: 124.0.6367.91 (51df0e5e17a8..., userDataDir: C:\Users\user\AppData\Local...}, fedcm:accounts: true, goog:chromeOptions: {debuggerAddress: localhost:62923}, networkConnectionEnabled: false, pageLoadStrategy: normal, platformName: windows, proxy: Proxy(), se:cdp: ws://localhost:62923/devtoo..., se:cdpVersion: 124.0.6367.61, setWindowRect: true, strictFileInteractability: false, timeouts: {implicit: 0, pageLoad: 300000, script: 30000}, unhandledPromptBehavior: dismiss and notify, webauthn:extension:credBlob: true, webauthn:extension:largeBlob: true, webauthn:extension:minPinLength: true, webauthn:extension:prf: true, webauthn:virtualAuthenticators: true}
Element: [[ChromeDriver: chrome on windows (d0ca795f0619c3b4c261c96e7a35353c)] -> xpath: //span[normalize-space()='A']]
Session ID: d0ca795f0619c3b4c261c96e7a35353c
[23:13:48.931] [ INFO] extentlisteners.ExtentListeners - Running test method testColumnSort of class ApplicationsTest
[23:13:50.552] [ INFO] extentlisteners.ExtentListeners - Test passed: testColumnSort
[23:13:51.555] [ INFO] extentlisteners.ExtentListeners - Running test method testColumnMove of class ApplicationsTest
[23:13:55.226] [ INFO] extentlisteners.ExtentListeners - Test passed: testColumnMove
[23:13:56.240] [ INFO] extentlisteners.ExtentListeners - Running test method testApplicationsFilter of class ApplicationsTest
[23:14:08.126] [ INFO] extentlisteners.ExtentListeners - Test passed: testApplicationsFilter
[23:14:09.129] [ INFO] extentlisteners.ExtentListeners - Running test method testApplicationsFilterDelete of class ApplicationsTest
[23:14:09.270] [ INFO] extentlisteners.ExtentListeners - Test passed: testApplicationsFilterDelete
[23:14:10.280] [ INFO] extentlisteners.ExtentListeners - Running test method testApplicationsFilterSave of class ApplicationsTest
[23:14:13.622] [ INFO] extentlisteners.ExtentListeners - Test passed: testApplicationsFilterSave
[23:14:14.627] [ INFO] extentlisteners.ExtentListeners - Running test method testChangeView of class ApplicationsTest
[23:14:14.773] [ INFO] extentlisteners.ExtentListeners - Test passed: testChangeView
[23:14:15.785] [ INFO] extentlisteners.ExtentListeners - Running test method testAddColumns of class ApplicationsTest
[23:14:20.354] [ INFO] extentlisteners.ExtentListeners - Test passed: testAddColumns
[23:14:21.567] [ INFO] extentlisteners.ExtentListeners - Test Suite Applications ending
[23:14:21.647] [ INFO] extentlisteners.ExtentListeners - Test Suite Basedata started
[23:14:22.806] [ INFO] base.BaseTest - Google Chrome launched
[23:14:24.749] [ INFO] extentlisteners.ExtentListeners - Running test method testSearchSources of class BasedataSourcesTest
[23:14:26.255] [ INFO] extentlisteners.ExtentListeners - Test passed: testSearchSources
[23:14:27.268] [ INFO] extentlisteners.ExtentListeners - Running test method testSortSource of class BasedataSourcesTest
[23:14:29.441] [ INFO] extentlisteners.ExtentListeners - Test passed: testSortSource
[23:14:30.453] [ INFO] extentlisteners.ExtentListeners - Running test method testColumnMove of class BasedataSourcesTest
[23:14:34.067] [ INFO] extentlisteners.ExtentListeners - Test passed: testColumnMove
[23:14:35.068] [ INFO] extentlisteners.ExtentListeners - Running test method testEditSource of class BasedataSourcesTest
[23:14:37.175] [ INFO] extentlisteners.ExtentListeners - Test passed: testEditSource
[23:14:38.187] [ INFO] extentlisteners.ExtentListeners - Running test method testArchiveSource of class BasedataSourcesTest
[23:14:39.989] [ INFO] extentlisteners.ExtentListeners - Test passed: testArchiveSource
[23:14:41.003] [ INFO] extentlisteners.ExtentListeners - Running test method testCreateSource of class BasedataSourcesTest
[23:14:42.588] [ INFO] extentlisteners.ExtentListeners - Test passed: testCreateSource
[23:14:43.601] [ INFO] extentlisteners.ExtentListeners - Running test method testDeleteSource of class BasedataSourcesTest
[23:14:44.059] [ INFO] extentlisteners.ExtentListeners - Test passed: testDeleteSource
[23:14:46.008] [ INFO] base.BaseTest - Google Chrome launched
[23:14:48.138] [ INFO] extentlisteners.ExtentListeners - Running test method testSearchCustom of class BasedataCustomTest
[23:14:49.573] [ INFO] extentlisteners.ExtentListeners - Test passed: testSearchCustom
[23:14:50.585] [ INFO] extentlisteners.ExtentListeners - Running test method testSortCustomField of class BasedataCustomTest
[23:14:52.813] [ INFO] extentlisteners.ExtentListeners - Test passed: testSortCustomField
[23:14:53.815] [ INFO] extentlisteners.ExtentListeners - Running test method testColumnMove of class BasedataCustomTest
[23:14:57.461] [ INFO] extentlisteners.ExtentListeners - Test passed: testColumnMove
[23:14:58.477] [ INFO] extentlisteners.ExtentListeners - Running test method testEditCustomField of class BasedataCustomTest
[23:15:01.304] [ INFO] extentlisteners.ExtentListeners - Test passed: testEditCustomField
[23:15:02.316] [ INFO] extentlisteners.ExtentListeners - Running test method testCreateCustomField of class BasedataCustomTest
[23:15:03.931] [ INFO] extentlisteners.ExtentListeners - Test passed: testCreateCustomField
[23:15:04.944] [ INFO] extentlisteners.ExtentListeners - Running test method testDeleteCustomField of class BasedataCustomTest
[23:15:05.402] [ INFO] extentlisteners.ExtentListeners - Test passed: testDeleteCustomField
[23:15:06.601] [ INFO] extentlisteners.ExtentListeners - Test Suite Basedata ending
[23:15:06.649] [ INFO] extentlisteners.ExtentListeners - Test Suite Users started
[23:15:07.452] [ INFO] base.BaseTest - Google Chrome launched
[23:15:09.512] [ INFO] extentlisteners.ExtentListeners - Running test method testCreateUsers of class ManageUsersTest
[23:15:13.480] [ INFO] extentlisteners.ExtentListeners - Test passed: testCreateUsers
[23:15:14.490] [ INFO] extentlisteners.ExtentListeners - Running test method testEditUser of class ManageUsersTest
[23:15:16.726] [ INFO] extentlisteners.ExtentListeners - Test passed: testEditUser
[23:15:17.741] [ INFO] extentlisteners.ExtentListeners - Running test method testDeleteUser of class ManageUsersTest
[23:15:18.706] [ INFO] extentlisteners.ExtentListeners - Test passed: testDeleteUser
[23:15:20.777] [ INFO] base.BaseTest - Google Chrome launched
[23:15:22.560] [ INFO] extentlisteners.ExtentListeners - Running test method testSetNewPassword of class UsersTest
[23:15:24.893] [ INFO] extentlisteners.ExtentListeners - Test passed: testSetNewPassword
[23:15:25.900] [ INFO] extentlisteners.ExtentListeners - Running test method testRevertPassword of class UsersTest
[23:15:26.215] [ INFO] extentlisteners.ExtentListeners - Test passed: testRevertPassword
[23:15:27.227] [ INFO] extentlisteners.ExtentListeners - Running test method testLogout of class UsersTest
[23:15:27.464] [ INFO] extentlisteners.ExtentListeners - Test passed: testLogout
[23:15:28.663] [ INFO] extentlisteners.ExtentListeners - Test Suite Users ending
