Time,header.seq,header.stamp.secs,header.stamp.nsecs,header.frame_id,Latitude,Longitude,Altitude,UTM_easting,UTM_northing,Zone,Letter,quality
1701762596.7996347,1,58674,80000,GNSS1_Frame,42.33902876166667,71.08486158,4.225,671747.3163896924,4689524.371511556,42,T,5
1701762597.5067153,2,58675,80000,GNSS1_Frame,42.33902874666666,71.0848616,4.222,671747.3180781669,4689524.369886317,42,T,5
1701762598.2149456,3,58676,80000,GNSS1_Frame,42.33902876333333,71.084861585,4.226,671747.3167970642,4689524.371706726,42,T,5
1701762598.9241424,4,58677,80000,GNSS1_Frame,42.33902878666667,71.08486156166667,4.231,671747.3148112963,4689524.374250584,42,T,5
1701762599.6306837,5,58678,80000,GNSS1_Frame,42.33902878833333,71.08486156333333,4.229,671747.3149440611,4689524.374439021,42,T,5
1701762600.336285,6,58679,80000,GNSS1_Frame,42.339028795,71.08486154833334,4.235,671747.3136901864,4689524.375149005,42,T,5
1701762601.0471272,7,58680,80000,GNSS1_Frame,42.33902878666667,71.08486153666666,4.238,671747.3127517535,4689524.374200087,42,T,5
1701762601.7502,8,58681,80000,GNSS1_Frame,42.33902877,71.084861525,4.245,671747.3118360089,4689524.372325814,42,T,5
1701762602.4626834,9,58682,80000,GNSS1_Frame,42.33902875166667,71.08486150833333,4.238,671747.3105128948,4689524.370256374,42,T,5
1701762603.1673353,10,58683,80000,GNSS1_Frame,42.339028765,71.08486151833333,4.244,671747.3113004123,4689524.371757137,42,T,5
1701762603.8734508,11,58684,80000,GNSS1_Frame,42.33902878,71.08486148666667,4.244,671747.3086508185,4689524.373358809,42,T,5
1701762604.5798275,12,58685,80000,GNSS1_Frame,42.33902877,71.084861485,4.247,671747.3085407421,4689524.372245018,42,T,5
1701762605.2872806,13,58686,80000,GNSS1_Frame,42.33902876333333,71.0848615,4.245,671747.309794619,4689524.371535035,42,T,5
1701762605.9943347,14,58687,80000,GNSS1_Frame,42.339028776666666,71.08486143833333,4.242,671747.3046781106,4689524.3728910405,42,T,5
1701762606.701503,15,58688,80000,GNSS1_Frame,42.33902875333333,71.08486144,4.246,671747.3048789406,4689524.370303419,42,T,5
1701762607.4099965,16,58689,80000,GNSS1_Frame,42.33902876,71.08486142833334,4.246,671747.3038996707,4689524.371020136,42,T,5
1701762608.11806,17,58690,80000,GNSS1_Frame,42.339028748333334,71.08486140666666,4.252,671747.3021464965,4689524.369680878,42,T,5
1701762608.826899,18,58691,80000,GNSS1_Frame,42.339028715,71.08486139666667,4.252,671747.3014134332,4689524.365959266,42,T,5
1701762609.532588,19,58692,80000,GNSS1_Frame,42.33902870666667,71.08486137666667,4.258,671747.299788486,4689524.364993515,42,T,5
1701762610.238796,20,58693,80000,GNSS1_Frame,42.33902870833333,71.084861355,4.26,671747.2979990124,4689524.36513482,42,T,5
1701762610.9479299,21,58694,80000,GNSS1_Frame,42.339028705,71.084861375,4.263,671747.2996557212,4689524.364805077,42,T,5
1701762611.6587844,22,58695,80000,GNSS1_Frame,42.339028695,71.08486137,4.266,671747.2992710399,4689524.3636845555,42,T,5
1701762612.3631232,23,58696,80000,GNSS1_Frame,42.33902869666667,71.08486135666666,4.261,671747.2981680786,4689524.363842694,42,T,5
1701762613.0681567,24,58697,80000,GNSS1_Frame,42.33902870166666,71.08486131833334,4.265,671747.2949965012,4689524.364320476,42,T,5
1701762613.7759056,25,58698,80000,GNSS1_Frame,42.33902869333333,71.08486132333333,4.271,671747.2954310969,4689524.363405222,42,T,5
1701762614.4840946,26,58699,80000,GNSS1_Frame,42.339028686666666,71.08486132,4.271,671747.2951746427,4689524.362658207,42,T,5
1701762615.1887121,27,58700,80000,GNSS1_Frame,42.33902866333333,71.08486130333333,4.271,671747.2938651415,4689524.360033552,42,T,5
1701762615.8954022,28,58701,80000,GNSS1_Frame,42.33902864,71.08486128666667,4.264,671747.2925556403,4689524.3574089,42,T,5
1701762616.6041062,29,58702,80000,GNSS1_Frame,42.33902863666667,71.08486125,4.259,671747.2895440537,4689524.356964696,42,T,5
1701762617.312289,30,58703,80000,GNSS1_Frame,42.339028631666665,71.08486121666667,4.262,671747.2868116075,4689524.356342154,42,T,5
1701762618.0200377,31,58704,80000,GNSS1_Frame,42.339028623333334,71.0848612,4.263,671747.2854612694,4689524.355383138,42,T,5
1701762618.7275558,32,58705,80000,GNSS1_Frame,42.33902861166667,71.08486122166667,4.26,671747.287277969,4689524.354131408,42,T,5
1701762619.4355278,33,58706,80000,GNSS1_Frame,42.33902861333333,71.08486122833334,4.265,671747.2878226411,4689524.354329944,42,T,5
1701762620.142928,34,58707,80000,GNSS1_Frame,42.339028641666665,71.08486125333333,4.263,671747.2898050456,4689524.35752664,42,T,5
1701762620.851773,35,58708,80000,GNSS1_Frame,42.339028665,71.084861255,4.265,671747.2898788207,4689524.360120998,42,T,5
1701762621.5560918,36,58709,80000,GNSS1_Frame,42.339028685,71.08486124,4.261,671747.2885886425,4689524.362311547,42,T,5
1701762622.2655795,37,58710,80000,GNSS1_Frame,42.33902869166667,71.08486124,4.26,671747.2885704918,4689524.363051828,42,T,5
1701762622.9718828,38,58711,80000,GNSS1_Frame,42.33902870166666,71.08486122833334,4.258,671747.2875821445,4689524.364138686,42,T,5
1701762623.6830924,39,58712,80000,GNSS1_Frame,42.339028715,71.08486123,4.252,671747.2876831477,4689524.365622619,42,T,5
1701762624.3856823,40,58713,80000,GNSS1_Frame,42.33902872666667,71.08486124333334,4.254,671747.2887498055,4689524.366945046,42,T,5
1701762625.0954669,41,58714,80000,GNSS1_Frame,42.339028723333335,71.08486126,4.257,671747.2901319094,4689524.366608568,42,T,5
1701762625.8013015,42,58715,80000,GNSS1_Frame,42.33902870833333,71.08486127166667,4.267,671747.2911338698,4689524.364966498,42,T,5
1701762626.5114346,43,58716,80000,GNSS1_Frame,42.33902872833333,71.08486127833334,4.267,671747.2916286275,4689524.367200811,42,T,5
1701762627.2193866,44,58717,80000,GNSS1_Frame,42.339028733333336,71.08486125666667,4.261,671747.2898300786,4689524.367712259,42,T,5
1701762627.9270613,45,58718,80000,GNSS1_Frame,42.33902875,71.08486126166666,4.256,671747.2901966092,4689524.369573064,42,T,5
1701762628.6321504,46,58719,80000,GNSS1_Frame,42.33902877333333,71.08486123,4.251,671747.2875243293,4689524.372100091,42,T,5
1701762629.3374367,47,58720,80000,GNSS1_Frame,42.339028811666665,71.08486117166666,4.248,671747.2826143629,4689524.376238887,42,T,5
1701762630.0463762,48,58721,80000,GNSS1_Frame,42.33902883,71.08486113666666,4.242,671747.2796810869,4689524.378203969,42,T,5
1701762630.7511168,49,58722,80000,GNSS1_Frame,42.33902883,71.08486112666667,4.241,671747.2788572703,4689524.378183771,42,T,5
1701762631.4570174,50,58723,80000,GNSS1_Frame,42.33902883,71.08486112166666,4.239,671747.2784453629,4689524.378173671,42,T,5
1701762632.1650445,51,58724,80000,GNSS1_Frame,42.33902884333333,71.08486113666666,4.241,671747.2796447854,4689524.379684536,42,T,5
1701762632.8699813,52,58725,80000,GNSS1_Frame,42.33902886,71.08486114,4.24,671747.2798740158,4689524.381541976,42,T,5
1701762633.5784843,53,58726,80000,GNSS1_Frame,42.339028915,71.08486113833334,4.237,671747.2795869702,4689524.387645939,42,T,5
1701762634.2864695,54,58727,80000,GNSS1_Frame,42.339028915,71.08486112,4.234,671747.2780766393,4689524.387608908,42,T,5
1701762634.988162,55,58728,80000,GNSS1_Frame,42.33902886166667,71.08486123166666,4.267,671747.2874211351,4689524.381912202,42,T,5
1701762635.6955478,56,58729,80000,GNSS1_Frame,42.3390289,71.08486122166667,4.259,671747.2864929519,4689524.386148627,42,T,5
1701762636.3997438,57,58730,80000,GNSS1_Frame,42.339028845,71.08486134333333,4.28,671747.2966658022,4689524.380287048,42,T,5
1701762637.1075015,58,58731,80000,GNSS1_Frame,42.339028821666666,71.08486143833333,4.29,671747.3045555935,4689524.377887948,42,T,5
1701762637.8144898,59,58732,80000,GNSS1_Frame,42.339028778333336,71.084861505,4.304,671747.3101656872,4689524.373210771,42,T,5
1701762638.5188208,60,58733,80000,GNSS1_Frame,42.33902872833333,71.084861565,4.314,671747.3152447196,4689524.367779844,42,T,5
1701762639.2243109,61,58734,80000,GNSS1_Frame,42.339028678333335,71.08486164833333,4.327,671747.3222459925,4689524.362396049,42,T,5
1701762639.9298375,62,58735,80000,GNSS1_Frame,42.33902861,71.08486169666666,4.343,671747.3264138203,4689524.3549057795,42,T,5
1701762640.6355505,63,58736,80000,GNSS1_Frame,42.339028563333336,71.084861805,4.362,671747.3354655607,4689524.349942624,42,T,5
1701762641.343335,64,58737,80000,GNSS1_Frame,42.3390285,71.084861935,4.39,671747.3463476157,4689524.343172524,42,T,5
1701762642.05106,65,58738,80000,GNSS1_Frame,42.339028406666664,71.08486209333333,4.417,671747.3596454967,4689524.333128383,42,T,5
1701762642.756608,66,58739,80000,GNSS1_Frame,42.33902842333333,71.084862205,4.439,671747.3687994104,4689524.335204644,42,T,5
1701762643.4634004,67,58740,80000,GNSS1_Frame,42.33902842166667,71.08486231166667,4.457,671747.3775913332,4689524.335235028,42,T,5
1701762644.1682742,68,58741,80000,GNSS1_Frame,42.33902836833333,71.08486238166667,4.476,671747.383503258,4689524.329454158,42,T,5
1701762644.878742,69,58742,80000,GNSS1_Frame,42.33902828833333,71.08486243666667,4.489,671747.3882520592,4689524.320681862,42,T,5
1701762645.5819738,70,58743,80000,GNSS1_Frame,42.33902819666667,71.08486241833333,4.496,671747.3869913002,4689524.310465946,42,T,5
1701762646.290785,71,58744,80000,GNSS1_Frame,42.339028095,71.08486248166666,4.509,671747.3924856076,4689524.299304564,42,T,5
1701762646.9985235,72,58745,80000,GNSS1_Frame,42.33902800333333,71.0848625,4.519,671747.3942455107,4689524.289162709,42,T,5
1701762647.7104363,73,58746,80000,GNSS1_Frame,42.33902793666667,71.08486254666667,4.524,671747.3982714985,4689524.281854144,42,T,5
1701762648.4102235,74,58747,80000,GNSS1_Frame,42.33902788166667,71.084862555,4.535,671747.399107756,4689524.275763646,42,T,5
1701762649.1165962,75,58748,80000,GNSS1_Frame,42.33902781333333,71.084862535,4.539,671747.397646165,4689524.268135352,42,T,5
1701762649.827453,76,58749,80000,GNSS1_Frame,42.339027718333334,71.084862545,4.545,671747.3987286312,4689524.257606525,42,T,5
1701762650.5349035,77,58750,80000,GNSS1_Frame,42.339027646666665,71.0848626,4.554,671747.4034547443,4689524.249759581,42,T,5
1701762651.238865,78,58751,80000,GNSS1_Frame,42.33902758,71.08486266666667,4.556,671747.4091283655,4689524.242491414,42,T,5
1701762651.9501412,79,58752,80000,GNSS1_Frame,42.33902757166667,71.084862725,4.575,671747.4139566538,4689524.241683888,42,T,5
1701762652.655487,80,58753,80000,GNSS1_Frame,42.33902758333333,71.084862725,4.59,671747.4139248901,4689524.242979382,42,T,5
1701762653.3596425,81,58754,80000,GNSS1_Frame,42.339027575,71.084862685,4.6,671747.4106523094,4689524.241973233,42,T,5
1701762654.0651278,82,58755,80000,GNSS1_Frame,42.339027601666665,71.08486267833334,4.615,671747.4100304969,4689524.244920897,42,T,5
1701762654.7757185,83,58756,80000,GNSS1_Frame,42.33902755166667,71.08486266166666,4.627,671747.4087935985,4689524.239335115,42,T,5
1701762655.4794915,84,58757,80000,GNSS1_Frame,42.339027396666665,71.08486261,4.626,671747.404959214,4689524.222019183,42,T,5
1701762656.1878889,85,58758,80000,GNSS1_Frame,42.33902733833333,71.08486259833333,4.627,671747.4041569114,4689524.215518147,42,T,5
1701762656.8954623,86,58759,80000,GNSS1_Frame,42.33902728166667,71.08486254833333,4.628,671747.4001921066,4689524.20912475,42,T,5
1701762657.6011105,87,58760,80000,GNSS1_Frame,42.339027228333336,71.08486251666666,4.63,671747.3977285573,4689524.203138527,42,T,5
1701762658.311691,88,58761,80000,GNSS1_Frame,42.339027208333334,71.08486252166666,4.647,671747.3981949168,4689524.20092778,42,T,5
1701762659.0198598,89,58762,80000,GNSS1_Frame,42.33902713,71.08486254833333,4.661,671747.4006050348,4689524.192283322,42,T,5
1701762659.7231061,90,58763,80000,GNSS1_Frame,42.33902706333333,71.08486254,4.673,671747.4001000274,4689524.184863665,42,T,5
1701762660.4300218,91,58764,80000,GNSS1_Frame,42.339026975,71.08486254833333,4.682,671747.4010270385,4689524.1750717545,42,T,5
1701762661.1387281,92,58765,80000,GNSS1_Frame,42.339026925,71.08486258166667,4.689,671747.4039092258,4689524.169586964,42,T,5
1701762661.8466868,93,58766,80000,GNSS1_Frame,42.33902686333333,71.08486260666666,4.698,671747.4061366627,4689524.162789847,42,T,5
1701762662.555233,94,58767,80000,GNSS1_Frame,42.339026788333335,71.08486263333333,4.69,671747.4085377032,4689524.154515533,42,T,5
1701762663.2625453,95,58768,80000,GNSS1_Frame,42.33902670166667,71.08486264,4.703,671747.4093228742,4689524.144905325,42,T,5
1701762663.9716232,96,58769,80000,GNSS1_Frame,42.339026591666666,71.08486267166667,4.705,671747.4122311154,4689524.132754627,42,T,5
1701762664.679361,97,58770,80000,GNSS1_Frame,42.339026425,71.08486268166666,4.697,671747.4135086994,4689524.114267762,42,T,5
1701762665.387307,98,58771,80000,GNSS1_Frame,42.33902638166666,71.08486271333334,4.692,671747.4162354337,4689524.109519888,42,T,5
1701762666.0916173,99,58772,80000,GNSS1_Frame,42.339026368333336,71.08486272,4.702,671747.4168209468,4689524.108052787,42,T,5
1701762666.799377,100,58773,80000,GNSS1_Frame,42.339026311666665,71.08486277,4.714,671747.4210943136,4689524.101861381,42,T,5
1701762667.5107908,101,58774,80000,GNSS1_Frame,42.339026221666664,71.084862805,4.728,671747.4242227076,4689524.091938261,42,T,5
1701762668.2127385,102,58775,80000,GNSS1_Frame,42.339026075,71.084862775,4.728,671747.4221505728,4689524.075591451,42,T,5
1701762668.919928,103,58776,80000,GNSS1_Frame,42.339025998333334,71.08486273833333,4.746,671747.4193386416,4689524.067004139,42,T,5
1701762669.6272929,104,58777,80000,GNSS1_Frame,42.339025965,71.084862695,4.746,671747.415859521,4689524.063215196,42,T,5
1701762670.3374326,105,58778,80000,GNSS1_Frame,42.3390259,71.08486272,4.753,671747.4180960332,4689524.05604794,42,T,5
1701762671.0426052,106,58779,80000,GNSS1_Frame,42.339025855,71.08486270166667,4.749,671747.4167082172,4689524.0510140015,42,T,5
1701762671.7515419,107,58780,80000,GNSS1_Frame,42.339025783333334,71.08486269833334,4.754,671747.4166287323,4689524.04304923,42,T,5
1701762672.4589307,108,58781,80000,GNSS1_Frame,42.339025723333336,71.08486263833333,4.747,671747.411849186,4689524.036265494,42,T,5
1701762673.1639938,109,58782,80000,GNSS1_Frame,42.33902565166667,71.08486262333334,4.741,671747.4108085799,4689524.028277159,42,T,5
1701762673.872168,110,58783,80000,GNSS1_Frame,42.33902557,71.08486256833334,4.722,671747.4064999305,4689524.019097603,42,T,5
1701762674.582558,111,58784,80000,GNSS1_Frame,42.339025495,71.084862535,4.72,671747.4039580686,4689524.010702096,42,T,5
1701762675.2909565,112,58785,80000,GNSS1_Frame,42.339025451666664,71.08486251166667,4.717,671747.4021538098,4689524.005843128,42,T,5
1701762675.9959395,113,58786,80000,GNSS1_Frame,42.33902538,71.084862495,4.716,671747.400975901,4689523.997851427,42,T,5
1701762676.703727,114,58787,80000,GNSS1_Frame,42.339025315,71.084862445,4.706,671747.3970337844,4689523.990532678,42,T,5
1701762677.4089012,115,58788,80000,GNSS1_Frame,42.33902526166667,71.08486242,4.711,671747.3951194449,4689523.98455992,42,T,5
1701762678.1187484,116,58789,80000,GNSS1_Frame,42.33902519833333,71.08486237833333,4.709,671747.391859305,4689523.977443074,42,T,5
1701762678.8216982,117,58790,80000,GNSS1_Frame,42.339025148333334,71.084862345,4.705,671747.38924938,4689523.971823625,42,T,5
1701762679.5279078,118,58791,80000,GNSS1_Frame,42.33902510833333,71.08486226833334,4.708,671747.3830423509,4689523.9672270715,42,T,5
1701762680.237333,119,58792,80000,GNSS1_Frame,42.33902511833333,71.08486220666667,4.72,671747.3779349197,4689523.968212936,42,T,5
1701762680.9471006,120,58793,80000,GNSS1_Frame,42.33902511833333,71.084862185,4.728,671747.3761499816,4689523.968169171,42,T,5
1701762681.6552703,121,58794,80000,GNSS1_Frame,42.33902513333334,71.08486212,4.731,671747.3707543305,4689523.969703516,42,T,5
1701762682.3595889,122,58795,80000,GNSS1_Frame,42.33902509166667,71.08486201666666,4.728,671747.3623549957,4689523.964868028,42,T,5
1701762683.0683389,123,58796,80000,GNSS1_Frame,42.33902505333333,71.08486192666666,4.736,671747.3550450051,4689523.9604296135,42,T,5
1701762683.7726243,124,58797,80000,GNSS1_Frame,42.339025065,71.08486188,4.737,671747.3511687645,4689523.961630847,42,T,5
1701762684.478757,125,58798,80000,GNSS1_Frame,42.33902504,71.08486183333333,4.739,671747.3473923486,4689523.958760527,42,T,5
1701762685.1875029,126,58799,80000,GNSS1_Frame,42.339024998333336,71.08486181333333,4.737,671747.3458581548,4689523.954093363,42,T,5
1701762685.8934658,127,58800,80000,GNSS1_Frame,42.33902501,71.08486177,4.739,671747.3422565171,4689523.9553013295,42,T,5
1701762686.5973458,128,58801,80000,GNSS1_Frame,42.339024968333334,71.08486175166666,4.735,671747.3408596278,4689523.950637532,42,T,5
1701762687.303961,129,58802,80000,GNSS1_Frame,42.33902494,71.08486170333333,4.737,671747.3369549848,4689523.947393703,42,T,5
1701762688.0095935,130,58803,80000,GNSS1_Frame,42.339024931666664,71.08486162666667,4.727,671747.3306617398,4689523.946313491,42,T,5
1701762688.715642,131,58804,80000,GNSS1_Frame,42.33902495,71.08486152,4.717,671747.3218244439,4689523.948133816,42,T,5
1701762689.4242022,132,58805,80000,GNSS1_Frame,42.33902501,71.08486146666667,4.717,671747.317267397,4689523.954688631,42,T,5
1701762690.129611,133,58806,80000,GNSS1_Frame,42.339024955,71.08486144833333,4.723,671747.3159068068,4689523.948544268,42,T,5
1701762690.8425078,134,58807,80000,GNSS1_Frame,42.33902495,71.084861455,4.724,671747.3164696319,4689523.948002524,42,T,5
1701762691.5510495,135,58808,80000,GNSS1_Frame,42.339024976666664,71.08486145333333,4.72,671747.3162597266,4689523.950960286,42,T,5
1701762692.2551532,136,58809,80000,GNSS1_Frame,42.339025025,71.08486131166667,4.709,671747.3044573909,4689523.956041185,42,T,5
1701762692.966317,137,58810,80000,GNSS1_Frame,42.33902512,71.08486118166667,4.7,671747.2934891195,4689523.966327626,42,T,5
1701762693.6717439,138,58811,80000,GNSS1_Frame,42.33902515333333,71.08486119333334,4.701,671747.2943594853,4689523.970052605,42,T,5
1701762694.3774152,139,58812,80000,GNSS1_Frame,42.33902513,71.08486117833333,4.696,671747.2931872865,4689523.967431318,42,T,5
1701762695.0853872,140,58813,80000,GNSS1_Frame,42.33902513333334,71.08486111833334,4.687,671747.2882353107,4689523.967680265,42,T,5
1701762695.7916167,141,58814,80000,GNSS1_Frame,42.33902517,71.084861045,4.679,671747.2820941535,4689523.971603694,42,T,5
1701762696.4971633,142,58815,80000,GNSS1_Frame,42.33902519833333,71.08486098166667,4.679,671747.2767995035,4689523.97462197,42,T,5
1701762697.2036154,143,58816,80000,GNSS1_Frame,42.3390252,71.084860935,4.684,671747.2729504869,4689523.974712779,42,T,5
1701762697.9086978,144,58817,80000,GNSS1_Frame,42.3390252,71.08486089333333,4.682,671747.2695179153,4689523.974628618,42,T,5
1701762698.6185827,145,58818,80000,GNSS1_Frame,42.339025201666665,71.08486084333333,4.674,671747.2653942918,4689523.974712693,42,T,5
1701762699.3242147,146,58819,80000,GNSS1_Frame,42.339025213333336,71.08486077833334,4.678,671747.2600077161,4689523.975876896,42,T,5
1701762700.035179,147,58820,80000,GNSS1_Frame,42.33902526833333,71.08486068833334,4.665,671747.2524436201,4689523.9818024365,42,T,5
1701762700.7461605,148,58821,80000,GNSS1_Frame,42.33902525333333,71.08486060166666,4.656,671747.2453447069,4689523.979961745,42,T,5
1701762701.4473152,149,58822,80000,GNSS1_Frame,42.339025255,71.08486050833334,4.654,671747.2376512114,4689523.979958293,42,T,5
1701762702.1592815,150,58823,80000,GNSS1_Frame,42.339025248333336,71.08486047666666,4.647,671747.2350606073,4689523.979154048,42,T,5
1701762702.8602226,151,58824,80000,GNSS1_Frame,42.33902526166667,71.08486047333334,4.657,671747.2347497011,4689523.98062788,42,T,5
1701762703.570011,152,58825,80000,GNSS1_Frame,42.339025246666665,71.08486044333333,4.651,671747.2323190878,4689523.978901648,42,T,5
1701762704.2796903,153,58826,80000,GNSS1_Frame,42.339025271666664,71.08486039333333,4.65,671747.228131937,4689523.981576712,42,T,5
1701762704.987284,154,58827,80000,GNSS1_Frame,42.33902530666667,71.08486033,4.654,671747.2228191363,4689523.985335271,42,T,5
1701762705.6896305,155,58828,80000,GNSS1_Frame,42.339025353333334,71.0848603,4.654,671747.2202206292,4689523.990456653,42,T,5
1701762706.3992305,156,58829,80000,GNSS1_Frame,42.33902535833333,71.08486028666667,4.659,671747.2191085946,4689523.9909849325,42,T,5
1701762707.1074722,157,58830,80000,GNSS1_Frame,42.339025383333336,71.08486025,4.656,671747.2160198654,4689523.993686929,42,T,5
1701762707.815409,158,58831,80000,GNSS1_Frame,42.33902536666667,71.08486017166666,4.654,671747.2096120062,4689523.9916779995,42,T,5
1701762708.5229955,159,58832,80000,GNSS1_Frame,42.33902536666667,71.084860125,4.66,671747.2057675294,4689523.991583739,42,T,5
1701762709.2313573,160,58833,80000,GNSS1_Frame,42.33902535833333,71.084860085,4.654,671747.2024949467,4689523.990577589,42,T,5
1701762709.9387915,161,58834,80000,GNSS1_Frame,42.33902535666667,71.08486007333333,4.656,671747.2015383651,4689523.990368954,42,T,5
1701762710.6469877,162,58835,80000,GNSS1_Frame,42.33902539666666,71.08486007,4.659,671747.2011548541,4689523.994803916,42,T,5
1701762711.3525264,163,58836,80000,GNSS1_Frame,42.33902543333333,71.084860055,4.647,671747.1998192992,4689523.998845172,42,T,5
1701762712.0589745,164,58837,80000,GNSS1_Frame,42.33902546,71.084859985,4.645,671747.1939799772,4689524.00166491,42,T,5
1701762712.7676606,165,58838,80000,GNSS1_Frame,42.33902544833333,71.08485991,4.64,671747.1878331142,4689524.000217924,42,T,5
1701762713.4732192,166,58839,80000,GNSS1_Frame,42.33902545833333,71.08485985333333,4.633,671747.1831375883,4689524.001213888,42,T,5
1701762714.182671,167,58840,80000,GNSS1_Frame,42.339025461666665,71.08485981666666,4.634,671747.1801078509,4689524.001509966,42,T,5
1701762714.887904,168,58841,80000,GNSS1_Frame,42.339025465,71.08485976166666,4.641,671747.1755677803,4689524.001769016,42,T,5
1701762715.5932665,169,58842,80000,GNSS1_Frame,42.339025463333336,71.08485971833333,4.641,671747.172002444,4689524.001496416,42,T,5
1701762716.3013208,170,58843,80000,GNSS1_Frame,42.339025506666665,71.08485966333333,4.64,671747.1673534715,4689524.006197159,42,T,5
1701762717.0078852,171,58844,80000,GNSS1_Frame,42.33902549333333,71.08485964333333,4.645,671747.1657421372,4689524.004676195,42,T,5
1701762717.7220256,172,58845,80000,GNSS1_Frame,42.33902549333333,71.08485962333333,4.656,671747.1640945016,4689524.004635798,42,T,5
1701762718.4248283,173,58846,80000,GNSS1_Frame,42.33902548333333,71.08485957833334,4.646,671747.1604145532,4689524.003434479,42,T,5
1701762719.1350088,174,58847,80000,GNSS1_Frame,42.33902548166667,71.08485950833334,4.649,671747.1546523694,4689524.003108017,42,T,5
1701762719.8398223,175,58848,80000,GNSS1_Frame,42.33902548,71.08485949,4.655,671747.153146574,4689524.002885915,42,T,5
1701762720.5456102,176,58849,80000,GNSS1_Frame,42.339025461666665,71.08485943166667,4.644,671747.1483908903,4689524.000732312,42,T,5
1701762721.2533274,177,58850,80000,GNSS1_Frame,42.33902543166667,71.084859375,4.645,671747.1438042684,4689523.997286581,42,T,5
1701762721.9633522,178,58851,80000,GNSS1_Frame,42.339025435,71.08485932,4.649,671747.1392641999,4689523.99754563,42,T,5
1701762722.6684933,179,58852,80000,GNSS1_Frame,42.33902542166667,71.08485931333334,4.651,671747.1387512914,4689523.996051598,42,T,5
1701762723.3765683,180,58853,80000,GNSS1_Frame,42.33902540333333,71.084859305,4.651,671747.1381146894,4689523.9939989885,42,T,5
1701762724.086446,181,58854,80000,GNSS1_Frame,42.33902538833333,71.084859325,4.649,671747.139803162,4689523.992373751,42,T,5
1701762724.7922418,182,58855,80000,GNSS1_Frame,42.339025395,71.08485932333333,4.65,671747.1396477089,4689523.993110666,42,T,5
1701762725.4991658,183,58856,80000,GNSS1_Frame,42.33902541,71.084859325,4.653,671747.1397441723,4689523.994779667,42,T,5
1701762726.203354,184,58857,80000,GNSS1_Frame,42.339025451666664,71.08485926833333,4.642,671747.134962435,4689523.999291974,42,T,5
1701762726.910155,185,58858,80000,GNSS1_Frame,42.339025455,71.08485926,4.642,671747.1342668433,4689523.999645283,42,T,5
1701762727.6208637,186,58859,80000,GNSS1_Frame,42.33902546833333,71.08485921,4.65,671747.1301114581,4689524.001024854,42,T,5
1701762728.3266447,187,58860,80000,GNSS1_Frame,42.339025455,71.08485914666667,4.662,671747.12493025,4689523.999416363,42,T,5
1701762729.034984,188,58861,80000,GNSS1_Frame,42.33902545666667,71.08485914166667,4.662,671747.1245138028,4689523.999591335,42,T,5
1701762729.740857,189,58862,80000,GNSS1_Frame,42.33902547,71.08485913666667,4.662,671747.1240655942,4689524.001061801,42,T,5
1701762730.4475424,190,58863,80000,GNSS1_Frame,42.339025486666664,71.08485913666667,4.659,671747.1240202176,4689524.002912506,42,T,5
1701762731.155375,191,58864,80000,GNSS1_Frame,42.339025505,71.084859075,4.656,671747.1188900961,4689524.004823726,42,T,5
1701762731.86193,192,58865,80000,GNSS1_Frame,42.33902551833334,71.08485902166667,4.658,671747.114460104,4689524.006196563,42,T,5
1701762732.5705333,193,58866,80000,GNSS1_Frame,42.33902554,71.084859,4.659,671747.1126161763,4689524.008558718,42,T,5
1701762733.2750285,194,58867,80000,GNSS1_Frame,42.339025506666665,71.08485897,4.654,671747.1102354794,4689524.004796707,42,T,5
1701762733.9867854,195,58868,80000,GNSS1_Frame,42.33902553833333,71.08485897333334,4.657,671747.1104238686,4689524.008319783,42,T,5
1701762734.6920636,196,58869,80000,GNSS1_Frame,42.339025543333335,71.08485897833333,4.657,671747.1108221629,4689524.008885094,42,T,5
1701762735.3999057,197,58870,80000,GNSS1_Frame,42.339025533333334,71.08485897,4.655,671747.1101628768,4689524.007757838,42,T,5
1701762736.105887,198,58871,80000,GNSS1_Frame,42.339025543333335,71.08485899333333,4.66,671747.1120578891,4689524.008915393,42,T,5
1701762736.8151383,199,58872,80000,GNSS1_Frame,42.339025553333336,71.084859,4.661,671747.1125798749,4689524.010039282,42,T,5
1701762737.5269191,200,58873,80000,GNSS1_Frame,42.33902557,71.08485898,4.662,671747.110886865,4689524.01184959,42,T,5
1701762738.2319748,201,58874,80000,GNSS1_Frame,42.33902558166667,71.08485896,4.66,671747.1092074655,4689524.013104687,42,T,5
1701762738.9397829,202,58875,80000,GNSS1_Frame,42.339025568333334,71.08485894333333,4.658,671747.1078707383,4689524.0115904575,42,T,5
1701762739.6481583,203,58876,80000,GNSS1_Frame,42.339025578333334,71.08485892,4.666,671747.1059212738,4689524.012653751,42,T,5
1701762740.3551657,204,58877,80000,GNSS1_Frame,42.33902559333333,71.08485890333333,4.66,671747.1045074064,4689524.014285722,42,T,5
1701762741.063592,205,58878,80000,GNSS1_Frame,42.339025598333336,71.0848589,4.656,671747.1042191864,4689524.014834202,42,T,5
1701762741.7745166,206,58879,80000,GNSS1_Frame,42.33902559166667,71.08485884833334,4.657,671747.0999809487,4689524.0139895575,42,T,5
1701762742.4783926,207,58880,80000,GNSS1_Frame,42.339025555,71.084858785,4.652,671747.0948632678,4689524.009790078,42,T,5
1701762743.186628,208,58881,80000,GNSS1_Frame,42.339025555,71.08485885833333,4.649,671747.1009045942,4689524.009938203,42,T,5
1701762743.895892,209,58882,80000,GNSS1_Frame,42.339025576666664,71.08485886166666,4.642,671747.1011202093,4689524.0123508535,42,T,5
1701762744.603257,210,58883,80000,GNSS1_Frame,42.339025575,71.08485887333333,4.646,671747.1020858684,4689524.012189348,42,T,5
1701762745.3090706,211,58884,80000,GNSS1_Frame,42.33902560333333,71.08485885,4.644,671747.1000864875,4689524.015288419,42,T,5
1701762746.0138535,212,58885,80000,GNSS1_Frame,42.33902557333333,71.08485881,4.652,671747.0968728964,4689524.011876352,42,T,5
1701762746.723975,213,58886,80000,GNSS1_Frame,42.33902559166667,71.084858825,4.655,671747.0980587082,4689524.013942428,42,T,5
1701762747.4355664,214,58887,80000,GNSS1_Frame,42.33902560833333,71.08485881166666,4.655,671747.0969149079,4689524.0157662025,42,T,5
1701762748.1438417,215,58888,80000,GNSS1_Frame,42.33902563666667,71.08485882333333,4.659,671747.0977988888,4689524.018935969,42,T,5
1701762748.8504806,216,58889,80000,GNSS1_Frame,42.33902563833333,71.08485879166666,4.661,671747.0951855964,4689524.019057076,42,T,5
1701762749.5581157,217,58890,80000,GNSS1_Frame,42.33902566,71.08485879833333,4.665,671747.0956758165,4689524.021476462,42,T,5
1701762750.2673032,218,58891,80000,GNSS1_Frame,42.339025695,71.08485882666666,4.666,671747.0979146755,4689524.025420174,42,T,5
1701762750.9700186,219,58892,80000,GNSS1_Frame,42.33902571833333,71.08485884166667,4.664,671747.0990868744,4689524.028041461,42,T,5
1701762751.6801894,220,58893,80000,GNSS1_Frame,42.339025746666664,71.08485884666666,4.669,671747.0994216413,4689524.031197762,42,T,5
1701762752.3852062,221,58894,80000,GNSS1_Frame,42.339025758333335,71.08485884166667,4.675,671747.0989779703,4689524.032483156,42,T,5
1701762753.0909865,222,58895,80000,GNSS1_Frame,42.33902579833333,71.08485884833334,4.674,671747.0994182782,4689524.036938317,42,T,5
1701762753.799752,223,58896,80000,GNSS1_Frame,42.33902582166667,71.084858845,4.677,671747.099080144,4689524.039522573,42,T,5
1701762754.507944,224,58897,80000,GNSS1_Frame,42.33902584166667,71.08485887833334,4.675,671747.1017717492,4689524.041810751,42,T,5
1701762755.2141821,225,58898,80000,GNSS1_Frame,42.33902585,71.08485887833334,4.676,671747.1017490609,4689524.042736105,42,T,5
1701762755.9209232,226,58899,80000,GNSS1_Frame,42.339025858333336,71.08485885166667,4.673,671747.0995295292,4689524.0436075935,42,T,5
1701762756.631525,227,58900,80000,GNSS1_Frame,42.339025871666664,71.08485884,4.677,671747.0985321067,4689524.045064594,42,T,5
1701762757.3385339,228,58901,80000,GNSS1_Frame,42.339025885,71.084858875,4.678,671747.101379165,4689524.046615855,42,T,5
1701762758.0401082,229,58902,80000,GNSS1_Frame,42.339025871666664,71.08485889833334,4.678,671747.1033377068,4689524.045182419,42,T,5
1701762758.7503188,230,58903,80000,GNSS1_Frame,42.339025881666664,71.08485885666667,4.682,671747.0998779093,4689524.046208682,42,T,5
1701762759.4592118,231,58904,80000,GNSS1_Frame,42.33902589833333,71.084858825,4.682,671747.0972237778,4689524.047995425,42,T,5
1701762760.1665444,232,58905,80000,GNSS1_Frame,42.339025895,71.08485878166667,4.683,671747.0936629792,4689524.047537755,42,T,5
1701762760.8751678,233,58906,80000,GNSS1_Frame,42.33902591333333,71.08485880166667,4.683,671747.0952607006,4689524.04961393,42,T,5
1701762761.5802145,234,58907,80000,GNSS1_Frame,42.339025938333336,71.08485881333333,4.684,671747.0961537526,4689524.052413556,42,T,5
1701762762.2871165,235,58908,80000,GNSS1_Frame,42.339025965,71.08485881,4.681,671747.0958065451,4689524.055367951,42,T,5
1701762762.9955308,236,58909,80000,GNSS1_Frame,42.33902596,71.084858765,4.684,671747.0921129817,4689524.054721845,42,T,5
1701762763.7036753,237,58910,80000,GNSS1_Frame,42.33902596833333,71.084858745,4.68,671747.0904426577,4689524.055606802,42,T,5
1701762764.411272,238,58911,80000,GNSS1_Frame,42.339025965,71.08485871833334,4.686,671747.0882548898,4689524.055182796,42,T,5
1701762765.115705,239,58912,80000,GNSS1_Frame,42.339025946666666,71.08485871666667,4.692,671747.0881675017,4689524.053143654,42,T,5
1701762765.8249137,240,58913,80000,GNSS1_Frame,42.33902595333333,71.08485868666666,4.692,671747.0856778987,4689524.05382334,42,T,5
1701762766.531986,241,58914,80000,GNSS1_Frame,42.33902596,71.08485866833334,4.694,671747.084149417,4689524.05452659,42,T,5
1701762767.2391837,242,58915,80000,GNSS1_Frame,42.339025985,71.084858665,4.694,671747.0838067429,4689524.057295916,42,T,5
1701762767.9475603,243,58916,80000,GNSS1_Frame,42.339025973333335,71.08485865833333,4.699,671747.0832892968,4689524.055986959,42,T,5
1701762768.6559026,244,58917,80000,GNSS1_Frame,42.33902595666667,71.08485866166667,4.702,671747.0836092784,4689524.054142984,42,T,5
1701762769.3639503,245,58918,80000,GNSS1_Frame,42.33902597666667,71.08485867333333,4.705,671747.0845159476,4689524.0563873965,42,T,5
1701762770.0686073,246,58919,80000,GNSS1_Frame,42.339025973333335,71.08485871,4.705,671747.0875456851,4689524.056091319,42,T,5
1701762770.779062,247,58920,80000,GNSS1_Frame,42.339025985,71.08485872,4.709,671747.0883377403,4689524.057407009,42,T,5
1701762771.484892,248,58921,80000,GNSS1_Frame,42.339025983333336,71.08485871333333,4.708,671747.087793064,4689524.057208476,42,T,5
1701762772.1926193,249,58922,80000,GNSS1_Frame,42.33902595833333,71.084858705,4.712,671747.0871746168,4689524.054415583,42,T,5
1701762772.8992352,250,58923,80000,GNSS1_Frame,42.33902594833334,71.084858705,4.713,671747.0872018428,4689524.053305158,42,T,5
1701762773.607811,251,58924,80000,GNSS1_Frame,42.33902590333334,71.084858645,4.71,671747.082381455,4689524.048187058,42,T,5
1701762774.315628,252,58925,80000,GNSS1_Frame,42.33902591166667,71.084858675,4.708,671747.0848302192,4689524.049173009,42,T,5
1701762775.0201206,253,58926,80000,GNSS1_Frame,42.33902593333333,71.08485871666667,4.712,671747.088203803,4689524.051663087,42,T,5
1701762775.7320473,254,58927,80000,GNSS1_Frame,42.339025936666665,71.08485871,4.717,671747.0876455137,4689524.052019763,42,T,5
1701762776.437198,255,58928,80000,GNSS1_Frame,42.339025918333334,71.084858715,4.714,671747.0881073354,4689524.049994085,42,T,5
1701762777.1470976,256,58929,80000,GNSS1_Frame,42.339025926666665,71.08485873833334,4.717,671747.0900068895,4689524.05096657,42,T,5
1701762777.8551428,257,58930,80000,GNSS1_Frame,42.33902592166667,71.08485874166666,4.709,671747.0902951075,4689524.050418091,42,T,5
1701762778.5667162,258,58931,80000,GNSS1_Frame,42.33902593333333,71.08485875666666,4.713,671747.09149907,4689524.051743883,42,T,5
1701762779.2679963,259,58932,80000,GNSS1_Frame,42.339025918333334,71.08485876666667,4.709,671747.0923637258,4689524.050098446,42,T,5
1701762779.9750402,260,58933,80000,GNSS1_Frame,42.33902592166667,71.084858775,4.713,671747.0930411647,4689524.05048542,42,T,5
1701762780.6816385,261,58934,80000,GNSS1_Frame,42.33902591,71.084858815,4.709,671747.0963681975,4689524.04927072,42,T,5
1701762781.3882143,262,58935,80000,GNSS1_Frame,42.339025901666666,71.08485881166666,4.714,671747.0961162788,4689524.048338634,42,T,5
1701762782.0963204,263,58936,80000,GNSS1_Frame,42.339025905,71.08485879666667,4.714,671747.0948714773,4689524.048678478,42,T,5
1701762782.8040879,264,58937,80000,GNSS1_Frame,42.339025891666665,71.08485877,4.711,671747.0927109354,4689524.04714405,42,T,5
1701762783.5088859,265,58938,80000,GNSS1_Frame,42.33902586833333,71.084858755,4.708,671747.0915387366,4689524.044522761,42,T,5
1701762784.2190366,266,58939,80000,GNSS1_Frame,42.33902584166667,71.08485872166666,4.698,671747.0888652819,4689524.041494302,42,T,5
1701762784.9295084,267,58940,80000,GNSS1_Frame,42.33902582666666,71.08485870166666,4.696,671747.0872584854,4689524.0397882685,42,T,5
1701762785.6353192,268,58941,80000,GNSS1_Frame,42.339025845,71.08485867,4.687,671747.0845998183,4689524.041760083,42,T,5
1701762786.3379326,269,58942,80000,GNSS1_Frame,42.33902586,71.08485865833333,4.68,671747.0835978581,4689524.043402154,42,T,5
1701762787.042911,270,58943,80000,GNSS1_Frame,42.339025875,71.08485865333333,4.674,671747.0831451097,4689524.04505769,42,T,5
1701762787.7512841,271,58944,80000,GNSS1_Frame,42.339025875,71.08485868166666,4.667,671747.0854792575,4689524.0451149205,42,T,5
1701762788.4584377,272,58945,80000,GNSS1_Frame,42.33902590333334,71.08485869833333,4.658,671747.0867751478,4689524.048294786,42,T,5
1701762789.1641917,273,58946,80000,GNSS1_Frame,42.33902590833333,71.08485869666667,4.648,671747.0866242325,4689524.048846632,42,T,5
1701762789.8686547,274,58947,80000,GNSS1_Frame,42.33902589666667,71.08485868833333,4.645,671747.0859694819,4689524.047534304,42,T,5
1701762790.5732214,275,58948,80000,GNSS1_Frame,42.339025905,71.084858685,4.638,671747.0856721865,4689524.048452925,42,T,5
1701762791.279722,276,58949,80000,GNSS1_Frame,42.339025915,71.08485866666666,4.633,671747.0841346295,4689524.049526318,42,T,5
1701762791.9912457,277,58950,80000,GNSS1_Frame,42.339025926666665,71.08485867333333,4.629,671747.0846520776,4689524.050835277,42,T,5
1701762792.6930728,278,58951,80000,GNSS1_Frame,42.33902594166667,71.084858675,4.626,671747.0847485411,4689524.05250428,42,T,5
1701762793.3989072,279,58952,80000,GNSS1_Frame,42.339025918333334,71.084858685,4.63,671747.0856358851,4689524.049933489,42,T,5
1701762794.1045353,280,58953,80000,GNSS1_Frame,42.33902590333334,71.08485867,4.633,671747.084441,4689524.048237556,42,T,5
1701762794.812204,281,58954,80000,GNSS1_Frame,42.339025918333334,71.08485865,4.632,671747.0827525256,4689524.049862794,42,T,5
1701762795.5185895,282,58955,80000,GNSS1_Frame,42.339025901666666,71.08485865,4.633,671747.0827979022,4689524.048012087,42,T,5
1701762796.2267847,283,58956,80000,GNSS1_Frame,42.339025915,71.08485862833334,4.63,671747.0809766628,4689524.04944889,42,T,5
1701762796.9337158,284,58957,80000,GNSS1_Frame,42.33902592166667,71.08485860166667,4.625,671747.0787616668,4689524.050135308,42,T,5
1701762797.6390283,285,58958,80000,GNSS1_Frame,42.33902595666667,71.08485857166667,4.619,671747.0761949256,4689524.053961194,42,T,5
1701762798.3478186,286,58959,80000,GNSS1_Frame,42.339025946666666,71.08485854166666,4.613,671747.0737506992,4689524.052790175,42,T,5
1701762799.0546274,287,58960,80000,GNSS1_Frame,42.339025981666666,71.08485850833334,4.609,671747.0709093511,4689524.056609328,42,T,5
1701762799.763271,288,58961,80000,GNSS1_Frame,42.33902598,71.08485849833333,4.603,671747.0700900699,4689524.056404059,42,T,5
1701762800.4670112,289,58962,80000,GNSS1_Frame,42.33902599,71.08485848833334,4.6,671747.0692390293,4689524.057494284,42,T,5
1701762801.1756582,290,58963,80000,GNSS1_Frame,42.33902599666666,71.08485846333333,4.59,671747.0671613336,4689524.058184069,42,T,5
1701762801.8795505,291,58964,80000,GNSS1_Frame,42.33902601166667,71.08485842166667,4.579,671747.0636879252,4689524.059765544,42,T,5
1701762802.5874064,292,58965,80000,GNSS1_Frame,42.33902602333333,71.08485836833333,4.573,671747.0592624667,4689524.060953311,42,T,5
1701762803.2917597,293,58966,80000,GNSS1_Frame,42.33902602333333,71.08485836,4.569,671747.0585759545,4689524.060936478,42,T,5
1701762803.9998496,294,58967,80000,GNSS1_Frame,42.33902602166667,71.08485835833334,4.571,671747.0584431897,4689524.060748043,42,T,5
1701762804.7054343,295,58968,80000,GNSS1_Frame,42.33902603166667,71.08485837666667,4.575,671747.0599262947,4689524.061895495,42,T,5
1701762805.409217,296,58969,80000,GNSS1_Frame,42.33902604166666,71.08485838833333,4.582,671747.060860188,4689524.063029485,42,T,5
1701762806.1162844,297,58970,80000,GNSS1_Frame,42.339026025,71.08485839333333,4.59,671747.0613174741,4689524.061188878,42,T,5
1701762806.823927,298,58971,80000,GNSS1_Frame,42.33902602,71.08485841333334,4.592,671747.0629787205,4689524.060674065,42,T,5
1701762807.5315971,299,58972,80000,GNSS1_Frame,42.33902604833333,71.08485839333333,4.587,671747.0612539467,4689524.063779867,42,T,5
1701762808.2396595,300,58973,80000,GNSS1_Frame,42.33902603,71.084858665,4.588,671747.083684226,4689524.0622928245,42,T,5
1701762808.9478023,301,58974,80000,GNSS1_Frame,42.33902610166667,71.08485903333333,4.612,671747.1138330402,4689524.070994851,42,T,5
1701762809.655189,302,58975,80000,GNSS1_Frame,42.339026096666665,71.08485935833333,4.624,671747.140620711,4689524.071096101,42,T,5
1701762810.3637764,303,58976,80000,GNSS1_Frame,42.33902595666667,71.08485967666667,4.634,671747.167226723,4689524.056193163,42,T,5
1701762811.0682447,304,58977,80000,GNSS1_Frame,42.339025755,71.08485994166666,4.64,671747.1896069361,4689524.034334886,42,T,5
1701762811.7758117,305,58978,80000,GNSS1_Frame,42.339025635,71.08486017666667,4.655,671747.2092933533,4689524.021484471,42,T,5
1701762812.4869945,306,58979,80000,GNSS1_Frame,42.33902552333333,71.08486041166667,4.674,671747.22895708,4689524.00955941,42,T,5
1701762813.1910684,307,58980,80000,GNSS1_Frame,42.339025345,71.08486057333333,4.688,671747.2427609874,4689523.9900834,42,T,5
1701762813.8988695,308,58981,80000,GNSS1_Frame,42.33902517666667,71.084860715,4.688,671747.2548900353,4689523.971677417,42,T,5
1701762814.6073055,309,58982,80000,GNSS1_Frame,42.33902511666667,71.08486080666667,4.697,671747.2626050508,4689523.965200029,42,T,5
1701762815.3127806,310,58983,80000,GNSS1_Frame,42.339025056666664,71.084860955,4.705,671747.2749883621,4689523.958837102,42,T,5
1701762816.0197604,311,58984,80000,GNSS1_Frame,42.33902502666667,71.084861055,4.714,671747.283308212,4689523.955707818,42,T,5
1701762816.727427,312,58985,80000,GNSS1_Frame,42.339024968333334,71.08486119333334,4.729,671747.2948631668,4689523.949509763,42,T,5
1701762817.4347243,313,58986,80000,GNSS1_Frame,42.339024933333334,71.08486122,4.746,671747.2971553053,4689523.945677144,42,T,5
1701762818.1429687,314,58987,80000,GNSS1_Frame,42.339024863333336,71.0848613,4.758,671747.3039364236,4689523.938065768,42,T,5
1701762818.8477008,315,58988,80000,GNSS1_Frame,42.339024845,71.084861395,4.777,671747.3118126024,4689523.93622188,42,T,5
1701762819.555151,316,58989,80000,GNSS1_Frame,42.33902478666667,71.08486148166666,4.797,671747.3191111689,4689523.9299194645,42,T,5
1701762820.2598915,317,58990,80000,GNSS1_Frame,42.33902479166667,71.084861565,4.798,671747.325962699,4689523.930642999,42,T,5
1701762820.9686007,318,58991,80000,GNSS1_Frame,42.33902471,71.08486161666667,4.812,671747.3304414353,4689523.921678898,42,T,5
1701762821.6795757,319,58992,80000,GNSS1_Frame,42.339024638333335,71.08486173833333,4.822,671747.3406596631,4689523.913966615,42,T,5
1701762822.387383,320,58993,80000,GNSS1_Frame,42.33902456333333,71.08486180166666,4.84,671747.3460813679,4689523.905766361,42,T,5
1701762823.095162,321,58994,80000,GNSS1_Frame,42.339024546666664,71.08486181666666,4.856,671747.3473624708,4689523.903945954,42,T,5
1701762823.803155,322,58995,80000,GNSS1_Frame,42.33902453,71.084861835,4.872,671747.3489181786,4689523.902132278,42,T,5
1701762824.5084195,323,58996,80000,GNSS1_Frame,42.33902444666667,71.084861865,4.884,671747.3516165124,4689523.892939341,42,T,5
1701762825.215954,324,58997,80000,GNSS1_Frame,42.33902431333333,71.08486188833334,4.895,671747.3539017667,4689523.8781808205,42,T,5
1701762825.9235706,325,58998,80000,GNSS1_Frame,42.339024251666665,71.08486196166666,4.901,671747.3601109871,4689523.871481332,42,T,5
1701762826.630077,326,58999,80000,GNSS1_Frame,42.339024195,71.08486205166666,4.921,671747.367679623,4689523.865370721,42,T,5
1701762827.3394866,327,59000,80000,GNSS1_Frame,42.339024243333334,71.08486215666667,4.933,671747.3761981118,4689523.870949858,42,T,5
1701762828.047459,328,59001,80000,GNSS1_Frame,42.33902424833333,71.08486227333333,4.944,671747.3857956972,4689523.871740722,42,T,5
1701762828.755354,329,59002,80000,GNSS1_Frame,42.33902426666667,71.08486233,4.946,671747.3904140827,4689523.873890959,42,T,5
1701762829.462833,330,59003,80000,GNSS1_Frame,42.33902431333333,71.08486239833333,4.945,671747.3959164448,4689523.879210962,42,T,5
1701762830.16806,331,59004,80000,GNSS1_Frame,42.33902442,71.08486245666667,4.951,671747.400431634,4689523.891173311,42,T,5
1701762830.8790302,332,59005,80000,GNSS1_Frame,42.33902456,71.08486250166666,4.968,671747.403757646,4689523.906810139,42,T,5
1701762831.584351,333,59006,80000,GNSS1_Frame,42.33902466833333,71.08486255166666,4.98,671747.4075817831,4689523.918940725,42,T,5
1701762832.292181,334,59007,80000,GNSS1_Frame,42.339024735,71.08486260166667,4.989,671747.4115193621,4689523.926444544,42,T,5
1701762832.9996114,335,59008,80000,GNSS1_Frame,42.339024905,71.08486264833333,4.996,671747.4149010004,4689523.945416011,42,T,5
1701762833.7075121,336,59009,80000,GNSS1_Frame,42.339025015,71.08486273833333,5.008,671747.422015869,4689523.957812461,42,T,5
1701762834.411718,337,59010,80000,GNSS1_Frame,42.339025168333336,71.08486275833333,5.004,671747.4232460386,4689523.974879358,42,T,5
1701762835.1231906,338,59011,80000,GNSS1_Frame,42.339025338333336,71.08486282,4.999,671747.4278634009,4689523.993881122,42,T,5
1701762835.8281426,339,59012,80000,GNSS1_Frame,42.33902535833333,71.084862865,4.989,671747.4315161253,4689523.996192865,42,T,5
1701762836.5360239,340,59013,80000,GNSS1_Frame,42.33902533333333,71.08486291666667,4.985,671747.4358405787,4689523.993521166,42,T,5
1701762837.2436152,341,59014,80000,GNSS1_Frame,42.33902543166667,71.084862945,4.994,671747.4379070059,4689524.004497564,42,T,5
1701762837.951315,342,59015,80000,GNSS1_Frame,42.339025435,71.08486296333334,4.988,671747.4394082616,4689524.004904738,42,T,5
1701762838.6568785,343,59016,80000,GNSS1_Frame,42.339025443333334,71.08486301666667,4.984,671747.443779266,4689524.0059378175,42,T,5
1701762839.3637073,344,59017,80000,GNSS1_Frame,42.33902537666667,71.084863035,4.986,671747.445471104,4689523.998572023,42,T,5
1701762840.071623,345,59018,80000,GNSS1_Frame,42.339025316666664,71.08486306,4.979,671747.4476940032,4689523.991959976,42,T,5
1701762840.7790425,346,59019,80000,GNSS1_Frame,42.33902528833333,71.08486309166666,4.969,671747.4503798985,4689523.988877739,42,T,5
1701762841.4830627,347,59020,80000,GNSS1_Frame,42.339025398333334,71.08486311333333,4.962,671747.451865348,4689524.001136166,42,T,5
1701762842.1900675,348,59021,80000,GNSS1_Frame,42.339025445,71.08486313,4.945,671747.4531113217,4689524.006351808,42,T,5
1701762842.8993132,349,59022,80000,GNSS1_Frame,42.339025496666665,71.08486314,4.922,671747.4537944726,4689524.012109196,42,T,5
1701762843.603516,350,59023,80000,GNSS1_Frame,42.339025555,71.08486309333334,4.893,671747.4497911731,4689524.018492407,42,T,5
1701762844.3111908,351,59024,80000,GNSS1_Frame,42.339025595,71.08486313666667,4.879,671747.4532521429,4689524.023021632,42,T,5
1701762845.0187955,352,59025,80000,GNSS1_Frame,42.339025586666665,71.08486322833333,4.887,671747.4608264886,4689524.022281433,42,T,5
1701762845.7236824,353,59026,80000,GNSS1_Frame,42.33902565333333,71.084863255,4.894,671747.462841829,4689524.029738123,42,T,5
1701762846.431861,354,59027,80000,GNSS1_Frame,42.33902572666667,71.08486334166666,4.888,671747.4697819193,4689524.038056289,42,T,5
1701762847.1395636,355,59028,80000,GNSS1_Frame,42.339025793333334,71.08486342,4.892,671747.476053648,4689524.045617339,42,T,5
1701762847.8447835,356,59029,80000,GNSS1_Frame,42.339025838333335,71.08486341666666,4.865,671747.4756565238,4689524.050607514,42,T,5
1701762848.5552008,357,59030,80000,GNSS1_Frame,42.33902593,71.08486344166667,4.849,671747.4774664947,4689524.060836894,42,T,5
1701762849.2632275,358,59031,80000,GNSS1_Frame,42.33902603333333,71.08486333166667,4.821,671747.4681231682,4689524.072089086,42,T,5
1701762849.9660828,359,59032,80000,GNSS1_Frame,42.339026141666665,71.08486317666667,4.8,671747.4550590547,4689524.0838055955,42,T,5
1701762850.675136,360,59033,80000,GNSS1_Frame,42.33902616333334,71.08486309,4.79,671747.4478603171,4689524.086036458,42,T,5
1701762851.3812127,361,59034,80000,GNSS1_Frame,42.339026215,71.08486302666667,4.777,671747.4425021396,4689524.09164572,42,T,5
1701762852.089472,362,59035,80000,GNSS1_Frame,42.33902630833333,71.08486299333333,4.75,671747.4395019726,4689524.101942347,42,T,5
1701762852.7960422,363,59036,80000,GNSS1_Frame,42.339026366666666,71.08486297666667,4.742,671747.4379701255,4689524.108386154,42,T,5
1701762853.5016084,364,59037,80000,GNSS1_Frame,42.33902642,71.08486292833334,4.734,671747.4338431365,4689524.114210788,42,T,5
1701762854.2116175,365,59038,80000,GNSS1_Frame,42.33902649833333,71.08486287166667,4.717,671747.4289615703,4689524.122794647,42,T,5
1701762854.916055,366,59039,80000,GNSS1_Frame,42.339026575,71.08486286,4.703,671747.427791716,4689524.131284331,42,T,5
1701762855.623273,367,59040,80000,GNSS1_Frame,42.33902666666667,71.08486283166667,4.689,671747.4252079941,4689524.141405987,42,T,5
1701762856.3237433,368,59041,80000,GNSS1_Frame,42.339026688333334,71.08486283333333,4.69,671747.4252863068,4689524.14381527,42,T,5
1701762857.0311513,369,59042,80000,GNSS1_Frame,42.339026753333336,71.08486279833333,4.683,671747.4222259778,4689524.1509623295,42,T,5
1701762857.7335956,370,59043,80000,GNSS1_Frame,42.33902679,71.08486284166666,4.686,671747.425696025,4689524.155121413,42,T,5
1701762858.44046,371,59044,80000,GNSS1_Frame,42.33902689333333,71.08486286,4.686,671747.4269250203,4689524.166632823,42,T,5
1701762859.147961,372,59045,80000,GNSS1_Frame,42.33902691833333,71.084862895,4.697,671747.4297403147,4689524.169479578,42,T,5
1701762859.852369,373,59046,80000,GNSS1_Frame,42.33902689166667,71.084862945,4.708,671747.4339320033,4689524.166619442,42,T,5
1701762860.5609272,374,59047,80000,GNSS1_Frame,42.339026866666664,71.08486299166667,4.719,671747.4378445493,4689524.163937646,42,T,5
1701762861.2671242,375,59048,80000,GNSS1_Frame,42.33902686333333,71.084862985,4.717,671747.4373044128,4689524.163554036,42,T,5
1701762861.9666698,376,59049,80000,GNSS1_Frame,42.339026855,71.08486293333333,4.69,671747.4330707109,4689524.162524324,42,T,5
1701762862.679396,377,59050,80000,GNSS1_Frame,42.339026806666666,71.08486287666666,4.65,671747.4285340079,4689524.157042814,42,T,5
1701762863.3873272,378,59051,80000,GNSS1_Frame,42.33902674666667,71.08486290666667,4.642,671747.4311688164,4689524.150440869,42,T,5
1701762864.0911448,379,59052,80000,GNSS1_Frame,42.33902671,71.08486296333334,4.644,671747.4359369408,4689524.146483773,42,T,5
1701762864.7993014,380,59053,80000,GNSS1_Frame,42.33902674833333,71.08486288666667,4.632,671747.4295166433,4689524.150585541,42,T,5
1701762865.5072653,381,59054,80000,GNSS1_Frame,42.33902682,71.08486291333334,4.628,671747.4315183685,4689524.158597442,42,T,5
1701762866.2127695,382,59055,80000,GNSS1_Frame,42.339026831666665,71.084862895,4.622,671747.4299762738,4689524.159855906,42,T,5
1701762866.9174683,383,59056,80000,GNSS1_Frame,42.33902684833333,71.08486294,4.617,671747.4336380734,4689524.161797507,42,T,5
1701762867.627198,384,59057,80000,GNSS1_Frame,42.339026831666665,71.08486303833334,4.604,671747.4417843213,4689524.160145422,42,T,5
1701762868.3354316,385,59058,80000,GNSS1_Frame,42.33902683666667,71.08486308333333,4.591,671747.4454778825,4689524.160791529,42,T,5
1701762869.0398417,386,59059,80000,GNSS1_Frame,42.33902683,71.08486307833333,4.588,671747.445084126,4689524.160041147,42,T,5
1701762869.7473342,387,59060,80000,GNSS1_Frame,42.33902684833333,71.084863065,4.578,671747.4439357878,4689524.162049992,42,T,5
1701762870.4549196,388,59061,80000,GNSS1_Frame,42.339026886666666,71.08486304666667,4.584,671747.4423210903,4689524.1662695855,42,T,5
1701762871.1637444,389,59062,80000,GNSS1_Frame,42.339026955,71.08486303833334,4.579,671747.4414485334,4689524.1738406485,42,T,5
1701762871.8680477,390,59063,80000,GNSS1_Frame,42.33902697166667,71.08486302333333,4.577,671747.4401674285,4689524.175661058,42,T,5
1701762872.5785801,391,59064,80000,GNSS1_Frame,42.33902698666667,71.084863015,4.577,671747.4394400751,4689524.177309861,42,T,5
1701762873.2906718,392,59065,80000,GNSS1_Frame,42.339027038333334,71.08486299,4.566,671747.4372398665,4689524.182996554,42,T,5
1701762873.991172,393,59066,80000,GNSS1_Frame,42.33902713,71.084862885,4.545,671747.4283402134,4689524.192963351,42,T,5
1701762874.6994739,394,59067,80000,GNSS1_Frame,42.339027173333335,71.084862855,4.54,671747.4257507815,4689524.197714591,42,T,5
1701762875.4064574,395,59068,80000,GNSS1_Frame,42.33902717833333,71.08486283,4.535,671747.4236776256,4689524.198219306,42,T,5
1701762876.1114407,396,59069,80000,GNSS1_Frame,42.339027171666665,71.08486286833333,4.535,671747.4268537408,4689524.197556452,42,T,5
1701762876.8149028,397,59070,80000,GNSS1_Frame,42.33902717,71.08486283666667,4.528,671747.4242495259,4689524.197307419,42,T,5
1701762877.5270839,398,59071,80000,GNSS1_Frame,42.33902716,71.084862795,4.519,671747.4208441805,4689524.196112832,42,T,5
1701762878.2310286,399,59072,80000,GNSS1_Frame,42.33902727833333,71.08486273666666,4.504,671747.4157164036,4689524.209135021,42,T,5
1701762878.9328666,400,59073,80000,GNSS1_Frame,42.339027331666664,71.08486269666666,4.5,671747.4122759311,4689524.214976485,42,T,5
1701762879.6353729,401,59074,80000,GNSS1_Frame,42.339027385,71.08486266333334,4.489,671747.4093846683,4689524.220831417,42,T,5
1701762880.3398201,402,59075,80000,GNSS1_Frame,42.339027435,71.08486266833333,4.49,671747.4096604455,4689524.226393635,42,T,5
1701762881.0450733,403,59076,80000,GNSS1_Frame,42.339027531666666,71.08486257,4.475,671747.4012963914,4689524.23692911,42,T,5
1701762881.7535079,404,59077,80000,GNSS1_Frame,42.339027525,71.08486252666667,4.475,671747.3977446704,4689524.2361013,42,T,5
1701762882.45888,405,59078,80000,GNSS1_Frame,42.33902759,71.084862485,4.472,671747.3941351275,4689524.243234892,42,T,5
1701762883.1666536,406,59079,80000,GNSS1_Frame,42.339027605,71.084862495,4.47,671747.3949181073,4689524.244920726,42,T,5
1701762883.8783026,407,59080,80000,GNSS1_Frame,42.339027658333336,71.08486250333333,4.466,671747.3954594139,4689524.25085982,42,T,5
1701762884.5900156,408,59081,80000,GNSS1_Frame,42.339027718333334,71.08486248666667,4.458,671747.3939230292,4689524.257488699,42,T,5
1701762885.3064876,409,59082,80000,GNSS1_Frame,42.33902776833333,71.08486245333333,4.456,671747.3910408418,4689524.262973487,42,T,5
1701762886.0226033,410,59083,80000,GNSS1_Frame,42.33902784,71.08486240666667,4.443,671747.3870012432,4689524.270837264,42,T,5
1701762886.7290573,411,59084,80000,GNSS1_Frame,42.33902783,71.08486235333334,4.436,671747.3826347765,4689524.269619113,42,T,5
1701762887.4674978,412,59085,80000,GNSS1_Frame,42.33902784833333,71.08486235333334,4.425,671747.3825848621,4689524.271654891,42,T,5
1701762888.1544852,413,59086,80000,GNSS1_Frame,42.33902792333333,71.084862375,4.406,671747.3841656048,4689524.2800268335,42,T,5
1701762888.8604171,414,59087,80000,GNSS1_Frame,42.33902799,71.08486239833333,4.405,671747.3859063382,4689524.287476789,42,T,5
1701762889.5799775,415,59088,80000,GNSS1_Frame,42.339028065,71.08486244666666,4.405,671747.3896839262,4689524.295902595,42,T,5
1701762890.2887967,416,59089,80000,GNSS1_Frame,42.33902808,71.08486246833333,4.405,671747.3914280231,4689524.2976119965,42,T,5
1701762890.9982095,417,59090,80000,GNSS1_Frame,42.33902822,71.08486247166667,4.392,671747.3913214654,4689524.313164662,42,T,5
1701762891.7333663,418,59091,80000,GNSS1_Frame,42.33902826333333,71.08486248666667,4.382,671747.39243921,4689524.318006797,42,T,5
1701762892.4546611,419,59092,80000,GNSS1_Frame,42.33902826333333,71.08486250666667,4.377,671747.3940868455,4689524.318047195,42,T,5
1701762893.1859832,420,59093,80000,GNSS1_Frame,42.33902827666667,71.08486250333333,4.368,671747.3937759371,4689524.319521027,42,T,5
1701762893.8853648,421,59094,80000,GNSS1_Frame,42.33902835666667,71.08486256666667,4.359,671747.3987756382,4689524.328532343,42,T,5
1701762894.6030567,422,59095,80000,GNSS1_Frame,42.339028495,71.084862555,4.351,671747.3974378922,4689524.3438696405,42,T,5
1701762895.3121185,423,59096,80000,GNSS1_Frame,42.33902858333333,71.084862545,4.351,671747.3963735787,4689524.353658186,42,T,5
1701762896.0169392,424,59097,80000,GNSS1_Frame,42.33902866,71.08486252166666,4.346,671747.3942426032,4689524.362124304,42,T,5
1701762896.7326558,425,59098,80000,GNSS1_Frame,42.33902870666667,71.08486250166666,4.341,671747.392467915,4689524.367265885,42,T,5
1701762897.441611,426,59099,80000,GNSS1_Frame,42.33902875,71.08486250666667,4.332,671747.3927618448,4689524.3720878195,42,T,5
1701762898.1466856,427,59100,80000,GNSS1_Frame,42.33902877333333,71.08486254333333,4.327,671747.3957189815,4689524.374752872,42,T,5
1701762898.8754945,428,59101,80000,GNSS1_Frame,42.33902884,71.08486256,4.311,671747.396910503,4689524.382189361,42,T,5
1701762899.5885231,429,59102,80000,GNSS1_Frame,42.33902886833334,71.08486256666667,4.296,671747.3973825723,4689524.38534903,42,T,5
1701762900.304144,430,59103,80000,GNSS1_Frame,42.33902884333333,71.08486256833334,4.291,671747.3975879399,4689524.382576336,42,T,5
1701762901.0091753,431,59104,80000,GNSS1_Frame,42.339028825,71.08486249166667,4.281,671747.3913219256,4689524.380385702,42,T,5
1701762901.7139359,432,59105,80000,GNSS1_Frame,42.33902882666667,71.084862435,4.269,671747.3866490882,4689524.380456312,42,T,5
1701762902.4205425,433,59106,80000,GNSS1_Frame,42.33902878666667,71.08486239333334,4.256,671747.3833254232,4689524.375930455,42,T,5
1701762903.1309142,434,59107,80000,GNSS1_Frame,42.3390288,71.08486237666666,4.237,671747.3819160912,4689524.377377355,42,T,5
1701762903.835051,435,59108,80000,GNSS1_Frame,42.33902880666667,71.08486236166667,4.228,671747.3806622165,4689524.37808734,42,T,5
1701762904.5429587,436,59109,80000,GNSS1_Frame,42.339028801666664,71.08486234833333,4.222,671747.3795774058,4689524.377505194,42,T,5
1701762905.2448194,437,59110,80000,GNSS1_Frame,42.33902877,71.084862315,4.22,671747.3769175645,4689524.373921523,42,T,5
1701762905.9499452,438,59111,80000,GNSS1_Frame,42.33902874666666,71.084862315,4.22,671747.3769810919,4689524.371330534,42,T,5
1701762906.656634,439,59112,80000,GNSS1_Frame,42.339028776666666,71.08486226833334,4.211,671747.373054933,4689524.374567544,42,T,5
1701762907.357373,440,59113,80000,GNSS1_Frame,42.33902883166667,71.084862245,4.203,671747.3709829494,4689524.380627746,42,T,5
1701762908.063833,441,59114,80000,GNSS1_Frame,42.339028835,71.08486223,4.197,671747.3697381502,4689524.380967589,42,T,5
1701762908.7750177,442,59115,80000,GNSS1_Frame,42.339028803333335,71.08486219333334,4.195,671747.3668037019,4689524.377377183,42,T,5
1701762909.4761536,443,59116,80000,GNSS1_Frame,42.33902878833333,71.084862165,4.2,671747.3645103932,4689524.375654317,42,T,5
1701762910.1819599,444,59117,80000,GNSS1_Frame,42.339028784999996,71.08486216833333,4.196,671747.3647940734,4689524.37529091,42,T,5
1701762910.8846345,445,59118,80000,GNSS1_Frame,42.3390288,71.08486218166667,4.192,671747.365851658,4689524.376983477,42,T,5
1701762911.5865438,446,59119,80000,GNSS1_Frame,42.33902883,71.084862185,4.181,671747.3660445848,4689524.38032148,42,T,5
1701762912.2907505,447,59120,80000,GNSS1_Frame,42.33902882333334,71.08486218,4.179,671747.3656508282,4689524.3795711,42,T,5
1701762913.0035217,448,59121,80000,GNSS1_Frame,42.339028791666664,71.084862175,4.17,671747.3653251346,4689524.376044659,42,T,5
1701762913.7005587,449,59122,80000,GNSS1_Frame,42.33902878666667,71.08486215333333,4.166,671747.3635538097,4689524.375445683,42,T,5
1701762914.4062338,450,59123,80000,GNSS1_Frame,42.33902880833333,71.08486215833334,4.157,671747.3639067293,4689524.377861699,42,T,5
1701762915.1132286,451,59124,80000,GNSS1_Frame,42.33902881,71.08486214,4.15,671747.3623918586,4689524.378009738,42,T,5
1701762915.8173609,452,59125,80000,GNSS1_Frame,42.33902881666667,71.08486210833334,4.138,671747.3597649552,4689524.378686058,42,T,5
1701762916.522104,453,59126,80000,GNSS1_Frame,42.33902878833333,71.08486207,4.134,671747.3566841292,4689524.375462428,42,T,5
1701762917.2321117,454,59127,80000,GNSS1_Frame,42.33902875333333,71.08486205666667,4.131,671747.3556809967,4689524.371549014,42,T,5
1701762917.9351397,455,59128,80000,GNSS1_Frame,42.33902875,71.08486201833334,4.126,671747.3525321076,4689524.371101443,42,T,5
1701762918.6364355,456,59129,80000,GNSS1_Frame,42.33902876166667,71.084861985,4.121,671747.3497542868,4689524.372329609,42,T,5
1701762919.3458035,457,59130,80000,GNSS1_Frame,42.339028756666664,71.084861965,4.12,671747.3481202665,4689524.371733999,42,T,5
1701762920.0447907,458,59131,80000,GNSS1_Frame,42.339028766666665,71.08486194666666,4.121,671747.3465827074,4689524.372807392,42,T,5
1701762920.7544484,459,59132,80000,GNSS1_Frame,42.33902875333333,71.084861905,4.124,671747.3431864374,4689524.371242666,42,T,5
1701762921.4601688,460,59133,80000,GNSS1_Frame,42.339028758333335,71.08486185666666,4.121,671747.3391910411,4689524.371700249,42,T,5
1701762922.1645384,461,59134,80000,GNSS1_Frame,42.33902874166667,71.08486180333334,4.117,671747.3348427273,4689524.369741815,42,T,5
1701762922.8626852,462,59135,80000,GNSS1_Frame,42.33902873,71.08486177166667,4.115,671747.3322657364,4689524.368382359,42,T,5
1701762923.56794,463,59136,80000,GNSS1_Frame,42.33902871666667,71.08486173,4.113,671747.3288694664,4689524.36681763,42,T,5
1701762924.2794704,464,59137,80000,GNSS1_Frame,42.339028725,71.08486166833333,4.104,671747.3237665733,4689524.367618425,42,T,5
1701762924.979113,465,59138,80000,GNSS1_Frame,42.33902871833333,71.08486162,4.095,671747.3198029408,4689524.366780514,42,T,5
1701762925.6812272,466,59139,80000,GNSS1_Frame,42.33902871,71.08486155333334,4.085,671747.3143335149,4689524.365720503,42,T,5
1701762926.394768,467,59140,80000,GNSS1_Frame,42.339028715,71.084861505,4.078,671747.3103381187,4689524.366178087,42,T,5
1701762927.0996659,468,59141,80000,GNSS1_Frame,42.33902871,71.08486147833334,4.074,671747.3081548865,4689524.365569011,42,T,5
1701762927.8089612,469,59142,80000,GNSS1_Frame,42.33902872,71.084861425,4.067,671747.3037339678,4689524.366571708,42,T,5
1701762928.5133755,470,59143,80000,GNSS1_Frame,42.33902872,71.08486140333333,4.063,671747.3019490319,4689524.366527944,42,T,5
1701762929.2228441,471,59144,80000,GNSS1_Frame,42.33902872666667,71.08486138833334,4.059,671747.3006951552,4689524.367237928,42,T,5
1701762929.9272587,472,59145,80000,GNSS1_Frame,42.33902870166666,71.08486135333334,4.06,671747.2978798607,4689524.364391171,42,T,5
1701762930.634455,473,59146,80000,GNSS1_Frame,42.339028705,71.08486132166666,4.06,671747.2952620308,4689524.36469735,42,T,5
1701762931.340426,474,59147,80000,GNSS1_Frame,42.339028665,71.08486128333334,4.061,671747.2922129704,4689524.360178228,42,T,5
1701762932.0510476,475,59148,80000,GNSS1_Frame,42.33902864666667,71.08486124666666,4.053,671747.2892422187,4689524.358068387,42,T,5
1701762932.756968,476,59149,80000,GNSS1_Frame,42.33902863666667,71.08486119833333,4.044,671747.2852876615,4689524.356860336,42,T,5
1701762933.4641988,477,59150,80000,GNSS1_Frame,42.339028686666666,71.084861125,4.03,671747.2791102075,4689524.36226433,42,T,5
1701762934.1719434,478,59151,80000,GNSS1_Frame,42.339028666666664,71.08486109166667,4.025,671747.2764186023,4689524.359976153,42,T,5
1701762934.8800137,479,59152,80000,GNSS1_Frame,42.33902863833333,71.084861075,4.025,671747.2751227142,4689524.356796287,42,T,5
1701762935.5862997,480,59153,80000,GNSS1_Frame,42.339028606666666,71.08486105,4.024,671747.2731493871,4689524.353229448,42,T,5
1701762936.2936594,481,59154,80000,GNSS1_Frame,42.33902861333333,71.08486101,4.015,671747.2698359676,4689524.353888935,42,T,5
1701762937.000546,482,59155,80000,GNSS1_Frame,42.339028635,71.08486098666667,4.009,671747.2678547396,4689524.356247723,42,T,5
1701762937.7071335,483,59156,80000,GNSS1_Frame,42.339028635,71.08486094666667,4.006,671747.2645594685,4689524.356166928,42,T,5
1701762938.412411,484,59157,80000,GNSS1_Frame,42.339030386666664,71.08486344166667,1.865,671747.4653327505,4689524.55571578,42,T,1
1701762939.1224601,485,59158,80000,GNSS1_Frame,42.33903042666667,71.08486345666667,1.858,671747.4664595723,4689524.560187772,42,T,1
1701762939.8279278,486,59159,80000,GNSS1_Frame,42.33903043666667,71.08486346833334,1.837,671747.4673934676,4689524.561321761,42,T,1
1701762940.5355294,487,59160,80000,GNSS1_Frame,42.33903045833333,71.08486345166666,1.827,671747.4659614472,4689524.563694017,42,T,1
1701762941.2429965,488,59161,80000,GNSS1_Frame,42.33903048333333,71.08486347,1.822,671747.467403715,4689524.566507106,42,T,1
1701762941.9503295,489,59162,80000,GNSS1_Frame,42.33903050666667,71.08486348333334,1.818,671747.4684386092,4689524.569125026,42,T,1
1701762942.658489,490,59163,80000,GNSS1_Frame,42.339030523333335,71.0848635,1.815,671747.4697662608,4689524.571009398,42,T,1
1701762943.365135,491,59164,80000,GNSS1_Frame,42.339030568333335,71.08486349666667,1.809,671747.4693691388,4689524.575999572,42,T,1
1701762944.074605,492,59165,80000,GNSS1_Frame,42.339030601666664,71.08486348833334,1.802,671747.468591871,4689524.579684152,42,T,1
1701762944.7787695,493,59166,80000,GNSS1_Frame,42.33903062666667,71.08486347166667,1.792,671747.4671507773,4689524.582426547,42,T,1
1701762945.4807522,494,59167,80000,GNSS1_Frame,42.339030668333336,71.08486344666666,1.784,671747.4649777906,4689524.587002817,42,T,1
1701762946.188549,495,59168,80000,GNSS1_Frame,42.33903071666667,71.08486344333333,1.774,671747.4645715931,4689524.592363133,42,T,1
1701762946.8914955,496,59169,80000,GNSS1_Frame,42.339030763333334,71.084863405,1.771,671747.4612865739,4689524.5974676795,42,T,1
1701762947.600156,497,59170,80000,GNSS1_Frame,42.339030835,71.08486339833334,1.773,671747.460542242,4689524.605412251,42,T,1
1701762948.306727,498,59171,80000,GNSS1_Frame,42.339030915,71.08486338333333,1.772,671747.4590887055,4689524.614265345,42,T,1
1701762949.011277,499,59172,80000,GNSS1_Frame,42.339030955,71.08486335833334,1.774,671747.4569202607,4689524.618656542,42,T,1
1701762949.7186694,500,59173,80000,GNSS1_Frame,42.339030965,71.084863325,1.779,671747.4541469775,4689524.619699636,42,T,1
1701762950.4235976,501,59174,80000,GNSS1_Frame,42.339031008333336,71.08486328833334,1.768,671747.4510083362,4689524.624437411,42,T,1
1701762951.1294208,502,59175,80000,GNSS1_Frame,42.33903104,71.084863245,1.767,671747.4473522445,4689524.627866225,42,T,1
1701762951.8387156,503,59176,80000,GNSS1_Frame,42.339031041666665,71.0848632,1.757,671747.4436405308,4689524.6279604,42,T,1
1701762952.544346,504,59177,80000,GNSS1_Frame,42.339031055,71.08486317333333,1.751,671747.4414073842,4689524.629387102,42,T,1
1701762953.2478344,505,59178,80000,GNSS1_Frame,42.339031078333335,71.08486314833333,1.749,671747.439284312,4689524.631927594,42,T,1
1701762953.9540539,506,59179,80000,GNSS1_Frame,42.339031115,71.08486309833333,1.745,671747.4350653976,4689524.635898153,42,T,1
1701762954.6626449,507,59180,80000,GNSS1_Frame,42.33903114666667,71.08486305833334,1.749,671747.4316839151,4689524.639333701,42,T,1
1701762955.3636339,508,59181,80000,GNSS1_Frame,42.33903117333333,71.08486298833333,1.75,671747.4258445913,4689524.642153439,42,T,1
1701762956.0681465,509,59182,80000,GNSS1_Frame,42.339031215,71.08486292,1.746,671747.4201017332,4689524.646642179,42,T,1
1701762956.7741852,510,59183,80000,GNSS1_Frame,42.33903122833333,71.0848629,1.748,671747.4184177963,4689524.648082347,42,T,1
1701762957.4826362,511,59184,80000,GNSS1_Frame,42.33903125333333,71.084862895,1.746,671747.4179378238,4689524.650848307,42,T,1
1701762958.184174,512,59185,80000,GNSS1_Frame,42.33903129,71.08486289166666,1.745,671747.4175633901,4689524.654913128,42,T,1
1701762958.895105,513,59186,80000,GNSS1_Frame,42.33903132,71.08486286666667,1.737,671747.4154221672,4689524.658193902,42,T,1
1701762959.597688,514,59187,80000,GNSS1_Frame,42.33903134333333,71.08486282833333,1.731,671747.4122006755,4689524.660707462,42,T,1
1701762960.2968948,515,59188,80000,GNSS1_Frame,42.33903136166666,71.08486280833333,1.722,671747.4105031256,4689524.662702842,42,T,1
1701762961.008426,516,59189,80000,GNSS1_Frame,42.33903137,71.08486279333333,1.721,671747.4092447133,4689524.663597897,42,T,1
1701762961.713633,517,59190,80000,GNSS1_Frame,42.33903137666667,71.08486279666667,1.72,671747.4095011675,4689524.664344911,42,T,1
1701762962.4158652,518,59191,80000,GNSS1_Frame,42.33903143333333,71.08486277666667,1.731,671747.4076992532,4689524.670596916,42,T,1
1701762963.1290166,519,59192,80000,GNSS1_Frame,42.339031495,71.08486276333333,1.738,671747.4064329355,4689524.677417597,42,T,1
1701762963.835857,520,59193,80000,GNSS1_Frame,42.33903150333333,71.08486279166667,1.752,671747.4087443969,4689524.67840018,42,T,1
1701762964.5431356,521,59194,80000,GNSS1_Frame,42.339031541666664,71.08486285166667,1.765,671747.4135829324,4689524.682777999,42,T,1
1701762965.241138,522,59195,80000,GNSS1_Frame,42.339031518333336,71.08486290666667,1.771,671747.4181774547,4689524.680298103,42,T,1
1701762965.9492807,523,59196,80000,GNSS1_Frame,42.33903152166667,71.08486299333333,1.779,671747.4253081267,4689524.680843302,42,T,1
1701762966.6529572,524,59197,80000,GNSS1_Frame,42.33903155,71.08486307,1.781,671747.4315469168,4689524.68414436,42,T,1
1701762967.3585062,525,59198,80000,GNSS1_Frame,42.339031575,71.08486313666667,1.784,671747.4369709657,4689524.687055079,42,T,1
1701762968.0682232,526,59199,80000,GNSS1_Frame,42.33903160166667,71.08486319166667,1.787,671747.4414293577,4689524.690127303,42,T,1
1701762968.7701519,527,59200,80000,GNSS1_Frame,42.33903161,71.08486323333334,1.79,671747.4448392405,4689524.691136818,42,T,1
1701762969.4745207,528,59201,80000,GNSS1_Frame,42.33903161166667,71.08486327333334,1.792,671747.4481299715,4689524.691402685,42,T,1
1701762970.180213,529,59202,80000,GNSS1_Frame,42.339031606666666,71.084863345,1.799,671747.4540476059,4689524.6909922315,42,T,1
1701762970.8818667,530,59203,80000,GNSS1_Frame,42.33903162166666,71.08486343166666,1.796,671747.4611465142,4689524.692832922,42,T,1
1701762971.5897577,531,59204,80000,GNSS1_Frame,42.339031605,71.084863485,1.799,671747.4655855832,4689524.691089944,42,T,1
1701762972.3021905,532,59205,80000,GNSS1_Frame,42.33903157666666,71.08486354166666,1.804,671747.470331021,4689524.688058203,42,T,1
1701762973.0048687,533,59206,80000,GNSS1_Frame,42.339031585,71.08486360833334,1.807,671747.4758004465,4689524.689118215,42,T,1
1701762973.7110307,534,59207,80000,GNSS1_Frame,42.33903154666667,71.08486367166667,1.805,671747.4811223221,4689524.6849895185,42,T,1
1701762974.4190493,535,59208,80000,GNSS1_Frame,42.33903155,71.084863725,1.807,671747.4855069371,4689524.685467386,42,T,1
1701762975.127008,536,59209,80000,GNSS1_Frame,42.339031518333336,71.08486375833333,1.802,671747.4883392099,4689524.682018371,42,T,1
1701762975.8362722,537,59210,80000,GNSS1_Frame,42.33903150333333,71.08486373833334,1.802,671747.4867324157,4689524.680312338,42,T,1
1701762976.540102,538,59211,80000,GNSS1_Frame,42.339031489999996,71.084863745,1.801,671747.4873179289,4689524.678845239,42,T,1
1701762977.247565,539,59212,80000,GNSS1_Frame,42.339031455,71.08486375333334,1.803,671747.4880997343,4689524.674975589,42,T,1
1701762977.9533534,540,59213,80000,GNSS1_Frame,42.339031418333334,71.084863775,1.808,671747.489984499,4689524.6709477985,42,T,1
1701762978.6627705,541,59214,80000,GNSS1_Frame,42.33903142166667,71.084863775,1.813,671747.4899754237,4689524.6713179415,42,T,1
1701762979.3674812,542,59215,80000,GNSS1_Frame,42.33903142333333,71.08486377,1.817,671747.4895589787,4689524.671492912,42,T,1
1701762980.075567,543,59216,80000,GNSS1_Frame,42.339031408333334,71.084863765,1.821,671747.4891879084,4689524.669817177,42,T,1
1701762980.782839,544,59217,80000,GNSS1_Frame,42.33903135166667,71.08486371,1.826,671747.4848111946,4689524.663413681,42,T,1
1701762981.492129,545,59218,80000,GNSS1_Frame,42.33903127833333,71.084863675,1.824,671747.4821274929,4689524.655199877,42,T,1
1701762982.1998222,546,59219,80000,GNSS1_Frame,42.33903121833333,71.08486367333333,1.82,671747.4821535468,4689524.648533967,42,T,1
1701762982.9061482,547,59220,80000,GNSS1_Frame,42.33903117,71.084863665,1.82,671747.4815986252,4689524.6431500865,42,T,1
1701762983.614527,548,59221,80000,GNSS1_Frame,42.33903113,71.084863645,1.834,671747.480059894,4689524.638667993,42,T,1
1701762984.3159041,549,59222,80000,GNSS1_Frame,42.33903107333333,71.08486362333333,1.844,671747.4784292391,4689524.632331827,42,T,1
1701762985.0211625,550,59223,80000,GNSS1_Frame,42.339030995,71.084863605,1.851,671747.477132179,4689524.623596477,42,T,1
1701762985.727997,551,59224,80000,GNSS1_Frame,42.339030963333336,71.0848636,1.859,671747.4768064875,4689524.620070035,42,T,1
1701762986.438545,552,59225,80000,GNSS1_Frame,42.339030943333334,71.084863635,1.862,671747.4797442991,4689524.617919884,42,T,1
1701762987.142823,553,59226,80000,GNSS1_Frame,42.339030926666666,71.08486369166667,1.87,671747.4844579711,4689524.616183638,42,T,1
1701762987.8512948,554,59227,80000,GNSS1_Frame,42.339030926666666,71.08486378333333,1.861,671747.49200963,4689524.616368794,42,T,1
1701762988.5589283,555,59228,80000,GNSS1_Frame,42.339030896666664,71.084863905,1.852,671747.5021144149,4689524.613283274,42,T,1
1701762989.263452,556,59229,80000,GNSS1_Frame,42.339030908333335,71.08486401,1.842,671747.5107327315,4689524.614790857,42,T,1
1701762989.9746132,557,59230,80000,GNSS1_Frame,42.33903093333333,71.08486411166666,1.834,671747.5190401376,4689524.617772271,42,T,1
1701762990.6838608,558,59231,80000,GNSS1_Frame,42.339030935,71.0848642,1.828,671747.5263126539,4689524.618135765,42,T,1
1701762991.3878834,559,59232,80000,GNSS1_Frame,42.33903093,71.08486428666667,1.828,671747.5334660143,4689524.617755611,42,T,1
1701762992.094993,560,59233,80000,GNSS1_Frame,42.339030935,71.08486437666667,1.832,671747.5408667556,4689524.618492613,42,T,1
1701762992.8031824,561,59234,80000,GNSS1_Frame,42.33903098,71.08486444,1.837,671747.5459617474,4689524.623617445,42,T,1
1701762993.5068822,562,59235,80000,GNSS1_Frame,42.339031005,71.08486448333333,1.851,671747.5494635559,4689524.626481033,42,T,1
1701762994.2148433,563,59236,80000,GNSS1_Frame,42.339031006666666,71.084864535,1.866,671747.5537154062,4689524.626770465,42,T,1
1701762994.915529,564,59237,80000,GNSS1_Frame,42.33903099,71.08486453166667,1.872,671747.5534861782,4689524.624913026,42,T,1
1701762995.6265013,565,59238,80000,GNSS1_Frame,42.33902618166667,71.08486248,4.322,671747.3975575541,4689524.086840105,42,T,5
1701762996.3312352,566,59239,80000,GNSS1_Frame,42.339024081666665,71.08486278,4.63,671747.4279895378,4689523.854257068,42,T,5
1701762997.0319064,567,59240,80000,GNSS1_Frame,42.33902428166667,71.084862115,4.599,671747.3726611737,4689523.87512232,42,T,5
1701762997.7384472,568,59241,80000,GNSS1_Frame,42.339023618333336,71.08486207833333,4.688,671747.3714465029,4689523.801390145,42,T,5
1701762998.4423037,569,59242,80000,GNSS1_Frame,42.339023266666665,71.084862185,4.741,671747.3811913356,4689523.762555694,42,T,5
1701762999.141823,570,59243,80000,GNSS1_Frame,42.339022936666666,71.084862235,4.777,671747.3862088807,4689523.726012701,42,T,5
1701762999.8595703,571,59244,80000,GNSS1_Frame,42.33902262833333,71.08486234333333,4.81,671747.3959730365,4689523.6919934545,42,T,5
1701763000.5627658,572,59245,80000,GNSS1_Frame,42.33902247666666,71.084862475,4.811,671747.4072328918,4689523.675417978,42,T,5
1701763001.2668138,573,59246,80000,GNSS1_Frame,42.339022326666665,71.08486246,4.772,671747.406405556,4689523.658731323,42,T,5
1701763001.969266,574,59247,80000,GNSS1_Frame,42.33902233,71.08486235833334,4.738,671747.3980210082,4689523.658896109,42,T,5
1701763002.683143,575,59248,80000,GNSS1_Frame,42.339022553333336,71.08486231,4.732,671747.3934311764,4689523.6835979475,42,T,5
1701763003.3830302,576,59249,80000,GNSS1_Frame,42.33902274166667,71.08486234333333,4.789,671747.3956644748,4689523.704578259,42,T,5
1701763004.086119,577,59250,80000,GNSS1_Frame,42.33902299166667,71.08486243333333,4.836,671747.4023981792,4689523.732520643,42,T,5
1701763004.7954512,578,59251,80000,GNSS1_Frame,42.33902304833333,71.08486256666667,4.863,671747.4132281276,4689523.7390823625,42,T,5
1701763005.4939072,579,59252,80000,GNSS1_Frame,42.339023311666665,71.084862635,4.881,671747.4181405924,4689523.768461549,42,T,5
1701763006.2048666,580,59253,80000,GNSS1_Frame,42.33902368333333,71.08486266166666,4.892,671747.4193255388,4689523.809786164,42,T,5
1701763006.9120407,581,59254,80000,GNSS1_Frame,42.33902397833333,71.084862605,4.943,671747.4138540728,4689523.842429208,42,T,5
1701763007.6292264,582,59255,80000,GNSS1_Frame,42.33902418,71.08486247833333,4.987,671747.4028699971,4689523.864566903,42,T,5
1701763008.3274233,583,59256,80000,GNSS1_Frame,42.339024208333335,71.08486222666667,4.917,671747.3820601244,4689523.867204766,42,T,5
1701763009.0320191,584,59257,80000,GNSS1_Frame,42.339024806666664,71.08486209333333,4.985,671747.369446869,4689523.933375807,42,T,5
1701763009.7393847,585,59258,80000,GNSS1_Frame,42.33902491166667,71.08486195,4.997,671747.3573529497,4689523.944745741,42,T,5
1701763010.4519408,586,59259,80000,GNSS1_Frame,42.339024755,71.08486193833333,4.979,671747.3568183696,4689523.927325534,42,T,5
1701763011.1586776,587,59260,80000,GNSS1_Frame,42.33902492666667,71.08486164833333,4.918,671747.3324602909,4689523.945802045,42,T,5
1701763011.8670764,588,59261,80000,GNSS1_Frame,42.339024986666665,71.084861185,4.851,671747.2941267381,4689523.951528708,42,T,5
1701763012.574775,589,59262,80000,GNSS1_Frame,42.33902514333333,71.08486070333333,4.792,671747.2540196694,4689523.967952437,42,T,5
1701763013.2797055,590,59263,80000,GNSS1_Frame,42.339025201666665,71.08486033333334,4.728,671747.2233796143,4689523.973682553,42,T,5
1701763013.9869695,591,59264,80000,GNSS1_Frame,42.33902526666667,71.084860145,4.696,671747.2076874231,4689523.980519897,42,T,5
1701763014.6945438,592,59265,80000,GNSS1_Frame,42.339025248333336,71.08486016333333,4.677,671747.2092476685,4689523.9785211515,42,T,5
1701763015.3994834,593,59266,80000,GNSS1_Frame,42.33902530666667,71.08486027833334,4.675,671747.218562748,4689523.98523091,42,T,5
1701763016.1112998,594,59267,80000,GNSS1_Frame,42.339025375,71.08486032,4.658,671747.2218092752,4689523.992902967,42,T,5
1701763016.817152,595,59268,80000,GNSS1_Frame,42.339025445,71.08486039833333,4.616,671747.2280719267,4689524.000834159,42,T,5
1701763017.520874,596,59269,80000,GNSS1_Frame,42.33902539166667,71.08486049166666,4.583,671747.235906092,4689523.995100421,42,T,5
1701763018.2315946,597,59270,80000,GNSS1_Frame,42.339025246666665,71.08486062833333,4.535,671747.247559705,4689523.979275326,42,T,5
1701763018.9401507,598,59271,80000,GNSS1_Frame,42.339025168333336,71.08486070666666,4.479,671747.2542262092,4689523.9707352305,42,T,5
1701763019.6474612,599,59272,80000,GNSS1_Frame,42.33902514,71.08486067333334,4.426,671747.2515572945,4689523.967521699,42,T,5
1701763020.3687189,600,58622,80000,GNSS1_Frame,42.339028436666666,71.084862555,4.112,671747.3975967106,4689524.337392168,42,T,5
1701763021.0754368,601,58623,80000,GNSS1_Frame,42.339028505,71.08486255833333,4.108,671747.397685271,4689524.344986797,42,T,5
1701763021.7801106,602,58624,80000,GNSS1_Frame,42.339028481666666,71.084862445,4.096,671747.3884122055,4689524.3421668885,42,T,5
1701763022.4953086,603,58625,80000,GNSS1_Frame,42.33902851333333,71.08486247333333,4.102,671747.3906601374,4689524.345740461,42,T,5
1701763023.1972172,604,58626,80000,GNSS1_Frame,42.33902852,71.08486242833334,4.104,671747.3869348104,4689524.346389849,42,T,5
