<?xml version="1.0" encoding="UTF-8"?>
<svg width="63px" height="23px" viewBox="0 0 63 23" version="1.1" xmlns="http://www.w3.org/2000/svg" xmlns:xlink="http://www.w3.org/1999/xlink">
    <!-- Generator: Sketch 48.2 (47327) - http://www.bohemiancoding.com/sketch -->
    <title>Icon Copy</title>
    <desc>Created with Sketch.</desc>
    <defs>
        <polygon id="path-1" points="63 0 0 1.58387796e-14 0 14 63 14 63 2.11183728e-14"></polygon>
    </defs>
    <g id="Playground" stroke="none" stroke-width="1" fill="none" fill-rule="evenodd">
        <g id="Icon-Copy">
            <g id="Academic/Graduate">
                <path d="M31.4993016,23 C30.6897621,23 29.8802227,22.9104914 29.0932185,22.7344088 L18.0023544,20.2296342 C16.0764479,19.7952972 14.8214017,18.2619114 15.020753,16.5817902 L15.8372264,9.66027776 C15.8857641,9.2567552 16.303535,8.96768631 16.7871785,9.00290282 C17.263888,9.0425214 17.6105859,9.40202332 17.5620482,9.80554588 L16.7455748,16.7285257 C16.6311645,17.6867084 17.348829,18.5641865 18.4495947,18.8121695 L29.5404588,21.3169441 C30.8215073,21.6045456 32.1770959,21.6045456 33.4598779,21.3154767 L44.550742,18.8121695 C45.6515077,18.5641865 46.3674387,17.6867084 46.2547619,16.7285257 L45.4625573,10.0227144 C45.4140196,9.61919183 45.762451,9.25968991 46.237427,9.21860397 C46.7314715,9.19072423 47.1388414,9.47392371 47.1873791,9.87597891 L47.9795837,16.5817902 C48.1772015,18.2619114 46.9221553,19.7952972 44.9979822,20.2296342 L33.9053846,22.7329414 C33.1183805,22.9104914 32.3088411,23 31.4993016,23" id="Fill-1" fill-opacity="0.65" fill="#FFFFFF"></path>
                <mask id="mask-2" fill="white">
                    <use xlink:href="#path-1"></use>
                </mask>
                <g id="Clip-4"></g>
                <path d="M3.61373367,6.99935021 L30.7374849,12.4396769 C31.2354539,12.5392403 31.762817,12.5392403 32.2625151,12.4396769 L59.3862663,6.99935021 L32.2625151,1.56050957 C31.7645461,1.45946007 31.2354539,1.45946007 30.7357558,1.56050957 L3.61373367,6.99935021 Z M32.4596278,13.1618836 L32.4769184,13.1618836 L32.4596278,13.1618836 Z M31.5,14 C31.1109617,14 30.7219234,13.9628494 30.3432594,13.8855763 L0.907756065,7.98309679 C0.373476781,7.87610321 0.00172905917,7.47190521 0,7.00083623 C0,6.52976725 0.371747722,6.12408323 0.907756065,6.01560362 L30.3432594,0.113124113 C31.1005873,-0.0369641118 31.8994127,-0.0384501338 32.6550115,0.113124113 L62.0922439,6.01560362 C62.6265232,6.12408323 63,6.52976725 63,7.00083623 C62.9982709,7.47190521 62.6247942,7.87610321 62.0905149,7.98309679 L32.6567406,13.8855763 L32.6550115,13.8855763 C32.2780766,13.9628494 31.8890383,14 31.5,14 Z" id="Fill-3" fill-opacity="0.65" fill="#FFFFFF"></path>
                <path d="M58,17 C57.448,17 57,16.6865184 57,16.3002643 L57,8.69973566 C57,8.3120821 57.448,8 58,8 C58.552,8 59,8.3120821 59,8.69973566 L59,16.3002643 C59,16.6865184 58.552,17 58,17" id="Fill-6" fill-opacity="0.65" fill="#FFFFFF"></path>
                <path d="M57.0007468,20 C55.3442868,20 54,18.8807271 54,17.5 C54,16.1192729 55.3442868,15 57.0007468,15 C58.6572069,15 60,16.1192729 60,17.5 C60,18.8807271 58.6572069,20 57.0007468,20 Z" id="Fill-8"></path>
                <path d="M57.5,16.5945784 C56.007177,16.5945784 54.7942584,17.674108 54.7942584,18.9992027 C54.7942584,20.325892 56.007177,21.4054216 57.5,21.4054216 C58.992823,21.4054216 60.2057416,20.325892 60.2057416,18.9992027 C60.2057416,17.674108 58.992823,16.5945784 57.5,16.5945784 M57.5,23 C55.0185407,23 53,21.2060993 53,18.9992027 C53,16.7939007 55.0185407,15 57.5,15 C59.9814593,15 62,16.7939007 62,18.9992027 C62,21.2060993 59.9814593,23 57.5,23" id="Fill-10" fill-opacity="0.65" fill="#FFFFFF"></path>
            </g>
        </g>
    </g>
</svg>