<?xml version="1.0" encoding="UTF-8"?>
<svg width="158px" height="58px" viewBox="0 0 158 58" version="1.1" xmlns="http://www.w3.org/2000/svg" xmlns:xlink="http://www.w3.org/1999/xlink">
    <!-- Generator: Sketch 47.1 (45422) - http://www.bohemiancoding.com/sketch -->
    <title>Icon</title>
    <desc>Created with Sketch.</desc>
    <defs>
        <polygon id="path-1" points="158 0 0 3.99412702e-14 0 35.3043478 158 35.3043478 158 5.32550269e-14"></polygon>
    </defs>
    <g id="Playground" stroke="none" stroke-width="1" fill="none" fill-rule="evenodd">
        <g id="full_screen-with-leader---History" transform="translate(-78.000000, -120.000000)">
            <g id="Screen" transform="translate(42.000000, 47.000000)">
                <g id="Icon" transform="translate(0.000000, 70.000000)">
                    <g id="Academic/Graduate" transform="translate(36.000000, 0.000000)">
                        <path d="M78.9982484,58 C76.9679749,58 74.9377013,57.7742826 72.9639449,57.3302482 L45.1487619,51.0138601 C40.3187106,49.9185755 37.1711344,46.0517767 37.6710948,41.8149493 L39.7187583,24.3607004 C39.8404877,23.3431218 40.8882306,22.6141655 42.1011778,22.7029723 C43.2967351,22.8028801 44.1662313,23.7094501 44.0445018,24.7270288 L41.9968383,42.1849779 C41.7099045,44.6012646 43.5097616,46.8140356 46.270412,47.4393839 L74.085595,53.755772 C77.2983834,54.4810281 80.6981135,54.4810281 83.9152494,53.7520717 L111.730432,47.4393839 C114.491083,46.8140356 116.286592,44.6012646 116.004006,42.1849779 L114.017207,25.2746711 C113.895478,24.2570924 114.769322,23.3505224 115.960531,23.2469144 C117.199563,23.1766089 118.221221,23.8907641 118.342951,24.9046425 L120.32975,41.8149493 C120.825362,46.0517767 117.677786,49.9185755 112.852082,51.0138601 L85.032552,57.326548 C83.0587956,57.7742826 81.028522,58 78.9982484,58" id="Fill-1" fill-opacity="0.65" fill="#FFFFFF"></path>
                        <mask id="mask-2" fill="white">
                            <use xlink:href="#path-1"></use>
                        </mask>
                        <g id="Clip-4"></g>
                        <path d="M9.0630146,17.6505353 L77.0876606,31.3696199 C78.3365353,31.620693 79.6591283,31.620693 80.9123394,31.3696199 L148.936985,17.6505353 L80.9123394,3.93519805 C79.6634647,3.68037758 78.3365353,3.68037758 77.0833242,3.93519805 L9.0630146,17.6505353 Z M81.4066857,33.1908368 L81.4500494,33.1908368 L81.4066857,33.1908368 Z M79,35.3043478 C78.0243166,35.3043478 77.0486332,35.2106638 76.0989681,35.0158011 L2.27659458,20.1312876 C0.936656054,19.8614777 0.00433637062,18.8421958 0,17.6542827 C0,16.4663696 0.932319684,15.4433403 2.27659458,15.1697831 L76.0989681,0.285269503 C77.9982984,-0.0932138471 80.0017016,-0.096961207 81.8966956,0.285269503 L155.723405,15.1697831 C157.063344,15.4433403 158,16.4663696 158,17.6542827 C157.995664,18.8421958 157.059008,19.8614777 155.719069,20.1312876 L81.9010319,35.0158011 L81.8966956,35.0158011 C80.9513668,35.2106638 79.9756834,35.3043478 79,35.3043478 L79,35.3043478 Z" id="Fill-3" fill-opacity="0.65" fill="#FFFFFF"></path>
                        <path d="M145.460317,42.8695652 C144.075937,42.8695652 142.952381,42.0790465 142.952381,41.1050144 L142.952381,21.9384638 C142.952381,20.9609027 144.075937,20.173913 145.460317,20.173913 C146.844698,20.173913 147.968254,20.9609027 147.968254,21.9384638 L147.968254,41.1050144 C147.968254,42.0790465 146.844698,42.8695652 145.460317,42.8695652" id="Fill-6" fill-opacity="0.65" fill="#FFFFFF"></path>
                        <path d="M142.954254,50.4347826 C138.799957,50.4347826 135.428571,47.6122683 135.428571,44.1304348 C135.428571,40.6486012 138.799957,37.826087 142.954254,37.826087 C147.108551,37.826087 150.47619,40.6486012 150.47619,44.1304348 C150.47619,47.6122683 147.108551,50.4347826 142.954254,50.4347826 Z" id="Fill-8"></path>
                        <path d="M144.206349,41.8471978 C140.462444,41.8471978 137.420521,44.5694898 137.420521,47.9110329 C137.420521,51.2565971 140.462444,53.9788892 144.206349,53.9788892 C147.950254,53.9788892 150.992177,51.2565971 150.992177,47.9110329 C150.992177,44.5694898 147.950254,41.8471978 144.206349,41.8471978 M144.206349,58 C137.983007,58 132.920635,53.4762503 132.920635,47.9110329 C132.920635,42.3498366 137.983007,37.826087 144.206349,37.826087 C150.429692,37.826087 155.492063,42.3498366 155.492063,47.9110329 C155.492063,53.4762503 150.429692,58 144.206349,58" id="Fill-10" fill-opacity="0.65" fill="#FFFFFF"></path>
                    </g>
                    <text id="}-copy" transform="translate(33.500000, 60.500000) rotate(-215.000000) translate(-33.500000, -60.500000) " font-family=".AppleSystemUIFont" font-size="18" font-weight="normal" fill="#C6F1ED">
                        <tspan x="0" y="67">}</tspan>
                    </text>
                </g>
            </g>
        </g>
    </g>
</svg>