<?xml version="1.0" encoding="UTF-8"?>
<svg width="47px" height="29px" viewBox="0 0 47 29" version="1.1" xmlns="http://www.w3.org/2000/svg" xmlns:xlink="http://www.w3.org/1999/xlink">
    <!-- Generator: Sketch 48.2 (47327) - http://www.bohemiancoding.com/sketch -->
    <title>Icon</title>
    <desc>Created with Sketch.</desc>
    <defs></defs>
    <g id="Trivia-Science-1---Untapped" stroke="none" stroke-width="1" fill="none" fill-rule="evenodd" transform="translate(-47.000000, -17.000000)">
        <g id="Header" transform="translate(0.000000, -1.000000)" fill="#FFFFFE">
            <g id="Content" transform="translate(47.000000, 18.000000)">
                <g id="Icon">
                    <g id="Group-3" transform="translate(0.000000, 7.000000)" opacity="0.65">
                        <g id="STARS" transform="translate(14.000000, 10.000000)">
                            <path d="M0.435971223,4 C0.195203837,4 0,3.80503597 0,3.56426859 C0,3.32326139 0.195203837,3.12829736 0.435971223,3.12829736 C1.92038369,3.12829736 3.12805755,1.9206235 3.12805755,0.435971223 C3.12805755,0.194964029 3.32326139,0 3.56402878,0 C3.80479616,0 4,0.194964029 4,0.435971223 C4,2.40119904 2.40119904,4 0.435971223,4" id="Fill-5"></path>
                            <path d="M5.56426859,4 C3.59880096,4 2,2.40119904 2,0.435971223 C2,0.194964029 2.19520384,0 2.43597122,0 C2.67673861,0 2.87194245,0.194964029 2.87194245,0.435971223 C2.87194245,1.9206235 4.07961631,3.12829736 5.56426859,3.12829736 C5.80503597,3.12829736 6,3.32326139 6,3.56426859 C6,3.80503597 5.80503597,4 5.56426859,4" id="Fill-6"></path>
                            <path d="M2.43597122,7 C2.19520384,7 2,6.80503597 2,6.56426859 C2,4.59880096 3.59880096,3 5.56426859,3 C5.80503597,3 6,3.19496403 6,3.43597122 C6,3.67673861 5.80503597,3.87170264 5.56426859,3.87170264 C4.07961631,3.87170264 2.87194245,5.0793765 2.87194245,6.56426859 C2.87194245,6.80503597 2.67673861,7 2.43597122,7" id="Fill-7"></path>
                            <path d="M3.56402878,7 C3.32326139,7 3.12805755,6.80503597 3.12805755,6.56426859 C3.12805755,5.0793765 1.92038369,3.87170264 0.435971223,3.87170264 C0.195203837,3.87170264 0,3.67673861 0,3.43597122 C0,3.19496403 0.195203837,3 0.435971223,3 C2.40119904,3 4,4.59880096 4,6.56426859 C4,6.80503597 3.80479616,7 3.56402878,7" id="Fill-8"></path>
                        </g>
                        <g id="Group-2">
                            <g id="STARS">
                                <path d="M0,11.2773065 C0,10.8780488 0.377667801,10.5543478 0.843489019,10.5543478 C3.308073,10.5543478 5.31333127,8.83589608 5.31333127,6.72295864 C5.31333127,6.32370095 5.69099907,6 6.15682029,6 C6.62264151,6 7,6.32370095 7,6.72295864 C7,9.63255567 4.23816888,12 0.843489019,12 C0.377667801,12 0,11.676299 0,11.2773065 Z" id="Fill-1"></path>
                                <path d="M12.1568575,12 C8.76201838,12 6,9.63255567 6,6.72295864 C6,6.32370095 6.37765111,6 6.84345175,6 C7.30925239,6 7.6865942,6.32370095 7.6865942,6.72295864 C7.6865942,8.83589608 9.69207317,10.5543478 12.1568575,10.5543478 C12.6226582,10.5543478 13,10.8780488 13,11.2773065 C13,11.676299 12.6226582,12 12.1568575,12" id="Fill-2"></path>
                                <path d="M6.84345175,16 C6.37765111,16 6,15.6762704 6,15.2772426 C6,12.3673884 8.76201838,10 12.1568575,10 C12.6226582,10 13,10.3237296 13,10.7230225 C13,11.1220504 12.6226582,11.4457799 12.1568575,11.4457799 C9.69207317,11.4457799 7.6865942,13.1643836 7.6865942,15.2772426 C7.6865942,15.6762704 7.30925239,16 6.84345175,16" id="Fill-3"></path>
                                <path d="M6.15682029,16 C5.69099907,16 5.31333127,15.6762704 5.31333127,15.2772426 C5.31333127,13.1643836 3.308073,11.4457799 0.843489019,11.4457799 C0.377667801,11.4457799 0,11.1220504 0,10.7230225 C0,10.3237296 0.377667801,10 0.843489019,10 C4.23816888,10 7,12.3673884 7,15.2772426 C7,15.6762704 6.62264151,16 6.15682029,16" id="Fill-4"></path>
                                <path d="M10.6539568,5 C10.2928058,5 10,4.75629496 10,4.45533573 C10,4.15407674 10.2928058,3.9103717 10.6539568,3.9103717 C12.8805755,3.9103717 14.6920863,2.40077938 14.6920863,0.544964029 C14.6920863,0.243705036 14.9848921,0 15.3460432,0 C15.7071942,0 16,0.243705036 16,0.544964029 C16,3.0014988 13.6017986,5 10.6539568,5" id="Fill-5"></path>
                                <path d="M17.3464029,5 C14.3982014,5 12,3.0014988 12,0.544964029 C12,0.243705036 12.2928058,0 12.6539568,0 C13.0151079,0 13.3079137,0.243705036 13.3079137,0.544964029 C13.3079137,2.40077938 15.1194245,3.9103717 17.3464029,3.9103717 C17.707554,3.9103717 18,4.15407674 18,4.45533573 C18,4.75629496 17.707554,5 17.3464029,5" id="Fill-6"></path>
                                <path d="M12.6539568,8 C12.2928058,8 12,7.75629496 12,7.45533573 C12,4.9985012 14.3982014,3 17.3464029,3 C17.707554,3 18,3.24370504 18,3.54496403 C18,3.84592326 17.707554,4.0896283 17.3464029,4.0896283 C15.1194245,4.0896283 13.3079137,5.59922062 13.3079137,7.45533573 C13.3079137,7.75629496 13.0151079,8 12.6539568,8" id="Fill-7"></path>
                                <path d="M15.3460432,8 C14.9848921,8 14.6920863,7.75629496 14.6920863,7.45533573 C14.6920863,5.59922062 12.8805755,4.0896283 10.6539568,4.0896283 C10.2928058,4.0896283 10,3.84592326 10,3.54496403 C10,3.24370504 10.2928058,3 10.6539568,3 C13.6017986,3 16,4.9985012 16,7.45533573 C16,7.75629496 15.7071942,8 15.3460432,8" id="Fill-8"></path>
                            </g>
                        </g>
                    </g>
                    <g id="SATURN-Copy-3" opacity="0.64" transform="translate(23.000000, 0.000000)">
                        <path d="M13.5002119,4 C12.1214716,4 11,3.1028988 11,2 C11,0.897101204 12.1214716,0 13.5002119,0 C14.8789523,0 16,0.897101204 16,2 C16,3.1028988 14.8789523,4 13.5002119,4 L13.5002119,4 Z M13.5002119,1.23275131 C12.9712639,1.23275131 12.5410698,1.57687744 12.5410698,2 C12.5410698,2.4234616 12.9712639,2.76758773 13.5002119,2.76758773 C14.02916,2.76758773 14.4593541,2.4234616 14.4593541,2 C14.4593541,1.57687744 14.02916,1.23275131 13.5002119,1.23275131 L13.5002119,1.23275131 Z" id="Fill-1"></path>
                        <path d="M11.5,26 C6.26147391,26 2,21.9628142 2,17 C2,12.0375437 6.26147391,8 11.5,8 C16.7381483,8 21,12.0375437 21,17 C21,21.9628142 16.7381483,26 11.5,26 L11.5,26 Z M11.5,9.95183742 C7.39758988,9.95183742 4.06027283,13.1138641 4.06027283,17 C4.06027283,20.8864938 7.39758988,24.0481626 11.5,24.0481626 C15.6020323,24.0481626 18.9397272,20.8864938 18.9397272,17 C18.9397272,13.1138641 15.6020323,9.95183742 11.5,9.95183742 L11.5,9.95183742 Z" id="Fill-2"></path>
                        <path d="M23.3202873,6.48598803 C21.9089268,5.31196492 18.5679781,6.33212145 14.700991,8.82314416 C15.2203904,8.93836845 15.6585604,9.1487933 16.0162821,9.42666651 C18.5570433,7.88202868 20.620582,7.2634007 21.4844252,7.98179606 C23.0336413,9.27069217 20.3686928,14.4466516 15.2586619,19.4174557 C10.148631,24.3879084 4.52818279,27.2709747 2.97896669,25.9820786 C2.19557181,25.330429 2.56266612,23.7025346 3.76353315,21.6169047 C3.28943475,21.3176026 2.93249411,20.9143176 2.69466386,20.4558795 C0.161322592,24.1809965 -0.753679504,27.3229662 0.676035679,28.5120949 C2.86961945,30.3367137 9.7167094,26.8852544 15.9698095,20.8029575 C22.2229096,14.7203093 25.5138711,8.31060684 23.3202873,6.48598803" id="Fill-3"></path>
                    </g>
                </g>
            </g>
        </g>
    </g>
</svg>