[gd_scene load_steps=5 format=2]

[ext_resource path="res://Assets/new_dynamicfont.tres" type="DynamicFont" id=1]
[ext_resource path="res://Scripts/RETRY.gd" type="Script" id=2]
[ext_resource path="res://Assets/new_dynamicfont 3.tres" type="DynamicFont" id=3]
[ext_resource path="res://Scenes/Mainmenu.gd" type="Script" id=4]

[node name="ColorRect" type="ColorRect"]
anchor_right = 1.0
anchor_bottom = 1.0
color = Color( 1, 0, 0, 1 )
__meta__ = {
"_edit_use_anchors_": false
}

[node name="Label" type="Label" parent="."]
margin_left = 141.503
margin_top = 88.0554
margin_right = 863.503
margin_bottom = 191.055
custom_fonts/font = ExtResource( 1 )
text = "GAME OVER"
__meta__ = {
"_edit_use_anchors_": false
}

[node name="Retry" type="LinkButton" parent="."]
margin_left = 316.253
margin_top = 263.664
margin_right = 702.253
margin_bottom = 366.664
custom_fonts/font = ExtResource( 1 )
text = "RETRY"
script = ExtResource( 2 )
__meta__ = {
"_edit_use_anchors_": false
}
scene_to_load = "Level 1"

[node name="Mainmenu" type="LinkButton" parent="."]
margin_left = 425.807
margin_top = 392.569
margin_right = 599.807
margin_bottom = 423.569
custom_fonts/font = ExtResource( 3 )
text = "Back to Menu"
script = ExtResource( 4 )
scene_to_load = "MainMenu"
[connection signal="pressed" from="Retry" to="Retry" method="_on_Retry_pressed"]
[connection signal="pressed" from="Mainmenu" to="Mainmenu" method="_on_Mainmenu_pressed"]
