Suite/Test/Step Name,Browser,Description,Tag,Start time,End time,Duration,Status
DDT,,,,2023-09-15 10:03:45,2023-09-15 10:04:10,25.702s,PASSED
,,,,,,,
Test Cases/Login/APK-LOG001 DDT,,Login with valid credential,,2023-09-15 10:03:45,2023-09-15 10:04:10,25.411s,PASSED
"startExistingApplication(""com.codingid.codingidhive.betastaging"")",,,,2023-09-15 10:03:45,2023-09-15 10:03:57,12.131s,PASSED
"tap(findTestObject(""Beranda/btn_loginPage""), 0)",,,,2023-09-15 10:03:57,2023-09-15 10:04:04,6.372s,PASSED
"sendKeys(findTestObject(""Login/input_email""), email, STOP_ON_FAILURE)",,,,2023-09-15 10:04:04,2023-09-15 10:04:05,1.579s,PASSED
"sendKeys(findTestObject(""Login/input_password""), password, STOP_ON_FAILURE)",,,,2023-09-15 10:04:05,2023-09-15 10:04:06,0.992s,PASSED
"tap(findTestObject(""Login/btn_login""), 0)",,,,2023-09-15 10:04:06,2023-09-15 10:04:07,1.078s,PASSED
delay(2),,,,2023-09-15 10:04:07,2023-09-15 10:04:10,2.044s,PASSED
"verifyElementText(findTestObject(""old/Login/txt_invalidCredential""), ""Invalid Credential"")",,,,2023-09-15 10:04:10,2023-09-15 10:04:10,0.224s,PASSED
closeApplication(),,,,2023-09-15 10:04:10,2023-09-15 10:04:10,0.480s,PASSED
