Suite/Test/Step Name,Browser,Description,Tag,Start time,End time,Duration,Status
DDT,,,,2023-09-19 08:29:38,2023-09-19 08:31:13,1m - 35.728s,PASSED
,,,,,,,
Test Cases/Login/APK-LOG001 DDT,,Try Login with different Error,,2023-09-19 08:29:38,2023-09-19 08:30:02,23.896s,PASSED
"dataLog = findTestData(""Data Files/dataLogin"")",,,,2023-09-19 08:29:39,2023-09-19 08:29:39,0.653s,PASSED
"startExistingApplication(""com.codingid.codingidhive.betastaging"")",,,,2023-09-19 08:29:39,2023-09-19 08:29:51,12.060s,PASSED
"tap(findTestObject(""Beranda/btn_loginPage""), 0)",,,,2023-09-19 08:29:51,2023-09-19 08:29:55,3.617s,PASSED
"sendKeys(findTestObject(""Login/input_email""), email, STOP_ON_FAILURE)",,,,2023-09-19 08:29:55,2023-09-19 08:29:56,1.342s,PASSED
"sendKeys(findTestObject(""Login/input_password""), password, STOP_ON_FAILURE)",,,,2023-09-19 08:29:56,2023-09-19 08:29:57,1.053s,PASSED
"tap(findTestObject(""Login/btn_login""), 0)",,,,2023-09-19 08:29:57,2023-09-19 08:29:58,1.103s,PASSED
delay(2),,,,2023-09-19 08:29:58,2023-09-19 08:30:00,2.059s,PASSED
"verifyElementText(findTestObject(""old/Login/txt_invalidCredential""), ""Invalid Credential"")",,,,2023-09-19 08:30:00,2023-09-19 08:30:01,0.194s,PASSED
"tap(findTestObject(""Login/btn_invalidOk""), 0)",,,,2023-09-19 08:30:01,2023-09-19 08:30:01,0.256s,PASSED
pressBack(),,,,2023-09-19 08:30:01,2023-09-19 08:30:02,0.616s,PASSED
closeApplication(),,,,2023-09-19 08:30:02,2023-09-19 08:30:02,0.410s,PASSED
,,,,,,,
Test Cases/Login/APK-LOG001 DDT,,Try Login with different Error,,2023-09-19 08:30:02,2023-09-19 08:30:19,17.506s,PASSED
"dataLog = findTestData(""Data Files/dataLogin"")",,,,2023-09-19 08:30:02,2023-09-19 08:30:02,0.049s,PASSED
"startExistingApplication(""com.codingid.codingidhive.betastaging"")",,,,2023-09-19 08:30:02,2023-09-19 08:30:12,9.872s,PASSED
"tap(findTestObject(""Beranda/btn_loginPage""), 0)",,,,2023-09-19 08:30:12,2023-09-19 08:30:13,0.878s,PASSED
"sendKeys(findTestObject(""Login/input_email""), email, STOP_ON_FAILURE)",,,,2023-09-19 08:30:13,2023-09-19 08:30:14,1.305s,PASSED
"sendKeys(findTestObject(""Login/input_password""), password, STOP_ON_FAILURE)",,,,2023-09-19 08:30:14,2023-09-19 08:30:15,1.082s,PASSED
"tap(findTestObject(""Login/btn_login""), 0)",,,,2023-09-19 08:30:15,2023-09-19 08:30:16,0.868s,PASSED
delay(2),,,,2023-09-19 08:30:16,2023-09-19 08:30:18,2.011s,PASSED
"verifyElementText(findTestObject(""old/Login/txt_invalidCredential""), ""Invalid Credential"")",,,,2023-09-19 08:30:18,2023-09-19 08:30:18,0.178s,PASSED
"tap(findTestObject(""Login/btn_invalidOk""), 0)",,,,2023-09-19 08:30:18,2023-09-19 08:30:18,0.261s,PASSED
pressBack(),,,,2023-09-19 08:30:18,2023-09-19 08:30:19,0.608s,PASSED
closeApplication(),,,,2023-09-19 08:30:19,2023-09-19 08:30:19,0.362s,PASSED
,,,,,,,
Test Cases/Login/APK-LOG001 DDT,,Try Login with different Error,,2023-09-19 08:30:20,2023-09-19 08:30:37,17.817s,PASSED
"dataLog = findTestData(""Data Files/dataLogin"")",,,,2023-09-19 08:30:20,2023-09-19 08:30:20,0.042s,PASSED
"startExistingApplication(""com.codingid.codingidhive.betastaging"")",,,,2023-09-19 08:30:20,2023-09-19 08:30:29,9.827s,PASSED
"tap(findTestObject(""Beranda/btn_loginPage""), 0)",,,,2023-09-19 08:30:29,2023-09-19 08:30:30,0.880s,PASSED
"sendKeys(findTestObject(""Login/input_email""), email, STOP_ON_FAILURE)",,,,2023-09-19 08:30:30,2023-09-19 08:30:32,1.430s,PASSED
"sendKeys(findTestObject(""Login/input_password""), password, STOP_ON_FAILURE)",,,,2023-09-19 08:30:32,2023-09-19 08:30:33,1.140s,PASSED
"tap(findTestObject(""Login/btn_login""), 0)",,,,2023-09-19 08:30:33,2023-09-19 08:30:34,1.134s,PASSED
delay(2),,,,2023-09-19 08:30:34,2023-09-19 08:30:36,2.006s,PASSED
"verifyElementText(findTestObject(""old/Login/txt_invalidCredential""), ""Invalid Credential"")",,,,2023-09-19 08:30:36,2023-09-19 08:30:36,0.177s,PASSED
"tap(findTestObject(""Login/btn_invalidOk""), 0)",,,,2023-09-19 08:30:36,2023-09-19 08:30:36,0.232s,PASSED
pressBack(),,,,2023-09-19 08:30:36,2023-09-19 08:30:37,0.607s,PASSED
closeApplication(),,,,2023-09-19 08:30:37,2023-09-19 08:30:37,0.331s,PASSED
,,,,,,,
Test Cases/Login/APK-LOG001 DDT,,Try Login with different Error,,2023-09-19 08:30:37,2023-09-19 08:30:56,18.290s,PASSED
"dataLog = findTestData(""Data Files/dataLogin"")",,,,2023-09-19 08:30:37,2023-09-19 08:30:37,0.041s,PASSED
"startExistingApplication(""com.codingid.codingidhive.betastaging"")",,,,2023-09-19 08:30:37,2023-09-19 08:30:47,9.847s,PASSED
"tap(findTestObject(""Beranda/btn_loginPage""), 0)",,,,2023-09-19 08:30:47,2023-09-19 08:30:48,0.881s,PASSED
"sendKeys(findTestObject(""Login/input_email""), email, STOP_ON_FAILURE)",,,,2023-09-19 08:30:48,2023-09-19 08:30:50,1.417s,PASSED
"sendKeys(findTestObject(""Login/input_password""), password, STOP_ON_FAILURE)",,,,2023-09-19 08:30:50,2023-09-19 08:30:50,0.747s,PASSED
"tap(findTestObject(""Login/btn_login""), 0)",,,,2023-09-19 08:30:50,2023-09-19 08:30:52,1.195s,PASSED
delay(2),,,,2023-09-19 08:30:52,2023-09-19 08:30:54,2.015s,PASSED
"verifyElementText(findTestObject(""old/Login/txt_invalidCredential""), ""Invalid Credential"")",,,,2023-09-19 08:30:54,2023-09-19 08:30:54,0.216s,PASSED
"tap(findTestObject(""Login/btn_invalidOk""), 0)",,,,2023-09-19 08:30:54,2023-09-19 08:30:55,0.908s,PASSED
pressBack(),,,,2023-09-19 08:30:55,2023-09-19 08:30:55,0.643s,PASSED
closeApplication(),,,,2023-09-19 08:30:55,2023-09-19 08:30:56,0.347s,PASSED
,,,,,,,
Test Cases/Login/APK-LOG001 DDT,,Try Login with different Error,,2023-09-19 08:30:56,2023-09-19 08:31:13,17.663s,PASSED
"dataLog = findTestData(""Data Files/dataLogin"")",,,,2023-09-19 08:30:56,2023-09-19 08:30:56,0.042s,PASSED
"startExistingApplication(""com.codingid.codingidhive.betastaging"")",,,,2023-09-19 08:30:56,2023-09-19 08:31:06,9.841s,PASSED
"tap(findTestObject(""Beranda/btn_loginPage""), 0)",,,,2023-09-19 08:31:06,2023-09-19 08:31:06,0.882s,PASSED
"sendKeys(findTestObject(""Login/input_email""), email, STOP_ON_FAILURE)",,,,2023-09-19 08:31:06,2023-09-19 08:31:08,1.926s,PASSED
"sendKeys(findTestObject(""Login/input_password""), password, STOP_ON_FAILURE)",,,,2023-09-19 08:31:08,2023-09-19 08:31:09,0.775s,PASSED
"tap(findTestObject(""Login/btn_login""), 0)",,,,2023-09-19 08:31:09,2023-09-19 08:31:10,0.906s,PASSED
delay(2),,,,2023-09-19 08:31:10,2023-09-19 08:31:12,2.015s,PASSED
"verifyElementText(findTestObject(""old/Login/txt_invalidCredential""), ""Invalid Credential"")",,,,2023-09-19 08:31:12,2023-09-19 08:31:12,0.158s,PASSED
"tap(findTestObject(""Login/btn_invalidOk""), 0)",,,,2023-09-19 08:31:12,2023-09-19 08:31:12,0.216s,PASSED
pressBack(),,,,2023-09-19 08:31:12,2023-09-19 08:31:13,0.600s,PASSED
closeApplication(),,,,2023-09-19 08:31:13,2023-09-19 08:31:13,0.292s,PASSED
