Suite/Test/Step Name,Browser,Description,Tag,Start time,End time,Duration,Status
Homepage,Chrome 116.0.0.0,,,2023-09-08 10:41:44,2023-09-08 10:51:01,9m - 16.075s,FAILED
,,,,,,,
Test Cases/HomePage/WEB-HP001,Chrome 116.0.0.0,"Hover around an avaliable product on homepage, verify the pop up",homepage,2023-09-08 10:41:45,2023-09-08 10:41:57,12.338s,PASSED
"openBrowser("""")",Chrome 116.0.0.0,,,2023-09-08 10:41:45,2023-09-08 10:41:49,3.302s,PASSED
"navigateToUrl(""https://demo-app.online/"")",Chrome 116.0.0.0,,,2023-09-08 10:41:49,2023-09-08 10:41:54,5.653s,PASSED
"mouseOver(findTestObject(""Object Repository/Homepage/Page_Be a Profressional Talent with Coding.ID/div_BOOTCAMP                               _706530""))",Chrome 116.0.0.0,,,2023-09-08 10:41:54,2023-09-08 10:41:55,0.745s,PASSED
"click(findTestObject(""Object Repository/Homepage/Page_Be a Profressional Talent with Coding.ID/h6_Materi Belajar""))",Chrome 116.0.0.0,,,2023-09-08 10:41:55,2023-09-08 10:41:56,0.786s,PASSED
"verifyElementText(findTestObject(""Object Repository/Homepage/Page_Be a Profressional Talent with Coding.ID/h6_Materi Belajar""), ""Materi Belajar"")",Chrome 116.0.0.0,,,2023-09-08 10:41:56,2023-09-08 10:41:56,0.403s,PASSED
closeBrowser(),Chrome 116.0.0.0,,,2023-09-08 10:41:56,2023-09-08 10:41:57,0.785s,PASSED
,,,,,,,
Test Cases/HomePage/WEB-HP002,Chrome 116.0.0.0,Click on product while hover around an product avaliable on homepage,homepage,2023-09-08 10:41:57,2023-09-08 10:42:08,11.086s,PASSED
"openBrowser("""")",Chrome 116.0.0.0,,,2023-09-08 10:41:58,2023-09-08 10:41:59,1.491s,PASSED
"navigateToUrl(""https://demo-app.online/"")",Chrome 116.0.0.0,,,2023-09-08 10:41:59,2023-09-08 10:42:05,5.446s,PASSED
"click(findTestObject(""Object Repository/Homepage/Page_Be a Profressional Talent with Coding.ID (1)/h6_Advance Level""))",Chrome 116.0.0.0,,,2023-09-08 10:42:05,2023-09-08 10:42:06,1.703s,PASSED
"verifyElementText(findTestObject(""Object Repository/Homepage/Page_Quality Assurance Engineer Class - Cod_d9a6f3/button_Daftar Sekarang""), ""Daftar Sekarang"")",Chrome 116.0.0.0,,,2023-09-08 10:42:06,2023-09-08 10:42:08,1.307s,PASSED
closeBrowser(),Chrome 116.0.0.0,,,2023-09-08 10:42:08,2023-09-08 10:42:08,0.684s,PASSED
,,,,,,,
Test Cases/HomePage/WEB-HP003,Chrome 116.0.0.0,Guest enroll in bootcamp through homepage,homepagee,2023-09-08 10:42:08,2023-09-08 10:42:21,12.353s,PASSED
"openBrowser("""")",Chrome 116.0.0.0,,,2023-09-08 10:42:09,2023-09-08 10:42:10,1.472s,PASSED
"navigateToUrl(""https://demo-app.online/"")",Chrome 116.0.0.0,,,2023-09-08 10:42:10,2023-09-08 10:42:16,5.469s,PASSED
"mouseOver(findTestObject(""Object Repository/Homepage/Page_Be a Profressional Talent with Coding.ID/img_Belajar intensif bersama coach         _bc916f""))",Chrome 116.0.0.0,,,2023-09-08 10:42:16,2023-09-08 10:42:16,0.612s,PASSED
"click(findTestObject(""Object Repository/Homepage/Page_Be a Profressional Talent with Coding.ID/button_Daftar Sekarang""))",Chrome 116.0.0.0,,,2023-09-08 10:42:16,2023-09-08 10:42:18,1.467s,PASSED
"click(findTestObject(""Object Repository/Homepage/Page_Masuk untuk dapatkan akses di Coding.ID/div_Email                                  _7413aa""))",Chrome 116.0.0.0,,,2023-09-08 10:42:18,2023-09-08 10:42:18,0.612s,PASSED
"verifyElementText(findTestObject(""Object Repository/Homepage/Page_Masuk untuk dapatkan akses di Coding.ID/label_Email""), ""Email"")",Chrome 116.0.0.0,,,2023-09-08 10:42:18,2023-09-08 10:42:19,0.404s,PASSED
takeFullPageScreenshot([]),Chrome 116.0.0.0,,,2023-09-08 10:42:19,2023-09-08 10:42:20,1.191s,PASSED
closeBrowser(),Chrome 116.0.0.0,,,2023-09-08 10:42:20,2023-09-08 10:42:21,0.689s,PASSED
,,,,,,,
Test Cases/HomePage/WEB-HP004,Chrome 116.0.0.0,Enroll in bootcamp through homepage with valid account,homepage,2023-09-08 10:42:21,2023-09-08 10:42:39,18.543s,PASSED
"callTestCase(findTestCase(""Precondition/precondition""), [:], STOP_ON_FAILURE)",Chrome 116.0.0.0,,,2023-09-08 10:42:21,2023-09-08 10:42:33,12.336s,PASSED
"mouseOver(findTestObject(""Object Repository/Page_Be a Profressional Talent with Coding.ID/button_Lihat Semua Kelas""))",Chrome 116.0.0.0,,,2023-09-08 10:42:33,2023-09-08 10:42:34,0.570s,PASSED
"mouseOver(findTestObject(""Object Repository/Page_Be a Profressional Talent with Coding.ID/h6_Quality Assurance Engineer Class""))",Chrome 116.0.0.0,,,2023-09-08 10:42:34,2023-09-08 10:42:35,0.596s,PASSED
delay(2),Chrome 116.0.0.0,,,2023-09-08 10:42:35,2023-09-08 10:42:37,2.038s,PASSED
"click(findTestObject(""Object Repository/Page_Be a Profressional Talent with Coding.ID/button_Daftar Bootcamp_1""))",Chrome 116.0.0.0,,,2023-09-08 10:42:37,2023-09-08 10:42:37,0.516s,PASSED
"click(findTestObject(""Object Repository/Page_Be a Profressional Talent with Coding.ID/h2_Pendaftaran Bootcamp""))",Chrome 116.0.0.0,,,2023-09-08 10:42:37,2023-09-08 10:42:38,0.900s,PASSED
"verifyElementText(findTestObject(""Object Repository/Page_Be a Profressional Talent with Coding.ID/h2_Pendaftaran Bootcamp""), ""Pendaftaran Bootcamp"")",Chrome 116.0.0.0,,,2023-09-08 10:42:38,2023-09-08 10:42:38,0.388s,PASSED
closeBrowser(),Chrome 116.0.0.0,,,2023-09-08 10:42:38,2023-09-08 10:42:39,0.726s,PASSED
,,,,,,,
Test Cases/HomePage/WEB-HP005,Chrome 116.0.0.0,Validate WA number on enrollment form,homepage,2023-09-08 10:42:39,2023-09-08 10:42:58,19.062s,PASSED
"callTestCase(findTestCase(""Precondition/precondition""), [:], STOP_ON_FAILURE)",Chrome 116.0.0.0,,,2023-09-08 10:42:40,2023-09-08 10:42:53,13.593s,PASSED
"mouseOver(findTestObject(""Object Repository/Homepage/Page_Be a Profressional Talent with Coding.ID/h6_Quality Assurance Engineer Class""))",Chrome 116.0.0.0,,,2023-09-08 10:42:53,2023-09-08 10:42:54,0.567s,PASSED
"click(findTestObject(""Homepage/Page_Be a Profressional Talent with Coding.ID/button_Daftar Bootcamp (1)""))",Chrome 116.0.0.0,,,2023-09-08 10:42:54,2023-09-08 10:42:54,0.486s,PASSED
"click(findTestObject(""Object Repository/Homepage/Page_Be a Profressional Talent with Coding.ID/h2_Pendaftaran Bootcamp""))",Chrome 116.0.0.0,,,2023-09-08 10:42:54,2023-09-08 10:42:55,0.578s,PASSED
"click(findTestObject(""Object Repository/Homepage/Page_Be a Profressional Talent with Coding.ID/input__kelas_form_name""))",Chrome 116.0.0.0,,,2023-09-08 10:42:55,2023-09-08 10:42:55,0.524s,PASSED
"click(findTestObject(""Object Repository/Homepage/Page_Be a Profressional Talent with Coding.ID/input__kelas_form_name""))",Chrome 116.0.0.0,,,2023-09-08 10:42:55,2023-09-08 10:42:56,0.682s,PASSED
"click(findTestObject(""Homepage/Page_Be a Profressional Talent with Coding.ID/button_Selanjutnya (1)""))",Chrome 116.0.0.0,,,2023-09-08 10:42:56,2023-09-08 10:42:57,0.457s,PASSED
"click(findTestObject(""Object Repository/Homepage/Page_Be a Profressional Talent with Coding.ID/h5_Nomor Whatsapp""))",Chrome 116.0.0.0,,,2023-09-08 10:42:57,2023-09-08 10:42:57,0.542s,PASSED
"verifyElementText(findTestObject(""Object Repository/Homepage/Page_Be a Profressional Talent with Coding.ID/h5_Nomor Whatsapp""), ""Nomor Whatsapp*"")",Chrome 116.0.0.0,,,2023-09-08 10:42:57,2023-09-08 10:42:57,0.381s,PASSED
closeBrowser(),Chrome 116.0.0.0,,,2023-09-08 10:42:57,2023-09-08 10:42:58,0.823s,PASSED
,,,,,,,
Test Cases/HomePage/WEB-HP006,Chrome 116.0.0.0,Fill the form with valid data,homepage,2023-09-08 10:42:58,2023-09-08 10:43:26,27.681s,PASSED
"callTestCase(findTestCase(""Precondition/precondition""), [:], STOP_ON_FAILURE)",Chrome 116.0.0.0,,,2023-09-08 10:42:59,2023-09-08 10:43:15,16.702s,PASSED
"mouseOver(findTestObject(""Object Repository/Homepage/Page_Be a Profressional Talent with Coding.ID/h6_Quality Assurance Engineer Class (1) (1)""))",Chrome 116.0.0.0,,,2023-09-08 10:43:15,2023-09-08 10:43:16,0.574s,PASSED
"click(findTestObject(""Object Repository/Homepage/Page_Be a Profressional Talent with Coding.ID/button_Daftar Bootcamp (1) (1)""))",Chrome 116.0.0.0,,,2023-09-08 10:43:16,2023-09-08 10:43:16,0.480s,PASSED
"click(findTestObject(""Object Repository/Homepage/Page_Be a Profressional Talent with Coding.ID/h2_Pendaftaran Bootcamp (1) (1)""))",Chrome 116.0.0.0,,,2023-09-08 10:43:16,2023-09-08 10:43:17,0.552s,PASSED
"click(findTestObject(""Object Repository/Homepage/Page_Be a Profressional Talent with Coding.ID/button_Selanjutnya (1) (1)""))",Chrome 116.0.0.0,,,2023-09-08 10:43:17,2023-09-08 10:43:18,0.687s,PASSED
"waitForElementClickable(findTestObject(""Object Repository/Homepage/Page_Be a Profressional Talent with Coding.ID/div_Pilih Domisili""), 1)",Chrome 116.0.0.0,,,2023-09-08 10:43:18,2023-09-08 10:43:18,0.578s,PASSED
"click(findTestObject(""Object Repository/Homepage/Page_Be a Profressional Talent with Coding.ID/div_Pilih Domisili""))",Chrome 116.0.0.0,,,2023-09-08 10:43:18,2023-09-08 10:43:19,0.442s,PASSED
"click(findTestObject(""Object Repository/Homepage/Page_Be a Profressional Talent with Coding.ID/h5_KAB TIMOR TENGAH SELATAN""))",Chrome 116.0.0.0,,,2023-09-08 10:43:19,2023-09-08 10:43:20,0.966s,PASSED
"setText(findTestObject(""Object Repository/Homepage/Page_Be a Profressional Talent with Coding.ID/input__jurusan-field""), ""hahaeehe"")",Chrome 116.0.0.0,,,2023-09-08 10:43:20,2023-09-08 10:43:21,0.973s,PASSED
"scrollToElement(findTestObject(""Object Repository/Homepage/Page_Be a Profressional Talent with Coding.ID/div_Pilih Instansi""), 1)",Chrome 116.0.0.0,,,2023-09-08 10:43:21,2023-09-08 10:43:21,0.413s,PASSED
"waitForElementClickable(findTestObject(""Object Repository/Homepage/Page_Be a Profressional Talent with Coding.ID/div_Pilih Instansi""), 1)",Chrome 116.0.0.0,,,2023-09-08 10:43:21,2023-09-08 10:43:22,0.534s,PASSED
"click(findTestObject(""Object Repository/Homepage/Page_Be a Profressional Talent with Coding.ID/div_Pilih Instansi""))",Chrome 116.0.0.0,,,2023-09-08 10:43:22,2023-09-08 10:43:22,0.469s,PASSED
"click(findTestObject(""Object Repository/Homepage/Page_Be a Profressional Talent with Coding.ID/h5_Akademi Akuntansi Bandung""))",Chrome 116.0.0.0,,,2023-09-08 10:43:22,2023-09-08 10:43:23,0.708s,PASSED
"waitForElementClickable(findTestObject(""Object Repository/Homepage/Page_Be a Profressional Talent with Coding.ID/div_Pilih Referensi""), 1)",Chrome 116.0.0.0,,,2023-09-08 10:43:23,2023-09-08 10:43:23,0.500s,PASSED
"click(findTestObject(""Object Repository/Homepage/Page_Be a Profressional Talent with Coding.ID/div_Pilih Referensi""))",Chrome 116.0.0.0,,,2023-09-08 10:43:23,2023-09-08 10:43:24,0.434s,PASSED
"click(findTestObject(""Object Repository/Homepage/Page_Be a Profressional Talent with Coding.ID/h5_Indeed""))",Chrome 116.0.0.0,,,2023-09-08 10:43:24,2023-09-08 10:43:24,0.467s,PASSED
"click(findTestObject(""Homepage/Page_Be a Profressional Talent with Coding.ID/button_Selanjutnya (1)""))",Chrome 116.0.0.0,,,2023-09-08 10:43:24,2023-09-08 10:43:25,0.534s,PASSED
"verifyElementText(findTestObject(""Object Repository/Homepage/Page_Be a Profressional Talent with Coding.ID/h5_Apa bahasa pemrograman yang kamu kuasai""), ""Apa bahasa pemrograman yang kamu kuasai?*"")",Chrome 116.0.0.0,,,2023-09-08 10:43:25,2023-09-08 10:43:25,0.527s,PASSED
closeBrowser(),Chrome 116.0.0.0,,,2023-09-08 10:43:25,2023-09-08 10:43:26,0.714s,PASSED
,,,,,,,
Test Cases/HomePage/WEB-HP007,Chrome 116.0.0.0,,,2023-09-08 10:43:26,2023-09-08 10:43:46,19.884s,PASSED
"callTestCase(findTestCase(""Precondition/precondition""), [:], STOP_ON_FAILURE)",Chrome 116.0.0.0,,,2023-09-08 10:43:26,2023-09-08 10:43:40,13.410s,PASSED
"mouseOver(findTestObject(""Object Repository/Homepage/Page_Be a Profressional Talent with Coding.ID/h6_Quality Assurance Engineer Class (1) (1)""))",Chrome 116.0.0.0,,,2023-09-08 10:43:40,2023-09-08 10:43:40,0.582s,PASSED
"click(findTestObject(""Object Repository/Homepage/Page_Be a Profressional Talent with Coding.ID/button_Daftar Bootcamp (1) (1)""))",Chrome 116.0.0.0,,,2023-09-08 10:43:40,2023-09-08 10:43:41,0.460s,PASSED
"click(findTestObject(""Object Repository/Homepage/Page_Be a Profressional Talent with Coding.ID/h2_Pendaftaran Bootcamp (1) (1)""))",Chrome 116.0.0.0,,,2023-09-08 10:43:41,2023-09-08 10:43:41,0.575s,PASSED
"click(findTestObject(""Object Repository/Homepage/Page_Be a Profressional Talent with Coding.ID/button_Selanjutnya (1) (1)""))",Chrome 116.0.0.0,,,2023-09-08 10:43:41,2023-09-08 10:43:42,0.474s,PASSED
"scrollToElement(findTestObject(""Object Repository/Homepage/Page_Be a Profressional Talent with Coding.ID/h5_Nama Instansi Pendidikan""), 1)",Chrome 116.0.0.0,,,2023-09-08 10:43:42,2023-09-08 10:43:43,1.079s,PASSED
"click(findTestObject(""Homepage/Page_Be a Profressional Talent with Coding.ID/button_Selanjutnya (1)""))",Chrome 116.0.0.0,,,2023-09-08 10:43:43,2023-09-08 10:43:43,0.468s,PASSED
"click(findTestObject(""Object Repository/Homepage/Page_Be a Profressional Talent with Coding.ID/button_Ok""))",Chrome 116.0.0.0,,,2023-09-08 10:43:43,2023-09-08 10:43:45,1.096s,PASSED
"verifyElementText(findTestObject(""Object Repository/Homepage/Page_Be a Profressional Talent with Coding.ID/div_Jurusan tidak boleh kosong""), ""Jurusan tidak boleh kosong"")",Chrome 116.0.0.0,,,2023-09-08 10:43:45,2023-09-08 10:43:45,0.510s,PASSED
closeBrowser(),Chrome 116.0.0.0,,,2023-09-08 10:43:45,2023-09-08 10:43:46,0.828s,PASSED
,,,,,,,
Test Cases/HomePage/WEB-HP008,Chrome 116.0.0.0,"""Pop up appear showing warning message 
""""Perhatian
Periksa kembali inputan anda""""""",homepage,2023-09-08 10:43:46,2023-09-08 10:44:09,23.426s,PASSED
"callTestCase(findTestCase(""Precondition/precondition""), [:], STOP_ON_FAILURE)",Chrome 116.0.0.0,,,2023-09-08 10:43:46,2023-09-08 10:43:59,12.627s,PASSED
"mouseOver(findTestObject(""Object Repository/Homepage/Page_Be a Profressional Talent with Coding.ID/h6_Quality Assurance Engineer Class (1) (1)""))",Chrome 116.0.0.0,,,2023-09-08 10:43:59,2023-09-08 10:43:59,0.579s,PASSED
"click(findTestObject(""Object Repository/Homepage/Page_Be a Profressional Talent with Coding.ID/button_Daftar Bootcamp (1) (1)""))",Chrome 116.0.0.0,,,2023-09-08 10:43:59,2023-09-08 10:44:00,0.463s,PASSED
"click(findTestObject(""Object Repository/Homepage/Page_Be a Profressional Talent with Coding.ID/h2_Pendaftaran Bootcamp (1) (1)""))",Chrome 116.0.0.0,,,2023-09-08 10:44:00,2023-09-08 10:44:01,0.570s,PASSED
"click(findTestObject(""Object Repository/Homepage/Page_Be a Profressional Talent with Coding.ID/button_Selanjutnya (1) (1)""))",Chrome 116.0.0.0,,,2023-09-08 10:44:01,2023-09-08 10:44:01,0.479s,PASSED
"scrollToElement(findTestObject(""Object Repository/Homepage/Page_Be a Profressional Talent with Coding.ID/input__jurusan-field""), 1)",Chrome 116.0.0.0,,,2023-09-08 10:44:01,2023-09-08 10:44:02,0.519s,PASSED
delay(3),Chrome 116.0.0.0,,,2023-09-08 10:44:02,2023-09-08 10:44:05,3.007s,PASSED
"click(findTestObject(""Homepage/Page_Be a Profressional Talent with Coding.ID/button_Selanjutnya (1)""))",Chrome 116.0.0.0,,,2023-09-08 10:44:05,2023-09-08 10:44:05,0.600s,PASSED
delay(3),Chrome 116.0.0.0,,,2023-09-08 10:44:05,2023-09-08 10:44:08,3.006s,PASSED
"verifyElementText(findTestObject(""Object Repository/Homepage/Page_Be a Profressional Talent with Coding.ID/p_Periksa kembali inputan anda""), ""Periksa kembali inputan anda"")",Chrome 116.0.0.0,,,2023-09-08 10:44:08,2023-09-08 10:44:09,0.457s,PASSED
closeBrowser(),Chrome 116.0.0.0,,,2023-09-08 10:44:09,2023-09-08 10:44:09,0.691s,PASSED
,,,,,,,
Test Cases/HomePage/WEB-HP009,Chrome 116.0.0.0,Pilih Skill Search bar (select one skill),homepage,2023-09-08 10:44:34,2023-09-08 10:44:58,24.523s,FAILED
"callTestCase(findTestCase(""Precondition/precondition""), [:], STOP_ON_FAILURE)",Chrome 116.0.0.0,,,2023-09-08 10:44:34,2023-09-08 10:44:47,13.088s,PASSED
"mouseOver(findTestObject(""Object Repository/Homepage/Page_Be a Profressional Talent with Coding.ID/h6_Quality Assurance Engineer Class (1) (1)""))",Chrome 116.0.0.0,,,2023-09-08 10:44:47,2023-09-08 10:44:47,0.571s,PASSED
"click(findTestObject(""Object Repository/Homepage/Page_Be a Profressional Talent with Coding.ID/button_Daftar Bootcamp (1) (1)""))",Chrome 116.0.0.0,,,2023-09-08 10:44:47,2023-09-08 10:44:48,0.471s,PASSED
"click(findTestObject(""Object Repository/Homepage/Page_Be a Profressional Talent with Coding.ID/h2_Pendaftaran Bootcamp (1) (1)""))",Chrome 116.0.0.0,,,2023-09-08 10:44:48,2023-09-08 10:44:48,0.573s,PASSED
"click(findTestObject(""Object Repository/Homepage/Page_Be a Profressional Talent with Coding.ID/button_Selanjutnya (1) (1)""))",Chrome 116.0.0.0,,,2023-09-08 10:44:48,2023-09-08 10:44:49,0.531s,PASSED
"waitForElementClickable(findTestObject(""Object Repository/Homepage/Page_Be a Profressional Talent with Coding.ID/div_Pilih Domisili""), 1)",Chrome 116.0.0.0,,,2023-09-08 10:44:49,2023-09-08 10:44:49,0.498s,PASSED
"click(findTestObject(""Object Repository/Homepage/Page_Be a Profressional Talent with Coding.ID/div_Pilih Domisili""))",Chrome 116.0.0.0,,,2023-09-08 10:44:49,2023-09-08 10:44:50,0.667s,PASSED
"click(findTestObject(""Object Repository/Homepage/Page_Be a Profressional Talent with Coding.ID/h5_KAB TIMOR TENGAH SELATAN""))",Chrome 116.0.0.0,,,2023-09-08 10:44:50,2023-09-08 10:44:51,0.778s,PASSED
"setText(findTestObject(""Object Repository/Homepage/Page_Be a Profressional Talent with Coding.ID/input__jurusan-field""), ""hahaeehe"")",Chrome 116.0.0.0,,,2023-09-08 10:44:51,2023-09-08 10:44:52,0.916s,PASSED
"scrollToElement(findTestObject(""Object Repository/Homepage/Page_Be a Profressional Talent with Coding.ID/div_Pilih Instansi""), 1)",Chrome 116.0.0.0,,,2023-09-08 10:44:52,2023-09-08 10:44:52,0.393s,PASSED
"waitForElementClickable(findTestObject(""Object Repository/Homepage/Page_Be a Profressional Talent with Coding.ID/div_Pilih Instansi""), 1)",Chrome 116.0.0.0,,,2023-09-08 10:44:52,2023-09-08 10:44:53,0.803s,PASSED
"click(findTestObject(""Object Repository/Homepage/Page_Be a Profressional Talent with Coding.ID/div_Pilih Instansi""))",Chrome 116.0.0.0,,,2023-09-08 10:44:53,2023-09-08 10:44:54,0.534s,PASSED
"click(findTestObject(""Object Repository/Homepage/Page_Be a Profressional Talent with Coding.ID/h5_Akademi Akuntansi Bandung""))",Chrome 116.0.0.0,,,2023-09-08 10:44:54,2023-09-08 10:44:54,0.883s,PASSED
"waitForElementClickable(findTestObject(""Object Repository/Homepage/Page_Be a Profressional Talent with Coding.ID/div_Pilih Referensi""), 1)",Chrome 116.0.0.0,,,2023-09-08 10:44:54,2023-09-08 10:44:55,0.499s,PASSED
"click(findTestObject(""Object Repository/Homepage/Page_Be a Profressional Talent with Coding.ID/div_Pilih Referensi""))",Chrome 116.0.0.0,,,2023-09-08 10:44:55,2023-09-08 10:44:55,0.447s,PASSED
"click(findTestObject(""Object Repository/Homepage/Page_Be a Profressional Talent with Coding.ID/h5_Indeed""))",Chrome 116.0.0.0,,,2023-09-08 10:44:55,2023-09-08 10:44:56,0.428s,PASSED
"click(findTestObject(""Homepage/Page_Be a Profressional Talent with Coding.ID/button_Selanjutnya (1)""))",Chrome 116.0.0.0,,,2023-09-08 10:44:56,2023-09-08 10:44:57,0.722s,PASSED
"scrollToElement(findTestObject(""Object Repository/Homepage/Page_Be a Profressional Talent with Coding.ID/h5_Apakah kamu                             _d1f2d0""), 0)",Chrome 116.0.0.0,,,2023-09-08 10:44:57,2023-09-08 10:44:57,0.493s,PASSED
"click(findTestObject(""Object Repository/Homepage/Page_Be a Profressional Talent with Coding.ID/div_Pilih skill""))",Chrome 116.0.0.0,,,2023-09-08 10:44:57,2023-09-08 10:44:57,0.385s,PASSED
"click(findTestObject(""Object Repository/Homepage/Page_Be a Profressional Talent with Coding.ID/h5_C""))",Chrome 116.0.0.0,,,2023-09-08 10:44:57,2023-09-08 10:44:58,0.825s,FAILED
,,,,,,,
Test Cases/HomePage/WEB-HP010,Chrome 116.0.0.0,Pilih Skill Search bar (select multiple skill),homepage,2023-09-08 10:45:25,2023-09-08 10:45:50,25.038s,FAILED
"callTestCase(findTestCase(""Precondition/precondition""), [:], STOP_ON_FAILURE)",Chrome 116.0.0.0,,,2023-09-08 10:45:25,2023-09-08 10:45:39,13.958s,PASSED
"mouseOver(findTestObject(""Object Repository/Homepage/Page_Be a Profressional Talent with Coding.ID/h6_Quality Assurance Engineer Class (1) (1)""))",Chrome 116.0.0.0,,,2023-09-08 10:45:39,2023-09-08 10:45:39,0.585s,PASSED
"click(findTestObject(""Object Repository/Homepage/Page_Be a Profressional Talent with Coding.ID/button_Daftar Bootcamp (1) (1)""))",Chrome 116.0.0.0,,,2023-09-08 10:45:39,2023-09-08 10:45:40,0.448s,PASSED
"click(findTestObject(""Object Repository/Homepage/Page_Be a Profressional Talent with Coding.ID/h2_Pendaftaran Bootcamp (1) (1)""))",Chrome 116.0.0.0,,,2023-09-08 10:45:40,2023-09-08 10:45:40,0.563s,PASSED
"click(findTestObject(""Object Repository/Homepage/Page_Be a Profressional Talent with Coding.ID/button_Selanjutnya (1) (1)""))",Chrome 116.0.0.0,,,2023-09-08 10:45:40,2023-09-08 10:45:41,0.440s,PASSED
"waitForElementClickable(findTestObject(""Object Repository/Homepage/Page_Be a Profressional Talent with Coding.ID/div_Pilih Domisili""), 1)",Chrome 116.0.0.0,,,2023-09-08 10:45:41,2023-09-08 10:45:41,0.717s,PASSED
"click(findTestObject(""Object Repository/Homepage/Page_Be a Profressional Talent with Coding.ID/div_Pilih Domisili""))",Chrome 116.0.0.0,,,2023-09-08 10:45:41,2023-09-08 10:45:42,0.553s,PASSED
"click(findTestObject(""Object Repository/Homepage/Page_Be a Profressional Talent with Coding.ID/h5_KAB TIMOR TENGAH SELATAN""))",Chrome 116.0.0.0,,,2023-09-08 10:45:42,2023-09-08 10:45:43,0.786s,PASSED
"setText(findTestObject(""Object Repository/Homepage/Page_Be a Profressional Talent with Coding.ID/input__jurusan-field""), ""hahaeehe"")",Chrome 116.0.0.0,,,2023-09-08 10:45:43,2023-09-08 10:45:44,1.015s,PASSED
"scrollToElement(findTestObject(""Object Repository/Homepage/Page_Be a Profressional Talent with Coding.ID/div_Pilih Instansi""), 1)",Chrome 116.0.0.0,,,2023-09-08 10:45:44,2023-09-08 10:45:44,0.380s,PASSED
"waitForElementClickable(findTestObject(""Object Repository/Homepage/Page_Be a Profressional Talent with Coding.ID/div_Pilih Instansi""), 1)",Chrome 116.0.0.0,,,2023-09-08 10:45:44,2023-09-08 10:45:45,0.700s,PASSED
"click(findTestObject(""Object Repository/Homepage/Page_Be a Profressional Talent with Coding.ID/div_Pilih Instansi""))",Chrome 116.0.0.0,,,2023-09-08 10:45:45,2023-09-08 10:45:45,0.519s,PASSED
"click(findTestObject(""Object Repository/Homepage/Page_Be a Profressional Talent with Coding.ID/h5_Akademi Akuntansi Bandung""))",Chrome 116.0.0.0,,,2023-09-08 10:45:45,2023-09-08 10:45:46,0.681s,PASSED
"waitForElementClickable(findTestObject(""Object Repository/Homepage/Page_Be a Profressional Talent with Coding.ID/div_Pilih Referensi""), 1)",Chrome 116.0.0.0,,,2023-09-08 10:45:46,2023-09-08 10:45:47,0.465s,PASSED
"click(findTestObject(""Object Repository/Homepage/Page_Be a Profressional Talent with Coding.ID/div_Pilih Referensi""))",Chrome 116.0.0.0,,,2023-09-08 10:45:47,2023-09-08 10:45:47,0.422s,PASSED
"click(findTestObject(""Object Repository/Homepage/Page_Be a Profressional Talent with Coding.ID/h5_Indeed""))",Chrome 116.0.0.0,,,2023-09-08 10:45:47,2023-09-08 10:45:47,0.429s,PASSED
"click(findTestObject(""Homepage/Page_Be a Profressional Talent with Coding.ID/button_Selanjutnya (1)""))",Chrome 116.0.0.0,,,2023-09-08 10:45:47,2023-09-08 10:45:48,0.522s,PASSED
"scrollToElement(findTestObject(""Object Repository/Homepage/Page_Be a Profressional Talent with Coding.ID/h5_Apakah kamu                             _d1f2d0""), 0)",Chrome 116.0.0.0,,,2023-09-08 10:45:48,2023-09-08 10:45:48,0.523s,PASSED
"click(findTestObject(""Object Repository/Homepage/Page_Be a Profressional Talent with Coding.ID/div_Pilih skill""))",Chrome 116.0.0.0,,,2023-09-08 10:45:48,2023-09-08 10:45:49,0.557s,PASSED
"click(findTestObject(""Object Repository/Homepage/Page_Be a Profressional Talent with Coding.ID/h5_C""))",Chrome 116.0.0.0,,,2023-09-08 10:45:49,2023-09-08 10:45:50,0.745s,FAILED
,,,,,,,
Test Cases/HomePage/WEB-HP011,Chrome 116.0.0.0,Pilih Skill Search bar (select one skill multiple time/dup skill),homepage,2023-09-08 10:46:19,2023-09-08 10:46:45,25.765s,FAILED
"callTestCase(findTestCase(""Precondition/precondition""), [:], STOP_ON_FAILURE)",Chrome 116.0.0.0,,,2023-09-08 10:46:19,2023-09-08 10:46:33,13.707s,PASSED
"mouseOver(findTestObject(""Object Repository/Homepage/Page_Be a Profressional Talent with Coding.ID/h6_Quality Assurance Engineer Class (1) (1)""))",Chrome 116.0.0.0,,,2023-09-08 10:46:33,2023-09-08 10:46:33,0.599s,PASSED
"click(findTestObject(""Object Repository/Homepage/Page_Be a Profressional Talent with Coding.ID/button_Daftar Bootcamp (1) (1)""))",Chrome 116.0.0.0,,,2023-09-08 10:46:33,2023-09-08 10:46:34,0.440s,PASSED
"click(findTestObject(""Object Repository/Homepage/Page_Be a Profressional Talent with Coding.ID/h2_Pendaftaran Bootcamp (1) (1)""))",Chrome 116.0.0.0,,,2023-09-08 10:46:34,2023-09-08 10:46:34,0.504s,PASSED
"click(findTestObject(""Object Repository/Homepage/Page_Be a Profressional Talent with Coding.ID/button_Selanjutnya (1) (1)""))",Chrome 116.0.0.0,,,2023-09-08 10:46:34,2023-09-08 10:46:35,0.443s,PASSED
"waitForElementClickable(findTestObject(""Object Repository/Homepage/Page_Be a Profressional Talent with Coding.ID/div_Pilih Domisili""), 1)",Chrome 116.0.0.0,,,2023-09-08 10:46:35,2023-09-08 10:46:35,0.694s,PASSED
"click(findTestObject(""Object Repository/Homepage/Page_Be a Profressional Talent with Coding.ID/div_Pilih Domisili""))",Chrome 116.0.0.0,,,2023-09-08 10:46:35,2023-09-08 10:46:36,0.531s,PASSED
"click(findTestObject(""Object Repository/Homepage/Page_Be a Profressional Talent with Coding.ID/h5_KAB TIMOR TENGAH SELATAN""))",Chrome 116.0.0.0,,,2023-09-08 10:46:36,2023-09-08 10:46:37,0.800s,PASSED
"setText(findTestObject(""Object Repository/Homepage/Page_Be a Profressional Talent with Coding.ID/input__jurusan-field""), ""hahaeehe"")",Chrome 116.0.0.0,,,2023-09-08 10:46:37,2023-09-08 10:46:38,1.030s,PASSED
"scrollToElement(findTestObject(""Object Repository/Homepage/Page_Be a Profressional Talent with Coding.ID/div_Pilih Instansi""), 1)",Chrome 116.0.0.0,,,2023-09-08 10:46:38,2023-09-08 10:46:38,0.370s,PASSED
"waitForElementClickable(findTestObject(""Object Repository/Homepage/Page_Be a Profressional Talent with Coding.ID/div_Pilih Instansi""), 1)",Chrome 116.0.0.0,,,2023-09-08 10:46:38,2023-09-08 10:46:39,0.714s,PASSED
"click(findTestObject(""Object Repository/Homepage/Page_Be a Profressional Talent with Coding.ID/div_Pilih Instansi""))",Chrome 116.0.0.0,,,2023-09-08 10:46:39,2023-09-08 10:46:39,0.560s,PASSED
"click(findTestObject(""Object Repository/Homepage/Page_Be a Profressional Talent with Coding.ID/h5_Akademi Akuntansi Bandung""))",Chrome 116.0.0.0,,,2023-09-08 10:46:39,2023-09-08 10:46:41,1.547s,PASSED
"waitForElementClickable(findTestObject(""Object Repository/Homepage/Page_Be a Profressional Talent with Coding.ID/div_Pilih Referensi""), 1)",Chrome 116.0.0.0,,,2023-09-08 10:46:41,2023-09-08 10:46:41,0.506s,PASSED
"click(findTestObject(""Object Repository/Homepage/Page_Be a Profressional Talent with Coding.ID/div_Pilih Referensi""))",Chrome 116.0.0.0,,,2023-09-08 10:46:41,2023-09-08 10:46:42,0.421s,PASSED
"click(findTestObject(""Object Repository/Homepage/Page_Be a Profressional Talent with Coding.ID/h5_Indeed""))",Chrome 116.0.0.0,,,2023-09-08 10:46:42,2023-09-08 10:46:42,0.529s,PASSED
"click(findTestObject(""Homepage/Page_Be a Profressional Talent with Coding.ID/button_Selanjutnya (1)""))",Chrome 116.0.0.0,,,2023-09-08 10:46:42,2023-09-08 10:46:43,0.532s,PASSED
"scrollToElement(findTestObject(""Object Repository/Homepage/Page_Be a Profressional Talent with Coding.ID/h5_Apakah kamu                             _d1f2d0""), 0)",Chrome 116.0.0.0,,,2023-09-08 10:46:43,2023-09-08 10:46:43,0.512s,PASSED
"click(findTestObject(""Object Repository/Homepage/Page_Be a Profressional Talent with Coding.ID/div_Pilih skill""))",Chrome 116.0.0.0,,,2023-09-08 10:46:43,2023-09-08 10:46:44,0.441s,PASSED
"click(findTestObject(""Object Repository/Homepage/Page_Be a Profressional Talent with Coding.ID/h5_C""))",Chrome 116.0.0.0,,,2023-09-08 10:46:44,2023-09-08 10:46:45,0.869s,FAILED
,,,,,,,
Test Cases/HomePage/WEB-HP012,Chrome 116.0.0.0,Pilih Skill Search bar (search valid skill),homepage,2023-09-08 10:47:11,2023-09-08 10:47:35,24.496s,FAILED
"callTestCase(findTestCase(""Precondition/precondition""), [:], STOP_ON_FAILURE)",Chrome 116.0.0.0,,,2023-09-08 10:47:11,2023-09-08 10:47:24,12.947s,PASSED
"mouseOver(findTestObject(""Object Repository/Homepage/Page_Be a Profressional Talent with Coding.ID/h6_Quality Assurance Engineer Class (1) (1)""))",Chrome 116.0.0.0,,,2023-09-08 10:47:24,2023-09-08 10:47:24,0.554s,PASSED
"click(findTestObject(""Object Repository/Homepage/Page_Be a Profressional Talent with Coding.ID/button_Daftar Bootcamp (1) (1)""))",Chrome 116.0.0.0,,,2023-09-08 10:47:24,2023-09-08 10:47:25,0.486s,PASSED
"click(findTestObject(""Object Repository/Homepage/Page_Be a Profressional Talent with Coding.ID/h2_Pendaftaran Bootcamp (1) (1)""))",Chrome 116.0.0.0,,,2023-09-08 10:47:25,2023-09-08 10:47:25,0.534s,PASSED
"click(findTestObject(""Object Repository/Homepage/Page_Be a Profressional Talent with Coding.ID/button_Selanjutnya (1) (1)""))",Chrome 116.0.0.0,,,2023-09-08 10:47:25,2023-09-08 10:47:26,0.449s,PASSED
"waitForElementClickable(findTestObject(""Object Repository/Homepage/Page_Be a Profressional Talent with Coding.ID/div_Pilih Domisili""), 1)",Chrome 116.0.0.0,,,2023-09-08 10:47:26,2023-09-08 10:47:26,0.606s,PASSED
"click(findTestObject(""Object Repository/Homepage/Page_Be a Profressional Talent with Coding.ID/div_Pilih Domisili""))",Chrome 116.0.0.0,,,2023-09-08 10:47:26,2023-09-08 10:47:27,0.581s,PASSED
"click(findTestObject(""Object Repository/Homepage/Page_Be a Profressional Talent with Coding.ID/h5_KAB TIMOR TENGAH SELATAN""))",Chrome 116.0.0.0,,,2023-09-08 10:47:27,2023-09-08 10:47:28,0.680s,PASSED
"setText(findTestObject(""Object Repository/Homepage/Page_Be a Profressional Talent with Coding.ID/input__jurusan-field""), ""hahaeehe"")",Chrome 116.0.0.0,,,2023-09-08 10:47:28,2023-09-08 10:47:29,1.161s,PASSED
"scrollToElement(findTestObject(""Object Repository/Homepage/Page_Be a Profressional Talent with Coding.ID/div_Pilih Instansi""), 1)",Chrome 116.0.0.0,,,2023-09-08 10:47:29,2023-09-08 10:47:29,0.383s,PASSED
"waitForElementClickable(findTestObject(""Object Repository/Homepage/Page_Be a Profressional Talent with Coding.ID/div_Pilih Instansi""), 1)",Chrome 116.0.0.0,,,2023-09-08 10:47:29,2023-09-08 10:47:30,0.727s,PASSED
"click(findTestObject(""Object Repository/Homepage/Page_Be a Profressional Talent with Coding.ID/div_Pilih Instansi""))",Chrome 116.0.0.0,,,2023-09-08 10:47:30,2023-09-08 10:47:30,0.546s,PASSED
"click(findTestObject(""Object Repository/Homepage/Page_Be a Profressional Talent with Coding.ID/h5_Akademi Akuntansi Bandung""))",Chrome 116.0.0.0,,,2023-09-08 10:47:30,2023-09-08 10:47:31,0.792s,PASSED
"waitForElementClickable(findTestObject(""Object Repository/Homepage/Page_Be a Profressional Talent with Coding.ID/div_Pilih Referensi""), 1)",Chrome 116.0.0.0,,,2023-09-08 10:47:31,2023-09-08 10:47:32,0.471s,PASSED
"click(findTestObject(""Object Repository/Homepage/Page_Be a Profressional Talent with Coding.ID/div_Pilih Referensi""))",Chrome 116.0.0.0,,,2023-09-08 10:47:32,2023-09-08 10:47:32,0.409s,PASSED
"click(findTestObject(""Object Repository/Homepage/Page_Be a Profressional Talent with Coding.ID/h5_Indeed""))",Chrome 116.0.0.0,,,2023-09-08 10:47:32,2023-09-08 10:47:33,0.413s,PASSED
"click(findTestObject(""Homepage/Page_Be a Profressional Talent with Coding.ID/button_Selanjutnya (1)""))",Chrome 116.0.0.0,,,2023-09-08 10:47:33,2023-09-08 10:47:33,0.957s,PASSED
"scrollToElement(findTestObject(""Object Repository/Homepage/Page_Be a Profressional Talent with Coding.ID/h5_Apakah kamu                             _d1f2d0""), 0)",Chrome 116.0.0.0,,,2023-09-08 10:47:33,2023-09-08 10:47:34,0.527s,PASSED
"click(findTestObject(""Object Repository/Homepage/Page_Be a Profressional Talent with Coding.ID/div_Pilih skill""))",Chrome 116.0.0.0,,,2023-09-08 10:47:34,2023-09-08 10:47:34,0.438s,PASSED
"setText(findTestObject(""Object Repository/Homepage/Page_Be a Profressional Talent with Coding.ID/input_Instagram_input-form""), ""javascript"")",Chrome 116.0.0.0,,,2023-09-08 10:47:34,2023-09-08 10:47:35,0.822s,FAILED
,,,,,,,
Test Cases/HomePage/WEB-HP013,Chrome 116.0.0.0,Pilih Skill Search bar (search invalid skill),homepage,2023-09-08 10:48:02,2023-09-08 10:48:28,25.917s,FAILED
"callTestCase(findTestCase(""Precondition/precondition""), [:], STOP_ON_FAILURE)",Chrome 116.0.0.0,,,2023-09-08 10:48:02,2023-09-08 10:48:16,14.179s,PASSED
"mouseOver(findTestObject(""Object Repository/Homepage/Page_Be a Profressional Talent with Coding.ID/h6_Quality Assurance Engineer Class (1) (1)""))",Chrome 116.0.0.0,,,2023-09-08 10:48:16,2023-09-08 10:48:17,0.571s,PASSED
"click(findTestObject(""Object Repository/Homepage/Page_Be a Profressional Talent with Coding.ID/button_Daftar Bootcamp (1) (1)""))",Chrome 116.0.0.0,,,2023-09-08 10:48:17,2023-09-08 10:48:17,0.456s,PASSED
"click(findTestObject(""Object Repository/Homepage/Page_Be a Profressional Talent with Coding.ID/h2_Pendaftaran Bootcamp (1) (1)""))",Chrome 116.0.0.0,,,2023-09-08 10:48:17,2023-09-08 10:48:18,0.553s,PASSED
"click(findTestObject(""Object Repository/Homepage/Page_Be a Profressional Talent with Coding.ID/button_Selanjutnya (1) (1)""))",Chrome 116.0.0.0,,,2023-09-08 10:48:18,2023-09-08 10:48:18,0.480s,PASSED
"waitForElementClickable(findTestObject(""Object Repository/Homepage/Page_Be a Profressional Talent with Coding.ID/div_Pilih Domisili""), 1)",Chrome 116.0.0.0,,,2023-09-08 10:48:18,2023-09-08 10:48:19,0.622s,PASSED
"click(findTestObject(""Object Repository/Homepage/Page_Be a Profressional Talent with Coding.ID/div_Pilih Domisili""))",Chrome 116.0.0.0,,,2023-09-08 10:48:19,2023-09-08 10:48:19,0.576s,PASSED
"click(findTestObject(""Object Repository/Homepage/Page_Be a Profressional Talent with Coding.ID/h5_KAB TIMOR TENGAH SELATAN""))",Chrome 116.0.0.0,,,2023-09-08 10:48:19,2023-09-08 10:48:20,0.872s,PASSED
"setText(findTestObject(""Object Repository/Homepage/Page_Be a Profressional Talent with Coding.ID/input__jurusan-field""), ""hahaeehe"")",Chrome 116.0.0.0,,,2023-09-08 10:48:20,2023-09-08 10:48:21,0.932s,PASSED
"scrollToElement(findTestObject(""Object Repository/Homepage/Page_Be a Profressional Talent with Coding.ID/div_Pilih Instansi""), 1)",Chrome 116.0.0.0,,,2023-09-08 10:48:21,2023-09-08 10:48:21,0.422s,PASSED
"waitForElementClickable(findTestObject(""Object Repository/Homepage/Page_Be a Profressional Talent with Coding.ID/div_Pilih Instansi""), 1)",Chrome 116.0.0.0,,,2023-09-08 10:48:21,2023-09-08 10:48:22,0.705s,PASSED
"click(findTestObject(""Object Repository/Homepage/Page_Be a Profressional Talent with Coding.ID/div_Pilih Instansi""))",Chrome 116.0.0.0,,,2023-09-08 10:48:22,2023-09-08 10:48:23,0.658s,PASSED
"click(findTestObject(""Object Repository/Homepage/Page_Be a Profressional Talent with Coding.ID/h5_Akademi Akuntansi Bandung""))",Chrome 116.0.0.0,,,2023-09-08 10:48:23,2023-09-08 10:48:23,0.692s,PASSED
"waitForElementClickable(findTestObject(""Object Repository/Homepage/Page_Be a Profressional Talent with Coding.ID/div_Pilih Referensi""), 1)",Chrome 116.0.0.0,,,2023-09-08 10:48:23,2023-09-08 10:48:24,0.471s,PASSED
"click(findTestObject(""Object Repository/Homepage/Page_Be a Profressional Talent with Coding.ID/div_Pilih Referensi""))",Chrome 116.0.0.0,,,2023-09-08 10:48:24,2023-09-08 10:48:24,0.489s,PASSED
"click(findTestObject(""Object Repository/Homepage/Page_Be a Profressional Talent with Coding.ID/h5_Indeed""))",Chrome 116.0.0.0,,,2023-09-08 10:48:24,2023-09-08 10:48:25,0.426s,PASSED
"click(findTestObject(""Homepage/Page_Be a Profressional Talent with Coding.ID/button_Selanjutnya (1)""))",Chrome 116.0.0.0,,,2023-09-08 10:48:25,2023-09-08 10:48:26,0.881s,PASSED
"scrollToElement(findTestObject(""Object Repository/Homepage/Page_Be a Profressional Talent with Coding.ID/h5_Apakah kamu                             _d1f2d0""), 0)",Chrome 116.0.0.0,,,2023-09-08 10:48:26,2023-09-08 10:48:26,0.496s,PASSED
"click(findTestObject(""Object Repository/Homepage/Page_Be a Profressional Talent with Coding.ID/div_Pilih skill""))",Chrome 116.0.0.0,,,2023-09-08 10:48:26,2023-09-08 10:48:27,0.440s,PASSED
"setText(findTestObject(""Object Repository/Homepage/Page_Be a Profressional Talent with Coding.ID/input_Instagram_input-form""), ""masak"")",Chrome 116.0.0.0,,,2023-09-08 10:48:27,2023-09-08 10:48:28,0.973s,FAILED
,,,,,,,
Test Cases/HomePage/WEB-HP014,Chrome 116.0.0.0,Fill motivation form (more than 100 char),homepage,2023-09-08 10:48:28,2023-09-08 10:48:54,26.575s,PASSED
"callTestCase(findTestCase(""Precondition/precondition""), [:], STOP_ON_FAILURE)",Chrome 116.0.0.0,,,2023-09-08 10:48:28,2023-09-08 10:48:42,13.795s,PASSED
"mouseOver(findTestObject(""Object Repository/Homepage/Page_Be a Profressional Talent with Coding.ID/h6_Quality Assurance Engineer Class (1) (1)""))",Chrome 116.0.0.0,,,2023-09-08 10:48:42,2023-09-08 10:48:43,0.589s,PASSED
"click(findTestObject(""Object Repository/Homepage/Page_Be a Profressional Talent with Coding.ID/button_Daftar Bootcamp (1) (1)""))",Chrome 116.0.0.0,,,2023-09-08 10:48:43,2023-09-08 10:48:43,0.496s,PASSED
"click(findTestObject(""Object Repository/Homepage/Page_Be a Profressional Talent with Coding.ID/h2_Pendaftaran Bootcamp (1) (1)""))",Chrome 116.0.0.0,,,2023-09-08 10:48:43,2023-09-08 10:48:44,0.555s,PASSED
"click(findTestObject(""Object Repository/Homepage/Page_Be a Profressional Talent with Coding.ID/button_Selanjutnya (1) (1)""))",Chrome 116.0.0.0,,,2023-09-08 10:48:44,2023-09-08 10:48:44,0.450s,PASSED
"waitForElementClickable(findTestObject(""Object Repository/Homepage/Page_Be a Profressional Talent with Coding.ID/div_Pilih Domisili""), 1)",Chrome 116.0.0.0,,,2023-09-08 10:48:44,2023-09-08 10:48:45,0.606s,PASSED
"click(findTestObject(""Object Repository/Homepage/Page_Be a Profressional Talent with Coding.ID/div_Pilih Domisili""))",Chrome 116.0.0.0,,,2023-09-08 10:48:45,2023-09-08 10:48:45,0.573s,PASSED
"click(findTestObject(""Object Repository/Homepage/Page_Be a Profressional Talent with Coding.ID/h5_KAB TIMOR TENGAH SELATAN""))",Chrome 116.0.0.0,,,2023-09-08 10:48:45,2023-09-08 10:48:46,0.895s,PASSED
"setText(findTestObject(""Object Repository/Homepage/Page_Be a Profressional Talent with Coding.ID/input__jurusan-field""), ""hahaeehe"")",Chrome 116.0.0.0,,,2023-09-08 10:48:46,2023-09-08 10:48:47,0.906s,PASSED
"scrollToElement(findTestObject(""Object Repository/Homepage/Page_Be a Profressional Talent with Coding.ID/div_Pilih Instansi""), 1)",Chrome 116.0.0.0,,,2023-09-08 10:48:47,2023-09-08 10:48:47,0.379s,PASSED
"waitForElementClickable(findTestObject(""Object Repository/Homepage/Page_Be a Profressional Talent with Coding.ID/div_Pilih Instansi""), 1)",Chrome 116.0.0.0,,,2023-09-08 10:48:47,2023-09-08 10:48:48,0.844s,PASSED
"click(findTestObject(""Object Repository/Homepage/Page_Be a Profressional Talent with Coding.ID/div_Pilih Instansi""))",Chrome 116.0.0.0,,,2023-09-08 10:48:48,2023-09-08 10:48:49,0.546s,PASSED
"click(findTestObject(""Object Repository/Homepage/Page_Be a Profressional Talent with Coding.ID/h5_Akademi Akuntansi Bandung""))",Chrome 116.0.0.0,,,2023-09-08 10:48:49,2023-09-08 10:48:50,0.749s,PASSED
"waitForElementClickable(findTestObject(""Object Repository/Homepage/Page_Be a Profressional Talent with Coding.ID/div_Pilih Referensi""), 1)",Chrome 116.0.0.0,,,2023-09-08 10:48:50,2023-09-08 10:48:50,0.520s,PASSED
"click(findTestObject(""Object Repository/Homepage/Page_Be a Profressional Talent with Coding.ID/div_Pilih Referensi""))",Chrome 116.0.0.0,,,2023-09-08 10:48:50,2023-09-08 10:48:50,0.434s,PASSED
"click(findTestObject(""Object Repository/Homepage/Page_Be a Profressional Talent with Coding.ID/h5_Indeed""))",Chrome 116.0.0.0,,,2023-09-08 10:48:50,2023-09-08 10:48:51,0.430s,PASSED
"click(findTestObject(""Homepage/Page_Be a Profressional Talent with Coding.ID/button_Selanjutnya (1)""))",Chrome 116.0.0.0,,,2023-09-08 10:48:51,2023-09-08 10:48:52,0.781s,PASSED
"scrollToElement(findTestObject(""Object Repository/Homepage/Page_Be a Profressional Talent with Coding.ID/h5_Apakah kamu                             _d1f2d0""), 0)",Chrome 116.0.0.0,,,2023-09-08 10:48:52,2023-09-08 10:48:52,0.539s,PASSED
"setText(findTestObject(""Object Repository/Homepage/Page_Be a Profressional Talent with Coding.ID/textarea__Text1""), ""Ada dua tipe orang di dunia ini. Mereka yang mempunyai mimpi besar, dan mereka yang bangun untuk mew"")",Chrome 116.0.0.0,,,2023-09-08 10:48:52,2023-09-08 10:48:53,0.954s,PASSED
"verifyElementText(findTestObject(""Object Repository/Homepage/Page_Be a Profressional Talent with Coding.ID/textarea__Text1""), """")",Chrome 116.0.0.0,,,2023-09-08 10:48:53,2023-09-08 10:48:54,0.366s,PASSED
closeBrowser(),Chrome 116.0.0.0,,,2023-09-08 10:48:54,2023-09-08 10:48:54,0.707s,PASSED
,,,,,,,
Test Cases/HomePage/WEB-HP015f,Chrome 116.0.0.0,Input invalid Referral Code,homepage,2023-09-08 10:49:28,2023-09-08 10:50:00,32.521s,FAILED
"callTestCase(findTestCase(""Precondition/precondition""), [:], STOP_ON_FAILURE)",Chrome 116.0.0.0,,,2023-09-08 10:49:28,2023-09-08 10:49:41,13.251s,PASSED
"mouseOver(findTestObject(""Object Repository/Homepage/Page_Be a Profressional Talent with Coding.ID/h6_Quality Assurance Engineer Class (1) (1)""))",Chrome 116.0.0.0,,,2023-09-08 10:49:41,2023-09-08 10:49:42,0.570s,PASSED
"click(findTestObject(""Object Repository/Homepage/Page_Be a Profressional Talent with Coding.ID/button_Daftar Bootcamp (1) (1)""))",Chrome 116.0.0.0,,,2023-09-08 10:49:42,2023-09-08 10:49:42,0.490s,PASSED
"click(findTestObject(""Object Repository/Homepage/Page_Be a Profressional Talent with Coding.ID/h2_Pendaftaran Bootcamp (1) (1)""))",Chrome 116.0.0.0,,,2023-09-08 10:49:42,2023-09-08 10:49:43,0.566s,PASSED
"click(findTestObject(""Object Repository/Homepage/Page_Be a Profressional Talent with Coding.ID/button_Selanjutnya (1) (1)""))",Chrome 116.0.0.0,,,2023-09-08 10:49:43,2023-09-08 10:49:43,0.438s,PASSED
"waitForElementClickable(findTestObject(""Object Repository/Homepage/Page_Be a Profressional Talent with Coding.ID/div_Pilih Domisili""), 1)",Chrome 116.0.0.0,,,2023-09-08 10:49:43,2023-09-08 10:49:44,0.588s,PASSED
"click(findTestObject(""Object Repository/Homepage/Page_Be a Profressional Talent with Coding.ID/div_Pilih Domisili""))",Chrome 116.0.0.0,,,2023-09-08 10:49:44,2023-09-08 10:49:44,0.529s,PASSED
"click(findTestObject(""Object Repository/Homepage/Page_Be a Profressional Talent with Coding.ID/h5_KAB TIMOR TENGAH SELATAN""))",Chrome 116.0.0.0,,,2023-09-08 10:49:44,2023-09-08 10:49:45,0.749s,PASSED
"setText(findTestObject(""Object Repository/Homepage/Page_Be a Profressional Talent with Coding.ID/input__jurusan-field""), ""hahaeehe"")",Chrome 116.0.0.0,,,2023-09-08 10:49:45,2023-09-08 10:49:46,1.096s,PASSED
"scrollToElement(findTestObject(""Object Repository/Homepage/Page_Be a Profressional Talent with Coding.ID/div_Pilih Instansi""), 1)",Chrome 116.0.0.0,,,2023-09-08 10:49:46,2023-09-08 10:49:46,0.387s,PASSED
"waitForElementClickable(findTestObject(""Object Repository/Homepage/Page_Be a Profressional Talent with Coding.ID/div_Pilih Instansi""), 1)",Chrome 116.0.0.0,,,2023-09-08 10:49:46,2023-09-08 10:49:47,0.797s,PASSED
"click(findTestObject(""Object Repository/Homepage/Page_Be a Profressional Talent with Coding.ID/div_Pilih Instansi""))",Chrome 116.0.0.0,,,2023-09-08 10:49:47,2023-09-08 10:49:48,0.522s,PASSED
"click(findTestObject(""Object Repository/Homepage/Page_Be a Profressional Talent with Coding.ID/h5_Akademi Akuntansi Bandung""))",Chrome 116.0.0.0,,,2023-09-08 10:49:48,2023-09-08 10:49:48,0.778s,PASSED
"waitForElementClickable(findTestObject(""Object Repository/Homepage/Page_Be a Profressional Talent with Coding.ID/div_Pilih Referensi""), 1)",Chrome 116.0.0.0,,,2023-09-08 10:49:48,2023-09-08 10:49:49,0.515s,PASSED
"click(findTestObject(""Object Repository/Homepage/Page_Be a Profressional Talent with Coding.ID/div_Pilih Referensi""))",Chrome 116.0.0.0,,,2023-09-08 10:49:49,2023-09-08 10:49:49,0.402s,PASSED
"click(findTestObject(""Object Repository/Homepage/Page_Be a Profressional Talent with Coding.ID/h5_Indeed""))",Chrome 116.0.0.0,,,2023-09-08 10:49:49,2023-09-08 10:49:50,0.444s,PASSED
delay(2),Chrome 116.0.0.0,,,2023-09-08 10:49:50,2023-09-08 10:49:52,2.011s,PASSED
"click(findTestObject(""Homepage/Page_Be a Profressional Talent with Coding.ID/button_Selanjutnya (1)""))",Chrome 116.0.0.0,,,2023-09-08 10:49:52,2023-09-08 10:49:52,0.389s,PASSED
delay(5),Chrome 116.0.0.0,,,2023-09-08 10:49:52,2023-09-08 10:49:57,5.006s,PASSED
"scrollToElement(findTestObject(""Object Repository/Homepage/Page_Be a Profressional Talent with Coding.ID/h5_Apakah kamu                             _d1f2d0""), 1)",Chrome 116.0.0.0,,,2023-09-08 10:49:57,2023-09-08 10:49:58,0.419s,PASSED
"click(findTestObject(""Homepage/Page_Be a Profressional Talent with Coding.ID/h5_Apakah kamu                             _d1f2d0""))",Chrome 116.0.0.0,,,2023-09-08 10:49:58,2023-09-08 10:49:58,0.523s,PASSED
"setText(findTestObject(""Object Repository/Homepage/Page_Be a Profressional Talent with Coding.ID/textarea__Text1""), ""Ada dua tipe orang di dunia ini. Mereka yang mempunyai mimpi besar, dan mereka yang bangun untuk mew"")",Chrome 116.0.0.0,,,2023-09-08 10:49:58,2023-09-08 10:49:59,0.965s,PASSED
"scrollToElement(findTestObject(""Object Repository/Homepage/Page_Be a Profressional Talent with Coding.ID/div_Hai, Elka Verso memilih                _6c2bec""), 1)",Chrome 116.0.0.0,,,2023-09-08 10:49:59,2023-09-08 10:50:00,0.500s,PASSED
"setText(findTestObject(""Object Repository/Homepage/Page_Be a Profressional Talent with Coding.ID/input_Kode Refferal                        _21f1e9""), ""83274892"")",Chrome 116.0.0.0,,,2023-09-08 10:50:00,2023-09-08 10:50:00,0.570s,FAILED
,,,,,,,
Test Cases/HomePage/WEB-HP016,Chrome 116.0.0.0,Make sure online course product redirected into correct page,homepage,2023-09-08 10:50:00,2023-09-08 10:51:01,1m - 0.277s,PASSED
"openBrowser("""")",Chrome 116.0.0.0,,,2023-09-08 10:50:01,2023-09-08 10:50:03,2.194s,PASSED
"navigateToUrl(""https://demo-app.online/"")",Chrome 116.0.0.0,,,2023-09-08 10:50:03,2023-09-08 10:50:11,7.946s,PASSED
delay(2),Chrome 116.0.0.0,,,2023-09-08 10:50:11,2023-09-08 10:50:13,2.004s,PASSED
"mouseOver(findTestObject(""Object Repository/Homepage/Page_Be a Profressional Talent with Coding.ID/button_Lihat Semua Kelas""))",Chrome 116.0.0.0,,,2023-09-08 10:50:13,2023-09-08 10:50:14,0.799s,PASSED
"click(findTestObject(""Object Repository/Homepage/Page_Be a Profressional Talent with Coding.ID/button_Lihat Semua Kelas""))",Chrome 116.0.0.0,,,2023-09-08 10:50:14,2023-09-08 10:50:15,1.812s,PASSED
"click(findTestObject(""Object Repository/Homepage/Page_Bootcamp dengan Jaminan Kerja di Coding.ID/h2_Programs""))",Chrome 116.0.0.0,,,2023-09-08 10:50:15,2023-09-08 10:50:16,0.760s,PASSED
"verifyElementText(findTestObject(""Object Repository/Homepage/Page_Bootcamp dengan Jaminan Kerja di Coding.ID/h2_Programs""), ""Programs"")",Chrome 116.0.0.0,,,2023-09-08 10:50:16,2023-09-08 10:50:17,0.385s,PASSED
"click(findTestObject(""Object Repository/Homepage/Page_Bootcamp dengan Jaminan Kerja di Coding.ID/img_Toggle navigation_logonya""))",Chrome 116.0.0.0,,,2023-09-08 10:50:17,2023-09-08 10:50:18,1.265s,PASSED
"mouseOver(findTestObject(""Homepage/Page_Be a Profressional Talent with Coding.ID/button_Lihat Semua Course""), STOP_ON_FAILURE)",Chrome 116.0.0.0,,,2023-09-08 10:50:18,2023-09-08 10:50:19,0.874s,PASSED
"click(findTestObject(""Object Repository/Homepage/Page_Be a Profressional Talent with Coding.ID/button_Lihat Semua Course""))",Chrome 116.0.0.0,,,2023-09-08 10:50:19,2023-09-08 10:50:20,0.963s,PASSED
"click(findTestObject(""Object Repository/Homepage/Page_Belajar online kapan saja dan dimana s_6b8099/h2_Kelas Terbaru""))",Chrome 116.0.0.0,,,2023-09-08 10:50:20,2023-09-08 10:50:20,0.749s,PASSED
"verifyElementText(findTestObject(""Object Repository/Homepage/Page_Belajar online kapan saja dan dimana s_6b8099/h2_Kelas Terbaru""), ""Kelas Terbaru"")",Chrome 116.0.0.0,,,2023-09-08 10:50:20,2023-09-08 10:50:21,0.378s,PASSED
"click(findTestObject(""Object Repository/Homepage/Page_Belajar online kapan saja dan dimana s_6b8099/img_Toggle navigation_logonya""))",Chrome 116.0.0.0,,,2023-09-08 10:50:21,2023-09-08 10:50:22,1.078s,PASSED
"mouseOver(findTestObject(""Homepage/Page_Be a Profressional Talent with Coding.ID/button_Lihat Semua Event""), STOP_ON_FAILURE)",Chrome 116.0.0.0,,,2023-09-08 10:50:22,2023-09-08 10:50:23,0.892s,PASSED
"click(findTestObject(""Object Repository/Homepage/Page_Be a Profressional Talent with Coding.ID/button_Lihat Semua Event""))",Chrome 116.0.0.0,,,2023-09-08 10:50:23,2023-09-08 10:50:26,3.403s,PASSED
"click(findTestObject(""Object Repository/Homepage/Page_Online event bersertifikat dari prakti_f42b96/div_Events""))",Chrome 116.0.0.0,,,2023-09-08 10:50:26,2023-09-08 10:50:27,0.421s,PASSED
"verifyElementText(findTestObject(""Object Repository/Homepage/Page_Online event bersertifikat dari prakti_f42b96/h2_Events""), ""Events"")",Chrome 116.0.0.0,,,2023-09-08 10:50:27,2023-09-08 10:50:58,31.638s,PASSED
"click(findTestObject(""Object Repository/Homepage/Page_Online event bersertifikat dari prakti_f42b96/img_Toggle navigation_logonya""))",Chrome 116.0.0.0,,,2023-09-08 10:50:58,2023-09-08 10:51:00,1.531s,PASSED
closeBrowser(),Chrome 116.0.0.0,,,2023-09-08 10:51:00,2023-09-08 10:51:01,0.697s,PASSED
