<?xml version="1.0" encoding="UTF-8"?>
<DataFileEntity>
   <description></description>
   <name>ddt-forgetPass</name>
   <tag></tag>
   <connectionProperties/>
   <containsHeaders>true</containsHeaders>
   <csvSeperator></csvSeperator>
   <dataFileGUID>41d31856-3c5d-484d-9641-d33681981e73</dataFileGUID>
   <dataSourceUrl></dataSourceUrl>
   <driver>InternalData</driver>
   <data>ebbex+verso</data>
   <data>08518492192782</data>
   <data>11111111</data>
   <data>ebbex%40qa</data>
   <data>+</data>
   <internalDataColumns>
      <columnIndex>0</columnIndex>
      <name>Email</name>
      <size>5</size>
   </internalDataColumns>
   <isInternalPath>false</isInternalPath>
   <query></query>
   <secureUserAccount>false</secureUserAccount>
   <sheetName></sheetName>
   <usingGlobalDBSetting>false</usingGlobalDBSetting>
</DataFileEntity>
