/Users/oluwasogo/Documents/demo/sample_blockchain/java-blockchain-api-client/target/generated-sources/openapi/target/generated-sources/org/openapitools/client/model/EntryRequest.java
/Users/oluwasogo/Documents/demo/sample_blockchain/java-blockchain-api-client/target/generated-sources/openapi/target/generated-sources/org/openapitools/client/model/EntryResponse.java
/Users/oluwasogo/Documents/demo/sample_blockchain/java-blockchain-api-client/target/generated-sources/openapi/target/generated-sources/org/openapitools/client/model/Block.java
/Users/oluwasogo/Documents/demo/sample_blockchain/java-blockchain-api-client/target/generated-sources/openapi/target/generated-sources/org/openapitools/client/model/Errors.java
/Users/oluwasogo/Documents/demo/sample_blockchain/java-blockchain-api-client/target/generated-sources/openapi/target/generated-sources/org/openapitools/client/api/SendApi.java
/Users/oluwasogo/Documents/demo/sample_blockchain/java-blockchain-api-client/target/generated-sources/openapi/target/generated-sources/org/openapitools/client/model/StatusResponse.java
/Users/oluwasogo/Documents/demo/sample_blockchain/java-blockchain-api-client/target/generated-sources/openapi/target/generated-sources/org/openapitools/client/ProgressResponseBody.java
/Users/oluwasogo/Documents/demo/sample_blockchain/java-blockchain-api-client/target/generated-sources/openapi/target/generated-sources/org/openapitools/client/ApiCallback.java
/Users/oluwasogo/Documents/demo/sample_blockchain/java-blockchain-api-client/src/main/java/com/mastercard/blockchain/apiclient/config/ApiClientConfig.java
/Users/oluwasogo/Documents/demo/sample_blockchain/java-blockchain-api-client/target/generated-sources/openapi/target/generated-sources/org/openapitools/client/StringUtil.java
/Users/oluwasogo/Documents/demo/sample_blockchain/java-blockchain-api-client/src/main/java/com/mastercard/blockchain/apiclient/config/ApiProperties.java
/Users/oluwasogo/Documents/demo/sample_blockchain/java-blockchain-api-client/target/generated-sources/openapi/target/generated-sources/org/openapitools/client/GzipRequestInterceptor.java
/Users/oluwasogo/Documents/demo/sample_blockchain/java-blockchain-api-client/target/generated-sources/openapi/target/generated-sources/org/openapitools/client/auth/HttpBasicAuth.java
/Users/oluwasogo/Documents/demo/sample_blockchain/java-blockchain-api-client/target/generated-sources/openapi/target/generated-sources/org/openapitools/client/JSON.java
/Users/oluwasogo/Documents/demo/sample_blockchain/java-blockchain-api-client/src/main/java/com/mastercard/blockchain/apiclient/ApiClientApplication.java
/Users/oluwasogo/Documents/demo/sample_blockchain/java-blockchain-api-client/target/generated-sources/openapi/target/generated-sources/org/openapitools/client/auth/Authentication.java
/Users/oluwasogo/Documents/demo/sample_blockchain/java-blockchain-api-client/target/generated-sources/openapi/target/generated-sources/org/openapitools/client/model/ErrorApiResponse.java
/Users/oluwasogo/Documents/demo/sample_blockchain/java-blockchain-api-client/target/generated-sources/openapi/target/generated-sources/org/openapitools/client/Pair.java
/Users/oluwasogo/Documents/demo/sample_blockchain/java-blockchain-api-client/target/generated-sources/protobuf/java/com/mastercard/blockchain/message/PB02.java
/Users/oluwasogo/Documents/demo/sample_blockchain/java-blockchain-api-client/src/main/java/com/mastercard/blockchain/apiclient/config/ConfigProperties.java
/Users/oluwasogo/Documents/demo/sample_blockchain/java-blockchain-api-client/target/generated-sources/openapi/target/generated-sources/org/openapitools/client/model/EntryInfo.java
/Users/oluwasogo/Documents/demo/sample_blockchain/java-blockchain-api-client/target/generated-sources/openapi/target/generated-sources/org/openapitools/client/api/BlockApi.java
/Users/oluwasogo/Documents/demo/sample_blockchain/java-blockchain-api-client/target/generated-sources/openapi/target/generated-sources/org/openapitools/client/model/SendRequest.java
/Users/oluwasogo/Documents/demo/sample_blockchain/java-blockchain-api-client/target/generated-sources/openapi/target/generated-sources/org/openapitools/client/Configuration.java
/Users/oluwasogo/Documents/demo/sample_blockchain/java-blockchain-api-client/target/generated-sources/openapi/target/generated-sources/org/openapitools/client/auth/ApiKeyAuth.java
/Users/oluwasogo/Documents/demo/sample_blockchain/java-blockchain-api-client/target/generated-sources/openapi/target/generated-sources/org/openapitools/client/auth/OAuthFlow.java
/Users/oluwasogo/Documents/demo/sample_blockchain/java-blockchain-api-client/target/generated-sources/openapi/target/generated-sources/org/openapitools/client/api/NodeApi.java
/Users/oluwasogo/Documents/demo/sample_blockchain/java-blockchain-api-client/target/generated-sources/openapi/target/generated-sources/org/openapitools/client/auth/OAuth.java
/Users/oluwasogo/Documents/demo/sample_blockchain/java-blockchain-api-client/target/generated-sources/openapi/target/generated-sources/org/openapitools/client/model/GenesisBlock.java
/Users/oluwasogo/Documents/demo/sample_blockchain/java-blockchain-api-client/target/generated-sources/openapi/target/generated-sources/org/openapitools/client/ApiResponse.java
/Users/oluwasogo/Documents/demo/sample_blockchain/java-blockchain-api-client/target/generated-sources/openapi/target/generated-sources/org/openapitools/client/auth/OAuthOkHttpClient.java
/Users/oluwasogo/Documents/demo/sample_blockchain/java-blockchain-api-client/target/generated-sources/openapi/target/generated-sources/org/openapitools/client/model/Connection.java
/Users/oluwasogo/Documents/demo/sample_blockchain/java-blockchain-api-client/target/generated-sources/openapi/target/generated-sources/org/openapitools/client/model/PeerLocator.java
/Users/oluwasogo/Documents/demo/sample_blockchain/java-blockchain-api-client/target/generated-sources/openapi/target/generated-sources/org/openapitools/client/model/CurrentBlock.java
/Users/oluwasogo/Documents/demo/sample_blockchain/java-blockchain-api-client/target/generated-sources/openapi/target/generated-sources/org/openapitools/client/api/StatusApi.java
/Users/oluwasogo/Documents/demo/sample_blockchain/java-blockchain-api-client/target/generated-sources/openapi/target/generated-sources/org/openapitools/client/auth/RetryingOAuth.java
/Users/oluwasogo/Documents/demo/sample_blockchain/java-blockchain-api-client/src/main/java/com/mastercard/blockchain/apiclient/Ticker.java
/Users/oluwasogo/Documents/demo/sample_blockchain/java-blockchain-api-client/target/generated-sources/openapi/target/generated-sources/org/openapitools/client/ApiException.java
/Users/oluwasogo/Documents/demo/sample_blockchain/java-blockchain-api-client/target/generated-sources/openapi/target/generated-sources/org/openapitools/client/model/NodeInfo.java
/Users/oluwasogo/Documents/demo/sample_blockchain/java-blockchain-api-client/target/generated-sources/openapi/target/generated-sources/org/openapitools/client/api/TransactionEntryApi.java
/Users/oluwasogo/Documents/demo/sample_blockchain/java-blockchain-api-client/target/generated-sources/openapi/target/generated-sources/org/openapitools/client/model/MessagesApiResponse.java
/Users/oluwasogo/Documents/demo/sample_blockchain/java-blockchain-api-client/target/generated-sources/openapi/target/generated-sources/org/openapitools/client/ApiClient.java
/Users/oluwasogo/Documents/demo/sample_blockchain/java-blockchain-api-client/target/generated-sources/openapi/target/generated-sources/org/openapitools/client/model/Error.java
/Users/oluwasogo/Documents/demo/sample_blockchain/java-blockchain-api-client/target/generated-sources/openapi/target/generated-sources/org/openapitools/client/ProgressRequestBody.java
/Users/oluwasogo/Documents/demo/sample_blockchain/java-blockchain-api-client/target/generated-sources/openapi/target/generated-sources/org/openapitools/client/model/DataPartition.java
/Users/oluwasogo/Documents/demo/sample_blockchain/java-blockchain-api-client/src/main/java/com/mastercard/blockchain/apiclient/ui/Menu.java
/Users/oluwasogo/Documents/demo/sample_blockchain/java-blockchain-api-client/src/main/java/com/mastercard/blockchain/apiclient/ui/Console.java
