17

O          1.96503       -0.41185        0.89073
C          0.76240        0.31253        0.58964
C          1.16268        1.71223        0.14686
C         -0.03336       -0.45983       -0.47906
N         -0.06465       -1.91109       -0.09733
C         -1.44876        0.10636       -0.59982
O         -2.37954       -0.61964        0.06087
O         -1.77385        1.12439       -1.18799
H          1.72086       -1.35528        0.77263
H          0.18712        0.38013        1.52091
H          1.75921        1.67654       -0.77125
H          1.79015        2.18698        0.90919
H          0.29164        2.35015       -0.02486
H          0.45618       -0.40539       -1.45754
H         -0.52053       -2.41915       -0.85850
H         -0.73125       -1.99457        0.67904
H         -3.21427       -0.12615       -0.09125
