AU
2
2.35270652342668   0.000000000000000     0.341391281730973        0.002
2.35270785523127   0.000000000000000     0.341391191363233        0.002
1
2.35270652342668   0.160048345811675     0.480716730476272        0.002
5000
LORENTZ
0.0
