modelo,tiempo de entrenamiento,número de parámetros
ET,1.3623354315757752,120
RF,2.3349372148513794,120
GBDT,7.515308904647827,135
MLP+RF(hard),10.25782795906067,7680
XGB+RF(soft),10.05854367017746,450000
MLP+RF(soft),10.104687416553498,7680
KM+RF,7.6935951709747314,46080
XGB+MLP+GBDT(hard),10.782673627679998,506250
MLP+GBDT(soft),10.307569253444672,8640
KM+GBDT,21.360165119171143,51840
XGB+GBDT(soft),10.347110617160798,506250
XGB+MLP+RF(hard),10.472741564114889,28800000
XGB+GBDT(hard),10.110936578114828,506250
MLP+GBDT(hard),10.166001323291233,8640
XGB+MLP+GBDT(soft),10.874584011236827,32400000
XGB+MLP+RF(soft),10.650468618869782,28800000
XGB+RF(hard),10.404601120948792,450000
