{
  "rm_outlayers": true,
  "normalize": false,
  "scale": false,
  "best_params": {
    "activation": "relu",
    "alpha": 0.05,
    "hidden_layer_sizes": [
      5,
      5,
      5
    ],
    "learning_rate": "adaptive",
    "solver": "adam"
  },
  "acc_score": 88.86265249901614,
  "f1_score": {
    "micro": 0.8886265249901614,
    "macro": 0.6082201653820455,
    "weighted": 0.8807431935560162
  }
}