{
  "rm_outlayers": true,
  "normalize": false,
  "scale": false,
  "best_params": {
    "max_depth": 20,
    "min_samples_leaf": 1,
    "n_estimators": 200,
    "bootstrap": true
  },
  "acc_score": 89.88587170405353,
  "f1_score": {
    "micro": 0.8988587170405352,
    "macro": 0.6674952973766793,
    "weighted": 0.8932432271010614
  }
}