{
  "rm_outlayers": true,
  "normalize": false,
  "scale": false,
  "best_params": {
    "kmeans__algorithm": "elkan",
    "kmeans__init": "k-means++",
    "kmeans__max_iter": 200,
    "kmeans__n_clusters": 10,
    "kmeans__n_init": 5,
    "random_forest__max_depth": 50,
    "random_forest__min_samples_leaf": 10,
    "random_forest__n_estimators": 200
  },
  "acc_score": 89.05942542306178,
  "f1_score": {
    "micro": 0.8905942542306179,
    "macro": 0.6494663996123126,
    "weighted": 0.8844055826594133
  }
}