,K,Accuracy,F1 Score Micro,F1 Score Macro,F1 Score Weighted,Silhouette
0,2,0.375,0.375,0.375,0.375,0.3829433236511724
1,3,0.42375,0.42375,0.33420540834063756,0.5013081125109564,0.3836566673249216
2,4,0.1775,0.17750000000000002,0.11801680625658661,0.23603361251317323,0.3959198648597736
3,5,0.26375,0.26375,0.14967996680205725,0.37419991700514316,0.3619727963898374
