Place,Name,Sex,BirthDate,Age,Country,Equipment,Division,BodyweightKg,WeightClassKg,Best3SquatKg,Best3BenchKg,Best3DeadliftKg,TotalKg,Event
1,Kim Mazet,F,,36,Belgium,Raw,F-SR,87.60,90,135,80,160,375,SBD
1,Liam Dierickx,M,,26,Belgium,Raw,M-SR,67.50,67.5,160,107.5,217.5,485,SBD
1,Ismail Fatimi,M,,30,Belgium,Raw,M-SR,72.80,75,142.5,95,205,442.5,SBD
1,Erwin Hemelsoet,M,,50,Belgium,Raw,M-M3,90.00,90,180,135,240,555,SBD
2,Edward Versteele,M,,19,Belgium,Raw,M-T3,87.10,90,165,107.5,212.5,485,SBD
1,Dries Goethals,M,,36,Belgium,Raw,M-SR,107.30,110,200,165,240,605,SBD
1,John Vercruyce,M,,27,Belgium,Raw,M-SR,155.40,145+,250,210.5,303,763.5,SBD
1,Kevin Van Dorsten,M,,19,Netherlands,Raw,M-T3,84.20,90,177.5,115,185,477.5,SBD
