Name,WeightClassKg,Sex,State,Division,Age,Bench1Kg,Bench2Kg,Bench3Kg,Best3BenchKg,Deadlift1Kg,Deadlift2Kg,Deadlift3Kg,Best3DeadliftKg,TotalKg,Event,Equipment,Place
Nona Hubbard,67.5,F,PA,F-M,43,55,65,-67.5,65,,,,,65,B,Single-ply,1
Janel Brown,56,F,PA,F-O,,65,70,75,75,,,,,75,B,Single-ply,1
Jennifer Borzio,75,F,PA,F-O,,-82.5,82.5,85,85,,,,,85,B,Single-ply,1
Cathy Cooper,82.5,F,PA,F-O,35,50,-62.5,-62.5,50,,,,,50,B,Single-ply,1
Aubrey Tatarowicz,56,F,PA,F-SJ,17,37.5,-42.5,42.5,42.5,,,,,42.5,B,Single-ply,1
Kelly Dormer,67.5,F,PA,F-SJ,17,40,-45,45,45,,,,,45,B,Single-ply,2
Rachel Palumbo,67.5,F,PA,F-SJ,16,65,-70,70,70,,,,,70,B,Single-ply,1
Xavier Derstine,52,M,PA,M-SJ,15,52.5,57.5,-60,57.5,,,,,57.5,B,Single-ply,1
Josh Koontz,60,M,PA,M-SJ,17,92.5,-107.5,-110,92.5,,,,,92.5,B,Single-ply,1
Terry Williams Jr,60,M,PA,M-SJ,15,55,60,62.5,62.5,,,,,62.5,B,Single-ply,2
Jared Keller,67.5,M,PA,M-SJ,15,67.5,72.5,77.5,77.5,,,,,77.5,B,Single-ply,2
Maliek Derstine,67.5,M,PA,M-SJ,,127.5,-135,135,135,,,,,135,B,Single-ply,1
Steve Pattison,75,M,PA,M-SJ,16,85,90,-92.5,90,,,,,90,B,Single-ply,3
Philip Redline,75,M,PA,M-SJ,15,82.5,90,95,95,,,,,95,B,Single-ply,1
Shane Smith,75,M,PA,M-SJ,15,82.5,87.5,92.5,92.5,,,,,92.5,B,Single-ply,2
Joseph Giglotti,82.5,M,PA,M-SJ,14,102.5,107.5,112.5,112.5,,,,,112.5,B,Single-ply,1
Matt Pattison,82.5,M,PA,M-SJ,14,65,70,-75,70,,,,,70,B,Single-ply,4
Nicholas DeRemer,82.5,M,PA,M-SJ,16,67.5,72.5,77.5,77.5,,,,,77.5,B,Single-ply,3
Jim Davis,82.5,M,PA,M-SJ,16,87.5,95,-100,95,,,,,95,B,Single-ply,2
Joey Hirsch,90,M,PA,M-SJ,17,107.5,115,-122.5,115,,,,,115,B,Single-ply,3
John Pettine,110,M,PA,M-SJ,16,122.5,147.5,-150,147.5,,,,,147.5,B,Single-ply,2
Philip Godshall,110,M,PA,M-SJ,17,142.5,147.5,157.5,157.5,,,,,157.5,B,Single-ply,1
Kyle Weiss #2,110,M,PA,M-SJ,17,112.5,122.5,-132.5,122.5,,,,,122.5,B,Single-ply,3
Ian Shupp,125,M,PA,M-SJ,17,110,120,122.5,122.5,,,,,122.5,B,Single-ply,1
Chris Nase,125,M,PA,M-SJ,15,85,92.5,-97.5,92.5,,,,,92.5,B,Single-ply,2
Casey Grow,90,M,PA,M-SJ,17,127.5,140,142.5,142.5,,,,,142.5,B,Single-ply,2
James Bradsley III,75,M,,M-G,17,87.5,92.5,-97.5,92.5,,,,,92.5,B,Single-ply,G
Anthony Teti,75,M,,M-G,17,100,105,-110,105,,,,,105,B,Single-ply,G
Jarret Hitchings,90,M,PA,M-SJ,19,145,-147.5,-147.5,145,,,,,145,B,Single-ply,1
Andrew Elkin,90,M,PA,M-SJ,19,150,-162.5,162.5,162.5,,,,,162.5,B,Single-ply,1
Rocco DeStefano,90,M,PA,M-Jr,21,-152.5,152.5,160,160,,,,,160,B,Single-ply,2
Fred S. Ruch,125,M,PA,M-Jr,20,195,200,207.5,207.5,,,,,207.5,B,Single-ply,1
Michael Christian,125+,M,PA,M-Jr,23,182.5,192.5,-195,192.5,,,,,192.5,B,Single-ply,1
Samuel Gravesande,90,M,,M-G,19,162.5,172.5,-177.5,172.5,,,,,172.5,B,Single-ply,G
Fred Garvey Sr,60,M,PA,M-M,57,120,-127.5,-127.5,120,,,,,120,B,Single-ply,1
Grant Passman,82.5,M,PA,M-M,42,145,152.5,155,155,,,,,155,B,Single-ply,1
Peter Hubbard #1,82.5,M,PA,M-M,67,117.5,122.5,127.5,127.5,,,,,127.5,B,Single-ply,2
Stan Nocek,90,M,PA,M-M,51,127.5,-137.5,140,140,,,,,140,B,Single-ply,3
Patrick Horan,90,M,PA,M-M,41,185,-190,-190,185,,,,,185,B,Single-ply,1
Tom Sutton,90,M,PA,M-M,43,142.5,-155,157.5,157.5,,,,,157.5,B,Single-ply,2
John Bertocki,100,M,PA,M-M,49,172.5,182.5,187.5,187.5,,,,,187.5,B,Single-ply,1
Joe Hirsch,110,M,PA,M-M,40,195,205,212.5,212.5,,,,,212.5,B,Single-ply,1
Thomas Harman,110,M,PA,M-M,49,185,195,-197.5,195,,,,,195,B,Single-ply,2
Mark Jenkins,110,M,PA,M-M,44,75,92.5,97.5,97.5,,,,,97.5,B,Single-ply,5
Raymond Murhon,110,M,PA,M-M,49,172.5,-182.5,187.5,187.5,,,,,187.5,B,Single-ply,3
Brian Donnelly,125,M,PA,M-M,63,-167.5,175,-182.5,175,,,,,175,B,Single-ply,2
Al Thompson,125,M,PA,M-M,52,175,-185,-185,175,,,,,175,B,Single-ply,3
Stan Roesch,125,M,PA,M-M,41,185,-195,195,195,,,,,195,B,Single-ply,1
Rex Crowl,110,M,PA,M-M,60,127.5,-137.5,-140,127.5,,,,,127.5,B,Single-ply,4
John Mitsopoulos,82.5,M,,M-G,62,,,,,,,,,,B,Single-ply,DQ
James Bardsley Jr,82.5,M,,M-G,45,145,150,155,155,,,,,155,B,Single-ply,G
David Pora,82.5,M,,M-G,46,,,,,,,,,,B,Single-ply,DQ
Michael Kuhns,60,M,PA,M-O,19,150,165,-175,165,,,,,165,B,Single-ply,2
Fred Garvey Sr,60,M,PA,M-O,57,150,160,167.5,167.5,,,,,167.5,B,Single-ply,1
Kostadin Bahchevanov,67.5,M,PA,M-O,,150,160,167.5,167.5,,,,,167.5,B,Single-ply,1
Jim Smith #8,67.5,M,PA,M-O,,112.5,-127.5,-127.5,112.5,,,,,112.5,B,Single-ply,2
Dominic Ambrosano,75,M,PA,M-O,,142.5,-152.5,-152.5,142.5,,,,,142.5,B,Single-ply,1
Scott Henrick,75,M,PA,M-O,,,,,,,,,,,B,Single-ply,DQ
Mike Cagliola,82.5,M,PA,M-O,,195,200,205,205,,,,,205,B,Single-ply,1
Grant Passman,82.5,M,PA,M-O,42,145,152.5,155,155,,,,,155,B,Single-ply,4
George Welsh,82.5,M,PA,M-O,,,,,,,,,,,B,Single-ply,DQ
Scott Davenport,82.5,M,PA,M-O,,147.5,160,-167.5,160,,,,,160,B,Single-ply,3
Terry Dickey,82.5,M,PA,M-O,,-172.5,172.5,-187.5,172.5,,,,,172.5,B,Single-ply,2
Patrick Horan,90,M,PA,M-O,41,185,-190,-190,185,,,,,185,B,Single-ply,2
Rob Baum,90,M,PA,M-O,,177.5,-182.5,182.5,182.5,,,,,182.5,B,Single-ply,3
David Nocek,90,M,PA,M-O,,137.5,-145,145,145,,,,,145,B,Single-ply,4
Ron Zsido,90,M,PA,M-O,,,,,,,,,,,B,Single-ply,DQ
Pete Grohoski,90,M,PA,M-O,,210,220,-227.5,220,,,,,220,B,Single-ply,1
Fred Garvey Jr,100,M,PA,M-O,,150,-160,-160,150,,,,,150,B,Single-ply,3
Don Wilson,100,M,PA,M-O,,145,155,165,165,,,,,165,B,Single-ply,2
Cliff Dickey,100,M,PA,M-O,,165,172.5,-182.5,172.5,,,,,172.5,B,Single-ply,1
Patrick Klacik,110,M,PA,M-O,,147.5,160,-170,160,,,,,160,B,Single-ply,7
Frank Peters,110,M,PA,M-O,,192.5,200,210,210,,,,,210,B,Single-ply,2
Raymond Murhon,110,M,PA,M-O,49,172.5,-182.5,187.5,187.5,,,,,187.5,B,Single-ply,4
Joe Hirsch,110,M,PA,M-O,40,195,205,212.5,212.5,,,,,212.5,B,Single-ply,1
Kevin Voce,110,M,PA,M-O,,150,165,-170,165,,,,,165,B,Single-ply,6
Barry Myers,110,M,PA,M-O,,-182.5,182.5,-185,182.5,,,,,182.5,B,Single-ply,5
Robert Eckhart,110,M,PA,M-O,,192.5,205,-215,205,,,,,205,B,Single-ply,3
Johnathan Moll,125,M,PA,M-O,,,,,,,,,,,B,Single-ply,DQ
Brian Dacosta,125,M,PA,M-O,,127.5,140,-147.5,140,,,,,140,B,Single-ply,3
Dan Ratchford,125,M,PA,M-O,,215,232.5,-235,232.5,,,,,232.5,B,Single-ply,2
Jim McElwee,125,M,PA,M-O,,-230,-230,-230,,,,,,,B,Single-ply,DQ
Al Thompson,125,M,PA,M-O,52,227.5,237.5,245,245,,,,,245,B,Single-ply,1
Aaron Utermahlen,125+,M,PA,M-O,,192.5,202.5,210,210,,,,,210,B,Single-ply,2
Dennis Hulslander,125+,M,PA,M-O,,275,282.5,-292.5,282.5,,,,,282.5,B,Single-ply,1
Tony Forella,125+,M,PA,M-O,,-160,160,172.5,172.5,,,,,172.5,B,Single-ply,3
Kyle Stephens,110,M,,M-G,,215,225,232.5,232.5,,,,,232.5,B,Single-ply,G
David Pora,82.5,M,,M-G,46,,,,,,,,,,B,Single-ply,DQ
Mike Barcelone,100,M,,M-G,,,,,,,,,,,B,Single-ply,DQ
Scott Davenport,82.5,M,PA,M-PFM,,147.5,160,-167.5,160,,,,,160,B,Single-ply,1
Nona Hubbard,67.5,F,PA,F-M,43,,,,,115,122.5,130,130,130,D,Single-ply,1
Janel Brown,56,F,PA,F-O,,,,,,137.5,147.5,152.5,152.5,152.5,D,Single-ply,1
Jennifer Borzio,75,F,PA,F-O,,,,,,135,142.5,147.5,147.5,147.5,D,Single-ply,1
Cathy Cooper,82.5,F,PA,F-O,,,,,,67.5,70,77.5,77.5,77.5,D,Single-ply,1
Aubrey Tatarowicz,56,F,PA,F-SJ,17,,,,,97.5,105,110,110,110,D,Single-ply,1
Kelly Dormer,67.5,F,PA,F-SJ,17,,,,,65,110,117.5,117.5,117.5,D,Single-ply,1
Xavier Derstine,52,M,PA,M-SJ,15,,,,,102.5,-105,127.5,127.5,127.5,D,Single-ply,1
Terry Williams Jr,60,M,PA,M-SJ,15,,,,,115,120,-125,120,120,D,Single-ply,1
Maliek Derstine,67.5,M,PA,M-SJ,,,,,,237.5,247.5,-260,247.5,247.5,D,Single-ply,1
Jared Keller,67.5,M,PA,M-SJ,15,,,,,115,132.5,-147.5,132.5,132.5,D,Single-ply,2
Shane Smith,75,M,PA,M-SJ,15,,,,,185,205,220,220,220,D,Single-ply,1
Joseph Giglotti,82.5,M,PA,M-SJ,14,,,,,182.5,197.5,205,205,205,D,Single-ply,1
Nicholas DeRemer,82.5,M,PA,M-SJ,16,,,,,112.5,122.5,130,130,130,D,Single-ply,4
Matt Pattison,82.5,M,PA,M-SJ,14,,,,,157.5,160,170,170,170,D,Single-ply,3
Jim Davis,82.5,M,PA,M-SJ,16,,,,,170,180,182.5,182.5,182.5,D,Single-ply,2
Joey Hirsch,90,M,PA,M-SJ,17,,,,,-182.5,-187.5,187.5,187.5,187.5,D,Single-ply,2
Casey Grow,90,M,PA,M-SJ,17,,,,,207.5,230,-245,230,230,D,Single-ply,1
Kyle Weiss #2,110,M,PA,M-SJ,17,,,,,217.5,232.5,-250,232.5,232.5,D,Single-ply,1
John Pettine,110,M,PA,M-SJ,16,,,,,205,-220,-220,205,205,D,Single-ply,2
Ian Shupp,125,M,PA,M-SJ,17,,,,,185,-202.5,-202.5,185,185,D,Single-ply,1
Chris Nase,125,M,PA,M-SJ,15,,,,,147.5,167.5,-180,167.5,167.5,D,Single-ply,2
Jarret Hitchings,90,M,PA,M-T3,19,,,,,175,182.5,192.5,192.5,192.5,D,Single-ply,3
Andrew Elkin,90,M,PA,M-T3,19,,,,,237.5,-260,-260,237.5,237.5,D,Single-ply,2
Rocco DeStefano,90,M,PA,M-Jr,21,,,,,227.5,250,-260,250,250,D,Single-ply,1
Michael Christian,125+,M,PA,M-Jr,23,,,,,255,-272.5,272.5,272.5,272.5,D,Single-ply,1
Ronald Ragland,82.5,M,PA,M-T3,19,,,,,177.5,182.5,192.5,192.5,192.5,D,Single-ply,1
Nick Theodorou,75,M,PA,M-M,54,,,,,227.5,247.5,262.5,262.5,262.5,D,Single-ply,1
Baptist Nupieri,90,M,PA,M-M,42,,,,,202.5,207.5,215,215,215,D,Single-ply,1
Stan Nocek,90,M,PA,M-M,51,,,,,180,190,-195,190,190,D,Single-ply,2
Mark Jenkins,110,M,PA,M-M,44,,,,,155,175,182.5,182.5,182.5,D,Single-ply,1
Al Thompson,125,M,PA,M-M,52,,,,,227.5,237.5,245,245,245,D,Single-ply,1
David Pora,82.5,M,,M-G,46,,,,,122.5,137.5,145,145,145,D,Single-ply,G
Jim Smith #8,67.5,M,PA,M-O,,,,,,172.5,200,-210,200,200,D,Single-ply,2
Kostadin Bahchevanov,67.5,M,PA,M-O,,,,,,215,225,-235,225,225,D,Single-ply,1
Mike Cagliola,75,M,PA,M-O,,,,,,,,,,,D,Single-ply,DQ
Nick Theodorou,75,M,PA,M-O,,,,,,,,,,,D,Single-ply,DQ
William Kelly #3,75,M,PA,M-O,,,,,,182.5,-200,-200,182.5,182.5,D,Single-ply,1
Scott Davenport,82.5,M,PA,M-O,,,,,,197.5,-215,215,215,215,D,Single-ply,2
Terry Dickey,82.5,M,PA,M-O,,,,,,205,217.5,,217.5,217.5,D,Single-ply,1
Pete Grohoski,90,M,PA,M-O,,,,,,237.5,-247.5,-247.5,237.5,237.5,D,Single-ply,1
Rob Baum,90,M,PA,M-O,,,,,,205,217.5,-227.5,217.5,217.5,D,Single-ply,2
David Nocek,90,M,PA,M-O,,,,,,175,185,192.5,192.5,192.5,D,Single-ply,3
Fred Garvey Jr,100,M,PA,M-O,,,,,,185,192.5,-202.5,192.5,192.5,D,Single-ply,2
Cliff Dickey,100,M,PA,M-O,,,,,,210,-240,,210,210,D,Single-ply,1
Bill Dorell,110,M,PA,M-O,,,,,,275,297.5,-310,297.5,297.5,D,Single-ply,1
Frank Peters,110,M,PA,M-O,,,,,,255,-275,-275,255,255,D,Single-ply,4
Robert Eckhart,110,M,PA,M-O,,,,,,237.5,250,262.5,262.5,262.5,D,Single-ply,3
Kevin Voce,110,M,PA,M-O,,,,,,227.5,250,272.5,272.5,272.5,D,Single-ply,2
Randal Olinger,125,M,PA,M-O,44,,,,,237.5,257.5,-270,257.5,257.5,D,Single-ply,1
Brian Dacosta,125,M,PA,M-O,,,,,,222.5,237.5,247.5,247.5,247.5,D,Single-ply,2
Al Thompson,125,M,PA,M-O,52,,,,,227.5,237.5,245,245,245,D,Single-ply,3
Johnathan Moll,125,M,PA,M-O,,,,,,185,197.5,-202.5,197.5,197.5,D,Single-ply,4
Aaron Utermahlen,125+,M,PA,M-O,,,,,,227.5,240,250,250,250,D,Single-ply,2
Dennis Hulslander,125+,M,PA,M-O,,,,,,302.5,320,325,325,325,D,Single-ply,1
Tony Forella,125+,M,PA,M-O,,,,,,232.5,242.5,-250,242.5,242.5,D,Single-ply,3
Mike Robortaccio,100,M,,M-G,23,,,,,-217.5,217.5,230,230,230,D,Single-ply,G
