Place,Name,Division,BirthYear,Country,BodyweightKg,Squat1Kg,Squat2Kg,Squat3Kg,Best3SquatKg,Bench1Kg,Bench2Kg,Bench3Kg,Best3BenchKg,Deadlift1Kg,Deadlift2Kg,Deadlift3Kg,Best3DeadliftKg,TotalKg,WeightClassKg,Sex,Event,Equipment
1,Wiktoria Patrzałek,Juniorki do lat 18,1998,Poland,50.5,40,50,52.5,52.5,30,35,-40,35,65,70,80,80,167.5,52,F,SBD,Raw
1,Aleksandra Grzywniak,Juniorki do lat 18,1997,Poland,56.5,75,-85,85,85,50,55,-60,55,100,110,117.5,117.5,257.5,57,F,SBD,Raw
2,Joanna Białek,Juniorki do lat 18,1999,Poland,56.5,92.5,-97.5,-97.5,92.5,52.5,55,57.5,57.5,100,-105,105,105,255,57,F,SBD,Raw
3,Weronika Kolak,Juniorki do lat 18,1998,Poland,56.4,-60,60,70,70,35,-40,40,40,85,97.5,107.5,107.5,217.5,57,F,SBD,Raw
4,Karolina Twardowska,Juniorki do lat 18,1998,Poland,57,70,77.5,80,80,37.5,40,42.5,42.5,85,90,95,95,217.5,57,F,SBD,Raw
1,Magdalena Malcherek,Juniorki do lat 18,1998,Poland,62.1,110,-120,-120,110,57.5,-62.5,-62.5,57.5,130,140,150.5,150.5,318,63,F,SBD,Raw
2,Weronika Lenort,Juniorki do lat 18,2000,Poland,61.3,-90,90,-100,90,47.5,50,-52.5,50,115,125,-130,125,265,63,F,SBD,Raw
3,Dominika Bachan,Juniorki do lat 18,1997,Poland,59.7,70,75,-80,75,30,37.5,-40,37.5,90,-100,107.5,107.5,220,63,F,SBD,Raw
4,Klaudia Kochanowska,Juniorki do lat 18,1999,Poland,59.9,70,-80,-80,70,35,-40,-40,35,100,105,-110,105,210,63,F,SBD,Raw
5,Zuzanna Firek,Juniorki do lat 18,2000,Poland,57.8,55,60,65,65,52.5,-57.5,57.5,57.5,65,75,85,85,207.5,63,F,SBD,Raw
6,Edyta Murawska,Juniorki do lat 18,2000,Poland,62,40,55,62.5,62.5,25,27.5,-30,27.5,75,-90,90,90,180,63,F,SBD,Raw
1,Kamila Wróbel,Juniorki do lat 18,1997,Poland,71.7,90,-97.5,-97.5,90,52.5,57.5,60,60,115,125,130,130,280,72,F,SBD,Raw
2,Paulina Pawyza,Juniorki do lat 18,1999,Poland,68.4,85,92.5,97.5,97.5,52.5,57.5,60,60,92.5,102.5,112.5,112.5,270,72,F,SBD,Raw
3,Adrianna Majewska,Juniorki do lat 18,1998,Poland,69.5,100,105,-110,105,40,45,50,50,105,110,115,115,270,72,F,SBD,Raw
4,Nikola Śpica,Juniorki do lat 18,2001,Poland,67.4,85,90,-92.5,90,45,47.5,50,50,110,120,-130,120,260,72,F,SBD,Raw
5,Zuzanna Bućko,Juniorki do lat 18,2001,Poland,64,50,60,-72.5,60,37.5,42.5,45,45,80,95,105,105,210,72,F,SBD,Raw
1,Klaudia Rusztyn,Juniorki do lat 23,1993,Poland,54.7,100,107.5,112.5,112.5,57.5,-60,-60,57.5,145,152.5,-155,152.5,322.5,57,F,SBD,Raw
2,Joanna Stanek,Juniorki do lat 23,1995,Poland,56.7,77.5,82.5,-87.5,82.5,40,42.5,-45,42.5,75,82.5,85,85,210,57,F,SBD,Raw
1,Anita Wysokińska,Juniorki do lat 23,1992,Poland,60.4,90,95,100,100,45,50,-55,50,107.5,117.5,125,125,275,63,F,SBD,Raw
2,Karolina Kowalska,Juniorki do lat 23,1994,Poland,62.4,75,85,90,90,37.5,42.5,45,45,100,110,-115,110,245,63,F,SBD,Raw
1,Kamila Kasperska,Juniorki do lat 23,1992,Poland,82.4,165,173,-177.5,173,75,80,-86,80,160,175,-185.5,175,428,84,F,SBD,Raw
1,Ewa Mioduszewska,Seniorki,1989,Poland,46.5,75,85,95,95,40,45,47.5,47.5,115,125,135,135,277.5,47,F,SBD,Raw
2,Alicja Urbaniak,Seniorki,1988,Poland,46.8,60,-65,-65,60,45,50,52.5,52.5,82.5,90,-100,90,202.5,47,F,SBD,Raw
1,Kornelia Kulczycka,Seniorki,1985,Poland,51.4,90,95,-100,95,-60,60,63,63,110,120,125,125,283,52,F,SBD,Raw
2,Magdalena Wojtkowska,Seniorki,1990,Poland,52,60,65,72.5,72.5,35,40,45,45,75,82.5,-85,82.5,200,52,F,SBD,Raw
3,Wiktoria Patrzałek,Seniorki,1998,Poland,50.5,40,50,52.5,52.5,30,35,-40,35,65,70,80,80,167.5,52,F,SBD,Raw
DQ,Olha Havrylets,Seniorki,1983,Poland,52,-75,-75,-75,,35,40,-45,40,85,95,-105,95,,52,F,SBD,Raw
1,Klaudia Rusztyn,Seniorki,1993,Poland,54.7,100,107.5,112.5,112.5,57.5,-60,-60,57.5,145,152.5,-155,152.5,322.5,57,F,SBD,Raw
2,Joanna Białek,Seniorki,1999,Poland,56.5,92.5,-97.5,-97.5,92.5,52.5,55,57.5,57.5,100,-105,105,105,255,57,F,SBD,Raw
DQ,Małgorzata Laska,Seniorki,1986,Poland,56.6,120,125,130,130,60,65,-67.5,65,-140,-140,-140,,,57,F,SBD,Raw
1,Emilia Sobiech-Konopa,Seniorki,1989,Poland,62.5,127.5,130,-132.5,130,62.5,67.5,-70,67.5,147.5,-152.5,-152.5,147.5,345,63,F,SBD,Raw
2,Karolina Staszewska,Seniorki,1985,Poland,59.6,-105,110,-115,110,55,60,62.5,62.5,130,142.5,-150,142.5,315,63,F,SBD,Raw
3,Małgorzata Cieślik,Seniorki,1983,Poland,61.5,100,110,-117.5,110,57.5,65,-70,65,110,120,130,130,305,63,F,SBD,Raw
4,Olga Ciborowska,Seniorki,1991,Poland,61.8,100,105,-107.5,105,57.5,60,62.5,62.5,135,-142.5,-142.5,135,302.5,63,F,SBD,Raw
5,Anna Grzechnik,Seniorki,1981,Poland,59.9,90,97.5,102.5,102.5,47.5,50,-52.5,50,120,130,-140,130,282.5,63,F,SBD,Raw
6,Iwona Mazur-Żmuda,Seniorki,1973,Poland,61,90,95,100,100,45,50,52.5,52.5,115,120,-125,120,272.5,63,F,SBD,Raw
7,Karolina Kowalska,Seniorki,1994,Poland,62.4,75,85,90,90,37.5,42.5,45,45,100,110,-115,110,245,63,F,SBD,Raw
DQ,Katarzyna Kowalik,Seniorki,,Poland,62,-90,-90,-90,,-40,-40,,,,,,,,63,F,SBD,Raw
1,Aneta Szot,Seniorki,1984,Poland,71.2,105,110,115,115,95,100,101,101,145,155,160,160,376,72,F,SBD,Raw
2,Anna Szymańska,Seniorki,1987,Poland,67.7,117.5,125,130,130,67.5,75,77.5,77.5,140,147.5,152.5,152.5,360,72,F,SBD,Raw
3,Justyna Liszyk-Świder,Seniorki,1988,Poland,70.8,115,125,132.5,132.5,50,57.5,-62.5,57.5,130,145,155,155,345,72,F,SBD,Raw
4,Anna Sułkowska,Seniorki,1985,Poland,64.5,100,-105,105,105,70,75,77.5,77.5,100,105,110,110,292.5,72,F,SBD,Raw
5,Katarzyna Pietrzyk,Seniorki,1990,Poland,71.2,85,-95,95,95,42.5,47.5,-52.5,47.5,110,120,125,125,267.5,72,F,SBD,Raw
6,Zuzanna Bućko,Seniorki,2001,Poland,64,50,60,-72.5,60,37.5,42.5,45,45,80,95,105,105,210,72,F,SBD,Raw
1,Kamila Kasperska,Seniorki,1992,Poland,82.4,165,173,-177.5,173,75,80,-86,80,160,175,-185.5,175,428,84,F,SBD,Raw
DQ,Julia Cichaczewska,Seniorki,1991,Poland,73.1,-100,-107.5,-107.5,,-55,55,62.5,62.5,110,117.5,-122.5,117.5,,84,F,SBD,Raw
1,Iwona Karwowska,Seniorki,1982,Poland,87.6,140,150,160,160,70,75,-80.5,75,140,150,-160,150,385,84+,F,SBD,Raw
1,Iwona Mazur-Żmuda,Weteranki 40-49 lat,1973,Poland,61,90,95,100,100,45,50,52.5,52.5,115,120,-125,120,272.5,,F,SBD,Raw
2,Renata Styczyńska,Weteranki 40-49 lat,1975,Poland,54.4,67.5,72.5,75,75,35,37.5,40,40,95,105,-112.5,105,220,,F,SBD,Raw
DQ,Katarzyna Kowalik,Weteranki 40-49 lat,,Poland,62,-90,-90,-90,,-40,-40,,,,,,,,,F,SBD,Raw
1,Dominik Jurewicz,Juniorki do lat 18,2001,Poland,48.7,60,75,85,85,40,47.5,52.5,52.5,80,100,-120,100,237.5,53,M,SBD,Raw
1,Michał Anuszek,Juniorki do lat 18,1998,Poland,58,130,135,140.5,140.5,77.5,82.5,85,85,130,135,140,140,365.5,59,M,SBD,Raw
2,Paweł Wiącek,Juniorki do lat 18,2000,Poland,57.9,120,130,-135,130,60,65,70,70,125,135,142,142,342,59,M,SBD,Raw
3,Marek Borkowski,Juniorki do lat 18,1998,Poland,59,90,100,110,110,82.5,87.5,-90,87.5,120,130,140,140,337.5,59,M,SBD,Raw
4,Bartosz Warszczuk,Juniorki do lat 18,2001,Poland,57.7,-110,110,-122.5,110,60,65,67.5,67.5,125,135,-140,135,312.5,59,M,SBD,Raw
1,Michał Skonieczny,Juniorki do lat 18,1998,Poland,65.8,145,152.5,157.5,157.5,115,120,-122.5,120,190,200,-205,200,477.5,66,M,SBD,Raw
2,Wojciech Kała,Juniorki do lat 18,1997,Poland,64.7,-147.5,150,-160,150,102.5,105,-107.5,105,185,192.5,197.5,197.5,452.5,66,M,SBD,Raw
3,Hubert Kończak,Juniorki do lat 18,1997,Poland,66,135,142.5,-152.5,142.5,80,85,87.5,87.5,170,187.5,-200,187.5,417.5,66,M,SBD,Raw
4,Piotr Burzawa,Juniorki do lat 18,1997,Poland,65,125,135,-140,135,87.5,95,-97.5,95,-130,145,160,160,390,66,M,SBD,Raw
1,Paweł Kasperkiewicz,Juniorki do lat 18,1997,Poland,73.1,145,152.5,157.5,157.5,90,95,-97.5,95,220,-230,,220,472.5,74,M,SBD,Raw
2,Bartłomiej Kiersikowski,Juniorki do lat 18,1998,Poland,72.5,145,155,160,160,100,105,-110,105,185,195,202.5,202.5,467.5,74,M,SBD,Raw
3,Olaf Sadowski,Juniorki do lat 18,1997,Poland,73.2,140,150,157.5,157.5,100,107.5,110,110,180,190,-205,190,457.5,74,M,SBD,Raw
4,Kacper Drochomirecki,Juniorki do lat 18,1998,Poland,72.4,145,155,165,165,90,95,-97.5,95,170,180,190,190,450,74,M,SBD,Raw
5,Sebastian Wieczorek,Juniorki do lat 18,1997,Poland,73.7,135,145,152.5,152.5,80,85,-90,85,195,-205,-210,195,432.5,74,M,SBD,Raw
6,Jakub Wawrzyniak,Juniorki do lat 18,1997,Poland,72.4,115,125,132.5,132.5,70,75,80,80,130,145,155,155,367.5,74,M,SBD,Raw
7,Michał Partyka,Juniorki do lat 18,1998,Poland,71.9,120,130,-137.5,130,87.5,-92.5,-92.5,87.5,130,147.5,-157.5,147.5,365,74,M,SBD,Raw
1,Kamil Struck,Juniorki do lat 18,1997,Poland,81.4,210,220,225,225,122.5,130,132.5,132.5,210,220,232.5,232.5,590,83,M,SBD,Raw
2,Patryk Zaniewski,Juniorki do lat 18,1998,Poland,82.4,192.5,197.5,205,205,132.5,137.5,140,140,230,240.5,243,243,588,83,M,SBD,Raw
3,Sebastian Kolasa,Juniorki do lat 18,1998,Poland,82.2,195,200,-202.5,200,120,125,127.5,127.5,205,215,222.5,222.5,550,83,M,SBD,Raw
4,Paweł Przybojewski,Juniorki do lat 18,1999,Poland,82.3,180,190,195,195,100,107.5,112.5,112.5,205,215,220,220,527.5,83,M,SBD,Raw
5,Marcin Stram,Juniorki do lat 18,1997,Poland,81.9,175,182.5,-187.5,182.5,115,125,-130,125,180,190,-200,190,497.5,83,M,SBD,Raw
6,Marcin Lange,Juniorki do lat 18,1997,Poland,81.9,150,155,160,160,120,125,-130,125,190,200,210,210,495,83,M,SBD,Raw
7,Piotr Gola,Juniorki do lat 18,1998,Poland,78.7,120,130,142.5,142.5,100,-110,-110,100,180,200,210,210,452.5,83,M,SBD,Raw
8,Dorian Witosław,Juniorki do lat 18,1998,Poland,82.1,145,155,170,170,90,-97.5,-97.5,90,170,180,185,185,445,83,M,SBD,Raw
9,Patryk Koska,Juniorki do lat 18,1999,Poland,82.6,195,200,-202.5,200,70,75,77.5,77.5,140,150,160,160,437.5,83,M,SBD,Raw
10,Krystian Filipiak,Juniorki do lat 18,1997,Poland,80.5,150,160,167.5,167.5,90,100,-110,100,-155,155,165,165,432.5,83,M,SBD,Raw
11,Norber Radzio,Juniorki do lat 18,1997,Poland,81.2,140,150,157.5,157.5,95,-100,-100,95,140,160,170,170,422.5,83,M,SBD,Raw
12,Mateusz Brożek,Juniorki do lat 18,1999,Poland,77,100,115,125,125,97.5,102.5,-105,102.5,140,155,165,165,392.5,83,M,SBD,Raw
13,Adrian Rokita,Juniorki do lat 18,1998,Poland,78.2,120,135,-140,135,80,90,95,95,140,160,-175,160,390,83,M,SBD,Raw
14,Emil Pocheć,Juniorki do lat 18,1998,Poland,76.3,110,122.5,-127.5,122.5,75,82.5,87.5,87.5,140,152.5,155,155,365,83,M,SBD,Raw
DQ,Piotr Żołopa,Juniorki do lat 18,1998,Poland,77.3,170,177.5,-185,177.5,-120,-120,-120,,,,,,,83,M,SBD,Raw
1,Wojciech Grupiński,Juniorki do lat 18,1999,Poland,89.6,190,210,-215,210,110,120,-125,120,220,230,245,245,575,93,M,SBD,Raw
2,Seweryn Rzepecki,Juniorki do lat 18,1997,Poland,87.8,170,180,192.5,192.5,130,135,137.5,137.5,-220,230,242.5,242.5,572.5,93,M,SBD,Raw
3,Jakub Kawula,Juniorki do lat 18,1997,Poland,92.3,180,190,192.5,192.5,120,130,135,135,220,230,-240,230,557.5,93,M,SBD,Raw
4,Jakub Gajewski,Juniorki do lat 18,1998,Poland,85.2,190,200,-210,200,105,115,-117.5,115,200,210,220,220,535,93,M,SBD,Raw
5,Jakub Kołaczyński,Juniorki do lat 18,1998,Poland,92.2,150,160,165,165,82.5,87.5,92.5,92.5,185,-200,-200,185,442.5,93,M,SBD,Raw
1,Patryk Szeliga,Juniorki do lat 18,1997,Poland,103.8,-180,180,190,190,120,-125,-130,120,220,235,245.5,245.5,555.5,105,M,SBD,Raw
2,Mariusz Tworkowski,Juniorki do lat 18,1998,Poland,98.1,180,190,200,200,100,115,-130,115,190,200,210,210,525,105,M,SBD,Raw
3,Krystian Majdziński,Juniorki do lat 18,1997,Poland,100.7,160,172.5,182.5,182.5,130,137.5,-142.5,137.5,175,190,205,205,525,105,M,SBD,Raw
4,Bartosz Gębala,Juniorki do lat 18,1997,Poland,103,175,-185,185,185,100,105,107.5,107.5,180,190,195,195,487.5,105,M,SBD,Raw
5,Radosław Kołodziejski,Juniorki do lat 18,1998,Poland,103.2,165,175,182.5,182.5,90,95,-100,95,185,195,-200,195,472.5,105,M,SBD,Raw
1,Piotr Pasionek,Juniorki do lat 18,1997,Poland,117.2,200,210,220,220,140,150,155,155,240,252.5,260,260,635,120,M,SBD,Raw
2,Andrzej Woźniak,Juniorki do lat 18,1998,Poland,110.7,200,220,230,230,105,115,122.5,122.5,200,215,-230,215,567.5,120,M,SBD,Raw
3,Tomasz Luliński,Juniorki do lat 18,1998,Poland,115.2,180,190,-200,190,110,-117.5,-117.5,110,215,230,-240,230,530,120,M,SBD,Raw
1,Jakub Węgrzyn,Juniorki do lat 18,1999,Poland,130,190,210,-215,210,120,130,135,135,175,190,200,200,545,120+,M,SBD,Raw
2,Martin Tretyn,Juniorki do lat 18,1999,Poland,134.3,150,170,185,185,125,-135,135,135,150,170,200,200,520,120+,M,SBD,Raw
3,Tomasz Kreczmer,Juniorki do lat 18,1997,Poland,123.3,140,150,160,160,80,85,-87.5,85,165,180,-190,180,425,120+,M,SBD,Raw
1,Adam Doliński,Juniorki do lat 23,1996,Poland,58.7,125,130,135,135,95,102.5,-105,102.5,140,147.5,152.5,152.5,390,59,M,SBD,Raw
1,Paweł Mazij,Juniorki do lat 23,1994,Poland,65.9,160,170,175,175,132.5,-137.5,-137.5,132.5,190,205,-220,205,512.5,66,M,SBD,Raw
2,Mateusz Leżuch,Juniorki do lat 23,1993,Poland,65.2,150,-160,160,160,110,115,-120,115,150,160,165,165,440,66,M,SBD,Raw
3,Tomasz Koterba,Juniorki do lat 23,1992,Poland,65.1,140,-145,145,145,95,100,-110,100,160,180,-190,180,425,66,M,SBD,Raw
4,Paweł Kowal,Juniorki do lat 23,1996,Poland,64.7,130,140,155,155,85,90,-92.5,90,155,170,-182.5,170,415,66,M,SBD,Raw
1,Daniel Ilczyszyn,Juniorki do lat 23,1994,Poland,72.7,190,-202.5,-202.5,190,130,132.5,-135,132.5,230,245,247.5,247.5,570,74,M,SBD,Raw
2,Rafał Angierski,Juniorki do lat 23,1992,Poland,69.5,190,200,-202.5,200,125,-130,-130,125,195,210,220,220,545,74,M,SBD,Raw
3,Lukasz Gajowy,Juniorki do lat 23,1995,Poland,71.5,165,175,-182.5,175,110,115,-117.5,115,220,230,-240,230,520,74,M,SBD,Raw
4,Michał Twardowski,Juniorki do lat 23,1995,Poland,73.2,180,-187.5,-187.5,180,125,130,135,135,185,197.5,-207.5,197.5,512.5,74,M,SBD,Raw
5,Maksymilian Czerwiński,Juniorki do lat 23,1993,Poland,71.2,150,162.5,-170,162.5,100,105,-110,105,190,200,215,215,482.5,74,M,SBD,Raw
6,Kamil Dec,Juniorki do lat 23,1996,Poland,68.4,160,170,180,180,100,105,110,110,160,175,190,190,480,74,M,SBD,Raw
7,Mariusz Brito,Juniorki do lat 23,1994,Poland,73.2,145,155,-165,155,102.5,107.5,-112.5,107.5,185,195,202.5,202.5,465,74,M,SBD,Raw
8,Rafał Kolano,Juniorki do lat 23,1994,Poland,73.2,150,-152.5,157.5,157.5,90,-95,-95,90,180,187.5,-195,187.5,435,74,M,SBD,Raw
9,Jakub Gumuliński,Juniorki do lat 23,1994,Poland,71.8,105,115,-125,115,85,-90,-90,85,135,140,152.5,152.5,352.5,74,M,SBD,Raw
DQ,Piotr Szumiata,Juniorki do lat 23,1992,Poland,73.8,160,165,170,170,125,135,-140,135,-210,,,,,74,M,SBD,Raw
1,Felicjan Goyke,Juniorki do lat 23,1992,Poland,80.8,190,200,207.5,207.5,152.5,160,162.5,162.5,225,232.5,240,240,610,83,M,SBD,Raw
2,Wiktor Ziółkowski,Juniorki do lat 23,1992,Poland,82.7,185,200,207.5,207.5,135,-145,145,145,225,235,-260,235,587.5,83,M,SBD,Raw
3,Grzegorz Grygierczyk,Juniorki do lat 23,1993,Poland,82.3,180,190,200,200,140,145,-147.5,145,220,230,240,240,585,83,M,SBD,Raw
4,Dariusz Konopelski,Juniorki do lat 23,1992,Poland,,190,205,215,215,132.5,137.5,-140,137.5,212.5,225,-232.5,225,577.5,83,M,SBD,Raw
5,Andrzej Szczurek,Juniorki do lat 23,1993,Poland,82.5,-180,190,195,195,130,-137.5,-137.5,130,210,217.5,225,225,550,83,M,SBD,Raw
6,Tomasz Stefan,Juniorki do lat 23,1995,Poland,82.6,120,130,140,140,90,100,105,105,-230,250,-255,250,495,83,M,SBD,Raw
1,Mateusz Czechyra,Juniorki do lat 23,1993,Poland,90,240,250,260,260,160,165,167.5,167.5,260,280,290,290,717.5,93,M,SBD,Raw
2,Tomasz Domański,Juniorki do lat 23,1993,Poland,92.1,220,230,-240,230,145,-152.5,152.5,152.5,230,240,247.5,247.5,630,93,M,SBD,Raw
3,Damian Maśliński,Juniorki do lat 23,1995,Poland,87.9,220,230,-237.5,230,140,150,-152.5,150,230,240,-245,240,620,93,M,SBD,Raw
4,Adrian Kieblesz,Juniorki do lat 23,1994,Poland,88.6,210,217.5,220,220,145,150,155,155,230,240,245,245,620,93,M,SBD,Raw
5,Mariusz Hintzke,Juniorki do lat 23,1994,Poland,92.4,200,210,-215,210,185,190.5,-192.5,190.5,200,210,215,215,615.5,93,M,SBD,Raw
6,Kamil Besztak,Juniorki do lat 23,1993,Poland,91.4,200,205,-207.5,205,145,152.5,-157.5,152.5,250,-260,,250,607.5,93,M,SBD,Raw
7,Maciej Sienkiewicz,Juniorki do lat 23,1992,Poland,92.5,225,232.5,237.5,237.5,120,-130,-130,120,245,-255,,245,602.5,93,M,SBD,Raw
8,Oskar Rynkiewicz,Juniorki do lat 23,1993,Poland,92.5,190,205,210,210,115,122.5,-130,122.5,245,-260,-272.5,245,577.5,93,M,SBD,Raw
9,Hubert Walo,Juniorki do lat 23,1994,Poland,91.7,170,185,-195,185,125,130,135,135,220,235,,235,555,93,M,SBD,Raw
10,Kamil Filipiak,Juniorki do lat 23,1993,Poland,85.3,150,170,190,190,110,122.5,127.5,127.5,195,205,215,215,532.5,93,M,SBD,Raw
11,Grzegorz Dymarski,Juniorki do lat 23,1993,Poland,91.9,-175,175,-185,175,117.5,122.5,127.5,127.5,217.5,227.5,-240,227.5,530,93,M,SBD,Raw
12,Szymon Gąsienica-Kote,Juniorki do lat 23,1995,Poland,87.7,160,172.5,-185,172.5,115,120,122.5,122.5,185,205,215,215,510,93,M,SBD,Raw
1,Sławomir Sidorowicz,Juniorki do lat 23,1993,Poland,103.6,230,240,250,250,165,170,177.5,177.5,270,280,-290,280,707.5,105,M,SBD,Raw
2,Dawid Zaniewski,Juniorki do lat 23,1995,Poland,104,225,235,240,240,170,175,-177.5,175,265,275,-280,275,690,105,M,SBD,Raw
3,Albert Potocki,Juniorki do lat 23,1992,Poland,97.4,240,250,255,255,150,160,167.5,167.5,230,250,257.5,257.5,680,105,M,SBD,Raw
5,Rafał Kanas,Juniorki do lat 23,1993,Poland,102.7,235,245,250,250,175,185,-190,185,235,245,-255,245,680,105,M,SBD,Raw
5,Wojciech Masłowski,Juniorki do lat 23,1992,Poland,99.2,235,-242.5,245,245,155,162.5,167.5,167.5,230,242.5,250,250,662.5,105,M,SBD,Raw
6,Krzysztof Kluczny,Juniorki do lat 23,1992,Poland,100.5,195,207.5,215,215,150,157.5,162.5,162.5,240,255,260,260,637.5,105,M,SBD,Raw
7,Dawid Perenc,Juniorki do lat 23,1995,Poland,101.4,210,-225,225,225,130,140,145,145,260,-262.5,-302.5,260,630,105,M,SBD,Raw
8,Kamil Sypka,Juniorki do lat 23,1994,Poland,103.4,180,200,-210,200,150,160,170,170,220,250,-265,250,620,105,M,SBD,Raw
9,Maciej Francus,Juniorki do lat 23,1992,Poland,101.7,195,-205,205,205,160,165,-170,165,210,220,-225,220,590,105,M,SBD,Raw
10,Jędrzej Jagodziński,Juniorki do lat 23,1992,Poland,101.1,175,185,195,195,125,130,135,135,205,-220,225,225,555,105,M,SBD,Raw
1,Piotr Sadowski #1,Juniorki do lat 23,1993,Poland,118.5,300,320,330,330,195,205,-210,205,300,320,-322.5,320,855,120,M,SBD,Raw
2,Łukasz Nizio,Juniorki do lat 23,1992,Poland,111.7,250,265,277.5,277.5,175,185,190,190,270,-295,302.5,302.5,770,120,M,SBD,Raw
3,Dawid Wiśniewski,Juniorki do lat 23,1995,Poland,116.7,210,220,230,230,160,170,175,175,260,270,280,280,685,120,M,SBD,Raw
4,Arkadiusz Szymoniak,Juniorki do lat 23,1993,Poland,110.5,190,200,-210,200,140,147.5,150,150,250,265,270,270,620,120,M,SBD,Raw
5,Michał Janusz,Juniorki do lat 23,1995,Poland,111.9,190,205,-210,205,155,-160,,155,240,260,-267.5,260,620,120,M,SBD,Raw
6,Damian Kulik,Juniorki do lat 23,1995,Poland,105.5,180,200,-215,200,125,132.5,140,140,180,200,210,210,550,120,M,SBD,Raw
1,Łukasz Doruch,Juniorki do lat 23,1992,Poland,120.9,210,220,230,230,175,180.5,-182.5,180.5,260,275,-282.5,275,685.5,120+,M,SBD,Raw
2,Filip Miśkiewicz,Juniorki do lat 23,1996,Poland,120.1,190,205,210,210,125,-130,,125,220,230,245,245,580,120+,M,SBD,Raw
3,Krzysztof Ślepowroński,Juniorki do lat 23,1996,Poland,120.1,-180,180,205,205,110,122.5,-125,122.5,190,-230,-230,190,517.5,120+,M,SBD,Raw
1,Dariusz Wszoła,Seniorki,1978,Poland,58.5,200,210,215.5,215.5,140,150,153,153,190,200,205,205,573.5,59,M,SBD,Raw
2,Sławomir Śledź,Seniorki,1976,Poland,58.7,170,180,-182.5,180,135,140,-142.5,140,185,195,-200,195,515,59,M,SBD,Raw
3,Adam Doliński,Seniorki,1996,Poland,58.7,125,130,135,135,95,102.5,-105,102.5,140,147.5,152.5,152.5,390,59,M,SBD,Raw
4,Marek Borkowski,Seniorki,1998,Poland,59,90,100,110,110,82.5,87.5,-90,87.5,120,130,140,140,337.5,59,M,SBD,Raw
1,Mariusz Grotkowski,Seniorki,1989,Poland,66,190,-202.5,-202.5,190,130,137.5,,137.5,210,222.5,-230,222.5,550,66,M,SBD,Raw
2,Dawid Kluczyńśki,Seniorki,1990,Poland,64.9,172.5,-180,-180,172.5,122.5,127.5,-130,127.5,200,212.5,-220,212.5,512.5,66,M,SBD,Raw
3,Paweł Mazij,Seniorki,1994,Poland,65.9,160,170,175,175,132.5,-137.5,-137.5,132.5,190,205,-220,205,512.5,66,M,SBD,Raw
4,Grzegorz Uziełło,Seniorki,1975,Poland,65.6,150,160,165,165,100,105,,105,200,-210,-210,200,470,66,M,SBD,Raw
5,Michal Kalinowski,Seniorki,1990,Poland,65.7,-140,140,-155,140,110,117.5,120,120,175,182.5,192.5,192.5,452.5,66,M,SBD,Raw
6,Mateusz Leżuch,Seniorki,1993,Poland,65.2,150,-160,160,160,110,115,-120,115,150,160,165,165,440,66,M,SBD,Raw
7,Piotr Burzawa,Seniorki,1997,Poland,65,125,135,-140,135,87.5,95,-97.5,95,-130,145,160,160,390,66,M,SBD,Raw
8,Marian Piwowarczyk,Seniorki,1961,Poland,63.1,100,110,115,115,90,95,100,100,140,160,-170,160,375,66,M,SBD,Raw
9,Milosz Duryn,Seniorki,1991,Poland,64,95,102.5,105,105,80,82.5,-85,82.5,140,160,-167.5,160,347.5,66,M,SBD,Raw
DQ,Kamil Iwasiów,Seniorki,1984,Poland,65.2,-167.5,167.5,175,175,-130,-130,-130,,182.5,190,-200,190,,66,M,SBD,Raw
1,Piotr Jakimiuk,Seniorki,1987,Poland,73.6,230,240,245,245,155,160.5,-165,160.5,-250,250,265,265,670.5,74,M,SBD,Raw
2,Tomasz Miloch,Seniorki,1983,Poland,73.7,200,210,-215,210,135,140,-145,140,220,240,-260.6,240,590,74,M,SBD,Raw
3,Daniel Ilczyszyn,Seniorki,1994,Poland,72.7,190,-202.5,-202.5,190,130,132.5,-135,132.5,230,245,247.5,247.5,570,74,M,SBD,Raw
4,Szymon Jonczak,Seniorki,1987,Poland,72.8,175,185,190,190,135,140,145,145,205,220,235,235,570,74,M,SBD,Raw
5,Kamil Poręba,Seniorki,1991,Poland,72.9,180,190,-200,190,140,-145,-145,140,200,210,220,220,550,74,M,SBD,Raw
6,Piotr Obłękowski,Seniorki,1989,Poland,72.5,165,175,180,180,112.5,117.5,-120,117.5,220,225,230,230,527.5,74,M,SBD,Raw
7,Eryk Walczak,Seniorki,1977,Poland,74,155,-165,165,165,-132.5,135,140,140,190,205,210,210,515,74,M,SBD,Raw
8,Paweł Kasperkiewicz,Seniorki,1997,Poland,73.1,145,152.5,157.5,157.5,90,95,-97.5,95,220,-230,,220,472.5,74,M,SBD,Raw
9,Wojciech Kordeczka,Seniorki,1971,Poland,73.9,130,140,145,145,97.5,102.5,105,105,180,-190,190,190,440,74,M,SBD,Raw
10,Adam Wychodil,Seniorki,1990,Poland,72.5,130,140,150,150,107.5,112.5,-115,112.5,-170,170,-195,170,432.5,74,M,SBD,Raw
1,Jacek Spychała,Seniorki,1978,Poland,82.3,230,245,252.5,252.5,155,165,172.5,172.5,280,300,317.5,317.5,742.5,83,M,SBD,Raw
2,Łukasz Matwin,Seniorki,1982,Poland,83,220,230,235,235,135,137.5,145,145,290,305,312.5,312.5,692.5,83,M,SBD,Raw
3,Krzysztof Kaczmarek,Seniorki,1987,Poland,81.7,220,238,245.5,245.5,130,-135,-135,130,252.5,280,-300,280,655.5,83,M,SBD,Raw
4,Marcin Helwig,Seniorki,1987,Poland,81.6,210,220,225,225,160,-167.5,170,170,230,242.5,250,250,645,83,M,SBD,Raw
5,Daniel Macura,Seniorki,1981,Poland,82.6,215,225,-235,225,145,-152.5,152.5,152.5,245,255,-272.5,255,632.5,83,M,SBD,Raw
6,Łukasz Grzesiuk,Seniorki,1983,Poland,82.1,180,190,195,195,130,-135,-135,130,-240,250,260,260,585,83,M,SBD,Raw
7,Damian Borzyszkowski,Seniorki,1990,Poland,81.9,182.5,-192.5,-192.5,182.5,130,-135,,130,225,-232.5,-232.5,225,537.5,83,M,SBD,Raw
8,Włodzimierz Żmijewski,Seniorki,1949,Poland,75.8,185,195,202.5,202.5,70,75,77.5,77.5,235,250,-255,250,530,83,M,SBD,Raw
9,Damian Słota,Seniorki,1983,Poland,81.3,160,170,-177.5,170,120,130,-132.5,130,180,200,207.5,207.5,507.5,83,M,SBD,Raw
10,Łukasz Głowacz,Seniorki,1976,Poland,81.6,135,145,155,155,125,132.5,135,135,175,185,195,195,485,83,M,SBD,Raw
11,Piotr Gola,Seniorki,1998,Poland,78.7,120,130,142.5,142.5,100,-110,-110,100,180,200,210,210,452.5,83,M,SBD,Raw
12,Mateusz Brożek,Seniorki,1999,Poland,77,100,115,125,125,97.5,102.5,-105,102.5,140,155,165,165,392.5,83,M,SBD,Raw
1,Mateusz Czechyra,Seniorki,1993,Poland,90,240,250,260,260,160,165,167.5,167.5,260,280,290,290,717.5,93,M,SBD,Raw
2,Mirosław Kozubski,Seniorki,1978,Poland,91.4,230,250,265,265,170,180,-190,180,240,250,-260,250,695,93,M,SBD,Raw
3,Paweł Podmagórski,Seniorki,1986,Poland,92.8,205,215,220,220,165,170,-175,170,250,260,272.5,272.5,662.5,93,M,SBD,Raw
4,Konrad Obrzut,Seniorki,1985,Poland,92.9,220,227.5,232.5,232.5,160,165,-170,165,250,260,265,265,662.5,93,M,SBD,Raw
5,Bartłomiej Bałdyga,Seniorki,1983,Poland,91.8,-240,245,-255,245,140,-142.5,,140,-255,255,-265,255,640,93,M,SBD,Raw
6,Krzysztof Hoffmann,Seniorki,1991,Poland,90.8,205,212.5,217.5,217.5,130,-137.5,140,140,255,265,-270,265,622.5,93,M,SBD,Raw
7,Adrian Kieblesz,Seniorki,1994,Poland,88.6,210,217.5,220,220,145,150,155,155,230,240,245,245,620,93,M,SBD,Raw
8,Piotr Pokorski,Seniorki,1989,Poland,88.5,200,210,220,220,142.5,147.5,-150,147.5,235,240,250,250,617.5,93,M,SBD,Raw
9,Jakub Krawiec,Seniorki,1990,Poland,84.8,165,175,,175,142.5,147.5,150,150,210,225,-230,225,550,93,M,SBD,Raw
10,Andrzej Sibik,Seniorki,1984,Poland,90.6,-175,-175,175,175,115,120,125,125,210,-215,-215,210,510,93,M,SBD,Raw
11,Edward Rożnowski,Seniorki,1951,Poland,88.7,105,125,145,145,65,85,95,95,185,205,225,225,465,93,M,SBD,Raw
12,Wojciech Dreiseitel,Seniorki,1990,Poland,90.7,155,160,-165,160,112.5,-115,115,115,165,180,190,190,465,93,M,SBD,Raw
13,Tomasz Domagała,Seniorki,1962,Poland,90.4,75,90,,90,95,107.5,112.5,112.5,105,120,125,125,327.5,93,M,SBD,Raw
1,Marcin Goleń,Seniorki,1983,Poland,103.6,260,270,280,280,185,190,195,195,305,325,340,340,815,105,M,SBD,Raw
2,Mateusz Grzesik,Seniorki,1989,Poland,104.5,260,270,280,280,190,200,205,205,300,315,-322.5,315,800,105,M,SBD,Raw
3,Michał Kempys,Seniorki,1988,Poland,100.1,250,260,-265,260,165,170,172.5,172.5,290,300,307.5,307.5,740,105,M,SBD,Raw
4,Szczepan Zimmermann,Seniorki,1990,Poland,100.9,255,-260,-260,255,162.5,167.5,170,170,270,-280,-280,270,695,105,M,SBD,Raw
5,Albert Potocki,Seniorki,1992,Poland,97.4,240,250,255,255,150,160,167.5,167.5,230,250,257.5,257.5,680,105,M,SBD,Raw
6,Paweł Kawalerski,Seniorki,1989,Poland,101.9,235,245,-255,245,160,-165,-165,160,245,255,-260,255,660,105,M,SBD,Raw
7,Dawid Perenc,Seniorki,1995,Poland,101.4,210,-225,225,225,130,140,145,145,260,-262.5,-302.5,260,630,105,M,SBD,Raw
8,Kamil Sypka,Seniorki,1994,Poland,103.4,180,200,-210,200,150,160,170,170,220,250,-265,250,620,105,M,SBD,Raw
9,Radosław Wałęga,Seniorki,1988,Poland,104.4,190,202.5,-205,202.5,145,152.5,-157.5,152.5,205,227.5,235,235,590,105,M,SBD,Raw
10,Karol Grabowski,Seniorki,1991,Poland,94.6,175,182.5,-187.5,182.5,142.5,-147.5,147.5,147.5,215,230,-237.5,230,560,105,M,SBD,Raw
11,Mariusz Tworkowski,Seniorki,1998,Poland,98.1,180,190,200,200,100,115,-130,115,190,200,210,210,525,105,M,SBD,Raw
1,Piotr Sadowski #1,Seniorki,1993,Poland,118.5,300,320,330,330,195,205,-210,205,300,320,-322.5,320,855,120,M,SBD,Raw
2,Łukasz Nizio,Seniorki,1992,Poland,111.7,250,265,277.5,277.5,175,185,190,190,270,-295,302.5,302.5,770,120,M,SBD,Raw
4,Oliwier Gąsienica-Ciaptak,Seniorki,1981,Poland,112.5,250,260,270,270,205,-212.5,-212.5,205,250,270,-280,270,745,120,M,SBD,Raw
5,Paweł Jurczyński,Seniorki,1988,Poland,117.2,245,257.5,267.5,267.5,170,177.5,182.5,182.5,280,300,-305,300,750,120,M,SBD,Raw
5,Sebastian Sobiech,Seniorki,1980,Poland,115.5,260,270,272.5,272.5,185,190,192.5,192.5,280,-287.5,-287.5,280,745,120,M,SBD,Raw
6,Hubert Wrona,Seniorki,1979,Poland,111.6,240,250,255,255,155,165,-170,165,-300,300,-320.5,300,720,120,M,SBD,Raw
7,Krzysztof Kuster,Seniorki,1987,Poland,117.2,210,220,240,240,200,210,-220,210,240,,,240,690,120,M,SBD,Raw
8,Andrzei Koszyk,Seniorki,1979,Poland,108.8,195,205,215,215,170,177.5,-182.5,177.5,240,252.5,260,260,652.5,120,M,SBD,Raw
9,Łukasz Kubańda,Seniorki,1988,Poland,118.6,220,-230,-230,220,170,-180,-180,170,250,260,-270,260,650,120,M,SBD,Raw
10,Krzysztof Cybartowicz,Seniorki,1988,Poland,111.3,210,215,217.5,217.5,142.5,147.5,150,150,225,235,-242.5,235,602.5,120,M,SBD,Raw
11,Damian Kulik,Seniorki,1995,Poland,105.5,180,200,-215,200,125,132.5,140,140,180,200,210,210,550,120,M,SBD,Raw
12,Artur Szakiel,Seniorki,1990,Poland,116.5,165,172.5,185,185,105,107.5,-110,107.5,200,210,225,225,517.5,120,M,SBD,Raw
1,Jacek Stanek,Seniorki,1980,Poland,143,320,335,-340,335,200,208,-210,208,305,320,330,330,873,120+,M,SBD,Raw
2,Damian Ostrowski,Seniorki,1983,Poland,123.6,265,277.5,285,285,185,192.5,-197.5,192.5,270,285,300,300,777.5,120+,M,SBD,Raw
3,Ryszard Szymoniak,Seniorki,1985,Poland,124.9,250,270,-280,270,190,-200,-200,190,260,275,285,285,745,120+,M,SBD,Raw
4,Rafał Lipka,Seniorki,1975,Poland,124.7,260.5,270.5,275,275,165,170,175,175,265,275.5,285,285,735,120+,M,SBD,Raw
5,Adam Szymanowski,Seniorki,1983,Poland,121.4,250,-260,-260,250,160,165,-167.5,165,250,270,285,285,700,120+,M,SBD,Raw
DQ,Tomasz Chwalczuk,Seniorki,1989,Poland,124.4,-290,-290,-290,,190,200,-205,200,260,270,-275,270,,120+,M,SBD,Raw
1,Grzegorz Uziełło,Weteranki 40-49 lat,1975,Poland,65.6,150,160,165,165,100,105,,105,200,-210,-210,200,470,,M,SBD,Raw
2,Piotr Pawyza,Weteranki 40-49 lat,1975,Poland,81.9,140,150,155,155,148,151,154,154,160,170,172.5,172.5,481.5,,M,SBD,Raw
3,Sebastian Stępniak,Weteranki 40-49 lat,1974,Poland,82.5,-135,140,155,155,110,-115,115,115,190,205,210,210,480,,M,SBD,Raw
4,Hieronim Dereń,Weteranki 40-49 lat,1966,Poland,82.4,140,150,155,155,110,115,117.5,117.5,180,195,202.5,202.5,475,,M,SBD,Raw
5,Wojciech Kordeczka,Weteranki 40-49 lat,1971,Poland,73.9,130,140,145,145,97.5,102.5,105,105,180,-190,190,190,440,,M,SBD,Raw
1,Rafał Lipka,Weteranki 40-49 lat,1975,Poland,124.7,260.5,270.5,275,275,165,170,175,175,265,275.5,285,285,735,,M,SBD,Raw
2,Mirosław Kania,Weteranki 40-49 lat,1966,Poland,92.2,185,195,202.5,202.5,137.5,145,-150,145,210,225,235,235,582.5,,M,SBD,Raw
3,Tomasz Szachowicz,Weteranki 40-49 lat,1972,Poland,131.9,210,220,235,235,180,187.5,-192.5,187.5,195,215,-230,215,637.5,,M,SBD,Raw
4,Przemysław Kozioł,Weteranki 40-49 lat,1973,Poland,97.3,180,195,202.5,202.5,110,-115,117.5,117.5,200,215,225,225,545,,M,SBD,Raw
5,Leszek Dąbrowski,Weteranki 40-49 lat,1973,Poland,100.8,180,190,197.5,197.5,140,147.5,-150,147.5,180,195,-205,195,540,,M,SBD,Raw
1,Marian Piwowarczyk,Weteranki 50-59 lat,1961,Poland,63.1,100,110,115,115,90,95,100,100,140,160,-170,160,375,,M,SBD,Raw
2,Grzegorz Leski,Weteranki 50-59 lat,1958,Poland,75.4,110,125,132.5,132.5,110,117.5,-120,117.5,150,165,-175,165,415,,M,SBD,Raw
1,Józef Gromek,Weteranki 50-59 lat,1958,Poland,88.9,200,220,230,230,140,150,,150,230,250,265,265,645,,M,SBD,Raw
2,Tomasz Domagała,Weteranki 50-59 lat,1962,Poland,90.4,75,90,,90,95,107.5,112.5,112.5,105,120,125,125,327.5,,M,SBD,Raw
1,Włodzimierz Żmijewski,Weteranki 60-69 lat,1949,Poland,75.8,185,195,202.5,202.5,70,75,77.5,77.5,235,250,-255,250,530,,M,SBD,Raw
2,Jan Klus,Weteranki +70 lat,1945,Poland,83,130,-140,-140,130,-90,90,-100,90,130,140,150,150,370,,M,SBD,Raw
3,Józef Cisak,Weteranki +70 lat,1945,Poland,81.4,100,105,110,110,70,,,70,120,130,135,135,315,,M,SBD,Raw
1,Edward Rożnowski,Weteranki 60-69 lat,1951,Poland,88.7,105,125,145,145,65,85,95,95,185,205,225,225,465,,M,SBD,Raw
2,Andrzej Kołodziej,Weteranki 60-69 lat,1950,Poland,95.7,110,120,130,130,100,-107.5,,100,130,140,150,150,380,,M,SBD,Raw
