<?xml version="1.0" encoding="UTF-8" standalone="no"?>
<svg xmlns="http://www.w3.org/2000/svg" height="96" viewBox="0 0 96 96.000001" width="96" version="1.1">
 <g transform="translate(67.86 -78.51)">
  <g transform="matrix(0 -1 -1 0 373.5 516.5)">
   <g transform="matrix(-.9996 0 0 1 575.9 -611)">
    <g transform="matrix(-1 0 0 1 576 611)">
     <rect style="color:#000000;fill:none" transform="scale(-1,1)" height="96" width="96.04" y="345.4" x="-438"/>
     <path style="fill:#808080" d="m365.3 370.1c-0.0205-0.0154-0.0338-0.0386-0.0541-0.054-0.0242-0.0192-0.0544-0.0291-0.0784-0.0485z"/>
     <path style="fill:#808080" d="m365.3 416.7-0.1324 0.1025c0.024-0.0194 0.0543-0.0293 0.0784-0.0485 0.0204-0.0155 0.0337-0.0387 0.0541-0.054z"/>
     <path style="stroke-width:.09064;fill:#808080" d="m391.6 350.6v85.52c0 0.6978-0.5258 1.278-1.16 1.278h-0.9701c-0.6346 0-1.16-0.5709-1.16-1.278v-85.53c0-0.6978 0.5258-1.278 1.16-1.278h0.9701c0.6437 0.009 1.16 0.58 1.16 1.287z"/>
     <path style="stroke-width:.09064;fill:#808080" d="m417.3 425.3c2.714 0.099 4.715-1.901 4.606-3.94v-24.72l4.09 0.0541v24.69c0 4.018-3.981 8.007-7.937 8.007h-20.11v-4.097l20.04 0.0765z"/>
     <path d="m417.3 361.5c2.714-0.099 4.715 1.901 4.606 3.94v24.72l4.09-0.0541v-24.69c0-4.018-3.981-8.007-7.937-8.007h-20.06v4.097l19.99-0.0765z" style="stroke-width:.09064;fill:#808080"/>
     <path d="m362.6 425.3c-2.714 0.099-4.715-1.901-4.606-3.94v-24.72l-4.09 0.0541v24.69c0 4.018 3.981 8.007 7.937 8.007h20.11v-4.097l-20.04 0.0765z" style="stroke-width:.09064;fill:#808080"/>
     <path style="stroke-width:.09064;fill:#808080" d="m362.7 361.5c-2.714-0.099-4.715 1.901-4.606 3.94v24.72l-4.09-0.0541v-24.69c0-4.018 3.981-8.007 7.937-8.007h20.06v4.097l-19.99-0.0765z"/>
    </g>
   </g>
  </g>
 </g>
</svg>
