{
  "clickable_minimum_required": "6.17.1",
  "kill": "mirvncserver",
  "builder": "custom",
  "build": "${ROOT}/build-ubports.sh",
  "build_dir": "${ROOT}/build/${ARCH_TRIPLET}/app",
  "dependencies_target": [
    "libboost-program-options1.58.0",
    "libboost-program-options-dev",
    "libmirserver41",
    "libmirserver-dev",
    "libvncserver1",
    "libvncserver-dev"
  ],
  "install_data": {
    "${ROOT}/click/*": "${INSTALL_DIR}",
    "${ROOT}/vncserver.sh": "${INSTALL_DIR}",
    "${ROOT}/mirvncserver": "${INSTALL_DIR}"
  },
  "install_lib": [
    "/usr/lib/${ARCH_TRIPLET}/libvncserver.so.1*"
  ]
}
